##TITLE=Analysis number 329862
Compound Code cc 67046
Book Reference 508/138
Project Code adrs
Chemist Name antons
##JCAMPDX= 6.0         $$ Bruker NMR JCAMP-DX V2.0
##DATA TYPE= NMR SPECTRUM
##DATA CLASS= NTUPLES
##ORIGIN= Bruker BioSpin GmbH
##OWNER= nmr
$$ XWIN-NMR		Version 3.5
$$ Fri Oct  5 08:35:54 2007 GMT Daylight Time (UT+1h)  MAYBRIDGE\nmr@NMR_250MHZ
##.OBSERVE FREQUENCY= 250.131544655141
##.OBSERVE NUCLEUS= ^1H
##.ACQUISITION MODE= SIMULTANEOUS (DQD)
##.ACQUISITION SCHEME= undefined
##.AVERAGES= 16
##.DIGITISER RES= 18
##SPECTROMETER/DATA SYSTEM= dpx250
##.PULSE SEQUENCE= zg30
##.SOLVENT NAME= CDCl3
##.SHIFT REFERENCE= (INTERNAL, CDCl3, 0, 16.4545)
##AUDIT TRAIL= $$ (NUMBER, WHEN, WHO, WHERE, WHAT)
$$ ##TITLE= Audit trail, XWIN-NMR		Version 3.5
$$ ##JCAMPDX= 5.01
$$ ##ORIGIN= Bruker BioSpin GmbH
$$ ##OWNER= nmr
$$ C:\u/data/dgb/nmr/ADRS/300/pdata/1/auditp.txt
$$ ##AUDIT TRAIL=  $$ (NUMBER, WHEN, WHO, WHERE, WHAT)
(   1,<2007-10-05 08:35:33.68 +100>,<MAYBRIDGE\nmr>,<NMR_250MHZ>,
      <created by zg, POWCHK disabled, PULCHK disabled
       configuration hash MD5:
       76 6E 9A 78 1E 09 19 81 EC 84 63 8F B0 6A 59 2D
       data hash MD5: 64K
       FA 11 03 62 79 CE B0 20 9D 91 77 73 94 A6 EA DF>)
(   2,<2007-10-05 08:35:46.01 +100>,<MAYBRIDGE\nmr>,<NMR_250MHZ>,
      <Start of raw data processing
       ef LB = 0.3 FT_mod = 6 PKNL = 1 SI = 32K 
       data hash MD5: 32K
       CC F7 5D EB 1D CD EE 26 C3 95 D8 4C ED 5C C6 27>)
(   3,<2007-10-05 08:35:47.76 +100>,<MAYBRIDGE\nmr>,<NMR_250MHZ>,
      <apk 
       data hash MD5: 32K
       52 A2 BF 6B BF 7C BF 3D B6 CB 21 94 F9 5C 42 42>)
(   4,<2007-10-05 08:35:48.51 +100>,<MAYBRIDGE\nmr>,<NMR_250MHZ>,
      <abs ABSG = 5 
       data hash MD5: 32K
       16 3A 41 CA C1 42 F3 BC 22 15 6F 76 A3 7E E0 DD>)
$$ ##END=
$$ 
$$ hash MD5
$$ F4 01 EA F7 86 13 9B 79 03 D7 69 AA 74 99 FE BE
##$RELAX= 
##$RELAX= 
##$RELAX= 
##$RELAX= 
##$RELAX= 
##$RELAX= 
##$RELAX= 
$$ Bruker specific parameters
$$ --------------------------
##$DU= <C:\u>
##$EXPNO= 300
##$NAME= <ADRS>
##$PROCNO= 1
##$TYPE= <nmr>
##$USER= <dgb>
##$AMP= (0..31)
100 100 100 100 100 100 100 100 100 100 100 100 100 100 100 100 100 100 
100 100 100 100 100 100 100 100 100 100 100 100 100 100 
##$AQSEQ= 0
##$AQ_mod= 3
##$AUNM= <au_zg>
##$AUTOPOS= <1 >
##$BF1= 250.13
##$BF2= 250.13
##$BF3= 250.13
##$BF4= 250.13
##$BF5= 500.13
##$BF6= 500.13
##$BF7= 500.13
##$BF8= 500.13
##$BYTORDA= 1
##$CFDGTYP= 0
##$CFRGTYP= 5
##$CHEMSTR= <none>
##$CNST= (0..31)
1 1 145 1 1 1 1 1 1 1 1 1 1 1 1 1 1 1 1 1 1 1 1 1 1 1 1 1 1 1 1 1 
##$CPDPRG= <>
##$CPDPRG1= <>
##$CPDPRG2= <>
##$CPDPRG3= <>
##$CPDPRG4= <mlev>
##$CPDPRG5= <mlev>
##$CPDPRG6= <mlev>
##$CPDPRG7= <mlev>
##$CPDPRG8= <mlev>
##$CPDPRGB= <>
##$CPDPRGT= <>
##$D= (0..31)
0 1 0 0 0 0 0 0 0 0.06 0 0 0 0 0 0 0.0002 0 0 0 0 0 0 0 0 0 0 0 0 0 0 
0 
##$DATE= 1191569732
##$DBL= (0..7)
120 120 120 120 120 120 120 120 
##$DBP= (0..7)
150 150 150 150 150 150 150 150 
##$DBP07= 0
##$DBPNAM0= <>
##$DBPNAM1= <>
$$ [...]
##$SUBNAM7= <"">
##$SUBNAM8= <"">
##$SUBNAM9= <"">
##$SW= 20.6930455092707
##$SWIBOX= (0..15)
0 0 3 0 0 0 0 0 0 0 0 0 0 0 0 0 
##$SW_h= 5175.983436853
##$TD= 65536
##$TD0= 1
##$TE= 296.16
##$TE2= 300
##$TE3= 300
##$TEG= 300
##$TL= (0..7)
0 120 120 120 120 120 120 120 
##$TP= (0..7)
150 150 150 150 150 150 150 150 
##$TP07= 0
##$TPNAME0= <>
##$TPNAME1= <>
##$TPNAME2= <>
##$TPNAME3= <>
##$TPNAME4= <>
##$TPNAME5= <>
##$TPNAME6= <>
##$TPNAME7= <>
##$TPOAL= (0..7)
0.5 0.5 0.5 0.5 0.5 0.5 0.5 0.5 
##$TPOFFS= (0..7)
0 0 0 0 0 0 0 0 
##$TUNHIN= 0
##$TUNHOUT= 0
##$TUNXOUT= 0
##$USERA1= <user>
##$USERA2= <user>
##$USERA3= <user>
##$USERA4= <user>
##$USERA5= <user>
##$V9= 5
##$VALIST= <valist>
##$VCLIST= <CCCCCCCCCCCCCCC>
##$VD= 0
##$VDLIST= <DDDDDDDDDDDDDDD>
##$VPLIST= <PPPPPPPPPPPPPPP>
##$VTLIST= <TTTTTTTTTTTTTTT>
##$WBST= 1024
##$WBSW= 4
##$XGAIN= (0..3)
0 0 0 0 
##$XL= 0
##$YL= 0
##$YMAX_a= 369841
##$YMIN_a= -534977
##$ZGOPTNS= <>
##$ZL1= 120
##$ZL2= 120
##$ZL3= 120
##$ZL4= 120
##$ABSF1= 16.45445
##$ABSF2= -4.238722
##$ABSG= 5
##$ABSL= 3
##$ALPHA= 0
##$AQORDER= 0
##$ASSFAC= 0
##$ASSFACI= 0
##$ASSFACX= 0
##$ASSWID= 0
##$AUNMP= <proc_1d>
##$AZFE= 0.1
##$AZFW= 0.1
##$BCFW= 0
##$BC_mod= 0
##$BYTORDP= 0
##$COROFFS= 0
##$CY= 12.5
##$DATMOD= 1
##$DC= 0
##$DFILT= <>
##$DTYPP= 0
##$F1P= 14.0000005364418
##$F2P= -0.99999901652339
##$FCOR= 0.5
##$FTSIZE= 32768
##$FT_mod= 6
##$GAMMA= 0
##$GB= 0
##$INTBC= 1
##$INTSCL= 1
##$ISEN= 128
##$LB= 0.3
##$LEV0= 0
##$LPBIN= 0
##$MAXI= 10000
##$MC2= 0
##$MEAN= 0
##$ME_mod= 0
##$MI= 0
##$NCOEF= 0
##$NC_proc= -3
##$NLEV= 6
##$NOISF1= 0
##$NOISF2= 0
##$NSP= 0
##$NTH_PI= 0
##$NZP= 0
##$OFFSET= 16.45445
##$PC= 1
##$PHC0= 157.9659
##$PHC1= 3.250516
##$PH_mod= 1
##$PKNL= yes
##$PPARMOD= 0
##$PSCAL= 4
##$PSIGN= 0
##$REVERSE= no
##$SF= 250.130016895119
##$SI= 32768
##$SIGF1= 0
##$SIGF2= 0
##$SINO= 400
##$SIOLD= 32768
##$SREGLST= <1H.CDCl3>
##$SSB= 0
##$STSI= 32768
##$STSR= 0
##$SW_p= 5175.98343685301
##$SYMM= 0
##$S_DEV= 0
##$TDeff= 65536
##$TDoff= 0
##$TI= <Analysis number 999999
Compound Code 99
Book Reference 9
Project Code 9>
##$TILT= no
##$TM1= 0
##$TM2= 0
##$TOPLEV= 0
##$USERP1= <user>
##$USERP2= <user>
##$USERP3= <user>
##$USERP4= <user>
##$USERP5= <user>
##$WDW= 1
##$XDIM= 32768
##$YMAX_p= 499881024
##$YMIN_p= -119789
$$ End of Bruker specific parameters
$$ ---------------------------------
##NTUPLES= NMR SPECTRUM
##VAR_NAME=  FREQUENCY,     SPECTRUM/REAL,   SPECTRUM/IMAG
##SYMBOL=    X,             R,               I
##VAR_TYPE=  INDEPENDENT,   DEPENDENT,       DEPENDENT
##VAR_FORM=  AFFN,          ASDF,            ASDF
##VAR_DIM=   32768,         32768,           32768
##UNITS=     HZ,            ARBITRARY UNITS, ARBITRARY UNITS
##FACTOR=    0.157963299565203, 1,           1
##FIRST=     4115.7520084038, 0,             0
##LAST=      -1060.23142844921, 0,           0
##MIN=       -1060.23142844921, -119789,     0
##MAX=       4115.7520084038, 499881024,     0
$$ Real data points
##PAGE= N=1
##DATA TABLE= (X++(R..R)), XYDATA
$$ [...]
16530g4414l192M1914J9945m783j1269q676K6610j916M760M144J1774K2452J618
16517B8967m1580j3776K6719J8809q629l423j7216K1614K7329k9965j3358j435
16505e944J5440P658k2285j321K0761L927j8222j0426j8001K7114J5271m469p851
16492A652O811j6707l912J1085J2101P204k5410k7302j7927J7647L4581M877n071
16479c71j4508p934k0451j7660r101j747j8257j0749K0888J6712j2203M818J20
16466g0443k42P391P514J9587m032j7864J554j328L9365K6996K2137o347l3117
16453h829l7168k64k497k0798N700k8138k7795K7782L2173K4160J3057J9415P276
16440D074k129J4855N530l8939k0900Q552J7976Q039J4485k0484J299k0754j268
$$ y = [-74414, -77606, -35692, -15747, -20530, -31799, -40475, -13865, -15781, -11021, -6877, 4897, 27349, 28967, -12613, -26389, 330, 19139, 10510, 7087, -10129, 11485, 38814, 8849, -4509, -5944, 9496, 17154, -5131, -6452, 14309, 18236, 14, -10412, -28413, -1299, 13972, 9503, 1652, 8463, -8244, -12156, -1071, 11030, 18234, -7176, -34478, -52405, -34758, -177, 4700, -371, -14879, -22813, -43264, -60924, -70025, -71772, -90029, -100778, -79890, -63178, -75381, -70563, -70443, -70685, -63294, -55780, -36193, -40225, -58089, -56535, -57863, -18498, 8498, 30635, 24288, -8829, -45997, -46261, -48758, -69556, -63856, -91994, -119789, -92007, -59834, -35674, -22617, -3202, 4074, 1945, 16800, 22330, -16609, -37509, -28957, -10981, -2942, 11543, -8941, -7642, -28396, -29664]
16427b9664j9874M5672J7248l4600q098K074R65j8974K0152N31m155j9673q699
16414e7095J0446K4395n688K8465L1551P83k5565L6928O744j6159k8411k2342
16402a5948r368J814J8017j919l0512J1612J334K9810M1168K8493l921l8501k2440
16389I639l638P048k7540l1224l491K4176j3785J7711J4776m83j8288J2188J4397
16376A486N426R667j0188k3534j6866K0323K1057P880j6207k5152o144J9070K1795
16363H613j8276m3633K1726J3243Q971K9257P805k2010n47k4407n5105l720L5394
16350d2689L2115M1287n381k1221k2159j41p220k9606K044L1645R355j8273k5100
16337e5344J2370J0969O206l533j0771J4092q707j7626L4594M7536K7037j8535
$$ y = [-29664, -49538, -3866, 13382, -21218, -29316, -27242, -26277, -45251, -25099, -24568, -28723, -48396, -57095, -46649, -22254, -27942, 523, 32074, 32857, 7292, 44220, 50964, 34805, 6394, -15948, -25316, -23502, -5485, -7404, -37916, -26304, -24970, 4840, 46008, 74501, 70580, 32079, 9639, 6001, 13049, -14491, -45715, -49206, -25030, -38815, -21104, -6328, -6811, -25099, -12911, 1486, 6912, 16579, 6391, -17143, -34009, -13686, 7371, 15251, -956, -26108, -32252, -13182, 8613, -9663, -53296, -31570, -18327, -9356, 19901, 27706, 5696, 5149, -19258, -74363, -78083, -42689, -10574, 30713, 25332, 4111, -18048, -18189, -25409, -55015, -52971, -21326, -11971, -30244, -55344, -42974, -32005, -25799, -29332, -40103, -26011, -34718, -52344, -17750, 29786, 56823, 38288]
16325C8288k8071j6756j498O779q01j6313m642k7891j0389L347L2222O518k2300
16312d1507J2357K7850J8976j1293J167j737l5849k4397L25R189n469J9253M1321
16299A0186j406l2335j4380j8503j6872R60M129L3417M1412j0167l004J759J6030
16286A1226k774j0438j8784n647J1148J4221K3095q946K301j5185q867J2568j1258
16273g340j749l4081o928P584n436J0636L2053K1851J692Q113j8817K5703K8848
16260F2129k5443n1245n960j8251N946n710J7272J4973L124O096p314k0558J9266
16247e675O440k1787j5180p173k6767j6841M612J1970m448L1446J5891j1493N0665
16234A1660J0259j9709k4388l3287k164M0236M120k162J4002j4353j2678r62K1664
$$ y = [38288, 10217, -6539, -8037, -1258, -2059, -18372, -23014, -50905, -61294, -57947, -25725, -19207, -41507, -29150, -1300, 17676, 6383, 7550, 5813, -30036, -54433, -54108, -44919, -50388, -31135, 10186, 8780, -23555, -37935, -56438, -73310, -72350, -68221, -34804, 6608, -3559, -6563, -4804, 11226, 8452, -1986, -20770, -26417, -15269, -1048, 22047, 13101, 15402, 217, -8650, 3918, -7340, -9089, -43170, -50098, -42514, -47950, -37314, -5261, 16590, 18282, 26395, 7578, 33281, 62129, 36686, -14559, -20519, -38770, -32824, -38534, -21262, -6289, -3165, 2931, -4383, -24941, -5675, 765, -21022, -36202, -43375, -70142, -86983, -82371, -70401, -74849, -43403, -27512, -39005, 11660, 21919, 2210, -22178, -55465, -57629, -17393, -13273, -15435, -1433, -15786, -28464, -29426, -7762]
16221g762J0890m588j3113j9475r224L4468J2123p326j0172J4001P399m2908n028
16208d0715J9475K3846J0872o179J068R827k1497j1860j9702P063K2428K8219
16196B2845O1j6842j641o02l6281j0947K1453j2617J783J7733K4282j2328k9201
16183c2302J2458J0731j2701K1511K9268j4585J7519N509o972k8669r126Q687
16171A328K0600j4269R953J4472k1022j0707n056j093j2922k2614l524j2153K1804
16158c5203K6251M982j080Q644L967J3808K807r319j0794m402J2334r780l3473
16145c1258j5750l707J1570O282M7220L2832k7179l8111J6727L6801J5670j3169
16133C7928k2359m880L5678J0422l5676m5820j0709K96k0104K69J3875L1463P464
$$ y = [-7762, 3128, -1460, -14573, -34048, -43272, -8804, 3319, -4007, -14179, -178, 7221, -35687, -40715, -21240, 2606, 13478, 7299, 8367, 18194, -3303, -15163, -34865, -27802, -5374, 22845, 22906, 6064, 4423, 3821, -32460, -43407, -21954, -34571, -32788, -15055, 9227, -3101, -32302, -19844, -9113, -21814, -303, 28965, 14380, 31899, 37408, 30436, 1767, -7359, 1328, 21928, 7659, 17612, 32084, 11062, 355, -4701, -5794, -18716, -41330, -44854, -57007, -35203, -8952, -3970, -5050, 3594, 7561, 21369, 24176, 14857, 4063, -339, 11995, 2215, -31258, -47008, -50715, -39145, -32863, 14357, 47189, 20010, -18101, -1374, 35427, 51097, 37928, 15569, 10689, 46367, 56789, 21113, -24707, -35416, -35120, -55224, -54955, -41080, -9617, -2153]
16120b153J3327P236l5079J6805K1489l936j0846l0830j391N954j2753l8757n494
16107g6428j7745M0273J8928j3997K5383M2496k2371k6064q315J5376L0933k3891
16095a5422j7231j1950L6525k002r775J6193L917j2815o639J3984L5267J9187
16083D9239m2559l2672R179K3401j0316K274l1863l9864K0016L8285J7036k5793
16071b3637j8863k2186Q085J4976L54K0757R493l7027K8932R75j3598K0978K2590
16058A1829J0290k754j5425n989j2501j7115K7491L3738j8535o064K3j6775r856
16045b1643L5993J2356j2393j5116j2070J1762p134j0228j3171M816l501j1230
16033d1559K218N892k4525j8761j8934J9341L7297N122n065N815P838J6826K8680
$$ y = [-2153, 11174, 18410, -16669, 136, 21625, 17689, 6843, -23987, -25378, -19424, -32177, -70934, -76428, -94173, -53900, -34972, -48969, -23586, 18910, -3461, -29525, -37840, -22464, 8469, -15422, -32653, -44603, -8078, -10080, -19855, -3662, 255, -12560, -19199, -5215, 30052, 49239, 6680, -25992, -16813, 6588, -3728, -1454, -33317, -73181, -53165, -14880, 2156, -23637, -42500, -64686, -56601, -41625, -41271, -20514, -11021, -48048, -19116, -18141, -31739, -10761, 11829, 22119, 19365, 3940, -2049, -14550, -31665, -4174, 29564, 11029, 4965, 4988, -11787, -21643, 14350, 26706, 14313, -803, -12873, -1111, -8245, -18473, -31644, -26828, -30329, -41559, -39341, -33449, -57974, -76735, -95669, -76328, -39031, -33909, -38974, -33159, -25321, -8495, 20185]
16020B0185j5769m4996j0137J3864J6916J4900j7308k8396j8931K5100J9838k1588
16008d6322k1210J3902J1088J5277j97k3210P733J7536K7302L3153l3184K1803
15996B3671M418k9612j9666j4056q983j1188l0822J5506L0336K9993Q015R503
15984G115j4153k0837Q938J0759L767K1296j8519j6088R242q256K598k676j2017
15971b8831K2714J8373j637l1022J7534J134J5430M841l5558l0727N453J8981
15959b3315L7187J1916j4280k667j4359m6773l548K9409q666j5894j3925j3273
15947g8188R894R744J6317L746K3197P902k971k1926R442J7555N255l685j6232
15934a9950K714K7152o303K0235j2238o751J6583k1073k0725N9555m245k7047
$$ y = [20185, 4416, -40580, -50717, -36853, -19937, -5037, -22345, -50741, -69672, -44572, -24734, -46322, -67532, -53630, -42542, -27265, -27462, -50672, -42939, -25403, 1899, 35052, 1868, 23671, 28089, -1523, -21189, -35245, -44228, -55416, -86238, -70732, -40396, -10403, -2388, 7115, -7038, -27875, -18937, -8178, -4411, 16885, -1634, -17722, -8480, -16736, -14138, -16814, -28831, -6117, 12256, 10619, -20403, -2869, -1735, 13695, 18536, -17022, -47749, -42296, -23315, 13872, 25788, 11508, 8841, -5518, -52291, -55839, -26430, -35096, -50990, -64915, -78188, -68294, -58550, -42233, -38487, -15290, -7388, -10359, -32285, -22843, -5288, -33, -3718, -19950, -17236, 9916, 3613, 23848, 11610, 4859, 21442, 369, -20356, 39199, 34954, 7907]
15922G907j9504J2921K2816k7622l3026J2799Q777K99P103K2839ok503p393j9832
15908a4425j1868n991k7824J5311L7160K4624k069L985r737k2010o103q644Q589
15895a9002K2766j832j4711l1383J790j3971p251O840K1621L5560J8068K6949
15883D5444j0078k2779K5814j1464p709m4335k7376M834j0858p922M484k252K0246
15870d3951M480M0692k101l432j438K2747L5689q990k7390l2108r859n429J1130
15857a9960K6312N014k859j6333k8278J3135r317M189p388k2643M0878J9215j3344
15844a1379o55J1325J9872O202r578J561J2697k6828p849o403j8591J495K5211
15831b920P909p239M005J0550n606m088j2356k1434n312P892N669l596J0189K3753
$$ y = [7907, -11597, 1324, 24140, -3482, -36508, -23709, -14932, -14633, -7530, 15309, 15303, 12800, 5407, -14425, -26293, -32284, -60108, -44797, -7637, 16987, 14918, 18903, 9166, -12844, -18947, -27591, -19002, 3764, 1932, -12779, -44162, -42372, -56343, -63594, -56754, -35133, 427, 18495, 45444, 35366, 12587, 38401, 26937, 19228, -25107, -52483, -47649, -58507, -66429, -61945, -64197, -43951, -39471, 1221, -880, -4312, -5750, 16997, 52686, 43696, 16306, -15802, -25661, -31090, -19960, 6352, 11366, 8507, -7826, -36104, -22969, -32286, -28097, -35485, -58128, -17250, 1965, -11379, -12034, -709, 19163, 25365, 15787, 17348, 30045, 3217, -4632, -11035, -29626, -28131, -2920, 4989, -2250, 1755, 12305, 6699, 2611, -9745, -31179, -36491, -28599, -22930, -26526, -16337, 7416]
15817G416m778k8196j9351J0483m809N453L6452K5717k0922O77j1545j8890P810
15804a4483K8735L666k0141k6099j6597q44R081J6269j5701N11L475k3892j0933
15791f6953K3767K2239q328k3275P658L5993j1704o356r440J8753R423k1575m631
15778c4429m472J0798K77K604j88K2449L0187j7338k8824J0168R367p21J5965
15765A5843m501j3997r53n737Q71l785k5446o769J7170M0753j4928k7207J630
15752b7056Q903j1416q260r168p62J6173K1793p785J4453R733L447j675j7544
15739i164m815K0207r068P159k3785j9209j70l1008J3997M0169p600k0715k6253
15726g0255k2672J5256L5568K2637j0651K983k9824L024R456l488J6508K8345
$$ y = [7416, 2638, -25558, -44909, -34426, -39235, -33782, 2670, 28387, 7465, 8142, -3403, -22293, -14483, 14252, 17918, -2223, -28322, -44919, -45763, -36682, -20413, -36114, -35603, -32128, -56020, -66953, -43186, -20947, -29275, -52550, -44892, -8899, -20603, -26959, -36399, -17646, -8223, -29798, -34429, -38901, -28103, -27826, -25222, -25410, -2961, 27226, 9888, -18936, -8768, 599, -122, 15843, 11342, -2655, -3608, -9345, -8474, -12259, -37705, -44474, -27304, 13449, -1479, -28686, -27056, -18153, -29569, -37829, -46997, -47759, -31586, -9793, -17578, -3125, 6608, 10055, 8380, -9164, -13979, 6228, -2840, 4319, -19466, -38675, -38845, -69853, -55856, -15687, -23287, -44002, -70255, -92927, -77671, -42103, -19466, -30117, -27134, -56958, -53934, -44478, -47966, -31458, -3113]
15714c113j6997n762o826K2499p836r411M656o431q024L864J220M967l2638j7198
15700g7030K4743M4833N354l1666j5582N503l340q760M2766K6547k2714m347r722
15687b3415q78K889j2995j3165K274k5197J230n98L3856J5202j6855K2700K0243
15674E291k9835k045J7830k689j8054n412J0059L1990K155j1795L662K2609n873
15661A7893k454l7429k8383O664K7838L9204N772l6172m0887J9327L0023J3671
15649A5067j1997j285j5475Q181l862J6794p106k7566r668M192L1896k7073k4057
15636e1959K1382P355J0714K281K451K0798p566l8071j8116K945P286K2865k7307
15623d4942M049J1022J721m15J859J8352j2387J0404K5780J9785j3912J713r632
$$ y = [-3113, -20110, -25872, -32698, -10199, -18035, -27446, -22790, -29221, -37245, -33381, -32161, -27194, -59832, -77030, -52287, -7454, -2100, -33766, -49348, -43845, -47185, -55945, -13179, 13368, -9346, -13693, -23415, -24293, -21404, -34399, -47564, -45290, -70487, -69257, -69855, -35999, -20797, -37652, -14952, 5291, -24544, -26589, -8759, -11448, -29502, -34914, -24855, 7135, 9290, -2505, 1157, 23766, 17893, 15439, -21990, -50373, -43709, -15871, 23333, 29105, -7067, -47954, -28627, 1396, 15067, 3070, 1785, -13690, -5509, -9371, 7423, 317, -27249, -36917, -32725, -829, -27902, -51959, -30577, -23222, -12508, -10227, -7776, 13022, 5456, -32615, -50731, -47786, -40500, -17635, -44942, -40893, -29871, -28150, -28565, -26706, -8354, -20741, -10337, 15443, 35228, 21316, 23029, 13397]
15610A3397k3774j3035K4j9273J2785r876m054l2108J4593J9796M278K436J9030
15597a5781J7592L5009k1411l4303k997p699K5549L1868j0730r394J1737K32P28
15584B0400J1949P645o25M704l9326M070k6439r823R779k9569P590N440L3121
15571a084L8439L800j7628k0254j8152j2956n547J3902J7807r358N381j0850j891
15558a8391N458N410n534l1623j8496J8380L7892Q81l590k472j7683k4382J9181
15545c4969M1352l540J6360J0626j2015j2251O117L2021k9142k505Q894J2859
15533C3807j1012m1923j9287J6177o304J4767m533p68k011Q950J2146q544l1902
15520d0437P418M298R404J4046K8443n286j5165J824m522j19k634N162K0854j5381
$$ y = [13397, -10377, -23412, -23388, -42661, -29876, -39752, -43806, -75914, -61321, -41525, -37247, -34811, -15781, 1811, 36820, 15409, -18894, -21891, -29590, -4041, 27827, 17097, 7703, 19440, 19672, 20400, 32349, 39994, 39369, 44073, 4747, 8817, -17622, -27445, -17666, -47235, -39645, -34205, -1084, 37355, 41155, 23527, 3273, -14879, -27835, -33382, -19480, -1673, -11031, -5650, -16500, -18391, -12933, -7523, -13057, -44680, -63176, -44796, -6904, -6023, -9613, -12085, -29768, -54150, -34969, 6383, 2843, 19203, 29829, 17814, 5563, 11680, 43701, 14559, 12054, 20948, 33807, 22795, -19128, -38415, -22238, -28542, -13775, -18308, -19076, -21087, -12137, 9, -8535, -40437, -33019, -28721, -19317, -5271, 23172, 17886, 2721, 4545, 23, -96, -2730, 2432, 23286, 7905]
15506G905l3780j1233j3825R309K9915j0393n851K959K7280L507j5088k8500J2075
15493b5720L6673k7630j5867k311J6415J061o71l2464j2599L8803J6431r45q95
15480i719M934R9j5615j8202J344O488J5787J9518P39l1630J4903j4821K2498
15467c677K2125j9090j483o1k8200K8420M1716J5807l8998l2047J2333J020j9564
15454b1699L802K764R107J7133J0155k9579q810j2080K2623L9596j7400l2793
15442a7181o718K4025J2639m566k4213k2034J963O165j1564j3704j5074M654L0972
15429c4636K860k685J8461J4618q847j6937Q020j1860p836J4520j827r235m2755
15416g8139J5104J5193k022K9314K845j9350n704K0070k3906k2115K6511N7715
$$ y = [7905, -25875, -37108, -50933, -41624, -11709, -22102, -27953, -24994, 2286, 5793, -9295, -37795, -25720, 10953, -16677, -32544, -34855, -18440, -17379, -18050, -50514, -63113, -24310, -7879, -8824, -9719, -4785, -4686, -20301, -38503, -37159, -30671, -14884, 4634, 5373, -26257, -11354, -26175, -3677, 18448, -642, -2125, -2186, -30386, -1966, 39750, 55557, 16559, -15488, -3155, -2135, -21699, -17897, -15133, -6026, 11107, 21262, -8317, -17127, -29207, -6584, 33012, 15612, -17181, -23899, 126, 12765, 8199, -16014, -38048, -36085, -29920, -41484, -55188, -70262, -65608, -34636, -31776, -34461, -16000, -1382, -10229, -27166, -19146, -31006, -38842, -24322, -26149, -35384, -78139, -63035, -47842, -49864, -20550, -17705, -37055, -42759, -22689, -46595, -68710, -42199, 15516]
15404A5516n542j9695k359P570K89l6468j0790N159P781N056k8106J5797K1086
15391b4706P057K0279k632P928J1514m851j9706j813J955j3556K5789m100q111
15378d953K709p192j7584n988L9364O305o996l4209l5978K818J7603L199L4784
15365f118M1241P879k4696j3758j697j3042k883O009K3561j1822n541R700j8303
15352i470l1661J5887J7736p174J1594L4077M625m6324p881r890J584J6257P863
15339b777o406k3750j9497l268P885K2580L0289K4822j2941J1700j1775k4990
15327h128Q175J4340K062m400L326L138l0243l2405n576J4110L2252l456J1005
15314D200j5361l713n22k244J0901l921n078K8388J3310R741J3208J5370k8609
$$ y = [15516, 9974, -9721, -12080, -4510, -4221, -40689, -51479, -46320, -38539, -33483, -61589, -45792, -24706, -17649, 2630, -2, 7926, 19440, 14589, -5117, -6930, -4975, -18531, 7258, 3158, -4953, -2244, -9436, -27020, -33008, 6356, 12661, 5665, -28544, -64522, -61704, -44101, -40902, -6118, 35123, 43002, 18306, 4548, 2851, -10191, -13074, -7065, 16496, 4674, -867, 8833, -9470, -41131, -25244, -7508, -14682, -3088, 30989, 35614, -10710, -18591, -28481, -26897, -10640, -2777, -9183, -32933, -52430, -55698, -47813, -25233, 5056, 29878, 16937, 28637, 16862, -8128, 47, 14387, 16449, 12049, 15375, 18513, -11730, -44135, -49711, -35601, -3349, -6805, 4200, -11161, -14874, -15396, -17640, -6739, -10660, -15738, 12650, 25960, 35701, 48909, 64279, 35670]
15301C5670o346j6978k2495j9157j6126R334K357j3727K8767J373R618K6375k6512
15288g847O385Q525k234m520K750j258J0764O713N791k449j373K899K634j1234
15274A5546k7083k7696M8819M4020j1334j7367k7347l1109m035L7007J2616J5807
15262B7844n578k1021j1008j6996P888J4577K5713j9089q739J9268j5535p991
15250a0667K5773j6546l064K0465J3028J7481k2561l6791k0294q620J2696L6937
15238G837J1238k6645J1370k521J2290p329j2746m72K6239Q39n819j8178j8824
15225b2721Q117P527j3728k2700L7911k993j2215K1622N266P70K2807j1244l4373
15212a5954l42R586O932m474J5795k006j7185O499J0534L037O897N997R225j8521
$$ y = [35670, 29324, 12346, -10149, -29306, -45432, -36098, -33741, -47468, -18701, -17328, -7710, 18665, -7847, -1462, 7063, 4829, 309, 3059, 1801, 12565, 19278, 25069, 22620, 21247, 24146, 26780, 15546, -11537, -39233, 9586, 53606, 42272, 24905, -2442, -33551, -37586, -579, 12037, 27844, 22266, 1245, -9763, -26759, -18871, -4294, 21419, 2330, -6409, 12859, -2676, -10667, 15106, -1440, -4504, 15961, 28989, 46470, 23909, -12882, -33176, -41796, -29100, 7837, 19075, -7570, 3800, 1279, 13569, 6240, -6506, -6978, 19261, 20100, 14281, -3897, -22721, -14604, -7077, -20805, -43505, -5594, -8587, -20802, 820, 6086, 6856, 29663, 18419, -15954, -16296, -6710, 222, -4252, 11543, 9537, -7648, -1149, 9385, 12422, 19319, 25316, 34541, 16020]
15198A6020l5329K5905L752r541N823r210k5208J6319Q574j357K1254r867l1329
15185b4194k8651r426J5880L1434J0182M0620J4130k4138j957n854k5447M744
15173b677K2021J0565o619j2998j6374j8126j0248K7084o833k7877L091j801R31
15160c9861J1106J0523j7599o806l27N855p574J07P13O068l501Q503J2171J5785
15146d837n823l3681P645K0372K3411Q300J2838j1909k206l188k6006l906J1814
15133g176j7198l2143J103L490L4189j0j0176J0858L4631q73l1600K1035J3733
15120A9863j6677j8884L95j9673r929R58P162L8086J7797p90J1854j1887k2958
15107d683r353r716j5868K8552R141p416L068O952n267O472j1223k8977L3072
$$ y = [16020, -19309, 6596, 10348, 807, 6630, -2580, -27788, -11469, -2895, -4252, 17002, 7135, -24194, -52845, -62271, -46391, -14957, -4775, 35845, 49975, 25837, 23880, 18026, -7421, -2677, 19344, 29909, 23290, 10292, -6082, -24208, -34456, -7372, -14205, -42082, -38991, -40792, -39861, -28755, -18232, -35831, -42637, -42964, -37109, -44683, -44576, -43863, -37795, -41296, -32793, -20622, -4837, -10660, -44341, -36696, -16324, 7087, 15387, 28225, 16316, 14110, 10922, -15084, -18990, -7176, -24374, -56517, -55414, -51924, -17735, -17745, -27921, -17063, 17568, 16695, -14905, 6130, 19863, 3186, -15698, -15303, -34976, -44905, -43947, -36785, 1301, 19098, 18308, 30162, 18275, -4683, -14036, -23752, -39620, -11068, -1927, -9343, -6275, 677, -4590, 1882, -9341, -38318, -5246]
15094e246J8345j9662l6856J6531J1544j9200K1389o660J8762q787l099J1527
15082a412l7j6599j0077K6222K5463j1143j2932J8038r985k6201K1951O455j1104
15069a361m680k63K1933J9877m501j1196m8674J0017L892k843M126J3171l2719
15056c3221L113K4662r6J0008m963j7893J6698J0606L9229n145j1851k4284q879
15043b016J6081J9029K3911r490J1838L3497k9195L01l1181k1241j9876k9867
15031c8209l1501J992K8918Q061K9630L0353j284j256K1568j8451j9108K023l1235
15018a8499j2481k0024j3092P373M3226K3587j064p022j0887k6167Q339J3000
15006a3711j512R19j9253j4291L874j3544q487K0069j6586j6570L3292M593o756
$$ y = [-5246, 13099, -6563, -43419, -26888, -15344, -34544, -13155, -19815, -1053, -9840, -12939, -1412, -1449, -18048, -28125, -1903, 23560, 12417, -515, 17523, 7538, -18663, 3288, 9743, -1361, -6041, -6304, 15629, 35506, 31005, 19809, -28865, -18848, -14956, -17799, -13673, -502, -33221, -30108, -5446, -5542, 4466, -497, -18390, -1692, 8914, 48143, 42998, 31147, 6863, -2016, 14065, 33094, 57005, 47515, 59353, 92850, 63655, 63956, 32775, 11534, -8342, -38209, -69710, -67718, -38800, -30739, -1109, 29244, 27960, 26704, 48272, 29821, 10713, 12736, -18499, -30980, -51004, -64096, -56723, -13497, 10090, 9026, 2004, -8883, -35050, -26711, -13711, -15223, -14304, -33557, -47848, -43974, -57518, -66005, -45936, -62522, -79092, -45800, -41207, -47963]
14993d7963N971j4783m328J5410J1722K900r133J1777J2642l573j0716J0340L2020
14980A2286j8400k1413K609q239J2706J2346J1986r44j3663L4330M6194k5665
14968D4133n3737M9L319k2002R499K3013K0756j4485r861q14q287r636K3856j7576
14954a1773j2020l732K9159J6114j9075m3426j5608M7913J5484k5810L28j5499
14942c7945J9280Q552m672K3664o446k1348J2962K0232J8947j4399j9988k8726
14930b9887M961K2440l842J4250P151j3632m9755k7913O140L9338L1859k5114
14918b4004j3803o809l147J7287K364J649j451M444K7351n578j4574j5937k2641
14905e4849o363j770K8160L2434o748p050M291J727J5015k398j8756J4960Q258
$$ y = [-47963, -41992, -56775, -61103, -45693, -33971, -31071, -40204, -28427, -15785, -19358, -30074, -19734, 12286, -6114, -27527, -24918, -33157, -20451, -8105, 3881, 2937, -10726, 23604, 69798, 44133, -9604, -9555, -6236, -28238, -18739, 4274, 25030, 10545, 684, -130, -8417, -18053, 5803, -11773, -23793, -27525, 1634, 17748, -1327, -44753, -60361, -12448, 3036, -22774, -22446, -37945, -18665, -10113, -14785, 8879, 2433, -18915, -5953, 14279, 33226, 18827, -1161, -29887, -24926, -2486, -6328, 7922, 15073, 1441, -48314, -76227, -70087, -30749, 1110, -24004, -37807, -44616, -47763, -30476, -28112, -26463, -27914, -23470, 3881, -1697, -16271, -32208, -54849, -61212, -62982, -34822, -2388, -9136, -16186, -11895, -10168, 4847, 2449, -16307, -1347, 6911]
14892F911j5374k499J4240r657l1565N737K2329Q320k0869K6161L5938K2325l1254
14879C0743l189k1046j7374p768j5705j1995J3741L7553K43n211j1747p467j7267
14866c6489N225L731K0063N26q690j4813K9242J4841o332k3343J378J0679L2220
14853B8238L155M394j3236J5687J0786k1338K3708K4281J1711k3004j2912o336
14841D5134j0064O206l6170l9316Q226J4848J2883J6445j701N05L295L845J4903
14828C9039K6957J1128k7253l1307m3709J942J0914J0816k027J1893Q18l0738
14816b1527N011P788J5652j9307j1836L2230K4124P459M372J5540l1694k277J5524
14803D1059l441j5205r227j5317m70R78k8010R869P368J212L713k7698l6309J4890
$$ y = [6911, -8463, -10962, 3278, -6379, -37944, -32207, -9878, -1558, -22427, 3734, 39672, 61997, 30743, 27554, 6508, -10866, -18634, -34339, -46334, -32593, 4960, 5203, -8, -11755, -19222, -36489, -31264, -27533, -7470, -6944, -15634, -30447, -1205, 13636, 7304, -16039, -14661, -3982, 28238, 31393, 35787, 22551, 38238, 49024, 27686, 51394, 75675, 87386, 64382, 51470, 45134, 35070, 41276, 5106, -34210, -25984, -11136, 1747, 18192, 16491, 16996, 20291, 24136, 39039, 65996, 77124, 49871, 18564, -25145, -23203, -12289, -1473, -3500, 8393, 9211, -21527, -16516, -8728, 6924, -12383, -24219, 8011, 32135, 39594, 43966, 59506, 27812, 25535, 41059, 37618, 22413, 13186, -2131, -2601, -1623, -29633, -19764, -12396, -11184, -7471, -35169, -71478, -56588]
14789e6588L356J4967K5866J0855k4677k6500r987J8895K9169r552K349K0705
14777a142l63J3069k3305j0033K6782O153l632k173P667P107N902J8916k831M604
14763D6721k39j3176l7811k3831J1343K9448K2288K3810l3429m0985n288J8761
14751b388o793J2055K3693k2227j4347K2175m827j8458J1773m387j5139r107L6687
14738H710J2539Q401J7789m5k2263M261j2896J1407P009k3554O706n506n772j8046
14724a1260k0699j2021P933L682n482J9085K4909j9409m4781k575Q222p044J8160
14711d1280L2805k9812l2925J8030J6495j3634K6338L3505k888j6128L1411K2627
14699D4544L3448k833j4169j4315l3013k6768j9458R572J3213Q590J3934n103
$$ y = [-56588, -53232, -38265, -12399, -1544, -26221, -52721, -62708, -43813, -14644, -24196, -21847, -1142, -1505, 11564, -11741, -21774, 5008, 11161, 7529, 5356, 13023, 20130, 26032, 44948, 42117, 46721, 46482, 33306, -4505, -28336, -16993, 12455, 34743, 58553, 25124, -15861, -21149, -2388, -9181, 2874, 26567, 4340, -10007, 12168, 7341, -11117, 656, -3731, -18870, -27977, 8710, 21249, 29650, 47439, 47394, 25131, 29392, 16496, 27903, 34912, 11358, 18064, 12558, 6786, -11260, -31959, -43980, -36047, -32365, -37847, -18762, 6147, -13262, -58043, -60618, -52396, -59440, -41280, -8475, -38287, -71212, -53182, -36687, -50321, -23983, 9522, 6634, -9494, 21917, 44544, 77992, 75159, 60990, 46675, 13662, -13106, -32564, -22992, -9779, -1189, 12745, 7642]
14687G642m5292j0250K4111L2710J6194P685K1674K2069k807o959N799j9577k0033
14674C2966l954l335R784j9592j752k973j7044k8266J571k056P804K8858K33k8324
14660b6080J000K6498K5988J795k246n243J1664J6412N01L989m4236j1814j9482
14647b1254J97K2020P614k386R607j0183j0471R139l4839j0883P130J8917k5352
14634d0744j2029q246N878K2233R551r898k491j8236q126q10K817Q484J5547K6147
14620i923P31J2326K9568J2535l202M437j4625j0183r705R7r091l7629j4533L2021
14606a7176O900k283Q640J258L2493J5329n114j5987l6512k5182j3640p565J4580
14593d4259N383q172J1984k899p812K379j6247j0780J9916K0426O187P083J1972
$$ y = [7642, -37650, -47900, -23789, 8921, 25115, 32800, 54474, 76543, 73736, 66777, 72576, 52999, 32966, 29012, 25677, 35461, 15869, 14117, 11144, -5900, -34166, -32595, -34651, -26847, 2011, 2244, -26080, -25080, 1418, 27406, 29201, 26955, 21712, 33376, 49788, 50289, 54278, 10042, -1772, -21254, -21057, 963, 8577, 6191, 15798, 5615, -4856, 4283, -30556, -41439, -34309, -15392, -40744, -52773, -61019, -55141, -32908, -23357, -33255, -35746, -53982, -62108, -62918, -60101, -51617, -36070, -9923, -9192, 3134, 32702, 45237, 42035, 46472, 31847, 21664, 11959, 12056, 2965, -34664, -49197, -17176, -10276, -12559, -3919, -2661, 29832, 45161, 40047, 24060, -12452, -37634, -51274, -58839, -44259, -38876, -47048, -35064, -37963, -45775, -43396, -59643, -70423, -50507, -30081, -23894, -16811, -4839]
14580d839j3800M65J335n912j5045q633j6041K944K3319J3462n227O844K1577
14567D49l673P548J523P817j611o91j0744R881j6777k686Q483M275j807N58j5631
14552a3086k772L235M26j975L2969j3980m5192k2187N2538M2951N301j0836p999
14539A9393l274N892j054j9423j1185k1132J6382n772j6365J7550K0300m02K4838
14526B5748o54k9237J418P126o502R870K3199J4902O042k3605j6304o578j6772
14513a1347j1874J9629J1641k7902l2056Q853J0483M3414J7535j4387O535j0975
14501I549j1984k4254r650J3745L2159J3346q678k2636j595o45J5924J718l6826
14488b9827j0960M1963n127J0231j3424q099m678J6925j8669j3198J2652P371
$$ y = [-4839, -18639, -18174, -16839, -22751, -37796, -46429, -62470, -59526, -36207, -22745, -27972, -21128, 449, -3224, 4324, 5847, 13664, 12053, 11362, 618, 10499, -6278, -8964, -481, 3794, 1987, 2545, -13086, -15858, -12623, -12197, -14172, 18797, 4817, -40375, -62562, -10024, 32927, 38228, 27392, 19393, 16119, 22011, 20957, 1534, -9651, -30783, -14401, -20173, -36538, -18988, 1312, 910, 25748, 25094, -4143, -2725, 4401, -2101, 7769, 30968, 45870, 51912, 28307, 12003, 5425, -11347, -23221, -3592, 8049, -19853, -51909, -43056, -32573, 10841, 28376, 13989, 20524, 9549, -2435, -26689, -36339, -22594, 9565, 22911, 14233, -8403, -9998, -10643, 5281, 6999, -29827, -40787, 1176, -3951, 6280, -7144, -15243, -19921, -2996, -21665, -34863, -22211, -14840]
14476a4840j481K7923l7536k6467J6593R765M634k5250L2889M9275L178l622l2706
14463B355k4474k1282R772K7657K7162q053J7582J4197k3260j4618j717r869O70
14450c878J0297j5965m784J6606k3730k2170R338k854m840R778M2763K2253l8062
14437e248M614Q989p776k3144m628K786j6771j7985L5375n087J5321N29j8542
14424c1567N297n776J4768L4126N386j2589k1099k6331L378K2723Q533m9412m902
14411e7465K8489J6204L6909J3588R877k3457J6180K5901M311j4007k1113k2742
14399A2675j1726L589j7919K6273O481j3793l339r497J0838M639m003l242J4804
14386A5780J9313J5724j2803k9727m1703k736J4898J4779N066j4663r87J7057
$$ y = [-14840, -16321, 11602, -25934, -52401, -35808, -26043, -21409, -46659, -13770, 35505, 38683, 35061, 2355, -22119, -43401, -33629, -5972, 21190, 13137, 30719, 44916, 21656, 7038, 5321, -4548, -3878, 6419, -9546, -14330, 2276, -21454, -43624, -34286, -37140, -41980, -32202, 10561, 32814, -5248, -634, 8355, 579, -22565, -27193, -24407, -41178, -59163, -23788, -28875, -13554, -13025, -31567, -26270, -32046, -17278, 16848, 22234, 9645, -11454, -37785, -34407, -11684, -3151, -52563, -57465, -28976, -12772, 24137, 37725, 47602, 24145, 40325, 66226, 70537, 56530, 35417, 12675, 949, 4538, -13381, 12892, 19373, 5580, 2241, -7256, 3582, 8221, 4218, 976, 15780, 35093, 50817, 38014, 8287, -33416, -36152, -21254, -6475, -1409, -16072, -17059, -2]
14374bR727k690m761R407Q508o956K000M563j0980k135m2543O658K372Q400K5841
14359G409L4326J060K4756m997O231J7708P670l8010j8114j7399K2090M268j7474
14346B9524q453L519k4253j9317L0352J2550j818j9182k910k475J8730j5631j9582
14333a8946J2942j9453Q92K3936J7633L929n713k0433J9722k136R374J7992j1854
14320B7885j0982J2487J6842J026K9307K8153k4461O758K0628N4425L8716L6473
14308B37257N1568P1851Q9435J12485M5801J2065k303k314L6178o20m7265o4965
14296E39173q0501o2313p9231o7925l0692k3482q362n6770o4507l3781M778K139
14284C8526J8904j4420j8816j6054q381J3611M190k1165J740J3119j9103q314
$$ y = [-2, 9725, 7035, 2274, 11681, 20189, 13233, 15233, 19796, 8816, 6681, -35862, -29204, -26832, -18432, 7409, 41735, 42795, 67551, 62554, 68785, 86493, 94163, 56153, 38039, 20640, 42730, 46998, 29524, 21071, 24590, 337, -18980, 11372, 23922, 22104, 2922, 12, -2463, 16267, 636, -18946, -6004, -25457, -24565, -629, 17004, 20933, 15220, -5213, 14509, 12373, 21747, 39739, 27885, 16903, 29390, 46232, 47258, 76565, 104718, 80257, 87015, 107643, 162068, 200784, 237257, 288825, 360676, 450111, 562596, 608397, 620462, 618159, 615845, 652023, 651403, 604138, 539173, 458672, 396359, 317128, 249203, 218511, 195029, 186667, 129897, 65390, 31609, 36387, 38526, 57430, 43010, 24194, 8140, -241, 13370, 17560, -3605, -1865, 11254, -7849, -16163]
14272a6163J1153K5043J7488j855k4397l9883k9971L2826J3829J6428L7841L770
14260D6109M109q264q752J6958o656m6846l7197p33L4659K9002l405q935O597
14247A6646J6314j2623j1188L0975j599k0645n411k542K2866l171l2357k6331
14235b9066N0671J9888o004l897L077P542N654p746l3862l8936j1533L5908m851
14222a3155j6075k653K4491K4449m575l540m902m1877M751J318J9102j0637j30
14209b3433J8315Q040k0520O080J7480M817l8883k931p82O757J6035K5474J8601
14196C5050N897M906J3954j2110j1713J0716M827k8863l9250l813O123J4621J4808
14183A5153j6260j6750J2057J66k6807l650L0330j574j0476L0866k7071K377J3220
$$ y = [-16163, -5010, 20033, 37521, 35666, 11269, -28614, -58585, -25759, -11930, 4498, 42339, 46109, 50218, 41954, 33202, 50160, 43504, -3342, -40539, -41272, -6613, 22389, 18984, 10049, 16646, 32960, 20337, 9149, 40124, 38525, 17880, 12469, 9927, 32793, 29622, -2735, -29066, 21605, 41493, 35489, 31592, 34669, 42211, 47865, 40119, 6257, -32679, -44212, -8304, -13155, -29230, -31883, -7392, 17057, 12482, 8942, 4040, -37837, -33086, -31768, -12666, -23303, -23433, -5118, 2922, -17598, -11518, 5962, 10779, -28104, -31035, -31817, -25060, -9025, 16449, 35050, 40947, 45853, 59807, 47697, 35984, 46700, 51527, 22664, -16586, -20399, -14276, 345, 15153, -1107, -17857, -5800, -5634, -32441, -36091, -5761, -7335, -17811, 13055, -14016, -11639, 1581]
14170A581p363N109K9311J9895m866p162l9933k2702M106K3237j1890j8297K2948
14157f026K0904n138n480m609r556L122r686j9255q666r876L2351K8965K0624
14144B7674k6225l510Q186N929P050m0253r959q381Q720l471J8915M0980o218
14131A9437l6872j7650R416L1489j0610O507K096L914r864L546m157K2076p612
14118A1716l822O938j2166k9231k3877R998K3026J26l4583l468L5352J8086Q192
14105F287k8013q569J4125O617Q21J0739J4042K1602j823K467o077O497k862j5928
14091A9925j7383N4448J0420k936j222o0239n487L2980J5780J5216l207k5470
14079C2825J7910k3678l4762M400J6328j4030O51j1223J2061k462j5659m728J5277
$$ y = [1581, -5782, -673, 28638, 48533, 43667, 36505, -3428, -26130, -22024, 1213, -10677, -28974, -6026, 14878, 9740, 4260, -349, -9905, -6783, -16469, -35724, -44390, -54266, -21915, 7050, 27674, 1449, -2061, 6125, 12054, 19104, -21149, -31108, -39489, -30769, -34240, -15325, 25655, 19437, -17435, -35085, -25669, 5820, -4790, 1717, 3813, 7727, -2137, 1409, -2748, 19328, 11716, 7894, 14832, 2666, -26565, -50442, -40444, -17418, -17292, -51875, -55343, -19991, -1905, 6287, -21726, -30295, -16170, -9553, -8732, 2007, 16049, 37651, 35828, 38295, 32218, 38715, 35853, 19925, 2542, 56990, 67410, 64474, 63252, 3013, -2474, 30506, 46286, 61502, 58295, 32825, 50735, 27057, -7705, -3305, 13023, -1007, -356, -11579, 482, -1980, -17639, -22367, -7090]
14066g090P315j2783r947j1860J3377j1446n949L7241M0057j2118l990n560p174
14053A0073J1836J8569J567j6069j4099M829j3613J3847L1011k597j9959o085
14041A9310r477k0332J4210L9361q070m9655j4482K3234K2606M091j7966J4729
14029A7559K4848m721k9822l8874j2000j097K1533N693L749J1984P333k2104R398
14016f521m3M165j0345J5380n70N919J8495K3228k61k2677k6991j6381J4444j1445
14002a3603k0297N107K574J083j3992J891J9637J0765j0601J29M3952k7661l031
13989d047P279J0489j0168j1815k3953q003J8006K7330L05M396j2556J8542Q905
13976B4710l353r158k1232O441Q869j447j1809K809N315l286o893k0482K042P290
$$ y = [-7090, 225, -12558, -22505, -34365, -20988, -32434, -38383, -1142, 38915, 26797, 22807, 17247, 10073, 21909, 40478, 42045, 25976, 11877, 16706, 3093, 16940, 47951, 45354, 25395, 19310, 9833, -10499, 3711, 43072, 35002, -14653, -29135, -5901, 16705, 20796, 2830, 17559, 42407, 37686, 7864, -31010, -43010, -44107, -22574, -16881, -13132, -1148, 6185, -15919, -6521, -6564, -2399, -12744, 2636, 2066, 7985, 26480, 49708, 49447, 26770, -221, -16602, -2158, -13603, -33900, -28793, -26219, -25136, -39128, -37237, -17600, -6835, -17436, -17307, 26645, -1016, -4047, 3232, 13721, 3553, -8262, -32215, -40218, -22212, 5118, 5423, 9819, -2737, 15805, 24710, 21357, 12199, -9033, -2592, 6277, 4830, -6979, -4170, 1145, -2141, -9034, -29516, -27474, -20184]
13962b0184j1944k6552q234M795L2716K2174L621J191j0795M57k0358J9441J8349
13949D677J0644j1157q187k8266p53J395o764m562L9608R314o923o174j0881K2060
13935D031k060N262J2938J740k97k5442r608N75j1583j935K9010j0072M661p380
13921a0160n109j1365K0343k750L3728J4999l08J97l0952o687L1205L1071J5046
13908G9258o66O482l981J8960l4098l1541K2206j8425k6989J4973n527k0612N332
13895E372P57k2553R441j645M341J009j9250M577J6131K9001o782P619K4235k348
13881D9905j9463N87k4132j3352q690j9982q212Q052J9953L2133J7567l869j0702
13868A9795j3795j2545K8300J8207r304J906J5674m793k1186k7712k0817m444
$$ y = [-20184, -32128, -58680, -66914, -62119, -29403, -7229, -3608, -2417, -13212, -12755, -33113, -13672, 4677, 15321, 4164, -4023, -32289, -33042, -31647, -38411, -42973, -3365, 5949, -974, -7148, -18029, 4031, 1971, 7233, 20171, 21911, 21614, -3828, -13436, -12861, -24444, -26379, 2631, -7441, -2780, -10160, -15269, -26634, -6291, -9041, 24687, 39686, 39378, 39575, 8623, 1936, 33141, 64212, 79258, 78592, 85074, 81093, 100053, 65955, 34414, 56620, 38195, 11206, 26179, 20652, 40, 5372, 6129, -16424, -6983, -8628, -4287, -3278, -22528, -17951, -1820, 27181, 20399, 28018, 52253, 49905, 30442, 31029, 6897, -6455, -15145, -35127, -43339, -35287, -15334, 16799, 34366, 30497, 19795, 6000, -6545, 21755, 39962, 30658, 32564, 48238, 43445, 22259, -5453, -26270, -30714]
13856c0714J4440L2619J492n031j253Q984j780m2001j0680L2947R938J017J8719
13843B8697J0346l1955k6815P124J6857M694k7599l479K4658j9918j9361J3288
13831b3463M513J0782J9946N520k5385k5184m985N753K43L342j0401J2825K8119
13818A625J5379P635j8370J7653N095k2877q351k5721M263L6906K471k2628k1335
13805b8255J4285K4934K4094P364r903j7650l552k0472K6094J2531j6339j2873
13793B58j1065J0845J6139O219l1314l437J3088K9497O237R686k8538j5837j2954
13780a1176M970J4766K244J2886J2415j7881k1437j6963k951K0122o775m5167
13768e4947J0974K052J2069K0794j7786Q066k408m817O553K007K0197J7627l6019
$$ y = [-30714, -16274, 16345, 17837, 12806, 11553, 20537, 18757, -23244, -33924, -977, 8961, 9978, 28697, 39043, 7088, -19727, -12603, 4254, 8948, -18651, -22130, 2528, -17390, -36751, -23463, -18950, -8168, 11778, 17298, -8087, -33271, -38256, -32503, -32260, -28918, -39319, -26494, 1625, 17004, 24639, 6269, 23922, 29017, 6140, -2211, -27932, -23669, 13237, 15708, -6920, -28255, -13970, 10964, 35058, 42422, 32519, 14869, 11317, -9155, 16939, 29470, 13131, 258, -10807, 38, 16177, 22396, -8918, -12355, 733, 30230, 36467, 46153, 17615, 1778, -11176, -6206, 8560, 10804, 23690, 36105, 18224, -3213, -20176, -23127, -3005, -9780, -54947, -43973, -41921, -29852, -9058, -26844, -18778, -21186, -26003, -19450, -17443, 2754, 20381, -15638]
13755a5638j6418O049J9800M1859P598R361j6654k2256j7756K551J5263L0583
13743D4342r20j2523k5982k8888j1142J0380K7522L2214P017K5254j2474k6818
13731B7982j3907j3454Q881J6274k5852p578N986l4584j0943R279K6387M1801
13719C0272J9480j2290j9692K1920J5388l3638l015j5214k4683K4494L1047O436
13707D0505j3010j8945J5940K7668j0705k5154m826o028O255N214J0626k1255
13695F285L606j2856J4962K9220n480j5613k0258q338L6941K0171J2207K8267
13683H9114j2068n5948m3988K2301K8916N248M556K303p160k0897l239K2409l6376
13670d829r760j4534k0371J3244P341M945J5781j9789j1502J5982J1864J2389
$$ y = [-15638, -32056, -26007, -6207, 35652, 43250, 52611, 35957, 13701, -4055, -1504, 13759, 44342, 43422, 30899, 4917, -23971, -35113, -24733, 2789, 35003, 42020, 67274, 54800, 27982, 14075, 621, 9502, 25776, -76, -7654, -1668, -36252, -47195, -37916, -11529, 30272, 49752, 37462, 17770, 39690, 55078, 21440, 18425, 3211, -21472, 3022, 34069, 40505, 27495, 8550, 24490, 52158, 41453, 16299, 11473, 5445, 11700, 16914, 27540, 6285, 9891, -2965, 11997, 41217, 35737, 20124, -134, -8472, 28469, 48640, 60847, 89114, 77046, 21098, -22890, -589, 28327, 33575, 38131, 40434, 33274, 12377, 9138, 31547, -4829, -14589, -29123, -49494, -36250, -28909, -23964, -8183, -27972, -39474, -23492, -11628, 761]
13658G61l897O118R086J035J0988P804k5777o682N891j0529k70K1043l838k2739
13644a1006K1446K0785J2092j145r435K739K0712J258j0338j3497k5011m334j0537
13631f271m209K1455L0146p802M306N404j4581M2023J5295o667k5926k6183k4611
13618B379l709J3226l968q791J0507J5413n087P721O157K0019j1578l7495j3133
13605h339k7427L0908J9224o298q120j5341K1895o581O36J293L699k0519J2654
13592b316L5315K2415P241L524k3086l9085m996m827K704k719J604p406O010J9654
13578A4032N507L123M0605jm5241n0176J5742K4986Q529J5518L3442R278k9278
13565D6066n4734l1394J7811J0379Q010N032k1365j2988K7659j7257p726k5352
$$ y = [761, -3136, 2982, 12068, 13103, 24091, 31895, 6118, -564, 5327, -5202, -5472, 15571, 11733, -11006, 10440, 31225, 43317, 42172, 32737, 35476, 56188, 57446, 47108, 33611, 8600, 4266, -6271, -10480, 10975, 41121, 33319, 37625, 43029, 28448, 70471, 85766, 79099, 53173, 26990, 2379, -1330, 11896, 7928, -863, 9644, 25057, 19970, 27691, 33848, 53867, 42289, 4794, -8339, -35766, -4858, 14366, 8068, -52, -15393, 6502, -79, 557, 1850, 5549, -14970, -2316, 32999, 55414, 62655, 66179, 43093, 4008, -988, -5815, -3111, -5830, -4226, -11632, -5622, 14032, 19539, 22662, 63267, 63266, 18025, -32151, -16409, 8577, 17106, 32624, 66066, 75344, 46066, -8668, -40062, -22251, -11872, -3862, 1170, -20195, -33183, -5524, -22781, -30507, -55859]
13553e5859J87L0579l93K0911J0334J0525j3879k5241K2208M9013O137j9138n905
13540B9479J696k2151J500M0435O782j8622k3623j2793J3320K3421j455o129k7439
13527D421l3243L711j1113P678K0885L0655m183M974k185M028J0911m3901o856
13514a4218k929K8040K5769j3962m4130K3967L8911J5278j3381R097p722k3935
13502B0785K0220p759r537J978k6163Q369K7913K0168m3466p038j0580K628J6882
13489A4400J8255K0666j1640q644j1794j49J2007M834n751l3249l884L3996j995
13476B7052l928J9407q168m351q026q262j3964j1057j5338K7860J4756l883o08
13463A1490j7290p154N482J8066L626j638j0982j1037j3378j7231n207L3036P340
$$ y = [-55859, -55672, -25093, -25486, -4575, 5759, 16284, 2405, -22836, -628, 48385, 54522, 35384, 29479, 31175, 9024, 10524, 50959, 57741, 39119, 15496, 2703, 16023, 39444, 37989, 31860, 4421, -28822, -25111, -36224, -28546, -7661, 22994, 18811, 23785, 21600, 25628, 36539, -7362, -14218, -17147, 10893, 36662, 22700, -21430, 2537, 41448, 56726, 43345, 52442, 44720, 20785, 41005, 33246, 23709, 25687, -476, 7893, 35806, 55974, 12508, 5470, -5110, -2482, 14400, 32655, 53321, 41681, 33037, 21243, 21094, 33101, 37935, 32184, -1065, -4949, 29047, 27052, 23124, 42531, 34363, 30012, 21986, 13724, -240, -11297, -26635, 1225, 15981, 12098, 11490, -5800, -12954, -7472, 10594, 14220, 12582, 1600, -9437, -22815, -40046, -45253, -12217, -4877]
13450d877J18k90K3125l638j5322L192K0076R140k0945N069J3722K5502j4596
13437D0276j5141N565M019L501P333J3983K4761J2374k3544m5195k2644J5177
13425B0465P632k0896L955j3856l759K845J5967N706J1748j7198k2973k010J3633
13412A259L014k4114K8740L8424j0941r57J4157J456l0154k4103l3070J6259R40
13399a9090J9153J2293j3097K2004J0651K536K2081K5427k0262k2797k118J0531
13387D7312O36k2617J9122J686p613o833k251J2524K2659P12j4968k1185J084
13374C0268K8548L1524J909k4443j3831M678k0424j9275J6046J0669p464j3529
13362B4676P782k079N492J3801N93Q992j0905j1387J5913N592j8385k6797n293
$$ y = [-4877, -4759, -5049, 18076, 14438, -884, 2308, 22384, 31524, 10579, 15648, 29370, 54872, 40276, 25135, 30700, 34719, 38220, 45553, 59536, 84297, 96671, 73127, 27932, 5288, 20465, 28097, 7201, 11156, -2700, -6459, -3614, 12353, 18059, 29807, 12609, -10364, -12374, 1259, 4273, -19841, 8899, 47323, 36382, 35425, 49582, 51038, 20884, -3219, -36289, -20030, -19090, 63, 12356, -741, 21263, 31914, 34450, 56531, 81958, 61696, 38899, 36781, 47312, 47948, 25331, 44453, 46139, 38526, 31693, 29442, 41966, 64625, 65337, 50369, 29184, 30268, 58816, 90340, 92249, 67806, 53975, 58653, 38229, 18954, 35000, 45669, 38205, 24676, 32458, 30379, 35871, 49672, 50265, 59257, 48352, 36965, 52878, 58470, 40085, 13288, 7995]
13349G995J1918L6496J4444M350l923l899l0403L675J0080J896J1007L0595J9656
13336A13887j7864o760K898k3870l0324P704K636k9451o401k941J5354J5301m71
13323C9698K1L0575J8784J7852J4848J6932J3409P1464R0844Q8779J09461J20078
13311F32745J62379J27906M8420j985k5271k1468m324j7269m1888r4937j71296
13300E93012j41890j13026n8835m2623k9205p778k4085r473k5072k9883k9054
13289H2088q985L7963J82j6513k9359k5101K3369R537j1194k8317j0779O0468
13277H3359J9093p419M959k2297l4963P076N671l3843P585K7507j8290O819q644
13264C6613j7255N788J6755n140K5443J2416m934l0450J7292K6247J9760K629
$$ y = [7995, 19913, 56409, 70853, 75203, 71280, 67381, 36978, 40653, 50733, 52629, 63636, 94231, 113887, 96023, 89263, 92161, 68291, 37967, 45671, 48307, 18856, 12455, 9514, 24868, 40169, 39698, 39719, 70294, 89078, 106930, 121778, 138710, 152119, 223583, 314427, 403206, 512667, 632745, 795124, 923030, 971450, 969465, 944194, 922726, 918402, 901133, 859245, 764308, 593012, 451122, 338096, 279261, 236638, 207433, 199655, 175570, 166097, 141025, 111142, 82088, 73103, 111066, 111248, 94735, 65376, 40275, 63644, 73181, 61987, 33670, 22891, 83359, 102452, 95033, 99992, 77695, 42732, 49808, 55479, 21636, 29221, 56728, 38438, 45257, 36613, 19358, 25146, 41901, 36761, 62204, 74620, 69686, 39236, 56528, 82775, 102535, 105164]
13252A05164j2627k1686j1754O791P484K1906p597j144K5170L70j5309k5012k3640
13239D8116J500m210M055q653j6079k3973j0104r324q887J3767R511k0994l4325
13226e9600L1809L0425J1961o339O424P081j0517L5673J5371j5745M286L9521
13214I0350N515j8048l9340m774j3284l3527j5769L9303M5838j646j6942l1840
13202E836j6310J9797L8732J7333m099k7539K676J1242J4977k696J0081P61j9694
13189E1097L9465j1423j8171J1024P697j9412k0820p126j597O308L0676J978J2693
13176H2389j7185J0550l114J3647M727K2675l0440j8223O69O245j7272K803p072
13163E0399O464L0592J1898j7810k4979k8246O863J4623J2449J6628L3805k4632
$$ y = [105164, 92537, 70851, 59097, 65888, 73372, 95278, 87681, 86537, 111707, 112077, 96768, 71756, 48116, 49616, 45406, 49461, 40808, 24729, 756, -9348, -18672, -27559, -13792, -4281, -25275, -59600, -27791, 2634, 14595, 8256, 14680, 21761, 11244, 46917, 62288, 46543, 50829, 90350, 95865, 77817, 38477, 33703, 20419, -13108, -28877, 10426, 56264, 54618, 37676, 5836, -10474, 9323, 48055, 65388, 61289, 33750, 36426, 47668, 62645, 59949, 70030, 70791, 51097, 90562, 79139, 60968, 71992, 79689, 60277, 39457, 32331, 30734, 37042, 67718, 69696, 82389, 65204, 75754, 72640, 86287, 91014, 113689, 83249, 65026, 65695, 71940, 54668, 57471, 50399, 56863, 87455, 99353, 81543, 56564, 28318, 35181, 49804, 62253, 78881, 112686, 88054]
13151H8054K106K9143Q502L7296K9000J6773L426m5042n9754l4286J9039q559
13139H5698N750K9301K0552N1065K858j5336j6718m525J8856N1356J2979j3016
13127B28820l7704k9602m130l4895m299K8013j4944k4646L834J48q380K2638M2746
13114A67599J0237k9901p384r374Q579Q139K345K4640O280J0506J3449r364k5010
13101A70741M9728L1423m681j7933k2477o599l685n946m9502k9915q155r470k9143
13088F4386M785n357j0492j1171J4791k3772j8549Q349n866p548r247K9789K5000
13075E5098q217j5560r063n038J7136k071K2944M5822q108k7070J5968N2716K8124
13062A62681k2553p141L6219l852J518P244N46l300L4043k5560l7936j2678j0313
$$ y = [88054, 90160, 119303, 127805, 165101, 194101, 210874, 214300, 169258, 109504, 75218, 94257, 85698, 91448, 120749, 141301, 192366, 195224, 179888, 163170, 158645, 177501, 228857, 241836, 228820, 191116, 161514, 157384, 122489, 118190, 146203, 131259, 106613, 110447, 110595, 102215, 124853, 167599, 177836, 147935, 140551, 131177, 139756, 147895, 150240, 174880, 181160, 191666, 205115, 195751, 170741, 220469, 251892, 247211, 229278, 206801, 200202, 196517, 190571, 141069, 111154, 102999, 93529, 64386, 69171, 63814, 53322, 42151, 56942, 33170, 14621, 22970, 17104, 9556, 309, 30098, 55098, 46881, 31321, 22258, 17220, 34356, 32285, 55229, 101051, 92943, 65873, 81841, 134557, 162681, 140128, 132987, 169206, 165354, 166872, 174116, 174662, 171362, 205405, 179845, 141909, 129231, 118918]
13049A18918J19m636q350J7699j2205j7407j3538J2006J2760O579j427J4411j415
13036A23514J69J888P08n804k538J8830K7762j254p606n998l0386J8754L2618
13023A70657J2438l8953j7937K4295j6608l8657j777J3970J5002L1138l135j818
13011A48615n986J1583J2834J9485N434j0040J5420J9169K8226L2729O306K1575
12999C05350j0684j1382k8952q484r676l1105J688K5992J4568L4354j1310k4704
12987B45655q700k195L149K3999J6995L3612L2698L6658N1746M0298M891K2965
12975E01771J3480l8056l9991J8054K0818k0484m3088K893j2331K236K3090O938
12963D35330k2291k0383K5235J5474J3593J0854M9854K5967L1694j8179r872p886
$$ y = [118918, 119037, 114401, 106051, 123750, 111545, 94138, 80600, 92606, 105366, 111945, 110518, 124929, 123514, 123683, 125571, 126279, 120475, 117937, 136767, 164529, 163275, 155669, 149671, 119285, 138039, 170657, 183095, 144142, 126205, 150500, 133892, 95235, 93458, 107428, 122430, 153568, 150433, 148615, 142629, 154212, 167046, 186531, 191965, 181925, 197345, 216514, 244740, 277469, 283775, 305350, 294666, 283284, 254332, 245848, 236172, 205067, 206755, 232747, 247315, 281669, 270359, 245655, 236955, 234760, 237909, 261908, 278903, 312515, 345213, 381871, 433617, 473915, 478806, 501771, 515251, 477195, 437204, 455258, 476076, 455592, 412504, 415397, 403066, 405302, 428392, 435330, 413039, 392656, 417891, 433365, 446958, 457812, 507666, 533633, 565327, 547148, 537276, 529390]
12951E29390J0291K5314M0995M6544M6446J5833j6033J4879K0025P326O6116L7016
12939H44142p937J5916K5281L7851K6463L2734K4023J5390O7089O7472k245O053
12927A152232L9685J9555O6686Q4071M5411M7515N3932Q3915J02873J06851R3988
12916A896714J23702J33849J76106J78365J97386J78660J68351J68979K00141
12907C422253K86708L53281L74820M21802M86016N97288P62126R42298J164379
12898H810971J409642J603904J760200J968825K307234K848309L591171M354045
12890B8654301N413389O987893R673462J4078363K0520225K7441847L0133950
12883A42903430K4478970J2380779L31780m508667j049592L356931J117988q705959
$$ y = [529390, 539681, 564995, 605990, 652534, 698980, 714813, 698780, 713659, 733684, 741010, 807126, 844142, 836205, 852121, 877402, 915253, 941716, 974450, 998473, 1013863, 1080952, 1148424, 1146179, 1152232, 1191917, 1211472, 1278158, 1362229, 1407640, 1455155, 1509087, 1593002, 1695875, 1802726, 1896714, 2020416, 2154265, 2330371, 2508736, 2706122, 2884782, 3053133, 3222112, 3422253, 3708961, 4062242, 4437062, 4858864, 5344880, 5942168, 6704294, 7646592, 8810971, 10220613, 11824517, 13584717, 15553542, 17860776, 20709085, 24300256, 28654301, 34067690, 41055583, 50729045, 64807408, 85327633, 112769480, 142903430, 167382400, 179763179, 180094959, 175586292, 174536700, 177893631, 179011619, 170305660]
12875A70305660k1149085k8827115k8742945k3624101j7112243j1577069p803845
12868C1469257n500010m094167l151737k465365j915840j565057j343518j272566
12860A0160997j234281j162235j034096q59506p42668o03638m83405l98490l92663
12851C250015l51146k55513k10136k34371k07715j35125j29007p6987q2443o3962
12841A503610p4182r8464j20137p5664m5540m5004n4695q6121p6182o6345k3976
12830G37300l6811n2697n8027l4469k8980n2557k4974k4204k6123n775j7006j4665
12818C61012k2618l4169n075M81J5830R137K61K8705k2211l3521j6159l2777K2096
12805B70992K9667q11l6059l4567k073J6397k736j6336j632k5663q038j3312n5699
$$ y = [170305660, 149156575, 120329460, 91586515, 67962414, 50850171, 39273102, 31469257, 25969247, 21875080, 18723343, 16257978, 14342138, 12777081, 11433563, 10160997, 8926716, 7764481, 6730385, 5870879, 5128211, 4524573, 4041168, 3642678, 3250015, 2898869, 2643356, 2433220, 2198849, 1991134, 1856009, 1727002, 1650015, 1567572, 1503610, 1429428, 1330964, 1210827, 1135163, 1089623, 1044619, 989924, 903803, 827621, 761276, 737300, 700489, 647792, 589765, 555296, 526316, 473759, 448785, 424581, 398458, 392683, 375677, 361012, 338394, 304225, 299150, 299631, 315461, 324598, 324859, 353564, 331353, 297832, 281673, 248896, 270992, 300659, 299848, 263789, 229222, 227149, 243546, 240810, 224474, 222842, 197179, 189141, 175829, 120130]
12792A20130J5767P3585O092m3415k1357m8106j3353k1258L4962M5261j0843k7670
12780A09795j7960K0364L5935m996J0692j7969J4488K1590L50Q720p262j8591
12768A55156j6753j7078Q183K6943N855k7358l0595M563J1173J3158m972k6674
12756A01601J7341J1348J6607K8902K2037L08J2278N3382K3354l0191l0077l400
12744B23490j35j9015N307j0225m584M16L551l3693l7824J4809j3271K3n131K1292
12730A45010J3821j2284j9180l391O076K4797K0953l1519o8849j5862J5339J7860
12718I2771J9325m150N929j4688p766N51j9789o561n3745l0710n961L304J7039
12705d451K4864o035k6O764j7730m663L095J5292J5642L965k7804K0207J0379
$$ y = [120130, 135897, 209482, 215574, 172159, 150802, 102696, 89343, 68085, 103047, 148308, 137465, 109795, 91835, 112199, 148134, 143138, 153830, 135861, 150349, 171939, 172289, 181009, 173747, 155156, 138403, 121325, 129508, 156451, 162306, 134948, 104353, 108916, 120089, 133247, 128275, 101601, 118942, 130290, 146897, 175799, 197836, 198144, 210422, 263804, 287158, 256967, 226890, 223490, 223355, 204340, 209647, 199422, 194838, 195254, 198805, 165112, 127288, 142097, 128826, 128849, 123718, 145010, 158831, 146547, 127367, 123976, 130052, 154849, 175802, 144283, 75434, 59572, 74911, 92771, 112096, 107946, 113875, 99187, 91421, 91972, 72183, 65622, 11877, -18833, -24794, -21490, -4451, 20413, 14378, 14352, 21116, 3386, -1277, 1818, 17110, 32752, 36717, 8913, 29120, 39499]
12692C9499L0285J3183J9837K7937k764l6572K1886k261l4726J8060K0409L0225
12680A44998J2351q726k9811N656j785m3029j2390k220j920k9420R58P852J26
12667D2640L8807k506l2293j3461j344j5811o639K4358J8993J6683k924K1336
12655H7839Q253K5725j049j9785L0698N8317L8898P1325O5784K3123K4147J5220
12643D28495J1738j4224l6716J3683m2561p0664o5056m0480n7236l6695l86J0903
12631A00801k0822l4940N772J4055j1888j6203k082J8015J5718o174Q176l1176
12619C9252n017L2323R472m7374k4371M42J7194n167K1246L301r067j1155Q630
12606B9709q623K429J669k3596j1067k224L2164L2946k0240n806Q556k3475l1778
$$ y = [39499, 69784, 82967, 102804, 130741, 127977, 91405, 113291, 111030, 76304, 94364, 114773, 144998, 157349, 148623, 118812, 124468, 122683, 79654, 67264, 65044, 63124, 33704, 34662, 42514, 42640, 81447, 78941, 46648, 33187, 31843, 16032, 9393, 33751, 52744, 69427, 66503, 87839, 96092, 121817, 120768, 100983, 131681, 189998, 228896, 300221, 366005, 389128, 413275, 428495, 440233, 426009, 389293, 402976, 360415, 289751, 224695, 184215, 126979, 90284, 89898, 100801, 79979, 45039, 50811, 64866, 52978, 36775, 34693, 52708, 68426, 62252, 70428, 39252, 34235, 66558, 76030, 28656, 4285, 4727, 21921, 16754, 38000, 41301, 32234, 21079, 29709, 21086, 23515, 25184, 1588, -9479, -11703, 20461, 53407, 33167, 27361, 35917, 12442, -19336]
12593a9336R134M370J0208R876K832r631J1793L2608o600l0965Q959k391o260
12580A4597rJ0586k1817J7528M0697j9829l2208m086J166p255k9081Q333L3092
12567A1714k1691J328R541M183K6124M249j6358J5441L59j7830j0505r590J750
12554a285r326Q434J7673p373J6040Q831j6918k204k8410o098n743J3342L8283
12541B5246J1576m034J5937k4706J4089k1142n843k1747r970K588j5034J2548
12529b0492p13j0676l647R609J7764J107k2956J2044J5305R440J4569j6727k2443
12516a7816K3411M1964L0258j7533k04L5462K5479j6858K3192J7982P606J689
12504A54632K3577K8328j4687j5701j0215K8192n986j7929k9083j9790n2348o8615
$$ y = [-19336, -10202, -5832, 4376, 14252, 17084, 7453, 19246, 51854, 45254, 14289, 23248, 20857, 14597, 14588, 25174, 3357, 20885, 61582, 41753, 9545, 5459, 6625, -630, -29711, -21378, 11714, -9977, -8649, 892, 5075, 31199, 35448, 19090, 34531, 34890, 17060, 6555, -3035, -1285, -10611, -2177, 15496, 8123, 24163, 32994, 16076, 13872, -14538, -20636, -26379, -13037, 25246, 36822, 32788, 48725, 24019, 38108, 16966, 11123, -10624, -20594, -18006, -33040, -20492, -21205, -31881, -35528, -25919, -8155, -7048, -30004, -17960, -2655, 6785, 21354, 4627, -17816, 5595, 47559, 77817, 60284, 60080, 95542, 121021, 104163, 127355, 145337, 152943, 154632, 178209, 206537, 191850, 176149, 165934, 194126, 188140, 170211, 141128, 121338, 68990, 375]
12492C75j7135L693K7909M377M984L247j28j6222j474R937o940q000n558m010
12478d945K043j9441K5357K5220J1215m417J6732J4493J8303j3086l0849j4541
12466B6084L1814R078j34r722L604J4869L9429L7770j8024j5676M1625O8940O2640
12453B92297O8571J36080J50314J42751R3869K9592m470J5298K4019J9905l6475
12442I31751j09429j28620j49968j31327q2454o4782m1691l9321l4858k2044n007
12431A22250K5439m0585l1773J0438p82l0870j9549J7155l28k7675k5387k6238
12419b7905j1140k5007j0686O879L0649J8759K8596R881O604m160R085J5389O071
12406E3015K1296p919k0905j1795m3691m9959J1930p462J3121Q118j5141j1979
$$ y = [375, -16760, -13067, 14842, 19219, 24203, 27450, 27322, 11100, 9626, 19563, 12623, 4623, -935, -4945, -2902, -22343, 3014, 28234, 39449, 35032, 51764, 66257, 84560, 71474, 40625, 26084, 57898, 66976, 66842, 57120, 60724, 75593, 115022, 152792, 134768, 119092, 160717, 229657, 292297, 360868, 496948, 647262, 790013, 883882, 913474, 909004, 924302, 948321, 968226, 931751, 822322, 693702, 543734, 412407, 329953, 265171, 223480, 184159, 149301, 127257, 122250, 147689, 107104, 75331, 85769, 84987, 54117, 34568, 51723, 51395, 23720, -1667, -27905, -39045, -64052, -74738, -67859, -37210, -18451, 10145, 20026, 26630, 22470, 31555, 46944, 53015, 74311, 66392, 45487, 33692, -9999, -59958, -48028, -55490, -42369, -34251, -49392, -61371]
12394f1371K2544J7025K1911j4836J1840K7601J8983n588k3884k1483j0256O765
12382a0749J1003j0488L8874M3977Q305Q677j2704J8264p39j9633n316j2866j4795
12369D1810k686j9354j9053J5077N747k6240J0980J2365j2189p91J0809j3076
12357C399n1276k6574K8362K0144J9827J103j8128O692J4098J2176Q68K215K7026
12344C9932N946k1076o402K9562p070o165j066p458J7930j5891q224j845k149
12331A6024k9655J0610L7845M791P957J0333m932j1716k7748J6949m27J8169J5828
12318F4028k0406j7150O849j7907q002j6487k123M93J7808j2665m686l8982k1976
12305g1206p53K6515K8887J0887j8988j5712L5066j0277K0623j8750l1218q500
$$ y = [-61371, -38827, -21802, 109, -14727, -2887, 24714, 43697, 38109, 14225, -7258, -17514, -10749, 254, -10234, 28640, 72617, 80922, 89599, 76895, 95159, 94420, 74787, 69471, 56605, 41810, 39124, 19770, 717, 15794, 21541, -4699, 6281, 18646, 6457, 5666, 16475, 3399, -47877, -74451, -46089, -25945, -6118, -5015, -23143, -16451, -2353, 9823, 10691, 12906, 39932, 45878, 24802, 18400, 47962, 40892, 34727, 33661, 26203, 44133, 28242, 20018, 18173, 16024, -13631, -3021, 34824, 39615, 47572, 57905, 52973, 41257, 13509, 30458, 30031, 48200, 64028, 43622, 26472, 33321, 15414, 7412, -9075, -11198, -10705, 7103, -5562, -10248, -49230, -71206, -71959, -45444, -16557, -5670, -24658, -40370, -5304, -15581, 5042, -13708, -44926, -53426]
12293e3426M813M618M596J5082m295Q761J6369J3780M387j476R341L554k6000
12280A04q493J0636p809K8578l383J4505j1820j4793m234k2232q542j7148J7706
12267b6925j198j3281J9734K2788m529M0473m743j687k077m5520o120O983K1267
12254E165m358q521J8275M1800J0528n2912k8263J2292j2268k4828p630K7869
12242b2851p34K3025j1483k1260J2954J2783L10J36J4037L5651j1324k8318j1606
12229h680Q819J6191O29RJ4369K2511O664k0895j8432k8990j9672J2079j8617
12216c4015K8092L745N755P392j4578j548M027p006O667j4236R777K6752L0378
12203E1202o392n626j201P458j7405j610j2063j6228j298L7873J0211m9935k1328
$$ y = [-53426, -48613, -43995, -39399, -24317, -28612, -19851, -3482, 10298, 14685, 13209, 22550, 26104, 104, -8389, 2247, -5562, 23016, 19633, 34138, 22318, 7525, 3291, -18941, -27483, -44631, -26925, -28123, -41404, -21670, 1118, -3411, 37062, 32319, 30632, 28555, -16965, -23085, -16102, 5165, 807, -7714, 10561, 52361, 62889, 9977, -18286, -5994, -18262, -43090, -50720, -22851, -23585, -560, -12043, -33303, -20349, -7566, -7256, -7120, 6917, 42568, 31244, 2926, -8680, 139, 16330, 16959, 16968, 31337, 53848, 60512, 39617, 21185, -7805, -27477, -15398, -34015, -5923, -2178, 3577, 10969, -3609, -5157, -1130, -8136, -1469, -15705, -5928, 20824, 51202, 44810, 39184, 37983, 45441, 28036, 26426, 14363, -1865, -3163, 34710, 44921, -5014, -26342]
12190b6342L9980J5392j5341o719q955o193N618J6878K3169j1416j1216r596J773
12177G032N520J5071j429q260j2969j996N125j483m2681j2753K2363K5067L6771
12164C5378j5420k7333K1594K2373j0621j844j2659Q972j2010L735K5648m69m20
12151C6924j5541j9855K7J5931j7486O873J971N255K308k2328j0630j4324J8483
12138a2392J934K6776K1924J3212l783J9973J496k7860j8573O108j2705K3801
12126C9911n31j3949J802O34l241l5840k775K5781K1380j0563j2061k675K612
12113A0485J5116O231o974R469l094r376m008J733J1451N047J8164j8426k0166
12100A5652j0507j2186J3138K232p982M540n859k7689J1839K1205M0844K4713
$$ y = [-26342, 13638, 29030, 13689, 6970, -1985, -8178, -2560, 14318, 37487, 26071, 14855, 5259, 7032, 12552, 27623, 26194, 17934, 4965, 2969, 8094, 6611, -36070, -48823, -26460, -1393, 35378, 19958, -7375, 14219, 36592, 25971, 24127, 11468, 20440, 8430, 12165, 37813, 37344, 36924, 21383, 1528, 1555, 17486, 0, 6873, 8844, 14099, 16407, -5921, -16551, -30875, -12392, -10458, 16318, 38242, 51454, 47671, 67644, 69140, 41280, 22707, 28815, 16110, 39911, 39380, 25431, 27233, 27867, 24626, -11214, -13989, 11792, 33172, 22609, 10548, 7873, 10485, 25601, 31832, 24858, 34327, 31233, 21857, 17849, 19582, 31033, 36080, 54244, 35818, 15652, 5145, -7041, 6097, 8329, 347, 4887, -972, -28661, -16822, 4383, 45227, 69940]
12088F9940j853m7973m6725j1674J8004N964J6915K7938O660K81k7644Q659p70
12075A7722j5076J7685J3159O460k5447r990l587k2371k0580N280K3194L06q956
12062b2201p04J6990K350m2220k837K6245R219r437l5069K4806K5901n53O242
12049a268Q111j2995j2584k3163k6145N37K5362J3548J6922L916l278j8072k0645
12036d9754R730o213K3875M3100J1257r611J393J7883J3047l7422l8196j6595
12024c7506P223J0299K5638J2084j6784j5067l66K737J55J8528J7148j504k4327
12011a742k1750p423K1062L1477q23M739kP462l3259k772J4508o691J977K502
11997I265k9123l1763J1579P869K5864M686j3387j4057K1683M5278L0101J8549
$$ y = [69940, 68087, 20114, -26611, -38285, -20281, -14317, 2598, 30536, 37196, 37477, 9833, 18492, 17722, 2646, 20331, 33490, 39950, 14503, 4513, 926, -21445, -42025, -36745, -13551, -13245, -22201, -22905, -5915, -3565, -45785, -48622, -22377, -13158, -22595, -57664, -32858, -6957, -7510, -1268, 6843, -6152, -18736, -41899, -68044, -67507, -42145, -28597, -11675, -7759, -11037, -29109, -49754, -40024, -46237, -22362, 20738, 31995, 22384, 23777, 41660, 54707, 17285, -20911, -37506, -30283, -19984, 5654, 17738, 954, -14113, -14479, -11742, -11587, 6941, 24089, 22585, -1742, -23492, -30915, -9853, 21624, 20801, 25540, 25538, 33000, -259, -3031, 11477, 4786, 6763, 9265, -19858, -51621, -40042, -32173, -6309, -1623, -15010, -29067, -7384, 37894, 67995, 86544]
11985H6544j2605j9398r434j5198n542m231k164J69j4100j4266r540L8605K8684
11972D7524R51q097r015k3445n785M051M243q157m802k2357l4353r549K7157J5743
11958b5891K849R776L2260l3517m15M1354n970l080j1929m54Q7K89j358j4359
11944a0358l22R720j6709k3324K7034M6701L1810J3472m3189k7450P806nj6768
11931a582j1036j6353N221M3958K6192k306k1296j2140n639j1345O890J9896J9229
11918C9689j6909J3893J7705n435M185j4389j5843J4326j8439l075j0952k252
11906B504n10R884k3598k3808k0073L9602J1665J1486J9493L259L668k0226j0741
11893B605l085n091j7224L978m957o824k4969J5147Q312P152p260J1094J9212
$$ y = [86544, 73939, 54541, 45107, 29909, 24367, 20136, 17972, 18141, 4041, -10225, -19765, 18840, 47524, 48475, 40378, 31363, 7918, 2133, 6184, 10427, 2270, -2532, -24889, -59242, -68791, -41634, -25891, -23042, -13266, 18994, -14523, -14938, 26416, 20446, 17366, 5437, 4983, 5070, 5359, 4001, -10358, -10680, -960, -17669, -40993, -13959, 32742, 64552, 78024, 34835, 7385, 15191, 15186, -1582, -12618, -28971, -23750, 20208, 46400, 44094, 22798, 10658, 5019, -6326, 564, 20460, 39689, 22780, 36673, 54378, 48943, 53128, 38739, 22896, 37222, 18783, 15708, 4756, 2504, 1994, 11878, -11720, -35528, -55601, -15999, -4334, 7152, 26645, 29904, 33572, 13346, 2605, -480, -5571, -22795, -18817, -23774, -30598, -55567, -40420, -32108, -24956, -32216, -21122, -1910]
11880a910J1475k184m402j0451J0299J3526q615q06J9402P93j6436J092J0602
11867B2385q748k2261Q223K3016k536J6820L82j5773M562o448J569K0602L7847
11854G9640K5354j1514k4735k9370m0323J0762o759j0868p894k961M285p052R197
11841a2238m890o123O764J4222n490J4459P909k4538O331R08j961j3100j0904
11828b8651J6629K3647K4729j1912p638J2937l186J0925k5953r60P330Q75p919
11815A0853j7797K7637l5728j0120l105j0436K8374K6813O276p86L047L3067j1126
11802D6969k6580m465k6263q951J6130K612l0425Q135L931M989j628M361R36o89
11788a0938J59o990K7161M181m4419k5413K2529K560k759M0422J4344K321J0142
$$ y = [-1910, 9565, 7381, 2979, -7472, 2827, 16353, 7738, 6932, 26334, 27127, 10691, 11783, 22385, 13637, -8624, -401, 22615, 20079, 36899, 37281, 21508, 26070, 19622, 21191, 41793, 79640, 104994, 93480, 68745, 39375, -948, 9814, 3055, -7813, -15707, -18668, -14383, -21435, -12238, -17128, -23251, -16487, -2265, -7755, 6704, 14613, -9925, -3594, -2686, -4647, -17747, -28651, -12022, 11625, 36354, 24442, 16804, 29741, 26555, 37480, 11527, 10567, 17897, 18772, 10853, -6944, 20693, -15035, -25155, -28260, -38696, -10322, 16491, 22767, 21981, 25028, 58095, 46969, 20389, 15924, -10339, -19290, -3160, -548, -30973, -22838, -18907, -13918, -15546, -11185, -10249, -10938, -10779, -17769, 9392, 13573, -30846, -56259, -33730, -31170, -33929, 6493, 20837, 23158, 33300]
11775C3300p882O433K7314l7874l6024r278J4449j2545R057r238r055J6635L3537
11762A8829J0359L6465n879n4663l710p966J14L391Q444J7285k5709j0801R11
11749a2930J7843Q983K9M876o630P098j8574j9013J1140o005r781j4756J8761
11736a8959M169J5176O958r952K951Q491K074K904K5679j1712k0678K9850K9499
11723F6450K3659j8989l0899J509K309K0551k0084k2212j0189J6928m424J5940
11711D0549L539o519K697M996K7375J6216j807m4074l8188m3409l7442j9705L5102
11698f0670P5348J1308j6503j3619l30j3384Q636K2484j3206j923O142N54p233
11685b396j4260J1272J6253J1326L0018M096q849j3616p286k008l1660k259K56
$$ y = [33300, 25418, 31851, 59165, 21291, -14733, -24011, -9562, -22107, -13050, -22288, -31343, -14708, 18829, 29188, 65653, 59774, 5111, 1401, -6565, -6451, -3060, 5384, 22669, -3040, -13841, -12930, 4913, 13896, 13925, 18801, 12171, 19269, 695, -18318, -7178, -13183, -22964, -37720, -18959, -14790, 386, 7344, -2608, 343, 8834, 10908, 13812, 39491, 27779, 7101, 36951, 66450, 90109, 71120, 40221, 41730, 44039, 64590, 44506, 22294, 12105, 29033, 24609, 40549, 44088, 37569, 40266, 45262, 72637, 88853, 87046, 42972, 4784, -38625, -76067, -95772, -60670, 14678, 25986, 9483, -4136, -4466, -17850, -9214, 13270, 64, -1859, 4283, 4837, -2396, -16656, -5384, 10869, 22195, 52213, 56309, 47460, 33844, 26558, 24550, -7110, -9369, -9113]
11672i113k0709J5844Q756o557K4784P709j7580k1882L432J4676j5078n829J2785
11659h762r172o419q892K0721R572p1J2440L3938j0973j3862k3874K1966j2367
11646D245l2045K4687K1037J9003j768Q390K4637j6057o270j8401m5497j584k642
11633b2265J8956M4093k636k8754r357J8422J0248l130r132l343j7474J5453K867
11620A3948J917l1770k918J1958N58P066L5432J2219m621k6882J6154K6683j9551
11607D0193n259j4009k6996j2731R989J4376K9353L423n343j0816J2621j6617
11595A8184j5914K1851k0855l5841j9816k4992M0962K4500m483Q819M187L1717
11583B8319M520L692k1461J2933O389l651o078J3884P889K027R011m4649k56J4001
$$ y = [-9113, -29822, -13978, -5222, -11779, 13005, 20714, 3134, -18748, -15316, -640, -15718, -21547, -8762, -17934, -24353, -33245, -12524, -2952, -3023, 9417, 43355, 32382, 18520, -5354, 16612, 4245, -27800, -3113, 17924, 36927, 35159, 43549, 68186, 52129, 45859, 27458, -18039, -19623, -22265, -3309, 40784, 38148, 9394, 37, 18459, 28707, 25577, 16445, 13102, -4372, 11081, 13948, 15865, -15905, -18823, -6865, -6307, 759, 36191, 48410, 43789, 16907, 33061, 59744, 40193, 34934, 20925, -6071, -18802, -8813, 5563, 34916, 38339, 32996, 22180, 34801, 18184, 2270, 24121, 3266, -32575, -52391, -77383, -36421, -11921, -16404, -7585, -3398, 28319, 32839, 36531, 15070, 28003, 34392, 30741, 24663, 38547, 46436, 48463, 57474, 12825, 12569, 26570]
11569B6570O618R858L097r363j9827k4166k0816J8220K5086m914j3228r915k0552
11556c3332K4080K5014j1311l2960p060M307J8040K052k8106K3398K2990r158
11544b046J456J7311k2216k7520K2363K0496j3220K66K8620K8361q110lJ0258
11531E6016j0310N258j410p172J8015R532L430l5259j4289k0200J58L2623l745
11518C2647k8567o524m698j3417J8792j7488R015J9786Q764p831m178M586k3279
11505a2392J5452K8963J1248M038J1183q783K16j6770j7262J8474j2706o286p209
11492H166m274j1035o012N062k3657J8940K6593K1180L52J9963J7327k1354q719
11479D2532j9973m0972N043L9364J009L7999J7201j1529k1428k76j5808p388P063
$$ y = [26570, 33188, 43046, 46143, 36780, 16953, -7213, -28029, -9809, 15277, 10363, -2865, -12780, -33332, -9252, 15762, 4451, -28509, -35569, -31262, -13222, -11170, -39276, -15878, 7112, -2046, -590, 16721, -5495, -33015, -10652, 9844, -3376, -3110, 25510, 53871, 45761, 45758, 56016, 45706, 50964, 49554, 42382, 60397, 69929, 73359, 38100, 23811, 3611, 3769, 36392, 32647, 4080, -2444, -7142, -20559, -1767, -19255, -10240, 9546, 18310, 10479, 6301, 10887, -12392, 3060, 32023, 43271, 47309, 58492, 49709, 49925, 33155, 15893, 34367, 21661, 15375, 8166, 3892, -7143, -13155, -8093, -31750, -12810, 13783, 34963, 35315, 55278, 72605, 51251, 42532, 22559, -18413, -13370, 25994, 27003, 65002, 82203, 70674, 49246, 48970, 33162, 25774, 32837]
11466C2837R414j6228K7244J6266o455q532l916j4065k2771k2152K4439P821L1847
11453E5749M646l9466k9761R219K8051J1646q523j4089j1107m603r607O606j4551
11440a5790j4990j0476r466K0556L4147M386J3288J7688J0226l7256p784M391
11428H920K8361r608l882J2708K4625r88r030L588N510j7681o110J2016j0820
11415C7609j6191J4266K5392r80N555j5225k0565O95J407j8751K1605J9031J2098
11402F5946j9004j1903K240r356L029k428J3974K3046J55j3265j3888j9870J1343
11389C0019p207o814q125k3464k941N021P794j579p624K57r005K7105J6928J4872
11375C5237J4284K5597O378k6489k3199O960P944m229J392K50r919o528L0919
$$ y = [32837, 42251, 26023, 53267, 69533, 63078, 54546, 50630, 36565, 13794, -8358, 16081, 23902, 55749, 60395, 20929, -8832, 387, 28438, 40084, 31561, 17472, 6365, 1762, -7845, -1239, -15790, -30780, -41256, -50722, -30166, 3981, 8367, 21655, 39343, 49569, 12313, 4529, 8920, 37281, 27673, 23791, 36499, 61124, 60136, 51106, 54694, 60204, 42523, 36413, 48429, 37609, 21418, 35684, 61076, 60096, 65651, 50426, 29861, 30556, 31963, 13212, 34817, 53848, 65946, 46942, 35039, 37279, 27923, 30952, 28524, 42498, 65544, 65699, 52434, 38546, 18676, 30019, 22812, 15998, 7873, -15591, -18532, -13511, -5717, -7296, -14920, -14663, -23668, 3437, 20365, 35237, 49521, 75118, 81496, 55007, 31808, 38768, 46712, 42483, 43875, 44125, 34206, 27678, 58597]
11362E8597J0788Q532R921j2217L247j9028Q41K382k7059O590J8137p841j7731
11349C5159M219L851Q983J2942J581j3124j3399l048j3042Q431L6431l118l3006
11336C2860J342Q923M20j0567l18J4079M224O311j0038j1942j6605n527J247K611
11322A7020J3394m661j1640j115K9972j0388j5915L693J49J2900l411j590O812
11309C5220j4539J6411p904n465P049j9949j5189K4240K1917r432k4789J1569
11297A9139j1419j0276J1979K6235K0632j2209l0309j4058p176j9124j5619L1306
11285a0899K2464j5366j0549J5461J3730K264L6301n596l1645P252R260k5491
11273G186j802R605m3783j6621N024J4186P949J1833j0497J7498L4737q385m614
$$ y = [58597, 69385, 77917, 87838, 75621, 78868, 59840, 60681, 63063, 36004, 42594, 60731, 52890, 35159, 39378, 43229, 52212, 65154, 66735, 53611, 40212, 37164, 24122, 32553, 68984, 65866, 32860, 34202, 43125, 43545, 32978, 32660, 46739, 50963, 57274, 47236, 35294, 18689, 13162, 14409, 17020, 30414, 25753, 14113, 12998, 42970, 32582, 16667, 20360, 20509, 33409, 29998, 28408, 35220, 20681, 37092, 29188, 23723, 30772, 10823, -4366, 19874, 41791, 32359, 7570, 19139, 7720, -2556, 9423, 35658, 56290, 44081, 13772, -286, -7462, -26586, -42205, -10899, 11565, -3801, -14350, 1111, 14841, 17105, 53406, 47810, 16165, 23417, 32677, 7186, 5384, 14989, -28794, -45415, -40391, -26205, -18256, -6423, -16920, 578, 35315, 26930, 22316]
11260B2316L2785J6289k2090j8814M168o395n776j920J3630N744r144j4806p495
11247H492J884j3070L1559L1597J404J3309k2815k2997J56K4145Q866J2477k0353
11234E4654k7133r820l5830j5553L9651L1215J5113j2038j6189j3224K4879r786
11222B5939j5762j1654J9136K3100j6562K658k0636j4803L0899J1571j1968J4985
11210C6903l1050j2932J2279J8250p909l781K6768O926k9664K7086r075j4002
11198A9799o557J3156J2723J8551K2459K239j0036l8842l3592j7475j8594N873
11186c0296K5713J2163m492j0814J0549R410K710r461O84J9202J1314L2722P552
11173G6956l5957j1635K0931P164m812k3144Q795K2123j4772l7377J123K1859
$$ y = [22316, 55101, 71390, 49300, 30486, 34654, 28259, 22483, 20563, 34193, 39937, 30793, 15987, 8492, 10376, -2694, 28865, 60462, 61866, 75175, 52360, 29363, 29519, 53664, 62530, 75007, 54654, 27521, 17701, -18129, -33682, 5969, 37184, 52297, 40259, 24070, 10846, 35725, 25939, 10177, -1477, 17659, 40759, 24197, 26855, 6219, -8584, 22315, 33886, 21918, 36903, 5853, -7079, 5200, 23450, 15541, 11760, 38528, 45454, 15790, 42876, 33801, 19799, 13242, 26398, 39121, 57672, 80131, 82370, 72334, 33492, -100, -17575, -36169, -30296, -4583, 7580, 3088, -7726, 2823, 12233, 14943, 5482, 6166, 25368, 36682, 69404, 76956, 40999, 29364, 50295, 57459, 52647, 29503, 38298, 60421, 45649, 8272, 9395, 31254]
11161C1254J7051K8755J8679j1123k1518K5428J7387L362n111J202j9221r605
11149G6540k5775P189K7932j2146j4431P418l717j6430J207l838N13J0700q181
11136D6981j7692j5496K3417J1404J6942L0730J4695n304k1601j9504K5711L9827
11124A30110k4147k1696k493J0601j0414j3504k975m305l1654j2065J8918k214
11112C4162J8565K661m1163q174J0859N5o443J6367j143n63K3139k317k8296j2584
11098E125K4389J1684l410r971j6241J729J0444j261N083K7417M201j489R254
11085F6954N084j1382p989J3589r596J8897L2480N76P679R895j405j9610j7128
11072H8044j6712j4943p731L1925k3450k6175J9260J8633k3798R347J2383P404
$$ y = [31254, 48305, 77060, 95739, 84616, 63098, 88526, 105913, 109275, 104164, 105366, 86145, 76540, 50765, 57954, 85886, 73740, 59309, 66727, 63010, 46580, 47787, 43949, 44462, 55162, 46981, 29289, 13793, 37210, 48614, 65556, 96286, 110981, 105677, 84076, 64572, 90283, 130110, 105963, 84267, 81774, 92375, 81961, 68457, 65482, 61177, 29523, 17458, 36376, 34162, 52727, 55388, 14225, 6051, 16910, 16965, 10522, 26889, 25746, 25183, 48322, 46005, 17709, 5125, 29514, 41198, 37788, 27817, 11576, 13305, 23749, 22488, 27571, 54988, 59189, 57700, 66954, 72038, 60656, 52667, 66256, 56660, 75557, 108037, 108613, 116292, 126187, 124782, 105172, 88044, 71332, 56389, 48658, 80583, 57133, 30958, 50218, 68851, 45053, 54400, 66783, 74187]
11060G4187J4981J5499K3867j2240k7580J284M0028J8261J5497J2415l6904k0622
11048A18673n269r904R973n308l2503k113k990J2470j9254l9730q108P5339L2664
11035A23940j9388j1333J232N670l3353k8553K5292L1655j8761K974J6001K0204
11023A15580K0359J4401K4231J3667L6263Q79k0062m8969q292K2501J6950k3193
11011A64315j3834J1125K9319J9589M558m569J5217L3774O0024N7316O2613J12371
10999E51818J64323K45313L36369M96197N41075K97404j72312m43502n01324m06673
10989A108688k97454j76082q5677r3020n6484k8503n0199p3627k8843r859J206
10978B10146l2958l0697K1219j3940k2203P37L2190r832k3555R863K6196j0913
$$ y = [74187, 89168, 104667, 128534, 116294, 88714, 89998, 130026, 148287, 163784, 176199, 139295, 118673, 113404, 103500, 113473, 108165, 75662, 73549, 70559, 83029, 63775, 24045, 15937, 91276, 123940, 104552, 93219, 94451, 100121, 66768, 38215, 63507, 95162, 76401, 79375, 95376, 115580, 135939, 150340, 174571, 188238, 224501, 225380, 205318, 156349, 148057, 170558, 187508, 164315, 150481, 161606, 190925, 210514, 215072, 210503, 225720, 259494, 319518, 376834, 439447, 551818, 716141, 961454, 1297823, 1794020, 2335095, 2632499, 2460187, 2016685, 1515361, 1108688, 811234, 635152, 549475, 456455, 399971, 371468, 321269, 247642, 218799, 208940, 210146, 177188, 146491, 167710, 153770, 131567, 132304, 164494, 154662, 131107, 140970, 167166, 156253]
10966A56253R592P116k4053j1018j5260j2688K3206L3327J3793j0053q596l7156
10954A24463j9968j3843j1607J1993J8005L2152J0621j3789m200j524j6217L493
10942A19579j4709j7502p761j0618N5579l510k3429L815P429K5470J5802J8065
10930A68210J8243l4194m0429j5960n810J5884J6402R160N135j560R651J1082
10918A55814j3384j7648k0905j8351J4850K1855j0558j102J7194l376L073J2187
10906A39649l4557m5968k1794L9999N457o710J0256n702N116J0164L9711J4738
10894A50359k1204N18q21j1618L433j476j0430j4590k7875j9716K5710R342J8064
10881I9696p644n714J7465J2301k3796k5632m78R048J4875J8974J4576j1251m908
$$ y = [156253, 165845, 172961, 148908, 137890, 122630, 109942, 133148, 166475, 180268, 170215, 161619, 124463, 104495, 90652, 79045, 91038, 109043, 141195, 151816, 138027, 133827, 132303, 116086, 119579, 104870, 87368, 79607, 68989, 124568, 121058, 97629, 101444, 108873, 134343, 150145, 168210, 186453, 152259, 111830, 95870, 90060, 105944, 122346, 131506, 136641, 135081, 144732, 155814, 142430, 124782, 103877, 85526, 100376, 122231, 111673, 110571, 127765, 124389, 127462, 139649, 105092, 59124, 37330, 77329, 82786, 76076, 86332, 80630, 85746, 95910, 135621, 150359, 129155, 129673, 128852, 117234, 120667, 119191, 108761, 94171, 66296, 46580, 72290, 81632, 99696, 92052, 86338, 103803, 116104, 92308, 66676, 66198, 75246, 90121, 109095, 123671, 112420, 107512]
10868A07512j582J274j6904k0893Q058K2212N096P878J8413J8186k1995k8263
10856I8992m114q061k4216J3610N0507j4035j3878K4594J0276J7590J2887M908
10844A69060L0674J9622k8429j5000L1664j3595q576J9887J664k1097j1505o674
10832A67695J1739L1927M2159Q9029N5169J9043J6583k1722m7919m2128l7001
10821B84574k1722k1993J4378o709k8537k0909j2203K0439K1932Q296J1057k9273
10809B19330q134L9595N213q982K4844j8394L185j2145r748J7258j3437J0133
10797B48718P968m619J9653K058M547j5704k0988p233q304J224m674J5717j5760
10784B22603j4298j6328p309k1907k2659j9419l1449l9291j8727l7089j8488r028
$$ y = [107512, 105930, 107204, 90300, 69407, 77465, 99677, 104773, 112651, 131064, 149250, 127255, 98992, 94878, 86817, 62601, 76211, 126718, 112683, 98805, 123399, 133675, 151265, 164152, 169060, 199734, 219356, 190927, 175927, 207591, 193996, 185420, 205307, 206971, 185874, 174369, 167695, 179434, 211361, 253520, 342549, 397718, 416761, 433344, 411622, 363703, 321575, 284574, 262852, 240859, 255237, 248528, 219991, 199082, 186879, 207318, 229250, 237546, 248603, 219330, 211196, 250791, 256004, 247022, 271866, 253472, 256657, 244512, 234764, 252022, 238585, 248718, 256686, 252067, 271720, 273778, 278325, 262621, 241633, 234400, 226096, 227320, 222646, 238363, 222603, 208305, 191977, 184668, 162761, 140102, 120683, 89234, 49943, 31216, -5873, -24361, -33389]
10772c3389J81j4531m703J0437M7717M4069M5917M1790J5251L80K1903K2638J7174
10759B14834Q500l277J6095J029K1256K0200L5384L2302j1212k873k1017l3758
10747B77463j2142J2999j9847j6060P47j1481K685j842k1553l6311J970L1910
10735B08538O516K0211J6689k308K3726K6570k8677j5190j2391q937n296p801
10723B21650k6011l449J4232K004M002O149Q143J9007K3049J8072k890j5279K622
10710B71301k0443K100k1784j2481m58L60n136j2175L4014O2689N1751M8624M9715
10697D48077J1775L110L479J237l7339L501K0343j1211k5042J1550K1157J6681
10685D67318j6172j1306J2767n709p448j3802j0418J1444M4013N8490O0782L5682
$$ y = [-33389, -33208, -47739, -52442, -42005, 5712, 49781, 95698, 137488, 152739, 153119, 175022, 197660, 214834, 223334, 220057, 236152, 237181, 258437, 278637, 314021, 346323, 335111, 332238, 311221, 277463, 265321, 278320, 258473, 242413, 243160, 231679, 234364, 232522, 210969, 174658, 176628, 208538, 215054, 235265, 251954, 249646, 273372, 299942, 271265, 256075, 243684, 234747, 229451, 221650, 195639, 192190, 206422, 208426, 212428, 218577, 226720, 245727, 268776, 286848, 283958, 268679, 271301, 250858, 252958, 231174, 218693, 218235, 218595, 213459, 201284, 235298, 297987, 349738, 398362, 448077, 459852, 462962, 466441, 467678, 430339, 433840, 454183, 442972, 417930, 429480, 450637, 467318, 451146, 439840, 452607, 446898, 439450, 425648, 415230, 426674, 470687, 529177, 589959, 625641]
10673F25641L9943P713J9329N789P410K531p353l6266M368q097K3173J8618j9724
10660F83075L098O69L2041L4634J5307k2703j7444L4822M0140J9485k4262L0959
10648H29821K6056L2795L5940L0414J8109N5228M9707P5599O5420K7656N8840
10637A305585L0784p945R221L6077O6408L3009J2048L1803L1736N139K9343N8855
10625A642063Q5920R4893M9067K0861J1045M4938Q0275N5311P8150O7131R2108
10614B321762J04168J42099J89117K01340K05489K47239K32258K31588K33405
10605D108465L23723L61511L47543L11764K84704L31027M39961N96771P86113
10596G891582R74624J255109J558042J704288J502855J276200J425373J889223
$$ y = [625641, 665584, 673297, 692626, 698415, 705825, 708356, 701003, 664737, 669105, 661008, 684181, 702799, 683075, 686173, 686842, 718883, 753517, 768824, 746121, 728677, 763499, 803639, 823124, 798862, 829821, 855877, 888672, 924612, 955026, 973135, 1028363, 1078070, 1153669, 1219089, 1246745, 1305585, 1336369, 1328424, 1337645, 1373722, 1440130, 1473139, 1485187, 1516990, 1548726, 1553865, 1583208, 1642063, 1727983, 1822876, 1871943, 1892804, 1903849, 1948787, 2029062, 2084373, 2162523, 2229654, 2321762, 2425930, 2568029, 2757146, 2958486, 3163975, 3411214, 3643472, 3875060, 4108465, 4432188, 4793699, 5141242, 5453006, 5737710, 6068737, 6508698, 7105469, 7891582, 8866206, 10121315, 11679357, 13383645, 14886500, 16162700, 17588073, 19477296]
10588A9477296K658343L566857M757886O233742P919502R693207J1583505J4150857
10580H0041195J9004313K8293830M4713387P1753516J05367577J10357218M0349988
10573D99881024n3599332r7678258j00002667p7666857n0846448l1924444k0828778
10566F7334240j4367494j0377713p679419n778915m451400l487926k673442k021492
10558A6496439j507972j066170q69058r91523j207367j290249j226270j066211
10550G271619q95916p44450o47683o03329n02490l68114k76472k30995k27562
10541B774608j95382j85683j39677p5762n1065j9455o9848j07655j45394j34843
10531A649844j01976j17946j42343j18097j05156r1812p4347o0095j1901k1729
$$ y = [19477296, 22135639, 25702496, 30460382, 36694124, 44613626, 54306833, 65890338, 80041195, 99045508, 127339338, 172052725, 243806241, 349173818, 459531036, 499881024, 446281692, 348603434, 248600767, 170933910, 120087462, 88163018, 67334240, 52966746, 42589033, 34909614, 29130699, 24679299, 21191373, 18517931, 16496439, 14988467, 13922297, 13053239, 12061716, 10854349, 9564100, 8337830, 7271619, 6375703, 5631253, 4983570, 4380241, 3877751, 3509637, 3233165, 3002170, 2774608, 2579226, 2393543, 2253866, 2178104, 2127039, 2107584, 2037736, 1930081, 1784687, 1649844, 1547868, 1429922, 1287579, 1169482, 1064326, 972514, 898167, 838072, 826171, 804442]
10521H04442l9654n9794j7124m2491o1170l2922j8730N172M159r325j4844M5876
10509E63595O4445J8643m234j3064m1020k7990l0765n2632m4936j4609k5960k0554
10497C70919K167K5833J5545k4730k3460k5762J1886n427m6451k4646M373r315
10485B70932k5147n6654o0270o852K6469M117r777k0504n2245j7196J5222L5317
10473A03412N4457N0174L4829J5442j227j3905k527Q998L2881J5629m6047l6443
10461B15673l595N364l101Q42m304j6128l5469J7545j4685j7283r333J384Q3005
10448B19915O2361K0788K378j6008m424r102j4921J6378k420k8065j4435n339
10436B27106q203K364j8536J966J1700L924j2787j1210p975j2922k5141L933J871
$$ y = [804442, 764788, 704994, 687870, 645379, 584209, 551287, 532557, 537729, 541888, 532563, 517719, 563595, 628040, 646683, 642449, 629385, 588365, 560375, 529610, 476978, 432042, 417433, 391473, 370919, 373086, 398919, 414464, 389734, 366274, 340512, 352398, 346971, 300520, 275874, 280247, 270932, 245785, 189131, 128861, 122009, 148478, 152595, 142818, 122314, 70069, 52873, 68095, 103412, 157869, 208043, 242872, 258314, 257087, 243182, 240655, 249653, 282534, 298163, 252116, 215673, 212078, 217442, 214341, 215183, 210879, 194751, 159282, 176827, 162142, 144859, 135526, 136910, 219915, 282276, 303064, 305442, 289434, 285010, 275908, 260987, 277365, 274945, 246880, 232445, 227106, 218903, 221267, 202731, 204697, 216397, 220321, 207534, 196324, 188349, 175427, 150286, 154219, 156090]
10423A56090k1073k7382L943K0903J3739k0601N952L2601J8308m047r966k1972
10411A46495m609K422o816m531Q3o040k9901L075k0946m019L771j173j2717r579
10397E5515j0751M821K7909N522J8320M7088P0046K2489M8589N4057O0151L2225
10385D35981K9320J3484o295k1908k8103k6627m1622L789l250j6740l1943m8500
10373B57586m6589j1755k4813k4500j0812P442k3189k7708j6947l1858m6940l3542
10361c3625m435j5857k2915K7596L2569j4167j7298L240L771J8921j1161k3855
10349e7216K733J1894J5669J7240L455j7422j0571L354j4236n843n133K1306J7016
10336a7754L8660M0277o838j0948j865l6325k4754K8985L5335n119j8578p017
$$ y = [156090, 135017, 107635, 111578, 132481, 146220, 125619, 131571, 164172, 182480, 178433, 168467, 146495, 141886, 144308, 137492, 132961, 133044, 127004, 97103, 100178, 79232, 75213, 78984, 77811, 65094, 55515, 44764, 49585, 77494, 83016, 101336, 148424, 218470, 240959, 289548, 343605, 403756, 435981, 465301, 478785, 472490, 450582, 422479, 395852, 354230, 358019, 354769, 338029, 306086, 257586, 210997, 199242, 174429, 149929, 139117, 146559, 123370, 95662, 78715, 46857, -83, -33625, -38060, -53917, -76832, -49236, -16667, -30834, -48132, -44892, -41121, -22200, -33361, -57216, -54483, -42589, -26920, -9680, -6225, -23647, -34218, -30864, -45100, -50943, -56076, -34770, -17754, 20906, 61183, 54345, 43397, 41532, 5207, -19547, 9438, 44773, 39654, 21076, 14059]
10324A4059K8053J9832R327l6110j1915J5999L8008J5321j1278l0058k824M1842
10312I0256J4844N1n051N612J9217j9021m6727j9196L6p543O007k8990n062n85
10298C848K4561K7014j4803P705K094K2373j2860j5424L635m1098q542K6464K4680
10285D9647o518q212K707J7241j6573l685K3707P678j4314l536Q504L3299K410
10272I2355K7687O3475l129N5616Q9013J07603P4658L9101n6207n1907p7981p0189
10260B90095n5765l8984k9966j9248k1803J2064l838l8878k6057r560J0037j3463
10248E4634K0054J9709r270l592m634k4105J655J0773N1104q647o720J4017J2816
10235A27794r984j7363j7908m581J1445M758j6849J8918N1195R703k0094j2679
$$ y = [14059, 42112, 61944, 71271, 35161, 23246, 39245, 77253, 92574, 81296, 51238, 48414, 90256, 105100, 105151, 100100, 105712, 124929, 105908, 59181, 39985, 40021, 32478, 38485, 9495, 4433, 3848, 28409, 55423, 40620, 48325, 50419, 72792, 59932, 44508, 48143, 7045, -1497, 24967, 49647, 43129, 34917, 37624, 54865, 38292, 34607, 58314, 65992, 51678, 48142, 56646, 89945, 92355, 120042, 183517, 180388, 236004, 325017, 432620, 507278, 546379, 490172, 438265, 360284, 290095, 234330, 195346, 165380, 146132, 124329, 136393, 132555, 93677, 67620, 58060, 68097, 54634, 74688, 94397, 85127, 81535, 76901, 52796, 54451, 65224, 116328, 107681, 100961, 114978, 127794, 117810, 100447, 82539, 77958, 89403, 94161, 77312, 96230, 147425, 157128, 137034, 124355]
10223A24355j7391j5583J1720K4364N122M06L2687P6965O0557L2667M5052J8358
10211C99279j9697n5934p4483p2094l8510k7156l5220j8473j0611J334n696L1480
10199G4219J2641j1039k7230J9844J6081j0111k9320k2186L6345M078j7922R786
10187E5186K5604j8512n3864k5470J2116L33j4829L4065K5899m139J1827J0299
10175E8515k6808Q87J006P388q914L1598J4760j9819K8724L1170O471k558Q056
10162A30476k882J3069K8537K1979M7018P4364L7949O6850J13011J56421K47605
10151I34397L58298N29589N42350K61850k38421m75166m91459m04539l06524j74302
10141E36073j09245p3586o0777p3667p0475n5973L402K227J5081M531O412J3613
$$ y = [124355, 106964, 91381, 103101, 127465, 132587, 132993, 165680, 242645, 303202, 335869, 380921, 399279, 379582, 323648, 249165, 177071, 138561, 111405, 76185, 57712, 47101, 48435, 42739, 74219, 86860, 75821, 48591, 68435, 84516, 74405, 45085, 22899, 59244, 63322, 45400, 55186, 80790, 62278, 8414, -17056, -4940, -4607, -19436, 14629, 40528, 36389, 48216, 58515, 31707, 32594, 33600, 40988, 32074, 63672, 78432, 58613, 87337, 118507, 124978, 122420, 130476, 127594, 140663, 169200, 191179, 238197, 312561, 350510, 417360, 530371, 686792, 934397, 1292695, 1822284, 2364634, 2626484, 2388063, 1912897, 1421438, 1016899, 710375, 536073, 426828, 353242, 292465, 218798, 148323, 92350, 95752, 97979, 113060, 117591, 124003, 137616]
10129A37616k4534k9416k7423j3392m51J9225J2117J8722k114J0970k8669m1618
10117C1033j4422O793J9063k8049J3405O643J3453L196m872j1819l1360l1007
10105b7943m084J2765J7234k3847j4757L0082J3137R676P881J819j3784l3604
10093b5425j0034j7009o21m858L6395J9909r410J9352K960j8149k3823q668L003
10080c6378K181L5639q950o271r551J2078K5322p979P55K3140J4585k7340K3121
10067D0352M793j0946N057K4768L5538K0934K0382N0841N2916O3424N3603M3480
10055D05142l501m4628k6123n1693m5736n9230n0305l0901k5779j1088p685N967
10043E4440J2865K760k4389m8755r405K1011J289m521J0814q629O784j068j0538
$$ y = [137616, 113082, 83666, 56243, 42851, 42400, 61625, 73742, 92464, 90350, 101320, 72651, 31033, 16611, 23404, 42467, 14418, 27823, 34466, 47919, 51115, 46243, 34424, 3064, -27943, -32027, -19262, -2028, -25875, -40632, -10550, 2587, 12263, 20144, 21963, 8179, -25425, -35459, -52468, -53089, -57947, -21552, -1643, -11053, 8299, 11259, -6890, -30713, -39381, -36378, -34197, 1442, -7508, -13779, -23330, -11252, 14070, 6091, 6846, 29986, 44571, 17231, 40352, 45145, 34199, 39256, 64024, 99562, 120496, 140878, 191719, 244635, 308059, 361662, 405142, 401641, 357013, 330890, 279197, 233461, 174231, 123926, 93025, 67246, 56158, 48473, 54440, 67305, 70065, 45676, -3079, -12484, 8527, 9816, 5295, 16109, 7480, 14264, 13196, 2658]
10030B658l774j3589K1309K429j1393J4030L2804j470j4507n78M530J4070N280
10017E1799l6741m6431n195L8329J9276k5749p175r184l3916K9139K6492P987
10005H631p548J1822K5973k8607n601M622M991m421j9178K7916K0258j9566o839
9992A2453J8363R649m0039j4516L374J9606j2184n932k0668Q276J8242Q963P033
9979A2620j6425j3361J2668r226q86K0903J5593j4936O793K679k2226K797J0077
9966G070m042j4801j8111j5137k8517K0702J0673K329J3393J1944j3678L430L3939
9953I194k5468l878J7642J389o327n730K0543M0719j588j4271Q259K3505r683
9940E4306k5167j0457p816r520n510L9662L7093j5065r140o347k48j0249n0701
$$ y = [2658, -1116, -14705, 6604, 9033, -2360, 11670, 44474, 43004, 28497, 27919, 32449, 46519, 51799, 15058, -31373, -36568, 1761, 21037, -4712, -11887, -21071, -54987, -25848, 644, 8631, 1083, 12905, 38878, 10271, 4670, 9292, 14283, 9862, -9316, 18600, 38858, 19292, 12453, 30816, 40465, 426, -14090, -10716, 8890, -3294, -9226, -29894, -21618, -3376, 5587, 12620, -3805, -17166, -4498, -13724, -14610, 6293, 21886, 6950, 13743, 16422, -5804, -3007, 7070, 3028, -11773, -29884, -45021, -73538, -52836, -42163, -39834, -26441, -14497, -28175, -24745, 9194, -16274, -20152, -2510, -1121, -7448, -13178, 7365, 48084, 46496, 32225, 40484, 63989, 54306, 29139, 18682, 10866, 1346, -4164, 35498, 72591, 57526, 48386, 42039, 41791, 31542, -19159]
9927a9159l0729j7113L5981K2410m6603j614J3215K9343J0172l3727J9099K9548
9915A0823k233l178q577O420J4582J3884K432l581o81k2343j9939M3020J8752
9902D9381n2138j0765J5590p537K3071J4685J3120o951P899m663J804j332N367
9889D7531J8883M948J6608Q931l3375k1018L4524K0693j2176o874l9531L393K2621
9876F5158O862J9745J4101m747j0879J1351l5835j8850Q80N100J1640J9067N261
9863H8854k3864p675k5686J6459L7514j3797q471L0251K3590m4571n3605j8206
9851G93L3204J6050M940J7551J7905o919O811r477J819Q071Q373L5164O6029O7940
9837B68254R5609R2564K4008n5109r5735j02913p1810k6924k0215k5995k6874
$$ y = [-19159, -49888, -67001, -31020, -8610, -55213, -56827, -43612, -14269, -4097, -37824, -18725, 10823, 8590, 5412, -3165, 3255, 17837, 31721, 34153, 30572, 29891, 7548, -12391, 30629, 49381, -2757, -13522, 2068, -5469, 17602, 32287, 45407, 38456, 46355, 41692, 43496, 42164, 47531, 66414, 71362, 87970, 96901, 63526, 42508, 77032, 97725, 85549, 78675, 39144, 42537, 65158, 72020, 91765, 105866, 101119, 90240, 101591, 65756, 46906, 47786, 52886, 64526, 83593, 88854, 64990, 57315, 31629, 48088, 85602, 71805, 63334, 93585, 117175, 72604, 18999, 793, 33997, 50047, 54987, 72538, 90443, 83524, 90335, 80858, 82677, 90748, 99121, 134285, 200314, 268254, 363863, 456427, 480435, 425326, 329591, 226678, 154868, 127944, 107729, 81734, 54860]
9826E4860K5844j2023j4350k6502k763q79J670J3130j7127j7086N6251L2252J0007
9813A03284J970k284O051j4207k0330q154M698m790K160m787J3187K6445K2536
9800A25779l698J2334J2916m082j6893p877j2217j2002Q982J1367K0623q587j8248
9787A08397R460L2333K4244j0135J5648N1140M8376L3000P7537J12861J16552
9776F19413J48329L20248O41980J006078N47874n46381p23420p44796m93836k30436
9766E45053j28196q8572o8335m2255m6777l0285j5264K303P735O345l6542k6539
9754G8671l3505k6298K6577L4936K2708K3240j3281n3238m5031j8129J3204J4577
9742B4431J8863N0591J2034j0635k6542J358k6788J6228n968L6862L8397K3683
$$ y = [54860, 80704, 68681, 54331, 27829, 25066, 24187, 25857, 38987, 21860, 4774, 61025, 93277, 103284, 105254, 102970, 109021, 94814, 74484, 66330, 71028, 66238, 68398, 63611, 76798, 103243, 125779, 122081, 134415, 147331, 143249, 126356, 118479, 106262, 94260, 103242, 114609, 135232, 126645, 108397, 117857, 150190, 174434, 164299, 179947, 231087, 279463, 312463, 390000, 502861, 619413, 767742, 1087990, 1729970, 2736048, 3283922, 2737541, 2014121, 1269325, 775489, 545053, 416857, 328285, 259950, 217695, 170918, 140633, 125369, 127672, 135407, 141752, 105210, 78671, 45166, 18868, 45445, 80381, 103089, 126329, 113048, 59810, 14779, -3350, 9854, 24431, 43294, 93885, 105919, 95284, 68742, 70100, 43312, 59540, 53572, 90434, 128831, 152514]
9730A52514N4196K9014n75r869j5931j5647k5184j1696l3298k8574j0824j1373
9718G2753n7129r087N8072J9675Q525k2515l5646k385J1301L9688K1169j6297
9706H8124m6075k3636L140J4921J7417j0103k5306o399L6489L4090N257j3914
9694G4005k1504k0112n782L1017L614J2231L4807K601l4534n025J7071k2969k1107
9681D4313k078L5500n361R90J40N190q810L2128N956p795Q39m2632L188J6102
9667G7670j8187j5454J1500K9051J1256l1893j7206K7465m911K000j5531r687
9655D6073P66k8994k9774K4566K8309j9543j1023J4206K0462J1753r978K2382
9643F9205J6251R019r168j5855K651R984j9913j7528n998j9332p921K0119q926
$$ y = [152514, 206710, 235724, 235149, 225280, 209349, 193702, 168518, 156822, 123524, 94950, 84126, 72753, 15624, 6537, 64609, 84284, 92809, 70294, 34648, 32263, 43564, 83252, 104421, 88124, 42049, 18413, 21553, 36474, 53891, 43788, 18482, 12083, 48572, 82662, 87919, 74005, 52501, 32389, 26607, 57624, 61238, 73469, 108276, 110877, 76343, 71318, 88389, 65420, 44313, 42235, 77735, 72374, 73364, 73504, 78694, 69884, 102012, 107968, 100173, 101012, 58380, 61568, 77670, 59483, 44029, 55529, 84580, 95836, 63943, 46737, 74202, 69291, 71291, 55760, 46073, 46839, 17845, -11929, 12637, 40946, 21403, 10380, 24586, 45048, 56801, 46823, 69205, 85456, 94475, 85307, 69452, 72103, 82087, 62174, 44646, 38648, 19316, 11395, 31514, 22588]
9630B2588j2172K5015K1966j7932j8090J589K6226j3474K439J0778L3000m483
9618G7450j5180J9876q934M823J0491K932K4414J9143l6370K382N612j1136O18
9605I6121O681J1757j1516l4732j6653J4891k1764l1090p559J1108K4959J588
9593D3791M772K0253J7666k206R87j9685Q498J0909J4191p170j1631j1570L501
9580G2306K9641o54L640K3851j4168k2090k6180K167P699r066m793j527O58j174
9566F0310J0570j685Q891J5429P3j9066j0933j1890J1708J7399O425K753M392
9553I4376o260m224o132K3349M532j0792k5235M695J3995J0589k1597p684O990
9540G6602r102o935Q987Q335J4244M37j2570l4822q444L1986J1694K1571l647
$$ y = [22588, 10416, 35431, 57397, 39465, 21375, 22964, 49190, 35716, 38155, 48933, 81933, 77450, 62270, 82146, 73212, 78035, 88526, 91458, 115872, 135015, 98645, 101027, 106639, 95503, 96121, 102802, 114559, 103043, 68311, 51658, 66549, 44785, 13695, 6136, 17244, 42203, 43791, 48563, 68816, 86482, 84276, 85263, 65578, 74076, 84985, 99176, 92006, 80375, 68805, 72306, 101947, 101293, 104933, 128784, 114616, 92526, 66346, 68513, 76212, 67146, 62353, 60826, 61484, 60310, 70880, 69195, 78086, 93515, 93588, 74522, 63589, 51699, 63407, 80806, 87231, 89984, 94376, 88116, 83892, 77760, 101109, 105641, 94849, 69614, 74309, 88304, 98893, 77296, 69612, 76602, 67500, 60565, 69552, 77887, 92131, 92568, 79998, 45176, 36732, 68718, 80412, 101983, 98336]
9527I8336O343j0567P63O547k0360j5183P722J2617J2527J3347J7796j62j3948
9514A15778O048q80R038p728N7l2931k4455J1172J0951o416j1213J3708J7361
9501A00490m201k53Q59p076o205o826K8259J5562r563j8587k4849O454Q740j513
9487H1291L4735n376j9314P499J8521J5815L734J6087K4172j7885j7080j2480
9475A29719J1922j4293j6215Q934r949j7727J798k6422j6628L8096L0877Qj4757
9462A05363M485J8313O839J8654k1265j1703P177j6766K607l785L303j3458l353
9449I6411K9795J5542M254k5413Q093P39k360j7095k6633M229K3647K4495m202
9436A31502K3019j193J8503k324k8576k6375R074K0140J4653L121P471k7933j9922
$$ y = [98336, 104679, 94112, 94875, 101422, 81062, 65879, 73601, 86218, 98745, 112092, 129888, 129726, 115778, 121826, 120946, 129984, 122256, 122313, 89382, 64927, 76099, 87050, 80634, 69421, 83129, 100490, 96289, 96036, 96895, 89819, 83614, 76788, 105047, 120609, 111046, 92459, 67610, 74064, 82804, 81291, 116026, 110650, 91336, 98835, 117356, 133171, 136905, 152992, 177164, 159279, 142199, 129719, 141641, 127348, 111133, 120067, 110118, 92391, 94189, 67767, 51139, 89235, 120112, 120120, 105363, 109848, 128161, 135000, 153654, 132389, 120686, 127863, 111097, 113704, 109919, 113222, 99764, 96411, 126206, 141748, 146002, 120589, 128682, 129421, 127061, 109966, 83333, 87562, 111209, 135704, 131502, 154521, 153328, 171831, 169507, 140931, 114556, 123630, 143770, 158423, 161544, 169015, 141082, 121160]
9423A21160N708L290N802J2284K6889Q748k7327J4929k5893k2731j0912J9220
9411A31167P583r808M2021J4626j398l6556j4787K1545J4978K2827l795k8007
9399A60396r716K2101K378q633o89j1209o977J4920J9557j0335l7958r764m121
9386A19950j2535J4347N971J1790J2408R672J8773J6857j2930k2893J3801L0723
9374B05934O926J1028j1541j2813j1575m200q789q406o887m921L5466K4070K328
9361B16620j6246k1460k9879k0010R433K6954Q803k637m367K2082j0473m07J0753
9348A89166J4521k2332j1146J5281J9781K9812k1066n869N115Q051k3810o522
9336A90982l890j8025m452K3760O197l389O689R899j3199j0602n414L5275J5773
$$ y = [121160, 126868, 130158, 135960, 148244, 175133, 183881, 156554, 171483, 145590, 122859, 111947, 131167, 138750, 128942, 170963, 185589, 184191, 147635, 132848, 154393, 169371, 192198, 188403, 160396, 150680, 172781, 175159, 166526, 165837, 154628, 147651, 162571, 182128, 171793, 133835, 124071, 119950, 107415, 121762, 127733, 139523, 151931, 161603, 180376, 197233, 184303, 161410, 175211, 205934, 212860, 223888, 212347, 199534, 187959, 183759, 174970, 166564, 159677, 154756, 190222, 214292, 216620, 200374, 178914, 149035, 129025, 138458, 165412, 174215, 171578, 167211, 189293, 178820, 178413, 189166, 203687, 181355, 170209, 185490, 205271, 235083, 214017, 208148, 213263, 221314, 197504, 190982, 187092, 169067, 164615, 188375, 194572, 191183, 197872, 207771, 194572, 183970, 178556, 213831, 229604]
9323B29604j3495j9884j2259L1987R03j9879l2573o736J202J4647J5992L5759
9311B25268L0813M54k1587K620J299l088J941m389J284M594J5766J1016L138k0274
9297B48855j5188J0451l722q017J3273j3486L675K2034p150j5434L6241O278j8848
9284B58962P29o323j2868L5649K7621j750k1600j1442o276J8450j6667j6980j4744
9271B32761K1308L1030J5890p35m749K2097K0501L34L0347K4252j6864k8250K3377
9258C71299R243j3226k7602j5194P609j6055K989O699O520q737J5398L1942J775
9245C72660Q098m840l1601P00J4887k4403j612m729K0636J2023Q770L15j2090
9232C58814j8170J2910M371J1356K9733J0836M408p564j9631j3520p458k9738
$$ y = [229604, 216109, 196225, 183966, 215953, 216856, 196977, 164404, 157668, 158870, 173517, 189509, 225268, 256081, 256535, 234948, 237568, 238867, 235779, 237720, 233331, 234615, 239209, 254975, 265991, 269129, 248855, 233667, 244118, 240396, 232379, 245652, 232166, 235841, 257875, 250725, 235291, 271532, 277810, 258962, 259691, 253368, 240500, 276149, 303770, 302020, 280420, 268978, 262702, 281152, 264485, 247505, 232761, 254069, 285099, 300989, 300254, 295505, 317602, 338103, 338437, 368784, 393036, 376172, 347922, 371299, 380542, 367316, 339714, 324520, 332129, 316074, 319063, 325762, 332282, 323545, 338943, 370885, 372660, 380758, 375918, 344317, 345017, 359904, 335501, 333889, 329160, 349796, 361819, 370589, 370904, 358814, 340644, 353554, 357925, 369281, 399014, 409850, 414258, 406694, 387063, 373543, 366085, 336347]
9220C36347j2656j4077K5716L1233J9737J5906J7359K9591K518K729N015O607
9208D66025j8394k0627k5490J4442L414K6182j257J2587K2000J0991k9891n650
9196D54332M492M1960K2029n941j7629j4006j7735N904O196J423P589K663j4517
9183D76760J1903J8126N232J8788R59J5283j4845k4937j5622J3796K5541J7992
9171E48976M825j1967J3704L690J2041L060J5644J4970l1414K109L7744J6035
9159F29417K0802R900p297l5322k5853p020Q036J6600J6205R438n675K246K6382
9146F57859R635j7731J559J1664R687J8445M5666J2614j6115l6773P682K7400
9134G31592O089K3648J1606R759o397J9808J1456K6168l0616j9073J2665N792
$$ y = [336347, 323691, 309614, 335330, 366563, 386300, 402206, 419565, 449156, 451674, 454403, 459418, 466025, 447631, 427004, 401514, 415956, 419370, 445552, 444295, 456882, 478882, 489873, 459982, 454332, 458824, 500784, 522813, 516872, 499243, 485237, 467502, 473406, 479602, 481025, 488614, 491277, 476760, 488663, 506789, 512021, 530809, 531768, 547051, 532206, 507269, 491647, 505443, 530984, 548976, 553801, 541834, 555538, 559228, 571269, 574329, 589973, 604943, 573529, 575638, 613382, 629417, 650219, 660119, 652822, 617500, 591647, 584627, 592663, 609263, 625468, 634906, 629231, 631477, 657859, 667494, 649763, 651322, 662986, 672673, 691118, 736784, 749398, 733283, 696510, 704192, 731592, 737681, 761329, 772935, 782694, 776297, 796105, 807561, 833729, 803113, 784040, 796705, 802497]
9122H02497J3021J2226Q28K0837P489R996k114J4980K4106M8139L0423k5365N46
9109I57609j756j3020l385J4644J8371J0361K4636K7962N462k265J2029J9743
9097A070391J323K335J7062J2594J536K7996n763L3658K0051P938N180j5671O002
9084A184632J7125o36M334R429J9960L2185K3609K3489J7614M7332K1398J5624
9072A416095j349j4377J4484M9570K418M436K3376l601L2465P5190J8261L4958
9060A651926L2172j5321n089M1338L4806L3339L5719N269M1679J9434m923O7157
9048A937506L7373M2437L4667J8020J088K4828Q375N5420P3327O5989K7530M3899
9036B370459L2717J5463L7621K4909L8421O4632N6465L6054M4496O3651N3327
$$ y = [802497, 815518, 827744, 828572, 849409, 856898, 866894, 864780, 879760, 903866, 952005, 982428, 957063, 957609, 955853, 942833, 939448, 954092, 972463, 982824, 1007460, 1035422, 1040884, 1038619, 1050648, 1070391, 1071714, 1074049, 1091111, 1103705, 1105241, 1133237, 1127474, 1161132, 1181183, 1189121, 1194301, 1178630, 1184632, 1201757, 1201121, 1205455, 1214884, 1234844, 1267029, 1290638, 1314127, 1331741, 1379073, 1400471, 1416095, 1414746, 1400369, 1414853, 1464423, 1466841, 1471277, 1494653, 1491052, 1523517, 1598707, 1616968, 1651926, 1684098, 1668777, 1663688, 1705026, 1739832, 1773171, 1808890, 1814159, 1855838, 1875272, 1870349, 1937506, 1974879, 2017316, 2051983, 2070003, 2071091, 2095919, 2104294, 2159714, 2233041, 2299030, 2326560, 2370459, 2403176, 2418639, 2456260, 2481169, 2519590, 2584222, 2640687, 2676741, 2721237, 2784888, 2838215]
9025B838215L5608N7348L8775N4317N7137P2933P7192N6602K8513N0602N5086
9014C422328J11526J06228O9807O1146P1196M2482P8072Q7286J05916J03521P2916
9003D332424O1047Q5103R9949J22320J36221J20428J10888J23146J25017J06196
8993E422739Q1006J03198J23892J44897J27231J50774J56112J53074J30520J63506
8983F756949J74874J59599J73344J68411J82318J81004K00927J81469J49560J64488
8973H492943J86554K17068K17088K02568K07733K08222J94859K07132J85569J95211
8963A0514947J58238K03515K22318K08112K13732J82789J64800J36818J68265
8954A2173534K03248K19655J93089J34568J29534J10097J07708R4794O3442O5344
$$ y = [2838215, 2873823, 2931171, 2969946, 3024263, 3081400, 3154333, 3231525, 3288127, 3316640, 3367242, 3422328, 3533854, 3640082, 3709889, 3771035, 3842231, 3884713, 3962785, 4050071, 4155987, 4259508, 4332424, 4393471, 4478574, 4578523, 4700843, 4837064, 4957492, 5068380, 5191526, 5316543, 5422739, 5503745, 5606943, 5730835, 5875732, 6002963, 6153737, 6309849, 6462923, 6593443, 6756949, 6931823, 7091422, 7264766, 7433177, 7615495, 7796499, 7997426, 8178895, 8328455, 8492943, 8679497, 8896565, 9113653, 9316221, 9523954, 9732176, 9927035, 10134167, 10319736, 10514947, 10673185, 10876700, 11099018, 11307130, 11520862, 11703651, 11868451, 12005269, 12173534, 12376782, 12596437, 12789526, 12924094, 13053628, 13163725, 13271433, 13366227, 13429669, 13495013]
8944A3495013R6395K6049M621J6389O161n376r83p8480p6627p9135q2667j03268
8932A3218092j20684j05779j29672j69334j35634j76598j89925j81723k16715
8923A1792028j89883j93945k31070k09125j87379j89334k01398k07488k04884
8914I977522k18354k12168k15165k07580k22039j83715j72281j99636k37660j91298
8904G917626j58201k01866k12801j83022j48635j83133j63315j53950j30714j42803
8894F239186j57635j52132j41934j41050j25446j42385j46126j31476j26300r8674
8884D876028p8739j09260j38930j21795j18446j11122j16013o0212o6666p2967
8874C881878q5771r0586m8660o8027o3477r8131p6037l3586o1898p0449o7017
$$ y = [13495013, 13591408, 13617457, 13622078, 13638467, 13644628, 13639252, 13638269, 13559789, 13483162, 13404027, 13321360, 13218092, 13097408, 12991629, 12861957, 12692623, 12556989, 12380391, 12190466, 12008743, 11792028, 11602145, 11408200, 11177130, 10968005, 10780626, 10591292, 10389894, 10182406, 9977522, 9759168, 9547000, 9331835, 9124255, 8902216, 8718501, 8546220, 8346584, 8108924, 7917626, 7759425, 7557559, 7344758, 7161736, 7013101, 6829968, 6666653, 6512703, 6381989, 6239186, 6081551, 5929419, 5787485, 5646435, 5520989, 5378604, 5232478, 5101002, 4974702, 4876028, 4797289, 4688029, 4549099, 4427304, 4308858, 4197736, 4081723, 4021511, 3954845, 3881878, 3796107, 3705521, 3656861, 3588834, 3525357, 3427226, 3351189, 3317603, 3255705, 3185256, 3118239]
8863C118239j00900m8264n2258q6536n8540o5869o3330o7234m8446k1811k7765
8852B477286p4029n6102j2621k2367k7756n4112m0465j4885l8893n3935o0895
8841B021226k0452j954m663k4415l971n0172n1852p4256n3892k8510m5055j9178
8829A642856j6092J1862l284l6238k1989l5766m4802l2724R045k2237k7362j8326
8817A404943j4733l4894k0009j7271n325k0469l7408l9197k7973O622M150K49
8805A198685k5416j2527k033m0775N124j5718m0898j2920p925j2486k7298O034
8793A011847k2230j8562K5985J7306l5823m6138m334m7098j2152K1756m246J044
8781H87355j553m5880r248J133j9243j2116J259m46k1452l6669k9827O614p771
$$ y = [3118239, 3017339, 2969075, 2916817, 2830281, 2771741, 2705872, 2642542, 2575308, 2526862, 2505051, 2477286, 2403257, 2347155, 2334534, 2312167, 2284411, 2230299, 2189834, 2174949, 2136056, 2082121, 2021226, 2000774, 1998820, 1994157, 1969742, 1965771, 1915599, 1863747, 1789491, 1735599, 1707089, 1662034, 1642856, 1626764, 1638626, 1635342, 1599104, 1577115, 1541349, 1496547, 1463823, 1472868, 1450631, 1423269, 1404943, 1390210, 1355316, 1335307, 1318036, 1312711, 1292242, 1254834, 1215637, 1187664, 1194286, 1198436, 1198685, 1173269, 1160742, 1158709, 1117934, 1123058, 1107340, 1066442, 1053522, 1045597, 1033111, 1005813, 1011847, 989617, 971055, 997040, 1014346, 978523, 932385, 928051, 880953, 868801, 890557, 886311, 887355, 885802, 839922, 830674, 831807, 812564, 800448, 801707, 801261, 779809, 743140, 713313, 719927, 712156]
8768G12156l2908j364K0246r765k0643J959k8732k6059K268l881P064P185L2810
8755F60336J0029l7743k6310n290k7405n0254k4887J0977L5658L5239L936k123
8743E82163k357j9759m194j6072p595N603j9585j4595L1880N816k3959m2741N455
8730D80060j2582P082Q203j5714q255j6197Q595J2767k3729N101k7351o82J7069
8717D34367O669k4683k6476J0577K2018M336m889P439N643M464K7839k5157r889
8704D32258O049k7519j8747l2602j9355J6824L6000K8044J1280j6167j4183l0747
8692C71135k463K3850r343k2550Q201J3704R858J4222k6246o811o110k2442Q040
8679C53045J1382k950j4050K6848J187m7441l3184k44L1175k643l7190k4259J0402
$$ y = [712156, 679248, 677884, 698130, 688365, 667722, 669681, 640949, 614890, 617158, 613277, 620341, 627526, 660336, 670365, 632622, 606312, 601022, 573617, 523363, 498476, 509453, 545111, 580350, 584286, 582163, 579806, 560047, 555853, 539781, 532186, 537789, 518204, 503609, 535489, 541305, 517346, 474605, 480060, 467478, 474560, 482763, 467049, 458794, 442597, 451192, 463959, 440230, 445331, 417980, 417298, 434367, 441036, 416353, 389877, 400454, 422472, 426808, 421919, 429358, 435001, 439465, 467304, 442147, 432258, 438307, 410788, 392041, 359439, 340084, 356908, 392908, 420952, 432232, 416065, 401882, 371135, 368672, 392522, 383179, 360629, 368830, 382534, 392392, 406614, 380368, 373557, 367447, 345005, 353045, 364427, 361477, 347427, 374275, 375462, 328021, 294837, 294593, 325768, 323125, 285935, 261676, 272078]
8666B72078J6766J5872j1138J5685J2741m262k0649K8313j014J661M554M069j6327
8653C18349j5137j5669N163P309k513j6362p011J896K1118o366P508r352J1525
8640C00458L17n191R193J5757L3520L6454m1910l4872J9257p710m050k8064Q773
8627C01932n513j3393k0689L935n426m5570L5616P580j5925K014k2904O185M94
8614B28336k1619R906K2764Q098J6962j5769J813L330K7855m8365j9741K8325
8602B41895K7941L251J3758j1017j6219O978J557L3486L3153K5550M5446M0010
8590D45789N0407j5565k6920j7708k8429k9258j2823K190j369l2661l4800p739
8578B91114J0732o80j9710p947k6596k5454j688k4957j6064L263J6352n608k0452
$$ y = [272078, 288844, 304716, 293578, 309263, 322004, 317742, 297093, 325406, 324392, 326053, 330607, 334676, 318349, 303212, 287543, 292706, 300015, 297502, 281140, 274129, 276025, 297143, 290777, 298285, 288933, 300458, 300775, 295584, 304777, 320534, 354054, 390508, 348598, 313726, 332983, 325273, 321223, 293159, 301932, 296419, 283026, 262337, 266272, 260846, 215276, 250892, 258472, 242547, 244561, 221657, 227842, 228336, 206717, 216623, 239387, 247485, 264447, 248678, 250491, 253821, 281676, 233311, 213570, 241895, 269836, 273087, 286845, 275828, 259609, 266587, 268144, 301630, 334783, 360333, 405779, 445789, 496196, 480631, 453711, 436003, 407574, 378316, 365493, 367683, 366314, 333653, 298853, 291114, 301846, 301166, 281456, 273509, 246913, 221459, 219771, 194814, 178750, 182013, 198365, 192757, 172305]
8565A72305q331J6091J1863k2o317J901J7295K507k0833l8877m132J9650J1690
8552A74790Q850k8150k753K1820J0211R799K5631L6539K0289k1610n3161m7818
8540A54437j0116L363r190L732k727P19o556n0412k2183L0448r985M636M0759
8527A26925J1968j6246J490L5360J674J387j4227q245j1618j5406l8202m937K0165
8514I0088K773q553j989K4665J4674j1509o516j7659K2095L2020j508l7698k0991
8501G9892q103K7405M672l2570l1996r423P806K8745L2598J3031j4617m875P431
8488I9996M599j2840o118R160J9238J1603r560k0273J8072N13l4718j1128K7744
8475I6288K8732L9680j2943k2288l3523k8674J1382L184R53J9626K879p161J116
$$ y = [172305, 163974, 180065, 191928, 191906, 185589, 187490, 204785, 207292, 186459, 147582, 143450, 163100, 174790, 183640, 155490, 152737, 174557, 184768, 194567, 220198, 256737, 277026, 255416, 202255, 154437, 144321, 147684, 138494, 142226, 139499, 140218, 133662, 83250, 61067, 91515, 81530, 86166, 126925, 138893, 122647, 124137, 159497, 161171, 162558, 148331, 140086, 128468, 113062, 74860, 69923, 90088, 92861, 84308, 82319, 106984, 121658, 110149, 103633, 85974, 108069, 140089, 138581, 100883, 79892, 71789, 99194, 103866, 71296, 39300, 29877, 37683, 66428, 99026, 112057, 97440, 92565, 99996, 104595, 91755, 85637, 94797, 114035, 125638, 116078, 95805, 113877, 114390, 79672, 68544, 96288, 125020, 164700, 151757, 129469, 95946, 67272, 78654, 81838, 82791, 102417, 105296, 98135, 99251]
8462I9251J3723K6294K489l4050j1254k521k8227r263J3145J5540k7606J6283
8450G3804K0675J3856j5183J6102O660n647m4587O044q832J0111N8274J5182k992
8437A43467j8105r611J7616m496k4679o308l2937k1683K5013P252K1435J9014
8425A15978k32k407j0556j4666j2907n61n573J0852r533J496Q237j2780N446k2062
8411E0732j3382J5511l252L8323J9823j3870j0375J433PP739J8046K0518n1k7097
8397A04105n813k391K8480N784K188j0244k3715q454o637J1591J483r809m975
8384H1593M607j0128M932L4782j9801k7313J6972j4203J684o75L5328J4160n379
8371A16559M795j5878j9175r100K1138L6972k341j4503k7736j4354J2036l2r823
$$ y = [99251, 112974, 139268, 141757, 107707, 96453, 93932, 65705, 56442, 69587, 85127, 57521, 73804, 94479, 108335, 93152, 109254, 115914, 110267, 65680, 71724, 62892, 73003, 131277, 146459, 143467, 125362, 115751, 133367, 128871, 104192, 97884, 64947, 43264, 68277, 75529, 96964, 115978, 115746, 113339, 102783, 88117, 75210, 74649, 69076, 79928, 70395, 71891, 80128, 67348, 72794, 50732, 37350, 52861, 49609, 87932, 107755, 93885, 83510, 84943, 84950, 92689, 110735, 131253, 131202, 104105, 98292, 95901, 124381, 130165, 132353, 122109, 98394, 89940, 83303, 94894, 96377, 86568, 81593, 86200, 76072, 81004, 115786, 95985, 68672, 85644, 71441, 73125, 72450, 107778, 121938, 116559, 121354, 105476, 86301, 77201, 98339, 135311, 132970, 118467, 90731, 76377, 88413, 88381, 78558]
8358G8558k8138p796j2789J298J7432J8714N788k5576r553j0827K2046j7913P718
8345C8962r08j0452Q839J3745n132k2841q50K5481J7391p261p894J3121q006j7715
8331C6480J6194O880k3794k8113K2566O688K5546K7467O361j2328j4099j8758
8319E1090k2694N463k572j1002N108L6128q849k3104P687K6537m209n285K3785
8306G8083k0694J440L683j7837k6311k6463O769L4003L3078j1684l8523o524K1673
8293C0693N4757p986l0778r068R431Q089Q713J8772J0503O131k4082k9052Q252
8280E4375J3531k321k2903r753L0527M1312n596m0803k1578q123l1968J1652L1538
8267C9890p679L9815R821N175O713l7087n2217K3046L5476J5615k6818j2075L4164
$$ y = [78558, 50420, 42624, 29835, 31133, 48565, 67279, 73067, 47491, 37938, 27111, 49157, 31244, 38962, 38054, 27602, 36441, 50186, 45054, 22213, 21363, 46844, 64235, 56974, 49080, 62201, 54195, 36480, 52674, 59554, 35760, 7647, 30213, 36901, 62447, 89914, 96275, 83947, 69848, 51090, 28396, 33859, 31287, 20285, 25393, 61521, 52672, 29568, 37255, 63792, 59583, 54298, 78083, 57389, 58829, 62512, 44675, 18364, -8099, -1330, 32673, 65751, 54067, 15544, 9020, 30693, 85450, 77464, 46686, 37618, 47049, 55138, 63851, 82623, 93126, 99257, 75175, 46123, 54375, 67906, 65585, 42682, 32929, 63456, 104768, 99172, 58369, 36791, 28668, -3300, 8352, 39890, 32211, 72026, 81847, 87022, 93735, 56648, 4431, 27477, 62953, 78568, 51750, 39675, 73839]
8254G3839n404k1458j6542j1077o875L5609K072o230m635J827O993l812l36n308
8240C8663O031J3536k4216j3330K5998Q59j9167m825J9562M125k1711k1260O013
8227A0278q812j8695K9447L1469r665k2955N102j3661l353J3405L0365J0588P325
8214F0838J9075p065j0430K0263K6288j4772r777j5107l7414q614J6559M001j0462
8201C3383l2851K5356k175N32K1179m615k0020k261q26p758M452L7666Q287p290
8187E3059K7107k1324k8251O140J8450K3922k3470k0362R005J4990k0623r580
8175B9063l7927L540J1542J6951J5280P456J5134K7272J0643p492j8263l3591
8163C9608J4719Q341j5281P491q598N478R107j9150j2842N597P522J2242J1687
$$ y = [73839, 68435, 46977, 30435, 19358, 12483, 48092, 50164, 43934, 39299, 41126, 48119, 44307, 43971, 38663, 44694, 58230, 34014, 20684, 46682, 47541, 28374, 23549, 43111, 47236, 25525, 4265, 10278, 1466, -17229, 12218, 43687, 34022, 11067, 16169, 2508, -845, 12560, 42925, 53513, 60838, 79913, 72848, 62418, 82681, 108969, 94197, 84420, 69313, 31899, 23285, 39844, 43845, 33383, 532, 25888, 23713, 24245, 45424, 40809, 20789, 18528, 17702, 9944, 14396, 52062, 60349, 53059, 80166, 58842, 30591, 36731, 55181, 79103, 55633, 35271, 44276, 59266, 38643, 29063, -8864, -5324, 6218, 23169, 38449, 45905, 61039, 88311, 98954, 91462, 73199, 39608, 54327, 62668, 47387, 54878, 46280, 51758, 60865, 41715, 28873, 34470, 41992, 54234, 65921]
8150F5921N964k2954L4597j0147l3535m022J771L767j1290L3383m198j2716K109
8137D8650K0488L130k0197J6175J1058l514m1848O009J5308n478l240M78o479
8124D0540l447k3653l5065P854J8115J2983j69Q888J315j0651j2477m23J9339
8111B3149L4983K5730k675l4613J1417R387K739n948J1355K6500J6675p965k5621
8098H5113j271k018j7276k5759k5674j9176J3389K8055L1682J7139m6147j5219
8086B2838J0325L27m611L8049K2431k8541l0764n664O496J4773K2979m140J0443
8073G4941j3064k6171r387J0826j293L0913L3087q390Q325q047j6569J1444Q850
8060I5465o125j6622k8437r364O723L5413K3722p78k4781j6598k6567l887L764
$$ y = [65921, 71885, 48931, 83528, 73381, 39846, 35824, 37595, 41362, 30072, 63455, 59257, 46541, 48650, 69138, 72268, 52071, 68246, 79304, 75790, 33942, 39951, 55259, 49781, 46541, 47019, 40540, 37093, 13440, -21625, -13771, 4344, 17327, 17158, 26046, 27361, 16710, 4233, 3810, 23149, 58132, 83862, 81187, 46574, 57991, 67378, 70117, 64169, 75524, 102024, 118699, 110734, 85113, 83842, 81824, 64548, 38789, 13115, -6061, 7328, 35383, 67065, 84204, 38057, 22838, 33163, 33490, 28879, 66928, 89359, 60818, 30054, 24390, 30886, 45659, 68638, 64498, 74941, 61877, 35706, 26319, 37145, 35852, 66765, 99852, 91462, 99787, 91740, 75171, 86615, 95465, 89340, 72718, 44281, 34917, 41640, 77053, 100775, 99997, 75216, 58618, 32051, 28164, 31928]
8047C1928O179J7313j2189Q742J2073j2253j5265R650M2463N713k6072k39L309
8034G1352j9354p463k26j5765J4292Q289k896m179l856j8076M934j21J3388K8516
8020F8835J5299k2537J4317L717n361l3083n3084K6718M2624k0945J650O379j6162
8007B8367J4295J1346k7704K3513Q006l8657j6677j5642K80L5958n240l384M167
7994A8628n24Q399L4174L5936J1722j2775m803n617k0566l8804q317l083j3611
7981G59m472j498K5106L329j8137j5763O216L1363K2211R394k3250k1075J8178
7968C2361J2994l231k3405l138K6306M510n818r914j7510J2181J5317R615J4666
7955F4934k514J6713q229k1349N496k0261K183p660j0089J9726K558J2654L828
$$ y = [31928, 38107, 55420, 43231, 51973, 64046, 51793, 36528, 46178, 88641, 94354, 68282, 68043, 71352, 51998, 44535, 44309, 28544, 42836, 51125, 48229, 44050, 40194, 22118, 27052, 26931, 40319, 68835, 84134, 61597, 75914, 79631, 74270, 41187, -11897, 14821, 57445, 36500, 38150, 44529, 28367, 42662, 54008, 26304, 49817, 57823, 19166, 2489, -13153, -12873, 23085, 17845, 14461, 18628, 18104, 26503, 60677, 96613, 108335, 95560, 90757, 85140, 64574, 25770, 17453, 14370, 759, -3713, -5211, 19895, 23224, 5087, -10676, -4460, 26903, 49114, 58508, 35258, 14183, 32361, 45355, 42124, 18719, 15581, 41887, 46397, 40579, 30665, 13155, 25336, 40653, 50268, 64934, 62420, 79133, 70904, 49555, 55051, 34790, 36973, 29313, 19224, 38950, 41508, 54162, 57990]
7942E7990k8679k0442J317P787L0023J6891N02K6598k1586j2741j0335j3842J3641
7929D7124k931n023k8201j1611j2516l690K9493K8976J4773j6409k593J8341l8447
7916A7286l2869m250J4434n132J4124M2931j8046k9642K0361J9551j055j0052
7904B7641J002N239k4643M5861j4555k6103j7837r000N073k295M4972J5064o275
7891D4144O887J6482M3510M0849m7561n6730l2254j5310O096K693P932J5486K9742
7878F1966k5564k727J580j9871l0297j2789l184q253q742N487L0177K6873P418
7865B2074J1966m401J7139l8513l8332J7987K2914q907j2680l009m49J7231K6721
7852B9741q206k6106M943J8665n832N905n418k633j8538l482J1225J3638L067
$$ y = [57990, 29311, 8869, 10186, 17973, 47996, 64887, 65389, 91987, 70401, 57660, 47325, 33483, 47124, 44193, 39170, 10969, -642, -13158, -16848, 12645, 41621, 56394, 39985, 37392, 55733, 17286, -15583, -19833, -5399, -10531, 3593, 46524, 28478, -1164, 19197, 38748, 37693, 27641, 28643, 33882, 9239, 55100, 40545, 14442, -3395, -12395, -7322, -9617, 35355, 50419, 44144, 51031, 67513, 111023, 151872, 104311, 47581, 15327, 17, 6113, 8806, 16738, 32224, 61966, 36402, 33675, 35255, 15384, -14913, -27702, -30886, -39139, -47881, -42394, -12217, 14656, 22074, 34040, 29639, 46778, 8265, -30067, -12080, 10834, 1927, -10753, -13762, -14211, 3020, 29741, 21535, -4571, 372, 19037, 13205, 19110, 13692, 11059, -7479, -10961, 264, 13902, 16969]
7839A6969j16J0955r52P67J7568j0137j9566k2752l025K1028q181k834l6608j7592
7825e4476L8892R465O307M018j796j3756j5519J6555J8144m024J899J6165J0212
7812C2086J2935J7597l5925q535k257K2194p918l1087j1788J5188O084j9751J0170
7799a007J8176j2288l7388N151j737R41L2179p734o092r838j0013K4839J4184
7786I373O441j1717k0301K1896J4381l656J0550R358k6899k1053K745J0388J2919
7773A4425J2099K476j1505k0788k1658q665j7218N202J0992j143J9081L5128j617
7760A6809m6158j4683J7284P652l225m443K561K3716J4510J328j7381q37j0060
7747a2927L3080J3520j6785J1597j4292q333m793k2546J017k889O631m0924k036
$$ y = [16969, 16853, 27808, 26856, 27623, 45191, 35054, 15488, -7264, -10289, 10739, 2558, -276, -36884, -54476, -15584, -6119, 188, 4206, 2410, -11346, -26865, -10310, 7834, 3810, 5709, 21874, 32086, 45021, 62618, 26693, 18158, 15901, 38095, 30177, -910, -12698, 2490, 8574, -11177, -1007, 17169, 4881, -32507, -27356, -29093, -28152, 4027, -3707, -9799, -19637, -29650, -4811, 9373, 15814, 4097, -16204, 5692, 20073, 16417, 26967, 36325, 9426, -11627, -8882, 1506, 14425, 26524, 29000, 17495, -3293, -24951, -33616, -50834, -45632, -34640, -35783, -16702, 18426, 16809, -29349, -44032, -26748, -19096, -22321, -26764, -24203, -487, 14023, 15351, -2030, -2867, -12927, 20153, 33673, 16888, 28485, 14193, 5860, 1067, -21479, -20462, -23351, -16720, -57644, -59680]
7734e9680K9520L0787k011K332k4379j851L9308j0890k2527L217P71P622J6642
7721H861L2955j5623j3994l003r672j10N58Q966R526k01j4626J1001o201j4716
7707f279j382R707p818K56Q937k6858k14J4785j1743j5103n578P641r934p66L5350
7692h999J4463k6657J0493M602j1135m456J0843j0892l1332k208K9303J9109R984
7679C118k4131k7732J027J0841L8829K8507R415j4239j4775O764j4206r438J0228
7666D208j0203q10O659K4280k6485j1237J4186Q520j9342k3642K4833J1518k0583
7653a8098Q385j3662M2011n660j7751L550J2817p655r617L315J6379k5842k6842
7640c8670K5687L830j3374l4399J1957K4238L892J0543l243l639J4741L0886K7276
$$ y = [-59680, -30160, 627, -1384, 948, -23431, -25282, 14026, 3136, -19391, -16174, -15403, -7781, 8861, 41816, 26193, 12199, 9196, -476, -586, -28, 8938, 18464, 18263, 3637, 14638, 8437, -6279, -7661, 2046, -5772, -5516, 3421, -23437, -23651, -8866, -20609, -35712, -41290, -33649, -43583, -44349, -8999, 5464, -21193, -10700, -6098, -17233, -21689, -10846, -21738, -53070, -55278, -25975, -6866, 3118, -21013, -48745, -47718, -36877, 1952, 30459, 39874, 25635, 10860, 17624, 3418, -6020, 4208, -5995, -6805, -146, 24134, -2351, -13588, 598, 9118, -10224, -33866, -9033, 2485, -18098, -9713, -23375, 18636, 12976, -4775, -1225, 11592, 3937, -5680, -2365, 14014, -11828, -38670, -12983, -9153, -22527, -56926, -44969, -20731, -16839, -6296, -9539, -13178, 1563, 32449, 59725]
7627E9725l0436k4982o832k1868k2825o963j4467O177J6985J6616J6172p607j1743
7614c2048j0388Q148j7687o800k0475p701J9747K0945J2708k941L4759j0243j6386
7601b8362J4679J1835k831m485K0360K81K6682j573l3612k4198j9656j9654j7555
7588g8089k612Q322L1959J1168K4031K2483k5959k2622j4214l44L6654j805m95
7575a1523J6893L754J4030J679m0553p235K816J4938J6817N190j3201l256m181
7562c832l931l7601j1034J8365j612L3053K9618J0080K062m687l2871j0579j5715
7549b8684l5640K4616K3425N035K2668L315l4822R272K9882m784j0435N865m313
7536E400j1594q174j7566O3586K2750l9810j5961J300j1196q770J3501K4209k519
$$ y = [59725, 29289, 4307, -2525, -24393, -47218, -54181, -68648, -62471, -45486, -28870, -12698, -20305, -32048, -42436, -34288, -51975, -58775, -79250, -86951, -67204, -46259, -33551, -36492, -1733, -11976, -28362, -13683, -1848, -4679, -9164, 11196, 11477, 38159, 36586, 2974, -21224, -40880, -60534, -78089, -80701, -72379, -40420, -29252, -5221, 17262, -8697, -31319, -45533, -45877, -9223, -11028, -11523, 5370, 9124, 23154, 24833, -15720, -22955, -20139, -5201, 11616, 16806, 3605, 349, -3832, -7763, -45364, -56398, -38033, -39645, -6592, 23026, 33106, 35168, 30481, -2390, -12969, -28684, -64324, -39708, -16283, -11248, 11420, 14735, -20087, -10815, 19067, 14283, 3848, 9713, 5400, -6194, -14368, -31934, 31652, 54402, 14592, -1369, -69, -11265, -20035, -6534, 17675, 15156]
7523A5156m1466j7247j051j5910J5861K1108J3635K0477P836N974J4038k2621
7511A5790j6663r059K6086J2342j5970J6367J7020j9906k2931m287K6887j18l3883
7498h325l208j3818K2422L7368n058k3706j2756Q254k221O064j6728L729L5339
7485B7356R302l0445k0950r527L625J0546J0560k2512L58L125j34Q500j2640l7141
7471e9977o5J0720L200P06k5299n705J5392k715k1724J8341K3677K1240k0367
7458d2576l482R455O116p697J2479J2276j2223j2742J3740J8697J2388j4216J861
7445e924O117j0319J1013p321j1052R929q934K73m93Q619L0634J3744r708p978
7431A8600K4117n891K48j7840k4945j6524p596O785J5038O115Q017p317j3332
$$ y = [15156, -26310, -43557, -44608, -60518, -44657, -23549, -9914, 10563, 18399, 24373, 38411, 15790, -873, -9932, 16154, 28496, 12526, 28893, 45913, 26007, 3076, -1211, 25676, 25558, -8325, -11533, -25351, -2929, 34439, 29381, 5675, -7081, 1173, -1048, 5016, -11712, -7983, 27356, 36658, 6213, -14737, -24264, -20639, -10093, 467, -22045, -21687, -18562, -18696, -10196, -22836, -59977, -60042, -49322, -46122, -45416, -70715, -76420, -61028, -63743, -85467, -67126, -43449, -22209, -42576, -46058, -36603, -30487, -38184, -25705, -13429, -25652, -38394, -24654, -5957, 6431, -7785, -5924, 193, -10126, 887, -6434, -17486, -7557, -16491, -16218, -16711, -8092, 22542, 36286, 26578, 18600, 42717, 36826, 37074, 19234, -5711, -22235, -29831, -23046, -8008, -1893, 6124, -1193, -14525]
7418a4525K1372l115l3851K437L0526J0845O387j9575j9444J5312K0626j430M917
7405B0482k6577J5612J0890j2160l173O85j0899j1121M1178q273l0467J4418p31
7392a36k4888o547j2682L0681J2821J0867n472k861O364R900j5078k1242n170
7379b3443k4647J1593K7065J7288q69m390j7132L146p204j5002J9886k7299L276
7366c7732K6280O469J9605q062j6168l573J3383K9367j97j7349j3849j4045p76
7353a6647j9713o488L1367q076k0694K4765M832j5088J1988N513j6455j2828J1548
7340b5976J0555j042j5029o982l7941r382k892K4629K7921L364Q991n415k4348
7327e3547L2182J3104J562o746j9437L770N7257J4920m4979m4260J2672j4153
$$ y = [-14525, 6847, 3732, -30119, -27682, 2844, 13689, 20076, 501, -18943, -3631, 16995, 15565, 20482, -6095, 9517, 20407, 8247, 5074, 5759, -5140, -16261, 24917, 16644, -13823, 595, -136, -25024, -31571, -44253, -13572, -751, 10116, 4644, 1783, 8147, 18047, 2969, -18273, -23443, -48090, -36497, -9432, 7856, 6987, 2597, -14535, -11389, -18593, -33595, -13709, -41008, -37732, -11452, -4983, 14622, 6560, -9608, -13181, 202, 29569, 29372, 12023, -1826, -15871, -16647, -36360, -42848, -11481, -19557, -40251, -15486, -10654, -25742, -13754, -8241, -24696, -37524, -25976, -15421, -16463, -31492, -38474, -76415, -85797, -88689, -64060, -36139, -32775, -23784, -29199, -53547, -21365, -8261, -6699, -13445, -32882, -29112, 28145, 43065, -1914, -46174, -33502, -47655]
7315d7655R350J4760J2321O551l8873r843R765J5535P58L750j5349m17k2712J3596
7301d8463J1169J9979q591l33J4564l946L3050O545n0258k408L4788J7651j9029
7288D718k2960P826J5143J5132k1622o08J9955N91k1774k381K2648Q372j6670
7275H370j6428N237p08J8244l382j1316m20o665m21P37k4891j7251L3714P033
7261h147P064M214j273j8448k2428M289n320j4082K931J8063K9718J0025J0874
7248A7480j0818J0919K2794j6408k7733k7722j0330O665K7463O589p132Q066K2187
7235B2020n3222k4580L1804n28k4447J0728K8081L1388l290k8389q053J5491L64
7222b633o07L772j1811J0286j1519k0789N885O01k549J0044j7328j6294j5483
$$ y = [-47655, -38305, -23545, -11224, -4673, -43546, -53389, -43624, -28089, -27331, -23581, -38930, -39347, -62059, -48463, -37294, -17315, -25906, -26239, -11675, -15621, 17429, 23974, -26284, -28692, 6096, 23747, 4718, -18242, -10416, 4727, 19859, -1763, -2371, 17584, 18175, -3599, -5980, 16668, 25040, 8370, -8058, -2821, -3529, 14715, 11333, 17, -403, -7068, -7489, -6752, -31643, -48894, -15180, -8147, -1083, 3131, 1858, -16590, -39018, -34729, -40049, -54131, -51200, -33137, -3419, 6606, 17480, 6662, 17581, 40375, 23967, -3766, -31488, -41818, -35153, -7690, -1101, -8233, -167, 22020, -31202, -55782, -23978, -24506, -48953, -38225, -10144, 21244, 17954, -10435, -18488, -2997, -2633, -3240, 532, -11279, -993, -12512, -33301, -27416, -26815, -29364, -19320, -36648, -52942, -68425]
7209f8425L5102L1153R929M142J3191P706m543L756p802o988j0547o518L404R995
7195A3555j8766R319r299J2185j6690l0761K7947o441j5540j994R99l0246k8190
7182i3922K4432K7675L5166m2822o525L9870J8352l986o635j0226j7057p311j7081
7169f0070j6955k9718J2279O375M737J8720L2557K4591K9682Q83k7025k7735J4669
7156a7010J5581k4034j0874j069j632K771O751J388J491j5327K0595j382K732
7143b0019j6137J9348J0925n221L646J0331l099k4405k223j7169j2594K6947M015
7130b5655m492k299q480N936n500K0273N969o437O93Q486k6888l2380J2095R38
7116e7741K1153L2539L8929k0984j3480j1442n037L189J7748J6567j3654q674
$$ y = [-68425, -33323, -2170, 7759, 11901, 25092, 32798, 28255, 32011, 24209, 17221, 6674, 156, 3560, 13555, -5211, 4108, -5191, 6994, -9696, -40457, -12510, -18951, -34491, -36485, -35486, -65732, -93922, -69490, -41815, -6649, -49471, -55996, -16126, 2226, -1760, -8395, -18621, -35678, -42989, -60070, -77025, -106743, -94464, -88089, -83352, -64632, -32075, -7484, 22198, 23081, -3944, -31679, -17010, -1429, -25463, -36337, -37406, -39038, -36267, -29516, -28128, -26637, -41964, -21369, -22751, -20019, -36156, -16808, -5883, -11104, -7458, 2873, -226, -24631, -26854, -44023, -56617, -29670, -25655, -30147, -32446, -40926, -34990, -40490, -20217, -14248, -20685, -19992, -11506, -38394, -70774, -58679, -57741, -36588, -4049, 34880, 13896, 416, -11026, -16063, -12874, 4874, 21441, 7787, -887]
7104h87r272j4300m823J1578K176j0502M803Q436j2192P955K2325K9984j3406
7091B1875j371j3546M849k263K773R322j0241K513j486l3346m669J2917O591p187
7077a3269L206K3107r586L518J260q815J209l797k6005P602j2744j0708K3657
7064b1365J6073J9315M84J6347P649k3895k1200k81n465k1132J1115K7336Q96
7051E877k9418j3686j15N217Q645l0020j426K9146r575j3540K733L902R326P797
7037b5137J083l3421J2854M2492K247k4167j6150P080l420k1552m404k623q321
7024g3439J9101K6355P028L6729K251m1387N174M9719j0061k8679J1535K0566
7012B4892j1373R877n46o25r880R809Q519k9550l7674J0022J818k8860J0250J9143
$$ y = [-887, -10159, -24459, -29282, -17704, -15528, -26030, -21227, -12791, -24983, -17028, 5297, 35281, 21875, 20504, 6958, 11807, 9544, 12317, 21639, 11398, 13911, 12425, -20921, -25590, -12673, -6082, -13269, -10063, 13044, 3458, 6976, 8236, -579, 630, -3167, -29172, -21570, -34314, -45022, -21365, -5292, 14023, 14507, 30854, 38503, 14608, -6592, -6873, -12338, -33470, -22355, 4981, 5877, -23541, -37227, -37342, -32125, -23480, -53500, -54926, -25780, -35355, -48895, -46162, -42260, -32934, -25137, -24054, -57475, -44621, -2129, 118, -24049, -40199, -33119, -36539, -58091, -62495, -65118, -73439, -54338, -27983, -20955, 15774, 18025, -23362, -18188, 31531, 21470, -7209, 4326, 24892, 13519, 23396, 22850, 22225, 12345, 22154, 30673, 1123, -36551, -26529, -24711, -53571, -43321, -24178]
6998b4178j9586J6316K1416M833k881j177j2689j4649O543J5022K8785M910j6514
6985F151m885j1447J0514K1270k4106l5369J3183J0926k3204j3199j0856K317
6973e8705m798R810L3008M1060J0154J2998j6440k578q141m949K224k3388J0654
6960I09j2707k0279R923J330J4827L0857Q711l2565j6972j1519m7804k1338K7301
6947f9326O3319j0195k6417R295J002J4443k980J9838J6783K0437l2412j5724
6935a1937n92R050M942l971K405p418J8075L5258l148j5687j351j5753J9286Q264
6921C7423J0868l2226m2626m733J9820L307R331L9585n335m6847l8709K5698L0888
6908F444J1075j3507k6188J711R542j5029k8657j8303N854M8556K3174K5834k1025
$$ y = [-24178, -43764, -27448, -6032, -1199, -4080, -5257, -17946, -32595, -26052, -11030, 17755, 22665, 6151, 1266, -10181, 333, 21603, -2503, -37872, -24689, -13763, -36967, -50166, -61022, -58705, -63503, -53693, -20685, 20375, 30529, 43527, 27087, 24509, 16368, 11419, 13643, -9745, 909, -11798, -32077, -22154, -20824, -5997, 24860, 33571, 1006, -15966, -27485, -75289, -96627, -69326, -6007, -16202, -42619, -33324, -32322, -17879, -20859, -1021, 15762, 36199, 3787, -11937, -12529, -3479, 1463, -2508, -103, -7521, 10554, 45812, 42664, 26977, 25626, 9873, 29159, 37423, 48291, 16065, -26561, -31294, -11474, -8167, 1164, 40749, 35414, -11433, -50142, -24444, 6444, 17519, 4012, -22176, -20465, -10923, -25952, -54609, -72912, -67058, -18502, 4672, 30506, 9481]
6895I481j6436n542j63K4937j0214m0696j6791o331J374K6782J0790J7270J7544
6882A2005j5756l2487k619K2845l80j4045l285k7145k1114K2565K9606K5414J262
6869c134K04l935J022m3299K594J4296N258K395O751l2850j4596K5973J8620R252
6855a1449j8897L4068l402o9370K5650M2928K472Q651j839R805J5448M278k1966
6842A6377o358J720l561j3512p880n987j93L7348J397l1641p788k209K2231j0151
6828a0207m931P738j9424k1359m753M1130L5072M4207J5664k3757k4761J1669
6816D6288J7366j9059k4290J926j8280j0770J4208j5698k505j7270q787q343J2666
6803c2548L3983J2447j2654J6154L602l692n877k9266o935K2154J772k4402N982
$$ y = [9481, -6955, -12497, -12660, 12277, 2063, -38633, -55424, -61755, -60381, -33599, -22809, -5539, 12005, -3751, -36238, -38857, -16012, -16392, -30437, -33722, -60867, -81981, -59416, -29810, -4396, -3134, -2930, -6865, -5843, -49142, -46548, -32252, -26994, -24599, -17848, -50698, -65294, -39321, -20701, -11449, -30346, 3722, 320, -69050, -43400, -472, 2000, 10651, 8812, 18617, 34065, 38343, 16377, 10019, 11739, 8178, -5334, -13214, -19201, -19394, 17954, 19351, -12290, -20078, -22287, -56, -10207, -15138, -7400, -26824, -48183, -52936, -11806, 23266, 67473, 83137, 59380, 34619, 46288, 63654, 44595, 20305, 22231, 3951, -6819, 7389, -8309, -10814, -28084, -36871, -45214, -32548, 1435, 13882, 1228, 17382, 20984, 17292, 11415, -17851, -24786, -2632, -860, -25262, -19280]
6790a9280j3423l3202L0279J7882J2098M184J6082K8160m2616j0980q28K945J4124
6777E425k6740k5115K732J9562L5336K8149l1074j4954k2360L840O2609j6444
6765B0966m0347j0290l541L90k7l979j7691j4101J3207J7373J9782P11R346R193
6751I92j1991p128J6233J3976M851q695N73R314L1263j6120o776Q586M5576J9836
6737A00490k1280P528M39k8974j8343j0173K3359k8K341m964K6697N5254L3101
6724A65447K0735k4847P417K9419N3142P7396Q8594J25942J88010K77634M19478
6713A428367N13716K11478l06403m80918m71267l49893k00487j09686n1294k5392
6703A58221m1489m3574j8940n304k7754J2746K0774j0998m156j1813O562K5949
$$ y = [-19280, -32703, -65905, -35626, -17744, -5646, -1462, 14620, 42780, 164, -10816, -11644, -8699, 5425, -21315, -46430, -43698, -24136, 11200, 39349, 8275, -6679, -29039, -25199, 37410, 20966, -19381, -29671, -33212, -32822, -32849, -36828, -54519, -68620, -55413, -38040, -18258, -17547, -8201, 992, -10999, -18127, -1894, 12082, 16933, 8238, 8811, 18125, 49388, 33268, 26492, 35078, 80654, 100490, 79210, 86738, 87177, 58203, 39860, 29687, 53046, 53018, 55359, 50395, 77092, 132346, 165447, 186182, 161335, 168752, 198171, 251313, 328709, 417303, 543245, 731255, 1008889, 1428367, 1942083, 2153561, 1847158, 1366240, 894973, 545080, 344593, 234907, 183613, 158221, 116732, 73158, 54218, 48914, 21160, 33906, 54680, 43682, 39526, 27713, 34275, 60224]
6691F0224Q331K718j3717n1123m67J2436n733j1276l0392J6295J9890r057o152
6678h023j0847K2464L9229m1838k1271J54j4001P999j7650K876K0370o493k6837
6665e3868J9124L0451L749O601l3840r34o03j1466J3978K0755L0151j7897J134
6652G335l536j6156l1856k0614J4349K1800J3581K865k031O944J1305j8404L5495
6639B1077R136k3730l0546k8999J736K3287K70J1291J860N425j4015o967J2174
6626a8001L582M998j5678K5355k921j6419j9540P868K1098N639O958j1938p946
6613a6945J8955K1830k115K0785J5699k6207k4276k0883K2880L256k1200K00j1153
6600a9174m487m989J4285J9339j8134j0759L4629J3297l160j3002j5761J0715
$$ y = [60224, 68555, 71273, 57556, 6433, 5966, 18402, 12669, 1393, -28999, -12704, 7186, -1871, -8023, -18870, 3594, 42823, 985, -20286, -20132, -34133, -26134, -43784, -40908, -20538, -27031, -53868, -34744, -4293, -544, 6057, -27783, -28717, -29320, -40786, -26808, -6053, 24098, 6201, 7335, 3799, -12357, -44213, -64827, -50478, -28678, -15097, -12232, -14263, -7319, 3986, -14418, 21077, 30213, 6483, -24063, -53062, -51326, -28039, -27769, -16478, -14618, -9193, -23208, -30175, -18001, -14419, -9421, -25099, 256, -2665, -19084, -38624, -30756, -9658, -4019, 2939, -8999, -16945, 2010, 23840, 21725, 42510, 58209, 32002, 7726, -13157, 9723, 12979, -8221, -8021, -19174, -23661, -28650, -14365, 4974, -13160, -23919, 10710, 24007, 20847, 7845, -7916, 2799]
6588B799J3082O553P119j1622M215k8239k9037k5867n445J8169J4300M377K7204
6575b392j9431j9395j4705j3617J7202o192j945K0428j0328J6272K5036L1586
6563B2519l0866n5231K3319K7999j2155m361M5312Q633j478J4407N16l8872l4280
6550c4538N755J7567J860J2006m456o714k1932K1490M9183k171l1078j8102j4454
6537b5584k0374l349K0566K3852k0807j1125r24J7985J4953J6953j9901j9582
6525b7337L719j6237q673k5234P410K5217q650j8268J5791o238K2264N656K7127
6512c453J6426J5180K0617k6939j6747P120l239j6945k5496m830J6293K2712r412
6499h713l3253J7782J6240L889m718q936K663j076K6058k5856j2021L0606J4212
$$ y = [2799, 15881, 22434, 29553, 17931, 22146, -6093, -35130, -60997, -66442, -48273, -33973, -29596, -2392, -21823, -41218, -55923, -69540, -52338, -58530, -60475, -40047, -50375, -34103, -9067, 22519, -8347, -63578, -40259, -12260, -24415, -28776, 16536, 25169, 23691, 38098, 38614, -258, -34538, -28783, -11216, -9356, 2650, -1806, -8520, -30452, -8962, 40221, 38050, 6972, -11130, -25584, -45958, -49307, -28741, -4889, -25696, -36821, -37745, -19760, -4807, 12146, -7755, -27337, -23618, -39855, -48528, -73762, -66352, -41135, -49785, -68053, -52262, -58500, -36236, -30580, -3453, 12973, 28153, 48770, 21831, 5084, 12204, 8965, -7980, -33476, -38306, -22013, 699, -8713, -41966, -24184, -7944, -4055, -8773, -17709, -15046, -16122, 9936, -15920, -27941, 2665, 16877]
6486A6877j1127q327j6801Q917j7835q123J0299O725M1498J2704R565k3730m3428
6473b2786L431r938K5218L2346q322j1828N453o226l1921M568N464J2109m17K828
6459b1J4402k933K445l5975k3825J1037J1181J2068K332j0973k7120J3177R341
6446b4864k2157j7695n155o241L8477J0796L1624J2872j2240j8942j2299K527
6434b3297k365l695j3614q152J6053L2592J5832l604J3422o552O036p983q147
6421F526l6508k1777Q602j3475q481K9421M1404m270o597K1988k9110k9087k3786
6408f5150j2361J8348Q825j7380J5426J6892J8933J5912L579l8223K3442M5755
6396C3998N208o696k3614p828R988k1330O630k0112k4059n284k2690P459K1042
$$ y = [16877, 5750, -2577, -19378, -10461, -28296, -36419, -26120, -19395, 22103, 34807, 44372, 20642, -22786, -19355, -29293, -4075, 28271, 19949, 8121, 13574, 7348, -24573, -20005, -14541, -2432, -2849, -21, 14381, 11448, 13893, -22082, -45907, -34870, -23689, -11621, -9289, -20262, -47382, -34205, -24864, -47021, -64716, -69871, -76112, -37635, -26839, 4785, 17657, 5417, -13525, -25824, -23297, -25662, -29357, -42971, -51123, -35070, -2478, 13354, 9750, 23172, 16620, 22656, 14673, 6526, -29982, -51759, -43157, -56632, -65113, -35692, 5712, 1442, -5155, 16833, -12277, -41364, -65150, -77511, -59163, -50338, -67718, -52292, -35400, -16467, -555, 3024, -35199, -11757, 33998, 39206, 32510, 8896, 1068, 11056, -10274, -3644, -23756, -47815, -53099, -75789, -68330, -47288]
6383d7288J8323j5264K9141r922L810K5295k292k7080p738K0156r012J3673N5033
6370D6835k2017l8134j1400m155q08j5817o350M465J3946k1722J1016L9699J9186
6357A4744R537j8517j4886k7291m3428j3205L6683N3777J8447k6962q087J518
6345a7670j384J1972k6861J998M3105r098q782Q20o931K8321J1338J2952J0798
6332E0578n656K702j9333l859j5221o526j0711P643J6802J0612o047j6749J542
6319E777O774K067k0447J639o080P715L0826l272l0775j4548j4856J353m565K6934
6305a1458K1061j4344l1617k489P721j6922M913M1179J1241j9911J129k1683J4376
6292a6804K0114k0920j6434K6143r60k7081Q6J9699J0902l234J9219L2312M383
$$ y = [-47288, -28965, -44229, -15088, -25010, -21200, 4095, 1803, -25277, -33015, -12859, -21871, -8198, 46835, 24818, -13316, -24716, -28871, -29679, -45496, -51846, -47381, -33435, -55157, -44141, -4442, 14744, 24281, 5764, -9122, -36413, -79841, -93046, -56363, -2586, 15861, -11101, -19188, -17670, -19054, -7082, -33943, -31945, 11160, 2062, -6720, -5900, -12831, 15490, 26828, 39780, 50578, 44922, 47624, 28291, 24432, 9211, 2685, -8026, -383, 16419, 27031, 20984, 4235, 5777, 12551, 14618, -5829, -4190, -10270, -2555, 28271, 24999, -5776, -20324, -35180, -33827, -38392, -11458, 9603, -4741, -36358, -38847, -31126, -48048, -43135, -1956, 9285, -10626, -9497, -31180, -16804, 3310, -17610, -34044, -7901, -8861, -35942, -35856, -16157, -5255, -8489, 10730, 43042, 47425]
6279D7425l0327j8215p781O852n469l966N892O897Q173J3026K9584j2701l2520
6266F870m1759l429J497m090J3723j469p438p494O136J2662L8597O080j0667M477
6252A3696J8194J3583j3557k1700l5024m7719K3417K2420M896J0120L4115k3898
6240a457r336q25j3217K6009J2608K622n51J8298K940L048k5617J5886K8655M869
6226F3932k7877l2884j951J890j5817j0051k1859q73J7816J2613j7866k3867P185
6213d9609O886j5354n353J6436j2449j8212j8830q09J5670L3074L3871J6567R736
6200A1624J003L873j7052N398o702p889j4012K4162L613j6955m0876J1835K6518
6187a5460L1775l174m5043j8742q5J9403J1269M979J7820M828N774k4044r299
$$ y = [47425, 17098, -1117, -8898, -2046, -7515, -11481, -5589, 1308, 9481, 22507, 52091, 39390, 6870, -34889, -38318, -36821, -40911, -27188, -28657, -36095, -43589, -37453, -24791, 13806, 19886, 9219, 13696, 31890, 45473, 31916, 10216, -24808, -72527, -49110, -26690, -21794, -11674, 22441, -1457, -10793, -11618, -24835, 1174, 13782, 16404, 15853, 34151, 37091, 40139, 14522, 30408, 59063, 63932, 36055, 3171, 1220, 3110, -12707, -22758, -44617, -45490, -27674, -15061, -32927, -56794, -49609, -42723, -58077, -63430, -46994, -59443, -77655, -96485, -97294, -81624, -48550, -14679, 1888, 11624, 12627, 16500, -552, 4846, -1856, -9745, -23757, 405, 4018, -12937, -53813, -41978, -15460, 16315, 13141, -31902, -50644, -50729, -31326, -20057, -15078, 2742, 7570, 13344, -10700, -19999]
6174a9999L4991J3994o798J4495J405k2652o672J440n579k0003j2682k6220L959
6161e0321j4776n407j6936l259M1088J7260j715L3139L9840K57j8766k2155m2165
6148d3916J2169K9330j8355M386m712J2139J8976J1474n142j0444o074j2088N093
6135g164k668m716K756o939l3137J432m858j757J6518K1286J2068m194K0234O466
6121A5327j5861k2150k8761N197R059r220n69k62J4662K4094O375q666R768L7183
6107C6176M604m701k6074l9888j8044m52n033J522L2249J1535k12P608L3528K6297
6093E9115l80l6003k9035m1639j4865J9214L2106K596j0766L857M024M984J4010
6080G218m027l2786j3484L958M1027J4520J1394k9762j2289M588K3040J0734m812
$$ y = [-19999, 14992, 28986, 22188, 36683, 38088, 15436, 8764, 10204, 4625, -15378, -28060, -54280, -50321, -65097, -70504, -87440, -90699, -49611, -32351, -34066, -927, 38913, 39170, 20404, -1751, -43916, -31747, -2417, -20772, -16386, -21098, -8959, 10017, 21491, 16349, 5905, -169, -12257, -7164, -9832, -14548, -11792, -18731, -51868, -50436, -55294, -57051, -40533, -19247, -7179, -11373, 8861, 15327, -534, -22684, -51445, -46248, -37189, -46409, -46978, -47240, -32578, -8484, -2109, -10775, -1007, 36176, 40780, 36079, 10005, -29883, -47927, -48379, -53412, -51890, -19641, -8106, -8318, -710, 32818, 59115, 58735, 22732, -6303, -47942, -62807, -43593, -11487, -8891, -19657, -15800, -11776, -6792, 7218, 3191, -29595, -43079, -39121, 1906, 16426, 27820, -1942, -14231, -9643, 13397, 24131, 19319]
6067A9319n485j5380K742O378p948L104J9453P006k3469r697M856R054R42j2296
6053a421m090j6156k3774K691J7606Q812p04o934j0064P449M4092P452k0213k9152
6039b4406K287N004k0242j5493J9562N4877L854k3572k5275K7266K8964o104l4843
6026h121P105j0669j6688j811K8911p456j1032k0354k1241J2907P222k2173q395
6013g1795L153K5663J8692j5358p955J6710p659j6237q521r956J9786J0409R863
6000c3205J7960R700L326R031j2329n620j1654L865N259l4637r878L0414l595
5987c1363J44O808J3086k169m051k2170n985J0181J0754J1645J6898q669j01j1278
5973a6270J9038l1751K1019L3688n598k7238j2992k440o411J6681j402K1877j477
$$ y = [19319, 13834, -1546, 1196, 7574, -374, 2730, 22183, 29189, 5720, -3977, 879, 9933, 10875, -1421, -5511, -21667, -45441, -42750, -25144, -16332, -17036, -23970, -34034, -26585, 17507, 24959, 4746, -24406, -22119, -17115, -37357, -52850, -33288, 21589, 25443, 1871, -23404, 3862, 32826, 26722, -8121, -1016, -11685, -28373, -30184, -1273, -8729, -19761, -40115, -61356, -48449, -41227, -63400, -71795, -68642, -42979, -24287, -39645, -47600, -30890, -38549, -54786, -63307, -73263, -53477, -43068, -33205, -15245, -5545, -2219, 6812, -5517, -11137, -22791, -18926, -13667, -48304, -58182, -27768, -31363, -31219, -24411, -11325, -13494, -17545, -39715, -45700, -35519, -24765, -13120, 3778, -4891, -4992, -16270, 2768, -28983, -7964, 25724, 20126, -7112, -20104, -22544, -28955, -12274, -13676, 8201, 6724]
5960F724N113Q621j4941j7915j6638L19R885J0209j9726M649j813j0817Q267o465
5946c4528L025J4041J7308O214K1656J6311m4998j9986m858R385k644L7459J2375
5933C0760l5158j8579L440J4009k3724j132j0171J8075M0144N837l974k897r549
5920G081K255j7700m8247J2107P197k0501P011J405R085K2749J2366L730m742
5907f204l3776N995L4561r196K0917K6432k1602k8083k2857j2652J7620J1094
5895a7751j2761Q17J8419J7319k2012J2192j1754k200J3062J4607J8580J2426
5883D0944J5148j0106k0621l1228k0554K1112j7382m759L492L3452J2928K732
5871B5158J7256j2704k5974l3088P466J2832l2955j9506M4394K183j7704k549
$$ y = [6724, 11837, 20458, 5517, -12398, -29036, -28717, -18832, -8623, -28349, -23700, -25513, -36330, -28063, -34528, -31503, -17462, -154, 6060, 27716, 44027, -971, -20957, -25815, -16430, -19074, 18385, 30760, -4398, -22977, -19537, -5528, -29252, -30384, -40555, -22480, 17664, 23501, 19527, 16630, 7081, 9336, -8364, -56611, -44504, -37307, -57808, -50797, -49392, -40307, -17558, -5192, -1462, -6204, -39980, -33985, 576, -8620, 12297, 38729, 17127, -10956, -33813, -46465, -28845, -17751, -30512, -29695, -11276, 6043, -15969, -3777, -15531, -17731, -4669, 9938, 28518, 40944, 56092, 45986, 25365, -5863, -26417, -5305, -22687, -27446, -23954, 9498, 22426, 25158, 42414, 29710, 3736, -29352, -21886, -9054, -42009, -61515, -17121, -14938, -32642, -35191]
5859c5191K2794J5503J8489n973k3893K842J6180L716k9402j2698j9063k9165
5847g5861l252L5808M963j5447J1369o647L4855J4870k0562J5315J5937N083N113
5834B1544j3648R029J5307n772p535p027j5429j9472Q66o900o677n377L5914k463
5820g640q723O603j3039K6815R106l2067q620Q007q621M1502L927j2484q708L8146
5806C4204J9418j7826k972p359j86j5043j1981K205j0692O622j4007P682J8548
5793H613n773J7018k4816K120Q351o875O629P363L6305l923l8116j4496j5421
5780b3021R054j5814j7020J8831J8049p750q996j0396K0002J8278k1622j0041
5768c0446J7816J0050K011k0953j5006K3633K179j6082j0483M585q276j1186Q542
$$ y = [-35191, -12397, 3106, 21595, 15622, -8271, -5429, 10751, 14467, -14935, -27633, -46696, -75861, -79113, -43305, -38342, -53789, -42420, -49067, -14212, 658, -19904, -4589, 11348, 16431, 21544, 7896, 16925, 32232, 26460, 18925, 11898, -3531, -23003, -22137, -29037, -35714, -41091, -5177, -7640, -16363, -9760, -22799, 4016, 13122, -18945, -27565, -19558, -28179, 13323, 17250, 4766, -3942, 34204, 53622, 35796, 32824, 25465, 25279, 10236, -1745, 460, -10232, -3610, -17617, -9935, 8613, 2840, 19858, -4958, -2838, 5513, -1362, 5267, 12630, 48935, 45012, 6896, -7600, -23021, -13967, -29781, -46801, -27970, -9921, -17671, -26667, -37063, -17061, 1217, -20405, -30446, -12630, -2580, -569, -21522, -36528, -12895, -10716, -26798, -37281, -32696, -40972, -52158, -43616]
5755d3616J5647J8125J871L66o907Q498J8044L406K74Q817j3638l4617o198j2318
5741d2246N967j2517r165P204K7410L6765j8720l5884J9297L4486L883J3983J2530
5728D2993j7983j2201K054N32l1851l3704N068N618j9199J873j5662J5836J4030
5715d2596m430J0606K0892J2896j9300q752k7889J9979K6075j8405j0308K255
5703c8977J7238L9730P871o169l5833l0153N2671K6508j0812l1060l3277j9009
5691f1272J4486J0857L3437K144O138r849M037r058o689M3931K8926m2819m4363
5678c0094l420r013R281M3135J3813Q936m0854l3874K4921j0405j9225k2565J8239
5665e1125J8757q035k4715j3793p329L350P982K5913J996J4281K2004N677J3729
$$ y = [-43616, -27969, -9844, -7973, -7607, -14514, -6016, 12028, 15434, 15708, 24525, 10887, -23730, -29928, -42246, -36279, -48796, -57961, -50757, -23347, 13418, -5302, -41186, -21889, 12597, 16480, 30463, 42993, 25010, 12809, 14863, 15395, -16456, -50160, -45092, -39474, -58673, -56800, -72462, -56626, -42596, -47026, -36420, -15528, -2632, -21932, -30684, -58573, -38594, -12519, -30924, -41232, -38977, -21739, 17991, 25862, 19693, -16140, -46293, 6378, 32886, 22074, -8986, -42263, -61272, -46786, -35929, -2492, -348, 5790, -4059, -22, -9080, -15769, 28162, 57088, 14269, -30094, -33514, -42527, -33246, 9889, 23702, 32638, -8216, -42090, -17169, -27574, -46799, -69364, -51125, -32368, -40403, -65118, -78911, -86240, -82890, -74908, -48995, -46999, -32718, -10714, -5037, 8692]
5652H692j0909k6482l5628j6211K9591L6310n273j193l6474O672r538M653L0264
5639b5526K3615L890j2317P652J2031n374J4426j0772r073R169n672j3187k7369
5626c8507k3097J6222j201j1502L5342K7555O536k4490K5144J7535k0192k0836
5614a1491q66J0010k3044J7363q210j4579n002m291j7183J3297L97k1387J5906
5601d9080L9934j0197l2604J7523J4068J5654j4271k6428J9555n253n409J2372
5589b4136m186L845j4396K0770J2335l1644k7331J2905K8738L0583J3017j354
5577A9146k8787j6436O748K3343K6343J6648L243l4071j8012m276q857O345J9356
5564A0733j4400N498p828j2620J255j6787j2512p14J0329K4526K1660N144J3720
$$ y = [8692, -2217, -28699, -64327, -80538, -50947, -14637, -19910, -21103, -57577, -50905, -60443, -55790, -25526, -1911, 1979, -10338, -2686, 9345, 3971, 18397, 7625, -1448, 7721, 2049, -11138, -38507, -61604, -45382, -46583, -58085, -22743, 4812, 11348, -13142, 12002, 29537, 9345, -11491, -12357, -2347, -25391, -8028, -16238, -30817, -35819, -40110, -57293, -43996, -43599, -64986, -49080, -9146, -19343, -51947, -34424, -20356, -4702, -18973, -45401, -25846, -31099, -36508, -24136, -28322, -24477, -38873, -18103, -5768, -37412, -64743, -51838, -23100, 7483, 20500, 19146, -9641, -26077, -19329, 4014, 30357, 47005, 50248, 16177, -1835, -6111, -14968, -8623, 10733, -3667, 1831, -5997, -18617, -17362, -34149, -46661, -47375, -37046, -12520, 9140, 14284, 28004]
5551B8004l054k7922j5244J0100R726K308j9211J73N720R955J5928J9049K5109
5538F0641j0822j9594l0347n559R59O226J5500J4935p465k3811k620J0824J1930
5525B0797N144k4833l0839Q500l08j4809J3821J4614j408m469K9305N882j4071
5512G326k8631P836K145l079L8864J3718J4536N385j5464l1034k0462k6677J4216
5499b1321j563K929K0817L297q0J8434J499j7821n6340m055J9088k231j5769P067
5485d6049J7356L5654l1644p120k7899l0565j6176K2352K9941l848l481J2909
5473d8570m198L049q57q156J5836L0050O113k379J6122j8603k8313J0041J9564
5460a0301J3117J6640J5895M980l913j8099k3196r645p214k6144J6563k867j9526
$$ y = [28004, 24950, -2972, -18216, -8116, 1610, 3918, -15293, -15120, -9400, 555, 16483, 35532, 60641, 49819, 30225, -122, -5681, -4722, 1504, 17004, 31939, 24474, 663, -1957, 8867, 20797, 25941, 1108, -29731, -21231, -21539, -36348, -22527, -7913, -9321, -13790, 15515, 21397, 7326, -21305, -13469, -11324, -14403, 24461, 38179, 52715, 58100, 42636, 11602, -8860, -35537, -21321, -22884, -19955, 862, 4159, 4079, 22513, 24012, 6191, -50149, -54204, -35116, -37347, -53116, -46049, -28693, 6961, -24683, -31803, -59702, -90267, -106443, -84091, -54150, -57998, -61479, -48570, -52768, -49719, -50576, -58732, -42896, -12846, -6733, -9112, 7010, -11593, -39906, -29865, -10301, 2816, 19456, 35351, 40331, 36418, 18319, -4877, -14522, -21736, -47880, -31317, -34184, -53710]
5447e3710L0890j436Q389N04m554j9122J6844J6320p317l114N308J202J1250m558
5433c104j9239j9296R454K7250L906o399p91J4081M4691N497k9203n0581Q802
5420a4932J1209m265k4788J240K3452L4128K2012K458N170j53q30k5276r500j1816
5406H109k0943J729p54j624J2435J6905K9833k7906R40n077J966j0766M140j7428
5392h441r80k7598K7534Q069o196N92J0165Q107k2677l8289L1140K5992K0899
5379B8317k5947j8838n007j4789n907o534j9322j0097o888J7230K4288q416j1225
5366f3135J7841K0289j7616N543M231M947J5787K6011j990j9702k1261p175K2003
5353a4227J7493K040j1114l24L0609K3364j8835k1163o714L4163J6937J1018J6929
$$ y = [-53710, -22820, -24256, -15867, -15363, -19917, -39039, -22195, -5875, -13192, -16306, -10998, -9796, 1454, -3104, -22343, -41639, -32185, -4935, -1029, -7428, -8219, 5862, 50553, 56050, 26847, -23734, -14932, -3723, -7988, -32776, -31536, -8084, 26044, 48056, 50514, 55684, 55531, 54701, 29425, 19925, 8109, -12834, -11105, -11859, -13483, -1048, 15857, 45690, 17784, 18724, 13647, 15613, 4847, 8987, -8441, -9421, -37019, -9485, -1416, -7612, -7020, 3145, 11252, -11425, -49714, -18574, 7418, 28317, 2370, -16468, -21475, -36264, -42171, -48705, -68027, -78124, -85012, -67782, -43494, -51910, -63135, -45294, -25005, -42621, -37078, -32847, -27900, -12113, 13898, 11908, -7794, -29055, -36230, -14227, 3266, 5306, -5808, -6132, 24477, 47841, 29006, 7843, 1129, 35292, 52229, 63247, 80176]
5340H0176k1389l1453k4749J3794K2154j4686K711j406l060Q681J8170J0421k9935
5327B9429L454l835j6315j602p219j0407K7715K851j4421k9917j4561J3782K6006
5314D960K0227l5509m299Q713j8100p639J6487J4635L972j6453L0665O420K099
5301B6178k6545R66J6348R844j8825n746K344l149j4729J4711M8224J8447l4086
5288C3982l8039j6266J6931q963j1213k445J7423P060N400M0589J0748m5111n904
5275D192j0688q288J2597K7507J1425l3426m7294j2017L6425L5150m606j4736
5263c759k6130L958L2873M5887K7260m0603p764j6650p286l2140Q373J4065q902
5250a0818J4420J6867j2376l7410n308L0925j5078r065K8612k0294n167L7144
$$ y = [80176, 58787, 27334, 2585, 16379, 38533, 23847, 26558, 25152, 22092, 30773, 48943, 59364, 29429, 32883, 29048, 12733, 11131, 3912, -6495, 21220, 24071, 9650, -20267, -34828, -21046, 4960, 25187, -10322, -14621, -5908, -24008, -31647, -15160, -525, 3447, -13006, 17659, 24079, 26178, -367, 599, 16947, 26791, 7966, 2220, 4564, 1415, -13314, 1397, 49621, 68068, 33982, -4057, -20323, -3392, -12355, -23568, -26013, -8590, -1530, 3870, 44459, 55207, 10096, 4192, -6496, -14784, -2187, 25320, 36745, 3319, -43975, -55992, -19567, 15583, 10977, -3759, -29889, -25931, 6942, 52829, 80089, 39486, 31722, 15072, 7786, -24354, -15981, -1916, -10818, 3602, 20469, 8093, -29317, -34625, -3700, -18778, -27843, 769, -19525, -24692, 12452]
5238A2452j5340q32r598j504J5962J628J8698J1214k5684k3520j14J2854L6092
5225C2308J3052j1343O955l8418k5802o337j2153M5130J3902j3995J7560J8835
5213C9694j9745k5766j3237j5379J4065R283j267R030n596n1578j7015J0344M5390
5200b1777Q885K340j5007l166K4796L0417j967o951j6312j3047l70p337k2615
5187d2111j7039R161K5423J2278J0994N00j2451K153j89p691j1999l690J517k3611
5173e6755j1248K2748L1704K56O827L483m288n053N462k7710j2936J511K0921
5160b5078o717j4827l5107K6705K7545K1250J4666p463K2745j817k7108J3115
5148G909l963p669j313k4690l1055J581J4555N080K3482J0166k8863j9577J4704
$$ y = [12452, -2888, -3720, -13318, -14822, 1140, 2768, 21466, 32680, 6996, -16524, -16638, -3784, 32308, 45360, 34017, 40972, 2554, -23248, -29585, -41738, 3392, 17294, 3299, 20859, 39694, 19949, -5817, -19054, -34433, -20368, -11085, -12352, -3322, -8918, -60496, -77511, -67167, -21777, -12892, -10552, -25559, -28725, -3929, 26488, 24521, 17570, 1258, -11789, -12159, -19496, -42111, -59150, -49989, -24566, -12288, -1294, -794, -13245, -11092, -11281, -18972, -30971, -34661, -33144, -56755, -68003, -45255, -13551, -13295, -6468, -2985, -7273, -12326, -6864, -34574, -47510, -45999, -25078, -31795, -46622, -81729, -55024, -27479, -6229, 8437, 974, 23719, 21902, -5206, 7909, 3946, -3723, -5036, -29726, -60781, -59200, -44645, -39565, -16083, -5917, -34780, -54357, -39653]
5135c9653J1577J823j774N243N604J3622O865R979k0894k3189k1393P046J840
5122d3304L1751q589j5312r845P684L538j1008J7279J703M709J0987o271p306
5109b3984q056J8340L2431k4674L167J6785J8970J2999R059j010k3189m824J8471
5096D4485O089j111j5855k4820K583k3155l1303M2484L1473k9971M425j0012k6509
5083c1197K518J8939M1510R716q284j6725N502k4538K3576Q142k834K2412k8307
5070B0430m0193j5109M2162R500j9770j470n229L671j5735k3529M0274K9945Q426
5057C3373P7k3475n393J1742J7499K1248k1115l1663j8660M156j939r373l763
5044b7286J1099J7309k138l0661k3213j998J2683K5193K5723J2674L478j2183
$$ y = [-39653, -28076, -26253, -28027, -22784, -17180, -3558, 3307, 13286, -7608, -30797, -52190, -45144, -43304, -11553, -20142, -35454, -45299, -37615, -34077, -45085, -27806, -26103, -21394, -10407, -16678, -23984, -32040, -13700, 18731, -5943, -2776, 14009, 32979, 45978, 55037, 54027, 30838, 26014, 44485, 50574, 49463, 33608, 8788, 11371, -11784, -43087, -603, 30870, 899, 5324, -4688, -31197, -28679, -9740, 31770, 41486, 33202, 16477, 21979, -2559, 21017, 29159, 26325, 48737, 20430, -19763, -34872, 7290, 16790, -2980, -4450, -9679, -6008, -21743, -45272, -4998, 24947, 33373, 33450, 9975, 4582, 16324, 33823, 55071, 33956, 2293, -16367, -12211, -14150, -23523, -27286, -16187, 1122, -1016, -31677, -54890, -56888, -44205, -19012, 6711, 19385, 22863, 10680]
5032A0680j2327m121k0686k9789J4465J4332K4720L3882K5404l2442m0451J303
5020a5030r16Q113R064J423J485K735r61l270k5153l6431J7349M3864J9035q732
5006A2575j3637m0011O917J5310J8631k8406j9394l756Q161J4737J5012m579o834
4993b5274K944K323n0818k2250q625r816Q700K0947L1462q877J2433R294k57N935
4979c1879K1726J9270j6638j7609j4821J3889K8403k6926j0400r066j2027J1921
4967d4157K6760N12L0263L6361L617j7281Q024l5197k8283R853O077J4536M457
4954A5542j1158k936J2078J185j0213M696j0426j8840K2437M0481K5154j7907
4942E0093m9667j8163n718L881k8410m772L5053K0923j389q452l87j2962L840
$$ y = [10680, -1647, -5768, -26454, -56243, -41778, -27446, -2726, 31156, 56560, 24118, -16333, -15030, -15946, -7833, 1231, 2654, 4139, 6874, 5913, 2643, -22510, -58941, -41592, 2272, 21307, 12575, -1062, -41073, -34156, -18846, -215, -28621, -48015, -51771, -43610, -28873, -13861, -18440, -25274, -22330, -20007, -70825, -93075, -101700, -111516, -102816, -81869, -50407, -59284, -46851, -37557, -37814, -31879, -10153, 9117, -7521, -25130, -39951, -26062, 2341, -24585, -34985, -44051, -56078, -44157, -17397, -16885, 13378, 49739, 53356, 36075, 44099, 8902, -19381, -9528, -3451, 11085, 15542, 4384, 1448, 13526, 14711, 4498, 9194, -1232, -20072, 2365, 42846, 68000, 50093, 426, -17737, -23455, -19574, -47984, -52756, -17703, 3220, 1831, -6621, -7008, -19970, -16130]
4929a6130K1839O4j5524n746k2545L669K1679K6107j0300j2963M211m864k503
4916a3006j1109j2043k3471J6443J0265m020q590J3956M171K7912l696j6612J8776
4903a024N996q339j468P202R101j4909J9624J1296p776j7514O524q697j2667j6686
4889b9337J6766K0330M422k1072m526k80j5611N890K6131L6231J1924l7821k8740
4876a5693J0419J591j4835p967l81Q043N4060R874n280K132j7485j2962j2647
4863a131m663J836k5353P422L9005J1846n676l7637n285l011O036K8829k935P540
4849A6823j3846K024J4606m3805j8029J5995m179J1522K4450l840j3125j4056
4837b5460l6032L7735J9938j3634j0874R021j1956j4355l305k552k3590K4589
$$ y = [-16130, 5709, 5773, -9751, -15497, -38042, -34373, -12694, 13413, 3113, -9850, -5639, -10503, -13006, -24115, -36158, -59629, -43186, -32921, -36941, -45531, -31575, -27404, 508, -3188, -19800, -1024, 4972, -3367, -4835, 2367, 11468, -3441, 16183, 27479, 19703, 2189, 8713, 16, -12651, -29337, -12571, 7759, 12181, -8891, -13417, -13697, -29308, -23418, 2713, 38944, 50868, 13047, -15693, -5274, -3683, -18518, -26485, -26866, -18823, 35237, 45111, 39831, 41963, 24478, 11516, -1131, -5794, -3958, -29311, -21889, 17116, 28962, 23286, -14351, -19636, -22647, -16611, 12218, 9283, 16823, 2977, 5001, 19607, -24198, -42227, -26232, -30411, -18889, 5561, 1721, -11404, -25460, -61492, -23757, -3819, -17453, -28327, -19306, -31262, -45617, -48922, -51474, -75064, -50475]
4825e0475K6123l268K650r996k2224K3296J8022Q906J0291j5073j1162K1825J8754
4812A7669R72l2197k56J4092p719j8789K3539O124j5089j5241K2709Q533K6111
4799C0458K9372k6943j463K8801m161N938m7079j6582o49l2836j3708N2970L6685
4786D0803n532k4236j4967O444J5648O742Q160j5453j6348j1623K1243J0771j2592
4773I060q390j551J8062K5423j509k9688r566J7347K476m75J0538K433j6759k2098
4759d697j2393k6666k3193L0612J28j2384m460O714K9736j1768l6000Q32L7583
4746b5956J5015L7686q895k5293k3069q519j550K9093J99M830N156J0731N097
4733A4525l7606N356K0794n182j5026p157l34J0121j6195r145K0908L3445j1293
$$ y = [-50475, -24352, -27620, -24970, -34966, -57190, -33894, -15872, -6966, 3325, -11748, -22910, -1085, 17669, 18641, -13556, -13812, 280, -7439, -26228, -2689, 3435, -11654, -26895, -4186, 4347, 30458, 59830, 32887, 31424, 60225, 56064, 62002, 14923, -1659, -2308, -35144, -48852, 4118, 40803, 35271, 11035, -3932, 2512, 18160, 24902, 33062, 17609, 1261, -10362, 10881, 21652, 9060, 670, -881, 17181, 42604, 41095, 11407, 1841, 19188, 21664, 21189, 31727, 34160, 17401, -4697, -17090, -43756, -66949, -36337, -36209, -48593, -53053, -46339, -16603, -28371, -64371, -63539, -25956, -10941, 26745, 17850, -7443, -30512, -39031, -40581, -11488, -11289, -6459, -1303, 9428, 14525, -23081, -17725, 3069, -2113, -17139, -24296, -24630, -14509, -30704, -39849, -18941, 14504, 3211]
4720C211O834r317j5625K712K856k5591j3534J6214p56r590l3775k0395Q288N0881
4706c7587O4671K9783k3553l5328L091m920j9280J6494k2797j715K3092J1876
4694C827R748K238L352j0820j909l5684O606O382p254M7539m207k4305j3539M126
4680a3900Q674K3895M2198O236k6483j5276k1871j2137N680J5793Q873l3651p613
4667a9582R899j3693k5169J6424M6564J6056J0263j8676l07Q897j2457r701j3561
4654e043j621J4522L9840j2336j6753k3393o81j1345l3875j8736j5331L6400K2286
4641b6066l447J3931N642R433M2566J7806j7828m0070L877k737k3576q177n695
4628c4341L6493K0362j0895j6895P967J3464K1286K404k1207k980j3693j9860
$$ y = [3211, 10045, 728, -14897, -12185, -9329, -34920, -48454, -32240, -32996, -42586, -76361, -96756, -88468, -37587, 27084, 56867, 33314, -2014, 1077, -3843, -23123, -6629, -29426, -31141, -8049, 3827, 13575, 15813, 19165, 8345, 6436, -29248, -22642, -16260, -23514, 24025, 19818, -4487, -18026, -13900, -5226, 18669, 60867, 67103, 40620, 25344, 3473, -8664, -2984, 12809, 21682, -11969, -19582, -9683, -23376, -48545, -32121, 14443, 30499, 40762, 22086, 21779, 30676, 18219, 8518, -5043, -6664, 7858, 47698, 35362, 18609, -4784, -5465, -16810, -50685, -69421, -84752, -48352, -26066, -29513, -15582, -9940, -507, 42059, 59865, 42037, 1967, 5844, 3107, -20469, -28646, -34341, 2152, 22514, 11619, -5276, 2691, 16155, 37441, 39845, 18638, 15658, 1965, -17895]
4616a7895k4824J0974J555Q210q358J4473o93N544J090q819r531J1197o667j2171
4602c5915J4969Q006k6980L881K6715N752L385J9426J7437n835K045l628j1083
4589A8175m3038k0769p797m335J0191K8112J2804r405m420J2978L0122J9893J0572
4576E3083j0731j0528p138J8073j6625k1434k239j3831p717Q445l146J131L7116
4563B4459L0768l5385j4784K6362J2694J095n512k2212l875m0551O290J0441k1933
4550c2143N288K1058M031k6342l612J6207J1185K1190k0568j5945n387J5277M194
$$ y = [-17895, -42719, -31745, -30190, -21980, -30338, -15865, -16558, -11014, -9924, -18743, -28274, -17077, -23744, -35915, -20946, -12940, -39920, -36039, -9324, -3572, -187, 19239, 36676, 30841, 32886, 29258, 18175, -24863, -45632, -53429, -57764, -47573, -19461, -6657, -16062, -20482, -7504, 22618, 42511, 53083, 42352, 31824, 24686, 42759, 26134, 4700, 2461, -11370, -19087, -10642, -13788, -12657, 24459, 55227, 19842, 5058, 31420, 44114, 45209, 39697, 17485, 13610, -26941, -20651, -10210, -32143, -26855, -5797, -1766, -28108, -31720, -15513, -4328, 16862, -3706, -19651, -25038, -9761, -5567]
$$ [...]
##END NTUPLES=NMR SPECTRUM
##END=
