##TITLE=Analysis number 330140
Compound Code cc 67106
Book Reference 513/147/38
Project Code adrs
Chemist Name ronp
+insols
##JCAMPDX= 6.0         $$ Bruker NMR JCAMP-DX V2.0
##DATA TYPE= NMR SPECTRUM
##DATA CLASS= NTUPLES
##ORIGIN= Bruker BioSpin GmbH
##OWNER= nmr
$$ XWIN-NMR		Version 3.5
$$ Thu Nov  1 09:38:08 2007 GMT Standard Time (UT+0h)  MAYBRIDGE\nmr@NMR_250MHZ
##.OBSERVE FREQUENCY= 250.131544655141
##.OBSERVE NUCLEUS= ^1H
##.ACQUISITION MODE= SIMULTANEOUS (DQD)
##.ACQUISITION SCHEME= undefined
##.AVERAGES= 16
##.DIGITISER RES= 18
##SPECTROMETER/DATA SYSTEM= dpx250
##.PULSE SEQUENCE= zg30
##.SOLVENT NAME= CDCl3
##.SHIFT REFERENCE= (INTERNAL, CDCl3, 0, 16.4508)
##AUDIT TRAIL= $$ (NUMBER, WHEN, WHO, WHERE, WHAT)
$$ ##TITLE= Audit trail, XWIN-NMR		Version 3.5
$$ ##JCAMPDX= 5.01
$$ ##ORIGIN= Bruker BioSpin GmbH
$$ ##OWNER= nmr
$$ C:\u/data/dgb/nmr/ADRS/1610/pdata/1/auditp.txt
$$ ##AUDIT TRAIL=  $$ (NUMBER, WHEN, WHO, WHERE, WHAT)
(   1,<2007-11-01 09:37:41.65 +000>,<MAYBRIDGE\nmr>,<NMR_250MHZ>,
      <created by zg, POWCHK disabled, PULCHK disabled
       configuration hash MD5:
       76 6E 9A 78 1E 09 19 81 EC 84 63 8F B0 6A 59 2D
       data hash MD5: 64K
       63 8F 94 CF BE 7C 8D C0 3B E8 F9 96 22 0D 75 F5>)
(   2,<2007-11-01 09:37:57.10 +000>,<MAYBRIDGE\nmr>,<NMR_250MHZ>,
      <Start of raw data processing
       ef LB = 0.3 FT_mod = 6 PKNL = 1 SI = 32K 
       data hash MD5: 32K
       61 47 58 CD C2 37 B5 B8 4E 89 48 3D 32 44 47 15>)
(   3,<2007-11-01 09:37:58.69 +000>,<MAYBRIDGE\nmr>,<NMR_250MHZ>,
      <apk 
       data hash MD5: 32K
       AC F4 E9 35 0A 15 31 6B 01 79 60 16 DD 91 3D 86>)
(   4,<2007-11-01 09:37:59.41 +000>,<MAYBRIDGE\nmr>,<NMR_250MHZ>,
      <abs ABSG = 5 
       data hash MD5: 32K
       84 35 EB B0 19 71 D6 15 35 32 B6 9F 90 BA FA 3C>)
$$ ##END=
$$ 
$$ hash MD5
$$ 13 FA 63 EA 01 A6 C8 E4 D3 58 22 F7 8E 57 BC 0A
##$RELAX= 
##$RELAX= 
##$RELAX= 
##$RELAX= 
##$RELAX= 
##$RELAX= 
##$RELAX= 
$$ Bruker specific parameters
$$ --------------------------
##$DU= <C:\u>
##$EXPNO= 1610
##$NAME= <ADRS>
##$PROCNO= 1
##$TYPE= <nmr>
##$USER= <dgb>
##$AMP= (0..31)
100 100 100 100 100 100 100 100 100 100 100 100 100 100 100 100 100 100 
100 100 100 100 100 100 100 100 100 100 100 100 100 100 
##$AQSEQ= 0
##$AQ_mod= 3
##$AUNM= <au_zg>
##$AUTOPOS= <54 >
##$BF1= 250.13
##$BF2= 250.13
##$BF3= 250.13
##$BF4= 250.13
##$BF5= 500.13
##$BF6= 500.13
##$BF7= 500.13
##$BF8= 500.13
##$BYTORDA= 1
##$CFDGTYP= 0
##$CFRGTYP= 5
##$CHEMSTR= <none>
##$CNST= (0..31)
1 1 145 1 1 1 1 1 1 1 1 1 1 1 1 1 1 1 1 1 1 1 1 1 1 1 1 1 1 1 1 1 
##$CPDPRG= <>
##$CPDPRG1= <>
##$CPDPRG2= <>
##$CPDPRG3= <>
##$CPDPRG4= <mlev>
##$CPDPRG5= <mlev>
##$CPDPRG6= <mlev>
##$CPDPRG7= <mlev>
##$CPDPRG8= <mlev>
##$CPDPRGB= <>
##$CPDPRGT= <>
##$D= (0..31)
0 1 0 0 0 0 0 0 0 0.06 0 0 0 0 0 0 0.0002 0 0 0 0 0 0 0 0 0 0 0 0 0 0 
0 
##$DATE= 1193909860
##$DBL= (0..7)
120 120 120 120 120 120 120 120 
##$DBP= (0..7)
150 150 150 150 150 150 150 150 
##$DBP07= 0
##$DBPNAM0= <>
$$ [...]
##$SUBNAM7= <"">
##$SUBNAM8= <"">
##$SUBNAM9= <"">
##$SW= 20.6930455092707
##$SWIBOX= (0..15)
0 0 3 0 0 0 0 0 0 0 0 0 0 0 0 0 
##$SW_h= 5175.983436853
##$TD= 65536
##$TD0= 1
##$TE= 295.16
##$TE2= 300
##$TE3= 300
##$TEG= 300
##$TL= (0..7)
0 120 120 120 120 120 120 120 
##$TP= (0..7)
150 150 150 150 150 150 150 150 
##$TP07= 0
##$TPNAME0= <>
##$TPNAME1= <>
##$TPNAME2= <>
##$TPNAME3= <>
##$TPNAME4= <>
##$TPNAME5= <>
##$TPNAME6= <>
##$TPNAME7= <>
##$TPOAL= (0..7)
0.5 0.5 0.5 0.5 0.5 0.5 0.5 0.5 
##$TPOFFS= (0..7)
0 0 0 0 0 0 0 0 
##$TUNHIN= 0
##$TUNHOUT= 0
##$TUNXOUT= 0
##$USERA1= <user>
##$USERA2= <user>
##$USERA3= <user>
##$USERA4= <user>
##$USERA5= <user>
##$V9= 5
##$VALIST= <valist>
##$VCLIST= <CCCCCCCCCCCCCCC>
##$VD= 0
##$VDLIST= <DDDDDDDDDDDDDDD>
##$VPLIST= <PPPPPPPPPPPPPPP>
##$VTLIST= <TTTTTTTTTTTTTTT>
##$WBST= 1024
##$WBSW= 4
##$XGAIN= (0..3)
0 0 0 0 
##$XL= 0
##$YL= 0
##$YMAX_a= 147260
##$YMIN_a= -240848
##$ZGOPTNS= <>
##$ZL1= 120
##$ZL2= 120
##$ZL3= 120
##$ZL4= 120
##$ABSF1= 16.45085
##$ABSF2= -4.242323
##$ABSG= 5
##$ABSL= 3
##$ALPHA= 0
##$AQORDER= 0
##$ASSFAC= 0
##$ASSFACI= 0
##$ASSFACX= 0
##$ASSWID= 0
##$AUNMP= <proc_1d>
##$AZFE= 0.1
##$AZFW= 0.1
##$BCFW= 0
##$BC_mod= 0
##$BYTORDP= 0
##$COROFFS= 0
##$CY= 12.5
##$DATMOD= 1
##$DC= 0
##$DFILT= <>
##$DTYPP= 0
##$F1P= 14.0000005364418
##$F2P= -0.99999901652339
##$FCOR= 0.5
##$FTSIZE= 32768
##$FT_mod= 6
##$GAMMA= 0
##$GB= 0
##$INTBC= 1
##$INTSCL= 1
##$ISEN= 128
##$LB= 0.3
##$LEV0= 0
##$LPBIN= 0
##$MAXI= 10000
##$MC2= 0
##$MEAN= 0
##$ME_mod= 0
##$MI= 0
##$NCOEF= 0
##$NC_proc= -4
##$NLEV= 6
##$NOISF1= 0
##$NOISF2= 0
##$NSP= 0
##$NTH_PI= 0
##$NZP= 0
##$OFFSET= 16.45085
##$PC= 1
##$PHC0= 155.9381
##$PHC1= 18.88227
##$PH_mod= 1
##$PKNL= yes
##$PPARMOD= 0
##$PSCAL= 4
##$PSIGN= 0
##$REVERSE= no
##$SF= 250.130017795359
##$SI= 32768
##$SIGF1= 0
##$SIGF2= 0
##$SINO= 400
##$SIOLD= 32768
##$SREGLST= <1H.CDCl3>
##$SSB= 0
##$STSI= 32768
##$STSR= 0
##$SW_p= 5175.98343685301
##$SYMM= 0
##$S_DEV= 0
##$TDeff= 65536
##$TDoff= 0
##$TI= <Analysis number 999999
Compound Code 99
Book Reference 9
Project Code 9>
##$TILT= no
##$TM1= 0
##$TM2= 0
##$TOPLEV= 0
##$USERP1= <user>
##$USERP2= <user>
##$USERP3= <user>
##$USERP4= <user>
##$USERP5= <user>
##$WDW= 1
##$XDIM= 32768
##$YMAX_p= 285586308
##$YMIN_p= -649846
$$ End of Bruker specific parameters
$$ ---------------------------------
##NTUPLES= NMR SPECTRUM
##VAR_NAME=  FREQUENCY,     SPECTRUM/REAL,   SPECTRUM/IMAG
##SYMBOL=    X,             R,               I
##VAR_TYPE=  INDEPENDENT,   DEPENDENT,       DEPENDENT
##VAR_FORM=  AFFN,          ASDF,            ASDF
##VAR_DIM=   32768,         32768,           32768
##UNITS=     HZ,            ARBITRARY UNITS, ARBITRARY UNITS
##FACTOR=    0.157963299565203, 1,           1
##FIRST=     4114.85128645834, 0,            0
##LAST=      -1061.13215039467, 0,           0
##MIN=       -1061.13215039467, -649846,     0
##MAX=       4114.85128645834, 285586308,    0
$$ Real data points
##PAGE= N=1
##DATA TABLE= (X++(R..R)), XYDATA
$$ [...]
23847F19964j92178l32415r9687J41571J23539j03714n5072M2294l8994j37472
23837c2164m7432N4143o825j26727O1848P0210o273J71094O9334j29770k5407
23826E2031k4452L6826n0813j26148N0010Q5413p2085J47707R7673k0668N4500
23815B29994k43250K7860J32045J00707Q7360j75455q0341j42380K5382m6874
23805h4952J8925Q7715j59939j57088K06191N8271K14812l5545j50546K4916L1674
23794E4434O2901n618l3069j24943j03931k5380j13404Q1676J24117j76718j08238
23783c68173l8629N0121R2715K3944K4452K0775k3690j0886R139L9775J13673
23772f6784P1106J0949O3414j2761j29009M2894K56001J63120k86182k74238J13953
$$ y = [619964, 427786, 95371, -4316, 137255, 260794, 157080, 102008, 144302, 105308, -32164, -79596, -25453, -32278, -159005, -97157, -26947, -33220, 137874, 207208, 77438, 52031, 27579, 64405, 13592, -112556, -62546, 22867, -49218, 98489, 196162, 175494, 229994, -13256, 14604, 146649, 247356, 334716, 159261, 78920, -63460, -38078, -84952, -66027, 21688, -138251, -295339, -89148, -30877, 183935, 148390, -2156, 22760, 54434, 117335, 111717, 78648, -46295, -150226, -175606, -289010, -207334, -83217, -259935, -368173, -406802, -356681, -263966, -240022, -215570, -194795, -218485, -229371, -220232, -180457, -66784, 4322, 15271, 78685, 65924, -63085, -20191, 235810, 398930, 112748, -161490, -47537]
23761d7537O7920O0113k9737l0205N0442J9971j9443j03437j24645l163O6007
23750i3714N0311Q2238j0903R3930P6333j13250l10384j65314k6549J66257J57420
23739i3625L7852j50337J80031K25809k4938p0487j25701J2087j8953P1235J25661
23728A68634m8411k19181r2842K49424O8118j66659n4092l631K5306J99246n0549
23717G5363j97501k9687L0523L1452J28953K2871K2508J75095M3119r0975j46485
23706F5236j13132P418M1011J10397j2229J8336J00164j8016m9744N8461J43317
23695C51219o1351j01518j99449q1406K9559N0501J63542Q695J10896J4229n0858
23684B34059o3497r564L7869j01829m0272M518j75259j39246J61036J49977l3756
$$ y = [-47537, 20383, 80496, 50759, 20554, 70996, 90967, 71524, -31913, -156558, -159721, -93714, -43403, 38835, 27932, 121862, 198195, 84945, -225439, -390753, -417302, -251045, -93625, -55773, -206110, -26079, 199730, 174792, 104305, -21396, -9309, -28262, 42973, 168634, 120223, -98958, -191800, 57624, 125742, -40917, -95009, -98640, -73334, 125912, 75363, -122138, -151825, -121302, -89850, 39103, 61974, 84482, 259577, 302696, 211721, 65236, -47896, -40478, 533, 110930, 98701, 117037, 217201, 199185, 149441, 207902, 351219, 289868, 188350, -11099, -92505, -62946, -12445, 151097, 159792, 270688, 284917, 234059, 170562, 160998, 198867, 97038, 56766, 61284, -113975, -253221, -92185, 57792, 24036]
23673B4036M7754j41674j50711q2464n2817M9132J92125J27591Q5569M4359j42012
23662H88M0143k24085o2936K59003k3090q1118O6383p760P5765J5898j88935m9327
23650a79171j3665P6577l94K8500K3671j06928P585P6744o5521k34503K5491k7755
23638c89369k0108J12931m6712n0752L2557R4849J77424J05286j48386P3251J56580
23627I7551n0352k6421J32108q5832l2797p5983K5976k6477M3187K6473k4997
23616B436j15481n5847J62705O7638Q8276k0301J1456p6719j34632n2944J1647
23605a11766M3811r5872r5338J2558k9283N4760J3078r6649j7343K70648K13096
23594A61700m0808j71386M5937j75500k68795Q2752J72089J86508J03432m6262
$$ y = [24036, 71790, -69884, -220595, -303059, -355876, -306744, -114619, 12972, 98541, 142900, 888, 41031, -183054, -245990, 13013, -10077, -91195, -24812, -32572, 43193, 59091, -129844, -179171, -192836, -116259, -116653, -88153, -64482, -171410, -163825, -87081, -152602, -387105, -361614, -389369, -409477, -296546, -343258, -394010, -361453, -266604, -89180, 16106, -132280, -59029, 97551, 47199, 20778, 152886, 67054, 34257, -41726, -15750, -42227, 960, 27433, 2436, -113045, -168892, -6187, 61451, 149727, 129426, 140882, 64163, -70469, -123413, -111766, -67955, -163827, -259165, -246607, -275890, -221130, -208052, -304701, -322044, -51396, 161700, 120892, -50494, -4557, -180057, -448852, -366100, -194011, -7503, 95929, 49667]
23584D9667o0988m1218m8945J09472p984K389j15432L7737N1083r1673J641J14560
23572C09n0553J13411N664P861j47331k7027r2011p5685r1011J98763P2129p074
23560i2555p8788j50281m7468Q1702K41378J90339O3993r9079j70784J07430R3187
23549A39074J10214k3070k5169j05208m4920k98059n5058J41454K37228K1531
23539I8017j1901P456p9210J16104J29304j83697o7578o9440q8809O5408m5092
23528a29438O0974k5264R6440o4064M0855J9180p9290j2731N0011J70004m5874
23517H0803J14670k0457j40050k9531J07134m3407j83691p6435N9813R5275l5303
23506g1179l7762Q9790M6224J6471l1325j42641j54340r2284J81043l8862M3213
$$ y = [49667, -11321, -52539, -101484, 7988, 4, 2393, -113039, -75302, -24219, -115892, -114251, 309, -50244, 63167, 68831, 76692, -70639, -97666, -189677, -265362, -356373, -157610, -85481, -92555, -171343, -321624, -369092, -287390, -46012, 144327, 208320, 109241, -61543, 45887, 139074, 249288, 226218, 201049, 95841, 50921, -247138, -302196, -160742, 76486, 98017, 86116, 93572, 14362, 130466, 259770, 76073, 8495, -60945, -149754, -84346, -129438, -68464, -93728, 2712, -61352, -20497, -1317, -80607, -93338, -43327, 126677, 80803, 195473, 175016, 34966, 5435, 112569, 69162, -114529, -190964, -131151, -35876, -71179, -108941, -19151, 27073, 43544, 12219, -130422, -284762, -377046, -196003, -234865, -191652]
23495a91652P2448K4688k662R4695j70467j09016q52P4694R4192P1482K9645Q8853
23483G6048k7932j01191R2227J20950Q5548j49958l8622Q8708R1173K1372j87063
23472G1260k34197k11684l5543J83524J68333R84N5250j8850k9113k9844R9405
23461A9525Q4823l5932p6603L2587J4696J15973p9039j86386J47398O3090O2940
23450A63072j16041j26642j29204N2730r6109J38448M0476J86737m0174n8815
23440A4478o6941M2193N8317k1221P2277n7531j03966l24016J16237J47359Q4930
23429c7884k8191r8890P9628J08110L5321J8721M6607q3822j8088P7131Q6484
23418A85127K6177m1483k53433j58820K97693J67753J2406m3769j15517M6511
$$ y = [-191652, -119204, -94516, -97178, -2483, -172950, -281966, -282818, -208124, -113932, -42450, -12805, 76048, 48116, -53075, 39152, 160102, 245650, 95692, 57070, 145778, 236951, 258323, 71260, -162937, -374621, -410164, -226640, -58307, -57323, -2073, -20923, -50036, -79880, 19525, 104348, 68416, -8187, 24400, 39096, 155069, 76030, -110356, 37042, 100132, 163072, 47031, -79611, -208815, -156085, -252194, -113746, -73270, 113467, 73293, 14478, -52463, -10270, 48047, 26826, 99103, 41572, -62394, -386410, -270173, -122814, -37884, -66075, -164965, -85337, 22773, 58094, 76815, 123422, 39600, 21512, 98643, 185127, 211304, 169821, -83612, -242432, 55261, 223014, 235420, 191651, 76134, 122645]
23408A22645j6837R8835n6193K4479M0584P6284Q282k9632m2959m8896M0151j89993
23396B6750l1275J16972J8840p7211n1590O3006M9224J10126q2950j86058q1027
23385a25193p2293k6660J10694J7370k8623n6974j84397j9951J5484J53066R1076
23374a26401N8609N8462j10127k3515J19357k369L8247j9478j00937j01546j90657
23363d00355L6963R2993J23209J81038J23397j78923r0387J54005P7124J2757
23353A31821K8655q3826p1673j2015j46779j23888l0314K1627J81007J31449K7252
23342E3316q5759M9572N1940J24976K7570k78659j41046o5328J9869k0698O9929
23331a94318J01743J314j69718k8636J85582J23444m5619M3592r8103Q9545l7994
$$ y = [122645, 105808, 204643, 148450, 172929, 213513, 289797, 298079, 268447, 225488, 176592, 216743, 26750, -4525, 112447, 131287, 54076, 2486, 65492, 114716, 224842, 141892, -44166, -125193, -197486, -224146, -113452, -96082, -124705, -181679, -366076, -386027, -370543, -217477, -126401, -67792, -9330, -119457, -142972, -23615, -25984, 12263, -7215, -108152, -209698, -400355, -363392, -270399, -147190, 33848, 157245, -21678, -112065, 41940, 119064, 131821, 160476, 76650, 4977, -7038, -153817, -277705, -308019, -286392, -105385, 26064, 53316, -32443, 17129, 69069, 194045, 221615, -57044, -198090, -263418, -243549, -264247, -194318, -92575, -91261, -260979, -289615, -104033, 19411, -26208, 17384, -80719, 8826, -29168]
23320b9168L7997J12204o6122o5963k55628r639J45669m6444q6200o2666K0714
23309c05246Q2766j3489O2378J31210j33108j870q2365m0018J12972M7836M3943
23298i4991P6747J14012J83865m9352j09999j79798J0519J18066O3399q3365k11487
23287a62384R9772j198o0113M0042m4060Q1132K2567M9970P3702o3724K7534k5247
23275C7993k2741J6135j71471q0969O0001K7492J86895Q5056q266j41154Q0859
23264F9830J22967j13699j57644q5915N189K6983M4237M0766Q197Q8099K5982
23253G4992J31573k2791j42581k43947j02625K53357J57840j05731m1033J04957
23243F4011l3748J02478q589m6779L18j14547j61468j26541o8566P9230P2830
$$ y = [-29168, 8829, 121033, 54911, -11052, -266680, -276319, -130650, -177094, -263294, -325960, -305246, -222480, -235969, -173591, -42381, -175489, -177359, -259724, -299742, -186770, -138934, -94991, -18244, 95768, 279633, 230281, 120282, -59516, -48997, 69069, 132468, 49103, -162384, -62612, -63810, -123923, -83881, -127941, -46809, -24242, 25728, 99430, 35706, 63240, 37993, 15252, 31387, -140084, -221053, -161052, -133560, 53335, 138391, 130125, -11029, 69830, 192797, 79098, -78546, -164461, -159272, -132289, -88052, -47286, -39089, 49010, 74992, 206565, 183774, 41193, -202754, -305379, -52022, 105818, 87, -40946, 64011, 30263, 132741, 124152, 77373, 77691, -36856, -198324, -324865, -393431, -314201, -241371]
23232b41371o365L8510m6848j29570P8917M4394M3658P0507J15644J20317R5442
23221A83235p2190k41361r9994J00543J14482o2385j06988J7343P4937K3578p5856
23210a44656J7468R5386J81149J10097J48471o6741L3142J1879j90601j05406
23200I0188N9904O8704n3560j6487r9933P6119M1998l4893j26254k99133J1424
23189b81923P1517M8701N6504M7194n7423P20K4067j36594Q7800J68578R6734
23178A25875j83771k85309K115k0396J30899L6520l626O8947K16096J94283N3203
23167C34836p3033K654L4115k75030j10729N2802r1759j63228P9416J74517M3695
23156H256j57479J06876L6245j2567k51210J07003J77389J65812m065j26446q5081
$$ y = [-241371, -247736, -209226, -256074, -385644, -306727, -262333, -218675, -148168, -32524, 87793, 183235, 111045, -130316, -230310, -129767, -15285, -77670, -184658, -167315, -92378, -68800, -144656, -127188, -31802, 149347, 259444, 407915, 341174, 374316, 386195, 195594, 90188, 150092, 218796, 165236, 148749, 48816, 124935, 166933, 132040, 5786, -293347, -281923, -210406, -161705, -105201, -58007, -115430, -114710, -90643, -227237, -139437, 29141, 125875, -57896, -343205, -341090, -361486, -230587, -194067, -197693, -128746, 87350, 281633, 334836, 261803, 264457, 298572, 23542, -87187, -34385, -126144, -289372, -209956, -35439, 8256, -149223, -42347, -6102, -18669, -269879, -162876, 14513, 180325, 176260, 49814, -35267]
23145c5267O5079K0503J63556J84970J08682k12962j36793m489R8933n8198o5936
23134A28078M418k27620K2478M8302J74453K9087m5827N3337J6433k08929k1611
23123b7401K7116N9361J35845j12143n1919m4939O7756m1623k30397r627M2325
23112a85646o4769K45904N639j1877o0333r8675J03344L6445n2128j48163l4294
23101b64553J69979N7671m53J40247l0264L9426j15227k4665j35019J60408L31704
23090C29254P9670k26721k90298m5943k7874Q9878J34951l9552j84152m7750L6574
23079a91963m4114L2519l3504K6735J6850M15J18857j20860R0314K28908P8385
23068B02542m5577j43091N1386R9746l23389j85885K76103J26360j92143J6595
$$ y = [-35267, 29812, 50315, 213871, 398841, 507523, 294561, 157768, 153279, 252212, 194014, 128078, 132496, -95124, -72646, -24344, 150109, 179196, 133369, 186706, 203139, -5790, -27401, -285, 59076, 194921, 82778, 30859, -14080, 53676, 12053, -218344, -227971, -185646, -250415, -4511, 1128, -10749, -71082, -169757, -66413, -29968, -82096, -230259, -264553, -94574, -36903, -37356, 102891, 72627, 112053, -3174, -27839, -162858, -2450, 329254, 408924, 182203, -108095, -154038, -181912, -92034, 42917, 3365, -180787, -228537, -191963, -236077, -203558, -237062, -210327, -193477, -193062, -74205, -195065, -104751, 124157, 202542, 156965, 13874, 65260, 165006, -158383, -344268, -68165, 58195, -133948, -117353]
23058a17353J22761K453J06574J07814O1720k23886k48025m6455K37417N9064
23048F2084o6913n9284j63373K549l4559j03166M3813K33453J16326j04173J8218
23037e5025L9483j44815l5808K4334n206J0142o3240N5600J74569j5974j3996
23026b9936J08540J2987k50650m4218r5040N9646J49745J14503L010p2736J65362
23015A21213l6893j74845j46538o9290J94630q326l0886K3192P5721j06219J59589
23004A348N6548r0019j2116M7497m1308K12952J58665j97019k92488N423J60964
22993A0447l3418J22279L4172j10796l9565k04655N439R5590K4797q6185k5437
22982b07332M1883J24853Q4634j34274j84745j92372o1744J80791Q4269J79810
$$ y = [-117353, 5408, 7861, 114435, 222249, 283969, 60083, -187942, -234397, 3020, 62084, -4829, -64113, -227486, -224937, -259496, -362662, -318849, -85396, 30930, -73243, -55025, -15542, -160357, -196165, -171831, -177037, -166895, -230135, -174535, 34, -15940, -29936, 78604, 91591, -159059, -203277, -298317, -238671, -88926, 25577, 28587, -44149, 121213, 84320, -90525, -237063, -306353, -111723, -120049, -150935, -127743, -52022, -158241, 1348, 57896, -32123, -44239, 3258, -38050, 174902, 333567, 136548, -155940, -150517, 10447, -22971, 99308, 133480, 22684, -16881, -221536, -216097, -120507, -95710, -181895, -207332, -165449, -40596, 44038, -90236, -274981, -467353, -529097, -348306, -264037, -84227]
22972h4227j32529l5060J995M4069j6768J34893K33437r4737j03285J29560O5558
22961A42906j4377k51091j25822R6556O279N9675j00861j06353r843J20024J3519
22950a69388k3682P9724J20448m2794q8021Q1581M0341j6813j54654j51957m380
22939c29595M5383J36511J11784Q3445m907J1188L0491l4673j78779r128L05115
22928A66835J00274j35941q4469j85181n676K5699J51580J67374J6572j31367
22918H5700j35736m2573J28809j82291K9503J9030N3356O2861Q5542N8999l8591
22907A24609j24184j22175P8616J17236Q03n7260J2418j5981j10671K3839R0954
22896A8204J27636j42579L5624k0406m7630p5146n5081J67320J01642j54900k7592
$$ y = [-84227, -216756, -251816, -249821, -205752, -222520, -87627, 145810, 51073, -52212, 77348, 142906, 128529, -122562, -248384, -151828, -145549, -85874, -186735, -293088, -302931, -182907, -169388, -193070, -113346, 7102, -35692, -123713, -42132, -1791, -18604, -173258, -325215, -329595, -284212, -147701, -35917, 47528, 42621, 53809, 84300, 49627, -129152, -138280, 166835, 267109, 131168, 46699, -138482, -144158, -118459, 33121, 200495, 217067, 85700, -50036, -92609, 36200, -146091, -116588, -97558, -44202, 18659, 104201, 163200, 124609, 425, -121750, -43134, 74102, 74905, 17645, 30063, 14082, -96589, -72750, 18204, 145840, 3261, 38885, 18479, -29151, -104297, -159378, 7942, 109584, -45316, -72908]
22885g2908j63000j08952R7371K11044J12746M2663M5944j45256k17850j01161
22875b99359O4910J2300M3159m0675J4415K36919M4258m2098O3629M1487r7753
22864D1192o0180p586J6221P7938J20086k86653k174K84299n5390j51957k75259
22853b99463r2626P5118J32022k1320O052J40012J22769O8121J09678j3793l149
22842B23421J17547l9196q1183j8442o3286j09284J18027J7518j49813j75226
22832a59917l2397J18173R2610p9898o958K5143K5170M6892L3033p1397k87596
22821b97142k12043j03539J68016L9903J1258M4004J45457O849p6655K22877M882
22810d6133j68490J25422J25665J4574p2464j17457r0515N5187J45879K05028
$$ y = [-72908, -235908, -344860, -247489, -36445, 76301, 118964, 164908, 19652, -198198, -299359, -234449, -222149, -178990, -219665, -205250, 31669, 75927, 33829, 97458, 138945, 41192, -18988, -26574, -10353, 67585, 187671, -98982, -101156, 183143, 127753, -24204, -299463, -392089, -316971, -184949, -206269, -200217, -60205, 62564, 130685, 240363, 226570, 223421, 340968, 301772, 220589, 202147, 138861, 29577, 147604, 165122, 15309, -159917, -192314, -74141, 18469, -61429, -68387, -43244, -18074, 28818, 61851, -9546, -297142, -509185, -612724, -444708, -404805, -393547, -349543, -204086, -197237, -273892, -51015, -46133, -214623, -89201, 36464, 51038, -21426, -138883, -229398, -174211, -28332, 176696]
22800A76696N2282o8131J80462m4916J9037r5439j28113K5849m01r912j91878
22789h4464J41962K20750j5313m5344K1875j03641q2121L994J10553j75580J03491
22778I6162j7420J50839j7183j42857k9797J18044m3460j22223o5009K8160l2715
22767g7459l9511N6705J9795j6425r5939j58628q759J45543L9539J93089N6843
22756A14793N4730j74249q2510L17356P3885N979K6034j42481k58024K9770J16285
22745H1568l4106j04552N8407J2445Q4728m0994l2981k00423K7015k4200j8024
22734a91117L679M4742n680m2011K5R8428M0576j13945j27042O1769J73274M1222
22722a6080o098R1788k8857j00945q8432J10408l6346J64669K42010q085j78110
$$ y = [176696, 228978, 160847, 341309, 296393, 315430, 219991, 91878, 117727, 117326, 107414, -84464, 57498, 278248, 262935, 217591, 239466, 135825, 53704, 57698, 168251, -7329, 96162, 78742, 229581, 212398, 69541, 39744, 157788, 114328, -7895, -72904, -44744, -77459, -116970, -60265, -40470, -56895, -152834, -311462, -320221, -174678, -135139, 57950, 114793, 169523, -4726, -87236, 230120, 304005, 309984, 336018, 193537, -64487, -34717, 81568, 47462, -57090, 1317, 13762, 98490, 57496, 24515, -175908, -148893, -173093, -191117, -187438, -142696, -148376, -190387, -190362, -91934, -51358, -165303, -292345, -230576, -57302, -16080, -22178, 69610, 40753, -60192, -148624, -38216, -74562, 90107, 332117, 324032, 145922]
22711A45922j01456m7961l182N5773Q8008o1104J55120M7004r0568p389n4069
22700A26098q3526n7381k0869L6091O1011l5422p3710N7953L9967m1624q4786
22689g6198o0028K5067n5082k0161l6272J78378L5168j36489O42m0405K5053K13134
22677E2807J57897k12619j25853j7409J1939q9508q5559r0044l5950J19528J39557
22666a75214J83495K25026J19189j67703l25679j27678o1165J27103o2119J33442
22656a31303N5295l9533p3478j7579n3348j21056K22119J10291o5231j85554r661
22645c09038J97241J81830j012o695R2961N9468j15139O0721J24249k041j72627
22634A09918J97817J05826k48698k17336N9240K98512J26664k6349L6709J76477
$$ y = [145922, 44466, -3495, -6677, 49096, 137104, 76000, 231120, 278124, 187556, 180167, 126098, 42572, -14809, -35678, 413, 61424, 26002, -47708, 10245, 50212, 8588, -76198, -136226, -111159, -166241, -186402, -222674, -44296, -9128, -145617, -144975, -185380, -160327, 52807, 210704, -1915, -127768, -145177, -133238, -222746, -308305, -398349, -434299, -314771, -175214, 8281, 233307, 352496, 184793, -140886, -268564, -329729, -202626, -264745, -131303, -76008, -115541, -189019, -206598, -259946, -381002, -158883, -48592, -113823, -299377, -309038, -111797, 70033, 69021, 62326, 155287, 214755, 99616, 160337, 284586, 282545, 109918, 307735, 413561, 164863, -52473, 6767, 305279, 431943, 405594, 442303, 618780]
22624F18780j09297l48362n6048k8149k11107j62801R7541o4824P516L6596Q4718
22613a35437J65598O4396K237J97668L1578k15436q8539K8657k24345M2988R0975
22602c9660K0578m2737j44093j15710o2712L49996J86106j37207j26893R4341
22592a7991J99810J16236m8962j54578K1473K9458j28138p4398L4126K9248O7685
22581G3969K6387N6598q5501K2399N8616o7207R6358o3235o9059j95305P0346
22570g5634N1659J9742J17392N2346r4794j9812N1226O6247r5880o727l5637j27609
22558i7481L7262J57731j01827R454p2991R6295n1833j7364J5341J17287L6093
22547A27967j08374j37011m5446n3553Q0015k2724O3468k8177o9031K88167K63682
$$ y = [618780, 509483, 161121, 105073, 76924, -134183, -296984, -199443, -264267, -256751, -220155, -135437, 30161, 94557, 96794, 294462, 326040, 110604, 22065, 50722, -173623, -130635, -39660, -19082, -61819, -205912, -321622, -384334, -34338, 151768, 14561, -112332, -17991, 181819, 298055, 249093, 94515, 115988, 145446, 17308, -57090, -22964, 6284, 73969, 100356, 156954, 71453, 93852, 152468, 85261, 181619, 118384, 49325, -145980, -75634, -23975, -4233, 113159, 165505, 70711, 50899, 102125, 168372, 72492, 65765, 30128, -97481, -60219, 97512, -4315, 5139, -67852, 28443, -23390, -40754, -25413, 91874, 127967, 19593, -117418, -162864, -216417, -136402, -159126, -95658, -123835, -192866, 95301, 358983]
22536C58983J1250k95648l8150J00421j73000j8416j59556j4357K07960k8945
22526d9458p6146K4287N387m852M43O4668Q6313N734j57641k16034m2238K30709
22514a28828J98899m8970q4848P6609L0496p6416K3676J2608q0895j9262k4355
22503a21286K7589L0240J73840n7285Q272L4751N8159j224n6935j00672r425o7694
22491h1670j08536r78k3381L7742P7077m8769K3553k9059n3838R1409o6336m0551
22479b23337R8744J01215m1447j4986m773J04421P5268q1704j72085j54959p2551
22468c86194O7114J3153L6553K5927k1376M6112J17179J40719N0648J9725M6811
22457A56371N671j41583j5197o0869p7686K665P7942J28134M3128n5583k2719
$$ y = [358983, 370233, 74585, 36435, 136856, -36144, -54560, -214116, -228473, -20513, -49458, -125604, -101317, -95930, -100782, -100339, -35671, 50642, 56376, -101265, -317299, -359537, -128828, 70071, 21101, -63747, 12862, 43358, -33058, -9382, 3226, -77669, -96931, -121286, -93697, -63457, 110383, 53098, 61370, 96121, 154280, 153056, 96121, -4551, -13976, -81670, -190206, -191184, -214565, -176823, -99746, -148515, -124962, -154021, -207859, -116450, -182786, -223337, -124593, -23378, -64825, -79811, -84584, 19837, 95105, 13401, -158684, -313643, -386194, -319080, -305927, -269374, -243447, -264823, -218711, -101532, 39187, 89835, 109560, 156371, 162042, 20459, 5262, -55607, -133293, -130628, -52686, 75448, 118576, 62993, 40274]
22446D0274o0925O3005K5657j43344n5305n9336R8793k5227j7207M6601R0695
22435C681Q3113P8411p0782j39247j26118j7837J55766K39392J24660o2141j92463
22424G6435q3227o4524r5112j70620j05207J55156K88259J94401j08326K1544
22414A08779L7756l228k8969l9175k3297L3703k9052n6413J18765M4440k03304
22403c9995o9260r7169j27599L389K44499J71095O0591j8721n5263l03432L3092
22392a98773J30250j9445n6764K7523Q3130K65696q3677j52076j1670N8360j25947
22381h3393k1036K6015q0663q4174j19286L6307J78696P9990J09111P1657J52546
22370B65770K1874n1323r3139j83225k4607J6945J17332K9656J12403J1441n6423
$$ y = [40274, -20651, 42354, 68011, -75333, -130638, -189974, -91181, -116408, -133615, -87014, 3681, 86794, 165205, 94423, -44824, -170942, -188779, -33013, 206379, 331039, 268898, 76435, -6792, -71316, -166428, -337048, -442255, -287099, 1160, 195561, 87235, 108779, 146535, 143307, 114338, 75163, 51866, 85569, 56517, 104, 118869, 163309, -39995, -109255, -206424, -334023, -330634, -86135, 84960, 145551, 126830, 71567, -231865, -198773, -68523, -87968, -144732, -117209, -34079, 231617, 147940, -4136, -15806, 42554, -83393, -104429, -78414, -159077, -243251, -362537, -326230, -147534, -67544, 41567, 113224, 265770, 287644, 236321, 143182, -40043, -64650, -47705, 69627, 99283, 211686, 223127, 166704]
22359A66704j53089j52239l5L3184L3679J742R0777N9785J11075j48187J30773
22348A74169Q9695j07129l49026j08870O7206j7107P7651J39303o5581K3009L8411
22337c8269k0630J74566J77036K67l2240q7336p3050k02230n0362J44725P4460
22326F6937o2051r3785Q4855j15150J34969K37304o218O4853m7105j29781j4196
22315A20632j75711k1787M5656O0017J01996l0369r9718n6214N2756J00578k9441
22304F8395k8816r8648K8992N7184L9135j07039m4566o9040J10556J44622P3932
22293A74707J59414N8454j16066n1692o5697P2028k43939k99594L5630k8886K7476
22282b78165K22341L3362q5482q1319j22688J9493Q9919p9522O3102L4809k2895
$$ y = [166704, 13615, -138624, -138659, -105475, -71796, -70054, 20723, 80508, 191583, 43396, 174169, 263864, 156735, -192291, -301161, -233955, -251062, -173411, -34108, -99689, -76680, -38269, -58899, 115667, 292703, 292970, 260730, 173394, 100344, -101886, -152248, -7523, 66937, 4886, -88899, -4044, -119194, 15775, 253079, 246861, 311714, 264609, 134828, 120632, -55079, -76866, -31210, 28807, 130803, 100434, 716, -55498, -2742, 97836, 68395, 39579, -59069, -30077, 27107, 66242, -40797, -85363, -154403, -43847, 100775, 174707, 334121, 392575, 276509, 224817, 159120, 231148, -12791, -312385, -276755, -305641, -278165, -55824, -22462, -107944, -189263, -311951, -292458, -202539, -282061, -218959, -184150, -207045]
22271b07045M8871K6796j1878J24349N2805Q4994L5763P3784j87981o0023J76278
22260A56713J72070j20862j09556n1911K5959j7475O793K9040R3185K188J17823
22249C03967j1962k68931j22992j03582K0043K11692L2853n2495O6092m2413M0720
22238G2992J54612j71845k76088Q8158J44179j3389L0499p6041j59313O0070J12335
22227c3831j9975k957Q2438m5807P9617m0153N2603k22605j66528P2522K90860
22216D6184J3972M6104q7342o9180L4076O1836P2109j9178J5728M7819L4942P9902
22204B76972n1206l98869j27073N1058J37980N1643K39071j47167j03157o68j4051
22193h5467j89676m9521N6244R0447L9597R1372M3915J21243N4659j13667l8342
$$ y = [-207045, -158174, -131378, -143256, -18907, 33898, 118892, 154655, 228439, 40458, -19565, 156713, 328783, 207921, 98365, 46454, 72413, 54938, 61731, 90771, 183956, 186144, 303967, 292005, 23074, -99918, -203500, -183457, 28235, 61088, 8593, 74685, 32272, 72992, 227604, 55759, -220329, -132171, 12008, -1381, 29118, -46923, -206236, -146166, -33831, -53806, -56763, 25675, -20132, 59485, 19332, 71935, -150670, -317198, -244676, 46184, 60156, 106260, 18918, -50262, -16186, 45650, 117759, 98581, 114309, 162128, 197070, 276972, 225766, -173103, -300176, -249118, -111138, -59495, 179576, 32409, -70748, -71416, -85467, -275143, -324664, -268420, -177973, -138376, -47004, -3089, 118154, 172813, 59146, 20804]
22182B0804J34734m9456o3118J64162R1641m6932p2630J05993N6391j78518r3989
22171F9082J7812o4327j05931O4516P9911k17720r9303L1520J67838R4122J3694
22160E1214j19496R644N728L2617o4531j48943m7040P8462N6725j3096L9009K0023
22148i9684O2141J6752m6663N9446k6972r0536J8828K7557q8393n0554P8449n743
22136a45372M9637n5526j5894J20980N3766k1930p7571k5478q458J40251N2801
22125F7206L292q3759R9754J16098K01520p2600j01720J20021j49485m0544n4851
22114A04932n1753J53916L3702k29813l5843Q6459M4631J35254r5059k03370r9942
22103a56886j64607p4595K14445J60653K45290P0072Q7874J67144j02992l7935
$$ y = [20804, 155538, 106082, 42964, 207126, 298767, 251835, 179205, 285198, 341589, 163071, 69082, 86894, 22567, -83364, -18848, 61063, -156657, -255960, -224440, -56602, 37520, 51214, -68282, -58638, -52910, -20293, -84824, -233767, -280807, -202345, -145620, -158716, -119707, -99684, -37543, -20791, -67454, -8008, -34980, -125516, -106688, -79131, -167524, -218078, -139629, -145372, -95735, -151261, -167155, -46175, 7591, -14339, -91910, -117388, -125846, 14405, 67206, 70498, -13261, 86493, 202591, 404111, 331511, 229791, 349812, 200327, 159783, 104932, 53179, 207095, 240797, 10984, -24859, 61600, 106231, 241485, 146426, -56944, -156886, -321493, -396088, -181643, -20990, 224300, 294372, 382246, 549390, 446398, 408463]
22093D08463l07008q1515r4140Q4355K30736j79890j54480j40490J05939k6946
22083a54976K0698L0922o079j50536o5519J19338J93591L2036o352J38919O5230
22072B17272j8699j73322Q4780R0988o1222j43593r834O4887J27894J404n1834
22061A28721j0549p5458K8213O087j51286N7228K08174j6324n660r8462k05707
22050a35023K2600o8191o2031P6111q971J05069J34332n9988p0176K7439j60599
22039a99428m6580j7709J09687K01484J13223n4596l4272p6026j32816J81339
22029D4306N4763j19684j35529O1391o3183l1013N8314r249P4779L3652J50203
22018A18750m1232J99574N9250j19065p3339P3520k3819j58400l0980K4427J19705
$$ y = [408463, 101455, 19940, -74200, 10155, 240891, 61001, -93479, -233969, -128030, -154976, -134278, -103356, -109435, -259971, -325490, -206152, -12561, 19475, 13123, 152042, 217272, 198573, 25251, 110031, 201019, 139797, -3796, -13630, 51257, 179151, 180555, 128721, 118172, 42714, 70927, 77014, -74272, -17044, 191130, 174806, 169146, 70684, -135023, -112423, -180614, -242645, -166534, -175505, -70436, 63896, 3908, -66268, -38829, -199428, -246008, -263717, -154030, 47454, 160677, 106081, 71809, -4217, -137033, 44306, 99069, -20615, -156144, -94753, -157936, -188949, -130635, -139884, -65105, -31453, 118750, 77518, 277092, 336342, 217277, 143938, 217458, 193639, 35239, 4259, 28686, 148391]
22007A48391j25120j33557l3726K08104N3838J613o1028o8376J45787j347m7164
21996H7415j10538M6520M4197q6032m9939r9046m5124J8948J11581Q8523J56117
21985A62622Q3783l3725j37666m3721l0891q5061j52346J87367K30390m8153J9909
21974A52508P1958n8630k8956K6143m8729j44082K4508J22353J16378J11903o5239
21963B80115j74258l000M8093L5234k0319n9631q5069L4446J05760O7536J24320
21952C53227N328j11792j29540n3624j07306j6786p8684o7263J77285O6321j48615
21941a11449p9544J12241Q4841O4088N5953j09210q0284j45347Q31K32026L9708
21930F3854L1365p7393j29123Q6697j30460l6414J17662O6179j41665J97811J41739
$$ y = [148391, 23271, -110286, -144012, 64092, 117930, 119543, 58515, -9861, 135926, 134579, 87415, -23123, 23397, 67594, -18438, -68377, -167423, -212547, -193599, -82018, 6505, 162622, 246405, 212680, 75014, 31293, 402, -84659, -237005, -49638, 180752, 132599, 152508, 224466, 165836, 136880, 163023, 114294, -29788, -5280, 117073, 233451, 345354, 280115, 105857, 102857, 150950, 186184, 165865, 106234, 21165, 55611, 161371, 228907, 353227, 358555, 246763, 117223, 63599, -43707, -60493, -139177, -206440, -29155, 37166, -111449, -190993, -78752, 6089, 70177, 126130, 16920, -63364, -208711, -207880, 24146, 63854, 95219, 17826, -111297, -24600, -155060, -191474, -73812, -7633, -149298, 48513, 190252]
21919A90252m5623M3574K109r7020j90701r5961K66876R8096j49662j56724j1604
21908a46388R1711Q7669o0297O5301N5266J07436J08722r8179j45962q1266M9558
21897C3571N6031k58883l8722J35896q630p8242q2113J66403k9751R1453J07391
21886I4404R8367k40947j49023O7517Q0838j40305j500J56382j1623J5981L9556
21875I647k9188P1890l9807j26477q8013J74158Q9446l3756M4342R2885K916j3412
21863A54631j65599p0030j38523l5520q60P1800J70407M9500K7748p8766k35604
21852b50816k4033J28913j0233j56183J03288J79042J99672J03970k6287j66069
21842H1264J15151l8710q2786m4939J23128k1760M9385P7076O7732N6698p0501
$$ y = [190252, 144629, 188203, 190312, 93292, -97409, -193370, 73506, 171602, 21940, -134784, -146388, -54677, 32992, -27305, 37996, 93262, 200698, 309420, 211241, 65279, -15987, 33571, 89602, -169281, -208003, -72107, -80737, -158979, -241092, -74689, -104440, -12987, 94404, 192771, -48176, -197199, -129682, -48844, -189149, -190649, -34267, -45890, -29909, 9647, -19541, 52349, 12542, -113935, -201948, -27790, 61656, 27900, 72242, 165127, 168043, 154631, -10968, -80998, -219521, -255041, -255901, -184101, -13694, 35806, 63554, -15212, -250816, -274849, -145936, -156169, -312352, -209064, -30022, 169650, 273620, 247333, 81264, 196415, 157705, 74919, 29980, 153108, 131348, 180733, 257809, 325541, 382239, 311738]
21831C11738j40981K2653O0133o6511j67887l5063k3805L0551J50874o4650n1829
21820B5223m1790o0133N801K6496P7816M7725p1025j04114p2604o9022J22044
21809a13583J8447o5918q2238O3640q9195q5129K572J30647O8060J40405o5455
21798g7747l8724J24360p808m8484o9623J14327K1458N0419r7760M1339M3302
21787E5059o8429o6627R6474J00256K63568K4121j14961j47109J00661R7615j34433
21776B06195k3293q3069j62841l547R4776k9856L200o0771Q2J07312L7840k2631
21764F3397q4419k6141L7252j10861j8999Q1027k5089j46344P3396K08636N1371
21753A03226j21584O9115j00871l1714R1453J27463R7526O5309k10960k20132
$$ y = [311738, 170757, 193410, 253543, 187032, 19145, -15918, -39723, -9172, 141702, 77052, 25223, -16567, -76700, -70899, -44403, 33413, 81138, 10113, -94001, -166605, -235627, -113583, -95136, -161054, -243292, -179652, -268847, -353976, -351404, -220757, -152697, -12292, -77747, -116471, 7889, 81, -48403, -118026, -3699, 17759, 68178, -29582, 11757, 55059, -13370, -79997, 16477, 116733, 380301, 404422, 289461, 142352, 243013, 340628, 206195, 182902, 99833, -63008, -66555, 28221, -1635, 1565, -59206, -59124, 48188, 86028, 63397, -21022, -47163, -9911, -120772, -139771, -58744, -83833, -230177, -156781, 51855, 103226, -18358, 50757, -50114, -81828, 9625, 137088, 234614, 299923, 88963, -131169]
21743a31169j82652j4354L68465J87224j20237p1165N9881o2233J63636l2437
21733A64959n1708p5725j62008j16749j4756J83281J92531J28461j24261j01151
21723B2874Q04P1938j9558J7656j6450j83009m4812j87508n3836Q0415j97153
21712e08639j7488L9494K08358O3332P7141R894M5728P9313Q3683r8171j62958
21701a80313K9237N4469n6582j02205J33314J90112J59234J22120m9069j09483
21691A90834r0386r8658o0251L162k6008n4716m7038L2847Q6679P7996M946M0963
21679F0370J02721q2500j26849p9272j40818J77723J21619k856M7754R5743N5485
21668B29120O4551r0151j97929o7552L9518J3787P7724N407J1519k0889o4058
$$ y = [-131169, -313821, -328175, 40290, 227514, 107277, 36112, 95993, 33760, 197396, 164959, 113251, 37526, -124482, -241231, -255987, -72706, 119825, 248286, 124025, 22874, 23678, 95616, 76058, 93714, 77264, -105745, -150557, -338065, -391901, -311486, -508639, -526127, -486633, -278275, -214943, -137802, -127908, -82180, -2867, 80816, -17355, -180313, -151076, -96607, -153189, -255394, -122080, 68032, 227266, 349386, 300317, 190834, 100448, 1790, -58461, -55299, -81307, -136023, -183061, -150214, -63535, 14461, 19407, 60370, 163091, 80591, -46258, -125530, -266348, -88625, 32994, 30138, 77892, 173635, 229120, 293671, 203520, 5591, -61961, -22443, -8656, 69068, 74475, 85994, 65105, 1047]
21657A047j50765K00929R9869J2163m8447J6418M6370r1461r0814q8935l0509
21646a24135l2832j64011J21719J46506k4449K3854m6650k2302L5413J11841R3937
21635A18891R2542J31744J13915J4338k0074k24722o3574k5251j2569j50828L5086
21624I498P9200j1096J37407q719K7345O755j99006j23752L0686J57320J12787
21613B18425o5515p1551k01983j8023K12953J42377j0869l9230l3050k8824j47642
21602d2932K58446K86579J6480p2768q5819j15788j09429J8025k13908r7017M8262
21591a09869Q123j00119Q8759J47581J65486n4868j12891Q347k7956l7555J47197
21580A22235j97501j00436J47566J93390J02412k50376o4795J44528k02117j35431
$$ y = [1047, -149718, 51211, 151080, 163243, 114796, 131214, 177584, 86123, -4691, -93626, -124135, -156967, -320978, -199259, -52753, -77202, -53348, -99998, -122300, -86887, 24954, 118891, 211433, 343177, 457092, 471430, 451356, 226634, 163060, 137809, 125240, -25588, 9498, 88698, 77602, 215009, 206290, 233635, 240390, 41384, -82368, -51682, 105638, 218425, 152910, 81359, -120624, -138647, 74306, 216683, 205814, 166584, 133534, 104710, -42932, 215514, 502093, 518573, 445805, 359986, 244198, 134769, 152794, -61114, -158131, -109869, -101746, -201865, -113106, 34475, 199961, 145093, 32202, 40549, 12593, -24962, 122235, -75266, -175702, -28136, 165254, 267666, 17290, -47505, 97023, -105094, -240525]
21570b40525J33817j1444J35653J16369k2580l7025J02398m6736j16089p2592
21560e8754K6707J32363L1229p9119j13674q318j26354j24219J7927J27928K11703
21549C7419r6833q166n7210O7550J42221K3020o59O1289n5758p5432k06051k90422
21537d59032N2500K21083Q3238J29930K7189q3725J5940j6278O677K7342m6000
21526d1136j35778R5392k0042J06384p130m1997m6922L2731J37264R6794j52854
21515B2706o2764J85292J6473L9203L8497j15454K8911J1355j50253j4779L772
21504B959R9950m0150m4017L3811Q1109j122P5020n0753q6318k22348J01063Q6984
21492C6188p2139o0467J198M5237K0948m98n3284Q5026K0421J7980N9163j97557
$$ y = [-240525, -106708, -118152, 17501, 133870, 111290, 74265, 176663, 129927, 13838, -58754, -32047, 100316, 131545, 52426, -61248, -69566, -195920, -320139, -302212, -174284, 37419, -59414, -67580, -124790, -57240, 84981, 108001, 107342, 168631, 112873, 37441, -168610, -459032, -406532, -185449, -102211, 27719, 54908, -28817, -12877, -29155, -22478, 4864, -41136, -176914, -81522, -101564, 4820, -2310, -44307, -91229, -58498, 78766, 175560, 22706, -40058, 145234, 161707, 200910, 239407, 123953, 152864, 164219, 13966, -813, 2959, 102909, 62759, 18742, 52553, 133662, 132540, 207560, 156807, 70489, -151859, -50796, 36188, -35951, -96418, -95220, -49983, -29035, -29533, -82817, 2209, 22630, 40610, 99773, -97784]
21480i7784k44374R1222J04051N6051n5990Q7835K05824o6587j75232K3755R1480
21469B0251l266l0194J02643J23535k27941o2755j3435m5570R9831k0839k6185
21458h3925O8280j95223P9097J64580j03114N6762j2231j9471j991J18729O4647
21447A36140p9085p4956o598K28608n679j21218j77068N15M3863L7188R5585L9461
21435A16756n9963j20249J38943J00205M4461k6674l5769n2358j23386m5202K9406
21424c3830J40853k9246k0743j64951n1775j5881p129J28831K03616Q0512l9195
21413A91062m0432K2605j9150j02940M813R4193L6518J35923j05392q3941q4633
21402D8626j40152J99520K02914R2543r0521n1470N0765r8443j3140o4805N833
$$ y = [-97784, -342158, -250936, -146885, -90834, -146824, -58989, 146835, 80248, -94984, -71229, 20251, 16985, -13209, 89434, 212969, -14972, -77727, -91162, -136732, -36901, -57740, -83925, -15645, -210868, -131771, 32809, -70305, -13543, -25774, -45245, -47236, 71493, 136140, 57055, -17901, -24499, 204109, 198430, 77212, -99856, -99341, -55478, -18290, 77295, 116756, 56793, -63456, 75487, 175692, 220153, 193479, 157710, 105352, -18034, -63236, -33830, 107023, 77777, 57034, -107917, -159692, -175573, -182702, -53871, 149745, 230257, 191062, 150630, 173235, 154085, 51145, 55958, 150151, 186669, 322592, 217200, 133259, 48626, -91526, 107994, 310908, 403451, 312930, 261460, 312225, 213782, 200642, 135837, 141670]
21391A41670j38905k0425o3964j573O1128l1906J96869n4823j38310O7095L3585
21380E0441K9550k25650j15474J72684K69588Q1467j13454q2535N4679r2365P7625
21369A06556J45396l5186J7691n6657o1015p3438k41744o1204K36708J30234l4331
21358G3010j69557o3418Q3959O3562l3784K02957J46871o8816o0560N4015N3725
21347B81964o1577o7290J08819q1600j12011J61711n9367j86904o1408J7495n3804
21336a13972J38150N1166j11225P9865O4640k7845N6538N5915J19796j09692j61070
21325D2266n0030l9885M9066J28911l6641k3718R0346P1584l7657o5461K4182
21314A52963O260n4138k20932N2786Q9301j77997l4954j02139O997J32749J06804
$$ y = [141670, 2765, -17660, -81624, -83197, -22069, -53975, 142894, 88071, -50239, 16856, 50441, 79991, -145659, -261133, -88449, 181139, 262606, 149152, 66617, 121296, 28931, 106556, 251952, 216766, 234457, 177800, 116785, 43347, -198397, -259601, -22893, 107341, 73010, -96547, -159965, -76006, -12444, -46228, 156729, 303600, 234784, 174224, 228239, 281964, 220387, 153097, 261916, 180316, 68305, 230016, 170649, -16255, -77663, -60168, -113972, 24178, 75344, -35881, 43984, 108624, 80779, 137317, 193232, 313028, 203336, 42266, -7764, -47649, 1417, 130328, 93687, 69969, 160315, 231899, 194242, 128781, 152963, 159223, 105085, -115847, -63061, 26240, -151757, -186711, -288850, -281853, -149104, -42300]
21303d2300K01933N0999j0950n110j56641j29866j29677Q6301J00141J16134J1901
21292I2865k8713j17721O147j50112k32823k4700K3717K33727J06098k332M1605
21281e2242M2669J07037R2655k1052k04771j11656P5858M2103Q0843k1359o3686
21270c3601n1465k2683Q0439J80784J01589k6894M145L8027l2761k07336j40696
21259a10452p73o0328k01620J068K20705O8105k8108J08939R1209J27652o3860
21248A52537K5603m6263J47656L5352k25723l3177N622J06424k6740k1223J1053
21237A31121q2478j24687K10110K86959p8671k03586J02548J17840J01533N5964
21227E16653j54194j93767j92625P5585N0767m466n7210j6021l2665J03074R6446
$$ y = [-42300, 159633, 210632, 199682, 194572, 37931, -91935, -221612, -135311, -35170, 80964, 92865, 64152, -53569, -47422, -197534, -430357, -455057, -431340, -197613, -91515, -93847, -52242, -9573, 97464, 190119, 169067, -35704, -147360, -71502, -29399, 51444, 30085, -33601, -85066, -107749, -27310, 153474, 255063, 228169, 232314, 270341, 237580, 30244, -110452, -111225, -171553, -373173, -372105, -151400, -83295, -111403, -2464, 88745, 216397, 152537, 178140, 131877, 279533, 314885, 89162, 55985, 61607, 168031, 141291, 120068, 131121, 48643, -76044, 134066, 421025, 342354, 138768, 241316, 359156, 460689, 516653, 362459, 168692, -23933, 51652, 102419, 97953, 40743, 24722, -7943, 95131, 191577]
21216A91577r8713j01397q6151k4855M5159p5379M5626L4502l6944k3947R6611
21205c3911L8071q0274j01164Q3184j5924K1884j81610O6044J09036m10R9997
21194D923Q8210m7953j83296P0714K13503J25674j3756j42311m7316Q5019J4083
21183A67494J09727j16390m0751Q0480o1780j49080J09536L6355J8270N7006j07144
21172A03723o2564l6905j51373N498J69260K4851k4324N1244P302q2199o1863
21161e7350j19768Q2363o4100N3032N4639p3068K6270M6823J04589J84457n524
21150B32363p9890o1246Q1618J20035J6925p5237J6644J34259j19525j92775L0067
21139A03238R3375k5380K29879O2907l1995k01186m2668n6304N8445o7968j59798
$$ y = [191577, 92864, -8533, -94684, -119539, -74380, -149759, -104133, -69631, -106575, -130522, -33911, 4160, -76114, -177278, -94094, -110018, -88134, -269744, -203700, -94664, -95074, 4923, 93133, 45180, -138116, -67402, 146101, 271775, 258019, 115708, 68392, 153411, 167494, 277221, 160831, 120080, 200560, 138780, -10300, 99236, 135591, 153861, 210867, 103723, 41159, 4254, -147119, -141621, 27639, 52490, 28166, 79410, 86712, 4513, -57350, -177118, -94755, -158855, -105823, -51184, -124252, -97982, -51159, 53430, 237887, 232363, 152473, 91227, 172845, 292880, 309805, 234568, 251212, 385471, 265946, 73171, 103238, 196613, 171233, 401112, 464019, 432024, 230838, 188170, 131866, 190311, 122343, -37455]
21128c7455P789k2235L9505J27912k1037k7128m1620j09367j7154N3661P8907
21117C1778k0936m4947K2646J41617n0152k17325J15427p7996J1308P6890j8488
21106c0178m05N1876o1795N0047J40585j21877j67967l4884J13200P4795J96885
21095B10282J39974Q2446j76772k32268N8033K21740K4485k71875j96212R5792
21085d4375P6151j73119O2664J88929m1199m4390j86123J23075J15167m0462p1808
21074c5490J03745j1115o6979n4148r856J09626R5057P7946n8573k00727k16735
21063b67249M0007K86268J10188Q0071j3152m8719R1395P312j05582m4166n6077
21052H0296J55156J3037j25414j39092O546J49760L9036J82478N723l43672J38954
$$ y = [-37455, -29666, -51901, -12396, 115516, 94479, 67351, 25731, -83636, -100790, -47129, 31778, 10842, -34105, -11459, 130158, 80006, -137319, -21892, -99888, -88580, -11690, -30178, -30583, 21293, -40502, 9545, 150130, 28253, -139714, -174598, -61398, 13397, 210282, 350256, 432702, 255930, 23662, 81695, 303435, 327920, 56045, -140167, -44375, 31776, -141343, -78679, 110250, 69051, 24661, -161462, -38387, 76780, 36318, -35490, 68255, 57140, -9839, -63987, -73843, 35783, 130840, 208786, 150213, -50514, -267249, -227242, 59026, 169214, 249285, 236133, 187414, 278809, 286121, 180539, 136373, 80296, 235452, 248489, 123075, -16017, -9471, 140289, 179325, 361803, 367526, 23854, 162808]
21041A62808K26084j02867j49150k15014J91121R1479J36115Q5875j18071k52061
21031E6319M8704j8897l1016J44577P7814k8001M2329L2333j88509o5955o5054
21020D644l1491r7040M5334R4092j35672j00128R6485N014k7836J04034J32596
21009I0032J36504o4015O624m9381j17088m7263P0231J25114J35803J81963p5468
20998C93056l13023M6480Q612l1706j02198Q2863j04436N4651p315N5521j30836
20987d8331J20298R5277J26354Q1215m8740r9828k3938J9909J23236J224l8768
20976C07908O456Q7397j72829p7156J02294k797j53146j18311j74395R4594K62429
20965A62444J03375j19186k31731r6754J01511M2851R5020j51377j7847J77852
$$ y = [162808, 388892, 286025, 136875, -78139, 112982, 204461, 340576, 426451, 308380, 56319, 105023, 86126, 55110, 199687, 277501, 249500, 291829, 324162, 135653, 69698, 4644, -26847, -123887, -78553, 15539, -120133, -220261, -123776, -118762, -146598, -42564, 90032, 226536, 162521, 169145, 119764, 2676, -44587, 25644, 150758, 286561, 468524, 393056, 80033, 126513, 135125, 103419, 1221, 84084, -20352, 34299, 26984, 82505, -48331, 71967, 167244, 293598, 374813, 326073, 226245, 202307, 222216, 345452, 346676, 307908, 314364, 401761, 228932, 151776, 254070, 251273, 98127, -20184, -194579, -99985, 162444, 265819, 146633, -85098, -181852, -80341, -37490, 57530, -93847, -111694, 66158]
20955F6158N680n3732J9189m0023J15282J70905M5174r7826j99731n7130M5739
20944A9685p1125L4590N584Q0365P5313j06484J3165J01555J81905q864j56935
20933A68754j85753L6661k4123p3229J776O9972K55380j0309R0531o2947M5068
20922C11781R6716j02805l52N7814q2710r5663j12297K4775J8003j81787N632
20911f0893J06300j32534J64173Q5837K8407j5792j35467R7424J8483p5067J06108
20900A86979m392l0245j29305o7485Q3131J15686j812r2882M6233R0054j00053
20889I5909M2821l8425k06114P1257o869m0769j59101M8126J9498J11286P0409
20878H028J85800o9113k86479j78308Q0174R3183l8780P0411J09136j1037N1415
$$ y = [66158, 71838, 18106, 37295, -2728, 112554, 283459, 328633, 230807, 31076, -26054, 19685, -51440, -16850, -11266, 69099, 144412, 37928, 51093, 152648, 334553, 325689, 168754, -16999, 19662, -4461, -77690, -75914, -5942, 249438, 239129, 329660, 266713, 311781, 408497, 305692, 305340, 363154, 280444, 184781, 72484, 97259, 115262, -66525, -60893, 45407, -87127, 77046, 162883, 191290, 175498, 40031, 137455, 155938, 80871, 186979, 182587, 152342, 23037, -44448, 38683, 154369, 152557, 59675, 105908, 195962, 95909, 138730, 100305, -105809, -34552, -41421, -82190, -241291, -193165, -173667, -62381, 8028, 193828, 124715, -161764, -340072, -259898, -166715, -205495, -135084, -25948, -36985, 14430]
20867A4430j38832j90920K58031n5220j60834l6968M3209O6688o4459J06988Q0593
20856g7294O7838J18968R5840k7966j57162l7115K95523m6493J9144j905l32223
20845h2845j16002K6766Q9102l5831J8584Q4219J66384J43282J8977l6017j23447
20834A53172k12951j68332L6358J94157K32567j9167j4499j79846k426j7523n7952
20823e6442p3954R5730R6551L8277k6029j74057j19952j97799O1176J29966J15944
20812a10589O5627N4298n426O6787j5466j65459j11544j7783O9362R9628J54326
20801H3761L7085j0727J21669J5927Q0767k1849j01137n8023j59342j78Q7090
20790G5043J21431l923L2775n4122k24066J06383O9567k467R0178l3463k51985
$$ y = [14430, -124402, -315322, -57291, -112511, -273345, -310313, -267104, -200416, -264875, -157887, -77294, -9456, 109512, 205352, 177386, 20224, -16891, 278632, 232139, 251283, 249378, -82845, -198847, -172081, -82979, -118810, -100226, -16007, 150377, 293659, 312636, 276619, 153172, -59779, -228111, -191753, 2404, 234971, 215804, 201305, 21459, 19033, 1510, -56442, -130396, -34666, 61885, 100162, 74133, -99924, -219876, -417675, -356499, -226533, -110589, -44962, 9336, 3910, 70697, 55231, -110228, -221772, -239555, -170193, -70565, 83761, 120846, 110119, 231788, 247715, 328482, 306633, 205496, 147473, -11869, -12047, 75043, 196474, 192551, 225326, 171204, -52862, 53521, 123088, 120621, 210799, 177336, -74649]
20779g4649J78914J12597j13618n4672J781J37526j05748k71220J21237Q9581
20769B1729P8147j2726J23459p7955M31L1244P5169K6146k1895p1387k6511p8750
20757F7101L2894J68331M158j72020l6369k9166j7799O2366j35086j75965q5719
20746c17274L3222K39567l8453J3420J3337J19441J86092M4801j28318j20411
20736D5424j3018L3923J30343J00k4786J45932J34461p0949o0645J63381n664
20725D78502o6802j934P5332j46106k20680j20738J07566n3222J38729J67173
20715C57820K8969M1784K7551R70l8582L8995M1760l2057r3340J24757j08001
20704C90626m1280R9953R2885j22110j1370J07669J20287J06310O6351l0485M7837
$$ y = [-74649, 104265, 216862, 103244, 48572, 50353, 187879, 82131, -189089, -67852, 21729, 99876, 87150, 210609, 132654, 133085, 164329, 239498, 265644, 243749, 172362, 145851, 67101, 99995, 268326, 272484, 100464, 64095, 34929, 17130, 79496, -55590, -231555, -317274, -284052, -44485, -82938, -69518, -56181, 63260, 249352, 294153, 165835, 45424, 32406, 66329, 196672, 196772, 171986, 317918, 452379, 381430, 320785, 484166, 478502, 411700, 409766, 485098, 338992, 118312, -2426, 105140, 51918, 190647, 357820, 386789, 428573, 456124, 457094, 418512, 457507, 499267, 467210, 373870, 498627, 390626, 349346, 449299, 542184, 420074, 408704, 516373, 636660, 742970, 809321, 778836, 826673]
20693H26673j20868r3714q1254j24015P3476J96971J18367p0712l2649J24426
20683H16701K59907L1354j92498r1644k12345j42729j54104j25426P3028M127
20673B66371j79739Q821O3860j0030Q776N5790j6613j92828L5213M9430J8073
20662A07124M0828j27048R3328R0523J5076P7570j37517r8032P491J17661n6227
20651A30777M4243M9350j08103J7330J15101O7548l105q1398J12592R6940O4970
20640E06245K6577k02985j54914n9287j5503j7894Q0964m3311l5487J25220J38455
20629C48080L7387O8033N6628k0192J45333k479j46659j04434J0055k8886k6965
20618C35901K9824K7185K1526L7291O7648j50333Q0529K34845j12723l28108l7402
$$ y = [826673, 705805, 612091, 530837, 406822, 480298, 677269, 795636, 724924, 692275, 816701, 1076608, 1107962, 915464, 823820, 611475, 468746, 314642, 189216, 262244, 266371, 86632, 95453, 159313, 149283, 158059, 213849, 197236, 4408, 39621, 89051, 107124, 147952, 20904, 114232, 204755, 219831, 297401, 159884, 61852, 69343, 187004, 130777, 175020, 224370, 116267, 133597, 248698, 316246, 313141, 231743, 344335, 441275, 506245, 532822, 329837, 174923, 115636, 100133, 82239, 163203, 119892, 84405, 209625, 348080, 385467, 453500, 510128, 489936, 635269, 632790, 486131, 381697, 391752, 362866, 335901, 365725, 392910, 414436, 451727, 519375, 369042, 449571, 684416, 571693, 243585, 206183]
20607B06183J31839N1399R088O23j16073M0442l0006m5790j40537M3151N001r1412
20595F3908m3713N2076J92181q4906o4567l724r9551M448O3705L9021j8839j83875
20583h3836R3459J21297J8162J3984M5513M3819j067L03344K90550K50443M23985
20572A519653K05656j07766k41094j7416k22954m04652j91958j13825J4457J86900
20562F27001K99876J89604K15222L64216N02033N06594K48619O264p0244k82843
20552B606342l82517n96015m10286l76411q5163P9536R5678M3109K73592K59327
20542A507192J27592k11913k29861k70378j85807k06986p0260k15203k21315l2583
20532i522J32881J29271j9498K2003j65686r0858J984N04O9363r888m4602j38720
$$ y = [206183, 338022, 389421, 398509, 399132, 283059, 323501, 293495, 247705, 107168, 150319, 155320, 63908, 20195, 72271, 264452, 179546, 114979, 111255, 11704, 16152, 79857, 118878, 100039, -83836, 9623, 130920, 149082, 163066, 208579, 252398, 251331, 554675, 845225, 1095668, 1519653, 1725309, 1617543, 1376449, 1359033, 1136079, 731427, 539469, 425644, 440101, 627001, 926877, 1116481, 1331703, 1695919, 2197952, 2704546, 2953165, 2959429, 2889185, 2606342, 2223825, 1627810, 1217524, 841113, 755950, 835486, 931164, 974273, 1247865, 1507192, 1634784, 1422871, 1193010, 922632, 736825, 529839, 459579, 244376, 23061, -9522, 123359, 252630, 233132, 255135, 89449, -1409, 575, 1079, 70442, 60554, 15952, -122768]
20520a22768K79426J08752m478L3556q0133n434J35687p8201j67492k83455m5976
20509b30516K68442J59487j1674K04249O1888J54488K0716p7557j25884j06929
20499C16710r7623k15326L4298O8633R564M850l1933R0893K086j55389R61K07411
20487B35135q355j5680N83m7872m7466q846M1659j92460k751m5039q2186o205
20475a79483J5426O8280R9073J64877J62964n138j40930p1151n15J34968J40303
20464C88674l3274M4110O2860J5515j62299l2037Q6258J54079J67492j5385j13936
20453E62057p9717m1342l2613j61311j90421p4044J30551k6263o4234J43017J88662
20442C54342J64762l1216l6636j31572j92625K19518P4902j30942r6821R4660
$$ y = [-122768, 156658, 265410, 260932, 294488, 214355, 208921, 344608, 266407, 98915, -184540, -230516, 37926, 197413, 185739, 389988, 451876, 606364, 627080, 549523, 423639, 316710, 219087, 3761, 38059, 106692, 116256, 121106, 89173, 180066, 182152, 26763, 27724, 235135, 226780, 211100, 211683, 163811, 116345, 107499, 149158, -43302, -46053, -91092, -173278, -179483, -164057, -95777, 3296, 168173, 331137, 325999, 185069, 113918, 113403, 248371, 388674, 355400, 399510, 462370, 477885, 315586, 283549, 369807, 523886, 691378, 675993, 562057, 482340, 440998, 408385, 247074, 56653, -17391, 113160, 86897, 22663, 165680, 354342, 519104, 487888, 451252, 319680, 127055, 346573, 421475, 290533, 193712, 288372]
20432B88372J59934K43615K34669j2867j03686k4567l0092j65147p1627j34265
20422C84339J11554M7227O2255J84137M4693R4002K20453p0137q3750p2448r1650
20411H30675q802k4216j90064k12264r6641L2591k2709p1731L9051j23982j60660
20400h752o9693M3080O2624j23440l1577K63431O4914j05798p9283m4559J19604
20389I0551J17767j28465m7606R3171K0747P3076j6260n5307J19042J81186M6299
20378D94201M0275j67674m1796j18744j02726J5293J06224J41081j36727R3047
20368C22454j949o5134j90617J4015r9228L3027J19686J10287O6545j685o1552
20357B45849j36396J43640J71868r1748J9548K9106N4810J50653L7575K30278
$$ y = [288372, 448306, 691921, 926590, 913723, 810037, 785470, 755378, 590231, 518604, 384339, 495893, 543120, 605375, 789512, 834205, 928207, 1148660, 1078523, 994773, 922325, 830675, 821873, 797657, 607593, 395329, 298688, 331279, 308570, 236839, 275890, 151908, -8752, -78445, -35365, 27259, -96181, -127758, 135673, 200587, 94789, 15506, -29053, 90551, 208318, 79853, 32247, 125418, 146165, 219241, 202981, 147674, 266716, 447902, 494201, 534476, 366802, 325006, 206262, 103536, 118829, 225053, 366134, 229407, 322454, 320505, 255371, 64754, 78769, -20459, 12568, 132254, 242541, 309086, 307401, 245849, 109453, 253093, 424961, 333213, 352761, 381867, 436677, 587330, 624905, 855183]
20347H55183p370k56322m08223P5637J47438J40557l0j80168r5383P425j84479
20336I4265M8302J30372P3913J48630J59640o1978j43167k68652j58631P9946
20326A02640K26710J5310N7731j25540j34549J31886L6444M5779L2422j6451M2511
20315D14893l7385j15837N529K3450O7094O5622J04144M4738k51702p6579l5202
20304B08765L7531m4337j39117J7920J20242m3636J00188J53339L2512K9383j12211
20293C60579j0714O0839N2379M127j87167j80616L2459R7974M6435r5160j72027
20282I108j00826L304O3711J66998N9819p9182M7914J22373R9737M1422P2810
20271E07188r4418R1038R5142K05318K42208K03684K41694O2464L0860k4845o4437
$$ y = [855183, 847813, 591491, 183268, 258905, 406343, 546900, 546870, 366702, 271319, 278744, 94265, 142567, 272939, 346852, 495482, 655122, 593144, 449977, 181325, 22694, 102640, 329350, 344660, 402391, 276851, 142302, 274188, 310632, 356411, 388833, 372382, 414893, 377508, 261671, 267200, 290650, 357744, 423366, 527510, 572248, 320546, 243967, 208765, 246296, 201959, 62842, 80762, 201004, 157368, 257556, 410895, 443407, 472790, 360579, 349865, 410704, 463083, 467210, 280043, 99427, 131886, 229860, 276295, 181135, 9108, -91718, -88414, -24703, 142295, 202114, 122932, 170846, 293219, 392956, 434378, 507188, 412770, 503808, 598950, 804268, 1046476, 1250160, 1491854, 1554318, 1585178, 1560333, 1495896]
20260A495896k48593k75374p6682q2133n1995Q9899J45066K21076L75687K30191
20250A823038Q6676K62230K28728o4133k25347l74617l26818j40891k9469r7756
20240A141641j76602k25850r7416J45084J49469K80792J4104k81147J5491J10787
20230A076353j73599j50846k5361J34684J04366K3928L1318O5919j43495j19432
20220H23835j6727J00448O6818j07918j26239J87975J71882K9580j77893m0849
20210I10912k5124j0004N7542P2850k04664q8421O7847l2437j40153J17498J33787
20199H59633k6416j61564j08849Q2055J7208n8853L6200J36045K3047M4854q6430
20188G56930o4083P7320J38072j03321L4433J68945M4943J53857K46895M70239
$$ y = [1495896, 1247303, 971929, 895247, 813114, 761119, 851018, 996084, 1217160, 1592847, 1823038, 1909714, 2171944, 2400672, 2336539, 2111192, 1736575, 1409757, 1268866, 1239397, 1141641, 965039, 739189, 641773, 786857, 936326, 1217118, 1231222, 950075, 965566, 1076353, 902754, 751908, 726547, 861231, 965597, 989525, 1020843, 1086762, 943267, 823835, 807108, 907556, 974374, 866456, 740217, 928192, 1100074, 1129654, 951761, 910912, 885788, 875784, 933326, 1006176, 801512, 713091, 780938, 748501, 608348, 725846, 859633, 833217, 671653, 562804, 644859, 662067, 603214, 639414, 775459, 798506, 843360, 756930, 692847, 770167, 908239, 804918, 839351, 1008296, 1053239, 1207096, 1453991, 1924230]
20178A924230K09882J44614K76013j41050k50024k12063k37213o9679K73191R3583
20168B011484J42179K71421j9477K24797L5367k12958k16994r0729l64480j76342
20158A604268o1724l9436j20971l2172J89035j32044j31292m1327N2074l1819
20148A254592K59807K89057J71384j45788j80516J86855j003j36728J05659K52746
20138B056065K09027q75K0252J96474L04380K03328K66040J14418Q7113N1833
20128C508055Q5996J00999J18990M8726J31918K24940L33743M34978L93422L84102
20118E765869L58607N74494P46715O23215M46203M21273O09036O49300Q81968
20109A1076680Q54858J354603J845421K309348L340090M598489O129942Q756131
$$ y = [1924230, 2134112, 2278726, 2554739, 2413689, 2163665, 1951602, 1714389, 1644710, 1917901, 2011484, 2153663, 2425084, 2405607, 2630404, 2665771, 2452813, 2235819, 2145090, 1780610, 1604268, 1542544, 1503108, 1382137, 1349965, 1539000, 1406956, 1275664, 1234337, 1286411, 1254592, 1514399, 1803456, 1974840, 1829052, 1648536, 1835391, 1834388, 1697660, 1803319, 2056065, 2265092, 2264217, 2284469, 2480943, 2785323, 2988651, 3254691, 3369109, 3456222, 3508055, 3594051, 3695050, 3814040, 3862766, 3994684, 4219624, 4553367, 4988345, 5381767, 5765869, 6124476, 6698970, 7445685, 8068900, 8515103, 8936376, 9545412, 10194712, 11076680, 11931538, 13286141, 15131562, 17440910, 20781000, 25379489, 31509431, 40265562]
20101D0265562J2729328J7348976K1464717K2935965J8986008R225596j328377
20094A41627775r761284j7283760k0637957j6777036r007009j286796O123545
20087G2997478J3173488J8375789J9660815J5006829M534501n696917j4400406
20080A23651577k2138791k4902212k1070980j5039532r902956o779559m945778
20073A8871769l633465k692897j987956j404974j004641q12739o25386n93154
20065F116557m09722m08006n03299k91130l50623j91205j05347m53835l81100
20056C022290k49839j97233k10167q3604r861j91848n5610O3876J18407Q2261
20046B288672R6812o5440k78779k25041j23625k775q1934l2386j04614k67727
$$ y = [40265562, 52994890, 70343866, 91808583, 114744548, 133730556, 142956152, 141627775, 131866491, 114582731, 93944774, 77167738, 68160729, 66873933, 72997478, 86170966, 104546755, 124207570, 139214399, 143748900, 138051983, 123651577, 101512786, 76610574, 55539594, 40500062, 30597106, 23817547, 18871769, 15238304, 12545407, 10557451, 9152477, 8147836, 7335097, 6709711, 6116557, 5706835, 5298829, 4795530, 4504400, 4153777, 3962572, 3857225, 3403390, 3022290, 2772451, 2575218, 2365051, 2281447, 2271586, 2079738, 2024128, 2088004, 2206411, 2288672, 2385484, 2320044, 2041265, 1816224, 1692599, 1689824, 1607890, 1575504, 1470890, 1203163]
20036A203163j72844r7237o9624r9178M09J20404J30327m7552j02058M922o1541
20025H09191j95764k24660K3140P0828J4515k82439j48392J88962P7294J764J98672
20014E33111R720j15847J40966k4084j31387n0644J1043Q3559j29785p1507o7626
20003A87519p4243J15153K856K50291Q6522j23600L0337J5887p3154K1541P5606
19992E14715j580o6109r4832k11987j01932J32911J92091j6408J26915O1348J07399
19981F42531k0876J56268O1082P120K39729r9782j94004K1596m0477R7216n8476
19970H11927l4045O1410j3420r9270l7598M6100J77297J49640j00675O6559K4909
19959A052834k1320L3400R5126J80636m6066l30499j54416K1834J50072Q487r5674
$$ y = [1203163, 1030319, 933082, 863458, 764280, 764689, 885093, 1015420, 967868, 865810, 870732, 809191, 613427, 388767, 411907, 482735, 497250, 214811, 66419, 255381, 332675, 334439, 533111, 542831, 426984, 567950, 543866, 412479, 361835, 372878, 456437, 326652, 255145, 187519, 113276, 228429, 231285, 481576, 568098, 444498, 474835, 490722, 417568, 439109, 514715, 513135, 447026, 352194, 140207, 38275, 171186, 363277, 346869, 473784, 535132, 642531, 621655, 777923, 839005, 846125, 1085854, 986072, 792068, 813664, 773187, 870403, 811927, 777882, 839292, 825872, 726602, 689004, 735104, 912401, 1062041, 961366, 1027925, 1052834, 1031514, 1064914, 1160040, 1340676, 1294610, 964111, 809695, 831529, 981601, 990088, 894414]
19948H94414J8710J07235J27621q8601o3124l2991J4312j05402q8091j43018N4763
19937F95828l3492j4446K8364O6171P0401K2587J88998m180j43144k7351Q3221
19926I32957J9525K0081M6628k02923p3879L3533Q2838j54480j65954J57337K42592
19915I38255n5038k3785j9750L860J1904J30799o107R9638J26704M7082n7499
19904A196063J1147j13297m9679J02913J88272J99290k8140o5184j2891L1999
19894A460493N9745L03785J26917j41708L5974J66794L77996K49313J72115O1019
19884B872443J88725J88737J30290M6598j12666k8080R1764J132K02974L91259
19874C973176L99274L06148L91065M17204P36732P14138O07333M81640M47268
$$ y = [894414, 913124, 1020359, 1147980, 1059379, 996255, 963264, 977576, 872174, 784083, 641065, 695828, 662336, 647890, 676254, 742425, 812826, 835413, 1024411, 1020231, 877087, 849736, 932957, 952482, 972563, 1019191, 816268, 742389, 775922, 858760, 704280, 538326, 695663, 938255, 883217, 859432, 839682, 843542, 855446, 986245, 980138, 1079776, 1206480, 1253562, 1196063, 1207210, 1093913, 1044234, 1147147, 1335419, 1534709, 1506569, 1441385, 1428494, 1460493, 1520238, 1824023, 1950940, 1809232, 1845206, 2012000, 2389996, 2639309, 2811424, 2872443, 3061168, 3249905, 3380195, 3426793, 3314127, 3286047, 3377811, 3378943, 3581917, 3973176, 4372450, 4678598, 5069663, 5486867, 6223599, 6937737, 7545070, 8026710, 8473978]
19865H473978P89122P55005P30579P93295J177744J665522K135719L032796M065494
19856B3619254N756029Q436145J2335529J7238643K1697588K3546953J9917540
19849A32547681R559778j585353r987091j7793536k1767573j8865882j1818472
19842F0289552m868423J027122O846882J3273936J8761535K1345791J8339858
19835A35016253Q335608l117587j1937379k0285348k4930444k2968788j6817096
19828D3295219j1311686p436766n061268l876359k578334j895509j570684j284589
19820H280024j002100r42473o22640l70532k12181l71223l11846l51367l82200
19811C713462m81824l60593k31283j36859k36486k93373k45060J30638K9124Q0054
$$ y = [8473978, 9263100, 10018105, 10748684, 11541979, 12719723, 14385245, 16520964, 19553760, 23619254, 29375283, 37811428, 50146957, 67385600, 89083188, 112630141, 132547681, 142107459, 140522106, 130535015, 112741479, 90973906, 72108024, 60289552, 55421129, 56448251, 63295133, 76569069, 95330604, 116676395, 135016253, 143351861, 140234274, 128296895, 108011547, 83081103, 60112315, 43295219, 31983533, 24546767, 19485499, 15609140, 13030806, 11135297, 9564613, 8280024, 7277924, 6335451, 5712811, 5342279, 5130098, 4758875, 4447029, 4095662, 3713462, 3231638, 2871045, 2639762, 2502903, 2266417, 1973044, 1727984, 1858622, 1887746, 1967800]
19801A967800J05111l8465N5487O1518k05495k26969l39196k22825k48283j62649
19791G46034R481J28827j03805l4751j34699j45416M2068n6131o2594K8777O7343
19780D85134l0384j43750R30O2200J15739J38867r3913k40143j0209l3293j37665
19769A13513q8505Q5579N9784j35641J552j206j09716j02843Q8948Q5379P5246
19758G2090m3831r5739L5233P8719J24417J38707q3848j17610J20336J12351q1675
19747B59150j91226k2983m7398J11421J30735j22816j15287J18752n4571N4301
19737A20078K16906j82970Q8498R7938K6902J83895O4548k23475k5479q3517j24015
19726A59309l00191L8002M5958P4571J1795M6105l5211o9777o3203J04912J37328
$$ y = [1967800, 2072911, 2034446, 2089933, 2151451, 1945956, 1718987, 1379791, 1156966, 908683, 746034, 755515, 884342, 780537, 745786, 611087, 465671, 507739, 451608, 389014, 417791, 485134, 454750, 311000, 311930, 374130, 489869, 628736, 534823, 294680, 284471, 251178, 113513, 25008, 110587, 170371, 34730, 36282, 35076, -74640, -177483, -88535, -3156, 72090, 28259, -67480, -32247, 46472, 170889, 309596, 225748, 108138, 228474, 340825, 259150, 67924, 44941, -2457, 108964, 239699, 116883, 1596, 120348, 65777, 120078, 336984, 154014, 242512, 340450, 367352, 551247, 615795, 392320, 366841, 283324, 159309, -140882, -102880, -56922, 17649, 29444, 75549, 40338, -29439, -92642, 12270, 149598]
19715A49598Q4409N3115j15510k10088k39769m2758J03316K406m0860J48134j095
19704a09102j97126P8379L07344j24552q0960K11456j57597p8465O8459o8701
19694a50865r3763J60630j9012Q6238K23017K29953j09769j08488p4822k82211
19684a39092j29971j12385J01382K34835K6364j52703m8398K8929K7980M2655
19674a20404N5301k62089j14966m8015J76755K73906J19221m8534L7835j00895
19664c1885p9439O7939r0995m1035M1677K15182J20331j14238j08703O3521L5137
19653G7492k44746m5372J05217L5371R7734J0465M7437j0686J38357l4440O839
19642A83668J81299J10722j38227P5262Q6020j45651j00078j45685P3627Q312
$$ y = [149598, 234007, 287122, 171612, -38476, -278245, -321003, -217687, -215281, -256141, -108007, -109102, -306228, -227849, 79495, -45057, -126017, 85439, -72158, -150623, -82164, -150865, -244628, -83998, -103010, -16772, 206245, 436198, 326429, 217941, 143119, -139092, -269063, -381448, -280066, -45231, -18867, -171570, -219968, -191039, -163059, -120404, -65103, -327192, -442158, -490173, -313418, -39512, 79709, 31175, 69010, -31885, -111324, -43385, -134380, -175415, -133738, 81444, 201775, 87537, -21166, 42355, 77492, -167254, -212626, -107409, -72038, 25696, 36161, 83598, 72912, 211269, 176829, 183668, 364967, 475689, 337462, 412724, 498744, 353093, 253015, 107330, 180957, 189269]
19632A89269N6021m6185o247j39367j64093J33083K21749M6778o5839P0686R162
19621C05017m884q5947r9185k9502N6005J21649R4910n9249p0212j26199n3904
19610D8499J71303L6782O9236J73581l00100l09049n8034m7027N5971L3001P6068
19599d9769L9216P1902j16552L3320O4520N3125p0158n9379o2152q9459n0699
19588b36085Q0872J19820N8375N1455j72693l8790o6189M0371k0014J85977J00226
19577A03325K6735q9565j68699r9457J4299J60784J54724N1374J77126l0532j61845
19566A38269p1706j75939K3526P0583K3747k13071j934K7613l2749M7441k2328
19555a86548K1280r1700o2153R5305M2501M0219p4467N1031k0259r6514O1658
$$ y = [189269, 245290, 199105, 192858, 53491, -110602, 22481, 244230, 291008, 225169, 295855, 305017, 300133, 214186, 115001, 85499, 141504, 263153, 358063, 298814, 228602, 102403, 48499, 219802, 256584, 325820, 499401, 199301, -109748, -167782, -214809, -158838, -125837, -49769, -10553, 61349, -55203, -21883, 42637, 95762, 25604, -33775, -95927, -185386, -236085, -155213, -35393, 22982, 74437, -98256, -137046, -203235, -162864, -182878, 3099, 103325, 130060, 40495, -128204, -227661, -213362, -52578, 102146, 153520, 330646, 300114, 138269, 66563, -109376, -85850, -15267, 8480, -204591, -206525, -178912, -211661, -164220, -186548, -165268, -256968, -319121, -223816, -181315, -141096, -215563, -164532, -184791, -281305, -219647]
19544b19647L7902J41482Q4922K39736L4841j0210l8815j2168q1015p6797R7368
19533A97599o9247j98978j46252j05116J14303J78717J96472M936k7473O5207
19523B10168r0164j01743k6225k01317l6076j10578m5452J62048J07309j27654
19513b59684J64321J06245l7985J21277M0380p0298m6052j07688K6973R6094J12126
19502A45709j8750Q6732q1955p1727o4688R7029J44990J06894J55267L25018J29977
19491I54496j62214j52882M9860p7036o4267k39148Q2752P2043j0993J9390j3655
19480D58346K84430J71437k54174p7384n302k06478j69103j8653l4459p1474q6423
19469i237p4669j28498N4976O6481R856O3089J05065P4326j08762L7950L9126
$$ y = [-219647, -181745, -40263, 44659, 284395, 319236, 309026, 270211, 258043, 177028, 100231, 197599, 128352, -70626, -216878, -321994, -207691, -28974, 167498, 172434, 144961, 210168, 120004, 18261, -7964, -209281, -245357, -355935, -401387, -239339, -132030, -259684, -95363, 10882, -27103, 94174, 134554, 64256, 18204, -89484, -62511, 33583, 145709, 126959, 213691, 131736, 60009, -4679, 92350, 237340, 344234, 499501, 824519, 954496, 792282, 639400, 689260, 612224, 547957, 308809, 391561, 463604, 452611, 472001, 458346, 742776, 914213, 660039, 582655, 577353, 370875, 201772, 183119, 148660, 77186, -9237, -83906, -212404, -157428, -90947, -81091, -18002, 87063, 161389, 52627, 90577, 129703]
19458A29703N244l6220r1217M2131k0165j43113N9089K43551J00008o6472k34985
19447a2446R2660m3289j03964o4978n1404j6829p5443N6268R9975R4599L9870
19436A5019M3820j77232k54754K8906M3581P3118R3402J85236l9095l7247R2384
19425F7138j72316j48253M3410K18489N9916J29161n4969n6679m140j20856l2970
19414g2069q7393m4101l0664m8502n3938p504J10214J235L4863J93132M5107o0128
19402a9748l8608J00605j40387n48N5257j26476L8623L4139Q6159o7213K0485
19391e7712m3781K8719P7487N6859l211M9562k3245O4824K19974J01827J39981
19380F11284p9426q5650q5k38016j37025j19881R2772K59124J64897j47902j98688
$$ y = [129703, 134947, 98727, 7510, 49641, 29476, -113637, -54548, 189003, 289011, 222539, -12446, 80214, 36925, -67039, -132017, -183421, -200250, -275693, -219425, -119450, -24851, 15019, 58839, -118393, -373147, -344241, -300660, -227542, -134140, 51096, 12001, -25246, 67138, -105178, -253431, -210021, 8468, 68384, 197545, 142576, 85897, 81757, -39099, -72069, -159462, -203563, -234227, -282729, -336667, -344171, -233957, -232722, -197859, -4727, 40380, -19748, -58356, 42249, -98138, -98686, -43429, -169905, -131282, -97143, -10984, -78197, -57712, -101493, -72774, 4713, 61572, 58361, 107923, 84678, 149502, 369476, 471303, 611284, 531858, 446208, 446123, 208107, 71082, -48799, 43973, 303097, 467994, 320092, 121404]
19369A21404j58817N1700P1744k05750j12251K05416R1259L2944j35333j35613
19359a73297j02197K47986R6856J49797R2166M5642k7681l9970j42172j65974
19349a8844p09J95894J96931j183k1879l7905M2826P2556J58537J61270K15316
19338I62810L01031j14976k74119k34439j63336J8689J4752r9751j07358K19760
19328E23063M7248K15000L53506L03102L51582p6558m36461m04409m16419j24559
19318C35095M915J32400o5757J98502L603J73980J04996K19557L22233l3269m00731
19307I95524m06441r3997j6604j31862j5543j4040l9605J45480M12536R9498m392
19296I30554j32350j18324o0325j82149l04582k4590o4574J14481J82872J68336
$$ y = [121404, -37413, 14287, 86031, -119719, -231970, -26554, 64705, 97649, -37684, -173297, -275494, -27508, 69348, 219145, 311311, 356953, 329272, 289302, 147130, -18844, -19553, 176341, 373272, 372089, 350210, 312305, 355131, 427687, 586224, 747494, 962810, 1263841, 1148865, 874746, 640307, 476971, 495660, 510412, 410661, 303303, 523063, 570311, 785311, 1138817, 1441919, 1793501, 1716943, 1280482, 876073, 459654, 335095, 340010, 472410, 406653, 605155, 608758, 782738, 887734, 1107291, 1429524, 1396255, 995524, 589083, 495086, 478482, 346620, 331077, 317037, 277432, 422912, 835448, 934946, 930554, 798204, 679880, 619555, 437406, 132824, 108234, 43660, 158141, 341013, 509349]
19286E09349J46067J51783N6354l5084l2761j83625k09154j03238k8644j0660
19276B60387j77359j17n600J11903K11302O4696J38894J37229J8452L5381o8476
19265G26692j83785M8624J97557j6770K54205l4077j26049j35826r1079L2731
19255F72223j61729j67794n4754j6757K38816K20812M9589M1490M0378j5430m3300
19244H03544k78079k68970j54910P435J75867J9747j5490M4757J203l0805n1494
19233B52805L3442j23318j06874l68n1493O3494O6850l1088j7215k5586k0202
19222D0447l1484k26494L5953K20836K7050r0376p0845p8011P7276O429O2595
19211b6624J32370J2499m7083M9249k8230k59068l557N5116N4422J5843O4619
$$ y = [509349, 655416, 807199, 863553, 828469, 795708, 612083, 402929, 299691, 271047, 260387, 83028, 82911, 77311, 189214, 400516, 465212, 604106, 741335, 759787, 795168, 726692, 542907, 591531, 789088, 772318, 1026523, 992446, 866397, 730571, 639492, 672223, 510494, 342700, 287946, 271189, 510005, 730817, 780406, 821896, 862274, 846844, 803544, 525465, 256495, 101585, 109020, 284887, 304634, 289144, 333901, 335104, 304299, 252805, 286247, 162929, 56055, 55687, 4194, 67688, 134538, 103450, 86235, 60649, 40447, 8963, -217531, -181578, 39258, 66308, -24068, -94913, -172924, -95648, -89219, -26624, 105746, 118245, 71162, 120411, 92181, -166887, -170444, -115328, -60906, -45063, 19556]
19200A9556O6101m9086n185J66314j07960m1162n3019J83635L66482K69611J70551
19189I85838J78073J70351l57274l51720k53720j80934J89351J15550N0034J81544
19179G27093L03489N96149M16852M48438K59089l1417o35121p27422n19703k53292
19169E84155j06852N9156Q768K17350K47407K76601j0549J06538L7997k76705
19159A143866o58963l89178K0811K6703k13872n2282m3368O117R6735K891J06814
19148D6274Q963k1613o5725l4471J71991l7768o5470K0599M6580K0408Q8758j7696
19136A60830J9590j92584j03397o8590O0769J14851k8411R9527j31358j45539
19126b14312N5842K2002O0278L7706j00192n2808J63347m1747j44205K6629M2583
$$ y = [19556, 85657, 36571, 31386, 197700, 89740, 48578, -4441, 179194, 545676, 815287, 985838, 1163911, 1334262, 976988, 625268, 371548, 190614, 379965, 495515, 545549, 727093, 1030582, 1626731, 2043583, 2492021, 2751110, 2719693, 2084572, 1357150, 837447, 584155, 477303, 536459, 545227, 762577, 1009984, 1286585, 1276036, 1382574, 1420571, 1143866, 484903, 95725, 116536, 143239, -70633, -122915, -166283, -160166, -63431, -60540, 46274, 55237, 33624, -32101, -66572, 105419, 67651, 2181, 22780, 69360, 89768, 178526, 160830, 180420, -12164, -115561, -184151, -123382, -8531, -36942, 62585, -68773, -214312, -158470, -136468, -76190, -38484, -138676, -191484, -28137, -69884, -214089, -187460, -144877]
19115a44877K466k3595J3356J26515J70298q4763r2557j56827O7943N8082m1913
19104a05872o8816j16064J10589M9982m832o9882Q8740M9476M2688K01599J15403
19093B93011q307N77j92201n4949R722J53450O0488j24095q868m774l6427j01340
19081a3713k4031j03264k8360j10157J17574J27151K8332j07358n960Q7030K953
19070b9803k4695j1563Q5172m8633k05497m1937J60211L565P816n1600j71504
19059c28468K10768J30811o0596q2809J13310o429l5593k20248K508N1861p6039
19048c00924J17810K18398k5123o7350j67150r1950L5380K15631K19106r3208
19038F0620m5867r7841o153j4951l1401J1250K91326J31871l17782j98151R9275
$$ y = [-144877, -142411, -166006, -152650, -26135, 144163, 59400, -33157, -189984, -122041, -63959, -105872, -174688, -290752, -180163, -130181, -135013, -204895, -116155, -66679, -23991, 177608, 293011, 284704, 285281, 93080, 38131, 47853, 201303, 261791, 137696, 128828, 124054, 87627, -13713, -37744, -141008, -169368, -279525, -161951, -34800, -6468, -113826, -119786, -32756, -29803, -54498, -66061, 19111, -29522, -235019, -276956, -116745, -113180, -105364, -156964, -328468, -117700, 13111, -47485, -130294, -16984, -23413, -59006, -279254, -276746, -224885, -300924, -183114, 35284, 10161, -57189, -224339, -316289, -280909, -65278, 153828, 60620, 14753, -83088, -89241, -104192, -135593, -124343, 166983, 298854, -18928, -217079, -117804]
19027a17804J57839J45859k8160k66120l4225n0119R4620K8676j93326n655l9554
19016c07969J39255R4202J10932K786j33382O8786J4030p6960Q8901l8424J36245
19005I8402K05719j42559k25870j02322j00480M7829K5929J67022o695k2982J7070
18994c8937J09793J71314J37033l3964l2866p4056j95118J1159n4452k3980Q0509
18983E6435q8113L7359J44730M4533m6423n0742k5860Q0550j7733j31801p278
18972d343j23736o4877J67061o6118J8213k191O4159M3205M1908Q9934j42432
18961B0783j33757J06895J13150m8471R8700J21450m7025j71620j30413J07139
18951C6831K35139r2526J1403l0229j94704M0278R1866J15170M6354j52836k45177
$$ y = [-117804, 40035, 185894, 157734, -108386, -142611, -192730, -98110, -69434, -262760, -268415, -307969, -168714, -74512, 36420, 39206, -94176, -25390, -11360, -88320, 581, -37843, 98402, 304121, 161562, -64308, -166630, -267110, -219281, -193352, -26330, -33025, -56007, -38937, 70856, 242170, 379203, 345239, 312373, 238317, 43199, 54358, -94, -24074, 56435, -31678, 5681, 150411, 194944, 148521, 97779, 71919, 152469, 134736, 2935, -4343, -128079, -192956, -25895, -92013, -73800, -75991, -11832, 31373, 73281, 163215, 20783, -112974, -6079, 107071, 58600, 157300, 278750, 231725, 60105, -70308, 36831, 271970, 179444, 190847, 160618, -34086, 6192, 98058, 213228, 259582, 106746, -138431]
18940a38431J26975J04151Q9178P337k22261L1145l4897j33430j25694O5687J63577
18929f6663J52630r100N144m2094K3211J67118k2300r5258L0417J82091M74j23573
18917B02097o895p6528j95457j51403K15234O6442o0037r331J28087J9150R884
18906A41243L614q1591j77049j8588J27824J522j27997j23661k086K17998J15323
18895G6552J37143j88549l0961L3282k81289j06767J44279J16716J30895J08273
18885A39574k7878K7571R077K2637P7047j25265j0432j32556P7855k29913M5290
18874a26993J15360J5904K8007M3548q1824L9696j8982q3511K5109j08660q7876
18863b40222K8567M6878P3268k5722q9212o4849J79119J51783j7639K0446p7995
$$ y = [-138431, -11456, 92695, 181873, 189210, -33051, -1906, -36803, -170233, -295927, -230240, -66663, 85967, 76867, 82011, 39917, 63128, 230246, 207946, 112688, 143105, 325196, 325670, 202097, 195202, 118674, -76783, -228186, -12952, 53490, -6547, -15878, 112209, 131359, 141243, 144857, 63266, -113783, -132371, -4547, -3025, -131022, -254683, -256769, -38771, 76552, 213695, 25146, -5815, 27467, -253822, -360589, -216310, -99594, 31301, 139574, 111696, 139267, 148344, 170981, 248028, 122763, 112331, -20225, 57630, -172283, -126993, -11633, 4271, 32278, 75826, -5998, 33698, 14716, -68795, -43686, -152346, -240222, -211655, -164777, -91509, -117231, -206443, -271292, -92173, 59610, 41971, 62417, -15578]
18852a5578j26705P7785j1734j17597R8923K22172o2005j02186J15493Q840n6314
18841C1094r7699j58669k0080M00275J14338p3531O2832r0415j45761n6054M8603
18830A4933O6185N6721K00603R6460j17782j23450j49493o2802J28510k3071j06627
18819a9813J23785O0773J63602J42142j30046n8647J7306l1746j72742J8476P6744
18808A89834q0364P3961P1401K7104p7543j09437p6673j18491j33642J96322L1476
18797f052j5537K34751O9079j09460j57876K7433j0505l7133J04676P1131j6657
18786A53850n6547p3732J8903O0012k5860j23191j14203l1377K48598Q1546J31118
18775B69117j24613K8822J13692J60816J50881N15320N10313L30150K27900k19590
$$ y = [-15578, -142283, -64498, -76232, -193829, -94906, 127266, 65261, -36925, 78568, 87408, 31094, -66605, -225274, -245354, 154921, 269259, 195728, 258560, 168145, 22384, -33670, 14933, 81118, 137839, 338442, 434902, 317120, 193670, 44177, -18625, 109885, 86814, -19813, 103972, 164745, 328347, 470489, 340443, 281796, 299102, 267356, 94614, 113090, 189834, 109470, 183431, 254832, 281936, 204393, 94956, 18283, -100208, -233850, -37528, -6052, -21589, 213162, 282241, 172781, 14905, 42338, 31833, -5300, 99376, 170507, 153850, 97303, 23571, 42474, 102486, 76626, -46565, -160768, -192145, 56453, 137999, 269117, 144504, 173326, 287018, 447834, 598715, 1114035, 1624348, 1954498, 2182398, 1962808]
18765A962808l20463l17219m13261l17947J2630n7925r7855P101q5498j99517
18755A72854M0097j02365K8249J53808J28232j81996N5008Q5417Q7528L1518l9670
18744D58680k106m6188M6304r222k27767n9342J55515K14446J83031J33185J9891
18733H66427k17274k06001n3631j9001j2551n822L6692J166o5949J10561J33904
18722E68521J49289j66284n1801O3925j43007m1429J3308J59681M6548q9039O4513
18711E74225L1869n4526J08361J86563j46800P3439o341P4422R724l3480Q6624
18700I04080L6029p5777O0727J79567J31154q3957k07840l9753J80526J98279
18690A283035O0769m7864J20865n1204n1469J5593k6253J68054K74437K09355
$$ y = [1962808, 1642345, 1325126, 911865, 593918, 606548, 548623, 450768, 457869, 372371, 172854, 212951, 110586, 138835, 292643, 420875, 238879, 293887, 379304, 466832, 498350, 458680, 456574, 410386, 456690, 447468, 219701, 160359, 315874, 530320, 713351, 846536, 866427, 649153, 443152, 389521, 370520, 357969, 352147, 388839, 390005, 324056, 434617, 568521, 717810, 551526, 499725, 563650, 420643, 379214, 392522, 552203, 598751, 509712, 574225, 606094, 551568, 659929, 846492, 699692, 773131, 766790, 841212, 850936, 817456, 904080, 940109, 864332, 925059, 1104626, 1235780, 1151823, 943983, 904230, 1084756, 1283035, 1343804, 1295940, 1416805, 1365601, 1314132, 1329725, 1303472, 1471526, 1745963, 1955318]
18680A955318j02700P2831N5436R0433L32682J61859J29967M08876K50675L41768
18670C697145O12065O25643N49740M66318O05926P06119N85524P35891J315158
18661I899529J630120K362242L395048N613365R358764J4787374K0738559K2491503
18653I0276504J7104220j595162k0945592k4422879j5796450p340028k168535
18646C5112078J901489O304291J2753317K2377648L3577532L9724338L4207633
18639A85958326Q617245k5546917m5180355m0965503k5982037j4046695o982314
18632C5871750k716069J258712O374169J2810407J8439502J9206772J2408863
18625A03654106p266842k4029920k5171908j6539984r533925n673843l716281
$$ y = [1955318, 1852618, 1925449, 1980885, 2071318, 2404000, 2565859, 2695826, 3104702, 3355377, 3697145, 4309210, 4934853, 5484593, 5950911, 6556837, 7262956, 7848480, 8584371, 9899529, 11529649, 13891891, 17286939, 22900304, 32259068, 47046442, 67785001, 90276504, 107380724, 105785562, 84839970, 60417091, 44620641, 37280613, 35112078, 37013567, 43317858, 56071175, 78448823, 112026355, 151750693, 185958326, 194575571, 169028654, 123848299, 82882796, 56900759, 42854064, 35871750, 33155681, 34414393, 40788562, 53598969, 72038471, 91245243, 103654106, 96387264, 72357344, 47185436, 30645452, 21111527, 15437684, 11721403]
18618A1721403k568881j617885j098043p29911n57752l47998l49742m24562n66039
18609C460590n18120l64467n64100l76941k36632k66805J31154J02158p8012l0358
18599A258467l4162j75049p7560j73935j80832k22550j46693L4625j9803R1480
18589C53988P0160j55024O1256O3173j20115k6322L1516m3255O0838r1204p8090
18578A26921J9247k22645l5251J90580K81156M2754l4962j46450l4682L0915r168
18567B08415L2903p8621j4888j54234j27939J7803n2279P7578J34883J13217M0345
18556A97183P8425N3113m6616O7292j24069j9765P5265k8698j310m1625j10427
18545I8768k1995j93754j35548k5790j5405L9314J92047K56520p001j30258l4845
$$ y = [11721403, 9152522, 7534637, 6436594, 5706683, 5148931, 4800933, 4451191, 4026629, 3460590, 2942470, 2578003, 2013903, 1636962, 1400330, 1133525, 1264679, 1366837, 1288825, 1258467, 1224305, 1049256, 971696, 797761, 616929, 394379, 247686, 282311, 262508, 353988, 424148, 269124, 330380, 393553, 273438, 247116, 278632, 235377, 296215, 205011, 126921, 146168, -76477, -111728, 78852, 360008, 402762, 367800, 221350, 186668, 217583, 208415, 241318, 162697, 147809, -6425, -134364, -116561, -168840, -91262, 43621, 156838, 197183, 275608, 328721, 282105, 349397, 225328, 205563, 280828, 252130, 250820, 209195, 98768, 76773, -116981, -252529, -278319, -293724, -254410, -62363, 194157, 187156, 56898, 22053]
18534B2053J38776J40571M8461l00485j77930j41134O2036k4268p244j0947J95456
18523e4655L58087O5092K8075m1275j78949l7068K6497j54079J26132K6599k52827
18512h8371j26252o090Q4808N1988K92Q2452l4602K4839J8057q339l2873j07966
18500a42057K971K2460Q484L056J25753K9821j26882L1114j08284R6692J6584
18489d0288o5209j31186j30030j888l8413l5774J35303J19832R5580J0853j11197
18478a92417M7111K67037O9980o6458j03659n8658p107J86657J61539J42589p1340
18467C75274j47053j4876L1005q6847M6175J34516k93785j54789J80835J68027
18457B38482m2795m4152J3413k38709j22583J00693j8189N6224p6251j3010J4814
$$ y = [22053, 160829, 301400, 349861, 49376, -128554, -269688, -207652, -231920, -239164, -250111, -54655, 303432, 368524, 396599, 355324, 176375, 139307, 165804, 11725, 137857, 164456, -88371, -214623, -220713, -135905, -83917, -83625, -1173, -35775, -10936, 7121, -1218, -34091, -142057, -139086, -116626, -108142, -105086, 20667, 50488, -76394, -45280, -153564, -56872, -40288, -105497, -236683, -366713, -368601, -407014, -442788, -307485, -187653, -92073, -81220, -192417, -145306, 121731, 191711, 125253, 21594, -37064, -44171, 142486, 304025, 446614, 375274, 228221, 213345, 244350, 157503, 203678, 338194, 44409, -110380, 70455, 238482, 195687, 151535, 164948, -73761, -196344, -95651, -113840, -57616, -133867, -146877, -132063]
18446a32063J37063q8592n0172q0878j00433J42775J27788n6459J62672J36430
18436A98131R4820j93681j26241K2741J16329K34772j2600j03589j39580J0681
18426A01783J31354R097j53820k80932M6495k0149J21409J27950J47821j45472
18416H5536k40193p3899L7496M4595J19373o479Q0177K78464J58198m3232J4568
18405D54604n9012l27549o0811J28146K32322o031n3807o0704l7770o7010j16025
18394B6353m8469M2605Q1169J93726J52839q8664k10308j18893O7194m5997J7255
18383F8810O7743j51903j79681L0083K53002O5835K1742p5601k40056J33091O9289
18372F2354N508P413m3830o752K40833K09757o0075j07778k4067j03085l8128
$$ y = [-132063, 5000, -83592, -133764, -214642, -315075, -172300, -44512, -100971, 61701, 198131, 292951, 99270, -26971, -4230, 112099, 346871, 334271, 230682, 91102, 101783, 233137, 242234, 88414, -192518, -146023, -166172, -44763, 83187, 231008, 85536, -154657, -228556, -191060, -146465, -27092, -33571, 46606, 325070, 483268, 440036, 454604, 395592, 68043, 7232, 135378, 367700, 361669, 307862, 247158, 209388, 142378, 26353, -22116, 20489, 101658, 295384, 448223, 359559, 149251, 30358, 97552, 51555, 68810, 136553, -15350, -195031, -164948, 88054, 153889, 175631, 100030, -140026, -6935, 62354, 67862, 75275, 31445, 24693, 265526, 475283, 415208, 307430, 283363, 180278, 142150]
18361A42150J08628m7858j89418P1625J29439n2943M1144n6058q8490j05546j15009
18350a62336L7842J57333J46363r4674j81921n7899J40298j64653j07144j90364
18340d77155O0538O4531K32310j3417J76179j4642k6679p92l2493Q0654J49230
18329A98264m7863M2293j22625j15079j17490j31072P2721K30848K7841K40849
18319B78687K3906m1871j7321O1689O3882L1703M0802Q408K01590P7887J40591
18308H69953Q6896j99753r0556j97132j18011o2199q2238n0208m9135P1532K96629
18297D75778K73383l934k37267o3624j87717j19972J7274J02714m5110j46390
18287F5135N6350J69381j6918j70417o7069R3551K61906k0842j0118l5204r2891
$$ y = [142150, 250778, 202920, 13502, 85127, 214566, 161623, 202767, 146709, 58219, -47327, -162336, -124494, 32839, 179202, 84528, -97393, -155292, -14994, -179647, -286791, -477155, -416617, -352086, -119776, -133193, 42986, 28344, 1665, 873, -31620, 49034, 198264, 150401, 192694, 70069, -45010, -162500, -293572, -220851, 9997, 37838, 278687, 302593, 260722, 243401, 305090, 368972, 400675, 441477, 449885, 651475, 729362, 869953, 956849, 757096, 666540, 469408, 351397, 289198, 206960, 156752, 107617, 179149, 475778, 749161, 745227, 507960, 444336, 256619, 136647, 153921, 256635, 211525, 65135, 121485, 290866, 273948, 103531, 36462, 130013, 391919, 371077, 360959, 325755, 232864]
18276B32864r5870j14642k8519J07737M6242Q7908K47808J72737J27727J40079
18266I24071L3975O3404N7366j76614p1218J17916J35734J62366j8056M3575R1391
18255A363910J92663j20372p1059j73892j29804k57620K5281J38649o7579q2601
18245H17576P4152j90735j26331n3154j7133J25284J02338N2749O8809J08627
18235I62182J19243R5991n2304j09021j8086k81Q501n8198j01798j40901K1258
18224G26586K38348j60696P45Q7720k33177p0994O9928R4902J07470M2459Q6550
18213I89841q2985L08370L46050J08757K0859o0846j31831k13469j98629q4799
18203A001318j50851k58310k5820J31009Q0814M9540q5836J4961K1830M6704N9574
$$ y = [232864, 136994, 22352, -6167, 101570, 147812, 235720, 483528, 656265, 783992, 924071, 958046, 1021450, 1078816, 902202, 830984, 948900, 1084634, 1247000, 1228944, 1272519, 1363910, 1556573, 1436201, 1365142, 1191250, 1061446, 803826, 829107, 967756, 900177, 817576, 891728, 700993, 574662, 521508, 504375, 629659, 731997, 784746, 853555, 962182, 1081425, 1177416, 1125112, 1016091, 998005, 997724, 1006225, 948027, 846229, 705328, 726586, 964934, 804238, 804983, 892703, 659526, 588532, 658460, 753362, 860832, 903291, 989841, 906856, 1215226, 1561276, 1670033, 1690892, 1630046, 1498215, 1284746, 1086117, 1001318, 850467, 592157, 566337, 697346, 778160, 827700, 741864, 756825, 778655, 825359, 884933]
18192H84933N2730j9397p4974r4511r5306m3576J12612p0299r9873j20500k8708
18181D03131n8430J0894K5613L8336j88260M7968J65351R8376R9793p693L7326
18170F72405O6440j75164j36641J28275M7272k2936J9745J15214J01495q6296
18160G29809J2147p1159j67057L3051J21060k3358L07803J67522o8699P1897m6459
18149A066557L45851J8103J391n2951j0382J37598J56473J23292j04546j45952
18139A535434Q8625K22334K37635J20541K00063K85705J39697K23912K59820L64722
18129C678488L94112L56979M08718M69481O42534Q07052Q84299J014216J403780
18120A0059659J768210K122568L233129M557284O417422R649089J5440817K6584010
$$ y = [884933, 937663, 918266, 843292, 748781, 653475, 609899, 722511, 652212, 552339, 431839, 403131, 344701, 355595, 381208, 419544, 231284, 279252, 444603, 542979, 642772, 635079, 672405, 738845, 563681, 427040, 555315, 602587, 579651, 599396, 714610, 816105, 729809, 741956, 670797, 503740, 536791, 657851, 634493, 942296, 1109818, 1041119, 1113016, 1066557, 1412408, 1430511, 1431902, 1378951, 1368569, 1506167, 1662640, 1785932, 1681386, 1535434, 1624059, 1846393, 2084028, 2204569, 2404632, 2690337, 2830034, 3053946, 3313766, 3678488, 4072600, 4429579, 4838297, 5307778, 5950312, 6757364, 7641663, 8655879, 10059659, 11827869, 13950437, 17183566, 21740850, 28158272, 37807361, 53248178, 79832188]
18112G9832188M4144906O0222696O1597291L9789227k3106018p1561793p1753527
18105A19164970m4625568k4406797j4092957q816365n795897l840983k675078
18098A4911325k227477j841300j540174j344022j256694p42017n81819n63877
18090D813945m90893n22735l09439k03239k57651k21277j16929j9045Q2521j27857
18080B627401j49925q348N7166L8827j41756j40761j13934k08728l5394J0968
18070A935516l22215j89346o0665J03438L9343l27110k03836o521Q6882J2230
18060A067716q0961q5185J8452p0799q1891Q5789J02455R6349J38666k6299l6781
18049A127511l7197K4525K3261M6814J62326J86923J4608j49696k52156k13069
$$ y = [79832188, 123977094, 184199790, 245797081, 285586308, 262480290, 190918497, 119164970, 74539402, 50132605, 36039648, 27223283, 21427386, 17586403, 14911325, 12683848, 10842548, 9302374, 7958352, 6701658, 5959641, 5377822, 4813945, 4323052, 3800317, 3490878, 3287639, 3029988, 2808711, 2691782, 2672737, 2755258, 2627401, 2477476, 2469128, 2526294, 2565121, 2423365, 2282604, 2168670, 1959942, 1924548, 1935516, 1613301, 1423955, 1363290, 1466728, 1506071, 1178961, 975125, 968604, 1055486, 1067716, 986755, 901570, 920022, 849223, 767332, 853121, 955576, 1051925, 1190591, 1164292, 1127511, 1090314, 1114839, 1138100, 1184914, 1347240, 1534163, 1548771, 1399075, 1146919, 933850]
18039I33850j36335Q8619K99168J21996j07902j07779M3740m2132j09464o5813
18029I17948N0503K7541P8504R2145j7264n6084j27329k10803p7250L3389j39796
18018E71504k04861n2998N2124J2615Q6991M6774m263j2467j25089j933J6470
18007C84867j83947J00994L5548n6192j04475n7543l1072m1738l2949M2078q4943
17996b9372K31767J83095o2753j86193j6741Q3783R8845M3515q8069n3200J7586
17985B22263J29304k96271l20876O1981J41357R2228J87040J23180n2177j95945
17975I2084j8358k5022j17982r653J69894J11232r1574q6662l5205J01725K5821
17964A16300j77451k32824k37066p1072J35459k6919J03903K42791J23066L3374
$$ y = [933850, 797515, 886134, 1185302, 1307298, 1199396, 1091617, 1135357, 1093225, 983761, 917948, 968451, 995992, 1074496, 1166641, 1149377, 1093293, 965964, 755161, 677911, 711300, 571504, 366643, 313645, 365769, 378384, 465375, 512149, 507886, 495419, 370330, 368397, 384867, 200920, 301914, 337462, 281270, 176795, 119252, 88180, 46442, 13493, 55571, -29372, 202395, 385490, 322737, 136544, 119803, 203586, 302431, 345946, 257877, 204677, 222263, 351567, 55296, -265580, -203599, -62242, 29986, 217026, 340206, 288029, 92084, 73726, 48704, -69278, -78931, 90963, 202195, 110621, 23959, -11246, 90479, 116300, -61151, -293975, -531041, -602113, -466654, -493573, -389670, -146879, -23813, 9561]
17954I561n232M8388j31394j73810r0769L29847N3797J6279j01755l2470O4006
17943a3552k01478j14226l6560M8304J18368K49332J03279N2716K8990m022K7035
17932B58186j7304j64439o1396J36990N8241j28918l1970J01876M0264K4252l5889
17921A79893k16986l14267K8548L4776K21992K44696n7107P4187Q3010K6410J17800
17910D22952K7729p7112j14712n3439j29656j70856J5186P2866N0209n0372n3390
17899f0595k5545l4539M3101J28590J98229o5613n8047n0723l6971p0395j03912
17888a36420o7456j03990j43446R9352R8385J81652n7827n5698r1272R4325Q6548
17877i5847N7029J05811q6989q2140N0557J9019R5583q546j27822j56620j9172
$$ y = [9561, 4329, 52717, -78677, -252487, -343256, -13409, 40388, 56667, -45088, -77558, -13552, -215030, -329256, -365816, -317512, -199144, 50188, 153467, 206183, 235173, 231151, 258186, 240882, 76443, 15047, 152037, 210278, 81360, 49390, 151266, 191530, 215782, 179893, -37093, -351360, -322812, -288036, -66044, 178652, 121545, 195732, 278742, 305152, 422952, 450681, 373569, 258857, 205418, 75762, -95094, -79908, -7042, 43167, -7205, -60595, -86140, -120679, -77578, 51012, 249241, 183628, 125581, 74858, 37887, -32508, -136420, -203876, -307866, -451312, -351960, -253575, -71923, -129750, -185448, -276720, -182395, -95847, -38818, 66993, -19996, -102136, -51579, -32560, 63023, 54477, -73345, -229965, -249137]
17866b49137O5044j39561K8631J25897K60015J01083J79954n8159r0937k10520
17856A2310j84413R5239J76199m9218M393J01115J83589o1891r3212O8545k54294
17845a638j09559M7314j2651r1614J78899N1266L0253J1323j85491Q927J38557
17834F5586o8294o0262J63810k5781j26296L8494j48283K73046K36333n9520k27099
17823F1734k4538l7078r4548K53826n1768l79652O4242j11260O1401J11053J41427
17812e161k5159j49772j58555j06310J1345R0556j28531N3436J51129L79J0585
17801b56058K50678K7775j03804k2425j33852l5876J27204r4399j21329R8498
17791b63588O9290J18366R4751J52590J36569o9427l61793j8158L5167j50359
$$ y = [-249137, -184093, -323654, -295023, -169126, 90889, 191972, 371926, 313767, 222830, 12310, -172103, -76864, 99335, 50117, 54510, 155625, 339214, 277323, 184111, 252656, -1638, -111197, -63883, -76534, -168148, 10751, 62017, 92270, 103593, -81898, -72971, 65586, -2708, -62970, 100840, 75059, -51237, -12743, -161026, 112020, 348353, 288833, 61734, 37196, 118, -94430, 159396, 107628, -272024, -207782, -319042, -257641, -146588, -5161, -30320, -180092, -338647, -444957, -433612, -343056, -471587, -418151, -267022, -266643, -256058, -5380, 22395, -81409, -103834, -237686, -273562, -146358, -240757, -362086, -263588, -194298, -75932, 18819, 171409, 307978, 238551, -123242, -141400, -106233, -256592]
17781b56592J66046J54438r342P1672J86173o3344N1388J11758k15977m16080
17771b19860M7922R4429j48203m2888K51664K06806j6881j85363j24095K1788
17761a14681J63754m9877N542n866k3148J72499k14151r5269j76363K5148J54495
17750a57917k5664k11K3565Q7782K49878n6559j35273N1020P4635o2142j59501
17739a10387j75960j08139P7985J53627J51414k9228N988K35727j92449j39136
17729a30558O6124K40335j2926o247l6275n6650j78980o3322p5431M1824o1196
17718b73302q1584O474J56697l0368J46927P6513M0698k45357j46704J93370J51640
17707d996m5499K7589R6633j60524k16640o6070j3002Q6191K66029J34330o3548
$$ y = [-256592, -90546, 63892, 54550, 126222, 312395, 249051, 300439, 412197, 196220, -219860, -171938, -77509, -225712, -268600, -16936, 189870, 172989, -12374, -136469, -114681, 49073, -804, 4738, -1128, -24276, 148223, -65928, -161197, -337560, -312412, -157917, -183581, -183792, -160227, -72445, 177433, 120874, -14399, 36621, 111256, 49114, -110387, -286347, -394486, -316501, -162874, -11460, -40688, -34700, 201027, 8578, -130558, -64434, 175901, 162975, 156728, 120453, 63803, -115177, -178499, -253930, -212106, -273302, -354886, -348412, -191715, -222083, -75156, 1357, 42055, -203302, -350006, -156636, -4996, -50495, -22906, 73727, -86797, -303437, -369507, -382509, -296318, -30289, 104041, 40493]
17696D0493n3389l0641N0144J25081k9250p0133l231k31912j38094K2167J0161
17685c08604j14258P8315K05321j2582K08191J18368J3649n9780J5847k06248
17675f1781j66584q533o555l6532J23005K08495k4401j88386j5464J98246J4388
17664C5898j24459p7288o4513r88k05588k8800j21440m9796J61564K22861Q5156
17653a67393M6480O2491k9781j58338J3523l3862K03084P2826r9077p8607j22450
17642b91104K601J85906Q3573J40276n8693j58585k72431J32415J27780n0785
17632a59047P0005J02652K39956j0887j92343j05375o5432q5196m6982j3871J39327
17621a27193J16978j10896n4999J67301j01853r9606P5384J40160j23183Q7567
$$ y = [40493, -12896, -43537, 6607, 131688, 102438, 32305, 29074, -202838, -340932, -318765, -308604, -422862, -344547, -139226, -151808, 56383, 174751, 188400, 128620, 144467, -61781, -228365, -236898, -243453, -279985, -156980, 51515, 27114, -161272, -176736, 21510, 35898, -88561, -165849, -230362, -231350, -436938, -465738, -587178, -636974, -475410, -252549, -167393, -120913, -58422, -88203, -246541, -233018, -266880, -63796, 9030, -90047, -168654, -291104, -288503, -102597, -19024, 121252, 62559, -96026, -368457, -236042, -108262, -159047, -89042, 13610, 253566, 242679, 50336, -55039, -120471, -205667, -252649, -266520, -127193, -10215, -121111, -176110, -8809, -110662, -210268, -134884, 5276, -117907, -30340]
17611c0340J1820r6670j25501P2465P2095j2921j27411J26609J05363K5115j17715
17600i7091J19832r26r4427p3324j8865q269j48645r7052J23007J17053M7300
17589a31407j6965j51760O8080J39913q026K3808j10487p9525l3308J4026J17231
17578a68420Q4558K02468L7254J4282n1252K2251j20175j22373m597l3732k4485
17567a64221N3632K01413J0717n7235j00604P1400K9024J4971J8215k9567N3457
17556A01202P0526k1994r2960O5181k628j51798m0399J53116l9783j48642q1780
17545a89959J58671k28794j63778N4555K06862O6924j66767m9620N1487J23935
17535a36484m1230l17132L6663J85105L5788m0600R5231n547j6826J17763M9318
$$ y = [-30340, -18520, -115190, -240691, -168226, -96131, -109052, -236463, -109854, -4491, 20624, -97091, 22741, 21815, -72612, -145936, -164801, -173070, -321715, -418767, -295760, -178707, -131407, -148372, -300132, -232052, -92139, -100165, -76357, -186844, -266369, -299677, -285651, -168420, -83862, 118606, 155860, 170142, 118890, 141141, 20966, -101407, -106004, -139736, -164221, -110589, 90824, 101541, 44306, -56298, 15102, 44126, 59097, 77312, 47745, 101202, 171728, 149734, 56774, 121955, 119327, -32471, -72870, 80246, 40463, -108179, -189959, -31288, -260082, -423860, -369305, -162443, -95519, -262286, -311906, -260419, -136484, -177714, -494846, -458183, -273078, -237290, -277890, -182659, -188206, -205032, -87269, -37951]
17524c7951o1719N8702p0833l1451P5353m9832j53008M6175J85986J51172P4594
17513A87188J726j64734r6644J81325J12155j87474p6879p2186O3639J2038n003
17502d4849O3005q0663Q396K6126K4052p6379j5167k55534j412J78228J48211
17491b5986m7176m0572j32350R688J94299K12000r5354k33443r9805J32493K00721
17480G4515K8253j42436n0475j30156n3610o1307M6853L770o6907j70485J45975
17469c76010J04883J0737O4154Q8810j93217J6404N463J24408J36216K5261N2604
17458E9713N3877M1439j14549K6890Q7725j9827j51530J42179J85797J5978j6313
17447C11379J32501k4680K03839L72807L75166K2167m22273k90753j87898l13328
$$ y = [-37951, -99670, -40968, -111801, -143252, -67899, -117731, -270739, -224564, -38578, 112594, 187188, 188914, 24180, -72464, 108861, 221016, 33542, -43337, -115523, -51884, -39846, -44849, 18156, -62507, -54111, -27985, -3933, -80312, -95479, -351013, -352425, -174197, -25986, -73162, -113734, -246084, -236396, -42097, 169903, 74549, -158894, -258699, -126206, 74515, 102768, -39668, -90143, -220299, -273909, -335216, -288363, -284593, -351500, -521985, -376010, -271127, -260390, -196236, -107426, -300643, -284239, -278776, -154368, -18152, 7109, 59713, 113590, 155029, 40480, 67370, 155095, 135268, -16262, 125917, 311714, 327692, 311379, 443880, 419200, 623039, 995846, 1371012, 1393179, 970906, 680153, 492255, 178927]
17437A78927l38029j40058K3934J35392J02859M530O6506j39760j9334Q1506n4145
17426i7672j35012J1226O9098J26173j48352n8569K4209j23509L0088P2792l0328
17415b59856j6580Q5771J15509k9994o883p7951N0763K40608j5293j41311l7035
17404i2252O4451o8801j9247R2897J8274J40718j39785k16769k2900J22430J45525
17393B4541O1961p8830j1114L357N002l4469p8786n0324M3348p2845m5087J60985
17381g2261L2801J1968J33189K01767p7535j82402k85921k4113n0968J18185J15226
17370h0064K8558Q3471m3257K0874q7073k0628j08227L0156n5759J08583J143
17359a22223o1077Q7149R6666l1929m6663O3369N9154J4250o2182L6963j88826
$$ y = [178927, -159102, -299160, -275226, -139834, -36975, -32445, 34061, -105699, -125033, -43527, -97672, -232684, -221458, -152360, -26187, -174539, -233108, -208899, -332408, -302320, -229528, -259856, -276436, -190665, -75156, -105150, -112033, -189984, -139221, 101387, 86094, -55217, -92252, -27801, -96602, -115849, -22952, -4678, 136040, -3745, -220514, -243414, -120984, 24541, 86502, 7672, -3442, -85, 4917, -29552, -108338, -158662, -115314, -188159, -233246, -72261, -39460, -27492, 105697, 307464, 229929, 47527, -238394, -262507, -313475, -195290, -80064, -51506, 31965, -11292, 9582, -77491, -98119, -206346, -176190, -231949, -123366, -122223, -183300, -96151, 515, -31414, -78077, -14708, 44446, 58696, -3486, 33477, -155349]
17348a55349k282m1729M9024J31734Q2880j07494n6691l51J74804J236j09131
17337c3349K3563j97689j75012j10570J61138K53408j6873J55851J49379L6440
17327B46286j31687m1296R9567Q0828J44681k66498j08306j2637j12106j2350
17317a13518P0796J10237j65908j06620q6654Q2791J30991j7617J22980R6253
17307A23731j50964j95081P6025J51365l8751P537J59815j116m4562j29355j44710
17296a86066J52582J0252j24117j4774K9288n5800N0401M3520p8212j10252m747
17285b87925J17536R773N0331o8942N3719O3424M4185m9548j30975O0969J6144
17274a21309p9244J13221L2876J22349q4078q1847j93039J7082k1570R9096J63814
$$ y = [-155349, -157631, -199360, -150336, -18602, 64278, -43216, -99907, -100258, 74546, 75782, -33349, -9786, -207475, -382487, -493057, -331919, -78511, -95384, 60467, 209846, 246286, 114599, 73303, 172870, 253698, 398379, 131881, 23575, 10938, -101168, -113518, -42722, 67515, -98393, -205013, -291667, -208876, -77885, -95502, 27478, 123731, -27233, -222314, -146289, 5076, -33675, -26138, 133677, 132561, 87999, -41356, -186066, -33484, -23232, -147349, -162123, -132835, -188635, -138234, -94714, -172926, -283178, -287925, -170389, -160616, -110285, -179227, -125508, -62084, -17899, -67447, -198422, -137453, -121309, -200553, -87332, -54456, 67893, -16185, -98032, -291071, -273989, -295559, -196463, -32649]
17263c2649P5024m2032L489m3972J8138J16044j09795K6274Q4903k38785N0795
17252i2566n195p1620r1537j7320p5511M5868J49247j00289m8428n510J4145P3605
17240b25111J84600J77365J19273j3418m9112o8236j15703L5131q2097j80634
17230b17942q6291J07713l4844K7160J74448N6042L6956m8747j75790J5840p282
17219a52737j30109j04316K1672L2430l1072q7358J37392J22559J12353J17358
17209C8172O9222J06875p0470j6538j37039q6355m6350Q6134M8511p3803k5539
17198a07180J18274r4986J21368R5268r4322o60O171n3877j73339j11067J54399
17187a39951M6092J5473J49193j69145k08351k7188O4464J88724J77983m979n978
$$ y = [-32649, 42375, 343, 3832, -40140, -22002, 94042, -15753, 10521, 95424, -143361, -92566, -97761, -169381, -260918, -278238, -353749, -307881, -158634, -258923, -307351, -312861, -298716, -225111, -40511, 136854, 256127, 242709, 193597, 125361, 9658, 44789, -37308, -217942, -304233, -196520, -231364, -204204, -29756, 26286, 63242, 14495, -161295, -145455, -152737, -282846, -387162, -365490, -333060, -364132, -451490, -314098, -191539, -79186, 38172, 107394, 214269, 143799, 127261, -9778, -96133, -142483, -56349, -7838, -81641, -107180, 11094, -83892, 37476, 132744, 38422, 37762, 43933, -9944, -183283, -294350, -139951, -93859, -78386, 70807, -98338, -306689, -333877, -269413, -80689, 97294, 92315, 86337]
17176H6337n6135O78m6601J0066L9145J13036q3218r6660J5519n7586L5879R2846
17164E3306o221P9707j88433j25629J9160J70651R9127o2778p677R5930R1182
17153B18325n2385m8760j1480k38938o3152P1209j58197K635K00036J49718J3838
17142H2849j73318j06384N924m6714N0289q5497J70334Q5488j30392o3194L8491
17131a72124J01099P8340Q2549o86o6278j0046q932N8872J04964J39488R54k40387
17119F7813k12851O9865J26362O2082M7268m6887j21039J06854k3796j98671M3686
17108g9314J74997j18698p3858j22278K6925M566q5075O8818J71571l5208k8193
17097i5747m6121J7241k4851K3969l508J38059J6999R2887K6172m0307n355K4288
$$ y = [86337, 30202, 30880, -15721, -5655, 33490, 146526, 63308, -33352, -17833, -75419, -39540, 53306, 47085, 126792, -61641, -187270, -168110, 2541, 101668, 38890, 31213, 127143, 218325, 165940, 117180, 105700, -133238, -196390, -125181, -283378, -280743, -80707, 69011, 82849, -90469, -196853, -190929, -237643, -187354, -272851, -102517, -17029, -147421, -210615, -172124, -71025, 7315, 89864, 89178, 22900, 12854, 3922, 62794, 167758, 307246, 308200, 67813, -145038, -75173, 51189, 113271, 160539, 113652, -7387, 99467, 75671, -123000, -79314, 95683, -23015, -96873, -219151, -192226, -187660, -272735, -203917, -32346, -67554, -95747, -141868, -124627, -149478, -125509, -129017, 9042, 26041, 118928, 145100, 104793, 99438, 123726]
17085A23726R1766J70625j4394j93321l26797q9866O66J06239P8858q4539j2227
17074a49264j9093M3464m2733L5815n8455M5976J9015J56207o0124p5396J50369
17063D5781j59887j23107K12893j03741j68767M2801J12497J11397Q1020M8097
17053I8984o7823P987R1615r7890r0444J41K1939p6131l711o8149l1335n1260
17041b66077j65240K9590P4560K3834R4509J05308N8360j01367o115j45889L7623
17030b60904K11346R999J1733o0402k523j9405J45015K0467k07472j10587J22341
17019a40392K3247N6984O0888j87935l51460J46420J34430r3985J4281N0411J47489
17008a39622r5957j29929j57806N3588K58958J51029m7403j22332j51545Q5241
$$ y = [123726, 215492, 386117, 371723, 178402, -148395, -238261, -237595, -131356, -52498, -137037, -149264, -168357, -124893, -167626, -131811, -190266, -144290, -125275, 30932, -29192, -104588, 45781, -114106, -237213, -24320, -128061, -296828, -254027, -141530, -30133, 50887, 98984, 31161, 39148, 130763, 32873, -57571, -57430, -35491, -111622, -115333, -183482, -214817, -266077, -431317, -401727, -327167, -303333, -208824, -103516, -45156, -146523, -152638, -298527, -260904, -49558, -39559, -27826, -88228, -90751, -110156, 34859, 55326, -152146, -262733, -140392, -117145, -60161, 727, -187208, -538668, -392248, -257818, -351803, -337522, -287111, -139622, -235579, -365508, -523314, -469726, -210768, -59739, -107142, -229474, -381019, -295778]
16998b95778J71781j45996m838O5033J27277R8370k7045j33491O6808k9442n3326
16987a60647J8428N940K6887R678R2886o0502m9610N7248j98N4303j0347r3959
16975a09893Q717O3647O5239j18204R3616o9347k7047k7649J70187N0368p4324
16964B5310M4967m021j01858J02094Q6879p4077l5243l5213J8676Q0541q2592
16953B5463j36350Q535n1681J32931M0598j6668L4148P5241j56960P5775j7831
16942A3201j82528o2090J14327J75887R7534J54691P1498p155N7504l9776k3242
16931C69851m9549k95518n2722J84309K1656q0089o3121m6942J51907R5202q9038
16920A45946J66620P1113K9882q0116p9133k98854o7197L9729r3830j12307p6366
$$ y = [-295778, -123997, -269993, -274831, -209798, -82521, 15849, -11196, -144687, -77879, -107321, -160647, -142219, -136279, -109392, -99714, -6828, -67330, -116940, -59692, -59890, -5587, -15934, -109893, -101176, -37529, 27710, -90494, 3122, -66225, -93272, -120921, 49266, 99634, 25310, 70277, 66256, -35602, 66492, 153371, 79294, 44051, 8838, 27514, 108055, 25463, -110887, -102352, -154033, -21102, 19496, 2828, 36976, 112217, -44743, 31032, 13201, -169327, -231417, -117090, 58797, 156331, 311022, 382520, 375365, 432869, 393093, 369851, 320302, 24784, -27938, 156371, 178027, 97938, 34817, -12125, 139782, 234984, 145946, 312566, 383679, 413561, 333445, 254312, -44542, -111739, -72010, -165840, -278147, -354513]
16909c54513n2492J05713j494J19349K05643K4982M2989j2314J52987J4234p8912
16898A66172j67635J4006J02212j9935O307k4108m937J4158k10579j8749l1271
16887a74359j05827j6948J3295J86855P8875K9105j2226j49634R0413k9736J50929
16876F0742L9846o7320o5522j54839j00285K3284Q4979j7853P0215J69119J01936
16865A44302J7799R4507q8328k3013k5538j11949P5811O4799p9013L2283n9510
16854D2150j62572J11939J7051m3692Q8883j54375j84325j0468M3906R8313j40182
16843b93372N3239J78950k891j31193J24403J37636Q6677j56838k58091J25725
16833a35755Q9761k64782o0222J54650J14206J31859k5672j38521L3223j28166
$$ y = [-354513, -407005, -301292, -302786, -183437, 22206, 47188, 90177, 77863, 230850, 245084, 166172, -1463, 12543, 114755, 94820, 101127, 77019, 72082, 86240, -124339, -143088, -174359, -280186, -297134, -283839, -96984, -18109, 10996, -1230, -150864, -60451, -90187, 60742, 100588, 33268, -32254, -187093, -287378, -264094, -179115, -196968, -126753, 42366, 144302, 162101, 256608, 168280, 145267, 119729, 7780, 83591, 148390, 69377, 101660, 42150, -120422, -8483, 8568, -35124, 53759, -100616, -284941, -295409, -251503, -153190, -293372, -240133, -61183, -64074, -195267, -70864, 66772, 153449, -3389, -261480, -135755, -45994, -310776, -370998, -216348, -102142, 29717, 4045, -134476, -101253, -229419]
16823b29419j14515Q0651K20829P3015p0842j7961J46177j08468k63697L3151
16813b51079R9126j37190l8662R9835N4894P0772j66114j2654K77539M0398L3440
16802G0305P7725J5362k23091p5652J3030j4487m0331o2006N9345O670K9042N4503
16790h9585M5695j7071K5851j40405K0541j02952q3912J47885Q7863K6193n4334
16779a34231o5512R4541Q6900J2969n8325O9752K62537J9690n9586j22056K1743
16768A28422J05597o3109k17578q7168k8071p0410n162L1008R7574R8310l1429
16757d2016K1094L3164m687J915L1275L1954J02606j36957k56748o3282k1755
16746c03437O6056l1693m9703O7421p6050p6145K9568L8612R2166L2472P1807
$$ y = [-229419, -343934, -263283, -42454, 30561, -40281, -58242, 87935, -20533, -284230, -251079, -151953, -289143, -327805, -227970, -173076, -102304, -268418, -281072, -3533, 36865, 70305, 148030, 163392, -59699, -135351, -122321, -136808, -177139, -239145, -179800, -173130, -144088, -89585, -43890, -60961, -35110, -175515, -154974, -257926, -341838, -193953, -106090, -79897, -134231, -199743, -105202, -18302, -5333, -63658, 6094, 268631, 288321, 228735, 106679, 128422, 234019, 170910, -46668, -133836, -161907, -232317, -237479, -206471, -108897, -10587, -42016, -20922, 12242, 7555, 9470, 40745, 72699, 175305, 38348, -218400, -281682, -303437, -237381, -269074, -318777, -251356, -327406, -403551, -373983, -335371, -243205, -210733, -138926]
16735a38926N1279K15429J9445p4502j82386j7472l5512q6462N1282L8501l7278
16724a96602o1211K92830p0965N8153J11709K3272j14640m3757k2396o43O8791
16713D4541N4864p2726o2083m2263m6952j7364L9349P5567J70641K28078M4874
16702D16526j62095j33024j11941j52020n6415O1084J6255J01639J13271o8771
16692B4509j42876p3701o0062Q2861K1265p795Q0174J7773j75542j86240j1731
16681d31365K47134o2655j15066P7006r495J15301K33085M8236N7669j70426k4577
16670c5153J11111N6167j46621q6890J45638j7404r7823o804n0147j18481M58
16659b45949J1523j533J88684l3453q3671J09706J04512J30285p2172Q1151L4946
$$ y = [-138926, -87647, 127782, 147227, 72725, -109661, -127133, -162645, -249107, -197825, -159324, -196602, -257813, 35017, -35948, 22205, 133914, 157186, 42546, -1211, -23607, -24250, 44541, 99405, 26679, -35404, -77667, -124619, -141983, -102634, -27067, 143574, 371652, 416526, 254431, 121407, 9466, -142554, -198969, -137885, -121630, -19991, 93280, 24509, -118367, -192068, -252130, -169269, -148004, -155799, -75625, -57852, -233394, -419634, -431365, -184231, -246886, -361952, -284946, -294441, -179140, 53945, 102181, 159850, -10576, -35153, 75958, 132125, -14496, -101386, 44252, 26848, -70975, -77779, -127926, -246407, -245949, -234426, -235959, -47275, -80728, -164399, -54693, 49819, 180104, 107932, 189083, 224029]
16648B24029j35533j61573j6412j8903L0848o733J12907j71131k96862m3107K12917
16637b69553l190q0281J3133K9545P9036j6252o2154o96m2199P4588J7377Q4730
16625a75916P5921p7761p3351J18015j1671L1395N8855J23839J4592k6333k04152
16614a46567j05938n0400j01995j11114J38435J64781P4546K406l6754K06865
16604C4265m1607r432J57498J1104n4060r2651j058K9882O2312L4439L0400j95788
16592c4696o5690O6380J7767O4735L4220j31156k66688J5939n1959j20009J41780
16581c29377J95173K03097j23817j80595j17609J57218r7177m7761J02027R1311
16571a47510J15965N5190j21294L5005J35891j16105j63798J28512Q0608m1628
$$ y = [224029, 88496, -73077, -89489, -108392, -77544, -84277, 28630, -142501, -439363, -482470, -269553, -272743, -353024, -339891, -310346, -231310, -247562, -309716, -310412, -352611, -278023, -260646, -175916, -99995, -177756, -251107, -133092, -144763, -113368, -54513, 69326, 83918, 57585, -146567, -252505, -302905, -404900, -516014, -377579, -212798, -138252, -135846, -172600, 34265, -7342, -16774, 140724, 151828, 97768, 5117, 4059, 33941, 96253, 130692, 161092, -34696, -100386, -34006, -16239, 48496, 82716, -48440, -315128, -299189, -351148, -471157, -329377, -134204, 68893, -54924, -235519, -353128, -195910, -293087, -340848, -238821, -147510, -31545, 23645, -97649, -62644, 73247, -42858, -206656, -78144, 2464, -39164]
16561c9164j34708l8762m3122Q30J0301j31501P7132J45672J26676J7353L586
16550e707k980P1019n9324q3458j32825O5184q9577j01344J40025R7601J81856
16539H0470K0182j08791j05984K7705J70358j01193j03789j57442j42446J3739
16529d07191j1630K08126K17798Q4186p6550Q7233R3783r5896P8760M2081p4175
16518A46525p8593o5361o0062K8799m9348n6120m6296O4872n5879q1416L13599
16507F0720J59186r6282k31254p8209O9684j5793L2797Q0071L7602P2508j51982
16496f0952l8394J03617O8963K0210q9683K9326K3843j05778j07830J11363k5994
16485g1309j11985N2878j5296M6423n3232M0502Q9641o1270J43037N0614p3165
$$ y = [-39164, -173872, -212634, -255756, -254926, -244625, -376126, -298994, -153322, -26646, -9293, -5707, -8687, 62332, 3008, -80450, -213275, -148091, -237668, -339012, -198987, -101386, 80470, 100652, -8139, -114123, -86418, 83940, -17253, -121042, -278484, -420930, -407191, -418821, -210695, 7103, 91289, 14739, 101972, 195755, 99859, 178619, 220700, 146525, 67932, 2571, -57491, -28692, -78040, -134160, -180456, -115584, -171463, -252879, 60720, 219906, 123624, -107630, -185839, -116155, -131948, -99151, -19080, 18522, 91030, -60952, -99346, 4271, 73234, 93444, 3761, 33087, 56930, -48848, -156678, -45315, -71309, -183294, -130416, -145712, -99289, -152521, -112019, -22378, -83648, 59389, 110003, 36838]
16474C6838K0975J24177j31432r5131J98185R7957j59148j30522M5057k7152j00392
16463a20588m9997O7820J75183J25664K7118n1998o1873k7977j90687p2258n306
16452a84899k3106J87912K0281j76297m4362k5082j82551r4030P4098K08661Q9619
16441a49756j88444r8821R7271J25919q9331j96921O7452J71563J180m7314m7797
16430c54999J4691K17964n2217k44892j24152J01331K75121J03500n7716j28937
16420b50306J7688K5110J76954K64364R7691j22138j58810M0897Q5351J1864o020
16409A82645j28610P7044J20745l0745M7031j27915j30921j04815J04800L3725
16399D2984P5283M0274K1043o7146o0031R3246j24278J5177N9843K6919k45884
$$ y = [36838, 57813, 181990, 50558, -44573, 153612, 251569, 92421, -38101, 6956, -20196, -120588, -170585, -102765, 72418, 198082, 225200, 173202, 111329, 83352, -107335, -179593, -184899, -208005, -20093, 188, -176109, -220471, -245553, -428104, -522134, -448036, -239375, -149756, -338200, -437021, -339750, -213831, -303162, -500083, -432631, -261068, -259888, -307202, -354999, -340308, -122344, -174561, -419453, -543605, -442274, -167153, -63653, -121369, -250306, -232618, -207508, -30554, 233810, 331501, 209363, 50553, 91450, 176801, 188665, 182645, 54035, 131079, 251824, 221079, 268110, 140195, 9274, -95541, 9259, 42984, 118267, 158541, 179584, 112438, 52407, 145653, 21375, 36552, 96395, 123314, -122570]
16388a22570j09592R3462q7414L7820n0698j12804k4463O3706K07898N0037m1052
16377i5670R7020k9895q5267J51415K2041K743J38170J10388o0919k38011k04900
16366a92885O747J60698R7912N7593n0270q1462j01920J55131N0453j35351k02817
16355b36171j10358J01232K02457R5905K6073J2627j4584r8152N5684L1833P503
16344G4049l9953j77329l33889Q2000L8747N8834K00687Q8034J14721o1688j22542
16333g8329j34461o4203J95161Q556P2109j24753j00137N5129l0608N2182J00897
16322d8457K6962j41766N410J30352J19807J49571j23929j01256J1649N3954m9494
16311C2803p9340J10441Q2902j14783l3506O0416K22051j20024p1714k4935j64995
$$ y = [-122570, -232162, -138700, -226114, -188294, -238992, -351796, -376259, -312553, -104655, -54618, -95670, 1350, -28545, -113812, 37603, 59644, 62387, 200557, 310945, 250026, 12015, -192885, -186138, -25440, 72472, 130065, 79795, -1667, -103587, 51544, 101997, -33354, -236171, -346529, -245297, -42840, 53065, 79138, 91765, 77181, -20971, 34713, 66546, 74049, 34096, -143233, -477122, -395122, -356375, -297541, -96854, -8820, 105901, 44213, -78329, -212790, -276993, -81832, -73276, -1167, -125920, -226057, -170928, -201536, -149354, -48457, -21495, -163261, -157851, -27499, 92308, 241879, 117950, 16694, 28343, 82297, 32803, -46537, 63904, 146806, 32023, -1483, 58933, 280984, 160960, 89246, 64311, -100684]
16300a00684K4527L2612J9303p2387n9334Q1980j8883m8740J11452J8503J09775
16289I8124o8882j05806R0839J0381j44159j32396P4544R0788L648l5845k8957
16278a47721k13717q9519R8014K87235J47125p4373p745J81246O2020n9842j35807
16267D6916r7250j08575p4112j06093p8380J52737K63768K19549n6361j94597
16257c2398k08123M5028N8497Q5412J34293j0830P7846K7984P9589m3488j45818
16246F7992j08786R5765J13812O8562j4216l57536k95566J49779O5360j169p3677
16235b89680J73186J00914j07752n9572K8457M6504O066J11329P3567o2031r7782
16224g6794N9462J40642P0711j41043r7172j2385m8267R6180J6452j36082n6571
$$ y = [-100684, -76157, -43545, -24242, -96629, -155963, -73983, -92866, -141606, -30154, -11651, 98124, 29242, -76564, 14275, 24656, -119503, -251899, -177355, -86567, -82919, -118764, -147721, -361438, -450957, -352943, -65708, 81417, 7044, -701, 180545, 242565, 182723, 46916, -50334, -158909, -233021, -339114, -417494, -264757, -989, 218560, 162199, -32398, -240521, -195493, -136996, -51584, 82709, 71879, 149725, 177709, 257298, 213810, 67992, -40794, 54971, 168783, 237345, 223129, -134407, -429973, -280194, -214834, -216003, -289680, -116494, -15580, -123332, -182904, -154447, -107943, -101877, 9452, 83019, 20988, -76794, -17332, 123310, 194021, 52978, -44194, -56579, -104846, -8666, 7786, -128296, -184867]
16213a84867q4568N1043L6920K1656K98155Q90j33512p9754M4608R1452O2246
16202A24269j23148l2634J9853K9012J8483r2648o3435L6982p7650P1032J06833
16191A6949r2935j7352p1322l5403N4252m2587J91998M6045p0582M5825j25641
16180a00753r4367p5314k1421O2711O8093J8631K77007o5203j22306P664k04442
16169b49700j5288J98194j9578l9544J09095K31208j42133n4961J47514R4523
16159B59330m9598j81126M2967L3372k08781P460N9144J97099q526o194L0013
16148A75160J5007O316L4332j43718M0808J53649J7991o4620j97287k38164j7892
16137b18418K10135K9869n2086N2070m0904j57747p3407M7262K9225J42953N2428
$$ y = [-184867, -269435, -218392, -181472, -159816, 138339, 139229, 5717, -74037, -29429, 62023, 124269, 1121, -31513, -11660, 17352, 35835, -56813, -120248, -83266, -160916, -89884, 16949, -75986, -93338, -164660, -200063, -145811, -188398, 3600, 49645, -20937, 24888, -100753, -195120, -270434, -291855, -229144, -161051, -142420, 134587, 69384, -52922, -45258, -249700, -264988, -66794, -86372, -125916, -16821, 214387, 72254, 17293, 164807, 259330, 209732, 28606, 71573, 104945, -103836, -96376, -37232, 159867, 151341, 145147, 175160, 190167, 196483, 230815, 87097, 127905, 281554, 299545, 234925, 37638, -200526, -218418, -8283, 21586, -30500, 21570, -19334, -177081, -250488, -203226, -174001, -31048, 21380]
16126B1380j27826J47672l0864n9619O3762Q1055J4072j13048L229Q0117K2350
16115A02280n8847J06039p6030j10960j6580J7865j00572q8308J96478Q0026R9832
16104A51223k5749j91672j040k5160j42732j7321M1525J51712J19311j08620p7498
16093a26021R6036K63690N8331k10002m5778J00214p6272m8832R480M7208J22133
16082A90187Q0651j1297k7517j02390j08329J36786R0886j92677j47639J55679
16072F4340J21480j42566j11612L1267n7198q1537J65967K3848r4204j73636j16656
16061c70507l1879K61237K15187r2179q2737J55127J94365j53365k20875j62391
16051b88017J50979J28865J03448p1737r0647l3901J23821o4955N5257k5276o810
$$ y = [21380, -106446, 41226, 10362, -49257, 14505, 95560, 109632, -3416, -187, 79930, 102280, 43433, 149472, 73442, -37518, -54098, -36233, -136805, -225113, -28635, 51391, 151223, 125474, -66198, -67238, -92398, -235130, -252451, -210926, -59214, 60097, -48523, -126021, -29985, 233705, 292036, 82034, 36256, 136470, 60198, 11366, 20846, 68054, 190187, 270838, 259541, 232024, 129634, 21305, 158091, 248977, 56300, -91339, 64340, 185820, 43254, -68358, -37091, -94289, -175826, -9859, 13989, -80215, -253851, -370507, -402386, -141149, 74038, -18141, -100878, 54249, 248614, 95249, -125626, -288017, -137038, -8173, 95275, 23538, -67109, -101010, 22811, -42144, 13113, -12163, -18973]
16040a8973J2666q0057q6045M9321M7972J4693N5635J56579O0263j5989J19337
16029C15402j41392l8229K1154k7902R8049N1163o3581j85275o8546r7130k1339
16018a57626M6413J22738N2920K5157K5183J1695j02525l5259l8360L2713L5683
16007A8732m1081L8670J06585K8249p5851o4731L6358n9520j75851Q5814R7960
15996d666p6518p8480r743J74565J05898R9325o859p3729j78265o7021O3567l6492
15984h8418K7172o5424q0406j6731K1272L0864P1569P8373P4728O7587K972j58542
15972c4984R97O4655J01589J90744j11935j94752J97870J47376r2067j11750k18999
15961f1256p9661J15600M2981J5108R9188J6346l7700r4564k15756M2245N2965
$$ y = [-18973, -6307, -86364, -172409, -123088, -75116, -60423, -4788, 151791, 212054, 196065, 315402, 174010, 135781, 156935, 129033, 227082, 278245, 214664, 29389, -39157, -136287, -157626, -111213, 11525, 64445, 89602, 114785, 126480, 23955, -11304, -49664, -16951, 18732, -22349, 16321, 122906, 151155, 75304, 10573, 46931, -12589, -188440, -102626, -4666, -81184, -159664, -169407, 5158, 111056, 210381, 203522, 129793, -48472, -115493, -51926, -88418, -61246, -126670, -207076, -223807, -202535, -171671, -100102, -21729, 52999, 120586, 123558, -34984, -33987, 30668, 132257, 323001, 211066, 16314, 214184, 361560, 269493, 157743, -61256, -140917, -25317, 17664, 32772, 131960, 148306, 110606, 16042, -199714, -157469, -104504]
15950a04504N7774k8884p8738R6590J9460K19336L6450j19660J0036m3172J516
15939F6204J02592l9011j80019O9384O6537j78162j71888L895J25936K6134P7375
15928c1023j75396N030q7304k1338N4131k4302n4396j34529J08808J70256O3503
15917a26560r4467p459R048J90750R4463J30500r3791j6298m2362q7095K02967
15906A59696R0259k50952j83140K9228N9672q5033m3530J0289O0602Q0975K9467
15895d2467k5803L8625m3277J30714P8958m3303J5070j19375j15163k278j72187
15884c00486J7261L72697P6303n942n7791j79297R2822J20190j28684o8415p1242
15873a32584j09554M7414L2983R0580l2599Q0396P4614q5806r9761o3719L00879
$$ y = [-104504, -46730, -75614, -154352, -57762, -38302, 181034, 217484, 97824, 107860, 64688, 66204, 168796, 129785, -50234, 19150, 85687, -92475, -264363, -260468, -134532, -108398, -31023, -206419, -201389, -288693, -310031, -255900, -280202, -334598, -469127, -360319, -190063, -126560, -221027, -228486, -219438, -28688, 65775, 196275, 102484, 86186, 43824, -43271, 159696, 249955, -997, -184137, -154909, -95237, -180270, -223800, -213511, -152909, -71934, -42467, -68270, -29645, -72922, 57792, 136750, 93447, 108517, -10858, -126021, -128299, -300486, -283225, 89472, 165775, 159833, 102042, -77255, 15567, 135757, 7073, -61342, -132584, -242138, -194724, -161741, -71161, -103760, -23364, 51250, -34556, -134317, -198036, 102843]
15862A02843J62487r1467j58707k29041L002J31471j8794j930M9165M0294j33001
15851a43678l1947J23157Q2398j97312j39208O9005J42263L7153j79583p6719
15841c14471j4629j37207J20412K04447J20158J29551Q863j40421l9478p7452
15831a40227j39652O3877o6817Q1140J35738O5540O4939O3888q0388j9065K8262
15820E7235j3667J13603N4318q4748q5787j74789l74010j18486J32656J98326
15810b95349R6464Q580J02979J43269p9152j21055R1396K8724N1110P0255j72172
15799g4951j18630J4311O5113Q4741k1169l7712P8700M3472k37921N2566K03000
15788E1520J32664Q314p3395p7567j19962j8052M5506o8628j39474J54358Q4332
$$ y = [102843, 265330, 173863, 15156, -213885, -210883, -79412, -98206, -100136, -50971, -10677, -143678, -175625, -52468, 29930, -167382, -306590, -237585, -95322, -58169, -237752, -314471, -329100, -466307, -345895, -141448, -21290, 108261, 117124, -23297, -62775, -140227, -279879, -216002, -282819, -201679, -65941, -401, 64538, 128426, 48038, 28973, 57235, 43568, 157171, 211489, 126741, 40954, -133835, -507845, -626331, -493675, -295349, -198885, -190305, -87326, 55943, -23209, -144264, -52868, -24144, 26966, 97221, -74951, -193581, -179270, -114157, -29416, -50585, -88297, -9597, 33875, -204046, -151480, 51520, 184184, 192498, 119103, 41536, -78426, -96478, -50972, -119600, -259074, -104716, -20384]
15777b0384o5734n3412j20555J87736K0655j07735n542O8781J59211J7226j82070
15766a01823M1318J21989p5644K9593K8047j91175M5898J11551j51858l0822l7068
15755b09994J42451O9749l4255j12332N6820N7068K9539K7032J07964j0560j0994
15744A12488M761L6232j12594J2674n1795J33192L1835K6954O6236q8938j96523
15733b5478L278P761J3757n4031q4522L0529L7396J76698O0076l082k0096o3184
15721G9102k3419l4176J06461j5555m7845N3414n3887N0762q6686K7257k25989
15710a70561m7111J82032M5841o3516j44610l6894l8244K3986l5897J58907J66279
15699D0212J28788n5502l9574k09063k0670J51786j74850M7141p1841n8582N6906
$$ y = [-20384, -86118, -139530, -260085, -72349, -51694, -159429, -164971, -96190, 63021, 80247, -101823, -60505, 61484, -14160, 15433, 43480, -147695, -101797, 9754, -142104, -172926, -209994, -67543, 2206, -32049, -144381, -87561, -30493, -954, 26078, 134042, 123482, 112488, 117249, 153481, 40887, 53561, 1766, 134958, 166793, 193747, 259983, 171045, -25478, -22200, -14439, -682, -54713, -139235, -108706, -71310, 105388, 165464, 162382, 142286, 79102, 55683, 21507, 127968, 112413, 64568, 117982, 64095, 114857, 28171, 55428, -170561, -217672, -35640, 10201, -53315, -197925, -234819, -273063, -249077, -284974, -126067, 40212, 169000, 113498, 73924, -135139, -155809, -4023, -178873, -131732, -203573, -262155, -205249]
15688b05249J11144J76558q9091O9549Q6887p3970N1648m6980P2418L9957M1801
15677B34672j6173n6944j4942o9268j05910Q5089q2095k22596l7009Q1002K48623
15666D4449P3283j46758m32K6251n2269k6671O132K11997J16784n5322r7834r1955
15654G655j68003l7639j0137j29981k9267J09382J62793J40682K17608J95746
15644D58839r689k47573o7940n7046K4727o127n183L5273N9347p1583K7871p828
15632A33088r5309J3118j9310j24316k5385n453J2229J14038J9966N2960j24194
15621d8568j50929P6878J31296j2967M56j75506L2343J36796j24626j76086J38470
15610a72443n7578K3822j3196J26543J7746J12698M1023j6208j7853k8306m1135
$$ y = [-205249, -94105, 82453, -6638, 62911, 149798, 75828, 127476, 80496, 152914, 192871, 234672, 218499, 161555, 146613, 77345, -28565, 56524, -25571, -248167, -285176, -204174, 44449, 117732, -29026, -29458, -3207, -55476, -82147, -76015, 135982, 252766, 197444, 99610, 7655, -160348, -197987, -208124, -338105, -367372, -257990, -95197, 45485, 263093, 458839, 449150, 201577, 133637, 76591, 101318, 95191, 90008, 125281, 184628, 113045, 140916, 133088, 37779, 50897, 31587, -92729, -118114, -123567, -111338, 2700, 22666, 75626, -48568, -199497, -122619, 8677, -4290, -3834, -179340, -146997, -10201, -134827, -310913, -172443, -230021, -206199, -219395, -92852, -75106, 37592, 78615, 62407, 44554, 16248, -24887]
15599b4887P9509J62763J78421j69505k36554j05851j31775J09491K16118M9695
15589A27425j36550j41552M449R9990L1908j50084o225m0705k1179J64977K13148
15578A45602o8615J6322J7589j75329m7779K28671p263j82264m0390j3699j8770
15567a45925q5232J5561K1125K3589P7949j89738l3017m7934j34879Q9756J89468
15556b19277J49412N1581p3796N5373o8450j08029r7402P1032O5891M5970N2638
15545g5057J14576k5166j29856J16970K17515L8212l24595j52246o5328k0334
15535c05309K04016M1714l6151K7878m7619L8827P5124j003J2717p1922M8552
15524a3176N699N6950J30637M2737K0553j48015Q866k9160j99919j04378O9744
$$ y = [-24887, 54622, 217385, 395806, 226301, -10253, -116104, -247879, -138388, 77730, 127425, -9125, -150677, -146228, -46238, -14330, -164414, -170639, -211344, -232523, -67546, 145602, 76987, 93309, 110898, -64431, -112210, 116461, 109198, -73066, -113456, -127155, -145925, -231157, -215596, -194471, -170882, -92933, -282671, -315688, -363622, -498501, -408745, -219277, -69865, -18284, -92080, -36707, -105157, -213186, -310588, -239556, -173665, -127695, -75057, 39519, 14353, -115503, 1467, 218982, 257194, -67401, -219647, -284975, -305309, -101293, -59579, -95730, -67852, -115471, -76644, -1520, -2523, 10194, -61728, -13176, -7477, 49473, 180110, 222847, 243400, 95385, 104251, 75091, -124828, -229206, -159462]
15513a59462J22866M4801R8360O9711o1175M1164k5936K11528j1531j52456N0893
15502B28763n0607k01881j57124q4966q5223n1577R1657Q8490M6880p902J38434
15491d5056r9567l8713J78374O2918j14623N5038p0015N1893m0499m9857K73737
15480A63630M1163j57972n1252r4144l1383j70225o4879N3630J53237P5905Q6970
15469D680j16249J51468J03887J51140o0217j35580j38218k1000J6396m028j09110
15458a56831q8150l8281J57896J4744j68459J04679r6259Q6088J96355j35892
15448a24110n6594M9776R193q5759P6845J89754r8798J69063K78129k624k93298
15437A11577j70744q5670M4386K02315P3386n4011L7101L4005k6839q2627j57272
$$ y = [-159462, -36596, 8205, 106565, 176276, 115101, 156265, 130329, 341857, 330326, 177870, 228763, 178156, -23725, -180849, -265815, -351038, -402615, -310958, -222468, -175588, -183490, -45056, -144623, -183336, -4962, 57956, -56667, -1629, -71644, -19751, -60250, -110107, 163630, 204793, 46821, -4431, -98575, -129958, -300183, -365062, -311432, -158195, -82290, 4680, -111569, 39899, 143786, 294926, 234709, 99129, -39089, -60089, -43693, -47721, -156831, -244981, -283262, -125366, -110622, -279081, -174402, -270661, -184573, 11782, -124110, -180704, -130928, -121735, -207494, -130649, 59105, -39693, 129370, 407499, 404875, 111577, -59167, -144837, -100451, 101864, 175250, 121239, 158340, 192345, 165506, 82879, -74393]
15426g4393o1131J68685J20518q9218N8736j91332o9307J85953Q1401j77588J30058
15415H2382M6841n9289l8587p965m8598L2256P2634j2155q4147K3209J48413j03142
15403E1852j33637N8014o5794k04252j92166Q1513J68191L9943Q7123l7789J41052
15392e950P9201N5648j6806l7477r0366q6271n779P2735L1029J58270K3058k8523
15380A48769K8158J37277J68527j60284p2023k4518j42825j73594j49294J6067
15370b23740J62421Q9055n2799n3349p0607J28818p6719j04030K28293J96018
15360B23361p5326j24232j20165j9889J731K75946K2178L8977p9455k13700j61711
15349b32285k602q0001O4809J58053m2595j08910j9161l1255r535J90945K31768
$$ y = [-74393, -135524, 33161, 153679, 64461, 123197, -68135, -137442, 48511, 129912, -47676, 82382, 129223, 69934, 31347, 23382, -25216, 7040, 79674, 67519, -16628, 6581, 154994, 51852, -81785, -23771, -89565, -293817, -485983, -404470, -236279, -196336, -109213, -147002, -5950, 73251, 128899, 112093, 74616, -15750, -102021, -107800, -35065, -4036, 154234, 177292, 148769, 176927, 314204, 482731, 322447, 250424, 225906, 83081, -90513, -239807, -223740, -61319, 27736, -25063, -78412, -149019, -20201, -96920, -200950, 27343, 223361, 148035, 23803, -96362, -116251, -114520, 161426, 183604, 222581, 143126, -70574, -232285, -234887, -314888, -250079, -92026, -134621, -243531, -262692, -293947, -303482, -112537, 119231]
15338A19231K2465p423M1776p2627j7166K3796l0151k84855j15748J69596L297
15327a47809L5208J06612r8951j37437j30609J98745K24491k496r3796N7784K4091
15316C5833L5840K04775o0320o6483J2391j96764k19476N7149m0014q8190k5307
15305c50566J05865J92773o8841p2301J13947Q3281L0878P6704M3739q135j21986
15294B5358r1049k985j43046J29024K38660M6343k93822l5061R7727L0270j09849
15283a08430M1498L0838J43732l2604p6764j7661R3814L2894j37593l0620J79097
15272A18201J18942j05632k08347l349J02709J27003M53j72962m8234J15242j1801
15261C2225M8032n1919j26083J002L4229j04J7830J26943J0834J34308l427j73382
$$ y = [119231, 141696, 134273, 176049, 103422, 86256, 110052, 79901, -204954, -320702, -151106, -147809, -112601, -5989, -104940, -242377, -372986, -174241, 50250, 47754, -46042, 11742, 35833, 71673, 276448, 216128, 149645, 162036, -34728, -254204, -197055, -237069, -325259, -350566, -244701, -51928, -120769, -193070, -79123, 4158, 35036, 111740, 155479, 147344, 25358, -65691, -68676, -211722, -82698, 155962, 202305, -91517, -126578, -28851, 1419, -108430, -66932, -36094, 107638, 75034, -1730, -19391, 74423, 107317, -30276, -60896, 118201, 237143, 131511, -76836, -80185, 22524, 149527, 149980, -22982, -71216, 44026, 32225, 80257, 28338, -97745, -96743, -62514, -62618, -44788, 82155, 92989, 227297, 223870, 50488]
15249E0488p9145j49566Q8095J96490J38462K9913j81042j56299r3208q217K660
15238a61369P3306q428J73129J33256J29K6246k7843n0754j67721r9639O2215
15227d7473O3326J43438J75858j92310o2554m8887p2204M6640J1068j7812m8778
15216d9688K7623J8941k0430O9291J37813j78358j35082j20072O9990P4238J8983
15205h6751J42954l9341P1928K0616j66593o0759o8467M2319M7287L7390j7460
15194g6877O0671R273L9191j3151J35156k2780o9600k9045N2435n9495J01385
15183A27163N8643k214n3o2395l5845n4319K376j23462O1240N012p5071k5642
15171a24567J89503q1892P6765P1044n0013j36730J83032J6377j9947J5736k62632
$$ y = [50488, -28657, -178223, -90128, 106362, 244824, 274737, 93695, -62604, -155812, -164029, -161369, -88063, -96491, 76638, 209894, 210023, 236269, 208426, 157672, -10049, -109688, -47473, 15853, 159291, 335149, 142839, 80285, 31398, -40806, 5834, 16902, -910, -49688, -22065, -3124, -23554, 45737, 183550, 5192, -129890, -249962, -179972, -105734, -86751, 56203, 16862, 88790, 109406, -57187, -117946, -186413, -144094, -96807, -59417, -76877, -16206, -6933, 32258, 19107, 154263, 131483, 61883, 32838, 85273, 25778, 127163, 185806, 183592, 183539, 121144, 85299, 30980, 33356, -90106, -28866, -23854, -98925, -124567, 64936, -16956, 59809, 130853, 80840, -55890, 127142, 143519, 123572, 139308, -123324]
15160a23324j37999P9286M1465L4794o9497m463j168M1129L2122q4990N6153O131
15148a30361M2071q2182k0697P2241l2998j13110l5572k724K11892m0192m7072
15137a78704J9571j55692n9888q1706K38R0285K07396R4412k5448j08181M0014
15126a57703J61309o2151m679M68o6980J34028j4454L486l9292j4137R0859M9131
15114G9885j16917q2163K6125p7709j6739J31162J56665r052l8519R0523q3588
15103E9673J5520j15441j662r6874n594L8233K96034J77796q7958j61056K1332
15092A40003j12899j77962J5815N5030R0631K4507r5771J52638n7358m7929P1284
15081E7989j3205L3637j86551o3755N5756k6099o949k9695J28890O6646q5545
$$ y = [-123324, -261323, -182037, -140572, -105778, -175275, -179738, -180906, -139777, -107655, -192645, -136492, -130361, -88290, -170472, -191169, -118928, -151926, -265036, -300608, -303332, -91440, -131632, -178704, -159133, -314825, -374713, -456419, -456181, -365896, -158500, -64088, -89536, -197717, -157703, 3606, -58545, -63224, -62756, -129736, 4292, -10162, -6676, -45968, -60105, 30754, 79885, -37032, -119195, -93070, -170779, -187518, -56356, 100309, 91257, 52738, 143261, 59673, 75193, -40248, -41910, -138784, -144378, -106145, 189889, 367685, 279727, 118671, 140003, 27104, -150858, -135043, -80013, 10618, 35125, -60646, 91992, 34634, -13295, 57989, 44784, 78421, -108130, -171885, -116129, -142228, -149177, -178872, -49982, 16664, -68881]
15070f8881J0375L1390j4656k6337j25213q7101O2877K35979J89708j5863k05061
15059a2783n6122K5853l4642p0042K704J55156J45102K6215J94k8396j17361p1590
15047c5712M241k0672o5711J34974J49090o9474k56785j88984J59199O5175m9015
15036a73674n8593K26256m3057j29913P3383O5363K17553j7968j04079j7865k5806
15025A1600J14868p3099k19087K3342O953Q1330J21871P3400j40780j52999j6558
15014a69159j5719J54237J66054j77500k4115R1522J6606j0965J07728m1549n3009
15003D4131J45486K5789j93760o1102J18839M8978j47760k5128K18133M454j34303
14992D3757M1022L5225j96310r8443K06533n9984o6400j50093j8347q6212p0544
$$ y = [-68881, -58506, -27116, -41772, -68109, -193322, -280423, -217546, 18433, 208141, 192278, -12783, -68905, -43052, -77694, -147736, -145032, 10124, 155226, 181441, 181635, 153239, 35878, -35712, -31471, -52143, -117854, 17120, 166210, 96736, -160049, -349033, -189834, -124659, -173674, -232267, -6011, -49068, -178981, -105598, -40235, 177318, 159350, 55271, 37406, 11600, 126468, 53369, -165718, -142376, -135423, -54093, 67778, 141178, 398, -152601, -169159, -184878, -30641, 135413, -42087, -66202, 25320, 41926, 30961, 138689, 97140, 44131, 189617, 215406, 21646, -39456, 79383, 128361, -19399, -44527, 173606, 178060, 43757, 84779, 120004, -76306, -174749, 31784, -28200, -94600, -244693, -263040, -349252, -419796]
14981d19796J85058O0275m0994L1278R9898l0027j01464J6346j9698j1513j5760
14970b46397N9033q206q4124K38144L3881o3171q2065P424J3347p7324J86481
14959b2977K18138M3572m5508j84005j94732m3333J98852o0820j1514k4162L8976
14948h7513N2081P1706q2657Q3587o3775j50197J05876L7695n2175J00442J10207
14937A25277l9439j87045J1266R1015M1724J43051m4306j45381j30774P6710l0360
14926h8262o6513L2637j1194m2258P3132J04149J21169J29514J967k31598j32851
14915a10108l8840J93343N899r5640m8450R3314M4080K0999L4112L9967p6193
14904F2483P050m1841N2293P8337l703n4510j42711p9743j05777R5934K21841
$$ y = [-419796, -234738, -174463, -215457, -184179, -84281, -114308, -215772, -199426, -219124, -230637, -246397, -187364, -195570, -279694, -41550, -7669, -70840, -152905, -145481, -132134, -209458, -22977, 195161, 238733, 193225, 9220, -185512, -228845, -29993, -90813, -102327, -126489, -87513, -35432, 36274, -46383, 37204, -26571, -176768, -70892, -33197, -85372, 15070, 125277, 85838, -101207, -89941, 1074, 42798, 185849, 141543, -3838, -134612, -57902, -88262, -154775, -122138, -133332, -175590, -102458, 1691, 122860, 252374, 254341, 22743, -110108, -148948, 44395, 50294, -45346, -93796, -482, 43598, 64597, 98709, 138676, 62483, 69533, 27692, 79985, 158322, 154619, 100109, -42602, -122345, -228122, -132188, 89653]
14893H9653J02110J63534j14241P4038p1311j44722m7591Q6814P3852J43365o9525
14882B85976j83117j32402o067m8954K3578p0600N4245q3483J03593K17836L5843
14871A96448J0836j14830j05650P898p9891J10542K45408o6178P8467r921r2807
14860A80322n3325k7641j5439n7374M1824L8359k5108m066J93914j04138o4443
14849A02885j16369J1770L3125Q040J28373n0218J5144R5682l2045J59269n7536
14838B98120l10604j50227J19650K1477P3321J80155O5493p4039j35169n5710
14828C2467m1115k2954K71619J1189j04288K9524P125K562L7632j2870k16371
14817e480J4025k0520q5795J15563P7754o1276j019O7840P6173J2032n2189Q9648
$$ y = [89653, 191763, 355297, 241056, 315094, 243783, 99061, 51470, 138284, 212136, 355501, 285976, 102859, -29543, -35610, -84564, -60986, -131586, -77341, -160824, -57231, 160605, 196448, 207284, 92454, -13196, -5298, -85189, 25353, 270761, 204583, 283050, 273129, 180322, 126997, 99356, 83917, 26543, 68367, 106726, 81618, 77552, 271466, 167328, 102885, -13484, -1714, 31411, 39451, 167824, 117606, 132750, 228432, 196387, 355656, 298120, -12484, -162711, -43061, -21584, 51737, 231892, 297385, 223346, 88177, 32467, -8648, -31602, 240017, 251206, 146918, 176442, 183567, 186129, 223761, 210891, -5480, 8545, -11975, -97770, 17793, 95547, 34271, 33252, 101092, 177265, 189297, 137108, 226756]
14805B26756r0863M9241j11077k8400j94965P1412k5224M4910L7994N6790j8819
14794A7755L7766k8734K3712K8690m0339j74089P6772K24265N603j00877j35042
14783f4518K3350j53692j16327J11970n0378J26295P0383M4040m6323j44163j93170
14772c92533J38991L78660J98812r3271N7010j22512m0891k1583j05044O0679
14762E8318J34907p6168m4756k64059L0975R9044j19148p7391k7293J16598j277
14751a70250q243K24605N3988P8985n8068j76418q919l6414J69550k2476j25905
14740g9565L2518p0441m5541M0539N4229J46580j61882N2957J47013Q6188q2918
14729A19677j754P4102L1982j17377j84082N6008R8665N4222Q5147K280j20992
$$ y = [226756, 135893, 185134, 74057, 45657, -149308, -77896, -103120, -58210, -20216, 36574, 17755, 55521, 26787, 50499, 79189, 38850, -135239, -58467, 165798, 171401, 70524, -64518, -41168, -194860, -311187, -199217, -249595, -123300, -52917, -8877, -55200, -199363, -392533, -253542, 125118, 323930, 230659, 287669, 165157, 124266, 102683, -2361, 58318, 193225, 117057, 72301, -191758, -160783, -61739, -180887, -258278, -285571, -168973, -170250, -178493, 46112, 100100, 179085, 121017, -55401, -64320, -100734, 68816, 46340, -79565, -47047, -117488, -163029, -122490, -68261, 78319, -83563, -30606, 116407, 202595, 119677, 117923, 192025, 224007, 106630, -77452, -21444, 77221, 131443, 216590, 218870, 97878]
14718I7878J8061J54186l9677k81294j58215J91381O6399j43742L6779K92417
14708B34173J55928k9304k85882k41823q7901K30643J66331L9215M0552j87162
14698C4770j32025n8824J58959J43981p9312m8368j20364p608P1540P3670O1379
14687I7798m4134K7392J2332q196k28125Q254J26434Q0343l705r9051j73077J02995
14675a00740J58555j94695j37658o1461P612Q6028l6086J6161J09011j01750m7731
14664c02754j00140J84417M520r3313J25738P9042J06896Q5820K7220P7018j66553
14653B7911n4745J47697P0816m5571k4690P3705k5390j32913m8065o9317q4755
14642a65317n029J42839j3586Q3754p6580L4296J891L7806K0505J05782j66236
$$ y = [97878, 115939, 270125, 230448, -50846, -209061, -17680, 48719, -95023, -58244, 234173, 390101, 360797, 74915, -166908, -254809, -24166, 142165, 181380, 221932, 34770, -97255, -156079, 2880, 146861, 67549, 19181, -101183, -108791, -37251, 36419, 97798, 53664, 81056, 93388, 85192, -142933, -134679, -8245, 72098, 68393, -30658, -203735, -100740, 57815, -136880, -274538, -335999, -328387, -242359, -278445, -262284, -153273, -255023, -302754, -402894, -218477, -213957, -307270, -181532, -102490, 4406, 90226, 117446, 194464, 27911, -26834, 120863, 191679, 146108, 121418, 195123, 169733, 36820, -11245, -80562, -165317, -170346, -27507, -41093, 42661, -33919, 377, 2268, 40074, 60579, 166361, 125]
14631A25m9323J86583n9095j13193k8536j34378J07792J04375P4120l4991k5439
14620B8040O6754O3438j07450P056L6148o7400P3248k5313K17107J16000j35382
14609B72246k6779J18612o4549k07402j56917j0714K8316Q5304J21214j08231
14599E1100m5402J10316P4773k09320j70606J8725O5568o6226L4257O8461p7881
14588a46235j60166l2246R6999O5136R4939J19732R4198o3408K2113r7517q0619
14577h7074J13677M9454p1227L625J32358r0566J72618q00O8959o4309j41867
14566H4848P0169Q5903j74279l6182m1442J71449q586j70685j46806j9516k22459
14555d07586N4511j9177K66043K17854m620l87M2158j40688j64139O5334J39610
$$ y = [125, -49198, 137385, 78290, -34903, -63439, -197817, -90025, 14350, 88470, 53479, 28040, 94794, 158232, 50782, 57838, 93986, 26586, 99834, 74521, 291628, 407628, 272246, 245467, 364079, 299530, 92128, -64789, -75503, -47187, 38117, 159331, 51100, 5698, 116014, 190787, -18533, -189139, -170414, -104846, -171072, -136815, -68354, -146235, -306401, -338647, -241648, -176512, -81573, 38159, 132357, 68949, 91062, -6455, -87074, 26603, 76057, 4830, 8455, 140813, 50247, 222865, 222065, 291024, 226715, 84848, 155017, 240920, 66641, 30459, -10983, 160466, 151880, -18805, -165611, -185127, -407586, -353075, -372252, -106209, 111645, 107025, 106638, 148796, 8108, -156031, -90697, 48913]
14544D8913q8400L8561P7512O3535j41227j7268J04526J58019j5504j23222r740
14533I5705r2150j10424J20763L8977P0608M4826p7279j83219R3131n063r075
14522a3200J70799o0208k18371K61184Q3642J25305j14771o8387j11311j2163
14512D2519L0511q3185l6892J86383J25319j7722j8121J38j95003k1996j18506
14501a06555J06998l6305j16015N5500j0433L5076J13191N8138m3473K3714P144
14490H6980o1741J6288M9371j51338j39473K2797K02413M7021J725k0813R6286
14479A49516K16772K8109j85283k3605J9833m124j04442k1060M5645M3185j84874
14468b0328j09080O9152k44035r1460M3276J52342J17109J32739J23137l9485
$$ y = [48913, -39487, -926, 76586, 140121, -1106, -18374, 86152, 244171, 228667, 105445, 95705, 3555, -106869, 13894, 52871, 123479, 168305, 91026, -92193, 938, -4125, -13200, 157599, 97391, -120980, 140204, 223846, 349151, 234380, 165993, 54682, 42519, 73030, -10155, -47047, 139336, 264655, 246933, 228812, 228950, 33947, 11951, -106555, 443, -35862, -151877, -96377, -106810, -71734, 41457, 99595, 56122, 79836, 86980, 25239, 41527, 90898, -60440, -199913, -177116, 25297, 72318, 74043, 53230, 149516, 366288, 394397, 209114, 185509, 205342, 201218, 96776, 75716, 121361, 164546, -20328, -129408, -60256, -304291, -395751, -352475, -200133, -83024, 49715, 172852, 133367]
14458A33367p7241p3633K24019N2423M7234j09834M1352o8674j42842o3132O6002
14447B9041K10426p6379j45584j66852o8470J12444J23448J3753n0419j9763Q7389
14436D9034M4600j5977O1405J69836j98678k90P5020J38644J5907P7292q2675
14425C34118k97593k52326L7146O746J39288L7691J17688J23660J5583m6061J4163
14414B30103j17481q6342L9273n6335P6300K66861n9117q7369P4515O6710j01728
14403B45390J2125r7314J08761Q3960r0430k43966r2138O8380j4527j52399j11501
14392b83659N9214J73423O0767L5234j8720j04726O980N1405J28570K8209j18696
14381A8001K614j23724n6093K50269R1112k10565r019J67890J49358j68451j54937
$$ y = [133367, 56126, -17507, 206512, 258935, 306169, 196335, 237687, 169013, 26171, -36961, 29041, 239467, 163088, 17504, -149348, -217818, -105374, 18074, 31827, -18592, -38355, 49034, 93634, 77657, 139062, 308898, 110220, 109930, 184950, 323594, 339501, 416793, 334118, 36525, -215801, -178655, -171909, -32621, 5070, 122758, 246418, 262001, 215940, 230103, 112622, 26280, 65553, 9218, 85518, 352379, 293262, 205893, 280408, 347118, 245390, 257515, 160201, 268962, 352922, 262492, 18526, -73612, -5232, -19759, -172158, -283659, -224445, -51022, 9745, 44979, 26259, -78467, -71487, -20082, 108488, 136697, 18001, 20615, -103109, -159202, 91067, 182179, -28386, -37405, 130485, 279843, 111392, -43545]
14370d3545p6758Q4408J81145q0323r3581P1570P7443M6826J6335n0247L1044
14359A64317P2910j14248k30290o2632Q0544J60550q3447l2249l6080p91M2115
14348c9301k30339j9553O5041N0222J17858o4297J1895p797M7625J82745J66110
14337B80209M4847k2811j44159k44066j33984J83388O4007L3403o3651L1635M8499
14326G7317M9373K1033o5299K22j15005k08335K3065M8576p0067J85821K02616
14315A49317r8663j79220j0892O6359q7532n8583r2735p387K0535K6646J06607
14304a65548P3371J1568M3611R2192J58129R402k05718P1869O5126P6875j26445
14293A04432j51139j14483R5449Q9154J5410N1387l2576O439j9709R221j30410
$$ y = [-43545, -120303, -35895, 145250, 64927, -28654, 42916, 120359, 167185, 183520, 133273, 164317, 237227, 122979, -107311, -169943, -89399, 71151, -12296, -44545, -80625, -81416, -39301, -269640, -289193, -224152, -173930, -56072, -120369, -108474, -116271, -68646, 114099, 280209, 325056, 302245, 158086, -85980, -219964, -36576, 27431, 60834, -2817, 28818, 77317, 126690, 147723, 82424, 82646, -32359, -240694, -217629, -169053, -239120, -53299, 149317, 50654, -128566, -139458, -73099, -160631, -219214, -311949, -319336, -298801, -272155, -165548, -92177, -80609, -36998, 55194, 213323, 222725, 17007, 88876, 154002, 230877, 104432, -46707, -161190, -65741, 23413, 38823, 90210, 57634, 64073, 44364, 53585, -76825]
14282g6825j181l5417J0422N4067R5717J05165O7255k7288j0034N4117j09632
14271A26366r2180k9305P4647J92184o3235p5977J3521k30697j72481K8537J15583
14260a13037J30135n9401j00949o3379J18243M2361R178J6250L1360k0555J97117
14249A87323N4474m5696j61229J8728j20j7610P7418j27939j00898J25540P6322
14238H6313q7190q221J79940j63060r6392J91146J10244k4253k0130Q8954J28487
14227C85838j06320j55137o4245m8544o3169K82395J19481o9307j15897o7228
14217I7867k9063j44410M3407J70794j27404m1981r6833j67415O4406p0751q7576
14206c88959r1010J49434J36067j42794k9541n4366J61674R5024O3841j15952
$$ y = [-76825, -78006, -113423, -103001, -48934, 46783, 151948, 219203, 191915, 181881, 235998, 126366, 34186, 4881, 79528, 271712, 208477, 132500, 146021, -84676, -257157, -228620, -113037, 17098, -42303, -143252, -206631, -88388, -46027, -36849, -20599, 10761, -9794, 187323, 241797, 196101, 34872, 53600, 53480, 35870, 113288, -14651, -115549, 9991, 86313, -877, -9098, 170842, 7782, -88610, 102536, 212780, 188527, 168397, 257351, 385838, 279518, 124381, 60136, 11592, -51577, 230818, 350299, 280992, 165095, 97867, 68804, -75606, -32199, 138595, 11191, -30790, -127623, -295038, -230632, -301383, -388959, -479969, -330535, -194468, -337262, -366803, -421169, -259495, -164471, -100630, -216582]
14196b16582J8859Q5210J95726M2691l3410O2780l7647K9095q2030k08620m8247
14185a92175K46723k6736k0880M088l2953N6097n9605j7120r3614j6996k9046
14174a82217M923J16929K9991L1790P2281o4880j2075J86120N2654L4113L5666
14163C05295p6557O4084K2031j49091J6964q3140L1203j82925j77961j68373Q4738
14152c13732K46333O8608o3675p7027j7826m8161Q1023m0557n5603J08454J250
14141a10913r6069J74894J83173J47505L2198k00081j58585j59997p1284Q9097
14131a70062N5160P6915O5924K4310J38070k9037k93276j4731J11615O7872M5142
14120G7902m3291J9107L748l5196J0588Q2580q5630j2412k3128l1917k00607j44367
$$ y = [-216582, -197723, -112513, 83213, 125904, 92494, 155274, 117627, 146722, 64692, -143928, -192175, 54548, 27812, 6932, 11020, -21933, 34164, -25441, -42561, -136175, -153171, -182217, -177294, -60365, -30374, 1416, 73697, 8817, -3258, 182862, 235516, 269629, 305295, 228738, 292822, 314853, 165762, 182726, 99586, 130789, -52136, -230097, -398470, -313732, -67399, 1209, -62466, -139493, -157319, -205480, -124457, -165014, -220617, -112163, -110913, -206982, -32088, 151085, 298590, 330788, 130707, -27878, -187875, -259159, -170062, -114902, -37987, 27937, 52247, 190317, 161280, -131996, -146727, -35112, 32760, 77902, 34611, 53718, 57466, 22270, 32858, 115438, 29808, 17396, -5732, -37649, -238256, -382623]
14108c82623J48728K04782q3966n2180m3087Q8343J63878j21396r8313m0386J220
14097b15000O5242O9106l7553j96561l0949k8997o7168J30619K08474J04405J9819
14086B1437J02409n2621L3741J16626k1653K038r0781j07335k2789m015m4345
14075f7288P7057K570p5303K6784p0098k57526J36539J71824j4659P7451l529
14064C822P8433j16425k14750J10462K01751K05307q4635o392M2209r7710M270
14053A26342J4193P2643q9512l6518R923J05116J94698K86k22844j75888n8790
14042f0351J45770R8559N1086J0056r9187j6190J36456r9244j23788M7991k2125
14031F9033o5137n4872n9866J6958n5023j12709P7268l2600J38663J29946J06104
$$ y = [-382623, -233895, -29113, -113079, -165259, -208346, -120003, 43875, -77521, -175834, -216220, -215000, -149758, -80652, -118205, -314766, -345715, -374712, -441880, -311261, -102787, 1618, 21437, 123846, 71225, 104966, 221592, 199939, 201977, 111196, 3861, -18928, -22943, -67288, 9769, 12339, -62964, -36180, -106278, -363804, -227265, -55441, -70100, 7351, 3822, 82255, -34170, -248920, -138458, 63293, 268600, 183965, 177573, 219782, 122072, 126342, 140535, 213178, 123666, 87148, 97071, 202187, 396885, 397171, 174327, -1561, -60351, 85419, 183978, 235064, 245120, 145933, 129743, 266199, 166955, 43167, 91158, 69033, 3896, -50976, -110842, -93884, -148907, -261616, -184348, -216948, -78285, 51661, 157765]
14020A57765j05227j48363P9419j9575j33658p3176R2566j14701O8601J8750K8029
14009a49570q3935J27447L7971j23828J68398P8757k03699j8240J28170P6578
13999C8049Q8637J5489j4284N4496l8958j23684K274o5121K4878l0009o5235O5800
13987d7668K52194r3631r7825J3819j23116k74790J15103M6353L8843K05255R8953
13976A33490O9317M2558o7617J21046m3734k33812l3870J44991n7813j42706K3815
13965d4335J47681M1535l7248j05520o3747N0882R9710L5885j7113o1407N9733
13954A06056J05627o9095j0681k0936j36125j44148N7884J26016J39238N5081
13944B08917m3482n0317N4540M0217L8688Q6381n7063j03992q4693Q103J72572
$$ y = [157765, 52538, -95825, -16406, -35981, -169639, -242815, -150249, -264950, -196349, -177599, -149570, -233505, -106058, -68087, -191915, -23517, 55240, -148459, -166699, -38529, 38049, 126686, 142175, 127891, 182387, 143429, 19745, 22019, -43102, -18224, -48233, -113468, -47668, 204526, 110895, 13070, 26889, -96227, -371017, -255914, -209561, -170718, 34537, 133490, 202807, 245365, 177748, 298794, 255060, 21248, -12622, 132369, 74556, -68150, -44335, 103346, 144881, 107633, 2113, -61634, -10752, 88958, 124843, 107730, 46323, 106056, 211683, 142588, 131907, 110971, -25154, -169302, -111418, 14598, 153836, 208917, 165435, 115118, 169658, 209875, 248563, 334944, 277881, 173889, 89196, 97299, 269871]
13933B69871P1281j03175j59704q8760Q1447M6270J33119O3781o8798p4164m6746
13922A24422J243k9079R7627M9887j66653j14260J0613M5298j11286N0565L2406
13911i217R3910p0658j5845l6089q9858n3519r9527k25090J71553J23638L7081
13900a73621j2193J4313J02249j14099J8722p0721P161J19404R7560l2300j60960
13889b04485M8939J24421q421j05338Q1999P0612n1866j6308j21884j73620R3053
13878b62898J98210Q1009l4760R4391j05061R9699L2587r419J80980q1032L143
13867A96849n3771J33755J57416N0314j10299J12841n1227k69214m3007n0419
13857G3238L1518J4044j21009K2972k0095P4409m5005J65339J01460j08331j66622
$$ y = [269871, 341152, 237977, 78273, -10487, 70960, 117230, 250349, 314130, 245332, 171168, 124422, 125665, 96586, 194213, 244100, 77447, -36813, -26200, 19098, -92188, -41623, -9217, 84693, 14035, -1810, -37899, -127757, -181276, -280803, -505893, -334340, -210702, -173621, -185814, -171501, -69252, -183351, -164629, -235350, -228189, -108785, -11225, -43525, -204485, -155546, -31125, -39546, -144884, -62885, 7727, -44139, -60447, -182331, -355951, -262898, -64688, 16321, -18439, 75952, -29109, 70590, 103177, 93758, 274738, 193706, 196849, 143078, 276833, 434249, 484563, 374264, 487105, 435878, 166664, 123657, 73238, 104756, 118800, -2209, 20763, 668, 75077, 30072, 195411, 296871, 188540, 21918]
13846B1918k6448K35563J03248j89685r1019j801K4432j9532l1583j22747P3905
13835b3749J07597M636j89557o3801k1076K23524J28214q4785N1075r6671j72952
13824a37545N5369m1659j02997J85113M415l1119N1930N7654J2658n7665j18874
13813a22720J45912R4008j16570K1850J76261k9386j87648M659l5144J0472L1116
13802g190j0135j8047N4789J42872J56460J0573k05632p3546M0235J35753j47863
13791G8269l6583p7677m9313n4110J23623n9496p2964j19498n0159J14404J06367
13780i7137O5037o6855M4172J13128J3365J68942j7329O5203j03721j70193p434
13769G178n3825l9376K90350J6478p4389q1111q9285k6277J35861l948o4425m0052
$$ y = [21918, -4530, 231033, 334281, 144596, 53577, 51776, 76208, 56676, 25093, -97654, -23749, 83848, 88484, -101073, -164874, -185950, 37574, 165788, 81003, 132078, 35407, -137545, -82176, -123835, -226832, -41719, -37304, -68423, -16493, 41161, 53819, -3846, -122720, 23192, 117200, 630, 22480, 198741, 169355, -18293, -13634, -48778, -38306, -7190, -17325, -35372, 19417, 162289, 318749, 329322, 123690, 50144, 90379, 226132, 78269, 41686, -35991, -85304, -139414, -15791, -75287, -148251, -267749, -317908, -203504, -97137, -32100, -98955, -54783, 58345, 71710, 240652, 223323, 288526, 184805, 14612, 7178, -46647, -86023, 204327, 220805, 146416, 65305, -23980, -50257, 85604, 81656, 17231, -22821]
13757b2821j18056M6552J98968j48741N9883K22003P0017k05533q5884J69960
13747A86348p5293j57443q9726q505k8605N9109p699J90122j4165j38417m9155
13736a33429q778J05609J20404K318J54171L3354o08j57397k21591q8909J16818
13725g8038J93033M9665j27846m001j28463j49426J8603l3781l4113L3172j38420
13714c99615M7972P8463L7748K48284L3624n2567j34888K15038l863k27448j01337
13703b58589R7405J23866k1669J35375K14431J5503j20172O9250o6864j10637
13693G7899j31611k55209j84413L993L49145J69586J54256J4112n3562m8194l516
13682I2486l2412r5729J99959J89302j31427r147j53526q3617J20373q2191j2190
$$ y = [-22821, -140877, -94325, 104643, -44098, 15785, 237788, 307805, 102272, 16388, 186348, 111055, -46388, -136114, -144619, -173224, -114115, -121814, 68308, 54143, -84274, -133429, -142207, -36598, 83806, 86124, 240295, 273649, 273041, 115644, -105947, -194856, -78038, 114995, 164660, 36814, 32813, -95650, -245076, -226473, -260254, -294367, -261195, -399615, -351643, -273180, -235432, 12852, 46476, -6091, -140979, 74059, 70196, -157252, -258589, -161184, -37318, -58987, 76388, 290819, 306322, 186150, 255400, 188536, 77899, -53712, -308921, -493334, -489341, -140196, 29390, 183646, 197758, 144196, 96002, 92486, 60074, -35655, 164304, 353606, 222179, 213032, 59506, -24111, 96262, 14071, 1881]
13671A881j18465q0819J45466J47095O3372k1961p0832j07644k7095o6449o8404
13660b03855J50959J1981J65869J08596J75655J0588l15534j07016j12494o3235
13650a78486P1093j62525q7841M594K8631r835J14474J07393M5383K38163K0162
13639A91206o2068m9084k66994p2915K06119Q7549P3605l4829n1809L060J0819
13628C4659J6435J23268J35428o4435m5139l8662k94218j59201O1658K16645J85296
13617A71734q755O7515J12860k2576p341M1701k24605j93147M3166m0537n9266
13606a19251R5691r5835J00504j2108j08237M9542q334j4554J46294J93279j8240
13595B08751o8366J7977p6720L7593p9408j27833j7089O9791N9335n052J1047
$$ y = [1881, -116584, -197403, -51937, 95158, 158530, 136569, 65737, -41907, -69002, -135451, -203855, -52896, -40915, 124954, 233550, 409205, 419793, 104259, -2757, -115251, -178486, -107393, -269918, -357759, -353165, -324534, -334369, -219895, -112502, -67119, 171044, 191206, 129138, 80054, -186940, -259855, -53736, 33813, 107418, 72589, 20780, 23840, 34659, 51094, 174362, 309790, 245355, 200216, 161554, -132664, -291865, -230207, -13562, 171734, 162979, 230494, 343354, 320778, 313437, 355138, 130533, -62614, -19448, -59985, -119251, -23560, -119395, -18891, -30999, -139236, -89694, -98028, -112582, 33712, 226991, 208751, 140385, 158362, 81642, 119235, 39827, -88006, -105095, -35304, 24031, 18979, 30026]
13584C0026K8134l11j7348J15958J10308j0996m3101J50235M865M5185r5709l03330
13572A3916L2251j25412M0760K06835o2748k19378j6083l6724k4152K14970J90430
13561B14665l89k46122P3655R3830K1710o1945j77980k8231J27486l897O8761
13550H1543J02119n7155p4746J01693k6410r5551j60298p6075J10745j40151j4835
13539b49121J16261J49425K02507j33867p8124K4976Q1761j57471j09951J09325
13529d4279J53905m4417P6780J8678Q3425R0637n6194j63379k42289j06212Q6292
13518a47053J57026Q7350Q553p4020P9687j33987j30273L7020k1614q1282R096
13507b09497J33846j3736p4524N4968R8629L8747J26748k37952j61940K34226
$$ y = [30026, 58160, 57849, 40501, 156459, 266767, 255771, 212670, 362905, 367770, 412955, 317246, 13916, 46167, -79245, -38485, 168350, 105602, -113776, -129859, -166583, -190735, 24235, 214665, 214276, -31846, 41809, 135639, 157349, 95404, -82576, -110807, 16679, 12782, 81543, 183662, 126507, 51761, 153454, 127044, 31493, -128805, -204880, -94135, -234286, -249121, -132860, 16565, 219072, 85205, 7081, 32057, 113818, -43653, -153604, -44279, 109626, 65209, 141989, 160667, 244092, 334729, 278535, 115156, -127133, -233345, -147053, 9973, 97323, 105876, 31856, 111543, -22444, -152717, -115697, -137311, -218593, -209497, -75651, -89387, -163911, -108943, -10314, 28433, 155181, -82771, -244711, -10485]
13497a0485J46732m1868L4021P9364M8138O7180L1043k921j12510j0360L8896
13486B67230N3241r313k78562J12808P4063p8946Q3029n2369O5246K5966m7004
13475B15389K6308O9964r2379n6510N3862J36042j02262o7869o9189O1412J05112
13464B79880J403L1276j7917l58216L6546m4896k9560p6524o8635M5968J96498
13453d177J4007j03553j05728n4171j19148R4151J14923M5493n3698N3256J19127
13442D82r597l8889J2607J92963n0728j69686j49175K4152l664R0375J33622K2093
13430E4555Q4515L0018j46026N3869J16639r4340j47295j0041J41658j5957p6363
13419h768q5333J68522o1540m4643p1062r2326o7261J14120Q6483L4379j28718
$$ y = [-10485, 136247, 94379, 128400, 207764, 255902, 323082, 354125, 351204, 238694, 228334, 267230, 320471, 311158, 32596, 145404, 219467, 140521, 223550, 171181, 236427, 262393, 215389, 241697, 311661, 219282, 162772, 216634, 352676, 250414, 182545, 113356, 174768, 279880, 281283, 312559, 294642, -63574, -27028, -71924, -101484, -178008, -246643, -200675, -4177, 9830, -93723, -199451, -253622, -372770, -278619, -163696, -118203, -171901, -118645, 482, -9115, -48004, -35397, 157566, 106838, -62848, -212023, -187871, -191535, -101160, 32462, 54555, 139070, 169088, 23062, 76931, 193570, 99230, -48065, -58106, 83552, 67595, -8768, -94101, 74421, 12881, -31762, -102824, -195150, -262411, -148291, -61808, -27429, -156147]
13408a56147M1937J35759J10996j93998O8085J37780P8025j50975J1413j28758
13398d5883L5849P0368k1607j30299k8208j2485J15300J45749Q3167o9953J8704
13387A60702R1156J07373Q1817j85805k92170j01951J35107P4697J72189J01021
$$ y = [-156147, -114210, 21549, 132545, -61453, 6632, 144412, 222437, 71462, 82875, -45883, -10034, 60334, 38727, -91572, -119780, -132265, -16965, 128784, 211951, 141998, 160702, 251858, 359231, 441048, 255243, -36927, -138878, -3771, 70926, 243115, 344136]
$$ [...]
##END NTUPLES=NMR SPECTRUM
##END=
