##TITLE=Analysis number 330437
Compound Code cc 67404
Book Reference 552/40
Project Code adrs
Chemist Name stevem
##JCAMPDX= 6.0         $$ Bruker NMR JCAMP-DX V2.0
##DATA TYPE= NMR SPECTRUM
##DATA CLASS= NTUPLES
##ORIGIN= Bruker BioSpin GmbH
##OWNER= nmr
$$ XWIN-NMR		Version 3.5
$$ Mon Nov 26 11:15:21 2007 GMT Standard Time (UT+0h)  MAYBRIDGE\nmr@NMR_250MHZ
##.OBSERVE FREQUENCY= 250.131544655141
##.OBSERVE NUCLEUS= ^1H
##.ACQUISITION MODE= SIMULTANEOUS (DQD)
##.ACQUISITION SCHEME= undefined
##.AVERAGES= 16
##.DIGITISER RES= 18
##SPECTROMETER/DATA SYSTEM= dpx250
##.PULSE SEQUENCE= zg30
##.SOLVENT NAME= CDCl3
##.SHIFT REFERENCE= (INTERNAL, CDCl3, 0, 16.522)
##AUDIT TRAIL= $$ (NUMBER, WHEN, WHO, WHERE, WHAT)
$$ ##TITLE= Audit trail, XWIN-NMR		Version 3.5
$$ ##JCAMPDX= 5.01
$$ ##ORIGIN= Bruker BioSpin GmbH
$$ ##OWNER= nmr
$$ C:\u/data/dgb/nmr/ADRS/2220/pdata/1/auditp.txt
$$ ##AUDIT TRAIL=  $$ (NUMBER, WHEN, WHO, WHERE, WHAT)
(   1,<2007-11-26 11:14:43.39 +000>,<MAYBRIDGE\nmr>,<NMR_250MHZ>,
      <created by zg, POWCHK disabled, PULCHK disabled
       configuration hash MD5:
       76 6E 9A 78 1E 09 19 81 EC 84 63 8F B0 6A 59 2D
       data hash MD5: 64K
       B0 8B D5 8A D5 E3 14 F2 D7 14 D9 F7 A7 4A 95 36>)
(   2,<2007-11-26 11:15:00.50 +000>,<MAYBRIDGE\nmr>,<NMR_250MHZ>,
      <Start of raw data processing
       ef LB = 0.3 FT_mod = 6 PKNL = 1 SI = 32K 
       data hash MD5: 32K
       92 02 2A 65 C8 26 9C CA F4 A0 0A 6F 34 44 D1 0B>)
(   3,<2007-11-26 11:15:02.26 +000>,<MAYBRIDGE\nmr>,<NMR_250MHZ>,
      <apk 
       data hash MD5: 32K
       44 A4 00 B7 48 A5 34 C7 67 08 67 EE D9 67 52 42>)
(   4,<2007-11-26 11:15:03.11 +000>,<MAYBRIDGE\nmr>,<NMR_250MHZ>,
      <abs ABSG = 5 
       data hash MD5: 32K
       4E E4 D1 46 10 BB 49 40 1A 5E AF 8D 7F 63 64 E5>)
$$ ##END=
$$ 
$$ hash MD5
$$ 0F 26 51 1C BB 89 11 E1 C2 14 7A 84 85 77 86 04
##$RELAX= 
##$RELAX= 
##$RELAX= 
##$RELAX= 
##$RELAX= 
##$RELAX= 
##$RELAX= 
$$ Bruker specific parameters
$$ --------------------------
##$DU= <C:\u>
##$EXPNO= 2220
##$NAME= <ADRS>
##$PROCNO= 1
##$TYPE= <nmr>
##$USER= <dgb>
##$AMP= (0..31)
100 100 100 100 100 100 100 100 100 100 100 100 100 100 100 100 100 100 
100 100 100 100 100 100 100 100 100 100 100 100 100 100 
##$AQSEQ= 0
##$AQ_mod= 3
##$AUNM= <au_zg>
##$AUTOPOS= <13 >
##$BF1= 250.13
##$BF2= 250.13
##$BF3= 250.13
##$BF4= 250.13
##$BF5= 500.13
##$BF6= 500.13
##$BF7= 500.13
##$BF8= 500.13
##$BYTORDA= 1
##$CFDGTYP= 0
##$CFRGTYP= 5
##$CHEMSTR= <none>
##$CNST= (0..31)
1 1 145 1 1 1 1 1 1 1 1 1 1 1 1 1 1 1 1 1 1 1 1 1 1 1 1 1 1 1 1 1 
##$CPDPRG= <>
##$CPDPRG1= <>
##$CPDPRG2= <>
##$CPDPRG3= <>
##$CPDPRG4= <mlev>
##$CPDPRG5= <mlev>
##$CPDPRG6= <mlev>
##$CPDPRG7= <mlev>
##$CPDPRG8= <mlev>
##$CPDPRGB= <>
##$CPDPRGT= <>
##$D= (0..31)
0 1 0 0 0 0 0 0 0 0.06 0 0 0 0 0 0 0.0002 0 0 0 0 0 0 0 0 0 0 0 0 0 0 
0 
##$DATE= 1196075681
##$DBL= (0..7)
120 120 120 120 120 120 120 120 
##$DBP= (0..7)
150 150 150 150 150 150 150 150 
##$DBP07= 0
##$DBPNAM0= <>
##$DBPNAM1= <>
$$ [...]
##$SUBNAM7= <"">
##$SUBNAM8= <"">
##$SUBNAM9= <"">
##$SW= 20.6930455092707
##$SWIBOX= (0..15)
0 0 3 0 0 0 0 0 0 0 0 0 0 0 0 0 
##$SW_h= 5175.983436853
##$TD= 65536
##$TD0= 1
##$TE= 296.16
##$TE2= 300
##$TE3= 300
##$TEG= 300
##$TL= (0..7)
0 120 120 120 120 120 120 120 
##$TP= (0..7)
150 150 150 150 150 150 150 150 
##$TP07= 0
##$TPNAME0= <>
##$TPNAME1= <>
##$TPNAME2= <>
##$TPNAME3= <>
##$TPNAME4= <>
##$TPNAME5= <>
##$TPNAME6= <>
##$TPNAME7= <>
##$TPOAL= (0..7)
0.5 0.5 0.5 0.5 0.5 0.5 0.5 0.5 
##$TPOFFS= (0..7)
0 0 0 0 0 0 0 0 
##$TUNHIN= 0
##$TUNHOUT= 0
##$TUNXOUT= 0
##$USERA1= <user>
##$USERA2= <user>
##$USERA3= <user>
##$USERA4= <user>
##$USERA5= <user>
##$V9= 5
##$VALIST= <valist>
##$VCLIST= <CCCCCCCCCCCCCCC>
##$VD= 0
##$VDLIST= <DDDDDDDDDDDDDDD>
##$VPLIST= <PPPPPPPPPPPPPPP>
##$VTLIST= <TTTTTTTTTTTTTTT>
##$WBST= 1024
##$WBSW= 4
##$XGAIN= (0..3)
0 0 0 0 
##$XL= 0
##$YL= 0
##$YMAX_a= 426992
##$YMIN_a= -488880
##$ZGOPTNS= <>
##$ZL1= 120
##$ZL2= 120
##$ZL3= 120
##$ZL4= 120
##$ABSF1= 16.522
##$ABSF2= -4.171173
##$ABSG= 5
##$ABSL= 3
##$ALPHA= 0
##$AQORDER= 0
##$ASSFAC= 0
##$ASSFACI= 0
##$ASSFACX= 0
##$ASSWID= 0
##$AUNMP= <proc_1d>
##$AZFE= 0.1
##$AZFW= 0.1
##$BCFW= 0
##$BC_mod= 0
##$BYTORDP= 0
##$COROFFS= 0
##$CY= 12.5
##$DATMOD= 1
##$DC= 0
##$DFILT= <>
##$DTYPP= 0
##$F1P= 14.0000005364418
##$F2P= -0.99999901652339
##$FCOR= 0.5
##$FTSIZE= 32768
##$FT_mod= 6
##$GAMMA= 0
##$GB= 0
##$INTBC= 1
##$INTSCL= 1
##$ISEN= 128
##$LB= 0.3
##$LEV0= 0
##$LPBIN= 0
##$MAXI= 10000
##$MC2= 0
##$MEAN= 0
##$ME_mod= 0
##$MI= 0
##$NCOEF= 0
##$NC_proc= -5
##$NLEV= 6
##$NOISF1= 0
##$NOISF2= 0
##$NSP= 0
##$NTH_PI= 0
##$NZP= 0
##$OFFSET= 16.522
##$PC= 1
##$PHC0= 166.5881
##$PHC1= 8.748422
##$PH_mod= 1
##$PKNL= yes
##$PPARMOD= 0
##$PSCAL= 4
##$PSIGN= 0
##$REVERSE= no
##$SF= 250.13
##$SI= 32768
##$SIGF1= 0
##$SIGF2= 0
##$SINO= 400
##$SIOLD= 32768
##$SREGLST= <1H.CDCl3>
##$SSB= 0
##$STSI= 32768
##$STSR= 0
##$SW_p= 5175.98343685301
##$SYMM= 0
##$S_DEV= 0
##$TDeff= 65536
##$TDoff= 0
##$TI= <Analysis number 999999
Compound Code 99
Book Reference 9
Project Code 9>
##$TILT= no
##$TM1= 0
##$TM2= 0
##$TOPLEV= 0
##$USERP1= <user>
##$USERP2= <user>
##$USERP3= <user>
##$USERP4= <user>
##$USERP5= <user>
##$WDW= 1
##$XDIM= 32768
##$YMAX_p= 356853629
##$YMIN_p= -285196
$$ End of Bruker specific parameters
$$ ---------------------------------
##NTUPLES= NMR SPECTRUM
##VAR_NAME=  FREQUENCY,     SPECTRUM/REAL,   SPECTRUM/IMAG
##SYMBOL=    X,             R,               I
##VAR_TYPE=  INDEPENDENT,   DEPENDENT,       DEPENDENT
##VAR_FORM=  AFFN,          ASDF,            ASDF
##VAR_DIM=   32768,         32768,           32768
##UNITS=     HZ,            ARBITRARY UNITS, ARBITRARY UNITS
##FACTOR=    0.157963299565203, 1,           1
##FIRST=     4132.6476996994, 0,             0
##LAST=      -1043.33573715361, 0,           0
##MIN=       -1043.33573715361, -285196,     0
##MAX=       4132.6476996994, 356853629,     0
$$ Real data points
##PAGE= N=1
##DATA TABLE= (X++(R..R)), XYDATA
$$ [...]
15788D0817q6647j5499K6225M949r038K1160m883M9981j741n862J708k4454p0282
15775g3566m3074o792K0560M7268j6379J6870L0436j9867k4923j4284M5545L8011
15763a95J824r681m972L034r332K3088k9218L7364R441k3930k7997K2243k0697
15750b9028j2411N176R224L506k3224J6894M735l6357l6463L980o961L9675J03337
15737D2083K2759m9256l2365k3098M4026j2284n2419L5027K7239k853j0408N6124
15725D4575K2004n8113p8796k6830L1521k2956j6646N2077K8840M8030M9634k9774
15713D3566k7490j3786m8096o489q598o9395l0183j6053J0848K2759n574L6609
15701a11882J5823N010J5761J032N838P8845J7042q680K731k0557n1384r425J2814
$$ plain form
15788 40817 -45830 -61329 -35104 -30155 -39193 -18033 -22916 27065 25324 19462 21170 -3284 -73566
15775 -73566 -116640 -123432 -102872 -55604 -71983 -55113 -24677 -44544 -69467 -83751 -38206 -195
15763 -195 1629 -8052 -13024 -9990 -19322 3766 -25452 11912 21353 -2577 -30574 -8331 -29028
15750 -29028 -41439 -36263 -27039 -23533 -46757 -29863 -25128 -61485 -97948 -93968 -100929 -61254 42083
15737 42083 64842 15586 -16779 -39877 4149 -8135 -60554 -25527 1712 -1141 -11549 44575
15725 44575 66579 8466 -70330 -97160 -65639 -88595 -105241 -53164 -24324 23706 73340 43566
15713 43566 16076 2290 -45806 -52295 -60893 -130288 -160471 -176524 -165676 -142917 -148491 -111882
15701 -111882 -96059 -91049 -75288 -74256 -68418 10427 27469 18789 21520 963 -50421 -59846 -47032
15688d7032l2987L4219K1374L9189R262o1188j0306r115J659p617q481L6199k1106
15675e5930m88K3905K8394q708k5949J1448j4709N6058N0248j3302n0058k4470
15663b3561M0036J1415N657L5041p921m3098L2454P6n2540l1468l191j6595m2270
15650i5965p921K9262j1799J8074L9771M3012k9850q6054l2279k133P4469K4839
15638c6574O908l3798l3073j7453Q4057L2082J6793J20008K4017m8377m5021l8495
15626C1074l4467l2045r820K0272K7705J5829l570j8197m7288j4116K6061M9250
15614A0688l5295j08792L9898K7478L7283k9502L2186O7746L6251o138r0928r7958
15602a17083j687L1371K4201N0221L9750j1752k2559K3761n6212j13389m8580
$$ plain form
15688 -47032 -80019 -45800 -24426 14763 24025 -37163 -47469 -56584 -54925 -62542 -71023 -34824 -55930
15675 -55930 -56418 -32513 -4119 -12827 -38776 -27328 -42037 14021 64269 50967 909 -23561
15663 -23561 16475 27890 33547 68588 60667 17569 50023 50099 -2441 -33909 -37100 -53695 -95965
15650 -95965 -103886 -74624 -86423 -68349 -28578 14434 -15416 -101470 -133749 -135882 -61413 -36574
15638 -36574 -29666 -63464 -96537 -113990 -29933 2149 18942 138950 162967 114590 69569 31074
15626 31074 -3393 -35438 -45258 -24986 2719 18548 14978 -3219 -50507 -64623 -38562 10688
15614 10688 -24607 -133399 -93501 -66023 -28740 -58242 -26056 41690 77941 71803 -19125 -117083
15602 -117083 -118770 -87399 -63198 -12977 26773 15021 -7538 16223 -39989 -153378 -201958
15591b01958L8296Q8696P5608o912j2656j4039K9307r6L6174k179l0579Q608L993
15578A2263N1512l0818P2J7750M8711k5355m9883n9322j4865N265N54M3622R213
15565H719l8806K5132L3740l5369l5525J5493L3452l7584N740L7037k8692J8344
15553A681Q2262N4553n6270j3280P120k706R011Q507l5221K6581K1713j161r1367
15540A1423N799O8549N8611J728l5100L7805L4642n5835m1706j3664j4090J7669
15528G5831K376k4070Q12M654M9581L1422M24J7854j7176K193K3883L855l7366
15515A34273m1723l3989j4154K6375l5652n4361J4905o29O295l674L3617L2567
15503F3850K0481J2494k0205L196l0288j9172l6691k328J7612j519k3933j318
$$ plain form
15591 -201958 -163662 -74966 642 -6270 -18926 -32965 -3658 -3754 32420 30241 -338 8270 12263
15578 12263 63775 32957 33029 50779 99490 74135 24252 -35070 -49935 -44670 -44116 -494 8719
15565 8719 -30087 -4955 28785 -6584 -42109 -26616 6836 -30748 -25008 12029 -16663 1681
15553 1681 83943 138496 82226 68946 76066 73360 82371 90878 55657 82238 103951 102790 11423
15540 11423 17222 85771 144382 146110 111010 148815 183457 127622 85916 72252 58162 75831
15528 75831 78207 54137 54949 59603 109184 140606 141030 158884 141708 143901 167784 171639 134273
15515 134273 92550 58561 44407 70782 35130 -19231 -4326 -4955 1340 -2334 31283 63850
15503 63850 84331 96825 76620 79816 49528 30356 -6335 -8663 8949 7430 -16503 -17821
15491a7821K4130N7687J9633K977k6638j6286J0560L9988p8084M4517j4098k8800
15479A7765l9495l1808K8787P9966j4686o37m5503J8801m6896J6005L6107O481
15467B4887p444N262N0815O4894k053p7303q4104j7566J8410K7558k7744M3547
15455A9159J5989n4586n8522j5867n915J1137M8017K2478j7213Q27O3689K3947
15443E3140K9786Q028l6390l8303l6570M2003K7854j2070P217K7762K0218l080
15431H9595O491M6249n9102o4814p3353j1028K2035m3296j6882K6881K7109J6325
15419c3790N437k2458J0975N6386m4273j2446O5003M0829P76p1982p3522J1991
15407f7074M9572O4981j815q3813p0961J8274L3210J6889j1929M159K5365K3595
$$ plain form
15491 -17821 6309 63996 83629 86606 59968 43682 54242 94230 16146 60663 46565 17765
15479 17765 -21730 -53538 -24751 55215 40529 39892 -5611 13190 -33706 -17701 18406 24887
15467 24887 17443 22705 73520 138414 136361 59058 -25046 -42612 -24202 3356 -24388 19159
15455 19159 35148 -19438 -77960 -93827 -99742 -88605 -40588 -18110 -35323 -34496 29193 53140
15443 53140 82926 90954 54564 16261 -20309 21694 49548 37478 44695 72457 92675 89595
15431 89595 96086 142335 83233 18419 -54934 -65962 -43927 -87223 -104105 -77224 -50115 -33790
15419 -33790 -28353 -50811 -39836 16550 -27723 -40169 24834 65663 66439 -5543 -79065 -67074
15407 -67074 -17502 47479 45664 -38149 -109110 -90836 -57626 -40737 -52666 -48507 -23142 453
15395D53m6583q119K4499P749J3172j9508k8075m8204M642O033O9445K3008p4173
15382g5661j8568k9929L4570J2970L3991K0849p086J5327J8472j524l7882l7981
15370g2452L8521L4348L725k3605L2422k7415j4982p600k5583n783p711N9249
15358a6866l386P0490j3389J0848M0668J271j7510q3285L713J4167q5529Q674
15346g0134L6853M080J2011m3716j3743J610m3984n5356J8622P2512N0833L1159
15334G47n3319k0289n614N8895j1146k0054J2201M8472J1335l3012o2520k5676
15322i9980M2277J4021K7419L1177m2049n6687L0433P7525K1091m7789k4221J8320
15310h463K3107j0938K4495k5212o3245k9523O8851O3431J5661K9355m0196j06525
$$ plain form
15395 453 -46130 -54249 -29750 -22001 -8829 -28337 -56412 -104616 -99974 -93941 -24496 -1488 -75661
15382 -75661 -94229 -124158 -89588 -76618 -42627 -21778 -28864 -13537 4935 3411 -34471 -72452
15370 -72452 -33931 417 4142 -19463 12959 -14456 -29438 -37038 -62621 -68404 -76115 -16866
15358 -16866 -20252 50238 36849 47697 88365 89636 72126 -11159 -7446 6721 -78808 -70134
15346 -70134 -33281 -29201 -17190 -60906 -74649 -73039 -117023 -172379 -153757 -81245 -30412 747
15334 747 -52572 -72861 -78475 -19580 -30726 -50780 -38579 9893 21228 -11784 -74304 -99980
15322 -99980 -57703 -43682 -16263 14914 -27135 -83822 -53389 24136 45227 -2562 -26783 -8463
15310 -8463 14644 3706 28201 2989 -60256 -89779 -20928 42503 58164 87519 47323 -59202
15298e9202n7468M3050N4730J1265j9720k1459o3123j4248J9200J3547k4476j4026
15286a31930j262L3162M7058L6489K7945M613l363L475J0625j7867R303m855q0127
15273f6734m8276m0363K3803N60k8783M3668L6488K8702q586K1875P163o406r5734
15260a32623k1646M9611N3478j2973M4965L1694L0696m1869K1222l1257N494L3882
15248C0674l4723l6489j7665j7922M7169J3429k5326M8223M1129J8302r724n7300
15236b23o1646N85K2119N054m883J7059K2953k030k7367K2004M4805j845n0857
15223a4272j1425J2561J1626m44n1199J9938M0754N0222P585o2387r0837Q553
15211g9325J1563n4916O4254N8583L3318l1151K0185K454n958N0000k5225o8523
$$ plain form
15298 -59202 -116670 -73620 -18890 -7625 -27345 -48804 -111927 -126175 -106975 -93428 -117904 -131930
15286 -131930 -133192 -100030 -52972 -16483 11462 16075 12712 16187 26812 8945 18248 13393 -66734
15273 -66734 -115010 -155373 -131570 -131010 -159793 -116125 -79637 -50935 -59521 -37646 -30483 -36889 -132623
15260 -132623 -154269 -104658 -51180 -64153 -19188 12506 43202 1333 22555 -8702 -3208 30674
15248 30674 -4049 -40538 -58203 -76125 -28956 -15527 -40853 7370 48499 66801 57077 -223
15236 -223 -61869 -61284 -39165 -34111 -38994 -21935 1018 -1012 -28379 -6375 38430 36585 -14272
15223 -14272 -25697 -13136 -1510 -1954 -53153 -33215 7539 57761 65346 2959 -87878 -79325
15211 -79325 -67762 -122678 -58424 159 33477 2326 22511 24965 19007 69007 43782 -24741
15199b4741n1568J5368K6719j1524j0841J6354l990O056j6160r881l0602l1955
15187a26765K7524L4132n020J933M7559M1587k8356J5680K5076p2784O2190R0065
15175A12821r673k3315k8509k5635j3686l9523N0939K5643J8075R454L99k974
15163G4016k0205n7451k2411K2787K5710r901n4041L9842M0555M8614o830q1491
15151h06l6614J3559K683N616K5704o8901J4290M5897K1479J2418N4126m1664
15139D7787k6951j1856k5487M0327j1916j1293j3506K7181J1945N810K0661p589
15127D5113l0032K86L532K2592Q897m2403L7099M2273J275l149M816M5344J9952
15114A55595K187K2681j3883k1263o07j871o7840k8945l3167J2466Q205r596O5509
$$ plain form
15199 -24741 -76309 -60941 -34222 -45746 -56587 -40233 -44223 -38167 -54327 -64208 -94810 -126765
15187 -126765 -99241 -65109 -70129 -68196 -20637 20950 -7406 8274 33350 -39434 22756 112821
15175 112821 103148 79833 51324 25689 12003 -27520 23419 49062 67137 76591 76990 74016
15163 74016 53811 -3640 -26051 -3264 22446 12545 -41496 -1654 38901 87515 80685 -806
15151 -806 -37420 -23861 -21178 -15562 10142 -58759 -44469 1428 22907 35325 89451 47787
15139 47787 20836 8980 -16507 23820 11904 611 -12895 14286 26231 32041 52702 45113
15127 45113 15081 15367 18899 41491 50388 7985 45084 87357 88632 85483 90299 135643 155595
15114 155595 157782 180463 166580 145317 144710 142839 74999 46054 12887 25353 33558 23962 89471
15101H9471M985k5293j6024Q742K5196n4496r34l207m0861l3482M2105J7007k3629
15088a0420r958o080J8703k3109k7103k4281n2798k682J14535P0088n1862n6865
15076f1832k4565j3127J0156j490K5749N4298M8276M4329k6262n1519k792M5911
15064D7132Q768L6256o748J2139K9997R375j7265m5707m0089K3093K5492J0714
15052I3157k6665m5414P887l2083k6166O975j1721K3786J1447n734K970j5219
15040a6780k9459K1110l5919J0459K6784K558p990J2038l7842J4146M9444J9286
15028B7835r180k321m026L2945j0633L119J1101l4623j9620J2734K6726J7148
15016E1205k9960o156k6156N1361L1336L3474j9392n2633p3195p0341J9054M0489
$$ plain form
15101 89471 94456 69163 53139 61881 87077 32581 31647 28440 -12421 -45903 -3798 13209 -10420
15088 -10420 -20378 -26458 -7755 -30864 -57967 -82248 -135046 -137728 -23193 46895 -4967 -61832
15076 -61832 -86397 -99524 -89368 -90858 -65109 -10811 37465 81794 55532 4013 1221 47132
15064 47132 55900 92156 85408 97547 127544 136919 119654 73947 33858 56951 82443 93157
15052 93157 66492 21078 28965 -3118 -29284 -22309 -34030 -10244 1203 -4531 -1561 -16780
15040 -16780 -46239 -25129 -61048 -50589 -23805 -21247 -29237 -17199 -55041 -40895 8549 27835
15028 27835 18655 16334 12308 45253 34620 37739 48840 14217 -5403 7331 34057 51205
15016 51205 21245 15089 -11067 40294 71630 105104 85712 33079 -40116 -110457 -91403 -50914
15004e0914O2678M9552K5003m866k1412k962L1653P8705L8509N0020O0318Q6849
14992D03133J48982K10765L79081P57409J479358K443890J595729p23044j788909
14983D906394j532335j180742p70736m12992k25206j46783o2379j18249j08156
14974C48816n3983r4508n0418m6371N6417K354j2978k4293p488n7715n9220j0604
14962i991j059N918M5603k2660K0017Q908j6974R447K8991k7696n3607j3169M273
14949b1999k6156m45M7577L948K2015J4540k0354J1444k1810l132K5195p0878
14937d0055k8339j6560k1491J1080K4932k2238r705Q577N1026K8567m0076K284
14925e1998L4906J4892j9031j8198L0600K319K5697J2483l3744l0409n4633K4461
$$ plain form
15004 -50914 11764 61316 86319 81453 60041 57079 88732 167437 205946 255966 316284 403133
14992 403133 552115 762880 1141961 1899370 3378728 5822618 7418347 6695303 4906394
14983 4906394 3374059 2193317 1422581 1009589 784383 637600 575221 456972 348816
14974 348816 294833 200325 149907 103536 159953 162307 149329 125036 117548 59833 613 -9991
14962 -9991 -11050 -5132 40471 17811 37828 46736 29762 39209 68200 40504 -13103 -26272 -21999
14949 -21999 -48155 -48600 -1023 2925 24940 39480 19126 30570 8760 5628 30823 -40055
14937 -40055 -68394 -84954 -106445 -95365 -70433 -92671 -102376 -93799 -42773 -14206 -54282 -51998
14925 -51998 -17092 -2200 -21231 -39429 -8829 -6510 19187 31670 -2074 -32483 -87116 -62655
14913f2655N2563p074j04K1513j2144K4970K8549n366J1022q040m913J3443k1850
14900B9914M3255j9008m2777J0011q73n5720r728N6105J7189k0607J5040j5107
14888G694K1720J8599l1435K9713J2536l590j7203j0254n6885n0295J1585M4916
14876b2899K2621P445L965K0276m315K6827j0306L9541m11p3814m093l2714p0908
14863i8785k1381L1743r487k1005J4972Q4244M4047l0247K7678l8154K6432o050
14851D007k8921k1034J6350j1427R558M300j6471m834J2217L2285L3080k3878
14839E232j2569m0745m5657N1776J9707k2824j2571O7121K4891K036j7388m9091
14827c0082J6277J7502O594o7180o4060R977J3088M9691P5427k3689m8701P055
$$ plain form
14913 -62655 -10092 -17166 -17270 4243 -7901 17069 45618 40252 51274 43234 38321 51764 29914
14900 29914 73169 54161 11384 21395 20522 -35198 -44926 11179 28368 7761 22801 7694
14888 7694 29414 48013 16578 46291 58827 55237 38034 27780 -29105 -79400 -67815 -22899
14876 -22899 -278 7167 11132 31408 27093 53920 43614 83155 82744 8930 4837 -27877 -98785
14863 -98785 -120166 -88423 -97910 -118915 -103943 -19699 24348 -5899 21779 -16375 10057 4007
14851 4007 -24914 -45948 -29598 -41025 -31467 -27167 -43638 -48472 -36255 -3970 29110 5232
14839 5232 -7337 -48082 -93739 -41963 -22256 -45080 -57651 9470 34361 36397 19009 -30082
14827 -30082 -13805 3697 10291 -56889 -120949 -110972 -97884 -48193 27234 3545 -45156 -38101
14815c8101m597J7640J3986j2260J255k4235N1917K9044P081l3769J4727m6998
14803b4310N3713P452j2677k3078L8962K1565k8784j3151j1577j0289l0444L5466
14791B848O630P0292q715r1467n6266n0938P3150M6940J7870J1239k8707o708
14779a3832k9844J9057J0369m93l9200l706M8790j2319nn7120O488L1523m9033
14766h9325m960L5522k8103l460M822l208J1500P6041J9864K4831O671p6356j0221
14753c6382K6285N6784N553J6789M3163K0386q044j5494k5318p2301l1597M6031
14741B5855K2145j1738k4662n347l2856m0697j023L3595K1820J8479Q6645p327
14729H4889k3118j5572k3654j276j5157l8956n4331l305L6395L3860m3002l0079
$$ plain form
14815 -38101 -42698 -25058 -11072 -23332 -22077 -46312 5605 34649 41730 7961 22688 -24310
14803 -24310 29403 36855 24178 1100 40062 61627 32843 19692 8115 -2174 -32618 2848
14791 2848 9478 79770 71055 -20412 -76678 -127616 -54466 -7526 10344 21583 -7124 -13832
14779 -13832 -43676 -24619 -14250 -14743 -53943 -57649 -8859 -21178 -21183 -78303 -71815 -40292 -89325
14766 -89325 -94285 -58763 -86866 -90326 -85504 -88712 -77212 -1171 18693 43524 50195 -26161 -36382
14753 -36382 -10097 46687 52240 69029 112192 132578 124534 109040 83722 11421 -20176 25855
14741 25855 48000 36262 11600 6253 -26603 -67300 -68323 -34728 -12908 5571 92216 84889
14729 84889 61771 46199 22545 21269 6112 -32844 -87175 -90480 -54085 -20225 -63227 -93306
14717i3306Q1699O970K1082P6741J8522l3123j6464l4643k597M2951m9968m1911
14705b4047m2505n729j044k3029K3182O727M2993k6226l6217N672N2742M0110
14693A2629l468l4086J926P634L260r844N1716M6045k5519j0015o635R001k6805
14680A5839K7462K4437m4019o272M2459N9139K7342m9940o3064j9550K8053M095
14668D5981p446l5586j3860O734N638j7549k0664k4749j4420M1473M7834o066
14656G320L3409K8493k2023l2130j6018K785L9720j7483l168j3177L5691j0672
14644C2747m1842L7559r116L7984l67l7124j9997q5682l0489K9363L271J6703
14632f6990n717L0627O2384R823j3054K0446J6095l8416l9732o5345J0145L1132
$$ plain form
14717 -93306 -11607 -4637 16445 93186 111708 78585 62121 27478 24881 67832 17864 -24047
14705 -24047 -66552 -72281 -73325 -96354 -73172 -66445 -23452 -49678 -85895 -80223 -27481 12629
14693 12629 9161 -24925 -22999 -15365 -12105 -21949 29767 75812 50293 40278 33643 42644 15839
14680 15839 43301 67738 23719 17447 59906 119045 146387 96447 33383 13833 41886 45981
14668 45981 38535 2949 -10911 -4177 1461 -16088 -36752 -61501 -75921 -34448 13386 7320
14656 7320 40729 69222 47199 15069 -949 1836 41556 24073 20905 7728 43419 32747
14644 32747 -9095 28464 19348 57332 56965 19841 -156 -85838 -116327 -86964 -83693 -66990
14632 -66990 -72707 -42080 20304 30127 17073 37519 53614 15198 -24534 -89879 -79734 -48602
14620d8602O3324L7784K6381N243N051m4253p1766n2267L7498L3416L0989l4498
14608a1700n4891K6750J0185K2420M7220l2470k6298K2533J6730L8095l634j5454
14596C9486j3472m2283j0851J2618N4581K0892k1545l1705M1976k7177n6455L8824
14584D889L1077j5175K512Q587o2024p0328m900L2514m7422M0910P6706K0992
14572A8338l7552J0860L8970j965K7652L7516n3621r0852M3470P81m2470J4483
14560c4390j7223J4540L5316K0967O4119k07K0166N8540Q2337K7506J843j554
14548B71960n8442r3061p8380K7508N4584m716o6917j11234k169j523L837j0264
14536f8817M8928M8536K3465Q861m5090o9601k7295Q1846J1694O589K4612J03397
$$ plain form
14620 -48602 14722 52506 78887 84130 89181 44928 -26838 -79105 -41607 -8191 22798 -11700
14608 -11700 -66591 -39841 -29656 -7236 39984 7514 -18784 3749 20479 58574 54940 39486
14596 39486 26014 -16269 -27120 -14502 40079 60971 39426 7721 49697 22520 -33935 4889
14584 4889 35966 20791 23303 31890 -30134 -100462 -105362 -72848 -120270 -79360 -2654 18338
14572 18338 -19214 -8354 30616 28651 56303 93819 40198 -50654 -7184 -6403 -48873 -34390
14560 -34390 -51613 -37073 -1757 19210 83329 83122 103288 161828 244165 271671 273514 271960
14548 271960 213518 120457 42077 69585 124169 119453 52536 -58698 -60867 -62390 -58553 -68817
14536 -68817 -19889 28647 52112 60973 15883 -53718 -81013 833 12527 19116 43728 147125
14524A47125q094p1238n6487r489j1480k4361m1369o3377P2896J11174K7848k2842
14512E0306M407L4577L9461M100n2289j3489n1663j4643J9296m560k2876j4521
14500b1894K0263M7518n1565j2975K597l9000M5952M6911M6671k6873p9022r2245
14488a13662L5426M2212k3992J0042K5163n481M7932J9244j0319p6054l2029M1047
14476d0471N1108N6615J4718j0169l9594l4868o2570o6149K3562J9858K0171L1929
14464c5860k6514L80J3862O3393Q530p1151m7518J9150K3971K6804r645J5463
14452a9135j7531l4217m4826K7258P0773K021l1588J1837n302O862M1721k6533
14440a8660k6263J8970N2695M8649n7436l4573J5516J8411p059n4343q389L5536
$$ plain form
14524 147125 139031 67793 11306 1817 -9663 -34024 -75393 -138770 -65874 45300 73148 50306
14512 50306 54713 89290 128751 132851 80562 67073 15410 767 20063 15503 -7373 -21894
14500 -21894 -1631 45887 -5678 -18653 -16056 -55056 -9104 37807 84478 57605 -21417 -113662
14488 -113662 -78236 -36024 -60016 -49974 -24811 -30292 17640 36884 26565 -49489 -81518 -40471
14476 -40471 10637 67252 81970 71801 32207 -2661 -65231 -131380 -107818 -87960 -67789 -35860
14464 -35860 -62374 -61994 -48132 15261 23791 -47360 -94878 -75728 -51757 -24953 -34598 -19135
14452 -19135 -36666 -70883 -115709 -88451 -17678 -15657 -47245 -35408 -40710 -33848 7873 -18660
14440 -18660 -44923 -25953 26742 75391 17955 -16618 -1102 17309 10250 -44093 -52482 -16946
14428a6946J7514k8146o3245M3454M2994o281n3K6072k6742m768O014j6567p796
14415c4496j4726K0691r517P287L8752J8657L4837j2339m2022k8167l5951l5897
14403i2891K4808J0487m066L793J0359P236m6576l8051J8337O629L4355L3402
14391c2178k4522K7842m1940N770K7398j2901M757r297R374j8377m454o1670l969
14378a34167p169O0148L6890L1248j4291J6919k3436P2207l7003m2857k7994j4772
14366h4277M1087L0385p3999m0130N612O9879N5343l8169m0469O0388L2283j1112
14354F821p4589k7167M7065j2972n764l3983m518J4623J9064k1535l533J3532
14342h2956n850m3157P720K9050j8880k784l5473J705L4929L0280N7088j5051
$$ plain form
14428 -16946 568 -27578 -90823 -47369 -4375 -10656 -10709 15363 -11379 -16147 -10133 -26700 -34496
14415 -34496 -49222 -28531 -38048 -30761 7991 26648 61485 49146 7124 -21043 -56994 -92891
14403 -92891 -68083 -57596 -61662 -57869 -47510 -40274 -86850 -124901 -106564 -99935 -65580 -32178
14391 -32178 -56700 -28858 -70798 -65028 -37630 -50531 -45774 -55071 -45697 -64074 -68528 -130198 -134167
14378 -134167 -141336 -81188 -44298 -13050 -27341 -10422 -33858 38349 1346 -41511 -69505 -84277
14366 -84277 -43190 -12805 -86804 -126934 -121322 -51443 3900 -34269 -74738 -14350 17933 6821
14354 6821 -67768 -94935 -47870 -60842 -66606 -100589 -105107 -90484 -71420 -92955 -96488 -82956
14342 -82956 -88806 -131963 -124243 -95193 -114073 -116857 -152330 -150625 -115696 -85416 -28328 -43379
14330d3379m1685l8814k3009J1900Q4505M114m7291R187K3199j1707j3469J6231
14318g0218L4022J0771L9038k0225l1459q4531J1064n3394N3011P3737L0090L1682
14306B3588l3162o7197p882n882o7428J7333M7166N147J8578K9907K4589j3097
14294b8340m1709m1840K3070J3560O2548M8623m9615j1614P244j7896L3937M2632
14282D0600K7997P635k4500K8544L7921J8034k5942P607k6855j20087p5485L6689
14270f7842O8634O75o2195O367J3193j45J5117L244P023k2143l2455l574n0452
14257a24553k3265J04930Q0660K5767n226M5699j4709p5647M654l424k3747j7197
14245b6058j7172n8389j7942J5674J7902P0309o8N2777K5372l2376j3466k4207
$$ plain form
14330 -43379 -85064 -123878 -146887 -134987 -50482 -46368 -93659 -84472 -61273 -72980 -86449 -70218
14318 -70218 -36196 -25425 13613 -6612 -38071 -122602 -111538 -164932 -111921 -38184 -8094 23588
14306 23588 -9574 -76771 -84653 -90535 -157963 -140630 -93464 -88317 -69739 -39832 -15243 -28340
14294 -28340 -70049 -111889 -88819 -75259 -12711 35912 -13703 -25317 -18073 -35969 -2032 40600
14282 40600 68597 76232 51732 80276 118197 136231 110289 117896 91041 -29046 -104531 -67842
14270 -67842 792 1467 -60728 -54361 -41168 -41313 -26196 -22952 -15929 -38072 -70527 -74101 -124553
14257 -124553 -147818 -42888 37772 63539 58313 104012 89303 13656 18310 14886 -8861 -26058
14245 -26058 -43230 -101619 -119561 -103887 -85985 -15676 -15744 37033 62405 30029 16563 -7644
14233g644M5251K9481o79M186J8436L7491n852k10l746j722k6291p5518n1373
14220c8190K2340R3701L0970n2948n052j2675m5890j7916Q000k4062j9743j2241
14208g3706N0992J4746l2521o249k8141Q435Q6008q942R817l196m51l4007k7174
14195d4389L4488O5769N571K0979j3774K9942l3637o1278M435L5280j779p527
14183C4080J133K8677k9109P719R5002L281n0482o0658K4203p77r816l6228j3300
14170f275K4193j3231L0396j9974P84J5933k421l724m3741m378p8470m3828L8261
14157a06475M8576l9114r68O3738L6058N3293O738l4665n2098K5729R985K547
14145A3344M4119K0042l505Q021J18320l889n300r5109r5689n6280J8152j2954
$$ plain form
14233 -7644 37607 67088 66409 70595 89031 126522 120670 120460 116714 114992 88701 13183 -38190
14220 -38190 -15850 77851 108821 55873 50821 38146 -7744 -25660 -17660 -41722 -61465 -73706
14208 -73706 -22714 -7968 -40489 -46738 -74879 -66444 19564 10622 20439 17243 16792 -17215 -44389
14195 -44389 -9901 55868 61439 82418 68644 98586 64949 3671 8106 43386 41607 34080
14183 34080 35213 63890 34781 42500 137502 140783 90301 29643 53846 53069 43253 7025 -6275
14170 -6275 17918 4687 35083 15109 15893 31826 29405 25681 -18060 -22438 -100908 -144736 -106475
14157 -106475 -57899 -97013 -97981 -34243 1815 55108 61846 27181 -24917 812 10797 13344
14145 13344 57463 77505 74000 82021 200341 196452 191152 96043 354 -55926 -37774 -50728
14133e0728L8936j2597n4787n653P5692o965L8447N6097N922n3106o5737R965
14121b4514M1006J5113o4355j9067L591J1572O8270k8704k7113K412k1598l9850
14109h3237o3679j08936k9344P2035J00993J9547L798N2534N9171q650l0786M2431
14097B5877O131o1031m861J0611p694J1014J5003o3187r1209N42O1057R2374J337
14084d036j6987J7925M5916K9496O154m1432m8452o4414n642N117M4083J7259
14072a5013J2086Q37K7304k3502l8329K302L510k1928K7506L6279l1877n181o251
14059c2257k1561J0561N9974K2031J4939K5984l7849p1397m3125J3270P541K5681
14047b6208N6657Q915j1121k2950L118n1558o7037K5429N8206j3601L3667Q7402
$$ plain form
14133 -50728 -11792 -24389 -79176 -84829 -9137 -16102 22345 78442 84364 31258 -34479 -24514
14121 -24514 16492 31605 -32750 -51817 -48226 -36654 31616 2912 -24201 -21789 -43387 -83237
14109 -83237 -146916 -255852 -285196 -213161 -112168 -92621 -88823 -36289 22882 14232 -16554 25877
14097 25877 32008 -29023 -33884 -23273 -30967 -19953 -4950 -68137 -159346 -158804 -97747 -5373 -4036
14084 -4036 -21023 -3098 42818 72314 78468 37036 -11416 -75830 -81472 -76355 -32272 -15013
14072 -15013 -2927 -2090 25214 1712 -36617 -34315 -30805 -52733 -25227 11052 -20825 -26006 -32257
14059 -32257 -53818 -43257 16717 38748 53687 79671 41822 -29575 -72700 -59430 -51889 -26208
14047 -26208 30449 39364 28243 5293 8411 -43147 -110184 -84755 -26549 -40150 -6483 80919
14035H0919j4840o79r211l9742m7248R7J6751l3909k5054K983k8764K1018O550
14022g1129K0365M5231l629j9272J7663K1329j839n515R975K562m5446n9987L8804
14009e0888J9482K2333M5627J2303m6643N9905L4119l0016n9813m0614J0789J08823
13997H5407O663n0205k9220k562O1722N8072L4600J9500m7740j05371q5384j2031
13985f6549n826m0192K850O6212K9715O153N2303L5380O0297K1723j1416l243
13973A47407l273n2802m4597q133L803p009m155l6323m6880n453L201P2799l0577
13960a1992p8046l2540J3760O187l1570J6117K6950q351J0210K601n0002K1478
13948a15198O4462o0637j5963M9713K0798j9598o940M6334j656p0694k4528m129
$$ plain form
14035 80919 66079 65400 56189 16447 -30801 -30704 -13953 -47862 -72916 -69933 -98697 -77679 -71129
14022 -71129 -50764 -5533 -9162 -28434 -10771 10558 8719 3204 13179 15741 -29705 -89692 -50888
14009 -50888 -31406 -9073 36554 48857 2214 62119 96238 66222 6409 -34205 -23416 85407
13997 85407 92070 41865 12645 10083 71805 129877 164477 183977 136237 30866 -54518 -66549
13985 -66549 -72375 -112567 -109717 -43505 -13790 -7637 44666 80046 140343 162066 150650 147407
13973 147407 144134 91332 46735 38602 42405 35396 31241 -5082 -51962 -57415 -54214 18585 -11992
13960 -11992 -90038 -122578 -108818 -102631 -134201 -118084 -91134 -99485 -89275 -86674 -136676 -115198
13948 -115198 -50736 -111373 -127336 -77623 -56825 -76423 -83363 -37029 -38685 -109379 -133907 -138036
13936a38036K0963L3580R400L4831j3659q094j8278l8980P452N8689O6814O2556
13924G7238l8548j0623K5727l9322J6193J6659J4828O4954O7300P6512J03502
13913C74420R6339J96024K78802L16094K69154j6244k74384l27999k26246j82098
13903E03862j57824j20342p1041k3361m7154n1452k3563L4496r555j1461j773
13892B0832K6848K9812j7793m625l0797k8335J5431k460k7995n7225l2709n995
13880a15011J8083o681l0913L1570M4899J6776R935k1933j0064j2879L4215N0533
13868H530j2359j695m0291p5259J540J1975m750J6488K9684L0741l0185o551L4338
13855c7794m2928N6829O2327o7900n9220j5263r772L1065N8140N5917J875m9029
$$ plain form
13936 -138036 -117073 -83493 -74093 -39262 -52921 -61015 -79293 -118273 -110821 -52132 14682 77238
13924 77238 38690 28067 53794 14472 30665 47324 62152 127106 194406 270918 374420
13913 374420 470759 666783 945585 1261679 1530833 1514589 1240205 912206 685960 503862
13903 503862 346038 225696 154655 131294 84140 32688 9125 43621 34066 22605 20832
13892 20832 47680 77492 59699 55074 24277 -4058 11373 8913 -19082 -76307 -109016 -115011
13880 -115011 -96928 -103609 -134522 -102952 -58053 -41277 -31342 -53275 -63339 -76218 -42003 8530
13868 8530 -3829 -5524 -45815 -121074 -119534 -107559 -112309 -95821 -66137 -35396 -65581 -72132 -37794
13855 -37794 -80722 -23893 38434 -29466 -88686 -103949 -113721 -82656 -24516 31401 33276 -15753
13843a5753k0892Q4367O0378l162l6640m4894k9227p1844o9200L893J1193L6191
13831i5590r490L6574k5736K9458M7959j7589l7444k1641J240k659M325j5810
13819a06403j7190K6108j9311N4811Q3567K9258l7657M340k9131n918K3801L085
13807I360p98q9370q4845m7942L3728R6678N4168P1705j4017p3903n755L3398
13795a7593j8708R322K5235J2952k3516K2992l6267o3630l0403j487K8916n154
13783i7341K2213j6456m4952m2933P082N6006O6272k4930j8559l2504j2518L3472
13771a05148K8302L0018o5881K9163r169k1965O0519p15k4573J8227k9921p2227
13759a63370K9058M6009j6440p809j5601m692M7040L3117K4046l0796k3623J8787
$$ plain form
13843 -15753 -36645 47722 108100 104938 68298 23404 -5823 -77667 -146867 -142974 -131781 -95590
13831 -95590 -105080 -68506 -94242 -64784 -16825 -34414 -71858 -93499 -92259 -94918 -90593 -106403
13819 -106403 -123593 -97485 -116796 -61985 21582 50840 13183 17523 -11608 -17526 6275 9360
13807 9360 8562 -80808 -165653 -213595 -179867 -83189 -29021 42684 28667 -45236 -50991 -17593
13795 -17593 -36301 -26979 -1744 11208 -12308 10684 -25583 -89213 -119616 -121103 -92187 -97341
13783 -97341 -75128 -91584 -136536 -179469 -172387 -116381 -50109 -75039 -93598 -126102 -138620 -105148
13771 -105148 -76846 -46828 -112709 -83546 -92715 -114680 -54161 -54876 -79449 -61222 -91143 -163370
13759 -163370 -134312 -88303 -104743 -112552 -128153 -132845 -85805 -52688 -28642 -59438 -83061 -64274
13747f4274j5922J2840O110K0958j8752K0109K2918p503K055j3512n0722J2648
13735g3047p16J8384R008N2474o1945q152O2445L8371k1035m6215p562K7340n7407
13722f8057m696q111L1659K0868k7680l2550j0980p7190J6788P0482L3112n2087
13710a08442p8k2717J3908M253j0461j1093J7964O8134K4416l0299n2632K1787
13698h5260N1483O007K7427m0140o6414k3177J4298o437J6634m9752K5553R48
13686a28830k6150l1542L0349K3513j0069j9498J0244n827M424M6520N2250J8755
13674c5861m6539k3273l0031j3245J028N4145K9305q556m4190M3734O5303M6230
13662C8050J9361K1173m6967m5168o017r0463m2569j022J1604R2795P1402k252
$$ plain form
13747 -64274 -80196 -67356 -61246 -40288 -59040 -38931 -16013 -23516 -21461 -34973 -85695 -73047
13735 -73047 -73763 -55379 -46371 6103 -55842 -63994 -1549 36822 15787 -30428 -37990 -10650 -68057
13722 -68057 -72753 -80864 -49205 -28337 -56017 -88567 -99547 -176737 -159949 -89467 -56355 -108442
13710 -108442 -108520 -131237 -117329 -113076 -123537 -134630 -116666 -48532 -24116 -54415 -107047 -85260
13698 -85260 -33777 -27770 -343 -40483 -106897 -130074 -115776 -122213 -105579 -155331 -129778 -128830
13686 -128830 -154980 -186522 -156173 -132660 -142729 -162227 -151983 -157810 -153386 -106866 -54616 -35861
13674 -35861 -82400 -105673 -135704 -148949 -147921 -93776 -64471 -73027 -117217 -73483 -8180 38050
13662 38050 57411 78584 31617 -13551 -19568 -110031 -152600 -153622 -142018 -49223 22179 19927
13650A9927l615j1114k7577n7083o6387j240M2631L3562j4338k0435K6766L9461
13638c9442l3723m2220m0932k4343L6413N0846R135K6258N1491k935q1749K0872
13626g0329O58j0493J755L9625k1874M435m8315j5380Q605O988M7934L0856k3010
13613d8545j6428m5197J938O994j4589L8395m281o4614r70M2624K7861K4637N7168
13600D993j0299m3295j6219j6845m873M015K7125J6769l2274k9968l9782k9916
13588a70569M6361O0558P3904L2043o7005l9518m1619M2040K1501p306k2337k5116
13576i7063M2356M895j1121j1411n1303k826O4538j1402O8231K8341m7398k5225
13564d9388k2896M3800k4405j6609l4315K475J4399J7311N383O650K4181m8144
$$ plain form
13650 19927 16312 5198 -22379 -79462 -145849 -147089 -104458 -70896 -85234 -105669 -78903 -39442
13638 -39442 -73165 -115385 -156317 -180660 -144247 -93401 -84266 -58008 -6517 -9452 -91201 -70329
13626 -70329 -69671 -80164 -78409 -38784 -60658 -56223 -104538 -119918 -111313 -104325 -56391 -25535 -48545
13613 -48545 -64973 -110170 -108232 -101238 -115827 -77432 -81713 -146327 -147297 -104673 -76812 -52175 4993
13600 4993 -5306 -48601 -64820 -81665 -86538 -82523 -55398 -38629 -70903 -100871 -140653 -170569
13588 -170569 -124208 -63650 10254 42297 -24708 -64226 -105845 -63805 -42304 -49610 -71947 -97063
13576 -97063 -54707 -49812 -60933 -72344 -123647 -126473 -61935 -73337 -5106 23235 -24163 -49388
13564 -49388 -72284 -28484 -52889 -69498 -103813 -101338 -86939 -69628 -64245 -57595 -33414 -81558
13552h1558K2796J9269J1703L3791j7970k6452J8227J8492M155l6269m6017P1337
13540h496O1186K0851k588k5820p519j8228N605m5325j9484n2305o757O6325M081
13527b8474k4423n2564N9492L4772n166k2989n6706Q06O4173L419k4738j9335
13515g1733j7932j2200l9569j6569k1412j0071N6153R8468J1486o9516k7388R186
13503a11097N6766K2832l5536n3313L4262O2512m6502n0838l466o959N9949L9224
13491c2166L9827P45n452j8520N46L0379k2021j2371k91L033j9388m797l3245
13478g3721k1321J0465O340o472j9932L963K1382j7546L1149J0311k9295j4831
13466i9508N4546J3227j7691l1601l2968m622k0915N7973P8129j7715l3385k6764
$$ plain form
13552 -81558 -58762 -39493 -27790 6001 -11969 -38421 -20194 -1702 2453 -33816 -79833 -8496
13540 -8496 52690 73541 70953 45133 37614 19386 24991 -20334 -39818 -92123 -98880 -32555 -28474
13527 -28474 -52897 -105461 -45969 -11197 -16363 -39352 -96058 -95252 -31079 -27660 -52398 -71733
13515 -71733 -89665 -101865 -141434 -158003 -179415 -189486 -133333 -34865 -23379 -92895 -120283 -111097
13503 -111097 -54331 -31499 -67035 -120348 -86086 -23574 -70076 -120914 -124380 -131339 -71390 -32166
13491 -32166 7661 8406 2954 -15566 -15020 15359 -6662 -19033 -19324 -16291 -35679 -40476 -73721
13478 -73721 -95042 -84577 -78237 -84709 -104641 -100678 -79296 -96842 -65693 -55382 -84677 -99508
13466 -99508 -44962 -31735 -49426 -81027 -113995 -118617 -139532 -81559 -3430 -21145 -54530 -81294
13454h1294k7286j3311J6749J928O1224R16p405L024j9548J7286j8507R244M537
13441e2443j1532m8279J4922N1198o293P815L93M7127l7943m6585J5952M594n467
13428f6541M4117K0602l838k577o3168o2021l0237j4463L0764j113L747M2739
13416a01989r132K5431K6113K3880k4822j468J626k8828M0890n842Q622L4365
13404a1154J0033l1569L5007K3380n6405k7412K7175k5400L988M6938j6983K253
13392b0149J9680o9572J175L3319K8820p2474K6896P413n9658k1362p333J7984
13380a15261J4866M6403K9752m6227m017J4690l7703O4234O7804K9519m3685J4953
13368C5328K6509J405R443l3287J2265k0505n769j0937P3437P7674N1748L1805
$$ plain form
13454 -81294 -108580 -121891 -105142 -103214 -41990 -41074 -48479 -45455 -65003 -47717 -66224 -56980 -52443
13441 -52443 -63975 -112254 -97332 -46134 -52427 -44612 -44219 2908 -35035 -81620 -65668 -61074 -66541
13428 -66541 -22424 -1822 -5660 -8237 -71405 -133426 -163663 -178126 -147362 -148475 -144728 -101989
13416 -101989 -111121 -85690 -59577 -35697 -60519 -61987 -60361 -89189 -48299 -54141 -45519 -11154
13404 -11154 -1121 -32690 2317 25697 -30708 -58120 -30945 -56345 -52357 -5419 -22402 -20149
13392 -20149 -469 -70041 -68866 -35547 -6727 -79201 -52305 -44892 -104550 -125912 -133245 -115261
13380 -115261 -100395 -53992 -24240 -70467 -74484 -59794 -97497 -33263 34541 64060 20375 35328
13368 35328 61837 63242 72685 39398 51663 31158 25389 14452 87889 165563 217311 249116
13356B49116R602L4112R4392J7270R198K1835l2941j6905k2773M586j5109l9178
13344C13205q48P7558N4955l84K1235j4449k3307l3970O17m3259j6250j1110k6385
13331B97608m9155L4745N5679L3522P731N0176J399k884J6576M5978L2710k7193
13319D96892j8861J376O1610J5028j7080j1817L2958j5822k3950m1809n9675m2331
13307C76519o8159K5845l98o6147l7093m5075j09186m5434P810l6565K8535M7491
13295G8143M929m4486M3103j744J626j6021J7841Q4409M3646J8547R5034J05448
13283D30475M9325M4478K9216m869J1907M2115L1607J7917J1442m7575p1902m3617
13271E00519J373O7699K4201k0294J193k1972k8446j492n8804q7023L9843L2253
$$ plain form
13356 249116 258718 292830 387222 404492 413690 435525 402584 385679 362906 367492 352383 313205
13344 313205 312357 389915 444870 444486 465721 451272 427965 393995 394612 351353 335103 323993 297608
13331 297608 248453 283198 338877 372399 380130 430306 431705 428821 445397 491375 524085 496892
13319 496892 478031 479407 541017 556045 538965 527148 560106 544284 520334 478525 418850 376519
13307 376519 308360 334205 333807 267660 230567 185492 76306 30872 38682 2117 30652 78143
13295 78143 83072 38586 81689 79945 81571 65550 83391 167800 211446 229993 325027 430475
13283 430475 479800 524278 553494 548625 560532 602647 634254 652171 663613 616038 544136 500519
13271 500519 501892 569591 593792 573498 574691 552719 524273 522781 463977 376954 416797 449050
13259D49050K1315J6264k4882J8171N670j1061M4623O5045P4495R9172l1007o3638
13247F63217k2831l3113m2747K8659K6217L3650j4631n0414o469k4568R613J1558
13235E78141j8875o4978p9372n8591l5689q0827q6831m2649n8887m9523k1900
13224a9981M1370N3732J1965m1364k4698L8644p92L024k8268k504n3886n0154
13212g2912J9357l4166l2728P2201M2784L4642l7422R017L7585R786k8121L4028
13200E4051K6210m1727K0608l7193o8805k1374N4997O5843N3236J8456K5604j2309
13188A37597p3151L3246j4773m9186j6394P3834M1708L4006K6180n6587q5624
13177E0856k6629K7900L3377M3939k3941m9448o2799m8898N9958O9367J557N3473
$$ plain form
13259 449050 470365 486629 461747 479918 485588 474527 519150 584195 658690 757862 726855 663217
13247 663217 640386 607273 564526 593185 619402 653052 638421 588007 581538 556970 566583 578141
13235 578141 559266 494288 414916 356325 320636 239809 152978 110329 51442 1919 -19981
13224 -19981 21389 75121 87086 45722 21024 59668 58876 61900 33632 31128 -22758 -72912
13212 -72912 -53555 -87721 -120449 -48248 -5464 29178 -8244 773 38358 48144 20023 54051
13200 54051 80261 38534 59142 21949 -46856 -68230 -13233 52610 105846 124302 149906 137597
13188 137597 64446 97692 82919 33733 17339 91173 132881 166887 193067 136480 50856
13177 50856 24227 52127 85504 129443 105502 56054 -6745 -55643 4315 73682 75239 128712
13165A28712j0153j9232q185L723o5368m0933j0697k0954K8389R1128M3755L3690
13153A53875K7633R403q2464k9319k2731L1005M7564j5917m4050J5885J5801j8384
13141H8301j12491m3138J8901M3217m4459N801n5769R013L3425J0938K0117J1453
13129a4691o4177n7904o221K1432J6619L1024L5145p635J7275n113k9536R2514
13117B8732m758n6487j8069N2154O4298k3479q9085n5523J7658K8168j0707L0126
13105c6972j2151m5954o0836J4841J7068N090l4130J4829m789m5424k4947k2109
13093b35484M0841L64o251L1437K4925K1653J4560J3877l5034l7328j8084j7299
13081b01823M0526l238p589J6751J9244K5137K0251q91j019j7281J3294l650J67
$$ plain form
13165 128712 118559 99327 91142 94865 29497 -11436 -22133 -43087 -14698 76430 120185 153875
13153 153875 181508 190911 108447 79128 56397 87402 134966 119049 74999 90884 106685 88301
13141 88301 -24190 -67328 -48427 -5210 -49669 -43868 -99637 -90624 -57199 -46261 -26144 -14691
13129 -14691 -78868 -136772 -142993 -121561 -104942 -73918 -38773 -46408 -29133 -34246 -63782 28732
13117 28732 23974 -32513 -50582 1572 65870 42391 -46694 -102217 -84559 -56391 -67098 -36972
13105 -36972 -49123 -95077 -155913 -141072 -124004 -118914 -153044 -138215 -143004 -188428 -213375 -235484
13093 -235484 -194643 -194279 -200530 -169093 -144168 -122515 -107955 -94078 -129112 -166440 -184524 -201823
13081 -201823 -161297 -164535 -172124 -155373 -136129 -110992 -90741 -91632 -92651 -109932 -96638 -100288 -100121
13068a00121J5473J9672k1321J8783N227L3722N671j8566k5571K3372l2954R219
13056f7394J3113n978J0450J5871j7195M240j8567k6886j1995l80K8147O3272
13044a3302p535q008J2576m618o374n8422J4210L0860j4806L4688o298r6456m7952
13031a71437k841N7725M4119l5391j5834j974L1274N7697M3675K0251L398j2464
13019A8198J9657O0126q195N1470M5472o6522p6196M7139M1339J4761K7255n955
13007A68549m4759j2705j4433K5999O5415L5952J07422J40493O3449J50728J57017
12996H43127N1533O5211M6573N8034k7051P5146Q5744N2665L325r440q7045m9211
12984A108611R825K1486M133K800J4029Q78m8787n0454j35856j86336l1858K8442
$$ plain form
13068 -100121 -84648 -64976 -86297 -67514 -62287 -28565 -22894 -41460 -67031 -43659 -76613 -67394
13056 -67394 -54281 -60259 -49809 -33938 -51133 -46893 -65460 -92346 -104341 -104721 -76574 -13302
13044 -13302 -20837 -28845 -16269 -20887 -27261 -85683 -71473 -40613 -55419 -20731 -27029 -123485 -171437
13031 -171437 -174278 -116553 -72434 -107825 -123659 -125633 -94359 -36662 7013 27264 30662 18198
13019 18198 37855 97981 89786 141256 186728 120206 44010 91149 132488 147249 174504 168549
13007 168549 123790 111085 96652 122651 188066 224018 331440 471933 535382 686110 843127
12996 843127 894660 959871 1006444 1064478 1037427 1112573 1198317 1250982 1254307 1244867 1157822 1108611
12984 1108611 1118436 1139922 1144055 1146855 1160884 1161762 1112975 1062521 926665 740329 708471 736913
12972G36913Q6183M1017O6177Q3147O5079j0301N4028O251j9856O1708M4383R8723
12960A313452j0238p1140n645k2721K7245M1351P0185K9131n0025q9866r7412
12949A134317o5124q4609j21846q1582l6291j723n7352j8389j0056L5000k0552
12938F71793O6865R4422M1747m99k1754R649P2453J16654J35204J50058J90075
12927A526667K28225K54580K78779L07145L93064L29194K33233J87281K28841
12918C967009K29368K43341K91005K79316L10835L28567M58790N52890N58558
12909G219679O79101R15560J300402J780268K463131L375067M892346P105039
12901B9730593R609216J0987035J0474598Q715058O530757M823414M019936L484061
$$ plain form
12972 736913 823096 864113 930290 1013437 1078516 1068215 1122243 1128494 1108638 1170346 1214729 1313452
12960 1313452 1303214 1232074 1226429 1203708 1230953 1272304 1342489 1371620 1321595 1231729 1134317
12949 1134317 1069193 984584 862738 781156 744865 743142 685790 667401 657345 692345 671793
12938 671793 738658 833080 874827 874328 852574 862223 934676 1051330 1186534 1336592 1526667
12927 1526667 1754892 2009472 2288251 2595396 2988460 3317654 3550887 3738168 3967009
12918 3967009 4196377 4439718 4730723 5010039 5320874 5649441 6108231 6661121 7219679
12909 7219679 7898780 8814340 10114742 11895010 14358141 17733208 22625554 29730593
12901 29730593 39339809 50326844 60801442 69516500 76047257 80870671 84890607 88374668
12893H8374668K466577J597022J418331J468686J226343J28767j461132k028178
12885I3191084o28355K125883L735174K710720k17443l546571n653308n992143
12877H5725041n710481n287291m341652k366891P96825M386530O645405O552650
12869H6400136M776361K627158J134669M91156L76794L43897L44716P39694J426338
12860I8660919J572210N49864q72119j833788j289101O48500J514850m59412l754456
12851I4737467o592568p962858q113837p988725q153587q414456q190741p059563
12843C2261132n443499l888848k565501j619044r36442m76847j75788Q6897L33728
12834A7575788P98978J643771K875827M625170O635306P927972Q553488R385026
$$ plain form
12893 88374668 90841245 92438267 93856598 95325284 96551627 96680394 95219262 93191084
12885 93191084 92562729 94688612 98423786 101134506 100917063 97370492 91717184 85725041
12877 85725041 80014560 74727269 70385617 68018726 68815551 73202081 79847486 86400136
12869 86400136 91176497 93803655 94938324 95429480 95806274 96150171 96494887 97234581 98660919
12860 98660919 100233129 100782993 99910874 98077086 96787985 97436485 98951335 98491923 94737467
12851 94737467 88144899 80182041 72068204 64079479 55925892 47511436 39320695 32261132
12843 32261132 26817633 22928785 20363284 18744240 17807798 17330951 17155163 17242060 17575788
12834 17575788 18374766 20018537 22894364 27519534 34154840 42082812 50636300 60021326
12826F0021326J0675857J1789392J1365379R039208N395567J881780K38258L90009
12818A10796776J239744J996081J806787N47884p95048j308961j343575r07614
12810A12032074L44305J460560J508006j48032k967675n878656p458192p204892
12802I1687498n329421k649571M0036K467153M683409O550073Q034328P618514
12794A13102019M628003Q83624j696520k155540o69577J101682J556909J111806
12786A17862406K78015m75731r27564j548307j958327j983719j832541k289788
12778A07124444m250764p221316r859439j1583930j2062485j1428418r987522
12771D0730570q158191o327379m671809l416429k513457j864004j512878j226712
$$ plain form
12826 60021326 70697183 82486575 93851954 102891162 108286729 110168509 110406767 110796776
12818 110796776 112036520 114032601 115839388 116387272 115592224 114283263 112939688 112032074
12810 112032074 112376379 113836939 115344945 115196913 112229238 106350582 98892390 91687498
12802 91687498 86358077 83708506 83748542 86215695 90899104 97449177 105483505 113102019
12794 113102019 117730022 118613646 116917126 114761586 114092009 115193691 116750600 117862406
12786 117862406 118140421 117664690 116737126 115188819 113230492 111246773 109414232 107124444
12778 107124444 102873680 95652364 85792925 74208995 62146510 50718092 40730570
12771 40730570 32572379 26245000 21573191 18156762 15643305 13779301 12266423 11039711
12763A1039711j050405q64211q36431p57357n80956m88176l97180l40469l16266
12754E408260l30143l38051l20606l16191k63056k32506k19122k35451k36871
12745B916263j82756j34859n3790j17483p3312j13469p5340r1628o0040p813o299
12734A999474q7841j17794l7425J7310n5162p6182m4666l6805m915m3519q1853
12723A430622k9666k5242r604p859j8968n6763p3480l0124J3713j3465l0213m4854
12711A104097m8260R354L6999p050j5265m3563l4239P080o1022j2547k686K1234
12699I54132L4208j4525o5280o3402Q661m925L367J4877J7537K3455J8136L0951
12687I57192L5226K798N8745R7948M9845P3540N6924J1311Q4080N0840p0058q3219
$$ plain form
12763 11039711 9989306 9125095 8288664 7531307 6950351 6462175 6064995 5724526 5408260
12754 5408260 5078117 4740066 4419460 4103269 3840213 3607707 3388585 3153134 2916263
12745 2916263 2733507 2598648 2544858 2427375 2354063 2240594 2165254 2073626 2013586 2005773 1999474
12734 1999474 1911633 1793839 1756414 1773724 1718562 1642380 1597714 1560909 1555994 1512475 1430622
12723 1430622 1400956 1375714 1366110 1358251 1339283 1282520 1209040 1178916 1192629 1179164 1148951 1104097
12711 1104097 1055837 1065191 1102190 1095140 1079875 1036312 1002073 1009153 948131 935584 932898 954132
12699 954132 988340 973815 908535 845133 853794 848869 852236 867113 884650 908105 926241 957192
12687 957192 992418 995216 1053961 1151909 1201754 1275294 1332218 1343529 1427609 1478449 1408391 1325172
12675A325172j00055j27275j25372r9081n9163p4429l3871j8252k5488L0615K8470
12664G21271N3988Q685j0973L9914M3855L1678M4189m0485n9419Q741J9654L5205
12652H96303L6982N8134M6443J71630J33289L8732n1472m500l2537o0478m0990
12641A191536q1129r3177j12520l1492k3897j08024p7988K5078K0933J421j7087
12630F93654K4695k688L4788M1628K3703J24540J71797N262j33484q9013r7008
12619G97874q4174n0509K221R795M1180K8478M3305Q7161J4444m6876J9008M9070
12607I10977Q88p9205r0606q0704o8312k3376m8181r6610k675q335M8262J4766
12595D76889p694Q791K8039J2119L3381R7258N0981k1066r4198q2991n213K9157
$$ plain form
12675 1325172 1225117 1097842 972470 873389 814226 739797 705926 687674 662186 692801 721271
12664 721271 775259 783944 772971 812885 856740 888418 932607 892122 832703 841444 861098 896303
12652 896303 933285 991419 1037862 1209492 1342781 1381513 1330041 1325541 1293004 1232526 1191536
12641 1191536 1110407 1017230 904710 873218 849321 741297 663309 688387 709320 710741 693654
12630 693654 718349 715661 750449 792077 815780 940320 1112117 1117379 983895 894882 797874
12619 797874 713700 663191 665412 675207 716387 744865 788170 875331 889775 842899 861907 910977
12607 910977 911865 832660 742054 661350 593038 569662 521481 424871 422196 413861 462123 476889
12595 476889 469195 477986 506025 518144 551525 648783 699764 678698 584500 501509 496296 525453
12583E25453k1743m0737j2517m3970J3932l8090k6288K5215l8295k6683N932L7935
12571C60144M0351J6409J6545k867K2648j9485k8769k1865K5219N818o14P3607
12559D87141Q2920J22990P1423j4685q4105r3828j1555j8576k3612K8534L4027
12548E80674j2078n8535o2349o7111L4402O2778N6773K6861Q890M2697L6445j7865
12536F31582N4300J17751M8261J55663K10403J29620P1360k2695q2280j01621
12526A212344q674P39l0542j1480K415J13015J23691J46297J55565K18476K69188
12515B191034K33461k3845k33979l19166k55700r0091p1717k3388m0555j4780
12505A351274n594N9692R0427N376M9471J4168n1116r1226j32970j24410Q983
$$ plain form
12583 525453 503710 462973 450456 406486 420418 382328 356040 381255 342960 316277 322209 360144
12571 360144 400495 416904 433449 430582 453230 433745 404976 383111 408330 414148 413534 487141
12559 487141 570061 693051 764474 749789 665684 571856 560301 541725 518113 546647 580674
12548 580674 568596 510061 447712 380601 415003 477781 534554 561415 570305 613002 649447 631582
12536 631582 685882 803633 851894 1007557 1217960 1347580 1418940 1396245 1313965 1212344
12526 1212344 1203670 1204409 1173867 1162387 1164802 1277817 1401508 1547805 1703370 1921846 2191034
12515 2191034 2424495 2400650 2166671 1847505 1591805 1501714 1429997 1406609 1366054 1351274
12505 1351274 1345680 1405372 1495799 1501175 1550646 1564814 1513698 1422472 1289502 1165092 1174075
12494A174075M3214M9257O6692M6179K7734k7758j6216J789o9345j00121m5495
12483A150005r7319j01580k2960r552M3853K7421L3284j9943Q1764J3607J19706
12472A218286P5476k7660p0131l7805n7205m6813m5153k2397N2159N5332J48895
12461A242984J28239R2313J50608J50014J27625R8835K5632l1572p5329r4059
12451A815290j03174m9304n4894J0606j1011M9477M9022N1005J45962J84710P8639
12440B166328j6367j16494k03646k13432o2100l7007m7142j4565N0788M7314k7280
12429A526397o0020q9724r6480r3021o7925j0069m385l7907k0106L4983R7843
12418A179586J09300L0016o9898j39670p5796n8778n9538p3483r6480n355j6506
$$ plain form
12494 1174075 1217289 1266546 1333238 1379417 1407151 1379393 1363177 1364966 1295621 1195500 1150005
12483 1150005 1052686 951106 928146 918594 962447 989868 1023152 1003209 1084973 1098580 1218286
12472 1218286 1293762 1266102 1195971 1158166 1100961 1054148 1008995 986598 1038757 1094089 1242984
12461 1242984 1371223 1463536 1614144 1764158 1891783 1990618 2016250 1984678 1909349 1815290
12451 1815290 1712116 1662812 1607918 1618524 1607513 1656990 1706012 1757017 1902979 2087689 2166328
12440 2166328 2149961 2033467 1829821 1616389 1554289 1517282 1470140 1455575 1506363 1553677 1526397
12429 1526397 1466377 1376653 1280173 1187152 1119227 1109158 1104773 1066866 1046760 1081743 1179586
12418 1179586 1288886 1318902 1249004 1109334 1033538 974760 915222 841739 745259 739904 723398
12407G23398l765J1322o12O921K9844M9119M2450P9716N4467k5775R98m9950n7841
12394H60292J5713J1326J0003m2307m8391j1348L869K9042O1417M5949L5952M1904
12382A013421J5223l3589n1273j00789j18704q9911m3362j7278K1635k2957m0792
12371E31624P5160J03976Q1338N2323l356m7646k2617R586k8304j3017k5806n8315
12359F54946K3389R1798O6433M9598m5029j0198J3360r8L588l9019m0897K6250
12347G94121M6227l4656o304J9171P688p6587l4176n486l9437N5664L492l4687
12335F95030o4904j756L7479O6306M8905N7258L8907L1420N0315N3939n3307m1330
12323I18262n0361r5978j3544n1206n5041l2087K7000J0478Q220M7469k5859p4307
$$ plain form
12407 723398 719633 730955 730343 737264 767108 816227 858677 938393 992860 967085 968083 918133 860292
12394 860292 876005 887331 897334 855027 806636 795288 799157 828199 889616 935565 971517 1013421
12382 1013421 1028644 995055 943782 842993 724289 634378 591016 573738 595373 572416 531624
12371 531624 606784 710760 792098 844421 841065 793419 770802 780388 752084 739067 713261 654946
12359 654946 678335 770133 836566 886164 841135 830937 844297 844199 847787 808768 767871 794121
12347 794121 840348 805692 799388 818559 826247 749660 715484 709998 670561 726225 729717 695030
12335 695030 630126 628370 665849 732155 781060 838318 877225 908645 958960 1012899 959592 918262
12323 918262 867901 771923 758379 707173 652132 620045 647045 657523 665743 713212 687353 613046
12311F13046n6968O6365L0131m2720r899l1452p0060m1231q4631j04741m0738
12300B27102n7425K9j4363M1115K1489m0831n509q560l0294K3630l900k9312j6760
12287A06411N6541J5247M8622O3823N762J28233L2748j30476n6274l3824K3838
12276B60651Q419l7271j4363j5924O448M1787M9011N5317N3968M4270J39993J75916
12264G68222R7322K5767m0955j15350j18055j06893o6040k3537p0227r1255m1417
12253B17582N3643L712j9958n1482k0433n675J6206N7019J01702J43618J54649
12242F50583P2244N814p9670j10744j94650q9742r4759k3865n1924l1977J0743
12231F2053k0306J8966J3786L1187N0211P0376Q5091J14290J02562L6154o7071
$$ plain form
12311 613046 556078 622443 652574 609854 599955 568503 498443 457212 372581 267840 227102
12300 227102 169677 169706 155343 196458 217947 177116 171607 163047 132753 156383 152483 123171 106411
12287 106411 162952 178199 226821 290644 296406 424639 457387 326911 270637 236813 260651
12276 260651 269070 231799 217436 201512 207960 249747 298758 354075 408043 452313 592306 768222
12264 768222 865544 891311 850356 735006 616951 510058 444018 420481 350254 258999 217582
12253 217582 271225 274937 254979 203497 183064 177389 193595 250614 352316 495934 650583
12242 650583 722827 728641 648971 538227 343577 253835 159076 135211 83287 51310 62053
12231 62053 41747 60713 74499 105686 155897 226273 311364 425654 528216 564370 497299
12220D97299j14521o0324q3841p1934l4390L6723n7984l0964O2742Q8728J36695
12209C68229R2727R4919Q3179J65920K64429K46822K86341K22443Q4006j30292
12199A778723j97615j82339j80336j35967j14602p2698q5113P990J32683J35281
12189A086007J04765J21388J19337M7363p9244j54569k34972j90447j53829j07591
12179E58208k9593o9605r7553n5988n5839M3826L335k1987m9253o1553l7632J9888
12167A46254n0757K5708K7730n5761j6747p718M5468J03575K9415p8590m6999
12156A21578n51K5501K0077k3096M0104M7191L5138N9095l365M6111K1341J5333
12144D04457J3736L0893m377L5468Q6047J56548J19156M0123O4631J28981J40827
$$ plain form
12220 497299 382778 322454 238613 166679 132289 169012 111028 80064 142806 231534 368229
12209 368229 460956 555875 639054 804974 1069403 1316225 1602566 1825009 1909015 1778723
12199 1778723 1581108 1398769 1218433 1082466 967864 895166 810053 818043 950726 1086007
12189 1086007 1190772 1312160 1431497 1478860 1399616 1245047 1010075 819628 665799 558208
12179 558208 528615 459010 361457 305469 249630 293456 296791 274804 225551 163998 126366 146254
12167 146254 95497 121205 148935 93174 76427 68709 114177 217752 247167 168577 121578
12156 121578 121027 146528 166605 143509 183613 230804 265942 325037 321672 367783 389124 404457
12144 404457 418193 449086 444709 480177 566224 722772 841928 882051 946682 1075663 1216490
12133A216490J55483K94998L85252L81173M34984L96598K96008J35930J555j35080
12123C563391j27703j03653r8202l8276P4540J99243L81723N00284O44109O91791
12113E687247P29625P83653Q30803Q94541J295808J757869J945536J909078K041712
12104A7875872K795271M497484P381161J1588826J6864412K1817524K3559447
12097A06379997J8210972O884865m379092j0788494j2379171j1598516r855897
12090H2474664p174722l215056J557704O139990R958585J3149040J5409350J4296845
12082A32596400O496206n726449j5511089j9474154j8843372j5858097j2487645
12075E1191800r565585p231124n554967m401031l683051l081555k458188j950267
$$ plain form
12133 1216490 1371973 1666971 2052223 2433396 2868380 3264978 3560986 3696916 3698471 3563391
12123 3563391 3435688 3332035 3233833 3195557 3270097 3469340 3851063 4351347 4995456 5687247
12113 5687247 6416872 7200525 8031328 8925869 10221677 11979546 13925082 15834160 17875872
12104 17875872 20671143 25168627 32549788 44138614 61003026 82820550 106379997
12097 106379997 124590969 131475834 127096742 116308248 103929077 92330561 82474664
12090 82474664 75299942 72084886 73642590 79782580 89741165 102890205 118299555 132596400
12082 132596400 139092606 133366157 117855068 98380914 79537542 63679445 51191800
12075 51191800 41626215 34395091 28840124 24439093 20756042 17674487 15216299 13266032
12067A3266032j530433j207201q71791o06738m92159m70984m87240m57555l81866
12058F760065k22749j28493O3897J51421J81900J39434m6176k11937k45509j08061
12048F333792p4416K3186K13698K58500M18042N42242O69978P59445Q33660R44560
12038A0922687J114513J345379J786032K464655L270083M154821M749639N164466
12030C4972275O202533Q628948J2604484J8211814K4776241L0903887L4671471
12023A70971653L2966749K4105042R176722o409227j6881091k0998021k0650275
12016A72281552j7052288j0664617k045312O878963J4095220J8696165K0487978
12009B02677661J9278727J3965800L500548j1503686k5447166l2499889l2392971
$$ plain form
12067 13266032 11735599 10528398 9656607 9049869 8557710 8086726 7599486 7141931 6760065
12058 6760065 6537316 6408823 6472720 6624141 6806041 6945475 6899299 6687362 6441853 6333792
12048 6333792 6259376 6282562 6496260 6754760 7172802 7715044 8385022 9144467 9978127 10922687
12038 10922687 12037200 13382579 15168611 17633266 20903349 25058170 29807809 34972275
12030 34972275 41174808 49803756 62408240 80620054 105396295 136300182 170971653
12023 170971653 203938402 228043444 237220166 230810939 213929848 192931827 172281552
12016 172281552 155229264 144564647 142519335 149398298 163493518 182189683 202677661
12009 202677661 221956388 235922188 239422736 227919050 202471884 169971995 137579024
12002A37579024k8026198k2124355j6605714j2191299r173795p392908o212190
11995C5852565n367374m454530l655883k885598k308561j882856j556696j280406
11987A2460661j135522r73367p45000o99618n56798n11862m28082k11115j42293
11978G057004j12025j61011j07786j14582n7648l8751J14936J42314K28450L39702
11968G290603L14951K29575J71111J65523K19733L90820O62560R91463J269133
11959A1705472J714258K144297K529788K872216L610123N183506P382051J0290832
11951D7432543J4250729J8061548J8966503J5008920P297062k060179r590188
11944A09366938j2600837j2008933r708820o284075k031704K139136N441856P837552
$$ plain form
12002 137579024 109552826 87428471 70822757 58631458 49457663 42064755 35852565
11995 35852565 30485191 26030661 22374778 19489180 17180619 15297763 13741067 12460661
11987 12460661 11325139 10351772 9606772 8907154 8350356 7838494 7410412 7199297 7057004
11978 7057004 6944979 6783968 6676182 6561600 6503952 6465201 6580137 6722451 6950901 7290603
11968 7290603 7605554 7835129 8006240 8171763 8391496 8782316 9444876 10436339 11705472
11959 11705472 13419730 15564027 18093815 20966031 24576154 29759660 37141711 47432543
11951 47432543 61683272 79744820 98711323 113720243 121017305 118957126 109366938
11944 109366938 96766101 84757168 75048348 68764273 66732569 68871705 74313561 82151113
11936H2151113R988966J1305306R985698N218785k843621j2086384j8204971j8723329
11928F6791563j5511894j1486137p962532n343839l689658k786763k397020k288598
11920A5325122k125585j827819j459015j176829j006470q02432o43857n31561
11912E751554m64294m28105l78826k36156k44297k54198j37901j42744j86037
11903C278996j27724p6465j06401j34964o7834o9722q4299l9553K908n2389r3938
11892B428615k8301p0495j27296o4299l7543j5309j9800n8293o196K7737K6570
11881B055390Kl6564l2830R89M4448M2221o1159j20526n9218J00863Q0634k5669
11869A988581p6203j7289j0905r3846r2996m2442l3138k916j0622k4661n6866
$$ plain form
11936 82151113 92140079 103445385 113431083 118649868 115806247 103719863 85514892 66791563
11928 66791563 51279669 39793532 31831000 26487161 22797503 20010740 17613720 15325122
11920 15325122 13199537 11371718 9912703 8735874 7729404 6926972 6283115 5751554
11912 5751554 5287260 4859155 4480329 4244173 3999876 3745678 3607777 3465033 3278996
11903 3278996 3151272 3074807 2968406 2833442 2765608 2695886 2611587 2572034 2574942 2522553 2428615
11892 2428615 2400314 2329819 2202523 2138224 2100681 2085372 2065572 2007279 2001083 2028820 2055390
11881 2055390 2055392 2018828 1985998 1986987 2031435 2073656 2012497 1891971 1832753 1933616 2014250 1988581
11869 1988581 1912378 1895089 1884184 1790338 1697342 1654900 1621762 1618846 1608224 1583563 1526697
11858A526697j9396K030j8748n6346l4806j8393k0397K699n9621j7623o4499r1677
11846A129920n5993m8380J3156P4885k8965l3866j9647m2605m9504j7266j1833
11835I09902k9878K8315r66j3734j4874l0506m5906p7637k5187o5584J4477K6038
11823F74460m7307l7151N485M3187K1332J4309K8197R711K2485L938p2917J265
11811F66994L3700k5994n5973k5680L1144J700p900K8021k629n4909l259M3169
11799F28384q770l5851K2523p080O856L1981n5690q3015j473K21Q598J6069M0368
11786E63121j6440l2282Q383m50k0329J5975L542m988J5778k0743o787k1906j3075
11773D69799R359O8309p5253p6961k0069j2630N554n0403J4823L2024m435K7297
$$ plain form
11858 1526697 1507301 1509331 1490583 1434237 1399431 1381038 1360641 1363340 1303719 1286096 1221597 1129920
11846 1129920 1073927 1025547 1038703 1113588 1084623 1050757 1031110 988505 939001 921735 909902
11835 909902 880024 908339 907373 893639 878765 848259 802353 724716 699529 633945 648422 674460
11823 674460 627153 590002 595487 638674 660006 674315 702512 712223 734708 738646 665729 666994
11811 666994 700694 674700 618727 593047 624191 625891 617991 646012 643383 588474 585215 628384
11799 628384 619614 583763 606286 599206 606062 638043 582353 499338 497865 498086 506684 522753 563121
11786 563121 546681 514399 522782 522332 502003 517978 521520 516532 532310 511567 504780 482874 469799
11773 469799 479158 547467 472214 395253 375184 362554 368108 317705 332528 364552 360117 387414
11761C87414P5067N1635L5692m567K4565K5607N997p1046k4285l8575k1074J2716
11749D59146J5502m4286Q594p026m2985l1531K603m1532l8270P685M1847N0012
11737C79759l293n3283j4951k8051j1756j2366J4798N0566l4780l8934M0111L7768
11725C25588J1173J3712l8943j8706K3960k9758M974J8901K2777l9219N883p825
11713B92517l988r877O709K9334m6939k441O3578J2250k2337p749m6640k38r867
11700B54312p574o519n0096l0207J7891M2432K2040m7357O582J2978j1122k2102
11688A81258J6092M2991O580o824p401j6414K3667J8404q027o243M1897m4474
11676B41506k8006m3787j0988M2300M9966M7061N361j845N678J1450j73j5810
$$ plain form
11761 387414 462481 514116 549808 545241 569806 595413 601410 530364 506079 467504 446430 459146
11749 459146 474648 430362 438956 431930 388945 357414 360017 318485 280215 287900 329747 379759
11737 379759 376466 323183 308232 280181 268425 256059 270857 321423 286643 247709 287820 325588
11725 325588 336761 350473 311530 292824 316784 287026 292000 310901 333678 294459 300342 292517
11713 292517 288529 278652 285361 314695 267756 265315 328893 341143 318806 311057 264417 264179 254312
11700 254312 246738 240219 190123 159916 177807 220239 242279 194922 201504 214482 203360 181258
11688 181258 197350 240341 246921 240097 232696 216282 239949 258353 250326 244083 285980 241506
11676 241506 213500 169713 158725 201025 250991 298052 303413 301568 307246 318696 318523 302713
11664C02713J5323K8908L343O1487O1867R1324J05706J12441O7662Q8249P52q6831
11652H52944j16800o5229m4738l8590o2503j0013N7922P0064M2891P2903R5982
11641H54833R5549J00781o2801j44813j23971r6492j08025j19810m4123l1185
11631C19943q23m4545j9105r69r911q294n6303n130m7651k0490r138K7200J3691
11618A38475j4124k876N6008N1465k4215k3486j9697K013j575j5385k882Q127
11606A51848M4563m11m7354n638L9898n6270l146J17399O4051K4551K778q773
11594C23496q558N660l5690r622R9845M7347k2256M1597J17452J08067J69350
11583H36688K02213K31313J90361P7418l4513j14558j53495j58246j60827q5171
$$ plain form
11664 302713 318036 346944 350287 411774 473641 564965 670671 783112 850774 939023 939775 852944
11652 852944 736144 670915 626177 587587 525084 515071 572993 643057 685948 758851 854833
11641 854833 950382 1051163 988362 843549 719578 623086 515061 395251 351128 319943
11631 319943 319120 274575 255470 254501 244590 236296 179993 174863 127212 106722 97584 124784 138475
11618 138475 124351 121475 177483 228948 204733 181247 161550 163563 161988 146603 143721 151848
11606 151848 196411 196000 148646 143008 182906 126636 123490 240889 304940 329491 332269 323496
11594 323496 314938 320598 284908 275286 375131 422478 400222 441819 559271 667338 836688
11583 836688 1038901 1270214 1460575 1537993 1503480 1388922 1235427 1077181 916354 831183
11573H31183m1208N2527Q9325J39859J27913R6909J01448O0031o2242p4645j84517
11562A136583j63701j51670j36508j39952l0917n2028o1177j12341p9813J001
11552B09477K0190k3056m2223m7539L5320O2281q257l0085P682M246R445n1995
11540A45486l6033L4754p809k5796l5606K2592n556m3050m4637n9215j6122O1174
11528i818M6552L6156L0257l8371M09O1344M7940r271Q693P444k0935j9238Q651
11515A49813K2271L6445J1790O529K8348N8306J19852J48353J12735L4359k2574
11504G06227j09744k5300j365n4460p462k0297L115L4959N2395J27784P2844J3343
11492G92039P0103K9573m1172q0548j19247n6299m9449q9708n4821m0507j7431
$$ plain form
11573 831183 789975 842502 931827 1071686 1199599 1296508 1397956 1457987 1395745 1321100 1136583
11562 1136583 972882 821212 684704 544752 513835 461807 400630 288289 208476 209477
11552 209477 229667 206611 164388 116849 152169 214450 206193 176108 183790 188036 197481 145486
11540 145486 109453 144207 136398 110602 74996 97588 92032 48982 4345 -54870 -70992 -9818
11528 -9818 36734 72890 103147 64776 65185 126529 174469 165198 173891 181335 160400 141162 149813
11515 149813 172084 208529 220319 226848 255196 313502 433354 581707 694442 728801 706227
11504 706227 596483 571183 569818 515358 507896 487599 490714 525673 578068 705852 778696 792039
11492 792039 862142 891715 850543 769995 650748 594449 545000 455292 400471 359964 342533
11481C42533N2622l2158p787m8235k5770J0309K667j8880l8955j4656M9040L7295
11469C08025l7574k1683L653j9607o1132k7545K8100K5171K546l9471p378R805
11457A62910K773m4131j7883j6253m7331L0904r648K3547J9613P451K6756P51
11445A39459m1073Q683J6068p1166Q0J1311m1453k677M9885K0007k0547k3426
11433D5151r164J8462J7888O1004q042m6155m9775P370j2719k9764j523l990K4072
11420A2815k644K4790J6100j2875J2699K0120l1370r579J1435J0777m1126m9463
11408c8321r966N8529J8425k9549j7465j090J1066l7886J1295K7276K8037L9812
11396F0163k2441o1951N484L1312J2933o1470K1859O946M419M3521L2154m1718
$$ plain form
11481 342533 395155 362997 355210 306975 281205 291514 294181 275301 236346 221690 270730 308025
11469 308025 270451 248768 252421 232814 171682 144137 172237 197408 199954 160483 153105 162910
11457 162910 165683 121552 103669 87416 40085 70989 61341 84888 104501 111952 138708 139459
11445 139459 98386 107069 123137 51971 52051 63362 21909 19232 69117 89124 68577 45151
11433 45151 35987 54449 72337 133341 125299 79144 29369 36739 24020 -5744 -7267 -11257 12815
11420 12815 10171 34961 51061 38186 50885 71005 39635 30056 41491 52268 11142 -38321
11408 -38321 -48287 10242 28667 -882 -18347 -19437 -8371 -46257 -34962 -7686 20351 60163
11396 60163 37722 -24229 -18745 12567 25500 -35970 -14111 -7165 -2746 40775 72929 31211
11384C1211l6666L385j0539q39n2308M1053K8103n2290j5172L0331J7847R823
11372f061M5246M6646j7274l9527J1619j7697j2247L443M8712k5620j0347J5213
11360D2106m4146l4418M7980J4731l9552J5541N8634k3053K3772P739J8721K7536
11348A15591r966j4085J4972m8277r327k6580J9040k7732j8504l9401j1967Q2326
11336B6090L9325J7092J5381n1245l7559p754M0978O1666K8976q848R830L5152
11324A69084j8601O4436J08827K18277K09101Q933j60144k18425j69053p1378
11314A41057m3377o0393k5386m9258j3544O8069J1079m4256K8506J8179j418M5782
11302G5040J5888j202j837O954M2880l6304k3459l6301o4088L3857R0692P340
$$ plain form
11384 31211 -5455 -2070 -12609 -13448 -65756 -24703 3400 -48890 -64062 -33731 -15884 -6061
11372 -6061 39185 85831 68557 29030 40649 22952 10705 14148 62860 37240 26893 42106
11360 42106 -2040 -36458 11522 26253 -13299 2242 60876 37823 61595 69334 88055 115591
11348 115591 105625 91540 106512 58235 48908 22328 41368 13636 -4868 -44269 -56236 26090
11336 26090 65415 82507 97888 46643 9084 1330 42308 103974 132950 124102 133932 169084
11324 169084 150483 214919 323746 542023 751124 760057 599913 381488 212435 141057
11314 141057 97680 37287 11901 -37357 -50901 17168 28247 -16009 12497 30676 29258 75040
11302 75040 90928 89726 87889 94843 137723 101419 77960 41659 -22429 11428 102120 109460
11290A09460l613N421k2864n5923o3410L4006L6326J7824o911l3237r705M7247
11278E4621m545k3291K9473N319j7350L1945j4361J2020R6226K5859r5234l1083
11266F9599L9006k0046k1121K6030k1984j2186J9271M4223P590r3237k2580K638
11254A7203j0044J8885j2136q7471J4890N2075O4437M9842K46j9047N295j0528
11242H3647m4592P9K7236L7023J2302M330j1831L4525J3373m2090n4080m0807
11230A9115q982j1351K0397L3328M2130j4117j1077K8355J6449l0590m8082m4753
11218i178J277J5736l3834M107P947J0654m7621J2547n0773N700L0454O2896K8883
11205C8795K8691m6476j9076M0476J8697O719l9249l5262k9130k3141L746l2404
$$ plain form
11290 109460 105847 111268 88404 32481 -30929 3077 39403 57227 50316 17079 7374 54621
11278 54621 50076 26785 56258 61577 44227 76172 61811 73831 170057 195916 100682 69599
11266 69599 108605 88559 67438 93468 71484 59298 78569 122792 130382 37145 14565 17203
11254 17203 7159 26044 13908 -73563 -58673 -6598 57839 107681 107927 88880 94175 83647
11242 83647 39055 39134 66370 103393 115695 120025 108194 142719 156092 114002 59922 19115
11230 19115 10133 -1218 19179 52507 94637 80520 69443 97798 114247 83657 35575 -9178
11218 -9178 -7901 7835 -25999 -21892 -13945 -3291 -50912 -38365 -89138 -83438 -52984 9912 38795
11205 38795 67486 21010 1934 42410 61107 67826 28577 -6685 -35815 -58956 -55210 -87614
11193h7614L9167J9801k8620k104M5661N9100l3344j0075P478l4704J4115M7609
11181C6470Q3320J2646k542j5731j8348k2435J6246n8856p5655j4358L3585N4787
11169B9129N6369L8000R1280L8958k198J02129M6931k5752j9018n9114k5434j2210
11157B59070N5654L2337M2046L7197N9623J1818k8502o0659p1198k7607J622m3464
11145B67937j7710K1044p2162m4116m0315qO0j9953l7478M9907M207l8556M17
11132G3274j4622k0759p336j4390J4903J3145j5161k0616K4692N9814O8082J7825
11120A78851N066O997J0285n502P0720L8459j58K0690k441r766j9589k1271L3066
11107C05407m327k6053p8544p3030J1209Q574k0068m9686k1514k8357J8975K1601
$$ plain form
11193 -87614 -48447 -28646 -57266 -59370 -13709 45391 12047 1972 9450 -25254 -11139 36470
11181 36470 119790 132436 129894 114163 95815 73380 89626 30770 -44885 -59243 -25658 29129
11169 29129 85498 123498 214778 253736 251538 353667 400598 374846 355828 296714 271280 259070
11157 259070 314724 347061 389107 426304 485927 497745 469243 408584 337386 309779 311401 267937
11145 267937 250227 271271 199109 154993 114678 114670 114730 94777 57299 107206 111413 72857 73274
11132 73274 58652 37893 30557 16167 31070 44215 29054 8438 33130 92944 161026 178851
11120 178851 183917 190914 201199 195697 266417 304876 304718 325408 322967 313201 293612 272341 305407
11107 305407 301080 275027 196483 123453 134662 143236 123168 73482 51968 23611 42586 64187
11095F4187J4960Q372n9787M4930K7268l4945l5486M353J4615O9330L7573p455
11083A47915j770o3625K5426R5929K1889n0933j5218J5815O3088o1222j9394J6801
11071A74701p759j8683k6207r2184j2470K393L3187P481J3515k5378m9692n4056
11059e5152K006M7788P249K8478J7829J6177m9712l1776P242n514j0625M3405
11047A7395j2923j4629P6963K3607k6172l3662R589p6828q446J2932o4795K0536
11035g6433Q944J8399Q987j5724K9797M3200p523L1096J6647k6981k5943L705
11023H171K5180k2481k862L1903j883J8603M8771J1642Q954J4019O992L6691o306
11010A77394m5813o5538O7273M3788n9778k1063o6001k069O4701j7150Q268O7222
$$ plain form
11095 64187 79147 87519 27732 72662 99930 64985 29499 33852 48467 117797 155370 147915
11083 147915 146145 82520 107946 203875 225764 174831 159613 175428 238516 177294 157900 174701
11071 174701 166942 148259 122052 29868 17398 19791 52978 60459 73974 48596 -1096 -55152
11059 -55152 -53146 -5358 1891 30369 48198 64375 14663 -17113 -9871 -15385 -26010 17395
11047 17395 4472 -10157 66806 90413 64241 30579 40168 -36660 -45106 -32174 -96969 -76433
11035 -76433 -67489 -49090 -40103 -55827 -26030 17170 9647 40743 57390 30409 4466 8171
11023 8171 33351 10870 8008 39911 38028 56631 105402 117044 125998 140017 147009 183700 177394
11010 177394 131581 66043 133316 177104 117326 96263 30262 28193 92894 75744 84012 151234
10998A51234P9844L2265M264J6897O4918L854q9805p0049N2838M4229n444J9292
10986C04337K3310L3626J2825o3476o5284q9664k8160m2662o4651j2801J9313
10975B6713M2798K9340j9366J3173m7796j4520O6861K6712m402M5417M2946O8
10963B07944J1092r812l8923m4254k2590n6054J6436J1364m1871K6416L1890J8347
10951A09985P460O393K1937j8904O9839Q4856K3116J4619o277P016K4167J6104
10939C60311q166j3561L7503j1909m9593j6097j9801q616j4730l2747m3172n0728
10927A28694l951P0399L6776R7837J58711J26396M3548j9596J721L185P8766M0483
10915G62969j622L436m4305o4124m1555o5313o5185j06547o9071k7862n1110m8892
$$ plain form
10998 151234 231078 263343 267607 284504 349422 353276 263471 193422 246260 290489 285045 304337
10986 304337 327647 361273 374098 310622 245338 155674 127514 84852 20201 7400 26713
10975 26713 69511 98851 79485 92658 44862 30342 97203 123915 119513 164930 207876 207944
10963 207944 219036 209224 170301 126047 103457 47403 63839 75203 33332 59748 91638 109985
10951 109985 117445 123838 145775 126871 196710 281566 304682 319301 313024 320040 344207 360311
10939 360311 352145 338584 376087 364178 314585 298488 278687 270071 255341 222594 179422 128694
10927 128694 124743 195142 231918 329755 488466 614862 658410 638814 640535 643720 722486 762969
10915 762969 761347 764783 720478 656354 614799 549486 484301 377754 308683 280821 229711 180819
10903A80819j9360L0501J08748R7073J21786J30441L2953l2989o5917o0593j01218
10892D22244l2213L7643K1952m5941p9053j7403K3460K0309q4665j53390k8008
10881H4935L8304L8200L4687O5485N8312Q5204M214n5116n8463o9092m7459P962
10869A87173R15J0127M247j6924k38k5023k6289j9094J7766j0744l1498n010P8318
10856A63726k7109l0746Q318L8027J3999J0273q235K502L0026O5737Q0157N4797
10844D01472L297n2348p746p1660M111L1553N8810l261p0595l0527l2547n3472
10832A77087m0101l2694k6308r166J4193k7569P7459M1957L508r21q333j325K4159
10819A91946K0374L4917M4763J7830P880j5331l4729n748L9507N6609M2204O5214
$$ plain form
10903 180819 161459 191960 300708 397781 519567 650008 682961 649972 584055 523462 422244
10892 422244 390031 427674 449626 403685 324632 307229 330689 350998 266333 112943 84935
10881 84935 123239 161439 196126 261611 319923 405127 409341 354225 295762 226670 179211 187173
10869 187173 188088 198215 202462 185538 185300 160277 133988 114894 132660 121916 90418 85408 163726
10856 163726 136617 105871 114189 152216 166215 176488 168253 170755 200781 266518 346675 401472
10844 401472 404769 352421 344675 273015 277126 308679 367489 364228 293633 263106 230559 177087
10832 177087 136986 104292 77984 68818 83011 55442 132901 174858 178366 177445 169112 167787 191946
10819 191946 212320 247237 292000 309830 317710 302379 267650 261902 301409 358018 400222 465436
10807D65436J08489K38169L07220K23857Q0008n0403j91846j66614j56939q9524
10797G67853j8892k0037J06979J94579K05693J07214O6055p0298k01186k02635
10787I35325k52298k27913r0672o8561n5116p2940p1523J7636q119L663M7366
10776A56848k1855j5732k8929N0385P4074k7764o3403j9618P9161N5749R4387
10765C33303J25202K35448L29198L26286K51876J25395j3888q7161j72438j70897
10755A282324j11388m5709O8805J78833K73124L39571K99098J50395j7558m9389
10745B368106j12743q5689j2869J25043K31913K72665L99768N83069R51765J553789
10735F274817K458636M280454Q090794J5577742K7269481K6772102J075990k0009359
$$ plain form
10807 465436 573925 812094 1119314 1343171 1423179 1372776 1180930 1014316 857377 767853
10797 767853 748961 728924 835903 1030482 1236175 1343389 1409444 1339146 1137960 935325
10787 935325 683027 455114 364442 295881 240765 167825 96302 113938 105819 109482 156848
10776 156848 134993 119261 90332 140717 214791 187027 123624 104006 183167 238916 333303
10765 333303 458505 693953 1023151 1349437 1601313 1726708 1712820 1625659 1453221 1282324
10755 1282324 1170936 1125227 1194032 1372865 1645989 1985560 2284658 2435053 2417495 2368106
10745 2368106 2255363 2169674 2156805 2281848 2513761 2786426 3186194 3769263 4721028 6274817
10735 6274817 8733453 13013907 21104701 36682443 63951924 90724026 91800016 71790657
10727G1790657k1173153j6354833j1401326p243806m308418k615343j743195j274805
10719E675778r83230p06002m57010m03850l66617l18566k93749k89333k05699
10710A651722j71299j80599j85266p2163m4781p6178j4125p3327p7886l0587q2704
10699F42807j29539n9633o279p9739n9679p4538k8971J374L1547L4028k601n1277
10687B17500j2432J5723k7041k8527P767j2462m5968l6687L0946M3177P021n272
10675A53745m3259j0620k939j4634L3006M4100K3418L5747l9699m1007j6882J4204
10663A35180J2729N908P33N647O446N1486K2336j7896k1683J24K2493M8685j7427
10650B54761m5594n6240r517k010J42j6520m8496n9198k0529K9004N0169K5688
$$ plain form
10727 71790657 50617504 34262671 22861345 15617539 11309121 8693778 6950583 5675778
10719 5675778 4692548 3986546 3529536 3125686 2759069 2440503 2146754 1857421 1651722
10710 1651722 1480423 1299824 1114558 1042395 997614 921436 907311 833984 756098 725511 642807
10699 642807 513268 453635 447356 367617 307938 233400 204429 205803 237350 271378 268777 217500
10687 217500 205068 220791 193750 165223 172990 160528 114560 77873 108819 151996 159017 153745
10675 153745 110486 99866 96927 82293 115299 159399 182817 218564 178865 137858 120976 135180
10663 135180 147909 153817 154550 160197 166643 218129 240465 222569 200886 201010 223503 272188 254761
10650 254761 209167 152927 143410 141400 141542 125022 76526 17328 -3201 25803 75972 101660
10638A01660K9098L7489L4594l8294o6953q372J3646o1912J2874L2788q5192m0005
10626c8579L5677L3097p0789j7434J4162L6645Q1373L8138k5340j4652n8959l4372
10614b1033j3742K0121O8443R7318O6541J1301j6225o2637m3785k3562n5440o6009
10602c8709m4512K0168P212L8309K0529n7958l0925Q7299P7760j0627n9913q346
10590B87P313o7989l7935r090n398R255O0091N4804J4584m9829j0134P885O852
10577a9304k7591k8894M4059l741N845N198K4837R270n0475q8581n4569k0866
10565b04812K5330M4079Q5385M2132k8681p7703k164J7549l5428l2000M1883L744
10553a20686N9811N6612k394N587O484o6196m862k6579j1464N5691Q4597J74064
$$ plain form
10638 101660 130758 168247 202841 164547 97594 89222 102868 40956 53830 86618 1426 -38579
10626 -38579 -2902 30195 -40594 -58028 -43866 -7221 74152 112290 86950 72298 13339 -21033
10614 -21033 -34775 -14654 53789 151107 217648 228949 212724 150087 106302 82740 27300 -38709
10602 -38709 -83221 -63053 -55841 -17532 2997 -54961 -85886 1413 79173 68546 8633 287
10590 287 7600 -60389 -98324 -107414 -112812 -103557 -43466 11338 25922 -23907 -34041 -26156 -19304
10577 -19304 -46895 -75789 -31730 -35471 -29626 -24428 409 9679 -40796 -129377 -183946 -204812
10565 -204812 -179482 -135403 -50018 -7886 -36567 -114270 -116434 -98885 -134313 -166313 -124430 -120686
10553 -120686 -60875 -4263 -6657 -1070 5414 -60782 -65644 -92223 -103687 -47996 36601 210665
10541B10665J57448J45790R8014o5943q8830j03858j16471j05441l3778j9777
10531G7819k6607M303m3631r160j7674N6836q272R340N9885J9390j6536n9425
10519D6268l0624k6949L5551N6044J6307n890j8189J004J1486k379l9535l5564
10507G530n213j1915R772O768q065m6062n0363J7243K6438P4010P8841N9675N4140
10494B12799n291p401O9459O3853j070j8137k6203M2128P4433O7746P047O2866
10482E42229M6913K2281n294k0869j1954L3960P3877N5255J1792k4056j8245j8839
10470F87050N7902n472Q9317K04693K70780K08694Q3349P6506K43531K42304K69198
10459B427852M35483P12702J143152J779770L057164N623021J0812520J9885053
$$ plain form
10541 210665 368113 513903 611917 545974 457144 353286 236815 131374 97596 77819
10531 77819 51212 55515 11884 2724 -14950 41886 33614 42954 102839 122229 105693 46268
10519 46268 15644 -11305 24246 80290 96597 90707 72518 73522 85008 82629 43094 7530
10507 7530 2317 -9598 174 6942 -1123 -47185 -97548 -80305 -53867 20143 98984 158659 212799
10494 212799 207508 200107 269566 333419 332349 314212 288009 330137 404570 472316 479363 542229
10482 542229 589142 611423 606129 585260 573306 607266 681143 736398 748190 724134 705889 687050
10470 687050 744952 739480 828797 1033490 1304270 1512964 1596313 1672819 1916350 2158654 2427852
10459 2427852 2863335 3576037 4719189 6498959 9556123 15179144 25991664 45876717
10451D5876717K3340876M861737j4235239j7359680j3423058r385193n876893
10444A3799267l512778k041577j237404q73191o98693m51698k58422j66277N0265
10435D609492J03990Q2686J08272K55648M88544Q02632J083597J377799J278227
10426A0190887Q88486P17181Q41379J115216J265915J439850J968127K956211
10418B1383252M526403P119891J1658561J8977513K9157394L9654557M5067004
10411A77544575M0114587K4598569M197886j3962666k5438933k9159900k5342107
10404A52552011j4985655j5030J6509345K9682780L3795088K5623667Q717883
10397B51880089r850063k4672713l3275820l5569233l2759667k6820057k0088560
$$ plain form
10451 45876717 69217593 74079330 59844091 42484411 29061353 19676160 13799267
10444 13799267 10286489 8244912 7007508 6134317 5435624 4983926 4725504 4559227 4609492
10435 4609492 4713482 4796168 4904440 5160088 5648632 6451264 7534861 8912660 10190887
10426 10190887 11079373 11796554 12637933 13753149 15019064 16458914 18427041 21383252
10418 21383252 25909655 33029546 44688107 63665620 92823014 132477571 177544575
10411 177544575 217659162 242257731 246455617 232492951 207054018 177894118 152552011
10404 152552011 137566356 137551326 154060671 183743451 217538539 243162206 251880089
10397 251880089 242030026 217357313 184081493 148512260 115752593 88932536 68843976
10390F8843976j4018866r379445o142319m076962k745537j855441j259197p05928
10382B8660281j49631L72211P11216R71687J278211J833028L047479N080792Q417506
10373E0222780J4206726K3425287L6397074N0375006N8714357N3804583L3441839
10366C20587652L895299k3858988m0693929m3742460l5026049j8526225K261615
10359A64896915K4296245M2241907M8710487L8309331J3331054j6406209l9970551
10352B75409179n1490157n1149089m3342172l2775493k3102181j5707878j0701309
10345D7140900p426270n326923l989283l212695k866490k551015k209566j931655
10337A7627003j640325j335018j148023j138076j167645j070718r38049q15475
$$ plain form
10390 68843976 54825110 45445665 39303346 35226384 32480847 30625406 29366209 28660281
10382 28660281 28510650 28882861 29594077 30565764 31843975 33677003 36724482 41805274 50222780
10373 50222780 64429506 87854793 124251867 174626873 233341230 287145813 320587652
10366 320587652 324482951 300623963 259930034 216187574 181161525 162635300 164896915
10359 164896915 189193160 231435067 280145554 318454885 331785939 315379730 275409179
10352 275409179 223919022 172769933 129427761 96652268 73550087 57842209 47140900
10345 47140900 39714630 34387707 30398424 27185729 24319239 21768224 19558658 17627003
10337 17627003 15986678 14651660 13503637 12365561 11197916 10127198 9189149 8373674
10329H373674o48794m96681m37514l51682l12122k87333k45944j83929j55523
10320E254152k70627k60195j90715j38519k17980r5720n7419j14115q5803j02615
10310C720444j42853j16449p4583o6454m6348p8080m4144o8077o6095n472Q7961
10299C099850j48l9666l0101p707j2766o2816l8412M3810J3811q2620o9132j5447
10287B798656k1648K1705J371q3577r0652l7276k0250l1073O2201P1836K605L7137
10275B711035J2964N685j6740o3916l6456j7889l5890o1704o5832p5871l4759
10264B320627m3319J9594l1712j35292r6751j17769o5717q7624j30453j08561
10254A523023r2043j10627n8003j3010m892o3060o1339J0025r897q426n7172j6595
$$ plain form
10329 8373674 7724880 7228199 6790685 6439003 6126881 5839548 5593604 5409675 5254152
10320 5254152 4983525 4723330 4532615 4394096 4176116 4080396 4022977 3908862 3823059 3720444
10310 3720444 3577591 3461142 3386559 3320105 3273757 3195677 3151533 3083456 3017361 3011889 3099850
10299 3099850 3099702 3060036 3029935 3022228 3009462 2946646 2908234 2952044 2965855 2883235 2814103 2798656
10287 2798656 2777008 2798713 2800084 2716507 2625855 2588579 2568329 2537256 2599457 2671293 2673898 2711035
10275 2711035 2723999 2729684 2712944 2649028 2612572 2594683 2558793 2497089 2431257 2355386 2320627
10264 2320627 2277308 2296902 2265190 2129898 2033147 1915378 1849661 1762037 1631584 1523023
10254 1523023 1430980 1320353 1262350 1249340 1244448 1181388 1120049 1130074 1120177 1111751 1054579 1037984
10242A037984o472m382o5373j0276P7075L9236K6025Q0714L6541n5085p6792q3472
10230I95723p2759n1866l7753L2058k0628J2275O4186M5877J1007k8805m3981
10219I05334K2013O3967J8540l8495m1633o3333k722p479J4366j1865o9215j5699
10207G73779J3596K7857j0675k9826o299N285L6679L1225K0941J7388K681Q9582
10195I72213R0515J06916K61279L12373J99739j09879k71099k14525j01444n1762
10185A194326L011L6589n3786n409j067O0343N1431p987m8068j33046n1788p4732
10173I69817q5336j01582m9817L5L651o4708j8091N048L7044j8114o1429k5272
10161E91246r3k328J8523N2252M1717j548k991l883K0040N4079Q5251n68M1336
$$ plain form
10242 1037984 1031512 1027130 961757 951481 1028556 1067792 1093817 1174531 1211072 1155987 1079195 995723
10230 995723 922964 871098 833345 865403 844775 857050 921236 967113 978120 949315 905334
10219 905334 927347 991314 1009854 971359 929726 866393 863671 856192 870558 858693 789478 773779
10207 773779 787375 815232 804557 774731 768432 773717 810396 841621 862562 879950 882631 972213
10195 972213 1062728 1169644 1430923 1743296 1943035 1833156 1562057 1347532 1246088 1194326
10185 1194326 1197337 1233926 1180140 1174731 1173664 1234007 1285438 1277451 1229383 1096337 1044549 969817
10173 969817 884481 782899 733082 733117 736768 672060 653969 659017 696061 677947 616518 591246
10161 591246 591153 588825 607348 659600 701317 699769 696778 692895 712935 767014 852265 851697 893033
10148H93033M2944J1753j2683N9560J05886R0022N6146P2405J54202J97227J82743
10137A853238J89267K15257M60100P94961J119950J362475J387503J091467P18178
10128I192396L44534j09397n44037q73096j074100j055102q74526o43084n40453
10119C823135m13970l49723j75010l5653O4744J07460J86479L24234M64863P77456
10109D774015J213718J704223K113789K468460K382268J836248R32485j58506
10101A7266700j127273j828489k153015k061591j649030j168175o49642k02688
10093F426797K44234N61645P93299R13505Q36217P00053N59291M47971N43283
10084A2026295O51013Q36773R37939Q54958M48217o9539o50150j156525j417622
$$ plain form
10148 893033 935977 947730 935047 994607 1100493 1190515 1246661 1319066 1473268 1670495 1853238
10137 1853238 2042505 2257762 2717862 3512823 4632773 5995248 7382751 8474218 9192396
10128 9192396 9536930 9427533 8883496 8010400 6936300 5881198 5006672 4363588 3823135
10119 3823135 3409165 3059442 2884432 2848779 2913523 3020983 3207462 3531696 3996559 4774015
10109 4774015 5987733 7691956 9805745 12274205 14656473 16492721 17425206 17266700
10101 17266700 16139427 14310938 12157923 10096332 8447302 7279127 6629485 6426797
10093 6426797 6671031 7232676 8025975 8939480 9775697 10475750 11035041 11483012 12026295
10084 12026295 12677308 13514081 14452020 15306978 15755195 15685656 15035506 13878981 12461359
10075A2461359j509607j298213r74079o29170j90296L03396Q52057J495192J997428
10066A2508067K369152K536970K503783K364869K299507K232151J978381J596465
10058C0389345J335928R51817J05250r57411k142150l016136l522435l545107
10050A9599101l023535k197462j463992p42353m2865N17150R71976J234148J378118
10041A6230286J340902J283541J258470J440113J878663K550827L461743M266443
10033C3710988M485839L772978K149840n5499k399096m122176m891390m645004
10025B8006480l849715k865374j588300l26789P77179J700719K391443K662419
10017B6908062K450720J889301J258732P78375M10237K29916K63241M94282O81535
$$ plain form
10075 12461359 10951752 9653539 8679460 8050290 7859994 8163390 9015447 10510639 12508067
10066 12508067 14877219 17414189 19917972 22282841 24582348 26814499 28792880 30389345
10058 30389345 31725273 32677090 32782340 31824929 29682779 26666643 23144208 19599101
10050 19599101 16575566 14378104 12914112 12171759 12128894 12646044 13618020 14852168 16230286
10041 16230286 17571188 18854729 20113199 21553312 23431975 25982802 29444545 33710988
10033 33710988 38196827 41969805 44119645 44064146 41665050 37542874 32651484 28006480
10025 28006480 24156765 21291391 19703091 19376302 20153481 21854200 24245643 26908062
10017 26908062 29358782 31248083 32506815 33285190 33695427 33925343 34188584 34682866 35364401
10008C5364401L68555l66926j195928j855060k345390k723119k717508k222010
10000B2307015j579882q33120J13781J153784K283856L485945M681805N542660
9992C7155844N758338N271215M364302L253819K092573Q25648o65781k199004
9984E5856954l596074m621551n294051n448432n137926m379333l479861k579704
9976B1320022j674434p89355J96673R86590J686913K134878K454035K625868K508346
9967C1449536K074559J625650J419068J262769J041277R06300P45841N04456j41294
9958D0888162j239687k437364l325953l712107l586007l080338k143515q76807
9950B0486384L91640J628221K717239L231080L098503K387590J219426k5146j073771
$$ plain form
10008 35364401 35732956 35366030 34170102 32315042 29969652 27246533 24529025 22307015
10000 22307015 20727133 19894013 20007794 21161578 23445434 26931379 31613184 37155844
9992 37155844 42914182 48185397 52549699 55803518 57896091 58721739 58055958 55856954
9984 55856954 52260880 47639329 42345278 36896846 31758920 27379587 23899726 21320022
9976 21320022 19645588 18856233 19052906 20039496 21726409 23861287 26315322 28941190 31449536
9967 31449536 33524095 35149745 36568813 37831582 38872859 39779159 40525000 41029456 40888162
9958 40888162 39648475 37211111 33885158 30173051 26587044 23506706 21363191 20486384
9950 20486384 20878024 22506245 25223484 28454564 31553067 33940657 35160083 35134937 34061166
9941C4061166j765695j883452j745518j494522j203418r68201q51645r22105j231120
9932B1995490j516488j714540j716809j542600j182203n64439J82511J055515
9924A4996437J851765K512178K987062L266343L287063L013083K378218J481363
9916C5773512N71987m11946j406151k362879l095173l607715l722888l536235
9908A8202512l008676k334656j803631j316639p33971l29982J07310N60584Q45731
9899A0188582J108976J338974J407164J368046J289442J086377Q86545N59757
9891A9233863J67094k64892r14135j369593j691072j830652j839634j643257j343201
9882H504521r30972n78015k53585J73159N86514R68843J446705J778032J760421
$$ plain form
9941 34061166 32295471 30412019 28666501 27171979 25968561 25000360 24148715 23226610 21995490
9932 21995490 20479002 18764462 17047653 15505053 14322850 13758411 13940922 14996437
9924 14996437 16848202 19360380 22347442 25613785 28900848 31913931 34292149 35773512
9916 35773512 36345499 35933553 34527402 32164523 29069350 25461635 21738747 18202512
9908 18202512 15193836 12859180 11055549 9738910 9004939 8674957 8782267 9342851 10188582
9899 10188582 11297558 12636532 14043696 15411742 16701184 17787561 18674106 19233863
9891 19233863 19400957 19136065 18221930 16852337 15161265 13330613 11490979 9847722 8504521
9882 8504521 7573549 6995534 6741949 6915108 7501622 8470465 9917170 11695202 13455623
9873A3455623J373496O51337l25412j185964j804240j990978j811331j554658
9865F807873j168322q99948o78053m67904l20448j97296j28665j8667k7559j7919
9855B883092J50313K91993N28200P47375R18341J053461Q96186N46417K28207
9846H243585k21608o70820j017319j129899r74958q24543o53882m72752l00380
9837A977424j78889j56157j08423r3478r3797m3138j26025q3801n1089p0987k3514
9826I48126M1510N0460j3378p8754p4446j9520n6209l448l7211o4630n0000M469
9814F46969K9653n4954o3790N548L2053K8471Q655m6502o6278l404J5974o487
9802E25908O8024K3042K2682J1985P280n6383r7131j5588m3321p6353j5220j4357
$$ plain form
9873 13455623 14829119 15480456 15155044 13969080 12164840 10173862 8362531 6807873
9865 6807873 5639551 4739603 4061550 3593646 3273198 3075902 2947237 2928570 2901011 2883092
9855 2883092 3033405 3325398 3853598 4600973 5519314 6572775 7468961 8015378 8243585
9846 8243585 8021977 7351157 6333838 5203939 4228981 3404438 2750556 2277804 1977424
9837 1977424 1798535 1642378 1533955 1440477 1346680 1303542 1177517 1093716 1042627 971640 948126
9826 948126 989636 1040096 1026718 947964 873518 853998 797789 794341 757130 692500 642500 646969
9814 646969 676622 621668 557878 563426 595479 623950 632605 586103 519825 516421 532395 525908
9802 525908 593932 616974 639656 651641 658921 602538 505407 489819 446498 370145 354925 340568
9790C40568K2670O6065L3058k693L1606K3260K1192j403m5476p7005m1457J9238
9778C89623P156N0944P181l4020q800J7586j7160O985k2656L0939L650L5250K567
9765D69245j3668Q1073J05690J15499J66058R8052r512j04710j72807j69745l8213
9754E26962o7494n0502n1465K3806m5546l4712K0361P3587N876q778o8261o1088
9742B62746L8154R8195K5146j374L695P622l7140J0346l879k1518l242L9172l8353
9729C79570k3734N192M659m355J1624J7479l224K5981j4646p2045q8825K4531
9717B62207O8971Q4805N1126L7070K3506Q8296K4927O462r5304j48658o6219O5808
9705D02997J3672k3782o484N0928J8817j8907M231l5180o8047q855K5301k0187
$$ plain form
9790 340568 363238 429303 462361 459668 491274 514534 535726 534323 488847 411842 370385 389623
9778 389623 396779 447723 454904 420884 412084 429670 412510 419495 396839 427778 431428 466678 469245
9765 469245 455577 536650 642340 757839 923897 1021949 1012437 907727 734920 565175 526962
9754 526962 459468 408966 357501 381307 335761 301049 321410 394997 400873 392095 323834 262746
9742 262746 300900 399095 424241 422867 426562 434184 397044 407390 403511 381993 378751 417923 379570
9729 379570 355836 361028 365687 361332 372956 390435 387211 413192 398546 326501 237676 262207
9717 262207 331178 415983 467109 504179 527685 615981 640908 647370 552066 403408 337189 402997
9705 402997 416669 392887 386403 437331 456148 437241 441472 406292 338245 329390 354691 334504
9693C34504r2864l0743j5725O797j5872N9841K8906J8951j8014K9083K5413J2703
9681C42980j9347k5443K5310L0463K4999l6592l4382n4212l4031K1384K8362J149
9669B70640q285J6814j2554O5864N7805r810M9844L0798k7221K0332N4624J1654
9657E20505J2727k8153L8764M4318k0163l4368o722k6620R761N0385q632r713
9645E42089P8790L3389K9087L7786M4587o3722p4775n6918m4069j8502R4271R0406
9633F92419M5527N1299R8703J6338r880n133n8232j7418j8395l0449m5274l3826
9621F85679P4530R0925N8174j1373J5208J5571k9301j31126o5284l1038r17k3323
9609F47725M1965N7041o979j6548O7419K4220m5270q2713o2605j3384N9726O1765
$$ plain form
9693 334504 241640 210897 195172 201969 186097 245938 274844 293795 275781 304864 330277 342980
9681 342980 323633 298190 323500 353963 378962 342370 307988 253776 219745 241129 269491 270640
9669 270640 262355 279169 266615 332479 390284 380474 430318 461116 433895 454227 508851 520505
9657 520505 533232 505079 543843 588161 567998 533630 526908 500288 510049 560434 551802 542089
9645 542089 620879 654268 683355 721141 765728 702006 627231 570313 526244 507742 602013 692419
9633 692419 737946 789245 887948 904286 894406 889273 831041 813623 795228 764779 719505 685679
9621 685679 760209 851134 909308 897935 913143 928714 899413 768287 703003 671965 671048 647725
9609 647725 689690 746731 739752 723204 790623 814843 769573 686860 624255 610871 670597 732362
9597G32362Q9452J91038L09265J74554r0053k18116j87727j26177j16938K9634
9587G87294o0156m3845J6396m1433m0986n1497l3195r794l6779K0448N7838K4310
9575E88601m3680l1977M9864L6933l3219j02392P75N4613O0034P8081P8595Q4990
9563H21218J73905K25050J69484N3731p7717q4320j02796o7476p0215r8991L649
9552I45522O2815p87J3689M3502Q9471P3618O5413O3900K4167M0202j4643k836
9540A404033j0019n026J1059M2399k6087o2521k5422n0069j9390l1217o7995r2713
9528A067032r8855n2348l6972Q2181J93447J77582J39292K18426L03647J97814
9518B191246k8010k01630l03994k69328j62373j26710j18628j00193k9174p884
$$ plain form
9597 732362 821814 1012852 1322117 1496671 1406618 1188502 1000775 874598 757660 787294
9587 787294 727138 683293 699689 658256 617270 565773 532578 522784 486005 506453 564291 588601
9575 588601 544921 512944 562808 599741 566522 464130 464905 519518 579552 657633 736228 821218
9563 821218 995123 1220173 1389657 1443388 1365671 1281351 1178555 1111079 1040864 941873 945522
9552 945522 1008337 1007550 1021239 1064741 1154212 1227830 1293243 1357143 1381310 1421512 1406869 1404033
9540 1404033 1394014 1388988 1400047 1442446 1416359 1353838 1328416 1278347 1258957 1227740 1159745 1067032
9528 1067032 968177 915829 878857 961038 1154485 1332067 1471359 1689785 1993432 2191246
9518 2191246 2163236 1961606 1657612 1388284 1225911 1099201 980573 880380 851206 843322
9508H43322j2563J0109k2107j6159p5025j1653M9048l2157J9304O9770L2234l312
9496H50811p195k5560l9694n2213n1234r1064o5654n9914K221M2776j8851Q881
9484D93310j1320p38N4295N9237L584k1762P0561M5530K5698m6874p4228o7323
9472E29970j6279k6968q1151J583M386r920k0205p092l2948k690k6712k8638k2733
9459B60603K0116K4679p771m4876m9524l718K097R362j8793l8585r373l9658P6514
9446A81073K1003q274k7500k0548l7218l5426L8133M3876J0811P6865k6132k1128
9434A95535M403P3878M5469o304j6701K1221j7148J3875l5420j9239L2954M8977
9422C41500j4284m3591j2069N8226N7217K6889k0427k5395l2437j6575k1448k5620
$$ plain form
9508 843322 830759 840868 818761 802602 727577 715924 764972 732815 752119 821889 854123 850811
9496 850811 843616 818056 778362 726149 674915 583851 518197 458283 460504 503280 484429 493310
9484 493310 481990 481252 535547 594784 598368 576606 647167 692697 718395 671521 597293 529970
9472 529970 513691 486723 405572 407155 411541 401621 381416 374324 341376 338686 311974 283336 260603
9459 260603 280719 305398 297627 252751 203227 199509 201606 210968 192175 153590 144217 104559 181073
9446 181073 202076 193802 166302 145754 108536 73110 111243 155119 165930 242795 216663 195535
9434 195535 199938 273816 319285 312981 296280 317501 300353 314228 278808 259569 292523 341500
9422 341500 327216 283625 271556 329782 386999 413888 393461 368066 335629 319054 297606 271986
9410B71986r47M1805O580M263k6961K6793M1610r045L1562N866m1247m9127M3019
9397C46157K3439m9365K9944q469L5782L1460J9770M0426L0555J2915J9390J8415
9385E50419O4410L5656M9120J4328J9245j7345k2803M534J6031L5815J7696J2339
9373G79445L1751N7802m7699k2597K8204N7891J01156Q8545J5241M9263O5965
9362A204967Q9720J51851J02144J50644K11963J60656K03641K96004L96283M94954
9352C462827P26521R71637J292837J834292K603215L923163N729329P786102Q605443
9343C6935366N644046k50731n292222p161719o759685n443111m052642k907643
9335A0711659k054348j523494j124885r11343o88670n30300m74373l97618l15011
$$ plain form
9410 271986 271039 312844 319424 323687 296726 323519 365129 356084 387646 393512 352265 303138 346157
9397 346157 369596 320231 350175 341706 377488 408948 428718 469144 499699 512614 532004 550419
9385 550419 614829 650485 699605 713933 733178 715833 693030 697564 713595 749410 767106 779445
9373 779445 811196 868998 821299 798702 826906 884797 985953 1074498 1089739 1139002 1204967
9362 1204967 1294687 1446538 1548682 1699326 1911289 2071945 2275586 2571590 2967873 3462827
9352 3462827 4189348 5160985 6453822 8288114 10891329 14814492 20543821 28329923 36935366
9343 36935366 42579412 42328681 37036459 29874740 23115055 17671944 13619302 10711659
9335 10711659 8657311 7133817 6008932 5097589 4408919 3878619 3404246 3006628 2691617
9326B691617k59281k23839j31652j03353j18542j67777j11850j15698n6071o1663
9316A341891j21717j8491J0999j6364J2043N8687O730N1550M7052L975K9683P9110
9304A485148Q8273Q0957P2408O2045J4064J4324M4623Q91k0841m1990l8986Q513
9292A769429J342J5404Q3038O0486K4999J7304K4646L6786M5521J6724L2059K7779
9280B155517Q6322J18413R3407R8912P6159J78290J98605K10253K53201K91256
9270C760335L64262N51149O78513Q08274J062484J217020J576234J985430K266379
9261A4270080K290422K137689J918356J858165J770073J462416J214044J231482
9253B8152727J718960K671826M017614N514457O691711O958326O266386N026848
$$ plain form
9326 2691617 2432336 2208497 2076845 1973492 1854950 1687173 1575323 1459625 1403554 1341891
9316 1341891 1220174 1201683 1212682 1196318 1208361 1267048 1273778 1325328 1372380 1376355 1406038 1485148
9304 1485148 1573421 1654378 1726786 1788831 1802895 1817219 1861842 1862733 1841892 1799902 1760916 1769429
9292 1769429 1770771 1786175 1869213 1929699 1954698 1972002 1996648 2033434 2078955 2095679 2127738 2155517
9280 2155517 2241839 2360252 2453659 2552571 2628730 2807020 3005625 3215878 3469079 3760335
9270 3760335 4124597 4675746 5354259 6162533 7225017 8442037 10018271 12003701 14270080
9261 14270080 16560502 18698191 20616547 22474712 24244785 25707201 26921245 28152727
9253 28152727 29871687 32543513 36561127 42075584 48767295 55725621 61992007 67018855
9245F7018855L517722K055193Q24332l2169m20518n65393m81790J30047J552201
9236G3598480L519781N240443N938422N232454L277309O85698j879266l761647
9228I1851674m471056l838530j918559M36570K275392L102853L133861K800487
9220I3372692K007143N75444q94634j976073l066286m229355m877400m391201
9212G6520330k687089j93179J670779K096423J216009n60842k508270m320271
9204G1233890n716043o557125o518271n725159m567062l463573k381153j381762
9196C4923742n18014k99827o71413j317713j807018k078435k251155k369895k323906
9187B1286366k040814j526288r21394j64642O92302J582295K662022L563953M005844
$$ plain form
9245 67018855 70536577 72591770 73416102 73383933 72963415 72398022 71916232 72046279 73598480
9236 73598480 77118261 82358704 88297126 93529580 96806889 97492587 95613321 91851674
9228 91851674 87380618 83542088 81623529 82060099 84335491 87438344 90572205 93372692
9220 93372692 95379835 95955279 95060645 93084572 90018286 85788931 80911531 76520330
9212 76520330 73833241 73640062 75310841 77407264 78623273 78062431 75554161 71233890
9204 71233890 65517847 58960722 52442451 46717292 42150230 38686657 36305504 34923742
9196 34923742 34405728 34105901 33434488 32116775 30309757 28231322 25980167 23610272 21286366
9187 21286366 19245552 17719264 16797870 16633228 17325530 18907825 21569847 25133800 29139644
9178B9139644L756768L046598K326810J535958O99558K60336N82832J483604K633719
9169D5465827M000442N818994Q125469J0219710J1129173J0556702Q717330N958238
9161A09991885K572163q92692l427361l644968j462468K166016N309958O752143
9153A17364676O715660O143345N472540M221989K262533j26598k451151m649302
9145A34953692o264394o341404m246188o53001L012627N707969P018596O308966
9137A39496863L531173q60802n388888q122984q364512o286423l282021j036672
9129A09685734k63650k59163m17772k55371j74639o30214j970296m236357o953527
9120I4524745r133769r982785r274665p541961n411682l333901j948178j587030
$$ plain form
9178 29139644 32896412 35943010 38269820 39805778 40505336 40765672 41348504 42832108 45465827
9169 45465827 49466269 55285263 63410732 73630442 84759615 95316317 104033647 109991885
9161 109991885 112564048 111671356 108243995 104599027 103136559 105302575 110612533 117364676
9153 117364676 124080336 130223681 135696221 139918210 142180743 142054145 139602994 134953692
9145 134953692 128689298 122347894 118101706 117448705 120461332 126169301 133187897 139496863
9137 139496863 143028036 142167234 136778346 128655362 120290850 114004427 110722406 109685734
9129 109685734 109422084 109162921 108745149 108489778 108315139 107684925 105714629 101478272 94524745
9120 94524745 85390976 75408191 66133526 58591565 53179883 49845982 47897804 46310774
9112D6310774j990266k531125l012875l176762l182483l230799l120157k911193
9104B3155114k723000k526408k151314j853466j534648j229797r54482p42578
9096I439421o53425m71442m05134l55704l31225k51325l00239k86572k49007j67149
9086E968199j92066j67739j51785k44140k30751j58540j30658k18445k22538j64683
9076D086854j58469j58650j08701m6525n512J1620K2247R0359K4127J2982k7142
9065C743190q9710p3619J3943O3672P2342J26841J88505K08496R4822p9734j85697
9054D083051k20709k00223j62575r9942p8714p0107j29754j13585j24381j23834
9044B759227j07589m3693M3587N3906J2133L4369J0132J5514J23765R9430M8024
$$ plain form
9112 46310774 44320508 41789383 38776508 35599746 32417263 29186464 26066307 23155114
9104 23155114 20432114 17905706 15754392 13900926 12366278 11136481 10181999 9439421
9096 9439421 8785996 8314554 7909420 7553716 7222491 6971166 6670927 6384355 6135348 5968199
9086 5968199 5776133 5608394 5456609 5212469 4981718 4823178 4692520 4474075 4251537 4086854
9076 4086854 3928385 3769735 3661034 3614509 3608997 3620617 3642864 3733223 3757350 3770332 3743190
9065 3743190 3653480 3579861 3593804 3657476 3729818 3856659 4045164 4253660 4348482 4268748 4083051
9054 4083051 3862342 3662119 3499544 3399602 3320888 3250781 3121027 3007442 2883061 2759227
9044 2759227 2651638 2607945 2651532 2705438 2717571 2751940 2762072 2777586 2901351 3000781 3048805
9033C048805Q5712K18889K95975L22694K36776J19359J3178q3138j79665k36791
9023C841794k48707k49233k14127j33700j11362q4992j16842j44532p6767o3962
9013B397570q0237l9064J7294o9746k138k2179r2066r8875q5359j19748r4041
9002A711411q2033n067J2480M5384n6370r265n726k144K9705K2413M8369Q6528
8990A795685L9589P1459R0996J72133K12892K21028J65297N0689m5373j52610
8980B621785k34744k03577o4507m2388j3418M9646L4209R62l5387r1103j20449
8969A901029j20170j16236p8401o9668q1680m4705n4037K9796M8528k0609M2419
8958A436266R5357J40331P5552J19923Q4807j1209k9079r9213m936J1253N4178
$$ plain form
9033 3048805 3134517 3353406 3649381 3972075 4208851 4328210 4341388 4258250 4078585 3841794
9023 3841794 3593087 3343854 3129727 2996027 2884665 2799673 2682831 2538299 2461532 2397570
9013 2397570 2317333 2278269 2295563 2225817 2223679 2201500 2109434 2010559 1925200 1805452 1711411
9002 1711411 1629378 1624311 1636791 1682175 1625805 1616540 1610814 1608670 1638375 1660788 1709157 1795685
8990 1795685 1835274 1906733 1997729 2169862 2382754 2603782 2769079 2819768 2774395 2621785
8980 2621785 2387041 2183464 2118957 2076569 2063151 2112797 2147006 2147968 2112581 2021478 1901029
8969 1901029 1780859 1664623 1586222 1516554 1434874 1390169 1336132 1365928 1414456 1393847 1436266
8958 1436266 1531623 1671954 1747506 1867429 1952236 1941027 1911948 1812735 1807799 1819052 1873230
8947A873230O2436L1627M5679k9845l9065p2949r2157r5535j17410j47252p6936
8936A341823n1889l3444j16704q1526r695k223M0941M3558J502o4249k3696k3634
8924A020764J8124O0353l8062k6432J7010k5246l5727n1208K2428N5068L2844
8913A049916L5186M3871K4278k009L498O8358R0364L4168L5074M5442J39781J32730
8901A700657J01025J15403J33910J81606J66416M4334R6004J60116J67693L12758
8891C179922K44805K90745L02615L96685M72415N13769O97723R68838J392434
8882H459951K045021K853503L761721M783634N909162P352472Q561391Q550108
8874E2276963O720531L115322o13269l125643m439894n093596n409623n274823
$$ plain form
8947 1873230 1935666 1967293 2012972 1983127 1944062 1871113 1778956 1683421 1566011 1418759 1341823
8936 1341823 1289934 1256490 1139786 1058260 1048565 1046342 1087283 1130841 1132343 1068094 1044398 1020764
8924 1020764 1038888 1099241 1061179 1034747 1051757 1026511 990784 939576 962004 1017072 1049916
8913 1049916 1085102 1128973 1153251 1151242 1154740 1223098 1313462 1347630 1382704 1428146 1567927 1700657
8901 1700657 1801682 1917085 2050995 2232601 2399017 2443351 2539355 2699471 2867164 3179922
8891 3179922 3424727 3715472 4018087 4414772 4887187 5400956 6098679 7067517 8459951
8882 8459951 10504972 13358475 17120196 21903830 27812992 35165464 43726855 52276963
8874 52276963 58997494 62112816 61499547 58373904 53934010 48840414 43430791 38155968
8866C8155968m634925l899683l483309l163777k770164k176250j520462r66191
8858A5541207n01357Q4241M99359R16055J534284K478583L680385N091166O037509
8849C5361432O153465O099552N995881N200742L065507j90319l385050n174137
8841E3127073n586006n036829m214080l587288l260346l077663l159861l154757
8833B2050243l046922k694224k238018j720971j143497p30866n27740m35155m31035
8824I081815n20062m95195l34333j79927O3103K63174M57889O63466O60011N92894
8814A0252835O28641Q07421J057141J504670K228885L146840M312324N539248
8806B9478005O917427Q545303J0311463J1939997J2874071J2550511J0819595
$$ plain form
8866 38155968 33521043 29621360 26138051 22974274 20204110 18027860 16507398 15541207
8858 15541207 15039850 15124091 15623450 16539505 18073789 20552372 24232757 29323923 35361432
8849 35361432 41514897 47614449 53610330 58811072 61876579 61686260 58301210 53127073
8841 53127073 47541067 42504238 38290158 34702870 31442524 28364861 25205000 22050243
8833 22050243 19003321 16309097 14071079 12350108 11206611 10475745 9948005 9512850 9081815
8824 9081815 8561753 8066558 7732225 7552298 7615401 7878575 8336464 8999930 9659941 10252835
8814 10252835 10881476 11688897 12746038 14250708 16479593 19626433 23938757 29478005
8806 29478005 36395432 44940735 55252198 67192195 80066266 92616777 103436372
8799A03436372Q009216M071529q13024n275881p811750p938592o246534l916585
8791H3514751j702851j00493L15946q59324l113235n400911o766413o780359n802460
8782E3304651m479425l016406j337251P20879L146295N647989Q276052J0259315
8774G2522099J1290721J1212023J0059995Q293169N760796K008289k377551o293213
8766A12476328q589490q904325p731660n787839l804825k405928k223224l216672
8758F9812365m912919o609997p262835o875886n865303m918479m150247l477985
8750B5738714k910098k466309k143687j676138j299748r84182o11041m13385l27335
8741A2906791k23620o2715Q2426K57860O26118J100746J568295K139815K613073
$$ plain form
8799 103436372 111445588 115517117 114704093 109428212 101616462 93677870 87431336 83514751
8791 83514751 81811900 81711407 82027353 81168029 78054794 72653883 65887470 59107111 53304651
8782 53304651 48825226 45808820 44471569 45192448 48338743 53986732 62262784 72522099
8774 72522099 83812820 95024843 105084838 113378007 119138803 121147092 118769541 112476328
8766 112476328 103886838 94982513 87250853 81463014 77658189 75252261 73029037 69812365
8758 69812365 64899446 58289449 51026614 44150728 38285425 33366946 29216699 25738714
8750 25738714 22828616 20362307 18218620 16542482 15242734 14258552 13647511 13234126 12906791
8741 12906791 12683171 12620456 12702882 12960742 13586860 14687606 16255901 18395716 21008789
8732B1008789K965663L500130M231741N473171P057401Q388648Q419538O692908
8724F7737989L783881Q79357j074497j416376j74504J967760M102225N360938
8716H1166773N394151M086959J673109j171019l632183n713313p196490p890002
8708F6717985p659943o814124n551449m033919k274268k86996J790307L648731
8700D5536324N395847O896172P979920P727148N558303K033319j401061l418579
8692G6307393l645935k176118N15573L208831M490481M314489K727243L51290
8684H6093247k337105m890991p051399q475324q878015q435984p335289o299270
8676C2389870n389105m453904l527081k671190k041885j481040j053017q54638
$$ plain form
8732 21008789 23974452 27474582 31706323 37179494 44236895 52625543 61045081 67737989
8724 67737989 71521870 72401227 71326730 69910354 69735850 71703610 75805835 81166773
8716 81166773 86560924 90647883 92320992 91149973 87517790 81804477 74607987 66717985
8708 66717985 59058042 52243918 46692469 42658550 40384282 40097286 41887593 45536324
8700 45536324 50932171 57828343 65808263 73535411 79093714 81127033 79725972 76307393
8692 76307393 72661458 70485340 71000913 74209744 78700225 83014714 85741957 86093247
8684 86093247 83756142 78865151 71813752 63338428 54460413 46024429 38689140 32389870
8676 32389870 27000765 22546861 19019780 16348590 14306705 12825665 11772648 10918010
8668A0918010q00065p16019n86614n02329m86200m19471k77980j71810m7032J35943
8658G046433J53518J74134N5180N4817J46743M35733P07696J072218J553405J872317
8648A3272194K059835K105550J964230J859930J917204K352240L133067L859860
8640C2524110L822510K457317J42510k120607l628031m386957m423677l943426
8632B0443749l228446k435803j712808j107649p92105n09723l75989k64150m6570
8623I970506L05844P39057J179892J475669J808357K001122K376478K847080L137946
8614B5841951L281537L337347L460843K772114O86477k110803m319295n020977
8606B7929194m719600m150983l534189k834516k226105j681672j288972r04796
$$ plain form
8668 10918010 10117945 9401926 8815312 8312983 7826783 7407312 7129332 6957522 6910490 7046433
8658 7046433 7199951 7374085 7429265 7484082 7630825 8066558 8774254 9846472 11399877 13272194
8648 13272194 15332029 17437579 19401809 21261739 23178943 25531183 28664250 32524110
8640 32524110 36346620 38803937 38946447 36825840 33197809 28810852 24387175 20443749
8632 20443749 17215303 14779500 13066692 11959043 11166938 10657215 10281226 10017076 9970506
8623 9970506 10276350 11015407 12195299 13670968 15479325 17480447 19856925 22704005 25841951
8614 25841951 29123488 32460835 35921678 38693792 39380269 37269466 32950171 27929194
8606 27929194 23209594 19058611 15524422 12689906 10463801 8782129 7493157 6588361
8598F588361n94329m83368m08801l55169k87174k76789k52991j89545k45473k07019
8588C287703j47939j54259j42272r6141j18152j23142p5855o3019o630p9260o5524
8577B215510n8644n7378k3387k7657j09061k7675l8315k5223P936L0755k647K8873
8565A913087M5672K843P719N2993M0257J41946J17769J92376J89207K94043L68487
8554C366399M39207M47878M25037L53995K51990J90412K9106j15873k87229m49628
8544D651294n02918m66863m72619l68422k95946k71121j85186j51861m1406p6927
8534A818025j32103n1894k9452o4524o6020J3259j7406k3246J7687K3950k8202
8523A460074k6325O61k3682k7312N2350l1336j0310l1615J9502L2343j8139j3631
$$ plain form
8598 6588361 5994032 5510664 5101863 4746694 4459520 4182731 3929740 3740195 3494722 3287703
8588 3287703 3139764 2985505 2843233 2747092 2628940 2505798 2429943 2366924 2360294 2281034 2215510
8577 2215510 2156866 2099488 2076101 2048444 1939383 1911708 1873393 1848170 1856106 1886861 1884214 1913087
8565 1913087 1958759 1961602 1969321 2022314 2062571 2204517 2322286 2514662 2703869 2997912 3366399
8554 3366399 3805606 4253484 4678521 5032516 5284506 5474918 5504024 5388151 5100922 4651294
8544 4651294 4148376 3681513 3208894 2840472 2544526 2273405 2088219 1936358 1894952 1818025
8534 1818025 1685922 1634028 1604576 1540052 1474032 1487291 1469885 1446639 1464326 1488276 1460074
8523 1460074 1433749 1434410 1410728 1383416 1435766 1404430 1394120 1362505 1382007 1414350 1396211 1382580
8511A382580M0185N0453Q3898O1376J35610K07513K68822L87434M52644M99441
8501C569956M97290O14692O46703L68632L3823j41438m11015n84561o22779o01170
8491C370133n45426l77113k88434k62680j60945j60324j28811j5724L4272l1617
8481A433331p615M2076J11507N6093K0860J9317m2226L0197j4398l1964J5624
8470A632802N9965k457m2282k0420k1519m5725J5941M595L5043N4650N4673k8999
8458A696267m5068M1331P1113P6478O161j08265j76173j41214q6257m7324q3439
8447A203610n8403m8935M302M8657M1866J37500Q3400N9005O0m3881j01924n3578
8435A271679m0674P351L5453m350l7321J7417O28j8316m0982n3598j7199K9583
$$ plain form
8511 1382580 1422765 1473218 1557116 1618492 1754102 1961615 2230437 2617871 3070515 3569956
8501 3569956 4067246 4681938 5328641 5697273 5731096 5589658 5178643 4594082 3971303 3370133
8491 3370133 2824707 2447594 2159160 1896480 1735535 1575211 1446400 1430676 1464948 1433331
8481 1433331 1425716 1467792 1579299 1635392 1656252 1675569 1633343 1663540 1649142 1617178 1632802
8470 1632802 1692767 1690310 1648028 1627608 1606089 1560364 1576305 1580900 1615943 1670593 1725266 1696267
8458 1696267 1651199 1692530 1763643 1840121 1846282 1738017 1561844 1420630 1334373 1287049 1203610
8447 1203610 1145207 1096272 1100574 1149231 1191097 1328597 1411997 1471002 1471062 1427181 1325257 1271679
8435 1271679 1231005 1238356 1273809 1269459 1232138 1249555 1250183 1231867 1190885 1137287 1120088 1149671
8423A149671J0004k8921K5746N0792N2716J34900J13326J33907N4616p8386j51180
8412A467191j52270j27406p7459r0414r1542n3713N5911J5035M3724O4332K2893
8401A076282P6843J06046J53502J06966R4547K4987O3349L2312j6710m3471o0684
8390A613969p9166l2193n7839l4219M1790Q8017J7404P315o8161p5552r3387j48644
8378A179334j41710p6954r5879m1580L2820O5221J0250j2470M2388P6920N8254
8367A096594O3733J02694J07401l8563j03636q4013p1271k2395m8001Q286J2196
8356A023025n3643l8263L4234L9445l4441q8633o5734n6551l3267n7996J0005
8345F78181N0755j5957l7475k1801j6173j9769O4935P1780J6095n479k9310l3198
$$ plain form
8423 1149671 1159675 1130754 1156500 1207292 1260008 1394908 1508234 1642141 1696757 1618371 1467191
8412 1467191 1314921 1187515 1110056 1019642 928100 874387 930298 945333 989057 1053389 1076282
8401 1076282 1153125 1259171 1412673 1519639 1614186 1639173 1702522 1734834 1718124 1674653 1613969
8390 1613969 1534803 1502610 1444771 1410552 1452342 1540359 1557763 1565078 1496917 1421365 1327978 1179334
8378 1179334 1037624 960670 864791 823211 856031 921252 931502 919032 961420 1038340 1096594
8367 1096594 1160327 1263021 1370422 1331859 1228223 1144210 1072939 1050544 1002543 1010829 1023025
8356 1023025 969382 931119 965353 1004798 970357 881724 815990 759439 726172 668176 678181
8345 678181 728936 712979 675504 653703 637530 617761 682696 754476 770571 765092 735782 702584
8333G02584j3541J8971L0924k529l7356l0794L9597L2579J5122J4452N8608Q7176
8321I15793R0540K4352O3743m7233n5468K1934J7661l491J2184O5884K6008o3691
8309A068216o2054j05020q5804q6251j08939k4103k6170j5489k4719j2719K4330
8298E41278K0599M9683O8034J62P0799Q2345L4095O291j5776L4882K0745p8870
8286H34267l8417J13661L5349N2432J6628l7606k8305q8862o3454j08909q3306
8275F03478j2035r927k9593n1744L0101J0861m726K2646j8332j3545j2327o646
8263E08211O812l2623m9344l7731k613P141k3789K6403K65l3720P190J5653J0077
8250D01932j9200n7230K5099P3505n884q655m241Q06N3089K2376L9862N6975J6935
$$ plain form
8333 702584 689043 708014 738938 736409 699053 668259 707856 740435 755557 770009 828617 915793
8321 915793 1006333 1030685 1094428 1047195 991727 1013661 1031322 1027831 1040015 1105899 1131907 1068216
8309 1068216 1006162 901142 815338 729087 620148 596045 569875 554386 529667 516948 541278
8298 541278 561877 611560 679594 679756 750555 832900 866995 873286 857510 892392 913137 834267
8286 834267 795850 909511 944860 997292 1013920 976314 948009 859147 795693 686784 603478
8275 603478 591443 581516 551923 500179 530280 541141 536415 559061 540729 527184 514857 508211
8263 508211 515023 482400 433056 395325 392712 399853 376064 402467 402732 369012 376202 391855 401932
8250 401932 382732 325502 350601 424106 418222 409567 405326 406132 459221 481597 521459 578434 595369
8237E95369N2215K1620j8792r5321q2847n3709K9186J5154k8317q768q135k443
8225D15212L744j8682k7411L0436K561j9224j0373J5079n3222J8939J6114N5411
8213D28584K7237J3716M9966O2048K0758k5479n0559j5326l3108l7584j15317
8202C24936J7116M2260K3923k5970j1354N5400m9399j9745O978L6557M8956j5413
8190D34245m3770r5171K48N6013Q319N1416p880p3747k5333j1425l7996l0843
8178B24076N9825L2560M6247N8157l6493K424k8566j4699k4787j9777M0715J3109
8166C52791J279k4046j9831j0705l565r558K1131R7338j5469k9587l7943l2020
8154B89815P505j2779k7618n3475j320L1558N2272N0626Q9k3362J7257J1686L9729
$$ plain form
8237 595369 647584 669204 650412 555091 472244 418535 447721 462875 434558 425790 417655 415212
8225 415212 418956 400274 372863 403299 405860 386636 376263 391342 338120 357059 373173 428584
8213 428584 455821 469537 519503 581551 602309 576830 526271 510945 477837 440253 324936
8202 324936 342052 384312 408235 382265 370911 426311 376912 357167 364145 400702 449658 434245
8190 434245 390475 295304 295552 351565 359884 411300 403420 329673 304340 292915 254919 224076
8178 224076 283901 316461 362708 420865 384372 386796 358230 343531 318744 298967 339682 352791
8166 352791 354070 330024 310193 299488 295923 286365 307496 404834 389365 359778 321835 289815
8154 289815 297320 284541 256923 203448 202128 233686 285958 336584 336673 313311 330568 342254 381983
8141C81983k468k3473o1962J5209J1927o587M0405J220p8066p3788O9003J6757
8129B90160n4437n426J1972j7729J8712L2945K8639L9233k371P96K5552M095j0862
8116C61279m65K4061P6308k5732j8884P60j1368k4960Q575l4911K1238K6884l2868
8103C69917j2491j5649m5247L9728L1313m5668m5945N022m3186m9915l0080K7791
8091A85590L8455k7444P556J6557O2792N607O847M540k321k1628K8462N3341o069
8078C52285j871K8005q7528R637P0708N7522J8678J2485j1472p56K8563l9701
8066D36555k8700j8683O838m2596N32m349L4024j5081J0472M4852J1610M1911
8054D77385M3229o2407m378j161j5401q0153p1750j3237M1389M9540l4937j4164
$$ plain form
8141 381983 379515 356042 294080 309289 321216 314629 355034 356254 278188 204400 273403 290160
8129 290160 235723 230297 242269 224540 243252 276197 304836 344069 341698 342494 368046 372141 361279
8116 361279 360814 384875 461183 435451 416567 417327 405959 380999 389574 354663 375901 402785 369917
8103 369917 357426 341777 296530 336258 367571 321903 275958 280980 237794 187879 157799 185590
8091 185590 224045 196601 204157 220714 283506 289113 295960 300500 298179 276551 305013 358354 352285
8078 352285 350414 378419 290891 300528 371236 428758 447436 459921 448449 447693 476256 436555
8066 436555 407855 389172 396010 353414 353946 349597 383621 368540 379012 423864 435474 477385
8054 477385 520614 458207 453829 452668 437267 357114 285364 272127 313516 363056 328119 313955
8042C13955L7769K5756k4287r853N0576O260l80j7594K6841K0474j6648j2107
8030D00762k084L9860M3805K9840m4517j6377J1175L8989k8990K3416M615m6616
8018D53878l576j6106n4339M108J9573M2646L271N3235O1041O3508J04690O1721
8006G93650O778r1215j13989m2418l2875m3544m6259j01365p8086P707L6609K7727
7994C22720k2389m648n695K4177J0731j0375k9699j5882K8965M6899M5568L8081
7982D28453K570J2502n6234l5063j1857J539R851j040j6543L4675K8114K3334
7970D20301j2261n4635j9209J4548r951K5987M0320K9302J5595j5332J6050K7742
7958D78457O576k0601n3873J1296l6811p8659o6962L973P2331P2586q172m9584
$$ plain form
8042 313955 351724 377480 353193 343340 393916 400176 399796 382202 409043 429517 412869 400762
8030 400762 398678 438538 482343 512183 467666 451289 462464 501453 472463 495879 500494 453878
8018 453878 450302 434196 379857 383965 403538 446184 449455 502690 563731 627239 731929 793650
8006 793650 800428 709213 595224 552806 519931 476387 430128 328763 250677 258384 294993 322720
7994 322720 300331 295683 289988 314165 324896 314521 284822 268940 297905 344804 390372 428453
7982 428453 431023 443525 387291 352228 340371 341910 351761 350721 334178 368853 396967 420301
7970 420301 408040 353405 334196 348744 338793 364780 405100 434402 449997 434665 450715 478457
7958 478457 485033 464432 410559 421855 385044 306385 239423 243396 315727 388313 380141 330557
7946C30557m1235j0979M4010r101n8661l0345K9065L9308K7285l1266N568k1690
7934B72516l540K0938R601L6339j9074j9404k6m9923p1405N901L9702l3979l8504
7921A49142K9955q226P342M1713K6718K0445J9723K5918m7208k7847R485o8j546
7908B45546K8813J5777K526m7894j6184J8840j5150l8664k170L356O9454N0078
7896C14328K49l0041K3850l4462l0221O334P641L6277n1557o4138k9472L8635
7884A87423O836K1103l3705M21j667o565L1751J8174J7601M580l1215k2154J9987
7871B12570O2946j2665J518n9264o1022l0185j725J2465k2770m598L2441M5972
7859A75683J4818k0150j2035J4198K5280m648n7084K3738K7328j9352R835l2590
$$ plain form
7946 330557 289322 278343 322353 313252 254591 224246 253311 292619 319904 288638 294206 272516
7934 272516 268976 289914 299515 335854 316780 297376 297350 247427 176022 181923 221625 187646 149142
7921 149142 179097 170871 178213 219926 246644 267089 286812 312730 265522 237675 247160 247092 245546
7908 245546 274359 290136 292662 244768 228584 247424 232274 193610 191440 194796 264250 314328
7896 314328 314577 284536 308386 273924 243703 250037 257678 293955 242398 178260 148788 187423
7884 187423 194259 215362 181657 182078 180411 173846 205597 223771 241372 245952 214737 192583 212570
7871 212570 275516 262851 264369 205105 144083 113898 112173 124638 101868 97270 129711 175683
7859 175683 190501 170351 158316 172514 197794 193146 136062 159800 187128 167776 177611 145021
7847A45021l1967K8540L8622J4766K8834l9189j1230M3814N7049M2283o584m1877
7835B68082n0410k4088j8616p4396L2416L4640J4873L995j1256j0426M7493M0257
7823B52564k7291N306K4331p8127m0036J5356J9074P949k551k5074n2776K9873
7811A28598M0764n942J2158L05M7781N5415j7123j2946k8721m3658l7956j2261
7799A26414K9014M7234k0630l7964k6493L6774J91k5752K3458K0808p0140k0433
7787H2481J9593M8683O1329o894n7007k0349J9177j4232R176O842l1804K5682
7775A42677l2826k905L7154J7601Q452M716L4356j9402r068l972L2437l634J3264
7762B18850N511m7547K861J3366J8616N6013j8358k8144l6658k074L4192J0282
$$ plain form
7847 145021 113054 141594 180216 194982 223816 184627 173397 217211 274260 316543 309959 268082
7835 268082 217672 193584 174968 100572 132988 167628 182501 186496 175240 164814 212307 252564
7823 252564 225273 230579 254910 176783 136747 152103 171177 179126 176575 151501 98725 128598
7811 128598 169362 163420 175578 175883 223664 279079 261956 249010 220289 176631 138675 126414
7799 126414 155428 202662 182032 144068 117575 154349 154540 128788 152246 173054 102914 82481
7787 82481 102074 150757 212086 205192 148185 127836 147013 132781 141957 148799 116995 142677
7775 142677 109851 106946 144100 161701 170153 174869 209225 189823 180755 176783 209220 205586 218850
7762 218850 224361 176814 179675 193041 211657 267670 249312 221168 184510 182436 216628 226910
7750B26910Q613j5219n0929k7720L9092j8659l1651L840J4127k867L0841o834
7738A69544M3555l8908J5679P763j753J353m924k5287k803l5123q011L9418r754
7725A50749k1194M5642j0984m4913M6685O7761j490k4019k7053j7564k6383P8234
7713B15471M4771k9865P353l8906l0938o697j4736N3331K4115k2653j7726N657
7701A89177N3497m7321r7098M516J4396j6988K3M7621k3637P591j6147j4684O761
7688A07707K4110K4092N6341j3869j7406k423m565k8118j0618J3689k4906l6793
7676H7241J9558K699m2473J1475M307l1705k3557R756K9659L3871L2430J02813
7664B36074N4480l1873j9301k1823m118k1663k917k8561j4032J9049J5091n5386
$$ plain form
7750 226910 235523 220304 169375 141655 180747 162088 130437 134277 148404 145537 176378 169544
7738 169544 213099 174191 189870 197633 195880 197233 192309 167022 164219 129096 121085 160503 150749
7725 150749 129555 175197 164213 119300 165985 233746 232256 208237 181184 163620 137237 215471
7713 215471 260242 230377 237730 198824 167886 161189 146453 199784 223899 201246 183520 189177
7701 189177 242674 195353 98255 102771 117167 100179 100202 147823 124186 131777 115630 100946 107707
7688 107707 131817 155909 212250 198381 180975 178552 173987 145869 135251 148940 124034 87241
7676 87241 106799 109498 67025 78500 82807 51102 27545 37301 66960 100831 133261 236074
7664 236074 290554 258681 239380 217557 213439 191776 188859 160298 146266 165315 180406 125020
7652A25020p2190L7154K5977P909j6381J8996L6165J9763k0204m6482k1166K0741
7640A15302J7170M8769l3393K1309j4219N9961K285q977k5827k0973k9461q403
7628A23543J7943L2398J6307k403K3211o0161m4637J4067M54L6023J2187L8981
7616B07913k2818j02050o121K8004P731P907j1925K9942K5760o449K8427Q770
7604A95091N992P744l3215J8224j1826j0375n8442j5440l4036L1987j2859P53
7592H3598Q2791k0748J0896L3312m5836l0586l5695m182K2891M4277K6282l3321
7580A33679K296J3109j1100j135l0624L4531M6734N531r377l2888J6402K7653
7568A94811l4996Q984J1403k1504j249k4789m645j96J1993K8897N4763p792l4798
$$ plain form
7652 125020 52830 89984 115961 123870 107489 126485 162650 182413 162209 115727 94561 115302
7640 115302 132472 181241 147848 169157 154938 214899 217184 208207 182380 161407 131946 123543
7628 123543 141486 173884 190191 187788 210999 150838 106201 120268 120722 156745 168932 207913
7616 207913 185095 83045 76924 104928 112659 120566 108641 138583 164343 157894 186321 195091
7604 195091 201083 208827 175612 193836 182010 171635 113193 97753 63717 95704 82845 83598
7592 83598 166389 145641 156537 189849 144013 113427 77732 73550 96441 140718 167000 133679
7580 133679 135975 149084 137984 136849 106225 140756 187490 193021 183644 150756 167158 194811
7568 194811 159815 168799 180202 158698 157449 132660 128015 127819 139812 168709 223472 215680 180882
7555A80882k0393j9902l4450M830j5934o0062M3997N8135L0546j4531R742J5790
7543A78650M7824K9332k5693r9412n2103L0942N5939P114L6009n0186k4070l0751
7531A03595j4614p510j7828N557L4736r042J4798k8946J7217K5922L4660J995
7519A60540l2401n2125J9346K1099r761m6865k8362J6770M7645M0789L788L8674
7507A79137L9946j8459M138P559j4239J8099J6979l2081m4023m5497O41j3064
7495I9136L2578Q6135K6032o3123n7094m8063L6213k4829m4028N157p376K1173
7483F1911P8968M287k3521q648K5295k1378j6344o2181J5453O048J6476j0650
7471F5716P0312K7735o406k2113m0936o4599J8010Q7041j1648k0607L7996K4529
$$ plain form
7555 180882 160489 140587 106137 110967 95033 34971 78968 137103 167649 153118 162860 178650
7543 178650 226474 255806 230113 130701 78598 109540 165479 172593 208602 158416 134346 103595
7531 103595 88981 81471 63643 69200 103936 94894 109692 80746 97963 123885 158545 160540
7519 160540 128139 76014 95360 116459 106698 59833 31471 48241 95886 136675 140463 179137
7507 179137 219083 200624 204762 212321 198082 216181 233160 201079 157056 111559 112200 99136
7495 99136 131714 217849 243881 180758 123664 75601 111814 86985 42957 48114 40738 61911
7483 61911 140879 145166 121645 112997 138292 116914 100570 38389 53842 59890 76366 65716
7471 65716 136028 163763 157357 135244 94308 29709 47719 134760 123112 102505 140501 165030
7459A65030K3442j6116m8036L4090O60l6370l0582K7381J4353k5607j8009M5866
7447A36102K6677k0767l6475J8134m4426L1499P385K3284L6909L034l6093j6514
7435A28749k5039l6361n4179m5076J8099P3046J2605k1895K38K3790O1255M3167
7423A78399K7246k6668r0534l958J2253J9881P128J0943N912K7211j4778k6452
7411A26583N154L7433j0871n0149m6818j0958K5535j36l8336J8241k180N611J3060
7398G2169K2344N693l9716m4014n0960K8216K8411L2510K3443l5941P930K6972
7386G7057O798K1387J5635k119L0224n5779l0530J6158l925K1666R088n170k4524
7373G5966L2981K3802o1415m8438k2478J9765L0770M1209k9069m529n219p350
$$ plain form
7459 165030 188472 172356 124320 158410 159070 122700 92118 119499 133852 108245 90236 136102
7447 136102 162779 142012 105537 123671 79245 110744 118129 141413 178322 181356 145263 128749
7435 128749 103710 67349 13170 -31906 -13807 59239 71844 49949 50187 73977 135232 178399
7423 178399 205645 178977 88443 84485 96738 116619 123747 134690 140602 167813 153035 126583
7411 126583 131737 169170 158299 108150 61332 50374 75909 75773 37437 55678 53498 59109 72169
7398 72169 94513 100206 60490 16476 -34484 -6268 22143 54653 78096 42155 50085 77057
7386 77057 83855 105242 120877 118758 148982 93203 62673 78831 74906 96572 105660 100490 75966
7373 75966 108947 132749 71334 22896 418 20183 50953 92162 63093 58564 53345 45995
7361D5995J7916j9688l0511J3500K9200M2080M3852Q814k8617l1224J7292k2086
7349H6523L098p51N999l2303k3169l1334M3718M5811m165L863O275K51M134l0407
7335G7543k7330k590k8900J0943q158m6858Q121p7283M6238N9539K4925O7026
7323A03216K7922K0982j6721k4190j6202J2364j4933P727r492j5306k8035J0236
7311E7568Q582J4983N3601L5091k5095J5542N2234r127k6610j7336m3669L2955
7299A48719R5M9679M6993j9107n1247n4353J6287j0111q247j9804k9916k0640
7287D8348K3462L9219K6409j1985k1484j9849j9499L612Q369K837M413K1080M3386
7274A48318l332m6561q0464j8591P047p453j0075L1801N3028P8723k2965n4597
$$ plain form
7361 45995 63911 44223 13712 27212 56412 98492 142344 151158 122541 91317 108609 86523
7349 86523 89621 88870 94869 62566 39397 8063 51781 97592 93427 97290 103565 103816 107950 77543
7335 77543 50213 47623 18723 29666 21508 -25350 -17229 -94512 -48274 11265 36190 103216
7323 103216 131138 152120 135399 111209 95007 107371 92438 100165 90673 75367 47332 57568
7311 57568 66150 81133 134734 169825 144730 160272 212506 203379 176769 159433 115764 148719
7299 148719 148814 198493 245486 226379 175132 120779 137066 126955 118708 98904 68988 48348
7287 48348 71810 111029 137438 125453 103969 84120 64621 68233 76602 79439 83852 104932 148318
7274 148318 144986 98425 17961 -630 6417 -1036 -11111 20690 73718 152441 129476 74879
7262G4879m6445j4329J0491O584l0933m9157j075O2976J8749k0127P5786L1159
7250A18558J0993K9775l1015J3355j6246l019J8806L6200L6907k1932m5131J8994
7238A66245l3602l7058K1786Q122l6430m5356j2273J7194K4038M6930O0155k4965
7226A54786k7864k5895m9047o618M1372J7715k1475j9196k1274J4337K3037J1819
7214I1697q084m2530P208o226L9877P888o8210O4801L2396m173n0277j8159J3546
7201E9754J6074O5974L0664k1549Q612J3832p3607k1324J424J4320L4535m7977
7189H0732j5327K3058J1550m888k7898N1380L2309m478l2776l2749l6305J8159
7177F2767o806n750M644K7662j5702K2629j4997J158r61l9633k2498o296L3616
$$ plain form
7262 74879 28434 14105 24596 31180 247 -48910 -49985 12991 31740 11613 87399 118558
7250 118558 129551 159326 128311 141666 125420 122401 141207 177407 214314 192382 147251 166245
7238 166245 132643 95585 117371 125493 89063 43707 31434 48628 72666 119596 179751 154786
7226 154786 126922 101027 51980 45362 86734 104449 82974 63778 42504 56841 79878 91697
7214 91697 83613 41083 48291 42065 81942 89830 21620 86421 118817 114644 64367 46208 59754
7201 59754 75828 141802 172466 150917 159529 173361 99754 78430 79854 94174 128709 80732
7189 80732 65405 88463 100013 95125 67227 118607 150916 146438 113662 80913 44608 62767
7177 62767 55961 50211 54855 82517 66815 89444 74447 75605 74644 35011 12513 6217 39833
7164C9833M0251J3439q445R19k1890Q7356n908J8911n622l7007m2616m3928j424
7151C3869m1577J6444M1226N1398M6882m4806K0663j6886k7540j7935q317J8347
7139G1768J5871K6927O525j7330J3763j9211O695m3497m0152K1363N6258O538
7127A05518m0212j3358J4295P181L240L1502k5084n0565n6996j9772M8604j9203
7115a4850l5052J7513K0084P555K8133M6081J5805M513O39j8071q927j6286k387
7102D4750P533m806l538l5708L2173K173N081j0966k2464k0184k0243K1213O38
7089d348Q61K3383j8886O9283K9913m4426L3682p175k4960o6564K287L3034N54
7076B6638J4633L0991K7747J8523L2657K2328l5353l8372j935K1744P451k9969
$$ plain form
7164 39833 80084 93523 85078 85997 64107 151463 145555 164466 158844 121837 79221 35293 33869
7151 33869 -7708 8736 49962 101360 148242 103436 124099 107213 79673 61738 53421 71768
7139 71768 87639 114566 121091 103761 117524 98313 105008 61511 21359 42722 98980 105518
7127 105518 65306 51948 66243 73424 76664 108166 83082 32517 -24479 -44251 4353 -14850
7115 -14850 -49902 -32389 -12305 -4750 23383 69464 85269 89782 90421 72350 63423 47137 44750
7102 44750 52283 47477 43939 8231 40404 42577 47658 36692 14228 -5956 -26199 -4986 -4348
7089 -4348 -3487 19896 1010 70293 100206 55780 89462 82287 57327 -9237 -6950 26084 26638
7076 26638 41271 72262 100009 118532 151189 173517 138164 99792 97857 119601 127052 97083
7064I7083k3814M2092R021k3085j60L8063J8319m6186j7668m2514j860m6068n4992
7051e1769R181k7683M2703L3359L2919K3476K3091n2968p3330K8332K1907l4089
7039b4871J1754M0844K056J0115P5284J1536k8415o9775l987L5897j7119K8541
7027G1860J0917L428o8311o3764J5383O7316K2821R460j0693p814j0818P4998
7015A14783Q264m1281m4606l5394O787M2796J6170j1254M7280J015k6853j0796
7003F6911j1331j5169j5900k1666P798L8996M626j2573M785P2712k9407q7748
6991B034L6583Q1863k468n3255j1133J8543j4756j1978m3622l1719k0414K2375
6979b7947O9920P090j4810k6562M548l144j6583K3430m9580k9066N0705J3323
$$ plain form
7064 97083 73269 115361 124382 101297 101137 139200 157519 111333 93665 51151 49291 3223 -51769
7051 -51769 -42588 -70271 -27568 5791 38710 62186 85277 32309 -41021 -12689 9218 -24871
7039 -24871 -13117 27727 29783 39898 115182 126718 98303 28528 24541 60438 43319 71860
7027 71860 82777 86205 17894 -45870 -30487 36829 59650 69110 58417 50603 39785 114783
7015 114783 123047 81766 37160 1766 8553 51349 67519 56265 103545 104560 77707 66911
7003 66911 55580 40411 24511 2845 10643 49639 54265 41692 46477 119189 89782 2034
6991 2034 38617 120480 118012 64757 53624 72167 57411 45433 1811 -29908 -50322 -27947
6979 -27947 41973 49063 34253 7691 12239 9095 -7488 15942 -33638 -62704 -11999 1324
6967A324J4027J0461L5080L9908j9535N299k8581J039q360l880N777J644l444
6954E0759j2333m930L622l696l130j490K5826k181P525K1965J3001k0377k7429
6941D7132q018j3936r034L4615J8169K8728L0623m0831n6766n084L7578p162l3809
6928B2205M7066J5011k3862P812N2433J3025n0738j2765J9637n0237L261j5830
6916B7018n84L2460N5213N6836j8703n9199p275R175M4070N8439o4283l1337L7468
6903A39298j0554k202m9020K7094R875j3577J5739j6510K0208J680n3396m7527
6891B1108j0628J9904M9098N0289N2930J4603k1467o8764l3205r861J7168m1221
6879C9954n0846J5379L8593L1523J4926K1561r086K1302K1132K9709j5746o9621
$$ plain form
6967 1324 15351 25812 60892 100800 81265 86564 57983 59022 50662 46782 52559 54203 50759
6954 50759 38426 33496 37118 33422 30292 28802 54628 52447 59972 81937 94938 74561 47132
6941 47132 39114 25178 16144 50759 68928 97656 128279 87448 30682 25598 63176 56014 22205
6928 22205 69271 84282 60420 68232 120665 133690 82952 70187 89824 39587 42848 27018
6916 27018 26434 58894 114107 170943 152240 93041 85766 94941 139011 197450 133167 101830 139298
6903 139298 128744 126542 77522 104616 114491 100914 116653 100143 120351 122031 68635 21108
6891 21108 10480 30384 79482 129771 182701 197304 175837 107073 73868 64007 81175 39954
6879 39954 -10892 4487 43080 74603 89529 111090 102004 123306 144438 174147 158401 88780
6867H8780N526J730r796j5411N1972j6141m2470L1159L4567o0088n9674P131J1767
6854B9052K392J4719j5621l9352J1275N5704k1095j0543q598L744K9926M2283
6842I3886K1897k2738j4046j5775j9266K8068L6412M1680m811j6049p6169o4189
6830a1100K3356K9907K6706r587l0257o6340l1185M6086K2396K3290k5406o837
6818h971J5588O9743J0454K9092l8802J3409P0266O1392O7503n520k8996j7437
6806B37721q1189K268r140j3695k1530k8626K9328K5393o940j6226K4874k5718
6794A16520j4734L9534o2877m3576n0398K2179N4324L790k0686k3664K01L3006
6782E3619K0064l1595P914r6400K225O0960N854l1611m7686M7474L6696J4109
$$ plain form
6867 88780 94306 96036 86240 70829 122801 106660 64190 95349 129916 69828 10154 17285 29052
6854 29052 31444 46163 30542 -8810 2465 58169 37074 26531 17933 21677 51603 93886
6842 93886 115783 93045 78999 63224 43958 72026 108438 150118 145307 129258 53089 -11100
6830 -11100 12256 42163 68869 59282 29025 -37315 -68500 -22414 -18 23272 -2134 -8971
6818 -8971 6617 76360 86814 115906 77104 90513 160779 222171 289674 284154 255158 237721
6806 237721 156532 158800 149660 135965 114435 85809 115137 140530 133590 117364 142238 116520
6794 116520 101786 141320 78443 34867 -15531 6648 60972 64762 44076 20412 20613 53619
6782 53619 73683 42088 50002 -46398 -44173 16787 22641 -8970 -56656 -9182 27514 41623
6770D1623R035L9070m8807k9228j4925M3509R008k1756k3742L7378R4553K9888
6758A65606p7542p3939M032J4405N1030l731K7474K0268J1791k882K0138q7763
6746F8887n0593O059L583M6719k9000P578K5324N1080K0331p4742o0872m7024
6734c2670M2930Q6061M3798k216j593k1241k4372L942o330J7804N193n8311j37
6721E2858l4798j5522N1566K3601k0889N3918L8067J2814n0958o5741K3752Q1587
6709A50255O4470r984L0105j4062j6281O416M1799l1254r1304l6302M4804N531
6697A44193l4707n1623l0552K3104L6555J0471j0779j3311j5097L1626N6992k9575
6685A17297k4084J605k5313k8695j943J7093k4481J9878q0023k6739M9816L4927
$$ plain form
6770 41623 50658 89728 40921 11693 -3232 40277 49285 27529 3787 41165 135718 165606
6758 165606 88064 14125 18157 32562 83592 79861 107335 127603 139394 136512 156650 68887
6746 68887 18294 24353 27936 74655 45655 53233 78557 129637 149968 75226 14354 -32670
6734 -32670 10260 96321 140119 137903 136310 115069 90697 94639 88309 106113 111306 52995 52858
6721 52858 18060 2538 54104 77705 56816 110734 148801 161615 110657 44916 68668 150255
6709 150255 214725 204741 234846 220784 204503 210919 252718 221464 130160 93858 138662 144193
6697 144193 109486 57863 27311 50415 86970 97441 86662 73351 58254 89880 146872 117297
6685 117297 93213 94818 69505 40810 38867 55960 31479 51357 -28666 -55405 -5589 29338
6673B9338l3132l1693M6393K8098l9127R56K3685j1247j1400j8463K4563o535
6661A436M2163L2590J8849k8708k49M2520j4187p126r34L4276N8443j8359o496
6648A54218m677k7279L013j4881m5634J9742M1036K2450n0503k4559k8581j7037
6636B7308L9223K1724K6598P782q9956P39k2158j8341j467L732Q448L1994P708
6623D3334m5574n7155J00362K2209n0188k0601J2211O137L4117J4329l5659L2208
6611E5730J9763R654m7305n7407j4785l636N2920P789J8263p109j8103L9658n733
6598D9699N932l286J318p676j6562K9048R945m5781L0445j2778m170L4790M1047
6585A11971n3214o8136L6694J772j454k5314K9065k9214L5255Q890J0582l0936
$$ plain form
6673 29338 -3794 -35487 10906 39004 -123 833 24518 13271 1871 -16592 7971 1436
6661 1436 43599 76189 95038 66330 66081 108601 94414 87288 86354 120630 179073 160714 154218
6648 154218 149541 122262 125275 110394 64760 84502 125538 147988 97485 72926 44345 27308
6636 27308 66531 88255 114853 122635 32679 33418 11260 -7081 -8548 -4816 3632 35626 43334
6623 43334 -2240 -59395 40967 63176 12988 -7613 4598 10735 44852 59181 23522 55730
6611 55730 75493 85147 37842 -19565 -34350 -37986 14934 22723 40986 33877 15774 55432 49699
6598 49699 55631 52345 53663 45987 29425 58473 68418 22637 53082 40304 36134 70924 111971
6585 111971 58757 -9379 27315 29087 27633 2319 31384 2170 37425 46315 56897 25961
6573B5961j7908K3321J9893m3568N867K9430K7637J742l7881J7129M6354M7465
6561A45442M531k5603l7342M1358l4001J085K8013J3619j8203l6834p5731k1990
6549a5656M3052M6589L639k0n8073p3750R262O9181J5256P33j676k2057J5682
6536C2162q344J7292n7309p1064j4348M9670l8537L2540Q5376M4210m7065j0431
6524A4152P864j7745L4097M258l5179k2546J9768P124L194L4819n561j8762k0575
6511D908L3955j5854k1083m4716O3618K6132o7230l5676J8728O5855L9004j9790
6499D7851o7113k426m096N7424N5508R069l0923j9338p22L5949q1268N5680L0415
6486H6010k7839k2058l3482M6967n362k2840n5431L48M2033J7978J9262j9544
$$ plain form
6573 25961 8053 31374 51267 7699 13566 42996 70633 72375 34494 51623 97977 145442
6561 145442 149973 124370 87028 128386 94385 95470 123483 137102 118899 82065 6334 -15656
6549 -15656 27396 73985 77624 77604 19531 -54219 -44957 24224 39480 40213 38537 16480 32162
6536 32162 23818 41110 -16199 -87263 -101611 -51941 -90478 -57938 27438 71648 24583 14152
6524 14152 22016 4271 38368 42626 7447 -15099 4669 11793 14987 49806 44245 25483 4908
6511 4908 38863 23009 1926 -42790 20828 46960 -20270 -55946 -37218 28637 67641 47851
6499 47851 -19262 -21688 -25784 31640 87148 96217 65294 45956 45234 81183 -85 55595 86010
6486 86010 58171 36113 2631 49598 44236 21396 -34035 -33687 8346 26324 45586 26042
6474B6042q555J03161K0024n5829m4465l5209J5258r069M63l227K115n407l5562
6461c0260J6948P4494K7973K2198j9539J0032j3272j5373r959l5335j4130M1883
6449E5660J9107L9764n8132M806M5875k6567k3723J0330k6824k0068m7348l615
6437c0735M759K7536J3967n125L4841K7861O237j3164n2939n7897j0768K5302
6425c0125j118J450J9384P62j3138o743K302J4985p853M0469Q9039Q113l1726
6412H5801l4808m7932k565N6099r382L346M1683L4407J982k6984m6891o5717J0283
6399f78k4345k2597L8380Q5750k4585m9329j1725l574k0477l3548L7892L9546
6387A0710n410j5240P225N7118K8670L6871m3646k091j15K246j0856k7012p442
$$ plain form
6474 26042 17487 120648 140672 84843 40378 5169 20427 11358 11821 8594 10709 5302 -30260
6461 -30260 -13312 61182 89155 111353 91814 101846 88574 73201 63242 27907 13777 55660
6449 55660 74767 114531 56399 61205 107080 80513 56790 67120 40296 20228 -27120 -30735
6437 -30735 -25976 1560 15527 10402 45243 73104 79341 66177 13238 -44659 -55427 -30125
6425 -30125 -31243 -29793 -10409 -9647 -22785 -29528 -27226 -12241 -20094 20375 109414 117527 85801
6412 85801 50993 3061 496 56595 47213 50559 92242 126649 128631 101647 54756 -10961 -678
6399 -678 -25023 -47620 -9240 76510 51925 2596 -9129 -12703 -33180 -66728 -28836 10710
6387 10710 5300 -9940 -2715 54403 83073 119944 76298 74207 74092 76338 65482 38470 31028
6374C1028K9098K9382j8634j8785k615l2514k8378p036L0286O1253K6756p0453
6362B9388l331k3187m1728L2427N0839J6006k3503k3556L9231k0795l1968j7179
6350a7356n2609J9979K1555R055O5587L1240o962j7772k1666P422m0473J1219
6338I219j0250k3776o223L3575j4675m111K559M2573k9551j6645j7855N181K8742
6325a237M1764j7106K3121P557l6851o5425N5447L279l7222O835J8221j6258j2213
6312c0088L5394R349L9758J5263j2074j1306n616k9985J1810O83K9742k8721J6192
6299D0401N1820k8969n4702O150l6401n2699j3990k2102M1363N6464j4860P1883
6287D4358R0538m966j7359l3336l9199j0936r526L2220j8329m1100M5573J8661
$$ plain form
6374 31028 60126 89508 70874 52089 49474 16960 -11418 -18454 11832 73085 99841 29388
6362 29388 26057 2870 -38858 -6431 44408 60414 36911 13355 52586 31791 -177 -17356
6350 -17356 -69965 -49986 -28431 -19376 46211 77451 70489 52717 31051 38473 -2000 9219
6338 9219 -1031 -24807 -31030 2545 -12130 -16241 -13682 28891 -660 -17305 -35160 -29979 -1237
6325 -1237 40527 23421 46542 54099 17248 -48177 7270 10549 -26673 -19838 -1617 -17875 -30088
6312 -30088 5306 14655 54413 69676 57602 46296 40680 10695 22505 23188 52930 24209 40401
6299 40401 92221 63252 8550 14700 -21701 -74400 -88390 -110492 -69129 -12665 -27525 44358
6287 44358 134896 129930 112571 79235 40036 29100 19574 51794 33465 -7635 37938 56599
6275E6599J2453k5042M7193M5534l055o5212l2105k0778m6789j3935M9036Q795
6263A2694O131O751q640L5288J0173k9751n2596L7060L468J4963m265k9945k7836
6250b6505K6866L018l6044J9467M0673p864M2515m1690l4117J3625K5693R89m3978
6237a7352K9317K4888q917n4976M890M3206j7084K1323j9596L4939L5927K130
6225G8695j2713j5545m3039R795k2456J0549J107N989L41n6023l8424j901K5066
6212e8559r270K1829N6402N7599J2273o2950m1168J7348J9760j7517J0828P1L0975
6199C7621O408J6399J1755r736k1505N5989j2599l1297K3067j5420n563R203O0151
6186A24473r652K5654J339J9993k4364n1588m2230m1079o0896k092J8059N4845
$$ plain form
6275 56599 69052 44010 91203 136737 133682 68470 36365 15587 -31202 -45137 3899 12694
6263 12694 18825 25576 16936 52224 62397 32646 -19950 17110 20578 35541 31276 1331 -26505
6250 -26505 361 3379 -32665 -13198 27475 19611 62126 20436 -13681 -56 25637 26626 -17352
6237 -17352 11965 36853 27936 -27040 -22150 21056 3972 25295 5699 40638 76565 78695
6225 78695 65982 50437 7398 17193 -5263 5286 6393 12382 12723 -43300 -81724 -83625 -58559
6212 -58559 -67829 -46000 10402 68001 80274 17324 -23844 -6496 13264 -4253 6575 6646 37621
6199 37621 44029 60428 72183 62447 40942 96931 84332 53035 76102 60682 55119 64322 124473
6186 124473 114821 140475 141814 161807 137443 85855 43625 2546 -58350 -60442 -42383 12462
6174A2462l5652m7599M4156P6832k0818o6093J9829k2365l1703J2309p029O884
6162e8787N0978L0592k472k9761J6194J2337p946l5177L0519K5817P309J8479
6150E8082M0758q35j0281n7876k9363m556J8940N0329l484O4673j8606k4703l1800
6137E1278m5385Q516j9791k8416o619k0128J1801j5070j4568K9210M2558P1761
6125F5147K5815J0436q468j2953l6358n8241M2791K0922l2410R971P988n7979
6113b3339j016L5874N1141k1815m6506l247l0825m6166J0771M7490K9799O652
6101H813J1649p8997j8753J8919J4485m126K7246J924P9050m0606j2811J1974
6089A8767j1061N217J9194L0306l8066p8326M2359J14660j0822m7863K6292J3966
$$ plain form
6174 12462 -23190 -70789 -26633 50199 29381 -36712 -16883 -39248 -70951 -58642 -65671 -58787
6162 -58787 -7809 22783 20311 -9450 6744 19081 11135 -24042 6477 32294 39603 58082
6150 58082 98840 98005 87724 29848 485 -4071 14869 65198 61714 126387 107781 83078 51278
6137 51278 5893 14409 -5382 -33798 -40417 -60545 -48744 -63814 -78382 -49172 -6614 65147
6125 65147 90962 101398 92930 79977 43619 -14622 28169 49091 16681 26652 34640 -23339
6113 -23339 -24355 11519 62660 40845 -5661 -8908 -39733 -85899 -75128 -27638 2161 8813
6101 8813 20462 -58535 -77288 -58369 -43884 -48010 -20764 -18840 60210 19604 6793 18767
6089 18767 7706 12923 32117 62423 24357 -53969 -11610 103050 92228 44365 70657 84623
6077H4623o4724K3239J02344P361P311p6857N058k20k9675q9504L2132P0464l5710
6064C5842j6886m905k0110M9064N542o520n9534k7679j7786P9630K34j8579n613
6051g300N3515m0556K8584j1759L1037M2045l421k9407o9455j0709j1257n1950
6039h0633O508K662M6227O451K5053k6047N8945N8360J3069l201l4901p3783m780
6026f070j6497K2027n0308k2185K3954M6276M9044j9847O818J137k3989k0641
6014a0281l1807m4878l5972k8420M8639P6882M1888K6390j2545p0136n7522L4199
6002f3563O6690L7745N6498Q2975k7296m1502m5740k7057N7894J009n1926j0895
5990C4832j1563k6320j2109k2299J2998M2325j7718p77J4558m35K3690R317m1253
$$ plain form
6077 84623 19899 43138 145482 152843 160154 83297 88355 88135 58460 -31044 1088 71552 35842
6064 35842 18956 14051 -6059 43005 48547 42027 -17507 -45186 -62972 16658 16892 -1687 -7300
6051 -7300 46215 5659 34243 22484 53521 95566 92145 62738 -6717 -17426 -28683 -80633
6039 -80633 -74125 -71463 -25236 -18785 6268 -19779 39166 97526 110595 107394 72493 -1290 -6070
6026 -6070 -22567 -540 -50848 -73033 -49079 -2803 46241 26394 33212 34349 10360 -10281
6014 -10281 -42088 -86966 -122938 -151358 -102719 -25837 16051 42441 29896 -40240 -97762 -63563
6002 -63563 3127 40872 97370 180345 153049 111547 65807 38750 96644 97653 45727 34832
5990 34832 23269 -3051 -15160 -37459 -24461 17864 146 -631 13927 13492 37182 46499 5246
5977E246O591O247J4005m8707n3038L6760O3450M8686m0876j9470K4633M5896
5965H9423J9709k6955o7475o1441L0315M7616K290o057k5873l9931q376K5396
5953b1359Q5641L5773o3728l7237N698L6024J2476K9453k9818n9263l4905M9342
5941H097j590j6215L0740K3470O347Q465m227p0234K147M7314L2020J5932r500
5928G2766k7689l0300n6483Q888K2778R13R548M3153m1444L548k0916m6106M0819
5915b0525N9894m389k3951k1374K0977l765L9573K3940j6523m6905k05k668j0015
5902e936M274J685J8164K7076K2028J3237m1523o4296O279k3004J6546r268J6895
5889a7843L8767k0271m8878K7279j8775J6023L5781K7635k8715k6531n4204K0278
$$ plain form
5977 5246 11837 18084 32089 -16618 -69656 -32896 30554 79240 38364 18894 43527 89423
5965 89423 109132 82177 14702 -46739 -16424 31192 33482 27425 1552 -38379 -46755 -21359
5953 -21359 64282 100055 36327 -910 4788 40812 53288 82741 52923 -6340 -41245 8097
5941 8097 6507 -9708 21032 44502 50849 59314 55087 -15147 -13000 34314 66334 82266 72766
5928 72766 45077 14777 -41706 -32818 -10040 -9127 421 43574 2130 5678 -15238 -61344 -20525
5915 -20525 39369 34980 11029 -10345 10632 6867 46440 70380 53857 6952 6747 4079 -5936
5902 -5936 -1662 23 18187 45263 67291 80528 39005 -25291 -19012 -42016 -25470 -34738 -17843
5889 -17843 20924 653 -48225 -20946 -39721 -23698 12083 39718 11003 -15528 -69732 -49454
5877d9454L5126J0484L0930k774k4665L1783j070n1102L4277N1565l4870o0033
5865b9803n823K6931O145k8206M4253j7869m302J5856j2095N395l9563j0642O7259
5852A7536L0922J1327q177j9731j4838N0470r046n1444J2729N4530K5807k5137
5840G4948l4646j7925l4834j0391j6476J4097j7127J3013j4228J4456j9336P897
5828d0552j1848j1266o16m4314n141M2696N6165L2424k0332n598L5569k1940j4209
5815h962q400K0566l6943J8894M4074k7155l6904L440M3608J0639K780m0488n0219
5802f5070L3856L1108k2612k5905n305L063L0868K1249K8376j474L4758L1324
5790I4236j8869k2507k2226J501J5008L2422l3749m0393m7470M989J2474k1205
$$ plain form
5877 -49454 -14328 -3844 27086 24312 -353 31430 30360 -20742 13535 65100 30230 -29803
5865 -29803 -35626 -8695 -2550 -30756 13497 -4372 -8674 7182 -4913 482 -39081 -49723 17536
5852 17536 48458 59785 51608 31877 17039 67509 58463 7019 19748 74278 100085 74948
5840 74948 40302 22377 -12457 -22848 -39324 -25227 -42354 -29341 -43569 -29113 -48449 -40552
5828 -40552 -52400 -63666 -64282 -108596 -113737 -71041 -14876 17548 -2784 -8382 27187 5247 -8962
5815 -8962 -17362 3204 -33739 -14845 29229 2074 -34830 -31390 12218 22857 25637 -14851 -65070
5802 -65070 -31214 -106 -22718 -48623 -53928 -50865 -19997 1252 29628 28154 62912 94236
5790 94236 75367 52860 30634 32135 47143 79565 45816 5423 -42047 -37058 -24584 -45789
5778d5789L6289M3420m0127l8645q393p766L0651K8168K5129j4399j3065L4962
5766C0435k785l938l3682N939O1798m8232j8813l1699r771N306L9264K1509L541
5753A8872l3107L3525K2969p249K3137m3451j4942L6009L1896j1449k1604m4984
5741a0378l4411L6815K2477L0254k8700n1571K9719J1815k4316n8809J6493J3070
5729d7542N9330N0448l7843M614K5246k2998O495K7685K390K760p247j3775M6862
5716I6425j8671j02609m6922K5290K9672k78k9977M8758P5498j4960o5299M3054
5704C9981k3656l9154r207k5801K5002K9080L9597r199k4687j3009J01368p726
5692H2589k8792R46R657M683L4829M4275m2702m8253R059k6105q1084n1954K1261
$$ plain form
5778 -45789 -9500 33920 -6207 -44852 -53245 -61011 -30360 -2192 22937 8538 -4527 30435
5766 30435 27650 23712 -9970 -4031 57767 9535 -9278 -40977 -50748 -45442 -6178 15331 18872
5753 18872 -14235 19290 42259 35010 58147 14696 -246 35763 67659 56210 34606 -10378
5741 -10378 -44789 -7974 14503 44757 16057 -35514 -5795 6020 -18296 -77105 -60612 -47542
5729 -47542 11788 62236 24393 29007 54253 31255 37750 65435 67825 70585 63338 49563 96425
5716 96425 77754 -24855 -71777 -46487 -16815 -17093 -47070 1688 77186 62226 -3073 39981
5704 39981 16325 -22829 -32036 -57837 -32835 -3755 35842 26643 1956 -11053 90315 82589
5692 82589 53797 54743 64400 69083 103912 148187 105485 57232 66291 40186 -40898 -92852 -71591
5679g1591K2455K1250J7382N8007O0029m443l1375j4816k3094m2121o0616m8640
5667a17573L2090M3173J4364k576N535P2687J3597n6937l3574J2942M3388l3495
5655f379k9351r856P735l8006K1421M5651n1035k2085Q98j963k3495J2878N6939
5642c6648k3295j2168N8941M9945J0987n5409m6872J3459M0538N6924n31k8883
5630B6988l918O986j8583n9190P172N9140L0466R91l298n901m3382q5390K559
5617h5360m8937m1714m7704K0059J00390p009J5384M3765M0483l2216m8263J4313
5605g6809L5851k7675m3732j4810K0009K8459O3419L8334k1095j0102J4309O1994
5593F8152P0513j3826m0975k3913p2521K35L2851K1537J551p649L5815j2428J0256
$$ plain form
5679 -71591 -49136 -27886 -10504 47503 107532 103089 71714 56898 33804 -8317 -68933 -117573
5667 -117573 -85483 -42310 -27946 -30522 -24987 47700 61297 4360 -29214 -16272 27116 -6379
5655 -6379 -35730 -45586 -37851 -75857 -54436 -8785 -59820 -81905 -81007 -82970 -106465 -93587 -36648
5642 -36648 -59943 -72111 -13170 36775 47762 -7647 -54519 -41060 -522 56402 55871 26988
5630 26988 23070 30056 11473 -47717 -40545 18595 49061 50052 46754 40853 -2529 -87919 -85360
5617 -85360 -134297 -176011 -223715 -203656 -103266 -110275 -94891 -51126 -10643 -42859 -91122 -76809
5605 -76809 -40958 -68633 -112365 -127175 -107166 -78707 -15288 23046 1951 -8151 6158 68152
5593 68152 138665 124839 83864 59951 -12570 -12335 20516 42053 43604 35955 71770 59342 69598
5580F9598k0298p979j1148k6621J7220l5520k0171L5466M2689P4220j1810k1740
5568H3906j1527m9l0645M314l9983l5011l5561J8971J2325N3981N2624K6392m2939
5555E6798j5116R763L0496n90l4272j3250R161j1669m4442l1341M6348N0887M1692
5542I4465j0043n2610J9264L6456r6065m3122L0826M8752K4817m5659k302K4292
5530B9071k2758n1861n8561R713K2528K9810N5847l2685K3118j121k7548j3735
5518c8182J7063M6641M9532J0553m7448j7038R556l1185j3940L2253O9023M5560
5506A32388l4177K1243l4595q9088l5622n5784n0125R5053R8377K1408L3157j1950
5494I0285k809q981l0814o0801n6478L8466L712P2535K1873l1812l0169j6372
$$ plain form
5580 69598 49300 41321 30173 3552 20772 -14748 -34919 547 43236 117456 105646 83906
5568 83906 72379 72330 41685 45999 6016 -28995 -64556 -45585 -33260 20721 73345 99737 56798
5555 56798 41682 51445 81941 81351 47079 33829 42990 31321 -13121 -44462 1886 52773 94465
5542 94465 84422 31812 51076 87532 -8533 -51655 -20829 27923 52740 7081 4779 29071
5530 29071 6313 -45548 -104109 -94396 -71868 -42058 13789 -18896 4222 3101 -24447 -38182
5518 -38182 -21119 25522 75054 85607 38159 21121 30677 -508 -14448 17805 86828 132388
5506 132388 98211 119454 84859 -4229 -39851 -95635 -145760 -50707 47670 69078 102235 90285
5494 90285 87476 78495 47681 -13120 -69598 -31132 -27420 45115 66988 35176 5007 -11365
5482a1365k057j345l7389J4523J7655J2076K4386L0778N747k6915l5716M5009
5470C5387j9431j3655N7071J04604K8559q1762n4620l7449L973L0483J1760n4543
5458A0377K1681p490k9314J4735M672M7279L1257l606K1990r063o5027n847N261
5445C6905n7786m640n590m772l0449p342L1706N0481k945j3930O189m924l0939
5432c8036M468J1423L1124M873k0414j7003K5967o8235q347N8173N7482p1465
5420b9990l4568K7684J7391m979l0974M9314N0522o2019J2468M3714O0998k3905
5408G5656o9744N637L7967J5074k9907k5263q090p554k2490J4706L7094q034p6826
5395f1774p869L7777K0096M2677k0252j2529n8410l090R732L3394J108k8280J7620
$$ plain form
5482 -11365 -13422 -14767 -52156 -37633 -19978 -7902 16484 47262 53009 26094 -9622 35387
5470 35387 15956 2301 59372 163976 192535 110773 56153 18704 22677 53160 64920 10377
5458 10377 32058 24568 -4746 9989 14661 61940 93197 89591 111581 102518 37491 31644 36905
5445 36905 -20881 -25521 -31111 -35883 -66332 -73674 -41968 8513 5568 -8362 -2173 -7097 -38036
5432 -38036 -33568 -22145 8979 13852 -6562 -23565 2402 -65833 -74180 -16007 41475 -29990
5420 -29990 -64558 -36874 -19483 -24462 -55436 -6122 44400 -17619 -5151 38563 99561 75656
5408 75656 5912 11549 49516 64590 34683 9420 1330 -6224 -28714 -14008 23086 15052 -61774
5395 -61774 -69643 -31866 -11770 30907 10655 -1874 -60284 -63374 -53642 -20248 -19140 -47420 -29800
5382b9800N033L962M7459k7570J3920J1514j0641L1926M5639p5921m3721k444
5370c0644k2003j5329L8993j5335m3881j16M2819N0132q888J5314j0193J944j1717
5357h904O2625N390k8483N02L1558j4715l2159o978n688j1770k9397p1201J3368
5344i5852L9949L6709j8904L6880K7628P509K6696J8023m582m1943q495m2774
5332a9156l317J8545p610n604n3180l7027O270J3670L8105R389j6547j1524n321
5319g3307J346k7506P478P714m4840M2466P0135J7539j4500M7372L7787N7367
5307A29051m1884n2920M6182l547o0052m9955l0106k9931N5698K9919R141j7880
5295a6284K3532j3265l7680L127K759J3334M6639l7501M3405j6374J5466M5901
$$ plain form
5382 -29800 -24767 -20805 26654 -916 13004 24518 13877 45803 91442 15521 -28200 -30644
5370 -30644 -52647 -67976 -28983 -44318 -88199 -88315 -45496 4636 -4252 11062 869 2813 -8904
5357 -8904 53721 59111 30628 31130 62688 47973 15814 8836 3148 -8622 -38019 -109220 -95852
5344 -95852 -55903 -19194 -38098 -1218 26410 33919 60615 78638 74056 32113 23618 -19156
5332 -19156 -22473 -3928 -11538 -17142 -70322 -107349 -101079 -87409 -49304 -39915 -56462 -67986 -73307
5319 -73307 -71961 -99467 -91989 -84275 -129115 -86649 -16514 1025 -13475 33897 71684 129051
5307 129051 87167 34247 80429 76882 16830 -33125 -63231 -93162 -37464 -7545 1596 -16284
5295 -16284 7248 -6017 -43697 -40570 -37811 -24477 22162 -15339 28066 11692 27158 73059
5283G3059k2571m5551n1562L1068O6795l8818l6992j9257P15O0772K8902o6353
5271a9793O397J4927k966l1415P221o984M1220P661j5057M6540R559l7696l5337
5258a5723l8511L0273K9682l338J966O147M6015l5952p814k0904m6520J3230O2919
5245B1470J1470l4647q558M1642J2284K8626K1437k4504J9534n2938P71J2408
5233D8995m8110l617m908K6220K15J8269l7442P120N4502l8665k9623O046j6229
5220a7227N1291L8720m425l5422O137J3914K344M0925k8014k8679M137L5624m712
5207G4613k2224j6830k0624J096k9627j5580k4041Q217P1521N0247r594l1256
5195C5918j6891m1869N967j4482O553L5046o857J7674L5410j0080m3373K1332
$$ plain form
5283 73059 50488 4937 -46625 -15557 51238 12420 -24572 -43829 -43114 17658 46560 -19793
5271 -19793 -13396 1531 -1435 -32850 -25629 -32613 8607 16268 1211 47751 57310 19614 -15723
5258 -15723 -54234 -23961 5721 2383 4349 10496 56511 20559 12745 -8159 -54679 -41449 21470
5245 21470 32940 -1707 -10265 31377 43661 72287 93724 69220 88754 35816 36587 48995
5233 48995 885 -2732 -7640 18580 18795 37064 -378 6742 61244 22579 -7044 -998 -17227
5220 -17227 34064 72784 68359 32937 39074 52988 55332 96257 68243 39564 43701 79325 74613
5207 74613 52389 35559 14935 16031 -13596 -29176 -53217 -45000 26521 76768 67174 35918
5195 35918 19027 -22842 -16875 -31357 -24804 10242 3385 21059 56469 46389 3016 24348
5183B4348k3062J2472k488j8310j23m8816r81N4718J2155M4522l56m5448N5838
5170F4469r282l1224m4827K3945K0977j8870j8456M6698M0915J2765l5697p4481
5158b3068j6542O835J6117j8020R496M250M5946p050n6459N557K1895J7077K7883
5145C3917K3078M4444k373m5619p2339n5701k8511J0173O3635K2579l6476n4289
5133i7482O9k0213l1765M4785O4936K9255j9178M5152M197l6535j3103o641K4450
5120a2073p353j8604j1379M508j6151l3915j3288J1690K0650M1113M606j877N4467
5107B2394K6504n232J8332j4310J4455k8188L0816k0610m287J6153j3379q2089
5095c9441O565N3039n30k2755K1957R8173J400m424l0005o2103j8464M2272L551
$$ plain form
5183 24348 1286 13758 11270 -7040 -7163 -55979 -56960 -2242 9913 54435 54079 8631 64469
5170 64469 55187 23963 -20864 3081 24058 5188 -13268 33430 74345 87110 51413 -23068
5158 -23068 -39610 -32775 -16658 -34678 -25182 -20932 25014 17964 -38495 -32938 -11043 6034 33917
5145 33917 56995 101439 99066 53447 -18892 -74593 -103104 -92931 -29296 -6717 -43193 -97482
5133 -97482 -97413 -117626 -149391 -104606 -39670 -10415 -29593 15559 19756 -16779 -29882 -36523 -12073
5120 -12073 -19426 -38030 -49409 -44901 -61052 -94967 -108255 -96565 -75915 -34802 -30196 -32073 22394
5107 22394 48898 43666 61998 47688 62143 33955 64771 44161 39874 56027 42648 -39441
5095 -39441 -32876 20163 19633 -3122 18835 117008 118408 113984 83979 21876 3412 45684 49235
5082D9235q289n0817n36j6877j0858l0708J4732L7182j8504j5319M145j3799p58
5069f1171j451P411k1484M6533k99o5168k4418J4803J6671J2243j5583J5434K0261
5056e6218L7263j7648M5176O1332j4395q5281m4704P199M0908J3154O6494Q778
5044F2058j5617n5536l6781L4109M223n358k8230J419k0537J2264N4750L1774
5032C8538r848K4261l5675l3106n225M7151K1464j8231m0673L06L146j2966k9359
5019e0217l8290N2884J0884R203l811M466J5701j9425N4081J237n1163j4573K3895
5006e128L6993J6208l327o4119n0667l108L4419k756j9073J9629P795o564M7592
$$ plain form
5082 49235 40946 -9871 -10407 -27284 -38142 -68850 -54118 -16936 -35440 -50759 -46614 -60413 -61171
5069 -61171 -62622 -55211 -76695 -30162 -30461 -95629 -120047 -105244 -88573 -76330 -91913 -76479 -56218
5056 -56218 -18955 -36603 8573 69905 55510 -29771 -74475 -67276 -26368 -13214 53280 62058
5044 62058 46441 -9095 -45876 -11767 -7544 -12902 -41132 -39713 -60250 -47986 6764 38538
5032 38538 28690 52951 17276 -15830 -21055 26096 47560 29329 -11344 -11038 -7892 -20858 -50217
5019 -50217 -88507 -35623 -24739 -15536 -19347 -14881 820 -18605 35476 36713 -14450 -29023 -5128
5006 -5128 31865 48073 44746 -19373 -70040 -73148 -38729 -41485 -60558 -40929 -33134 -39698 7894
$$ [...]
##END NTUPLES=NMR SPECTRUM
##END=
