##TITLE=Analysis number 329909
Compound Code cc 67801
Book Reference 521/117
Project Code adrs
Chemist Name evam
##JCAMPDX= 6.0         $$ Bruker NMR JCAMP-DX V2.0
##DATA TYPE= NMR SPECTRUM
##DATA CLASS= NTUPLES
##ORIGIN= Bruker BioSpin GmbH
##OWNER= nmr
$$ XWIN-NMR		Version 3.5
$$ Wed Oct 10 12:27:10 2007 GMT Daylight Time (UT+1h)  MAYBRIDGE\nmr@NMR_250MHZ
##.OBSERVE FREQUENCY= 250.131544655141
##.OBSERVE NUCLEUS= ^1H
##.ACQUISITION MODE= SIMULTANEOUS (DQD)
##.ACQUISITION SCHEME= undefined
##.AVERAGES= 16
##.DIGITISER RES= 18
##SPECTROMETER/DATA SYSTEM= dpx250
##.PULSE SEQUENCE= zg30
##.SOLVENT NAME= DMSO
##.SHIFT REFERENCE= (INTERNAL, DMSO, 0, 16.509)
##AUDIT TRAIL= $$ (NUMBER, WHEN, WHO, WHERE, WHAT)
$$ ##TITLE= Audit trail, XWIN-NMR		Version 3.5
$$ ##JCAMPDX= 5.01
$$ ##ORIGIN= Bruker BioSpin GmbH
$$ ##OWNER= nmr
$$ C:\u/data/dgb/nmr/ADRS/600/pdata/1/auditp.txt
$$ ##AUDIT TRAIL=  $$ (NUMBER, WHEN, WHO, WHERE, WHAT)
(   1,<2007-10-10 12:26:47.65 +100>,<MAYBRIDGE\nmr>,<NMR_250MHZ>,
      <created by zg, POWCHK disabled, PULCHK disabled
       configuration hash MD5:
       76 6E 9A 78 1E 09 19 81 EC 84 63 8F B0 6A 59 2D
       data hash MD5: 64K
       6A 2E 53 2B 87 C7 72 ED 01 22 E4 4D 6A 6B DB 94>)
(   2,<2007-10-10 12:27:00.36 +100>,<MAYBRIDGE\nmr>,<NMR_250MHZ>,
      <Start of raw data processing
       ef LB = 0.3 FT_mod = 6 PKNL = 1 SI = 32K 
       data hash MD5: 32K
       5A F9 5B 7B D9 6C 75 43 64 65 94 7B D5 64 B4 57>)
(   3,<2007-10-10 12:27:02.01 +100>,<MAYBRIDGE\nmr>,<NMR_250MHZ>,
      <apk 
       data hash MD5: 32K
       3C ED A1 0B E7 BD 35 EB 71 19 C3 9A C0 04 5A 85>)
(   4,<2007-10-10 12:27:02.75 +100>,<MAYBRIDGE\nmr>,<NMR_250MHZ>,
      <abs ABSG = 5 
       data hash MD5: 32K
       FB 73 B4 5A 27 02 DB 88 1F 0E 17 04 4C B0 5D 9C>)
$$ ##END=
$$ 
$$ hash MD5
$$ 57 7A E4 65 F4 B1 77 64 08 A1 D8 07 FD FF FF 51
##$RELAX= 
##$RELAX= 
##$RELAX= 
##$RELAX= 
##$RELAX= 
##$RELAX= 
##$RELAX= 
$$ Bruker specific parameters
$$ --------------------------
##$DU= <C:\u>
##$EXPNO= 600
##$NAME= <ADRS>
##$PROCNO= 1
##$TYPE= <nmr>
##$USER= <dgb>
##$AMP= (0..31)
100 100 100 100 100 100 100 100 100 100 100 100 100 100 100 100 100 100 
100 100 100 100 100 100 100 100 100 100 100 100 100 100 
##$AQSEQ= 0
##$AQ_mod= 3
##$AUNM= <au_zg>
##$AUTOPOS= <16 >
##$BF1= 250.13
##$BF2= 250.13
##$BF3= 250.13
##$BF4= 250.13
##$BF5= 500.13
##$BF6= 500.13
##$BF7= 500.13
##$BF8= 500.13
##$BYTORDA= 1
##$CFDGTYP= 0
##$CFRGTYP= 5
##$CHEMSTR= <none>
##$CNST= (0..31)
1 1 145 1 1 1 1 1 1 1 1 1 1 1 1 1 1 1 1 1 1 1 1 1 1 1 1 1 1 1 1 1 
##$CPDPRG= <>
##$CPDPRG1= <>
##$CPDPRG2= <>
##$CPDPRG3= <>
##$CPDPRG4= <mlev>
##$CPDPRG5= <mlev>
##$CPDPRG6= <mlev>
##$CPDPRG7= <mlev>
##$CPDPRG8= <mlev>
##$CPDPRGB= <>
##$CPDPRGT= <>
##$D= (0..31)
0 1 0 0 0 0 0 0 0 0.06 0 0 0 0 0 0 0.0002 0 0 0 0 0 0 0 0 0 0 0 0 0 0 
0 
##$DATE= 1192015606
##$DBL= (0..7)
120 120 120 120 120 120 120 120 
##$DBP= (0..7)
150 150 150 150 150 150 150 150 
##$DBP07= 0
##$DBPNAM0= <>
##$DBPNAM1= <>
$$ [...]
##$SUBNAM7= <"">
##$SUBNAM8= <"">
##$SUBNAM9= <"">
##$SW= 20.6930455092707
##$SWIBOX= (0..15)
0 0 3 0 0 0 0 0 0 0 0 0 0 0 0 0 
##$SW_h= 5175.983436853
##$TD= 65536
##$TD0= 1
##$TE= 296.16
##$TE2= 300
##$TE3= 300
##$TEG= 300
##$TL= (0..7)
0 120 120 120 120 120 120 120 
##$TP= (0..7)
150 150 150 150 150 150 150 150 
##$TP07= 0
##$TPNAME0= <>
##$TPNAME1= <>
##$TPNAME2= <>
##$TPNAME3= <>
##$TPNAME4= <>
##$TPNAME5= <>
##$TPNAME6= <>
##$TPNAME7= <>
##$TPOAL= (0..7)
0.5 0.5 0.5 0.5 0.5 0.5 0.5 0.5 
##$TPOFFS= (0..7)
0 0 0 0 0 0 0 0 
##$TUNHIN= 0
##$TUNHOUT= 0
##$TUNXOUT= 0
##$USERA1= <user>
##$USERA2= <user>
##$USERA3= <user>
##$USERA4= <user>
##$USERA5= <user>
##$V9= 5
##$VALIST= <valist>
##$VCLIST= <CCCCCCCCCCCCCCC>
##$VD= 0
##$VDLIST= <DDDDDDDDDDDDDDD>
##$VPLIST= <PPPPPPPPPPPPPPP>
##$VTLIST= <TTTTTTTTTTTTTTT>
##$WBST= 1024
##$WBSW= 4
##$XGAIN= (0..3)
0 0 0 0 
##$XL= 0
##$YL= 0
##$YMAX_a= 272755
##$YMIN_a= -376693
##$ZGOPTNS= <>
##$ZL1= 120
##$ZL2= 120
##$ZL3= 120
##$ZL4= 120
##$ABSF1= 16.50904
##$ABSF2= -4.184132
##$ABSG= 5
##$ABSL= 3
##$ALPHA= 0
##$AQORDER= 0
##$ASSFAC= 0
##$ASSFACI= 0
##$ASSFACX= 0
##$ASSWID= 0
##$AUNMP= <proc_1d>
##$AZFE= 0.1
##$AZFW= 0.1
##$BCFW= 0
##$BC_mod= 0
##$BYTORDP= 0
##$COROFFS= 0
##$CY= 12.5
##$DATMOD= 1
##$DC= 0
##$DFILT= <>
##$DTYPP= 0
##$F1P= 14.0000005364418
##$F2P= -0.99999901652339
##$FCOR= 0.5
##$FTSIZE= 32768
##$FT_mod= 6
##$GAMMA= 0
##$GB= 0
##$INTBC= 1
##$INTSCL= 1
##$ISEN= 128
##$LB= 0.3
##$LEV0= 0
##$LPBIN= 0
##$MAXI= 10000
##$MC2= 0
##$MEAN= 0
##$ME_mod= 0
##$MI= 0
##$NCOEF= 0
##$NC_proc= -5
##$NLEV= 6
##$NOISF1= 0
##$NOISF2= 0
##$NSP= 0
##$NTH_PI= 0
##$NZP= 0
##$OFFSET= 16.50904
##$PC= 1
##$PHC0= 148.802
##$PHC1= 8.001382
##$PH_mod= 1
##$PKNL= yes
##$PPARMOD= 0
##$PSCAL= 4
##$PSIGN= 0
##$REVERSE= no
##$SF= 250.130003241275
##$SI= 32768
##$SIGF1= 0
##$SIGF2= 0
##$SINO= 400
##$SIOLD= 32768
##$SREGLST= <1H.DMSO>
##$SSB= 0
##$STSI= 32768
##$STSR= 0
##$SW_p= 5175.98343685301
##$SYMM= 0
##$S_DEV= 0
##$TDeff= 65536
##$TDoff= 0
##$TI= <Analysis number 999999
Compound Code 99
Book Reference 9
Project Code 9>
##$TILT= no
##$TM1= 0
##$TM2= 0
##$TOPLEV= 0
##$USERP1= <user>
##$USERP2= <user>
##$USERP3= <user>
##$USERP4= <user>
##$USERP5= <user>
##$WDW= 1
##$XDIM= 32768
##$YMAX_p= 461032821
##$YMIN_p= -773185
$$ End of Bruker specific parameters
$$ ---------------------------------
##NTUPLES= NMR SPECTRUM
##VAR_NAME=  FREQUENCY,     SPECTRUM/REAL,   SPECTRUM/IMAG
##SYMBOL=    X,             R,               I
##VAR_TYPE=  INDEPENDENT,   DEPENDENT,       DEPENDENT
##VAR_FORM=  AFFN,          ASDF,            ASDF
##VAR_DIM=   32768,         32768,           32768
##UNITS=     HZ,            ARBITRARY UNITS, ARBITRARY UNITS
##FACTOR=    0.157963299565203, 1,           1
##FIRST=     4129.40643694845, 0,            0
##LAST=      -1046.57699990456, 0,           0
##MIN=       -1046.57699990456, -773185,     0
##MAX=       4129.40643694845, 461032821,    0
$$ Real data points
##PAGE= N=1
##DATA TABLE= (X++(R..R)), XYDATA
$$ [...]
$$ plain form
15687 5985 -185272 -112801 -28062 -146258 23381 261939 153122 197558 259513 302557 315711
15676 315711 195441 -28537 -218489 -303537 -368024 -371387 -460230 -478185 -416931 -451663 -548930
15665 -548930 -356114 -252638 -295756 -244783 -36981 86072 71092 -12340 31598 162652
15655 162652 177696 -871 -13167 164568 124831 6890 -40168 -141232 -88300 42952
15645 42952 374929 436461 234395 170951 250773 72565 -84227 57195 98129 143808 214841
15634 214841 281642 233319 203136 218220 168802 13084 42814 -35747 -10526 -69113 -156853
15623 -156853 -123531 -5563 144924 127142 131503 -877 -292249 -302540 -218351 108774 302212
15612 302212 384233 321292 191633 52759 -61570 107656 375904 299081 222734 153951
$$ packed form
15687E985j91257P2471Q4739j18196J69639K38558j08817M4436O1955M3044J3154
15676C15711j20270k23978j89952q5048o4487l363q8843j7955O1254l4732r7267
15665e48930J92816J03476m3118N0973K07802J23053j4980q3432M3938J31054
15655A62652J5044j78567j2296J77735l9737j17941m7058j01064N2932J31252
15645D2952L31977O1532k02066o3444P9822j78208j56792J41422M0934M5679P1033
15634B14841O6801m8323l0183J5084m9418j55718K9730p8561K5221n8587q7740
15623a56853L3322J17968J50487j7782M361j32380k91372j0291Q4189L27125J93438
15612C02212Q2021o2941j29659j38874j14329J69226K68248p6823p6347o8783
$$ plain form
15602 153951 146147 -87844 -134360 -310128 -345969 -300768 -145191 -213269 -169012 -142778 1740
15591 1740 103081 130766 112134 -101495 -272959 -280333 -112466 -22446 -4503 -38909 -52094
15580 -52094 59343 -32520 -221899 -187063 -1603 47438 -56514 9968 -18756 -2571 -90006
15569 -90006 -261158 -103758 -2896 -12552 67537 -133535 -272961 -166058 45591 38346 53431
15558 53431 153989 171564 -17740 -37099 75014 -82082 -25643 10704 -5938 -191797 -167080
15547 -167080 57754 34157 -227715 -370070 -399468 -281383 17039 161071 58063 -34295
15537 -34295 -234547 -346963 -173782 -19253 124547 201049 226003 -11615 -24870 75624
15527 75624 187473 184445 199670 151635 160105 294437 210552 93824 256567 529121 384076
$$ packed form
15602A53951p804k33991m6516j75768l5841M5201J55577o8078M4257K6234J44518
15591A740J01341K7685j8632k13629j71464p374J67867R0020J7943l4406j3185
15580e2094J11437r1863j89379L4836J85460M9041j03952O6482k8724J6185q7435
15569i0006j71152J57400J00862r656Q0089k01072j39426J06903K11649p245J5085
15558E3431J00558J7575j89304j9359J12113j57096N6439L6347j6642j85859K4717
15547a67080K24834k3597k61872j42355k9398J18085K98422J44032j03008r2358
15537c4295k00252j12416J73181J54529J43800P6502K4954k37618j3255J00494
15527G5624J11849l028J5225m8035Q470J34332q3885j16728J62743K72554j45045
$$ plain form
15516 384076 281746 317896 367667 239980 229475 311770 258504 3644 -104387 59466
15506 59466 -18235 -169153 -330727 -206987 51264 220249 94599 17223 11564 234980
15496 234980 351432 226192 138565 184244 76926 -11560 -109527 -199589 -373201 -262003
15486 -262003 -320130 -290888 -12700 -69188 -206872 -249570 -332306 -220185 -26371 -95084 -159544
15475 -159544 -190092 -139550 -230810 -92436 61133 48784 -109461 -338941 -354798 -23849
15465 -23849 31745 -185529 -312101 -295079 -67971 29046 92361 -51598 -186127 -49226
15455 -49226 71331 57424 -26185 -21596 -69449 146826 100157 -77213 -102755 -161559 -97197
15444 -97197 -279255 -344209 -208339 -208402 -492282 -563933 -354810 -270059 -299594 -41186 81686
$$ packed form
15516C84076j02330L6150M9771j27687j0505Q2295n3266k54860j08031J63853
15506E9466p7701j50918j61574J23740K58251J68985j25650p7376n659K23416
15496B34980J16452j25240q7627M5679j07318q8486r7967r0062j73612J11198
15486b62003n8127K9242K78188n6488j37684m2698q2736J12121J93814o8713o4460
15475a59544l0548N0542r1260J38374J53569j2349j58245k29480j5857L30949
15465b3849N5594k17274j26572J7022K27108R7017O3315j43959j34529J36901
15455d9226J20557j3907q3609M589m7853K16275m6669j77370k5542n8804O4362
15444i7197j82058o4954J35870o3k83880p1651K09123Q4751k9535K58408J22872
$$ plain form
15433 81686 -27754 166684 232100 186691 163328 249534 313360 470278 379868 23369 -187782
15422 -187782 -16309 308522 407747 260433 118805 150573 -47623 -209082 -170033 -71572
15412 -71572 -225661 -251789 -335353 -244643 -49512 -107330 -202676 -281950 -83115 -61200 -75702
15401 -75702 -113326 -51062 3436 20744 -146029 -149450 -243258 -155802 40433 -53796 -112708
15390 -112708 -128027 -249311 -62135 71224 -31671 -64640 15309 30715 25718 -109355 -11234
15379 -11234 106674 -23465 -23109 -20217 15076 62576 118453 222520 329077 261842 136144
15368 136144 45648 -6443 -15013 93868 117702 28889 -62204 -99020 -219766 -178880 -64872
15357 -64872 -27586 -77065 -64582 -381 109034 -81361 -88198 -63111 -61686 95720 154952
$$ packed form
15433H1686j09440J94438O5416m5409k3363Q6206O3826J56918r0410l56499k11151
15422a87782J71473L24831R9225j47314j41628L1768j98196j61459L9049R8461
15412g1572j54089k6128q3564R0710J95131n7818r5346p9274J98835K1915j4502
15401g5702l7624O2264N4498J7308j66773l421r3808Q7456J96235r4229n8912
15390a12708j5319j21284J87176J33359j02895l2969P9949J5406m997j35073R8121
15379a1234J17908j30139L56K892L5293M7500N5877J04067J06557o7235j25698
15368A36144r0496n2091q570J08881K3834q8813r1093l6816j20746M0886J14008
15357f4872L7286m9479J2483O4201J09415j90395o837K5087J425J57406N9232
$$ plain form
15346 154952 170702 307694 471513 517218 196851 76098 158170 50355 -67685 55364
15336 55364 -29609 -73378 -309108 -535597 -384738 -151850 -141510 -96240 -73442 -71938 -17229
15325 -17229 -274341 -371441 -244889 -194990 -208770 -233998 -81963 37866 -187846 -78531
15315 -78531 -41156 -193511 -370497 -403779 -426178 -325507 -335031 -130839 50378 22035 -237954
15304 -237954 -382118 -457846 -298904 -142197 -24286 -71620 -175321 -138225 -13771 67612
15294 67612 139865 172132 167896 11800 -34520 -206897 -406754 -486009 -468511 -285809 -195067
15283 -195067 -177356 -174078 -53757 -188405 -81482 -80084 -147861 -60042 -184965 -294301 -199047
15272 -199047 -169338 3968 139663 124390 47597 -127728 -290786 -294610 -339463 -173229 -9935
$$ packed form
15346A54952J5750J36992J63819M5705l20367j20753Q2072j07815j18040J23049
15336E5364q4973m3769k35730k26489J50859K32888J0340M5270K2798J504N4709
15325a7229k57112r7100J26552M9899j3780k5228J52035J19829k25712J09315
15315g8531L7375j52355j76986l3282k2399J00671r524K04192J81217k8343k59989
15304b37954j44164p5728J58942J56707J17911m7334j03701L7096J24454Q1383
15294F7612P2253L2267m236j56096m6320j72377j99857p9255J7498J82702R0742
15283a95067J7711L278J20321j34648J06923J398o7777Q7819j24923j09336R5254
15272a99047K9709J73306J35695j5273p6793j75325j63058l824m4853J66234J63294
$$ plain form
15261 -9935 -56723 -236364 -237835 -57112 -86668 -324822 -366028 -328381 -259507 -168299 -16501
15250 -16501 33127 94765 56896 -149041 -243012 -286873 -126209 -3583 -8199 -11216 -288557
15239 -288557 -32548 161534 -30549 -181009 -373408 -298023 -189683 -175347 -327665 -281506
15229 -281506 -191354 121316 224785 -20664 -263335 -243679 -221804 -140574 -119481 -97133 -111505
15218 -111505 -123890 -127305 -90832 -3859 3222 -124396 -219233 -470765 -462917 -236309 -166843
15207 -166843 -302235 -413596 -406004 -437005 -375629 -207240 -232196 -133504 36429 -58289 -227451
15196 -227451 -280387 -240136 -423243 -339248 -277442 -267209 -208930 -144242 -70558 -116757 -207406
15185 -207406 -317143 -385476 -290888 -253348 -180723 -70753 -75409 -99465 8456 25863 -188549
$$ packed form
15261i935m6788j79641j471J80723k9556k38154m1206L7647O8874R1208J51798
15250a6501M9628O1638l7869k05937r3971m3861J60664J22626m616l017k77341
15239b88557K56009J94082j92083j50460j92399P5385J08340J4336j52318M6159
15229b81506R0152L12670J03469k45449k42671J9656K1875Q1230K1093K2348j4372
15218a11505j2385l415L6473Q6973P081j27618r4837k51532P848K26608O9466
15207a66843j35392j11361P592l1001O1376J68389k4956R8692J69933r4718j69162
15196b27451n2936M0251j83107Q3995O1806J0233N8279O4688P3684m6199r0649
15185b07406j09737o8333R4588L7540P2625J09970m656k4056J07921J7407k14412
$$ plain form
15174 -188549 -328370 -240524 32943 128455 42976 171900 -130634 -285668 -289451 -366601 -215191
15163 -215191 -138948 -39850 133803 285763 199587 70896 -115578 28755 -3254 -3685 10099
15152 10099 -109712 -180343 41075 67245 58260 69447 -60607 -132157 -38858 35152 170410
15141 170410 133913 -87019 -40859 44173 117640 110828 66809 -60936 -304078 -400244 -270623
15130 -270623 -184867 -98064 -101363 -12851 4906 -82682 -231507 -51511 -254705 -330837 1100
15119 1100 159244 98177 78338 33848 16622 149345 301363 357190 297938 155612 71144
15108 71144 -143387 -151274 107450 218450 -17550 -311983 -226087 -40650 175688 481757
15098 481757 538152 142401 8940 -203460 -257582 -88590 18123 122514 161410 51478
$$ packed form
15174a88549j39821Q7846K73467R5512q5479J28924l02534j55034l783p7150J51410
15163b15191P6243R9098J73653J51960q6176j28691j86474J44333l2009m31J3784
15152A0099j19811p0631K21418K6170q985J1187j30054p1550R3299P4010J35258
15141A70410l6497k20932M6160Q5032P3467o812m4019j27745k43142r6166J29621
15130b70623Q5756Q6803l299Q8512J7757q7588j48825J79996k03194p6132L31937
15119A100J58144o1067j9839m4490j7226J32723J52018N5827n9252j42326q4468
15108G1144k14531p887K58724J11000k36000k94433Q5896J85437K16338L06069
15098D81757N6395l95751j33461k12400n4122J68992J06713J04391L8896j09932
$$ plain form
15088 51478 25768 -16210 -200406 -211576 -204063 -41097 -52397 -178210 -112903 -239351 -233241
15077 -233241 -81537 -122464 -301148 -224208 -269833 -220665 -36691 -15021 -57048 72219 26615
15066 26615 -91932 -129722 101966 20482 -84928 -244230 -105165 -153235 -131769 -108269 -211072
15055 -211072 -172598 -5939 -23616 101478 270247 302182 411151 397907 185712 -80055
15045 -80055 -160255 -232668 -254336 -239487 -302358 -344693 -426730 -460810 -396160 -323343 -207544
15034 -207544 -292719 -367778 -434978 -456774 -318389 -121052 30031 -194834 -314397 -367311
15024 -367311 -218449 -242583 -341097 -331443 -111633 -75413 2017 -17514 5132 -245757 -242476
15013 -242476 -175981 -287905 -216046 -394506 -208768 -72627 -14107 -124045 -41964 -162952
$$ packed form
15088E1478k5710m1978j84196j1170P513J62966j1300j25813O5307j26448O110
15077b33241J51704m0927j78684P6940m5625M9168J83974K1670m2027J29267m5604
15066B6615j18547l7790K31688q1484j05410j59302J39065m8070K1466K3500j02803
15055b11072L8474J66659j7677J25094J68769L1935J08969j3244k12195k65767
15045h0055q0200p2413k1668J4849o2871m2335q2037l4080O4650P2817J15799
15034b07544q5175p5059o7200k1796J38385J97337J51083k24865j19563n2914
15024c67311J48862k4134r8514R654K19810L6220P7430j9531K2646k50889L281
15013b42476O6495j11924P1859j78460J85738J36141N8520j09938Q2081j20988
$$ plain form
15003 -162952 -165128 -61313 -49682 -146082 -77450 -64950 -89205 -285327 -365816 -232975 -203695
14992 -203695 -299243 -225475 -77502 -115964 -26346 -27374 -101892 -965 149863 245438 197774
14981 197774 305002 151259 219332 399708 284188 168670 44340 177928 261874 190409
14971 190409 17709 -91778 -118337 -117753 -81130 -266148 -348130 -219514 -43295 -5876 -26830
14960 -26830 19947 -57702 -28935 -16880 -100539 -339668 -399936 -283691 -346308 -313692 -173134
14949 -173134 -390398 -394553 -159174 -220674 -376530 -345428 -488652 -602840 -534773 -445846 -376486
14938 -376486 -239609 -95981 14047 -58601 -125048 -164681 -132956 -178752 -214858 -60425 -130943
14927 -130943 -200896 -92154 -249253 -227562 -243250 -334821 -282995 98935 148439 161379 290112
$$ packed form
15003a62952k176J03815J1631r6400O8632J2500k4255j96122q0489J32841K9280
14992b03695r5548P3768J47973l8462Q9618j028p4518J00927J50828R5575m7664
14981A97774J07228j53743O8073J80376j15520j15518j24330J33588Q3946p1465
14971A90409j72700j09487k6559N84L6623j85018q1982J28616J76219L7419k0954
14960b6830M6777p7649K8767J2055q3659k39129o0268J16245o2617L2616J40558
14949a73134k17264m155K35379o1500j55856L1102j43224j14188O8067Q8927O9360
14938c76486J36877J43628J10028p2648o6447l9633L1725m5796l6106J54433p0518
14927a30943o9953J08742j57099K1691j5688r1571N1826L81930M9504J2940J28733
$$ plain form
14916 290112 308500 12908 -133316 -83607 -200033 -516985 -526128 -275151 -202588 -148772 -89585
14905 -89585 -12628 116476 147324 172320 116725 71785 -19300 -10871 -155833 -136652 -48778
14894 -48778 -53775 -81983 -104654 -175315 -68938 148622 175044 244516 50634 29194 943
14883 943 -132714 12329 72990 135374 -53744 -251613 -405243 -374595 -329262 -145553 -106859
14872 -106859 -98109 144377 139185 -125078 -224411 -142408 64261 310774 298709 137959 182735
14861 182735 206150 114894 159925 381894 502156 343544 53025 24839 317297 484145
14851 484145 435425 233533 209937 271608 255483 250691 112981 155156 244922 275611 410842
14840 410842 417857 187750 118970 -93108 -234087 -85464 108546 94237 158854 217474 215233
$$ packed form
14916B90112J8388k95592j46224M9709j16426l16952r143K50977P2563N3816N9187
14905h9585P6957J29104L0848K4996n5595m4940r1085Q429j44962J9181Q7874
14894d8778m997k8208k2671p0661J06377K17560K6422O9472j93882k1440k8251
14883I43j33657J45043O0661O2384j89118j97869j53630L0648M5333J83709L8694
14872a06859Q750K42486n192k64263r9333Q2003K06669K46513j2065j60750M4776
14861A82735K3415r1256M5031K21969J20262j58612k90519k8186K92458J66848
14851D84145m8720k01892k3596O1671j6125m792j37710M2175Q9766L0689J35231
14840D10842P015k30107o8780k12078j40979J48623J94010j4309O4617N8620k241
$$ plain form
14829 215233 135937 140354 148609 -272625 -326031 -105810 44407 122692 156672 -44274 4296
14818 4296 144470 198830 90359 31132 -107425 -34427 16127 105902 79074 119270 127713
14807 127713 115272 263856 242151 193335 71223 26219 139047 218385 202538 331880 256150
14796 256150 199328 115995 79496 334970 298237 49109 -4769 -15545 157359 95066 -36692
14785 -36692 -102768 6612 41605 -53579 4613 32176 -7348 -145441 -340246 -307234 -232633
14774 -232633 -183792 -198151 -70023 -83271 -75995 -56013 -12116 84238 110613 161489 -21185
14763 -21185 -249719 -202339 48062 258772 13605 -198430 -174556 -270329 -360995 -355421 -98924
14752 -98924 -221928 -462875 -507607 -266642 -330890 -196366 -36721 -179094 -93112 -11498
$$ packed form
14829B15233p9296M417Q255m21234n3406K20221J50217P8285L3980k00946M8570
14818D296J40174N4360j08471n9227j38557P2998N0554Q9775k6828M0196Q443
14807A27713j2441J48584k1705m8816j22112m5004J12828P9338j5847J29342p5730
14796B56150n6822q3333l6499K55474l6733k49128n3878j0776J72904o2293j31758
14785c6692o6076J09380L4993r5184N8192K7563l9524j38093j94805L3012P4601
14774b32633M8841j4359J28128j3248P276J9982M3897R6354K6375N0876j82674
14763b1185k28534M7380K50401K10710k45167k12035K3874r5773r0666N574K56497
14752i8924j23004k40947m4732K40965o4248J34524J59645j42373Q5982Q1614
$$ plain form
14742 -11498 -116193 -169033 -103764 -53887 70075 244893 137780 -46782 -185809 -204649
14732 -204649 -238897 -236693 -159314 -122409 20110 363119 329985 97112 32085 93543 293508
14721 293508 153687 -119480 59417 65610 36441 53402 24572 167457 356777 362756 264593
14710 264593 213807 127534 279553 289358 77042 21781 111461 272250 189698 -89654 -141635
14699 -141635 -31836 185660 184130 207103 77148 27369 112111 177380 70694 134521 222761
14688 222761 -3669 -292838 -333239 -283790 -81944 97797 154913 213575 103785 -101065
14678 -101065 -169972 -21272 137437 -130371 -259975 -282887 -390805 -546886 -445896 -160296
14668 -160296 -247195 -146507 -22556 35266 65803 65202 109669 22883 -132176 -182831 -149861
$$ packed form
14742a1498j04695n2840O5269M9877J23962J74818j07113j84562j39027j8840
14732b04649l4248K204P7379L6905J42519L43009l3134k32873o5027O1458J99965
14721B93508j39821k73167J78897O193k9169J6961k8830J42885J89320N979r8163
14710B64593n0786q6273J52019R805k12316n5261Q9680J60789q2552k79352n1981
14699a41635J09799K17496j530K2973j29955m9779Q4742O5269j06686O3827Q8240
14688B22761k26430k89169m0401M9449K01846J79741N7116N8662j09790k04850
14678a01065o8907J48700J58709k67808j29604k2912j07918j56081J00990K85600
14668a60296q6899J00688J23951N7822L0537o01M4467q6786j55059n0655L2970
$$ plain form
14657 -149861 -21615 -112528 -248105 -223741 -152819 45458 20379 -215500 -458861 -298687
14647 -298687 -153588 -38911 132489 226282 362985 331807 180459 94997 20110 -7851
14637 -7851 -69937 44548 22138 -103096 -237570 -184906 10719 211413 181286 15248 -16138
14626 -16138 64493 59555 87618 89205 77041 173174 -2699 -6341 94693 92397 36657 185412
14614 185412 218560 241258 447027 649261 670460 447308 164842 -76936 -237137 -164660
14604 -164660 46586 -25532 -133932 -51430 -131054 -164740 106136 98003 39465 -77610 -53146
14593 -53146 -95006 -227377 -282519 -223420 -278051 -306397 -88689 -117340 -204712 -81934 235488
14582 235488 410022 355472 193151 113862 101872 58960 4170 -142638 -152207 -175098 -91892
$$ packed form
14657a49861J28246r0913j35577K4364P0922J98277k5079k35879k43361J60174
14647b98687J45099J14677J71400R3793J36703l1178j51348q5462p4887k7961
14637g851o2086J14485k2410j25234j34474N2664J95625K00694l0127j66038l1386
14626a6138Q0631m938K8063J587j2164R6133j75873l642J01034k296n5740J48755
14614A85412L3148K2698K05769K02234K1199k23152k82466k41778j60201P2477
14604a64660K11246p2118j08400Q2502p9624l3686K70876q133n8538j17075K4464
14593e3146m1860j32371n5142N9099n4631k8346K17708k8651q7372J22778L17422
14582B35488J74534n4550j62321p9289j1990m2912n4790j46808r569k2891Q3206
$$ plain form
14571 -91892 -132457 -111656 -92306 -103595 -227 38583 -77545 -77339 -66095 -141840 -33092
14560 -33092 34839 -22296 -111366 -41290 159001 285066 110122 -102242 -221623 -241244 -155628
14549 -155628 -6129 -17886 -44742 -89774 -12828 -2370 -6956 46804 -44290 -177814 -181123
14538 -181123 -23983 -5856 73772 -75372 -199662 -259226 -225201 -27405 42609 364323
14528 364323 299048 258099 40460 -32907 -19882 -75209 -20142 191426 218837 319309 348507
14517 348507 404837 324671 225245 170497 23682 -161710 -80023 -93842 -89024 -78200 -137016
14506 -137016 -94264 -78678 -39731 -120427 -204436 -74940 -330837 -343348 -188188 78071 328230
14495 328230 359216 67858 -130341 -169624 -35363 16197 28415 -65874 -186697 -152668 -31527
$$ packed form
14571i1892m0565K0801J9350j1289J03368L8810j16128K06J1244p5745J08748
14560c3092O7931n7135q9070P0076K00291J26065j74944k12364j19381j9621Q5616
14549a55628J49499j1757k6856m5032P6946J0458m586N3760r1094j33524l309
14538a81123J57140J8127P9628j49144j24290n9564L4025J97796P0014L21714
14528C64323o5275m0949k17639p3367J3025n5327N5067K11568K7411J00472K9198
14517C48507N6330q0166r9426n4748j46815j85392Q1687j3819M818J0824n8816
14506a37016M2752J5586L8947q0696q4009J29496k55897j2511J55160K66259K50159
14495C28230L0986k91358j98199l9283J34261N1560J2218r4289j20823L4029J21141
$$ plain form
14484 -31527 149894 225021 21779 202501 343046 232675 174551 -74872 9812 -59131
14474 -59131 -159622 -122193 -75936 80218 100598 95636 215014 208060 16922 5809 243464
14463 243464 255749 259304 125560 -70010 -90608 -59528 -13051 66703 -3583 -229433 -239640
14452 -239640 248 5120 -178071 -199687 -128195 -131031 122772 166582 138980 96616 215335
14441 215335 293285 328925 206226 -58163 -328851 -392903 -296328 -261979 -205304 76023 5922
14430 5922 -92401 -216692 -51761 6932 -123394 -122582 -54097 -147046 -255518 -232608 173102
14419 173102 320379 180757 222209 158321 214238 172765 78327 -4735 -71684 25551 1597
14408 1597 15914 35765 -52222 89768 5797 -125865 -121080 -194533 -332250 -379087 -183085
$$ packed form
14484c1527J81421P5127k03242J80722J40545j10371n8124k49423Q4684o8943
14474e9131j00491L7429M6257J56154K0380m962J19378o954j91138j1113K37655
14463B43464J2285L555j33744j95570k0598L1080M6477P9754p0286k25850j0207
14452b39640K39888M872j83191k1616P1492k836K53803M3810k7602m2364J18719
14441B15335P7950L5640j22699k64389k70688o4052R6575L4349N6675K81327p0101
14430E922r8323j24291J64931N8693j30326Q12O8485r2949j08472K2910M05710
14419A73102J47277j39622M1452o3888N5917m1473r4438q3062o6949R7235k3954
14408A597J4317J9851q7987J41990q3971j31662M785p3453j37717m6837J96002
$$ plain form
14397 -183085 15340 174404 171395 128040 32058 -96257 -196425 -178689 -248071 -118738 -8833
14386 -8833 94319 220672 178328 -117945 -245486 -202097 -77520 -193602 -213704 -239570 -270061
14375 -270061 -266259 -298832 -261054 -148995 -37143 -128344 -113799 26582 32783 280757 306115
14364 306115 320639 253119 -10269 -215448 -321158 -298355 -68735 56033 113182 79593
14354 79593 -60874 -103461 -144547 -362870 -496366 -502141 -384186 -343408 -298952 -342942 -616412
14343 -616412 -546574 -315825 -340398 -309158 -34318 176631 30680 -9837 -166186 -285242
14333 -285242 -271878 -99880 -196186 -411945 -458139 -337040 -440796 -357584 -177999 65392
14323 65392 242021 278427 444884 458530 224551 -191007 -238428 -77570 -8409 -286049
$$ packed form
14397a83085J98425J59064l009m3355r5982j28315j00168J7736o9382J29333J09905
14386h833J03152J26353m2344k96273j27541M3389J24577j16082k0102k5866l0491
14375b70061L802l2573L7778J12059J11852r1201J4545J40381O201K47974K5358
14364C06115J4524o7520k63388k05179j05710K2803K29620J24768N7149l3589
14354G9593j40467m2587m1086k18323j33496n775J17955M0778M4456m3990k73470
14343f16412O9838K30749k4573L1240K74840K10949j45951m0517j56349j19056
14333b85242J3364J71998r6306k15759m6194J21099j03756Q3212J79585K43391
14323F5392J76629L6406J66457J3646k33979m15558m7421J60858O9161k77640
$$ plain form
14313 -286049 -314350 -233924 -135439 -146379 -185572 -235065 -132996 28901 -157275 -288124 -258474
14302 -258474 -320539 -529799 -616714 -653941 -513202 -145707 -5102 125786 72715 -70257
14292 -70257 -15631 -169346 -336327 -381741 -232398 -65612 69006 48350 8137 -147301
14282 -147301 -232573 -239801 -244126 -195450 -259483 -365550 -332432 -448777 -370475 -179013 -45432
14271 -45432 -33002 -351860 -281120 -181655 -215146 -104520 -89653 -17423 66151 46800 77973
14260 77973 294669 261243 222165 161685 98656 23917 -52250 17347 71457 93380 86985 -15324
14248 -15324 126734 145839 107410 255909 333305 182443 100524 231641 220178 132306 119411
14237 119411 23527 -141516 -177531 -168181 -74471 -67591 65832 77685 252663 360110 342391
$$ packed form
14313b86049k8301Q0426R8485j0940l9193m9493J02069J61897j86176j30849K9650
14302b58474o2065k09260q6915l7227J40739L67495J40605J30888n3071j42972
14292g0257N4626j53715j66981m5414J49343J66786J34618k0656m0213j55438
14282a47301q5272p228m325M8676o4033j06067L3118j16345P8302J91462J33581
14271d5432J2430l18858P0740R9465l3491J10626J4867P2230Q3574j9351L1173
14260G7973K16696l3426l9078o0480o3029p4739p6167O9597N4110K1923o395j02309
14248a5324J42058J9105l8429J48499P7396j50862q1919J31117j1463q7872j2895
14237A19411r5884j65043l6015R350R3710O880J33423J1853J74978J07447j7719
$$ plain form
14226 342391 144581 113735 142785 108846 58971 -3917 117227 76307 10533 105303 151117
14215 151117 205467 125213 24764 81828 90389 -18085 -194868 -159227 -182818 -336355 -248361
14204 -248361 -35340 -18383 -124449 -284003 -81349 114721 138546 167483 265204 426439
14194 426439 423230 276316 149551 56382 -10949 -84111 -99674 -45425 -76819 36206 102921
14183 102921 -90809 -254870 -165373 -13437 -155515 -88002 -13960 184298 435879 469596
14173 469596 525036 367841 189762 153793 101310 52148 18816 -33633 -328860 -234693 -68416
14162 -68416 -111234 67928 93098 -129460 -18403 -81738 -489947 -447933 -289071 -207453 -185973
14151 -185973 -224017 -306315 -180540 -123965 -296974 -199804 -15931 5044 -80486 161001 279678
$$ packed form
14226C42391j97810l0846K9050l3939m9875o2888J21144m0920o5774R4770M5814
14215A51117N4350q0254j00449N7064Q561j08474j76783L5641k3591j53537Q7994
14204b48361K13021J6957j06066j59554K02654J96070K3825K8937R7721J61235
14194D26439l209j46914j26765r3169o7331p3162j5563N4249l1394J13025O6715
14183A02921j93730j64061Q9497J51936j42078O7513P4042J98258K51581L3717
14173D69596N5440j57195j78079l5969n2483m9162l3332n2449k95227R4167J66277
14162f8416m2818J79162K5170k22558J11057o3335m08209M2014J58862Q1618K1480
14151a85973l8044q2298J25775N6575j73009R7170J83873K0975q5530K41487J18677
$$ plain form
14140 279678 411674 458145 380958 443227 456599 341440 271340 326431 283436 140871 203817
14129 203817 129537 61131 -109661 42412 249898 38316 14961 40681 -122063 -223845
14119 -223845 -15363 86034 105466 101662 194984 146995 18405 -158243 -442028 -358362 -187897
14108 -187897 87194 192598 -33427 -273538 -242876 -213485 -109590 106624 107591 55813 73195
14097 73195 78868 84476 41535 25416 -41553 -129606 34788 94403 -149405 -105286 -159003 -122864
14085 -122864 -251864 -167060 -34964 -173405 -153849 -110328 -41389 17287 -34212 128583 -20533
14074 -20533 -97895 -107468 -295241 -441671 -326848 -119556 -65771 -141079 -184218 72528 296775
14063 296775 246307 216171 66396 -146629 -111098 71778 6920 -7760 6436 -142457 -186456
$$ packed form
14140B79678J31996M6471p7187O2269J3372j15159p0100N5091m2995j42565O2946
14129B03817p4280o8406j70792J52073K07486k11582k3355K5720j62744j01782
14119b23845K08482J01397J9432l804R3322m7989j28590j76648k83785Q3666J70465
14108a87897K75091J05404k26025k40111L0662K9391J03895K16214R67n1778J7382
14097G3195N673N608m2941j6119o6969q8053J64394N9615k43808M4119n3717L6139
14085a22864j29000Q4804J32096j38441J9556M3521O8939N8676n1499J62795j49116
14074b0533p7362r573j87773j46430J14823K07292N3785p5308m3139K56746K24247
14063B96775n0468l0136j49775k13025L5531J82876o4858j4680J4196j48893m3999
$$ plain form
14052 -186456 -160539 -78215 35420 101401 17609 -144125 -239745 -34907 36557 30890 89117
14041 89117 -11876 86761 217284 18007 -78247 -54448 256453 254597 -126804 -383278 -426518
14030 -426518 -345853 -241785 -167885 -123043 -5202 18420 -43953 -200641 -88210 127803
14020 127803 410798 382040 224631 -65213 -190501 -274539 -53477 22918 -113227 -282233
14010 -282233 -267371 5650 80337 198440 169045 125425 265353 172456 264120 254132 148056
13999 148056 24152 3247 14419 119647 -62011 -143123 -141145 -33010 -85105 -277995 -264182
13988 -264182 -168376 -215660 -335805 -231559 -180928 -295259 -148474 -94289 -170448 -129444 -137531
13977 -137531 -71266 -56006 -20310 49887 144199 337914 194019 -1878 -56026 -64368 2625
$$ packed form
14052a86456K5917Q2324J13635O5981q3792j61734r5620K04838P1464n667N8227
14041H9117j00993R8637J30523j99277r6254K3799L10901j856l81401k56474m3240
14030d26518Q0665J04068P3900M4842J17841K3622o2373j56688J12431K16013
14020A27803K82995k8758j57409k89844j25288q4038K21062P6395j36145j69006
14010b82233J4862K73021P4687J18103k9395m3620J39928r2897R1664r988j06076
13999A48056j23904k0905J1172J05228j81658q1112J978J08135n2095j92890J3813
13988b64182R5806m7284j20145J04246N0631j14331J46785N4185p6159M1004q087
13977a37531O6265J5260L5696P0197R4312J93715j43895j95897n4148q342O6993
$$ plain form
13966 2625 -70507 -331335 -262005 -89175 -166692 -182561 -423195 -461211 -393768 -451163 -414237
13955 -414237 -254828 -150783 -38289 -73276 -250247 -315482 -218457 -28992 -9186 14052
13945 14052 -202321 -184597 -233236 -306494 -243504 150718 179383 -90084 -208864 72340 246907
13934 246907 384865 263488 165088 190222 147133 70633 -6629 -88520 -71480 -34668 -213231
13923 -213231 -247924 -207756 -167076 -332651 -239847 -124792 -353584 -283764 3742 105487
13913 105487 239183 136398 237011 267237 26873 -64868 -152129 -242415 -152448 -29553
13903 -29553 -74290 -333114 -480355 -269122 -207187 -155354 65081 29899 15035 122161 129579
13892 129579 61882 26803 -131319 -65940 -99642 -177897 -246938 -257119 -394160 -530581 -400902
$$ packed form
13966B625p3132k60828O9330J72830p7517j5869k40634l8016O7443n7395L6926
13955d14237J59409J04045J12494l4987j76971o5235R7025J89465J9806K3238
13945A4052k16373J7724m8639p3258O2990L94222K8665k69467j18780K81204J74567
13934B46907J37958j21377r8400K5134m3089p6500p7262q1891J7040L6812j78563
13923b13231l4693M0168M0680j65575R2804J15055k28792O9820K87506J01745
13913A05487J33696j02785J00613L0226k40364r1741q7261r0286Q9967J22895
13903b9553m4737k58824j47241K11233O1935N1833K20435l5182j4864J07126P418
13892A29579o7697l5079j58122O5379l3702p8255o9041j0181j37041j36421J29679
$$ plain form
13881 -400902 -304318 -355136 -182948 -38275 118752 219500 131572 -85677 -146927 -191722
13871 -191722 -198640 -313286 -259121 75336 54542 -329613 -349449 -351033 -168376 -172771 -130778
13860 -130778 111860 9646 -158832 -210163 3234 232323 422398 310691 119800 -78418
13850 -78418 -1695 107840 -20511 -50204 132811 -37168 -4811 -111311 -57989 48458
13840 48458 186532 231564 117133 30327 148508 207395 83776 -193566 -143493 -294224
13830 -294224 -419236 -235460 -99903 -7380 106271 29162 -17649 113548 190161 83720
13820 83720 -169383 -205392 -265781 -342204 -447200 -543461 -401617 -276280 -138937 10952
13810 10952 116394 139071 133413 124511 79700 87816 142089 60863 71775 77538 77011 196454
$$ packed form
13881d00902R6584n0818J72188J44673J57027J00748q7928k17249o1250m4795
13871a91722o918j14646N4165L34457k0794l84155j9836j584J82657m395M1993
13860a30778K42638j02214j68478n1331K13397K29089J90075j11707j90891j98218
13850g8418P6723J09535j28351k9693J83015j69979L2357j06500N3322J06447
13840D8458J38074M5032j14431q6806J18181N8887j23619k77342N0073j50731
13830b94224j25012J83776J35557R2523J13651p7109m6811J31197P6613j06441
13820H3720k53103l6009o0389p6423j04996r6261J41844J25337J37343J49889
13810A0952J05442K2677n658q902m4811Q116N4273q1226J0912N763n27J19443
$$ plain form
13798 196454 108356 56491 233014 348463 590440 578294 375495 233687 389245 212315
13788 212315 -95287 -196824 -177322 -77900 132402 -48069 -145121 47873 195838 278871
13778 278871 285735 210069 -44420 -239439 -311100 -252300 -244708 -165025 -352393 -326171 -145724
13767 -145724 -106206 -72572 -127725 -275066 -197310 29169 183927 117227 139974 -43249 -124519
13756 -124519 -189461 -127761 -56047 -5598 -65551 -151325 -161697 -29474 -6361 176 82907
13745 82907 130796 -136543 -129782 -213016 -126462 -46877 -109351 30274 133772 105714 180559
13734 180559 259162 139644 167465 -71405 -77104 104113 -25557 -129634 -48971 -103470 113720
13723 113720 178567 -55260 -144263 -86136 60805 212886 228661 251432 62413 -78179
$$ packed form
13798A96454q8098n1865J76523J15449K41977j2146k02799j41808J55558j76930
13788B12315l07602j01537J9502R9422K10302j80471r7052J92994J47965Q3033
13778B78871O864p5666k54489j95019p1661N8800P592P9683j87368K6222J80447
13767a45724L9518L3634n5153j47341P7756K26479J54758o6700K2747j83223q1270
13756a24519o4942O1700P1714N0449n9953q5774j0372J32223K3113O537Q2731
13745H2907M7889k67339O761q3234Q6554P9585o2474J39625J03498k8058P4845
13734A80559P8603j19518K7821k38870n699J81217j29670j04077Q0663n4499K17190
13723A13720O4847k33827q9003N8127J46941J52081J5775K2771j89019j40592
$$ plain form
13713 -78179 60583 -31238 -61162 -88768 -53592 16519 48347 -107903 -51847 -33611 129864
13702 129864 163860 21389 137948 165311 172291 64303 -54907 -53474 -78597 18171 91842
13691 91842 150219 8977 -80809 29668 -54046 -43833 53348 183652 499 -226527 -62488
13680 -62488 71628 153260 124477 87028 69276 -168545 -273904 -35809 -23394 22825 221833
13669 221833 351215 270866 105513 118137 168220 8329 -81500 -62438 -51907 -71763 -141852
13658 -141852 -27195 -25316 -152766 -148076 -136341 -8608 31156 116201 156683 181958 48773
13647 48773 -161889 -53084 -1769 -10665 18525 98693 75095 17648 11629 33535 -12017 -176736
13635 -176736 29984 70810 -91302 -95595 -200613 -376980 -223583 -65557 -6976 -70783
$$ packed form
13713g8179J38762r1821k9924k7606L5176P0111L1828j56250N6056J8236J63475
13702A29864L3996j42471J16559K7363O980j07988j19210J433k5123R6768P3671
13691I1842N8377j41242q9786J10477q3714J0213R7181J30304j83153k27026J64039
13680f2488J34116Q1632k8783l7449j7752k37821j05359K38095J2415M6219J99008
13669B21833J29382q0349j65353J2624N0083j59891q9829J9062J0531j9856p0089
13658a41852J14657J879j27450M690J1735J27733L9764Q5045M0482K5275j33185
13647D8773k10662J08805N1315q896K9190Q0168k3598n7447o019K1906m5552j64719
13635a76736K06720M0826j62112m293j05018j76367J53397J58026N8581o3807
$$ plain form
13625 -70783 -44704 -75066 -91949 -72296 218969 370060 307663 164890 19247 83803 -78093
13614 -78093 -220044 -29253 128782 301211 116414 -43608 -139369 -306930 -245545 -242723
13604 -242723 -178289 -204079 -226243 -191396 -151349 10793 98434 163130 137060 48462 129273
13593 129273 57038 73541 175168 186534 113942 128197 109344 7524 -85103 65095 101628
13582 101628 -1216 -87575 -150583 113369 223499 203369 212727 248975 208841 99506 145566
13571 145566 100065 222723 47223 -97615 -85344 -104700 -118064 -37193 -54624 -7429 -122676
13560 -122676 -241679 -198342 -56462 -66023 -43445 -8428 -202391 -242478 -204743 -193663 -334983
13549 -334983 -195988 -182338 -16127 -25821 72251 27271 -127716 -33162 217556 170986 -55137
$$ packed form
13625g0783K6079l0362j6883J9653K91265J51091o2397j42773j45643O4556j61896
13614g8093j41951J90791J58035J72429j84797j60022r5761j67561O1385K822
13604b42723O4434k5790k2164L4847M0047J62142Q7641O4696k6070q8598Q0811
13593A29273p2235J6503J01627J1366p2592J4255j8853j01820r2627J50198L6533
13582A01628j02844q6359o3008K63952J10130k0130R358L6248m0134j09335M6060
13571A45566m5501J22658j75500j44838J2271j9356j3364Q0871j7431M7195j15247
13560a22676j19003M3337J41880r561K2578L5017j93963m0087L7735J1080j41320
13549c34983J38995J3650J66211r694R8072m4980j54987R4554K50718m6570k26123
$$ plain form
13538 -55137 -118299 -88410 -147328 -178511 -140326 -87867 18802 15693 106976 96513 -80805
13527 -80805 -103323 -218656 -198146 -264009 -300990 -193829 -103136 -165550 -91154 -20166 -75798
13516 -75798 18855 -14837 125789 30717 -59971 -55501 -94070 -224321 -170176 -122608 -71695
13505 -71695 -133437 -85740 -103933 -101848 -7695 77335 -31147 169860 -3718 -222801 -169656
13494 -169656 -216321 -73886 -27581 89011 99679 122148 221749 358812 220447 46823
13484 46823 73975 185145 297008 65121 -67717 -178181 -231129 -111586 -8564 -125447
13474 -125447 -72240 32672 -8250 -45624 -70189 -57796 72862 -107025 -162081 -72216 69705
13463 69705 122629 -62826 -148672 33239 287333 233358 14356 8905 54221 165787 83490
$$ packed form
13538e5137o3162K9889n8918l1183L8185N2459J06669l109R1283j0463j77318
13527h0805k2518j15333K0510o5863l6981J07161R0693o2414P4396P0988n5632
13516g5798R4653l3692J40626r5072r0688M470l8569j30251N4145M7568N0913
13505g1695o1742M7697j8193K085R4153Q5030j08482K01007j73578k19083N3145
13494a69656m6665J42435M6305J16592J0668K2469R9601J37063j38365j73624
13484D6823K7152J11170J11863k31887j32838j10464n2948J19543J03022j16883
13474a25447N3207J04912m0922l7374k4565J2393J30658j79887n5056Q9865J41921
13463F9705N2924j85455q5846J81911K54094n3975k19002n451M5316J11566q2297
$$ plain form
13452 83490 135561 150774 93142 -55763 -100950 -287192 -207558 7988 -25423 -31823 -62099
13441 -62099 -53393 4647 57057 -81685 -59834 119506 -23362 1179 13920 38032 44776
13430 44776 33642 93141 77715 99510 103472 93379 -65873 -8275 256714 191002 12824
13419 12824 -271832 -378856 -281706 -81065 -111831 -7434 206319 414807 493563 386236
13409 386236 329579 304167 74429 -96693 -5614 67073 78300 133321 -89654 -97021 74909
13398 74909 335081 642185 661370 431519 316105 292371 132763 -121370 -142811 40934
13388 40934 179793 40117 -65783 -46571 52166 149780 105680 16949 -26490 101859 163521
13377 163521 191302 63603 138625 321132 333929 455541 411740 177406 68924 1870
$$ packed form
13452H3490N2071J5213n7632j48905m5187j86242P9634K15546l3411o400l0276
13441f2099Q706N8040N2410j38742K1851J79340j42868K4541J2741K4112O744
13430D4776j1134N9499j5426K1795L962j0093j59252N7598K64989o5712j78178
13419A2824k84656j07024R7150K00641l0766J04397K13753K08488P8756j07327
13409C86236n6657k5412k29738j71122R1079P2687J1227N5021k22975p367J71930
13398G4909K60172L07104J9185k29851j15414k3734j59608k54133k1441J83745
13388D0934J38859j39676j05900J9212R8737R7614m4100q8731m3439J28349O1662
13377A63521K7781j27699P5022J82507J2797J21612m3801k34334j08482o7054
$$ plain form
13367 1870 -94784 -347838 -414244 -237498 95209 219435 168577 94233 85978 10118 -134603
13356 -134603 -145823 35916 56020 -14860 -217425 -208434 -217279 -162214 9336 71180 -29055
13345 -29055 -144054 -280404 -244524 -233853 -127428 4063 64783 153205 154218 145779 307687
13334 307687 321025 198786 54876 65607 199776 220242 45855 -34039 11098 -22068 -52090
13323 -52090 -174874 -285250 -102337 -19172 53305 162780 145802 212800 66316 -8607 -147735
13312 -147735 -128608 41571 51496 -89990 -245155 -193170 -91647 -132836 7061 36796 60497
13301 60497 27941 54967 76448 -162676 -1274 257129 235738 223367 45351 79327 201848
13290 201848 289762 256810 301757 232440 86467 115327 180028 30413 -23736 203769 305118
$$ packed form
13367A870r6654k53054o6406J76746L32707J24226n0858p4344q255p5860j44721
13356a34603j1220J81739K0104p0880k02565Q991q845N5065J71550O1844j00235
13345b9055j14999j36350L5880J0671J06425J31491O0720Q8422J013q439J61908
13334C07687J3338j22239j43910J0731J34169K0466j74387p9894M5137l3166l0022
13323e2090j22784j10376J82913Q3165P2477J09475j6978O6998j46484p4923j39128
13312a47735J9127J70179R925j41486j55165N1985J01523m1189J39897K9735K3701
13301F0497l2556K7026K1481k39124J61402K58403k1391j2371j78016L3976J22521
13290B01848Q7914l2952M4947o9317j45973K8860O4701j49615n4149K27505J01349
$$ plain form
13279 305118 325086 151634 103489 31404 -201427 -219852 -6251 83284 -111746 -406778
13269 -406778 -411852 -257579 -45683 -49020 -151447 -167699 -170278 -100973 200242 391494 67685
13258 67685 -71090 86458 231745 157631 3163 -87629 -199013 -120898 -21842 86150
13248 86150 366837 386737 166492 62929 135070 200791 187506 283180 292982 298672 228158
13237 228158 245078 157544 38767 19872 3995 114861 48462 58720 255594 168020 77784
13226 77784 -118821 -125968 -48527 -51195 -30372 -151582 -184940 -150902 -18596 95784 202664
13215 202664 201123 192157 152977 168557 220921 110950 24639 75436 153234 175493 275539
13204 275539 96825 -4364 167285 232506 127750 78966 -16665 -9580 -27305 -69983 -101817
$$ packed form
13279C05118J9968j73452m8145p2085k32831j8425K13601Q9535j95030k95032
13269d06778n074J54273K11896l337j02427j6252k579O9305L01215J91252l23809
13258F7685j38775J57548J45287p4114j54468r0792j11384P8115R9056J07992
13248H6150K80687J9900k20245j03563P2141O5721j3285R5674R802N690p0514
13237B28158J6920q7534j18777j8895j5877J10866o6399J0258J96874q7574r0236
13226G7784j96605p147P7441k668K0823j21210l3358L4038J32306J14380J06880
13215B02664j541q966l9180J5580N2364j09971q6311N0797P7798K2259J00046
13204B75539j78714j01189J71649O5221j04756m8784r5631P085j7725m2678l1834
$$ plain form
13193 -101817 -48193 -105090 -21550 202113 101930 -37513 -46216 22508 -130847 -302602 -70014
13182 -70014 97646 362769 289723 -13022 83796 165338 217503 328688 176927 195513 101112
13171 101112 98921 77533 165941 118555 47703 96641 181853 492239 454376 464381 316614
13160 316614 225658 405305 422737 336594 104953 -15463 -24023 37852 39456 -72989 33375
13149 33375 89405 -43627 9505 35612 -51941 -21196 42971 178743 234266 39479 -84862
13138 -84862 133148 -59739 -231410 4887 114391 382794 360378 285953 160135 140486
13128 140486 51926 -9027 170355 142435 29961 146345 236765 206687 236209 288698 266770
13117 266770 215293 164223 220038 112501 270096 7771 -224774 -312531 -385535 -36062
$$ packed form
13193a01817N3624n6897Q3540K23663j00183j39443q703O8724j53355j71755K32588
13182g0014J67660K65123p3046l02745R6818Q1542N2165J11185j51761J8586r4401
13171A01112k191k1388Q8408m7386p0852M8938Q5212L10386l7863J0005j47767
13160C16614r0956J79647J7432q6143k31641j20416q560O1875J604j12445J06364
13149C3375N6030j33032N3132K6107q7553L0745O4167J35772N5523j94787j24341
13138h4862K18010j92887j71671K36297J09504K68403k2416p4425j25818j9649
13128A40486q8560o0953J79382k7920j12474J16384R0420l0078K9522N2489k1928
13117B66770n1477n1070N5815j07537J57595k62325k32545q7757p3004L49473
$$ plain form
13107 -36062 229821 184420 121494 224230 246984 155336 221264 111290 -216762 -104571 -111354
13096 -111354 -318406 -417533 -266731 -24346 237926 280224 281927 266405 277957 254337 11265
13085 11265 60019 49610 11979 8893 -159773 -166374 241885 548990 868955 1385399 1470239
13074 1470239 1266588 971096 820396 640294 396330 247057 157066 142933 248694 240044
13064 240044 76370 86107 -25631 -13352 235398 251491 157805 24247 135061 -64098
13054 -64098 -123278 -140094 -74611 106066 266179 225186 157970 227897 215973 221466 251535
13043 251535 215006 -29442 -193476 32386 238336 358987 386947 443502 673725 1272874
13033 1272874 2076781 2860670 3720517 4206201 4209138 3635830 2654658 1768935 1174351 871967
$$ packed form
13107c6062K65883m5401o2926J02736K2754r1648O5928j09974l28052J12191o783
13096a11354k07052r9127J50802K42385K62272M2298J703j5522J1552k3620k43072
13085A1265M8754j0409l7631l086j68666o601M08259L07105L19965N16444Q4840
13074A470239k03651k95492j50700j80102k43964j49273q9991j4133J05761q650
13064B40044j63674R737j11738J2279K48750J6093r3686j33558J10814j99159
13054f4098n9180j6816O5483J80677J60113m0993o7216O9927j1924N493L0069
13043B51535l6529k44448j64034K25862K05950J20651K7960N6555K30223N99149
13033A272874Q03907P83889Q59847M85684K937n73308r81172q85723n94584l02384
$$ plain form
13023 871967 578641 366324 309286 203456 297783 410525 392478 175200 11783 -101126
13013 -101126 -162029 -59427 -182838 -188421 -43119 -49659 219685 431649 198115 86374
13003 86374 -32988 -60016 -108370 81380 154516 161292 90896 117046 229124 229378 221897 162556
12991 162556 382173 879723 1233560 1914067 2968832 4161439 4816923 4757870 3865250
12982 3865250 2883585 1805177 1160593 940322 790735 729517 483828 223692 196736 95718
12972 95718 144849 165470 14265 50318 179162 119893 235054 52561 -92637 104280
12962 104280 169039 85629 150883 339432 320870 394742 311758 251469 118650 95519 215613
12951 215613 256378 166547 56294 141921 244508 316277 277523 543826 931690 1069136
$$ packed form
13023H71967k93326k12317n7038j05830R4327J12742j8047k17278j63417j12909
13013a01126o0903J02602j23411n583J45302o540K69344K11964k33534j11741
13003H6374j19362k7028m8354J89750P3136O776p0396K6150J12078K54p481n9341
12991A62556K19617M97550L53837O80507J054765J192607O55484n9053q92620
12982C865250r81665j078408o44584k20271j49587o1218k45689k60136k6956j01018
12972I5718M9131K0621j51205L6053J28844n9269J15161j82493j45198J96917
12962A04280O4759q3410O5254J88549j8562P3872q2984o0289j32819k3131J20094
12951B15613M0765q9831j10253Q5627J02587P1769l8754K66303L87864J37446
$$ plain form
12941 1069136 1247605 1336717 1345893 1312775 1097770 884941 721786 537996 243060 172000
12931 172000 288673 217328 255171 279459 111358 127129 240343 517729 532845 546460 290238
12920 290238 62052 -44311 -42864 106007 259926 153243 127304 186934 19417 150524
12910 150524 139826 183898 196248 169401 150649 153615 67290 -28549 -110633 -109245 -205109 -262407
12898 -262407 -88969 262948 468962 558521 553623 584387 365766 199160 55150 28231
12888 28231 113259 242629 350209 289240 285586 207391 205160 160136 84036 19349 -16939 112335
12876 112335 119047 41831 121541 222544 74407 42404 20776 -110872 57048 193208 63478
12865 63478 -72332 -96940 -30672 -90828 -11976 -86247 -162000 -154798 -6857 25145 169006
$$ packed form
12941A069136J78469Q9112R176l3118k15005k12829j63155j83790k94936p1060
12931A72000J16673p1345L7843K4288j68101J5771J13214K77386J5116J3615k56222
12920B90238k28186j06363J447J48871J53919j06683k5939N9630j67517J31107
12910A50524j0698M4072J2350k6847j8752K966q6325r5839q2084J388r5864n7298
12898b62407J73438L51917K06014Q9559m898L0764k18621j66606j44010k6919
12888B8231Q5028J29370J07580o0969l654p8195k231m5024p6100o4687l6288J29274
12876A12335O712p7216P9710J01003j48137l2003k1628j31648J67920J36160j29730
12865F3478j35810k4608O6268o0156P8852p4271p5753P202J47941L2002J43861
$$ plain form
12854 169006 181433 202153 320853 464192 339120 102028 -170165 -197603 -123142 64403
12844 64403 231107 123234 72239 67738 208459 405774 441055 350474 319596 363300 475277
12833 475277 384480 307955 150007 269963 333534 169477 207778 324548 324507 218948 208440
12822 208440 340122 568106 544249 227743 3787 -100909 -115122 6225 49556 80665
12812 80665 204171 350066 413373 288429 129169 116593 259178 336630 244270 152701 62123
12801 62123 128842 412779 336572 187250 190845 424909 370938 272166 245536 184247 245342
12790 245342 287243 406390 497193 312898 269435 219019 181064 67119 169612 171600 189758
12779 189758 112129 96609 89966 199824 273240 449017 430687 360354 261968 121256 243321
$$ packed form
12854A69006J2427K0720J18700J43339j25072k37092k72193k7438P4461J87545
12844F4403J66704j07873n0995m501J40721J97315L5281r0581l0878M3704J11977
12833D75277r0797p6525j57948J19956O3571j64057L8301J16770m1j05559j0508
12822B08440J31682K27984k3857l16506k23956j04696j4213J21347M3331L1109
12812H0665J23506J45895O3307j24944j59260j2576J42585P7452r2360r1569r0578
12801F2123O6719K83937p6207j49322L595K34064n3971r8772k6630o1289O1095
12790B45342M1901J19147R0803j84295m3463n0416l7955j13945J02493J988J8158
12779A89758p7629j5520o643J09858P3416J75777j8330p0333r8386j40712J22065
$$ plain form
12768 243321 395818 224321 409909 482552 299197 128713 -51935 -88067 -10109 210586
12758 210586 246193 204511 234744 -118179 -198266 -31925 73656 11430 -297643 -310408 -144344
12747 -144344 135712 405293 189144 151766 119229 -59743 -73772 172844 340771 390313
12737 390313 287108 204231 -25424 -220101 -144317 -79188 85353 228212 267552 224163
12727 224163 413567 577905 587834 437221 338001 392367 334184 244804 440396 482914 367284
12716 367284 198711 248643 75651 11005 277019 407127 236851 10439 120425 359346
12706 359346 328541 318267 241199 318313 319245 229308 276773 177989 14521 -38988 -9306 114961
12694 114961 377003 495452 351391 373569 433316 329199 382818 545765 464281 398958
$$ packed form
12768B43321J52497j71497J85588P2643j83355j70484j80648l6132P7958K20695
12758B10586L5607m1682L0233l52923q0087J66341J05581o2226l09073j2765J66064
12747a44344K80056K69581k16149l7378l2537j78972j4029K46616J67927M9542
12737C90313j03205q2877k29655j94677P5784O5129J64541J42859L9340m3389
12727B24163J89404J64338R929j50613r9220N4366n8183q9380J95592M2518j15630
12716C67284j68573M9932j72992o4646K66014J30108j70276k26412J09986K38921
12706C59346l0805j0274p7068P7114R32q9937M7465r8784j63468n3509K9682J24267
12694A14961K62042J18449j44061K2178N9747j04117N3619J62947q1484o5323
$$ plain form
12684 398958 353229 356412 102353 -229088 46637 334571 438219 447769 349025 276830 391150
12673 391150 232155 278682 457683 555282 435677 251541 289826 248000 189211 309484
12663 309484 480776 539776 384536 92886 -54794 41747 134955 119288 -30213 49237
12653 49237 151164 85523 224935 303464 332309 222657 209033 150007 -34003 182427 327990
12642 327990 432399 196597 -27002 -48430 46894 126713 184127 94215 205779 310164
12632 310164 246757 393482 377045 447915 577318 446278 334273 340796 286155 386457 466996
12621 466996 579794 716985 783383 731832 499104 256183 231473 273043 258884 360097
12611 360097 456445 322112 268008 191409 340147 352434 280506 545208 536881 384406 505188
$$ packed form
12684C98958m5729L183k54059l31441K75725K87934J03648R550r8744p2195J14320
12673C91150j58995M6527J79001R7599j19605j84136L8285m1826n8789J20273
12663C09484J71292N9000j55240k91650j47680R6541R3208j5667j49501P9450
12653D9237J01927o5641J39412P8529K8845j09652j3624n9026j84010K16430J45563
12642C27990J04409k35802k23599k1428R5324P9819N7414q9912J11564J04385
12632C10164o3407J46725j6437P0870J29403j31040j12005O523n4641J00302Q0539
12621D66996J12798J37191O6398n1551k32728k42921k4710M1570j4159J01213
12611C60097R6348j34333n4104p6599J48738J2287p1928K64702q327j52475J20782
$$ plain form
12600 505188 547043 291210 193589 244216 290009 284354 416928 631561 742670 635805 484442
12589 484442 524819 501733 319362 315867 350022 101407 21661 55449 398947 508088 404282
12578 404282 517593 580812 615139 440095 220409 149547 83970 281825 420641 377352
12568 377352 296046 443427 361603 161500 125061 107431 282360 384115 330600 445310
12558 445310 396299 323875 134817 120208 315431 392307 441879 505966 587651 632337 463446
12547 463446 489671 539780 564606 450817 223821 268766 331418 282543 263205 246146 421537
12536 421537 406442 481009 562282 371496 271124 139626 181956 300884 328761 488247
12526 488247 606547 445574 443354 416988 453655 406326 332501 414296 539903 647205 561766
$$ packed form
12600E05188M1855k55833r7621N0627M5793n655J32574K14633J11109j06865j51363
12589D84442M0377k3086j82371l495L4155k48615p9746L3788L43498J09141j03806
12578D04282J13311O3219L4327j75044k19686p0862o5577J97855J38816m3289
12568C77352q1306J47381q1824k00103l6439j7630J74929J01755n3515J14710
12558D45310m9011p2424j89058j4609J95223P6876M9572O4087Q1685M4686j68891
12547D63446K6225N0109K4826j13789k26996M4945O2652m8875j9338j7059J75391
12536D21537j5095P4567Q1273j90786j00372j31498M2330J18928K7877J59486
12526D88247J18300j60973k220k6366L6667m7329p3825Q1795J25607J07302q5439
$$ plain form
12515 561766 513398 467587 558550 757107 722217 646234 566092 638566 891041 855752 702035
12504 702035 861043 1013677 948737 927729 689121 604457 676251 651661 604874 540168 562416
12493 562416 575724 358235 184993 333594 530906 542163 466414 320176 317180 446450
12483 446450 525840 542746 617028 770614 539704 292009 254721 383837 492762 768015
12473 768015 787270 695961 747283 908791 852623 664378 596082 607611 548581 367060 225098
12462 225098 330813 453235 406199 426340 541658 670097 663185 485637 236518 137868
12452 137868 213383 416497 495790 551053 563372 587056 489197 302675 374860 680872 926544
12441 926544 1045760 843485 493318 297144 406343 665788 774463 747386 551712 611280
$$ packed form
12515E61766m8368m5811R0963J98557l4890p5983q0142P2474K52475l5289j53717
12504G02035J59008J52634o4940k1008k38608q4664P1794k4590m6787o4706K2248
12493E62416J3308k17489j73242J48601J97312J1257p5749j46238k996J29270
12483D46450P9390J6906P4282J53586k30910k47695l7288J29116J08925K75253
12473G68015J9255r1309N1322J61508n6168j88245o8296J1529n9030j81521j41962
12462B25098J05715J22422m7036K0141J15318J28439o912j77548k49119r8650
12452A37868P5515K03114P9293N5263J2319K3684r7859j86522P2185L06012K45672
12441I26544J19216k02275l50167j96174J09199K59445J08675k7077j95674N9568
$$ plain form
12431 611280 506082 653879 670908 679466 708313 662933 605445 515376 673741 499814 538917
12420 538917 543464 469312 557053 690565 763780 744048 766349 767766 819766 722721 744078 756489
12408 756489 664841 620810 831682 954621 898181 727290 815712 955359 618184 503929
12398 503929 561427 588119 510460 472025 408777 558414 855898 939019 805544 801817 817080
12387 817080 1036508 1125594 866585 707798 850970 799926 636520 674112 575487 534681
12377 534681 561635 598798 567245 529975 700263 692471 662528 898478 1101626 1195207 1146842
12366 1146842 923067 762146 787492 909464 998723 972459 765487 790647 752910 833728
12356 833728 829725 717005 814301 842193 647784 578911 750355 845898 835314 839668 875164
$$ packed form
12431F11280j05198J47797J7029Q558K8847m5380n7488r0069J58365j73927L9103
12420E38917M547p4152Q7741J33512P3215j9732K2301J417N2000r7045K1357J2411
12408G56489r1648m4031K10872J22939n6440j70891Q8422J39647l37175j14255
12398E03929N7498K6692p7659l8435o3248J49637K97484Q3121j33475l727J5263
12387H17080K19428Q9086k59009j58787J43172n1044j63406L7592r8625m0806
12377E34681K6954L7163l1553l7270J70288p792k9943K35950K03148R3581m8365
12366A146842k23775j60921K5346J21972Q9259k6264k06972K5160l7737Q0818
12356H33728m003j12720R7296K7892j94409o8873J71444R5543j0584M354L5496
$$ plain form
12345 875164 1064328 1085516 850051 828126 904492 768102 762732 931777 975205 1008107 1007465
12334 1007465 956096 926417 1100313 1059923 880418 836928 878801 943208 715984 643957 938913
12323 938913 1016394 782959 803654 945353 946321 855789 972899 1002713 943422 1033163 1096633
12312 1096633 945003 1004075 1201311 1405783 1506558 1471028 1471647 1255780 1030898 1083354
12302 1083354 1136256 980705 1210220 1339532 1302202 1411953 1365699 1296932 1153259 1149714
12292 1149714 1221256 1480031 1461851 1348884 1142587 1229750 1487044 1626174 1286717 1056972
12282 1056972 1107545 1060946 893534 969485 1114205 1238020 1210640 1215805 1392343 1294466 1218320
12271 1218320 1179177 986279 938156 1101482 1296966 1425660 1467123 1316436 1338927 1455411
$$ packed form
12345H75164J89164K1188k35465k1925P6366j36390n370J69045M3428L2902o42
12334A007465n1369k9679J73896m0390j79505m3490M1873O4407k27224p2027K94956
12323I38913P7481k33435K0695J41699R68r0532J17110K9814n9291Q9741O3470
12312A096633j51630N9072J97236K04472J00775l5530O19k15867k24882N2456
12302A083354N2902j55551K29515J29312l7330J09751m6254o8767j43673l545
12292A149714P1542K58775j8180j12967k06297Q7163K57294J39130l39457k29745
12282A056972N0573m6599j67412P5951J44720J23815k7380N165J76538r7877p6146
12271A218320l9143j92898m8123J63326J95484J28694M1463j50687K2491J16484
$$ plain form
12261 1455411 1555497 1597025 1613549 1512664 1479302 1454072 1502410 1450333 1582689 1525450 1441368
12250 1441368 1419689 1489061 1607396 1622058 1696952 1628461 1488490 1431606 1347578 1599600 1623445
12239 1623445 1548494 1554931 1572080 1685590 1760209 1839453 2018238 2203102 2259107 2208786 1996449
12228 1996449 1922918 1932550 1863545 1928352 2001035 2079725 1939638 1899766 2053026 1872627 1987054
12217 1987054 2070598 2036747 2091274 2251026 2304260 2196525 2069130 2012309 1956888 1919805 2092702
12206 2092702 2073661 2052637 2105438 2353251 2340707 2286296 2206436 2347235 2453465 2507653 2484223
12195 2484223 2416867 2340443 2394794 2630570 2587958 2458112 2542458 2528027 2535697 2750500 2777492
12184 2777492 2822335 2796288 2804957 2694458 2572453 2761426 2964919 3107026 3022989 2847520
$$ packed form
12261A455411J00086M1528J6524j00885l3362k5230M8338n2077J32356n7239q4082
12250A441368k1679O9372J18335J4662P4894o8491j39971n6884q4028K52022K3845
12239A623445p4951O437J7149J13510P4619P9244J78785J84864N6005n0321k12337
12228A996449p3531R632o9005O4807P2683P8690j40087l9872J53260j80399J14427
12217A987054Q3544l3851N4527J59752N3234j07735j27395n6821n5421l7083J72897
12206B092702j9041k1024N2801K47813j2544n4411p9860J40799J06230N4188k3430
12195B484223o7356p6424N4351K35776m2612j29846Q4346j4431P670K14803K6992
12184B777492M4843k6047Q669j10499j22005J88973K03493J42107q4037j75469
$$ plain form
12174 2847520 2731892 2611437 2643523 2644679 2889987 2947199 2841266 2763152 2796532 2841358 2776208
12163 2776208 2699641 2717202 2865946 3130374 3332219 3411973 3476986 3207679 3040706 3110058
12153 3110058 3118200 3255677 3150606 3007767 3242706 3375603 3490449 3587603 3658421 3681571
12143 3681571 3607651 3570010 3487103 3457935 3573601 3691250 3795867 3910412 4029518 4185404
12133 4185404 4305972 4181804 4037870 3892676 4030448 4084858 4063116 4014735 4074542 4070370
12123 4070370 3959638 3954520 4145701 4084067 3958241 3974099 4096140 4276208 4365242 4486711
12113 4486711 4608382 4834437 4731239 4865956 5120105 5235217 5073846 4968207 5176068
12104 5176068 5254115 5074956 4886963 4944978 5167054 5311639 5424384 5456352 5566590 5577648
$$ packed form
12174B847520j15628j20455L2086J156K45308N7212j05933p8114L3380M4826o5150
12163B776208p6567J7561J48744K64428K01845P9754O5013k69307j66973O9352
12153C110058Q142J37477j05071j42839K34939J32897J14846R7154P0818K3150
12143C681571p3920l7641q2907k9168J15666J17649J04617J14545J19106J55886
12133D185404J20568j24168j43934j45194J37772N4410k1742m8381N9807m172
12123D070370j10732n118J91181o1634j25826J5858J22041J80068Q9034J21469
12113D486711J21671K26055j03198J34717K54149J15112j61371j05639K07861
12104E176068P8047j79159j87993N8015K22076J44585J12745L1968J10238J1058
$$ plain form
12094 5577648 5449193 5436240 5495512 5454762 5679531 6041670 6221419 6518426 6516323 6518857 6434569
12083 6434569 6431263 6455693 6348928 6507810 6738782 6870391 6960749 6879777 6945378 7051397
12073 7051397 7045062 7160564 7448016 7777277 7875658 7981047 8192559 8458270 8425186 8500281
12063 8500281 8446339 8527432 8684110 8859243 8810825 8791704 8936852 8999169 9201791 9457980
12053 9457980 9741702 9815022 10103855 10350951 10342956 10343645 10556178 10548416 10530325 10687042 10897499
12042 10897499 11027057 11335747 11255013 11408286 11790750 11961063 11885191 12173816 12573057 12785449
12032 12785449 13028699 13211454 13268216 13201093 13371880 13662237 13863264 14149302 14368944 14640073
12022 14640073 15131536 15502412 15830601 16241766 16358639 16454016 16787785 17283730 17459029
$$ packed form
12094E577648j28455j2953N9272m0750K24769L62139J79749K97007k103K534q4288
12083F434569l306K4430j06765J58882K30972J31609R0358q0972O5601J06019
12073G051397o335J15502K87452L29261R8381J05389K11512K65711l3084P5095
12063H500281n3942Q1093J56678J75133m8418j9121J45148O2317K02622K56189
12053I457980K83722P3320K88833K47096p995O89K12533p762j8091J56717K10457
12042A0897499J29558L08690q0734J53273L82464J70313p5872K88625L99241K12392
12032A2785449K43250J82755N6762o7123J70787K90357K01027K86038K19642K71129
12022A4640073M91463L70876L28189M11165J16873R5377L33769M95945J75299
$$ plain form
12013 17459029 17742957 18004983 18184269 18683059 19086272 19448631 19675362 20022273 20390574
12004 20390574 20766985 21397156 21946706 22349697 22807569 23265387 23788244 24092067 24456777
11995 24456777 25079700 25796466 26497931 27168778 27772529 28374351 28968931 29453345 30093604
11986 30093604 30809327 31612568 32463170 33186067 34075819 35059165 35882298 36716933 37558140
11977 37558140 38456562 39537572 40694333 41885140 42833157 43744065 44768074 45778217
11969 45778217 46993703 48217851 49387333 50899364 52402091 53755455 55080695 56416985
11961 56416985 57996266 59735469 61443528 62700763 64492670 66315226 68089975 69878827
11953 69878827 71799305 73753565 75931694 77835808 79948434 82360565 84595889 86671641
$$ packed form
12013A7459029K83928K62026J79286M98790M03213L62359K26731L46911L68301
12004B0390574L76411O30171N49550M02991M57872M57818N22857L03823L64710
11995B4456777O22923P16766P01465O70847O03751O01822N94580M84414O40259
11986C0093604P15723Q03241Q50602P22897Q89752R83346Q23133Q34635Q41207
11977C7558140Q98422J081010J156761J190807R48017R10908J024009J010143
11969D5778217J215486J224148J169482J512031J502727J353364J325240J336290
11961E6416985J579281J739203J708059J257235J791907J822556J774749J788852
11953F9878827J920478J954260K178129J904114K112626K412131K235324K075752
$$ plain form
11945 86671641 88807199 90991165 93284218 95484509 97621015 99930988 102255148 104737213
11937 104737213 106972477 109013717 111082816 113230969 115468218 117493553 119314224 121170384
11929 121170384 123005138 124677641 126039158 127240583 128194154 129226144 130124565 130676880
11921 130676880 131140612 131320382 131397354 131387988 131020070 130633067 130020221 129182472 128401308 127341451
11911 127341451 125911928 124461870 122909203 121279366 119437770 117721173 116048055 114204481
11903 114204481 111822777 109598704 107495613 105283010 103076926 100990716 98739634 96461954
11895 96461954 94171440 91900927 89655819 87315567 85188905 83242590 81165096 79009396
11887 79009396 77090472 75306610 73311965 71253042 69593104 68005178 66144387 64485028
$$ packed form
11945H6671641K135558K183966K293053K200291K136506K309973K324160K482065
11937A04737213K235264K041240K069099K148153K237249K025335J820671J856160
11929A21170384J834754J672503J361517J201425R53571J031990Q98421N52315
11921A30676880M63732J79770P6972r366l67918l87003o12846q37749p81164j059857
11911A27341451j429523j450058j552667j629837j841596j716597j673118j843574
11903A14204481k381704k224073k103091k212603k206084k086210k251082k277680
11895I6461954k290514k270513k245108k340252k126662j946315k077494k155700
11887G9009396j918924j783862j994645k058923j659938j587926j860791j659359
$$ plain form
11879 64485028 62875496 61229392 59760962 58096589 56534259 55262640 53934459 52610453
11871 52610453 51041339 49752126 48452657 47381552 46476108 45289944 43979084 42730402
11863 42730402 41659443 40560858 39592227 39044672 38219793 37181549 36333503 35576637 34867312
11854 34867312 33988773 32926257 32078232 31486768 31088968 30540218 29780934 28973908 28184735
11845 28184735 27535107 27025646 26544237 26102997 25412618 25060198 24511232 23974552 23483862
11836 23483862 23043880 22685706 22089497 21433682 21025016 20789149 20478848 20120352 19659903
11827 19659903 19267205 18896463 18618815 18272222 17993907 17757601 17504117 17246812 16876970
11818 16876970 16588297 16057224 15603893 15483878 15212628 15113179 14904827 14556072 14227017
$$ packed form
11879F4485028j609532j646104j468430j664373j562330j271619j328181j324006
11871E2610453j569114j289213j299469j071105r05444j186164j310860j248682
11863D2730402j070959j098585r68631n47555q24879j038244q48046p56866p09325
11854C4867312q78539j062516q48025n91464l97800n48750p59284q07026p89173
11845B8184735o49628n09461m81409m41240o90379l52420n48966n36680m90690
11836B3483862m39982l58174n96209o55815m08666k35867l10301l58496m60449
11827A9659903l92698l70742k77648l46593k78315k36306k53484k57305l69842
11818A6876970k88673n31073m53331j20015k71250r9449k08352l48755l29055
$$ plain form
11809 14227017 14104132 13871469 13759995 13466626 13185836 13027842 12766410 12760018 12616691 12315220
11799 12315220 12096803 11968692 11741749 11448565 11473732 11350217 11042713 10702916 10411553
11790 10411553 10457105 10430671 10180142 10024066 9685246 9473097 9256133 9228270 9258574 9178322
11780 9178322 8998753 8996157 8866973 8665138 8780124 8618351 8678050 8558508 8197612 7981965
11770 7981965 7789273 7706224 7462061 7319554 7488885 7590957 7630795 7585149 7536038 7403366
11760 7403366 7055576 6972588 6959322 6976495 7153753 7113188 6834491 6706921 6585377 6210051
11750 6210051 6012170 6126001 6053115 5834063 5635492 5748767 5740660 5919761 5903753 5796965
11740 5796965 5868847 5541998 5230654 5138797 5168192 5067098 5042819 5032985 5065784 4989764 4843407
$$ packed form
11809A4227017j22885k32663j11474k93369k80790j57994k61432o392j43327l01471
11799A2315220k18417j28111k26943k93184K5167j23515l07504l39797k91363
11790A0411553M5552k6434k50529j56076l38820k12149k16964k7863L0304q0252
11780I178322j79569k596j29184k01835J14986j61773N9699j19542l60896k15647
11770G981965j92692q3049k44163j42507J69331J02072L9838m5646m9111j32672
11760G403366l47790q2988j3266J7173J77258m0565k78697j27570j21544l75326
11750F210051j97881J13831p2886k19052j98571J13275q107J79101j6008j06788
11740E796965P1882l26849l11344r1857K9395j01094k4279r834L2799p6020j46357
$$ plain form
11729 4843407 4662027 4714950 4714957 4633374 4775648 4737347 4493503 4533014 4530761 4467276 4173064
11718 4173064 3946711 4075976 4185157 4295087 4251370 4183569 4215677 4270188 4094913 3902803
11708 3902803 4122189 4184020 4056722 3971475 3934171 3981067 4036878 3816790 3713330 3675776
11698 3675776 3700394 3773106 3667425 3410968 3185258 3374459 3707655 3622855 3652316 3845004
11688 3845004 3898268 3683451 3358657 3327614 3243912 3146983 3235151 3185546 3163017 3220365 3145797
11677 3145797 3038485 2940464 2945322 2994537 3138494 3108376 3247636 3179581 3015903 2875382
11667 2875382 2893084 2947881 2844918 2774099 2845263 2858441 2692798 2699432 2873820 2829650 2652061
11656 2652061 2721973 2575118 2562065 2562157 2557617 2659836 2683723 2630674 2458903 2320591 2451706
$$ packed form
11729D843407j81380N2923Pq1583J42274l8301k43844L9511k253o3485k94212
11718D173064k26353J29265J09181J09930m3717o7801L2108N4511j75275j92110
11708C902803K19386O1831j27298q5247l7304M6896N5811k20088j03460l7554
11698C675776K4618P2712j05681k56457k25710J89201L33196q4800K9461J92688
11688C845004N3264k14817l24794l1043q3702r6929Q8168m9605k2529N7348p4568
11677C145797j07312r8021M858M9215J43957l0118J39260o8055j63678j40521
11667B875382J7702N4797j02963p0819P1164J3178j65643O634J74388m4170j77589
11656B652061O9912j46855j3053R2m540J02219K3887n3049j71771j38312J31115
$$ plain form
11645 2451706 2398339 2324973 2339891 2470985 2300784 2008136 1865740 1859554 2021111 2050127
11635 2050127 2035765 2134945 2070416 1929351 1857864 2009716 2136990 2214699 2270374 2106867
11625 2106867 2001719 1943182 1984973 1963460 1927977 2055829 2051299 2031919 2076292 2018655 2011925
11614 2011925 2030421 2007669 1876762 1874439 1843847 1876040 2001646 2041099 1905012 1732967 1772945
11603 1772945 1818874 1788861 1919941 1756987 1616956 1568653 1515486 1376466 1380389 1440011 1609612
11592 1609612 1776664 1876881 2063805 2056401 2027976 1888207 1788527 1763852 1518911 1410362
11582 1410362 1312117 1384657 1500092 1715864 1679932 1580640 1437095 1562012 1672048 1601998
11572 1601998 1712906 1913651 1774692 1587112 1679613 1692210 1646592 1827465 1715724 1728193
$$ packed form
11645B451706n3367p3366J4918J31094j70201k92648j42396o186J61557K9016
11635B050127j4362R9180o4529j41065p1487J51852J27274P7709N5675j63507
11625B106867j05148n8537M1791k1513l5483J27852m530j9380M4373n7637o730
11614B011925J8496k2752j30907k323l0592L2193J25606L9453j36087j72045L9978
11603A772945M5929l0013J31080j62954j40031m8303n3167j39020L923N9622J69601
11592A609612J67052J00217J86924p404k8425j39769r9680k4675k44941j08549
11582A410362r8245P2540J15435K15772l5932r9292j43545J24917J10036p0050
11572A601998J10908K00745j38959j87580R2501J2597m5618J80873j11741J2469
$$ plain form
11562 1728193 1651803 1488972 1370043 1399578 1611240 1694490 1650381 1565279 1226299 1281732
11552 1281732 1449490 1484668 1341254 1362406 1421825 1166815 1171318 1093786 959285 1155312
11542 1155312 1216704 1196354 1065539 1110812 1072719 1119549 1326868 1380741 1340725 1212343 1190806
11531 1190806 1456265 1441723 1292183 1254750 1250567 1209662 1122390 948061 1065480 1070097 1054064
11520 1054064 991429 1144303 1206415 1183194 1113658 1096025 1016353 886585 829469 996525 988100
11509 988100 969315 945726 882364 994554 1171779 1327706 1253795 1148071 1309911 1339754
11499 1339754 1321936 1251424 1017594 758982 801277 1243805 1309042 1238979 1124879 917441
11489 917441 785464 737317 685631 768850 682769 728814 938431 1061871 1114396 1106715 1337784
$$ packed form
11562A728193p6390j62831j18929K9535K11662Q3250m4109q5102l38980N5433
11552A281732J67758L5178j43414K1152N9419k55010M503p7532j34501J96027
11542A155312O1392k0350j30815M5273l8093M6830K07319N3873m0016j28382k1537
11531A190806K65459j4542j49540l7433m183m0905q7272j74329J17419M617j6033
11520A054064o2635J52874O2112k3221o9536j7633p9672j29768n7116J67056q425
11509I88100j8785k3589o3362J12190J77225J55927p3911j05724J61840K9843
11499A339754j7818p0512k33830k58612M2295M42528O5237p0063j14100k07438
11489I17441j31977m8147n1686Q3219q6081M6045K09617J23440N2525p681K31069
$$ plain form
11478 1337784 1418647 1141967 1021228 1008701 1012844 1069804 907646 781936 738409 611870
11468 611870 699205 852413 1074157 1084021 1059984 1161525 1087190 1080144 1040215 720079 819473
11457 819473 890343 918376 889847 867174 894141 848237 923064 866407 758325 827831 916015
11446 916015 754167 873078 950043 817432 787992 651217 704617 637390 476301 524624
11436 524624 736473 848879 698699 468272 544747 755537 564710 450423 489960 423537
11426 423537 382901 372523 265077 292365 253524 487210 747659 764857 636708 601887 634592
11415 634592 601315 547422 607752 519066 564347 434000 348231 171640 55222 76856 304000
11404 304000 317244 331281 321063 246252 320551 513974 499695 406534 538441 606283 479125
$$ packed form
11478A337784Q0863k76680j20739j2527M143N6960j62158j25710m3527j26539
11468F11870Q7335J53208K21744R864k4037J01541p4335p046l9929l20136R9394
11457H19473P0870K8033k8529k2673K6967m5904P4827n6657j08082O9506Q8184
11446I16015j61848J18911P6965j32611k9440j36775N3400o7227j61089M8323
11436E24624K11849J12406j50180k30427P6475K10790j90827j14287L9537o6423
11426D23537m0636j0378j07446K7288l8841K33686K60449J7198j28149l4821L2705
11415F34592l3277n3893O0330q8686M5281j30347q5769j76591j16418K1634K27144
11404C04000J3244J4037j0218p4811P4299J93423j4279r3161J31907O7842j27158
$$ plain form
11393 479125 398981 289130 426420 620027 642087 350979 260156 339597 491434 843485
11383 843485 793084 591963 524106 490744 406421 381240 436807 491989 473620 396738 356945
11372 356945 552539 595293 476247 530096 546429 384700 560019 673116 517203 666027
11362 666027 718880 735459 650275 501068 466929 380420 322167 435422 507390 389004 176222
11351 176222 243617 418046 477646 482089 280970 332295 659096 746215 796487 626702 640813
11340 640813 552486 430376 327052 271753 116131 114060 116279 125404 245302 361171 293755
11329 293755 261101 303926 311302 67785 98111 400005 360867 221252 142270 262120 342593
11318 342593 549145 476226 387417 370612 422641 438802 440136 491950 615071 677363 751181
$$ packed form
11393D79125q0144j09851J37290J93607K2060k91108r0823P9441J51837L52051
11383H43485n0401k01121o7857l3362q4323k5181N5567N5182j8369p6882l9793
11372C56945J95594M2754j19046N3849J6333j61729J75319J13097j55913J48824
11362F66027N2853J6579q5184j49207l4139q6509n8253J13255P1968j18386k12782
11351A76222O7395J74429N9600M443k01119N1325L26801Q7119N0272j69785J4111
11340F40813q8327j22110j03324n5299j55622k071K219R125J19898J15869o7416
11329B93755l2654M2825P376k43517L0326L01894l9138j39615p8982J19850Q0473
11318C42593K06552p2919q8809j6805N2029J6161J334N1814J23121O2292P3818
$$ plain form
11307 751181 661295 658095 588205 469065 411786 453139 536874 437982 292109 287679 119973
11296 119973 54937 209323 367691 370636 446979 267534 242449 381787 548672 381193
11286 381193 227301 434165 443243 452342 450300 367497 340165 253762 404918 430216 363121
11275 363121 176792 338938 330428 59144 -17219 63033 52763 135960 122750 354941 368609
11264 368609 318508 195623 193401 267414 417676 593006 481573 424190 268431 264799 299668
11253 299668 405897 434109 464564 253391 216613 388809 266865 203518 336645 421714
11243 421714 223119 141260 258142 337729 402401 322176 471327 620281 388622 129718
11233 129718 23348 47240 107126 221883 180422 161073 354384 407192 316485 208898 198234
$$ packed form
11307G51181q9886l200o9890j19140n7279M1353Q3735r8892j45873m430j67706
11296A19973o5036J54386J58368K945P6343j79445k5085J39338J66885j67479
11286C81193j53892K06864R078R099k042q2803k7332q6403J51156K5298o7095
11275C63121j86329J62146q510k71284p6363Q0252j0270Q3197j3210K32191J3668
11264C68609n0101j22885k222P4013J50262J75330j11433n7383j55759l632L4869
11253B99668J06229K8212L0455k11173l6778J72196j21944o3347J33127Q5069
11243D21714j98595q1859J16882P9587O4672q0225J49151J48954k31659k58904
11233A29718j06370K3892N9886J14757m1461j9349J93311N2808r0707j07587j0664
$$ plain form
11222 198234 229015 357318 346346 438153 606525 649131 600739 542686 385989 172612 153108
11211 153108 393526 325269 249188 199725 242126 219123 124599 -166443 -122926 144077 255722
11200 255722 172762 78598 79974 74975 130106 46871 177878 510052 576177 432350 313262
11189 313262 284946 193977 282147 256050 427821 515569 490652 481996 387162 251675 147303
11178 147303 135965 153593 163550 401303 525254 435465 397082 476375 472428 466969 495948 347169
11166 347169 277382 181078 244712 315966 438425 396308 299473 289465 215762 66666 140238
11155 140238 80698 -131976 57355 165398 123550 230419 344305 441671 520228 447487
11145 447487 287025 90853 133068 53982 102537 52277 108850 151199 194593 186652 243279
$$ packed form
11222A98234L0781J28303j0972R1807J68372M2606m8392n8053j56697k13377j9504
11211A53108K40418o8257p6081m9463M2401k3003r4524k91042M3517K67003J11645
11200B55722q2960r4164J376m999N5131q3235J31007L32174O6125j43827j19088
11189C13262k8316r0969Q8170k6097J71771Q7748k4917q656r4834j35487j04372
11178A47303j1338J7628R957K37753J23951q9789l8383P9293l947n459K8979j48779
11166C47169o9787r6304O3634P1254J22459m2117r6835j0008p3703j49096P3572
11155A40238n9540k12674J89331J08043m1848J06869J13886R7366P8557p2741
11145D47487j60462j96172M2215p9086M8555n0260N6573M2349M3394p941N6627
$$ plain form
11134 243279 200977 130374 48413 -122227 -291161 -161438 -84654 73363 55085 -68084
11124 -68084 -29916 18239 60582 150896 392793 264852 70405 -8650 92253 90261 -21171
11113 -21171 32307 -162505 -293641 -415867 -460793 -194566 -32974 77603 145483 145160 150036
11102 150036 138386 54332 215478 364607 206238 144702 276297 282723 368342 301181 282035
11091 282035 172898 75204 -23355 -95848 -67321 -178623 -102876 7976 -56313 12560 82643
11080 82643 -1293 179891 185355 140489 85616 266549 279267 315777 233671 309830 240579
11069 240579 225668 84841 108426 216835 534441 491169 73809 -244809 -111967 100064
11059 100064 152299 107786 102256 171052 209143 301108 424925 428870 478354 492482 513960 662276
$$ packed form
11134B43279m2302p0603q1961j70640j68934J29723P6784J58017j8278j23169
11124f8084L8168M8155M2343R0314K41897j27941j94447p9055J00903j992j11432
11113b1171N3478j94812j31136j22226m4926K66227J61592J10577O7880l23M876
11102A50036j1650q4054J61146J49129j58369o1536J31595O426Q5619o7161j9146
11091B82035j09137r7694r8559p2493K8527j11302P5747J10852o4289O8873P0083
11080H2643q3936J81184N464m4866n4873J80933J2718L6510q2106P6159o9251
11069B40579j4911j40827K3585J08409L17606m3272m17360l18618J32842K12031
11059A00064N2235m4513n530O8796L8091R1965J23817L945M9484J4128K1478J48316
$$ plain form
11047 662276 836120 919149 1023699 948200 973157 890670 835156 811795 958540 1090592 1368604
11036 1368604 1693289 1895924 1848881 1680550 1526419 1443175 1471662 1444903 1417135 1587482
11026 1587482 1798246 2061457 2417674 2488937 2507918 2136555 1699192 1583444 1438905 1241856
11016 1241856 1355692 1457150 1583228 1924412 1958469 1787850 1615038 1320692 1307961 1250390
11006 1250390 1126063 912797 1124668 1020036 962614 1075435 983055 692190 351892 95272
10996 95272 -116451 -85811 63245 -44396 -14180 162231 215158 383609 349783 289099 224716
10985 224716 244288 186160 193263 299214 210711 141785 164571 5398 -13501 239103 433553
10974 433553 367313 152783 -36960 -34138 -55272 60738 330667 278201 143992 52342 -78784
$$ packed form
11047F62276J73844Q3029J04550p5499K4957q2487n5514k3361J46745J32052K78012
11036A368604L24685K02635m7043j68331j54131q3244K8487k6759k7768J70347
11026A587482K10764K63211L56217P1263J8981l71363m37363j15748j44539j97049
11016A241856J13836J01458J26078L41184L4057j70619j72812k94346j2731n7571
11006A250390j24327k13266K11871j04632n7422J12821r2380k90865l40298k56620
10996I5272k11723L0640J49056j07641L0216J76411N2927J68451l3826o0684o4383
10985B24716J9572n8128P103J05951q8503o8926K2786j59173j8899K52604J94450
10974D33553o6240k14530j89743K822k1134J16010K69929n2466j34209r1650j31126
$$ plain form
10963 -78784 -198583 -145580 -20887 -74465 71308 124306 191840 303680 380033 290996 86297
10952 86297 -14880 -8283 43202 -91664 -124194 -23186 3642 -20669 27062 -96002 -260950
10941 -260950 -213716 -161071 -158640 -325627 -433785 -412631 -486154 -383495 -119515 71652 46557
10930 46557 -49772 88291 175202 140268 -6880 -25679 47829 18938 122856 89879 -65713
10919 -65713 -265069 -227680 76146 261905 196843 228664 64447 -53132 -8627 25125 -6500
10908 -6500 -44428 -177408 -210671 -285431 -245069 -275327 -209694 -173432 51502 136419 79107
10897 79107 -35185 28544 -50937 -301324 -431631 -303544 -121553 64490 106304 235058
10887 235058 35112 70071 248032 191433 87099 -10544 113950 258299 397864 385562
$$ packed form
10963g8784j19799N3003J24693n3578J45773N2998O7534J11840P6353q9037k04699
10952H6297j01177O597N1485j34866l2530J01008K6828k4311M7731j23064j64948
10941b60950M7234N2645K431j66987j08158K1154p3523J02659K63980J91167k5095
10930D6557r6329J38063Q6911l4934j47148j8799P3508k8891J03918l2977j55592
10919f5713j99356L7389L03826J85759o5062L1821j64217j17579M4505L3752l1625
10908f500l7928j32980l3263p4760M0362l0258O5633L6262K24934Q4917n7312
10897G9107j14292O3729p9481k50387j30307J28087J81991J86043M1814J28754
10887B35058j99946L4959J77961n6599j04334r7643J24494J44349J39565j2302
$$ plain form
10877 385562 295642 305257 451815 414463 215567 207398 262757 362216 334972 249372 209021
10866 209021 22363 -51776 24873 92687 206585 441700 565197 626750 612317 414156
10856 414156 352438 400380 228033 375939 544872 566177 529178 512942 548857 447586 468325
10845 468325 400533 402192 507049 279675 260412 475861 395482 364035 404459 401595 323573
10834 323573 355979 380028 233376 227698 247984 332577 242916 304143 232232 278056 87363
10823 87363 -50532 2065 133432 191359 235761 135672 142955 241306 227038 164821 85600
10812 85600 207682 92182 40362 101271 199770 266860 185580 -72190 -180120 -21231 110822
10801 110822 117024 -35033 71844 -81045 -96619 -40634 -64167 3407 -124551 -167743 -347989
$$ packed form
10877C85562q9920R615J46558l7352j98896q169N5359R9459k7244q5600m0351
10866B09021j86658p4139P6649O7814J13898K35115J23497O1553j4433j98161
10856D14156o1718M7942j72347J47906J68933K1305l6999j6236L5915j01271K0739
10845D68325o7792J659J04857k27374j9263K15449q0379l1447M0424k864p8022
10834C23573L2406K4049j46652n678K0286Q4593q9661O1227p1911M5824j90693
10823H7363j37895N2597J31367N7927M4402j00089P283R8351j4268o2217p9221
10812H5600J22082j15500n1820O0909R8499O7090q1280k57770j07930J58889J32053
10801A10822O202j52057J06877j52889j5574N5985k3533O7574j27958m3192j80246
$$ plain form
10790 -347989 -329341 -207693 -144692 -54089 -41638 17377 -17579 -131244 -169798 -59955 114054
10779 114054 -26369 -69415 188432 299962 115271 -33514 159704 94691 12188 -26019
10769 -26019 73747 -58121 -39451 -130295 106007 73157 159783 213098 276220 368579 421889
10758 421889 399338 247741 105962 1222 96899 117681 117732 143567 179759 291813 173756
10747 173756 184125 280125 338813 319963 185803 275976 273835 355509 458241 591544 533357
10736 533357 461064 414002 249315 232867 352762 250555 85441 104325 257033 330999
10726 330999 338487 280112 292054 283402 87642 177389 334859 272490 146444 117227 180167
10715 180167 176582 63643 -149315 -5982 171829 283365 246278 145395 210133 70430
$$ packed form
10790c47989J8648J21648O3001R0603J2451N9015l4956j13665l8554J09843J74009
10779A14054j40423m3046K57847J11530j84691j48785J93218o5013q2503l8207
10769b6019R9766j31868J8670r0844K36302l2850Q6626N3315O3122R2359N3310
10758D21889k2551j51597j41779j04740R5677K0782N1K5835L6192J12054j18057
10747A73756J0369R6000N8688j8850j34160R0173k141Q1674J02732J33303n8187
10736E33357p2293m7062j64687j6448J19895j02207j65114J8884J52708P3966
10726C30999P488n8375J1942q652j95760Q9747J57470o2369j26046k9217O2940
10715A80167l585j12939k12958J43333J77811J11536l7087j00883O4738j39703
$$ plain form
10705 70430 -115315 -293676 -293675 -236289 -4678 169509 288757 213149 -26911 81773 94329
10694 94329 81998 425576 505907 353450 126689 279737 511100 498596 505218 490244 315893
10683 315893 340316 245143 213903 193617 224732 231451 297821 387041 436850 413688 507994 556409
10671 556409 486253 268931 400292 486075 437083 441952 428919 444018 492025 350308 483789
10660 483789 815895 954181 1164531 1424635 1742226 1623903 1550066 1487836 1240799 1387991
10650 1387991 1740721 1977714 1992062 2075043 2348862 2366220 2341376 2379703 2485114 2795911
10640 2795911 2912763 3350599 3941138 4463747 5130334 6037949 7106104 8003193 8799934
10631 8799934 9475426 10270520 11199472 12611969 14746112 17721568 21508744 26957884 34736106
$$ packed form
10705G0430j85745j78361JN7386K31611J74187J19248p5608k40060J08684J2556
10694I4329j2331L43578Q0331j52457k26761J53048K31363j2504O622j4974j74351
10683C15893K4423r5173l1240k0286L1115O719O6370Q9220M9809k3162R4306M8415
10671E56409p0156k17322J31361Q5783m8992M869j3033J5099M8007j41717J33481
10660D83789L32106J38286K10350K60104L17591j18323p3837o2230k47037J47192
10650A387991L52730K36993J4348Q2981K73819J7358k4844L8327J05411L10797
10640B795911J16852M37836N90539N22609O66587R07615J068155Q97089P96741
10631H799934O75492P95094R28952J412497K134143K975456L787176N449140P778222
$$ plain form
10622 34736106 45376472 59810858 78777458 101907023 124782243 140532467 145609126
10615 145609126 142011565 134145399 126867613 124189624 128456520 142004597 166711115 204335789
10607 204335789 252271215 298068791 323710995 321648613 299374545 269305150 242471073
10600 242471073 226754125 225356295 239995854 272144656 322528308 385262623 440134147
10593 440134147 461032821 440956268 393998298 338070070 288333832 253240326 234784307
10586 234784307 232374809 245321611 272000954 306097422 332368752 334252823 309406814
10579 309406814 268316964 223767521 185893143 159109298 143255153 136863170 138238832
10572 138238832 145370303 154512704 159181465 153847766 138546631 117297851 94922093
$$ packed form
10622C4736106J0640366J4434386J8966600K3129565K2875220J5750224N076659
10615A45609126l597561p866166p277786k677989M266896J3548077K4706518L7624674
10607B04335789M7935426M5797576K5642204k062382k2274068l0069395k6834077
10600B42471073j5716948j397830J4639559L2148802N0383652O2734315N4871524
10593D40134147K0898674k0076553m6957970n5928228m9736238l5093506j8456019
10586B34784307k409498J2946802K6679343L4096468K6271330J884071k4846009
10579C09406814m1089850m4549443l7874378k6783845j5854145o391983J375662
10572A38238832P131471R142401M668761n333699j5301135k1248780k2375758
$$ plain form
10565 94922093 75268531 59770113 48093536 39607185 33528205 28883483 25227805 22433683
10557 22433683 20274606 18561769 16734601 15196437 13924153 13030873 12073328 11086142
10549 11086142 10326338 9694344 9178443 8548974 7868184 7401859 7048097 6737109 6447735
10540 6447735 5824600 5265001 5100201 4881502 4586926 4345125 4208929 4181776 4212287 3951963
10530 3951963 3629890 3585484 3671351 3485428 3254104 3327373 3106683 3050651 3081806 2954456
10520 2954456 2814811 2840905 2796177 2797063 2596545 2370513 2172425 2214275 2288352 2392193 2325748
10509 2325748 2155118 1821347 1512876 1645898 1790706 1883049 1677800 1624334 1692446 1944578
10499 1944578 1953393 1879884 1837403 1731955 1461395 1307489 1172209 1276678 1275615 1243252 1224605
$$ packed form
10565I4922093j9653562j5498418j1676577q486351o078980m644722l655678k794122
10557B2433683k159077j712837j827168j538164j272284q93280r57545r87186
10549A1086142p59804o31994n15901o29469o80790m66325l53762l10988k89374
10540F447735o23135n59599j64800k18699k94576k41801j36196k7153L0511k60324
10530C951963l22073m4406Q5867j85923k31324P3269k20690n6032L1155j27350
10520B954456j39645K6094m4728Q86k00518k26032j98088M1850P4077J03841o6445
10509B325748j70630l33771l08471J33022J44808R2343k05249n3466O8112K52132
10499A944578Q815p3509m2481j05448k70560j53906j35280J04469j063l2363j8647
$$ plain form
10488 1224605 1397255 1629506 1694184 1488753 1514666 1627679 1557848 1556677 1566094 1486373 1231543
10477 1231543 1282198 1352096 1119013 1010150 917833 863641 963009 1297911 1192772 1018942
10467 1018942 1222240 996102 790743 758042 768653 942902 1097794 978749 687011 607351
10457 607351 479351 403514 427043 390437 479376 523661 647734 719947 628692 425779 455395
10446 455395 784327 843925 509137 368432 319790 273167 305569 491195 354001 447905
10436 447905 561266 753574 721835 611641 685296 634022 527921 348539 320279 386959
10426 386959 261593 172396 -52829 47531 230686 345975 389589 397880 529764 502499
10416 502499 141254 -197064 -4209 125905 73864 6839 27784 320297 450424 482855
$$ packed form
10488A224605J72650K32251O4678k05431K5913J13013o9831j171R417p9721k54830
10477A231543N0655O9898k33083j08863r2317n4192R9368L34902j05139j73830
10467A018942K03298k26138k05359l2701J0611J74249J54892j19045k91738p9660
10457F07351j28000p5837K3529l6606Q8939M4285J24073P2213r1255k02913K9616
10446D55395L28932N9598l34788j40705m8642m6623L2402J85626j37194R3904
10436D47905J13361J92308l1739j10194P3655n1274j06101j79382k8260O6680
10426C86959j25366q9197k25225J00360J83155J15289M3614Q291J31884k7265
10416E02499l61245l38318J92855J30114n2041o7025K0945K92513J30127L2431
$$ plain form
10406 482855 455136 207473 63696 160196 335905 501740 391283 416721 371227 494910
10396 494910 528214 346958 210324 63724 90349 182865 177802 302938 511985 425378 480952
10385 480952 492477 585292 546262 378070 240352 95147 37464 157248 343042 237013
10375 237013 219696 213673 256597 238389 186172 92175 222628 345991 406354 360165 135756
10364 135756 230855 341910 441682 513111 586215 512611 556060 586054 390983 484309 592055
10353 592055 577448 501742 497051 415699 122232 -97547 101177 257186 237562 97744 151353
10342 151353 234498 354292 321648 320894 361821 217128 168433 296785 272102 191017 168003
10331 168003 267625 271370 269484 268136 240287 168325 59733 180094 92007 75551 -58495
$$ packed form
10406D82855k7719k47663j43777R6500J75709J65835j10457K5438m5494J23683
10396D94910L3304j81256j36634j46600K6625R2516n063J25136K09047q6607N5574
10385D80952J1525R2815l9030j68192j37718j45205n7683J19784J85794j06029
10375B37013j7317o023M2924j8208n2217r3997J30453J23363O0363m6189k24409
10364A35756R5099J11055R9772P1429P3104p3604M3449K9994j95071R3326J07746
10353E92055j4607p5706m691q1352k93467k19779J98724J56009j9624j39818N3609
10342A51353Q3145J19794l2644p54M0927j44693m8695J28352k4683q1085k3014
10331A68003R9622L745j886j348k7849p1962j08592J20361q8087j6456j34046
$$ plain form
10320 -58495 -136092 95318 392176 316729 243498 284475 335530 283968 276058 429983 478502
10309 478502 316459 474785 464081 438725 547752 623078 600951 640460 608277 613605 535478
10298 535478 602502 592414 419498 300226 594619 533699 438334 318635 408966 583859
10288 583859 646855 507126 623773 704806 687249 733793 704280 499688 417117 620619 796999
10277 796999 737131 618755 524812 537968 345116 399920 465708 490903 460363 399732 175258
10266 175258 258492 205865 207955 416361 495872 431126 406061 265091 238388 112050 48398
10255 48398 -48194 -65609 66282 60135 -33259 -109158 -51490 -237856 -150006 81926 62539
10244 62539 12530 132189 70940 83654 171474 78905 176218 199168 66008 93475 162960
$$ packed form
10320e8495p7597K31410K96858p5447p3231M0977N1055n1562p910J53925M8519
10309D78502j62043J58326j0704k5356J09027P5326k2127L9509l2183N328p8127
10298E35478O7024j0088j72916j19272K94393o0920r5365j19699R0331J74893
10288E83859O2996j39729J16647Q1033j7557M6544k9513k04592q2571K03502J76380
10277G96999n9868j18376r3943J3156j92852N4804O5788K5195l0540o0631k24474
10266A75258Q3234n2627K090K08406P9511o4746k5065j40970k6703j26338o3652
10255D8398r6592j7415J31891o147r3394p5899N7668j86366Q7850K31932j9387
10244F2539n0009J19659o1249J2714Q7820r2569R7313K2950j33160K7467O9485
$$ plain form
10233 162960 204843 122179 65645 61299 53627 176598 106217 95396 246242 320271 162665
10222 162665 242283 193857 199476 158897 83011 -70760 -47335 -88262 -107707 66161 221509
10211 221509 287292 186848 119608 286967 274356 227047 -8626 -105032 -161888 -234123 -46794
10200 -46794 39636 71301 239433 212706 161861 247079 343245 311086 146086 238409 318968
10189 318968 233454 310586 360514 401972 496943 811835 784444 686339 910389 1010874 830553
10178 830553 690585 667016 934679 758609 552625 884719 1333075 1725723 2025313 2257000
10168 2257000 2470578 2450010 2135099 1577826 1235815 1246880 1412866 1710787 2044210 2410487
10158 2410487 2691445 2869618 2882570 2617684 2319794 2160575 1857956 1445381 1444960 1379541
$$ packed form
10233A62960M1883q2664n6534m346p672J22971p0381j0821J50846P4029j57606
10222A62665P9618m8426N619m0579p5886j53771K3425m0927j9445J73868J55348
10211B21509O5783j00444o7240J67359j2611m7309k35673r6406n6856p2235J87329
10200d6794Q6430L1665J68132k6727n0845Q5218R6166l2159j65000R2323Q0559
10189C18968q5514P7132M9928M1458R4971L14892k7391r8105K24050J00485j80321
10178H30553j39968k3569K67663j76070k05984L32094M48356L92648K99590K31687
10168B257000K13578k0568l14911n57273l42011J1065J65986K97921L33423L66277
10158B410487K80958J78173J2952k64886k97890j59219l02619m12575m21o5419
$$ plain form
10148 1379541 1551134 1834659 2074428 2046290 1890572 1826890 1729202 1582798 1430609 1086357
10138 1086357 916078 1088362 1027284 949213 1069005 979538 968517 922364 687412 663792
10128 663792 634547 512607 633970 393875 193536 249827 358017 320881 346090 436000
10118 436000 373253 146800 114402 193450 155714 52129 165161 93703 -5519 -52678 90181
10107 90181 247717 493189 478175 475838 412428 276051 264956 314878 368192 280424 300925
10096 300925 196083 91460 243774 269603 298194 405663 237721 94101 118354 41542
10086 41542 70761 156827 113083 27276 78608 -176570 -373332 -284851 31926 97472 210989
10075 210989 106707 -97783 -136565 -113907 -187304 -232934 -165146 -60133 67429 121183 60373
$$ packed form
10148A379541J71593K83525K39769k8138j55718o3682r7688j46404j52189l44252
10138A086357j70279J72284o1078p8071J19792q9467j1021m6153k34952k3620
10128F63792k9245j21940J21363k40095k00339N6291J08190l7136K5209Q9910
10118D36000o2747k26453l2398P9048l7736j03585J13032p1458r9222m7159J42859
10107I0181J57536K45472j5014k337o3410j36377j1095M9922N3314q7768K0501
10096C00925j04842j04623J52314K5829K8591J07469j67942j43620K4253p6812
10086D1542K9219Q6066m3744q5807N1332k55178j96762Q8481L16777O5546J13517
10075B10989j04282k04490l8782K2658p3397m5630O7788J05013J27562N3754o0810
$$ plain form
10064 60373 55541 120216 316088 453559 223850 -30405 -248743 -264983 -327869 -161626 -72202
10053 -72202 -23808 169456 284708 207995 29436 9750 -140459 -247179 -278997 -294787 -88145
10042 -88145 -149783 -169736 -51798 -297495 -313669 -111958 22023 49436 114476 159859 -28145
10031 -28145 -37179 39552 40557 305872 364751 247743 130111 12785 135231 -222 -143161
10020 -143161 -91724 -63346 7136 -110160 -93391 -43119 24172 87002 -44473 -97787 126229
10009 126229 80900 64604 262429 420142 448817 227894 55815 169226 -281 20260
9999 20260 -47303 105622 257792 143635 110947 19163 35693 28131 96078 101832 134533 113457
9987 113457 -226541 -209208 -153559 -444900 -528625 -436238 -368951 -251578 -279998 66628 89545
$$ packed form
10064F0373m832O4675J95872J37471k29709k54255k18338j6240o2886J66243Q9424
10053g2202M8394J93264J15252p6713j78559j9686j50209j06720l1818j5790K06642
10042h8145o1638j9953J17938k45697j6174K01711J33981K7413O5040M5383j88004
10031b8145r034P6731J005K65315N8879j17008j17632j17326J22446j35453j42939
10020a43161N1437K8378P0482j17296J6769N0272O7291O2830j31475n3314K24016
10009A26229m5329j6296J97825J57713K8675k20923j72079J13411j69507K0541
9999B0260o7563J52925J52170j14157l2688r1784J6530p562O7947N754L2701k1076
9987A13457l39998J7333N5649k91341q3725R2387O7287J17373k8420L46626K2917
$$ plain form
9976 89545 -76487 -80271 224764 341579 153456 -73990 -31348 -112649 -239278 -380950 -140902
9965 -140902 74417 193986 177810 312123 305318 191224 -45630 -77382 -99230 17627 135717
9954 135717 89412 34550 177662 143277 50372 304019 277828 76588 10282 -70686 126238
9943 126238 144310 73694 -9029 1249 300660 450691 435090 568716 1183182 2435356
9933 2435356 3724753 3325455 2506430 1672551 870186 442922 330177 438024 521567 397461
9923 397461 218928 296113 369945 422821 753363 1107354 1012137 830586 747214 462744 280948
9912 280948 209484 156834 172154 265213 248920 203997 121292 113238 -55106 26157 142288
9901 142288 88500 190792 209871 52389 -50720 -57529 -57818 70729 236522 404703 441891
$$ packed form
9976H9545j66032l784L05035J16815j88123k27446M2642q1301j26629j41672K40048
9965a40902K15319J19569j6176J34313o805j14094k36854l1752k1848J16857J18090
9954A35717m6305n4862J43112l4385r2905K53647k6191k01240o6306q0968J96924
9943A26238J8072p0616q2723J0278K99411J50031j5601J33626O14466J252174
9933B435356J289397l99298q19025q33879q02365m27264j12745J07847Q3543j24106
9923C97461j78533P7185P3832N2876L30542L53991r5217j81551q3372k84470j81796
9912B80948p1464n2650J5320R3059j6293m4923q2705q054j68344Q1263J16131
9901A42288n3788J02292J9079j57482j03109o809k89J28547J65793J68181L7188
$$ plain form
9890 441891 487257 552331 552243 437634 343398 392482 468888 244514 -16850 29091 277784
9879 277784 298333 76737 -95428 -157973 -58506 75805 56222 -30722 108283 321991 153000
9868 153000 -36739 -165707 -27393 127604 301634 142847 59764 -79702 -40792 28036
9858 28036 45349 -146161 -237495 -368966 -315171 -83426 -11323 174719 139817 -64315 -204996
9847 -204996 -180995 -188199 -250693 -220839 2939 -189329 -339630 -448614 -445255 -289922 -240191
9836 -240191 -92801 43448 44749 -39438 -136107 -52914 -46370 -98487 -43423 108358 -27000
9825 -27000 -169150 -263626 -326316 -446658 -368885 -216778 -286061 -320556 -319828 -193119 -59310
9814 -59310 -58190 -120142 -1724 36099 85078 -51708 -178702 -119183 104069 213776 212566
$$ packed form
9890D41891M5366O5074q8j14609r4236M9084P6406k24374k61364M5941K48693
9879B77784K0549k21596j72165o2545R9467J34311j9583q6944J39005K13708j68991
9868A53000j89739j28968J38314J54997J74030j58787q3083j39466L8910O8828
9858B8036J7313j91510r1334j31471N3795K31745P2103J86042l4902k04132j40681
9847b04996K4001p204o2494K9854K23778j92268j50301j08984L359J55333M9731
9836b40191J47390J36249J301q4187r6669Q3193O544n2117N5064J51781j35358
9825b7000j42150r4476o2690j20342P7773J52107o9283l4495P28J26709J33809
9814e9310J120o1952J18418L7823M8979j36786j26994N9519K23252J09707j210
$$ plain form
9803 212566 107411 32177 -34496 309941 509283 196185 110621 -25181 176394 256044
9793 256044 418924 592507 475134 521996 647862 840034 1096878 1347028 1726814 2461239
9783 2461239 3951057 7029164 11949612 17508133 20231985 18476803 14183029 9584196
9775 9584196 5806757 3404788 2295496 1946619 1701685 1281423 895706 818249 830259
9766 830259 572989 382000 274371 148242 115392 136080 313903 381433 383888 303616 495549
9755 495549 484057 160023 93399 236582 445190 331880 170915 172518 185231 283154 430014
9744 430014 383498 497624 565899 631054 419266 355745 229484 141293 171403 176467 218359
9733 218359 252515 218126 135825 34955 -68650 -6191 249792 147687 170316 216175 167075
$$ packed form
9803B12566j05155p5234o6673L44437J99342l13098q5564j35802K01575P9650
9793B56044J62880J73583j17373M6862J25866J92172K56844K50150L79786P34425
9783B461239J489818L078107M920448N558521K723852j755182m293774m598833
9775I584196l777439k401969j109292l48877k44934m20262l85717p7457J2010
9766H30259k57270j90989j07629j26129l2850K0688J77823O7530K455q0272J91933
9755D95549j1492l24034o6624J43183K08608j13310j60965J603J2713R7923J46860
9744D30014m6516J14126O8275O5155k11788o3521j26261q8191L0110N064M1892
9733B18359L4156l4389q2301j00870j03605O2459K55983j02105K2629M5859m9100
$$ plain form
9722 167075 239256 223802 136681 145238 109373 153667 205769 112973 174151 64447 33391 140467
9710 140467 36342 -23888 171172 104856 -45099 -27434 -172606 -124752 -124020 24888 -9181
9699 -9181 147933 160346 107204 -15650 -86330 -9407 147854 -200 -115899 -43423 -16744
9688 -16744 108761 251250 52910 -210860 -214710 -117623 -64017 -34367 -85911 -101128 1932
9677 1932 127648 114927 -170656 -185693 35060 199036 247467 313098 49413 32896 39746
9666 39746 23413 82395 256221 229257 114890 212579 420649 547060 542623 816830 1446799
9655 1446799 2553700 3005213 2672983 2161177 1486600 885959 404614 103480 105485 218292
9645 218292 212439 3976 50371 -2215 38929 -39933 91964 274959 233853 186751 254352
$$ packed form
9722A67075P2181j5454q7121Q557l5865M4294N2102r2796O1178j09704l1056J07076
9710A40467j04125o0230J95060o6316j49955J7665j45172M7854P32J48908l4069
9699i181J57114J2413n3142j22854p0680P6923J57261j48054j15699P2476K6679
9688a6744J25505J42489j98340k63770l850R7087N3606K9650n1544j5217J03060
9677A932J25716j2721k85583j5037K20753J63976M8431O5631k63685j6517O850
9666C9746j6333N8982J73826k6964j14367R7689K08070J26411m437K74207O29969
9655A446799J106901M51513l32230n11806o74577o00641m81345l01134K005J12807
9645B18292n853k08463M6395n2586M1144p8862J31897J82995m1106m7102O7601
$$ plain form
9634 254352 176549 -2570 -224466 -251040 -156881 10866 77605 161896 218837 309528 423399
9623 423399 433223 113584 14381 23782 -64889 -106516 149590 428370 313877 30769 55619
9612 55619 167186 51295 126586 208919 49132 -95948 -330197 -406915 -286427 -181557
9602 -181557 -242543 9554 -23787 30379 97968 133702 36228 96289 202704 310917 171776
9591 171776 90906 36435 -15230 -96722 -75742 -163361 -166380 -117361 -66993 -117596 -100870 -96477
9579 -96477 -4155 -119438 34476 47435 -119068 -141749 -49373 48289 -17371 -52761 -183002
9568 -183002 -274391 -355104 -341153 -68379 49029 115838 204190 -16410 -288632 -168056 -6569
9557 -6569 -25764 -41422 94980 -76938 -81019 -56767 -20676 -119641 -22567 52852 100986 86301
$$ packed form
9634B54352p7803j79119k21896k6574R4159J67747O6739Q4291N6941R0691J13871
9623D23399R824l19639r9203R401q8671m1627K56106K78780j14493k83108K4850
9612E5619J11567j15891P5291Q2333j59787j45080k34249p6718J20488J04870
9602a81557o0986K52097l3341N4166O7589L5734r7474O0061J06415J08213j39141
9591A71776q0870n4471n1665q1492K0980q7619l019M9019N0368n0603J6726M393
9579i6477R2322j15283J53914J2959j66503k2681R2376R7662o5660l5390j30241
9568a83002r1389q0713J3951K72774J17408O6809Q8352k20600k72222J20576J61487
9557f569j9195j5658J36402j71918m081K4252L6091r8965R7074P5419M8134j4685
$$ plain form
9545 86301 30503 -125315 -201661 -119161 -41729 56705 50299 -84990 -35400 225668 303826
9534 303826 296179 377188 199601 51256 -131189 -49244 51296 -83843 -289745 -256678 -287651
9523 -287651 -213200 -37067 -65306 16670 315556 436394 342950 189350 83193 70870 18057
9512 18057 -19372 -170316 -310467 -320310 -212671 -279519 -355566 -195742 -40379 -107611 -134388
9501 -134388 -102578 -67018 -145954 -112306 -100902 -52945 8491 124040 146658 188365 134649
9490 134649 -15605 20077 -8866 -65091 -144662 -35438 17015 -21913 -208163 -300074 -214808
9479 -214808 -66127 -302 116149 150080 20906 -33393 -45098 -101647 23717 22450 9397
9468 9397 16307 -29659 2728 142700 270569 435936 427875 451627 329538 170554 25176
$$ packed form
9545H6301n5798j55818p6346Q2500P7432R8434o406j35289M9590K61068P8158
9534C03826p647Q1009j77587j48345j82445Q1945J00540j35139k05902L3067l0973
9523b87651P4451J76133k8239Q1976K98886J20838r3444j53600j06157j2323n2813
9512A8057l7429j50944j40151r843J07639o6848p6047J59824J55363o7232k6777
9501a34388L1810L5560p8936L3648J1404M7957O1436J15549K2618M1707n3716
9490A34649j50254L5682k8943n6225p9571J09224N2453l8928j86250r1911Q5266
9479b14808J48681O5825J16451L3931j29174n4299j1705n6549J25364j267j3053
9468I397O910m5966L2387J39972J27869J65367q061K3752j22089j58984j45378
$$ plain form
9457 25176 234079 254306 162680 38194 -190408 -145009 6952 -99494 -144311 117716 175384
9446 175384 7576 20001 110536 88457 149415 367461 296437 236942 314887 95289 -24208
9435 -24208 181302 155734 98067 64290 10793 -116154 -189151 35750 95811 207526 215179
9424 215179 126795 241612 382304 239961 -29502 -83936 56811 35347 79423 213924
9414 213924 173219 65299 78746 143894 17444 53124 305867 251189 89070 80045 174196
9403 174196 381670 481041 261793 95979 66002 78888 158036 53600 26190 -46630 -51567
9392 -51567 -111606 -129209 -105028 -137960 -5008 -95574 -219062 -58021 -167927 -46198 26811
9381 26811 45791 73078 -147231 -292466 -330564 -206757 8427 245953 265328 327837 374981
$$ packed form
9457B5176K08903K0227r1626j24486k28602M5399J51961j06446m4817K62027N7668
9446A75384j67808J2425R0535k2079O0958K18046p1024n9495P7945k19598j19497
9435b4208K05510k5568n7667l3777n3497j26947p2997K24901O0061J11715P653
9424B15179q8384J14817J40692j42343k69463n4434J40747k1464M4076J34501
9414B13924m0705j07920J3447O5148j26450L5680K52743n4678j62119r025R4151
9403A74196K07474R9371k19248j65814k9977J2886P9148j04436k7410p2820m937
9392e1567o0039j7603K4181l2932J32952r0566j23488J61041j09906J21729P3009
9381B6811J8980K7287k20309j45235l8098J23807K15184K37526J9375O2509M7144
$$ plain form
9370 374981 339220 367051 328953 225347 127911 117080 189994 125960 85238 123720 140883
9359 140883 181615 387362 320228 232182 252222 273175 255515 88393 -152602 -67715 -6991
9348 -6991 -130893 -50881 4192 139688 153584 185687 129871 142748 54294 74805 274331
9337 274331 126268 82022 -24178 -52218 -17485 107044 -14642 -74844 89928 147912 -9019
9326 -9019 -189689 -12292 103467 220782 230160 46573 -13144 169557 276154 195673 -19933
9315 -19933 -21949 -24874 -146554 -74548 167251 198062 48072 -120696 -235337 -176759 -96856
9304 -96856 -16698 142386 255582 296390 8569 -49986 -97472 -131854 38182 294862 195313
9293 195313 46879 33651 160161 155224 125511 101268 -176669 -181751 -39827 35220 36605
$$ packed form
9370C74981l5761K7831l8098j03606r7436j0831P2914o4034m0722L8482J7163
9359A40883M0732K05747o7134q8046K0040K0953j7660j67122k40995Q4887O0724
9348f991j23902Q0012N5073J35496J3896L2103n5816J2877q8454K0511J99526
9337B74331j48063m4246j06200k8040L4733J24529j21686o0202J64772N7984j56931
9326i019j80670J77397J15759J17315R378j83587n9717J82701J06597q0481k15606
9315a9933k016k925j21680P2006K41799L0811j49990j68768j14641N8578P9903
9304i6856Q0158J59084J13196M0808k87821n8555m7486l4382J70036K56680r9549
9293A95313j48434j3228J26510m937k9713k4243k77937n082J41924P5047J385
$$ plain form
9282 36605 48859 63792 219023 312356 228643 116651 237369 240938 51506 -233909 -305529
9271 -305529 -94562 -40749 59988 188941 358167 233903 25027 -150244 -109073 -104439
9261 -104439 -109902 -128774 -43613 73512 -58888 -80207 62457 9901 -31978 -108631 -226546
9250 -226546 -322268 -86415 97863 -31599 -164570 -204081 -90921 -25184 272674 227660
9240 227660 114275 -139115 -265819 34844 112212 197315 108031 -151504 -253357 -371315
9230 -371315 -293497 -175063 -233531 -234737 -176869 -240625 -327247 -284203 -163782 -68650 140491
9219 140491 179796 157862 69909 157154 340632 408125 409391 318044 55931 -175717 -177764
9208 -177764 30864 -2051 -90492 -270105 -359043 -145001 -17810 -21675 -41995 -124345 -180728
$$ packed form
9282C6605J2254J4933J55231R3333q3713j11992J20718L569j89432k85415p1620
9271c05529K10967N3813J00737J28953J69226j24264k08876j75271M1171M634
9261a04439n463j8872Q5161J17125j32400k1319J42664n2556m1879p6653j17915
9250b26546r5722K35853J84278j29462j32971l9511J13160O5737K97858m5014
9240B27660j13385k53390j26704L00663P7368Q5103q9284k59535j01853j17958
9230c71315P7818J18434n8468j206N7868o3756q6622M3044J20421R5132K09141
9219A40491L9305k1934q7953Q7245J83478O7493J266r1347k62113k31648k047
9208a77764K08628l2915q8441j79613q8938K14042J27191l865k0320q2350n6383
$$ plain form
9197 -180728 -230277 -123824 -141948 -27400 4802 -183877 -273403 -149040 -153369 -87311 -66759
9186 -66759 -2748 30530 68220 -96799 -74747 -117575 -180647 -204341 -237030 -160316 108481
9175 108481 60254 -37908 -66004 -133428 -87210 -57896 16578 32076 -13301 -8011 172521 333765
9163 333765 259677 194427 386182 264753 39274 -184848 -343989 -275495 -88878 -109983
9153 -109983 -159172 -365399 -250364 -250226 -166099 -158513 -323820 -134458 -176588 -202394 -201203 -186418
9141 -186418 -254365 -166342 -88417 42513 277941 365164 201474 44115 -42720 -59456 -113372
9130 -113372 -104745 -126339 -37599 -3391 191673 251577 272564 226810 154053 -38373 -45556 22481
9118 22481 -36161 -113934 -61534 171006 147340 80053 28846 -34453 -198276 -242455 -262492
$$ packed form
9197a80728m9549J06453j8124J14548L2202j88679q9526J24363m329O6058K0552
9186f6759O4011L3278L7690j65019K2052m2828o3072k3694l2689P6714K68797
9175A08481m8227r8162k8096o7424M6218K9314P4474J5498m5377N290J80532J61244
9163C33765p4088o5250J91755j21429k25479k24122j59141O8494J86617k1105
9153a09983m9189k06227J15035J38Q4127P586j65307J89362m2130k5806J191J4785
9141a86418o7947Q8023P7925J30930K35428Q7223j63690j57359q6835j6736n3916
9130a13372Q627k1594Q8740L4208J95064N9904K0987m5754p2757j92426p183O8037
9118B2481n8642p7773N2400K32540k3666o7287n1207o3299j63823m4179k0037
$$ plain form
9107 -262492 -274322 -155947 -12470 60167 -120356 -55020 12233 -23597 -149001 -245339 -214204
9096 -214204 -221903 -136163 -61860 -37296 -49335 -52482 -206506 -251322 -96004 -157965 -342921
9085 -342921 -374580 -300893 -110752 -151280 -123814 78303 196621 133005 -18062 179626 288132
9074 288132 363245 450678 382258 281481 439775 243558 104266 28611 -25295 44798 99014
9063 99014 271572 284970 211296 180315 175534 34562 -44636 41098 74651 -143208 -44492
9052 -44492 125090 334829 228581 231430 76715 156129 99823 28933 157993 295829 285639
9041 285639 204377 29967 83019 -42201 -105398 -216724 -271278 -194611 -269739 -227420 -116758
9030 -116758 50141 66507 137247 158926 53643 98234 132565 -37421 -125548 -13811 -90609
$$ packed form
9107b62492j1830J18375J43477P2637j80523O5336O7253l5830j25404r6338L1135
9096b14204p699Q5740P4303K4564j2039l147j54024m4816J55318o1961j84956
9085c42921l1659P3687J90141m0528K7466K02117J18318o3616j51067J97688J08506
9074B88132P5113Q7433o8420j00777J58294j96217j39292p5655n3906P0093N4216
9063I9014J72558J3398p3674l0981m781j40972p9198Q5734L3553k17859R8716
9052d4492J69582K09739j06248K849j54715P9414n6306p0890J29060J37836j0190
9041B85639q1262j74410N3052j25220o3197j11326n4554P6667p5128M2319J10662
9030a16758J66899J6366P0740K1679j05283M4591L4331j69986q8127J11737p6798
$$ plain form
9019 -90609 12900 203517 122640 144786 218294 76742 169604 137999 110486 83025 234067
9008 234067 181854 111787 194856 182292 -17322 -241 -250303 -220468 -196909 -231717 3139
8997 3139 20346 -80382 -67817 -83992 -159886 -136371 75978 233182 77252 -24710 -58823
8986 -58823 -167227 -129372 -56059 -85470 -47509 226290 295809 359328 241666 275058 183216
8975 183216 24195 2739 93994 132032 100208 265960 418071 575168 546951 370957 159759
8964 159759 58547 -46259 -282887 -338461 -162119 -39385 -139425 -277259 -331800 -327976
8954 -327976 -188105 157855 380853 476935 279097 121769 299599 333967 221951 109434
8944 109434 -75110 40319 287167 224462 97118 28953 -84994 -71112 19394 90984 69533
$$ packed form
9019i0609J03509J90617q0877K2146P3508j41552R2862l1605k7513k7461J51042
9008B34067n2213p0067Q3069j2564j99614J7081k50062K9835K3559l4808K34856
8997C139J7207j00728J2565j6175p5894K3515K12349J57204j55930j01962l4113
8986e8823j08404L7855P3313k9411L7961K73799O9519O3519j17662L3392r1842
8975A83216j59021k1456R1255L8038l1824J65752J52111J57097k8217j75994k11198
8964A59759j01212j04806k36628n5574J76342J22734j00040j37834n4541L824
8954c27976J39871L45960K22998R6082j97838j57328J77830L4368j12016j12517
8944A09434j84544J15429K46848o2705j27344o8165j13947J3882R0506P1590k1451
$$ plain form
8933 69533 15221 32542 53303 422 -256025 -203054 -157369 -244182 -371402 -291958 -276291
8922 -276291 -250305 -146416 -112711 -156910 -226685 -180613 -143959 -126 76546 -26760 -147501
8911 -147501 -54967 6425 2550 -87477 -54901 -6878 103698 144845 -43455 -177535 -100836
8900 -100836 11893 -33961 -159485 -237054 -243424 -334908 -398091 -270431 -100550 -55055 -61593
8889 -61593 -10737 144566 115082 174363 220911 187315 163186 -120824 -225638 -121654 74565
8878 74565 98766 76800 188244 392098 533020 504368 428325 319444 348006 244185 176273
8867 176273 95443 101859 227175 411903 332318 308189 149772 -12547 -3656 48631 75397
8856 75397 -23657 -90979 -144165 -63234 -74721 -114899 -4861 -92133 95744 8372 -18074
$$ packed form
8933F9533n4312J7321K0761n2881k56447N2971M5685q6813j27220P9444J5667
8922b76291K5986J03889L3705m4199o9775M6072L6654J43833P6672j03306j20741
8911a47501R2534O1392l875r0027L2576M8023J10576M1147j88300j34080P6699
8900a00836J12729m5854j25524p7569o370r1484o3183J27660J69881M5495o538
8889f1593N0856J55303k9484N9281M6548l3596k4129k84010j04814J03984J96219
8878G4565K4201k1966J11444K03854J40922k8652p6043j08881K8562j03821o7912
8867A76273q0830O416J25316J84728p9585k4129j58417j62319Q891N2287K6766
8856G5397r9054o7322n3186Q0931j1487m0178J10038q7272J87877q7372k6446
$$ plain form
8845 -18074 169102 291297 350002 457793 291150 277793 390490 171631 -98242 -176911
8835 -176911 -158895 -81217 78226 186084 178447 73378 70703 65692 -151278 -115090 -65171
8824 -65171 129638 263616 269551 -14235 13393 165943 125129 -26880 -294420 -124561 249541
8813 249541 494023 403366 247860 375385 460107 288486 110384 123740 159036 -25808
8803 -25808 -230188 -289472 -265151 -139474 -25246 -35290 470 -88419 -128051 -137961 69697
8792 69697 248434 30043 -67814 -17534 113463 57517 168497 34838 -5399 -15979 -119010
8781 -119010 -239504 -269829 -178730 -40495 -72968 -95500 -177410 -230219 84564 318409 252783
8770 252783 247229 244293 333870 666521 781292 681450 575431 569190 585263 462077 260757
$$ packed form
8845a8074J87176J22195N8705J07791j66643j3357J12697k18859k69873p8669
8835a76911J8016P7678J59443J07858p637j05069k675n011k16970L6188M9919
8824f5171J94809J33978N935k83786K7628J52550m0814j52009k67540J69859L74102
8813B49541K44482r0657j55506J27525Q4722j71621j78102J3356L5296j84844
8803b5808k04380n9284K4321J25677J14228j0044L5760q8889l9632r910K07658
8792F9697J78737k18391r7857N0280J30997n5946J10980j33659m0237j0580j03031
8781a19010j20494l0325R1099J38235l2473k2532q1910n2809L14783K33845o5626
8770B52783n554k936Q9577L32651J14771r9842j06019o241J6073j23186k01320
$$ plain form
8759 260757 74318 -156975 -213439 -262692 -222698 -171694 -111880 -160240 -168100 -17169 -95503
8748 -95503 -280399 -346335 -41490 356 -21519 -10720 -100453 -154001 -130888 -31044 112088
8737 112088 4957 -118598 -112332 83745 127352 -5393 -247068 -175712 548 37521 74683
8726 74683 118533 41417 -11672 -150877 -168931 -70987 188460 254936 260738 273804 208791 161032
8714 161032 -52378 -5788 273796 373698 221709 274900 175326 44680 -89691 -57767 176201
8703 176201 284632 359312 256410 293629 262281 107149 226230 280145 285659 192074 12209
8692 12209 -107952 88750 126408 -28579 -31083 31442 213374 172071 -47225 32613 30662
8681 30662 -13072 -87242 15905 32647 -65450 -71702 -46502 32386 208116 126841 -5772
$$ packed form
8759B60757j86439k31293n6464m9253L9994N1004N9814m8360p860J50931p8334
8748i5503j84896o5936L04845M1846k1875J0799q9733n3548K3113R9844J43132
8737A12088j07131j23555O266J96077M3607j32745k41675P1356J76260L6973L7162
8726G4683M3850p7116n3089j39205j8054R7944K59447O6476N802J3066o5013m7759
8714A61032k13410M6590K79584R9902j51989N3191r9574j30646j34371L1924K33968
8703A76201J08431P4680j02902L7219l1348j55132J19081N3915N514r3585j79865
8692A2209j20161J96702L7658j54987k504O2525J81932m1303k19296P9838j951
8681C0662m3734p4170J03147J6742r8097o252K5200P8888J75730q1275j32613
$$ plain form
8670 -5772 -23423 4197 141022 170559 214508 299135 308459 146155 54541 -15532 18404 166553
8658 166553 164240 8034 -13353 77187 115991 -4936 89423 131210 165941 242892 268654
8647 268654 266791 118927 44443 170644 438045 417884 138821 35513 45993 173603 198550
8636 198550 167353 -6079 36938 14588 135125 276401 122977 88306 148773 348479 400306
8625 400306 329912 206728 204997 386624 447502 446474 327538 182648 305220 153485 39566
8614 39566 -38765 196390 156107 74081 200846 65630 14532 128639 -72852 -96238 48570
8603 48570 -63228 -199606 -77976 -121143 -164524 146328 198382 139197 173800 187108 176809
8592 176809 235206 -6610 -166004 -254592 -71290 61499 337586 402177 443001 475804 398206
$$ packed form
8670e772j7651K7620J36825K9537M3949Q4627R324j62304r1614p0073L3936J48149
8658A66553k313j56206k1387R0540L8804j20927R4359M1787L4731P6951K5762
8647B68654j863j47864p4484J26201K67401k0161k79063j03308J0480J27610K4947
8636A98550l1197j73432M3017k2350J20537J41276j53424l4671O0467J99706N1827
8625D00306p0394j23184j731J81627O0878j028j18936j44890J22572j51735j13919
8614C9566p8331K35155m0283q2026J26765j35216n1098J14107k01491k3386J44808
8603D8570j11798j36378J21630m3167m3381L10852N2054n9185L4603J3308j0299
8592A76809N8397k41816j59394q8588J83302J32789K76087O4591M0824L2803p7598
$$ plain form
8581 398206 370602 461295 491290 647041 824441 849506 985362 1107635 912828 850009 873978
8570 873978 812068 870322 770812 737836 583105 389886 319324 159871 249032 430301 246433
8559 246433 33375 -97391 -42203 33970 284296 352579 347563 381637 484105 604994 459022
8548 459022 488107 507732 429119 615576 616404 423491 406162 362370 385837 415896 768127
8537 768127 1082292 1393897 2294616 3861186 5333569 5334386 4526670 3412511 2219750 1449318
8527 1449318 966034 780332 662928 579984 364435 461941 600552 603199 730557 713104
8517 713104 702108 540972 227782 187388 497248 298438 207176 341436 398907 132943
8507 132943 86464 177303 368242 569208 774043 760897 546255 565084 594908 458533 443301
$$ packed form
8581C98206k7604R0693K9995J55751J77400K5065J35856J22273j94807o2819K3969
8570H73978o1910N8254r9510l2976j54731j93219p0562j59453Q9161J81269j83868
8559B46433k13058j30766N5188P6173K50326O8283n016L4074J02468J20889j45972
8548D59022K9085J9625p8613J86457Q28j92913j7329m3792K3467L0059L52231
8537G68127L14165L11605R00719J566570J472383Q17q07716j114159j192761p70432
8527A449318m83284j85702j17404q2944k15549R7506J38611K647J27358j7453
8517G13104j0996j61136l13190m0394L09860j98810r1262J34260N7471k65964
8507A32943m6479R0839J90939K00966K04835j3146k14642J8829K9824j36375j5232
$$ plain form
8496 443301 485462 573365 788645 1196044 1649454 2539159 4278139 7479627 10662242 10401014
8486 10401014 8438530 6312827 4023022 2460168 1825891 1460783 1212176 1131700 849311
8477 849311 752532 535056 395170 305126 256006 367951 490602 514938 522010 432751 435218
8466 435218 541664 336272 279711 378743 647570 633057 535098 534555 349383 398210 574452
8455 574452 683416 615427 585359 693486 774191 824094 911096 1211564 1459082 1908121 2761277
8444 2761277 4155770 5510491 5450571 4637768 3571157 2416541 1732136 1446112 1148474
8435 1148474 839024 709120 672755 541135 554700 791261 842623 833601 826202 753597 672618
8424 672618 799071 923225 785518 783407 672990 484137 212086 326028 460009 330440
$$ packed form
8496D43301M2161Q7903K15280M07399M53410Q89705J738980L201488L182615k61228
8486A0401014j962484k125703k289805j562854o34277l65108k48607q0476k82389
8477H49311r6779k17476j39886r0044m9120J11945J22651K4336P072q9259K467
8466D35218J06446k05392n6561R9032K68827j4513r7959n43j85172M8827J76242
8455E74452J08964o7989l0068J08127Q0705M9903Q7002L00468K47518M49039Q53156
8444B761277J394493J354721n9920q12803j066611j154616o84405k86024k97638
8435A148474l09450j29904l6365j31620J3565K36561N1362r022p399p2605q0979
8424F72618J26453J24154j37707k111j10417j88853k72051J13942J33981j29569
$$ plain form
8414 330440 231453 152472 345841 378092 422522 276713 200416 160700 235287 391512 433847
8403 433847 305216 242737 298041 222502 68732 33823 185323 342202 221684 427780
8393 427780 634556 680113 749112 728190 585278 549078 609780 503400 378193 406124 417462
8382 417462 703908 802601 706580 643427 410520 294811 332463 371043 305147 431902 488595
8371 488595 395898 235285 259866 289777 262320 439684 421650 291943 125199 305436 384731
8360 384731 468342 546216 905122 979458 866050 607931 545748 408597 280507 110740
8350 110740 165171 338324 421118 551278 639161 763038 807621 618217 420079 281127
8340 281127 235831 63236 167374 326496 180056 204438 303886 378742 430279 421572 569464
$$ packed form
8414C30440r8987p8981J93369L2251M4430j45809p6297l9716P4587J56225M2335
8403D33847j28631o2479N5304p5539j53770l4909J51500J56879j20518K06096
8393D27780K06776M5557O8999k0922j42912l6200O0702j06380j25207K7931J1338
8382D17462K86446R8693r6021o3153k32907j15709L7652L8580o5896J26755N6693
8371D88595r2697j60613K4581K9911k7457J77364j8034j29707j66744J80237P9295
8360C84731Q3611P7874L58906P4336j13408k58119o2183j37151j28090j69767
8350A10740N4431J73153Q2794J30160Q7883J23877M4583j89404j98138j38952
8340B81127m5296j72595J04138J59122j46440K4382R9448P4856N1537q707J47892
$$ plain form
8329 569464 590980 805138 746256 552253 470571 482175 342231 70416 101500 217862 29779
8318 29779 94130 190117 255460 347065 379603 374499 497031 269870 219612 394686 487266
8307 487266 579822 679197 737048 570578 570648 555729 449118 486570 334937 272604 394228
8296 394228 278520 124570 272285 449755 563683 622337 562578 553983 283026 96944
8286 96944 280574 366765 161246 176439 373083 493919 399450 466478 504234 502088 546299
8275 546299 554920 645015 713671 636882 619776 674008 550131 424719 424753 386919 478682 561400
8263 561400 556458 631918 696374 550246 469324 362163 419999 606808 527351 259529 78295
8252 78295 134375 465567 549502 457432 393804 331149 289661 422406 277337 215352 450267
$$ packed form
8329E69464K1516K14158n8882j94003q1682J1604j39944k71815L1084J16362j88083
8318B9779O4351R5987O5343R1605L2538n104J22532k27161n0258J75074R2580
8307D87266R2556R9375N7851j66470P0j4919j06611L7452j51633o2333J21624
8296C94228j15708j53950J47715J77470J13928N8654n9759q595k70957j86082
8286I6944J83630Q6191k05519J5193J96644J20836r4469O7028L7756k146M4211
8275E46299Q621R0095O8656p6789j7106N4232j23877j25412L4l7834R1763Q2718
8263E61400m942P5460O4456j46128q0922j07161N7836J86809p9457k67822j81234
8252G8295N6080L31192Q3935r2070o3628o2655m1488J32745j45069o1985K34915
$$ plain form
8241 450267 530007 468521 273286 525694 617919 553741 448668 556390 628286 472830 452337
8230 452337 500944 402817 571095 731317 669493 723271 887128 868907 683948 697293 753543
8219 753543 660315 430321 401889 482925 472068 576055 582875 657037 652977 500117 570080
8208 570080 525469 397652 552893 721210 538459 556187 378658 338144 436603 469030 317512
8197 317512 170695 98691 178834 367850 543261 591931 669143 844127 884183 592327 325746
8186 325746 215822 361534 584764 641903 677701 707584 684612 542077 344741 367983 353218
8175 353218 495526 596597 459898 329474 527183 411638 293549 198211 90736 234559
8165 234559 379757 384260 216347 -97603 50615 184320 306340 203833 121575 55419
$$ packed form
8241D50267P9740o1486j95235K52408R2225o4178j05073J07722P1896j55456k0493
8230D52337M8607r8127J68278J60222o1824N3778J63857j8221j84959J3345N6250
8219G53543r3228k29994k8432Q1036j0857J03987O820P4162m060j52860O9963
8208E70080m4611j27817J55241J68317j82751J7728j77529m0514R8459L2427j51518
8197C17512j46817p2004Q0143J89016J75411M8670P7212J74984M0056k91856k66581
8186C25746j09924J45712K23230N7139L5798K9883k2972j42535j97336K3242j4765
8175C53218J42308J01071j36699j30424J97709j15545j18089r5338j07475J43823
8165B34559J45198M503j67913l13950J48218J33705J22020j02507q2258o6156
$$ plain form
8155 55419 1721 108859 322842 454102 558184 591037 496260 312421 553551 801929
8145 801929 662812 535152 440825 378985 184720 74446 28225 230972 350799 384188
8135 384188 486509 475906 477612 347861 183919 58636 33870 152964 290401 294757 177881
8124 177881 274997 264383 147354 258157 450561 464485 430879 407306 257249 289334 242352
8113 242352 233430 328690 229111 54755 141817 110045 56690 222166 306037 292241 357183
8102 357183 274115 314065 336407 381224 318662 181793 -123777 -99054 -130534 -29545 51563
8091 51563 104928 103799 153759 198737 149179 65797 70546 3632 36449 3359 85994 72970
8079 72970 -31260 -138546 -84259 62760 149010 407580 370716 221274 192932 173023 296283
$$ packed form
8155E5419n3698J07138K13983J31260J04082L2853r4777j83839K41130K48378
8145H01929j39117j27660r4327o1840j94265j10274m6221K02747J19827L3389
8135C84188J02321j0603J706j29751j63942j25283k4766J19094J37437M356j16876
8124A77881R7116j0614j17029J10803J92404J3924l3606k3573j50057L2085m6982
8113B42352q922R5260r9579j74356Q7062l1772n3355J65476Q3871j3796O4942
8102C57183q3068L9950K2342M4817o2562j36869l05570K4723l1480J00989Q1108
8091E1563N3365j129M9960M4978m9558q3382M749o6914L2817l3090Q2635j3024
8079G2970j04230j07286N4287J47019Q6250K58570l6864j49442k8342j9909J23260
$$ plain form
8068 296283 275937 143557 376468 213995 66209 75725 264254 266492 67835 22221 143436
8057 143436 205493 143978 98312 127198 189999 148842 170596 123551 24784 109386 176942 87278
8045 87278 63539 -3874 18379 -158032 -307666 -252650 -107835 -111444 -136245 -146066 -136816 -268871
8033 -268871 -66991 89142 -93529 -119705 26130 93505 -163928 -170341 -106410 -1379 22045
8022 22045 -100483 189935 335129 258271 117059 9324 41490 33713 212714 250804 299873
8011 299873 254435 397344 528331 464112 366236 297278 127392 112834 229128 -87921 -154852
8000 -154852 -91268 -146718 -37951 -227893 -243732 -176178 -188785 -217838 -174853 234216 368795
7989 368795 387241 288493 13372 -18883 280332 322177 45077 -41068 -225725 -33198 303108
$$ packed form
8068B96283k0346j32380K32911j62473j47786R516J88529K238j98657m5614J21215
8057A43436O2057o1515m5666K8886O2801m1157K1754m7045r8767Q4602O7556q9664
8045H7278k3739o7413K2253j76411j49634N5016J44815l609k4801r821R250j32055
8033b68871K01880J56133j82671k6176J45835O7375k57433o413O3931J05031K3424
8022B2045j22528K90418J45194p6858j41212j07735L2166p777J79001L8090M9069
8011B99873m5438J42909J30987o4219r7876o8958j69886j4558J16294l17049o6931
8000a54852O3584n5450J08767j89942j5839O7554j2607k9053M2985M09069J34579
7989C68795J8446r8748k75121l2255K99215M1845k77100q6145j84657J92527L36306
$$ plain form
7978 303108 366282 385676 413582 208355 95566 118863 208689 305998 169090 -32465 -39065
7967 -39065 -1280 -96175 -167711 -80065 -179228 -117942 68570 130490 209742 144349 -26927
7956 -26927 -76282 161274 109838 47585 156260 212023 108879 -58293 -11185 23927 -103505
7945 -103505 -95818 -136865 -68929 135311 220391 85423 -86194 5019 125361 55074 -69447
7934 -69447 -112847 -59352 -33039 -100477 -139529 -224745 -179695 -97127 7248 -88723 -67430 -96808
7922 -96808 -203247 -239488 -71818 22158 -69819 -198943 -161504 14904 182178 119384 61920
7911 61920 106011 242826 118325 70977 177535 257128 396989 287312 157718 51236
7901 51236 -167612 -245671 -138397 -118355 45984 206497 231713 220031 47086 -39113 -131107
$$ packed form
7978C03108O3174J9394K7906k05227j12789K3297Q9826R7309j36908k01555o600
7967c9065L7785r4895p1536Q7646r9163O1286J86512O1920P9252o5393j71276
7956b6927m9355K37556n1436o2253J08675N5763j03144j67172M7108L5112j27432
7945a03505P687m1047O7936K04240Q5080j34968j71617R1213J20342p0287j24521
7934f9447m3400N3495K6313o7438l9052q5216M5050Q2568J04375r5971K1293k9378
7922i6808j06439l6241J67670R3976r1977j29124L7439J76408J67274o2794n7464
7911F1920M4091J36815j24501m7348J06558P9593J39861j09677j29594j06482
7901E1236k18848p8059J07274K0042J64339J60513K5216j1682j72945q6199r1994
$$ plain form
7890 -131107 -280192 -8361 357468 270139 111778 -88141 22600 143854 104008 291542
7880 291542 269539 168647 225782 153259 135334 181002 262501 -9492 57383 139762 92399
7869 92399 -49544 -170605 -325850 -276351 -130537 -61948 2044 5231 -112496 -83103 -11723
7858 -11723 -15124 30166 91569 109884 138885 -17876 -43669 44413 185807 -48443 -111934
7847 -111934 -204438 -198413 -168120 43191 87638 -19381 108647 185941 21127 -137264 -125429
7836 -125429 4128 60373 -26113 -58770 186277 193292 114158 91588 -30682 -268274 -457304
7825 -457304 -208401 32767 114187 283213 414355 275082 4953 -75676 -40486 191640
7815 191640 319829 171280 137706 196163 121870 11730 -67083 -79005 -19710 93054 105159
$$ packed form
7890a31107j49085K71831L65829q7329j58361j99919J10741J21254l9846J87534
7880B91542k2003j00892N7135p2523j7925M5668Q1499k71993O6875Q2379m7363
7869I2399j41943j21061j55245M9499J45814O8589O3992L187j17727K9393P1380
7858a1723l401M5290O1403J8315K9001j56761k5793Q8082J41394k34250o3491
7847a11934r2504O025L0293K11311M4447j07019J28028P7294j64814j58391J1835
7836a25429J29557N6245q6486l2657K45047P015p9134k2570j22270k37592j89030
7825d57304K48903K41168Q1420J69026J31142j39273k70129q0629L5190K32126
7815A91640J28189j48549l3574N8457p4293j10140p8813j1922N9295J12764J2105
$$ plain form
7804 105159 -62213 -262019 -440130 -106862 115600 -139565 -106810 -61381 53972 47527
7794 47527 10786 188950 219902 54444 62339 219058 172386 148901 87944 -134856 -75555
7783 -75555 92365 196617 -41469 -97066 -59674 2431 39563 65790 -186691 -146064 -88241
7772 -88241 2274 -117977 -90714 -59617 -121892 -94572 5728 99648 58279 91364 -36754
7761 -36754 -2249 15831 -71229 85652 71481 79314 292635 434783 311785 124732 111020
7750 111020 202974 71362 -178312 -55788 94921 228742 194519 39419 114669 321473
7740 321473 319875 351566 311288 119693 143902 239259 52066 -33430 -112706 8674 82854
7729 82854 180821 48228 116886 72770 -42547 -211336 -229952 -221908 -79375 131649 169841
$$ packed form
7804A05159j67372j99806j78111L33268K22462k55165L2755M5429J15353o445
7794D7527l6741J78164L0952j65458P895J56719m6672k3485o0957k22800N9301
7783g5555J67920J04252k38086n5597L7392O2105L7132K6227k52481M0627N7823
7772h8241R0515j20251K7263L1097o2275K7320J00300R3920m1369L3085j28118
7761c6754L4505J8080q7060J56881j4171P833K13321J42148j22998j87053j3712
7750A11020R1954j31612k49674J22524J50709J33821l4223j55100P5250K06804
7740C21473j598L1691m0278j91595K4209R5357j87193q5496p9276J21380P4180
7729H2854R7967j32593O8658m4116j15317j68789j8616Q044J42533K11024L8192
$$ plain form
7718 169841 28486 -93977 202170 427753 351110 277176 252082 240335 192412 -22771 -8034
7707 -8034 -48712 -206995 -11849 -4908 -230304 -362163 -263633 -158758 25241 -48372 -151768
7696 -151768 -149864 -51017 114459 111247 49483 37208 -21437 -157033 -222921 75323 266211
7685 266211 162814 -77973 -71659 100502 144562 165925 297897 418092 317325 246043 132664
7674 132664 183410 405215 272626 45451 121966 44902 -133181 -56313 132213 262929
7664 262929 199454 149604 -28838 -184626 -218680 -174672 -124586 -202981 -231257 -146128 23790
7653 23790 175468 263425 362688 183716 139827 21252 -62353 -188038 -182797 -142959 -303238
7642 -303238 -397194 -356512 -343614 -68480 27090 -34272 -65338 -118799 -47777 -161452 -144223
$$ packed form
7718A69841j41355j22463K96147K25583p6643p3934k5094j1747m7923k15183J4737
7707h034m0678j58283J95146O941k25396j31859R8530J04875J83999p3613j03396
7696a51768J904R8847J65476l212o1764j2275n8645j35596o5888K98244J90888
7685B66211j03397k40787O314J72161M4060K1363J31972J20195j00767p1282j13379
7674A32664N0746K21805j32589k27175P6515p7064j78083P6868J88526J30716
7664B62929o3475m9850j78442j55788l4054M4008N0086p8395k8276Q5129J69918
7653B3790J51678Q7957R9263j78972m3889j18575q3605j25685N241L9838j60279
7642c03238r3956M0682J2898K75134R5570o1362l1066n3461P1022j13675J7229
$$ plain form
7631 -144223 100829 142044 141456 87828 -117197 -241510 -285960 -22510 101266 -70840 -117479
7620 -117479 -94484 -83065 -159682 -162925 -307921 -290671 -47999 125325 227093 171620 7809
7609 7809 -28525 -2726 69857 214006 332530 266188 182426 114481 37298 -187087 -142599
7598 -142599 -190079 -235710 -46920 78235 113548 175234 144715 94997 144140 217888 488741
7587 488741 459464 154161 -29932 -10189 -40410 24320 174048 230496 4162 86829 -26481
7576 -26481 -183283 -241074 -366524 -452946 -351378 -110919 -42125 11657 -73007 -90097 -95765
7565 -95765 -13109 65660 -25896 -112713 -176617 -231025 -229381 -249768 -369478 -499548 -305576
7554 -305576 -260212 -54209 53972 -14933 103193 199164 10149 -18847 27858 96376 19748
$$ packed form
7631a44223K45052M1215n88n3628k05025j24313m4450K63450J23776j72106m6639
7620a17479K2995J1419p6617l243j44996J7250K42672J73324J01768n5473j63811
7609G809l6334K5799P2583J44149J18524o6342q3762o7945p7183k24385M4488
7598a42599m7480m5631J88790J25155L5313O1686l0519m9718M9143P3748K70853
7587D88741k9277l05303j84093J9743l0221O4730J49728N6448k26334Q2667j13310
7576b6481j56802n7791j25450q6422J01568K40459O8794N3782q4664j7090n668
7565i5765Q2656P8769r1556q6817o3904n4408J644k0387j19710j30070J93972
7554c05576M5364K06003J08181o8905J18126R5971j89015k8996M6705O8518p6628
$$ plain form
7543 19748 -50873 138547 292982 294569 143918 29911 41078 67716 179 -77844 -166293
7532 -166293 -77864 -209354 50445 235663 204809 250475 33084 -135871 155414 171782
7522 171782 210710 193171 302360 163957 51841 -17741 -49996 -90661 -103624 -22678 36100
7511 36100 29752 -22553 -15448 147688 43799 -70729 -7270 -143919 -11288 91966 82661
7500 82661 34232 -29351 -122363 -175302 -53213 -85093 -198936 -31313 -42022 -116925 -124993
7489 -124993 155246 108932 99477 37347 45872 214173 307652 225592 304227 369519 313503 257906
7477 257906 225510 472125 398164 342373 145989 -104079 -36656 -84874 -184600 -207808 -270713
7466 -270713 -372128 -75799 273582 389981 350616 14997 -109052 -121059 -161326 31719
$$ packed form
7543A9748p0621J89420J54435J587j50651j14007J1167K6638o7537p8023q8449
7532a66293Q8429j31490K59799J85218l0854M5666k17391j68955K91285J6368
7522A71782L8928j7539J09189j38403j12116o9582l2255m0665j2963Q0946N8778
7511C6100o348n2305P105J63136j03889j14528O3459j36649J32631J03254r305
7500H2661m8429o3583r3012n2939J22089l1880j13843J67623j0709p4903q068
7489a24993K80239m6314r455o2130Q525J68301R3479q2060P8635O5292n6016n5597
7477B57906l2396K46615p3961n5791j96384k50068O7423m8218r9726k3208o2905
7466b70713j01415K96329L49381J16399l9365l35619j24049j2007m0267J93045
$$ plain form
7456 31719 50734 44231 -27222 -111285 -11274 192476 128177 133167 47641 -33198 -67159 -90190
7444 -90190 65131 86908 -44698 -85797 -54064 29511 229524 349475 151334 96766 3322
7433 3322 -5338 2473 13093 -20043 -230123 -280312 -234183 -195364 -386498 -317557 -40243 -30017
7421 -30017 -192339 -170844 13002 141821 75991 4268 146269 96751 -35706 -160307 -172607
7410 -172607 -48360 -59207 -117981 -283001 -352223 -219609 151406 174572 79893 120644 -19444
7399 -19444 -80664 -43962 -84641 -129898 -266246 -438878 -348585 -64368 76928 181677 255232
7388 255232 15191 -96937 -6649 56200 40282 36017 -62390 -98539 -33499 68967 247475
7377 247475 2482 -83696 49237 15788 -29460 20283 -75337 -287259 -402193 -397044 -400984
$$ packed form
7456C1719J9015o503p1453q4063J00011K03750o4299M990q5526q0839l3961k3031
7444i0190J55321K1777j31606m1099L1733Q3575K00013J19951j98141n4568r3444
7433C322q660P811J0620l3136k10080n0189M6129L8819j91134O8941K77314J0226
7421c0017j62322K1495J83846J28819o5830p1723J42001m9518j32457j24601j2300
7410a72607J24247j0847n8774j65020o9222J32614L71015K3166r4679M0751j40088
7399a9444o1220L6702m0679m5257j36348j72632R0293K84217J41296J04749P3555
7388B55232k40041j12128R0288O2849j5918m265r8407l6149O5040J02466J78508
7377B47475k44993q6178J32933l3449m5248M9743r5620k11922j14934N149l940
$$ plain form
7366 -400984 -401810 -345769 -6257 89306 -4945 -229079 -409433 -377512 -437559 -304904 -115219
7355 -115219 -30725 -132627 -313522 -233935 -197000 -331041 -432229 -287284 -184814 -191651 -25572
7344 -25572 119388 -75213 -161073 -139171 5173 122829 195412 266675 386652 376078 419696
7333 419696 272071 142445 44660 80610 133306 239149 308646 266833 79247 88727 61482
7322 61482 119915 27605 -59319 18014 -112702 -206635 -162364 -27589 -120395 -363304 -260019
7311 -260019 -145994 3328 96033 82876 101064 -36784 3073 158062 146297 24990 -182957
7300 -182957 -69008 83909 102859 -72304 -201637 -19916 -80265 81098 28701 -196955
7290 -196955 -44553 204539 207382 55668 -10122 -121263 -104634 -26550 -115847 -215493 -246544
$$ packed form
7366d00984q26N6041L39512R5563r4251k24134j80354L1921o0047J32655J89685
7355a15219Q4494j01902j80895P9587L6935j34041j01188J44945J02470o837J66079
7344b5572J44960j94601q5860K1902J44344J17656P2583P1263J19977j0574M3618
7333D19696j47625j29626r7785L5950N2696J05843O9497m1813j87586R480k7245
7322F1482N8433r2310q6924P7333j30716r3933M4271J34775r2806k42909J03285
7311b60019J14025J49322R2705j3157J8188j37848L9857J54989j1765j21307k07947
7300a82957J13949J52917J8950j75163j29333J81721o0349J61363n2397k25656
7290a96955J52402K49092K843j51714o5790j11141J6629P8084q9297r9646l1051
$$ plain form
7279 -246544 -179397 -148528 -198646 -25658 125228 119754 -134972 -446532 -490631 -162219 7269
7268 7269 -41486 -86508 -79266 -83259 13917 90242 77172 -248458 -527582 -483219 -351862 -305214
7256 -305214 -223662 -146542 -266385 -342688 -428956 -256698 -163239 -136005 3459 90520 -5952
7245 -5952 -72907 -146010 -147158 -122801 -31609 -79520 -58124 -61083 -280996 -378756 -303807 -61720
7233 -61720 -48906 -156520 -204396 -373019 -319526 -194832 -48219 -40224 129369 -18472 13568
7222 13568 170231 107953 -103634 -174265 -74151 -175836 -90064 -112082 -53701 -96405 -90545
7211 -90545 -118545 -243577 -257976 -293907 -58583 84778 53114 -111731 -206642 -223911 -314069
7200 -314069 -282823 -178701 111217 26162 -133934 -204901 -53928 -35721 -258584 -255291 -68776
$$ packed form
7279b46544O7147L0869n0118J72988J50886n474k54726l11560m4099L28412J69488
7268G269m8755m5022P242l993R7176P6325j3070l25630k79124M4363J31357M6648
7256c05214Q1552P7120j19843p6303q6268J72258R3459K7234J39464Q7061r6472
7245e952o6955p3103j148K4357R1192m7911K1396k959k19913r7760P4949K42087
7233f1720J2814j07614m7876j68623N3493J24694J46613P995J69593j47841L2040
7222A3568J56663o2278k11587p0631J00114j01685Q5772k2018N8381m2704N860
7211i0545k8000j25032j4399l5931K35324J43361l1664j64845r4911j7269r0158
7200c14069L1246J04122K89918q5055j60096p0967J50973J8207k22863L293J86515
$$ plain form
7189 -68776 -132036 -180065 -168897 -116168 -108392 -139533 -128852 -38046 -93250 -44570 184635 175036
7177 175036 -93286 -153746 -27877 93323 120798 -93030 -352410 -154127 -30970 148766
7167 148766 -47078 -246763 -213063 -145629 -176139 -98889 -78883 -305422 -238550 94710 91671
7156 91671 138505 61956 122038 46485 -18951 137609 195004 60475 116692 53432 -227098
7145 -227098 -241599 -47675 -2306 -182403 -141287 -34943 -5700 -46907 -79754 -248910 -43601
7134 -43601 32873 -132937 -254344 -349191 -78001 -54221 -204141 -85120 -112605 -346098 -396229
7123 -396229 -389799 -456716 -479334 -494060 -409150 -137845 42609 -73522 -248662 -279303 -251854
7112 -251854 -205940 -182409 -112786 -258057 -461892 -479427 -469008 -205667 -43391 60670 -125218
$$ packed form
7189f8776o3260m8029J1168N2729P776l1141J0681R0806n5204M8680K29205r599
7177A75036k68322o0460J25869J21200K7475k13828k59380J98283J23157J79736
7167A48766j95844j99685L3700O7434l0510P7250K0006k26539O6872L33260l039
7156I1671M6834p6549O0082p5553o5436J56560N7395j34529N6217o3260k80530
7145b27098j4501J93924M5369j80097M1116J06344K9243m1207l2847j69156K05309
7134d3601P6474j65810j21407r4847K71190K3780j49920J19021k7485k33493n0131
7123c96229O430o6917k2618j4726Q4910K71305J80454j16131j75140l0641K7449
7112b51854M5914K3531O9623j45271k03835j7535J0419K63341J62276J04061j85888
$$ plain form
7101 -125218 -408897 -318017 -168784 -30514 -67767 -93598 -114032 -138861 -131022 94126 117044
7090 117044 -47033 -219198 -395170 -349689 -344545 -110944 -83403 -105850 -25342 -123594 -410566
7079 -410566 -474417 -378980 -283322 -260330 -344834 -272575 -193771 -239801 -266292 -158089 -168247
7068 -168247 -173905 -24596 -55075 -34718 -135320 -286614 -285308 -249446 -85947 -20694 -150856
7057 -150856 -223026 -95436 -14251 30525 -143679 -376316 -405640 -337859 -9935 26316 -73441
7046 -73441 14344 254565 230432 224728 60900 -50830 -114152 103209 190225 63712 -99863
7035 -99863 -225249 -73732 67851 80224 90518 82699 5947 -213848 -159824 -70878 8880
7024 8880 19622 -76075 96166 222653 212520 31350 18613 -26330 -116993 -209151 -116531
$$ packed form
7101a25218k83679R0880J49233J38270l7253k5831k0434k4829P839K25148K2918
7090A17044j64077j72165j75972M5481N144K33601K7541k2447Q0508r8252k86972
7079d10566o3851R5437R5658K2992q4504P2259P8804m6030k6491J08203j0158
7068a68247n658J49309l0479K0357j00602j51294J306L5862J63499O5253j30162
7057a50856p2170J27590Q1185M4776j74204k32637k9324O7781L27924L6251r9757
7046g3441Q7785K40221k4133n704j63828j11730o3322K17361Q7016j26513j63575
7035i9863j25386J51517J41583J2373J0294p819p6752k19795N4024Q8946P9758
7024H880J0742r5697J72241J26487j0133j81170j2737m4943r0663r2158R2620
$$ plain form
7013 -116531 79367 196556 177587 -109279 -238411 -182992 -121938 -41963 43847 -80517 -99926
7002 -99926 -171393 -312021 -156729 258782 446518 274021 289189 258894 35362 -67490
6992 -67490 -40951 93844 62250 -146105 -80666 -13580 156340 240168 220806 155893 187653
6981 187653 119788 -38098 -127972 -72020 -88738 34238 76788 -61000 -73353 90831 214012
6970 214012 40518 -126706 -380309 -506745 -487264 -241969 -10627 -165357 -248617 -278921
6960 -278921 -182807 -120212 -116460 -58717 -61251 -117684 -257684 -376957 -362280 -353482 -472777 -313692
6948 -313692 -214418 -201382 -267491 -211449 -56160 -252800 -384968 -384193 -142383 -36059 -216702
6937 -216702 -169743 -93659 -79706 74551 48831 -92649 -176739 -208894 -131613 -98067 -153703
$$ packed form
7013a16531J95898J17189j8969k86866j29132N5419O1054P9975Q5810j24364j9409
7002i9926p1467j40628J55292M15511J87736j72497J5168l0295k23532j02852
6992f7490K6539J34795l1594k08355O5439O7086J69920Q3828j9362o4913L1760
6981A87653o7865j57886q9874N5952j6718J22976M2550j37788j2353J64184J23181
6970B14012j73494j67224k53603j26436J9481K45295K31342j54730q3260l0304
6960b78921R6114O2595L752N7743k534n6433j40000j19273J4677Q798j19295J59085
6948c13692R9274J3036o6109N6042J55289j96640j32168P75K41810J06324j80643
6937b16702M6959P6084J3953J54257k5720j41480q4090l2155P7281L3546n5636
$$ plain form
6926 -153703 -212978 -190074 -161331 -168944 -303885 -443783 -273199 -393765 -440249 -527298 -298171
6915 -298171 -48132 -134442 -141477 -182681 -211624 26439 61942 -67841 -269067 -165639 30730
6904 30730 238078 142109 10687 -233401 -196877 11847 154618 246037 261620 201359 -72233
6893 -72233 -52352 60946 28142 -207194 -476153 -491856 -145933 78806 32890 -51415 -100803
6882 -100803 89729 123215 29905 84417 135908 -35549 -216364 -241770 -275946 -313485 -316953
6871 -316953 -259219 -163250 -36251 -215 -22032 28238 108775 35602 -84190 -54185 -30818
6860 -30818 1570 -250504 -334764 -28020 -128800 -245376 -178070 -257086 -262984 -348407 -258601
6849 -258601 -110948 85281 -3466 -28592 -114875 -270049 -178179 -177411 -448615 -425112 -420186
$$ packed form
6926a53703n9275K2904K8743p613j34941j39898J70584j20566m6484q7049K29127
6915b98171K50039q6310p035m1204k8943K38063L5503j29783k01226J03428J96369
6904C0730K07348r5969j31422k44088L6524K08724J42771R1419J5583o0261k73592
6893g2233J9881J13298l2804k35336k68959j5703L45923K24739m5916q4305m9388
6882a00803J90532L3486r3310N4512N1491j71457j80815k5406l4176l7539l468
6871c16953N7734R5969J26999L6036k1817N0270Q0537p3173j19792L0005K3367
6860c0818L2388k52074q4260L06744j00780j16576O7306p9016n898q5423Q9806
6849b58601J47653J96229q8747k5126q6283j55174R1870P68k71204K3503M926
$$ plain form
6838 -420186 -300458 -305275 -184730 -103072 -27284 -54879 -70002 -29942 -25043 -49958 -59433 -90129
6826 -90129 18094 -79020 -340517 -459756 -208869 -141138 -11373 90388 37897 -223914
6816 -223914 -199146 -111743 -160774 -15131 -65613 -122665 -150455 -211095 -72561 -61244 -202184
6805 -202184 -209697 -108429 -38258 -28461 -109690 -246349 -207318 -32975 22556 -90517 -31168
6794 -31168 38357 15036 -716 -166459 -334679 -351199 -184622 -106648 -53210 -166398 -256087
6783 -256087 -157952 31781 115418 148241 -8805 -267704 -303603 -145574 -96644 -76731 -106425
6772 -106425 -131150 65324 97119 10770 72972 95039 -7914 10086 -112673 -317848 -194858
6761 -194858 -134556 -238973 -262655 -122462 12661 88116 51756 -81831 -99571 -98914 32989
$$ packed form
6838d20186J19728m817J20545Q1658P5788k7595j5123M0060M899k4915r475l0696
6826i0129J08223r7114k61497j19239K50887O7731J29765J01761n2491k61811
6816b23914K4768Q7403m9031J45643n0482n7052k7790o0640J38534J1317j40940
6805b02184p513J01268P0171R797q1229j36659L9031J74343N5531j13073N9349
6794c1168O9525k3321j5752j65743j68220j6520J66577P7974N3438j13188q9689
6783b56087R8135J89733Q3637L2823j57046k58899l5899J58029M8930J9913k9694
6772a06425k4725J96474L1795q6349O2202K2067j02953J8000j22759k05175J22990
6761a94858O0302j04417k3682J40193J35123P5455l6360j33587j7740O57J31903
$$ plain form
6750 32989 -124133 -124772 -167769 -438773 -486559 -511192 -427378 -437658 -437213 -266599 -90292 -141947
6738 -141947 -286182 -126121 24460 -37849 -181414 -298286 -345950 -287968 -205150 -70360
6728 -70360 -96178 -178898 -295563 -239143 -321579 -291262 -334880 -428781 -282823 -38307 -126905
6717 -126905 70810 145196 -103055 -175386 -207511 -97905 -75308 -262457 -405417 -473045 -385525
6706 -385525 -414325 -434184 -333857 -360546 -497636 -347540 -119638 2234 -128677 -151519
6696 -151519 -55454 -60785 -252912 47145 101467 99654 187247 46205 141222 158906 94599
6685 94599 -50975 -223573 -115228 -279828 -200179 -86444 -108985 -164152 -127973 -51795 -174957
6674 -174957 -306974 -112622 206818 -19041 -269938 -272342 -38962 -126341 67134 221333
$$ packed form
6750C2989j57122o39m2997k71004m7786k4633Q3814j0280M45J70614J76307n1655
6738a41947j44235J60061J50581o2309j43565j16872m7664N7982Q2818J34790
6728g0360k5818q2720j16665N6420q2436L0317m3618r3901J45958K44516q8598
6717a26905J97715P4386k48251p2331l2125J09606K2597j87149j42960o7628Q7520
6706c85525k8800j9859J00327k6689j37090J50096K27902J21872j30911k2842
6696a51519R6065n331j92127L00057N4322j813Q7593j41042R5017J7684o4307
6685I4599j45574j72598J08345j64600P9649J13735k2541n5167L6179P6178j23162
6674a74957j32017J94352L19440k25859k50897k404K33380q7379J93475J54199
$$ plain form
6664 221333 234600 230082 367364 409925 469396 321690 276454 317366 29865 226239 308824
6653 308824 234374 345397 530315 641314 1051183 1833399 2859467 2805048 2357297 1885885
6643 1885885 1256213 835747 861956 1268687 1556224 1695326 2014556 2438781 3102198 3964373
6633 3964373 5160135 6851896 9491728 13511386 20785544 36153056 66758649 100167320
6625 100167320 94197511 74919218 53716233 32110252 20250560 14387342 10994437
6618 10994437 8686541 7048583 5698799 4641225 3978436 3617093 3259277 2927222 2692927
6609 2692927 2464718 2528914 2761530 3242223 3964526 3790676 3085525 2392436 1799367 1390710
6599 1390710 1128993 976565 896183 752706 808821 876262 643929 430159 563212 331063
$$ packed form
6664B21333J3267m518J37282M2561N9471j47706m5236M0912k87501J96374Q2585
6653C08824p4450J11023J84918J10999M09869P82216J026068n4419m47751m71412
6643A885885o29672m20466K6209M06731K87537J39102L19230M24225O63417Q62175
6633C964373J195762J691761K639832M019658P274158J5367512L0605593L3408671
6625A00167320n969809j9278293k1202985k1605981j1859692n863218l392905
6618A0994437k307896j637958j349784j057574o62789l61343l57816l32055k34295
6609B692927k28209O4196K32616M80693P22303j73850p05151o93089n93069m08657
6599A390710k61717j52428q0382j43477N6115O7441k32333k13770J33053k32149
$$ plain form
6589 331063 37451 -65989 152444 247533 286681 338531 338207 122627 -105638 86184 182685
6578 182685 116863 195911 344169 328116 121469 80823 9775 -56379 -149415 -55659 58759
6567 58759 -115348 -113810 -60541 100195 259270 169812 17372 5743 -47119 -204609 -16645
6556 -16645 30469 71896 118642 14706 -86611 -119183 -158493 41469 271038 327787 228639
6545 228639 173013 198042 138908 42799 -73838 -163651 -135341 -321255 -378206 -357252 -191753
6534 -191753 -135234 -266729 -228736 -100029 -38654 -212007 -322946 -300214 -149179 40958
6524 40958 -21 -31090 109198 201792 26731 -163785 -148461 -30559 -122508 42751 81606
6513 81606 13970 4529 226371 244437 165460 255961 138643 -50278 -72102 226839 397047
$$ packed form
6589C31063k93612j03440K18433R5089L9148N1850l24k15580k28265J91822R6501
6578A82685o5822P9048J48258j6053k06647m0646p1048o6154r3036R3756J14418
6567E8759j74107J538N3269J60736J59075q9458j52440j1629n2862j57490J87964
6556a6645M7114M1427M6746j03936j01317l2572l9310J99962K29569N6749r9148
6545B28639n5626K5029n9134r6109j16637q9813K8310j85914n6951K0954J65499
6534a91753N6519j31495L7993J28707O1375j73353j10939K2732J51035J90137
6524D0958m0979l1069J40288R2594j75061j90516J5324J17902r1949J65259L8855
6513H1606o7636r441K21842J8066p8977R0501j17318j88921k1824K98941J70208
$$ plain form
6502 397047 336043 162943 54467 -137813 -141904 -117267 -45753 58259 31246 14273 82707
6491 82707 49023 -149769 -359319 -347394 -260301 -73211 42308 -91813 -2108 216533 127759
6480 127759 -124333 -104696 36850 153483 111530 -106145 -84756 -43361 -49444 15008 -60828
6469 -60828 -241412 20992 156385 154694 136749 -74077 -339286 -248040 -62239 -40127 -32191
6458 -32191 -117546 -170507 -104129 -13048 -211524 -185022 -342309 -455196 -462903 -317574 -225736
6447 -225736 -210589 -106180 -177447 -307367 -266677 -295161 -289719 -145506 -61081 -185749 -199518
6436 -199518 -118118 125423 409363 308280 145097 -209739 -201902 -154276 -359397 -341396 -235497
6425 -235497 -275322 -380348 -352832 -243589 61299 214512 209686 131036 -103016 -83448 -47999
$$ packed form
6502C97047o1004j73100j08476j92280m091K4637P1514J04012k7013j6973O8434
6491H2707l3684j98792k09550J1925Q7093J87090J15519j34121Q9705K18641q8774
6480A27759k52092J9637J41546J16633m1953k17675K1389M1395o083O4452p5836
6469f0828j80584K62404J35393j691j7945k10826k65209R1246J85801K2112P936
6458c2191q5355n2961O6378R1081j98476K6502j57287j12887p707J45329R1838
6447b25736J5147J04409p1267j29920M0690k8484N442J44213Q4425j24668j3769
6436a99518Q1400K43541K83940j01083j63183l54836P837M7626k05121J8001J05899
6425b35497l9825j05026K7516J09243L04888J53213m826p8650k34052J9568L5449
$$ plain form
6414 -47999 -134600 16927 84231 -9634 -132749 -57023 -4805 -15473 13061 41197 -48651
6403 -48651 -166297 -110373 -124339 -180484 -116742 7219 -104427 -71503 42416 -169012 -502144
6392 -502144 -685779 -773185 -606930 -397067 -217410 72992 207255 142483 75683 10699
6382 10699 -104385 -151243 -217253 -232218 -212718 -301304 -287480 -254831 -208503 -212022 -220923 -222740
6370 -222740 -339242 -304994 -169395 -128745 114888 196488 138315 152887 105350 131371 94158
6359 94158 144778 25209 -116833 -120528 -255814 -232912 57525 139960 70610 -15036 -211629
6348 -211629 -280649 -376044 -300100 -157963 69597 111517 112570 120407 -7115 -23404 -49736
6337 -49736 13193 259473 173057 232126 147884 12672 -263417 -262658 -92004 -133749 -201078
$$ packed form
6414d7999q6601J51527O7304r3865j23115P5726N2218j0668K8534K8136q9848
6403d8651j17646N5924j3966n6145O3742J23961j11646L2924J13919k11428l33132
6392e02144j83635q7406J66255K09863J79657K90402J34263o4772o6800o4984
6382A0699j15084m6858o6010j4965J9500q8586J3824L2649M6328l519q901j817
6370b22740j16502L4248J35599M0650K43633Q1600n8173J4572m7537K6021l7213
6359I4158N0620j19569j42042l695j35286K2902K90437Q2435o9350q5646j96593
6348b11629o9020r5395P5944J42137K27560M1920J053P837j27522j6289k6332
6337d9736O2929K46280q6416N9069q4242j35212k76089P59J70654m1745o7329
$$ plain form
6326 -201078 -142349 -227912 -211059 16828 126924 165668 66479 143692 79279 66131 131001
6315 131001 18812 16643 303108 355518 172295 201464 -4778 -132069 -58248 45538 210665
6304 210665 172240 201387 57182 2531 -130738 -192253 -73584 -4496 28200 147411 100400
6293 100400 -9061 -48884 112054 228860 267185 210352 46095 30223 5374 -55536 -37357
6282 -37357 -97560 -9939 -12688 -138908 -118019 -50676 -53978 -63193 -221114 -102025 10433 -214443
6270 -214443 -315027 -114441 51118 -68210 -238873 -337034 -324016 -370773 -399245 -223486
6260 -223486 -57519 52306 129183 -1820 -128303 19933 140879 53144 -26312 -25389 77247
6249 77247 142320 -11636 -32723 -14085 85593 91635 -22600 -150417 45640 126998 76028
$$ packed form
6326b01078N8729q5563J6853K27887J10096L8744r9189P7213o4413j3148O4870
6315A31001j12189k169K86465N2410j83223K9169k06242j27291P3821J03786J65127
6304B10665l8425K9147j44205n4651j33269o1515J18669O9088L2696J19211m7011
6293A00400j09461l9823J60938J16806L8325n6833j64257j5872k4849o0910J8179
6282c7357o0203Q7621k749j26220K0889O7343l302r215j57921J19089J12458k24876
6270b14443j00584K00586J65559j19328j70663r8161J3018m6757k8472J75759
6260b23486J65967J09825P6877j31003j26483J48236J20946q7735p9456R23J02636
6249G7247O5073j53956k1087J8638R9678O042j14235j27817J96057Q1358n0970
$$ plain form
6238 76028 -21315 -32851 -139966 -217738 -330597 -486878 -616480 -566106 -410581 -402447 -419064
6227 -419064 -283389 -351383 -420804 -311036 -169781 -15069 83207 32055 -177682 -133685 -119220
6216 -119220 -343584 -336787 -225382 -327153 -464275 -468333 -251851 -134364 -221881 -300819 -299229
6205 -299229 -276005 -125075 1269 -141170 -347846 -438366 -212027 -92039 39645 56713
6195 56713 -82396 -200114 -328052 -268210 -187966 -54986 39969 167755 219363 177054 -29247
6184 -29247 10851 161700 151342 -74318 -252579 -69481 -31861 -214489 -298089 -108380 -86980
6173 -86980 14069 121749 10903 29950 -31594 -31909 -34207 25981 104986 -48767 -312064
6162 -312064 -521675 -415720 -70337 -8604 -166344 -206890 35312 70681 143921 236405 248115
$$ packed form
6238G6028r7343j1536j07115p7772j12859j56281j29602N0374J55525Q134j6617
6227d19064J35675o7994o9421J09768J41255J54712R8276n1152k09737M3997J4465
6216a19220k24364O797J11405j01771j37122m058K16482J17487q7517p8938J590
6205b99229K3224J50930J26344j42439k06676r0520K26339J19988J31684J7068
6195E6713j39109j17718j27938N9842Q0244J32980R4955J27786N1608m2309k06301
6184b9247M0098J50849j0358k25660j78261J83098L7620j82628q3600J89709K1400
6173h6980J01049J07680j10846J9047o1544l15k298O0188P9005j53753k63297
6162c12064k09611J05955L45383O1733j57740m0546K42202L5369P3240R2484J1710
$$ plain form
6151 248115 273838 277158 38097 -167441 -172249 -5754 32489 -54633 -552 -108331 57116
6140 57116 -24265 -117195 -210340 -228832 -59504 -2254 -64307 -235463 -292338 -176043 44797
6129 44797 43484 -64236 -92182 -130730 -57631 -34448 82393 75388 94563 135356 28834 -28282
6117 -28282 -35273 -30626 -20311 -14930 -167567 -167037 -43898 -44196 -391120 -438312 -171448 -28890
6105 -28890 39015 18695 -95701 -27245 -128409 -127023 -57400 -114812 -160471 -177784 -181187 -80682
6093 -80682 -248113 -127030 -41093 -138785 -286252 -387017 -340167 -137189 -77061 -180735 -184825
6082 -184825 -421367 -565538 -684589 -470016 -151264 -25477 50430 -42758 -287534 -179675
6072 -179675 -105369 -202893 -138257 -157868 -167433 -253831 -235720 -4291 96550 171015 -112365
$$ packed form
6151B48115K5723L320k39061k05538m808J66495L8243q7122N4081j07779J65447
6140E7116q1381r2930r3145j8492J69328N7250o2053j71156n6875J16295K20840
6129D4797j313j07720k7946l8548P3099K3183J16841p005J9175M0793j06522n7116
6117b8282o991M647J0315N381j52637N30J23139k98l46924m7192K66864J42558
6105b8890O7905k0320j14396O8456j01164J386O9623n7412m5659j7313l403J00505
6093h0682j67431J21083Q5937r7692j47467j00765M6850K02978O0128j03674m090
6082a84825k36542j44171j19051K14573L18752J25787P5907r3188k44776J07859
6072a79675P4306r7524O4636j9611r565q6398J8111K31429J00841P4465k83380
$$ plain form
6061 -112365 -176163 14958 -147076 -206234 -227591 -31464 -36572 -61463 -98017 15578 -17103
6050 -17103 -203393 -354289 -351674 20507 396920 192903 45568 -67771 -117768 -77165 215832
6039 215832 250352 33075 -12692 88385 98357 68755 58652 -93098 -152377 -77393 -117553
6028 -117553 -103630 -211223 -405448 -393027 -253228 -46188 42179 73890 143 -26419 149724
6017 149724 172016 95272 12980 80281 -49212 -185991 -213455 -196406 -295238 -373630 -297506
6006 -297506 -293898 -253667 -169851 -123632 37906 -159017 43190 63476 -26584 67858 114364
5995 114364 -103991 -190209 -208280 24879 -21450 -203664 -168943 -58350 -96705 -256283 -238582
5984 -238582 -324775 -198563 19848 147301 127473 175740 37113 234910 73899 -2552
$$ packed form
6061a12365o3798J91121j62034n9158k1357J96127n108k4891l6554J13595l2681
6050a7103j86290j50896K615L72181L76413k04017j47335j13339m9997M0603K92997
6039B15832L4520k17277m5767J01077R972k9602j0103j51750n9279P4984m0160
6028a17553J3923j07593j94225J2421J39799K07040Q8367L1711p3747k6562J76143
6017A49724K2292p6744q2292O7301j29493j36779k7464J7049r8832p8392P6124
6006b97506L608M0231Q3816M6219J61538j96923K02207K0286r0060R4442M6506
5995A14364k18355q6218j8071K33159m6329j82214L4721J10593l8355j59578J7701
5984b38582q6193J26212K18411J27453j9828M8267j38627J97797j61011p6451
$$ plain form
5974 -2552 -86322 -120914 22382 206116 181520 129673 144920 188024 249676 44569 -217989
5963 -217989 -183720 -46015 -3993 -80239 -192780 -383278 -430315 -279805 -224122 -78480 -174474
5952 -174474 -142401 -346045 -475186 -471126 -239249 -136599 -189967 -143472 102041 78669 -33613
5941 -33613 -284329 -198435 -99236 51352 -82450 -271266 -235944 -55600 -316269 -285221 -31590
5930 -31590 -102722 -135272 -294681 -418634 -217653 -38650 -111869 -73856 84591 254627 355303
5919 355303 338894 380495 429183 267093 41840 -10544 38701 -8263 -106517 -115963 158581
5908 158581 219061 90957 -232376 -278326 69102 54899 124551 10664 -115471 -99667 -69703
5897 -69703 -98298 -16890 -136429 -330224 -269300 -225199 -118343 10570 -81079 -186585 -201432
$$ packed form
5974b552q3770l4592J43296J83734k4596n1847J5247M3104O1652k05107k62558
5963b17989L4269J37705M2022p6246j12541j90498m7037J50510N5683J45642r5994
5952a74474L2073k03644j29141M060K31877J02650n3368M6495K45513k3372j12282
5941c3613k50716Q5894R9199J50588j33802j88816L5322J80344k60669L1048K53631
5930c1590p1132l2550j59409j23953K00981J79003p3219L8013J58447J70036J00676
5919C55303j6409M1601M8688j62090k25253n2384M9245m6964r8254r446K74544
5908A58581O0480j28104l23333m5950L47428j4203O9652j13887j26135J5804K9964
5897f9703k8595Q1408j19539j93795O0924M4101J06856J28913r1649j05506j4847
$$ plain form
5886 -201432 -185384 165230 214217 68283 -38573 68075 5126 -11611 -77924 -117579 -160830
5875 -160830 -258759 -321268 -272651 -175663 -57284 -103674 -182868 -142758 -256793 -291212 -165243
5864 -165243 -67601 -29917 23935 36295 92948 199738 244163 9001 31551 8467 111129
5853 111129 73911 84109 46072 1315 -68096 -289112 -241242 -66949 68136 111797 42112
5842 42112 8648 -39293 55123 -71383 -101807 -83476 -69154 -116763 -118547 -114182 -59023 66131
5830 66131 244693 178316 102971 32098 163223 149658 232434 215050 63967 177235 262756
5819 262756 -64475 -252168 -261351 -404448 -246326 27251 187854 250940 99714 -28051
5809 -28051 -92350 -86061 -43051 -135427 -33926 -72691 -131788 8307 176805 221526 244736
$$ packed form
5886b01432J6048L50614M8987j45934j06856J06648o2949j6737o6313l9655m3251
5875a60830r7929o2509M8617R6988J18379m6390p9194M0110j14035l4419J25969
5864a65243R7642L7684N3852J2360N6653J06790M4425k35162K2550k3084J02662
5853A11129l7218J0198l8037m4757o9411k21016M7870J74293J35085M3661o9685
5842D2112l3464m7941R4416j26506l0424J8331J4322m7609j784M365N5159J25154
5830F6131J78562o6377p5345p0873J31125j3565Q2776j7384j51083J13268Q5521
5819B62756l27231j87693r183j43097J58122K73577J60603O3086j51226j27765
5809b8051o4299O289M3010r2376J01501l8765n9097J40095J68498M4721K3210
$$ plain form
5798 244736 112515 115893 24381 48067 -57074 -366328 -257582 -302775 -500725 -377936 -241613
5787 -241613 -71955 -149106 -305402 -564265 -505350 -324076 -166037 -353376 -372599 -445454
5777 -445454 -556600 -289776 -208236 -65690 -133709 -83151 66848 232991 334995 164846
5767 164846 -85410 -139580 84893 141852 17669 -15808 -258486 -351985 -466798 -279274
5757 -279274 -10484 117712 379661 223192 -166995 -252731 72136 130888 39448 160667
5747 160667 162731 -9662 -35681 -293754 -209291 55124 170894 172441 201521 189621 206438
5736 206438 91582 -114241 -151134 -153167 63855 271878 203588 12090 -78660 -29960 -12600
5725 -12600 -41585 -134539 -101704 -57874 -158883 -103981 -139660 -196092 -274174 -379201 -494931
$$ packed form
5798B44736j32221L378r1512K3686j05141l09254J08746m5193j97950J22789J36323
5787b41613J69658p7151j56296k58863N8915J81274J58039j87339j9223p2855
5777d45454j11146K66824Q1540J42546o8019N0558J49999J66143J02004j70149
5767A64846k50256n4170K24473N6959j24183l3477k42678r3499j14813J87524
5757b79274K68790J28196K61949j56469l90187q5736L24867N8752r1440J21219
5747A60667K064j72393k6019k58073Q4463K64415J15770J547K9080j1900J6817
5736B06438j14856k05823l6893k033K17022K08023o8290j91498r0750M8700J7360
5725a2600k8985r2954L2835M3830j01009N4902l5679n6432p8082j05027j15730
$$ plain form
5714 -494931 -506000 -376904 -441688 -331522 -222456 -232944 -67723 247758 378079 265691
5704 265691 49412 -105291 -130903 2714 172115 157261 362848 287978 -17114 -207219
5694 -207219 -211083 -352557 -280940 -69912 -49800 47771 66916 -58874 -215862 -77556 210162
5683 210162 225700 37039 71636 170634 180310 165479 -41562 -150265 -126321 25050 61276
5672 61276 59936 -162081 -299987 -367355 -407157 -429978 -234763 -247693 -403397 -478922 -320521
5661 -320521 -302995 -326381 -325473 -297489 -401672 -511599 -386549 -373969 -262468 29221 4943
5650 4943 -175702 -123362 -46256 -214184 -339801 -364399 -294923 -306596 -323604 -264116 -187672
5639 -187672 -97413 -240747 -239572 -146383 -62326 -298121 -296648 -257587 -16520 95414 -224252
$$ packed form
5714d94931j1069J29096o4784J10166J09066j0488J65221L15481J30321j12388
5704B65691k16279j54703k5612J33617J69401j4854K05587p4870l05092j90105
5694b07219l864j41474P1617K11028K0112R7571J9145j25790j56988J38306K87718
5683B10162J5538j88661L4597R8998R676j4831k07041j08703K3944J51371L6226
5672F1276j340k22017j37906o7368l9802k2821J95215j2930j55704p5525J58401
5661c20521J7526k3386R08K7984j04183j09927J25050J2580J11501K91689k4278
5650D943j80645N2340P7106j67928j25617k4598O9476j1673j7008N9488P6444
5639a87672R0259j43334J175R3189Q4057k35795J473L9061K41067J11934l19666
$$ plain form
5628 -224252 -249470 -194539 19160 26251 -348003 -666754 -562221 -398496 -296074 -204189 -145821
5617 -145821 -96669 35459 -106319 -124714 -59863 -78236 -10049 -61480 1696 9201 -38517
5606 -38517 68633 -109465 -283196 -238207 -237849 -143628 128510 137979 151061 105526 108738 250616
5594 250616 233605 188353 127444 65820 74134 -55581 -174168 50965 302878 332923 314077
5583 314077 -3523 -237229 -60570 101836 225594 335894 145146 -91729 -97948 -125893
5573 -125893 -172991 -368614 -471985 -260035 -235016 -213290 -38450 -70099 3530 48131 67736
5562 67736 -208822 -400005 -299066 -74444 138522 272581 257522 94118 -20070 -19085 -281300
5551 -281300 -280215 -369848 -345309 -222612 -11668 51006 18538 173065 382764 334233 63256
$$ packed form
5628b24252k5218N4931K13699P091l74254l18751J04533J63725J02422R1885N8368
5617a45821M9152J32128j41778j8395O4851j8373O8187n1431O3176P505m7718
5606c8517J07150j78098j73731M4989L58R4221K72138R469J3082m5535L212J41878
5594B50616j7011m5252o0909o1624Q314j29715j18587K25133K51913L0045j8846
5583C14077l17600k33706J76659J62406J23758J10300j90748k36875o219k7945
5573a25893m7098j95623j03371K11950K5019K1726J74840l1649P3629M4601J9605
5562F7736k76558j91183J00939K24622K12966J34059j5059j63404j14188R85k62215
5551b81300J085q9633K4539J22697K10944O2674l2468J54527K09699m8531k70977
$$ plain form
5540 63256 -11326 137649 170199 -45759 -110101 -88871 -28488 83608 94049 158924 155375
5529 155375 101962 49396 92974 209033 175975 158040 152908 -133134 -79317 109898 -11835
5518 -11835 -79140 -128644 -55662 225169 212676 1613 -4166 -134820 -345586 -438030 -446478
5507 -446478 -350766 -229196 -62994 -155059 39373 204289 30777 -63303 -2226 -47407 28965
5496 28965 136108 222456 351055 445961 273822 185248 271090 55500 -999 13170 -12017
5485 -12017 -40129 29213 22286 -23580 -29296 80241 57476 6137 -45621 58622 248791 223181
5473 223181 262251 90461 78999 97260 77925 -80434 -302403 -325749 7387 73842 1715
5462 1715 -71694 -14133 -38353 -185643 -346782 -247269 -401796 -449791 -393807 -347410 -451342
$$ packed form
5540F3256p4582J48975L2550k15958o4342K1230O0383J12096J0441O4875l549
5529A55375n3413n2566M3578J16059l3058j7935n132k86042N3817J89215j21733
5518a1835o7305m9504P2982K80831j2493k11063n779j30654k10766r2444q448
5507d46478R5712J21570J66202r2065J94432J64916j73512r4080O1077m5181P6372
5496B8965J07143Q6348J28599R4906j72139q8574Q5842k15590n6499J4169k5187
5485a2017k8112O9342o927m5866n716J09537k2765n1339n1758J04243J90169k5610
5473B23181L9070j71790j1462J8261j9335j58359k21969k3346L33136O6455p2127
5462A715p3409N7561k4220j47290j61139R9513j54527m7995N5984M6397j03932
$$ plain form
5451 -451342 -595340 -583804 -362143 -128590 -81279 -60349 -136592 -112651 -244269 -313423 -229718
5440 -229718 -167601 -254655 -58318 30927 -36151 -103274 -242250 -383621 -348677 -245796 -225316
5429 -225316 -342409 -267930 -194804 -265284 -50504 187471 184388 -61409 -188536 -212212 -278327
5418 -278327 -195622 -156759 -247973 -509311 -448272 -357010 -237102 -58145 -14809 111710 299508
5407 299508 226278 62343 56927 64716 30457 33285 79157 -11029 -147215 -124546 -28200 130662
5395 130662 156424 74221 -62541 20189 -54892 -52224 5813 68223 199826 125895 4305
5384 4305 459 164059 267383 259482 157531 -74537 -145231 -130636 176655 235929 274433
5373 274433 291675 303794 135480 -125548 -82370 36018 -28662 -58627 -182666 -291197 -573535
$$ packed form
5451d51342j43998J1536K21661K33553M7311K0930p6243K3941j31618o9154Q3705
5440b29718O2117q7054J96337Q9245o7078o7123j38976j41371L4944J02881K0480
5429b25316j17093P4479P3126p0480K14780K37975l083k45797j27127k3676o6115
5418b78327Q2705L8863r1214k61338O1039R1262J19908J78957M3336J26519J87798
5407B99508p3230j63935n416P789l4259K828M5872r0186j36186K2669R6346J58862
5395A30662K5762q2203j36762Q2730p5081K668N8037O2410J31603p3931j21590
5384D305l846J63600J03324p901j01951k32068p0694J4595L07291N9274L8504
5373B74433J7242J2119j68314k61028M3178J18388o4680k9965j24039j08531k82338
$$ plain form
5362 -573535 -462295 -345389 -179846 -1885 -56573 75025 190685 119392 34790 -33551
$$ packed form
5362e73535J11240J16906J65543J77961n4688J31598J15660p1293q4602o8341
$$ [...]
##END NTUPLES=NMR SPECTRUM
##END=
