##TITLE=Analysis number 329908
Compound Code cc 67802
Book Reference 521/119
Project Code adrs
Chemist Name evam
##JCAMPDX= 6.0         $$ Bruker NMR JCAMP-DX V2.0
##DATA TYPE= NMR SPECTRUM
##DATA CLASS= NTUPLES
##ORIGIN= Bruker BioSpin GmbH
##OWNER= nmr
$$ XWIN-NMR		Version 3.5
$$ Wed Oct 10 12:19:30 2007 GMT Daylight Time (UT+1h)  MAYBRIDGE\nmr@NMR_250MHZ
##.OBSERVE FREQUENCY= 250.131544655141
##.OBSERVE NUCLEUS= ^1H
##.ACQUISITION MODE= SIMULTANEOUS (DQD)
##.ACQUISITION SCHEME= undefined
##.AVERAGES= 16
##.DIGITISER RES= 18
##SPECTROMETER/DATA SYSTEM= dpx250
##.PULSE SEQUENCE= zg30
##.SOLVENT NAME= CDCl3
##.SHIFT REFERENCE= (INTERNAL, CDCl3, 0, 16.4485)
##AUDIT TRAIL= $$ (NUMBER, WHEN, WHO, WHERE, WHAT)
$$ ##TITLE= Audit trail, XWIN-NMR		Version 3.5
$$ ##JCAMPDX= 5.01
$$ ##ORIGIN= Bruker BioSpin GmbH
$$ ##OWNER= nmr
$$ C:\u/data/dgb/nmr/ADRS/590/pdata/1/auditp.txt
$$ ##AUDIT TRAIL=  $$ (NUMBER, WHEN, WHO, WHERE, WHAT)
(   1,<2007-10-10 12:19:08.72 +100>,<MAYBRIDGE\nmr>,<NMR_250MHZ>,
      <created by zg, POWCHK disabled, PULCHK disabled
       configuration hash MD5:
       76 6E 9A 78 1E 09 19 81 EC 84 63 8F B0 6A 59 2D
       data hash MD5: 64K
       AC 67 D5 40 3B CD 9D 44 A7 3B 33 5D 5B F8 FE 53>)
(   2,<2007-10-10 12:19:20.70 +100>,<MAYBRIDGE\nmr>,<NMR_250MHZ>,
      <Start of raw data processing
       ef LB = 0.3 FT_mod = 6 PKNL = 1 SI = 32K 
       data hash MD5: 32K
       81 8B 20 77 94 F0 9F BA B6 78 8C 2B 29 74 3C 03>)
(   3,<2007-10-10 12:19:22.26 +100>,<MAYBRIDGE\nmr>,<NMR_250MHZ>,
      <apk 
       data hash MD5: 32K
       2E 47 BF D1 B1 86 C3 19 95 91 A6 71 BC 5A 41 61>)
(   4,<2007-10-10 12:19:22.97 +100>,<MAYBRIDGE\nmr>,<NMR_250MHZ>,
      <abs ABSG = 5 
       data hash MD5: 32K
       52 A2 03 F6 D4 60 2C BA B2 70 37 BD 18 9A 08 A6>)
$$ ##END=
$$ 
$$ hash MD5
$$ 00 65 32 84 58 6F 2D 0B BE 17 13 B2 94 09 4E 79
##$RELAX= 
##$RELAX= 
##$RELAX= 
##$RELAX= 
##$RELAX= 
##$RELAX= 
##$RELAX= 
$$ Bruker specific parameters
$$ --------------------------
##$DU= <C:\u>
##$EXPNO= 590
##$NAME= <ADRS>
##$PROCNO= 1
##$TYPE= <nmr>
##$USER= <dgb>
##$AMP= (0..31)
100 100 100 100 100 100 100 100 100 100 100 100 100 100 100 100 100 100 
100 100 100 100 100 100 100 100 100 100 100 100 100 100 
##$AQSEQ= 0
##$AQ_mod= 3
##$AUNM= <au_zg>
##$AUTOPOS= <15 >
##$BF1= 250.13
##$BF2= 250.13
##$BF3= 250.13
##$BF4= 250.13
##$BF5= 500.13
##$BF6= 500.13
##$BF7= 500.13
##$BF8= 500.13
##$BYTORDA= 1
##$CFDGTYP= 0
##$CFRGTYP= 5
##$CHEMSTR= <none>
##$CNST= (0..31)
1 1 145 1 1 1 1 1 1 1 1 1 1 1 1 1 1 1 1 1 1 1 1 1 1 1 1 1 1 1 1 1 
##$CPDPRG= <>
##$CPDPRG1= <>
##$CPDPRG2= <>
##$CPDPRG3= <>
##$CPDPRG4= <mlev>
##$CPDPRG5= <mlev>
##$CPDPRG6= <mlev>
##$CPDPRG7= <mlev>
##$CPDPRG8= <mlev>
##$CPDPRGB= <>
##$CPDPRGT= <>
##$D= (0..31)
0 1 0 0 0 0 0 0 0 0.06 0 0 0 0 0 0 0.0002 0 0 0 0 0 0 0 0 0 0 0 0 0 0 
0 
##$DATE= 1192015147
##$DBL= (0..7)
120 120 120 120 120 120 120 120 
##$DBP= (0..7)
150 150 150 150 150 150 150 150 
##$DBP07= 0
##$DBPNAM0= <>
##$DBPNAM1= <>
$$ [...]
##$SUBNAM7= <"">
##$SUBNAM8= <"">
##$SUBNAM9= <"">
##$SW= 20.6930455092707
##$SWIBOX= (0..15)
0 0 3 0 0 0 0 0 0 0 0 0 0 0 0 0 
##$SW_h= 5175.983436853
##$TD= 65536
##$TD0= 1
##$TE= 296.16
##$TE2= 300
##$TE3= 300
##$TEG= 300
##$TL= (0..7)
0 120 120 120 120 120 120 120 
##$TP= (0..7)
150 150 150 150 150 150 150 150 
##$TP07= 0
##$TPNAME0= <>
##$TPNAME1= <>
##$TPNAME2= <>
##$TPNAME3= <>
##$TPNAME4= <>
##$TPNAME5= <>
##$TPNAME6= <>
##$TPNAME7= <>
##$TPOAL= (0..7)
0.5 0.5 0.5 0.5 0.5 0.5 0.5 0.5 
##$TPOFFS= (0..7)
0 0 0 0 0 0 0 0 
##$TUNHIN= 0
##$TUNHOUT= 0
##$TUNXOUT= 0
##$USERA1= <user>
##$USERA2= <user>
##$USERA3= <user>
##$USERA4= <user>
##$USERA5= <user>
##$V9= 5
##$VALIST= <valist>
##$VCLIST= <CCCCCCCCCCCCCCC>
##$VD= 0
##$VDLIST= <DDDDDDDDDDDDDDD>
##$VPLIST= <PPPPPPPPPPPPPPP>
##$VTLIST= <TTTTTTTTTTTTTTT>
##$WBST= 1024
##$WBSW= 4
##$XGAIN= (0..3)
0 0 0 0 
##$XL= 0
##$YL= 0
##$YMAX_a= 165600
##$YMIN_a= -252788
##$ZGOPTNS= <>
##$ZL1= 120
##$ZL2= 120
##$ZL3= 120
##$ZL4= 120
##$ABSF1= 16.44847
##$ABSF2= -4.244703
##$ABSG= 5
##$ABSL= 3
##$ALPHA= 0
##$AQORDER= 0
##$ASSFAC= 0
##$ASSFACI= 0
##$ASSFACX= 0
##$ASSWID= 0
##$AUNMP= <proc_1d>
##$AZFE= 0.1
##$AZFW= 0.1
##$BCFW= 0
##$BC_mod= 0
##$BYTORDP= 0
##$COROFFS= 0
##$CY= 12.5
##$DATMOD= 1
##$DC= 0
##$DFILT= <>
##$DTYPP= 0
##$F1P= 14.0000005364418
##$F2P= -0.99999901652339
##$FCOR= 0.5
##$FTSIZE= 32768
##$FT_mod= 6
##$GAMMA= 0
##$GB= 0
##$INTBC= 1
##$INTSCL= 1
##$ISEN= 128
##$LB= 0.3
##$LEV0= 0
##$LPBIN= 0
##$MAXI= 10000
##$MC2= 0
##$MEAN= 0
##$ME_mod= 0
##$MI= 0
##$NCOEF= 0
##$NC_proc= -5
##$NLEV= 6
##$NOISF1= 0
##$NOISF2= 0
##$NSP= 0
##$NTH_PI= 0
##$NZP= 0
##$OFFSET= 16.44847
##$PC= 1
##$PHC0= 156.3286
##$PHC1= 16.16177
##$PH_mod= 1
##$PKNL= yes
##$PPARMOD= 0
##$PSCAL= 4
##$PSIGN= 0
##$REVERSE= no
##$SF= 250.130018391097
##$SI= 32768
##$SIGF1= 0
##$SIGF2= 0
##$SINO= 400
##$SIOLD= 32768
##$SREGLST= <1H.CDCl3>
##$SSB= 0
##$STSI= 32768
##$STSR= 0
##$SW_p= 5175.98343685301
##$SYMM= 0
##$S_DEV= 0
##$TDeff= 65536
##$TDoff= 0
##$TI= <Analysis number 999999
Compound Code 99
Book Reference 9
Project Code 9>
##$TILT= no
##$TM1= 0
##$TM2= 0
##$TOPLEV= 0
##$USERP1= <user>
##$USERP2= <user>
##$USERP3= <user>
##$USERP4= <user>
##$USERP5= <user>
##$WDW= 1
##$XDIM= 32768
##$YMAX_p= 530285189
##$YMIN_p= -1019641
$$ End of Bruker specific parameters
$$ ---------------------------------
##NTUPLES= NMR SPECTRUM
##VAR_NAME=  FREQUENCY,     SPECTRUM/REAL,   SPECTRUM/IMAG
##SYMBOL=    X,             R,               I
##VAR_TYPE=  INDEPENDENT,   DEPENDENT,       DEPENDENT
##VAR_FORM=  AFFN,          ASDF,            ASDF
##VAR_DIM=   32768,         32768,           32768
##UNITS=     HZ,            ARBITRARY UNITS, ARBITRARY UNITS
##FACTOR=    0.157963299565203, 1,           1
##FIRST=     4114.25589399328, 0,            0
##LAST=      -1061.72754285973, 0,           0
##MIN=       -1061.72754285973, -1019641,    0
##MAX=       4114.25589399328, 530285189,    0
$$ Real data points
##PAGE= N=1
##DATA TABLE= (X++(R..R)), XYDATA
$$ [...]
23053a4179j03555m4599R9285N7197j69120k16708p4157J21905K63744p5966J59326
23042C173Q2849L33035J4514j24801L7323K6223q4782j85312r543N0863q3147
23031F0395j46737L5005J13518j85685J0022r9364N7794q3488q3453N0385N6380
23020b15228J22068N1919J07370L37889R7892j05231k65204K2751j29786l9524
23010a5084K4918L0497j07724p9079R4448K6344K1928J93706o5793l3745m4454
22999D5962L6495J08736j00530l4232M438j36729L2646r2934P4870p3663R171
22988a25770J38428K72047M2109j92160j62025q0712k52383R2380M07365R2323
22978B31602k68543k16104O0699K26728J61728j1049l3191J1559R373j26953k91247
$$ plain form
23053 -14179 -117734 -162333 -63048 -5851 -174971 -391679 -465836 -343931 -80187 -156153 3173
23042 3173 86022 419057 433571 308770 346093 372316 287534 102222 92679 143542 60395
23031 60395 -86342 -51337 62181 -123504 -113482 -212846 -155052 -238540 -321993 -271608 -215228
23020 -215228 -93160 -41241 66129 404018 501910 396679 131475 154226 24440 -15084
23010 -15084 9834 40331 -67393 -146472 -52024 -25680 -3752 189954 124161 90416 45962
22999 45962 82457 191193 90663 56431 60869 -75860 -43214 -136148 -61278 -134941 -125770
22988 -125770 12658 284705 326814 134654 -27371 -108083 -360466 -268086 139279 231602
22978 231602 -36941 -253045 -192346 34382 196110 185061 151870 163429 172802 45849 -245398
22967b45398p5884J69218J62487j99758K72108L38834j8495p3252n8983k18619
22957E2258O5926R7786k72984m5452k8326L2999M3290k00503r334l6406k031p6107
22945c78884K24289l7286j59134r0573j40508K26088J54087J10522O1153k63003
22935b93249k99727j96313O887K35851L80282K95971L37919M5045k55699q8896
22925A68071j89920k21642L2814L41995k11634j07743K68767m6071J276M6298
22915H2211j04092j21274o2923J19292j0348p6427r2502J4533O1451J53519n1690
22904h8250j63829j59943l4837J22051J28803K66542Q8842m8190k48183j84482
22894c21476J70118J13436J79634M9934r8047n7213J78748J0007l24322l23319
$$ plain form
22967 -245398 -321282 -152064 10423 -189335 82773 421607 403112 329860 270877 52258
22957 52258 118184 215970 -57014 -102466 -130792 -97793 -54503 -255006 -264340 -300746 -302777 -378884
22945 -378884 -154595 -191881 -351015 -441588 -582096 -356008 -201921 -91399 -30246 -293249
22935 -293249 -592976 -789289 -782402 -546551 -166269 129702 467621 512666 256967 168071
22925 168071 -21849 -243491 -210677 131318 -80316 -188059 80708 34637 35913 82211
22915 82211 -21881 -143155 -206078 -86786 -97134 -173561 -266063 -251530 -190079 -36560 -88250
22904 -88250 -252079 -412022 -446859 -324808 -196005 70537 159379 111189 -136994 -321476
22894 -321476 -151358 -37922 141712 191646 93599 36386 215134 225141 -99181 -422500
22884d22500J48443J38706j43361J55196J90337k72064j06545J98067K24517J78560
22874B89356K61259P2026k51367k42543k94360k88743N1811K5812O5197L24746
22864A3194n8335N0347K87268J19037o0523Q0388J19630j41391k09254p6461k26327
22853a02427p6877j21694Q5823n2935L55613p4814m5291P2714J64529M4635l63870
22842a14594l8879l9800M56320r178j04353K93881M1776j31113j87849j0733p8410
22831G7068j53058j24590K55446J48391q1069M3458q6100P2394Q5796j64506J12682
22820A85912K38954J31041l54100k95448j8668R6222j3309J13915R0653j61216
22810A3956o4036k02759j32553k13160j71960J25264M43600L23442l3657m32393
$$ plain form
22884 -422500 -274057 -135351 -278712 -123516 66821 -205243 -311788 -113721 110796 289356
22874 289356 550615 622641 371274 128731 -165629 -454372 -402561 -376749 -311552 13194
22864 13194 -45141 5206 292474 411511 350988 431376 551006 409615 200361 123900 -102427
22853 -102427 -179304 -300998 -215175 -268110 87503 12689 -32602 40112 204641 249276 -114594
22842 -114594 -153473 -193273 263047 253869 149516 443397 485173 354060 166211 155478 77068
22831 77068 -75990 -200580 54866 203257 122188 165646 79546 151940 237736 73230 185912
22820 185912 424866 555907 201807 -93641 -112309 -16087 -29396 84519 175172 13956
22810 13956 -50080 -252839 -385392 -598552 -770512 -645248 -201648 121794 88137 -344256
22800c44256p5616J29629q789p2603l08830O5258L44689Q7798j62361J39691K33309
22789B7919j69577m52215P9678K48637J22574l2599K7557Q9069J44992K44972
22779C31007l872k71231o0986K5566k84658M2027M48605J12952L24679r4778m13498
22768A55813k10162P1723p820J11676J14531n5370K41334R3262j12696M6558j1753
22757D37096j13999j38416j33189k0262p908L45508k50855m52584p3393J68722
22747b39280L71341L57391J07600k03203m11598m4028K20738J00191l1992j10850
22737A16310k07253O18J25676J13739o1268j65437j63120j1924J58117j98665
22727b93207K9331L70582l5691J04412k8910o878J96214j20653l47912j4434j44194
$$ plain form
22800 -344256 -419872 -290243 -299032 -371635 -680465 -615207 -270518 -182720 -345081 -205390 27919
22789 27919 -141658 -593873 -514195 -265558 -142984 -175583 -148026 -58957 86035 331007
22779 331007 327135 55904 -5082 20484 -264174 -222147 226458 339410 664089 569311 155813
22768 155813 -54349 17374 9554 121230 235761 180391 421725 514987 402291 448849 437096
22757 437096 323097 184681 51492 31230 23322 368830 117975 -334609 -408002 -239280
22747 -239280 132061 489452 597052 393849 -17749 -61777 158961 259152 227160 116310
22737 116310 -90943 -90325 35351 149090 87822 -77615 -240735 -252659 -94542 -293207
22727 -293207 -263876 106706 71015 175427 146517 139639 335853 215200 -132712 -147146 -291340
22716b91340K44354j16292j35441O2038j03410j53203J3042J30046J13974J78912
22706e7320K00927j96292J20194J38838m3153k55800m36M3046J16144L6759J36369
22695B39276p6979j82399l4959l1607L7843O6075K7540j73698k23415L5644K48687
22684f7992k66692k4308L2878L2812J40843L71037M37411k39679n69727k85391
22674d38808O6809R0220J30808m8971j3050K32423K21300l48469n8994k03477
22664c70209M100J02101L7583k4825O322K41102J10390N9065O0771J3327j87447
22653E2280k16551m1830J78480O671J49J23739J96016n1114K1913P3111j98651
22642A44213P6836J89433j24176k75228J07302J62607J40343M0964j79841j07670
$$ plain form
22716 -291340 -46986 -163278 -298719 -236681 -340091 -493294 -480252 -350206 -236232 -57320
22706 -57320 143607 -52685 67509 206347 163194 -92606 -93042 -49996 66148 102907 239276
22695 239276 162297 -20102 -55061 -86668 -48825 17250 44790 -128908 -352323 -316679 -67992
22684 -67992 -334684 -358992 -326114 -293302 -152459 218578 655989 416310 -153417 -438808
22674 -438808 -371999 -281779 -150971 -199942 -212992 19431 240731 -107738 -166732 -370209
22664 -370209 -366109 -264008 -226425 -251250 -244928 -3826 106564 165629 226400 239727 52280
22653 52280 -164271 -206101 -27621 -20950 -20801 102938 298954 247840 269753 342864 144213
22642 144213 221049 410482 286306 11078 118380 280987 421330 462294 282453 174783
22632A74783j20770l7679j44120j77112K16715J88066K10289j23547j31189k80447
22622b25011P8958R7222J76581M7105J07381j01614o6519K47348j94498l80620
22612b13667k17768o497J17144o6900J13743N51931n9510k83670k3614k6387q522
22601a23717R4761J14069m1783L5790O6468L42509M7503l45491m3253R5536P511
22590B49903j06622r5332M5670p3044l34589R3960M3608k15584j6046K21299J48832
22579c7945n6822j34378n0452K14791L82591p0724l10990j39811j78019K55121
22569a26638L18122K88071K7249q2605j24045j46332K2473n8504j29978j8083
22559c0270P2342K36296K64253j75674o9741j62049k26899j9973q0331P9061K42527
$$ plain form
22632 174783 54013 16334 -127786 -304898 -88183 99883 310172 186625 55436 -225011
22622 -225011 -146053 -48831 127750 174855 282236 180622 114103 361451 166953 -213667
22612 -213667 -431435 -437932 -320788 -387688 -273945 277986 218476 -65194 -88808 -115195 -123717
22601 -123717 -28956 85113 43330 79120 145588 488097 535600 190109 146856 242392 249903
22590 249903 143281 47949 93619 20575 -314014 -220054 -176446 -392030 -408076 -186777 -37945
22579 -37945 -94767 -229145 -279597 -64806 317785 247061 -63929 -203740 -381759 -126638
22569 -126638 191484 479555 506804 424199 300154 153822 176295 117791 -12187 -30270
22559 -30270 42072 278368 542621 366947 297206 135157 -91742 -111715 -192046 -112985 129542
22548A29542K2754j12900P6672Q549J76103J54012o9050M7908O2021J63242P7725
22537G36578j33128j01862j82248k02327j11681k68915Q7429Q2610o3664J12959
22527d4249J48220k32175l67312k0003J91185m8253j70179L18606L29235k74356
22517a69281j62774p722M1997J92773J37507J2425j42297J31077R4278K12858
22507C40841J82497l91938l4396J68048J82662l48228O8829K49232J38397m8537
22497E07407j40325k13867L8553K6687j54358j72439R372K91715L1299k87108
22487f3064n3082J82595J5831J466p200r6271j39123j31390J08504K53632k6933
22476D4965j95349J62057J49525l84977R2689Q5084J02927j77492k56824j26000
$$ plain form
22548 129542 152296 39396 116068 124617 300720 454732 385682 433590 495611 658853 736578
22537 736578 603450 501588 319340 117013 5332 -263583 -176154 -93544 -157208 -44249
22527 -44249 103971 -128204 -495516 -515519 -324334 -372587 -542766 -224160 105075 -169281
22517 -169281 -332055 -339777 -297780 -105007 32500 44925 -97372 33705 127983 340841
22507 340841 523338 131400 97004 265052 447714 99486 168315 417547 555944 507407
22497 507407 367082 153215 191768 218455 64097 -108342 -98970 192745 224044 -63064
22487 -63064 -116146 66449 82280 83746 76546 -19725 -158848 -290238 -181734 71898 44965
22476 44965 -150384 11673 161198 -223779 -131090 -46006 56921 -120571 -377395 -503395
22466e03395P1836Q8989O0322R9240n9448J60568j5084P4837j57487j29954r9645
22455d09221J61122J55122K07301J80470p0453n7483o5049L3020M4187J24630
22445C03646k89531j79682O5811k46056j90048L50154K30400M00204J86949m22818
22435B09029k73691k5142l8606J19696j15116P1472K2550l49705N748K06449P7227
22424i0089j23014m7701k223j51002K06422M32274J02997k1191n2381j09567j39805
22413D720j24128m4271O3045O5832j6821r6627l8837q7241q6289r6689Q5213K48768
22401a23325J96447j53512r2700k3877K13656r4161j29467j21374j8990N6814
22391b90489M11040K86971k09162n1300k1779J55589K02087J66819j7370n9610
$$ plain form
22466 -503395 -431559 -342570 -282248 -183008 -242456 -81888 -96972 -22135 -179622 -309576 -409221
22455 -409221 -248099 -92977 114324 294794 224341 166858 101809 134829 179016 303646
22445 303646 14115 -165567 -99756 -345812 -535860 -185706 44694 444898 631847 209029
22435 209029 -64662 -89804 -128410 -8714 -123830 -52358 -29808 -379513 -373765 -167316 -90089
22424 -90089 -213103 -260804 -263027 -414029 -207607 224667 327664 306473 254092 144525 4720
22413 4720 -119408 -163679 -100634 -34802 -51623 -148250 -187087 -274328 -360617 -457306 -372093 -123325
22401 -123325 73122 -80390 -173090 -196967 16689 -77472 -206939 -328313 -347303 -290489
22391 -290489 120551 407522 198360 147060 125281 280870 482957 649776 632406 572796
22381E72796R4771p8715j64279J77385k41605l12465k14528j41340J18160O4872
22371a24948j06317J00055J82201J47603o5654n4607o0933k85061N8310J03447
22361a05904J54630k2687p1259N1675J1944o4857j15867N8193l6074K63842K18602
22350C42238R178k0519j56858k30286o4090m7547J34519k7816k0928J22897R3243
22339A34031j69550k38133j8486J00736j72846L34710K08838r1311L9600j92859
22329f5270k81403m5685Q0352K70488K66000J4405j5222j4411j73068k42647O6549
22318a39912N5848Q6910K38918j5799K25469k9509m75278l17942N0395J07898
22308b13002n922J64065L08829J48818k50187Q3193J24459j70291j53864j25584
$$ plain form
22381 572796 667567 588852 424573 601958 360353 47888 -166640 -307980 -189820 -124948
22371 -124948 -231265 -131210 50991 198594 132940 78333 17400 -267661 -209351 -105904
22361 -105904 48726 26039 -45220 6455 18399 -46458 -162325 -104132 -140206 123636 342238
22350 342238 351416 330897 174039 -56247 -120337 -167884 -33365 -61181 -82109 40788 134031
22339 134031 -35519 -273652 -292138 -191402 -364248 -29538 179300 87989 127589 -65270
22329 -65270 -346673 -392358 -312006 -41518 224482 238887 223665 209254 36186 -206461 -139912
22318 -139912 -84064 2846 241764 225965 451434 421925 -53353 -371295 -320900 -213002
22308 -213002 -218924 -54859 253970 402788 152601 235794 360253 189962 36098 -89486
22298h9486m4636O7168l44357o8009K54617L05860j96946n8846j7729j81762O8773
22287c05353K38361J62050j24428m2254M7122L3681k68283N7642M42071k50324
22277i715k32678P4106m773o8242M2642K34462K13683R6774N8250l17149p516
22266G9844O9562j43095O566K04409k2213q2710N4638k38752l29435j25857L33052
22255a93991M55748J27922k07401j00862K4167J93708J71297j75945l61915m54522
22245e21794j66330k67619M14714M21587j91076L6504j07310k842j13015P5577
22235d21604r4534P0153k8313J22118k37784l6130M89761n2784N7264J83615r0305
22224c8543j04626N7385K71965J32006J02678K8203l22209K31584J7199k32203
$$ plain form
22298 -89486 -134122 -66954 -411311 -479320 -224703 81157 -115789 -174635 -192364 -374126 -305353
22287 -305353 -66992 95058 -29370 -71624 -24502 9179 -259104 -201462 240609 -9715
22277 -9715 -242393 -168287 -173060 -241302 -198660 35802 249485 346259 404509 87360 79844
22266 79844 149406 6311 12877 217286 195073 112363 167001 -71751 -401186 -527043 -193991
22255 -193991 261757 389679 182278 81416 105583 299291 470588 294643 -67272 -521794
22245 -521794 -688124 -955743 -541029 -119442 -310518 -274014 -381324 -384166 -497181 -421604
22235 -421604 -516138 -445985 -474298 -352180 -589964 -626094 -136333 -189117 -131853 51762 -38543
22224 -38543 -143169 -85784 186181 318187 420865 449068 126859 358443 375642 143439
22214A43439m5929l07530p6643J78794J14944j15505o8231J43267j26051j86986
22204c46431n6437O1331K52085j55490P5711N76039R5367k96842k89684O5834
22194a8517K2624J3634j62927k13282K14994K76658j36639J60551l6312n00125
22184c79341O3198J62772l0242J99429k4965j87153N5892j02073l54539j1031
22174f08053M28767J02366K4923m2907J95754K11753K41792J6975k38944j68071
22164A64355k6622K5684k37714J96978J47647k90729k29465J43621J38745j02969
22154g0469K02487m6397k51467N8399Q2569k24343j0161p7435j59812J50807j0139
22143c55961K54702J55059k63882Q6940K44802j1001j39627K30391Q5165J64365
$$ plain form
22214 143439 97510 -210020 -286663 -107869 7075 -108430 -176661 -33394 -159445 -346431
22204 -346431 -402868 -341537 -89452 -244942 -169231 406808 502175 205333 -84351 -18517
22194 -18517 4107 17741 -145186 -358468 -143474 133184 -3455 157096 120784 -379341
22184 -379341 -316143 -153371 -183613 15816 -9149 -196302 -140410 -242483 -597022 -608053
22174 -608053 -179286 -76920 -51997 -94904 100850 312603 554395 571370 332426 164355
22164 164355 137733 163417 -74297 122681 270328 -20401 -249866 -106245 32500 -70469
22154 -70469 132018 85621 -165846 -107447 -24878 -249221 -259382 -336817 -496629 -345822 -355961
22143 -355961 -101259 53800 -210082 -123142 121660 110659 -28968 201423 286588 450953
22133D50953J05708k41035j54832k93131k10862j57977N0631J04254K99001K04718
22123A57428J00983j01218l67582j54961j33333J06226L28462L93988r2031l2601
22113B05361j50672j37103j71460r6905J08462K19905K71226m9718o2228n556
22103A31312j52365j52755k17426j70711N1244J01899j8645O5532R8605J49809
22093a13501O6114M2122Q2048q5581o5240Q424R6172k31293r8900K2936K83126
22082F427j21164J35741L3233J56367j10192j26083Q8919J73344r1404l2408o2359
22071E0421n8626J78412q6690j20076q5733j42864N4858p732J65363K5070M2454
22060A4857K3379j2933j87572J66889P2721j00325J61007M8016K0511O8589j50768
$$ plain form
22133 450953 556661 315626 160794 -132337 -343199 -501176 -450545 -346291 -47290 157428
22123 157428 258411 157193 -210389 -365350 -498683 -392457 -63995 329993 237962 205361
22113 205361 54689 -82414 -253874 -350779 -242317 -22412 248814 199096 136868 131312
22103 131312 -21053 -173808 -391234 -561945 -510701 -408802 -427447 -361915 -263310 -113501
22093 -113501 -47387 -5265 76783 -8798 -74038 -65614 30558 -200735 -299635 -276699 6427
22082 6427 -114737 21004 54237 210604 100412 -25671 63248 236592 145188 112780 50421
22071 50421 -8205 170207 83517 -36559 -122292 -265156 -210298 -218030 -52667 -27597 14857
22060 14857 38236 25303 -162269 4620 77341 -22984 138023 186039 206550 275139 124371
22049A24371k5596o0441L1431p9835l2876L2250n1547j58017Q8585K47314k22013
22038a06374r7883r1702q019K59073L23186J46181k87697l10002j6196j7658K39526
22027C2435k037L526r2181k34657N7528L7608M3393K41478n8083j86753l28885
22016d86628L07491J38689j32435J06718J6728n6356p3451j11463n1760P1836
22006b70631J84633p3304J19068j2001L2815J18634J16252J90015j00047m2734
21996B62700j17881j49198l9544K47697k43781j62617K3572j83870J4845K83697
21986f4380J57560r2845p4180p6683P1483R4057j43275j02878P2366L6756J27243
21975E224k17556k48946K503J54342R3003j99952j07780J3770J78822K5136l9933
$$ plain form
22049 124371 98775 38334 69765 -10070 -42946 -10696 -62243 -220260 -131675 115639 -106374
22038 -106374 -204257 -295959 -303978 -44905 278281 424462 136765 -173237 -189433 -207091 32435
22027 32435 30398 33924 -58257 -292914 -235386 -197778 -154385 87093 29010 -157743 -486628
22016 -486628 -179137 -40448 -172883 -66165 -49437 -105793 -179244 -290707 -342467 -270631
22006 -270631 -85998 -159302 -40234 -52235 -19420 99214 215466 405481 305434 262700
21996 262700 144819 -4379 -43923 203774 -40007 -202624 -179052 -362922 -348077 -64380
21986 -64380 93180 335 -73845 -150528 -79045 15012 -128263 -231141 -158775 -122019 5224
21975 5224 -212332 -461278 -458775 -304433 -211430 -411382 -519162 -505392 -326570 -301434 -341367
21964c41367J61798J70833O2375N2373j06768q1341q563K97493P2294j67565j93753
21953h2191K4584j07430P5932K60108L3705J42927Q539q3939o7108j69124k20277
21942a84274j19568j34234J2593M6333j41899l9571J56896K58912k10462K3021
21932c32253P9521q113J42778J23342k05371J06254J59157r293j99381p084J125
21921a49318q3084J76890M7786l6423M2105M21641J07840j53719r3116k52810
21911B7792j50180M34o0978m5601n0083J44353k6407q1688j34087M2768j08211
21900d41888q9848Q9136J20854L91438N8679j35298k2995J6319J72670J11461
21890B70528l31680R0743L56147j24848k4977l08471m75838j15751J33269J76322
$$ plain form
21964 -341367 -179569 -8736 53639 106012 -756 -82097 -90660 206833 279127 111562 -82191
21953 -82191 -57607 -165037 -89105 171003 204708 347635 356174 272235 205127 36003 -184274
21942 -184274 -303842 -438076 -425483 -379150 -521049 -560620 -403724 -144812 -355274 -332253
21932 -332253 -252732 -260845 -118067 5275 -200096 -93842 65315 56022 -143359 -150443 -149318
21921 -149318 -232402 -55512 -7726 -44149 -2044 419597 527437 373718 280602 27792
21911 27792 -122388 -121954 -182932 -228533 -278616 -134263 -160670 -242358 -376445 -333677 -441888
21900 -441888 -531736 -442600 -321746 69692 128371 -6927 -29922 -13603 159067 270528
21890 270528 -61152 29591 385738 260890 235913 -72558 -548396 -664147 -530878 -354556
21880c54556L0278Q5852J77765R0634L4846N2386l0283L09818j74390q5226J16460
21869B53584J26079L5104j82664j22831j05209k3965l37382j3117K51916j60070
21859b78555j18262r8434N5963J72438L21768k40489k99212R0701L08603R651
21849g5828n0930J32378M6974J00627m17196l15920K84591K65714n0364k22347
21839c02301j8136p194K52121J00969J0543j49028k64222J01731K27235K28230
21829A79948J21290J11917j03164j88475m5278j78084j43022J91810J16557Q3758
21819A47257j32641R0155j98120j96439K5716l1823M3006L31060K2769k2507K16551
21808B94984J34154k15551m42308k75833l9690J64175J17528M7778J69297k8304
$$ plain form
21880 -354556 -324278 -238426 -60661 29973 64819 117205 86922 396740 222350 137124 253584
21869 253584 379663 414767 232103 109272 4063 -19902 -357284 -370401 -118485 -278555
21859 -278555 -396817 -495251 -439288 -266850 54918 -185571 -484783 -394082 -85479 -75828
21849 -75828 -126758 5620 52594 153221 -263975 -579895 -295304 -29590 -79954 -302301
21839 -302301 -320437 -327631 -75510 25459 36002 -113026 -377248 -275517 -48282 179948
21829 179948 301238 413155 309991 121516 76238 -101846 -244868 -53058 63499 147257
21819 147257 14616 104771 -93349 -289788 -264072 -295895 -252889 78171 100940 78433 294984
21808 294984 429138 213587 -228721 -504554 -544244 -380069 -262541 -214763 -45466 -73770
21798g3770j08921n808N4013N8825N563j72964n7496K54031J51377K22309P6634
21787D03793l36776l55986J83313K41910K2148P9196j24490K44862N4922j64437
21777B48455o19978k04505J56003J43848J23887J79718K99924M7121l46079l3056
21767d662L0661k51603J09606L23350j67886j38801J93930J36495L40577k4814
21757E46853k22864m54064m4946K97982j67301l6369J97787j03887Q7742K04481
21747C05414j7542k47996m66465k29370K354J89694L01714J49640R2733k16372
21737a36196K45729L445k40137k4720J39888K33977k31387k03520M2359K35798
21727F5236L20688j18777L9734Q5852j52895j54224l7657o1425k68969k59497
$$ plain form
21798 -73770 -182691 -188499 -134486 -75661 -70098 -243062 -300558 -46527 104850 327159 403793
21787 403793 67017 -288969 -105656 136254 158402 237598 113108 357970 412892 248455
21777 248455 -371523 -576028 -420025 -276177 -152290 27428 327352 374473 28394 -4662
21767 -4662 25999 -225604 -115998 207352 39466 -99335 94595 231090 571667 546853
21757 546853 323989 -130075 -175021 122961 -44340 -80709 117078 13191 100933 305414
21747 305414 287872 39876 -426589 -655959 -653605 -463911 -162197 -12557 80176 -136196
21737 -136196 109533 112978 -127159 -151879 -11991 221986 -9401 -212921 -170562 65236
21727 65236 385924 267147 306881 392733 239838 85614 47957 -13468 -282437 -541934
21717e41934m0678L46822J01615j59889j16883J21848k6290N6640J41079M6327
21707g1343J2098k41655J88861N797k26737L43853J24978J33111M1835j14183
21697A96615j37072j10130L1375K78015M8887J0563K9768j79707q0996K76459
21687C63777J0149q7499J39367K95239j44221r7798j88631k09050k44970m3532
21677b07169J1872o7848J61360N0221n1025K6433J27567k15553q969J47364J93624
21666A67877n6860p7566J92024R405j12268l0418m4980m4097l16930k27860R9304
21655d42369r1026l0967J72543j8513q0531J40764J36785M3890P8564K659J25811
21644C7610J41689j23971l33383j09368k147j4052n5051K40187L43070J66648
$$ plain form
21717 -541934 -582612 -235790 -134175 -294064 -410947 -289099 -315389 -258749 -117670 -71343
21707 -71343 -59245 -300900 -112039 -106242 -332979 10874 135852 268963 310798 196615
21697 196615 59543 -50587 -19212 258803 307690 318253 348021 168314 87318 363777
21687 363777 373926 286427 425794 721033 576812 479014 290383 81333 -163637 -207169
21677 -207169 -195297 -263145 -101785 -51564 -102589 -76156 51411 -164142 -173111 -25747 167877
21666 167877 111017 33451 225475 234880 122612 92194 47214 3117 -313813 -541673 -442369
21655 -442369 -533395 -564362 -391819 -410332 -490863 -350099 -213314 -169424 -90860 -88201 37610
21644 37610 179299 55328 -278055 -387423 -389570 -403622 -458673 -218486 124584 291232
21634B91232q1938M7236j50119j62009K281K38256J93854j93216o4331j06810
21624A4436j11700J90273R927J07733q1087O2569K5751j2908k47851o5635n9922
21613a68414L3702n5305j26085J14938J88217K72124Q8459m11548j28419L74704
21603A82373M47180l07555k9055o6987o1015q086J65666k26070k53081J28827
21593b7803M9137k06074J11894K50917j34229m2876N6633k4604K940j4171q7351
21582f5587N8856Q8378K2657m00264j31790m7931p0631J92841K24451m1900J01852
21571f9068K82553J71483k37795l4271o9067n1814J91407Q9561m1404q4541O9667
21560B16711j25275m6770j8411j66293m9525M4332l64752j26575P8412L51768
$$ plain form
21634 291232 209294 256530 106411 -55598 -53317 184939 378793 185577 121246 14436
21624 14436 -97264 93009 102936 210669 129582 192151 217902 204994 -42857 -108492 -168414
21613 -168414 -134712 -190017 -316102 -201164 -12947 259177 347636 -63912 -192331 182373
21603 182373 629553 321998 292943 225956 164941 156855 322521 96451 -156630 -27803
21593 -27803 21334 -184740 -72846 178071 43842 966 57599 32995 35935 21764 -65587
21582 -65587 -6731 81647 104304 -295960 -427750 -475681 -546312 -353471 -129020 -170920 -69068
21571 -69068 213485 384968 147173 112902 43835 -7979 183428 272989 231585 147044 216711
21560 216711 91436 44666 26255 -140038 -189563 -145231 -509983 -636558 -558146 -206378
21550b06378K97010r8008k63428Q2651J21332j8352o3246n1221K37018j05604
21540f8226j88287K08689J71225J46888K1625O8647J17834R5170j62256k06154
21530B05155j39217q5963J23319J02099r7989L2018J4256j48170O7110J31266
21520B03884q1000j44498J22309K54369n7204K4825l7949N4461o0171k4031j85205
21509F9790p6126J06113q5869N4720K56945j69474k94482j19271J21089Q5597
21499e0968j9146j39373L13528q7435j00045j67131q5294R6164L42029o8915l87401
21488c53987j07059M38704K37690r5645J9313k53892Q7418J86301K29637R6623
21478D85103N3984j24675r639L1918k6660k45498J6378K06520p6232q8719j22792
$$ plain form
21550 -206378 90632 -7376 -270804 -188153 -66821 -85173 -148419 -199640 37378 -68226
21540 -68226 -256513 -47824 123401 270289 291914 360561 478395 573565 411309 205155
21530 205155 65938 -20025 103294 205393 107404 139422 153678 5508 72618 203884
21520 203884 122884 -21614 100695 355064 297860 322685 284736 339197 279026 254995 69790
21509 69790 -6336 99777 13908 68628 325573 156099 -138383 -257654 -136565 -50968
21499 -50968 -70114 -209487 104041 16606 -83439 -250570 -335864 -239700 102329 33414 -353987
21488 -353987 -461046 -22342 215348 119703 139016 -114876 -27458 158843 388480 485103
21478 485103 539087 414412 404773 436691 410031 164533 180911 387431 311199 222480 99688
21467I9688p9145j68468J13870R9407j16861L6143q6165q8124k86J24396J80280
21456A14735J27965l21720k18279J61086k32717j57170K01034K03503L3387k2999
21446a11175j01204K02648K64943m8285j56107J02948M88l9922j44282O1376m0145
21435h717k22282k45428r9500k13594Q6100L55583J38518N8817J42703L32651
21425C24851q6258l99997k83284M5622L07603L9223k9796m9214J74380J19445
21415A62575M2686N5222j8093m69691m10254J84162L25435Q5709j45889K9113
21405a59025Q7920n5509J84511n9916j13745r4678j68863J17293m24J48790k1254
21394a34900L59453k26054j49540J6505j91972R3396J8398K6744J03083j18377
$$ plain form
21467 99688 20543 -147925 -34055 65352 -51509 -15366 -101531 -189655 -189941 -65545 114735
21456 114735 242700 -79020 -297299 -136213 -368930 -526100 -325066 -121563 -88176 -111175
21446 -111175 -212379 -9731 255212 206927 50820 153768 154256 114334 -29948 31428 -8717
21435 -8717 -230999 -476427 -575927 -789521 -703421 -347838 -209320 -150503 -7800 324851
21425 324851 238593 -161404 -444688 -399066 -91463 -52240 -82036 -131250 43130 162575
21415 162575 205261 260483 242390 -227301 -637555 -453393 -127958 -42249 -188138 -159025
21405 -159025 -71105 -126614 57897 -2019 -115764 -210442 -379305 -262012 -262436 -113646 -134900
21394 -134900 224553 -1501 -151041 -134536 -326508 -233112 -214714 -187970 -84887 -203264
21384b03264J56863L68434n8710j97564j08203M520K70260L2375k71725k2093
21374b9107j07062J1502K18772j3960j46367k29174J67384K54687p3856P9700
21364A32519k1340n2350P0019p3308N2010Q3676Q2162j21198Q9318M5325k26340
21353F0493k11261J70275J30074j50322m02874j68517k33074Q4474J09717O9974
21343e41041q223J59866j19701N6209L2045J28028J03762M5992j53304k95129
21333e91496j7563J96317R6612o7104J69010K05010l733q6905P6943j70539l55814
21322e49262K03729K99216J44576L925q9835j65605J9214j49628J00805m3639
21312b26504k22897Q7504R0932j03479l1305L30018J67369K35084K1648j71782
$$ plain form
21384 -203264 -46401 322033 263323 65759 -42444 -37924 232336 264711 -7014 -29107
21374 -29107 -136169 -124667 94105 80145 -66222 -295396 -128012 126675 52819 132519
21364 132519 111179 58829 128848 55540 107550 191226 273388 152190 241508 286833 60493
21353 60493 -150768 19507 149581 -741 -403615 -572132 -805206 -720732 -611015 -541041
21343 -541041 -549264 -389398 -509099 -452890 -420845 -292817 -189055 -143063 -296367 -591496
21333 -591496 -609059 -412742 -316130 -383234 -214224 -9214 -12947 -99852 -22909 -193448 -549262
21322 -549262 -345533 -46317 98259 102184 12349 -153256 -134042 -283670 -182865 -226504
21312 -226504 -449401 -361897 -270965 -374444 -405749 -75731 91638 326722 348370 176588
21302A76588n1784j21905p1115K7820j2439J3164K59742R3074j73431l30444k92942
21291d83672J38380K31541K72382j5732k27070j47988N2046J24809N6067K00791
21281B01554J21545k82480P8024l6168M8648N0441p8646j62519k41520k7343L91960
21270F3496P7455m1100l77002J58428K997J50195Q7737k82581L7574J25626J19819
21259A22644P2686j15140R7803m2887l03246k14107Q4886m0436p1866K12559J23787
21248g3317R5979J28428J73180j6095M718R4025K01662J88783J49166j09373k18108
21237F19048j59594j55275r6122j37830j00629K3237k51265j84660R3753J14533
21227b34804j07537J44688J2149J25668j67823J78948K41512j19876k03681j54023
$$ plain form
21302 176588 124804 2899 -68216 -40396 -52835 -39671 220071 313145 139714 -190730 -483672
21291 -483672 -345292 -113751 158631 142899 -84171 -232159 -180113 -55304 763 201554
21281 201554 323099 40619 118643 82475 131123 181564 102918 -59601 -301121 -328464 63496
21270 63496 140951 99851 -277151 -118723 -115726 34469 122206 -160375 -122801 2825 122644
21259 122644 195330 80190 177993 135106 -168140 -382247 -297361 -337797 -409663 -197104 -73317
21248 -73317 22662 151090 324270 308175 312893 406918 608580 797363 946529 837156 619048
21237 619048 459454 304179 208057 70227 -30402 -7165 -258430 -443090 -349337 -234804
21227 -234804 -342341 -197653 -185504 -59836 -227659 -48711 192801 72925 -130756 -284779
21217b84779j85355Q5090N3064n168K73515J21320k00417j99429L17772J00242
21207G5855j29659J11543j7938J30923j72172j53713M13233J83552j60724l8960
21197B41940J72640J11062j04269k22640l6905L9010k25468j72121m7199p3776
21187c17726J89182J83194K58452j27557k70520k9450K52009j00456r8796J2289
21177d9379o2198M0089j8865p1005K16370O6071J47030Q139j95106l03307O1400
21166a60761L28602k35410l30055J43154j11089j98408n5028J29223J18412Q1254
21156b90106q2421K67606J29204j10647J53867l5925L7351j1409k57785O1261
21146a39004P1910K20574M2444k6339j9501J29560j51098Q2152J41435l62569
$$ plain form
21217 -284779 -470134 -385044 -331980 -337148 -63633 57687 -142730 -342159 -24387 75855
21207 75855 -53804 57739 39801 170724 -1448 -155161 258072 441624 280900 241940
21197 241940 414580 525642 421373 198733 161828 200838 -24630 -196751 -243950 -317726
21187 -317726 -128544 54650 313102 185545 -84975 -114425 137584 37128 -61668 -49379
21177 -49379 -111577 -71488 -90353 -161358 55012 121083 268113 276252 81146 -222161 -160761
21166 -160761 167841 -67569 -397624 -254470 -365559 -563967 -618995 -489772 -371360 -290106
21156 -290106 -372527 -104921 24283 -86364 67503 31578 68929 57520 -200265 -139004
21146 -139004 -67094 153480 195924 169585 150084 279644 128546 210698 352133 -10436
21136a0436n4392J98320R131K08005o5466l5087K19625K22952K63778k18820n48323
21125A89287k54769J57306J17063k00142J54177n1170q3805L17596J5745j64495
21115A96793k3843J11634J13006k65144l97904N1866L33551J35230j39768J36920
21105B52341M5967l29913O1835m5870j33464J3111Q5150K16413p6261K10390L08733
21094F08432J82054j77627k14601j80282j68765k79059j98189j93316K78726M2082
21084c00545J29027j1739o1015r3630r2997L27253R1787L023p5374J54428q9489
21073a9271k51381J53904N0981J42162K11650J5383P416j92956n3278k51676J08808
21062g8258J94183J20938K74669l5131k45623m87762j08407J93218J23120q3258
$$ plain form
21136 -10436 -64828 133492 142623 350628 285162 250075 469700 692652 956430 737610 189287
21125 189287 -65482 91824 208887 8745 162922 111752 27947 345543 361288 196793
21115 196793 172950 284584 397590 132446 -265458 -213592 119959 255189 115421 252341
21105 252341 298308 -31605 30230 -15640 -149104 -135993 -50843 165570 89309 299699 608432
21094 608432 790486 612859 398258 217976 49211 -229848 -428037 -621353 -342627 -300545
21084 -300545 -171518 -183257 -244272 -337902 -430899 -103646 -11859 -8836 -84210 70218 -19271
21073 -19271 -270652 -116748 -65767 76395 288045 303428 310844 117888 64610 -187066 -78258
21062 -78258 115925 236863 511532 476401 230778 -256984 -365391 -172173 -49053 -132311
21052a32311r7740o6089K63584J50588R9330L04117r5673j56388k72839o6017
21042f9438q0975J0968r4796k22257j21647L0789M03679M58751O1204P6170q0158
21031C72290k17837n12061M3198L53298N2488q8718j29014k37099l673n7446J38757
21020b85817J32260k544k30825k9439J95544r5199n8818l35827j30317L57356
21010d83626N1216m5778J84334P9150L6998K15016K1528j85065j22191k16617
21000d65035J42018J58928J87949q9719k23261K68828j22692j2172q942J36299
20990b7799j1686j14654l2683K40595K9731J61508N5260m7149l57831k28055K54770
20979g7993K45868k59450j34600k98964R3253J32922J63280p5938k38334J803
$$ plain form
21052 -132311 -230051 -296140 -32556 118032 217362 521479 425806 269418 -3421 -69438
21042 -69438 -150413 -139445 -234241 -456498 -578145 -547356 -143677 315074 376278 452448 372290
21031 372290 154453 -357608 -314410 38888 91376 2658 -126356 -363455 -367128 -424574 -285817
21020 -285817 -153557 -156101 -386926 -416365 -220821 -316020 -374838 -710665 -840982 -483626
21010 -483626 -432410 -478188 -293854 -214704 -177706 37310 58838 -126227 -248418 -465035
21000 -465035 -323017 -164089 23860 -65859 -289120 -20292 -142984 -155156 -164098 -27799
20990 -27799 -39485 -154139 -186822 53773 83504 245012 300272 253123 -104708 -332763 -77993
20979 -77993 167875 -91575 -226175 -525139 -431886 -298964 -135684 -211622 -449956 -448153
20969d48153R1001J65560J5275j21006J5557J60957N6264J00435M910l9565O94
20958A929K13922j11864j59881j96966l1500J85937j67895k36776K36337K76033
20948I276l6577O3497m7797r223R6206Q8019j17515R1030n5840K7127J44802K40879
20936D93884o2538j64089n032l82087j25028K0517r8362L01852J68940J27935
20926B75992k6224k90834q3805K4815L734q3105Q4738m1409N8719K01204J92441
20915C16266L87498k12991l93881k24830j83704O3505K99378j07546P9543L9898
20905F3136k27827L7994J56546O2805j15404o1007N6328q9541J22560O3553m34472
20894c65329j90313k2431N92027J97681j04076r8966J75974K7794k55956j40451
$$ plain form
20969 -448153 -357152 -191592 -176317 -297323 -281766 -120809 -64545 35890 40800 1235 1929
20958 1929 215851 103987 -55894 -252860 -284360 -98423 -266318 -503094 -266757 9276
20948 9276 -27301 36196 -11601 -20824 75382 163401 45886 136916 81076 108203 253005 493884
20936 493884 431346 267257 262225 -119862 -244890 -224373 -322735 -20883 148057 275992
20926 275992 249768 -41066 -124871 -100056 -96322 -179427 -94689 -136098 -77379 123825 316266
20915 316266 703764 490773 96892 -127938 -311642 -248137 51241 -56305 23238 63136
20905 63136 -164691 -126697 29849 92654 -22750 -83757 -27429 -116970 5590 69143 -365329
20894 -365329 -555642 -578073 13954 211635 107559 8593 184567 212361 -43595 -184046
20884a84046K15572K11659k11209k0372j63258L2024K34286L72820N4530l89851
20874A52155j66449j30519l87517r3153o988n7043L41499N30538K14763k82653
20864A14633m44763L8532K57484k08606j67208J08603J01892j09163j05296J78317
20854b35575J46721L91902J34913j95712j94691k77359j1335M58896r1866n4637
20844G1257J35060j96606k6649L46606j40324l59614q9274K38848K33917r2354
20834A20867j37069n7992n8338L6906J90094j09113Q6559J44965J22599j46625
20824A92853j71167j48358k6728J94322j07720Q3688j4316O9396N7994K6456Q6437
20813B42857p5897Q7917L6342k4379j42643q2660P863l25989j26031J26938K72984
$$ plain form
20884 -184046 31526 243185 31976 11604 -151654 -119630 114656 487476 542006 152155
20874 152155 -14294 -144813 -532330 -625483 -632471 -689514 -348015 182523 397286 114633
20864 114633 -330130 -291598 -34114 -242720 -409928 -301325 -199433 -308596 -413892 -235575
20854 -235575 -88854 303048 437961 242249 47558 -229801 -241136 217760 125894 71257
20844 71257 206317 9711 -16938 329668 189344 -170270 -259544 -20696 213221 120867
20834 120867 -16202 -74194 -132532 -95626 94468 -14645 71914 216879 339478 192853
20824 192853 21686 -126672 -153400 40922 -66798 16890 2574 71970 129964 156420 242857
20813 242857 166960 254877 291219 266840 124197 41537 49400 -276589 -402620 -275682 -2698
20802b698J71201J05736n0658r6305M975J38318j26346l76787J33379J55501n3582
20791B734K21340J68750j53738j56785k00702p2239j10486J31430J1310j13820
20781b72206J31033K87357K60247l1746r3708M3698k2280J03630R9317j14628
20771C90714q8111l32091k64846o1718j55586k15349J51915M11314K70527K03335
20761C10104q7237k02489q2243L20291J47841l56660k26298j06743J73736J24192
20751A4494M7653J67414J89729L953l1710j51298r9919L547K68261O0747k4316
20740D48555l35553n9420J41634M3665k48393J7707P1468J87836J42967j67854
20730B42612m0923J7794k10l0359k01677k25362k30455j12420Q4054M39726k6483
$$ plain form
20802 -2698 168503 274239 223581 127276 132251 270569 144223 -232564 -99185 56316 2734
20791 2734 224074 392824 239086 82301 -118401 -190640 -301126 -169696 -158386 -272206
20781 -272206 -141173 146184 406431 374685 280977 324675 302395 406025 505342 390714
20771 390714 302603 -29488 -294334 -356052 -511638 -726987 -575072 -163758 106769 310104
20761 310104 222867 20378 -61865 258426 406267 49607 -176691 -283434 -109698 14494
20751 14494 62147 229561 419290 423243 391533 240235 140316 143863 412124 472871 448555
20740 448555 113002 53582 195216 238881 -9512 8195 79663 267499 410466 242612
20730 242612 201689 219483 219273 188914 -12763 -238125 -468580 -581000 -496946 -57220 -83703
20719h3703J65945l6808j49597k636J20338O8306J65355J41745K16837J16361
20709G22143l47833l64147m75398O5581M7056J2664K44022L12080r0358J66263
20699B92073l8641j30169n0500P2750k53366k97946J39743M9204l6587Q6714L21585
20688A54860L47432j90336m03042l079J59402L1331k21976Q8838J61019J7835
20678A42284q0735L25658P0937j74439p5250l6999n5409n6391Q2874m0226r3184
20667I120K64638L28973K18180k60899j98627j17998R943q6891j32479q770k30231
20656b05041j73173J64098K14256n3279p0872K35389j51128l1006K60208k51574
20646f2122k60110M781K73849J34216q4629O1639j98464k29448j17796J04004
$$ plain form
20719 -83703 82242 45434 -104163 -106799 13539 81845 247200 388945 605782 722143
20709 722143 374310 10163 -465235 -399654 -352598 -339934 -95912 216168 125810 292073
20699 292073 253432 123263 72763 145513 -107853 -405799 -266056 -216852 -253439 -166725 154860
20688 154860 502292 311956 -91086 -94165 65237 96568 -125408 -36570 124449 142284
20678 142284 61549 387207 458144 283705 208455 171456 116047 59656 142530 102304 9120
20667 9120 273758 602731 820911 560012 361385 243387 253330 166439 33960 25190 -205041
20656 -205041 -378214 -214116 140 -53139 -124011 111378 -39750 -70756 189452 -62122
20646 -62122 -322232 -317451 -43602 90614 5985 67624 -130840 -360288 -478084 -374080
20636c74080J38097j67679M2376K71660M11522O2742j66779j48264j52583J03410
20626B0422m763j97838q8423j28359K69792J57471q3928J69863O1525J30603j74176
20615A32189j91198k95755k7256K55680J05006o2917J05783P6477K97272L34891
20605G30172k42021m58809k37977k05630J5704l0765L29495J44054j13767k38326
20595c07870M3578L58196k44866J27511L07347o4973m5671j62629j85285j58776
20585c33438Q0728K01669K08340j70606K6291k15265k84563K35736M30266k82694
20575a03536l82263j00342J84093l0034J02880J06766M3641j835M1775J37461
20565a394J05826K26885J06704k10265j22644L15882J41115l31551k08147R5330
$$ plain form
20636 -374080 -235983 -403662 -361286 -89626 321896 384638 217859 69595 -82988 20422
20626 20422 15659 -182179 -270602 -398961 -129169 28302 -55626 114237 175762 306365 132189
20615 132189 -59009 -354764 -382020 -126340 -21334 -84251 21532 98009 395281 730172
20605 730172 488151 29342 -208635 -414265 -398561 -429326 -99831 44223 -69544 -307870
20595 -307870 -264292 93904 -150962 -23451 283896 218923 173252 10623 -174662 -333438
20585 -333438 -252710 -51041 157299 -13307 12984 -202281 -486844 -251108 179158 -103536
20575 -103536 -485799 -586141 -402048 -432082 -329202 -222436 -178795 -180630 -138855 -1394
20565 -1394 104432 331317 438021 227756 105112 420994 562109 230558 22411 117741
20555A17741m2811J29386M5304k82481L0474k88259P4698R2820j64746K8753n621
20544b64742J2393j83211J57734K65885J93410Q4006o6212j20216J80077p3771
20534A85353r7091j00138j72873r3544J25860Q1730L1472k31709n1676L66025
20524D3409R941L2818j55492k2174J19023J24179n1766j54175m1143J23604P0400
20513I8624l16927j61832O9130K88807R4190R7967M178j17715J35676K4485j24583
20502I2000K24866k22914k29990k80305o3863J34025J03856L2473K63033j67041
20492a13860k27264O2817J92025R9807p35k29739L7657J49975L7310k1339j21968
20481a35314Q3526J82716K40367k37870m05026L9713j69016k54652k38403J91541
$$ plain form
20555 117741 74930 204316 249620 -32861 -2387 -290646 -215948 -123128 -287874 -259121 -264742
20544 -264742 -252349 -435560 -277826 -11941 181469 265475 199263 79047 259124 185353
20534 185353 88262 -11876 -184749 -278293 -152433 -70703 -39231 -270940 -322616 43409
20524 43409 53350 86168 -69324 -91498 27525 151704 99938 -54237 -95380 28224 98624
20513 98624 -218303 -380135 -311005 -22198 71992 169959 174137 56422 192098 216583 92000
20502 92000 316866 93952 -136038 -416343 -480206 -346181 -242325 -209852 53181 -113860
20492 -113860 -341124 -278307 -86282 13525 12790 -216949 -179292 -29317 7993 -13346 -135314
20481 -135314 -51788 130928 371295 133425 -271601 -231888 -400904 -655556 -893959 -702418
20471g02418L11574J34069L53052L75278j17525l72857k9177o4885J67842r0473
20461c5520K7677l742J16035J46632j58023m9410o8733P9049l524l3128j58882
20450a41569q8238j07268o3694p1683Q2318K57532K83461K9968j84021l17254
20440c20448p0005L62125J06282L9962l4596k35048j01840P8338o3261O9952L04831
20429A36292M18905j39729M9747l5320l11515k05103P7954j40959j25935M122
20419b71541m9356Q2052K59164m3012l68093J96575L60195m9071M925J01464J68165
20408C91467K2459r7471l43910k14229J16006L36636L96851J49963K9321L1704
20398H18797l91069J29949k47075j39875J23622n0605j58069J70181l3692k42649
$$ plain form
20471 -702418 -390844 -256775 96277 471555 354030 -18827 -48004 -112889 54953 -35520
20461 -35520 -7843 -11585 104450 251082 93059 43649 -25084 53965 50441 17313 -141569
20450 -141569 -229807 -337075 -400769 -472452 -390134 -132602 150859 180827 -3194 -320448
20440 -320448 -390453 -28328 77954 117916 83320 -151728 -253568 -175230 -238491 -168539 136292
20429 136292 555197 415468 465215 429895 118380 -86723 -8769 -149728 -275663 -271541
20419 -271541 -320897 -238845 20319 -22693 -390786 -194211 165984 116913 121838 223302 391467
20408 391467 413926 316455 -27455 -241684 -125678 210958 607809 757772 787093 818797
20398 818797 427728 557677 310602 170727 294349 243744 85675 255856 222164 -20485
20388b0485m0571L3770j7522J13608j31946P1982j80753k18022P6111K69878j24763
20377a68713j92428K78832J63811J66484J40939j03251j70836k35905r4305j88010
20367d03382R2716K26985J68818J79064J7234L3508j75353k83836k53701r0308
20357d88255L93908J01985n4325l7605J60J18042j68005P7204K38556K22396j878
20346D02183j09110j53396j07905n594j87537J03211j3220k777l0008j15638J68673
20335e1118J59833k82788l4629K15636J56002K13460J28289k03185j36589J00125
20325B65036J55937k85265J4043J89119J85550l42239k73478k09163R9671R0276
20315a10513J45034M7956R468k19399J71564J98955M4k92655k26500k7227J15739
$$ plain form
20388 -20485 -61056 -27286 -44808 68800 -63146 8836 -171917 -389939 -313828 -43950 -168713
20377 -168713 -361141 -82309 81502 247986 388925 285674 114838 -121067 -215372 -403382
20367 -403382 -310666 -83681 85137 264201 281435 314943 139590 -144246 -397947 -488255
20357 -488255 -94347 7638 -46687 -84292 -84132 33910 -134095 -56891 181665 404061 402183
20346 402183 293073 139677 31772 26178 -161359 -58148 -71368 -74145 -104153 -219791 -51118
20335 -51118 108715 -174073 -208702 6934 162936 376396 504685 301500 164911 265036
20325 265036 420973 135708 149751 338870 524420 182181 -91297 -300460 -200789 -110513
20315 -110513 34521 82477 91945 -127454 44110 243065 243109 -49546 -276046 -303273 -187534
20304a87534J48136J1690J08690M3753r7724o364J52594M3541p2809q0505M1937
20293A05405j04543n3226K9489j46928j4391K47680L35868K29329j31965k5596
20283D71122J6637j57450k21379k55148K89543O9857n4012K26967k4063J46749
20273E08823J13353J86562j29987k69556o6178p8840M128k70133k78599j5858
20263b96285J81420M3060o6694J78874M9716j52217K52014J40140l2342j55579
20253A42107Q1760J33258l10829k76799J28024o5626q2903J17318K26707J10566
20243B03583j45762j66529K41149j22741j35515J6055o7713J4588Q0311Q4506
20233A932j29416L0897k21745Q0058K11547L50200N1464l5408j95396k07705j63397
$$ plain form
20304 -187534 -39398 -27708 80982 124735 27011 20647 173241 216782 143973 63468 105405
20293 105405 862 -52364 -22875 -169803 -184194 63486 399354 628683 496718 471122
20283 471122 487759 330309 108930 -146218 143325 213182 159170 386137 362074 508823
20273 508823 622176 808738 678751 409195 343017 264177 268305 -1828 -280427 -296285
20263 -296285 -114865 -71805 -138499 40375 90091 -62126 189888 330028 297686 142107
20253 142107 223867 357125 46296 -230503 -102479 -168105 -251008 -133690 93017 203583
20243 203583 57821 -108708 132441 9700 -125815 -109760 -177473 -162885 -82574 1932
20233 1932 -127484 -96587 -318332 -238274 -26727 323473 374937 339529 144133 -63572 -226969
20222b26969p9139L0839J63050J30621j47163J9765N6221l1796k0730Q5805j01265
20211a20761O4999K60013k19884j71625k9339J19861j15158j75269Q965L3779
20201c44419P5702L84737K77862k87879m00525J15763K13160p9909o842K397l88964
20190d38917k50080p8445q8885N1813K98634K66903l0231M01618j02992l28005
20180b98587Q6465J45667p2061j50501L3746J21716J18348P3447n1782k0785j50648
20169a64975R158m7030J35494j29540J00711J32640R8407j40136r332q8251J75598
20158G2744P6080k68906P3274K69966K69339j72985k5684m8200j68767q5835J37477
20147A28503j84049j02267O4227p858L74108J14962j78746p0458j9982l69163
$$ plain form
20222 -226969 -306108 -275269 -112219 18402 -128761 -108996 -52775 -84571 -105301 -19496 -120761
20211 -120761 -55762 204251 -15633 -187258 -216597 -96736 -211894 -387163 -378198 -344419
20201 -344419 -268717 116020 393882 106003 -294522 -178759 34401 -45508 -52350 -49953 -438917
20190 -438917 -688997 -767442 -856327 -804514 -505880 -238977 -269208 132410 29418 -298587
20180 -298587 -212122 -66455 -138516 -289017 -255271 -133555 -15207 58240 6458 -14327 -164975
20169 -164975 -155817 -202847 -67353 -196893 -96182 36458 134865 -5271 -14603 -102854 72744
20158 72744 148824 -120082 -46808 223158 492497 319512 293828 245628 76861 -8974 128503
20147 128503 -55546 -157813 -93586 -101444 272664 387626 208880 138422 118440 -250723
20137b50723J42355J34531o0714J68124J12085K8364J31907n2164o9941J43080
20127D26904J19762J43706j33065k56030o1493K50188N4038P1818Q4837J30602
20117H31267J21008j45335q4100j67587k62217j26639j2477J78909O6407R401
20107D08637j62734K03298J06730L14598O2869j45156k24122p7214K57457J80280
20097I24643J17510o6528l46098n8094r0130N7135m8042q606J03208K21471k04499
20086F01970p8759j66276K9785j11541K8005j74559Q8781L3066r1361n7997r8233
20075B881K55223P8525m6489Q8313r5744Q4227J85369J58163n6233J0373l762
20064F60846r34K8347p2156M6058J35876p5068J59125j2962L5496J21723L51583
$$ plain form
20137 -250723 -108368 26163 -34551 133573 245658 274022 405929 353765 283824 426904
20127 426904 546666 690372 557307 301277 239784 489972 544010 615828 700665 831267
20117 831267 952275 806940 722840 555253 293036 166397 153920 332829 399236 408637
20107 408637 245903 449201 555931 870529 933398 788242 564120 486906 744363 924643
20097 924643 1042153 975625 629527 571433 481303 538438 490396 481790 584998 806469 601970
20086 601970 523211 356935 386720 275179 303184 128625 217406 250472 159111 101114 2881
20075 2881 258104 336629 290140 378453 282709 366936 552305 710468 654235 664608 660846
20064 660846 659912 688259 616103 662161 798037 722969 882094 869132 904628 1026351 1377934
20053A377934k42125l45328l21565J01660M2245O7913j9399L0l28852J6167J13363
20042D62043l3126q5659N9553J13818m37132k37302k00605Q8583K18331P5930
20032B4434K67582L9245k33030j94809j19812R0591L79637J53762J75499J02963
20022F86062l21964n8603k1072j19844j74706l0673J05279N0154Q7396k24305
20012b2276N7261j41804J37377J46150j54346m3101O6307J02408J47542k3866
20002B71652j27092j77476q6504L75012J16743q0863k16019k57811r0985o2249
19992c35592J06938J79446L773j25579R4290j51773r4373O0916J49394J51883
19982C9323L9631J07544q8112j17684K05185K42250N3310j56673j6696J49709
$$ plain form
20053 1377934 1135809 790481 468916 570576 612821 680734 661335 661365 332513 348680 462043
20042 462043 428917 343258 402811 516629 79497 -157805 -358410 -269827 -51496 24434
20032 24434 292016 331261 98231 -96578 -216390 -125799 253838 407600 583099 686062
20022 686062 364098 305495 284423 164579 -10127 -40800 64479 114633 202029 -22276
20012 -22276 34985 -106819 30558 176708 22362 -20739 45568 147976 295518 271652
20002 271652 144560 -32916 -119420 255592 372335 291472 75453 -182358 -273343 -335592
19992 -335592 -228654 -49208 -45435 -171014 -76724 -228497 -322870 -261954 -112560 39323
19982 39323 78954 186498 98386 -19298 185887 428137 481447 324774 308078 457787
19972D57787j77838J41970o6428J09844R4484j8739j7301l85716k21828K08952
19962A25187K2943j95699j26199M4110J13376J41417k42166J7423P9966P6108
19952E6466N5399j297q1964j26234L87222J20621k03629j35797k09439j0224J00433
19941d8443Q8377M0642j64693j9990M6783l05394K8188J80015K50690L13081j96955
19930B12301j73449J0870m176j24048o7291l4607M5014R4163L3733j76486j14008
19919b97984J86142J28122l3596N132Q0754J1122j6673Q4049K31550J14263J49176
19908F42057j90711q4889m2145K1380k27200n7481J66253L01547j12590l51762
19898F4459o1556K51622J40758o9904n0436O9619N7987j8164O9001k44089j07081
$$ plain form
19972 457787 279949 421919 355491 465335 559819 541080 523779 138063 -83765 125187
19962 125187 148130 -47569 -173768 -129658 -16282 125135 -117031 -99608 -19642 56466
19952 56466 111865 110568 28604 -97630 289592 410213 206584 70787 -138652 -148876 -48443
19941 -48443 39934 80576 -84117 -104107 -57324 -362718 -334530 -154515 96175 409256 212301
19930 212301 38852 49722 45546 -78502 -145793 -180400 -135386 -41223 -7490 -183976 -297984
19919 -297984 -111842 16280 -17316 -12184 68570 79692 63019 147068 378618 492881 642057
19908 642057 451346 366457 324312 345692 118492 61011 227264 528811 416221 64459
19898 64459 2903 254525 395283 325379 274943 344562 402549 384385 453386 209297 102216
19887A02216O2341k01026k96819j68618l1218J15567R3020L9662q1223K59623
19877a06475N3704p347J6437J92603L7045M5188R9731k42921j19063J7958P2422
19866E9282p5514K06940j12185m7910L1352R8983l1984j85503p7989O9677Q5291
19855B0440k22989J1523K98849K23073J773m4212j99963j26528o4163K81554L00821
19844D80178P2561J24101m4749k35472k99335o6538Q3677L2750J64936J92328
19834E04437q1765j67840k29883J56163J33464J14514j29353n2468o4194k06718
19824b3643k33058m7575j82752q9770L00312L3711J27446M36522J9243j51652
19814A88784j32894l24967J37416p6919Q7613r9830K78422l8478K09834L09174
$$ plain form
19887 102216 164557 -36469 -333288 -501906 -533124 -417557 -324537 -284875 -366098 -106475
19877 -106475 -52771 -60118 -43681 148922 185967 231155 330886 87965 -31098 -13140 59282
19866 59282 -16232 190708 78523 30613 61965 160948 128964 -56539 -134528 -64851 20440
19855 20440 -202549 -191026 107823 330896 332669 288457 88494 -38034 -102197 179357 480178
19844 480178 552739 676840 632091 396619 97284 30746 114423 147173 312109 504437
19834 504437 422672 254832 24949 181112 314576 429090 299737 247269 183075 -23643
19824 -23643 -256701 -304276 -487028 -576798 -276486 -242775 -115329 321193 340436 188784
19814 188784 55890 -269077 -131661 -208580 -120967 -220797 57625 19147 228981 538155
19804E38155J02392J20834K04917J8319l27790k87969k59916K96712K073l11276
19794I6451O2046j17473R7446K0302q1957M75221P5174k41727j89246j17346p2324
19783F567j08920K0960j01689j95770j74044J16308K61760L67152J36912J97952
19773E27188K05848o1783j72501l11540j57757R2647n5978j07577J79347k31168
19763i3274K1375r7087K66546K8349j27877o5798Q2752M03495L1667l9551j75814
19752B34783P8824J87731q854R9595J06422o0970J87602l01408k6984J20189Q5898
19741G02828o2673k66353Q8900p8501K26628j40995l2035M3988J03699k61880
19731C23606J63540m034r5998n8817L13441J25446m3351P5449j14065l53932j18405
$$ plain form
19804 538155 640547 761381 966298 984617 656827 368858 108942 405654 407727 96451
19794 96451 158497 41024 138470 158772 76815 552036 627210 385483 196237 78891 6567
19783 6567 -102353 -81393 -183082 -378852 -552896 -436588 -174828 192324 329236 527188
19773 527188 733036 671253 498752 187212 29455 122102 66124 -41453 137894 -93274
19763 -93274 -71899 -168986 97560 125909 -1968 -67766 14986 418481 450148 410597 234783
19752 234783 313607 501338 492484 592079 698501 637531 825133 523725 496741 616930 702828
19741 702828 640155 373802 462702 384201 610829 469834 437799 481787 585486 323606
19731 323606 487146 483112 387114 328297 641738 767184 723833 799282 685217 331285 212880
19720B12880N3704J11053J88121R9472j38763L38920J8058J1360k31485j16354
19710E46966N0527l2598k36489J4940o9400m6101o0927K53420L36677J53304p2573
19699H37746K33292J26823l8145j21272N497J02457O8209l17945k32913K51312
19689I15061P7920k47329j06920J18763q4423j2629K2475K03514J7529m65441
19679D38520J910J34936L254j17817J15571J62267Q7270j0084Q3687J88778L47890
19668A436182J22045J17329j54042j91380K093j07939q0901J77934j80826j66964
19658I73531K08668K02357P8588J18591K47124j99247K4265n7128j53566N0487
19648A493670O9546J99175k61536J4020K20601N9354K49794L77030J56103k72360
$$ plain form
19720 212880 266584 377637 565758 665230 526467 865387 883445 894805 663320 546966
19710 546966 597493 564895 328406 343346 273946 227845 166918 420338 757015 910319 837746
19699 837746 1071038 1197861 1159716 1038444 1043941 1146398 1214607 896662 663749 915061
19689 915061 992981 745652 638732 757495 673072 660443 682918 886432 903961 438520
19679 438520 440430 575366 578620 460803 576374 738641 825911 815827 899514 1088292 1436182
19668 1436182 1558227 1675556 1521514 1330134 1332227 1224288 1143387 1321321 1140495 973531
19658 973531 1182199 1384556 1463144 1581735 1828859 1629612 1653877 1596749 1443183 1493670
19648 1493670 1563216 1762391 1500855 1514875 1735476 1794830 2044624 2421654 2577757 2305397
19638B305397o19946l04803j16076K92722K38771K35721K09059Q9593l7746k597
19628B290095j19877K5052L43742L37467K28541l5330L32245Q32402P77713L54793
19618E366843M77325N94629R36079L58739L78219P19533N97897Q31734J385821
19609A1646819K283752K197462K329184L260190M992615P724806P916395K481438
19601D4832661l687053m253503j664362J519120L871963O504402J0939437J7468024
19593G5530689K9045430M7608396O4736613M6879832n248014l1943984k7339311
19586A99269651k8492575l7331540l5995018k5093810j2995599l853600L682202
19579E9189711J0753497J4647502O007097j1104218k0023518j7294649j1252092
$$ plain form
19638 2305397 1685451 1380648 1264572 1557294 1796065 2031786 2240845 2330438 2292692 2290095
19628 2290095 2170218 2195270 2539012 2876479 3105020 3069690 3401935 4234337 5012050 5366843
19618 5366843 5844168 6438797 7374876 7733615 8111834 8831367 9429264 10260998 11646819
19609 11646819 13930571 16128033 18457217 21717407 26710022 34434828 42351223 44832661
19601 44832661 41145608 36892105 35227743 36746863 40618826 47123228 58062665 75530689
19593 75530689 104576119 152184515 216921128 263800960 258552946 226608962 199269651
19586 199269651 170777076 133445536 97450518 72356708 59361109 55507509 59189711
19579 59189711 69943208 84590710 90597807 79493589 59470071 42175422 30923330
19572C0923330o949836m536481k385700j566089r70432o54228L49822R75478J127432
19563A6313296Q11505N69269O38148O99073K30052K69813J172164K348622K408223
19554B5460165L312232M500476O132965P950720J2334688J8502421K2084428J2912501
19546A13190596n459286j5610126j3180765n118593K713110J0943025K2389273
19539A09867234L6874211M8699239M6107939L5624414L6713901J6937067m3002389
19532B87821616q0651862p1420546m5635410k6225516j5151179q774370m698686
19525C5264047q14542L090079O691885N460557k720053r563301r602296o795146
19517B1011230m346541l164661k703649j805522j217844p33699j35919K12911
$$ plain form
19572 30923330 23973494 19437013 17051313 15485224 14514792 13860564 14210386 15185864 16313296
19563 16313296 17124801 17694070 18332218 19031291 19261343 19531156 20703320 23051942 25460165
19554 25460165 28772397 33272873 39405838 47356558 59691246 78193667 100278095 113190596
19546 113190596 107731310 92121184 78940419 73821826 76534936 87477961 109867234
19539 109867234 146741445 195440684 241548623 277173037 313886938 330824005 287821616
19532 287821616 207169754 135749208 90113798 63888282 48737103 39962733 35264047
19525 35264047 34449505 37539584 44231469 49692026 46971973 37408672 27806376 21011230
19517 21011230 16664689 13500028 10796379 8990857 7773013 7039314 6903395 7116306
19509G116306L16n20881q66938r61920m85162o89787o78860m1835k82710j62492
19499B426037k17142j33573J20232K36477J34646J0780k08600J88038M85695L32429
19489C375019Q4596o3302l31527n53289L9216M64226M71612M52200L16177M92472
19479D747400O69935O12591M62377J4005o78904j214034j225135n86626l91201
19470B410408m44484R730M2797J21282L1081l33865n04520l48462L9888l57999
19460F65856j44976K8052j28844j41333J62548M8091q9646p8622q3980K55548
19450D92694K64688j49093l41342M8007o984J73015O5666j06930p6372K08972
19440E72321J7181k5937L5651j61979M522K0848J99003k22732o6515P9403r8638
$$ plain form
19509 7116306 7116622 6595741 5728803 4766883 4281721 3591934 2913074 2871239 2588529 2426037
19499 2426037 2208895 2075322 2195554 2432031 2566677 2577457 2368857 2556895 3042590 3375019
19489 3375019 3459615 3396313 3064786 2511497 2550713 3014939 3486551 3938751 4254928 4747400
19479 4747400 5417335 6029926 6492303 6506308 5827404 4613370 3388235 2801609 2410408
19470 2410408 1965924 1975654 2018451 2139733 2170814 1836949 1332429 983967 1023855 665856
19460 665856 520880 548932 420088 278755 441303 489394 399748 321126 237146 492694
19450 492694 757382 608289 266947 314954 307970 480985 546651 439721 363349 572321
19440 572321 589502 563565 599216 437237 441759 462607 661610 438878 372363 451766 353128
19429C53128O9542K42372K63071R076J64673k83705m5505M79502J44713l22480
19419A074387l81737j80898Q2391j15249j25554P6326K49248P0281k4850J32221
19409H56566Q3197m11222k49845k49143k1748R2531J69642r3288j98034M9282
19399B7938j07546J11546J1477L7723L08552P6696j22380L01226K79140l52008
19389E72364k01375J4542j3953j75672m34038N1620L81905j46148l6796k41938
19379b29489J25020K74568m3761j60827j17985J54384l0406P6636K87594K07178
19369E42912J05026P0005o305k04702n1876J89281n5461k52790j43957j14136
19359G7997l2921J55931K893P3305l7546k65234q6075P1757M2250L72611J96211
$$ plain form
19429 353128 422670 665042 928113 937189 1101862 818157 772652 1252154 1396867 1074387
19419 1074387 692650 511752 594143 478894 353340 429666 678914 749195 724345 856566
19409 856566 939763 528541 278696 29553 7805 100336 269978 176690 -21344 27938
19399 27938 -79608 31938 43415 81138 389690 466386 344006 645232 924372 572364
19389 572364 370989 385531 371578 195906 -238132 -186512 195393 49245 12449 -229489
19379 -229489 -104469 170099 126338 -34489 -152474 1910 -28496 48140 335734 542912
19369 542912 647938 717943 711638 506936 455060 644341 588880 336090 192133 77997
19359 77997 45076 201007 203900 277205 239659 -25575 -111650 -39893 2357 374968 571179
19348E71179j02718p6138m6558q6288O428p7104N6751K6044j24310j82044K04972
19337A70214L39618P7696p6435q8126J2975O4907J6231J01921k58129m52501J22237
19326C0608N0889J7003K91786J23009K62431j14289k317J17814m5946j036l8012
19315F91940k1321j64040K39457J45100O5116j76857m10104J20570Q5775j68656
19305D06980k26472j30552l7376o0212K02093K04299J43642q9925J39338m4136
19295E07679M9852K32621M238k2055k74437l08137J04465j6290k97817J67238
19285A47357K41836R6000J12804k0324k79552l15445R0412O8633j95210j88254
19275b41743j30428p7650J98004J11570Q4690k4782P2995K13653J12967o0351
$$ plain form
19348 571179 468461 392323 345765 259477 265905 188801 245552 271596 147286 -34758 170214
19337 170214 509832 587528 511093 422967 435942 500849 517080 619001 360872 -91629 30608
19326 30608 81497 98500 390286 513295 775726 661437 659120 776934 730988 729952 691940
19315 691940 670619 506579 746036 891136 956252 779395 369291 489861 575636 406980
19305 406980 180508 49956 12580 -47632 154461 358760 502402 412477 551815 507679
19295 507679 557531 790152 794390 772335 497898 189761 294226 277936 -19881 147357
19285 147357 389193 485193 597997 577673 298121 -17324 73088 141721 -53489 -241743
19275 -241743 -372171 -449821 -251817 -140247 -55557 -80339 -7344 206309 319276 258925
19265B58925J6107K00572p1034j8861k9316P4502J05782K27444J36154l3895l1044
19254H35336k19229O6374j92358k83727j16023N640K05633p4279j86473L3412
19244G4306l2799K45844K79520o103K52062O2353l72844j85326j1214j2702j66549
19233A26548l2882k9973R5473J25712J28857N9984J23075j41799M2217l2255j50785
19222C14172j52353k80621L11318J43237M59281k0813k38141O544r2068n0037
19212D00519k57077k08958J08681K51224o8933R3034m8911J16450J8895m8646
19202C56278J29797j88850j31100Q665k4922R938K35018K85833j30622j68712
19192C81323j42429j00895K06241J70422o3430j04111K3735J08740L96508l6114
$$ plain form
19265 258925 275032 475604 404570 385709 356393 430895 536677 764121 900275 866380 835336
19254 835336 616107 682481 490123 206396 90373 96013 301646 227367 40894 74306
19244 74306 41507 287351 566871 560768 812830 875183 502339 317013 305799 293097 126548
19233 126548 93666 63693 159166 284878 413735 473719 596794 454995 497212 464957 314172
19222 314172 161819 -118802 192516 335753 795034 774221 536080 542624 450556 400519
19212 400519 143442 -65516 43165 294389 225456 318490 269579 386029 404924 356278
19202 356278 486075 297225 166125 174790 149868 159806 394824 680657 550035 381323
19192 381323 238894 137999 344240 514662 451232 347121 370856 479596 876104 839990
19182H39990k86004n7201j04743J75020K30599J5641j44946O8520K28442k6282
19172I39036k67946J28806r3687r2438l5262j92733Q5273l6901j38015r107J68641
19161D55667q6852Q6044m2292k23998J064n7130j94976j3924N00326n4626k56062
19150A13241p1283K8924J45347J50156M20799l1882j44759L12223L57543L08974
19140A589283J4492k41345k37733j9365J15749L09934J68086K04851J16976O1502
19130B082430o780N29084M96048k7232k04323m68231m40470j46127m50033k07172
19120A157194q464m9425J91637J59699J31289J38843R897j04188p899p9947r621
19109A529015J2994l8159k4978K1433m5902j37803k57057P3431M0080M62169L74259
$$ plain form
19182 839990 553986 496785 392042 567062 797661 813302 668356 736876 965318 939036
19172 939036 671090 799896 706209 613771 578509 385776 471049 434148 296133 287026 455667
19161 455667 368815 454859 412567 188569 189633 132503 -62473 -76397 423929 369303 113241
19150 113241 41958 70882 216229 366385 787184 755302 610543 922766 1280309 1589283
19140 1589283 1603775 1362430 1124697 1105332 1221081 1531015 1699101 1903952 2020928 2082430
19130 2082430 2075650 2604734 3100782 3073550 2869227 2400996 1960526 1814399 1364366 1157194
19120 1157194 1148730 1099305 1290942 1450641 1581930 1720773 1730670 1626482 1618583 1538636 1529015
19109 1529015 1542009 1503850 1478872 1500305 1454403 1316600 1059543 1132974 1173054 1635223 2009482
19098B009482K41328P4543K89762K79849J07478J83180K14470K76441J20372J56478
19088C953383L09140O95837P90412O63986O49145J089909J150947M99484L54483
19079A0156726N72861Q08644J425471J577539J359971J848373K735311M237856
19071B4722752O844293J0085412J1359844N672544l559117o096708k996667J056845
19063D7089198M525646Q539381J4095674K2495393L8293627O2265651Q0227085
19056B77531655N1299048r969088l8695258l9314200m5533772n1154914m1763297
19049A02400174k6165352j3403078l764142L902973J1572922J6251135R769183
19042A00563815q041435k0707151k0448612j3802065q350529n268183l726888
$$ plain form
19098 2009482 2250810 2325353 2615115 2894964 3002442 3185622 3400092 3676533 3796905 3953383
19088 3953383 4262523 4958360 5748772 6412758 7061903 8151812 9302759 9802243 10156726
19079 10156726 10729587 11538231 12963702 14541241 15901212 17749585 20484896 24722752
19071 24722752 31567045 41652457 53012301 58684845 55125728 49029020 46032353 47089198
19063 47089198 51614844 60154225 74249899 96745292 135038919 197304570 277531655
19056 277531655 328830703 318861615 280166357 240852157 195318385 144163471 102400174
19049 102400174 76234822 62831744 59067602 62970575 74543497 90794632 100563815
19042 100563815 92522380 71815229 51366617 37564552 29214023 23945840 20218952
19035B0218952k648422j847493q55234K17598O61828J020204P78075J95948k81744
19026A7459712l61055J42386L88109J101170J488390J191517J145617K378817
19018B4934663M406614O489350J0294349J6290999K0526885J4918670j317480
19011I6544050j3117610j2838058n402840K368087J0954560K1431142L3651534
19004A33590865L7199420K6408039K1581959L0189950J1780501l9340642o6560600
18997A54849492n5821898l4061462j8949785j1025548o237168l581297p09108
18990B4463226K245039M641309M627208k31675o011287p678968o219374m039416
18982A1796062k343512j129477p01278m68230l20656l24410n22771o5539L9192
$$ plain form
19035 20218952 17570530 15723037 14867803 15085401 15747229 16767433 17545508 17741456 17459712
19026 17459712 17098657 17241043 17629152 18730322 20218712 21410229 22555846 24934663
19018 24934663 29341277 35830627 46124976 62415975 82942860 97861530 96544050
19011 96544050 83426440 70588382 65185542 67553629 78508189 99939331 133590865
19004 133590865 170790285 197198324 218780283 248970233 260750734 221410092 154849492
18997 154849492 99027594 64966132 46016347 34990799 28753631 25172334 24463226
18990 24463226 26708265 31349574 35976782 35745107 29733820 22054852 15835478 11796062
18982 11796062 9452550 8323073 7621795 7153565 6832909 6508499 5985728 5920189 5959381
18973E959381M9356K2635M83290P25384N20939j51389n14073p33038o67402o35590
18963E059493n29093q28289n76739m82627k11230L1007N49779M60380o7255j57840
18953C247586j10702P4829N7986p8514n72603n04634M2412J64985J96488Q4774
18943B602607O0000j29695k77120k59729k38957k44633P0162P0566l64652j94660
18933A093889O9401J93849J8188m1176j2660K63229K02766P4300j05073n1308
18923A705405k7129J88571K39723L56204L06678M12873O76996P23915Q15915M90368
18913E889519j54500q71066p54919m71421m61344p62517o85036l88905R699N7209
18903A406719K05525J19183n9975k5889k7358k6218K10834N408k37689l00353
$$ plain form
18973 5959381 6008737 6031372 6514662 7240046 7760985 7609596 7095523 6362485 5695083 5059493
18963 5059493 4530400 3702111 3125372 2642745 2431515 2462522 3012301 3472681 3405426 3247586
18953 3247586 3136884 3211713 3269699 3191185 2618582 2113948 2156360 2321345 2517833 2602607
18943 2602607 2662607 2532912 2255792 1996063 1757106 1512473 1582635 1653201 1288549 1093889
18933 1093889 1163290 1357139 1375327 1334151 1321491 1584720 1787486 1861786 1756713 1705405
18923 1705405 1678276 1866847 2106570 2462774 2769452 3182325 3859321 4583236 5399151 5889519
18913 5889519 5735019 4863953 4109034 3637613 3176269 2413752 1728716 1339811 1349510 1406719
18903 1406719 1612244 1731427 1671452 1645563 1618205 1591987 1802821 1808229 1570540 1270187
18893A270187j62979j39910n050P912l1883J56965j72030k53354J64243K84823
18883A118924j00624l06152p3546K07699J94944k84168k00311J87629p2142k30688
18873D41565n30218L787R1888Q6795J79581Q6188j05381j12625L86321K14903
18863G42804k18988j62422j92491J57087j23965p3066j46490l02854l3343J43648
18853b10080j8822J58771L86057Q280j56827P97n9196K68002m1977k41872k5501
18842F7632j69320j76062q6713J59406J73704J39648L807P9869j05735N6277j29164
18831A3349k22309l1835L10690Q6721q992M0021p6276O5190J28145K4988j19754
18820B09938R6355L99183J51254l94323l7631O7411Q7887r3148k02386j215J58006
$$ plain form
18893 1270187 1107208 967298 962248 970160 938277 1095242 923212 669858 834101 1118924
18883 1118924 1018300 712148 638602 846301 1041245 757077 556766 744395 672253 441565
18873 441565 -88653 -84866 7022 93817 273398 359586 254205 141580 527901 742804
18863 742804 523816 361394 168903 325990 202025 128959 -17531 -320385 -353728 -210080
18853 -210080 -228902 -70131 315926 324206 167379 168176 108980 376982 335005 93133 67632
18842 67632 -101688 -277750 -364463 -205057 -31353 108295 112102 191971 86236 142513 13349
18831 13349 -208960 -240795 69895 156616 147624 187645 111369 176559 304704 329692 209938
18820 209938 306293 705476 856730 462407 424776 492187 580074 486926 284540 283325 441331
18809D41331K7520k13968K84411L40825j98821o3400l6342j50857j10899l87324
18799f7524p5160O2225j9339K19501M22223L37835k70401k48238k87568O0328
18789A33882J50474j26140l94017k53265O3428L85766J54431M479r211L68078
18779D77905R4151k36437k30355j43981J3482J13762K71208K02164R4200L33602
18769I89701M09318O19139O68449k16332r13329p54662n47859l34818j19250O6635
18759a33008r0672O2851J13407O3223J49566k24253L20330L12607l11159k09486
18749E3406J19264o1k1546l4504J03987O9763k51892m00042r4131K38377K37851
18738B0472K13144n8547R5798K04353j17655J24839k13820l72043r6330J88398
$$ plain form
18809 441331 468851 254883 539294 880119 681298 617898 581556 430699 319800 -67524
18799 -67524 -142684 -80459 -99798 119703 541926 879761 609360 361122 73554 133882
18789 133882 284356 158216 -235801 -489066 -425638 -39872 114559 119038 109827 477905
18779 477905 572056 335619 105264 -38717 -25235 88527 359735 561899 656099 989701
18769 989701 1399019 2018158 2686607 2470275 1556946 802284 254425 -80393 -199643 -133008
18759 -133008 -223680 -160829 -47422 15801 165367 -58886 261444 574051 262892 53406
18749 53406 172670 172609 151063 116559 220546 290309 38417 -361625 -455756 -217379 20472
18738 20472 233616 175069 270867 475220 357565 482404 268584 -103459 -199789 -11391
18728a1391O128r9545J5327J3637O2359j45077m03463J03018K50807o9388M4890
18717b32698J84579J66867R4989Q4303k91759j7874j10013O7992k1604L3360O1252
18706A9394m06577j21320L07797K21074j05303J29152l7853J67835q154j79532
18696a3487k08694j4274J35067M4770J55484j47094k38382J2150j21916R6065
18686c00311O4701j41958K14543O4539M6438j73832o172J33363J17220j39969
18676a21438p2953K12421m6832Q3672J12773P6752Q3585l69647k506J12883J47757
18665B16467q423k9668n4587L0125j36444n5434j5287j28510M3225J20016J34
18654a8386k5752N2982j9730N6162J65923j09773N8740p5096P3965M6334J41507
$$ plain form
18728 -11391 -5263 -104808 -89481 -75844 -13485 -158562 -562025 -459007 -208200 -277588 -232698
18717 -232698 -48119 118748 213737 298040 6281 -11593 -121606 -53614 -75218 -41858 19394
18706 19394 -387183 -508503 -200706 20368 -84935 44217 6364 174199 166045 -13487
18696 -13487 -222181 -236455 -101388 -56618 98866 -48228 -286610 -274460 -396376 -300311
18686 -300311 -235610 -377568 -163025 -98486 -52048 -225880 -232052 -98689 18531 -121438
18676 -121438 -194391 18030 -28802 54870 167643 244395 327980 -41667 -44173 68710 216467
18665 216467 208044 178376 123789 153914 17470 -37964 -53251 -181761 -138536 -18520 -18386
18654 -18386 -44138 8844 -10886 45276 211199 101426 160166 85070 159035 205369 346876
18643C46876J01757l32579j44305m8841p5171j91713j75244R664J07842L00480
18633a01234J12376p3871J89196j7419m21592j47165K68791J79336m5308o1108
18623a17998j12904l9691p3842J84123J11203K42198j49187q6197K56314K05352
18613D19371j25914l80626j66144o5407j36312L01148L12597K4606j00421k77190
18603a94292k71149L87631J57763k23915J06961Q8640j85775j44680r8241r0719
18593d67776K29052M8309j03666J85188K16689M06851K1358j61257o4298j69075
18583A41375o08122k71256J67064J34844m2875L68943J00974J79392J43027O4836
18573C78202l37531j70953K93567J04808k5256m5221p5768m8956K04944K66037
$$ plain form
18643 346876 448633 116054 -28251 -77092 -152263 -343976 -519220 -509556 -401714 -101234
18633 -101234 11142 -62729 126467 109048 -312544 -459709 -190918 -11582 -56890 -117998
18623 -117998 -230902 -270593 -344435 -160312 -49109 193089 43902 -42295 214019 419371
18613 419371 293457 -87169 -253313 -318720 -455032 -153884 158713 183319 82898 -194292
18603 -194292 -465441 -77810 79953 -143962 -37001 51639 -134136 -278816 -377057 -467776
18593 -467776 -238724 -190415 -294081 -108893 107796 514647 536005 374748 310450 141375
18583 141375 -466747 -738003 -570939 -436095 -478970 -110027 -9053 170339 313366 378202
18573 378202 40671 -130282 163285 268093 242837 197616 121848 72892 277836 543873
18563E43873j83158j66867O1428J27876O3194l1198k36128j98775l5382J63307
18553A08170K57351l8599k77665p3309L02508J85889J37098j53355J77131J72023
18543G97242O6129j08409k87963J66378J0806j10612k6721L09596L62889K53170
18533A432505j04491m5793o1047o5209J09000J49682m71448n03140k21220R7881
18523C16720P6105M6672p9551r8490J81835k52794M0270J67898k33055k08451
18513d2841J49595L16124J89780K09454k94441o40645j93353J29538K32063J80922
18503B36196j71954p1938j02124K30501L32834J38037k1213J48944J40415j18692
18493G41006l86754j16820K73526K55464K16265j4521K66381M91919o8873j43158
$$ plain form
18563 543873 360715 193848 255276 383152 446346 415148 179020 -19755 -55137 108170
18553 108170 365521 326922 49257 -24052 278456 464345 601443 448088 625219 797242
18543 797242 863371 754962 466999 633377 644183 533571 506850 816446 1179335 1432505
18533 1432505 1328014 1282221 1221174 1155965 1264965 1414647 943199 440059 218839 316720
18523 316720 392825 439497 359946 261456 443291 190497 230767 398665 165610 -42841
18513 -42841 106754 422878 612658 822112 527671 -112974 -306327 -176789 55274 236196
18503 236196 64242 -7696 -109820 120681 453515 591552 570339 719283 859698 741006
18493 741006 354252 237432 510958 766422 982687 968166 1234547 1726466 1657593 1514435
18483A514435q6423j35335m65673k29530m5010j91739R8296K64215L33258J74582
18473A231076L19279P5968P5208m36266m60300m46590l4580k73177J62701M202
18463B17521K92953J81841j01041p8227L82007O8741l06196K55290O40621L49707
18453A903217m4901k38977m17205n18395j18800J44786P6469l8690j38708o3171
18443E45625n1253Q9193J16285l07729k84659K49544J24956r4783j52050J7819
18433B52948K17764J63438N7777J3742J6547l8295o900l576L750J61938R5174
18422I34307K18561L57857J31533J8136m94176l27390N2861Q7854l4005l6734
18412I08804k72782l86961j08950K49831K68137L58083J51696j78876k83600l13204
$$ plain form
18483 1514435 1428012 1292677 827004 597474 552464 360725 459021 723236 1056494 1231076
18473 1231076 1550355 1626323 1701531 1265265 804965 358375 323795 50618 213319 217521
18463 217521 510474 692315 591274 513047 895054 963795 657599 912889 1553510 1903217
18453 1903217 1858316 1619339 1202134 683739 564939 709725 786194 747504 608796 545625
18443 545625 494372 583565 699850 392121 107462 357006 481962 387179 235129 252948
18433 252948 470712 634150 691927 705669 722216 683921 677021 673445 677195 839133 934307
18422 934307 1152868 1510725 1642258 1660394 1166218 838828 891689 979543 945538 908804
18412 908804 636022 249061 140111 389942 658079 1016162 1167858 988982 705382 392178
18402C92178J6940L83339j17943Q5540k0763k71921j97755K05115K86094K58993
18392A019817N03263L00173J43858J76673J33726R0633l78386l38142k66465o0642
18382A324508j5837K46806J30356J458j04262j22859J30839K86031K22595L34591
18372B434226L14952J76240M95633L87344K65928K95405L91150O59220Q47949
18363F268047J571512J605329J539835J601993J464453K070745L325847M278113
18355B3725874M777660O121133Q367654J3499186K3895333M3059165O5405348
18348A88851353N2805139j4766777o5109766o2591760l8521325k0624170j1745275
18341B8297419o997866m691710l027189j740542q68556m06151j99551M34262N29653
$$ plain form
18402 392178 409118 792457 674514 760054 739291 467370 269615 474730 760824 1019817
18392 1019817 1523080 1823253 1967111 2143784 2277510 2368143 1989757 1651615 1385150 1324508
18382 1324508 1308671 1555477 1685833 1687291 1583029 1460170 1591009 1877040 2099635 2434226
18372 2434226 2749178 2925418 3421051 3808395 4074323 4369728 4760878 5420098 6268047
18363 6268047 7839559 9444888 10984723 12586716 14051169 16121914 19447761 23725874
18355 23725874 28503534 34624667 42992321 56491507 80386840 123446005 188851353
18348 188851353 241656492 226889715 161779949 99188189 60666864 40042694 28297419
18341 28297419 21299553 16607843 13580654 11840112 10971556 10565405 10365854 10800116 11329769
18332A1329769p329k85438L41101J086159J535392J261978J438659J616197K241689
18323B0558177L513301M344988N151221P182656J1169829J8487784L2084537N5294049
18315A57786542P6623461M4944964l5659153p8096220o5265134l8203398k0865133
18308D1265929j2513039p860349n039097l053004j729737j388152q48992n71380
18300H262179l57113l15168j038707j138839j098105p80922k90046L46729L59873
18291C949881J65909J37439K41499P81502M28287n64183j204119j037284n49549
18282B349382j94662j00481r9743l2948L81019L98498J90698L4850j5772l17021
18272B593820m79132k63264l31200k53687j53059q4871L36108J06292J235K2157
$$ plain form
18332 11329769 11322440 11037002 11378103 12464262 13999654 15261632 16700291 18316488 20558177
18323 20558177 24071478 28416466 33567687 40750343 51920172 70407956 102492493 157786542
18315 157786542 234410003 279354967 243695814 165599594 100334460 62131062 41265929
18308 41265929 28752890 20892541 15853444 12800440 11070703 9682551 8833559 8262179
18300 8262179 7905066 7589898 6551191 5412352 4314247 3533325 3243279 3590008 3949881
18291 3949881 4115790 4253229 4494728 5276230 5704517 5140334 3936215 2898931 2349382
18282 2349382 2154720 2054239 1954496 1921548 2302567 2701065 2891763 2926613 2910841 2593820
18272 2593820 2114688 1851424 1520224 1266537 1113478 1028607 1364715 1471007 1472242 1494399
18262A494399j3296O8927J74758K94566J41450M60637L74912P47254J308779M81994
18252E534380j008134j569974j000130n86939m59298l9358j33771J56637j05837
18243G87576k06501P6910p0263J81260K08035J0070O2964L05126m63342m06012
18233D85823n0749R4187L4296j61325q6141J54484K41026N4732r332K2227K6951
18222H06179m011l94092k39466j287k37889j41326J67045K00048J51729J72840
18212D79770M9514J84467j35802k44691q7617N2338r173j51103o7839K90375J09861
18201D70100m6298M9311K07812L20265k40036l37033j9960l2064K68328J02067
18191G42492j7135j92649q1640K85367J5823j30527k4771k35177J59667o4586
$$ plain form
18262 1494399 1481103 1550030 1724788 2019354 2160804 2621441 2996353 3743607 5052386 5534380
18252 5534380 4526246 2956272 1956142 1369203 909905 870547 736776 893413 787576
18243 787576 581075 657985 587722 768982 977017 987087 1050051 1355177 891835 485823
18233 485823 435074 529261 563557 402232 316091 470575 711601 766333 757001 779228 806179
18222 806179 802168 408076 168610 167323 -70566 -211892 -44847 155201 306930 479770
18212 479770 529284 713751 577949 333258 245641 297979 288806 137703 69864 360239 470100
18201 470100 423802 473113 680925 1001190 761154 424121 404161 372097 640425 742492
18191 742492 725357 532708 451068 736435 752258 621731 596960 361783 521450 456864
18181D56864k01484N1599m0162o8761l42322J72008J50120j40310o3720K98266
18171B72098L01753J71699K87557k50793j99471J1022Q6449K52782M38791O50440
18161B022327M26861j14118n16710l98723k18763k60538j39621J95730k08876
18152G87569O3976M02544J92125j67969J71810J14151n1287J86047K65902k63642
18142A701226j81520K78787K90485L11118K56326O87108K29420j2389L68904L70462
18132D299927P12245M60481N07582J115978J675029J537825J080212J157501R58686
18123A3505466J920253L483311L696854L382156L734256N886678P630883R135734
18115E2375591J2051263J7513333K8602495N0515432R0513265J44883753J33830057
$$ plain form
18181 456864 255380 306979 266817 198056 -144266 27742 177862 37552 -26168 272098
18171 272098 573851 745550 1033107 782314 582843 593865 680314 933096 1371887 2022327
18161 2022327 2449188 2335070 1818360 1419637 1200874 940336 800715 996445 787569
18152 787569 851545 1254089 1446214 1278245 1450055 1564206 1512919 1698966 1964868 1701226
18142 1701226 1519706 1798493 2088978 2400096 2656422 3343530 3572950 3560561 3929465 4299927
18132 4299927 5012172 5472653 5980235 7096213 8771242 10309067 11389279 12546780 13505466
18123 13505466 15425719 18909030 22605884 25988040 29722296 35608974 43239857 52375591
18115 52375591 64426854 81940187 110542682 161058114 251571379 396455132 530285189
18108E30285189j6191213j44618587j46734546r1705987m8715464k6831884j5776007
18101C9711501j0130168o767673m644820l519123k415446k113744j613606q65391
18093G641530p80730p37894q94980o18345l57450j2871K40645l33602n04064l69089
18083C273150r5876p4408j55352k11145j66786j15581m16318k36271j78690j03083
18073A519640J84926r8722o0368J14992Q0160p3353k69102k69484j14581k2072
18063I92036J19375j8653k68734j65017L9444R9486k7403N7250j03271N9068J23089
18052I06670j12915o3998R3489K67493o4815L2917j833o5668j99280k70027r9613
18041D22420k05027k11806L18075M98289k9107K354K1836J22853j96128p048Q117
$$ plain form
18108 530285189 514093976 369475389 222740843 131034856 82319392 55487508 39711501
18101 39711501 29581333 22813660 18168840 14649717 12234271 10120527 8506921 7641530
18093 7641530 6860800 6122906 5227926 4609581 4252131 4239260 4479905 4146303 3642239 3273150
18083 3273150 3177274 3102866 2947514 2736369 2569583 2454002 2037684 1801413 1622723 1519640
18073 1519640 1704566 1605844 1545476 1660468 1740628 1667275 1398173 1128689 1014108 992036
18063 992036 1111411 1092758 824024 659007 698451 797937 770534 827784 724513 783581 906670
18052 906670 793755 729757 823246 1090739 1025924 1058841 1057008 991340 792060 522033 422420
18041 422420 217393 5587 323662 821951 792844 795198 817034 939887 743759 736711 744828
18030G44828l60519l37528J91781K43909N9541M8646j91904j44016J34737L98160
18020G87635l29592m03987J8663O9668Q2014N5620K61308K35154L7015r7630j19102
18009E96766J5571J33139k08507K0347k94822p6388K36151J23564K440K6622m9579
17998E25304J25845j14504k23793J43887J16577j44089L29814m9759k37174m5182
17988D26926J57386l7898j39337n9896r4616k7970K41703O8028k56135J11777
17978C89968l7204l00665Q0796J00375K6101l04500k66773M9355J48450J73236
17968E9139J31989J1985L706k7402k27394j17297k4398l8164j65348J97399K3491
17957a72294K24151K64268n7880j07525o3395K15728j03728P4533q3036J00538
$$ plain form
18030 744828 384309 46781 238562 482471 542012 590658 398754 254738 389475 787635
18020 787635 458043 54056 72719 142387 224401 280021 541329 776483 813498 715868 596766
18009 596766 612337 745476 536969 557316 262494 186106 422257 545821 548261 574883 525304
17998 525304 651149 536645 312852 456739 573316 429227 759041 709282 472108 426926
17988 426926 584312 546414 407077 347181 252565 224595 466298 534326 278191 389968
17978 389968 352764 52099 132895 233270 259371 -45129 -311902 -262547 -114097 59139
17968 59139 191128 203113 206819 179417 -47977 -165274 -189672 -227836 -393184 -195785 -172294
17957 -172294 51857 316125 258245 150720 87325 303053 199325 273858 190822 291360
17947B91360j32310K32680K37114K30661J87326k90004k74424K12400N5796J47119
17937H97718J47963O9789L27927J13166L4229J73859k08739p0210p50J61830M59784
17926B106566L97360M76144O94994L52922Q3680K44909K22581L01678N87841P58544
17916F227219M96444L48027M61720J086880J890108J992839K083943K457120L665048
17907B0709348M582155N150319O336165R788495J6583451K9424952N1561213P5942793
17899B20078891N7896370k1357317p5685138p0424647m2970738k3300327j2936965
17892C1300129p369302m431733k654399k525215k192034j793321q50621j72839
17884I310665K97278M95426L82136K43163L08482O95928J572983J849667K000141
$$ plain form
17947 291360 159050 391730 628844 859505 1046831 756827 482403 694803 750599 897718
17937 897718 1045681 1115470 1443397 1556563 1590792 1764651 1555912 1485702 1484952 1646782 2106566
17926 2106566 2503926 2980070 3675064 4027986 4111666 4356575 4579156 4880834 5468675 6227219
17916 6227219 6723663 7071690 7533410 8620290 10510398 12503237 14587180 17044300 20709348
17907 20709348 25291503 30441822 36777987 46566482 63149933 92574885 144136098 220078891
17899 220078891 277975261 256617944 180932806 110508159 67537421 44237094 31300129
17892 31300129 23930827 19499094 16844695 14319480 12127446 10334125 9483504 9310665
17884 9310665 9607943 10103369 10485505 10728668 11037150 11733078 13306061 15155728 17155869
17875A7155869K863810L593769M131776N201171P060028J0097966J6007909K7710194
17867I3822492M8484423O6373885L5681951l5656666o9271373n6065718l2185422
17860E1183572j7392428r853671o169237l804364k199904j882170j822952j415460
17852F643386j057139o24109j09918K73410K08999j75581k77095p10776n90668
17843C580509j13809L1801M49969L03385L45545K57474P56988M39219n80914j050415
17833D419752j026322q45175n59671m01891k65913J7147l73306m5042n5766k27551
17823F36262m3261p0315N5803K52212K34451r1172k49331P882R8344J19519J48284
17812A098678K17167O55579P68489K88764k54485p48548n03207r2809j75152m05749
$$ plain form
17875 17155869 20019679 23613448 27745224 32946395 40006423 50104389 66112298 93822492
17867 93822492 142306915 208680800 244362751 208706085 139434712 83368994 51183572
17860 51183572 33791144 23937473 17768236 13963872 11763968 9881798 8058846 6643386
17852 6643386 5586247 4962138 4852220 5125630 5334629 5159048 4881953 4171177 3580509
17843 3580509 3466700 3498501 3948470 4251855 4597400 4854874 5611862 6051081 5470167 4419752
17833 4419752 3393430 2548255 1988584 1586693 1320780 1337927 964621 919579 863813 636262
17823 636262 593001 522686 578489 830701 1065152 973980 724649 732531 830875 950394 1098678
17812 1098678 1315845 1971424 2739913 3028677 2774192 2025644 1522437 1429628 1254476 848727
17802H48727j37687J00673j44977j06276J87554R6963k22522O4181m7470m9169
17792E89997R8630R4919j45053n11883P5835j5421L6637J50299o8911Q0656J14031
17781D99736K68298L35870L37591J10216L48535L85310K82852l00981p87878n34348
17771I45201m64875k31072j29109J61058J95762K64286J35293j36403K64885r2201
17761I12825k61866j37499p6094P3921J4837j42009l5998P1234r2306k60726K6427
17750I2746J61831K6273P345J72339J89232K23183M23744N32796J30444j5537
17740A944396k71288l71684m70099m91982j13707r1774J36209K24013K165l40703
17730A55546j82367j25291n9611L13333Q3439J03097J98481m325p526j74130j26335
$$ plain form
17802 848727 711040 811713 666736 560460 748014 844977 622455 686636 639166 589997
17792 589997 688627 783546 638493 126610 202445 187024 223661 373960 305049 385705 499736
17781 499736 768034 1103904 1441495 1551711 1900246 2285556 2568408 2267427 1479549 945201
17771 945201 480326 249254 120145 281203 476965 741251 876544 740141 1005026 912825
17761 912825 650959 513460 437366 511287 526124 384115 348117 419351 327045 66319 92746
17750 92746 254577 280850 288195 460534 649766 872949 1296693 1829489 1959933 1944396
17740 1944396 1673108 1301424 831325 339343 225636 133862 270071 494084 496249 155546
17730 155546 -26821 -152112 -211723 101610 185049 288146 486627 482302 474776 300646 174311
17719A74311k9481O0961j84274k52184l6203J91856N9343K14303k2004J07566
17709B84194L12255J56530K3431l2844J43837j86995P8498M9800k0374k54880
17699E53452o4451n0969j55045j60364o2586j5808J12125J52471J54505q0939
17689C82391L072j01595k05013N3077l80859l09778O8424J1074J73862k33501
17679e38846j85906K14344K28522K53530L09369j46390m16469K18212J85302k33115
17669a11447p321n4298p1739j56838K22227l2016O115K39818J86362L01472Q809
17658E31144j81882l89122J44367n3781j8012J32473J60011l77240m11169J29929
17648c33282Q7852P4659K19053J66500j98320Q2917k88522j14206j71057k45260
$$ plain form
17719 174311 144830 205791 21517 -230667 -266870 -75014 -15671 198632 176628 284194
17709 284194 596449 752979 776410 743566 887403 700408 778906 828706 808332 553452
17699 553452 489001 438032 282987 122623 60037 44229 156354 308825 463330 382391
17689 382391 385463 283868 78855 131932 -248927 -558705 -490281 -479207 -305345 -538846
17679 -538846 -724752 -510408 -281886 -28356 281013 134623 -281846 -63634 121668 -111447
17669 -111447 -118768 -173066 -244805 -401643 -179416 -211432 -205317 34501 220863 522335 531144
17658 531144 349262 -39860 104507 50726 32714 165187 325198 -52042 -463211 -333282
17648 -333282 -245430 -170771 48282 214782 16462 99379 -189143 -303349 -474406 -719666
17638g19666J7543K38627K31760K98891Q9863J5126j87052J87437J63261K05184
17628E40974j79871j53540j25027q3860j4447J08120J65545R1214J45138k09034
17618B85212j76853l04244J3216J46134J75880r734k10119j0925Q2116J9743K11096
17607B21522Q2589k43902l75361k42047J49540J74823J23208J02846k55449l9040
17597c01271Q1283K79945N1435J10542m0686j6441M3694j08675j68700p9289k13490
17586c61653J94515K87436J72781K4713j07321L3038j75038j1613K4425O4928
17576A46211l15220k68321J5477l22120K09853K56958O921r5176j77055j17129
17566f59601J40846n3159J52556M19520J25865o0357k33384O0225j77992K58058
$$ plain form
17638 -719666 -702123 -463496 -231736 67155 157018 172144 -14908 172529 335790 540974
17628 540974 361103 207563 82536 -1324 -15771 92349 257894 349108 494246 285212
17618 285212 108359 -195885 -182669 -36535 139345 129611 -80508 -91433 -9317 10426 221522
17607 221522 304111 60209 -315152 -557199 -407659 -232836 -109628 -6782 -262231 -301271
17597 -301271 -219988 59957 111392 221934 181248 164807 208501 99826 -68874 -148163 -361653
17586 -361653 -167138 120298 293079 317792 210471 243509 68471 56858 81283 146211
17576 146211 -169009 -437330 -421853 -743973 -534120 -277162 -270241 -365417 -542472 -659601
17566 -659601 -518755 -571914 -419358 162 126027 65670 -167714 -107489 -285481 -27423
17556b7423K46523K63528k12277r5928J64915j17242J97516k06304O3902J98094
17546D75304k22862k26322K3565o4559j62385P8429k50493p4662k0177L26270
17536a17892M0106k16776J75074o1651j02123j74261J44503M4706R0199K47978
17526F9863j79443k32998M7263j74757J3451K14758K94859L1308l55197j69558
17516d40451J59852l5724k81411O924K25082n1309K8848j89640J04286O0207j03304
17505e16640k9247J80915l6576N4284o7214L76816N1905J49828N8363j88294k32814
17494a98674P2706K67271M5471l55298j06876J28845L11156j0805J45979k26507
17484G3268j5668j20997M2667L37777L7919j42816j5787m860j21028j56020l72700
$$ plain form
17556 -27423 219100 482628 270351 174423 339338 222096 419612 213308 277210 475304
17546 475304 252442 26120 49685 -14874 -177259 -98830 -349323 -423985 -444162 -117892
17536 -117892 -77786 -294562 -119488 -181139 -283262 -457523 -313020 -268314 -178115 69863
17526 69863 -109580 -342578 -295315 -470072 -456621 -241863 52996 84304 -270893 -440451
17516 -440451 -280599 -316323 -597734 -590810 -365728 -417037 -388189 -577829 -473543 -413336 -516640
17505 -516640 -545887 -364972 -401548 -347264 -414478 -37662 14243 164071 222434 34140 -198674
17494 -198674 -125968 141303 186774 -168524 -275400 -146555 164601 153796 299775 73268
17484 73268 57600 -63397 -20730 317047 354966 212150 196363 191503 70475 -85545 -458245
17473d58245K00265L45224r5134N7422J00682J87339j65634j86245p5230K27112
17463A37556k56418l18722m5019J41686K30184M06161J3828j66568J18058M26385
17453F87131K56749j86180j29797o6693j6651k09985n17102K59410O55224O81481
17443A413587J030538L24942p31181j059074n40865L63416j36707l26848p7625
17434B60183k50251j90219K9055J83940J33062k40091K46590p0999k07972j11302
17424b18004J52655J22577k86829l01457n8032m9113k0161L85925K55069k80024
17414b97394k1320P6735o7295k65647R333j0476K39632J38081J56984p0354P6352
17403c5369p4337j92894K36490K15734p1040L3226J07621l6986j38799K5285k95152
$$ plain form
17473 -458245 -257980 87244 -7890 49532 150214 337553 171919 -14326 -89556 137556
17463 137556 -118862 -437584 -482603 -340917 -110733 295428 309256 142688 260746 687131
17453 687131 943880 757700 627903 561210 544559 334574 -182528 76882 732106 1413587
17443 1413587 2444125 2769067 2037886 978812 437947 801363 664656 337808 260183
17434 260183 9932 -180287 -151232 32708 165770 -74321 172269 101270 -106702 -218004
17424 -218004 -65349 57228 -229601 -531058 -589090 -638203 -658364 -272439 -17370 -297394
17414 -297394 -318714 -241979 -309274 -574921 -565588 -576064 -336432 -198351 -41367 -111721 -35369
17403 -35369 -109706 -302600 -66110 149624 78584 111810 219431 182445 43646 68931 -226221
17392b26221k47985K43943K67337j42709j22474R020L8808N0157j01160J92243
17382c9041K44580j58312j80628r3281J24390K9511q8052L9675N21185J23787
17372E23814k03209k70474M0943M039j1100p7632j85167J15800r7236R0059j1161
17361h1324K1475K75738K64256N5646j52663j6535j78232k33392k6859M6122K19173
17350A93405J55003r9522p9281Q7763M6799R0527J80033m8356L02851k9467k59869
17339E39886l74349k22274r9494n7228o9924J42908j5503r0624Q2622Q5802k6350
17328a04528j45298L6370J41823n7277Q6424J48197O02j4668j10874k35580r9164
17317c53973R5222m03J42494R7439j72546K14086K17199L33922L00421L83819
$$ plain form
17392 -226221 -474206 -230263 37074 -105635 -228109 -219089 -180281 -130124 -231284 -39041
17382 -39041 205539 47227 -133401 -226682 -102292 -72781 -160833 -121158 400027 523814
17372 523814 320605 50131 91074 95113 84013 6381 -178786 -62986 -160222 -70163 -81324
17361 -81324 -59849 215889 480145 535791 383128 366593 188361 -45031 -71890 -25768 193405
17350 193405 348408 248886 169605 257368 304167 394694 574727 526371 829222 799755 539886
17339 539886 165537 -56737 -156231 -213459 -283383 -140475 -155978 -246602 -163980 -78178 -104528
17328 -104528 -249826 -213456 -71633 -128910 -42486 105711 106313 91645 -19229 -254809 -353973
17317 -353973 -258751 -259154 -116660 -19221 -191767 22319 239518 573440 873861 1257680
17307A257680L58556j64947o38399k67803J34270K26338k04298o3584k80005j82535
17297A75273j0496J62565J40521j00773j38256n7745l0213J28585j2455j39332
17287A17674n9915K5327k76636K9975J9177K5372l66301n1228P3395J26915o083
17276c42328Q8330K12365L27466O1436k62687j57793L0739n0366m7222K6882m9929
17265a63107J35994J25210j15488n8915m9655r848j15710J20527j58640L053K07312
17254g9267J05830O2614n5898j53700r8930J81405J63377m2776k22373k21973
17244c61691j78734J85269j2491N2246J89351r7163j87449q6379J4260j82721
17234f65502K61505K00028L3257P181j03645k24592J59864j09771N1895K12644
$$ plain form
17307 1257680 1616236 1451289 812890 545087 679357 905695 701397 637813 357808 175273
17297 175273 164777 327342 467863 367090 228834 171089 140876 269461 257006 117674
17287 117674 57759 83086 -193550 -163575 -144398 -119026 -485327 -536555 -463160 -336245 -342328
17276 -342328 -253998 -41633 285833 347269 84582 -73211 -42472 -92838 -140060 -113178 -163107
17265 -163107 -27113 98097 -17391 -76306 -125961 -135809 -251519 -130992 -289632 -286579 -79267
17254 -79267 26563 89177 33279 -120421 -219351 -37946 125431 82655 -139718 -361691
17244 -361691 -540425 -355156 -367647 -315401 -126050 -223213 -410662 -497041 -482781 -665502
17234 -665502 -403997 -203969 -170712 -163531 -267176 -491768 -331904 -441675 -389780 -177136
17224a77136P628P1505k2686m1963r9307J42463R2988R3880j02962k10641k07836
17213d54067K625Q2593O6598k6601R2514J04436j19261l7391L38914J54693J4370
17202B19423j16513N3296P0291j94097l1084k28258k73693N7341M29407O7619
17192E3732k06829k30497m0278J58494K05370p6128j46809J5810M43527K8786
17182B05178O2764m83809j34184K96362J35372R3088Q2882R341j9215k70832n3673
17171g6726j47593p5825J05255R3502j10018o6017J93231J78858r4004n3658j03118
17160a56113q0105l13656m5185O6120J99687J9275l27954N4499K24125J1724Q6421
17149b61162j64009L9516J48803k2208j45991m8184j09899J00884K62778R1438
$$ plain form
17224 -177136 -169508 -98003 -120689 -162652 -261959 -119496 -26508 67372 -35590 -246231 -454067
17213 -454067 -451442 -368849 -302251 -328852 -236338 -131902 -251163 -288554 50360 205053 219423
17202 219423 102910 156206 226497 32400 1316 -226942 -500635 -443294 -13887 53732
17192 53732 -153097 -383594 -423872 -265378 -60008 -136136 -282945 -267135 176392 205178
17182 205178 267942 -215867 -350051 -53689 81683 174771 257653 266994 247779 -23053 -76726
17171 -76726 -224319 -300144 -194889 -101387 -211405 -277422 -84191 94667 663 -52995 -156113
17160 -156113 -236218 -549874 -595059 -528939 -329252 -309977 -637931 -583432 -359307 -347583 -261162
17149 -261162 -425171 -385655 -236852 -259060 -405051 -453235 -563134 -462250 -199472 -108034
17139a08034n7564K59405N5997j70829j99852M0304j04619J94652K81635Q0320
17129B71415j26089l48793j63533R8617R328j52371j60654J92377N11168P7523
17119B08988l06328k19182r2625o461j2017K76658J73307J27008n0236j27095
17109b7983j41669k36726J46841K20195O8066k0537j61404P9465R2932j15667
17099i6487J44208o7950p9693J09407N1655q797L900n6575O3954j21455j65558
17088b23391l09602J93327j07756q4443Q9593R182J40110R4188R1622J75153P1755
17077A39738j11245j35478o0364L3686K6068N3224j15951k72867k56911P7358
17067f22742m9647J89042R1181M323J05940K03082Q105R2424j97786j94432l5700
$$ plain form
17139 -108034 -165598 93807 149804 -21025 -220877 -180573 -285192 -90540 191095 271415
17129 271415 145326 -203467 -367000 -268383 -259055 -411426 -572080 -379703 131465 208988
17119 208988 -97340 -316522 -409147 -415608 -427625 -150967 22340 149348 99112 -27983
17109 -27983 -169652 -406378 -259537 -39342 28724 8187 -153217 -73752 19180 -96487
17099 -96487 47721 -20229 -99922 9485 61140 52343 56243 -332 63622 -57833 -223391
17088 -223391 -532993 -339666 -447422 -531865 -442272 -433090 -292980 -198792 -107170 67983 139738
17077 139738 28493 -106985 -167349 -133663 -107595 -54371 -170322 -443189 -700100 -622742
17067 -622742 -672389 -483347 -392166 -387843 -281903 -78821 -70716 21708 -176078 -370510 -406210
17056d06210K27980J69847J16307K0765l34069J62753k10219J54157l367k8244
17046a30300P4827K32414j46987j37311l08146J10925L56933K07566l98028R45
17036a37162R0207Q1405r9515m8513N3510Q0393j12253j49084R2005J97339N6164
17025A04496j81220K10951K33274M7829p2047L3954l86418k8157j11434j15656
17015b64428Q2478k7702k27081K76161J26876l92239R5473N5595k00726K6575
17005d49018P6241k4306K38366K32988L26471R3057l19613j30547P7007L04284
16995D24930K57943j02688m49954j90871j31715J60794J34052L4691J48222k2258
16985B63146J74742j32382l84376k16973l6976L53923J02020j06846k84345J1911
$$ plain form
17056 -406210 -178230 -8383 107924 128689 -205380 -42627 -252846 -98689 -102056 -130300
17046 -130300 -55473 176941 29954 -107357 -415503 -304578 52355 259921 -138107 -137162
17036 -137162 -46955 34450 -65065 -113578 -60068 20325 -91928 -241012 -149007 48332 104496
17025 104496 -76724 134227 367501 415330 343283 377237 -9181 -37338 -148772 -264428
17015 -264428 -181950 -209652 -436733 -160572 -33696 -425935 -330462 -274867 -475593 -449018
17005 -449018 -372777 -397083 -158717 74271 400742 493799 174186 43639 120646 424930
16995 424930 682873 580185 130231 -60640 -192355 -31561 102491 137182 285404 263146
16985 263146 437888 305506 -78870 -295843 -332819 21104 123124 16278 -268067 -256156
16975b56156L7048j35636m05300j33851K05941K58687L36610J44027j3131k47811
16965b09572q9868K67228K47022p9607k36135k84729k28333J78928L9178J47603
16955b48285R0390Q6741k6618p1183j0938N9014l29058l11228J44864N63210J79901
16944A26810k02725l00214j91836j30251n8639K25096K29911K68282n8406J68522
16934G6550N8106j73355l44978O6288J05607K5596M817R5104K58187K2874j2793
16923A82003j52493j45954r3451J43915L4586j21745l1656K9788J44988p3293
16913h3312O1883J08882k69326l57977J58136J5383j51564j20390K64282L87429
16903A3426J1676j06083Q812M6575k49097j46526J30381Q9004M6283K0431k7417
$$ plain form
16975 -256156 -219108 -354744 -760044 -893895 -687954 -429267 -92657 51370 38239 -209572
16965 -209572 -299440 -32212 214810 135203 -100932 -385661 -613994 -435066 -395888 -248285
16955 -248285 -157895 -71154 -97772 -168955 -179893 -120879 -449937 -761165 -616301 -53091 126810
16944 126810 -75915 -376129 -567965 -698216 -756855 -531759 -301848 -33566 -91972 76550
16934 76550 134656 -38699 -383677 -317389 -211782 -186186 -181369 -86265 171922 194796 182003
16923 182003 29510 -116444 -209895 -65980 -31394 -153139 -184795 -155007 -10019 -83312
16913 -83312 -21429 87453 -181873 -539850 -381714 -366331 -517895 -638285 -374003 13426
16903 13426 25102 -80981 -72169 -25594 -274691 -421217 -290836 -201832 -155549 -135118 -162535
16892a62535J61504K84811j48943j28961j25174j64094q0064r9846R1570J61298
16882b10434J65193j01125o915j21323k0761k54044K46246J86465J09499M3693
16872C6494k0455N9283p5492p5923L07184j05335j70369m38396J01474K5796k57842
16861f13581R4281k7909m5886J31720K68134N32131j76067k15439j81164l92266
16851f26046p2449K95577m2607L2681K79807J08332k73479j30166J73923q8307
16841c42734K09653J79463j83946j45862j61925N6567L59466L7786J8141l4452
16831g843l42363N9670k34640l07986J55634L00366J62740m0043j30351J65196
16821b19620J60646j5452j44905j06511L06559R219m7322n0652j19310J265m6687
$$ plain form
16892 -162535 -1031 283780 134837 5876 -119298 -283392 -363456 -463302 -371732 -210434
16882 -210434 -45241 -146366 -153281 -274604 -295365 -549409 -303163 -116698 -7199 36494
16872 36494 16039 75322 -170 -76093 231091 125756 -44613 -483009 -381535 -355739 -613581
16861 -613581 -519300 -547209 -593095 -461375 -193241 338890 162823 -52616 -233780 -626046
16851 -626046 -698495 -402918 -445525 -412844 -133037 -24705 -298184 -428350 -254427 -342734
16841 -342734 -133081 46382 -137564 -283426 -445351 -388784 -29318 8468 26609 -7843
16831 -7843 -350206 -290536 -525176 -833162 -677528 -377162 -214422 -254465 -384816 -219620
16821 -219620 -58974 -74426 -219331 -325842 -19283 -10064 -57386 -108038 -227348 -226083 -272770
16810b72770L02975K1660R6362M5826j82410p4547J36091Q623K13017l5986N1231
16799C10072J66131k55318n736o7921k33286q7885l93547J27852K08944J30154
16789a00540J74241J04262j7627Q040j39606O5885M6922k26694J11681J90902
16779B17466j66350l04382J25471J10514k9604J21119N1522J50273j31244k41953
16769i7168r5419k23799j19762J44736K14065k26464o0270J57543K41171J48251
16759H2884J69366k93070j74059M7276p6158M3733j68271Q1283J44526K66717
16749A24227K3381P8821j63044j38624q8609j17205L8086J80255k8241J49758
16739E8805J15700L32891J79272k29949j72124n45820k44170K45343j72572M6820
$$ plain form
16810 -272770 30205 51865 148227 194053 11643 -62904 73187 81810 294827 258841 310072
16799 310072 476203 220885 215149 147228 -86058 -173943 -567490 -439638 -230694 -100540
16789 -100540 73701 177963 160336 168376 28770 94655 141577 -85117 26564 217466
16779 217466 51116 -253266 -127795 -17281 -46885 74234 125756 276029 144785 -97168
16769 -97168 -192587 -416386 -536148 -391412 -177347 -403811 -464081 -306538 -65367 82884
16759 82884 252250 -40820 -214879 -167603 -243761 -200028 -368299 -287016 -142490 124227
16749 124227 147608 226429 63385 -75239 -163848 -281053 -242967 -62712 -90953 58805
16739 58805 174505 507396 686668 456719 284595 -261225 -505395 -260052 -432624 -385804
16729c85804P7985Q0814J25922L3033N2141j94611j13916k234J0298J56604J19046
16718d0722j40951P5714K04573q5707j52492K43265o6272N4828j09706j07317
16708a24787m6866O3839O2157J00207o7889k97706k08527j34951M7832O9874M17399
16697a19418J43694k1887k29495p9018j07000J42504J93874k55240J07562M05714
16687A81290J60756J53800k05637k61711K14636J45309J21059k22662l50398j86854
16677b50412J74541K48483j43659j93696R0259J59414j59229r240j99420k09099
16667d92058J10055K90770M47334o5722L3104q5216j07603p0803m6629Q4067K17677
16656C14976l8505l92048l80047K2694J10711j3690j25717l8575L47619O7230
$$ plain form
16729 -385804 -307819 -227005 -101083 -68050 -15909 -210520 -324436 -326670 -316372 -159768 -40722
16718 -40722 -181673 -105959 98614 12907 -139585 103680 37408 92236 -17470 -124787
16708 -124787 -171653 -107814 -45657 54550 -13339 -311045 -519572 -654523 -606691 -536817 -119418
16697 -119418 24276 2389 -227106 -306124 -413124 -270620 -76746 -331986 -224424 181290
16687 181290 342046 495846 290209 28498 243134 388443 509502 286840 -63558 -250412
16677 -250412 -75871 172612 28953 -164743 -74484 84930 -74299 -83539 -282959 -492058
16667 -492058 -382003 -91233 356101 290379 323483 238267 130664 59861 13232 97299 314976
16656 314976 276471 -115577 -495624 -472930 -362219 -375909 -501626 -540201 -192582 -125352
16646a25352J40136j06294n3722K584n318l9902L89769R6050k71964j02788N8708
16635a8093m3820K05711l4141K5977k36124K3560j62823k2347J23924K72973L15838
16624D50635R1431j67236q2454j00093Q8298l16447l42560j66434N0J56995R4451
16613b93364j59780L2926J248J36103K18634O5464n4683J843j71217R0654k53518
16602c85690k0971J50745K83872l9169j76881R1840J91411K41180L13672J34086
16592G84095k63000K8024l43310j45298j41288P2040j59208l318l0142j17335
16582c18740n5201J22398K79568n2446M874M1398J40847j71527n1222P6397n151
16571A1195L3897J15524l0720p0116J80500q501k60099N1744M5044M5819M2314
$$ plain form
16646 -125352 14784 -91510 -145232 -142648 -147966 -187868 201901 297951 25987 -76801 -18093
16635 -18093 -61913 143798 109657 135634 -100490 -76930 -239753 -262100 -138176 134797 450635
16624 450635 542066 374830 292376 192283 280581 -35866 -378426 -544860 -544810 -387815 -293364
16613 -293364 -453144 -420218 -418970 -282867 -64233 1231 -53452 -51609 -222826 -132172 -385690
16602 -385690 -406661 -255916 27956 -11213 -188094 -96254 95157 336337 650009 784095
16592 784095 521095 549119 205809 60511 -80777 -8737 -167945 -171263 -201405 -318740
16582 -318740 -373941 -251543 28025 -24421 -19547 21851 162698 -8829 -60051 16346 11195
16571 11195 45092 160616 129896 59780 240280 231779 -28320 23424 68468 114287 156601
16560A56601J04424k64808l42171j13629k60854L36682K49439l4332j21187J79171
16550a10664J28764k3034m27466k78166J39125J18339N7046r9972K80517J21422
16540i4089K7526l5026k17362J07972K02943j39336k32069j49929j08099J22327
16530e15142Q3556j00676p8163J49924L20583P1384j63434J62467J06232r4265
16520e7534K45355o901k5303J64320k18413j92615k59065o5127j08136K89234
16510b34185L77206O9881r4114j2135L6944k33596J6765J52309O8226j61731m54343
16499d68773j20853J64437k14447o8729J57295m1530M8854K81176K07296j47461
16489b02735k05085J12119M2264q8260K00929k4581j72337O5520j30311K43602
$$ plain form
16560 156601 261025 -3783 -345954 -459583 -720437 -383755 -134316 -168648 -289835 -110664
16550 -110664 18100 -4934 -432400 -710566 -571441 -453102 -396056 -496028 -215511 -94089
16540 -94089 -66563 -101589 -318951 -210979 -8036 -147372 -379441 -529370 -637469 -515142
16530 -515142 -431586 -532262 -610425 -460501 -139918 -68534 -231968 -69501 36731 -57534
16520 -57534 187821 180920 155617 319937 101524 -91091 -350156 -415283 -523419 -234185
16510 -234185 143021 212902 118788 106653 143597 -89999 -73234 79075 147301 -14430 -468773
16499 -468773 -589626 -425189 -639636 -708365 -551070 -592600 -543746 -262570 -55274 -202735
16489 -202735 -407820 -295701 -253437 -341697 -140768 -165349 -337686 -272166 -402477 -158875
16479a58875P2118K42125j3725k45196k27109k4426J74232K5796l54116j53355
16469f62531K10949K56628J40712K03556Q9178m2769j47293j72343K8688J57991
16459F2766M2873j47200k629r8090R3158M4188k40611j31791J03117r4769r4231
16448d63219K30685J57425r5404R6929j43609J41318P9094m8975J07088O0013
16438A21345o1846j24499j91338j3416J01450J52380P6337N9710R3140P1118o1658
16427B22723j06961M3219j23886k59864K9026R4920O5049L24151J86263j99689
16417B74951m28148o1621j80620K43512K82499M72198j12263k18140p0428J09362
16407C11302M618l47947r6243L2028J59107k8665l56890K4646J92144q6834r7878
$$ plain form
16479 -158875 -86757 155368 141643 -103553 -330662 -355088 -180856 -155060 -509176 -662531
16469 -662531 -451582 -194954 -54242 149314 238492 195723 48430 -123913 -95225 62766
16459 62766 105639 -41561 -44190 -142280 -49122 -4934 -245545 -377336 -274219 -368988 -463219
16448 -463219 -232534 -75109 -170513 -73584 -217193 -75875 3219 -45756 61332 121345
16438 121345 59499 -65000 -256338 -269754 -168304 -15924 60413 120123 213263 284381 222723
16427 222723 115762 158981 35095 -224769 -195743 -100823 -35774 288377 474640 274951
16417 274951 -153197 -214818 -395438 -151926 130573 602771 490508 272368 201940 311302
16407 311302 315920 -32027 -128270 -96242 62865 34200 -322690 -298044 -105900 -192734 -290612
16396b90612K45641J43069k4143l0996k37468j855r891r4705p7645J58803O8861
16385a50941J05883R489j93088p5170R3262M09707j62316j23057N994J49065j19900
16374e1072p7111J19424j05116J39575Q1270K42436j85332k08700M4866J43964
16364A44204J76196R9723J00546l44189l75467l32538K36074K42085J7269P1804
16354C5707q167K5642j0068O2358J32695K23171j32521j20142j9506Q2100q2312
16343A88957k34209j04330l3893K87867J58936l47889l52604K61238K57655J33611
16333B15339n2392P6378k39012J22254L004O0648O5721L3080j75223j53103q262
16322e1568J95797J52615m1609l95572k29861K2083L1084K19065n3067J15742
$$ plain form
16396 -290612 -44971 98098 73955 42959 -194509 -196364 -206255 -300960 -378605 -219802 -150941
16385 -150941 -45058 -35569 -228657 -303827 -210565 199142 36826 -86231 -80237 68828 -51072
16374 -51072 -128183 -8759 -113875 25700 106970 349406 164074 -44626 240 144204
16364 144204 320400 420123 520669 176480 -198987 -531525 -295451 -53366 -36097 35707
16354 35707 27540 53182 43114 105472 238167 461338 328817 208675 189169 271269 188957
16343 188957 -45252 -149582 -183475 104392 263328 -84561 -437165 -175927 81728 215339
16333 215339 162947 239325 313 122567 125571 186219 251940 285020 109797 -43306 -51568
16322 -51568 144229 296844 255235 -140337 -370198 -348115 -317031 -97966 -151033 -35291
16312c5291J23698k53465K1513J47946J37539R582k79059o5909O9501j51289j63525
16301d38759K34923J08498q7628J4505p0645J68274j3780K4604M8908j47520O2049
16290i6571K45114j0263q3647M5757L4128p7332j3368J16171M4054l1827p4341
16279I7875J04512J52544K718l74453j93804K96624l378l4615k4670k21990M3420
16268a55217j30541Q9287j3782J10055J2113J51994n7943N2143M7722O47J59674
16257B66152J21031l14650O097j60606r0880L83245J23824l35452l37232J42328
16247a96143K14094J65623J49924P8275j96500j67535r3480q2456p9576M3903
16237a63871J39316Q649j65223k68165j45617Q990J16629Q9048O9324j192K74715
$$ plain form
16312 -35291 88407 -165058 -143545 4401 141940 151522 -127537 -193446 -123945 -275234 -438759
16301 -438759 -203836 -95338 -182966 -168461 -239106 -70832 -84612 -60008 -11100 -158620 -96571
16290 -96571 148543 138280 54633 100390 134518 57186 43818 159989 204043 172216 97875
16279 97875 202387 354931 357649 -16804 -210608 86016 82638 48023 23353 -198637 -155217
16268 -155217 -285758 -196471 -210253 -100198 -88085 63909 5966 58109 105831 106478 266152
16257 266152 387183 72533 78630 -81976 -172856 210389 334213 -1239 -338471 -196143
16247 -196143 17951 183574 333498 411773 215273 47738 -45742 -128198 -207774 -163871
16237 -163871 -24555 -15906 -181129 -449294 -594911 -585921 -469292 -380244 -310920 -312112 -37397
16226c7397m8612k77059k48296K14371J44776K1640Q6266L16904L4495p5336J3910
16215A45662k0944j53388k45712J72271j703j62675r6205K07650L08896N4850
16205B08702j41020k7831l08300O6021m2662R9332N6684l9936J64020J19103N05245
16194F59358N7066m32197j21884k2854k17099o4664p366L7744j34019p082L47777
16183I4780p4309j30133o9409J43966j1117k65720J17456P8526l61067l0975M1448
16172d66554J2948j9177J58895N9272p9540j21060K05589m2911o4068O5698L27017
16161C6109j73368P8255P6895j43287j79646J95714N8922j37391p5043k08570
16151d71410l0532L24484J49798M7439K39686J36137l58030l50453k75882k27127
$$ plain form
16226 -37397 -86009 -363068 -611364 -396993 -252217 -230577 -144311 172593 207088 131752 145662
16215 145662 124718 -28670 -274382 -102111 -103814 -266489 -362694 -155044 153852 208702
16205 208702 67682 39851 -268449 -202428 -245090 -145758 -89074 -129010 35010 154113 659358
16194 659358 716424 284227 162343 139489 -77610 -142274 -149640 -111896 -245915 -252997 94780
16183 94780 20471 -109662 -179071 -35105 -46222 -311942 -194486 -115960 -477027 -508002 -466554
16172 -466554 -453606 -472783 -313888 -254616 -334156 -455216 -249627 -292538 -356606 -290908 36109
16161 36109 -137259 -59004 17891 -125396 -305042 -109328 -50406 -187797 -262840 -471410
16151 -471410 -501942 -177458 -27660 19779 259465 395602 37572 -312881 -588763 -815890
16141h15890J62311K41540K46340r1302K27689j910j31601K54697R767j52695
16131e1054j41040N4259k0102Q2918n9389P1082J7015J19184j39026j40919O701
16120b00371q7587p1269J82171j79280j67601J07001J38477J44203J7519J5689
16110a01048O0869J43661M53044m5802j59432P1214l7259k01014j86084Q1800
16100G9949O7616J59134L98002j42932j46714m45334l46555k29679J99907J16674
16090b89932k5852l4217k16098o4303R3067K18280J35707M9573r4499n0534j44323
16079d23131J118K67899K81064p8007j95517J01678j29737M2141l8627l0064j0108
16068b11291Q441Q3929J54318J85705q9693k03550J32883j56870l31713L955l5038
$$ plain form
16141 -815890 -653579 -412039 -165699 -257001 -29312 -31222 -162823 91874 101641 -51054
16131 -51054 -192094 -137835 -157937 -75019 -134408 -63326 -46311 72873 -66153 -207072 -200371
16120 -200371 -287958 -359227 -177056 -356336 -523937 -416936 -278459 -134256 -116737 -101048
16110 -101048 -40179 103482 556526 510724 351292 422506 385247 184233 -1851 79949
16100 79949 147565 306699 704701 561769 415055 -30279 -376834 -606513 -406606 -289932
16090 -289932 -315784 -350001 -566099 -630402 -537335 -319055 -183348 -133775 -228274 -278808 -423131
16079 -423131 -422013 -154114 126950 48943 -146574 -44896 -174633 -132492 -171119 -201183 -211291
16068 -211291 -202850 -118921 35397 221102 131409 -72141 60742 -96128 -427841 -423886 -458924
16057d58924J8192K5786J15181L83510j01632r5863j15147L63903J37768n9280
16047B13494k22506j64996o0597J60586J09700L4609k84976J27392J7717j27044
16037a96621N0571m1058J05101m2175k8046K02153L28908j13820j57675M8921
16027A56259Q4441l0033r3157Q320j24345k62007M2063l6138Q6508J31680J69509
16016A33100k9705L27848j84082l81211J48801j14993l29766J40253n6026q1413
16006d27194J81764J51916k15372J60158K99915j3076O9634n6365J32542K50549
15996E34471j14532k69876j6932j57513m826j47172j78894Q9939R2411k5405J20836
15985g7493l4007q3465r0370R5855K45157J25355m7554J95822J06852o8653k48397
$$ plain form
16057 -458924 -440732 -414946 -299765 83745 -17887 -113750 -228897 135006 272774 213494
16047 213494 -9012 -174008 -234605 -74019 35681 70290 -214686 -87294 -69577 -196621
16037 -196621 -146050 -187108 -82007 -124182 -152228 49925 378833 265013 107338 156259
16027 156259 240700 210667 117510 125830 1485 -260522 -218459 -254597 -168089 -36409 133100
16016 133100 103395 431243 247161 -134050 14751 -100242 -430008 -289755 -345781 -427194
16006 -427194 -245430 -93514 -308886 -148728 151187 138111 207745 151380 283922 534471
15996 534471 419939 150063 133131 -24382 -29208 -176380 -355274 -265335 -172924 -198329 -77493
15985 -77493 -111500 -194965 -285335 -189480 55677 181032 133478 329300 436152 367499 119102
15974A19102l31503L3999J92569j43179J47849j58298J19109J92741j92628j07135
15964a27374J52731m2810k7791j43834M2170J61370j25337k40964k74227K19614
15954d06452O22308J71485L9248l2571k80521J15408q4605J375j04195j54954
15944a13474l07184P664J79356J47820J16556m982K0855O5632J37933K10733n2903
15933D08006q0151k89984j57496j8285J01619J72693L3970l14142Q4176n3550
15923a13144k51797L22557K46250j81027j06695j08019R7199J86816j20285j68219
15913a96364K36128K46565p8734j39394q5289k44434r2442k44210J48355K8727
15903d21092j93135j9751L20491J16293L0720J80687p0955J4514J08307J33041
$$ plain form
15974 119102 -212401 -178402 14167 -129012 18837 -139461 -20352 172389 -20239 -127374
15964 -127374 25357 -17453 -45244 -189078 -146908 14462 -110875 -351839 -626066 -406452
15954 -406452 215856 387341 426589 394018 113497 228905 144300 145675 41480 -113474
15944 -113474 -420658 -412994 -233638 -85818 30738 25756 46611 112243 250176 460909 408006
15933 408006 327855 37871 -119625 -137910 -36291 136402 170372 -143770 -59594 -113144
15923 -113144 -364941 -42384 203866 22839 -83856 -191875 -94676 92140 -28145 -196364
15913 -196364 39764 286329 207595 68201 -17088 -261522 -353964 -598174 -449819 -421092
15903 -421092 -614227 -633978 -313487 -197194 -166474 14213 -56742 -42228 66079 199120
15893A99120J86888l20513j22744k2025j81500j10820k9516J9639o9771L20452
15883a30790K58458l970r13k55689j09819J33095p2951l21332P1K30259O7274
15872b06307J49124j23592P5665K82939P4167K0555k28867R302J8520l79344k52371
15861e60209J56924J47134J44044J72215j33039j46898p2397K5108J22546J88351
15851D3779J45070P8083K9472n2199m5499O1295j44749r0072k60153J15046J34772
15840A4845J01074j32269r1114l19419K05100P2987Q7690Q7557O9449p4854L9487
15829F0533J5669J17411n0354M4932l3237q9538l97066q515L26836J51829j09816
15818B8684j31797j09220j01289N68K03085Q0264j44744q2570j14614n0317J33563
$$ plain form
15893 199120 386008 65495 -57249 -79274 -260774 -371594 -401110 -381471 -451242 -130790
15883 -130790 127668 123698 122785 -132904 -242723 -109628 -182579 -503911 -503840 -273581 -206307
15872 -206307 -57183 -180775 -105110 177829 251996 272551 43684 52986 71506 -307838 -560209
15861 -560209 -403285 -256151 -112107 60108 -72931 -219829 -292226 -267118 -144572 43779
15851 43779 188849 266932 296404 244205 198706 260001 115252 25180 -234973 -119927 14845
15840 14845 115919 -16350 -107464 -426883 -221783 -148796 -61106 26451 95900 21046 60533
15829 60533 76202 193613 143259 188191 154954 65416 -331650 -340165 -13329 138500 28684
15818 28684 -103113 -212333 -313622 -313054 -109969 -29705 -174449 -257019 -371633 -421950 -288387
15807b88387j46054J41778K79333r566j34392j7365N8547p8188k04056n0024K26790
15796b21584K19204K9981j15443J43113L69436J07780k20010l59976k26409j3084
15786b86992K67787L9634j24412k12016o2802J27113L22530j5121j40383J42330
15776E7668k0516j63126m0299l37431K81689L42211k37540J71830J64790j10192
15766A09084j85847j33446N4617K12895K40078o6205k25218k82641L2822J84316
15756e9545k00175k10702L97518J29751J32777J16683K1204L0356p2370m29870
15746a44373l05189L66359K55175k7356j50705r974k11080J0338L7487J24080
15736e5238J66528r9515k21671J8282n0874L07480K03261k10925j7608j01265
$$ plain form
15807 -288387 -434441 -292663 -13330 -22896 -157288 -174653 -116106 -194294 -398350 -448374 -221584
15796 -221584 -2380 27601 -87842 55271 424707 532487 312477 -47499 -273908 -286992
15786 -286992 -19205 20429 -103983 -315999 -378801 -251688 70842 55721 -84662 57668
15776 57668 37152 -125974 -166273 -503704 -222015 120196 -117344 54486 219276 109084
15766 109084 -76763 -210209 -155592 57303 297381 231176 5958 -276683 -243861 -59545
15756 -59545 -259720 -470422 -72904 56847 189624 306307 327511 357867 285497 -144373
15746 -144373 -449562 -83203 171972 144616 -6089 -16063 -227143 -216805 -179318 -55238
15736 -55238 111290 11775 -209896 -191614 -242488 64992 268253 57328 39720 -61545
15726f1545N6844l01370q2943K02241o4707l1924R7684k57731O9180J50959J4454
15715b08858K7741L150q488j50235r1863k3701L20610J38866j219K1615j0286
15704A7332k67995L76264K67726k38497K04275M21036M541o5276l33187k16890
15694A69329J76510O0808j55920j63655J06164K47410R1798k03371j32143l03262
15684a06332K26267K92749m7389l09296j2194L2905m2041L6130K7290J61853l50194
15673i0252q136K39859j6587k77143K4775j74688j03102r0064J69586K47875R5729
15662A7852J31921k58217j16010J55250L22659K26454J01006k34481K0399j46532
15652B20301l26443j99331r3752R8833K43207K18330k03285j01785M5790Q6717
$$ plain form
15726 -61545 -4701 -306071 -389014 -186773 -251480 -283404 -185720 -443451 -374271 -223312 -208858
15715 -208858 -181117 -177967 -186455 -336690 -428553 -452254 -131644 7222 6003 27618 17332
15704 17332 -250663 125601 393327 154830 359105 780141 784682 719406 386219 169329
15694 169329 345839 406647 250727 87072 193236 440646 532444 329073 196930 -106332
15684 -106332 119935 412684 365295 55999 43805 76710 34669 70799 98089 259942 -90252
15673 -90252 -98388 141471 124884 -152259 -127484 -302172 -405274 -495338 -325752 -77877 17852
15662 17852 149773 -108444 -224454 -69204 253455 479909 580915 346434 366833 220301
15652 220301 -106142 -305473 -399225 -300392 -57185 161145 -42140 -143925 -98135 -11418
15642a1418J7260j17129K35862N045q5505j75742N5749K39314O8445l2127l39138
15631a39384j76320m8283J0397L13739K45056J54811k4661o7983j25273o5780
15621G6319J16819M7463K56888j36254m89522k75240m9061p287K25612J90325
15611d3938q9070j77881K81245L77856P1104r2810m41714j56534Q797j24862m3971
15600d31778l1519P0717K94962M13578J51360m7708j54235j25185K2773j94236
15590c1271k23674K26009J67630O490J24578J47965N4488j86293m8127l9257J36955
15579C35493o6520r9240P2886q5539K7653j92889l08007R6190K45328M2401j19259
15568e1503K66602J40763N1921k49130l02413j93732K53281J33674j17153K01103
$$ plain form
15642 -11418 5842 -111287 124575 129620 44115 -131627 -75878 163436 231881 199754 -139384
15631 -139384 -315704 -363987 -353590 -39851 205205 360016 335355 267372 142099 76319
15621 76319 193138 240601 497489 361235 -128287 -403527 -452588 -459875 -234263 -43938
15611 -43938 -133008 -310889 -29644 348212 419316 326506 -115208 -271742 -262945 -387807 -431778
15600 -431778 -463297 -392580 -97618 315960 467320 419612 265377 140192 162965 -31271
15590 -31271 -254945 -28936 138694 145184 269762 417727 472215 285922 237795 198538 335493
15579 335493 268973 169733 242619 157080 184733 -8156 -316163 -219973 25355 67756 -51503
15568 -51503 215099 355862 407783 158653 -143760 -337492 -84211 49463 -67690 133413
15558A33413J47719L5163j45157j53465k19555O1293J19003K81230Q0534j69394
15548A70784j29829O1018K28255J66273j84954k18680l00574J20706k46533q6925
15538d20459M9615M07742J73683p3971j48229j79942j1170L96125k8575k92638
15528a27819k01331L414K02442K52558L22325j63248k47261M6729j11351j79831
15518b03373o7787K99955J16464j16635r530k58396N3160J65580J19190j76154
15508g7526K70559n7005Q165q0783j79443j1221J79131j66737J436J87384K85477
15497C59437p9839l26082r8060N4769j30134o530J06783m4931j20833J6383J15212
15486a53825P7488K34650l6779J06270K3733j05777k12727J49886j72347j97120
$$ plain form
15558 133413 281132 316295 171138 17673 -201882 -140589 -21586 259644 340178 170784
15548 170784 40955 101973 330228 496501 311547 92867 -207707 -87001 -333534 -420459
15538 -420459 -370844 36898 210581 136610 -11619 -191561 -202731 193394 164819 -127819
15528 -127819 -329150 -325736 -123294 129264 451589 288341 41080 87809 -23542 -203373
15518 -203373 -271160 28795 145259 28624 19094 -239302 -186142 -20562 98628 -77526
15508 -77526 193033 136028 144193 63410 -116033 -127254 51877 -114860 -113424 73960 359437
15497 359437 279598 -46484 -144544 -89775 -219909 -226439 -119656 -164587 -285420 -269037 -153825
15486 -153825 -76337 158313 121534 227804 251537 145760 -66967 82919 -89428 -286548
15476b86548J47409j08220L23115K55370k28080N5550J073R1561j02948J30535
15466B78817K6951Q7669k70403k13982k25492L70129K54302M28j17370n5984j51416
15455a6351K04616o5686m79539O7314L77227J94970l8970p8854M1629p3186j40210
15444g040j09112K57037J00026P5892o4382r6261m2445m5839l71687j93860N2397
15433d45274K67599j37830J02090J6707K93083k37581l2804J43309N3811K81559
15423C04669m6840q3332P1093Q63J22132J06028k04737k45505j16253L4858K92129
15412B35105N2900Q1908Q5473k6367N0564k61090N3442j96852o9005J74652Q8335
15401B69065K12332O3888m5940j04574k94289l970K62994N3359k24562L4480l00077
$$ plain form
15476 -286548 -139139 -247359 75756 331126 103046 158596 159669 251230 148282 278817
15466 278817 305768 393437 123034 -90948 -316440 53689 307991 308419 191049 135065 -16351
15455 -16351 188265 122579 -356960 -289646 87581 282551 243581 164727 206356 133170 -7040
15444 -7040 -116152 140885 240911 316803 252421 156160 113715 67876 -303811 -497671 -445274
15433 -445274 -177675 -315505 -213415 -196708 96375 -141206 -174010 -30701 23110 304669
15423 304669 257829 174497 245590 246453 368585 474613 269876 24371 -91882 -57024 235105
15412 235105 288005 369913 455386 429019 479583 218493 271935 75083 6078 180730 269065
15401 269065 481397 545285 499345 394771 100482 96512 359506 412865 188303 222783 -77294
15390g7294k54966J02902K63201K74283n05493l11132J86490O7177M0127J4436
15380b00269n2829K12089M06237j94822k13922M3958m6680q991J66437K72921
15370C84129l6350k8574k01836j42015l9989R8540K7122L52945N3418M7312J6005
15359E30707j71375l56246j08588M3646J49720K67126k58675q2547j12029q0322
15349a78583q7458J98218J21841o1773k1377j1769R4272J9376J84753q6618l72960
15338b02078k91201j2853R2405J74808J96407q6748J1281R4561L2358P8189M32187
15327E19316k3923o422J9248k74453j75502J20719k0000l11273l50594j08525
15317f11409Q5391K44032J49613k42972J51805L52128P0162l09623j33669o6549
$$ plain form
15390 -77294 -332260 -229358 33843 308126 -197367 -508499 -322009 -254832 -214705 -200269
15380 -200269 -253098 -41009 365228 170406 -43516 442 -46238 -55229 111208 384129
15370 384129 347779 319205 117369 -24646 -64635 33905 61027 413972 467390 514702 530707
15359 530707 359332 3086 -105502 -61856 87864 354990 96315 13768 -98261 -178583
15349 -178583 -266041 -67823 54018 -7755 -29132 -40901 53371 72747 257500 170882 -202078
15338 -202078 -493279 -506132 -413727 -238919 -42512 -129260 -117979 -23418 8940 87129 519316
15327 519316 495393 488971 508219 233766 58264 178983 158983 -152290 -502884 -611409
15317 -611409 -526018 -281986 -132373 -375345 -223540 128588 198750 -110873 -244542 -311091
15307c11091k2084J98176K39649J60732o2606j17824J09055N4427n5259q1667
15297A11508L5339r4910j82629J10980p4841j41213M2887j94526J6519M36921
15287F6035J84652J5904p2297j26121p3870J68641k00800J33489k8514n2196l4370
15276a9447j62779P0660K6970O0075q7086K91630k269K19376K93492J49389K4094
15265H64105l44026j35434k65386J74667m25252l53741l791N87522K11963k05475
15255A05152k04992j40908k41523J2901K37183L50371K2271J69814o4120j72401
15245G3748J7450J31470K23210L0852l69171k25894j90292o6330J06427P0620
15235a97910L2953n0991R3013j7700j17125K78823J69467j35678j99465k72011
$$ plain form
15307 -311091 -333175 -134999 104650 265382 202776 84952 194007 248434 193175 111508
15297 111508 146847 51937 -130692 -19712 -94553 -235766 -192879 -387405 -370886 66035
15287 66035 250687 266591 194294 68173 -5697 162944 -37856 95633 67119 14923 -19447
15276 -19447 -182226 -111566 -84596 -24521 -111607 180023 177754 397130 690622 840011 864105
15265 864105 520079 384645 119259 293926 -131326 -485067 -488858 98664 310627 105152
15255 105152 -99840 -240748 -482271 -469370 -232187 118184 140455 310269 246149 73748
15245 73748 91198 222668 445878 476730 107559 -118335 -308627 -374957 -268530 -197910
15235 -197910 -164957 -215948 -122935 -140635 -257760 21063 190530 54852 -144613 -416624
15225d16624j87770j33019J73101K02958r6634j51183q9270j12683J59048N7950
15215e94126n9660L25259N05794N4306j82932j33845j40996K49689J30916m7581
15205A06824q0064k29756O4441j30807l40074j05164P4865L24508L68468j46808
15195i3567j37878J06054K22073n9221r4773j86568O6460J11179J77951l3196
15185G8514Q283P889j24415R2539j86924J95887K4747k47368k31197J22600J97226
15174f2219N3295J50517K2655k42399j15014J91443m5392l6202J90998P918m40897
15163c25297j35672L29484p804R9611l2549q1391j82331r1967K38517m6028N3872
15152a81555R5055L974o3023n3866P6465M89270J9882l71000o3197j738L694K01750
$$ plain form
15225 -416624 -604394 -737413 -564312 -361354 -457988 -609171 -698441 -811124 -652076 -594126
15215 -594126 -653786 -328527 177267 231573 48641 -85204 -226200 23489 154405 106824
15205 106824 26760 -202996 -138555 -269362 -609436 -714600 -639735 -315227 53241 -93567
15195 -93567 -231445 -125391 96682 37461 -57312 -243880 -177420 -66241 111710 78514
15185 78514 86797 94686 -29729 62810 -124114 71773 96520 -150848 -382045 -259445 -62219
15174 -62219 -8924 141593 164248 -78151 -193165 -1722 -47114 -83316 107682 115600 -325297
15163 -325297 -460969 -131485 -139289 -39678 -72227 -153618 -335949 -427916 -189399 -235427 -181555
15152 -181555 -86500 -82526 -145549 -199415 -122950 366320 386202 15202 -47995 -49733 -46039 155711
15140A55711p8193M4855P7939M6596j17743N8341j1696k74143K30424K44715N0478
15129D27284l71062l66872m6788J81130N10768j6940q9526J0654j89876j29579
15119h0807J45454j12344j10680J36568J63014m24186j61574K09071Q9589L3038
15109a12857K3901j60290J4727K08169J18706J64821k76956l50555j81642K24694
15099c27282J26868J13089R0600j03886O0447Q6809Q8981N9414J14122k38618
15089G0544r1070j03936J94855L8376k53155j07342K57515R8942p2331N7444q0769
15078I073l5299j08604k7041J89502L95287J865l90695k31829j24142O6930K743
15067b52210J76518J08175j11751j75373J78581l0308j34293K71458K18412o0497
$$ plain form
15140 155711 77518 122373 200312 246908 129165 187506 175810 -98333 132091 376806 427284
15129 427284 56222 -310650 -357438 -176308 334460 317520 227994 238648 48772 -80807
15119 -80807 64647 -47697 -158377 -21809 141205 -282981 -444555 -235484 -145895 -112857
15109 -112857 -88956 -249246 -234519 -26350 92356 257177 -19779 -370334 -551976 -327282
15099 -327282 -200414 -87325 3275 -100611 -40164 46645 135626 195040 309162 70544
15089 70544 -20526 -124462 70393 108769 -144386 -251728 5787 104729 32398 89842 9073
15078 9073 -26226 -134830 -161871 27631 422918 424783 34088 -197741 -321883 -254953 -252210
15067 -252210 -75692 32483 -79268 -254641 -76060 -106368 -240661 30797 249209 188712
15057A88712l39102q4361J31787j12447R6288n7177j81929j55199N3507J40210
15047c19711R2433J58506l3998J8280J76297o8716k17649l13561O6966J73857
15037b67296j9665L37326K66813J3677q8112l1391J56413j52303k16734J0461
15027I189R4226o5333j83547Q2646l4840m1145K29609R6883J46774o5304j5804
15016B53354j6346k12173J4648r1906o6993J22758K90276n0348n7603L4508N0452
15005B70627L532J51486m35557O1143r0739j06964O7700K55087p2201n9601N3761
14994I8274k63136Q7003K36785j91543k50478M1499K26046J719l20028J30714
14984b03145L06461J89615J8276r5043K9617j18100l2032N331r4446k7317j65024
$$ plain form
15057 188712 -150390 -234751 -102964 -215411 -119123 -176300 -358229 -513428 -459921 -319711
15047 -319711 -227278 -68772 -102770 -84490 91807 23091 -194558 -508119 -441153 -267296
15037 -267296 -286961 50365 317178 330855 242743 211352 367765 215462 -1272 9189
15027 9189 103415 38082 -145465 -62819 -97659 -138804 90805 187688 334462 269158 253354
15016 253354 237008 24835 39483 -52423 -119416 3342 293618 243270 185667 220175 270627
15005 270627 274159 425645 -9912 51231 -39508 -146472 -78772 176315 104114 44513 98274
14994 98274 -164862 -77859 158926 -32617 -283095 -241596 -15550 -13831 -333859 -203145
14984 -203145 103316 292931 311207 216164 245781 127681 95649 100980 6534 -20783 -185807
14973a85807p2560j31627M4374L08294Q4982l7010J3326L3421n0657j40546L02856
14962A69046J59677j86889k8103k18929j47194Q3351r3733J94641K02121k6034
14952A07954j64209K6215n4698l08245n014J70504M8727l1586l2400o5982m4662
14941c53396M54651M2812k1074J06018P6013q7609J261P822J90066L629l20819
14930I9374l05871q2448J84775J96417M6557J01486j7632n3280j91363q9006j98637
14919c09628q9429k21809J55524K62985Q4588J8876m4974J53621O032n2998J49690
14908A12478K65233p1294p6084r4861k2648j87206M3451j58245l0017P7369J68181
14897B6357q4634j51420R2296J01648j40404J7777J33925J37894j4238j32686
$$ plain form
14973 -185807 -258367 -389994 -345620 -37326 47656 10646 23972 57393 6736 -133810 169046
14962 169046 328723 141834 113731 -105198 -252392 -169041 -262774 -68133 133988 107954
14952 107954 -56255 -30040 -84738 -392983 -397997 -227493 -178766 -210352 -242752 -308734 -353396
14941 -353396 101255 144067 122993 229011 305024 217415 218676 226498 416564 420193 99374
14930 99374 -206497 -288945 -104170 92247 138804 240290 222658 169378 -21985 -110991 -309628
14919 -309628 -399057 -620866 -465342 -202357 -117769 -98893 -143867 9754 15786 -37212 112478
14908 112478 377711 306417 230333 135472 112824 -74382 -30931 -189176 -219193 -141824 26357
14897 26357 -58277 -209697 -117401 -15753 -156157 -138380 -4455 133439 119201 -13485
14887a3485o558N7306K455J77442K47683l09606j18134K9053k2341j81784J73349
14876C5380n8449r8105q5613R8303j8710J60918K69857j60268l29631n6261L20324
14865G7745O573j49443l04616p6942K42362J78258j31929o3755k45387L4642Q1635
14854c50857p5039k01169j02250J35072J44693p336J61709J56948L0390j29583
14844b37422j50440J06338k70402m3945K05718J07719L42017P7499j3091p1065
14834E2926j2997Q0481m6767n2126J46736O8931K4804L9364O9328j17553j40323
14823A12804o4171P1924L222l22325J04341O134j86025J51502J17983r9373m5389
14812a49373J4057K13019J31372R8335k7596j30614r1607K61139K80248P455j42193
$$ plain form
14887 -13485 -20043 37263 39718 217160 464843 155237 37103 66156 43815 -137969 35380
14876 35380 -23069 -121174 -206787 -108484 -127194 33724 303581 143313 -186318 -242579 77745
14865 77745 84318 -65125 -369741 -446683 -204321 -26063 -157992 -221747 -467134 -432492 -350857
14854 -350857 -425896 -627065 -729315 -594243 -449550 -456886 -295177 -138229 -107839 -237422
14844 -237422 -387862 -281524 -551926 -595871 -390153 -282434 59583 137082 123991 52926
14834 52926 39929 120410 73643 21517 168253 237184 261988 301352 370680 253127 112804
14823 112804 48633 120557 123779 -198546 -94205 -88071 -274096 -122594 -4611 -103984 -149373
14812 -149373 -135316 77703 209075 307410 279814 149200 57593 318732 598980 606435 464242
14801D64242j78047j7631k19145j34539M3583P8757k680k55331Q369J49510J18911
14790E5999k76850P9838K12566L8357j7432p8061P5928R0274k02569m0682J97070
14779A34438K28928J15681j03154j57707n2070j60464Q7443K0294N3266j8738
14769A47917n5376M0886j57161K21295M25365N6844r9701P430m1814k30849j97388
14758A17448l6140j44726N2592K61834K96129k9691j74373J1704K29273J07084
14748F91134k97560j37717m6203p9797J65416P3580k33787j06356K83858j73390
14738A39178m1404Q4840J77526j80398r0230j0151k65531j49742K05664L6993
14728i3255k1478Q1934M6119l3546r518J01529p0117K44861K9645j63611l4259
$$ plain form
14801 464242 286195 268564 49419 -85120 -41537 37220 34540 -220791 -212422 -62912 55999
14790 55999 -220851 -141013 71553 109910 92478 14417 90345 180619 -21950 -62632 134438
14779 134438 363366 479047 375893 218186 166116 5652 93095 113389 166655 147917
14769 147917 92541 133427 -23734 197561 622926 679770 580069 587499 545685 314836 117448
14758 117448 81308 -63418 -10826 251008 547137 517446 343073 354777 584050 691134
14748 691134 393574 255857 209654 129857 295273 368853 135066 28710 312568 139178
14738 139178 97774 182614 360140 179742 89512 79361 -186170 -335912 -130248 -93255
14728 -93255 -114733 -32799 13320 -20226 -29744 71785 1668 246529 276174 112563 78304
14717G8304M4499r4977P0107j81262O9063J13506n084j71699J9565M0272K4526
14706F820J09097l3227k3963j91614j3500Q1541P8487M9522J75311J11385q2865
14695B66994k8109j2849k26331J97051p6149j13906P1314r9036K7915k73481q6364
14684c52951K43512K42191n6774Q0231m4162K34034J66579J8331n72k51883k46671
14673C1865r4339L3349j4936J55260K29416j4776k93402l33302J17339J85488
14663A962Q633Q9137j14633L9537O6656R6984q6337m7756j13325l882J86802j08961
14651A4817j41347J89389l69821P556L77945R7010j77165p8931k62826q6664J53003
14640b77034K043N7571m4245J18462J75028L09959o7183j07522P205k8333r7658
$$ plain form
14717 78304 122803 27826 97933 -83329 -14266 99240 94156 -77543 -57978 -17706 6820
14706 6820 115917 82690 58727 -132887 -146387 -64846 13641 63163 238474 349859 266994
14695 266994 238885 226036 -295 196756 120607 6701 78015 -21021 6894 -266587 -352951
14684 -352951 -109439 132752 75978 156209 112047 346081 512660 530991 530419 278536 31865
14673 31865 -62474 -29125 -44061 111199 340615 325839 32437 -300865 -183526 1962
14663 1962 10595 99732 -14901 24636 91292 188276 101939 54183 -59142 -63024 123778 14817
14651 14817 -126530 62859 -306962 -299406 78539 175549 -1616 -80547 -343373 -430037 -277034
14640 -277034 -274991 -217420 -261665 -143203 31825 341784 274601 167079 174284 145951 48293
14629D8293j95294j22108r1984M5080j41437K37146J46181L6461o6785r1996K27029
14618C0586J90450j34889j59797k11612J30707J56265j98655L6392j34379O2602
14608b32330L21422J13800K11557k72998j91244l8271r9298J9079K77380J33291
14598B42388l51943l21525k3910L34994P1654j87311K24349J95634R9914j42275
14588A41969M5834k89712K00978q5385j21313o4623j73152m8046J43002q1027
14578c31475M7597K54601J00422L3592l8042O2185j17653j86488m1789j8782k48604
14567d84436n3506L29735K8544Q4826L0729m00655k73396K08272K06565R5426
14557b27896J84676j33564K6320r2363K38176J21330j21458r3119J71654J61160
$$ plain form
14629 48293 -147001 -269109 -361093 -316013 -457450 -220304 -74123 -37662 -104447 -196443 30586
14618 30586 221036 86147 -73650 -285262 -154555 1710 -196945 -160553 -294932 -232330
14608 -232330 89092 202892 414449 141451 -49793 -88064 -187362 -168283 109097 242388
14598 242388 -109555 -431080 -454990 -119996 -48342 -235653 -11304 184330 284244 141969
14588 141969 187803 -101909 99069 13684 -107629 -172252 -345404 -393450 -250448 -331475
14578 -331475 -283878 -29277 71145 104737 66695 128880 11227 -175261 -217050 -235832 -484436
14567 -484436 -537942 -208207 -179663 -94837 -64108 -464763 -738159 -529887 -323322 -227896
14557 -227896 -43220 -176784 -150464 -242827 -4651 116679 -4779 -97898 73756 234916
14547B34916j3504k52779k15856l7599k17633l7810o9412j22665J25675K50676
14537c55991J5420M6551O9184K13469L9427n4931k5635J10357R7938k43169j05045
14526a92425j74010R1089Q2259q6743K47104L11671p8063j90743j34820J7234
14516a07447L1905M7313Q574m4703q7197j82508K34378O1896k71146j42052K46055
14505b04932L90414J9991k88408q9001J64548J37690J97649J36144l43470L3807
14495A54432l2750j57537j39559r3250j14444K28666J31270j83649j57089p410
14485c71320Q1872j63472q1966L5417L21213q9002J08271J52011N1975Q1060n3888
14474G2171j20048O6363K67835M1419N5733o1718j72373k37299q470j1134J78355
$$ plain form
14547 234916 221412 -31367 -247223 -284822 -502455 -540265 -609677 -732342 -606667 -355991
14537 -355991 -340571 -294020 -224836 -11367 28060 -26871 -52506 57851 155789 -87380 -192425
14526 -192425 -366435 -275346 -193087 -279830 -32726 278945 200882 10139 -124681 -107447
14516 -107447 -75542 -28229 -19655 -64358 -151555 -334063 -99685 -37789 -308935 -450987 -204932
14505 -204932 185482 205473 -82935 -171936 -7388 130302 327951 464095 120625 154432
14495 154432 121682 -35855 -175414 -268664 -383108 -154442 -23172 -206821 -363910 -371320
14485 -371320 -289448 -452920 -534886 -499469 -178256 -267258 -158987 -6976 44999 126059 72171
14474 72171 -47877 18486 286321 327740 383473 321755 149382 -87917 -96387 -107521 70834
14463G0834j6072J32271Q5992P1640j11641K6076k1603J36164J20131j86714k7570
14452B79508l60289k34946j57960R6473K58147R596K99252P0880k89703q3899
14442a12941j00567k5477O0460L4019O7170R1774j2901M3947J38575k31987j01018
14431a48946j66412j43311K40601J0591M17141P1845r3251Q7076N1361j77316
14421A49379l02169o7840N2194M105K5453j03880j52057j26107L6725K21135L4269
14410b28793J16228M347p2223l8148N0793j75732J13328J4979L8189K43586l8762
14399B7792n6912K51751p4623j88770J31089j18378k15474q6401R4766j19948
14389c55108L42774L30351j8671k92312J29793J89530J39672J5710j52173J09913
$$ plain form
14463 70834 54762 187033 273025 344665 233024 259100 237497 373661 493792 307078 279508
14452 279508 -80781 -315727 -473687 -377214 -119067 -109471 189781 260661 -29042 -112941
14442 -112941 -213508 -238985 -178525 -144506 -77336 14438 1537 45484 184059 -47928 -148946
14431 -148946 -315358 -458669 -218068 -207477 209664 281509 188258 275334 326695 149379
14421 149379 -152790 -220630 -168436 -164331 -138878 -242758 -394815 -520922 -484197 -263062 -228793
14410 -228793 -112565 -108218 -180441 -218589 -167796 -343528 -230200 -215221 -177032 66554 27792
14399 27792 -29120 222631 148008 -40762 90327 -28051 -243525 -329926 -235160 -355108
14389 -355108 -12334 318017 299346 7034 136827 326357 466029 481739 329566 439479
14379D39479n4702j53067j19711r7817j07557j91894O7125J03807K19798j52420
14369d6959m9635J23189j11387l82446K69301J93647J08565R5556J84028j98738
14359A85121n0434N8947q9784j67231l30004M921P0081K4418r6563L94301K16870
14348B20643l27345k45071J6731j73516J05024K3471j50209k5159Q7490K02928
14338b65013k08868M9975J49437m157j03366N5900L17366q5941l85506k10605
14328f90778J56550J68419M21294P8124p8288J00984N2266k34430Q0807J07930
14318A62878j26505N8171K27486J48316J86565N8900l3307K04164l10760k48410
14308C27498p6369j87600k4369J4627n6761k4737L4157J42270N2897Q6929j9088
$$ plain form
14379 439479 384777 231710 111999 14182 -93375 -285269 -218144 -114337 105461 -46959
14369 -46959 -96594 26595 -84792 -467238 -197937 -4290 104275 199831 383859 185121
14359 185121 134687 193634 103850 -63381 -393385 -388464 -318383 -293965 -390528 3773 220643
14348 220643 -106702 -351773 -335042 -508558 -403534 -380063 -530272 -555431 -467941 -265013
14338 -265013 -473881 -423906 -274469 -278626 -381992 -326092 -8726 -94667 -480173 -690778
14328 -690778 -534228 -365809 55485 133609 55321 156305 208571 -25859 54948 162878
14318 162878 36373 94544 322030 470346 656911 715811 682504 886668 575908 327498
14308 327498 251129 63529 39160 53787 -2974 -27711 6446 148716 201613 288542 269454
14297B69454O1489M9830j97111j35954P8759M4882j54894P7091q626J138n1559
14286C4499K12873j82757k61622L7200K08175J62964o27K7684p4083l3432j06135
14275B4739J52775J2510j09463p8421J15978J10627j021n688r9539q9158r3401
14264f0062m10860l4354m451J1281L15604J28811J156J24481M7031j69694j39077
14253a90134o7175J3233q1746j61580J23905L83006q1178l50318J19788K27725
14243f4474o9873J99049K24565P7973J139q9838l41819L471m781j5000k7327Q4839
14231b2076l47700k93220O3008L30740K89553j29656k62305m1868J04052J27997
14221a81475q0673J90104P7541J14729M8561q0582K04567j88428k31785r2869
$$ plain form
14297 269454 330943 380773 183662 47708 126467 171349 16455 93546 84920 86058 34499
14286 34499 247372 64615 -197007 -159807 48368 211332 210705 238389 164306 130874 24739
14275 24739 177514 190024 80561 2140 118118 228745 227724 222036 122497 33339 -60062
14264 -60062 -470922 -505276 -509727 -498446 -182842 -54031 -52875 71606 118637 -51057 -190134
14253 -190134 -257309 -244076 -325822 -487402 -363497 19509 -61669 -411987 -292199 -64474
14243 -64474 -134347 64702 289267 367240 368379 278541 -63278 -59807 -64588 -79588 -106915 -22076
14231 -22076 -369776 -662996 -599988 -269248 20305 -109351 -371656 -413524 -309472 -181475
14221 -181475 -262148 -72044 5497 120226 168787 88205 292772 104344 -127441 -220310
14211b20310O6541o6243P4306L888K5145j9252j734R999j71338J82679L64065
14200B47746K35836j34040j50981j26065K9315K0911J98052j11932j06576j85594
14190h3328k65868j5524k6204J65689L59596k3504l3782k51973k09235M29314
14180D5181p392j4942J45859n2008k9957K45466J92668k07994k17183R7578J38835
14169C36111k36044K32610L10381j39133J594J3201l48108l35635j19230j09927
14159c94180J05247J77696K54002j20598L012J96114n0129k22925j70697K15180
14149g278j30051l8545o7918k96550L79415K50299Q2932N5054K35891k5625j46827
14138B90797j43065J00441j32464k93078J3257J02664J6116P4936j1200r6233
$$ plain form
14211 -220310 -153769 -220012 -145706 -141818 -116673 -135925 -137659 -127660 -298998 -116319 247746
14200 247746 483582 349542 198561 72496 101811 122722 320774 208842 102266 -83328
14190 -83328 -349196 -364720 -390924 -225235 134361 110857 77075 -174898 -384133 45181
14180 45181 37789 22847 168706 116698 86741 332207 524875 316881 99698 197276 336111
14169 336111 100067 332677 643058 503925 505519 518720 170612 -165023 -284253 -394180
14159 -394180 -288933 -111237 142765 22167 25179 221293 171164 -51761 -222458 -7278
14149 -7278 -137329 -175874 -243792 -540342 -160927 89372 172304 227358 463249 437624 290797
14138 290797 147732 248173 115709 -177369 -164112 -61448 -45332 29604 18404 -77829
14128g7829j31137J13267P9468j02667j07696M2553J76050k53783J18248K8992
14118a14534J91235O4104M572j37802L2686L48679o3427N3954j94468j97430p382
14107a9813k8l02244k56528O5170j117L14112M15497j18547j06291m7310L28960
14096B71861J62464k13889q5362l7582J3006J5232J02800N5645l8259J22604m4985
14085C23535N3753N264n3993R3679j81124k67577K18866K32591j20023r3094l0641
14074A81236k90500j00252J80071o4360K2927k33136j14621M21933J81794N3795
14064B38887o8403J88280j64780J47664j09586j02048p1845J24031j49618j0622
14054B1960J53505j9712k45846P2320J39901j91910k49446J83448k7050N2714
$$ plain form
14128 -77829 -208966 -95699 -16231 -118898 -226594 -184041 -7991 -261774 -143526 -114534
14118 -114534 76701 140805 145377 7575 40261 388940 325513 379467 184999 -12431 -19813
14107 -19813 -19841 -322085 -578613 -513443 -514560 -200448 215049 96502 -9789 -57099 271861
14096 271861 434325 220436 135074 97492 110498 125730 228530 284175 245916 368520 323535
14085 323535 377288 382552 328559 422238 241114 -26463 192403 424994 304971 211877 181236
14074 181236 -109264 -209516 -29445 -93805 -70878 -304014 -418635 3298 185092 238887
14064 238887 170484 358764 193984 341648 232062 130014 58169 182200 32582 21960
14054 21960 175465 155753 -90093 -17773 122128 -69782 -319228 -135780 -162830 -110116
14044a10116K13081J60448j11070L46096R4008k6032m4221j10711m49102j27051
14034a64670p199J25516k8377j76114J22584K36794K65857J44260j48800K72076
14024F41927m6861q619r8576m06694K2340L451j36360M9412j4154J49889J12148
14013B67903J0850j3121O9688K22892k84311k46146K75895J23715k27811O4702
14003B64256L36034N2058k797l15849r0772k98268j88484J98306K53766J70064
13993C78314M966l18731j27206K87756j33191j84597L19110K06430k95500j12119
13983B5232J85055r3709l8385l78813k32932K8595r4564K66535L55059J60868
13973A82941R334L9091P5323r5740M9975r0098j9927J19513l3842J09517m199
$$ plain form
14044 -110116 102965 263413 152343 498439 592447 566415 522194 411483 -37619 -164670
14034 -164670 -171869 -46353 -74730 -250844 -128260 108534 374391 518651 369851 641927
14024 641927 595066 586447 487871 81177 103517 106968 -29392 20020 5866 155755 267903
14013 267903 278753 265632 335320 558212 273901 27755 303650 427365 199554 264256
14003 264256 600290 652348 649551 333702 242930 -55338 -243822 -45516 208250 378314
13993 378314 383280 64549 -62657 225099 91908 -92689 226421 432851 137351 25232
13983 25232 210287 116578 78193 -300620 -533552 -504957 -599521 -332986 22073 182941
13973 182941 192275 231366 306689 210949 260924 170826 150899 270412 236570 346087 341888
13962C41888j09259K41087R1879l54229m24861J36523j09660j48863M9802J46076
13952a39617K10088J19312N6635M602J93830j09381r9048k56390q5750J17711
13942A1992K04979o6285k65891o6185j02102j37090J94285j44507P6110K26906
13932f7788J15465K63622J95225k01597j44408L3892k2870J36277N279k28621
13922H4476l72816l2816l222R7098N4318k0337Q3540n229j27898j10671J32840
13911b20717J76948K69287m7526j5558k23368j63056l641R7893o4522k47047j06020
13900e47327J69045j5018k33996j87685L74119L65565j19787m2756J8273J26161
13890i3406l9061Q4922J18416O3428j54111m44423k03132Q2905K26871O7736J03635
$$ plain form
13962 341888 232629 473716 565595 211366 -213495 -76972 -186632 -335495 -285693 -139617
13952 -139617 70471 189783 246418 251020 444850 335469 236421 -19969 -105719 11992
13942 11992 216971 150686 -115205 -181390 -283492 -420582 -226297 -370804 -294694 -67788
13932 -67788 47677 311299 506524 304927 160519 194411 171541 307818 313097 84476
13922 84476 -288340 -321156 -324378 -227280 -172962 -193299 -109759 -114988 -242886 -353557 -220717
13911 -220717 -43769 225518 177992 162434 -60934 -223990 -227631 -129738 -194260 -441307 -547327
13900 -547327 -378282 -393300 -627296 -814981 -440862 -75297 -195084 -237840 -219567 -93406
13890 -93406 -132467 -47545 70871 134299 -19812 -464235 -667367 -584462 -357591 -289855 -186220
13879a86220k26270J33224K66372P9328j7710J35087N8557l49975K5176K49236
13869A66805k65001k77846K01987R6756Q4395K3307N412j60909j02201m2973J86344
13858h3924q4961O8454K29602R252j21126J9195k9066P230p5083o6783j55556
13847b82766o7367j36276O3049r1659L7645L44451K05303o2507l3916J6031K9013
13836B1001K52379J09638k97215k78407n9996l3386J20357K25219j71664M2116
13826f9958j71132P8646K8694Q8161j9438j77522r3327Q6719J56443J58136P3210
13815A38632M0803p3994n274P2800Q8326j8356R1553J92465k37811k46193Q5594
13804A28545J1591m8364j63056l2602J62959O4819M911L07676O4181l24508j60972
$$ plain form
13879 -186220 -412490 -279266 -12894 66434 48724 183811 242368 -107607 -82431 166805
13869 166805 -98196 -376042 -174055 -77299 7096 30403 35815 -125094 -227295 -270268 -83924
13858 -83924 -168885 -100431 129171 138423 17297 36492 7426 14656 -60427 -127210 -282766
13847 -282766 -350133 -486409 -423360 -515019 -477374 -132923 72380 9873 -24043 -8012 21001
13836 21001 273380 383018 85803 -192604 -252600 -285986 -165629 59590 -112074 -69958
13826 -69958 -241090 -162444 -133750 -45589 -65027 -242549 -335876 -249157 -92714 65422 138632
13815 138632 179435 105441 100167 172967 261293 242937 334490 526955 289144 42951 128545
13804 128545 140136 91772 -71284 -103886 59073 123892 128803 436479 500660 176152 15180
13793A5180n9738j12705J34602K16286K24234j63150n65104k76409Q292j14371
13783f92883N05447J12369L5154N730O1106M8021O998l004j39638j00243j14687
13772b75630J31489m4437q3117N3008J08884L5284J15582J74077J50024k8638
13762C36526J84456J45021L6945l53972m10911j8698K37083R3171r6722k54472
13752a01573k83948q6902N8054L33405p4954j55803N6735J04913P3052M6612J77457
13741A47048o7493j69147k47918J62715J70160j27157j62470R7381J97347K0120
13731B0586k32275N1967N33464N2922k75515o0688R878k94591k9104J26421k10602
13720c07537l26511J51212M79088L39085N7216J6175l8486r7478l37909K4666
$$ plain form
13793 15180 -44558 -157263 -22661 193625 417859 254709 -310395 -586804 -578512 -692883
13783 -692883 -187436 -75067 -39913 -34183 26923 74944 81942 78938 -60700 -160943 -275630
13772 -275630 -144141 -188578 -271695 -218687 -109803 -74519 41063 215140 365164 336526
13762 336526 520982 666003 702948 348976 -61935 -80633 156450 249621 152899 -101573
13752 -101573 -385521 -472423 -414369 -80964 -155918 -311721 -254986 -150073 -77021 -30409 147048
13741 147048 79555 -89592 -337510 -174795 -4635 -131792 -294262 -196881 466 20586
13731 20586 -211689 -159722 373742 426664 151149 90461 100339 -194252 -223356 -96935 -307537
13720 -307537 -634048 -482836 -3748 335337 392553 408728 370242 272764 -65145 -40479
13710d0479K07202N8177j18449j27935l07066j22075J8271K17978L55190J30267
13700B71081j70833L4682J57766J11903P2665k36208j52392k9453Q6988L31336
13690D77535n1829j64160L0621k12418j20909J02347J86547j55548m29124j78950
13680e15888J89956j89506q5877O5120L90054k75728n2303K58581q6142K3743
13670b77990R8189r304J61422L0444n7131J55966m486L054J54518j51527J48846
13659B52001N5771j74535R5225k34651o4427l2468N3667l5189o5742K17968j7864
13648D9756l33095J01905K96096R7216L4216q4880J91212j41221l42307j69638
13638c00740Q2940j48646j00437R0233J06206j02855J60063K50266l1173N8903
$$ plain form
13710 -40479 166723 224900 106451 -21484 -328550 -450625 -432354 -214376 140814 271081
13700 271081 100248 134930 292696 404599 477264 241056 88664 59211 146199 477535
13690 477535 425706 261546 292167 79749 -41160 61187 247734 92186 -336938 -515888
13680 -515888 -325932 -515438 -601315 -536195 -146141 -421869 -474172 -215591 -301733 -277990
13670 -277990 -179801 -189105 -27683 2761 -54370 101596 97110 100164 254682 103155 252001
13659 252001 307772 133237 228462 -6189 -70616 -103084 -49417 -84606 -150348 67620 49756
13648 49756 -283339 -181434 114662 211878 246094 161214 352426 211205 -131102 -300740
13638 -300740 -217800 -366446 -466883 -376650 -270444 -373299 -213236 37030 5857 64760
13628F4760p8991j10938m54867M2045M02177L83312J7423p3987q3980j8754K33258
13617C21458l52095k15992O3133J57520O7113J34748p9451L1454L9826q0447m8728
13606C8539q6690O728P9590J30686J73875j17416q5800j32719K7428J946J56910
13595A93077M2333r9937k39741K02025n2327q4444J5290j29758K91554J27274
13585B65346m9077P771N6201o8578O0734j00822j94930l5056J15359K36038L9521
13574C32507j74075N7388J82103m7272l0643Q380o3400p2031j54600j87434M5502
13563a03575M6661j59570L404K04868L4332k30257P8219Q5759L3270l772J75765
13552A65104j43789R9662J90014J3585j06735o4435j07426q0523K05826P8891
$$ plain form
13628 64760 -14231 -125169 -580036 -537991 -135814 247498 264921 190934 106954 88200 321458
13617 321458 -30637 -246629 -183496 -25976 41137 175885 96434 127888 167714 87267 38539
13606 38539 -48151 -41423 38167 168853 342728 225312 139512 6793 34221 36167 193077
13595 193077 235410 135473 -104268 97757 45430 -39014 -23724 -153482 138072 265346
13585 265346 216269 224040 280241 211663 272397 171575 -23355 -58411 56948 292986 332507
13574 332507 158432 215820 397923 350651 320008 328388 264988 192957 38357 -149077 -103575
13563 -103575 -56914 -216484 -213080 -8212 26120 -204137 -125918 -40159 -6889 -10661 165104
13552 165104 21315 120977 310991 324576 217841 153406 45980 -34543 171283 250174
13542B50174P768M6477K63807l10617l62789p372k9430P6460P564J11127J91051
13531B44220l1113k79575l7716J09087K1495M8142q8747j78753K32505J21716
13521A61261l16946k3850J02528j75221j57412J30527J74663j8603O7045Q7799
13511C1791r8818J7486O7175O613o7941J64076K8856j97977L36123L16138p8108
13500E25414j98181q4577K08399K14060q8656p2540k31739j69475J53782l05950
13490d9463k03568n1960j50582p198k1677K97508K08954J20565L12371j57990
13480B96960N1832J58283O5422k64122k05508M9593q8921O14J52522M02280j51741
13469D67214m08700r198J94236K1965n0263j29804n2312r0571j62824N1967k8822
$$ plain form
13542 250174 257942 304419 568226 257609 -105180 -112552 -141982 -65522 -57958 53169 244220
13531 244220 213107 -66468 -104184 4903 26398 74540 -14207 -192960 39545 161261
13521 161261 -155685 -179535 -77007 -252228 -409640 -279113 -104450 -123053 -56008 31791
13511 31791 -67027 -49541 17634 24247 -43694 120382 149238 -48739 287384 603522 525414
13500 525414 327233 242656 451055 665115 576459 503919 272180 102705 256487 -49463
13490 -49463 -253031 -304991 -455573 -462771 -484448 -186940 22014 142579 454950 296960
13480 296960 348792 507075 572497 308375 102867 152460 63539 64153 216675 618955 467214
13469 467214 58514 49316 243552 265517 215254 85450 33138 -57433 -220257 -168290 -197112
13458a97112l537M0740p9951J93926O5139k9983j15926j53465j7648j50229K99394
13447a48652O2539j77604K26537L42110Q7772j73233k69781k23776J18151j80083
13437c36020q0944K7305L43382K23482k7975r2302j55610J55102o3910r0966j00782
13426a99238J13938l8957J94056K34026O2466m8980j99482k01443J7408j14212
13416a80418r8410N8431M15363Q2561J92138p2324j30717p6336J83764l450O8445
13405D39047J8682n6854m9110j03347k94615j57064k4243J43582K22100p4616
13395F3562o5294P4161K3934O419q9131M993J27191K83588j31058p5261q5771
13384A37333j02765J24781J42177l01010j01334R4598P9492k2651O5824j59643
$$ plain form
13458 -197112 -200649 -159909 -239860 -45934 19205 -10778 -126704 -280169 -297817 -448046 -148652
13447 -148652 -86113 -263717 -37180 304930 392702 219469 -50312 -274088 -155937 -336020
13437 -336020 -416964 -389659 -46277 177205 149230 56928 -98682 56420 -7490 -98456 -199238
13426 -199238 -85300 -124257 69799 303825 366291 317311 117829 -83614 -66206 -180418
13416 -180418 -278828 -220397 194966 277527 469665 397341 266624 190288 374052 370602 439047
13405 439047 457729 400875 351765 248418 -46197 -203261 -227504 -83922 138178 63562
13395 63562 -1732 72429 96363 102782 13651 18644 145835 429423 298365 223104 137333
13384 137333 34568 159349 301526 516 -100818 -6220 73272 50621 116445 -43198
13374d3198n1233J6188j9750M2656j5590Q3740L50875l01384r6569j57518L810
13363a87973Q7537j82032j7129M4523J96459L20095J55200J0236l11541l9844
13353G5531q8765J87361J17610L2910m19232m20441n2015L75713L62930J49583
13343C21185M7701l70449o0245n2508m0178K35275Q7390r3896j08778K42123J33361
13332C40981n6461j53150j27701r9550k81145K62857J04699O2820m0092j38947
13322a25689M2157R6576J15744q5292l16279m0984l9503J98939J43143m0153J77367
13311A26026O399J2353J44736j45544J18064k30872q8131j64764Q315J09070j76362
13300b80710J89077O1091J15643j69153k25415k6691L24929K04353k38718J4163
$$ plain form
13374 -43198 -94431 -78243 -97993 -55337 -70927 12813 363688 62304 -34265 -191783 -187973
13363 -187973 -100436 -282468 -299597 -255074 -58615 261480 416680 426916 115375 75531
13353 75531 -13234 174127 291737 324647 -94585 -515026 -567041 -191328 171602 321185
13343 321185 368886 -1563 -61808 -114316 -154494 80781 168171 74275 -34503 207620 340981
13332 340981 284520 131370 3669 -95881 -377026 -114169 -9470 53350 13258 -125689
13322 -125689 -83532 13044 128788 43496 -272783 -313767 -353270 -154331 -11188 -51341 126026
13311 126026 132425 144778 289514 143970 262034 31162 -56969 -221733 -213418 -104348 -280710
13300 -280710 -91633 -30542 85101 -84052 -309467 -336158 -11229 193124 -45594 -31431
13290c1431J69743L2650J03761K3927n7593j37572l13178l66417r9754L74323
13280c01541N5648k02675K06006m679l2990R0102J20972L22153N8912j53779m53126
13269b94997k5133R5268K59665J97980J31290q282j30131K5237l03339k9687q2159
13258a64288l730k2210j9103J15256J19423k28737R1997p9695J36236K63048L35770
13247E43967q7038k79079M5836J41819q4041m3796j69083k86558j56345K47198
13237a27120J85429K2632l2229j659p5890Q8782K43795k59974k56544N93m9010
13226b61195j86004J24810K52643K44474M4062j36558o0896L3570J13075j23866
13216D4115m4428J35467J82497m8510j74772q8646N7076k67368j02758r8898p4482
$$ plain form
13290 -31431 138312 170962 274723 298650 241057 103485 -209693 -576110 -675864 -301541
13280 -301541 -245893 -448568 -242562 -247241 -280231 -190129 -69157 252996 311908 158129 -294997
13269 -294997 -320130 -224862 34803 232783 364073 355791 225660 250897 -52442 -82129 -164288
13258 -164288 -168018 -190228 -209331 -94075 25348 -203389 -111392 -191087 -54851 208197 543967
13247 543967 456929 177850 223686 365505 281464 237668 68585 -217973 -374318 -127120
13237 -127120 58309 80941 48712 47053 -28837 59945 303740 43766 -212778 -212185 -261195
13226 -261195 -447199 -322389 -69746 174728 218790 82232 21336 54906 167981 44115
13216 44115 -313 135154 317651 269141 94369 5723 62799 -204569 -307327 -406225 -480707
13205d80707K41474J46627k7273p2408K4550L8164n5879L5171J59369n2442J31133
13194H7779J65466j2449r332J85706K2842o1118R611O6805j6011j31530l08127
13183c58J9819q8728M7542n1306m16M365L8927J63179J61745P0339k84074l17978
13171b36944l51400J06197M22597J56365k7k9914n4173l78353j4628L65708J83590
13160A69018l2375k80551j41343K44851M8367j33800n6775n8510K61262j05029
13150h4885j64458j65023J84565K09494J94011l58381l15343O8082L17838n5237
13140a69337r0019L2863R9511q1379J60620K47601j62206j88051J01800K97759
13130B49162J03350j27747n0142J5924j78276r5183J4198J20017J08932L9092
$$ plain form
13205 -480707 -239233 -92606 -119879 -192287 -167737 -129573 -185452 -150281 9088 -43354 87779
13194 87779 253245 240796 231464 417170 440012 378894 388505 455310 439299 307769 -358
13183 -358 19461 -69267 -21725 -73031 -73447 -69082 -30155 133024 294769 365108 81034 -236944
13171 -236944 -588344 -482147 -59550 96815 96788 66874 12701 -365652 -380280 -14572 169018
13160 169018 136643 -143908 -285251 -40400 7967 -125833 -182608 -241118 20144 -84885
13150 -84885 -249343 -414366 -229801 -20307 173704 -184677 -500020 -431938 -114100 -169337
13140 -169337 -259356 -226493 -126982 -208361 -47741 199860 37654 -150397 -48597 249162
13130 249162 352512 224765 174623 190547 12271 -82912 -68714 51303 160235 199327
13120A99327P1409l9978m1897p5900j35666J11219N0433K4696p9974j15727j26770
13109a58828j83853K00560M2851L7685N8099J57868o5316J552K9958j20166j61110
13098a60700J09264J11725j25913J15638O0916k59032j35363J21682J28567P182
13088b6034l0042l2238n2009K30042J93373L37424L7579l88746j02099J64527
13078C31777K86548J609j66703k9112k5739j71768j53536J83707k05986k98860
13068b48063p5329J89839J74077O2920j10230p3496L19062r0446p243j72485m02901
13057d34295m076N19378J01412M8345J6710K81412J65568k13817j27956j42738
13047B09943k4038p1659k37859o5189L17132k45275l4087O4502L8437J62339M6208
$$ plain form
13120 199327 270736 230758 188861 112961 -22705 88514 138947 163643 83669 -32058 -158828
13109 -158828 -342681 -142121 -99270 -61585 -3486 154382 89066 90618 120576 410 -160700
13098 -160700 -51436 60289 -65624 50014 110930 -148102 -283465 -161783 -33216 -26034
13088 -26034 -56076 -88314 -140323 89719 283092 620516 658095 269349 167250 331777
13078 331777 618325 619934 453231 424119 398380 226612 73076 256783 50797 -248063
13068 -248063 -323392 -133553 40524 103444 -6786 -80282 238780 148334 141091 -31394 -434295
13057 -434295 -438371 81007 182419 230764 247474 528886 694454 480637 352681 209943
13047 209943 185905 114246 -123613 -188802 128330 -116945 -151032 -86530 -48093 114246 160454
13036A60454k7899L96830O3009l05987k71899O5539J13206J8202J03730k86100
13026B9085k24197O0855J75415L51802K9883L5504j62943l04695k31283n731J65176
$$ plain form
13036 160454 132555 529385 592394 286407 14508 80047 193253 211455 315185 29085
13026 29085 -195112 -134257 41158 392960 422843 458347 295404 -9291 -240574 -246305 -81129
$$ [...]
##END NTUPLES=NMR SPECTRUM
##END=
