##TITLE=Analysis number 329910
Compound Code cc 67804
Book Reference 521/115
Project Code adrs
Chemist Name evam
##JCAMPDX= 6.0         $$ Bruker NMR JCAMP-DX V2.0
##DATA TYPE= NMR SPECTRUM
##DATA CLASS= NTUPLES
##ORIGIN= Bruker BioSpin GmbH
##OWNER= nmr
$$ XWIN-NMR		Version 3.5
$$ Wed Oct 10 14:27:12 2007 GMT Daylight Time (UT+1h)  MAYBRIDGE\nmr@NMR_250MHZ
##.OBSERVE FREQUENCY= 250.131544655141
##.OBSERVE NUCLEUS= ^1H
##.ACQUISITION MODE= SIMULTANEOUS (DQD)
##.ACQUISITION SCHEME= undefined
##.AVERAGES= 16
##.DIGITISER RES= 18
##SPECTROMETER/DATA SYSTEM= dpx250
##.PULSE SEQUENCE= zg30
##.SOLVENT NAME= CDCl3
##.SHIFT REFERENCE= (INTERNAL, CDCl3, 0, 16.522)
##AUDIT TRAIL= $$ (NUMBER, WHEN, WHO, WHERE, WHAT)
$$ ##TITLE= Audit trail, XWIN-NMR		Version 3.5
$$ ##JCAMPDX= 5.01
$$ ##ORIGIN= Bruker BioSpin GmbH
$$ ##OWNER= nmr
$$ C:\u/data/dgb/nmr/ADRS/630/pdata/1/auditp.txt
$$ ##AUDIT TRAIL=  $$ (NUMBER, WHEN, WHO, WHERE, WHAT)
(   1,<2007-10-10 14:26:41.67 +100>,<MAYBRIDGE\nmr>,<NMR_250MHZ>,
      <created by zg, POWCHK disabled, PULCHK disabled
       configuration hash MD5:
       76 6E 9A 78 1E 09 19 81 EC 84 63 8F B0 6A 59 2D
       data hash MD5: 64K
       9D B1 C5 D5 9B 6D 14 F0 54 BE 44 5F FB C4 EA EF>)
(   2,<2007-10-10 14:26:57.00 +100>,<MAYBRIDGE\nmr>,<NMR_250MHZ>,
      <Start of raw data processing
       ef LB = 0.3 FT_mod = 6 PKNL = 1 SI = 32K 
       data hash MD5: 32K
       74 8E 9E 98 3E 05 CD 3E E8 32 35 77 84 3E 24 AE>)
(   3,<2007-10-10 14:26:58.70 +100>,<MAYBRIDGE\nmr>,<NMR_250MHZ>,
      <apk 
       data hash MD5: 32K
       51 67 4D 9F 68 83 CF D1 E1 F7 1B E0 8D 0B 46 7C>)
(   4,<2007-10-10 14:27:00.06 +100>,<MAYBRIDGE\nmr>,<NMR_250MHZ>,
      <abs ABSG = 5 
       data hash MD5: 32K
       7A 14 31 C1 7E 7D 90 D3 08 9F 23 BB CA 5B 66 EF>)
$$ ##END=
$$ 
$$ hash MD5
$$ 08 A8 F0 9B F6 EA DC 8E 50 05 D3 24 7A A5 24 D1
##$RELAX= 
##$RELAX= 
##$RELAX= 
##$RELAX= 
##$RELAX= 
##$RELAX= 
##$RELAX= 
$$ Bruker specific parameters
$$ --------------------------
##$DU= <C:\u>
##$EXPNO= 630
##$NAME= <ADRS>
##$PROCNO= 1
##$TYPE= <nmr>
##$USER= <dgb>
##$AMP= (0..31)
100 100 100 100 100 100 100 100 100 100 100 100 100 100 100 100 100 100 
100 100 100 100 100 100 100 100 100 100 100 100 100 100 
##$AQSEQ= 0
##$AQ_mod= 3
##$AUNM= <au_zg>
##$AUTOPOS= <25 >
##$BF1= 250.13
##$BF2= 250.13
##$BF3= 250.13
##$BF4= 250.13
##$BF5= 500.13
##$BF6= 500.13
##$BF7= 500.13
##$BF8= 500.13
##$BYTORDA= 1
##$CFDGTYP= 0
##$CFRGTYP= 5
##$CHEMSTR= <none>
##$CNST= (0..31)
1 1 145 1 1 1 1 1 1 1 1 1 1 1 1 1 1 1 1 1 1 1 1 1 1 1 1 1 1 1 1 1 
##$CPDPRG= <>
##$CPDPRG1= <>
##$CPDPRG2= <>
##$CPDPRG3= <>
##$CPDPRG4= <mlev>
##$CPDPRG5= <mlev>
##$CPDPRG6= <mlev>
##$CPDPRG7= <mlev>
##$CPDPRG8= <mlev>
##$CPDPRGB= <>
##$CPDPRGT= <>
##$D= (0..31)
0 1 0 0 0 0 0 0 0 0.06 0 0 0 0 0 0 0.0002 0 0 0 0 0 0 0 0 0 0 0 0 0 0 
0 
##$DATE= 1192022800
##$DBL= (0..7)
120 120 120 120 120 120 120 120 
##$DBP= (0..7)
150 150 150 150 150 150 150 150 
##$DBP07= 0
##$DBPNAM0= <>
##$DBPNAM1= <>
$$ [...]
##$SUBNAM7= <"">
##$SUBNAM8= <"">
##$SUBNAM9= <"">
##$SW= 20.6930455092707
##$SWIBOX= (0..15)
0 0 3 0 0 0 0 0 0 0 0 0 0 0 0 0 
##$SW_h= 5175.983436853
##$TD= 65536
##$TD0= 1
##$TE= 296.16
##$TE2= 300
##$TE3= 300
##$TEG= 300
##$TL= (0..7)
0 120 120 120 120 120 120 120 
##$TP= (0..7)
150 150 150 150 150 150 150 150 
##$TP07= 0
##$TPNAME0= <>
##$TPNAME1= <>
##$TPNAME2= <>
##$TPNAME3= <>
##$TPNAME4= <>
##$TPNAME5= <>
##$TPNAME6= <>
##$TPNAME7= <>
##$TPOAL= (0..7)
0.5 0.5 0.5 0.5 0.5 0.5 0.5 0.5 
##$TPOFFS= (0..7)
0 0 0 0 0 0 0 0 
##$TUNHIN= 0
##$TUNHOUT= 0
##$TUNXOUT= 0
##$USERA1= <user>
##$USERA2= <user>
##$USERA3= <user>
##$USERA4= <user>
##$USERA5= <user>
##$V9= 5
##$VALIST= <valist>
##$VCLIST= <CCCCCCCCCCCCCCC>
##$VD= 0
##$VDLIST= <DDDDDDDDDDDDDDD>
##$VPLIST= <PPPPPPPPPPPPPPP>
##$VTLIST= <TTTTTTTTTTTTTTT>
##$WBST= 1024
##$WBSW= 4
##$XGAIN= (0..3)
0 0 0 0 
##$XL= 0
##$YL= 0
##$YMAX_a= 338986
##$YMIN_a= -426232
##$ZGOPTNS= <>
##$ZL1= 120
##$ZL2= 120
##$ZL3= 120
##$ZL4= 120
##$ABSF1= 16.522
##$ABSF2= -4.171173
##$ABSG= 5
##$ABSL= 3
##$ALPHA= 0
##$AQORDER= 0
##$ASSFAC= 0
##$ASSFACI= 0
##$ASSFACX= 0
##$ASSWID= 0
##$AUNMP= <proc_1d>
##$AZFE= 0.1
##$AZFW= 0.1
##$BCFW= 0
##$BC_mod= 0
##$BYTORDP= 0
##$COROFFS= 0
##$CY= 12.5
##$DATMOD= 1
##$DC= 0
##$DFILT= <>
##$DTYPP= 0
##$F1P= 14.0000005364418
##$F2P= -0.99999901652339
##$FCOR= 0.5
##$FTSIZE= 32768
##$FT_mod= 6
##$GAMMA= 0
##$GB= 0
##$INTBC= 1
##$INTSCL= 1
##$ISEN= 128
##$LB= 0.3
##$LEV0= 0
##$LPBIN= 0
##$MAXI= 10000
##$MC2= 0
##$MEAN= 0
##$ME_mod= 0
##$MI= 0
##$NCOEF= 0
##$NC_proc= -4
##$NLEV= 6
##$NOISF1= 0
##$NOISF2= 0
##$NSP= 0
##$NTH_PI= 0
##$NZP= 0
##$OFFSET= 16.522
##$PC= 1
##$PHC0= 160.1401
##$PHC1= 5.816028
##$PH_mod= 1
##$PKNL= yes
##$PPARMOD= 0
##$PSCAL= 4
##$PSIGN= 0
##$REVERSE= no
##$SF= 250.13
##$SI= 32768
##$SIGF1= 0
##$SIGF2= 0
##$SINO= 400
##$SIOLD= 32768
##$SREGLST= <1H.CDCl3>
##$SSB= 0
##$STSI= 32768
##$STSR= 0
##$SW_p= 5175.98343685301
##$SYMM= 0
##$S_DEV= 0
##$TDeff= 65536
##$TDoff= 0
##$TI= <Analysis number 999999
Compound Code 99
Book Reference 9
Project Code 9>
##$TILT= no
##$TM1= 0
##$TM2= 0
##$TOPLEV= 0
##$USERP1= <user>
##$USERP2= <user>
##$USERP3= <user>
##$USERP4= <user>
##$USERP5= <user>
##$WDW= 1
##$XDIM= 32768
##$YMAX_p= 419531644
##$YMIN_p= -336164
$$ End of Bruker specific parameters
$$ ---------------------------------
##NTUPLES= NMR SPECTRUM
##VAR_NAME=  FREQUENCY,     SPECTRUM/REAL,   SPECTRUM/IMAG
##SYMBOL=    X,             R,               I
##VAR_TYPE=  INDEPENDENT,   DEPENDENT,       DEPENDENT
##VAR_FORM=  AFFN,          ASDF,            ASDF
##VAR_DIM=   32768,         32768,           32768
##UNITS=     HZ,            ARBITRARY UNITS, ARBITRARY UNITS
##FACTOR=    0.157963299565203, 1,           1
##FIRST=     4132.6476996994, 0,             0
##LAST=      -1043.33573715361, 0,           0
##MIN=       -1043.33573715361, -336164,     0
##MAX=       4132.6476996994, 419531644,     0
$$ Real data points
##PAGE= N=1
##DATA TABLE= (X++(R..R)), XYDATA
$$ [...]
24747D1362L7663o3425l7929Q0261k8353m0414L2651Q2117N2471m480r8525o4960
24735a1561j60N6690n1247o754Q9221M0056p7983j13153o8753O529R6261J660
24723c9194L7781m4189j3327r105m4599o0723L177J00396J517J9053J7420K7718
24711d075m2648p5275K8406K7379N3156P8116L7257m1144o8803l7691k1452P3031
24699F257m1801k5191O5442K0208p9485r4228K8210M0827L4398L6166l4750M5482
24687A535L5305p124o6103M7758K3887N0874M8358q506q682q2273l5337J4240
24675A3932l5981n8224O390j643L9328j3992l3163o2988n564Q9907k011K0575
24663d3434Q019L2208k9240l0799K2739K3720j5143K0558O8347k8162r4254l8527
$$ plain form
24747 41362 79025 15600 -22329 57932 29579 -10835 21816 103933 156404 151924 53399 -11561
24735 -11561 -11721 44969 -6278 -13032 76189 116245 38262 -74891 -143644 -137115 -40854 -39194
24723 -39194 -1413 -45602 -58929 -68034 -112633 -173356 -170179 -69783 -68266 -49213 -31793 -4075
24711 -4075 -46723 -121998 -93592 -66213 -13057 65059 102316 61172 -7631 -45322 -66774 6257
24699 6257 -35544 -60735 4707 24915 -54570 -148798 -120588 -79761 -45363 -9197 -43947 1535
24687 1535 36840 29716 -36387 11371 35258 86132 134490 125984 117302 35029 -308 13932
24675 13932 -22049 -80273 -73883 -75526 -36198 -50190 -83353 -146341 -151905 -61998 -64009 -43434
24663 -43434 -35415 -3207 -32447 -63246 -40507 -16787 -31930 -11372 56975 28813 -65441 -103968
24651a03968p4467M1418J5016M9364j8767l4516J08967j3655O199r1052J6949
24640i8512J6644R2639N2414K8097K7501j0228m0167O9840L7743p0993j07514
24629b536p4021m5065J03493K8914m6216M997M8305l521K326n6902o0447Q876
24617i1797M2218J15304k4354J2140O3200J435J2360r9179r5714r1192l8409m356
24605a98344J08162M4911L2914J8339n084k7076n0957N28J7352j3743P7863J4749
24593A9614J3211j6693l6934j1728q482j1100k4617r3L6311K4393M2721N006J8797
24580E0406m9278k7001O521m020K6569K4362r7651k1161O4604J09640R041j25588
24568c3556p933M2565O97K4368j1355n2421j1525n771L8991o5181K9740J37006
$$ plain form
24651 -103968 -178435 -137017 -122001 -72637 -91404 -125920 -16953 -30608 -24409 -115461 -98512
24640 -98512 -81868 10771 63185 91282 118783 108555 68388 138228 175971 104978 -2536
24629 -2536 -76557 -121622 -18129 10785 -35431 -30434 17871 14350 16676 -40226 -100673 -91797
24617 -91797 -49579 65725 41371 53511 116711 118146 130506 31327 -64387 -155579 -193988 -198344
24605 -198344 -90182 -45271 -12357 5982 898 -26178 -77135 -76607 -59255 -72998 4865 19614
24593 19614 32825 16132 -20802 -32530 -41012 -52112 -76729 -76822 -40511 -16118 26603 31609 50406
24580 50406 1128 -25873 -19352 -23372 3197 27559 -70092 -91253 -26649 82991 92032 -33556
24568 -33556 -41489 1076 1773 26141 14786 -37635 -49160 -54931 -15940 -81121 -51381 85625
24556H5625R6499M9967k7969o9645j45866k2055o952j2531j8488j8370P8955J19242
24544A08412j9885q3601j6143m1313o513m0406J09541P3850o3290j74308J6098
24533a37558O315J5251J01136R6250O7545k4368L0596r0026m2570L4888m7353
24522A0106J7395K7988k1307J0916p951m3196m783l7339k7347N765K4869l7374
24510h2258j847M2951n5600p0660J5022O8903Q008l0904l4130L0756O5715k1716
24498f5760R537j7732K2007K7694j955N5107l8606m7657k7294M0919l4359l4525
24486a12624N2963P8313j1851j00945q881R2651J24152O1552o086J0476o903m7268
24474A25549j35392R619o6712L1898M6693L1721N6337m6916p490J5133m5111M3740
$$ plain form
24556 85625 182124 232091 204122 134477 -11389 -33444 -40396 -52927 -71415 -89785 -10830 108412
24544 108412 88527 4926 -11217 -52530 -59043 -99449 10092 83942 20652 -153656 -137558
24533 -137558 -131243 -115992 -14856 81394 148939 124571 155167 65141 22571 57459 10106
24522 10106 27501 55489 34182 45098 37147 -6049 -10832 -48171 -75518 -69753 -44884 -82258
24510 -82258 -84105 -41154 -96754 -167414 -152392 -83489 -75481 -106385 -140515 -109759 -44044 -65760
24498 -65760 -56223 -73955 -51948 -24254 -26209 28898 -9708 -57365 -84659 -43740 -78099 -112624
24486 -112624 -59661 18652 6801 -94144 -103025 -10374 113778 175330 169244 179720 172817 125549
24474 125549 -9843 -224 -66936 -35038 11655 43376 99713 52797 45307 60440 15329 59069
24462E9069L1870k2256m378K192K4616m7560p1613j7428J7989L8760J442K3045
24450C5748q6654o296K4378M835L3485N1164p73q2451N0211J53754J438q0048
24438I8791l8232K6414m678L0096q0724p7411J6537l454R609m7100L0401J08610
24426F8859P6934k8707M2470Q795o7146n8420M1660m3818k2268l060L0945M248
24414E0492K4365j4608j6628k3913K2188k3590k949j8241m1731m4080l4746O0325
24402f3116Q0389M8026k5179o2188K3862m1792k3194K399P2424J8520q3257M6718
24390f388k7861J3005K0619r696n2104M0170m2952J024Q5841J7369j4673N652
24378C0006o5052O9956N4066j0715N4368k6841m9296n6906N3040j1053K5135m2471
$$ plain form
24462 59069 90939 68683 64305 66497 91113 43553 -28060 -45488 -27499 11261 12703 35748
24450 35748 -50906 -57202 -32824 -27989 5496 56660 55887 -26564 23647 177401 178839 98791
24438 98791 60559 86973 82295 112391 31667 -45744 -29207 -32661 -23052 -70152 -39751 68859
24426 68859 145793 117086 159556 168351 101205 42785 84445 40627 18359 15299 46244 50492
24414 50492 74857 60249 43621 19708 41896 18306 15357 -2884 -44615 -88695 -123441 -63116
24402 -63116 17273 65299 40120 -22068 1794 -39998 -63192 -60793 11631 30151 -53106 -6388
24390 -6388 -34249 -21244 -625 -10321 -62425 -22255 -65207 -64183 21658 39027 24354 30006
24378 30006 -35046 34910 88976 78261 132629 105788 56492 -414 52626 41573 66708 24237
24366B4237j3390k9658N3087l3545m7527M9688J3888K731k461L2634N8236L0999
24354A38919p7259l1789L2875j5521R846q848L9900Q0331P1743m0516o8032o5810
24342F5839l9161O174q1911J2367l3606l7864Q005K8837L7909R9203l505J1265
24330G3552j2568M0173l0601j47235p741O6956N1348p3076q1853n8248N8035Q1821
24318c9437N6454j2422k4850L0625P4117L3236Q402n0331K6738q276j963j2609
24306G9684R094l9803o8565k1533l4905p3212M2006J8696L7067j429N4630J8628
24294B0358q356q1086K6207O0470r0084q7327p4340K4486R723L6701Q946J8249
24282a36053j392K2239R3574N1631L3445l5553r3536m4829L4810L4018O2390M4066
$$ plain form
24366 24237 10847 -18811 34276 731 -46796 2892 16780 19511 17050 49684 107920 138919
24354 138919 61660 29871 62746 47225 57071 48223 88123 168454 240197 199681 131649 65839
24342 65839 26678 32852 -49059 -36692 -70298 -108162 -100157 -71320 -33411 65792 62287 73552
24330 73552 60984 101157 70556 -76679 -84420 -17464 33884 -39192 -121045 -179293 -121258 -39437
24318 -39437 17017 4595 -20255 10370 84487 117723 126125 75794 102532 94256 92293 79684
24306 79684 88778 48975 -19590 -41123 -76028 -149240 -107234 -88538 -51471 -52900 1730 20358
24294 20358 12002 -69084 -42877 17593 -72491 -159818 -234158 -209672 -199949 -163248 -154302 -136053
24282 -136053 -137445 -115206 -21632 29999 63444 27891 -65645 -110474 -75664 -41646 20744 64810
24270F4810O696p3016l2264K3747J04274q641j29370j28540K1387P321O7884O1755
24258a3957N2785k1637l1765k9984m7553L9307O4983Q7168P172o7499P2406l6570
24246G4856L1901K6500p1436o6142K59J8010M579m382k653J5086j6679k0497q916
24233a9514O5861k1134L191K9234K3940l1369k4413l7410R409O5127L7285k2194
24221G8013q1348M3256j2221n5399j04029p188N1923J4957o7988j8798L4054Q7253
24209c7515K1702J8763j9311k0168K0919K2944p2492P7666L5075n2821p5155k6365
24197a06758J6806l52j1194O811Q3596Q444N5809k4197n7774j067R0220m0165
24185B0179J7492l382l2314N7680k4561L743J2950j7393o1808l1672Q2407m586
$$ plain form
24270 64810 71506 -1510 -33774 -10027 94247 85606 -43764 -172304 -150917 -143596 -75712 -13957
24258 -13957 38828 17191 -14574 -44558 -92111 -52804 12179 99347 106519 39020 111426 74856
24246 74856 106757 133257 61821 -4321 -4062 13948 18527 14145 11492 26578 9899 -10598 -19514
24233 -19514 46347 25213 28404 57638 81578 50209 25796 -11614 -2205 62922 100207 78013
24221 78013 -3335 39921 27700 -27699 -131728 -138916 -86993 -72036 -140024 -158822 -124768 -37515
24209 -37515 -15813 2950 -16361 -36529 -15610 7334 -65158 12508 47583 -5238 -80393 -106758
24197 -106758 -89952 -90304 -101498 -94687 -11091 -2647 53162 28965 -28809 -29876 60344 20179
24185 20179 37671 34289 1975 59655 35094 38837 51787 34394 -27414 -59086 23321 18735
24173A8735k57L8447m498p2735J9142o1967k7128Q5392O4596r3453J2961l4029
24161e4794P7Q2653O4356j3778n3229N7207k4673n888R9088N8117j7132q1671
24149A10333j12085k9261J3795M302K4179M0253O3338k7625K174q0890n0583L9033
24137c037n7425k7846M4540O0930k1394l9688L0349M9703r2211n0889O1824J03273
24125E8129R8904j736o3019o4436n6159L088j5030j2341j9384M0193J4955n816
24113b2652Q6206M0335N4841J0240o7417r1659Q562j1998l4394O6724j7811j04942
24101h3965M513J3836m9038r3616P2531J44500O0248j8702l5819L2027j0200j5155
24089B1160P307k3370L4408p369n9720j4563O0338j2462R3011j7141n5518m3999
$$ plain form
24173 18735 18478 56925 52427 -20308 -1166 -63133 -90261 -4869 59727 -33726 -20765 -54794
24161 -54794 -54717 27936 92292 78514 25285 82492 57819 51931 151019 209136 192004 110333
24149 110333 -1752 -31013 -17218 -12916 11263 51516 114854 87229 89403 8513 -42070 -3037
24137 -3037 -60462 -88308 -43768 17162 -4232 -43920 -13571 36132 -56079 -106968 -45144 58129
24125 58129 157033 155297 92278 27842 -28317 -25229 -40259 -52600 -71984 -31791 -16836 -22652
24113 -22652 63554 103889 158730 168970 101553 9894 18456 6458 -27936 38788 20977 -83965
24101 -83965 -79452 -65616 -114654 -208270 -135739 8761 69009 50307 14488 46515 36315 21160
24089 21160 28467 5097 39505 32136 -27584 -42147 18191 5729 98740 81599 26081 -17918
24077a7918o0233J4788q239K6682J18141N4629P250K3265N2356l6915o062m6931
24065A20813o1544o2596r93K3104o8763M5736N6578n0333o5815K421L4689l8424
24053f5127j6303P1856L7530m655j5215o567M8298M2479P3673n0465J937n1182
24041F6259q7365q169l4162L8243J12515O0564m2303l6154k4921p2588N9796n6613
24029b4898N5695M7145J279K9943j4323p7904j6598J19839O5872r1197j18052
24018b3199m0189q476J14454M6426j1318l0655L7674N2790n8442p1532j11181
24007a03648m1139M2889P1536M2865J25436M9886l1846J1804j3925j04758n4960
23996e860m7705K0613O3301J6467j5370J2770J2535k3740p8329j7648j2428o1083
$$ plain form
24077 -17918 -78151 -63363 -71602 -44920 73221 127850 135100 158365 210721 173806 167744 120813
24065 120813 59269 -3327 -4320 18784 -49979 -4243 52335 2002 -63813 -61392 -26703 -65127
24053 -65127 -81430 -9574 27956 23301 8086 1519 49817 92296 165969 115504 117441 66259
24041 66259 -21106 -29275 -63437 -25194 87321 147885 105582 69428 44507 -28081 31715 -24898
24029 -24898 30797 77942 79221 109164 94841 16937 339 120178 186050 94853 -23199
24018 -23199 -63388 -71864 42590 89016 77698 47043 84717 137507 79065 7533 -103648
24007 -103648 -144787 -101898 -30362 12503 137939 187825 155979 167783 153858 49100 -5860
23996 -5860 -53565 -32952 30349 46816 31446 44216 56751 33011 -45318 -62966 -75394 -136477
23984a36477N4745N0276J5845K5996M6567n1764k8355O9720K9797J4211m0552
23973E0009k9407l3282m0922N4429m4228M9889M0667m4239j1263K0868j6783J7707
23961A3445J3284j5703J0127j1689Q6098o559Q975m7496n0392K5221n2658n4608
23949h1955J31005J31274k1008p5430j17302n0044Q442l461P8009O8563K2172
23938I0265m228M0670k0516p1159o6037Q3350j2676n1143j17272N8362N8351m1920
23926e3953k6374K5200k0701K4929J6865n2569m8324M2727q044J6931N5907L2480
23914E074l0035j6502q5561l2113j1004O5001P1325K5277M6747L1143K917n6262
23902A6007r5708j8221O7026K165q1930O758M9342R0384J0376R013j6433J4220
$$ plain form
23984 -136477 -81732 -31456 -15611 10385 56952 5188 -23167 46553 76350 90561 50009
23973 50009 20602 -12680 -53602 827 -43401 6488 47155 2916 -8347 12521 -4262 13445
23961 13445 26729 11026 21153 9464 95562 89003 97978 50482 90 25311 -27347 -81955
23949 -81955 49050 180324 159316 83886 -33416 -83460 -75018 -78479 -470 68093 90265
23938 90265 86037 126707 106191 35032 -31005 52345 39669 -11474 -128746 -70384 -12033 -53953
23926 -53953 -80327 -55127 -75828 -50899 -34034 -86603 -134927 -92200 -100244 -83313 -27406 5074
23914 5074 -24961 -41463 -127024 -159137 -170141 -105140 -33815 -8538 38209 69352 72269 16007
23902 16007 -79701 -97922 -30896 -28731 -110661 -103903 -54561 35823 46199 55212 38779 52999
23890E2999O225L5166m3510n3455l8486M020n047K8091l028o5248N0369O6351
23878C4447L8385P9086K2956m1540k9376o045r5728m2847k7711N0106R0164m6105
23866B5792n3821N932J16838L6612j49678r2984J1689O8799L5115J511P3944K8254
23854A08003j14004l4625J04775L8849N6353j17485q3327m4991n7198J8041P4096
23843e1513J05582M1327J5072p3853l9550j2805j2p9044m7470J34865P1824j9187
23831D5236m054r3478J7636j1430O6274j5331o8848P1062j6616K2636N9965M2100
23819A15152j6479q8168L873Q1393L2975p7588m1156l2509m6339n0652J4769m0980
23807a45709k0933l5155M53J02394M5739l3846p6014j8604j4093P9902J36075
$$ plain form
23890 52999 59224 94390 50880 -2575 -41061 -37041 -42088 -13997 -17025 -82273 -31904 34447
23878 34447 72832 151918 174874 133334 103958 97913 2185 -40662 -68373 -18267 71897 25792
23866 25792 -28029 -22097 94741 131353 -18325 -111309 -99620 -30821 4294 5805 79749 108003
23854 108003 -6001 -40626 64149 102998 159351 41866 -41461 -86452 -143650 -125609 -51513
23843 -51513 54069 95396 110468 36615 -2935 -15740 -15752 -94796 -142266 -7401 64423 45236
23831 45236 41182 -52296 -34660 -46090 20184 4853 -63995 7067 -9549 13087 73052 115152
23819 115152 98673 10505 14378 95771 128746 51158 10002 -22507 -68846 -119498 -104729 -145709
23807 -145709 -166642 -201797 -201344 -98950 -53211 -87057 -163071 -181675 -195768 -115866 20209
23796B0209N2164q7972j8815J9325K530M4088P3084l490j08543l0433P6269M5623
23784H4039r4699r7700Q3900n4635l0351L7520J6206J00217Q7982M7178j441n6129
23772A22087j50784m0571Q3175L1187p7417m8576M0672Q2218M4794j260p590j15971
23760c8036o6061J07754K8262K1047J5438q5799o1612K0731O3358k7633J8140
23749d411j7146m359n609P5912P6657l0328r5793k9510k1797M475l1841o6177
23737a49927L8081J338N2936K8285O826m6595M695O1735Q277R3830M8775n1835
23725I6421p5449j9768n0079l7327J7320Q8502L6199k1055o898N8O7109m925q300
23712H1808p356j6202k1262k6552O544L6320j2807m9080p2887n1514K4421K8689
$$ plain form
23796 20209 72373 -15599 -34414 -15089 -12559 31529 104613 101123 -7420 -37853 38416 84039
23784 84039 -10660 -108360 -24460 -79095 -109446 -71926 -55720 44497 132479 179657 178216 122087
23772 122087 -28697 -69268 13907 45094 -32323 -80899 -40227 41991 86785 85525 77935 -38036
23760 -38036 -104097 3657 31919 52966 68404 -17395 -79007 -58276 5082 -22551 -4411
23749 -4411 -21557 -25916 -31525 44387 121044 90716 -5077 -34587 -56384 -51909 -83750 -149927
23737 -149927 -111846 -110508 -57572 -29287 -22461 -69056 -64361 -2626 5651 99481 148256 96421
23725 96421 20972 1204 -48875 -86202 -68882 19620 55819 34764 27866 27924 95033 90108 81808
23712 81808 74452 58250 36988 10436 16980 53300 40493 -8587 -81474 -132988 -108567 -79878
23700g9878J18J3810J22885P6294k5322k3595q3024O011j2216O806N1500J1582
23688F4971K4195p8753k2619K8763P6466L8263l734L7721P228j01047j04240M9587
23676A6801l2202n7354o5255L5424J4003L3130Q9701k582j01933p4481l1960k7178
23664b03886l9456J3738J5017J19956J13377O814q777p0911n0086Q2971N4821
23653C3578N3035O3073j01370q9703k5959O129J992k3913l4400Q388O5966r108
23641e2292N0625K4019o8177L1930M0799m1942j5443J076M6678J1974j6460o4192
23629e1405j09982M7539R5154K7387K2385p1098o5395K9427J0659O0596k4982
23618b9715k0483r736J0670j5964n2994K5493k6915L2758j0800R7487J9896o169
$$ plain form
23700 -79878 -79760 -65950 56935 133229 107907 84312 1288 7299 -4917 1889 53389 64971
23688 64971 89166 10413 -12206 16557 93023 131286 127552 165273 172501 71454 -32786 16801
23676 16801 -15401 -72755 -138010 -102586 -88583 -55453 34248 31666 -70267 -144748 -176708 -203886
23664 -203886 -243342 -229604 -214587 -94631 18746 25560 16783 -54128 -104214 -21243 33578
23653 33578 86613 149686 48316 -41387 -67346 -61217 -59225 -83138 -117538 -109150 -43184 -52292
23641 -52292 -1667 22352 -45825 -13895 26904 -15038 -30481 -29405 17273 29247 12787 -51405
23629 -51405 -161387 -113848 -18694 8693 31078 -40020 -105415 -75988 -65329 -4733 -29715
23618 -29715 -50198 -59934 -49264 -65228 -118222 -92729 -119644 -86886 -97686 -199 19697 13528
23606A3528L32k3491R63K3219L5143l7251l3388Q8969K0824j30339n5914J5885
23594h1520J1634J6488J19054j1748q7174j3741p452n566J9674M8395p0997l4132
23582i7085P3054q6325l2922L9303M79R4831R8881m2738q5146j9256j5082l9839
23570a11845N2510R7396j7642l5524r3889n3509Q0408Q3553K0207J1913O225o772
23558C3031P9683l521p3868L9460n9308n8843k6881J322K3572K989M7378j3685
23546h671m4086j3389M9481N6255l054l1714K4770J6803J7814q54p5071n4256
23534f5972n9485p597L158J18689K891m0909l0178O5961L7692k8535j752M2520
23522C6483j7711K6763J8236n5638l7817j270K0042J2593J7611j05306l9589k4625
$$ plain form
23606 13528 13860 -9631 -8668 14551 49694 12443 -20945 68024 88848 -41491 -97405 -81520
23594 -81520 -69886 -53398 65656 53908 -33266 -47007 -54459 -60025 -40351 8044 -62953 -97085
23582 -97085 -24031 -110356 -143278 -103975 -103496 -8665 90216 47478 -37668 -56924 -72006 -111845
23570 -111845 -59335 38061 20419 -15105 -108994 -162503 -82095 1458 21665 33578 39803 33031
23558 33031 112714 109193 35325 74785 15477 -43366 -70247 -68925 -45353 -42364 5014 -8671
23546 -8671 -52757 -66146 -16665 39590 36536 4822 29592 46395 64209 63355 -11716 -65972
23534 -65972 -125457 -133054 -129896 -11207 -8316 -49225 -79403 -13442 24250 -4285 -6037 36483
23522 36483 18772 45535 63771 8133 -29684 -30954 -10912 1681 19292 -86014 -125603 -150228
23510a50228M0962O5512P6904k4977p2111O1878J1676l5836J00829P5618L947
23499A54174l4638J3934K7434j45571j18337N3587N652O9832M9927m2694j3873
23488A9427j2186J6595J7264n243o2151q6050M189N2196P0835k8532R675M2529
23476C8548O426k7597K8606k0074J9893l4560k9311O7199K9990M7305M143q9543
23464D1025m0213N8150m2529K7064L7415K7334p2085K6812r73J2657j9895j714
23452E3048r5428N0501k6348o1786j3323P079O1607P043Q404l7999P2416K6815
23440E2029p6519j08947k652J8556o964P6309K3795k032M2770m3632L777j5428
23428c8938K0803J00104J1855r7458m3801K8048K3161L4534M9280N1880J3955
$$ plain form
23510 -150228 -109266 -43754 33150 8173 -63938 -2060 9616 -26220 74609 150227 154174
23499 154174 119536 133470 160904 15333 -103004 -49417 -43765 26067 75994 33300 19427
23488 19427 7241 23836 41100 35857 -26294 -112344 -108155 -55959 14876 -13656 -3981 38548
23476 38548 44974 17377 45983 25909 45802 11242 -18069 49130 79120 126425 130568 41025
23464 41025 812 58962 16433 43497 80912 108246 36161 62973 62000 74657 54762 53048
23452 53048 -42380 8121 -18227 -80013 -93336 -86257 -24650 -17607 -9203 -47202 25214 52029
23440 52029 -24490 -133437 -136089 -117533 -124497 -48188 -24393 -26425 16345 -27287 -23510 -38938
23428 -38938 -18135 81969 93824 -3634 -47435 -19387 3774 38308 87588 139468 153423
23417A53423k6129p4274q1486o0127j2835J9253P041l9193L504M7381O202K6209
23405c1031o6599o1516k9160P3979O6050O5176l2517l5934j5523K6781K5680L0505
23393A5891j6333r3110j08705K4429J53910R9013n7541m9731Q0906P317o4987
23382h941L3818M1597n7276L8024N612n3567q0256j07857L494K6448K0747L8954
23370i9203N7803O2843k6297M8552L68o4438L1229J7604L7480J0772P916m7735
23358C6894j7213k1435n9556j5379k2705K8895J0573L8749m9462J2397o673J0285
23346e4630P7598O9032r6p5548o3512P184k3942Q0243R7373k7914k11675q2999
23334b08886O2375J7513J2577O0242O1097M4321k1810q2504l6169M3226P4208
$$ plain form
23417 153423 127294 53020 -28466 -88593 -101428 -82175 -75134 -114327 -110823 -63442 -57240 -31031
23405 -31031 -97630 -159146 -188306 -114327 -48277 16899 -15618 -51552 -67075 -40294 -14614 15891
23393 15891 -442 -93552 -202257 -177828 -23918 75095 17554 -32177 48729 56046 -8941
23382 -8941 24877 66474 9198 47222 52834 -733 -80989 -188846 -185352 -158904 -138157 -99203
23370 -99203 -41400 21443 -4854 43698 44066 -20372 10857 28461 65941 76713 84629 36894
23358 36894 19681 -1754 -61310 -76689 -99394 -70499 -59926 -21177 -70639 -58242 -64915 -54630
23346 -54630 22968 92000 91904 16356 -47156 -39972 -63914 16329 113702 85788 -125887 -208886
23334 -208886 -146511 -128998 -116421 -56179 4918 49239 27429 -55075 -91244 -48018 26190
23323B6190P5421m3304O9397j7354k0832j2662m2360l9133M3766Q6987n2255l2290
23311D1571q6681M678m5562l9466k5773q511J2262J0043R4381N3512o901n7190
23299e3637J552K5496J7760O1219k9431j8587n4635L7409K8689k6950O9160K9140
23287H7185k4890j3674j6181n0081j7998j3697o7438N9242O2077L5930r4734p1628
23275a25887J07241K0234O0769M2617n6058o0228J547J8030K1324O5850j10443
23264a5004J1901N4250L0765n3086J367k7386J497r7582j8138P3123K8248M2231
23252C2186M8662J1582l2291o9479o4220M7465Q177l8455K6915R6047N510L3941
23240A06040J2930o8998J4582o8323k9823K3711r248K9518m5254k095L3452R5475
$$ plain form
23323 26190 101611 58307 127704 110350 89518 76856 34496 -4637 39129 126116 73861 41571
23311 41571 -45110 -40432 -85994 -125460 -151233 -159744 -147482 -137439 -43058 10454 3553 -53637
23299 -53637 -52085 -26589 -8829 52390 22959 4372 -50263 -12854 15835 -11115 58045 87185
23287 87185 62295 48621 32440 -17641 -35639 -49336 -116774 -57532 4545 40475 -54259 -125887
23275 -125887 -18646 1588 62357 104974 48916 -11312 -9765 8265 29589 95439 -15004
23264 -15004 -3103 51147 81912 28826 30193 2807 4304 -93278 -111416 -38293 -10045 32186
23252 32186 80848 92430 60139 -9340 -73560 -26095 -17918 -56373 -29458 66589 72099 106040
23240 106040 118970 49972 64554 -3769 -33592 -9881 -19129 10389 -34865 -36960 -3508 91967
23228I1967n444J623m239L0855K9591K2560r5724q9429R959M6520m0735M4354
23216D1858P5326n2960o7159R7472O9168r9698j35743P876j981p96j9464j764
23204h7865L4372K8897o8184L8058Q7539N1409L3399r8210m3850L4504N7232l9081
23192B8220j7735m9450m8372O9661Q272m9481l356n1199K0432Q0023O4348Q138
23180E9501o0685o9645L3407R264K6374l2531P007n6316K0740K7037L6709M5803
23168D6665j5965j7546M0397n5665m9015m756q541O7884K8179j4883k0775M7689
23156D3668O2306n2914q155m85o0608J6396P840l1689R8758J61188K4615l1983
23144B28937o1471k6019n3405o713o8492l411J797J1843K6262P7400N8343R064
$$ plain form
23228 91967 86523 88146 83907 114762 144353 166913 71189 -18240 -8281 38239 -2496 41858
23216 41858 117184 64224 -2935 94537 163705 64007 -71736 -63860 -65841 -66637 -86101 -87865
23204 -87865 -53493 -24596 -92780 -54722 32817 84226 117625 19415 -24435 10069 67301 28220
23192 28220 10485 -38965 -87337 -17676 -9404 -58885 -62241 -113440 -93008 -12985 51363 59501
23180 59501 -1184 -70829 -37422 -28158 -1784 -34315 -27308 -83624 -62884 -35847 862 46665
23168 46665 30700 13154 53551 -2114 -51129 -55885 -64426 3458 31637 16754 -4021 43668
23156 43668 105974 53060 44905 44420 -16188 208 8048 -23641 75117 236305 260920 228937
23144 228937 167466 141447 88042 81329 12837 9426 11223 23066 49328 126728 185071 194135
23132A94135q8096n4731m7155j9596N4819K0446M5916k4290p0613o7267k0671
23121g7103R1360L6274m5134J6018k7213m3772l6809O0151n650L0287L9871o2637
23109b4357l0615k8797m5889N3625J02542L0130l59Q352K2555m2484k0801K7811
23097E1713o1221R1805N7123m486l673K1349k4357P2104J16013J57813K10390
23086F84573J61165K89201L64291M12593K16894r463k48839l74275l88290l31648
23076G76202k80451k29744n1256n2977J170r4369k9058L2601J8773n3819K530
23065C9602M2936N3267J2186k7380L1967l2957o9644n0124Q0252j9042j40641
23054g9578k4200J09979j0655r401J7717K5029m2326k0931k1131j695Q8394O9047
$$ plain form
23132 194135 106039 51308 4153 -15443 39376 59822 105738 81448 10835 -56432 -77103
23121 -77103 14257 50531 5397 21415 -5798 -49570 -86379 -26228 -31878 -1591 38280 -24357
23109 -24357 -54972 -83769 -129658 -76033 26509 56639 56280 64632 87187 44703 23902 51713
23097 51713 -9508 82297 139420 134934 131261 152610 128253 200357 316370 474183 684573
23086 684573 845738 1134939 1499230 1911823 2128717 2119254 1870415 1496140 1107850 776202
23076 776202 495751 266007 214751 161774 162944 68575 39517 72118 90891 37072 39602
23065 39602 82538 135805 147991 120611 152578 119621 49977 -147 80105 61063 -79578
23054 -79578 -103778 6201 -4454 -13855 3862 28891 -13435 -34366 -55497 -57192 31202 100249
23042A00249k8722J3733l0618K4347n7844O2152P8830j1369j09358k5527N5932
23031G1805K3286n6508k3104k3289r24o0550M0374K2190n769J19345K0692n8291
23019F9257K4743Q4631j20781n5508o2792j05580k0066J07019M0656R4011k9009
23008B6581o7584j0419J03664L2769J6023Q0971k4834j16049j5386K3439l1862
22997A7313m7594k0994Q8534J07561n6058k9034j21209o2500L3083P429O5777
22986a7692P945l7886m8704m9268M0190N1720m9710j02551K469L6845O8784O5603
22974c2255n567Q4758L2318L4511n4387k4083q8007K7541P9713O7595K9852o7046
22962H4943n2863J5355n7485m3484J26908j4847o4481k8504k7520k2686N3969
$$ plain form
23042 100249 71527 85260 54642 78989 21145 83297 162127 150758 41400 15873 71805
23031 71805 95091 38583 15479 -7810 -8734 -69284 -28910 -6720 -12489 106856 127548 69257
23019 69257 94000 178631 57850 2342 -60450 -166030 -186096 -79077 -38421 55590 26581
23008 26581 -41003 -51422 52242 85011 101034 182005 157171 41122 25736 49175 17313
22997 17313 -30281 -51275 37259 144820 88762 59728 -61481 -123981 -90898 -83469 -17692
22986 -17692 -9747 -47633 -96337 -145605 -105415 -53695 -103405 -205956 -203487 -166642 -97858 -32255
22974 -32255 -37822 46936 79254 113765 59378 35295 -52712 -25171 54542 122137 151989 84943
22962 84943 32080 47435 -10050 -53534 73374 58527 -5954 -34458 -61978 -84664 -30695
22951c0695N9145O0815j30887J4006O5934L1165L2704j4388l4787l4348j07491
22940h8827r0983R634Q3352L2379J1812l6225k2960j6903L6633Q0812R6969n2792
22928D2901O1772o0608o5457O7293O5294J5972l0520m9939l7792l7540L6203K2072
22916B9651N3613M4392p4548o0717j07056m9092K0390M7180L2137j7696P5310
22905f436L3131n738O7585l1472o1194p34R152M1907K5886m1141o3118L261K1411
22892g500m4081N3708O9828m7390L6055O2163n1476j12149j3354K4564J3228K3204
22880F800K5967m673l1103j5137J5172j4873Q14P3717Q4918j8636l9660j04033
22868b0727m2127j4152M9904N784k3057k1933k556K9054k2964J4745O5535n2860
$$ plain form
22951 -30695 28450 89265 -41622 -27616 38318 69483 102187 87799 53012 18664 -88827
22940 -88827 -179810 -170176 -86824 -54445 -42633 -78858 -101818 -118721 -82088 -1276 95693 42901
22928 42901 104673 44065 -21392 45901 111195 127167 96647 46708 8916 -28624 7579 29651
22916 29651 83264 127656 53108 -7609 -114665 -163757 -143367 -96187 -64050 -81746 -6436
22905 -6436 26695 20957 88542 57070 -4124 -4858 4294 46201 72087 30946 -32172 -28911 -7500
22892 -7500 -51581 2127 71955 24565 60620 122783 71307 -40842 -54196 -29632 -16404 6800
22880 6800 32767 28094 -3009 -18146 -2974 -17847 -17033 56684 141602 122966 83306 -20727
22868 -20727 -62854 -77006 -27102 -21318 -44375 -66308 -68864 -39810 -62774 -48029 17506 -35354
22856c5354l7674O7213K2305l0612n8697M899l0199J8184J02255Q9398M1574q9826
22844F3466j00596L3395J280m0703r6707j973J1333n2244r942M7004N9683L5011
22832e0993N6583K1570q7743n7416O0909J18248K0271M5517j9759m9772j14136
22821e6721J7252N5693L2699p6152J9932J0340K9963M4243n7877N3749O4649j6698
22809A21072p7302m7540M5463J1397j5202j7902N7874k8058k3443O725n750k7537
22797b03M8959N4455P750j0066k4223q041L7745P9827P0421L9117M0847n217o312
22784C25059n0030j28m2776p9568l601j8516l970l0884K8527m51l266J5045O769
22771A42210J7120o1752R7876M9222n2864p6335o7757K9880N1321M0310o8009
$$ plain form
22856 -35354 -73028 -5815 16490 -14122 -72819 -67920 -98119 -79935 22320 111718 153292 63466
22844 63466 -37130 -3735 -2455 -43158 -139865 -141838 -130505 -182749 -192691 -145687 -86004 -50993
22832 -50993 5590 27160 -60583 -117999 -57090 61158 81429 126946 107187 57415 -56721
22821 -56721 -39469 16224 48923 -27229 -7297 3043 33006 77249 19372 73121 137770 121072
22809 121072 43770 -3770 41693 53090 37888 19986 77860 49802 26359 33084 27334 -203
22797 -203 48756 103211 110961 100895 76672 68631 106376 186203 256624 295741 336588 331371 325059
22784 325059 275029 274901 232125 152557 148956 130440 126470 95586 124113 123662 120396 135441 142210
22771 142210 159330 97578 195454 244676 191812 115477 47720 77600 128921 169231 101222
22760A01222m2771j0687L3067j9470n0229l036J16189P8507p1318j11311l4125
22749a3962r2578J4440K7782j4900m762j2923R3078L1279L1661l5581q2850K1296
22737c8020O1544J4860L1969O1479O2064N7900R9381M8390J0983l5353j13787
22726B61410n1904l5747o003j11554o0759J1253L2322R582k8322J1405j4229j01150
22714h3696l2689N4352J00923J00642q08m178N161P3697O221q0569o1521J1254
22702H8789o6578P6847O3053N3404O7470J21708n6045j34527j04155M5527l2509
22691A22984J880M6310l8390p5556q4618q8224L4060J58898J25115J00986M5416
22680C48861q1481l9413J03888j8388k3583j01661J5495j5254R432J5427O1171
$$ plain form
22760 101222 58451 47764 80831 61361 11132 8096 124285 202792 131474 20163 -13962
22749 -13962 -106540 -92100 -64318 -79218 -83980 -96903 -3825 27454 59115 23534 -59316 -38020
22737 -38020 23524 38384 70353 131832 193896 251796 351177 399567 410550 375197 261410
22726 261410 209506 173759 167756 56202 -4557 6696 39018 48600 20278 31683 17454 -83696
22714 -83696 -116385 -62033 38890 139532 138724 134546 139707 213404 219625 139056 77535 88789
22702 88789 22211 99058 162111 215515 282985 404693 348648 214121 109966 155493 122984
22691 122984 124864 171174 132784 57228 -27390 -115614 -81554 77344 202459 303445 348861
22680 348861 267380 227967 331855 313467 289884 188223 203718 188464 197896 213323 274494
22669B74494m018o6685o6349L5047R1126j3599J710R332k2061J3948N7413j05464
22657B04894j19615l8801M7706m6088L0982L6159O2215L1132p2821J5636P7422
22646B28821P079p2714j0189o3268o0248k087O1582J10823N2862j14657j22572
22635A5432j7571J52672N2470J09151O3787o0322K8533K0765k9753q1538k0902
22624B32724r793K0837J03721J28070O6738L8176R9477P5452O4533J26807K42344
22613A189086L44538L90833L55526L01284J74048j81302m02004m34885l24456
22604A412668l41322k24155j58043o3157j13851M4021J03371L753L0054P098k1208
22593F79229l4815q3802n616L8944R4195P4808N0622M6713K587k8883L5564Q3046
$$ plain form
22669 274494 270476 203791 137442 172489 263615 250016 251726 261058 238997 252945 310358 204894
22657 204894 85279 46478 94184 48096 79078 115237 177452 208584 135763 151399 228821
22646 228821 235900 163186 152997 89729 29481 27394 88976 199799 252661 138004 15432
22635 15432 -2139 150533 203003 312154 375941 315619 344152 364917 335164 253626 232724
22624 232724 222931 243768 347489 475559 542297 580473 679950 755402 819935 946742 1189086
22613 1189086 1533624 1924457 2279983 2581267 2755315 2574013 2172009 1737124 1412668
22604 1412668 1071346 847191 689148 625991 512140 556161 659532 663285 693339 700437 679229
22593 679229 644414 560612 554996 593940 688135 762943 813565 860278 862865 833982 869546 952592
22581I52592J5858K3042j5749Q825K7860Q2219J98817J66926J29505J02840J13137
22570A805872J59117J46036J03131J58017J12298J69176J90101J27128J25646
22561C096522K21216K99188K84741K32277K59027K98861L75440N68127O48869
22552F284268P85919J012446J245952J610172K016257K562298L377645M533663
22544B3428620O239256Q350422J0789917J4460177K0356901L0018299M5087876
22537A58731468O3288440P0314577O1164813M3568011L186854l9915372o2862894
22530B97475897p3939383o9740404n2101504l2590037j9592417j2446245q430718
22523B8635189o085813m328144l176021k227710j670088j318757j149838r79945
$$ plain form
22581 952592 968450 991492 975743 984568 1012428 1094647 1293464 1460390 1589895 1692735 1805872
22570 1805872 1964989 2111025 2214156 2372173 2484471 2653647 2843748 2970876 3096522
22561 3096522 3317738 3616926 3901667 4133944 4392971 4691832 5067272 5635399 6284268
22552 6284268 7070187 8082633 9328585 10938757 12955014 15517312 18894957 23428620
22544 23428620 29667876 38018298 48808215 63268392 83625293 113643592 158731468
22537 158731468 222019908 292334485 353499298 397067309 400254163 360338791 297475897
22530 297475897 223536514 153796110 101694606 69104569 49512152 37065907 28635189
22523 28635189 22549376 18221232 15045211 12817501 11147413 9828656 8678818 7698873
22515G698873q25321q16530o51774m59769m52609l00512l74395n63600l68213
22506B886150l07006l21829k69424k53964j82115q3956j10657k2196J2066q9755
22496A257314k7206K7931K1965K6018m8801k6845o843o9537M2147P95n0543p3838
22484A072557K5854k2607l4874K2067o3834k5905q877K2496m3600N1216J73657
22473A168150P4641J7621J14374j0947r8770o6227n2792k9515r4809j7567Q0524
22462A084683J40337K92106L51355N25235M70459M20836K55841K29495J49721
22453C920068q5406k63277l69541n25356n10760m68762l59670k73287j86956j22958
22443G54095j60595j4993O3354J3425l6472q7127j14091M4412n4165n6419Q272
$$ plain form
22515 7698873 6873552 6057022 5405248 4945479 4492870 4192358 3817963 3254363 2886150
22506 2886150 2579144 2257315 1987891 1733927 1551812 1467856 1357199 1335003 1347069 1257314
22496 1257314 1230108 1258039 1280004 1306022 1257221 1230376 1223533 1153996 1196143 1196938 1146395 1072557
22484 1072557 1098411 1075804 1040930 1062997 999163 973258 964381 986877 943277 994493 1168150
22473 1168150 1242791 1260412 1374786 1363839 1265069 1198842 1146050 1116535 1021726 1004159 1084683
22462 1084683 1225020 1517126 1868481 2393716 2864175 3285011 3540852 3770347 3920068
22453 3920068 3834662 3571385 3201844 2676488 2165728 1696966 1337296 1064009 877053 754095
22443 754095 593500 578507 641861 655286 618814 531687 417596 462008 407843 351424 359696
22432C59696j6505k8222j8260R6144J7493M7023R4559O7962J67417M9406J2880
22421H49593P8326J22882J03614J26525K98167M25725K62467K07240q6210k56728
22411B131601l43901m25921m37907k59964j52153k14349j07862l5428L8110L1740
22401B23966o3654p1660P8826K9619r1490j01561l0804M6176o0882k6211O5473
22390b202O7687j9816L4907k0082L2624N518Q6854R683k6572J2976R560K9530
22378B20667l8918j0521j8409r7644j84462j2763N1825R3217k3678m9887q611
22367g9184N2900N850K668M9339P6164J4668M7119r222n1200m0276N879o8024
22355F681O9245J29423M1507m0201l5412M4856m1786l7583j6896j4397j604p0134
$$ plain form
22432 359696 343191 314969 296709 392853 410346 457369 551928 619890 787307 836713 849593
22421 849593 927919 1050801 1154415 1280940 1579107 2004832 2267299 2474539 2388329 2131601
22411 2131601 1787700 1361779 923872 663908 511755 297406 189544 154116 192226 223966
22401 223966 160312 88652 167478 197097 105607 4046 -26758 19418 -41464 -67675 -2202
22390 -2202 65485 45669 80576 60494 93118 98636 185490 195173 168601 181577 191137 220667
22378 220667 181749 171228 152819 55175 -129287 -142050 -90225 2992 -20686 -70573 -79184
22367 -79184 -26284 -20434 -17766 31573 107737 122405 169524 160302 109102 68826 74705 6681
22355 6681 75926 205349 246856 206655 171243 216099 174313 136730 119834 105437 103833 33699
22343C3699p8232m3986n7316k0838N8844O426O325L9940Q1252L3179k7566p788
22331B3939J324n7211M2309N8763L7830l2388n5000j6832m2579q696K2724J3220
22319a2597j8015l9541M0333N3446P3143j6844l8590l2655K9525j0391K2178R4932
22307A44924M5275O0699q5234k2596N7518j15767r1197l9485m2473J2193J7758
22296e8385q606L1117J08343k4941k0738p389l242k4101p3065p6886N1572J07929
22284A608K5221j6270k4645n2988j4128k1746j1523P7854P9801N5608M996k468
22272A01320n3165m706r610N0067r661k2774l5886K0929k6653P612O0658m0869
22260C7262r061k1889R66l944R0845Q708O9582L9753k0477j51542j44792k9573
$$ plain form
22343 33699 -44533 -88519 -145835 -166673 -107829 -101403 -95078 -55138 26114 59293 31727 23939
22331 23939 25263 -31948 10361 69124 106954 74566 19566 2734 -39845 -48541 -25817 -12597
22319 -12597 -30612 -70153 -29820 23626 96769 79925 41335 8680 38205 27814 49992 144924
22307 144924 190199 250898 165664 143068 200586 84819 -6378 -45863 -88336 -76143 -58385
22296 -58385 -66991 -35874 72469 47528 26790 19401 16159 -7942 -81007 -157893 -106321 1608
22284 1608 26829 10559 -14086 -67074 -81202 -102948 -114471 -36617 43184 98792 103788 101320
22272 101320 48155 43449 33839 83906 74245 51471 15585 36514 9861 17473 78131 37262
22260 37262 28201 6312 7278 3334 94179 102887 172469 212222 191745 40203 -104589 -134162
22248a34162R6855L9968L6579L4386k0156r5226l0705J00540N27j04839P262P730
22236f1241K5141l3060Q909N7300N8140N7016K9616J2346p5375k3753l6746K3003
22224D1296N7249p865l499p7677M1004r0391q7210l263K2122n4477n0827O2287
22212a51251J48265M6114l0924k0950k0056L3076l5995n4058N1951P8607n3125
22201h346p7889m3950n2461m0587j8536P6582J6203J1118P4763P4672m3863p4863
22189a07157j1743L9637J3583Rm1616Q2489Q9683j0262O432J1511p035L6289p833
22176I3987k4407J7464K3437m8211j34538m2915J3843M6334j4400l0069j2542
22165a12017O5886J3447p5169L2317K8536Q9133N7353l4755M792n0725q1378q443
$$ plain form
22248 -134162 -37307 2661 39240 73626 53470 -41756 -72461 28079 28606 -76233 -68971 -61241
22236 -61241 -36100 -69160 -60251 -2951 55189 112205 141821 154167 78792 55039 18293 41296
22224 41296 98545 90680 87181 9504 50508 -39883 -127093 -130356 -108234 -162711 -213538 -151251
22212 -151251 -2986 43128 12204 -8746 -28802 4274 -31721 -85779 -33828 44779 -8346
22201 -8346 -86235 -130185 -182646 -223233 -241769 -165187 -148984 -137866 -63103 11569 -32294 -107157
22189 -107157 -118900 -79263 -65680 -65671 -107287 -24798 64885 54623 61055 72566 65531 101820 93987
22176 93987 69580 87044 110481 62270 -72268 -115183 -101340 -55006 -69406 -99475 -112017
22165 -112017 -46131 -32684 -107853 -75536 -47000 42133 99486 64731 69523 18798 -62580 -71023
22153g1023K6259k9128Q6627J39551l2769o2512L3516p4628l8628O3531J0221
22142E1017n7902l2326j9339k548J34037j3136r4588M4541J34486K6817j8855
22131A52204n7847o5451j0379o2046q2440P618J866J4948k2266J6147Q7001m0747
22119f1392O716j112O4931N8061k6248r267n3369N933m952k1083j9800j8104J4403
22106f5283P4871M6065N6545R09k4166Q957k7830m5767p3508L9780K1979n3268
22094d0716m2756L6219N1078R103l779j9709k985k2071N5199n0314q734j6348
22082e5813L1530P0987l0073k5669M7090p4558o5874N0962P1690N1373K212n4189
22070A9668j6979l1386m7517P689N675L2953j8322k3905r796m1466j78L5813O7621
$$ plain form
22153 -71023 -44764 -73892 12735 152286 119517 57005 90521 15893 -22735 40796 51017
22142 51017 -6885 -39211 -58550 -61098 72939 59803 -34785 9756 144242 171059 152204
22131 152204 94357 28906 18527 -43519 -125959 -118341 -116475 -101527 -123793 -107646 -20645 -61392
22119 -61392 -54676 -55788 9143 67204 40956 31689 -21680 -15747 -20699 -41782 -61582 -79686 -65283
22106 -65283 9588 55653 112198 113107 88941 97898 70068 24301 -49207 -9427 12552 -40716
22094 -40716 -83472 -47253 3825 12928 9149 -10560 -13545 -35616 19583 -30731 -39465 -55813
22082 -55813 -24283 46704 16631 -9038 38052 -36506 -102380 -51418 20272 71645 73857 19668
22070 19668 2689 -28697 -76214 -68525 -62850 -29897 -48219 -72124 -81920 -123386 -123564 -87751 -20130
22057b0130J30597j345j3982n3595m2467p4413p763L4691J07886N8845l7924m3181
22045C7219o4447J6000P948k6295O3880j0069p2097o467l682n0589R035J30315
22033C0751L7769O6119k7195m2658O010k5592K9968K048J3773L7357n2098l4251
22021D2001O7194k952q4257o2800M2322K3969k213P445p794n7088K3142O7493
22009E6462l9600l2806P0254j9449n5796k6475K9849L4651K4689L2699n0483k7220
21997c225L8440j3405p1933l809N9668N0610J05257j3829m8867K764M2716M6648
21985A91035O9544L816K8526J84253L19026K77357L12315L12205L61988Q9398
21975B149463j81883k49149l48869l29240l82609k73165j08470q1636j34149n9859
$$ plain form
22057 -20130 110467 109122 95140 41545 -922 -75335 -83098 -48407 59479 118324 80400 37219
22045 37219 -27228 -11228 -3280 -29575 34305 24236 -47861 -54328 -58010 -108599 -99564 30751
22033 30751 68520 134639 107444 64786 70796 45204 75172 77220 90993 128350 76252 42001
22021 42001 109195 106243 21986 -40814 1508 25477 23264 30709 22915 -34173 -11031 56462
22009 56462 16862 -15944 54310 34861 -20935 -47410 -17561 17090 41779 74478 23995 -3225
21997 -3225 35215 21810 -50123 -53932 5736 56346 161603 147774 98907 101671 144387 191035
21985 191035 260579 264395 292921 477174 796200 1073557 1385872 1698077 2060065 2149463
21975 2149463 1967580 1718431 1369562 1040322 657713 384548 276078 194442 60293 434
21965D34K1471K8680M850N3145m1414r4679K80N2232j8357M5997m6127o3013J28985
21952G2484J9054o7804K9402M0676J5608k0736m7605l0691j5473J7642L735L7965
21940E4257k5720N8301m0113j09140k8284J9729j0542O4817K6254j9274J7269
21929G554j3434k533J23283M1441n904q1170r0992M5445J0342k0008j160k2583
21917i719j3700m3534l1755r5295J37653P5863J7914J0229j7289l607M345P7979
21905A09084J42497l4898j02490m727M5986K2966J5999j13732j4286L2184K6841
21894A25424l4877q0820n25k4848o2457J0622J6854K2386O8472p920j9262k0258
21882g209m5625N216J5541m0382L4493P2514j6382l2357k1524k0281R029L8777
$$ plain form
21965 434 21905 50585 55435 108580 67166 -27513 -27233 24999 6642 52639 6512 -56501 72484
21952 72484 91538 23734 53136 93812 109420 88684 41079 10388 -5085 12557 16292 54257
21940 54257 28537 86838 46725 -62415 -90699 -70970 -81512 -16695 9559 -9715 7554
21929 7554 -5880 -8413 114870 156311 150407 69237 -21755 23690 34032 14024 12864 -9719
21917 -9719 -23419 -66953 -98708 -194003 -56350 19513 37427 47656 30367 26760 31105 109084
21905 109084 251581 216683 114193 109466 155452 178418 194417 80685 66399 98583 125424
21894 125424 90547 9727 9202 -15646 -78103 -67481 -50627 -28241 40231 32311 13049 -7209
21882 -7209 -52834 -47618 -32077 -72459 -37966 34548 18166 -14191 -35715 -55996 -46967 -8190
21870h190J8235n775O0876o552q3857M8661q296o1915K0321j9152M0444n2975
21858e8175r2656l2720J20934R9029k9588l5310O5403M1854O0802O0632m6343
21847A53862n3986p882K472k9676q5442L397R508P9189n6920m0572j7325l1285
21835g4660P8994K9723p2890n5589K2862Q4610N5782J1422p2703k8823R4502J8601
21823I1831l7734j30175p4198j5019R7949R9671l3864k1309n8270r264J4795L9279
21811c6308j7964l1651O0854P6058r2242R404N7753K0857j45062o977J22812J4648
21799C2182j6379L4279l2530r9893J7015N0691m695j39386M3451M8796p375q4060
21787a57904L0160J00242Q440o1458m1800l2939L7312J27061J3053Q211L9338
$$ plain form
21870 -8190 10045 4270 65146 58594 -25263 23398 15102 -46813 -26492 -45644 -5200 -58175
21858 -58175 -150831 -183551 -62617 36412 6824 -28486 36917 78771 139573 200205 153862
21847 153862 99876 91994 94466 64790 -20652 -17255 -7747 71442 14522 -26050 -43375 -74660
21835 -74660 4334 34057 -38833 -94422 -71560 13050 68832 80254 7551 -21272 73230 91831
21823 91831 54097 -76078 -150276 -165295 -67346 32325 -1539 -22848 -81118 -90382 -75587 -36308
21811 -36308 -54272 -85923 -25069 50989 -41253 -31849 25904 46761 -98301 -105278 17534 32182
21799 32182 15803 50082 17552 -82341 -65326 -14635 -19330 -158716 -115265 -66469 -73844 -157904
21787 -157904 -127744 -27502 -19062 -80520 -122320 -155259 -117947 9114 22167 30378 69716
21776F9716O4384O6358q9368j12116n6307K1898Q9451j9398n524j7094n9222J0513
21764c6709P6932J05461J7429o2304k3767m4464n4797j9032K661J9155k4017M4346
21752H94N4273M8332N6400J0080n8700q5992n1800l2050M3744J7752m6183O6007
21740B2757j7224m0090K3602M0571R672l6671N3m0570m7167j4150K5868n3683
21728a27032m0499Q2206N3695m4613N6934J1804o4517r881L6193L1341j27152
21717a41521o8929r655O4455Q705o3304q375M2066m5220P853L6727O3511M5478
21705f8209q183k1403n0543J7186L2688J951J3110M0345m1819R792N6504l0799
21693d9380n1160L465l6093J906p2122m2006O2076N9593J1169O4846O2750J0487
$$ plain form
21776 69716 134100 200458 111090 -1026 -57333 -35435 54016 34618 29094 12000 -47222 -36709
21764 -36709 40223 145684 163113 100809 77042 32578 -22219 -41251 -38590 -19435 -43452 894
21752 894 55167 103499 159899 169979 111279 25287 -26513 -58563 -14819 2933 -43250 22757
21740 22757 5533 -34557 -10955 29616 39288 2617 2670 -37900 -85067 -99217 -73349 -127032
21728 -127032 -167531 -85325 -31630 -76243 -19309 -7505 -72022 -81903 -45710 -14369 -141521
21717 -141521 -210450 -220105 -155650 -146945 -210249 -218624 -176558 -221778 -213925 -177198 -113687 -68209
21705 -68209 -76392 -97795 -148338 -131152 -98464 -96513 -83403 -43058 -84877 -75085 -18581 -49380
21693 -49380 -100540 -97075 -133168 -131262 -203384 -245390 -183314 -123721 -112552 -47706 15044 25531
21681B5531M7298K0050j4184n8819l8850k4388j1229j0031m5661K4068l6567K680
21669a20102l5980L5245O4784J21430L1392M3709J0540k6167r2807k8878K0346
21658B3512k6723o8618M5736K3219L916o2141q3395K7203R6186M8460o8336q5525
21646a26506M1267J34108K9347K1637m7651K939p536j47353j3669j8719R438Q3426
21634c9272N0694K0666n1817k6771l3866k0119K7966j8166m3545L458N1082K6001
21622e3689K2471L4323o0947j7576O2393o2743n9216l7204K3415O3816O4004r953
21610c0906m8269l4346L9948o4262L7699q981l931J3359O652Q9907K0247n1290
21598c4173K1966K2177J1319P215K6714m3120n6969N8016k9860j00190n256K9070
$$ plain form
21681 25531 72829 92879 78695 19876 -18974 -43362 -54591 -64622 -110283 -86215 -122782 -120102
21669 -120102 -156082 -120837 -56053 65377 96769 140478 151018 124851 32044 3166 23512
21658 23512 -3211 -71829 -26093 -2874 1042 -61099 -144494 -117291 -21105 27355 -40981 -126506
21646 -126506 -85239 48869 78216 99853 52202 55141 47605 -99748 -113417 -132136 -122698 -39272
21634 -39272 11422 32088 -19729 -46500 -80366 -100485 -72519 -90685 -134230 -130772 -79690 -53689
21622 -53689 -31218 3105 -57842 -75418 -13025 -75768 -134984 -172188 -148773 -84957 -20953 -30906
21610 -30906 -79175 -113521 -73573 -137835 -100136 -109117 -113048 -99689 -93037 -3130 17117 -34173
21598 -34173 -12207 9970 21289 28504 55218 12098 -44871 13145 -16715 -116905 -122161 -93091
21586i3091N8954K0795L9997L3306j2564l5315K69M2174O327n1981L8937j2350
21574C5458o9365L593O2299K2590J1158j20556p4423M4580O1J22706R3113J5690
21562A46904q2203n5531J6095P4190n7528m3738n5250l1219O9877M157K382m276
21550a6140j01970l3073m53P0253k360l1289O146j9814j1620l0382L6044n934
21538a40592O3423M804n2984M1532P5471N2041q792J7211l199J8143R695p98l9619
21525C6336r2798K0501k2418m3071J6620O0386P2261k1698k0958J2076j6315k0179
21513a9257j5802N4738j0799m7263j5843p8383j9557N1545J2012j7663o5197N8768
21501a12701R1400J6864m55L5420J032j1030j6850K0780K7117m9961n648J06680
$$ plain form
21586 -93091 -34137 -13342 26655 59961 47397 12082 12351 54525 60852 8871 47808 35458
21574 35458 -33907 -30314 31985 54575 65733 -54823 -129246 -84666 -84605 38101 131214 146904
21562 146904 64701 9170 25265 99455 41927 -1811 -57061 -88280 -18403 -14246 -11864 -16140
21550 -16140 -118110 -151183 -151636 -81383 -83743 -115032 -108886 -128700 -140320 -170702 -134658 -140592
21538 -140592 -77169 -72365 -125349 -83817 -8346 43695 34903 52114 48915 67058 76753 75955 36336
21525 36336 -56462 -35961 -58379 -101450 -84830 -24444 47817 26119 5161 17237 922 -19257
21513 -19257 -35059 19679 8880 -38383 -54226 -132609 -152166 -100621 -88609 -106272 -171469 -112701
21501 -112701 -21301 -4437 -4892 30528 31560 20530 3680 24460 51577 1616 -4032 102648
21489A02648K6944m8638j513o7287n3696M7487J0932j977k1980R28K9650r71j6815
21476E712J107j0046m2829n1009q7588L3793J09398J42384L279o9586m643O5433
21464I5405p7694l2871l8779p2035J9493P5104N3142J23340J4840j20012l8248
21453A685p551j6390L0579K4746K398r2327k3804P0275n007n0940K3013n5864
21441i9187n0234L6880Q4589N5236Q856j8734l269p4845n0780M1556n3L4223l7563
21428g3325J9066N8925k0714M2915L9201J9813L2577m4841l6649m2696N0409o4276
21416a9595K919P5935j17817l9253L1757l0644n3069N9463M8203J9525K0031k2518
21404b5063L0149K3294n595J5517k9024j01573j7581L7446O0583l9575K5983K8109
$$ plain form
21489 102648 129592 80954 79441 12154 -41542 5945 16877 14900 -7080 -6152 23498 22527 5712
21476 5712 6819 -3227 -46056 -97065 -184653 -150860 -41462 100922 104201 34615 29972 95405
21464 95405 17711 -15160 -53939 -125974 -106481 -31377 21765 145105 159945 39933 1685
21453 1685 -5866 -22256 8323 33069 35467 -56860 -80664 -10389 -15396 -66336 -43323 -99187
21441 -99187 -149421 -112541 -27952 27284 36140 17406 14137 -60708 -111488 -69932 -69985 -35762 -73325
21428 -73325 -54259 4666 -16048 26867 66068 85881 118458 73617 36968 -5728 44681 -19595
21416 -19595 -16676 59259 -58558 -97811 -66054 -96698 -149767 -90304 -42101 -22576 -2545 -25063
21404 -25063 5086 28380 22785 38302 9278 -92295 -109876 -72430 -11847 -51422 -25439 2670
21392B670K4490L0359l4058n1602Q813k6997m0681N339P427M9520p544J0505M7810
21379B6051L334l7437r896M7426J6523J2532o1971r7296L9451J07981M795L403
21367E4896L3516p6672n61j4369R47r371p2870l2865M7703P373J0398l3473J7334
21354f8014N5859j0719o6747J4900J10734J8089L7132o2158L2953k6216j5058
21343B0755L5705n91l7830M0623r443K2213o813K585M0493j10226R53N0144k6688
21330B1880j807K4067L1106o2793q8840j11395o995R4579M0410j4169l3873k123
21318a09953j8386N3637K7179P8466J147K9708P5781r6502j10928o9773M9209
21307i0415k8708R2375N0384l05j6207J0743r1748j3921L3064Q865m1378P0531
$$ plain form
21392 2670 27160 57519 23461 -28141 -19328 -46325 -87006 -81667 -74240 -24720 -32264 -21759 26051
21379 26051 29385 -8052 -17948 29478 46001 58533 -3438 -100734 -61283 46698 51493 54896
21367 54896 88412 11740 11179 -3190 -2243 -11614 -84484 -117349 -69646 -62273 -51875 -85348 -68014
21354 -68014 -12155 -22874 -89621 -74721 36013 54102 91234 29076 62029 35813 20755
21343 20755 56460 55869 18039 58662 49219 71432 64619 67204 107697 -2529 -1576 48568 21880
21330 21880 20073 44140 75246 12453 -76387 -187782 -194777 -100198 -59788 -73957 -107830 -109953
21318 -109953 -128339 -74702 -47523 30943 32090 61798 137579 41077 -69851 -139624 -90415
21307 -90415 -119123 -26748 23636 23331 7124 17867 -73881 -87802 -54738 -45873 -87251 -16720
21295a6720L2136l0077q137P1356K9297j6663o1148n3788k248q267K4559L7425
21283b275L6028K6355n2614m8027p778L9504J4497K9754J156n3349j54199K2384
21271a48564P7796L0577L0816j9187m6652o093m032J5715n8405o9174R621N6786
21259a30796L8176L5970J899K1153P312K8704k3757J3256L6316J122o136j3162
21247A0057j05753J8430O3256K8487P2828P6097j7557n3161J0744k2642m1056
21236C9730J024N068k2931J0225l0062m6030L5992m8086o0139m2921J7947J35580
21224d603O2260p2178m498L2122N2328L5091j2214k0890m4923m137N4629L5957
21212A08944l1345l4618J3839M8457r730k4074n571m532N0315j5376r3435q3388
$$ plain form
21295 -16720 15416 -14661 -22798 48558 77855 61192 44 -53744 -55992 -64259 -39700 -2275
21283 -2275 33753 60108 7494 -40533 -48311 -8807 5690 35444 36600 -16749 -170948 -148564
21271 -148564 -70768 -40191 -9375 -28562 -75214 -81307 -85339 -69624 -128029 -197203 -187582 -130796
21259 -130796 -92620 -56650 -54751 -33598 -26286 2418 -21339 -8083 28233 29355 23219 10057
21247 10057 -95696 -77266 -14010 14477 87305 163402 145845 92684 103428 80786 39730
21236 39730 40754 45822 22891 33116 3054 -42976 -6984 -55070 -115209 -158130 -140183 -4603
21224 -4603 57657 -14521 -19019 13103 65431 100522 88308 67418 22495 18358 72987 108944
21212 108944 77599 42981 56820 105277 95547 71473 65902 61370 111685 96309 2874 -80514
21200h0514j2462J9423L5136M4992P6017l6245K199j6397k3016L2004k6204m6138
21188c1205R7640R9221k0230m4151J306J3798r496l3340K861o0793l3144o8184
21176h5717p659m603j6293J10094L5594L9409p394q5779n3633q5331m962M8272
21164a18002N3855P1954o257L385L8493J2829q1488l6885K4975R519J023M5294
21152A8695j330L6800n934m7054o1488L9763k8080J3231j7003O654N4310L8388
21140D6952j4109K9077m4375o9121j4065N303O2692J4447J8794J2778q0778R075
21128b3330M7902o6160J9749o8034o0560J6815O9023O7945N9314j1141j16943
21117f5420K641N2137l593J027K1043J8846p4169n663M5702o9764L2347K844q2532
$$ plain form
21200 -80514 -92976 -73553 -38417 6575 82592 46347 48546 32149 9133 41137 14933 -31205
21188 -31205 66435 165656 145426 101275 102581 116379 106883 73543 76404 15611 -17533 -85717
21176 -85717 -93376 -97979 -114272 -4178 31416 70825 63431 -22348 -75981 -161312 -166274 -118002
21164 -118002 -64147 7807 1550 4935 43428 56257 -25231 -62116 -37141 -27622 -26599 18695
21152 18695 17365 54165 48231 1177 -60311 -20548 -48628 -35397 -52400 -45746 8564 46952
21140 46952 32843 61920 17545 -51576 -65641 -60338 2354 16801 35595 48373 -32405 -23330
21128 -23330 24572 -41588 -21839 -89873 -150433 -133618 -64595 3350 62664 51523 -65420
21117 -65420 -62779 -10642 -14235 -13208 7835 26681 -47488 -53151 -7449 -77213 -44866 -42022 -124554
21104a24554n1592m4673K4296N73L6781J21726M9056N3592L2075L6339o6493J9908
21092H7034N5488m8531o3714j4498M3227l2070Q579K1587n4273N290j2589K8790
21080B4320J4795j0730J833J2964L7005q448m8161n5055l201K2305J3733L5509
21068C6869l1723o0309M269J8504J4712J0493o2646O3983L5761m3618l669J4466
21056b908L7468r2611j3618N0344L021O308K804l3232j1305K692K2440L2931K4957
21043B9291q687l531m202q1357k3234J7392j7443Q147N7660R0025P4871l4931
21031A04001l8088q0509n2071p767M1158l9571k3803K5872n8522L4714j5283n1574
21019a61443j0615N5102O6211m5184J4884K20607J21636m8612k01089j48830R9506
$$ plain form
21104 -124554 -176146 -220819 -196523 -195950 -159169 -37443 11613 65205 97280 133619 67126 87034
21092 87034 142522 93991 30277 15779 59006 26936 35515 57102 2829 8119 -4470 24320
21080 24320 39115 28385 30218 43182 80187 71739 23578 -31477 -34678 -12373 1360 36869
21068 36869 5146 -55163 -50894 -32390 -17678 -7185 -69831 -5848 29913 -13705 -17374 -2908
21056 -2908 34560 -58051 -71669 -21325 -18304 -11996 -9192 -42424 -53729 -51037 -28597 4334 29291
21043 29291 20604 17073 12871 -68486 -91720 -74328 -91771 -83624 -25964 64061 138932 104001
21031 104001 65913 -14596 -66667 -74434 -33276 -72847 -96650 -70778 -129300 -94586 -109869 -161443
21019 -161443 -172058 -116956 -50745 -95929 -81045 139562 261198 212586 11497 -137333 -37827
21008c7827O3237j4410o6905l6898M4466Q8315O4508L8339k3291J8951j9513J874
20996A20846o8930L8003J9634l4809n491J0912L2311j457k4394o2083r7539k3619
20984i6616j2296L1024M5509L9069r661j3320m7289j2323N2552KK7218Q3084m335
20971H2618j11868L4520Q395J5811L3974k3284m6685l4611m1068J22266O3807
20960A03875J6407K8106o625l2344q7555n964K3736q366j47069n3634O8144j1003
20948a12292M9683O8591L7062l1275m2044N2366N7110n5203l0926K6707R3460
20937A13239j4226n2310L4696N8257o7085p7185M2155Q3556k059j07926m6608
20926c5496K4523R515n835L9305J37774M3152q1826n041m0408j09282N7840j6219
$$ plain form
21008 -37827 25410 11000 -55905 -92803 -48337 39978 104486 142825 119534 138485 118972 120846
20996 120846 51916 89919 109553 74744 69253 80165 112476 111019 86625 24542 -72997 -96616
20984 -96616 -108912 -77888 -32379 6690 -2971 -16291 -63580 -75903 -23351 -23349 3869 86953 82618
20971 82618 -29250 5270 13665 29476 63450 40166 -6519 -41130 -82198 40068 103875
20960 103875 120282 148388 141763 109419 21864 15900 39636 31270 -115799 -169433 -101289 -112292
20948 -112292 -62609 5982 43044 11769 -30275 22091 79201 23998 -6928 19779 113239
20937 113239 99013 46703 81399 139656 72571 -4614 37541 121097 119038 11112 -35496
20926 -35496 -10973 -1458 -7293 32012 169786 212938 131112 126071 85663 -23619 34221 18002
20914A8002L5243K4958Q0883J1679k6273j10164j01781L9891J0716l5847p1852
20903a24545k316P8637J2637j9497R161R113N8117R5482P2925l7824l2263l0825
20891H8802k0529l5156m8757k137J4510N5161J0209M2266L0260k2013k9495l9812
20879D3309k1800j1673p0072J204K5698k7034M3648J9543l8162n7444p283J26585
20867B6519P1688R57j22334m4214l8422Q7177J46537K3241o8156j14827l3993
20856f5827O325j1412M1649R1413K6320K3720k9352M3479n8643j19531J2385L97
20844c9077m4835k625J23626L591o0377l7780Q3466Q537j33492J0793M0262k320
20832e0231M5228o534j8733r4554j7970Q4168P0158J4185L7104N7540o6260n5703
$$ plain form
20914 18002 53245 78203 159086 170765 144492 34328 -67453 -27562 -16846 -52693 -124545
20903 -124545 -126861 -48224 -35587 -55084 -45923 -36810 21307 116789 189714 151890 119627 88802
20891 88802 68273 33117 -15640 -17777 -3267 51894 62103 104369 134629 112616 83121 43309
20879 43309 21509 9836 -60236 -59032 -33334 -60368 -16720 2823 -35339 -92783 -100066 26519
20867 26519 98207 99164 -23170 -67384 -105806 -18629 127908 151149 82993 -31834 -65827
20856 -65827 -59502 -70914 -29265 62148 88468 112188 82836 126315 67672 -51859 -39474 -39077
20844 -39077 -83912 -86537 37089 40680 -19697 -57477 25989 34526 -98966 -88173 -47911 -50231
20832 -50231 -5003 -11537 -30270 -124824 -142794 -58626 11532 25717 62821 120361 54101 -1602
20820a602O922R9849P2565j1114k6920q6678r7341m3991Q3841l3784k6601m7587
20808a12441K1755K2693m6956J16440O338n5793j53707q8835J04041J72590L3013
20797A9138k8527L4510j9903N2611Q435M2641R5240J9635k1905n4704j18394l1418
20785b641n0720l3207K7174k0386m0908Q2749J02708J15929M2445q5528n6982
20774H0633L5682M7970L8680k1511M408j01311n870Q9695n1676j22283l98k1642
20762b7623J387l929j046m0754n6640N1714O201j9336P7511J11612p931p1931
20750A9235l2182N9624L1533M0011j1490k3421l7187k044K3024l159j482r589
20738E2873p776l1474L8800l7101k2724j1459j9042k549O45L7897J3439K6108
$$ plain form
20820 -1602 5320 105169 177734 166620 139700 53022 -44319 -88310 -4469 -38253 -64854 -112441
20808 -112441 -90686 -67993 -114949 1491 7829 -47964 -201671 -290506 -186465 -13875 19138
20797 19138 -9389 25121 5218 57829 66264 108905 204145 223780 201875 147171 28777 -2641
20785 -2641 -53361 -86568 -59394 -79780 -120688 -37939 64769 180698 223143 137615 80633
20774 80633 116315 164285 202965 181454 185862 84551 78681 168376 116700 -5583 -5981 -27623
20762 -27623 -26236 -30165 -31211 -71965 -128605 -76891 -70690 -90026 -12515 99097 91166 19235
20750 19235 -12947 46677 78210 118221 106731 83310 46123 44079 67103 63944 62462 52873
20738 52873 45097 13623 52423 15322 -7402 -18861 -37903 -40452 -39807 -1910 11529 37637
20726C7637K4447k6238r4088o4235l0033J30735L5806K0050O0339j8260p128O587
20714G5619k5895J6380n4421L1878r41M5154p5374l7649M577Q2984K6738l4928
20702E4122n7020L623Q283l700l838J9613N2910M3553L4422J0331n4561K0206
20690A27944J7156n3905O924J8266q910j7448o9997j7782L0727L2206j6479N3191
20678A01893R7753l6180q9104o0431l7946O919K7840L2613N9819l7790n2193m5890
20666c2697M1557p307k7757m7099n2333O7741J6674J2063L4178K9651o3631k2167
20654e1127q161k496n402k7512K8780J9137Q4114l2852K6450j4658l969m4366
20642c2062P027R1667N3819o2565j03501J222N2804J3041j548M7679J8511L6682
$$ plain form
20726 37637 62084 35846 -58242 -122477 -152510 -21775 14031 34081 94420 76160 69032 75619
20714 75619 49724 66104 11683 43561 42620 87774 12400 -25249 -20672 62312 89050 54122
20702 54122 -2898 725 9008 5308 1470 21083 73993 117546 151968 162299 107738 127944
20690 127944 145100 91195 98119 116385 107475 90027 20030 2248 32975 65181 48702 101893
20678 101893 199646 163466 74362 13931 -24015 -17096 10744 43357 103176 65386 13193 -32697
20666 -32697 8860 1553 -26204 -73303 -125636 -57895 -41221 -29158 5020 34671 -28960 -51127
20654 -51127 -59288 -61784 -67186 -94698 -65918 -46781 37333 4481 30931 16273 12304 -32062
20642 -32062 -25035 66632 120451 57886 -45615 -44393 8411 21452 19904 67583 86094 122776
20630A22776n9922J7191l2375p9835m4654k6660k8822L7399P8746P4996R0832
20619A49672o2303m9563P8243M0558j10618n1028N1553n335K1050p8456m3960
20608f0187O569O8506J4567l8776j9763N1248M1442j21727q256P751O134n915
20596e8407J5387l0780l0715l0566P7092l573j6456N7468Q190k913M4968R2132
20584A21827o2917j7421q678j8770j08502J9397N4169J2901N7539j4686q314M1031
20572F7576Q4298L775l639k8313o8894m2676j12785m3982R2251r352J3513k2379
20560g0607K3239R9105m7258j00047r0022L9129K2908Q74k075K4068Q3488J4889
20548b309L0242j1601K3573n8569K5084o9281M0220j979n6726m3675n4299N420
$$ plain form
20630 122776 62854 80045 47670 -32165 -76819 -103479 -132301 -94902 -16156 58840 149672
20619 149672 87369 37806 116049 156607 45989 -5039 46514 41179 62229 -16227 -60187
20608 -60187 -53618 14888 29455 -9321 -29084 22164 63606 -58121 -66377 -58626 -52492 -58407
20596 -58407 -43020 -73800 -104515 -135081 -57989 -61562 -78018 -20550 -12360 -15273 29695 121827
20584 121827 58910 41489 32811 14041 -94461 -75064 -20895 -7994 49545 34859 26545 67576
20572 67576 151874 155649 152010 123697 54803 12127 -100658 -144640 -52389 -61741 -48228 -70607
20560 -70607 -47368 51737 4479 -95568 -185590 -146461 -123553 -122679 -124754 -100686 -17198 -2309
20548 -2309 27933 16332 39905 -18664 6420 -62861 -22641 -24620 -81346 -125021 -179320 -173900
20536a73900N1440N1027P2696P1579r7353l2334R976M792M621N8041L9802j703
20524E8684K8664L8572M691J0087q86l9995p100n7664K802j01961J49016k5147
20512E9763l7480p9073r865j357J9728L0114k4390M1463M625j6225m6168J9601
20500c9264J1431K6815k3035o0499o0684m8836J2759J52264N4127K6832j7801
20489C4109m2017m1655J5622l2900L8194l2202L1565J0615L9243j2052O2270k1480
20477D9312j14879j5147L4182L8204M5687k9486k2910N7572J0880q8173p512L1919
20465a0351k5824l9819O4261J30931p682n2572K2592o5949o3837k0127n2926J33
20453a21170L7334P876K2488N044J2689N8165j1826J3751p1019J5083R6283M0081
$$ plain form
20536 -173900 -122460 -71433 1263 72842 -24511 -56845 -46869 -42077 -37456 20585 60387 58684
20524 58684 87348 125920 130611 140698 139812 99817 92717 35053 37855 -64106 84910 59763
20512 59763 22283 -56790 -66655 -68012 -48284 -18170 -42560 -1097 3528 -12697 -58865 -39264
20500 -39264 -27833 -1018 -24053 -84552 -145236 -194072 -181313 -29049 25078 51910 34109
20489 34109 -7908 -49563 -33941 -66841 -28647 -60849 -29284 -18669 20574 8522 70792 49312
20477 49312 -65567 -80714 -46532 -8328 37359 7873 -15037 42535 53415 -34758 -42270 -10351
20465 -10351 -36175 -75994 -11733 119198 111516 58944 81536 15587 -48250 -68377 -121303 -121170
20453 -121170 -83836 -75960 -53472 -48428 -35739 22426 10600 24351 -46668 -31585 64698 104779
20441A04779P2274M958p4424J6420Q8947m7685j31927r1993k513N0165K8484K468
20429A9953j3209k3312k852O917J982M6502J8446M3840p0263L2787n6501r9301
20417i5011Q018J07713R2320L3659l9808L587m8978K7745j9541P1953N2215q2408
20405A11464q9379p6110n3841J5980j8371k1704N7932M7304o103j9519P8342P8462
20393A04457k9360p8339N6178J3827k2990M6694l4356k778m5951l4641K3298J9145
20381A5184j3780j0171J5600o58P563K2778k2952K3071n14l0978m2503R071J7038
20368a1251P9581J0038l8922l117l1799m3976J6591P0058j724J7295J3250p489
20356F8535o6930n4396m719Q374N652j1844J9557L1875L987M006L8630j0528M826
$$ plain form
20441 104779 177053 182011 107587 124007 212954 165269 33342 -58651 -61164 -10999 17485 19953
20429 19953 6744 -16568 -19420 -12503 -10521 35981 54427 98267 28004 60791 4290 -95011
20417 -95011 -86993 20720 113040 146699 106891 110478 61500 89245 69704 141657 193872 111464
20405 111464 22085 -54025 -107866 -91886 -110257 -131961 -74029 -26725 -32828 -52347 25995 104457
20393 104457 75097 -3242 52936 66763 43773 90467 56111 53333 7382 -27259 -3961 15184
20381 15184 1404 -8767 6833 6175 13738 36516 13564 36635 36121 5143 -37360 -28289 -11251
20368 -11251 68330 78368 39446 36329 4530 -39446 -22855 47203 45479 62774 76024 68535
20356 68535 1605 -52791 -57510 -49136 -43484 -55328 -35771 -3896 91 4097 42727 32199 37025
20343C7025q5743m5436j9810l9587J3947P2461N1092j884j5877J1780j460N0036
20331B6544K9111m0265j4491j9812n1028k9798k7500N9539J02536L6268n7797
20320A3307n137j7697k2782K0795M2161N4380n842n9453O910Q8261J16216K6424
20308B57543j07288q2206j08969k0948P9017J5451o8375j7146R9100M3665O29
20297I0473J0953k6378o2104K2076m1106m7683p4739m2198J28058L8734O328M0534
20285D2948J2234M2530J5188J274R458p477n5230N078k4840O726m374n005J9249
20272E7759P6646M1476k9174n9757j1294K5005O8258j334j37706p0059L7266K6599
20260B3685m4869n8286O2202p8228m2202J7642M6084M950L4210J21580p497l7339
$$ plain form
20343 37025 -48718 -94154 -113964 -153551 -139604 -67143 -16051 -17935 -33812 -22032 -23492 26544
20331 26544 55655 15390 899 -18913 -69941 -99739 -127239 -67700 34836 71104 13307
20320 13307 8170 -9527 -32309 -11514 30647 85027 79185 19732 26642 114903 231119 257543
20308 257543 150255 68049 -40920 -61868 17149 32600 -35775 -52921 46179 89844 90473
20297 90473 101426 75048 12944 35020 -6086 -53769 -128508 -170706 -42648 -3914 2414 42948
20285 42948 55182 97712 112900 114174 123632 116155 60925 66003 41163 47889 43515 38510 57759
20272 57759 134405 175881 146707 86950 75656 100661 168919 167585 29879 -40180 -2914 23685
20260 23685 -21184 -79470 -17268 -95496 -137698 -120056 -73972 -69022 -34812 86768 79271 41932
20248D1932q113r085O3584J8215q102m5345n9317k067l5733O1981J00201l15j25769
20235g933j2140M3578q7563q4646O5343Q6430K8563j5007J5168m4959j9008M5218
20223A3044P6158k8711q5013M0456M2913Q1620j723k0062o3437m209N6548j00248
20211G336n920M1783J6414K804J4218m0792k3964n8229O4371M8519o9298r020
20199a1778K1993l7162R4893O1054Q7941k0206j64715q9834p565K8313k9546l5524
20187a02136O3078N1459n6288L186k7625m6594N9993k2609k8950L5650M2230R9244
20175G0638P945k3571K0264J0848N7224j160j06213j01691l8879J7596L7791M0382
20163h826L1941k886p341K1679j6192k8391j328Q0331P668l2668l9889j1195O0627
$$ plain form
20248 41932 33819 24734 88318 106533 98431 53086 -6231 -8298 -44031 17950 118151 117836 -7933
20235 -7933 -20073 23505 -64058 -148704 -83361 3069 31632 16625 31793 -13166 -32174 13044
20223 13044 89202 60491 -24522 15934 58847 140467 138744 118682 55245 51036 107584 7336
20211 7336 1416 43199 59613 62417 76635 35843 11879 -46350 18021 66540 -2758 -11778
20199 -11778 10215 -26947 67946 129000 216941 196735 32020 -57814 -65379 -37066 -66612 -102136
20187 -102136 -39058 12401 -43887 -40701 -68326 -114920 -54927 -77536 -106486 -70836 -28606 70638
20175 70638 78583 55012 75276 86124 143348 142188 35975 -65716 -104595 -86999 -49208 -8826
20163 -8826 23115 20229 12888 34567 18375 -10016 -11344 68987 76655 43987 4098 -7097 53530
20150E3530M1805r121k0065O1184k5661m1248J5601o663L151Q3487O5150p1615
20138A49535j09239p4946k6343m5315j3373J59696J32248L6781m5658j48731p6524
20127f1869K0313N3178K7610M874n2427M8303M0978q161k9857k3502K1504L9515
20115H0459m9951J6358L0145m2664l1392o599k0450J0262q2623J19604P1990r2265
20103B874j1361J2060J02k7316m6105K9744L2063K4548o2012l525k9313p4353
20091a52594J968O151K2998L6127j2303K1710R4476k5270K4467O9169O1825n608
20079A43116j9684m0564n547p6092J127M2525m4709q786P98K810k720J5678M8280
20066E6232K9087l1781n2014l2199k4095O618q821K0442M761j4775J4657m9781
$$ plain form
20150 53530 95335 86214 66149 127333 101672 60424 76025 69362 72513 156000 221150 149535
20138 149535 40296 -34650 -60993 -106308 -119681 40015 172263 209044 163386 14655 -61869
20127 -61869 -41556 11622 39232 44106 -8321 39982 80960 72799 42942 19440 40944 80459
20115 80459 30508 46866 77011 34347 2955 -3644 -24094 -13832 -96455 23149 95139 2874
20103 2874 -8487 3573 3675 -23641 -69746 -40002 -7939 16609 -45403 -48928 -78241 -152594
20091 -152594 -150626 -144475 -121477 -85350 -97653 -75943 18533 -6737 17730 86899 148724 143116
20079 143116 123432 82868 77321 1229 2356 44881 172 -8614 -7816 -5006 -7726 7952 56232
20066 56232 85319 53538 1524 -30675 -54770 -48152 -56973 -36531 -31770 -46545 -31888 -81669
20054h1669M2487N5089K4136p7086j27086K7215J11388O9000O0365l5647J4934
20043H3126M9652j01599n1037o2689p6377N4961P0647J4085M6597n4004j07207
20032a33845N6455J04772m0694K3777M4204p0465n5508p856n706O7929J6875M8695
20020D8633N4147K5110j2275o2529m1810L1913n8015o3286O0461J24302j6948
20009H9703q3693J4546o7475j3740j952L2671l6326L1601P2311Q345M2683j6517
19997G2157j1860M9013K9411k1456j0121l8840l6850n4k8076q3239j1433O5541
19985b5807o5367O2521R3232M087Q2l4247N5575N8042k4908m8811L6735K56q607
19972A02783r739p5633L2686o3061M3261J1432J1254J7608m6418R604k0607m7313
$$ plain form
20054 -81669 -39182 15907 40043 -37043 -164129 -136914 -25526 43474 103839 68192 83126
20043 83126 132778 31179 -19858 -82547 -158924 -103963 -33316 -19231 27366 -26638 -133845
20032 -133845 -77390 27382 -13312 10465 54669 -15796 -71304 -79160 -84866 -16937 -62 48633
20020 48633 102780 127890 115615 53086 11276 43189 -14826 -78112 -17651 106651 89703
20009 89703 6010 20556 -46919 -60659 -62611 -29940 -66266 -34665 37646 45991 88674 72157
19997 72157 60297 109310 138721 117265 107144 68304 31454 31400 3324 -79915 -91348 -25807
19985 -25807 -91174 -28653 64579 68666 68748 34501 90076 148118 123210 74399 111134 111390 102783
19972 102783 93044 17411 50097 -12964 30297 41729 52983 70591 24173 33777 13170 -34143
19960c4143m5367L8158R0561N3553k9228q4217L371r826M8638J00080L8687n8021
19948A12246j597K0886l4320k7050l0419m5676J6523L5307L892J09p2160j2059
19936c4318M7115K9387J4820l4403q777o367L4922M7120p5080j10442l2049K3858
19924a04214Q8544P6264K4401j0380o1965l0251M0755k113L1563M5769k579k4722
19912G1072m3303k3913J21969N4675j08498n7286K8025O1489n36j6633L4793L9755
19900A61609l366m0221j7487m5705p163M5856L0264j2577J5698m4710j3591p4359
19888e752m5517p2526O2033K15370J5744j00388K1237k6321N9233j5320q0174
19877B7619O111Q1245M0818J698J3763O854k1643q0452n6294M0697O2815L9536
$$ plain form
19960 -34143 -79510 -41352 49209 102762 73534 -10683 -7312 -17138 31500 131580 170267 112246
19948 112246 110649 131535 97215 70165 39746 -5930 10593 45900 49792 49901 -22259 -34318
19936 -34318 12797 42184 57004 22601 13824 7457 42379 89499 14419 -96023 -128072 -104214
19924 -104214 -15670 60594 84995 74615 12650 -17601 23154 21041 52604 98373 95794 71072
19912 71072 27769 3856 125825 180500 72002 14716 42741 104230 103694 87061 121854 161609
19900 161609 158243 118022 100535 54830 47667 93523 123787 111210 126908 82198 68607 -5752
19888 -5752 -51269 -123795 -61762 153608 169352 68964 90201 63880 123113 107793 27619
19877 27619 33730 114975 155793 157491 171254 178108 156465 76013 19719 60416 123231 162767
19865A62767n7372j03306k2477j1914J1832J0561N6547l8942N8305j062m4739
19854B0200L9020R5658M6332k814o2822m3313j1093j3937K9188k0908l2752l6961
19842E798k8040O3684L1555L890Q252j02220o3646J04164N1243l4306o1314L6823
19830A5883M8524O0088N4866k9854o7723l3194J4124m8238k3699R2949L9973j0340
19818A13359q9791q0569l3180L5167N4588M215N0700O9858k5207k1294n0858N0414
19806G7402J9681J630q3583k6550M2550L6837l6319N6599J7794P5086M9591p578
19794B23140k6023l0398p0947j7387n0065j7984k6006R4832N6109Q0707p1988
19783A43990m6903j4210k3170k2290l1009L6797l6942K6043j0966Q081J1599p495
$$ plain form
19865 162767 105395 2089 -20388 -32302 -20470 -9909 46638 7696 66001 64939 20200
19854 20200 59220 154878 201210 198396 135574 92261 81168 67231 96419 75511 42759 5798
19842 5798 -22242 41442 72997 76887 85139 -17081 -80727 23437 74680 40374 -20940 15883
19830 15883 64407 124495 179361 149507 81784 48590 62714 14476 -9223 83726 123699 113359
19818 113359 23568 -57001 -90181 -55014 -426 3789 54489 124347 99140 77846 26988 77402
19806 77402 97083 98713 15130 -11420 31130 67967 31648 88247 106041 181127 230718 223140
19794 223140 197117 166719 95772 78385 28320 10336 -15670 79162 135271 215978 143990
19783 143990 97087 82877 59707 37417 6408 43205 6263 32306 21340 29421 41020 33525
19771C3525J8704q147J340l1594k4341O7014M7932o9058j15225k5443L5663R638
19759e9992l1049N9893L5739m2625K3974J7163J4777J7532O4663R5357K1506l5759
19747A81179n0953J5528L6109k0903n5386L8117J00077L7621m8041n2950N344
19736A85742O4441J09781J21868R9014K19415J43663j3837m9505p2880j44189
19726F63513j22858N8950k9489J8396K5508M5033J85984J69102Q05p9613p9211
19715H56120m2260K5135k9593q5036j56001k12542j21872r228R894n6872j3161
19704A64584M0094M5634k0294j31577r281k8020q3961Q0861N1112K4308o465O7611
19692A94606J17528N5531K0931O4840J1263j6519j19303p2231j14041q045J03931
$$ plain form
19771 33525 52229 44082 45422 13828 -10513 56501 104433 35375 -79850 -105293 -69630 -59992
19759 -59992 -91041 -31148 4591 -38034 -14060 3103 17880 35412 100075 195432 216938 181179
19747 181179 130226 145754 181863 160960 105574 143691 243768 281389 233348 180398 185742
19736 185742 250183 359964 481832 580846 800261 943924 930087 880582 807702 663513
19726 663513 540655 599605 570116 588512 614020 659053 845037 1014139 1014944 935331 856120
19715 856120 813860 838995 809402 724366 568365 355823 233951 224723 234617 177745 164584
19704 164584 204678 250312 230018 98441 89160 61140 -22821 58040 109152 133460 126995 194606
19692 194606 312134 367665 388596 453436 464699 448180 328877 256646 142605 134560 238491
19681B38491J30687K10655J40088J36820K34672J97932J63571q2250k08148j84233
19671I78285j3718P2979j07375p3804l0665p714P4399J12695j61247k33898j11160
19660D98777o0260j2304m8138l6841j31820p8059l7102N6034R402j3429O085K254
19648A54599j4744j6659j2933J1079P830k8393p9458M2129L8844k3974j9353M0632
19636I9599K923M6799J0443l0009j10113L1437J04021M5541l376p0063K0592J04148
19624B51942Q525o3051r5540m2783m5995J2212Q4016O060o1612n9698J05194M523
19612A03793n045J5906L7387k7406j3512J84955P2617n4952k3809J23333R0763
19601E04030Q6793J16394J03483J5760L5610k8681l5497p6526j0835K1184K5381
$$ plain form
19681 238491 369178 579833 719921 856741 1091413 1289345 1452916 1370666 1162518 978285
19671 978285 964567 1037546 930171 856367 825702 817988 892387 1005082 843835 609937 498777
19660 498777 438517 426213 378075 341234 209414 131355 94253 150287 159689 146260 152345 154599
19648 154599 139855 123196 110263 121342 129172 100779 21321 63450 102294 78320 58967 99599
19636 99599 102522 149321 159764 129755 19642 51079 155100 200641 197265 127202 147794 251942
19624 251942 260467 197416 101876 59093 13098 25310 109326 115386 53774 -5924 99270 103793
19612 103793 98748 114654 152041 124635 111123 296078 368695 313743 289934 413267 504030
19601 504030 590823 707217 810700 826460 862070 833389 797892 721366 710531 731715 757096
19590G57096J11941J41890J40949O9476j19197j36581q820j59513j13335j15372
19580E68534o3906K0095P209K1572q9921r8024o4357p2562M3876J6402o0349l1518
19568A97051l0541k2612J2399j7116M3031K7026P1314O6907p6280p118L5422q1883
19556B17600N8051P5399K7012K7388J02801P4701J4583M5337j5358k5384L0803
19545F32933J08950K49222J55917N2054K5914k5127r1579j51898p5639m4245J6771
19534H53273M5762Q9125J01383P1491q314o1771j79361j16587j84495k15293q1120
19523C14093j06561j6406Q4211M1222o4020m7346K2530p9027l7646j0752L4823
19512A35121j3982P766K2010O4892k0666K1843j6222n8942J7027K5483K1343L2193
$$ plain form
19590 757096 869037 1010927 1151876 1221352 1102155 965574 956754 797241 683906 568534
19580 568534 504628 524723 531932 553504 463583 365559 301202 228640 272516 288918 228569 197051
19568 197051 166510 143898 156297 139181 182212 209238 280552 347459 271179 264061 299483 217600
19556 217600 275651 351050 378062 405450 508251 582952 597535 642872 627514 602130 632933
19545 632933 741883 991105 1147022 1199076 1224990 1199863 1108284 956386 880747 836502 853273
19534 853273 899035 988160 1089543 1161034 1152720 1090949 911588 795001 610506 395213 314093
19523 314093 207532 191126 275337 316559 252539 205193 227723 148696 111050 100298 135121
19512 135121 121139 128905 150915 215807 195141 216984 200762 141820 158847 184330 205673 237866
19500B37866N0878j7199j0631m1823m6573m635m3539l7911O9859P2661j16600
19489A12353j4334l222M9437Q906K8896J6307m8085O444P9902j2677N6318J10460
19477C90705k1014o2909j7736P3328r2126l2569k5510J666j9155q285L0752P8281
19465B95428Q6615k9537q9006o4016k4343L2676P0305J6596k1760L8377r710L5938
19453C37563J2923l7793r465J7284q5441J8839L516Q3565O6980l2380k2492j61270
19441A91829J5067N7005k9023k1742m675L7205N2121k6763K5180O1592M7380l3586
19429C71590J5071p415n0007J9769n792k5541K8529O5594Q762M5393O1720J3473
19417E41146M0757r7376m019O146J915l3747P497o5716Q561J3536J5716k8936
$$ plain form
19500 237866 288744 271545 260914 219091 172518 167883 124344 86433 156292 228953 112353
19489 112353 98019 94797 144234 153140 182036 198343 150258 156702 236604 223927 280245 390705
19477 390705 369691 306782 289046 362374 270248 237679 212169 213835 194680 186395 217147 295428
19465 295428 382043 352506 263500 199484 175141 207817 278122 294718 272958 311335 301625 337563
19453 337563 350486 312693 303228 320512 235071 253910 257426 340991 407971 375591 353099 191829
19441 191829 206896 263901 234878 213136 208461 245666 297787 271024 296204 357796 405176 371590
19429 371590 386661 379246 329239 349008 343216 317675 346204 411798 420560 465953 527673 541146
19417 541146 581903 484527 480508 486654 488569 454822 462319 396603 405164 418700 434416 405480
19405D05480m8698m0545l0737j2752M1700J01651M8903n8088m7435P480l8808
19394C28151j6190O1175Q423m8260m6178n4724n2261l6676k303l3498N9633N4822
19382B22114n5126O5832L3320K0062Q9995M0950l0336m253m4576k8735j3586n2234
19370B43427N7725M7645Q2482l430j03049J5507L0653K8523k524o5825m0185P5011
19358C65960J35343M5653o0713l8892K3944l7997j18226l9445M606n3191n0824
19347A76218J15928Q128m8270K1551L4280N2301R8974N4527N83J680K0125R535
19335E45560N6683K7778k0625J606K9823q002l9086j3554R8836Q8326J01978M2600
19323I11923l3777K977q3623p2135j11328j06952l776O1057N7361P1154P3268
$$ plain form
19405 405480 356782 316237 285500 272748 314448 416099 465002 406914 359479 366959 328151
19394 328151 311961 373136 381559 333299 287121 232397 180136 143460 141157 107659 167292 222114
19382 222114 166988 232820 266140 286202 376197 417147 386811 382558 337982 309247 295661 243427
19370 243427 301152 348797 431279 427849 324800 340307 370960 399483 396959 331134 290949 365960
19358 365960 501303 546956 486243 447351 471295 433298 315072 275627 280233 227042 176218
19347 176218 292146 300274 252004 273555 307835 360136 459110 513637 514220 515900 536025 545560
19335 545560 602243 630021 609396 611002 640825 632823 593737 580183 679019 767345 869323 911923
19323 911923 878146 881123 797500 725365 614037 507085 503309 564366 621727 692881 766149
19312G66149m548k6577P8992N3222m1080n4182N4534M4115o3127j4671q238N052
19300G89641N349o677J2205n6601J352j214O1912J06831L379P572p2916o1802
19288G89031k6183p9392K5711M875P3019R3119n4295J8053M034r5675N0542l504
19276G99335J17580J17131M0673L5389p813N8060N8002N3421K5967K1053m2939
19265A275859R86K7369M5775L1723M6268N2255J42579J25516J34494J28789M7676
19254B059289J23725J44939R9466N7756J95088K68618K64417L90644M01974L45106
19244D351022L88075J73665K0549K56794L98247M89184O02597P74263R74838J329617
19234I758851J769875K058512K806492M040843N653719O120759L567990P4331
$$ plain form
19312 766149 761601 735024 814016 867238 826158 771976 826510 870625 807498 792827 784589 789641
19300 789641 794990 788313 800518 743917 745269 744055 805967 912798 916177 923749 850833 789031
19288 789031 762848 683456 709167 714042 787061 880180 825885 843938 847972 752297 802839 799335
19276 799335 916915 1034046 1074719 1110108 1102295 1160355 1218357 1271778 1297745 1318798 1275859
19265 1275859 1276845 1304214 1349989 1381712 1427980 1480235 1622814 1748330 1882824 2011613 2059289
19254 2059289 2183014 2327953 2427419 2485175 2680263 2948881 3213298 3603942 4005916 4351022
19244 4351022 4739097 4912762 4933311 5190105 5588352 6077536 6680133 7454396 8429234 9758851
19234 9758851 11528726 13587238 16393730 20434573 26088292 32209051 35777041 35851372
19226C5851372k14137K331519N629876J0051224J7495636K8491210M0131056M0474557
19218A80242313J2700831j9244171k3401469r315439m674535j8634820k6734617
19211I0938093k1689408j1082938j716811N695451J0201465O750161o097551j5338499
19203E7659963j5416354j0799637o787064m301647k852552j803093r87317m28365
19195A4283934J18981K93297K95196L14205L87785N75181O07285M92673O31469
19186A8000006J405307K540396L836270N170373P141866J0547122J5677537K0879013
19178H5197890K1257117Q872704q523709j4802512r884854j218889P108330J6222744
19170A04228821K7838045M3405160O2060828P1990576N5602013L7323800J7082401
$$ plain form
19226 35851372 35637235 37968754 43598630 53649854 71145490 99636700 139767756 180242313
19218 180242313 192943144 173698973 150297504 140982065 136307530 117672710 90938093
19211 90938093 69248685 58165747 56448936 62144387 72345852 79096013 72998462 57659963
19203 57659963 42243609 31443972 24656908 20355261 17502709 15699616 14712299 14283934
19195 14283934 14402915 14696212 14991408 15305613 15693398 16268579 16875864 17368537 18000006
19186 18000006 19405313 21945709 25781979 30952352 38094218 48641340 64318877 85197890
19178 85197890 106455007 115327711 106804002 92001490 82116636 80897747 88006077 104228821
19170 104228821 132066866 175472026 237532854 309523430 365125443 402449243 419531644
19163D19531644k8046196p5653820q8781489o8791258m1834740k1275575p449060
19156H7699506J310967J278442r694060j7478409j6347787j1249089p035196m598419
19148B3885955l382092k738197k268914j834173j337151q30440m77533k20538
19140A0796917k05886k91389n56981q24061r32846o97830m41373m71206n34427
19131E840918m66664l94819l66024l14622l38284j55042m4723M7409J81783J05992
19121D095924J1314j11031j64892j70474p7399R0809O3678O1N812L085K31805
19110C978692J45049K26476K71729L93215L04820L58097L37501M11297L74007
19101F800883K45110L88531M76979O06920P13967P61213R24821J078698J098470
$$ plain form
19163 419531644 391485448 315831628 227050139 158258881 116424141 95148566 87699506
19156 87699506 89010473 90288915 80594855 63116446 46768659 35519570 28484374 23885955
19148 23885955 20503863 17765666 15496752 13662579 12325428 11494988 11017455 10796917
19140 10796917 10591031 10299642 9742661 8918600 7985754 7287924 6846551 6375345 5840918
19131 5840918 5374254 4979435 4613411 4298789 3960505 3805463 3760740 3808149 3989932 4095924
19121 4095924 4107238 3996207 3831315 3660841 3583442 3674251 3737929 3737990 3743802 3746887 3978692
19110 3978692 4123741 4350217 4621946 5015161 5319981 5678078 6015579 6426876 6800883
19101 6800883 7045993 7434524 7911503 8518423 9232390 9993603 10918424 11997122 13095592
19092A3095592R73753J035607J470103K094485K885861L854240N097984P064108
19084C7571733R971543J3476625J5011389J1967154R926635Q023278Q097061J5749841
19076A29795259L0603185M8925174O2219066N7843529M0864644J8228170j2879386
19069C75599641m8858172n8110455n7473888n3251693m1100867k5354759j2171771
19062G9278036k325319N137930R348594O364379j039535p347709j4502022j7331608
19054E7582746j4791417j0079447o295880l938103k713987j815201j406145j222897
19046A5319669r30526n98654m04198k68849K236K18684N82094Q59319J155110
19037A5934885J698644K530567L892514N811410Q731045J1541749J1949153P620649
$$ plain form
19092 13095592 14069345 15104952 16575055 18669540 21555401 25409641 30507625 37571733
19084 37571733 47543276 61019901 76031290 87998444 97925079 105948357 114045418 129795259
19076 129795259 160398444 209323618 271542684 329386213 370250857 388479027 375599641
19069 375599641 326741469 268631014 211157126 157905433 116804566 91449807 79278036
19062 79278036 76952717 82090647 91439241 97803620 96764085 89416376 74914354 57582746
19054 57582746 42791329 32711882 26416002 22477899 19763912 17948711 16542566 15319669
19046 15319669 14389143 13790489 13386291 13117442 13119678 13338362 13920456 14779775 15934885
19037 15934885 17633529 20164096 24056610 29868020 38599065 50140814 62089967 69710616
19029F9710616L541882p48337m014540j930411M901342J3207866J8510796J5561366
19021A18740580J4652831J5829196J3761673N829713o419407j4104585k6018898
19014A22271103l2133851k7186672j7240534r171288m151199j254871q38496j795941
19006B8498251k619379l900566m398422l706842k590814j867069j345470q97509
18998G172180n73209m34173m40710m01058m31387m82173n63439n31030l86457
18989B928544l14337k79955j37092j22765j42797j56085n1022n2143l1895j9142
18979A621311L0077o9811r5651o1313o8903j29614j68312j12438n7946K0967r2755
18968H15612k9921L1636Q2819K3692l6237j3447N163j2577J532O5270k2462n2982
$$ plain form
19029 69710616 73252498 72504161 68489621 66559210 71460552 84668418 103179214 118740580
19021 118740580 133393411 149222607 162984280 168813993 162394586 148290001 122271103
19014 122271103 90137252 62950580 45710046 36538758 32387559 31132688 30294192 28498251
19006 28498251 25878872 21978306 17579884 13873042 11282228 9415159 8069689 7172180
18998 7172180 6598971 6164798 5724088 5323030 4891643 4409470 3846031 3315001 2928544
18989 2928544 2614207 2334252 2197160 2074395 1931598 1775513 1724491 1672348 1640453 1621311
18979 1621311 1651388 1581577 1485926 1424613 1355710 1226096 1057784 945346 887400 908367 815612
18968 815612 785691 817327 900146 923838 887601 874154 879317 866740 868272 933542 911080 858098
18956H58098L8106O2959m2233k0743M0756J02751J12879Q9927O7786Q3984K0147
18945A414417P7036N5685Q2322K25818L20712K45489J70783p494j52630k66845
18935B165293k18204k93403l24105k26838p8476J08238J00167M1949R8130R1018
18925A463769K9169o0644j38805q8917m2060J08727J00145j18363j53017O1625
18915A161629N0993r1430j11954j25675j98729j16069N4799J71446P0577J31231
18905I96818N3551M7316J17239K18860L24354J51957p6679j71089r8439j37753
18895A426135j66195p3003K5835j1019J6838J06897N9246Q6227J74905J62380
18885A808246O7686j03732k15736k52433k53410j34057n0163O2331K7319K9293
$$ plain form
18956 858098 896204 959163 916930 896187 936943 1039694 1152573 1242500 1310286 1394270 1414417
18945 1414417 1491453 1547138 1629460 1855278 2175990 2421479 2592262 2584768 2432138 2165293
18935 2165293 1947089 1653686 1329581 1102743 1024267 1132505 1232672 1274621 1372751 1463769
18925 1463769 1492938 1432294 1293489 1204572 1162512 1271239 1371384 1253021 1100004 1161629
18915 1161629 1212622 1121192 1009238 883563 684834 568765 623564 795010 865587 996818
18905 996818 1050369 1097685 1214924 1433784 1758138 1910095 1833416 1662327 1563888 1426135
18895 1426135 1259940 1186937 1212772 1201753 1218591 1325488 1384734 1470961 1645866 1808246
18885 1808246 1875932 1772200 1556464 1304031 1050621 916564 866401 928732 956051 985344
18875I85344J5621j6959P7229L8114J15469K56378M90949O35101O60052M51456
18865C708754O135k90889k97654m79591n37802m41759k59975o5128l1428P4960
18855A385623P1555n0430j87901k08901o2773j34839j82666P831O8802j5163m873
18844F86265M0757j1972j20150m7984J4031m8183o251n900L5614p7781j38846
18833C19600k6111L1329K8713N5225N2474k7026l8574k7215J0269l6603p047N5999
18821C91033R4686M0964M272P0339J35216K42470K67272K81550K92639K80699
18811B101140J73809N3589j45696k21168k71763l13995k06825j22726j22025r5407
18801H28933k2759N5714J4699q9429j35707k8135l9251j05151r6531l8641j4680
$$ plain form
18875 985344 1000965 984006 1061235 1099349 1214818 1471196 1962145 2597246 3257298 3708754
18865 3708754 3714889 3424000 3126346 2646755 2108953 1667194 1407219 1342091 1310663 1385623
18855 1385623 1457178 1406748 1218847 1009946 947173 812334 629668 637499 706301 691138 686265
18844 686265 727022 715050 594900 546916 560947 512764 506513 500613 536227 458446 319600
18833 319600 293489 324818 353531 408756 461230 434204 395630 368415 378684 342081 335034 391033
18821 391033 485719 526683 530955 601294 736510 978980 1246252 1527802 1820441 2101140
18811 2101140 2274949 2328538 2182842 1961674 1689911 1375916 1169091 1046365 924340 828933
18801 828933 806174 861888 876587 787158 651451 623316 584065 478914 382383 343742 329062
18790C29062J1429p1096q7819k9544n9871n1870m5849k5205L6320L2257P4566
18779A12380P2847Q5989l2852j7068M3740N564K3116N4387J98230J67886J31390
18768H45609K00346J76232r9581k47542k54106j05931p320O1086P9110Q0728J27302
18757H55933P2164J0016r7521j56145j14555j77522r6654p1983K5286o093k0876
18746B22050k3572l1117j00580q0100P0648L2368K5148r7063o8066R2373Q9661
18735A31750M9766J0386p6017P5452Q1211j26858j03332j31991O0190J00647R8564
18724A69768M3201O106K2323m8205p5554j6165N9169K6713p2913n688m763k7628
18712G6364L5814N1737P4729N3943Q0742R9216J26991J14021J07654J94988J07073
$$ plain form
18790 329062 340491 269395 181576 152032 92161 40291 -5558 -30763 5557 37814 112380
18779 112380 185227 271216 238364 221296 265036 270600 293716 348103 546333 714219 845609
18768 845609 1045955 1222187 1122606 875064 620958 515027 507707 568793 647903 728631 855933
18757 855933 928097 938113 840592 684447 569892 392370 295716 223733 249019 242926 222050
18746 222050 198478 167361 66781 -13319 57329 89697 114845 17782 -50284 42089 131750
18735 131750 181516 191902 115885 191337 272548 145690 42358 -89633 -29443 71204 169768
18724 169768 212969 219075 241398 193193 117639 101474 160643 187356 114443 108755 103992 76364
18712 76364 112178 163915 238644 292587 373329 472545 599536 713557 821211 1016199 1123272
18701A123272o3151j72751j36802p6479l1109J07166J54434J82192K67261Q6019
18691A440052L2008j81837j71378k03911k24003q5025p2624J9275K5357Q5761
18681F63675m7815j20510j71137l3181Q2283K5551k5154n3149j7163k9727j0126
18670B63547q1028J784J05085j2441p9202O2559m1966n6842q8808M4019Q1958
18659A98665Q4468N3379J20599P6552k5630k7848o2123K6288R1653j0942N6380
18648E81441J68590K19461J21009l5309m0607j34235k24122j52819j7004M6084
18638E32489N7545J74788R0409J2888m0886j67389j76346j66820j7187k171R141
18627C06461l2152m9670p0150j11497m0174K8526O0085K6552K4610n2131j3770
$$ plain form
18701 1123272 1060121 887370 750568 674089 642980 750146 904580 1086772 1354033 1440052
18691 1440052 1472060 1290223 1118845 914934 690931 605906 533282 552557 577914 663675
18681 663675 615860 495350 324213 291032 373315 398866 373712 320563 303400 273673 263547
18670 263547 182519 184303 289388 276947 197745 260304 218338 161496 72688 116707 198665
18659 198665 283133 336512 457111 533663 508033 480185 418062 444350 536003 525061 581441
18648 581441 750031 969492 1090501 1055192 1014585 880350 656228 503409 486405 532489
18638 532489 590034 764822 855231 868119 827233 659844 483498 316678 299491 297320 306461
18627 306461 274309 224639 154489 42992 2818 31344 91429 117981 142591 90460 76690
18616G6690J3341L6799M0181L353r5489k2525P1372M5397m0343o6290p0051J6316
18604H751J09530K5679j4697p8488p8844k400O2626L1711O0835Q6267N813n7369
18592A59414m6133K0350N2742K4658k6989P2350L2193O799q5989Q308K451l5923
18580A84231K3373k1750j9003J5918k681J2410K4833j3442K709J05308O9827J1986
18568C93719n2692P1049J66844J59497J09546O4829J18462J18161Q7928R3908
18558A331251L0897j45163j05041N9850l941J8475J16286k985l2806o8296k07177
18547I91350k59115k32609q8186n8057J6346K332N4051L3176R5604K7575j028
18536E81439K6816J5273L9790p3684l6784n8086p2032j28782n2803P9226J34708
$$ plain form
18616 76690 90031 126830 167011 170364 74875 52350 123722 169119 128776 62486 -7565 8751
18604 8751 118281 143960 129263 50775 -28069 -30469 32157 63868 124703 210970 216783 159414
18592 159414 113281 133631 186373 211031 184042 256392 288585 295384 209395 217703 220154 184231
18580 184231 207604 185854 166851 182769 180088 192498 217331 203889 206598 311906 381733 393719
18568 393719 341027 412076 578920 738417 847963 912792 1031254 1149415 1237343 1331251
18558 1331251 1362148 1216985 1111944 1171794 1167853 1186328 1302614 1299629 1266823 1198527 991350
18547 991350 732235 499626 411440 353383 369729 372061 426112 459288 554892 582467 581439
18536 581439 608255 623528 663318 589634 552850 494764 422732 293950 241147 320373 455081
18525D55081N166l6512J41702N7153m3506o7385j2594N8635J53318R1487J58226
18514I60771J85142J30993O1717j22003j25477q3184k3753n9399j8597J3619M1958
18503I61787K8418p549o0656q9298J24813J12627O6191q7817j23837p7929k52545
18492E94205j80910p8857q9071L2915J3183L5595o7949m4399m480j9345J9659
18481B10546M9590q2569L1537L3673j21250j6202N7366O3595l3212k093P9724
18470B70705L4414L3594Q3223Q9907L6756K8447r3034j2657n9576j10719o9667
18459B31393L8522O5972J73027K07486M1895M7116J37495J9835p9900r968O5097
18448I37970k8189J17214J85931O540k04957j60959n9438m9390j6502L6959M4807
$$ plain form
18525 455081 460247 423735 565437 622590 579084 511699 499105 557740 711058 802545 960771
18514 960771 1145913 1276906 1338623 1216620 1091143 1007959 984206 924807 906210 919829 961787
18503 961787 990205 982656 922000 832702 957515 1070142 1136333 1048516 924679 846750 594205
18492 594205 413295 334438 245367 278282 291465 327060 259111 214712 210232 190887 210546
18481 210546 260136 177567 209104 242777 121527 105325 162691 226286 193074 190981 270705
18470 270705 305119 338713 421936 511843 548599 577046 484012 471355 411779 301060 231393
18459 231393 269915 335887 508914 716400 758295 805411 942906 962741 882841 872873 937970
18448 937970 909781 1026995 1212926 1219466 1014509 853550 794112 744722 728220 765179 809986
18437H09986N8993J53505J57310J81382K74786L68517L31358N9947l32798m31217
18427A631769l65128k39913n8281J25962K68707J24703j33898k61812j21838m5262
18417I25009l4729j10660P3612Q9942J48151L0796o445q2983j55648p7479O083
18406H05649p1895N0545J81097J82802J76813K71252L20517L35198K85842O8823
18396B606643l90810n25411m38372k27614j21842L3274m7625k6706O4691r872
18386I16356N1749q1202r0863r6690r641K0876J0873j5331R178L504k0413K2623
18374G21019R3043R8751k1744K2516N2674J0424o8442k7247l587L662K6145M3964
18362I51178J26262J52517n6326o0429Q23L1919N0437N9259J01567J96593K42667
$$ plain form
18437 809986 868979 1022484 1179794 1361176 1635962 2004479 2335837 2395784 2062986 1631769
18427 1631769 1266641 1026728 968447 1094409 1363116 1487819 1353921 1092109 970271 925009
18417 925009 890280 779620 853232 943174 1091325 1122121 1115676 1032693 877045 799566 805649
18406 805649 733754 784299 965396 1148198 1325011 1596263 1916780 2251978 2537820 2606643
18396 2606643 2215833 1690422 1252050 1024436 902594 935868 888243 861537 926228 916356
18386 916356 968105 886903 796040 699350 689709 710585 721458 706127 715305 718809 698396 721019
18374 721019 814062 912813 891069 913585 966259 976683 908241 880994 877407 881069 907214 951178
18362 951178 1077440 1229957 1173631 1113202 1114025 1145944 1196381 1255640 1357207 1553800 1796467
18351A796467J55234rJ0340J30235K81465L43285L69311O2342k81361m09318k39065
18340B218926j39921r0924l0426R371J69510J26085l2475K5995N6256M9976J25314
18329B487687K31722K30491L18579M41585L62885M36806N97697Q30611J161157
18320G099220J463175J321215J196769J539544K304264L392787M793341O607242
18312B9717557Q406463J0312367J4705465K5312087M3436301O3407252O1152964
18305B56450456j6663132o8820333o6687557l9351827k1250384j2471464p747513
18298B3458246n076827l508537k302054j359753o00491P5194L85469K91724k50183
18289A1112788k70683N3965M55831P51773Q09934J054282J645467K630983L847506
$$ plain form
18351 1796467 1951701 1951692 1962032 2092267 2373732 2717017 3086328 3148670 2867309 2457991 2218926
18340 2218926 2079005 1988081 1957655 1967026 2136536 2262621 2230146 2256141 2312397 2362373 2487687
18329 2487687 2719409 2949900 3268479 3710064 4072949 4509755 5107452 5938063 7099220
18320 7099220 8562395 9883610 11080379 12619923 14924187 18316974 23110315 29717557
18312 29717557 38124020 48436387 63141852 88453939 131890240 195297492 256450456
18305 256450456 239787324 170966991 104279434 64927607 43677223 31205759 23458246
18298 23458246 18381419 14872882 12570828 11211075 10610584 10685778 11071247 11362971 11112788
18289 11112788 10842105 10896070 11351901 12103674 12913608 13967890 15613357 18244340 22091846
18280B2091846N556482P812517R757060J2757977J9978222L4375325N6574862
18273A68904291P7709494N7425484m0527056q4422347p1230649l9816008k1572379
18266D6470830j3012326q464008n732605m053176k933997j863866p69407k21245
18258I420200M2681m17632r95719j240456j021369q58124o97247n83978m49528
18249C198828k36072j99026k02942k28500k17771j86924j60857j45209j71767
18240A449760o3105N0694O6128L3129J71107L14038M52363L75146j02814m58068
18230B288378l96170k79257j08256k3986r4206r1940j59112p3908j34804r5075
18220H31664M7910l066r1131m491N3750p3333j03647J834M8393l6435p2929o1867
$$ plain form
18280 22091846 27648328 35460845 45217905 57975882 77954104 112329429 168904291
18273 168904291 246613785 304039269 263512213 179089866 107859217 68043209 46470830
18266 46470830 33458504 24994496 19261891 15208715 12274718 10410852 9641445 9420200
18258 9420200 9462881 9045249 8049530 6809074 5787705 4929581 4232334 3648356 3198828
18249 3198828 2962756 2763730 2560788 2332288 2114517 1927593 1766736 1621527 1449760
18240 1449760 1386655 1437349 1503477 1536606 1707713 2021751 2474114 2849260 2746446 2288378
18230 2288378 1892208 1612951 1504695 1480709 1386503 1294563 1135451 1061543 926739 831664
18220 831664 879574 876508 785377 780886 834636 761303 657656 659490 707883 671448 598519 536652
18208E36652O0176J4979n9457M3163M9739m3160P0365Q7305O6464r4086J1856
18197G43996J65298l9854q5139j9238J6553k7718L0400J44129N5965j27341j53560
18186G03491J502k3693L0409J1514P6280K9843j8881L8145Q0828Q5768O9054m0336
18174A043924j60310r2530J5417r8281q5592L3902J29986P3355N3907J18590K7281
18163A059649Q3998P6098J40635J18876j08518j37968j57380j01594j5887J10112
18153A068021J71662J54259O2021j72516j74341o5465N6203j04335k838J69461
18143A162132K370l076k9126o694l1042P8495J47377N0254J66511Q5885j295J5994
18131A637785Q9601J39967P2425L0403J40166K53978L28598M07032M45277P11244
$$ plain form
18208 536652 596828 611807 552350 595513 645252 602092 672457 759762 826226 732140 743996
18197 743996 909294 869440 784301 765063 781616 753898 784298 928427 984392 857051 703491
18186 703491 704993 681300 711709 723223 799503 829346 810465 848610 929438 1015206 1084260 1043924
18174 1043924 883614 791084 806501 708220 622628 656530 786516 859871 913778 1032368 1059649
18163 1059649 1143647 1219745 1360380 1479256 1370738 1232770 1075390 973796 957909 1068021
18153 1068021 1239683 1393942 1455963 1283447 1109106 1043641 1099844 995509 992671 1162132
18143 1162132 1164502 1161426 1132300 1125606 1094564 1173059 1320436 1370690 1537201 1623086 1621791 1637785
18131 1637785 1727386 1867353 1939778 1970181 2110347 2364325 2692923 3099955 3545232 4256476
18121D256476Q71784J089982J339221J765010K366427L505995M714817N787604
18113B5697316Q215228J4225289K4895464L8079833M4284940K891861m0916925
18106A17373006m5953996k8947969j5195882q530174n082388l178806k219416
18099H264375j658910j202291p79143o42763m89118m10726l08329k76795j90148
18090B306152j05332j73932k11623r2263n3376J26l3783j06812j20433r0940j44941
18079A172843j13528M8310N2029N161M3219J3020j2143K2983P3957M1978J8259
18068A366088j12553j84645j46595j29499j11044K3486J9989m5718l6933j7611
18058F24965P1167j4189j5587K5571r7618p8595J0376K8302m807o5042O7333R4525
$$ plain form
18121 4256476 5128260 6218242 7557463 9322473 11688900 15194895 19909712 25697316
18113 25697316 33912544 48137833 73033297 111113130 155398070 158289931 117373006
18106 117373006 71419010 42471041 27275159 18744985 13662597 10483791 8264375
18099 8264375 6605465 5403174 4624031 3981268 3492150 3081424 2773095 2496300 2306152
18090 2306152 2200820 2026888 1815265 1723002 1669626 1669752 1635969 1529157 1408724 1317784 1172843
18079 1172843 1059315 1107625 1159654 1164815 1208034 1221054 1208911 1231894 1305851 1347829 1366088
18068 1366088 1253535 1068890 922295 792796 681752 705238 725227 679509 642576 624965
18058 624965 696132 681943 666356 691927 594309 515714 526090 554392 549585 484543 551876 646401
18046F46401K6364k9974J2514N1518o2984k7365n7260n6406n9282K1215M9811
18035E14552M6242o9405j2858n3592j36503j22488n7157J58217P8307k1994k7592
18024B95729n0133L6788L3750M7156O6345j9804L3027K7901n5044k9289L0826
18013D17252K1411J9161p3373p4198Q565Q964N5437J5389j4732J5023O7543P9125
18001E45567J3833m1402p6283j20223j09389O4284O1852Q1629M3701Q885n596
17990D66858n006o1102n0930j6153n3512J3141O6121J2907l6008n8192j2765j5932
17978B49427J2566q761j4018j9207Q2348Q3317j9639p1832K6221K3139l270M1999
17966C82290J7130Q530K6065N5217Q5092l0817r596J2244m41L9716K3507k8212
$$ plain form
18046 646401 672765 642791 655305 706823 643839 616474 559214 502808 443526 464741 514552
18035 514552 560794 491389 478531 424939 288436 165948 108791 267008 345315 323321 295729
18024 295729 245596 282384 316134 363290 429635 409831 442858 470759 415715 386426 417252
18013 417252 438663 457824 384451 310253 318818 327782 383219 398608 383876 398899 466442 545567
18001 545567 559400 517998 441715 321492 212103 276387 338239 419868 463569 472454 466858
17990 466858 461852 400750 349820 333667 280155 293296 359417 372324 336316 278124 265359 249427
17978 249427 261993 253232 239214 220007 302355 385672 366033 294201 320422 343561 340291 382290
17966 382290 399420 407950 434015 489232 574324 543507 533911 546155 545714 585430 608937 580725
17954E80725k8188j2733O7241K3628j5240j05491Q401M2504J6994n4963L5426
17943E58304K21706J44206K23070K23919K05821n0028k13214k33640j76095o7848
17933H36201o8720k2955Q6327l126M7829K0474J04612O1761J3474J139k8885L3272
17921A081403J05154J12893J86704J80765K70928L89588J79045j23728p1313n4303
17911B257136P4501O1052K22009K49736K57869J95635R6470J42878L76966L76142
17901D310394M1531j66321J581L41160M42834N30565N63213L70354L55615N38725
17891G329651Q63977J279116J789171K397344L361720M555268O597887Q526664
17883C6700798R885909J2997831K1427050L8161461O1371047Q0403072M6078667
$$ plain form
17954 580725 552537 539804 607045 630673 615433 509942 518343 560847 577841 522878 558304
17943 558304 780010 924216 1147286 1371205 1577026 1526998 1313784 1080144 904049 836201
17933 836201 767481 744526 830853 827727 875556 896030 1000642 1062403 1075877 1077016 1048131 1081403
17921 1081403 1186557 1299450 1486154 1666919 1937847 2327435 2506480 2382752 2311439 2257136
17911 2257136 2331637 2392689 2614698 2864434 3122303 3317938 3414408 3557286 3934252 4310394
17901 4310394 4351925 4185604 4187185 4528345 4971179 5501744 6064957 6435311 6790926 7329651
17891 7329651 8193628 9472744 11261915 13659259 17020979 21576247 28174134 36700798
17883 36700798 46586707 59584538 81011588 119173049 180544096 260947168 307025835
17876C07025835n2718066q6053131o7185345l7060830k0098721j1487960o893861
17869B5527921m145779k883756k858497k383933j588772p47771k63471K3460M9467
17860A0728869M3470J48792J37253K40528P62436J379863K170849L149159M165466
17851B2926685N278213O565580Q284278J2006420K0853386L6770620N6746131
17844A69431313O9129491J9538646n7521672p3835614n1007979k7528673j5192488
17837C3013024q850265n503649l601845k614340k157050j607436j178317o67421
17829F832701l47631m77940m04740m4426J6742m10352o49749o01724k52500R2608
17819C752989J51787q6900n34482n75955n84756m01852r3216m8319m5463j07370
$$ plain form
17876 307025835 254307769 168254638 101069293 64008463 43909742 32421782 25527921
17869 25527921 21382142 18498386 15639889 13255956 11667184 10919413 10655942 10679402 10728869
17860 10728869 10772339 10921131 11058384 11298912 12061348 13441211 15612060 18761219 22926685
17851 22926685 28204898 34770478 43054756 55061176 75914562 112685182 169431313
17844 169431313 238560804 258099450 200577778 126742164 75734185 48205512 33013024
17837 33013024 24162759 18659110 15057265 12442925 10285875 8678439 7500122 6832701
17829 6832701 6485070 6007130 5602390 5557964 5574706 5164354 4514605 3912881 3660381 3752989
17819 3752989 3904776 3817876 3283394 2707439 2122683 1720831 1627615 1579296 1533833 1426463
17809A426463j03909j13047m1292K3439R5686K3176n2420j03925o9085M5027K9000
17798A159113l6341n7519j00763j05776l2756p1605n2467k9075o1333q7591q081
17787E15806K6166N1096M5433r091m0287k3774Q5492o04n5717k9204m5813J7623
17775E37126k3140o6233N2033R6262j5044p5070k4108N4700P9406j6182p8245
17764E21505q6052o8615l1340J8450j6605o850k003M335q734O1410K02M3799K168
17751D31670n4725j07149r7795r6930L6226P7906k9521j26732J2599K9431k9018
17740D5962m690m7312K6226p1388j1470O0942O4599k276o4518O9531j8556p712
17728C9338n664L38J08252P4114k6257M7724k180m7877J5415R9523L7700p8444
$$ plain form
17809 1426463 1322554 1209507 1168215 1191654 1287340 1310516 1258096 1154171 1085086 1130113 1159113
17798 1159113 1122772 1065253 964490 858714 825958 754353 701886 672811 611478 523887 515806
17787 515806 541972 593068 638501 629410 589123 565349 650841 650237 594520 565316 519503 537126
17775 537126 513986 447753 499786 596048 581004 505934 481826 536526 615932 599750 521505
17764 521505 435453 366838 335498 353948 337343 330493 328490 332825 324091 385501 385703 429502 431670
17751 431670 376945 269796 172001 75071 111297 189203 159682 32950 45549 74980 45962
17740 45962 41272 -6040 20186 -51202 -62672 -1730 62869 60593 -3925 65606 47050 39338
17728 39338 33674 34012 142264 216378 190121 237845 235665 187788 203203 302726 340426 261982
17716B61982j04833m5159R7029J20287K0404j2741J10231l0382o7584L5316J67297
17705E51847J66656K46566K93028L12819K19381j7134l59433m65698l35319k58972
17695C53741p3205K0095r221l2739m1427M1042j5121K4430l0962j37658q9470
17684I505L2978Q2066O533l5529j4211P458N3799O3967n0769k5131O4589P5674
17672B70929J52079J62580J80328K71418J67369R2190l8598k41126l28115k51281
17662D37773m1858j08711j28578q1666M2681j5973N9923R9778k5784j31675j24956
17651a9046m5936n9178r2298P9375L3810m4960j2467Q3333Q7627L0593M6207L6093
17639A23153L2136J476k5661j100j8044o77M6662l0190p2221M381j4607P4820
$$ plain form
17716 261982 157149 111990 209019 329306 349710 336969 447200 416818 349234 384550 551847
17705 551847 718503 965069 1258097 1570916 1790297 1773163 1413730 948032 612713 353741
17695 353741 280536 300631 291410 258671 217244 258286 243165 267595 236633 98975 9505
17684 9505 42483 124549 131082 95553 81342 88800 142599 206566 155797 130666 195255 270929
17672 270929 423008 585588 765916 1037334 1204703 1296893 1258295 1017169 689054 437773
17662 437773 395915 287204 158626 76960 119641 103668 163591 263369 237585 105910 -19046
17651 -19046 -64982 -124160 -216458 -137083 -103273 -148233 -160700 -77367 10260 40853 87060 123153
17639 123153 155289 156765 131104 130004 111960 111283 157945 127755 55534 59915 45308 120128
17627A20128N0182K7422j2411J3615n4232o7378k1880p519l8395k585M6646m6685
17615F908j29824K3025J59109N0563p1745q3279j9143j5442P5771M8880Q1366
17604A26189P0465K3928q3624j00628l9788n7558O2630K4867m8352L2389J7180
17593B7698l4778J263l9676j3190P358M693k299n4759p1025k7563L1873P2199
17581i8206o151k5766L6655J09534j8919m9489J9450N7127m0495l5697j2970j279
17569f6206J5749L5871r517n0183N3940o3823o1850J4671K7877n777O975k201
17557a04474K1956R3343L7133q51M9647p2424L2330N4212p7828K7836N7j2558
17545D8379J0068k932k0389m4126J7845J3276m2494k8848j146k2113m9013k9322
$$ plain form
17627 120128 170310 197732 185321 198936 144704 77326 55446 47927 9532 6947 53593 6908
17615 6908 -122916 -99891 59218 109781 38036 -45243 -64386 -79828 -4057 44823 126189
17604 126189 196654 220582 136958 36330 -3458 -61016 1614 26481 -21871 10518 27698
17593 27698 -7080 -5817 -45493 -58683 -51325 -46632 -48931 -103690 -174715 -202278 -170405 -98206
17581 -98206 -104357 -130123 -93468 16066 -2853 -52342 -32892 24235 -16260 -51957 -64927 -66206
17569 -66206 -50457 -14586 -24103 -74286 -20346 -84169 -146019 -131348 -103471 -109248 -102273 -104474
17557 -104474 -82518 10825 47958 47107 96754 24330 56660 110872 33044 60880 60937 48379
17545 48379 58447 55515 35126 -9000 8845 22121 -20373 -49221 -50367 -72480 -121493 -150815
17533a50815l1688M9932K9769N8539N3301J0275k0028l9320k9972N1716K0894
17522B603M0090P8439n5242m1758l6740n3517l3284M4469n1192L6246k3693Q793
17510h4786p1105L155M097Q2209O9279m1201l3690q9086m656n578j9452j5340
17498b06154K8422P5667J4388k1482K1560K3442J3082K323l9899Q5406k7279M3561
17486A3037n49m804j00779k7140J53036Q1000M5318j18352m8144l481O462q0770
17474h5166m0371q034L6912j160k5175L0044R2602l6232R104j6597o7047O6348
17462d4772J8022k678Q3261m5676k8146L5340O4605o921j6287M0027o5072l4514
17450b811L0635N0938n205J6273L7329N2926K21148L20403J64189j63664k77837
$$ plain form
17533 -150815 -182503 -132571 -102802 -44263 9038 19313 -715 -40035 -70007 -18291 2603
17522 2603 42693 121132 65890 24132 -12608 -66125 -99409 -54940 -106132 -69886 -93579 -84786
17510 -84786 -155891 -152736 -148639 -66430 2849 -38352 -72042 -161128 -165784 -171362 -190814 -206154
17498 -206154 -177732 -102065 -87677 -109159 -87599 -64157 -51075 -48752 -88651 -3245 -30524 13037
17486 13037 12488 7684 -93095 -120235 32801 113801 159119 40767 -7377 -10858 -4396 -85166
17474 -85166 -125537 -133571 -96659 -97819 -122994 -92950 -348 -36580 -27476 -44073 -111120 -44772
17462 -44772 -26750 -29428 53833 8157 -19989 15351 79956 73035 56748 96775 31703 -2811
17450 -2811 27824 78762 73557 89830 127159 180085 401233 721636 885825 722161 444324
17439D44324k51665q2927j5906l6587j14773q4971J17940Q2196j13504r6362L8053
17428a14182M3243P341J9391N6490j4245K6434l4346n0986N7171k2565J3733O535
17416e986m43N8415n0427m7821l9274J7307K869o4712J1576j4052j6575K1596
17404a27527J28914M7756o8963m3871o97l7408j8303M3095K3937k7258q9133O2742
17392a06716O452Q437J7086j8674N9183P5237J9457Q5558k4750m3054n7629r442
17380A1145j1356q2474L068J08254O8537N9449k4793p1088K3432M4926l1900p2929
17368B4271L671K8807m3484k8152j8570j14977m5169Q0680O2098L0416M6481P8475
17356A04547k8911m9846k8468j4682K4933K8142k323j30353r1199K35N1903K260
$$ plain form
17439 444324 192659 109732 93826 57239 -57534 -142505 -24565 57631 -55873 -152235 -114182
17428 -114182 -70939 -63598 -44207 12283 -1962 24472 -9874 -60860 -3689 -26254 -12521 -5986
17416 -5986 -6429 51986 1559 -46262 -85536 -68229 -65360 -130072 -118496 -132548 -149123 -127527
17404 -127527 1387 49143 -19820 -63691 -64388 -101796 -120099 -77004 -53067 -80325 -169458 -106716
17392 -106716 -100264 -91827 -74741 -93415 -34232 41005 60462 146020 121270 78216 20587 11145
17380 11145 -211 -82685 -79617 28637 97174 156623 131830 60742 84174 129100 97200 24271
17368 24271 27942 56749 13265 -14887 -33457 -148434 -193603 -112923 -50825 -20409 26072 104547
17356 104547 75636 25790 -2678 -17360 7573 35715 33392 -96961 -188160 -187925 -136022 -133762
17344a33762J9694J05593K0370k2566K2149J7210K6241L12p4862K7067K7698l3554
17332A590J5976N9528L5194K165J2002N9138Q7441J54951O8053J17971K76196
17321H90205L65066J57869r6686l68188k89750k97742j42917n0176j00080r6504
17311b8903K5351L5177k3212n081J14144J0795k5790R09p496J3872k397j0495
17299I6874n2791L5668J31711j3718n1286l3747R7042J23591Q3311J11673J64456
17288F92784K83651L14339J35553k21664k92640k75766j34364p721l6627j06099
17278C51446q3730p896l6104k5209j33329n2294Q974L2298p9O5518N6645O6373
17266B42613O5226l6702r4860m9111J8694O7129R309k7748j5429O4485L9883q427
$$ plain form
17344 -133762 -114068 -8475 11895 -10671 11478 28688 54929 55241 -19621 7446 35144 1590
17332 1590 17566 77094 112288 114453 126455 185593 273034 427985 496038 614009 890205
17321 890205 1255271 1413140 1316454 948266 658516 360774 217857 167681 67601 -28903
17311 -28903 -3552 31625 8413 3332 117476 128271 102481 103390 95894 109766 107369 96874
17299 96874 44083 79751 211462 197744 146458 112711 209753 333344 416655 528328 692784
17288 692784 976435 1290774 1426327 1204663 912023 636257 501893 494172 457545 351446
17278 351446 267716 259820 223716 198507 65178 12884 21858 54156 54077 119595 176240 242613
17266 242613 307839 271137 176277 127166 145860 212989 222298 194550 179121 243606 283489 275062
17254B75062l4086M22j0319l4331l3955Q0089M1676j4097p0932q5728M2142K5825
17242A81768j9409J6851P7996N1692N321M2556l3026j43932m1306O683K0732k9493
17230A36433j5532q6685j9912K4286k9258k3955L1268L7361M6711k6590j01594
17219b7467R347j2331O9417P8177O1601K4593l6885P1814l496o4975m4308P2055
17207A97542K0512p35q2868L3988R6584J2046j26498j56161q9105p2032J14503
17196e2224J05987R2442o2356k02937j29284N5773J19066J094m3098J231j3437
17185a27743O1768M0951N015L3312L3601K6954q1216p8088L3473l4390k2089K5668
17173h2784K317J4989m8759m090J15085k781J4443l4141n7083l2321P4642K6692
$$ plain form
17254 275062 240976 241398 231079 196748 162793 242882 284558 270461 199529 113801 155943 181768
17242 181768 162359 179210 257206 308898 314219 356775 323749 179817 138511 145194 165926 136433
17230 136433 120901 34216 14304 38590 9332 -14623 16645 54006 100717 74127 -27467
17219 -27467 -18120 -30451 38966 117143 178744 203337 166452 238266 234770 169795 125487 197542
17207 197542 218054 217319 134451 168439 265023 277069 150571 -5590 -94695 -166727 -52224
17196 -52224 53763 146205 83849 -119088 -248372 -192599 -73533 -72439 -115537 -114306 -127743
17185 -127743 -65975 -25024 -20009 13303 46904 73858 -7358 -85446 -51973 -86363 -108452 -82784
17173 -82784 -80467 -65478 -114237 -118327 -3242 -6023 8420 -25721 -82804 -115125 -40483 -13791
17161a3791l4672K746M4306l0650j01142M9798M2414p7952j7810N5049M7365N3174
17149A8835l3362j0161l598k2723M5368M776n0974p2931m604J07505K5914N6371
17137F0416q419K4131K3279k4940o3642m3832l3011j0973r721l3774j760M6273
17125g5973l404N0238R0148l9545k9442j7296j5776l5893l4771K353P7492m489
17113c6358j6229J32062L1815q1998j44660M4712n915j6209j7802n083Q049N0019
17101e7597J6033L8913L2797m938J3044L2819k6104J8519l061K9044l6684p5838
17089b3053M5086K8148M4727j5113m0921j2412L5052L6334N7415p4949l4221N8033
17077A04126O3339q458m3068o2271r8351p0939L5856N4234M1210o0401k0755l7717
$$ plain form
17161 -13791 -48463 -45717 -1411 -32061 -133203 -83405 -40991 -118943 -136753 -81704 -34339 18835
17149 18835 -14527 -24688 -28286 -51009 -5641 -865 -51839 -124770 -129374 -21869 4045 60416
17137 60416 51997 76128 99407 74467 10825 -33007 -66018 -76991 -86712 -120486 -122246 -75973
17125 -75973 -79377 -29139 61009 21464 -7978 -25274 -41050 -76943 -111714 -109361 -31869 -36358
17113 -36358 -52587 79475 111290 29292 -115368 -70656 -76571 -92780 -110582 -115665 -107616 -57597
17101 -57597 -41564 -2651 30146 25208 38252 71071 44967 63486 60425 89469 52785 -23053
17089 -23053 22033 50181 94908 79795 38874 26462 61514 97848 155263 80314 46093 104126
17077 104126 167465 159007 115939 53668 -44683 -115622 -79766 -25532 15678 -44723 -65478 -103195
17065a03195j4674O8753j8114n6500l5341J03160J7847m5319j8015p22N8042o2515
17053a06593m8911J01776p678j128M5639P9644N6020N7038R3975j32988k6505
17042A10289L6275K289m7101J3533K3237n8668j17791l4389l4041J7588m9886
17031a38665j1546R215k133P1163M3862J7705l383p1754j6479O0624O187N0383
17019A5179K3648K496k9445M716j1552k8168P079J9587J5390k4350o4221o7368
17007a37009K3464J20470m9222j8668m9585j4704N4711K2792p2486K6979R8026
16996D768N2869m0519r761p0057r4402J2197K0681r820l1511Q5519M5065L2408
16984b563K0998K7339m3936J3723O3189j9928q8876J7682k5411l0349N442M5300
$$ plain form
17065 -103195 -117869 -49116 -67230 -123730 -159071 -55911 -38064 -83383 -101398 -102120 -44078 -106593
17053 -106593 -155504 -53728 -61406 -62534 -16895 62749 118769 175807 269782 136794 110289
17042 110289 146564 148853 101752 115285 138522 79854 -37937 -72326 -106367 -88779 -138665
17031 -138665 -150211 -140996 -143129 -71966 -28104 -10399 -13782 -85536 -102015 -41391 -35204 15179
17019 15179 38827 41323 11878 16594 5042 -23126 -16047 3540 18930 -5420 -69641 -137009
17007 -137009 -113545 6925 -42297 -60965 -110550 -125254 -70543 -47751 -120237 -93258 4768
16996 4768 57637 17118 7357 -62700 -157102 -144905 -124224 -134044 -165555 -80036 -34971 -2563
16984 -2563 18435 45774 1838 15561 78750 58822 -30054 -12372 -37783 -68132 -62690 -17390
16972a7390j6414o7964n0416L0086J03282q495j2376R0235j7566o3084L784l1702
16960e8020r982N1657L871j8569L6165M5298o013J0490J6850n9157o2290l3569
16948h3269O4192j7727J1859O9509J9653n1767l3460M8813N202L3982n8336j13721
16936a05070q125R2606l480L2094l3120n1370n982R6022O5766r3571j4000J8485
16924i745r610k7634M9044L2404l8579q9030k3032Q9626J11159K984k2822k7519
16912C7246o4955n3164n9021l5320K4682M8507J295j3476K9389O5857n777j00802
16900a25539j8270n7375L4059k6313O3451L0383p2837J2881o831L190J3665L5501
16888a14035P1994J18257R1694O43m5398q0185n0858J7297q7103p8632P8234J01247
$$ plain form
16972 -17390 -33804 -101768 -152184 -122098 -18816 -27311 -39687 50548 32982 -30102 -26318 -58020
16960 -58020 -68002 -16345 -12474 -31043 5122 50420 44407 54897 71747 12590 -49700 -83269
16948 -83269 -19077 -36804 -24945 44564 64217 12450 -21010 27803 33005 66987 8651 -105070
16936 -105070 -113195 -20589 -24069 8025 -25095 -76465 -82447 13575 79341 -14230 -28230 -9745
16924 -9745 -19355 -46989 2055 34459 -4120 -93150 -116182 -26556 84603 87587 64765 37246
16912 37246 -27709 -80873 -139894 -175214 -150532 -102025 -100730 -114206 -84817 -18960 -24737 -125539
16900 -125539 -143809 -201184 -167125 -193438 -129987 -99604 -172441 -159560 -166391 -163201 -149536 -114035
16888 -114035 -42041 76216 167910 168553 123155 42970 -7888 9409 -77694 -156326 -78092 23155
16876B3155k9851K9613P4172J3570l2852j09604o1058j64l4325j3543L8876L9011
16864f3000k8626K0502M3852r62r0477L5427M4313j15636l3090M2923Q7060j1882
16852f9596N31K4127Q299p067O2900J1084q29m9002k0593l9844p3077n4765K895
16839b04937J28973K4692N3782J2759P187K6696m7829m2093N7847J15539p2545
16828F0071j17051L4121Q1221O0873j7384L346n7815j19910m1301N3001n380Q3106
16816A6898N5178l676m5863o6740N7763L3648j12867j35934l2083l8632O3211
16805b09097P5813Q099n4703N160O4777K129K6664J6306k8590q719j2110j14072
16793b28343j07821R8628R6349n4225L7808J3831j4441N1419R1259j1057m5283
$$ plain form
16876 23155 -6696 22917 97089 110659 77807 -31797 -92855 -93019 -127344 -140887 -102011 -63000
16864 -63000 -91626 -71124 -27272 -28234 -118711 -83284 -38971 -154607 -187697 -144774 -57714 -69596
16852 -69596 -69065 -44938 -36639 -43706 19194 30278 29449 -19553 -40146 -79990 -153067 -207832 -204937
16839 -204937 -75964 -51272 2510 15269 22456 49152 1323 -40770 17077 132616 60071
16828 60071 -56980 -22859 58362 119235 101851 105197 47382 -72528 -113829 -60828 -66208 16898
16816 16898 72076 68400 22537 -44203 13560 47208 -65659 -201593 -233676 -272308 -209097
16805 -209097 -133284 -125185 -179888 -174728 -109951 -107822 -81158 -64852 -93442 -102161 -114271 -228343
16793 -228343 -336164 -237536 -141187 -195412 -157604 -143773 -158214 -106795 -15536 -26593 -71876
16782g1876k2223j09330L3467N1185N3792L1696q68j7662k7734j2705L5990M6135
16770a0133J5658J7908L2757K7813k8222J6725J350j00516j5023o5637m0544N1408
16758i6456K5499O8796K0266j3393m130J0946q589N8135J4067K0648l5915l7812
16746B2062K6956j1180l5709l4606j01984k0170J06834Q2642l8429K0086O7279
16735H3781P7016M7869j172K4187m4223n9677l7694K4000K9114p4241r4901K392
16723b3549r604P342l9129r706k4384N9445J21801O4111l1901k7822l534k3435
16711E9635m53n4975m0592n9144p726Q2566O7095J5498n5748m1944N8386j12175
16699h9577o8268Q1663o5907J6784J69479L6667m5999o8106J3582m8896k3933
$$ plain form
16782 -71876 -94099 -203429 -169962 -118777 -64985 -33289 -34157 -51819 -79553 -92258 -56268 -10133
16770 -10133 5525 23433 56190 84003 55781 72506 73856 -26660 -41683 -107320 -147864 -96456
16758 -96456 -70957 -2161 18105 4712 582 11528 2939 61074 75141 95789 59874 22062
16746 22062 49018 37838 2129 -32477 -134461 -154631 -47797 34845 -3584 16502 83781
16735 83781 160797 208666 207494 231681 187458 127781 90087 114087 143201 68960 -25941 -23549
16723 -23549 -33153 -25811 -64940 -74646 -99030 -39585 82216 146327 114426 86604 83070 59635
16711 59635 59182 4207 -36385 -95529 -103255 -20689 46406 61904 6156 -35788 22598 -89577
16699 -89577 -157845 -76182 -142089 -125305 44174 80841 34842 -33264 -19682 -68578 -92511
16688i2511k4872k0333Q2445Q159l3117P8298Q4368Q817J7569j00140r98j0315
16676b630j24408k1003O883K2446o205p1283P559J22299P3777l7645m2090l8559
16664a10859L8423K3633K1002j2152O3302K02j7929j4224L472L0457l6159l1635
16652d2467J9471n2219m8036M8379k8417q7931l33m1292l5410M0462J50183j9069
16640i6679L8646M5365L7450L5003K4622o8384j6937K6443q0578L0726K9664m9289
16628d3948K1312n3456m4149m4955M6445Q7939M2324M7166K0374K1877l2128j20696
16616e1895l0985k4523l273Q3481P2383K3899m9809k9505K3164R8604l8520q3471
16604a0450L550O4808l3803m2491k8977L5324j2813L3070J1709N1895N4542m1623
$$ plain form
16688 -92511 -117383 -137716 -55271 -47112 -80229 -1931 82437 91254 108823 8683 7685 -2630
16676 -2630 -127038 -148041 -141158 -118712 -124917 -196200 -188641 -66342 7435 -30210 -72300 -110859
16664 -110859 -72436 -48803 -27801 -39953 23349 23551 5622 -8602 -5130 25327 -10832 -42467
16652 -42467 -22996 -75215 -123251 -74872 -103289 -191220 -191553 -232845 -268255 -227793 -77610 -96679
16640 -96679 -58033 -12668 24782 59785 84407 16023 -914 25529 -55049 -24323 5341 -43948
16628 -43948 -22636 -76092 -120241 -165196 -118751 -30812 11512 58678 79052 100929 68801 -51895
16616 -51895 -82880 -107403 -110676 -27195 45188 69087 19278 -10227 12937 111541 73021 -10450
16604 -10450 -6900 57908 24105 -18386 -47363 -12039 -24852 8218 19927 71822 126364 84741
16592H4741n4942q0704Q1361J3003j24836N8564M1776k2997K0651J1642K5047
16581E3306m9587q3255K119M7447l1838o9001K1480J5428K1432N7801Q30n3485
16569f7323n086q5853r5387L3420O1017N5353L5509N1615K5542K8440p5262M073
16557c3942K7252l7360m951N589M7116L4265N0176m3877n2514k210j2288l8398
16545f1142L0155m265J8328J0919k4540o8290r1559L6023N8015N2913L7232l8357
16533d4568m9837q021j9768P39P8718P0251J8366P7216j9557j05068N3678J8775
16521G0924r4173m3916J00422J9569j2457J581q2483r028k4084m9256K6763l5526
16509a31664k7954O6051l7159m7038P3764Q9699M4613L1655l452l8434k7339R6199
$$ plain form
16592 84741 29799 -50905 30456 43459 -81377 -22813 18963 -4034 16617 28259 53306
16581 53306 3719 -79536 -77417 -29970 -61808 -130809 -109329 -93901 -72469 -14668 -13838 -67323
16569 -67323 -72409 -158262 -253649 -220229 -159212 -103859 -68350 -16735 8807 37247 -38015 -33942
16557 -33942 -6690 -44050 -49001 -43412 3704 37969 88145 44268 -8246 -10456 -22744 -61142
16545 -61142 -30987 -35252 -16924 -6005 -30545 -98835 -190394 -154371 -96356 -43443 -6211 -44568
16533 -44568 -94405 -102426 -122194 -121455 -42737 27514 45880 123096 103539 -1529 52149 70924
16521 70924 -23249 -67165 33257 52826 40369 41950 -40533 -49561 -73645 -122901 -96138 -131664
16509 -131664 -159618 -93567 -130726 -177764 -104000 -14301 30312 61967 58515 20081 -7258 88941
16497H8941J3871j41006q1849L3277R8587n5097k9208q952K0265k0595M2822m951
16485d3895p6949K7284M2648O2213k9941k7621R1149P5361j02852o0336M4969
16474B030K2255O2012P0924k3428o6677j14549k8585P8315O6865J1148N0994M7520
16462A78824o4624l8047k5651n0514m4551M4890O4276j7475J05080q146m2343
16451A01719m4232p4139p2771m334n7812J642P9299N6919J6251l9632l4371P177
16439f4284k9586Q464N0463j2705L4873j2940o507J3097n1214L2976L8962j1629
16427a0030k5228Q3199q9930n6623J7431O082k3558q6924j0712J00279J6116o049
16415h5947n8033J038Q935J06797J8164M7367L518L711O9110L3721P86J82q3809
$$ plain form
16497 88941 102812 -38194 -120043 -86766 11821 -43276 -72484 -81436 -61171 -81766 -38944 -43895
16485 -43895 -120844 -93560 -50912 11301 -18640 -46261 44888 120249 17397 -42939 2030
16474 2030 24285 86297 157221 133793 67116 -47433 -76018 2297 69162 80310 131304 178824
16462 178824 114200 76153 50502 -12 -44563 327 64603 47128 152208 144062 101719
16451 101719 57487 -16652 -89423 -93757 -151569 -149927 -70628 -13709 2542 -37090 -71461 -64284
16439 -64284 -93870 -85406 -34943 -47648 -12775 -25715 -32222 -19125 -70339 -37363 1599 -10030
16427 -10030 -35258 47941 -41989 -98612 -81181 -75099 -98657 -185581 -196293 -96014 -79898 -85947
16415 -85947 -143980 -142942 -134007 -27210 -9046 38321 41839 45550 114660 148381 149167 149349 65540
16402F5540j41279o0890L5625L6425O8047M7889l6664m4148l5476l4711l2621
16391a32263O377R4359l03L3426M0563J1076J5548R749o2445j2443K0309r5085
16379g1132k269R112n8816n0941L8944O0623Q5400l3372J5469L1063q4929M8790
16367a2058J45723N8276k2451l8092k9334j4233j3604L8830m6965o0873n0183
16356d4964k9554J05068N8339r231O7329k2341j10423j26877O566r975k6645Q703
16344a34005J66840J5413n5889p92l158p856o6704r3574L7657K3933J3923Q8350
16332a5862O1610n550j5830l7857j0396L3958P069M3217O0552K0527J4310o3759
16320I1989j02529q6412p0153m9210P302M9604P6812o19q285L1833O0237O969
$$ plain form
16402 65540 -75739 -136629 -101004 -64579 3468 51357 14693 -29455 -64931 -99642 -132263
16391 -132263 -125886 -31527 -31830 1596 42159 53235 68783 78532 16087 3644 23953 -71132
16379 -71132 -73401 -64289 -123105 -174046 -135102 -74479 10921 -22451 -6982 24081 -60848 -12058
16367 -12058 133665 191941 169490 131398 102064 87831 74227 113057 66092 5219 -44964
16356 -44964 -74518 30550 88889 79658 146987 124646 14223 -112654 -106088 -116063 -142708 -134005
16344 -134005 32835 48248 -7641 -8433 -11591 -19447 -86151 -179725 -142068 -118135 -104212 -15862
16332 -15862 45748 40198 24368 -13489 -23885 10073 17142 60359 120911 141438 155748 91989
16320 91989 -10540 -96952 -167105 -216315 -209013 -159409 -82597 -83216 -91501 -59668 569 7538
16308G538L1993K0698O0180k8225M334L1943O1398j043q2966j04449k6825K9284
16296C860k2552n3222k3320N32L2854l3181N0101O6375L7877N5222L4521p0527
16284G8540j03029n0251j49041m1720J5101P8916K8678j2772R3293K6619k8903
16273f4569j2019K739P3587N3231N9784o8883p0158l2151O1917K3240J4160k1680
16261A9198o8150m9740n6074k1022K8156J1600O4984l2841J0244l7519l4587L0711
16249a35040J4454k4282m0636P0957N0573M5461j6908m889P1364m560o688L956
16237B3762K699K2873n3515m7653R637k9996L5559k3503O2618P3769L4659j23880
16225a2971j9678K5385p7579o9345j3076n0595K2010K9687J2785k9978J6042N818
$$ plain form
16308 7538 39531 60229 120409 92184 96518 128461 189859 188816 105850 1401 -25424 3860
16296 3860 -18692 -71914 -95234 -94702 -61848 -95029 -44928 21447 59324 114546 149067 78540
16284 78540 -24489 -74740 -223781 -265501 -250400 -171484 -142806 -155578 -62285 -35666 -64569
16273 -64569 -76588 -73849 -262 52969 112753 43870 -26288 -58439 3478 26718 40878 19198
16261 19198 -48952 -98692 -154766 -175788 -147632 -136032 -71048 -103889 -93645 -131164 -165751 -135040
16249 -135040 -120586 -144868 -185504 -114547 -63974 -18513 -35421 -40310 31054 26494 19806 23762
16237 23762 26461 49334 -4181 -51834 -42197 -72193 -36634 -60137 2481 76250 110909 -12971
16225 -12971 -32649 -7264 -84843 -154188 -167264 -217859 -195849 -166162 -153377 -183355 -167313 -161495
16213a61495m3961L1352P2761k0318o3109n3464m6107J20365J70506J10828k667
16202A14691o2235l5939j2860p1663n2168M4117k8477o3420N5858K4425k7711
16191a15382k0254K9053J3070P4181k1654r6942J5851N2951O0509R18j1074j4042
16179c2815k2313k0931k7684k2780K651K5185M1613n917l9144M8869P2021J9723
16167C8478P8040L4301l9098j22374r0636j4096l1466J00158R4105R786r608K5043
16155G2633o6015p0091O393j485j5316M2354J02994K5715n0751m4798R810l327
16143H116k8684J4999M3613M9987l0683j04317j6813N233k9569O2464J05137K4297
16131A03780k6557p0529m4682L0061M1301o5402K1725N1418j3490p196K8139P285
$$ plain form
16213 -161495 -205456 -174104 -101343 -121661 -184770 -238234 -284341 -163976 6530 117358 114691
16202 114691 52456 16517 3657 -68006 -120174 -76057 -104534 -167954 -112096 -87671 -115382
16191 -115382 -135636 -106583 -93513 -19332 -40986 -137928 -122077 -69126 -8617 -7699 -18773 -32815
16179 -32815 -55128 -76059 -103743 -126523 -123872 -98687 -57074 -62991 -102135 -53266 18755 38478
16167 38478 116518 150819 111721 -10653 -101289 -115385 -146851 -46693 47412 57198 47590 72633
16155 72633 6618 -63473 -57080 -58565 -73881 -31527 71467 97182 46431 1633 11443 8116
16143 8116 -20568 -5569 38044 88031 57348 -46969 -63782 -58549 -88118 -25654 79483 103780
16131 103780 77223 6694 -37988 -7927 33374 -32028 -10303 41115 27625 20429 48568 55853
16119E5853N6474K3055o2691N2905L1244K4962l3877p617j01789o8361M9760M1010
16107F0928J5690k7990J2163j7761q0267L1777r456p7636N59m7263J3585J03564
16095b2107O2334L539p6559J6209r65K760l7920n5794M0255m5431o6476j1135
16083a91290n8585O6734J3723M5132J8974l2128j5708o6224L2834J27451L9072
16072b0015j2807K1335J05965p3522j0716k2546l4047K9188Q741J5305J9553j5853
16060A0581m5481N8508j1857J6937M1857j4789j5525K125l1392q207n2999L6022
16048a4220O449k282Q567m2879j31225O2663N373j9092Q1126K9618K7596K1214
16036C2908J353j8423m4130q2169J3049J13959J07089n1327j26191m1337l8784
$$ plain form
16119 55853 112327 135382 72691 125596 156840 181802 147925 140308 38519 -29842 19918 60928
16107 60928 76618 48628 60791 43030 -37237 -5460 -14916 -92552 -91993 -139256 -125671 -22107
16095 -22107 40227 43766 -32793 -16584 -17549 -14789 -52709 -108503 -68248 -113679 -180155 -191290
16083 -191290 -249875 -183141 -169418 -124286 -105312 -137440 -153148 -219372 -186538 -59087 -20015
16072 -20015 -32822 -11487 94478 20956 10240 -12306 -46353 -17165 -8424 6881 26434 10581
16060 10581 -34900 23608 11751 28688 70545 55756 40231 42356 10964 2757 -50242 -14220
16048 -14220 -7771 -10053 -1486 -44365 -175590 -112927 -107554 -126646 -45520 -15902 11694 32908
16036 32908 34261 15838 -28292 -110461 -97412 16547 123636 72309 -53882 -95219 -134003
16025a34003l7758K2879R6781J1615m8556l4646m8601L1818N8681Q7662K7675
16014C3547j0569l2593q2067n3137k7785r145J00516M7133j4813K3276L1564N3526
16002E9453k5384K8973r167K8550o0606l2822L346N9557N8179p4994l2532n8040
15990e5487l7786j582P5833j522k9705K2254J46811l74j15408k5745j2634j2862
15978d8207j3041N0206j051O6800m787o9795P8271L1526o0074k5763p0248p9211
15966a45374q3691N6743J43055O5489L786k9198k1851k0795P4769J07438J636
15955A52007r1466m0559m6581j7850K6247n0237j9729R9441N9742n649k4752m2458
15943a844l4974J830j6980J9901J0276Q1145l1547o6539K6546k5176j2882l0091
$$ plain form
16025 -134003 -171761 -148882 -52101 -40486 -89042 -123688 -172289 -140471 -81790 5872 33547
16014 33547 22978 -9615 -91682 -144819 -172604 -181749 -81233 -34100 -48913 -25637 5927 59453
16002 59453 34069 63042 53875 82425 21819 -11003 -7657 51900 110079 35085 2553 -55487
15990 -55487 -93273 -94855 -19022 -20544 -50249 -27995 118816 118442 3034 -22711 -35345 -48207
15978 -48207 -61248 -11042 -12093 54707 49920 -19875 58396 89922 29848 4085 -66163 -145374
15966 -145374 -229065 -172322 -29267 36222 40008 10810 -11041 -31836 42933 150371 152007
15955 152007 60541 19982 -26599 -44449 -18202 -68439 -88168 11273 71015 65366 40614 -1844
15943 -1844 -36818 -34988 -51968 -32067 -21791 59354 27807 -38732 -12186 -37362 -50244 -80335
15931h0335n17L6108L21j0932J5303N502J1261n0321K0680M9104m4922m491R4920
15918D1681J7070L1691j6112k1670j9293l0752L1630j3634p2080l1039J05671
15907B3163N2872l1729k49n7371j9886K2226N820O3500Q0265J6272o5844r4753
15895e714p4861N561O2235o9023l2730N9236j1957M2375n4676o9240R1442R7623
15883D0271l1814K4886j665j4215q8763k6475R9320N9909M2168r895n0605l0484
15871A2638R1428M5588l426M2970m7742P830p543j886q0800k3939n6246k2498
15859d3626O4586k9229m4025K8763P330l3208k148K7013m1561M966k67M9637j9487
15846c1256K2152L3614j34864k5581M9528J9437k4592K6648P9536K9614o2838
$$ plain form
15931 -80335 -80852 -44744 -44423 -55355 -40052 -34550 -23289 -73610 -52930 -3826 -48748 -53239 41681
15918 41681 58751 90442 74330 52660 33367 2615 34245 20611 -51469 -82508 23163
15907 23163 76035 44306 44057 -13314 -33200 -10974 -5154 58346 138611 154883 89039 -5714
15895 -5714 -80575 -75014 -12779 -81802 -114532 -55296 -67253 -24878 -79554 -148794 -57352 40271
15883 40271 8457 33343 31678 17463 -71300 -97775 1545 61454 103622 93727 43122 12638
15871 12638 104066 149654 146228 189198 141456 149286 141743 139857 59057 35118 -21128 -43626
15859 -43626 20960 -8269 -52294 -23531 -16201 -49409 -51557 -24544 -66105 -61139 -61406 -11769 -31256
15846 -31256 -9104 24510 -110354 -135935 -86407 -66970 -91562 -64914 14622 44236 -18602
15835a8602K6335j6228n1226j5886J4447m9241j17500j7643M1531k2348J10357
15824a16004N9140J5963N5768Q8699N9371j09058r5424L9034l0370j5924l1937
15813h0742m6629k9245N5657M6851m1352N9010J02631L758l1488j0971N97o879
15801B1198L5374l9767k0136M3783N9238J6060n4928n8449j7318O0783K7282k6796
15789D6324q5158J5518P0954j8201j3289p3663l0366M161j721q503n045Q7332
15777a1657l722l730O799P525L7216L7018L3670m1027r4313R57J36771k2657k4245
15764E8605L7231M0998P472j00030j07056k4773J1987k1627J7271M5341N0369
15753A5788j1455l2234o3203q246P5097n223n850m1830k3177K4599l1681n6360
$$ plain form
15835 -18602 7733 -8495 -59721 -75607 -61160 -110401 -227901 -245544 -204013 -226361 -116004
15824 -116004 -56864 -40901 14867 103566 162937 53879 -41545 -2511 -32881 -48805 -80742
15813 -80742 -127371 -156616 -100959 -54108 -95460 -36450 66181 69939 38451 27480 28077 21198
15801 21198 56572 16805 -3331 40452 99690 115750 60822 2373 -14945 45838 73120 46324
15789 46324 -38834 -23316 47638 29437 16148 -57515 -87881 -83720 -85441 -93944 -98989 -11657
15777 -11657 -15379 -19109 -12310 -4785 32431 69449 103119 62092 -32221 -31264 105507 82850 58605
15764 58605 95836 136834 144306 44276 -62780 -87553 -75566 -97193 -79922 -34581 15788
15753 15788 4333 -27901 -91104 -99350 -24253 -29476 -35326 -77156 -100333 -75734 -107415 -163775
15741a63775N1117Q7498j2578J0686l6084j1077J5417n725q5247R5123J18628
15730F3983l1144r4557m5839N8621Q3542k2P075M3082j9651K3888M7847o4454
15718G2371k5635l4463J5950J3464L9158R9903o0076q6908K4896j6141r6939J8969
15706c5451J6310M7009R9279L5505k3501q391j8535l4341p2362j46811K8618O1475
15694e1196O7048J9913p0429m1984L0631N1249k4897q1742l2937P5159J12926
15683E3741j4999P5187M5277j8750q7059m4718j0638M2682M8814l4673j0733J499
15671D5630M9377n4008p7967N9038M6025l5643k4126n4205j9090K3538j1803O5761
15659A2527P6178r139j8251k3618o8819l1800M2326m6640P7668k050n6326j0131
$$ plain form
15741 -163775 -112658 -25160 -37738 -27052 -63136 -74213 -58796 -64521 -149768 -54645 63983
15730 63983 32839 -61718 -107557 -48936 34606 34584 41659 84741 65090 88978 136825 72371
15718 72371 46736 12273 28223 41687 80845 180748 120672 33764 58660 42519 -54420 -35451
15706 -35451 -19141 27868 127147 162652 139151 130760 112225 77884 5522 -141289 -112671 -51196
15694 -51196 15852 35765 -34664 -76648 -46017 5232 -19665 -101407 -134344 -59185 53741
15683 53741 38742 113929 159206 140456 53397 8679 -1959 40723 89537 54864 44131 45630
15671 45630 95007 40999 -36968 22070 68095 32452 8326 -45879 -64969 -41431 -53234 12527
15659 12527 88705 79566 61315 37697 -31122 -62922 -20596 -67236 10432 8382 -47944 -58075
15647e8075N712o1825J753M7124O0545N6285j6216p728k986n5068k2047N2681
15635A55J8158p5964m7687M4679K0936k7200o90N4035J3593l266m5755L0199N2317
15622C3510N2909J6415m5835K9291L097l9440J3644J9998n7117n5292l0239l0131
15610h9190m8612K5252j833m6742L3130J33164J5460j8612k3324L5679k8177k8651
15598d2456P9487L7840k4111L6247Q424p1545p3023k3050l2159k779l0408n292
15586a42825Q5523J06473J3276j0523J5065m9812k9219n6083j2994N578K1458
15575e4083K7163L5252M7265n6221o2041K6513K3274L334M0869m9007q409n2737
15563g8828n2320L3899J0801j6504O3026N6217K1159J1675K4655j26876j290P4422
$$ plain form
15647 -58075 -52363 -114188 -112435 -65311 -4766 51519 35303 27575 24589 -30479 -52526 155
15635 155 18313 -57651 -105338 -60659 -39723 -66923 -67613 -13578 15 -3251 -49006 -18807 33510
15622 33510 86419 102834 56999 86290 89387 49947 63591 83589 26472 -28820 -59059 -89190
15610 -89190 -137802 -112550 -114383 -161125 -127995 5169 20629 2017 -21307 14372 -13805 -42456
15598 -42456 37031 74871 50760 87007 95431 23886 -49137 -72187 -104346 -107125 -137533 -142825
15586 -142825 -57302 49171 62447 51924 66989 17177 -12042 -68125 -81119 -75541 -54083
15575 -54083 -26920 8332 55597 -624 -62665 -36152 -12878 -9544 31325 -17682 -26091 -78828
15563 -78828 -131148 -97249 -86448 -102952 -39926 16291 37450 49125 73780 -53096 -54386 20036
15551B0036K698j1814O070K0625q8314K731K5754L8280M1004k1570J2599M9106
15539I7205j60065r1378R5304J04323R8425j4826r0529q1342K5498m2539J5061
15528d4863K9321J7641k8442l9347J01569J18228M7291m9703m4402O020m2322
15517G0991q9641L0950R1216K9925P524j17325o9306J7207m2640q302Q3924J4182
15505A8705l8084J7692L8410P823m1235o2441p334M592j4152l6975n953m2596
15493a61548L1242J2664N0315j0820j4535j4558J17841J77083J0852j03966p3171
15482B1399l1727j659K7619R9629J8375j2158j6007q5277k1721l7925K1194j0331
15470b8589M1774N9808m2932k8810O2734N7802O7876j0530o9444K1185K4077K3636
$$ plain form
15551 20036 22734 10920 16990 37615 -50699 -47968 -22214 16066 57070 35500 48099 97205
15539 97205 -62860 -154238 -58934 45389 143814 128988 38459 -42883 -17385 -59924 -44863
15528 -44863 -15542 2099 -26343 -65690 35879 154107 201398 151695 107293 113313 70991
15517 70991 -18650 12300 103516 133441 140965 23640 -45666 -28459 -71099 -79401 4523 18705
15505 18705 -19379 -1687 36723 44546 3311 -59130 -66464 -61872 -76024 -112999 -118952 -161548
15493 -161548 -130306 -117642 -67327 -78147 -92682 -107240 10601 187684 198536 94570 21399
15482 21399 -10328 -11987 15632 115261 133636 121478 105471 20194 -1527 -39452 -18258 -28589
15470 -28589 13185 72993 30061 1251 63985 121787 189663 179133 109689 130874 154951 178587
15458A78587J318o3413j32969K7357P3470m9807j298r1518o0054J71366P2567
15447A25606P3613p5076j42820N0634K8931n2632J0754m2804r8377K3593O9584
15436b8994M4600N4325j1894n9998K8826K6832K1348j5708m8822m8885j4680L7870
15424a5180k0519l7094M2603J2005j0332K4319n2056J7947O5253j04967p1688
15413a49709j9418M0743J48123M3866m1914N0356j6627J7905N1292p6265m2596
15402E756K5401k2094K8231k7591j6015k915p67l599k1450K7836m102M5535P5408
15389A09634Q9088j25601m9093M933j502o161J8722M8082k4459L1565k9282K8387
15377I4313P699o5059p5530m5406P4746N1632o4356q752p4561N280R9949J03049
$$ plain form
15458 178587 179905 116492 -16477 10880 84350 34543 33245 -58273 -118327 53039 125606
15447 125606 199219 124143 -18677 31957 60888 8256 19010 -23794 -122171 -98578 -28994
15436 -28994 15606 69931 58037 -1961 26865 53697 75045 59337 10515 -38370 -53050 -15180
15424 -15180 -35699 -72793 -30190 -18185 -28517 -4198 -56254 -38307 26946 -78021 -149709
15413 -149709 -169127 -128384 19739 63605 21691 72047 55420 73325 124617 48352 5756
15402 5756 31157 9063 37294 9703 -6312 -9227 -9994 -13593 -35043 -7207 -11309 34226 109634
15389 109634 198722 73121 24028 28961 27459 21298 40020 88102 63643 95208 65926 94313
15377 94313 102012 36953 -38577 -83983 -9237 42395 -21961 -30713 -105274 -99994 -45 103004
15365A03004J9218n7903p8538l8446n9319n728N7856Q4939M1016k5562Q2996J0766
15353A34299n3816M9466m8656q6973m7754K1764N2814N8671q054K0075K1260j3947
15341I9149K8335m6242n4755K6511K1944m1350N8014k4923r4897k2678P1633P9120
15329I9861j3601m5415L611M251j732j00076j8385L8325l998j9706k2876K8169
15317e1572O5719J3842j3829J6292r075o7890j04613J5490M0685L4763N9852J4532
15305A4196j2682o7501J5766N8042M0206k2466k4735M7702K45M508q3069K9147
15293f41K0443J25210j738j7705k4470J5536n574l0752j6497j8453n3610j35547
15281a43798r2092J11053J06571k4607J248J9557M4233n6744N1837P6377J5548
$$ plain form
15365 103004 122222 64319 -14219 -52665 -111984 -117712 -59856 25083 66099 40537 123533 134299
15353 134299 80483 129949 81293 -5680 -53434 -31670 21144 79815 71761 91836 113096 99149
15341 99149 127484 81242 26487 52998 74942 33592 91606 66683 -28214 -50892 20741 99861
15329 99861 86260 40845 44456 48707 46975 -53101 -71486 -33161 -37159 -56865 -79741 -51572
15317 -51572 14147 27989 14160 30452 21377 -46513 -151126 -135636 -94951 -60188 -336 14196
15305 14196 1514 -65987 -50221 7821 48027 25561 826 48528 48773 53281 -29788 -641
15293 -641 19802 145012 143274 125569 101099 116635 111061 80309 63812 45359 -8251 -143798
15281 -143798 -235890 -124837 -18266 -42873 -41625 -22068 22165 -34579 17258 93635 109183
15270A09183K7474n9948p3762L2389J8831K7598K734j7702q2463K886r015L2127
15258A0332r444p8868P0264q7888l4955K8407P1930K330k5047N9703N9040J2805
15246G8609k4004J7699P0831o8392K6938J8441K614r0305q8429m7499j2201K4875
15234i0823M4712K999l1622L3487k7549n2159K6237j5964K4918P3839p964l4057
15222e3946k6306P5896l1465m4818k9424J02002J00757j1072J0284m8343K8312
15211G1877J5803n3667m5492J3028M9784m8554q9569P8333N8094L825O123n774
15199E3811N1861o809p0988n6616k1732K6711Q6536O5212j07244m7889m2116J7704
15187e1559l1605j8014L9442J38044P467r4811K8139L8709o2921r228L3513l5736
$$ plain form
15270 109183 136657 76709 2947 35336 54167 81765 84499 66797 -15666 -12780 -21795 10332
15258 10332 888 -77980 -7716 -95604 -130559 -102152 -30222 -27892 -52939 6764 65804 78609
15246 78609 54605 72304 143135 74743 101681 120122 122736 32431 -55998 -103497 -115698 -90823
15234 -90823 -46111 -43112 -74734 -41247 -68796 -120955 -94718 -110682 -85764 -11925 -19889 -53946
15222 -53946 -80252 -4356 -35821 -80639 -110063 -8061 92696 81624 91908 43565 71877
15211 71877 87680 34013 -11479 1549 51333 2779 -86790 -8457 49637 53462 59585 53811
15199 53811 105672 98863 27875 -28741 -50473 -23762 62774 127986 20742 -27147 -69263 -51559
15187 -51559 -83164 -101178 -61736 76308 83775 -11036 17103 55812 -7109 -16337 17176 -18560
15175a8560K268J4885O1196k7553p9913l3921P9338O8848l5710m9856k6455J7492
15163b7941J29565K0433l8129r1015n8736r795N51L3732L0807K7557j8398M834
15151C465l630K4421o9897m620J6505M9269j5378P2874O7610j2228n1528k6523
15139E0340J9797r0506k8948l1028K141K8958o1910k5045M8302J3888p7055p9433
15127b30499n271P9080J11641j6538M3777j8684K0651K0856L2991J0876j7820
15116C1060J1130N8120O34l3185l5960l7830P1460M9154J015o917K1832l5211
15104I5302k1193M5964N880j5476L8008K080J0188m586L8219k0280K2292j8991
15092A77407r6333j40172j7813J28783M4075J1865o4096P461P9437k3206K8911
$$ plain form
15175 -18560 -16292 -1407 59789 32236 -47677 -81598 -2260 66588 30878 -18978 -45433 -27941
15163 -27941 101624 122057 83928 -7087 -65823 -75618 -75067 -41335 -10528 17029 -1369 3465
15151 3465 -165 24256 -45641 -50261 -33756 15513 135 73009 140619 128391 76863 50340
15139 50340 70137 -20369 -49317 -80345 -78204 -49246 -111156 -136201 -87899 -74011 -151066 -230499
15127 -230499 -235770 -156690 -45049 -61587 -17810 -36494 -15843 5013 38004 48880 31060
15116 31060 42190 100310 100944 67759 31799 -6031 65429 114583 115598 108681 130513 95302
15104 95302 74109 120073 125953 110477 148485 150565 160753 156167 194386 174106 196398 177407
15092 177407 81074 -59098 -76911 51872 95947 107812 43716 51177 130614 107408 136319
15081A36319k4940p1043K3824J0818r204K8297q9790L3466N3624n995Q104J0613
15069A04093p8058k8019M1845J3198k5383k4681j3441P230L2333K398p40l4778
15057d003M8233O4469m6875j04223r651k8188M3246R0138m3380q8742K5659J3441
15045c9876L6366L0013K3481m3449k9843k3210J6439R0412K4816m5387j0446m1429
15033a2113l3087M119M9907o710l168q6917N9762J1040O116k5452l5739J4020
15021e8222o703r654l1943L4301L5891K4643n3761m2327m5704n675M3260O9706
15009d6188L1646O1173q178m9946j9539j747L7239P5269m213q6544k7752q090
14997d6870m5471r0911j6048J40710M7243o994m4183J2361Q5197J918q5740q1157
$$ plain form
15081 136319 111379 40336 64160 74978 65774 94071 4281 37747 91371 85376 93480 104093
15069 104093 26035 -1984 39861 53059 27676 2995 -10446 -3216 29117 31515 30775 -4003
15057 -4003 44230 108699 61824 -42399 -52050 -80238 -36992 53146 9766 -78976 -53317 -39876
15045 -39876 -3510 26503 49984 6535 -23308 -46518 -30079 60333 85149 39762 29316 -12113
15033 -12113 -45200 -41081 8826 2116 -1052 -87969 -28207 -17167 -11051 -36503 -72242 -58222
15021 -58222 -64925 -74579 -106522 -72221 -36330 -11687 -65448 -107775 -153479 -159154 -115894 -46188
15009 -46188 -14542 46631 38453 -11493 -31032 -32779 4460 79729 75516 -11028 -38780 -46870
14997 -46870 -92341 -183252 -199300 -58590 -11347 -18341 -62524 -50163 35034 36952 -48788 -129945
14985a29945L9396J11752P5034k7488j13092j9712j1292o8148M546O9101k4008
14974i3856Q1118P4600j9863m0809o2520L3677N3198L2054R151p3692r8544J7781
14962h7705K1457J26578l0009j20604n5430J24378K4011j13144m4823l0412p0061
14951b55764O7516N1079n0249j7742J8177M5799M0572J42567Q3565q676n0888
14940F5956n884j4208K5671M9557k1781p5484j2407n4892j4495O1052n2454J8146
14928c1223j893n9799p4098k3579K7627J06130M0077o8157J3427J3576P531m607
14916e4988j2062O6353q2690l7839L5472m626n6134k873P5167P8819K6920J4635
14904D6154Q007J3453k7443k460r9262o3997K0020K3119L9651l6883R7747L9157
$$ plain form
14985 -129945 -90549 21203 96237 68749 -44343 -64055 -75347 -143495 -138949 -69848 -93856
14974 -93856 -12738 61862 41999 1190 -61330 -27653 25545 57599 66750 -6942 -105486 -87705
14962 -87705 -66248 60330 30321 -90283 -145713 -21335 2676 -110468 -155291 -185703 -255764
14951 -255764 -188248 -137169 -187418 -205160 -186983 -141184 -100612 41955 125520 116844 65956
14940 65956 60072 45864 71535 121092 99311 23827 11420 -43472 -57967 3085 -49369 -31223
14928 -31223 -33116 -92915 -167013 -190592 -162965 -56835 -16758 -84915 -71488 -57912 -50381 -54988
14916 -54988 -67050 -697 -83387 -121226 -85754 -90380 -146514 -149387 -74220 4599 31519 46154
14904 46154 54161 67614 40171 37711 -61551 -125548 -105528 -82409 -42758 -79641 18106 57263
14892E7263n6403p421j4511O4590r9169k3941q300j0959L6710L7683K9086K9912
14880C4540m57J9600m6742m0431o0185l4184J18487l899k4651O4246J0310o596
14868C0038n3588L3728L5509N7771o4016j78453k2357N8219L1489M7630Q9579
14857F5549M3308j6539m0676k6321j8697M1980R976p558j5371o3872l2802M0457
14845b0566O6696K2163n8759q3400O793k9809J14651J2435j30814p9256R3470
14834h6396N3695L5736k4351J5589M0946n3169l365M5856m6966O5223N2264O4104
14822A59166M020j45633j03099K3030L4897q690O7418j3878o4022J09424j1070
14811E1563p4260p8713K8172O7818L3045N2798P4545k5555j00718K4817Q1847
$$ plain form
14892 57263 860 -6561 -21072 43518 -55651 -79592 -87892 -98851 -62141 -24458 4628 34540
14880 34540 34083 53683 6941 -33490 -93675 -127859 -9372 -13271 -37922 26324 36634 30038
14868 30038 -23550 10178 45687 103458 39442 -139011 -161368 -103149 -71660 -24030 65549
14857 65549 108857 92318 51642 25321 6624 48604 58580 51022 35651 -28221 -61023 -20566
14845 -20566 46130 68293 9534 -73866 -67073 -96882 17769 30204 -100610 -179866 -86396
14834 -86396 -32701 3035 -21316 -5727 35219 -17950 -21315 24541 -22425 42798 95062 159166
14822 159166 163186 17553 -85546 -62516 -27619 -36309 31109 17231 -46791 62633 51563
14811 51563 -22697 -101410 -73238 -5420 27625 80423 154968 129413 28695 53512 135359
14800A35359j1916j18940L6454L202P609K1337l5486O17k4968k9577Q443P2215
14788F4349m8721l5742m1639j16447K5025J12590J01147o9275j18070J2368J0089
14777a04326K1989J38665P431J2110l5345M3598p478k8018k533n1857Q8440O4489
14765A47165m7923n8950k922J5582j10334n9701N9017M6732j2481j6808K0799
14754a9824Q2989L0358m5720p5686N851k8995l8472j2215n052J5586n2951J7657
14742a26474M4078M8037R0548J14411l5568K6127n2864l5969k2425o3442Q869
14731d672q4496q6K2726o6159k4032J26544Q4753L8301j7289N2630J9l5647O5844
14718A58436L8521j12826l5866j5945K0694J4014l1071O1727Q229l8447K717R000
$$ plain form
14800 135359 123443 4503 40957 44159 51768 73105 37619 38236 13268 -16309 -7866 64349
14788 64349 15628 -20114 -61753 -178200 -153175 -40585 60562 -8713 -126783 -114415 -104326
14777 -104326 -82337 56328 63759 75869 40524 84122 76644 48626 46093 -5764 82676 147165
14765 147165 99242 40292 37370 52952 -57382 -117083 -58066 -11334 -23815 -40623 -19824
14754 -19824 63165 93523 47803 -27883 -22032 -51027 -89499 -101714 -106766 -91180 -144131 -126474
14742 -126474 -82396 -34359 56189 170600 135032 161159 108295 72326 49901 -13541 -4672
14731 -4672 -89168 -89254 -66528 -132687 -156719 -30175 54578 92879 75590 128220 128239 92592 158436
14718 158436 196957 84131 48265 32320 53014 67028 35957 97684 105913 67466 70183 79183
14706G9183q8069j5476P5188M965j1239q1593R060M1739k4148l2411j1013k8487
14694h2301n2764N0891L9006N0918l6837K7607P4316m986q0960J5512j4261l2668
14682d6527J1009o44m3010k8730j3654j1413M4004j875M5711N9183J9203l5666
14670b409l6727k77O3189K8304r5990m7240P9464R513o5069J9456J05071r537
14658D7748n9292q570P2194n1923m3247K8475j6340m6061P300N0890J10323L3646
14646A25143o9614j27544K3033J5371p3752k272L1323j0101k8355J7605N7383
14635d1780k4178j6898j8992L4103O1573J02518L9880n6663k9097Q7760k5682
14624A12544n9984l3081Q220J0126L003L5724P11q6411l2293R773j1790k1877
$$ plain form
14706 79183 -8886 -24362 50826 55791 44552 -37041 -27981 13758 -10390 -42801 -53814 -82301
14694 -82301 -135065 -84174 -45168 5750 -31087 -3480 70836 65850 -15110 402 -13859 -46527
14682 -46527 -35518 -36162 -79172 -107902 -121556 -132969 -88965 -90840 -45129 14054 33257 -2409
14670 -2409 -39136 -39413 23776 52080 -43910 -91150 -11686 -2173 -67242 -47786 57285 47748
14658 47748 -11544 -20114 52080 157 -43090 -14615 -30955 -77016 -69716 -18826 91497 125143
14646 125143 55529 -72015 -48982 -33611 -107363 -109635 -78312 -88413 -116768 -99163 -41780
14635 -41780 -65958 -82856 -101848 -67745 -6172 96346 136226 79563 50466 138226 112544
14624 112544 52560 19479 27699 37825 40828 76552 77263 -9148 -41441 -31668 -43458 -65335
14612f5335P2878Q8440K7761J5281l4082j13487m7471R9046J05267l4877j09233
14601D188j10200M297P179K0219L4474P0736K3958l3818k8721o660m4712l3944
14589i3004M5609P0119M2296R305o0585l8657m1358m8014L8134K7907l1537o124
14577h5909K3136L7323O4938K0104Q817N8255N561p0608J2889r9207R697l7957
14565e2961l1826J6310O0434j9173J4233k4142n0333o9812l3668M7550N9944N6827
14553b6617n2155o107K7527r279O0167P0079J2998J2678r283K0768o7192l5990
14541b406P5873Q8802J1088K7063J09070O710j32351j30063o4322k4415N2405
14530A7454j099J33465O5175n1947j5446N66j0881k3463J1348Q0763j5170k47
$$ plain form
14612 -65335 7543 95983 123744 139025 104943 -8544 -56015 43031 148298 113421 4188
14601 4188 -106012 -101715 -94536 -74317 -39843 30893 54851 21033 -7688 -14348 -59060 -93004
14589 -93004 -47395 22724 65020 74325 13740 -24917 -66275 -114289 -76155 -48248 -79785 -85909
14577 -85909 -62773 -25450 39488 59592 68409 126664 132225 61617 74506 -24701 -15004 -52961
14565 -52961 -84787 -68477 -8043 -27216 -12983 -37125 -87458 -157270 -190938 -143388 -83444 -26617
14553 -26617 -78772 -84879 -57352 -66631 -6464 63615 76613 89291 80008 100776 33584 -2406
14541 -2406 73467 162269 173357 200420 309490 316200 183849 53786 -10536 -34951 17454
14530 17454 16355 149820 214995 163048 147602 148168 137287 113824 125172 205935 190765 190518
14518A90518O6544p0479j05818p3508p2944r378j0791J1466p937k4497J5481J670
14506h9673J00854n298q8710K1360L5472L0398l1511N75n767p5903M8112j825
14494f1916j2732J0105n159j7783o4208K2540J5027Q5555N0153m1126m2797l77
14482f2718J0980M2433O8905q792J11743K4135k4347n4720p273L7678n8430l2832
14470D6762L9239L0721m6963r1533m8085m858n0209M4951K2954l5675n1262m4918
14458a88876l5185P6830L3288Q4841k221J7223o2646L2426k999N327m6651m24
14446h9067K3100N7230L3505M8925k6095J4298M5901Q4128K208j25266o1550L9725
14434D7042L4267M0368l0382N418j3897o0561q4856q804k6403O5531J5820K2822
$$ plain form
14518 190518 257062 186583 80765 7257 -65687 -75065 -85856 -74390 -82327 -106824 -91343 -89673
14506 -89673 11181 5883 -82827 -61467 -25995 4403 -27108 -26533 -32300 -108203 -60091 -61916
14494 -61916 -74648 -64543 -69702 -87485 -151693 -129153 -114126 -28571 21582 -19544 -62341 -62718
14482 -62718 -51738 -9305 59600 50808 162551 186686 162339 107619 100346 138024 79594 46762
14470 46762 86001 116722 69759 -21774 -69859 -74717 -124926 -79975 -57021 -92696 -143958 -188876
14458 -188876 -224061 -147231 -113943 -29102 -31323 -14100 -76746 -44320 -47319 -41992 -88643 -89067
14446 -89067 -65967 -8737 24768 73693 47598 61896 107797 191925 194133 68867 7317 47042
14434 47042 81309 121677 91295 96713 82816 22255 -62601 -71405 -97808 -32277 -16457 6365
14422F365L9622l7005j52127J5002P6497M3466n1366J8806O5848J0941N1158L0268
14410A17475l9523j3325J3779k8648m397K4314L438m6335J5586k8680n3898N0682
14398A0468l9384N3523N3936o2339j3812O5281R8255n600j09816q1002N2247j1821
14386I936M0611N0966n2622o5807q3365J2230K7657O0693L1263n3759n8308O1234
14374a9271m671m9962n7621L9984j9649J6025L2818L8043M4562L5682N1075k5662
14362H1353p6879l0759K7371O7596o3037m5872k0872K2774M7120L3029L7065K50
14350G9139M782p46N601M616l4503m6041m747j5141O1245K1461n6758j24387q099
14337a13578O9306J07235O7718K5402k1060n4700K138k7648l8233q289P2633M5989
$$ plain form
14422 6365 45987 8982 -143145 -128143 -51646 -8180 -59546 -40740 25108 36049 87207 117475
14410 117475 77952 64627 78406 49758 45361 69675 73113 26778 42364 13684 -40214 10468
14398 10468 -28916 24607 78543 16204 2392 67673 165928 160328 50512 -30490 21757 9936
14386 9936 50547 101513 48891 -16916 -100281 -88051 -60394 299 31562 -22197 -80505 -19271
14374 -19271 -23942 -73904 -131525 -91541 -111190 -95165 -62347 -24304 20258 55940 107015 81353
14362 81353 4474 -26285 1086 68682 5645 -40227 -61099 -38325 8795 41824 78889 79139
14350 79139 83921 83175 88776 93392 58889 12848 8101 -7040 54205 75666 18908 -105479 -113578
14337 -113578 -44272 62963 130681 156083 135023 80323 82461 54813 16580 8291 80924 126913
14325A26913m0068r4408r8300p745L1585M2041Q4813N0429q3963l6705N0903m5451
14313a9956o3387n600J32903J01527q455L0926L8241k3395n6569k5734K054J5252
14301A17807r637L141K5720L8564n9031n7390L6685p1011k0750N0814m0979o4983
14289e1050j057M6507l8923l2222Q6814P0365q4157o1068K6931M585m6552k4635
14277a04462K0639N1853n4465j2800L9998O6351K487p0716M7727j161n1184n9911
14265a25644J9530L770l9007j9882Q981N984O2762P84o921N8814J21801M4544
14253A35516l9003N803J2676p6289k3288P0N0946P7401Q218k7043K1106J2532
14241A58645n9954q6705l6098K2641N0815l7808k4029l217N5745K0898L6185P2974
$$ plain form
14325 126913 86845 -7563 -105863 -113608 -82023 -39982 44831 95260 11297 -25408 25495 -19956
14313 -19956 -83343 -88943 43960 145487 137032 167958 206199 182804 126235 100501 102555 117807
14301 117807 108170 111311 137031 175595 116564 59174 95859 24848 4098 54912 13933 -51050
14289 -51050 -52107 -5600 -44523 -76745 10069 80434 -3723 -64791 -37860 -33275 -79827 -104462
14277 -104462 -83823 -31970 -86435 -99235 -59237 7114 9601 -61115 -13388 -14549 -65733 -125644
14265 -125644 -106114 -102344 -141351 -161233 -152252 -146268 -83506 -82722 -89643 -30829 90972 135516
14253 135516 96513 102316 114992 38703 15415 15485 66431 143832 152050 125007 146113 158645
14241 158645 98691 11986 -24112 -1471 49344 11536 -12493 -15710 40035 60933 97118 170092
14229A70092J9053j3927l7854l7011L6346p8719p8931K7486k2949q2157n903m2531
14217a47005j1694N0064J26156K406r95L2190l1426n3397J7671N1767J8651j3014
14205D1374q784l5244q0979r2829N0419M1046k0228L356K0619p403j5592J8795
14193h5450K7053O8912P2414q0347k1590k6851j7094N4192P4675k3720l9801k1250
14181a8857M2313p9351r1380k8180J26689Q4366n090J7253r931m2068m0246K6970
14169a7512k005O3868K7720p4389q7213j7688P0414m959l15P1885P1676m4527
14157E6955P8064l2170o5577j0299r8550k5653J20346M0419L7749n3722j20780
14146g3218J5646R6193l0896k6710K3890l193k6199L5192P0205J5589k4474o1568
$$ plain form
14229 170092 189145 175218 137364 100353 136699 57980 -20951 6535 -16414 -98571 -104474 -147005
14217 -147005 -158699 -108635 17521 19927 18932 51122 19696 -33701 -16030 35737 54388 41374
14205 41374 32590 -2654 -83633 -176462 -126043 -84997 -105225 -101869 -81250 -88653 -104245 -85450
14193 -85450 -58397 10515 82929 2582 -19008 -45859 -62953 -8761 65914 42194 2393 -18857
14181 -18857 23456 -55895 -147275 -175455 -48766 35600 30510 47763 37832 -4236 -44482 -17512
14169 -17512 -19517 44351 72071 -2318 -89531 -107219 -36805 -41764 -42079 29806 101482 56955
14157 56955 135019 102849 37272 26973 -71577 -97230 23116 63535 101284 47562 -73218
14146 -73218 -57572 38621 7725 -18985 4905 1712 -24487 10705 80910 96499 72025 10457
14134A0457j9214M5540p1362q790Q9033k512l4313p9182L8970J05193O2455l5321
14122A00954k1268k1433n4412J6202K3390M3170r875k5328K1005J1790N2307j7758
14110A18744k3424j00780P2341J31184m9568j47656r4679M7954O2210M5030o0492
14099H64k711N4269K4602j4751J38748k6266j25181j0391n483J2563o0197n6457
14087g0391o126n6542J121J16653J01398O8668l8043m8754l8225m2531K1895M5556
14075E4679Q107N85L4160L1089j6491n6323p719m8618K030k2757J2076o739P7105
14062F1184J2805L5898M761K73m684k5372l8620O213K5036o1187K5630N155n947
14049D1145k6484k0729r078l7234K5679Q1109n0201J1874O8002l110K8022l913
$$ plain form
14134 10457 -8757 36783 -34579 -43369 45664 43152 8839 -70343 -31373 73820 136275 100954
14122 100954 79686 58253 3841 20043 43433 86603 76728 51400 72405 84195 136502 118744
14110 118744 95320 -5460 66881 198065 148497 841 -93838 -45884 16326 61356 864
14099 864 -1847 52422 77024 62273 201021 174755 49574 39183 33700 46263 -13934 -70391
14087 -70391 -76517 -133059 -131938 -15285 86113 154781 116738 67984 29759 -12772 9123 54679
14075 54679 62786 63371 97531 128620 112129 55806 48087 -531 1499 -21258 -9182 -15921 61184
14062 61184 73989 109887 114648 114921 110237 84865 46245 52458 77494 16307 41937 47092 41145
14049 41145 14661 -6068 -15146 -52380 -26701 54408 4207 16081 84083 80973 108995 105082
14037A05082m2505J7423q312j06655J378K6284j9599L8243K6598j5293k237j9583
14025H24l8196M8969K0494J1431M70l9381q6742K645J203j6464L514O0011L9924
14012H702N9737o7818P0786J0389R361P4200N357j4143j4549R512M3437n6562
14000A38409k4056n0540q735o9193k7664q5648n531L6062q288j0959K3391L6763
13988e5989K2322P540K6011m3400J01831J03764j33961l9688N937l1145k1480
13977e8258K5865P5278P2105l3157j10692J6624m7507L4333q489R7623K7417o7849
13965B3293j06994M9503n0518j0008O844N3768J14625L6658q7445j35159l7384
13954a42817N9240P9091J7688l3926o4694j1914J10134k6199J7081K1811r5559
$$ plain form
14037 105082 62577 80000 71688 -34967 -33589 -7305 -26904 11339 37937 22644 20407 824
14025 824 -37372 11597 32091 43522 43992 4611 -82131 -79486 -78283 -94747 -91233 -31222 8702
14012 8702 68439 621 71407 81796 91157 165357 170714 156571 142022 151534 194971 138409
14000 138409 114353 63813 55078 -14115 -41779 -127427 -132958 -96896 -105184 -116143 -92752 -55989
13988 -55989 -33667 -26127 -116 -43516 58315 162079 28118 -11570 -5633 -36778 -58258
13977 -58258 -32393 42885 114990 81833 -28859 -12235 -59742 -25409 -33898 63725 91142 23293
13965 23293 -83701 -34198 -84716 -94724 -87880 -34112 80513 117171 29726 -105433 -142817
13954 -142817 -83577 -4486 13202 -20724 -85418 -97332 12802 -13397 3684 25495 -70064
13943g0064j2823K707n0409l221R1822J09164m721p2508l4588J8616k9707o5532
13931a21264l813J31655N1373o0559j14838L0958J00611l346j18641L7228k1935
13920i2571j3630O5345j5457L3307p700k388k9868P4393M947P904q1346O2561
13908E497j1550Q203J2516q68j6066J8038r736o3324k1771n319k2029M6896N0719
13895h794m5204k9816P6323K4704L5888p2139j03334n420P7748J2998O5511N5589
13883H4054M9699J8885r6886n6717k0820K6203K5166l4559n5764L7711R4419l3290
13871C8101j0826n8177N1834O1275J2102p7039p2869n6112O4644M2129r8523n2442
13859a55903J3043J8870j2198N3640K9243P3616k1493j0449K4434p362M552J6955
$$ plain form
13943 -70064 -82887 -80180 -130589 -133810 -41988 67176 62455 -10053 -44641 -26025 -55732 -121264
13931 -121264 -125077 6578 57951 -2608 -117446 -86488 14123 10777 -107864 -70636 -92571
13920 -92571 -106201 -40856 -56313 -23006 -30706 -33094 -62962 11431 16378 24282 -57064 5497
13908 5497 -6053 2150 14666 13798 -2268 15770 6034 -57290 -79061 -84380 -106409 -59513 -8794
13895 -8794 -53998 -83814 -7491 17213 53101 -19038 -122372 -127792 -50044 -37046 28465 84054
13883 84054 133753 152638 55752 -965 -21785 4418 29584 -4975 -60739 -23028 71391 38101
13871 38101 27275 -30902 20932 82207 94309 17270 -55599 -111711 -47067 -4938 -103461 -155903
13859 -155903 -142860 -123990 -136188 -82548 -53305 20311 -1182 -11631 12803 5441 9993 26948
13847B6948M9257p5779q2550L8658P4865l4781j2532J3860r694j1307J6618k649
13835i086q553j7915J1144K8744k3387j9356L2015J1630N2989j3928r5949J3597
13823c8055R8301L6249r401o6784L101k3261m0860l1655o8912k2555M9635J51064
13811C6867Q3547L1765r8685q8250N9064M2295L1273R6875K7773m9282q6393j50988
13799f4139MJ4782M0655M642j248J5088j3643r9401J9040j783O5004O4665Q818
13786E2484j6641m0482M6153k5281K4879J07848n9050j26497j691J1485N7327
13775C0534L9284o3798k1870N446O022q4182m710N1025J5891Q8028p4085k1452
13763c3867O619L387L617J8844l8171n9036J01730Q5326n464p0147o6460L6508
$$ plain form
13847 26948 76205 426 -82124 -43466 31399 -3382 -15914 -2054 -11748 -23055 -6437 -9086
13835 -9086 -17639 -35554 -24410 4334 -19053 -38409 -6394 5236 58225 44297 -51652 -38055
13823 -38055 60246 96495 87094 20310 23411 150 -40710 -72365 -141277 -163832 -114197 36867
13811 36867 120414 152179 53494 -34756 24308 66603 97876 194751 222524 173242 86849 -64139
13799 -64139 -64135 -49353 -8698 -4056 -5304 9784 -3859 -103260 -84220 -86003 -20999 43666 52484
13786 52484 35843 -4639 41514 16233 41112 148960 89910 -36587 -38278 -26793 30534
13775 30534 69818 6020 -15850 -10404 -4382 -88564 -93274 -42249 -26358 61670 -12415 -33867
13763 -33867 -27248 -23861 -20244 -1400 -39571 -98607 3123 88449 82985 12838 -53622 -17114
13751a7114N7604n82J0823j2600M5855p0048m8169M6081m1752N9814N9911K144
$$ plain form
13751 -17114 40490 39908 50731 38131 83986 13938 -34231 11850 -29902 29912 89823 91967
$$ [...]
##END NTUPLES=NMR SPECTRUM
##END=
