##TITLE=Analysis number 330079
Compound Code cc 67806
Book Reference 521/131
Project Code adrs
Chemist Name evam
##JCAMPDX= 6.0         $$ Bruker NMR JCAMP-DX V2.0
##DATA TYPE= NMR SPECTRUM
##DATA CLASS= NTUPLES
##ORIGIN= Bruker BioSpin GmbH
##OWNER= nmr
$$ XWIN-NMR		Version 3.5
$$ Thu Oct 25 08:50:31 2007 GMT Daylight Time (UT+1h)  MAYBRIDGE\nmr@NMR_250MHZ
##.OBSERVE FREQUENCY= 250.131544655141
##.OBSERVE NUCLEUS= ^1H
##.ACQUISITION MODE= SIMULTANEOUS (DQD)
##.ACQUISITION SCHEME= undefined
##.AVERAGES= 16
##.DIGITISER RES= 18
##SPECTROMETER/DATA SYSTEM= dpx250
##.PULSE SEQUENCE= zg30
##.SOLVENT NAME= CDCl3
##.SHIFT REFERENCE= (INTERNAL, CDCl3, 0, 16.4397)
##AUDIT TRAIL= $$ (NUMBER, WHEN, WHO, WHERE, WHAT)
$$ ##TITLE= Audit trail, XWIN-NMR		Version 3.5
$$ ##JCAMPDX= 5.01
$$ ##ORIGIN= Bruker BioSpin GmbH
$$ ##OWNER= nmr
$$ C:\u/data/dgb/nmr/ADRS/1310/pdata/1/auditp.txt
$$ ##AUDIT TRAIL=  $$ (NUMBER, WHEN, WHO, WHERE, WHAT)
(   1,<2007-10-25 08:49:56.79 +100>,<MAYBRIDGE\nmr>,<NMR_250MHZ>,
      <created by zg, POWCHK disabled, PULCHK disabled
       configuration hash MD5:
       76 6E 9A 78 1E 09 19 81 EC 84 63 8F B0 6A 59 2D
       data hash MD5: 64K
       AF 66 51 2A 07 63 35 0F 6A 70 54 72 56 51 06 CD>)
(   2,<2007-10-25 08:50:16.30 +100>,<MAYBRIDGE\nmr>,<NMR_250MHZ>,
      <Start of raw data processing
       ef LB = 0.3 FT_mod = 6 PKNL = 1 SI = 32K 
       data hash MD5: 32K
       55 DD A6 21 C2 05 8C B1 20 DE D4 01 68 89 C8 2F>)
(   3,<2007-10-25 08:50:18.94 +100>,<MAYBRIDGE\nmr>,<NMR_250MHZ>,
      <apk 
       data hash MD5: 32K
       6A 2A 93 02 DE 94 9B AE B0 45 39 FE 53 84 FD FB>)
(   4,<2007-10-25 08:50:19.66 +100>,<MAYBRIDGE\nmr>,<NMR_250MHZ>,
      <abs ABSG = 5 
       data hash MD5: 32K
       CD 28 CF 26 E8 00 45 3A 35 FA 54 7F CC 90 C8 97>)
$$ ##END=
$$ 
$$ hash MD5
$$ BE AF 81 6B 25 F1 8E 85 30 21 49 FB 10 D2 A0 85
##$RELAX= 
##$RELAX= 
##$RELAX= 
##$RELAX= 
##$RELAX= 
##$RELAX= 
##$RELAX= 
$$ Bruker specific parameters
$$ --------------------------
##$DU= <C:\u>
##$EXPNO= 1310
##$NAME= <ADRS>
##$PROCNO= 1
##$TYPE= <nmr>
##$USER= <dgb>
##$AMP= (0..31)
100 100 100 100 100 100 100 100 100 100 100 100 100 100 100 100 100 100 
100 100 100 100 100 100 100 100 100 100 100 100 100 100 
##$AQSEQ= 0
##$AQ_mod= 3
##$AUNM= <au_zg>
##$AUTOPOS= <1 >
##$BF1= 250.13
##$BF2= 250.13
##$BF3= 250.13
##$BF4= 250.13
##$BF5= 500.13
##$BF6= 500.13
##$BF7= 500.13
##$BF8= 500.13
##$BYTORDA= 1
##$CFDGTYP= 0
##$CFRGTYP= 5
##$CHEMSTR= <none>
##$CNST= (0..31)
1 1 145 1 1 1 1 1 1 1 1 1 1 1 1 1 1 1 1 1 1 1 1 1 1 1 1 1 1 1 1 1 
##$CPDPRG= <>
##$CPDPRG1= <>
##$CPDPRG2= <>
##$CPDPRG3= <>
##$CPDPRG4= <mlev>
##$CPDPRG5= <mlev>
##$CPDPRG6= <mlev>
##$CPDPRG7= <mlev>
##$CPDPRG8= <mlev>
##$CPDPRGB= <>
##$CPDPRGT= <>
##$D= (0..31)
0 1 0 0 0 0 0 0 0 0.06 0 0 0 0 0 0 0.0002 0 0 0 0 0 0 0 0 0 0 0 0 0 0 
0 
##$DATE= 1193298595
##$DBL= (0..7)
120 120 120 120 120 120 120 120 
##$DBP= (0..7)
150 150 150 150 150 150 150 150 
##$DBP07= 0
##$DBPNAM0= <>
##$DBPNAM1= <>
$$ [...]
##$SUBNAM7= <"">
##$SUBNAM8= <"">
##$SUBNAM9= <"">
##$SW= 20.6930455092707
##$SWIBOX= (0..15)
0 0 3 0 0 0 0 0 0 0 0 0 0 0 0 0 
##$SW_h= 5175.983436853
##$TD= 65536
##$TD0= 1
##$TE= 295.16
##$TE2= 300
##$TE3= 300
##$TEG= 300
##$TL= (0..7)
0 120 120 120 120 120 120 120 
##$TP= (0..7)
150 150 150 150 150 150 150 150 
##$TP07= 0
##$TPNAME0= <>
##$TPNAME1= <>
##$TPNAME2= <>
##$TPNAME3= <>
##$TPNAME4= <>
##$TPNAME5= <>
##$TPNAME6= <>
##$TPNAME7= <>
##$TPOAL= (0..7)
0.5 0.5 0.5 0.5 0.5 0.5 0.5 0.5 
##$TPOFFS= (0..7)
0 0 0 0 0 0 0 0 
##$TUNHIN= 0
##$TUNHOUT= 0
##$TUNXOUT= 0
##$USERA1= <user>
##$USERA2= <user>
##$USERA3= <user>
##$USERA4= <user>
##$USERA5= <user>
##$V9= 5
##$VALIST= <valist>
##$VCLIST= <CCCCCCCCCCCCCCC>
##$VD= 0
##$VDLIST= <DDDDDDDDDDDDDDD>
##$VPLIST= <PPPPPPPPPPPPPPP>
##$VTLIST= <TTTTTTTTTTTTTTT>
##$WBST= 1024
##$WBSW= 4
##$XGAIN= (0..3)
0 0 0 0 
##$XL= 0
##$YL= 0
##$YMAX_a= 386221
##$YMIN_a= -457042
##$ZGOPTNS= <>
##$ZL1= 120
##$ZL2= 120
##$ZL3= 120
##$ZL4= 120
##$ABSF1= 16.43973
##$ABSF2= -4.253443
##$ABSG= 5
##$ABSL= 3
##$ALPHA= 0
##$AQORDER= 0
##$ASSFAC= 0
##$ASSFACI= 0
##$ASSFACX= 0
##$ASSWID= 0
##$AUNMP= <proc_1d>
##$AZFE= 0.1
##$AZFW= 0.1
##$BCFW= 0
##$BC_mod= 0
##$BYTORDP= 0
##$COROFFS= 0
##$CY= 12.5
##$DATMOD= 1
##$DC= 0
##$DFILT= <>
##$DTYPP= 0
##$F1P= 14.0000005364418
##$F2P= -0.99999901652339
##$FCOR= 0.5
##$FTSIZE= 32768
##$FT_mod= 6
##$GAMMA= 0
##$GB= 0
##$INTBC= 1
##$INTSCL= 1
##$ISEN= 128
##$LB= 0.3
##$LEV0= 0
##$LPBIN= 0
##$MAXI= 10000
##$MC2= 0
##$MEAN= 0
##$ME_mod= 0
##$MI= 0
##$NCOEF= 0
##$NC_proc= -4
##$NLEV= 6
##$NOISF1= 0
##$NOISF2= 0
##$NSP= 0
##$NTH_PI= 0
##$NZP= 0
##$OFFSET= 16.43973
##$PC= 1
##$PHC0= 149.371
##$PHC1= 38.34727
##$PH_mod= 1
##$PKNL= yes
##$PPARMOD= 0
##$PSCAL= 4
##$PSIGN= 0
##$REVERSE= no
##$SF= 250.130020577835
##$SI= 32768
##$SIGF1= 0
##$SIGF2= 0
##$SINO= 400
##$SIOLD= 32768
##$SREGLST= <1H.CDCl3>
##$SSB= 0
##$STSI= 32768
##$STSR= 0
##$SW_p= 5175.98343685301
##$SYMM= 0
##$S_DEV= 0
##$TDeff= 65536
##$TDoff= 0
##$TI= <Analysis number 999999
Compound Code 99
Book Reference 9
Project Code 9>
##$TILT= no
##$TM1= 0
##$TM2= 0
##$TOPLEV= 0
##$USERP1= <user>
##$USERP2= <user>
##$USERP3= <user>
##$USERP4= <user>
##$USERP5= <user>
##$WDW= 1
##$XDIM= 32768
##$YMAX_p= 386178228
##$YMIN_p= -322597
$$ End of Bruker specific parameters
$$ ---------------------------------
##NTUPLES= NMR SPECTRUM
##VAR_NAME=  FREQUENCY,     SPECTRUM/REAL,   SPECTRUM/IMAG
##SYMBOL=    X,             R,               I
##VAR_TYPE=  INDEPENDENT,   DEPENDENT,       DEPENDENT
##VAR_FORM=  AFFN,          ASDF,            ASDF
##VAR_DIM=   32768,         32768,           32768
##UNITS=     HZ,            ARBITRARY UNITS, ARBITRARY UNITS
##FACTOR=    0.157963299565203, 1,           1
##FIRST=     4112.06992579176, 0,            0
##LAST=      -1063.91351106125, 0,           0
##MIN=       -1063.91351106125, -322597,     0
##MAX=       4112.06992579176, 386178228,    0
$$ Real data points
##PAGE= N=1
##DATA TABLE= (X++(R..R)), XYDATA
$$ [...]
24208b30699Q8938L8406m83K3185p293M7964J1715n8715m9923k991J11875O81
$$ -230699 -141761 -103355 -103838 -80653 -87946 -39982 -28267 -86982 -136905 -139896 -28021 -27340
24196b7340j7926L777O7906K8532K5326J2178K3186m5711m3661m5067p3076J16797
$$ -27340 -45266 -41489 26417 54949 80275 92453 115639 69928 26267 -18800 -91876 24921
24184B4921P9675k7447n23J7106j01554o3297m933k5510l4088J06048K1110K6945
$$ 24921 104596 77149 76626 93732 -7822 -71119 -76052 -101562 -135650 -29602 -8492 18453
24172A8453J14860m4412o6496r7390o1479L7604Q3994J6031m3114J12482m3367
$$ 18453 133313 88901 22405 -74985 -136464 -98860 -14866 1165 -41949 70533 27166
24161B7166l3329M9287j1932p6237K8541P3206m9567k5075k4056J8368K8377P2876
$$ 27166 -6163 43124 31192 -45045 -16504 56702 7135 -17940 -41996 -23628 4749 77625
24149G7625M297n1364r8340m7163P9308N8433l4796N2521P1770k9860N0548q387
$$ 77625 81922 30558 -67782 -114945 -35637 22796 -12000 40521 112291 82431 132979 124592
24137A24592j7742J0445q6937p3514J50J4965n7661k3608K9681k27N8078J3965
$$ 124592 106850 117295 30358 -43156 -43006 -28041 -85702 -109310 -79629 -79856 -21778 -7813
24125g813o83O6394J00753j445n4521p3161p6510J2812J24638N9216m1261m365
$$ -7813 -8496 57898 158651 157206 102685 29524 -46986 -34174 90464 149680 108419 104054
24113A04054M71l9715m3627K3035K5348N0778k0207l0256k8374j08036M9378R772
$$ 104054 104525 64810 21183 44218 69566 120344 100137 69881 41507 -66529 -17151 -7379
24101g379r8903J9415L6980Q091L3479Q983l8319J4400P6417P733q7291m2414
$$ -7379 -106282 -86867 -49887 -41796 -8317 666 -37653 -23253 53164 60897 -26394 -68808
24089f8808q2123p4875J25222O0105m519L1902n7798P9087R2170M3187l3050M800
$$ -68808 -150931 -225806 -100584 -40479 -44998 -13096 -70894 8193 100363 143550 110500 115300
24077A15300r0959n3556N3110k5060n4006R77J09435M3735m4661l9893o2675o3467
$$ 115300 24341 -29215 23895 -1165 -55171 -54194 55241 98976 54315 14422 -48253 -111720
24065a11720J7137N3484K1929l3877N0185n9619j6003L0698P7816r7530r0746
$$ -111720 -94583 -41099 -19170 -53047 -2862 -62481 -78484 -47786 30030 -67500 -158246
24054a58246O9950Q7329p755J09379j8989l2941J513J8205L3804m4843m8029J4336
$$ -158246 -88296 -967 -8722 100657 81668 48727 50240 68445 102249 57406 9377 23713
24042B3713M4606p5839n9600j3420L372O8831m2058K5252l4949N8215l3825n4151
$$ 23713 68319 -7520 -67120 -80540 -77168 -8337 -50395 -25143 -60092 -1877 -35702 -89853
24030h9853k9438k178R224J04853M1459p1675l077L4309P553o5315j207M6889
$$ -89853 -119291 -121469 -112245 -7392 34067 -37608 -40685 -6376 1177 -64138 -65345 -18456
24018a8456N9646K7502l4232L5121L8870k7337j6296k5760N3920Q385r1537O7519
$$ -18456 41190 68692 34460 69581 108451 81114 64818 39058 92978 101363 9826 77345
24006G7345J3773n9308j11023m8842p1830L4781M7532j992O1093O4818l7152j2395
$$ 77345 91118 31810 -79213 -128055 -199885 -165104 -117572 -119564 -58471 6347 -30805 -43200
23994d3200K8290k2802k4110K9919m2207l9600Q6761o2949k8431j0597Q968J4786
$$ -43200 -14910 -37712 -61822 -31903 -74110 -113710 -26949 -89898 -118329 -128926 -119958 -105172
23982a05172N7756J1839K8607N9276j02535p7864l4813L9929Q8455J1335j1170
$$ -105172 -47416 -35577 -6970 52306 -50229 -128093 -162906 -122977 -34522 -23187 -34357
23971c4357j14214J8340J7709qN7573j0916Q0473Q4058k8581r8720m4230J9117
$$ -34357 -148571 -130231 -112522 -112530 -54957 -65873 14600 98658 70077 -28643 -72873 -53756
23959e3756O9907k7994o333P5392Q1106J14946j8856j26308j26373o9026P5443
$$ -53756 16151 -11843 -18176 57216 138322 253268 234412 108104 -18269 -87295 -11852
23948a1852K2732K0830P0110j239J6142m2732o7749j00706j9989P586j6556L5355
$$ -11852 10880 31710 101820 100581 116723 73991 6242 -94464 -114453 -106867 -123423 -88068
23936h8068L7441P9839m254p6130j7591l0961O173L9784M0043P1814L887J4527
$$ -88068 -50627 29212 24958 -51172 -68763 -99724 -93551 -53767 -13724 58090 61977 76504
23924G6504q1322O0329k0544K1052O5872J5582O3307r0510n9780p8697k4166k4063
$$ 76504 -4818 55511 34967 56019 121891 137473 200780 110270 50490 -28207 -52373 -76436
23912g6436N2134K7236J4259l9759J998q980l8935l8818J4428L3369L1571k8205
$$ -76436 -24302 2934 17193 -22566 -20568 -29548 -68483 -107301 -92873 -59504 -27933 -56138
23900e6138N88J4633L2686l9158o2741j2506N9579P0035K0098o3544m9014N3063
$$ -56138 -55550 -40917 -8231 -47389 -110130 -122636 -63057 6978 27076 -36468 -85482 -32419
23888c2419N0045M5212L7324O5903j9658j13184j27084K6639P6473o292k6185
$$ -32419 17626 62838 100162 166065 146407 33223 -93861 -67222 9251 2959 -23226
23877b3226J03303k8343l6673m6523n253J6224N4740J26314N2789K7948o1036
$$ -23226 80077 51734 15061 -31462 -36715 -20491 34249 160563 213352 241300 180264
23866A80264p9656p7662n0537k4182o548N4883O7596J12131q4441j34247j616
$$ 180264 100608 22946 -27591 -51773 -58321 -3438 64158 176289 91848 -42399 -44015
23855d4015O1219q3429m18J2165j1379N9660l4852J3570K5765O608m2498q887
$$ -44015 17204 -66225 -66643 -54478 -65857 -6197 -41049 -27479 -1714 4894 -37604 -46491
23843d6491M8460K9272J04045J39948n8037j36690m7957o2749J2953L5079n6597
$$ -46491 1969 31241 135286 275234 217197 80507 32550 -30199 -17246 17833 -38764
23832c8764r1179K0476Q6576q8446p0552Q8055M1997L7980J9586K2520N975n6532
$$ -38764 -129943 -109467 -22891 -111337 -181889 -93834 -51837 -13857 5729 28249 34224 -22308
23820b2308k7971m5251J1550O7054O7130j7437n262l7017k6939L9688P9134K5580
$$ -22308 -50279 -95530 -83980 -16926 50204 32767 27505 -9512 -36451 3237 82371 107951
23808A07951N3493L5479q2141j05236m0303p0646k9949l4648L690K2724J5431
$$ 107951 161444 196923 114782 9546 -30757 -101403 -131352 -166000 -162310 -139586 -124155
23797a24155m781K9993L1060J9629Q0031m8858N0961J30525L0665o0489l9422
$$ -124155 -128936 -98943 -67883 -48254 31777 -17081 33880 164405 195070 134581 95159
23786I5159p2218o654k6640m9574M2430N281k4125n1884N871l1390k4917Q4858
$$ 95159 22941 16287 -10353 -59927 -17497 -12216 -36341 -88225 -82354 -113744 -138661 -53803
23774e3803o3066q1606O7172Q0165N8793J407J17265o8098j20885L64K9399m4954
$$ -53803 -116869 -198475 -131303 -51138 7655 9062 126327 58229 -62656 -62292 -32893 -77847
23762g7847n0169o4690P4747K03208P5865k3993k2028K8287M597n7421j05000
$$ -77847 -128016 -192706 -117959 85249 161114 137121 115093 143380 147977 90556 -14444
23751a4444o0803Q8972J54964J4107p3284o7109M5429j3977m8583j5960K496j410
$$ -14444 -75247 13725 168689 182796 109512 42403 87832 73855 25272 9312 11808 10398
23739A0398j0885Q2771O752l5509k8202m3560k161O6646p6237O2713Q7018j0938
$$ 10398 -487 82284 89036 53527 25325 -18235 -20396 46250 -29987 32726 119744 108806
23727A08806n3659J2840q2650K7207M2503K5427O4882l302n8818q2063m7488N6173
$$ 108806 55147 67987 -14663 12544 55047 80474 145356 142054 83236 1173 -46315 9858
23715I858J56546J2468k3193j567l745k0031j4018m6697l8466J1730J727J4673
$$ 9858 166404 178872 155679 154112 150367 130336 116318 69621 31155 42885 44612 59285
23703E9285o130k6184r153o9334k9847K8816J5162M2163m0777l1487L8407K3842
$$ 59285 53155 26971 17818 -51516 -81363 -52547 -37385 4778 -35999 -67486 -29079 -5237
23691e237K3018L2281M652l0072m1647j3109K1354K83N1567J2741j03184n3739
$$ -5237 17781 50062 54714 24642 -17005 -30114 -8760 -8477 43090 55831 -47353 -101092
23679a01092N2495J3698J0094p3343q488Q8625N0892M1234o904r38m5132r9629
$$ -101092 -48597 -34899 -24805 -98148 -106636 -18011 32881 74115 67211 66273 21141 -78488
23667g8488O1901K8666m332j2204M0513o6799O7327J15001l9929q2260m4423l7219
$$ -78488 -16587 12079 7747 -4457 36056 -30743 36584 151585 111656 29396 -15027 -52246
23655e2246l1347J3475K3907l6116j1148M0891q697M7043R595q7006l1093R956
$$ -52246 -83593 -70118 -46211 -82327 -93475 -52584 -61281 -14238 -4643 -91649 -122742 -112786
23643a12786M5145N1960J688j3472O1137R2082J863q3379K7383p3826P599L43
$$ -112786 -67641 -15681 -13993 -27465 33672 125754 127617 44238 71621 -2205 5394 5737
23631E737K4712j8050P9217j819q2832r1323j12250O3518M8976P9299o159j1369
$$ 5737 30449 12399 91616 89797 6965 -84358 -196608 -133090 -84114 -4815 -10974 -22343
23619b2343P1253L7775k2583n0157q5871q5997L8342P9761R3003O0403p9119r5603
$$ -22343 48910 86685 64102 13945 -71926 -157923 -119581 -39820 53183 113586 34467 -61136
23607f1136P706M3275o38o1891K9663Q1716O752P5083K1375n3708J8217j19856
$$ -61136 -53430 -10155 -10793 -72684 -43021 38695 45447 120530 141905 88197 106414 -13442
23595a3442p5819K2141J1372l5193L6843N6461M6666j1463j4708k8619n9166L2306
$$ -13442 -89261 -67120 -55748 -90941 -54098 2363 49029 37566 22858 -5761 -64927 -32621
23583c2621N7107r6111o3504M7846K8351P6687l0882k3842k5160q328P2017O3924
$$ -32621 24486 -71625 -135129 -87283 -58932 17755 -13127 -36969 -62129 -70457 1560 65484
23571F5484o824n1524p8893j7760O8011N2753J2218p9338p5296M4841Q0923L5862
$$ 65484 58660 7136 -71757 -89517 -21506 31247 43465 -35873 -111169 -66328 14595 50457
23559E0457m4299n2192r7843K7147n420m8536Q0524J12037N0636M3198M6712m9713
$$ 50457 6158 -46034 -143877 -116730 -122150 -170686 -90162 21875 72511 115709 162421 112708
23547A12708o8648j5092o5713J2840n9545k9698j2288L5545K0214k4090k4692
$$ 112708 44060 28968 -36745 -23905 -83450 -113148 -125436 -89891 -69677 -93767 -118459
23536a18459O5116N5156k1625j3782J9932K061m5348l578l1290K8443P1173O5518
$$ -118459 -53343 1813 -19812 -33594 -13662 -11601 -56949 -60527 -91817 -63374 7799 73317
23524G3317N5164k7850o2666m9245J7477R8322O4162p7333o4563k4965O0819l7766
$$ 73317 128481 100631 37965 -11280 6197 104519 168681 91348 26785 1820 62639 24873
23512B4873O5618l803m9896m331j2222n8746q3913o104N7088j2119M2022L5063
$$ 24873 90491 86688 36792 32461 20239 -38507 -122420 -128524 -71436 -83555 -41533 -6470
23500f470O4925J8954j20919r4591L9504J1494N7179j0303j676J6817K0736n429
$$ -6470 58455 77409 -43510 -138101 -98597 -87103 -29924 -40227 -41903 -25086 -4350 -9779
23488i779l7144K4496L6756J2681r4421m4851Q60K2740N2232P7073M8934j3517
$$ -9779 -46923 -22427 14329 27010 -67411 -112262 -111402 -88662 -36430 40643 89577 76060
23476G6060n5899j6086O6658l6911j64381M1916L1939K9315j3960n871M4260k5394
$$ 76060 20161 4075 70733 33822 -130559 -88643 -56704 -27389 -41349 -47220 -2960 -28354
23464b8354P079L4987m5365p9713j8308j2300O479J3886j2312K9073J62465M4815
$$ -28354 -21275 13712 -31653 -111366 -129674 -141974 -135495 -121609 -133921 -104848 57617 102432
23452A02432p7600o5134l6334R775J1735N1075J7356J0911L348k0873n5656l8474
$$ 102432 24832 -40302 -76636 -66861 -55126 -4051 13305 24216 27564 6691 -48965 -87439
23440h7439J2656m4041P3624N4964k0287l338n5400j8268L3560K7828j4982p4331
$$ -87439 -74783 -118824 -45200 9764 -10523 -13861 -69261 -87529 -53969 -26141 -41123 -115454
23428a15454l4576N2019p8294j3785L9274O4991J04257J4257o7730K4567M7375
$$ -115454 -150030 -98011 -176305 -190090 -150816 -85825 18432 32689 -35041 -10474 36901
23417C6901J7120m8026l573K2296N9461P4l702o7828j00557q6160J35375R8960
$$ 36901 54021 5995 2422 24718 84179 84253 80551 12723 -87834 -173994 -38619 60341
23405F0341O8298l4515p1112m5851K4804N0369Q251n1372l1101M3538Q344o624
$$ 60341 128639 94124 23012 -22839 1965 52334 60585 9213 -21888 21650 29994 23370
23393B3370N1365o2188k0447k9251j1720M7533M3891M9075n0904l2930j603O279
$$ 23370 74735 12547 -7900 -37151 -48871 -1338 42553 91628 40724 7794 6191 12470
23381A2470N5434n1737j13001k9316L0151N8090J11409J0664l7164J80j187k0956
$$ 12470 67904 16167 -96834 -126150 -95999 -37909 73500 84164 47000 47180 45993 25037
23369B5037N2872p1573m9090l0806L8617p14P7532j7871n5633M6286P242l8977
$$ 25037 77909 6336 -42754 -73560 -34943 -35657 41875 24004 -31629 14657 21899 -17078
23357a7078K8926m3892j0858j491j6465Q585o7052j2071L0122j1866P9806n1490
$$ -17078 11848 -32044 -42902 -44393 -60858 -52273 -119325 -131396 -101274 -113140 -33334 -84824
23345h4824J11703O3149k7868p5040O2652J16280M1433m3249j23279j0318R515
$$ -84824 26879 90028 62160 -12880 49772 166052 207485 164236 40957 30639 40154
23334D0154n4901l6690M6336O8045K7348r003R203k1136n7920l8012N9432j12408
$$ 40154 -14747 -51437 -5101 62944 90292 81289 90492 69356 11436 -26576 32856 -79552
23322g9552j62078M6534J25074M9233k0191M4149j3322q514L3242J4388L2914
$$ -79552 -241630 -195096 -70022 -20789 -40980 3169 -10153 -18667 14575 28963 61877
23311F1877m714k2817m4958k8224N0429N1951m4003q9370L1981k791n1818k3835
$$ 61877 57163 34346 -10612 -38836 11593 63544 19541 -69829 -37848 -40639 -92457 -116292
23299a16292M3601N5698o700q9137K6169N3879P9583P9580j0834P117K9584q8541
$$ -116292 -72691 -16993 -23693 -112830 -86661 -32782 46801 126381 115547 122664 152248 63707
23287F3707j20742j0061m1104l7402r0634K7341J18754K7514M1338q957O3315
$$ 63707 -57035 -67096 -108200 -145602 -236236 -208895 -90141 -62627 -21289 -30246 33069
23276C3069o6558M5863O109J9574q845N670O3563K4257p8535m755k9422k0910
$$ 33069 -33489 12374 18483 38057 29212 34882 98445 122702 44167 39412 9990 -10920
23264a0920o0594L2534k99P6386l8747l6274l654K925m9064M835J20541j6465
$$ -10920 -71514 -38980 -39279 37107 -1640 -37914 -41568 -38643 -87707 -82872 37669 21204
23252B1204j20325J8405P7172j7455m203k9274p8315J5985J327J5554P1579p6941
$$ 21204 -99121 -80716 -3544 -20999 -25202 -54476 -132791 -116806 -115479 -99925 -28346 -105287
23240a05287J2808R4595k1317l0972p370M700L6485m8602m6375K2860R3012N656
$$ -105287 -92479 2116 -19201 -50173 -57543 -52843 -16358 -64960 -111335 -88475 4537 10193
23228A0193k8548K7266K8563p5262l7361K1731K9762K5386R749k7845k4444j3576
$$ 10193 -18355 8911 37474 -37788 -75149 -53418 -23656 1730 11479 -16366 -40810 -54386
23216e4386o0298K0837J36794J21326p5624j44104J4839N3453m3154k2642M3382
$$ -54386 -114684 -93847 42947 164273 88649 -55455 -40616 12837 -30317 -52959 -9577
23205i577O436n7038L9095L1913K4668l7512q8436j5672N1086N2864K6958k0992
$$ -9577 -3141 -60179 -21084 10829 35497 -2015 -90451 -106123 -55037 -2173 24785 3793
23193C793K3314o9152N9845R9151L5810r443k242k3983q1720M0009r0060j30608
$$ 3793 27107 -42045 17800 116951 152761 143318 141076 117093 35373 75382 -14678 -145286
23181a45286j25978M1512O7937J3802O3578L8670p5732O1614L0476J7767R9755
$$ -145286 -271264 -229752 -161815 -148013 -84435 -45765 -121497 -59883 -29407 -11640 88115
23170H8115L8873q7775q1488M3664J04996k0479o2303k5445O9919L3915N7715
$$ 88115 126988 39213 -42275 1389 106385 85906 23603 -1842 68077 101992 159707
23159A59707k5803j20340L4236O8797P159l9790j9408J6466k3699J6647m8489
$$ 159707 133904 13564 47800 116597 123756 83966 64558 81024 57325 73972 25483
23148B5483l5345J9274L48L7253q2513o6576l5025N9400O2977j1645p550P1037
$$ 25483 -9862 9412 9760 47013 -35500 -102076 -137101 -77701 -14724 -26369 -33919 37118
23136C7118O4317n8926j0451L8814p0997j9333R246q2364J3902L6104K360j1470
$$ 37118 101435 42509 32058 70872 -125 -19458 -10212 -92576 -78674 -42570 -40210 -51680
23124e1680J0317P8597Q4350P7311k2725q3447N9248J9745j30607p0645P2342
$$ -51680 -41363 37234 121584 198895 176170 92723 151971 171716 41109 -29536 42806
23113D2806k8731r609l6487O0016P3942j3784j6493O2569J3450q0345j757K3034
$$ 42806 14075 4466 -32021 27995 101937 88153 71660 134229 147679 67334 65577 88611
23101H8611N1450L1832r3565j09483l7365N425Q3374n907o3079l4572o494O2431
$$ 88611 140061 171893 78328 -31155 -68520 -63095 20279 14372 -48707 -83279 -89773 -27342
23089b7342M1294K105J6498p625j8098M0978l5871p7056r8274L615J7318K878
$$ -27342 13952 16057 32555 24930 6832 47810 11939 -65117 -163391 -159776 -142458 -139580
23077a39580N0691j7415J2666o099L2524P5520R1430j5110o1882p5127L8841m0007
$$ -139580 -88889 -106304 -93638 -99737 -67213 8307 99737 84627 22745 -52382 -13541 -53548
23065e3548O168M1378J06164Q0643r4647n3270n8903o5531O5325L5356M5168l3451
$$ -53548 -47380 -6002 100162 180805 86158 32888 -26015 -91546 -26221 9135 54303 20852
23053B0852L2908P8019m717o1639l5727m3388m6124N945n9584M2998O8615R965
$$ 20852 53760 131779 127062 65423 29696 -13692 -59816 -53871 -113455 -70457 -1842 8123
23041H123k6023k9577j2360O8725M862J2501l024n8544m7122p919M6770j9779
$$ 8123 -17900 -47477 -59837 8888 13750 26251 23227 -35317 -82439 -90358 -43588 -63367
23029f3367q0516j1921N5667P1076k8704j284J601j9079N5639Q9801o4307j04669
$$ -63367 -143883 -155804 -100137 -29061 -57765 -59049 -57448 -76527 -20888 68913 4606 -100063
23017a00063r1609N3113J01655K8904L0183l7387p6617l6356L0610L0325k5828
$$ -100063 -191672 -138559 -36904 -8000 22183 -15204 -91821 -128177 -97567 -67242 -93070
23006i3070l6150L851L0659R3099q3886l5781N071N2866q525N2969L0577O624
$$ -93070 -129220 -125369 -94710 -1611 -85497 -121278 -116207 -63341 -71866 -18897 11680 18304
22994A8304M3090O1235j11679m7691L0550J4057r2245J7765O1472n7237o8854
$$ 18304 61394 122629 10950 -36741 -6191 7866 -84379 -66614 -5142 -62379 -131233
22983a31233M8929K9158M004J1574k3037P307j3998p9474q1338K4325J06296P9241
$$ -131233 -82304 -53146 -49142 -37568 -60605 -53298 -67296 -146770 -228108 -203783 -97487 -18246
22971a8246K45O3881N1300j0993j6515j43768o9495O768J45144N9268l6378r184
$$ -18246 -18001 45880 97180 86187 69672 -74096 -143591 -136823 8321 67589 31211 22027
22959B2027o0562L1481L9553J0386L5046q6573l517q3119k8914N0454j129p86
$$ 22027 -38535 -7054 32499 42885 77931 -8642 -12159 -95278 -124192 -73738 -74867 -75653
22947g5653k5287o1254K6804r7105m6097O7932J22510j1425K9022m1822p169M1172
$$ -75653 -100940 -162194 -135390 -232495 -278592 -210660 -88150 -99575 -70553 -112375 -119544 -78372
22935g8372L9073J4890O1028l6914n3223n515j3255Q8115m739p5062k3087K9183
$$ -78372 -39299 -24409 36619 -295 -53518 -59033 -72288 15827 11088 -63974 -87061 -57878
22923e7878N53l4945J9207J6617j3461N795L7349P4714K8213J0795K1556p207
$$ -57878 -57325 -92270 -73063 -56446 -69907 -64112 -26763 47951 76164 86959 108515 101308
22911A01308k4643Q238q9875o8167M48Q8637k1941k521j5200N8361J9553k30P907
$$ 101308 76665 84903 -4972 -73139 -72691 15946 -5995 -8516 -23716 34645 54198 53968 61875
22898F1875P5765J1713j35284j4430J11939q1740o0870j2954o3913k1513L3106
$$ 61875 137640 149353 14069 -361 111578 29838 -31032 -43986 -107899 -129412 -96306
22887i6306O9479o9202R571k8660m7770O7531O5274R2439k5774p1368j4501N7710
$$ -96306 -26827 -96029 -86458 -115118 -162888 -95357 -30083 62356 36582 -34786 -49287 8423
22875H423M5650n1780j3540O8542O3998P3772k989n9457M8810j3438m9044n2927
$$ 8423 54073 2293 -11247 57295 121293 195065 192076 132619 181429 167991 118947 66020
22863F6020J0014O4966l4432l7390J732Q814K7740k9034J2986O1833K163q5280
$$ 66020 76034 141000 106568 69178 70910 79724 107464 78430 91416 153249 155412 70132
22851G0132m6179Q1617k3351j27341J9948M5722J2586L34m3377L166j4510N5593
$$ 70132 23953 105570 82219 -45122 -25174 20548 33134 33468 -9909 -6743 -21253 34340
22839C4340k7587j26808l6496M7571J8147j2806J1194m643k149K9231K6745n7133
$$ 34340 6753 -120055 -156551 -108980 -90833 -103639 -92445 -97088 -99237 -70006 -43261 -100394
22827a00394o9191K9599L7138l0596N2086J12117P7696o5603m5834k2819o0938
$$ -100394 -169585 -139986 -102848 -133444 -81358 30759 108455 42852 -2982 -25801 -86739
22816h6739k8050K7306M7612P0464M7622l2502j6581J7144k9282N4601M1121M6607
$$ -86739 -114789 -87483 -39871 30593 78215 45713 29132 46276 16994 71595 112716 159323
22804A59323l3569p4667k4114L6177q4826o228M3792m4468o6587j4940M1593k0502
$$ 159323 125754 51087 26973 63150 -21676 -27904 15888 -28580 -95167 -110107 -68514 -89016
22792h9016q9319J1215R1028R2149o2523n514R3333j6515l5003J9955k6037p9905
$$ -89016 -178335 -167120 -76092 16057 -46466 -51980 41353 24838 -10165 9790 -16247 -96152
22780i6152k7014J7664R8549k4865p9151j19044m4Q2781R7677P3017k3198l4292
$$ -96152 -123166 -105502 -6953 -31818 -110969 -230013 -230057 -147276 -49599 23418 220 -34072
22768c4072k6938k5166l8321k7506J01460N500n3041k8709Q524l1857O1131P9672
$$ -34072 -61010 -86176 -124497 -152003 -50543 -45043 -98084 -126793 -118269 -150126 -88995 -9323
22756i323n5109n797l7168r3832N6408J21452l3990k8032L0542J2020K4902K0464
$$ -9323 -64432 -70229 -107397 -201229 -144821 -23369 -57359 -85391 -54849 -42829 -17927 2537
22744B537K3315K6535k3058K0440q8008p3353N7030j2553p09j4329r206j2621
$$ 2537 25852 52387 29329 49769 -38239 -111592 -54562 -67115 -67824 -82153 -91359 -103980
22732a03980J1068K4605l3956j09075l2959P4186O4176k482O4679J42942j1146
$$ -103980 -92912 -68307 -102263 -211338 -244297 -170111 -105935 -108417 -43738 99204 88058
22721H8058o3855j452n0898K1142n0382m8110M6851K6143J7586O274P9864J7065
$$ 88058 24203 22751 -28147 -7005 -57387 -105497 -58646 -32503 -14917 -8643 71221 88286
22709H8286m7627p096K9842K8695L3315l0678q4663P4325K763q413p7020l4180
$$ 88286 40659 33563 63405 92100 125415 94737 10074 84399 87162 78749 1729 -32451
22697c2451j4100M1064N1139O946j23742m141N2005P1464j0036J6556k3071l1290
$$ -32451 -46551 -5487 45652 52598 -71144 -75285 -23280 48184 38148 54704 31633 343
22685C43j9751l8951J0714M1606O0255K8593m4039j9226J9778k6857j3583k3389
$$ 343 -19408 -58359 -47645 -6039 54216 82809 38770 19544 39322 12465 -1118 -24507
22673b4507m9508M5090O4681J8298m160l3667l41j2120l7834R144J03993M0502
$$ -24507 -74015 -28925 35756 54054 49894 16227 15886 3766 -34068 -24924 79069 119571
22661A19571q6700q9638k2145L6877n5325K8576K6592J30006Q8476o1202j5513
$$ 119571 32871 -56767 -78912 -42035 -97360 -68784 -42192 87814 176290 115088 99575
22650I9575o042k6584M3282k0957n6603p2516p113j4126M6456Q8703J5048R207
$$ 99575 93533 66949 110231 89274 32671 -39845 -46958 -61084 -14628 74075 89123 98330
22638I8330J0708L910p4443q3863o6930J217q4388M6697J21120N3859l2325K9453
$$ 98330 109038 112948 38505 -45358 -112288 -111071 -195459 -148762 -27642 26217 -6108 23345
22626B3345M3931J3195L9592o6519j8017K1214r026j422j8772j6850N3188m634
$$ 23345 67276 80471 120063 53544 35527 56741 47715 46293 27521 10671 63859 59225
22614E9225K0247M801K1182N9125O0084q0885j20263L962o0762l0300P7683O708
$$ 59225 79472 84273 105455 164580 224664 143779 23516 27478 -33284 -63584 14099 20807
22602B0807o423n0682J8335O5413J0908m5049m34N7268M6334q9075j18677P125
$$ 20807 14384 -36298 -17963 47450 58358 13309 12875 70143 116477 27402 -91275 -84150
22590h4150q245P4782J3981m8066J5996j1217m6816o1543l4869J17730P7234l646
$$ -84150 -92395 -17613 -3632 -51698 -35702 -46919 -93735 -155278 -190147 -72417 4817 1171
22578A171M5786M4359m5756L8169K5447J0766J133K3728l4102l1602m3129l7248
$$ 1171 46957 91316 45560 83729 109176 119942 121075 144803 110701 79099 35970 -1278
22566a278J18355L8995n4049M6648l8134r3274n1626J01677R7954q8356j05021
$$ -1278 117077 156072 102023 148671 110537 17263 -34363 67314 165268 76912 -28109
22555b8109l0242p5207l4410O0255J38910J797m3363J9286j564l01r0327n6949
$$ -28109 -58351 -133558 -167968 -107713 31197 32994 -10369 8917 7353 7052 -83275 -140224
22543a40224N7144Q9863m8307K164L2395q1159K4179K9767p09M8250O4320m9103
$$ -140224 -83080 6783 -41524 -39360 -6965 -88124 -63945 -34178 -34887 13363 77683 28580
22531B8580p972M7907n7691K5926O8845p0217n1597j5394J6517K7405O4333K9092
$$ 28580 20608 68515 10824 36750 105595 35378 -16219 -31613 -15096 12309 76642 105734
22519A05734n3935J2058J8313l7646j8610l6063o4910l0998K6045Q1746O7723
$$ 105734 51799 63857 82170 44524 25914 -10149 -75059 -106057 -80012 1734 69457
22508F9457N2938N8732J4227k0882j2584n2272q6640l6216L3439k640j8269k0974
$$ 69457 122395 181127 195354 174472 161888 109616 22976 -13240 20199 17559 -710 -21684
22496b1684n7798L0642J31918j6546j15421j1890P7117k7457l7979l7756q4909
$$ -21684 -79482 -48840 83078 66532 -48889 -60779 16338 -11119 -49098 -86854 -171763
22485a71763N2649R7921k7953j159J3886J5286l5121o1479J4444J1447J6005k7524
$$ -171763 -119114 -21193 -49146 -50305 -36419 -21133 -56254 -117733 -103289 -91842 -75837 -103361
22473a03361K1329Q323L5768k5279J0001k2920J2112M3454M154q4155R134j1117
$$ -103361 -82032 -73709 -37941 -63220 -53219 -76139 -64027 -20573 -16419 -100574 -91440 -102557
22461a02557O0946J00041m6614K7648O022j7645L1971k2700l5106M1634j5832
$$ -102557 -41611 58430 11816 39464 45486 27841 59812 37112 2006 43640 27808
22450B7808M1306j2379k1457O420m4728k4128j247M5027j31833L3123M6922O9199
$$ 27808 69114 56735 35278 41698 -3030 -27158 -28405 16622 -115211 -82088 -35166 34033
22438C4033J2992r218m48K0297K6432J0842l8420m1081n1958k4958O045L4486
$$ 34033 47025 37807 37359 57656 84088 94930 56510 15429 -36529 -61487 -55442 -20956
22426b0956j6004p7421m6906J01238J1177J2484M6354N4506p0261l8149L2375
$$ -20956 -36960 -114381 -161287 -60049 -48872 -36388 9966 64472 -5789 -43938 -11563
22415a1563p353K2201k0863J5440Q28m0954K0066J8109k0835L747m6553K7170
$$ -11563 -18916 3285 -17578 -2138 -1310 -42264 -22198 -4089 -24924 -21177 -67730 -40560
22403d0560K6337L2006L2423m0950j0256l6479L5333k6107m0481L0632k6743L4281
$$ -40560 -14223 17783 50206 9256 -1000 -37479 -2146 -28253 -68734 -38102 -64845 -30564
22391c0564L2136l4321o175K6220K9134n314k6843J1341j307k4812m731L5535
$$ -30564 1572 -32749 -38924 -12704 16430 11116 -15727 -4386 -5693 -30505 -35236 299
22379B99L8021n583m2982l3347M242o3623L4774L7581M8197O2392k1965L2914
$$ 299 38320 32737 -10245 -43592 -39350 -102973 -68199 -30618 17579 79971 58006 90920
22367I0920j02286j15367m647P0327N2271N4928k3528l3182l174K7812o1181k4362
$$ 90920 -11366 -126733 -131380 -61053 -8782 46146 22618 -10564 -13738 14074 -47107 -71469
22355g1469L1009o5453j4485J24146K1500r0545J0863Q3678k2196r4202K5658
$$ -71469 -40460 -105913 -120398 3748 25248 -65297 -54434 29244 7048 -87154 -61496
22344f1496J0500J71919N4742o4575n9568p5012m682n5976K3200K4453R4246K7694
$$ -61496 -50996 120923 175665 111090 51522 -23490 -28172 -84148 -60948 -36495 57751 85445
22332H5445o5089q7024l4845J3836l2163M2909K6869P304O127o1914O7704R2855
$$ 85445 20356 -66668 -101513 -87677 -119840 -76931 -50062 -42758 -36631 -98545 -30841 62014
22320F2014J10119K861k1768p0829j22565m0077k9175K5810l7535M5357K5122
$$ 62014 172133 174994 153226 82397 -40168 -80245 -109420 -83610 -121145 -75788 -50666
22309e0666M8293J0369p9827K398R1913Q2980o3038j12875p0708K9212O7816J05994
$$ -50666 -2373 7996 -71831 -69433 22480 105460 42422 -70453 -141161 -111949 -44133 61861
22297F1861J136m3669j12819K7487J18681j7188j9173j0629p900j14706j02419
$$ 61861 62997 19328 -93491 -66004 52677 35489 16316 5687 -2213 -116919 -219338
22286b19338l5896p047M5481P3876M4054l49M2891O033m1579K9018J10664o5316
$$ -219338 -255234 -262281 -216800 -142924 -98870 -99219 -56328 -50295 -91874 -62856 47808 -17508
22274a7508k5683N7322J4302r9686j311J1174L0071J0531r398J54614j357q9984
$$ -17508 -43191 14131 28433 -71253 -72564 -61390 -31319 -20788 -30186 124428 123071 33087
22262C3087r3536k3029P159L9567K1493o3921J8488P4080n1075k1559R971K7356
$$ 33087 -60449 -83478 -76319 -36752 -15259 -79180 -60692 13388 -37687 -59246 -49275 -21919
22250b1919R3616K1406P766m8665m5301N6294K1759j19665R4498M7553j05150
$$ -21919 71697 93103 100869 52204 6903 63197 84956 -34709 59789 107342 2192
22239B192J5540J9288l5452l0955J9318m2416Q8091Q6035m1606j77835p2141k9318
$$ 2192 17732 37020 1568 -29387 -10069 -52485 35606 121641 80035 -97800 -169941 -199259
22227a99259m9090j2821O5910J11675n7252o8832J1809P3656Q7205R4462J143
$$ -199259 -248349 -261170 -195260 -83585 -140837 -209669 -197860 -124204 -36999 57463 58606
22216E8606k2762j688K3152P224o5397L8011K1887j08k6967n3398O1214O1123
$$ 58606 35844 34156 57308 64532 -865 37146 59033 58925 31958 -21440 39774 100897
22204A00897P237j04854j06706N7692K294n4746j5202J3102Q3274M3486N4209
$$ 100897 108134 3280 -103426 -45734 -43440 -98186 -113388 -100286 -17012 26474 80683
22193H0683l8196M4196j5340k6889K5590q6734k8386O4830L5187p9918n7532K4465
$$ 80683 42487 86683 71343 44454 70044 -16690 -45076 19754 54941 -24977 -82509 -58044
22181e8044P9682R8088L3962p0999J9481k0528J7042J3285k2074k9447m8864n4943
$$ -58044 21638 119726 153688 82689 102170 81642 98684 111969 89895 60448 11584 -43359
22169d3359R4390N4019l0873n1852R480M441K6771j3938j14798l9232N2770O4948
$$ -43359 51031 105050 74177 22325 31805 36246 63017 49079 -65719 -104951 -52181 12767
22157A2767l7186j7388k4993o8647l4459R5062M6779L4383K8177R4904K4773k2356
$$ 12767 -24419 -41807 -66800 -135447 -169906 -74844 -28065 6318 34495 129399 154172 131816
22145A31816n0617j2537j36982j10401q309K9219L349L2052R2395K7122J6674
$$ 131816 81199 68662 -68320 -178721 -187030 -157811 -154462 -122410 -30015 -2893 13781
22134A3781M369k2077L6214M7239o9011J3513k3018K4551O0587M4969r3477n2540
$$ 13781 18150 -3927 32287 79526 10515 24028 1010 25561 86148 131117 37640 -14900
22122a4900N0122o0762m5187k9891r594J9062J198j8744J5688N6339O8468P5220
$$ -14900 35222 -25540 -70727 -100618 -110212 -91150 -89952 -108696 -93008 -36669 31799 107019
22110A07019o5242l1486J6987K196r1440l6048J13248O3743l9895o889l674k9155
$$ 107019 41777 10291 27278 29474 -61966 -98014 15234 78977 39082 32193 28519 -636
22098f36j0839r40N6621K8509P7015N0149J6917m9097m0332q0174Q353q978n2315
$$ -636 -11475 -12415 44206 72715 149730 199879 216796 167699 127367 47193 55546 46568 -5747
22085e747j3739j0132L2175l484Q9204L9971o499j8476L2753q776m9542l8893
$$ -5747 -19486 -29618 2557 -927 88277 128248 121749 103273 136026 127250 77708 38815
22073C8815n1676J1510j2451j02807K4366N8811M0700K4407k321K300l155N8789
$$ 38815 -12861 -1351 -13802 -116609 -92243 -33432 7268 31675 29354 31654 28499 87288
22061H7288J58075Q3405q1075r2177n6455j4982M108O1443m5333r8309o3575m642
$$ 87288 245363 328768 247693 155516 99061 84079 88187 149630 104297 5988 -57587 -62229
22049f2229l2184N6803R1254q2861N3054N7748J09521O1549o1643o5822n8356
$$ -62229 -94413 -37610 53644 -29217 23837 81585 191106 252655 191012 125190 66834
22038F6834L5741L7960l3957r1849m6276K1073K4115q006k2011M6968K2065q3788
$$ 66834 102575 140535 106578 14729 -31547 -10474 13641 5635 -16376 30592 52657 -31131
22026c1131l1388N8555O2749l5796k0482n4529K747L7919P3841k9883j8106m227
$$ -31131 -62519 -3964 58785 22989 2507 -52022 -49275 -11356 62485 32602 14496 10269
22014A0269o2472j0660K7383Q5900J1122l0759l0134l881m3716j14687M6256M2408
$$ 10269 -52203 -62863 -35480 50420 61542 30783 649 -3232 -46948 -161635 -115379 -72971
22002g2971K4575j17707j3226J26564N6311l4602k5089J8352Q2410k1940J7772
$$ -72971 -48396 -166103 -179329 -52765 3546 -31056 -56145 -37793 44617 22677 40449
21991D0449R165R2197Q2140n6960r5776j683Q7974O6177k3174j70055n4481l4004
$$ 40449 49614 141811 223951 166991 71215 69532 157506 223683 200509 30454 -24027 -58031
21979e8031J8372J300J3047M7907M9896p8968M285P9709j6279j51933m5684Q2431
$$ -58031 -39659 -38359 -25312 22595 72491 -6477 -2192 77517 61238 -90695 -136379 -53948
21967e3948M8331Q955l0620j2440R542L1281k709l7856k4684p227j4597J7563
$$ -53948 -5617 3338 -27282 -39722 -30180 1101 -1608 -39464 -64148 -71375 -85972 -68409
21955f8409N3779J24503M9050n047k4114n3673q5J43385k3340p7718N0269l4421
$$ -68409 -14630 109873 158923 153876 129762 76089 76004 219389 196049 118331 168600 134179
21943A34179k9383o5439p5417O2027J4903M265N888N0371J6855r4253q7378j09698
$$ 134179 104796 39357 -36060 25967 40870 45135 51023 101394 118249 23996 -63382 -173080
21931a73080o691J4801K2887J1146j8606J6200O5882m7700L8615J23946n218k2420
$$ -173080 -179771 -164970 -142083 -130937 -149543 -133343 -67461 -115161 -76546 47400 42182 19762
21919A9762j2673J4191P6522m977l7813n584l7214L7470P153l3428j9379k0729
$$ 19762 7089 21280 97802 92825 55012 49428 12214 49684 56837 23409 4030 -16699
21907a6699M7258K75m6609O9922L5396j7273j8272O8340P9746m0950L9770L4805
$$ -16699 30559 30834 -15775 54147 89543 72270 53998 122338 202084 161134 200904 235709
21895B35709q7527j1122l4393p7317j64757M5202J79944R493q4572j7514l6735
$$ 235709 148182 137060 102667 25350 -139407 -94205 85739 95232 10660 -6854 -43589
21884d3589J1804K6033O1076Q0783j01051P662R994O9794k7954p9682k9549L8777
$$ -43589 -31785 -5752 55324 136107 35056 42718 52712 122506 94552 14870 -14679 24098
21872B4098m8266J1079M9939m2132p6570J2247J0530m9726J7522K0548O224K5812
$$ 24098 -24168 -13089 36850 -5282 -81852 -69605 -59075 -108801 -91279 -70731 -64507 -38695
21860c8695P2474M2922n4097K1443K3943J4797m3342n5139q347n490K3374j1070
$$ -38695 33779 76701 22604 44047 67990 82787 39445 -15694 -24041 -29531 -6157 -17227
21848a7227j8770P2062L3725l6704K4355O478j6180J6152p5939o1230l891O313
$$ -17227 -35997 36065 69790 33086 57441 63919 47739 63891 -12048 -73278 -77169 -70856
21836g0856l7525m4854L9273j6468l0091M4771Q2446J5778p9377M756k5807j9410
$$ -70856 -108381 -153235 -113962 -130430 -160521 -115750 -33304 -17526 -96903 -92147 -117954 -137364
21824a37364O0019J4967N1471k7314l0477N6903J21571M1470n3958j38166j69036
$$ -137364 -77345 -62378 -10907 -38221 -68698 -11795 109776 151246 97288 -40878 -209914
21813b09914n4652M9841M4332Q8914J00683K2720J2088J6584o835k0644J5719
$$ -209914 -264566 -214725 -170393 -81479 19204 41924 54012 70596 63761 43117 58836
21802E8836q567o6863J05750P3389q8680o1316j6811N5994m400R4628r296o4307
$$ 58836 50269 -16594 89156 162545 73865 12549 -4262 51732 47332 141960 132664 68357
21790F8357l3931l2170j14043J2345N6397q958j1843N2754J04754J5671l978m3446
$$ 68357 34426 2256 -111787 -99442 -43045 -52003 -63846 -11092 93662 109333 105355 61909
21778F1909j34109m1281O8497k1724j041J12960N0651q825l4447m5391N7510K1219
$$ 61909 -72200 -113481 -44984 -66708 -67749 45211 95862 87037 52590 7199 64709 85928
21766H5928j1525J564j3855l0378L9186O6542l215n9088m1846k7379n4526l5340
$$ 85928 74403 75967 62112 31734 70920 137462 134247 75159 33313 5934 -48592 -83932
21754h3932k2030M7087m18L4549J21019J04428m8218j3524P7893n1568l3244l3953
$$ -83932 -105962 -58875 -59293 -24744 96275 200703 152485 138961 216854 165286 132042 98089
21742I8089Q9302p072n7973o3128j2917P6668m272m7060l9667J3529p8650l5605
$$ 98089 187391 180319 122346 59218 46301 122969 118697 71637 31970 45499 -33151 -68756
21730f8756J35682L1216j41436m3469L5625R209p216P6676J7228k4678k591l8124
$$ -68756 66926 98142 -43294 -86763 -51138 -41929 -49145 27531 44759 20081 17490 -20634
21718b0634j0493J5862o6100N9425K0714j0119P7945M8973j06408n3497o048N8240
$$ -20634 -31127 -15265 -81365 -21940 -1226 -11345 66600 115573 9165 -44332 -50380 7860
21706G860P8686l5402q9117k8254L0981J0804N9808r962r6786J9003j638N8153
$$ 7860 86546 51144 -37973 -66227 -35246 -24442 35366 25404 -71382 -52379 -54017 4136
21694D136Q7648n8379k3525k0986K7389k862j1115j18831J3692P3811N6901r8721
$$ 4136 91784 33405 9880 -11106 16283 13421 2306 -116525 -102833 -29022 27879 -70842
21682g0842L1063j100J6075J04108L0910r3929J6730O1379K1068j01634n0014
$$ -70842 -39779 -40879 -24804 79304 110214 16285 33015 94394 115462 13828 -36186
21671c6186P6635K6819o6860R148j9765m4673O1326o47Q039K2185L3054l2815
$$ -36186 40449 67268 408 9556 -10209 -54882 6444 5797 13836 36021 69075 36260
21659C6260l49j23741m2282p410N8540M4576l3136r458O1417O9010L1475j6718
$$ 36260 35911 -87830 -130112 -137522 -78982 -34406 -67542 -77000 -15583 53427 84902 68184
21647F8184j10611j10321L4748K9654K1983L4178j3310M1375o2052J4081K9813
$$ 68184 -42427 -152748 -118000 -88346 -66363 -32185 -45495 -4120 -66172 -52091 -22278
21636b2278R512M1436M745L6517O1966L3041j4549q0020q94k8785K3473Q34n3700
$$ -22278 -12766 28670 33415 69932 131898 164939 150390 70370 69476 40691 64164 64998 11298
21623A1298m9109R936K384K6040o3866j0883K6859K9952K7885o2539K0379L5901
$$ 11298 -37811 -27875 -25491 549 -63317 -74200 -47341 -17389 10496 -52043 -31664 4237
21611D237R2530P971n5417m8629k7759k8493M2374M6416L0021J0016J4418j9634
$$ 4237 96767 104738 49321 692 -27067 -55560 -13186 33230 63251 73267 87685 68051
21599F8051L1766l6154k729j8576o3004j3827l3695n4111k7573J26814M5330O7722
$$ 68051 99817 63663 60934 42358 -20646 -34473 -68168 -122279 -149852 -23038 22292 90014
21587I0014q752P5814Q519r3284q9107K0129J9249k1747j7210k3471N2462L200
$$ 90014 81262 157076 165595 72311 -16796 3333 22582 835 -16375 -39846 12616 15816
21575A5816m0500j2676M5102k4127o9999J858O0612P3593m2879L294o032k3917
$$ 15816 -24684 -37360 7742 -16385 -86384 -84526 -23914 49679 6800 10094 4062 -19855
21563a9855O9138K2305k6293l6518K4321K8080j1001o3998P515l2025p766O2470
$$ -19855 49283 71588 45295 8777 33098 61178 50177 -13821 -6306 -38331 -46097 16373
21551A6373M1941q3519l5680R239K8621O4177J04868J1551j29367o1570p2255
$$ 16373 58314 -25205 -60885 -51646 -23025 41152 146020 157571 28204 -33366 -105621
21540a05621m9411N5905O8465K8150l8665L0247j3020L7716L4423l3726p3397
$$ -105621 -155032 -99127 -30662 -2512 -41177 -10930 -23950 13766 48189 14463 -58934
21529e8934J6159m0342p6425q119J5737L1835L796j4560K6511O1500J8097R3337
$$ -58934 -42775 -83117 -159542 -167661 -151924 -120089 -116293 -130853 -104342 -42842 -24745 68592
21517F8592J8912o0164m0763k3379m4144K8975P7477L474j19445N937O9138O0164
$$ 68592 87504 27340 -13423 -36802 -80946 -51971 25506 28980 -90465 -84528 -15390 44774
21505D4774J3995n0908J4656j2250j02113l1268n2288o8856M8974O7131O5035
$$ 44774 58769 7861 22517 10267 -91846 -123114 -175402 -244258 -195284 -128153 -63118
21494f3118N2778M5288p7565p6861K4156K1730N7316L3013O749o1229K4250L716
$$ -63118 -10340 34948 -42617 -119478 -95322 -73592 -16276 16737 23486 -37743 -13493 -9777
21482i777K5195K6615l8398o9115L7835J22413J4925r4302n9441R710N8225O3136
$$ -9777 15418 42033 3635 -65480 -27645 94768 109693 15391 -44050 -34340 23885 87021
21470H7021J189J4915O4106m5848n7538j9115K8745N7466m6128M1387R859j39254
$$ 87021 88210 103125 167231 121383 63845 44730 73475 130941 84813 126200 136059 -3195
21458c195n818m4309j3387O485K9946L1661J9374k6597K3436J5586m9079r121
$$ -3195 -9013 -53322 -66709 -60224 -30278 1383 20757 -5840 17596 33182 -15897 -25018
21446b5018J5196m0645m3602J29361j096o2518j20031o6347Q4766L0042k3652
$$ -25018 -9822 -50467 -94069 35292 34196 -28322 -148353 -214700 -129934 -99892 -123544
21435a23544P0166j6097o1829J7115P675N9579J5476N3908L7144M0823l7181r6124
$$ -123544 -53378 -69475 -131304 -114189 -106514 -46935 -31459 22449 59593 100416 63235 -32889
21423c2889Q7915Q9910J5679k651m1441p1641l742O400l5695n4197p5972L9850
$$ -32889 55026 144936 160615 157964 116523 44882 41140 47540 11845 -42352 -118324 -78474
21411g8474P9908o917m263l3985R650O5160m84K5397j9843L1580k0375l5589l7433
$$ -78474 1434 -5483 -9746 -43731 -34081 31079 30595 55992 36149 67729 47354 11765 -25668
21398b5668J1652K6590l1593J1414J34748k4766p0675l2744K8738K9156o9195
$$ -25668 -14016 12574 -19019 -7605 127143 102377 31702 -1042 27696 56852 -12343
21387a2343n6126J9721l1882K6937q454l1201o2772k1052M0922J06928R2243n184
$$ -12343 -68469 -48748 -80630 -53693 -62147 -93348 -156120 -177172 -136250 -29322 62921 57737
21375E7737J6486K3741m1304j02615p7105J5108P0977J622k7996M012j022P4559
$$ 57737 74223 97964 56660 -45955 -123060 -107952 -36975 -35353 -63349 -59337 -60359 14200
21363A4200O4153L35j3506j4949j6768R621m2461K662n2085O5904m3988o1076
$$ 14200 78353 78688 65182 50233 33465 43086 625 3287 -48798 17106 -26882 -87958
21351h7958M0591J1825J236l315J8324J4105k0479P653J5132k7361l5786O488
$$ -87958 -47367 -35542 -34306 -37621 -19297 -5192 -25671 -18018 -2886 -30247 -66033 -59545
21339e9545M1047N4085J8432k4755l1518r2206O5047Q4416k5845k1538M4310n423
$$ -59545 -18498 35587 54019 29264 -2254 -94460 -29413 55003 29158 7620 51930 46507
21327D6507m072j3480k8366r8156j1555R6106N9932N5181m1032n5139p1022J6392
$$ 46507 42435 28955 589 -97567 -109122 -13016 46916 102097 61065 5926 -65096 -48704
21315d8704J8582L8590J0788o0545n8408M17O1200o1386n5469L3495l2443k8930
$$ -48704 -30122 8468 19256 -41289 -99697 -99280 -38080 -99466 -154935 -121440 -153883 -182813
21303a82813K0318q0666K5266Q9784J15416R5618o3449n3870m5m6092M7356p0400
$$ -182813 -162495 -243161 -217895 -128111 -12695 82923 19474 -34396 -34441 -80533 -33177 -103577
21291a03577q3446K9310K224K3756P0580j070J087J08064P7897k6735m5744K810
$$ -103577 -187023 -157713 -155489 -131733 -61153 -62223 -61136 46928 124825 98090 52346 55156
21279E5156N5911n5116K6308K5782n8047R419N166J3542q018n5551r120K5579
$$ 55156 111067 55951 82259 108041 49994 59413 64579 78121 70103 14552 5432 31011
21267C1011K4354N2258Q786j9256o4431r5248M6278J26588R5493l0940j48070
$$ 31011 55365 107623 116409 97153 32722 -62526 -16248 110340 205833 174893 26823
21256B6823j49420m019L5717P728n397Q1129M6346O3847j30240o9072R4424J18466
$$ 26823 -122597 -126616 -90899 -83171 -88568 -7439 38907 102754 -27486 -96558 -2134 116332
21244A16332n5372l2605L6670j2662j9905L2447k2809K1529K6393q5245J4927
$$ 116332 60960 28355 65025 52363 32458 64905 42096 63625 90018 4773 19700
21233A9700j8063L6094Q6721J18820K3816k7456q7369m8410M5726n8132J9090
$$ 19700 1637 37731 124452 243272 267088 239632 152263 103853 149579 91447 110537
21222A10537m1384p4883N3910L0196J23n0717j3928K9549l991M1746J1512m2681
$$ 110537 69153 -5730 48180 78376 78499 27782 13854 43403 39412 81158 92670 49989
21210D9989m7282K0895p209m0652K616j4676J072o3278O8502M2982j1979K6121
$$ 49989 2707 23602 16393 -24259 -21643 -36319 -35247 -98525 -30023 12959 980 27101
21198B7101K1638J34347P7085l7173o1699k3801N8414m468l6779N305m8986j46667
$$ 27101 48739 183086 260171 222998 161299 137498 195912 191444 154665 159970 110984 -35683
21186c5683j6317M9847o0207k7544N8330j9727K8572L8792P1464J7372P848j9702
$$ -35683 -52000 -2153 -62360 -89904 -31574 -51301 -22729 16063 87527 104899 112747 93045
21174I3045r3581k7378J8900J36843N0326l9522p1358j38005j18224N4879J10765
$$ 93045 -536 -27914 -9014 127829 178155 138633 67275 -70730 -188954 -134075 -23310
21163b3310N2051l4167m8291m5408J04667M4028M01J9642n6045n948j9065o7236
$$ -23310 28741 -5426 -53717 -99125 5542 49570 49971 69613 13568 7620 -11445 -78681
21151g8681j1935J9718J730L142l6668L9002M8692l6353M761J00489J01405k3864
$$ -78681 -90616 -70898 -69168 -66026 -102694 -63692 -15000 -51353 -46592 53897 155302 131438
21139A31438m2734j00378M3943J150p5942o4950K659L6700N2673K3721L2243k0204
$$ 131438 88704 -11674 32269 33419 -42523 -107473 -104814 -68114 -15441 8280 40523 20319
21127B0319K6503p7474q084L4231N2789P5035n5114o7066j732M265m4303J0195
$$ 20319 46822 -30652 -38736 -4505 48284 123319 68205 1139 -593 3672 -40631 -30436
21115c0436l9842q383j14595k7268K9549J09253J15318M1518O8418L4360j08435
$$ -30436 -70278 -78661 -193256 -220524 -190975 -81722 33596 75114 143532 177892 69457
21104F9457j31169L913Q2212K270k4008n949J7233l2541N7723J4833n78Q089k659
$$ 69457 -61712 -57799 24413 26683 2675 -3274 13959 -18582 39141 53974 53396 61485 58826
21091E8826o460j4701k2666K0697L3862m5136m080k1350J13172p6346L8013k8258
$$ 58826 52366 37665 14999 35696 69558 24422 20342 -1008 112164 35818 73831 45573
21079D5573J05048j0418q2249p4878p5906q6457N2526N9991L7007K8539m0231
$$ 45573 150621 140203 57954 -16924 -92830 -179287 -126761 -66770 -29763 -1224 -41455
21068d1455K7013M4161K4757O046j5719n428M524p4645l4706L4942O5395j6879
$$ -41455 -14442 29719 54476 60522 44803 39375 43899 -30746 -65452 -30510 34885 18006
21056A8006j08421l4819J8553N7825J00602n0018l882K7261n8993l8977L8030
$$ 18006 -90415 -125234 -106681 -48856 51746 1728 -2154 25107 -33886 -72863 -34833
21045c4833M157j8785j7230N3311l309R5491L3224n005N468o2555m8521l9325
$$ -34833 -30676 -49461 -66691 -13380 -16689 78802 112026 107021 112489 49934 1413 -37912
21033c7912k6081O7558J1249l8743m857j3173N9533J1080o7256j3982O0591K5095
$$ -37912 -63993 3565 14814 -23929 -28786 -41959 17574 28654 -38602 -52584 8007 33102
21021C3102o7971O8418k7605k2383o4551P5929k6910P3462J0898j8561l570O9694
$$ 33102 -34869 33549 5944 -16439 -80990 -5061 -31971 41491 52389 33828 30258 99952
21009I9952l791k4586K2828P890j40p285N5553N7729N1378K2159r039K9541q2439
$$ 99952 96161 71575 94403 102293 102153 94868 150421 208150 259528 281687 272648 302189 219750
20996B19750j41512k9258L6720L0103j30387m0294L6153P3701l399p0026q0168
$$ 219750 78238 48980 85700 115803 -14584 -54878 -18725 54976 51577 -18449 -98617
20985i8617j9897Q159J9449L7855Q3082l7435P6920j5201P6959N6403j17252n6162
$$ -98617 -118514 -110355 -90906 -53051 30031 -7404 69516 54315 131274 187677 70425 14263
20973A4263J2832L3296n3977Q115K3708l1081o043K2298M4698Q5001N1105k1856
$$ 14263 27095 60391 6414 14529 38237 7156 1113 23411 68109 153110 204215 182359
20961A82359o0819q946m3221l7771o5806J10046J08166L9513m5456j8845M2498
$$ 182359 121540 112594 69373 31602 -34204 75842 184008 223521 178065 159220 201718
20950B01718n6376n0114q2746K4160N1253k9222J6726r570n2709m9056P1949Q9297
$$ 201718 145342 95228 12482 36642 87895 58673 75399 65829 13120 -35936 36013 125310
20938A25310K8606r309k5192L803K8435L9693j26400j16447K6061P3292r1192
$$ 125310 153916 144607 119415 123218 151653 191346 64946 -51501 -25440 47852 -43340
20927d3340j3668K7202M8758O8273Q8109k7116J1644q820P8417k1866m0430k7433
$$ -43340 -57008 -29806 18952 87225 175334 148218 159862 151042 229459 207593 167163 139730
20915A39730m7923n7690P6503n45n9065L4693m8575o0304m9938R935P8046N3706
$$ 139730 91807 34117 110620 110075 51010 85703 37128 -23176 -73114 -63179 14867 68573
20903F8573l7320K2662L3948j841L2743l6970j06639p7543j5735K7339O0812R720
$$ 68573 31253 53915 87863 86022 118765 81795 -24844 -102387 -118122 -90783 -29971 -20251
20891b0251j9470N4606m3895j5723j3382k9833L4512K6679l6126k6616J23578
$$ -20251 -39721 14885 -29010 -44733 -58115 -87948 -53436 -26757 -62883 -89499 34079
20880C4079K6853n1880n474m1689k7402R1569R1730k391q5394L0484J4132n6487
$$ 34079 60932 9052 3578 -38111 -65513 26056 117786 115395 30001 60485 74617 18130
20868A8130l8877j0379Q8436j5428q0323o7983K5579Q2366J8381r460j8528j9111
$$ 18130 -20747 -31126 57310 41882 -38441 -106424 -80845 1521 19902 10442 -8086 -27197
20856b7197O5896O2523K5371k0231K3449k3423M662M4172k4649m7869j0496k7370
$$ -27197 38699 101222 126593 106362 129811 106388 111050 155222 130573 82704 72208 44838
20844D4838j6173j5620j7620m6408p7207K4149J04485J22383p4849p1866M1982
$$ 44838 28665 13045 -4575 -50983 -128190 -104041 444 122827 47978 -23888 18094
20833A8094o083O6802J0040o2994O5930J3731q6714o6222j5682Q5786K1810Q5663
$$ 18094 12011 78813 88853 25859 91789 105520 18806 -47416 -63098 22688 44498 130161
20821A30161N9458k4587m8512j21329n7584K6734K993K4795Q4909K1352n0864
$$ 130161 189619 165032 116520 -4809 -62393 -35659 -32666 -7871 77038 98390 47526
20810D7526m3420J7181N8207l3708r7729R020K3397k8573k4689L2199P9029M1935
$$ 47526 4106 21287 79494 45786 -51943 -42923 -19526 -48099 -72788 -40589 38440 80375
20798H0375m5846k6208m7238m9727m1712M8965P6866L5677m9270q6345L9307P2381
$$ 80375 34529 8321 -38917 -88644 -130356 -81391 -4525 31152 -18118 -104463 -65156 7225
20786G225N5197m1163k9694O633P1154k1089o0847n4397J3519P8491r048n2668
$$ 7225 62422 21259 -8435 -1802 69352 48263 -12584 -66981 -53462 25029 15981 -36687
20774c6687k7706M6410P8499J4974J6464K2162o9504m5694l8506M6570Q1037o5743
$$ -36687 -64393 -17983 60516 75490 91954 114116 44612 -1082 -39588 6982 88019 22276
20762B2276J0451k148L1511J1620j1448j8195J1550q305p1077k2793j3391J4045
$$ 22276 32727 30579 62090 73710 62262 44067 55617 47312 -23765 -46558 -59949 -45904
20750d5904N3521M4678r0022k3114o6682j2322P9319J10539N512l0162K1899k838
$$ -45904 7617 52295 -37727 -60841 -127523 -139845 -60526 50013 55525 25363 47262 44424
20738D4424j0343n5011K5245K5119N038j2003m9928l3234j12277P4402J9216K1846
$$ 44424 34081 -20930 4315 29434 34472 22469 -27459 -60693 -172970 -98568 -79352 -57506
20726e7506M0529n3341R9006q223n8651q8232M4219M4752m2079M0399M7677j9498
$$ -57506 -16977 -70318 28688 20465 -38186 -126418 -82199 -37447 -79526 -39127 8550 -10948
20714a0948r1569L3145Q8792M205K4745O5066n0490o7728M5462j8161j4408l1980
$$ -10948 -102517 -69372 19420 23625 48370 113436 62946 -4782 40680 22519 8111 -23869
20702b3869L7510k5666q2268N8417K8005Q9922K2834M572j07686o6411j8371J9212
$$ -23869 13641 -12025 -94293 -35876 -7871 82051 104885 109457 1771 -64640 -83011 -63799
20690f3799P911n484m7480J5665R3263k7043l9300J08176l3181m202l8662j1039
$$ -63799 -55888 -61372 -108852 -93187 76 -26967 -66267 41909 8728 4526 -34136 -45175
20678d5175j8980P1687l2480K4342o5137q4766M8575J21674L6198r0416r6555
$$ -45175 -64155 7532 -24948 -606 -65743 -150509 -101934 19740 55938 -34478 -131033
20667a31033L6199M1210N3445J9344l3657L0710L6962P971l0222Q7541J05370
$$ -131033 -94834 -53624 -179 19165 -14492 16218 53180 61151 30929 118470 223840
20656B23840J7987n8914q1851l0061l1015J1369Q7808P5795l7139q0294l8610
$$ 223840 241827 182913 101062 71001 39986 51355 139163 214958 177819 97525 58915
20645E8915K5999l0534J1534M4530l5965m5338J7071J07186K0721j4000O9630
$$ 58915 84914 54380 65914 110444 74479 29141 46212 153398 174119 160119 229749
20634B29749p6480j48069k8913J9574M7618j3126M61R697j0737k5816O1540L7265
$$ 229749 153269 5200 -23713 -4139 43479 30353 30814 40511 29774 3958 65498 102763
20622A02763p8394q8820K380J2304L6981L1630M5930R111j8790o9066j3367n470
$$ 102763 24369 -64451 -62071 -49767 -12786 18844 64774 73885 55095 -13971 -27338 -32808
20610c2808L6409R6157k1033l3477j9051o6433N1831N4724j4734l1361k8002N0619
$$ -32808 3601 99758 78725 45248 26197 -40236 11595 66319 51585 20224 -7778 42841
20598D2841p149Q2900J0472n1362J4788M3705l8319q2381r1800R175P6421o6022
$$ 42841 35692 118592 129064 77702 92490 136195 97876 15495 -76305 -67130 9291 -56731
20586e6731R38Q9814J7486l0826M2156N6897K6995p0825j50970N5294M520j8618
$$ -56731 -55793 34021 51507 20681 62837 119734 146729 75904 -75066 -19772 -15252 -33870
20574c3870p687M4280N1433l4789k1185L1769k1299j4246m2861N5209O3268k2150
$$ -33870 -41557 2723 54156 19367 -1818 29951 8652 -5594 -48455 6754 70022 47872
20562D7872l1935J8154o1358q730J4103K0088O360J00542j06703q3889R0431k7425
$$ 47872 15937 34091 -27267 -35997 -21894 -1806 4554 105096 -1607 -85496 4935 -22490
20550b2490j0222m7625l748R1668N2262k2114r439o7071k8270M6512j1790j0461
$$ -22490 -32712 -80337 -84085 7583 59845 37731 28292 -38779 -67049 -20537 -32327 -42788
20538d2788k0045n8236K4102N2272N2792Q9792P0706n1944o6250J139k4668j365
$$ -42788 -62833 -121069 -96967 -44695 8097 97889 168595 116651 50401 51540 26872 25507
20526B5507p0288M5540j0879M8302N3313M6307q1488q1777p4598Q7197R7118o5880
$$ 25507 -44781 759 -10120 38182 91495 137802 56314 -25463 -100061 -12864 84254 18374
20514A8374J6836k2080O7364P731m8850l0649p4080k2811n0608L4976J19800K1124
$$ 18374 35210 13130 80494 88225 39375 8726 -65354 -88165 -138773 -103797 16003 37127
20502C7127Q0295P14Q5j06085j38733N4785P3487n0444K5465K2626n704O3243
$$ 37127 117422 118136 118221 12136 -126597 -71812 1675 -48769 -23304 -678 -6382 56861
20490E6861P3294k867l3624K0533j3443k1648j03652n0379K5418M7324p724l0502
$$ 56861 130155 127288 93664 114197 100754 79106 -24546 -74925 -49507 -2183 -9907 -40409
20478d0409o1319M3244N6719n233o0282J5867m2980m0010l0160N802K358J17232
$$ -40409 -101728 -58484 -1765 -6998 -67280 -51413 -94393 -134403 -164563 -158761 -156403 -39171
20466c9171J02092R584M268k433m7104j3108l0192p485Q4918J02156k1519p4992
$$ -39171 62921 72505 76773 74340 27236 14128 -16064 -23549 61369 163525 142006 67014
20454F7014J0456K1759n032m2206l7646k1101j9223k1237q8356J4998J10049J5202
$$ 67014 77470 99229 94197 51991 14345 -6756 -25979 -47216 -135572 -120574 -10525 4677
20442D677m7090j2408j15549k8360J63458J05772q7118J336m4217J547R4732j3065
$$ 4677 -42413 -54821 -170370 -198730 -35272 70500 -16618 -15282 -59499 -57952 36780 23715
20430B3715k2351J0700o8498K4945J1502k1936L3828L2969O4310l7566j10326
$$ 23715 1364 12064 -56434 -31489 -19987 -41923 -8095 24874 89184 51618 -58708
20419e8708K8974K8058L5241M0714n5613O1666k2507n942p2989k4231K1112j7927
$$ -58708 -29734 -1676 33565 74279 18666 80332 57825 51883 -21106 -45337 -24225 -42152
20407d2152r2849N1099O8471O3649N3167J6049R8933l8957o8726q1644o2166j04870
$$ -42152 -135001 -83902 -15431 48218 101385 117434 216367 177410 108684 27040 -35126 -139996
20395a39996M3438N7980l5559j4831M9211M738M1206M1863J5303L1310L6464p7254
$$ -139996 -96558 -38578 -74137 -88968 -39757 -35019 6187 48050 63353 94663 131127 53873
20383E3873j12221m2674L40J6153O1138J1051O6024M2614k1219m5940m2816J458
$$ 53873 -58348 -101022 -100682 -84529 -23391 -12340 53684 96298 75079 29139 -13677 -12219
20371a2219M6083r071j1307P613L4461O0476k4509m2892k7527L4580O4545n9180
$$ -12219 33864 24793 13486 21099 55560 116036 91527 48635 21108 55688 120233 61053
20359F1053N662N3861m6776L7263N241M6016k4384l6456n6045M3604L7443M0822
$$ 61053 66715 120576 73800 111063 116304 162320 137936 101480 45435 89039 126482 167304
20347A67304k6464j4971P233L7343n5859r1723p098l142p0002J4318K0495K9559
$$ 167304 140840 125869 133102 170445 114586 22863 15765 12623 -57379 -43061 -22566 6993
20335F993J6315k2121j0923J4144R1694O5558m4429M654r531j22952k2436l402
$$ 6993 23308 1187 -9736 4408 96102 161660 117231 121885 112354 -10598 -33034 -36436
20323c6436O0433p39j6820j4407K9389L4409J1744J4515m3074q950J1021K4779
$$ -36436 23997 23258 6438 -7969 21420 55829 67573 82088 39014 30064 41085 65864
20311F5864K969n2706K9803K5539n834q6812j113j7692m4226M4672L9371J4582
$$ 65864 68833 16127 45930 71469 65635 -21177 -22290 -39982 -84208 -39536 -165 14417
20299A4417m6478j039J00948L4072m1295O7059k4928j7671Q108l3480l3912M5799
$$ 14417 -32061 -33100 67848 101920 60625 127684 102756 85085 93193 59713 25801 71600
20287G1600N1917l0686O0988Q7211m1963k7036k2295m0357O446P5061o2769j50863
$$ 71600 123517 92831 153819 241030 199067 172031 149736 109379 115825 190886 128117 -22746
20275b2746p6505j3648k9671n22q015M4406N8280J1220M7033p1627k8792N7080
$$ -22746 -99251 -112899 -142570 -143092 -151107 -106701 -48421 -37201 9832 -61795 -90587 -33507
20263c3507O1910l1731L5530J16266j0584m6850m6869L3081M309p8927L8491O005
$$ -33507 28403 -3328 32202 148468 137884 91034 44165 77246 81555 2628 41119 47124
20251D7124j6877q3125J478J6161K2162o25p4769N3979K5212k2847N200j3799
$$ 47124 30247 -52878 -51400 -35239 -13077 -13702 -88471 -34492 -9280 -32127 -26927 -40726
20239d0726O624j2463p456P6134M9958J7280m4070j11268L7075K0707j7464k2669
$$ -40726 -34102 -46565 -54021 22113 72071 89351 45281 -65987 -28912 -8205 -25669 -48338
20227d8338N3165M6296m0096k12m7623K1814l479m4622p402L3828J20569N3851
$$ -48338 4827 51123 11027 10815 -36808 -14994 -18473 -63095 -70497 -36669 83900 137751
20215A37751n1900j05319j21162j16907L8331M4538M2331J02675L7140l2625o196
$$ 137751 85851 -19468 -140630 -257537 -219206 -174668 -132337 -29662 7478 -25147 -31343
20204c1343N7120P7151m5234k9989L8124p0360j6490p3339N3204P2019K2180J5428
$$ -31343 25777 102928 57694 27705 65829 -4531 -21021 -94360 -41156 30863 53043 68471
20192F8471m5432m5499Q2728M7331J4443K2470j8589k100k5510n947j4071r3223
$$ 68471 23039 -22460 60268 107599 122042 144512 125923 123823 98313 92366 78295 -14928
20180a4928J4887N6376O4660K0478l8564n3875M3381k5576m292L9581L8702K3490
$$ -14928 -41 56335 120995 141473 102909 49034 92415 66839 62547 102128 140830 164320
20168A64320J6092m0784l7473N8145j6849j11793r6944q507P1691J4501P7590
$$ 164320 180412 139628 102155 160300 143451 31658 -65286 -73793 -2102 12399 89989
20157H9989P03n3814L5399J5695M231J0336r496j19048k8009k2657N8746K9775
$$ 89989 90692 36878 72277 87972 92203 102539 93043 -26005 -54014 -76671 -17925 11850
20145A1850k0104j2772J17006J9685l8418j3568l8555L7340R891m358l256k5223
$$ 11850 -8254 -21026 95980 115665 77247 63679 25124 62464 72355 67997 64741 39518
20133C9518j68l2222k5298N1495k2186k2768R0774k596j04192J6P8814N633J3774
$$ 39518 39350 7128 -18170 33325 11139 -11629 79145 76549 -27643 -27627 51187 56820 70594
20120G0594l1273l1163J1263N6945J7687L9159K6411q2127j68705r112J03659
$$ 70594 39321 8158 19421 76366 94053 133212 159623 77496 -91209 -100321 3338
20109C338M1130n2399K7517l5681j6504Q7703L5521q3275L2407O1483l6069L4584
$$ 3338 44468 -7931 19586 -16095 -32599 55104 90625 7350 39757 101240 65171 99755
20097I9755P0897J6568j5043l7497k9357j2586o435k9276P8338L6300J1238k3522
$$ 99755 170652 187220 172177 134680 105323 92737 86302 57026 135364 171664 182902 159380
20085A59380K420j09604Q669J06567o944p3206q3706M1739P3832k4234j15826
$$ 159380 161800 52196 60865 167432 160488 87282 3576 45315 119147 94913 -20913
20074b0913n6617N5864k6565O3153P1488m6466q483J24259R0384j30729q5511
$$ -20913 -77530 -21666 -48231 14922 86410 39944 31461 155720 246104 115375 29864
20063B9864k0566j9570l4027M9857Q5161J7289j11440m8742R0519N7380L1884
$$ 29864 9298 -10272 -44299 5558 90719 108008 -3432 -52174 38345 95725 127609
20052A27609m9646n6478O2211O0645K2984K7680m6028n6974k7772O3238L0150
$$ 127609 77963 21485 83696 144341 167325 195005 148977 92003 64231 127469 157619
20041A57619m4947q0701l4370O1319Q9778M412J4652j09968l3630k2221j2392
$$ 157619 112672 31971 -2399 58920 148698 153110 167762 57794 24164 1943 -10449
20030a0449J4305P9146O7018N082j26687k9660L975n6444Q2633Q9927L6579q187
$$ -10449 3856 83002 150020 155102 28415 -1245 2730 -53714 28919 118846 155425 147238
20018A47238j05642m5276j6628M0493J07788O0001K4166q0115r6760j3968J1943
$$ 147238 41596 -3680 -20308 20185 127973 187974 212140 132025 35265 21297 33240
20007C3240Q60o106J794N655J8070n2942M0757l0851m635R50k5467M7929j0753
$$ 33240 34100 27994 29788 35443 53513 571 41328 10477 5842 6792 -18675 29254 18501
19994A8501r485l3785k1833J22258L9994j6836m0501q0050m8805P7036J41649
$$ 18501 9016 -24769 -46602 75656 115650 98814 58313 -21737 -70542 6494 148143
19983A48143m139p542j4438k9820j0993j0489j557p7194J0441Q478K964m4297
$$ 148143 144004 136462 122024 92204 81211 70722 69165 -8029 2412 10890 13854 -30443
19971c0443J178M7340O5332L2649r297K3494o6655P8656L5148K3512j4914p1701
$$ -30443 -29265 18075 83407 116056 106759 130253 63598 142254 177402 200914 186000 114299
19959A14299p2655M4588J04125Q5686p5732j38243N052K6158N1643p1983j8617
$$ 114299 41644 86232 190357 276043 200311 62068 67120 93278 144921 72938 54321
19948E4321j8362O6504K5655l0630l7190k0669J01466m1571p816O1750K7829r3051
$$ 54321 35959 102463 128118 97488 60298 39629 141095 99524 91708 153458 181287 88236
19936H8236n7416K8805k1637r3116m706K3990o2253J9875Q1286K6019o0159j7828
$$ 88236 30820 59625 37988 -55128 -59834 -35844 -98097 -78222 3064 29083 -31076 -48904
19924d8904M6757R5968k5764K903O4483K7801m8762m3498J16942Q3908o1888j1179
$$ -48904 -2147 93821 68057 70960 135443 163244 114482 70984 187926 271834 209946 198767
19912A98767j367n6431j2774j04767j8922M5484J5140q869J8427O0393L7202j20606
$$ 198767 197400 140969 128195 23428 4506 49990 65130 56261 74688 135081 172283 51677
19900E1677J1781J1702J8078O8878N0659r475k9856k8338l6485o1119J5073k0430
$$ 51677 63458 75160 93238 162116 212775 203300 173444 145106 108621 47502 62575 42145
19888D2145j32383N7358N1915l7227M6695Q832O7506K4270J1592j09330n9484
$$ 42145 -90238 -32880 19035 -18192 28503 37335 104841 129111 140703 31373 -28111
19877b8111L4186k8573r234L46J0458k735m5220M7793O0410o048l5805m5570K0452
$$ -28111 6075 -22498 -31732 -31386 -20928 -23663 -68883 -21090 39320 33272 -2533 -48103 -27651
19864b7651Q9134O8580l7888q756l1450k092o3163M6463m2586n3901O3566J14311
$$ -27651 61483 130063 92175 83419 51969 49877 -13286 33177 -9409 -63310 256 114567
19852A14567L3736p0695o8249N0185L3392l2024J27L1849L6031O6972k6845J205
$$ 114567 148303 77608 9359 59544 92936 60912 61039 92888 128919 195891 169046 170251
19840A70251o0529n4994J9153m177N2775J9047o8087q8619N039J0908J2339L1973
$$ 170251 109722 54728 73881 69704 122479 141526 73439 -15180 -10141 767 13106 45079
19828D5079k4426j5770K4034K2696J118r895l5315m953J05004L7791l0196o995
$$ 45079 20653 4883 28917 51613 52731 42836 7521 2568 107572 145363 115167 108172
19816A08172n193l9612k0418K303j9822M8307p6968o2012K6090J4842j7316k705
$$ 108172 102979 63367 42949 45252 25430 73737 -3231 -65243 -39153 -24311 -41627 -44332
19804d4332L7563P4723j9068l470L3279l7108N42m728m5286N808l7098J3681J30818
$$ -44332 -6769 67954 48886 45416 78695 41587 42129 37401 -7885 -2077 -39175 -25494 105324
19791A05324N1326k0236m7565L1889k3900j8070n8286j4601j6761M0777m6517
$$ 105324 156650 136414 88849 120738 96838 78768 20482 5881 -10880 29897 -16620
19780a6620j17896J00821k6894p9019L6935M2141J30534Q9160l5083k8544j8165
$$ -16620 -134516 -33695 -60589 -139608 -102673 -60532 70002 159162 124079 95535 77370
19769G7370J338j2965K2783R634j7780j7742K5321O0485m1390k7446n2709o3359
$$ 77370 78708 65743 88526 98160 80380 62638 87959 148444 107054 79608 26899 -36460
19757c6460k5948J03077J37442j1964k1406k1678K5782m2630j09123p734L5795
$$ -36460 -62408 40669 178111 166147 144741 123063 148845 106215 -2908 -10642 25153
19746B5153m5165k4261M7734O2973K4973j00147m7204N8623L5749P9064N0734
$$ 25153 -20012 -44273 3461 66434 91407 -8740 -55944 2679 38428 117492 168226
19735A68226l2246k1413K091Q095Q5938J5543o9683p8683j668L6404M9937j5306
$$ 168226 135980 114567 116658 124753 210691 226234 156551 77868 76200 112604 162541 147235
19723A47235n5998o467k0898L6565k6348l9821L0659l3380O8757M0186q548m9196
$$ 147235 91237 84770 63872 100437 74089 34268 64927 31547 100304 140490 131942 82746
19711H2746l8309q760p2690l9745J24913N3603J0253O234J05443K3776q0882j36772
$$ 82746 44437 35677 -37013 -76758 48155 101758 112011 118245 223688 247464 166582 29810
19699B9810o5713Q647K070N420L0835O6830l5828N8892N3531J9170p1791L2947
$$ 29810 -35903 -27256 -25186 -19766 11069 77899 42071 100963 154494 173664 101873 134820
19687A34820J9102n7083m7124K2032k3007O7308L2724j9152P4828K9267o8407
$$ 134820 153922 96839 49715 71747 48740 116048 148772 129620 204448 233715 165308
19676A65308J3423l7417n6531k4837N39J7356N8228P2435p1560q7969l3371J6688
$$ 165308 178731 141314 84783 59946 60485 77841 136069 208504 136944 48975 15604 32292
19664C2292O2837J3014K663m9396O539l1672l1637o8184j6979M1618J02558L8029
$$ 32292 95129 108143 110806 61410 67949 36277 4640 -63544 -80523 -38905 63653 101682
19652A01682o6116k6082q520O4548L1026j7262N0255M3693m0392r0231j145P201
$$ 101682 35566 9484 964 65512 96538 79276 129531 173224 132832 42601 41456 48657
19640D8657N8480J0842p3230N390J24514p721o1312L7312R8229m1675p5403P1574
$$ 48657 107137 117979 44749 50139 174653 166932 105620 142932 241161 199486 124083 195657
19628A95657j3629j1541p198l2077k0147L441M0971m0055Q956j6669p9611K6348
$$ 195657 182028 170487 163289 131212 111065 114506 155477 115422 124378 107709 28098 54446
19616E4446K8929P9723R0903o7750j03868n1605j8023J63212L7834q6049n7501
$$ 54446 83375 163098 254001 186251 82383 30778 12755 175967 213801 127752 70251
19605G0251J9648Q428j7096j4276q438j6595J0934j4910K0263K1736k0541R4203
$$ 70251 89899 98327 81231 66955 58517 41922 52856 37946 58209 79945 59404 153607
19593A53607O2723L7860j4369j26373J3292m202M542j06046p696J09864K0536
$$ 153607 216330 254190 239821 113448 126740 122538 127080 21034 13338 123202 143738
19582A43738l3719l3492K0671r709k0405R8537j7469o1385k0760L1838n1633j5854
$$ 143738 110019 76527 97198 87489 67084 165621 148152 86767 66007 97845 46212 30358
19570C0358L4569N2361k1340J4733M9344k6035K2671M9773m9915r7331J0666o1110
$$ 30358 64927 117288 95948 110681 160025 133990 156661 206434 156519 59188 69854 8744
19558H744l6656K5854P9644n2705m874N2662N6889n8957n7810L4735n1023o5259
$$ 8744 -27912 -2058 77586 24881 20007 72669 129558 70601 12791 47526 -3497 -68756
19546f8756O1824P265J8854J27453N0392o9878o0405p1429J2177O6683n192j11279
$$ -68756 -6932 333 19187 146640 197032 127154 66749 -4680 7497 74180 68988 -42291
19534d2291j0627K0600J21485N6483p662j8025J6642j2333n1336k9979j8238L6310
$$ -42291 -52918 -32318 89167 145650 137988 119963 136605 124272 72936 42957 24719 61029
19522F1029J8804k523K951K1313L9885m6087J5660K2054k0409o8880R239L4355
$$ 61029 79833 77310 80261 101574 141459 95372 111032 133086 112677 43797 53036 87391
19510H7391j0089K402K8083l2940k2078j6917L2425J24527L3269r2400r103p09
$$ 87391 77302 79704 107787 74847 52769 35852 68277 192804 226073 133673 124570 123861
19498A23861o266J764k7372l4880K622K0904m640l8855m440J9186M6694Q9626
$$ 123861 117595 119359 91987 57107 59729 80633 75993 37138 32698 51884 98578 188204
19486A88204j3433l9569p984j6295j03752k8135J20922M0607r4815m4062M3028
$$ 188204 174771 135202 127218 110923 7171 -20964 99958 140565 45750 1688 44716
19475D4716J12803K3872l0500L4256l6670q0254p5142M4040N0934j5131k1404
$$ 44716 157519 181391 150891 185147 148477 68223 -6919 37121 88055 72924 51520
19464E1520Q5607M6676O0335o7042O464j1324m2493k586K3119l9238q7084r016
$$ 51520 137127 183803 244138 177096 183560 172236 129743 127157 150276 111038 23954 14938
19452A4938n851J07312M8741J0451M195n3288q20K9746l5150J0977j9639K8579
$$ 14938 9087 116399 165140 175591 179786 126498 125678 155424 120274 131251 111612 140191
19440A40191J02038j8615r2010q9768J2324L7088J2227l5641l8925k276N0662
$$ 140191 242229 223614 131604 41836 54160 91248 103475 67834 28909 26633 77295
19429G7295o0428r6284l701O6610Q6711r152R961N9653J5600L3267o040r6537
$$ 77295 16867 -79417 -83118 -16508 70203 61051 71012 130665 146265 179532 173492 76955
19417G6955M2685O4322q1476n3307M6626O5103J10389L7949K6299n2825K8491
$$ 76955 119640 183962 102486 49179 95805 160908 271297 309246 335545 282720 311211
19406C11211j5696j41586m9520Q819R2608M7622J423o4317o1901n4042O7905R8820
$$ 311211 295515 153929 104409 113228 205836 253458 254881 190564 128663 74621 142526 241346
19394B41346m1735j9224q0812o145J7610K8059L9226j4197p3724j08337k4843
$$ 241346 199611 180387 99575 93430 111040 139099 178325 164128 90404 -17933 -42776
19383d2776l8290L9767J7116O1296L5836k9610j01425p7689J6183M3828K2442
$$ -42776 -81066 -41299 -24183 37113 72949 43339 -58086 -135775 -119592 -75764 -53322
19372e3322J0222Q8819L263r856L313Q8829K0413n9600p712K3646k7872k4422
$$ -53322 -43100 45719 48982 39126 42439 131268 151681 92081 84369 108015 80143 55721
19360E5721K5219N0478N2494N6447o2218j09777j266k3703M4709O9369n3658Q322
$$ 55721 80940 131418 183912 240359 178141 68364 67098 43395 88104 157473 103815 112137
19348A12137N2510l2562o4254N4722K1201j03242N5427K3885q0475k086M7903
$$ 112137 164647 132085 67831 122553 143754 40512 95939 119824 39349 37263 85166
19337H5166Q3007o902l6421j05055K4993L4071m0133K1556j056p2828j6520Q2607
$$ 85166 168173 161271 124850 19795 44788 78859 38726 60282 59226 -13602 -30122 52485
19325E2485Q5427n2216N7511R545J1918L6986M7238N3160M23n6087r8000k6932
$$ 52485 137912 85696 143207 152752 164670 201656 248894 302054 302477 246390 148390 121458
19313A21458J03485N4067q3821n5408L776j6671n339M9939M1167k3113o5271J8786
$$ 121458 224943 279010 195189 139781 143557 126886 121547 171486 212653 189540 124269 143055
19301A43055l4946k916K5458K2903K8114r5186J2983K3175J03873Q6965o6602
$$ 143055 108109 105193 130651 153554 181668 86482 99465 122640 226513 313478 246876
19290B46876j01690l263M8742l433L9119j4648j6365m5219P998j9631L7041r810
$$ 246876 145186 141923 190665 187232 226351 211703 195338 150119 158117 138486 175527 165717
19278A65717O6822O2333O0723m7844q2652m8211q539j02600l1906M7104N8570
$$ 165717 232539 294872 355595 307751 225099 176888 168349 65749 33843 80947 139517
19267A39517R3830q760r210k1498l55m1590k8387M3413M7537q0667o1016K3666
$$ 139517 233347 224587 215377 193879 193524 151934 123547 166960 214497 133830 72814 96480
19255I6480Q6712M2153m2039K4582J1359R888P0651J01522m272r2005m8575K8297
$$ 96480 183192 225345 183306 207888 219247 229135 299786 401308 397036 305031 256456 284753
19243B84753l1353L8181k2547l3260Q6932Q6080K6075j07900j79450J3273L7235
$$ 284753 253400 291581 269034 235774 322706 408786 434861 326961 147511 160784 198019
19232A98019K4358O3660Q98l3624l6661J3468J5679m8804m5519R9232J67854M0349
$$ 198019 222377 286037 286935 253311 216650 230118 245797 196993 151474 250706 418560 458909
19220D58909J160m9398j0068l9274k1455J8096R4474P2646K5647N8142J00762
$$ 458909 460069 410671 400603 361329 339874 357970 452444 525090 550737 608879 709641
19209G09641O6626P6002R2601k4842p9406j82794q8759N5735M1680o976O7695
$$ 709641 776267 852269 944870 920028 840622 657828 569069 624804 666484 659508 727203
19198G27203J16360M8773J26851J47485J69990N3027p4488j28833r9091j18144
$$ 727203 843563 892336 1019187 1166672 1336662 1389689 1315201 1186368 1087277 969133
19188I69133q6774l693O7014M5998J24169M52k0462n5635j16724q7904j07835
$$ 969133 882359 878666 945680 991678 1115847 1116299 1095837 1040202 923478 835574 727739
19177G27739j10448j38798j54088j5980M6321Q4704N204p701M9665J14680n319
$$ 727739 617291 478493 324405 308425 354746 439450 444654 436953 486618 601298 595979
19166E95979L6428O0189q104j02229j00853j6147O608n0221p1481N5686J53616
$$ 595979 632407 692596 684492 582263 481410 465263 471871 421650 350169 405855 559471
19155E59471P0783M5859J51191J77667J35577N6015M4294J17924N8386M3895J7932
$$ 559471 630254 676113 827304 1004971 1140548 1196563 1240857 1358781 1417167 1461062 1478994
19144A478994j03935j43112j01734j37644J6260M8996J24536O8532q0791j20879
$$ 1478994 1375059 1231947 1130213 992569 1008829 1057825 1182361 1250893 1170102 1049223
19134A049223q0640o3234o3640R3193J36002J11386O8481j4748k03070j98166
$$ 1049223 968583 905349 841709 934902 1070904 1182290 1250771 1236023 1032953 834787
19124H34787j95785j47440j22710m9406j0639n394L636O159K3116M6329m2100
$$ 834787 639002 491562 368852 319446 308807 303413 307049 313208 336324 382653 340553
19113C40553q2516m4180K7976L4587Q8565R0248K9683N619n0830q7981j5763j4479
$$ 340553 258037 213857 241833 276420 364985 455233 484916 490535 439705 351724 335961 321482
19101C21482r1350k8575L0123Q930J5060j9914N8870Q8884K5549L6841o2438m7616
$$ 321482 230132 201557 231680 240610 255670 235756 294626 383510 409059 445900 383462 335846
19089C35846j1630m6172P5495M8718j0926m9622l0684q6231r4499L3668O5023
$$ 335846 324216 278044 353539 402257 391331 341709 311025 224794 130295 163963 228986
19078B28986K1779J9663p756j4216o1818L6059j9779L1384O5620L7298r778j6982
$$ 228986 250765 270428 262672 248456 186638 222697 202918 234302 299922 337220 327442 310460
19066C10460J3510N6029K6127K2041N027j3804M6801L6851K4397k9680j1120j05988
$$ 310460 323970 379999 406126 428167 433194 419390 466191 503042 527439 497759 486639 380651
19054C80651j13602O7613J08571N1746J5312k3911o1953j1781j2890l1525n3783
$$ 380651 267049 334662 443233 494979 510291 486380 424427 412646 399756 368231 314448
19043C14448j832K4758o6811q2088K6902P1737J17760Q9972j633l8054p2428l5465
$$ 314448 312616 337374 270563 188475 215377 287114 404874 494846 493213 455159 382731 347266
19031C47266K1309N0076L1119l6999m0200l3564J59477N9058m2227k3974l0204
$$ 347266 368575 418651 449770 412771 372571 339007 498484 557542 515315 491341 461137
19020D61137O631J20194q3593p19m354n288N340o7158N4459M9185N2945l9903
$$ 461137 467768 587962 504369 503650 499296 494008 499348 432190 486649 535834 588779 548876
19008E48876l8681R9360q3289l0958o3207p5044o9503l0861Q8852L381k3469M7295
$$ 548876 510195 609555 526266 495308 432101 357057 287554 256693 345545 348926 325457 372752
18996C72752Q6496k3694j32855j1743O8936J32165N651l222k0918M3829J6244
$$ 372752 459248 435554 302699 290956 359892 492057 497708 494486 473568 517397 533641
18985E33641p9241o9796j033J7506J24816M043k630l7749r143K9591j0852m1255
$$ 533641 454400 384604 383571 401077 525893 529936 527306 489557 480414 510005 499153 457898
18973D57898L2361j9004o0764k4342R893J09913P0365l3167o1946Q719m9061k9951
$$ 457898 490259 471255 410491 386149 396042 505955 576320 543153 481207 489926 440865 410914
18961D10914N8218j4959J7891K9935o8547k9891Q1663l039P7592L9544J3064q2866
$$ 410914 469132 454173 472064 501999 433452 403561 485224 482185 559777 599321 612385 529519
18949E29519q8744R3850J12158Q9888l0102n3026N3020q1486q8538r8849j06343
$$ 529519 440775 534625 646783 736671 706569 653543 706563 625077 536539 437690 331347
18938C31347N8354O0745M322K8122k6233j5503m701m4035q2695K1375M4293N6235
$$ 331347 389701 450446 454768 482890 456657 441154 436453 392418 309723 331098 375391 431626
18926D31626J254N1032M1004o206m387K8442j5078o8193L691K4034M6477P7933
$$ 431626 432880 483912 524916 518710 514323 542765 527687 459494 463185 487219 533696 611629
18914F11629J1515N4155j4483L649n4037o025J2611J05500n272J6026N6000l5258
$$ 611629 623144 677299 662816 666465 612428 606403 619014 724514 719242 735268 791268 756010
18902G56010r4201M729k1401L954L1778o893K5278j9605M8516O4630N7351N0095
$$ 756010 661809 666538 645137 649091 680869 673976 699254 679649 728165 792795 850146 900241
18890I00241r542J1907m6820K3200m413M9409m2641Q229k6871o6238k8537l4352
$$ 900241 890699 902606 855786 878986 874573 923982 881341 889570 862699 796461 767924 733572
18878G33572J09602M5542n8289j46774n9396K1406O2399j5301j6146k8224L9336
$$ 733572 843174 888716 830427 683653 624257 645663 708062 692761 676615 648391 687727
18867F87727o6369l4574M542L7729M2822Q607L1377n5235o3869N2792J34841P8187
$$ 687727 621358 586784 591326 629055 671877 680484 711861 656626 592757 645549 780390 858577
18855H58577Q1002R604M7895r083K4362K9641q8240l6353p0160q4842M948M1448
$$ 858577 939579 949183 997078 987995 1012357 1041998 953758 917405 847245 762403 767351 808799
18843H08799J7246p1168K5015L5814Q6298J0416k2816r784m9756k5432L9916J9267
$$ 808799 826045 754877 779892 815706 902004 912420 889604 879820 830064 804632 844548 863815
18831H63815k905N9957M1771L8981l0107N0553J50742L7513k4898j2461k6798
$$ 863815 860910 920867 962638 1001619 971512 1022065 1172807 1210320 1185422 1172961 1146163
18820A146163p0463k3404n2694m7029l9408O064l6102k8639N1835J38013N6586
$$ 1146163 1075700 1052296 999602 952573 913165 919229 883127 854488 906323 1044336 1100922
18809A100922o1206p8015l0662l8674k0287o0304o1983j4746J39802J25855K6994
$$ 1100922 1039716 961701 931039 892365 872078 811774 749791 735045 874847 1000702 1027696
18798A027696J7666k6546o9589j00265M7853Q0251J20460O9641n6218l1702m965
$$ 1027696 1045362 1018816 949227 848962 896815 977066 1097526 1167167 1110949 1079247 1074282
18787A074282N3028J58037J61256P2712J11467R1722J48080P1103J4565n1953
$$ 1074282 1127310 1285347 1446603 1519315 1630782 1722504 1870584 1941687 1956252 1904299
18777A904299q5615O6364J34625J54483L15757M13310M36691J89063P2894Q3076
$$ 1904299 1818684 1885048 2019673 2174156 2489913 2903223 3339914 3528977 3601871 3684947
18767C684947j5675r7956Q4520R0950j12722q5686j83283l27383l15318k38407
$$ 3684947 3669272 3571316 3655836 3746786 3634064 3548378 3365095 3037712 2722394 2483987
18757B483987j07367o9623K8174j4863R1679P8367k1140q6390j40571j2459K091
$$ 2483987 2376620 2306997 2335171 2320308 2411987 2490354 2469214 2382824 2242253 2229794 2231885
18746B231885M9284L8489M1201N4774J17783J95041J28925J43592L91180M47573
$$ 2231885 2281169 2319658 2360859 2415633 2533416 2728457 2857382 3000974 3392154 3839727
18736C839727J24415r1993o9934j37821j26883n2637M8074M6338J34153J76790
$$ 3839727 3964142 3872149 3802215 3664394 3537511 3484874 3532948 3579286 3713439 3890229
18726C890229J78764K63871N34309R14068Q90266O23389L98077J83358R1741l3126
$$ 3890229 4068993 4332864 4867173 5781241 6671507 7294896 7692973 7876331 7968072 7934946
18716G934946o760J78574M50545R21376J384063J691444K225963L425802M849625
$$ 7934946 7928186 8106760 8557305 9478681 10862744 12554188 14780151 18205953 23055578
18707B3055578P249632Q244451K304454k915064l915401m584593l365508j001203
$$ 23055578 30305210 38549661 40854115 37939051 34023650 29439057 26073549 25072346
18699B5072346Q97308K343133M294260P363191J2524488K0261870L1866549N3872154
$$ 25072346 25969654 28312787 32607047 39970238 52494726 72756596 104623145 158495299
18691A58495299Q4039224O4915646L642009j0953419j9799905n1856556n3716116
$$ 158495299 242534523 307450169 311092178 300138759 280338854 228482298 174766182
18684A74766182m1374582l3802825k2074005r834984q97471O965517J6170169
$$ 174766182 133391600 99588775 77514770 67679786 66782315 73747832 89918001
18677H9918001J9543905L925747j3525930j8043252j9484399j7002579j1013905
$$ 89918001 109461906 113387653 99861723 81818471 62334072 45331493 34317588
18670C4317588o593978m147420k641446j647333j015217p19617l33063j31625
$$ 34317588 27723610 23576190 20934744 19287411 18272194 17552577 17219514 17087889
18662A7087889K8358J82103J15443J67951J61773M85609J233494K012251L226546
$$ 17087889 17116247 17298350 17413793 17581744 17743517 18229126 19462620 21474871 24701417
18653B4701417N329007Q555352J3247594K0590746K7426578J7449758l883554
$$ 24701417 30030424 38585776 51833370 72424116 99850694 117300452 113416898
18646A13416898j3272770j5085167j3540400n863692L433013J3059394K5196886
$$ 113416898 100144128 85058961 71518561 65654869 69087882 82147276 107344162
18639A07344162M4725796O3225220N4915300M8722345O1271345N974060o4713472
$$ 107344162 152069958 215295178 270210478 318932823 380204168 386178228 321464756
18632C21464756p1627069o9818393o0911695l7563444k1277385j2535559p790841
$$ 321464756 249837687 180019294 119107599 81544155 60266770 47731211 39940370
18625C9940370m994130k864710r43094J263999M495543Q063548N235751l813814
$$ 39940370 34946240 32081530 31138436 32402435 36897978 44961526 50197277 46383463
18617D6383463p662205q147890q321722n901129l657752k235348j473618j141581
$$ 46383463 38721258 30573368 22251646 16350517 12692765 10457417 8983799 7842218
18609G842218q88926n90400j00808R4736M6864q0072k30916m31159p73065p64682
$$ 7842218 6953292 6362892 6262084 6356820 6403684 6323612 6092696 5661537 4888472 4123790
18599D123790o18913m86526l04758k47973j26668j28722j35507k17738k17130
$$ 4123790 3504877 3018351 2713593 2465620 2338952 2210230 2074723 1856985 1639855
18590A639855K1321p1402l4080L3744o279k0413l1413P312o3443j51140m2613
$$ 1639855 1661176 1589774 1555694 1589438 1583159 1562746 1531333 1538645 1475202 1324062 1281449
18579A281449P7940m4637M5072P9358J00948K5986l0386j09422j13044j76045
$$ 1281449 1359389 1314752 1359824 1439182 1540130 1566116 1535730 1426308 1313264 1137219
18569A137219k6882L6055m3717P3599J26435L7760l0432R349O9187j42444j50536
$$ 1137219 1110337 1146392 1102675 1176274 1302709 1340469 1310037 1319386 1388573 1246129 1095593
18558A095593r7929n7400p238K4050l5998K1516J13794J04734j4221l9467N38
$$ 1095593 997664 940264 933026 957076 921078 942594 1056388 1161122 1146901 1107434 1107972
18547A107972K6481l724j5399p9261m9028k7872Q97R0061J14494J13976J98827
$$ 1107972 1134453 1130729 1115330 1036069 987041 959169 960066 1050127 1164621 1278597 1477424
18536A477424K04377J13332L1937L7496l3513n0831n7356m9101J40902J59966
$$ 1477424 1681801 1795133 1827070 1864566 1831053 1780222 1722866 1673765 1814667 1974633
18526A974633K65820K74278J65624J63556M5474M7143O5736q7167k17801k15007
$$ 1974633 2240453 2514731 2680355 2843911 2889385 2936528 3002264 2915097 2697296 2482289
18516B482289l11521l94215k51801j99032o8727j4376l780j7133L7971L4977p7331
$$ 2482289 2170768 1776553 1524752 1325720 1256993 1242617 1238837 1221704 1259675 1294652 1217321
18505A217321p3309r6160j19664o9703j32693J2409Q3316Q9236Q3237L9974J86065
$$ 1217321 1144012 1047852 928188 858485 725792 738201 821517 910753 993990 1033964 1220029
18494A220029J17528o5284m5060L2022k4315p0255m1340L0406R8342K29456M02058
$$ 1220029 1337557 1272273 1227213 1259235 1234920 1164665 1123325 1153731 1252073 1481529 1883587
18483A883587M60001L73223R2323j85439k37036j32864j66574k15671j29832m3181
$$ 1883587 2343588 2716811 2809134 2623695 2386659 2253795 2087221 1871550 1741718 1698537
18473A698537O67O1164N9257J84378L54425M13494M61629K06354p3992j51377
$$ 1698537 1699204 1760368 1819625 2004003 2358428 2771922 3233551 3439905 3365913 3214536
18463C214536l37133l83643k77298k09981j83289k58363k43885j11242j71363
$$ 3214536 2877403 2493760 2216462 2006481 1823192 1564829 1320944 1209702 1038339
18454A038339j73805o09K2360P854l1711l7472o2542J2022j1943J4698L5825O4062
$$ 1038339 864534 863925 886285 894139 862428 824956 762414 774436 762493 777191 813016 877078
18442H77078L5927P6220K02817J02447R2933L3130j7996n6076j13457r650K1526
$$ 877078 913005 989225 1192042 1294489 1387422 1420552 1402556 1346480 1233023 1223373 1244899
18431A244899l5900N9608K2102R2993J25620J22549J70206J15516M6452m683l5754
$$ 1244899 1208999 1268607 1290709 1383702 1509322 1631871 1802077 1917593 1964045 1959362 1923608
18420A923608m2034l0436p1705n6599j40395j83414r3054o7211M6295J63670Q4548
$$ 1923608 1881574 1851138 1779433 1722834 1582439 1399025 1305971 1238760 1285055 1448725 1533273
18409A533273j10435r2177l8765j97765q8190L5231k0302j03621j4171M4064P8699
$$ 1533273 1422838 1330661 1291896 1094131 1005941 1041172 1020870 917249 903078 947142 1025841
18398A025841O2257J59K4040r224k1136o8618j52952l4446M2934m8723P9041O7598
$$ 1025841 1088098 1088257 1112297 1103073 1081937 1013319 860367 825921 868855 820132 899173 966771
18386I66771J37541J40585J72704J46199J11194J06481k1525J2297l5047m1182
$$ 966771 1104312 1244897 1417601 1563800 1674994 1781475 1759950 1772247 1737200 1696018
18376A696018m6150j18637k9813j00667p0817j6781L9970P0518N705N1323O9603
$$ 1696018 1649868 1531231 1501418 1400751 1329934 1313153 1353123 1423641 1429346 1480669 1550272
18365A550272N93K9395o9029q9167j02281M6046O5399J72607K11796J97577J9289
$$ 1550272 1550865 1580260 1511231 1422064 1319783 1365829 1431228 1603835 1815631 2013208 2032497
18354B032497k21618j83786j75951j67431l4120j8838K6511L1583l6878k3004
$$ 2032497 1810879 1627093 1451142 1283711 1249591 1230753 1257264 1288847 1251969 1228965
18344A228965k1211k3111k6563N5201K15985K18955R0922N3868K864J25929O2461
$$ 1228965 1207754 1184643 1158080 1213281 1429266 1648221 1739143 1793011 1795875 1921804 1984265
18333A984265L5171J17467J89409J28795O2324R9905J76421L68883M00602L40935
$$ 1984265 2019436 2136903 2326312 2455107 2517431 2617336 2793757 3162640 3563242 3904177
18323C904177L74411R5873k83695k92274k90184l28071l19722k62281k16433q3564
$$ 3904177 4278588 4374461 4090766 3798492 3508308 3180237 2860515 2598234 2381801 2298237
18313B298237j46273j62564q1625O161M1467R918n791J3726j38909k25099n1714
$$ 2298237 2151964 1989400 1907775 1913936 1955403 1965321 1959530 1973256 1834347 1609248 1557534
18302A557534N2112N9838M1563j24055j03434j8424o8247j06317j32060p1057
$$ 1557534 1609646 1669484 1711047 1586992 1483558 1465134 1396887 1290570 1158510 1087453
18292A087453K6421P9749N4199J68995K48426K49376J39031K16932K15375J87620
$$ 1087453 1113874 1193623 1247822 1416817 1665243 1914619 2053650 2270582 2485957 2673577
18282B673577K50238L09454K67480J16061o6716q061K08478J72883P2374J628
$$ 2673577 2923815 3233269 3500749 3616810 3550094 3542033 3750511 3923394 3995768 3997396
18272C997396P8972K17139O50987P46023k02430p13310n86231n71282m28073k05662
$$ 3997396 4076368 4293507 4944494 5690517 5488087 4774777 4188546 3617264 3189191 2983529
18262B983529l4688q8592j23433n7042J26464K32629K8648j26142j65788j27610
$$ 2983529 2948841 2860249 2736816 2679774 2806238 3038867 3067515 2941373 2775585 2647975
18252B647975k76666k09944j50021l8107r8515q2120j7177m3084m1569L0573J358
$$ 2647975 2371309 2161365 2011344 1973237 1874722 1792602 1775425 1732341 1690772 1721345 1722703
18241A722703j6015j0304q0383P9514J05320L1153L3503O436N3448m224L8886
$$ 1722703 1706688 1696384 1616001 1695515 1800835 1831988 1865491 1871927 1925375 1921151 1960037
18230A960037n4484K2669R7871P7179P1685J97842M01506M82523L98689L04452
$$ 1960037 1905553 1928222 2026093 2103272 2174957 2372799 2774305 3256828 3655517 3959969
18220C959969J09464q530J54691M15342L42188j70638k54412k29726m16618l72414
$$ 3959969 4069433 4060903 4215594 4630936 4973124 4802486 4548074 4318348 3901730 3529316
18210C529316k81548j34494K3446J15686J48138J75579K13223J57564J23671P8276
$$ 3529316 3247768 3113274 3136720 3252406 3400544 3576123 3789346 3946910 4070581 4148857
18200D148857J31318O047N4580J48790K51508M00147M55012M78650P95305J032148
$$ 4148857 4280175 4286222 4340802 4489592 4741100 5141247 5596259 6074909 6870214 7902362
18190G902362Q67685P92175J097651J653042K309732K787237L704428N805117
$$ 7902362 8770047 9562222 10659873 12312915 14622647 17409884 21114312 26919429
18182B6919429R228301J4550133K2390258L7666327P0588751P8044365P98788
$$ 26919429 36147730 50697863 73088121 110754448 181343199 259387564 260186352
18175B60186352m7857425m6687340n3990779m0647309k1982543j2166457p585090
$$ 260186352 212328927 165641587 111650808 71003499 49020956 36854499 29269409
18168B9269409m995081l424659k401253j808032j162834m75002j55172m04572
$$ 29269409 24274328 20849669 18448416 16640384 15477550 15002548 14847376 14442804
18160A4442804l43661P0021M11294N85435L87922M60997R88760J657192K326408
$$ 14442804 14099143 14169164 14580458 15165893 15553815 16014812 17003572 18660764 20987172
18151B0987172L046176M260958O580711J1341593J8765969K8828898M8845566
$$ 20987172 24033348 28294306 34875017 46216610 64982579 93811477 142657043
18144A42657043Q8755432Q5521459r799127n8411245n6524194o4189031m5657736
$$ 142657043 231412475 316933934 307134807 248723562 192199368 128010337 82352601
18137H2352601k5015562j4138557q946656o106727m070345k917811k492827j777080
$$ 82352601 57337039 43198482 34251826 28145099 24074754 21156943 18664116 16887036
18129A6887036q27541o80272j149316j136805r83975q43849p00566n27513j77043
$$ 16887036 16059495 15379223 14229907 13093102 12109127 11265278 10564712 10037199 9860156
18120I860156N8840N36258J170125J868776K877834M673661P628323J1725106
$$ 9860156 9918996 10455254 11625379 13494155 16371989 21045650 28673973 40399079
18112D0399079J8317208L4007823M8188394J2178255k5036499k6076521k9477170
$$ 40399079 58716287 92724110 140912504 153090759 128054260 101977739 72500569
18105G2500569k4875024j3320475p183426m687012l435546k644704j971975j602083
$$ 72500569 47625545 34305070 27121644 22434632 18999086 16354382 14382407 12780324
18097A2780324j621677j452793j158611p64666k79290j4929k11427l95246m84854
$$ 12780324 11158647 9705854 8547243 7782577 7503287 7488358 7276931 6881685 6396831
18088F396831m36189l82660k26544J20516J13082j5775p8663j68902k32989l09374
$$ 6396831 5960642 5577982 5351438 5471954 5585036 5569261 5490598 5321696 5088707 4779333
18078D779333m25331k75254r0910k7348j71511j52291k0226R7896L38447N79779
$$ 4779333 4354002 4078748 3987838 3960490 3788979 3636688 3616462 3714358 4052805 4632584
18068D632584L47985j81575k52529m21964m56895l13951k15460K1399K09821J17437
$$ 4632584 4980569 4798994 4546465 4124501 3667606 3353655 3138195 3159594 3369415 3486852
18058C486852K73792J13827j37616k40734k50570j41084L7423K31279J97431j24822
$$ 3486852 3760644 3874471 3736855 3496121 3245551 3104467 3141890 3373169 3570600 3445778
18048C445778j06278j10427k54836j54303k7291l6288J00134J37695J23400l6145
$$ 3445778 3339500 3229073 2974237 2819934 2792643 2756355 2856489 2994184 3117584 3081439
18038C081439p0248k2805O6945L5080n1598p0734n9686L1238M5446L8542J16885
$$ 3081439 3011191 2988386 3055331 3090411 3038813 2968079 2908393 2939631 2985077 3023619 3140504
18027C140504R3856j65671k45049k05996j63537k50899j03966J17440J01281R9833
$$ 3140504 3234360 3068689 2823640 2617644 2454107 2203208 2099242 2216682 2317963 2417796
18017B417796J22697N9353j36773j00241k6467Q7381J14723J6332K2604J17674
$$ 2417796 2540493 2599846 2463073 2362832 2336365 2423746 2538469 2554801 2577405 2695079
18007B695079J32103O6995J27989J11351J29714J58556J67272K01874J90436K11658
$$ 2695079 2827182 2894177 3022166 3133517 3263231 3421787 3589059 3790933 3981369 4193027
17997D193027L90969L77925L94161L89713L12936J74963K89257O84330R69627
$$ 4193027 4583996 4961921 5356082 5745795 6058731 6233694 6522951 7207281 8176908
17988H176908J297709J243552J312383J170696Q44827J260471K216127L623243
$$ 8176908 9474617 10718169 12030552 13201248 14046075 15306546 17522673 21145916
17980B1145916O046826R890574R779144J447033m263950m816403n204134l314196
$$ 21145916 27192742 37083316 46862460 48309493 44045543 39229140 34025006 30710810
17972C0710810k13187K131108M186570O441388J0247622J7125530K7257071M3934032
$$ 30710810 30497623 32628731 36815301 43256689 53504311 70629841 97886912 141820944
17964A41820944P5800284R9393632M8306713m761438j2516735m7188861o9147948
$$ 141820944 217621228 317014860 365321573 360560135 348043400 300854539 231706591
17957B31706591n5436911m3795674l1885838j7651459p309842J79467P817677
$$ 231706591 176269680 132474006 100588168 82936709 75626867 75806334 83624011
17950H3624011J6906407J7850246k41750j6071148j9376567k0360968j6723117
$$ 83624011 100530418 118380664 118138914 102067766 82691199 62330231 45607114
17943D5607114j0667891o473350m025418k399432j523491r62095o28552o77407
$$ 45607114 34939223 28465873 24440455 22041023 20517532 19555437 18926885 18249478
17935A8249478m21649j33918J56262J56522O6559M17150N77317P94011J612225
$$ 18249478 17827829 17693911 17850173 18006695 18073254 18490404 19067721 19861732 21473957
17926B1473957K948900N062939Q221990J2712869J9875787K4860762J2699574
$$ 21473957 24422857 29485796 37707786 50420655 70296442 95157204 107856778
17919A07856778n535069j1533810j2648152j0204027k296101O130722J4825074
$$ 107856778 102321709 90787899 78139747 67935720 65639619 71770341 86595415
17912H6595415K8118902M6545896M9341191L4472961M3855373M3231019k2249167
$$ 86595415 114714317 161260213 210601404 245074365 288929738 332160757 309911590
17905C09911590o0361274n6689968n7532493m3517825k5335317j4497839q529588
$$ 309911590 249550316 192860348 135327855 91810030 66474713 51976874 43447286
17898D3447286n683014m415230l021086j659813J00479K954725N690262K678256
$$ 43447286 37764272 33349042 30327956 28668143 28768622 31723347 37413609 40091865
17890D0091865l717877n799852o317603o007354l964760k245358j342952r31777
$$ 40091865 36373988 30574136 24256533 18249179 14284419 12039061 10696109 9764332
17882I764332o73641p53389q57221q01725q00957o90870n06813l99789l38159
$$ 9764332 9090691 8337302 7480081 6678356 5877399 5186529 4679716 4279927 3941768
17873C941768j18889K8430l8097J1685J56747M3445r3999J6576r6650l21387l21874
$$ 3941768 3822879 3851309 3813212 3824897 3981644 4025089 3931090 3947666 3851016 3529629 3207755
17862C207755j21697j37205q6233o1685o8353r5178r6675r6113m7633n9337n4689
$$ 3207755 3086058 2948853 2862620 2800935 2732582 2637404 2540729 2444616 2396983 2337646 2282957
17851B282957R3563R0224J08233Q7298K2151o8998J0726L3913O123o5742o4054
$$ 2282957 2376520 2466744 2574977 2662275 2684426 2615428 2626154 2660067 2666190 2600448 2536394
17840B536394n8439K6562O9667O1152J20170J14822J28751J97423L45006N54964
$$ 2536394 2477955 2504517 2574184 2635336 2755506 2870328 2999079 3196502 3541508 4096472
17830D096472O75330M94735N9300j18994j37862m5272K17259M85146M62724L42600
$$ 4096472 4771802 5266537 5325837 5206843 5068981 5023709 5240968 5726114 6188838 6531438
17820F531438K64987L57595N22589P28029R58267J381477K022643K876143L944031
$$ 6531438 6796425 7154020 7676609 8404638 9362905 10744382 12767025 15643168 19587199
17811A9587199N324517Q392871J4004581K2560593L6265553O5719829J02529565
$$ 19587199 24911716 33304587 47309168 69869761 106135314 171855143 274384708
17804B74384708M7767847m2079847n6709874o1627080n9665077l5200436j8600955
$$ 274384708 322152555 280072708 223362834 161735754 102070677 66870241 48269286
17797D8269286j0430331o035335m191724l765004l259707k876348k246298j494243
$$ 48269286 37838955 31803620 27611896 23846892 20587185 17710837 15464539 13970296
17789A3970296r15328m47757j83108J88853J66802J54393L23706N22300R30892
$$ 13970296 13054968 12607211 12424103 12612956 12779758 12934151 13257857 13780157 14711049
17780A4711049J730576K268763L180170M868018P296023J1909143J9408664L1510200
$$ 14711049 16441625 18710388 21890558 26758576 34054599 45963742 65372406 96882606
17772I6882606N8359635Q5883927K9419264m0944771m7801400n3430600m8446971
$$ 96882606 155242241 241126168 270545432 229600661 181799261 128368661 79921690
17765G9921690k7600712j4780341q533217n204377l734471l208733k732209k224750
$$ 79921690 52320978 37540637 29007420 23803043 20068572 16859839 14127630 11902880
17757A1902880j694146j224804p91620m25859l4520N3820j21524k58522l84128
$$ 11902880 10208734 8983930 8192310 7766451 7731931 7785751 7664227 7405705 7021577
17748G021577n47754l77134n2428k60525k72888N8092l6046m21760m71207n66316
$$ 7021577 6473823 6096689 6044261 5783736 5510848 5568940 5532894 5111134 4639927 4073611
17738D073611n18612m27869m08157l28953k95824p6588N1111Q894J17125K07053
$$ 4073611 3554999 3127130 2718973 2390020 2094196 2017608 2068719 2077613 2194738 2401791
17728B401791J46153L887Q1220M3224k10569l78512k25598k18861j65804r8325
$$ 2401791 2547944 2551831 2633051 2676275 2465706 2087194 1861596 1642735 1476931 1378606
17718A378606q2866j1404K0525q416p7315M5084Q918q3249j41473l2227n4716
$$ 1378606 1295740 1284336 1304861 1296445 1219130 1264214 1273132 1189883 1048410 1016183 961467
17707I61467n4011l6818o0045l617O315O1390J6771Q5954J79436J43612M7204
$$ 961467 907456 870638 810593 806976 813291 874681 891452 977406 1156842 1300454 1347658
17696A347658o5447r8694p1315p1420J6867j0508R9201K19701O1220o6891j12713
$$ 1347658 1282211 1183517 1112202 1040782 1057649 1047141 1146342 1366043 1427263 1360372 1247659
17685A247659j19898j56684o6126o0877o0120N7523O2969J19397R7799N0914n7914
$$ 1247659 1127761 971077 904951 844074 783954 841477 904446 1023843 1121642 1172556 1114642
17674A114642k2766N4210N0475j36413k03129j29728O751n5985m0390n4670n0291
$$ 1114642 1091876 1146086 1196561 1060148 857019 727291 734042 678057 637667 582997 532706
17663E32706q3676o0372k8106M2156p4984O71J02506N7360K2520r1282k4715O8108
$$ 532706 449030 388658 360552 402708 327724 328395 430901 488261 510781 419499 394784 462892
17651D62892O427k6678p8003r9320J408m4788M2626K7451o2515j2229K0419l2028
$$ 462892 469319 442641 364638 265318 266726 221938 264564 292015 229500 217271 237690 205662
17639B05662j1495J1395m4525P123j26j996k374j1646L6608K3099N6337l7495
$$ 205662 194167 205562 161037 168160 168034 166038 163664 152018 188626 211725 268062 230567
17627B30567L9623j21363m8248P0239M855p841M8745k6456j757p2256o5274P339
$$ 230567 270190 148827 100579 170818 175673 167832 216577 190121 188364 116108 50834 58173
17615E8173j07009k9005J6981M2413Q8953k5857j2635J8527R2566p143p5517j39536
$$ 58173 -48836 -77841 -60860 -18447 70506 44649 32014 50541 143107 135964 60447 -79089
17603g9089n0412O0951J0060o8446l0574L2514J2253M6138j9484N290q630n7345
$$ -79089 -129501 -68550 -58490 -126936 -157510 -124996 -112743 -66605 -86089 -80799 -89429 -146774
17591a46774l4692R4082J36156N4879o6170q2652k8854Q0921n376p248L4060J28280
$$ -146774 -181466 -87384 48772 103651 37481 -45171 -74025 6896 1520 -5728 28332 156612
17579A56612O3961k959P3114Q5635K00686K87609M11484J44985j46258k07749
$$ 156612 220573 217614 290728 376363 577049 864658 1276142 1421127 1274869 1067120
17569A067120k25914k39474k10043j36010m2967j8948j2715m4332M004j9803M21
$$ 1067120 841206 601732 391689 255679 212712 193764 181049 136717 140721 120918 121339
17558A21339q4558J5639J9654K4881K2560o475j4439K6482r854j6766J5721L8700
$$ 121339 36781 52420 72074 96955 119515 113040 98601 125083 115229 98463 114184 152884
17546A52884O60M2322m6953L8464J78224J92474K91330L21179O1645j70863j56708
$$ 152884 153544 195866 148913 187377 365601 558075 849405 1170584 1232229 1061366 904658
17535I04658k41185j84968r9085j43933k5253m3505j4421m5267j2413K9726K4573
$$ 904658 663473 478505 379420 235487 210234 166729 152308 107041 94628 124354 148927
17524A48927R1582o8913j08180n3441J4462j55J3393L0612L3745N2778r6226J9258
$$ 148927 240509 171596 63416 9975 24437 24282 37675 68287 102032 154810 58584 77842
17512G7842K02504N8211j2831o9944l0942N3520r0107j16636o800Q679P1785k8639
$$ 77842 280346 338557 325726 255782 224840 278360 188253 71617 64817 73496 145281 116642
17500A16642O69n0583o2938K7694O3872j14396q8571M1645j0458N0843P2940n2573
$$ 116642 117311 66728 3790 31484 95356 -19040 -107611 -65966 -76424 -25581 47359 -5214
17488e214j7378l7006N1407N2898M1714R2060j4824k3356N5221j6016J2285M5248
$$ -5214 -22592 -59598 -8191 44707 86421 178481 163657 140301 195522 179506 191791 237039
17476B37039j6593p2732l2358m7700o4356O9445J581k3451O8136Q3656K5812k1575
$$ 237039 220446 147714 115356 67656 3300 72745 74326 50875 119011 202667 228479 206904
17464B06904j13304m9477J183k3023k1222M8035J37135J52213N6942L2054J40043
$$ 206904 93600 44123 45306 22283 1061 49096 186231 338444 395386 427440 567483
17453E67483J26823J34829J98494j3585o0905o924M8528Q0544K72101J99172L6727
$$ 567483 694306 829135 1027629 1014044 953139 946215 994743 1075287 1347388 1546560 1583287
17442A583287j77954k13197j50709m6485J05514J33779N217j32582j84674k18819
$$ 1583287 1405333 1192136 1041427 994942 1100456 1234235 1239452 1106870 922196 703377
17432G03377j55884j59328o4763n8796o2910K5876J06651K7909P3525K0897j18202
$$ 703377 547493 388165 323402 264606 201696 227572 334223 362132 435657 456554 338352
17421C38352Q757k4607k2456p5747q1513n8140P0311K3588j0074q8129j2395m6445
$$ 338352 347109 322502 300046 224299 142786 84646 154957 178545 168471 80342 67947 21502
17409B1502P4734P5212K1971R451O5686J23526J20776Q8081O3854m8192Q8465
$$ 21502 96236 171448 193419 202870 268556 392082 512858 600939 664793 616601 705066
17398G05066J04974R7509K9054N2483j18640r1487o0053j49951k10962r7045l6693
$$ 705066 810040 907549 936603 989086 870446 778959 718906 568955 357993 260948 224255
17387B24255j4297Q4595j4788R2666J97050J58683Q6013O2107n1651k07394j29709
$$ 224255 209958 294553 279765 372431 569481 728164 814177 876284 824633 617239 487530
17376D87530p7745j18580l9396o3340j18555N953o3433p9324m2301M7349r245
$$ 487530 409785 291205 251809 188469 69914 75867 12434 -66890 -109191 -61842 -71087
17365g1087J18129P3668n8790K1865k1106k9684l2677k6495Q0978j7085r290Q522
$$ -71087 47042 120710 61920 83785 62679 32995 318 -26177 54801 37716 28426 36948
17353C6948m9063k5673o9805K1421P5595R873K5045o0594o4688K4280Q1090N7705
$$ 36948 -12115 -37788 -107593 -86172 -10577 -704 24341 -36253 -100941 -76661 4429 62134
17341F2134O817K2228K1551l5670q6251K1616L0872L2379n5184j16739o894Q0987
$$ 62134 68951 91179 112730 77060 -9191 12425 43297 75676 20492 -96247 -103141 -22154
17329b2154J5572q6256l291M5068m709N6049q157J1570m1115J1980Q0162L2908
$$ -22154 -6582 -92838 -96129 -51061 -55770 279 -7878 3692 -37423 -25443 54719 87627
17317H7627l7253N1068j3819P269R2497O3305r6645n2899n7063N972K0577M4879
$$ 87627 50374 101442 87623 94892 187389 250694 154049 101150 44087 50059 70636 115515
17305A15515O4630m1972j02031K2620R7114O6018m0820o5909r3050J2969Q8994
$$ 115515 180145 138173 36142 58762 155876 221894 181074 115165 22115 35084 124078
17294A24078N535L3152k332J7268K9769j70523j32064k6071P9853J815J7807k7800
$$ 124078 129613 162765 160433 177701 207470 36947 -95117 -121188 -41335 -39520 -21713 -49513
17282d9513K9986j6476M3151O412N2156o3257j47033M164N5493J03986R9815L974
$$ -49513 -19527 -36003 7148 13560 65716 2459 -144574 -140410 -84917 19069 118884 122858
17270A22858m1561o4952j03747L8663O2998K0108n4020Q098M1928l0999J3233
$$ 122858 81297 16345 -87402 -48739 14259 34367 -19653 -11555 30373 -626 12607
17259A2607J7292l8998L102M2901K1633J35337J89078K13837K26220L24970L71322
$$ 12607 29899 -9099 -5997 36904 58537 193874 382952 596789 823009 1147979 1519301
17248A519301R7445k73995l21508k77701k89245j68937o3128r3888j6167L0259
$$ 1519301 1616746 1342751 1021243 743542 454297 285360 222232 128344 112177 142436
17238A42436K6741n380r987k316l0489N5704J2058j8404l7467o3742n727L9113
$$ 142436 169177 163797 153810 151494 121005 176709 188767 170363 132896 69154 63427 102540
17226A02540m2662n4148P1559K0554N4628O9985O4952Q7886P7904J88007L06110
$$ 102540 59878 5730 77289 97843 152471 222456 287408 375294 453198 641205 947315
17215I47315L34634O4918k15452j86132j89121k59381j41127k3917n0498j24342
$$ 947315 1281949 1346867 1131415 945283 756162 496781 355654 331737 281239 156897
17205A56897o0294L4762q0238l2796J44023P7455p2472p0797j6900P3151J4332
$$ 156897 96603 131365 51127 18331 162354 239809 167337 96540 79640 152791 167123
17194A67123n1494q6384N12o847j0141l2023N4276k9676m0266q148Q437Q9754
$$ 167123 115629 29245 29757 22910 12769 -19254 35022 5346 -34920 -43068 -34631 55123
17182E5123J47411L6469j12557n0864n6982j5751k0024K6920m325q222j6207N9462
$$ 55123 202534 239003 126446 75582 18600 2849 -17175 9745 5420 -2802 -19009 40453
17170D0453N05J12468M6427k5925L8903l5285o8539o9641J1602N0369o7024l4869
$$ 40453 40958 153426 199853 173928 212831 177546 109007 39366 50968 101337 34313 -556
17158e56L466J9776K4010K849L845r13j06228K5781N2774j645l4669N0985J3252
$$ -556 2910 22686 46696 49545 53390 52477 -53751 -27970 24804 23159 -11510 39475 52727
17145E2727M8896N3003J0360K3262M325m5093n2010m3070K5089K2802K9327n1579
$$ 52727 101623 154626 164986 188248 192573 147480 95470 52400 77489 100291 129618 78039
17133G8039m0285O1418Q018l9315O9450J23334j27728o8164O4474N2134N4962
$$ 78039 37754 99172 107190 67875 137325 260659 132931 64767 129241 181375 236337
17122B36337Q077o2298l7087j1676j1922L2740n776l7217j5407M50k2773m4040
$$ 236337 244414 182116 145029 133353 121431 154171 148395 111178 95771 96221 73448 29408
17110B9408l970k5628j1574L2691k9383n5106N7021J0931J0788j0043L6220P1931
$$ 29408 25438 -190 -11764 20927 -8456 -63562 -6541 4390 15178 5135 41355 113286
17098A13286M8221r680j1288Q8q5124o7500p4334Q9545R6418o6867n5401O2166
$$ 113286 161507 151827 140539 140627 55503 -11997 -86331 3214 99632 32765 -22636 39530
17086C9530n6680j69215K782L9492L6067N8221k2081Q4318L0205J5204O6796p7209
$$ 39530 -17150 -186365 -183583 -144091 -108024 -49803 -71884 12434 42639 57843 124639 47430
17074D7430m2453L7931l4027P30K8463J2277o6888n4983R140L1926J930N1996
$$ 47430 4977 42908 8881 9611 38074 50351 -16537 -71520 -62380 -30454 -28524 23472
17062B3472L6593j2751L2924M1979J3027m6488M5267O8974l7348o3719m3961r2829
$$ 23472 60065 47314 80238 122217 135244 88756 134023 202997 165649 101930 57969 -34860
17050c4860K3948k8279o2228O6188m9140M4932J16437N3998p6168j63761k7508
$$ -34860 -10912 -39191 -101419 -35231 -84371 -39439 76998 130996 54828 -108933 -136441
17039a36441J8881j9373l719j2084j3592l75N0602J6631m3662Q2029K1285j4733
$$ -136441 -117560 -136933 -140652 -152736 -166328 -166703 -116101 -99470 -143132 -61103 -39818 -54551
17027e4551O2212N7908j07372o1000N1158J34822L8389l2876l4294l8884K7783
$$ -54551 7661 65569 -41803 -102803 -51645 83177 121566 88690 54396 15512 43295
17016D3295q432r0129r1663j673M192J22441P5977l3319k3347K5332J1184r2307
$$ 43295 34863 -55266 -146929 -148602 -144410 -21969 54008 20689 -2658 22674 33858 -58449
17004e8449q0904K1377J33096m684m3983n9491o421J09514n920q3957j09254m1157
$$ -58449 -139353 -117976 15120 10436 -33547 -93038 -99459 10055 4135 -79822 -189076 -230233
16992b30233J2410M4431N6182O5503r2282q7614n6253N546R5388K8057l8177P2185
$$ -230233 -217823 -173392 -117210 -51707 -143989 -231603 -287856 -282310 -186922 -158865 -197042 -124857
16980a24857J15828O0353n1007m4244j18573k3420j3267R5017j859M356K1752
$$ -124857 -9029 51324 317 -43927 -162500 -185920 -199187 -104170 -106029 -101673 -79921
16969g9921K148n3132j1812N2759m682O2702J4417r9140q1836O5799M0438L4850
$$ -79921 -77773 -130905 -142717 -89958 -94640 -31938 -17521 -116661 -198497 -132698 -92260 -57410
16957e7410n5197j01697O4975J7335j7920K1740m366J8601R5227P150p7853l1655
$$ -57410 -112607 -214304 -149329 -131994 -149914 -128174 -132540 -113939 -18712 -11562 -89415 -121070
16945a21070K1680j10292o3237O6560Q6508O6073k7229J0086K0941n6959l3791
$$ -121070 -99390 -209682 -272919 -206359 -119851 -53778 -81007 -70921 -49980 -106939 -140730
16934a40730r699O2643M0106j1294O1436R8186q0883j07480q7378P7777L6565
$$ -140730 -150429 -87786 -47680 -58974 2462 100648 19765 -87715 -175093 -97316 -60751
16923f0751J5819J9761P49m9684k1995l770P908o654K1117K0537n6615q6387J04125
$$ -60751 -44932 -25171 -24422 -74106 -96101 -99871 -91963 -98617 -77500 -56963 -113578 -199965 -95840
16910i5840J07659m6580l6887k9034r330M4774n618L768j8835L0606n510k4599
$$ -95840 11819 -34761 -71648 -100682 -110012 -65238 -70856 -67088 -85923 -55317 -60827 -85426
16898h5426Q932m9653n3306K2610J04133J08157L9779N916o2010k6624p800o844
$$ -85426 -76494 -126147 -179453 -156843 -52710 55447 95226 101142 39132 12508 4708 -2136
16886b136j9331l2351O757M308J332N3766l2408o7982J2221N1683l709J5581N9864
$$ -2136 -21467 -53818 -47061 -42753 -41421 12345 -20063 -88045 -75824 -24141 -27850 -12269 47595
16873D7595l7302o3987J720o7086p239k5725M0767N7742p293K2060J4772m311
$$ 47595 10293 -53694 -51974 -119060 -126299 -152024 -111257 -53515 -60808 -38748 -23976 -28287
16861b8287q3450n9272L9020L7822L6061m0293K714L0772Q9001M0748m38r0743
$$ -28287 -111737 -171009 -131989 -94167 -58106 -98399 -95685 -64913 24088 64836 64398 -26345
16849b6345o8739l4979L5802j2843O3063O109o0587L093J3195l4397J7298J1489
$$ -26345 -95084 -130063 -94261 -107104 -44041 -37932 -98519 -95426 -82231 -116628 -99330 -87841
16837h7841O6952L8705J4558m0211l6644L67o4837O851m439l9398N7689M6930
$$ -87841 -20889 17816 32374 -7837 -44481 -44114 -108951 -102100 -106539 -145937 -88248 -41318
16825d1318n1936j0972m9316L94o07q38j4758J0546j8899J01461R3642l7459l3166
$$ -41318 -93254 -104226 -153542 -153148 -153755 -154593 -169351 -158805 -177704 -76243 17399 -20060 -53226
16812e3226Q0675O6141j0910J6105j74517j33078O8139J29144j5996k8513N2750
$$ -53226 27449 93590 82680 98785 -75732 -208810 -140671 -11527 -27523 -56036 -3286
16801c286L6615M2017M8723N4175l3368l9170j75807r3244n3251j5804K6510R7989
$$ -3286 33329 75346 124069 178244 144876 105706 -70101 -163345 -216596 -232400 -205890 -107901
16789a07901n9510k3858Q0304r188K9590r30r775R9020L3577M734o7700l0505
$$ -107901 -167411 -191269 -110965 -120153 -90563 -91493 -101268 -2248 31329 36063 -31637 -62142
16777f2142j5224P641k3670m7386L4762L9284m1528l3559Q6232O1906O146l2331
$$ -62142 -77366 -69725 -93395 -140781 -106019 -66735 -108263 -141822 -55590 6316 12462 -19869
16765a9869K5201K3354q9165o8293M0616L3649j2967J7859l6067K9845P4501K0765
$$ -19869 5332 28686 -60479 -128772 -88156 -54507 -67474 -49615 -85682 -55837 18664 39429
16753C9429o4489k146Q964P783r851J4343m4183p5565k3759J3215N5104Q7129
$$ 39429 -25060 -27206 -18242 -10459 -20310 -5967 -50150 -125715 -149474 -136259 -81155 5974
16741E974k4518m2386K8596l4767K3827J703p1938K9505k1700O0531L5575M3811
$$ 5974 -18544 -60930 -32334 -67101 -43274 -41571 -113509 -84004 -105704 -45173 -9598 34213
16729C4213N716l3318q462l9876o3818n731k3606n1125J0996J35064J45209O9083
$$ 34213 39929 6611 -1851 -41727 -105545 -111276 -134882 -186007 -175011 -39947 105262 174345
16717A74345n8663j18525q0596M1923j7090l4913N810Q364p1631R3766J12340
$$ 174345 115682 -2843 -83439 -41516 -58606 -93519 -87709 -79345 -150976 -57210 55130
16706E5130l6410m0782j3378l2112K7652J01497K3289n3140k1237j12064l3554
$$ 55130 18720 -22062 -35440 -67552 -39900 61597 84886 31746 10509 -101555 -135109
16695a35109J0201j1933N5926J5674M2468M3908P0288p4984m3859k6551N7799
$$ -135109 -124908 -136841 -80915 -65241 -22773 21135 91423 16439 -27420 -53971 3828
16684C828L0437l7115j512L5270M8161L5395p5623j46827j21100P3289O6544L4400
$$ 3828 34265 -2850 -4362 30908 79069 114464 38841 -107986 -229086 -155797 -89253 -54853
16672e4853R8206j5955k3938o0467q5875m1995j1787L9300K2514L80O461R1591
$$ -54853 43353 27398 3460 -57007 -142882 -184877 -196664 -157364 -134850 -134470 -128009 -36418
16660c6418K7554j0826J0482K8063L1042J6233j4171l8181m5907l3555J0573k644
$$ -36418 -8864 -19690 -9208 18855 49897 66130 51959 13778 -32129 -65684 -55111 -57755
16648e7755k2091J766r2315m2671K6301R0211o7872L0298R4067J22100m515r3556
$$ -57755 -79846 -78080 -170395 -213066 -186765 -96554 -164426 -134128 -40061 82039 77524 -16032
16636a6032q0680r434L2986k825N8813q4968j21952N3893K5011J4689P9454M7967
$$ -16032 -96712 -106146 -73160 -75985 -17172 -102140 -224092 -170199 -145188 -130499 -51045 -3078
16624c078r090O5881P8146p1295L590m3761m5266k8071n5335k6543m9236n7739
$$ -3078 -12168 53713 131859 60564 64154 20393 -24873 -52944 -108279 -134822 -184058 -241797
16612b41797M3398J03341k8268r9670K4701Q3529L1994n8378l240O4635P8089
$$ -241797 -198399 -95058 -123326 -222996 -198295 -114766 -82772 -141150 -144390 -79755 -1666
16601a666N2021o4643n2765L5298L8676J3002j1679j4917J7429p2860n4570J0970
$$ -1666 50355 -14288 -67053 -31755 6921 19923 8244 -6673 10756 -62104 -116674 -105704
16589a05704O0305L197j9747M1574m3870K959m823M734K3847n6435o2121L6772
$$ -105704 -45399 -42202 -61949 -20375 -64245 -61286 -66109 -61375 -37528 -93963 -156084 -119312
16577a19312l0676n342J9758L4447R1497O7862J3906j17997q6693P5819L7788
$$ -119312 -149988 -155330 -135572 -101125 -9628 58234 72140 -45857 -132550 -56731 -18943
16566a8943o2497m0316J18410N7981L4052K6752L300q4521k9816K1665K1730l6382
$$ -18943 -81440 -121756 -3346 54635 88687 115439 118739 34218 4402 26067 47797 11415
16554A1415m7622n049k1776R993l9669J1145M6243L2713p046L4781K2980n5641
$$ 11415 -36207 -41256 -63032 -53039 -92708 -81563 -35320 -2607 -9653 25128 48108 -7533
16542g533o1628O2330R145p4615m1175Q3976P3173l4230n2644q6525J3322L0539
$$ -7533 -69161 -6831 2314 -72301 -113476 -29500 43673 9443 -43201 -129726 -116404 -85865
16530h5865p9488K2639l0902m945J0632O3108O05m9331K1983O2191N8529j6178
$$ -85865 -165353 -142714 -173616 -178561 -167929 -104821 -104216 -153547 -131564 -69373 -10844 -27022
16518b7022o295K7538J1316n8276q1121K3414P6511J365p4417j6606j5119J3957
$$ -27022 -33317 -5779 5537 -52739 -133860 -110446 -33935 -32570 -106987 -123593 -138712 -124755
16506a24755p7226L7608r2106P524J06951J005N632p301j4135L6810N1565l2626
$$ -124755 -201981 -164373 -256479 -248955 -142004 -140999 -135367 -142668 -156803 -119993 -68428 -101054
16494a01054j1519Q4539Q242N0152L3135l3419j02602N615O4757o2959j18437
$$ -101054 -112573 -28034 -19792 30360 63495 30076 -72526 -66911 -2154 -65113 -183550
16483a83550N0686R1143r91j02035k8534P3823R9864j8891o434L9786O575n8082
$$ -183550 -132864 -41721 -42712 -144747 -173281 -99458 406 -18485 -24919 14867 21442 -36640
16471c6640n3236m8209J01245K1000j642m2582o2319O4594P4551p5354j1622O5382
$$ -36640 -89876 -138085 -36840 -15840 -17482 -60064 -122383 -57789 16762 -58592 -70214 -4832
16459d832K3094j1669Q3983l2774l6706K7169L1561l1036j21836j08637k1894
$$ -4832 18262 6593 90576 57802 21096 48265 79826 48790 -73046 -181683 -203577
16448b03577P5165N3143J3602O099R7186j08970p9446M9211O5793j24396j4782
$$ -203577 -128412 -75269 -61667 -55568 41618 -67352 -146798 -97587 -31794 -156190 -170972
16437a70972K4547N7302R3959j7627M7752M0126n6726q1327J2689K215M0726J1463
$$ -170972 -146425 -89123 4836 -12791 34961 75087 18361 -62966 -50277 -48062 -7336 4127
16425D127j7187K6643j1979N0257L9655l3738l2094l1567K645J3525n6493j1094
$$ 4127 -13060 13583 1604 51861 91516 57778 25684 -5883 -3238 10287 -46206 -57300
16413e7300l0113J8391Q9209n4753n3953p4504q4629j5927R0740j5652J0113J762
$$ -57300 -87413 -69022 20187 -34566 -88519 -163023 -247652 -263579 -172839 -188491 -178378 -176616
16401a76616k0626l763J9560P9274K8841J9082r665o4163k9897k5821J26387J08268
$$ -176616 -197242 -201005 -181445 -102171 -73330 -54248 -63913 -128076 -157973 -183794 -57407 50861
16389E0861m0601q3685O3954k1289K4096L8857K792J7821l3764o9506k4986K3934
$$ 50861 10260 -73425 -9471 -30760 -6664 32193 34985 52806 19042 -50464 -75450 -51516
16377e1516M4907j163j9934N0239J9263p0590j6416Q281l5627L2835j0586m0755
$$ -51516 -6609 -7772 -27706 22533 41796 -28794 -45210 -36929 -72556 -39721 -50307 -91062
16365i1062R1996R9674n0964r9623J3420J00623J1477l1945p8371J04762O3958
$$ -91062 934 100608 49644 -49979 -36559 64064 75541 43596 -34775 69987 133945
16354A33945K5106o9878q5228p5655P210K9299l127j2341J0325R545k697K6231
$$ 133945 159051 89173 3945 -71710 -64500 -35201 -38328 -50669 -40344 -30799 -33496 -7265
16342g265k6569j8780k7845J3210P5560M2392J1986k9393L1946l0820L4861M8682
$$ -7265 -33834 -52614 -80459 -67249 8311 50703 62689 33296 65242 34422 69283 117965
16330A17965m9937L3764j1872j07068k2563J2832M7076N3836k8001p0668L0358
$$ 117965 68028 101792 89920 -17148 -39711 -26879 20197 74033 46032 -24636 5722
16319E722M9612k0648n9332m1737M1397R4858K6911j6248n3373l5951O4195n092
$$ 5722 55334 34686 -24646 -66383 -24986 69872 96783 80535 27162 -8789 55406 50314
16307E0314p9445n3343l7657M5384M8204K9345M5941j337K898o0503r8779k4420
$$ 50314 -29131 -82474 -120131 -74747 -26543 2802 48743 47406 50304 -10199 -108978 -133398
16295a33398K7793j2594M2974J1228j4275N7941m4758L1957J0257n6244k1397
$$ -133398 -105605 -118199 -75225 -63997 -78272 -20331 -65089 -33132 -22875 -79119 -100516
16284a00516J6507j2494M0105J6024m2419K9241K4174n1719M5174k4098q1954
$$ -100516 -84009 -96503 -56398 -40374 -82793 -53552 -29378 -81097 -35923 -60021 -141975
16273a41975M5364M5655O740J2020M1240o2886m4632N9596O5963J5015k8526L0861
$$ -141975 -96611 -50956 -44216 -32196 9044 -53842 -98474 -38878 27085 42100 13574 44435
16261D4435R9648j2909k8817k5975j10635j9502K748P8659O1198k6128L3308N74
$$ 44435 144083 131174 102357 76382 -34253 -53755 -51007 27652 88850 62722 96030 96604
16249I6604k8960l9710j7201P4409K0861J2328M0534n9595k8989Q032l0244M89
$$ 96604 67644 27934 10733 85142 106003 118331 158865 99270 70281 78313 48069 48558
16237D8558P610K3285J926m5054o2388k369j121l1807K4188l341L9499K1582K3333
$$ 48558 56168 79453 81379 36325 -26063 -28432 -29553 -61360 -37172 -40513 -1014 20568 43901
16224D3901O0003l7065J6940q0100j18873P4245N3354J8937l4261r2128M2273
$$ 43901 103904 66839 83779 3679 -115194 -40949 12405 31342 -2919 -95047 -52774
16213e2774K7263j628N515l3200J7943N8004J8470m8745r8495K2840q341J8293
$$ -52774 -25511 -27139 -21624 -54824 -36881 21123 39593 -9152 -107647 -84807 -93148 -74855
16201g4855J04904L1496r3852n0742N5963P6059l032r0024l7566J0604l8646K1867
$$ -74855 30049 61545 -32307 -83049 -27086 48973 45941 -44083 -81649 -71045 -109691 -87824
16189h7824J926o3827m2811O3900J3293q651p3245J0917O8497J8053K1196j4971
$$ -87824 -85898 -149725 -192536 -128636 -115343 -123994 -197239 -186322 -117825 -99772 -78576 -93547
16177i3547K5415J00269j01849p3238j06389k3358Q0638j248j9980k8919O0119
$$ -93547 -68132 32137 -69712 -142950 -249339 -272697 -192059 -193307 -213287 -242206 -182087
16166a82087O5293R4815k2984L1520J11463M5526q4356p3220J1864O8318m1447
$$ -182087 -116794 -21979 -44963 -13443 98020 143546 59190 -14030 -2166 66152 24705
16155B4705m7026L3395K4907J6725j4316N122k9816L224m5971K7453m1266j695
$$ 24705 -22321 11074 35981 52706 38390 43512 13696 16920 -29051 -1598 -42864 -44559
16143d4559n729m2510N184J71471M7880K203m1684n4462o2418J5113o8687k6184
$$ -44559 -50288 -92798 -87614 83857 131737 133940 92256 37794 -24624 -9511 -78198 -104382
16131a04382J5625J01489J5349j5294j2942k2620N4915L0552M4723N9862L5447
$$ -104382 -88757 12732 28081 12787 -155 -22775 32140 62692 107415 167277 202724
16120B02724J5021k7980j29650n1096M5782M1488J1426j0301J6765M8941l8163
$$ 202724 217745 189765 60115 9019 54801 96289 107715 97414 114179 163120 124957
16109A24957p4743n6004M6645n9236j1984k6708j6524O4440p415P822M0418o5930
$$ 124957 50214 -5790 40855 -18381 -30365 -57073 -73597 -9157 -16572 -8750 31668 -34262
16097c4262q9797J3727M9269j5848r383l825l7447k8757m3707J00163K0368O6007
$$ -34262 -124059 -110332 -61063 -76911 -86294 -90119 -127566 -156323 -200030 -99867 -79499 -13492
16085a3492J675J773m9358l7072j1010n2665L1658M5947P0871K7263k7667o600
$$ -13492 -11817 -10044 -59402 -96474 -107484 -160149 -128491 -82544 -11673 15590 -12077 -18677
16073a8677K7159Q5797K932k8968k2250m593M9276N6642m9348n3920l91K9185
$$ -18677 8482 94279 97211 68243 45993 41400 90676 147318 97970 44050 43659 72844
16061G2844k0583m9247p9605m2440N5906L0109J2941n7221n8509N3297J18566
$$ 72844 52261 3014 -76591 -119031 -63125 -33016 -20075 -77296 -135805 -82508 36058
16050C6058j17410j06733M8808J0864r959p100M9466J52437N870l1202m1057l0563
$$ 36058 -81352 -188085 -139277 -128413 -138372 -145472 -96006 56431 62301 31099 -9958 -40521
16038d0521k8213j34088N2167K326N2895L8074o2152k9368R590J503j5367k2908
$$ -40521 -68734 -202822 -150655 -148329 -95434 -57360 -119512 -148880 -139290 -137787 -153154 -176062
16026a76062Q1290J01666l9911j22201m6565R3742M3000M9811k1589m4670Q2758
$$ -176062 -94772 6894 -33017 -155218 -201783 -108041 -65041 -15230 -36819 -81489 1269
16015A269j8062k8233K5349o4819O352L2376r526p7872k8664l0323r781j5400
$$ 1269 -16793 -45026 -19677 -84496 -78144 -45768 -55294 -133166 -161830 -192153 -201934 -217334
16003b17334J23667M0473R5461k1127j5450J592k3515L7159Q236l3466q4228k2221
$$ -217334 -93667 -53194 42267 21140 5690 7282 -16233 20926 29162 -4304 -88532 -110753
15991a10753R2631J9520K1265j269k941m3362J3674k1585p5045p4988N723M7066
$$ -110753 -18122 1398 22663 21394 18453 -24909 -11235 -32820 -107865 -182853 -177130 -130064
15979a30064N6711L1306M0159L3597J3150k0976k7920R766p304K5499O1944l7530
$$ -130064 -73353 -42047 -1888 31709 44859 23883 -4037 5729 -1575 23924 85868 48338
15967D8338L23L3438o0112n2428k8596L4068j0552L117J28224J9076m732j04126
$$ 48338 48661 82099 21987 -30441 -59037 -24969 -35521 -32404 95820 114896 110164 6038
15955F038p9335M6155l744L065M7731j9480l1499J5422l6638r2L0351p9424n6920
$$ 6038 -73297 -27142 -30886 -27821 19910 430 -31069 -15647 -52285 -52377 -22026 -101450 -158370
15942a58370L3308L5586L084k4512j0878L532m123J8646P2275n8028q9377k5543
$$ -158370 -125062 -89476 -86392 -110904 -121782 -118250 -122373 -103727 -31452 -89480 -178857 -204400
15930b04400J5449R2026P0351M597O78m983q1054K6852N5412l165J1348J3303
$$ -204400 -188951 -96925 -26574 -21977 -21299 -26282 -107336 -80484 -25072 -28237 -16889 -3586
15918c586P1158O8597m1825r6486n0532O5350J01097L2292m4380J9981K3684j6125
$$ -3586 67572 136169 94344 -2142 -52674 12676 113773 146065 101685 121666 145350 129225
15906A29225l0199l0857m6335J0436l3258j9939p6687k192O2951O9468K9437o6161
$$ 129225 99026 68169 21834 32270 -988 -20927 -97614 -99806 -36855 32613 62050 -4111
15894d111l7506k7151L5732P8723P4486r4163P651N6166j00532j8402L3933r7600
$$ -4111 -41617 -68768 -33036 45687 120173 26010 33661 89827 -10705 -29107 4826 -92774
15882i2774m4610o9587p0602k418J73982j7973p928M4134N4182j4944q4725P0939
$$ -92774 -137384 -206971 -277573 -279991 -106009 -123982 -131910 -87776 -33594 -48538 -133263 -62324
15870f2324R7435O2538k2203R693n9477r0018m9279N0589P5690l272J0101R039
$$ -62324 35111 97649 75446 85139 25662 -64356 -113635 -63046 12644 9372 19473 28512
15858B8512o5796k1836l3693j9290P4590J5575k6368L9798k3378L9099k3414n5591
$$ 28512 -37284 -59120 -92813 -112103 -37513 -21938 -48306 -8508 -31886 7213 -16201 -71792
15846g1792l1663L7338Q1444P038l5084o0089n0625M0726J04425M6041j04107
$$ -71792 -103455 -66117 15327 22365 -12719 -72808 -123433 -82707 21718 67759 -36348
15835c6348p1727N1015p5859m4739Q6192K8226r447M996N4226J0970o0006M7083
$$ -36348 -108075 -57060 -132919 -177658 -91466 -63240 -72687 -67691 -13465 -2495 -62501 -15418
15823a5418P5799J7341n8656j01225j22241K1011J1407o42J45095L2944k1845
$$ -15418 60381 77722 19066 -82159 -204400 -183389 -171982 -172624 -27529 5415 -16430
15812a6430q6059l4336N3460K4600K2708k3867m0144l7361R350l2163J50431R9742
$$ -16430 -102489 -136825 -83365 -58765 -36057 -59924 -100068 -137429 -128079 -160242 -9811 89931
15800H9931k8330p7761o4105m2631o0093n1J724J22941M7621L0403K6575L1572
$$ 89931 61601 -16160 -80265 -122896 -182989 -183040 -181316 -58375 -10754 19649 46224 77796
15788G7796l0974n9249l6495L0135L0024R820q9336q0101N2922Q3538p023m7364
$$ 77796 46822 -12427 -48922 -18787 11237 21057 -68279 -148380 -95458 -11920 -18943 -66307
15776f6307L4203Q9970o8193j31210k6404J9663K0731K5388P8141P272n3702L3238
$$ -66307 -32104 57866 -10327 -141537 -167941 -148278 -127547 -102159 -24018 -16746 -70448 -37210
15764c7210M3236L8691j27215o2006J3936N4986L9510J0647P154n50M0259n2445
$$ -37210 6026 44717 -82498 -144504 -130568 -75582 -36072 -25425 -18271 -18821 21438 -31007
15752c1007o729L8952P8687K5161r4326j3706O5084M4997k8268o3753L5191j8330
$$ -31007 -37736 1216 79903 105064 10738 -2968 62116 107113 78845 15092 50283 31953
15740C1953q0652j63669m3386P390J19010R086m9683K6668N370k0796L4030K5763
$$ 31953 -48699 -212368 -255754 -248364 -129354 -120268 -169951 -143283 -137913 -158709 -124679 -98916
15728i8916O4212m077l8518J3021J7130O8568m997r2022r6774p833K641j5739
$$ -98916 -34704 -38781 -77299 -64278 -47148 21420 16423 -75599 -172373 -180206 -177565 -193304
15716a93304Q3932P4063J7556k4873n7461j3680k6931k3256K7904J11342L8442
$$ -193304 -109372 -35309 -17753 -42626 -100087 -113767 -140698 -163954 -136050 -24708 13734
15705A3734j08075j0466M8122O3413R970K466O6286j6454n6686m6047O0700M415
$$ 13734 -94341 -104807 -56685 6728 16698 19164 85450 68996 12310 -33737 26963 31378
15693C1378m9848j9893L3384J22214N3526l8924r6326j28111M49M1518O1285l1072
$$ 31378 -18470 -38363 -4979 117235 170761 131837 35511 -92600 -92151 -50633 10652 -20420
15681b0420l9262P5253Q7034j1851j25071o7448K0538k807j5257N4302p1010k6291
$$ -20420 -59682 15571 102605 90754 -34317 -101765 -81227 -84034 -99291 -44989 -115999 -142290
15669a42290j6247r539Q3873K208j8015k6791L3606K5953J0673N5675n129L6658
$$ -142290 -158537 -168076 -84203 -81995 -100010 -126801 -93195 -67242 -56569 -894 -6023 30635
15657C0635L5976n7862l0560n3872N4872j00815k7533L9736K1755O6739N6218
$$ 30635 66611 8749 -21811 -75683 -20811 -121626 -149159 -109423 -87668 -20929 35289
15646C5289R2281L3251o1469j17758n6259k5134j1982Q1644L325j10897j0528
$$ 35289 127570 160821 99352 -18406 -74665 -99799 -111781 -30137 -26812 -137709 -148237
15635a48237N2527O4209M2511q244j7521l4633j7795N0527o470J5896m0499p7758
$$ -148237 -95710 -31501 11010 2766 -14755 -49388 -67183 -16656 -23126 -7230 -47729 -125487
15623a25487M4676j6953k1258Q4961N4187p3082j2864j6765N7830l0967o7535
$$ -125487 -80811 -97764 -119022 -34061 20126 -52956 -65820 -82585 -24755 -55722 -123257
15612a23257o4361P2453K9390p533N2447J973k5190q442j380M5852j0774m78m124
$$ -123257 -187618 -115165 -85775 -93308 -40861 -38888 -64078 -72520 -73900 -28048 -38822 -39300 -43424
15599d3424p091N522M207J0817n3025j7846m4312K1307P9205R9980R640n4508
$$ -43424 -50515 -44993 -40786 -29969 -82994 -100840 -145152 -123845 -44640 55340 64980 10472
15587A0472j35148K4510J11601O5242O4320o0592j8619K4908j28n0109o4963j4436
$$ 10472 -124676 -100166 11435 76677 140997 80405 61786 86694 86566 36457 -28506 -42942
15575d2942M3717O939q6577l5902J27447J3200k4844m3061o507j3797r796K3818
$$ -42942 775 7714 -78863 -114765 12682 25882 1038 -42023 -48530 -62327 -72123 -48305
15563d8305l4550M9619L4567R746p4669J5147K8711m8669M586O9460j4906k004
$$ -48305 -82855 -33236 1331 11077 -63592 -48445 -19734 -68403 -63817 5643 -9263 -11267
15551a1267n9397N0744K6527j3314P4242m2722o7498P3787O0487l9030l9779M5363
$$ -11267 -70664 -19920 6607 -6707 67535 24813 -42685 31102 91589 52559 12780 58143
15539E8143m594p387j4266J4529N5102j1400n8698p7714j18380p384O6230j0316
$$ 58143 53549 46162 31896 46425 101527 90127 31429 -46285 -164665 -172049 -105819 -116135
15527a16135K8952k0822Q548P9634l4048R3210L99M1400l3580l5145L6058L5552
$$ -116135 -87183 -108005 -99457 -19823 -53871 39339 39738 81138 47558 12413 48471 84023
15515H4023j46l7446M991l2224j3676K5569M3556j4167k5082O6386L8307j10245
$$ 84023 83877 46431 51422 19198 5522 31091 74647 60480 35398 101784 140091 29846
15503B9846n7965j8609n5720M51N039O8893m059K9701R5097k6298r3934K3792
$$ 29846 -28119 -46728 -102448 -101997 -96958 -28065 -32124 -2423 92674 66376 -27558 -3766
15491c766Q2418m1897j06119Q9866L2432K422M0189K4898l3743J5542n990J2637
$$ -3766 78652 36755 -69364 20502 52934 55356 95545 120443 86700 102242 96252 108889
15479A08889J18j4315l6414m3873k4923R8473J10121o9449r8899r2030K4442Q645
$$ 108889 109007 94692 58278 14405 -10518 87955 198076 128627 29728 -62302 -37860 -29215
15467b9215k2978l3867P4151J8879j19012m637J16803O9186k6858l1474m5791
$$ -29215 -52193 -86060 -11909 6970 -112042 -116679 124 69310 42452 10978 -34813
15456c4813K3271J3615n187L8379n190r268K1495o1188j812N8822K7038k5569
$$ -34813 -11542 2073 -3114 35265 30075 20807 42302 -18886 -20698 38124 65162 39593
15444C9593m4023J3382J5484k8201L368L744j11810n4894J34046J46235L6753
$$ 39593 -4430 8952 24436 -3765 -397 3347 -108463 -163357 -29311 116924 153677
15433A53677p3247l7038J627M7724K9937L5182l9855n4828L38Q0527P9071r7227
$$ 153677 80430 43392 45019 92743 122680 157862 118007 63179 63517 144044 223115 125888
15421A25888j21872L4573N2970l1501k1305k5218L2349p9700j2964j7025j08175
$$ 125888 4016 38589 91559 60058 38753 13535 45884 -33816 -46780 -63805 -171980
15410a71980k3501K0925J00726M7233R876J3592k7807r1063l8399P0358j5811
$$ -171980 -195481 -174556 -73830 -26597 -16721 -3129 -30936 -121999 -160398 -90040 -105851
15399a05851k9071J75580K2429o4043n3555L8567N7869l7273j06387l3274J16652
$$ -105851 -134922 40658 63087 -956 -54511 -15944 41925 4652 -101735 -135009 -18357
15388a8357J09855j01993n4516j4923o9P686m9046J7473M1069q0191K9289K4742
$$ -18357 91498 -10495 -65011 -79934 -80003 -72317 -121363 -103890 -62821 -143012 -113723 -88981
15376h8981O5653M1272l0614r597J1427k8337m393K584O4140K0461N4717m6672
$$ -88981 -23328 17944 -12670 -22267 -10840 -39177 -43570 -40986 23154 43615 98332 51660
15364E1660k4530p324k7844K5578M4315L838n9167J5957N4290o088L1807l7970
$$ 51660 27130 19806 -8038 17540 61855 65693 6526 22483 76773 70685 102492 64522
15352F4522O9718O9349j7855j04462j6196r2092L5595M7781k188K6071J03877
$$ 64522 134240 203589 185734 81272 65076 -27016 8579 56360 54172 80243 184120
15341A84120L0793j26754j39026L7507O4249l5547l9m2327J0248m0627L1058M3555
$$ 184120 214913 88159 -50867 -13360 50889 15342 15303 -27024 -16776 -57403 -26345 17210
15329A7210J1103k711p757p0589n1759J4187k5628Q0526J04736O345R87p6048
$$ 17210 28313 25602 17845 -52744 -104503 -90316 -115944 -35418 69318 75663 76650 602
15317F02n181l485j328j475N6128P3273l9440J9447K9513r2178o5370Q7547R3961
$$ 602 -4579 -8064 -9392 -10867 45261 118534 79094 98541 128054 35876 -29494 58053 152014
15304A52014Q154j07731j16094Q41N5839L0476m9206J1947k1388P013K2487K6395
$$ 152014 160168 52437 -63657 -62816 -6977 23499 -25707 -13760 -35148 -28135 -5648 20747
15292B0747j3272p0225r7609J9037J31894K1607l2502M9835M3320P0229J1963
$$ 20747 7475 -62750 -160359 -141322 -9428 12179 -20323 29512 72832 143061 155024
15281A55024k1969m7557J7395L0317p768m1878K1982j5939m2178J093o3683P3067
$$ 155024 133055 85498 102893 133210 125442 83564 105546 89607 47429 48522 -15161 57906
15269E7906O8769L400o1611r4486P78O6265o4468n8535M4388O3120j8794k3734
$$ 57906 126675 130075 68464 -26022 -25244 41021 -23447 -81982 -37594 25526 6732 -17002
15257a7002L4655r097k3346m1282n0148K0898N9859J56347O520q3030M9835o5170
$$ -17002 17653 8556 -14790 -56072 -106220 -85322 -25463 130884 137404 54374 104209 39039
15245C9039r6607j09303k328R8384L5458n7897K5129o7335N2578P2478j9143J299
$$ 39039 -57568 -166871 -169199 -70815 -35357 -93254 -68125 -135460 -82882 -10404 -29547 -28248
15233b8248J8930M4493j3593p4928J0305k400R184j6482J1875J4035l7826k7107
$$ -28248 -9318 35175 21582 -53346 -43041 -45441 -36257 -52739 -40864 -26829 -64655 -91762
15221i1762k3378R4369J11141p8305q2806k0547Q0819k3576q704N9350J4006J397
$$ -91762 -115140 -20771 90370 12065 -70741 -91288 -10469 -34045 -42749 16601 30607 32004
15209C2004P5766k990l0249n7178l4411k9438l3248K2979N6622M2264m2923J620
$$ 32004 107770 104780 74531 17353 -17058 -46496 -79744 -56765 -143 42121 -802 818
15197H18K7894k0674n060L3834m8005K8838L5696j7096k1318K0533R612K9187
$$ 818 28712 8038 2978 36812 -11193 17645 53341 36245 14927 35460 45072 74259
15185G4259P299p1467n8948l2418L6488K355n786J93K1639j4557m6102L5346P1401
$$ 74259 81558 10091 -48857 -81275 -44787 -42432 -48218 -48025 -26386 -40943 -87045 -51699 19702
15172A9702M5374n4925n448k7076Q298M505l2761j9946R3982O3664m8583l071
$$ 19702 65076 10151 4703 -22373 -14075 -9570 -42331 -62277 31705 95369 46786 43715
15160D3715J143J20822p3340j69648J7999L2539K9897N7796R842p0970q8899L3182
$$ 43715 44858 165680 92340 -77308 -59309 -26770 3127 60923 70765 -205 -89104 -55922
15148e5922K9738l4798m9100J12235O078k7854O685L2790J08575P898j07110J1490
$$ -55922 -26184 -60982 -110082 2153 8231 -19623 -12938 19852 128427 136325 29215 40705
15136D0705M985j17148l432O6687j5765j943k2676P2553N6832J30348M7903j33119
$$ 40705 45690 -71458 -74890 -8203 -23968 -25911 -48587 23966 80798 211146 259049 125930
15124A25930j57054K543q444l1611O068P953L6996r90r340o3622J6690j2545M4549
$$ 125930 -31124 -28581 -37025 -68636 -62568 -54615 -17619 -18609 -27949 -91571 -74881 -87426 -42877
15111d2877J9755m7025l6895p2660O724j4512j4469O2904J10986O7489q4206j6504
$$ -42877 -23122 -70147 -107042 -179702 -172978 -187490 -201959 -139055 -28069 39420 -44786 -61290
15099f1290L0303J5119k256L2085O498j9271k1994P224m343l0343J3814O7226
$$ -61290 -30987 -15868 -18124 13961 20459 1188 -20806 -13582 -17925 -48268 -34454 32772
15087C2772K6504L7053J4675p0426p1203m9628J8098K0418l2521k953L7324O6146
$$ 32772 59276 96329 111004 40578 -30625 -80253 -62155 -41737 -74258 -77211 -39887 26259
15075B6259j41345q0685Q2755j8676N1202R4960k9479P5K6067q0603l3818L887
$$ 26259 -115086 -195771 -113016 -131692 -80490 14470 -15009 -14934 11133 -69470 -103288 -99401
15063i9401N7086k8426m8530N3435Q2463M9778R86m5008L4362L6248j1996m6659
$$ -99401 -42315 -70741 -119271 -65836 16627 66405 67391 22383 56745 92993 80997 34338
15051C4338q5912l7909J1362J1613J3669m060o0071K7480J25218l9471q3827J32146
$$ 34338 -51574 -89483 -78121 -66508 -52839 -56899 -116970 -89490 35728 -3743 -87570 44576
15039D4576M7106l0135o0846j9481o8547o7895J0256k504Q7571L0343J1426N850
$$ 44576 91682 61547 701 -18780 -87327 -155222 -144966 -147470 -59899 -29556 -18130 -12280
15027a2280J5637l8410k1354K5949J2770J7866m7933N6358J21997L4489m1808
$$ -12280 3357 -35053 -56407 -30458 -17688 178 -47755 8603 130600 165089 123281
15016A23281l8612l9884o6240j3708k8302k9316o9196j0126R3404M5135j5633
$$ 123281 84669 44785 -21455 -35163 -63465 -92781 -161977 -172103 -78699 -33564 -49197
15005d9197j5307p0181M338Q009R1101M3601k2476L3403l0024j5393l989k2185
$$ -49197 -64504 -134685 -130347 -122338 -31237 12364 -10112 23291 -6733 -22126 -26115 -48300
14993d8300M8526L2281J5371k642p2262o584p175m6999J6497j7010r897n6720
$$ -48300 226 32507 47878 45236 -27026 -33610 -40785 -87784 -71287 -88297 -98194 -154914
14981a54914L7091n4359J1161K4421J8813O0924M3897N2876l8881r265o2770O825
$$ -154914 -117823 -172182 -161021 -136600 -117787 -56863 -12966 39910 1029 -8236 -71006 -64181
14969f4181p708J5121J4773j2001L6744J1937O4919n8516P5j8505O6730J7243
$$ -64181 -71889 -56768 -41995 -53996 -17252 -5315 59604 1088 1163 -17342 49388 66631
14957F6631L5598M7811j1600j8996n5468k7376N4582m7527q7093K8967m3971l8314
$$ 66631 102229 150040 138440 119444 63976 36600 91182 43655 -43438 -14471 -58442 -96756
14945i6756j9158l7647Q2697M07N8757O7729q2918l8009M4968m0017J1466N8954
$$ -96756 -115914 -153561 -70864 -70457 -11700 56029 -26889 -64898 -19930 -59947 -48481 10473
14933A0473O0538k0329K0898k218k0421O3339k7496n3033k821k4670N7241k0343
$$ 10473 71011 50682 71580 69362 48941 112280 84784 31751 28930 4260 61501 41158
14921D1158l5382j6213j1472n0990J0239M8519P1066k5110p5565N9309K178j7761
$$ 41158 5776 -10437 -21909 -72899 -62660 -14141 56925 31815 -43750 15559 17737 -24
14909b4m0851J216r4928N8112O2151L6665Q881j461J0300m9084l7701N1588L3720
$$ -24 -40875 -39659 -134587 -76475 -14324 22341 31222 29761 40061 -9023 -46724 4864 38584
14896C8584o9920l0926r401K989Q50J848P7795L1351l1662r345L8056j8491Q789
$$ 38584 -31336 -62262 -71663 -68674 -67824 -65976 11819 43170 11508 2163 40219 21728 30517
14883C0517J21229n8702l7026m0673L835M1737l4209m2113m965J24477p955j23911
$$ 30517 151746 93044 56018 15345 19180 60917 26708 -15405 -20370 104107 96152 -27759
14871b7759p5675P930L3607O1682L9235M0737L164L57M031j10478J3019R4480
$$ -27759 -103434 -95504 -61897 -215 39020 79757 82921 83278 87309 -23169 -10150 84330
14859H4330m4984l0080P0949j3022L1050J524r3803l6932p2045o2190N0680N8621
$$ 84330 39346 9266 80215 67193 98243 99767 5964 -30968 -103013 -165203 -114523 -55902
14847e5902p757J693L5694K4392o992l698n4109o2057M8402L8957J8691K7745
$$ -55902 -63659 -61966 -26272 -1880 -8872 -12570 -66679 -128736 -80334 -41377 -22686 5059
14835E059Q9677R1691n4552O535j7597q3087l6624p5071K2462M0777p8314m6621
$$ 5059 94736 186427 131875 138410 120813 37726 1102 -73969 -51507 -10730 -89044 -135665
14823a35665M7494P2288n651l3263M795q417l5100K5485P0309N2161k4626Q5955
$$ -135665 -88171 -15883 -21534 -54797 -50002 -58419 -93519 -68034 2275 54436 29810 115765
14811A15765l4251r6568l0730k6828l1586l0278K6303O3010r0595K1014Q1341
$$ 115765 81514 -15054 -45784 -72612 -104198 -134476 -108173 -45163 -135758 -114744 -33403
14800c3403J6292j7715Q4943P7589J8510l7517j44626K384J37849N571l5311l6749
$$ -33403 -17111 -34826 50117 127706 146216 108699 -35927 -33543 104306 109877 74566 37817
14788C7817J8253n2259O9006J5751l3788q7152q2415J5620p810m2356J6444M2898
$$ 37817 56070 3811 72817 88568 54780 -32372 -114787 -99167 -106977 -149333 -132889 -89991
14776h9991Q2787L5145K3595m2572o1909o1206L607J01103k073l1360J7602Q7588
$$ -89991 -7204 27941 51536 8964 -52945 -114151 -110544 -9441 -11514 -42874 -25272 62316
14764F2316M5913q0644J4113j43245p7561o3426J40006R9876M164N9078m9388
$$ 62316 108229 27585 41698 -101547 -179108 -242534 -102528 -2652 1512 60590 11202
14753A1202r995Q7712l803r8473k9219j7705n7216O128K2585J9296M520J9202
$$ 11202 1207 88919 85116 -13357 -42576 -60281 -117497 -111369 -88784 -69488 -64968 -45766
14741d5766M9219J0014n6364n6805L3723J01200p4830l3440Q7999P7784K1296
$$ -45766 3453 13467 -42897 -99702 -65979 35221 -39609 -73049 14950 92734 114030
14730A14030K0968m3933k529j6241l4528l4879M742L6319j0070m9548l7874M8656
$$ 114030 134998 91065 88536 72295 37767 2888 7630 43949 33879 -15669 -53543 -4887
14718d887M5653m3580j162N5823m3984p2502j7208p0661K7294R0579M7662Q0060
$$ -4887 40766 -2814 -3976 51847 7863 -64639 -81847 -152508 -125214 -34635 13027 93087
14706I3087k6028j5088J8389o5574k6841m5462K457O8854l346q7530J1396N766
$$ 93087 67059 51971 70360 4786 -22055 -67517 -65060 3794 448 -87082 -75686 -69920
14694f9920N0983M7798Q851n1767m5618M3519m4312m7735r861l5873n0148J6789
$$ -69920 -18937 28861 37712 -14055 -59673 -16154 -60466 -108201 -118062 -153935 -204083 -187294
14682a87294J8689Q4845Q109n5325r9643l5480J08256N4871J01607o3349j1877
$$ -187294 -168605 -83760 -75651 -130976 -230619 -266099 -157843 -102972 -1365 -64714 -76591
14671g6591L4951m7906k533l1607K4841Q608L97n3233K4669m127M599k1095K2773
$$ -76591 -41640 -89546 -92079 -123686 -98845 -90237 -89840 -143073 -118404 -122531 -117932 -139027 -116254
14658a16254J00954N4327n1810j9595k6309K6792K4464K340J29764L7468K7785
$$ -116254 -15300 39027 -12783 -32378 -58687 -31895 -7431 -5091 124673 162141 189926
14647A89926j109m912o8926j8582J1338k7485l6465n0515l1981K8257k4279L293
$$ 189926 188817 183905 114979 96397 107735 80250 43785 -6730 -38711 -10454 -34733 -31440
14635c1440J11626L7412q5975j8143j4026r1068L9772o3279q761L7243L0043K6095
$$ -31440 80186 117598 31623 13480 -546 -91614 -51842 -115121 -123882 -86639 -56596 -30501
14623c0501o955O4185K7372l3662L1127J9702n0799l1785l9011n4996P874O0478
$$ -30501 -37456 26729 54101 20439 51566 71268 20469 -11316 -50327 -105323 -97449 -36971
14611c6971J0709m6674j5003O6145k6754m0352l2495k8067K4844J8688J13708
$$ -36971 -26262 -72936 -87939 -21794 -48548 -88900 -121395 -149462 -124618 -105930 7778
14600G778N7310k2459j8154K1120j5161K670P1113l4773l1884l2640j40849m5338
$$ 7778 65088 42629 24475 45595 30434 33104 104217 69444 37560 4920 -135929 -181267
14588a81267M1460O1161J43009L7960n1433o0582j2522L2597K7563K1737J383
$$ -181267 -139807 -78646 64363 102323 50890 -9692 -22214 10383 37946 59683 61066
14577F1066K7100Q1287k1743m1977L0050j0519l1454j09050j9236K2790O3303
$$ 61066 88166 169453 147710 105733 135783 125264 93810 -15240 -34476 -11686 51617
14566E1617k8227n224Q7703j2216j03404q1700K1561o2412K6447j0484m1525n6069
$$ 51617 23390 18166 105869 93653 -9751 -91451 -69890 -132302 -105855 -116339 -157864 -213933
14554b13933L1651J42546K2632k3916J1651L2491j9010R3997J05428R5770m730
$$ -213933 -182282 -39736 -17104 -41020 -29369 3122 -15888 78109 183537 279307 274577
14543B74577j05955n0232k609K83j3543J358l3574q536p8347K0891K745j4192
$$ 274577 168622 118390 115781 116064 102521 103879 70305 61769 -16578 4313 7058 -7134
14531g134j8525n2897k2893o8450k5895Q1172M6197J03824l4874L8380P22o9003
$$ -7134 -25659 -78556 -101449 -169899 -195794 -114622 -68425 35399 525 38905 39627 -29376
14519b9376p9878M111M2384O1253K0942k6091M93m0399j276J6965m3880m4846
$$ -29376 -109254 -105143 -62759 -1506 19436 -6655 -6162 -46561 -47837 -30872 -74752 -119598
14507a19598L0874m8035J4149Q224J1335n9285J7249K6677l7696M176K2639N1066
$$ -119598 -88724 -136759 -122610 -114386 -103051 -162336 -145087 -118410 -156106 -151930 -129291 -78225
14495g8225R6683O5221p4084q3407N2945M7426m8551q087n0368P1281O1062m9628
$$ -78225 18458 83679 9595 -73812 -20867 26559 -21992 -30079 -80447 -9166 51896 2268
14483B268k2962O2244K1584l7567r5884k5454L4358K7654j2503l2036l3952N9581
$$ 2268 -20694 41550 63134 25567 -70317 -95771 -61413 -33759 -46262 -78298 -112250 -52669
14471e2669O739l1596j54878m0185J21283J35759j6437p907M5423P3532l275Q3485
$$ -52669 -45930 -77526 -232404 -272589 -151306 -15547 -31984 -39891 5532 79064 75789 159274
14459A59274j2956j21618K6925n2463l6851m4915N835R7480R8939k4791n1941
$$ 159274 146318 24700 51625 -838 -37689 -82604 -76769 20711 119650 94859 42918
14448D2918l8967q6444k314J9248J217J3582P7588N8169j4532n055p3318n4200
$$ 42918 3951 -82493 -84807 -65559 -64342 -50760 26828 84997 70465 65410 -7908 -62108
14436f2108M6221J6537O5512j5226k7328m796K5216o0983k9628L6604J2158M0690
$$ -62108 -15887 650 66162 50936 23608 18812 44028 -16955 -46583 -9979 2179 42869
14424D2869K1952M3770m2140L2786q6817p1449n686K8240O0032l72k5143J3781
$$ 42869 64821 108591 66451 99237 12420 -59029 -64715 -36475 23557 23185 -1958 11823
14412A1823J5134n9680j3865Q5460N7758l2304l4954K4056l5384o2406Q516L3645
$$ 11823 26957 -32723 -46588 38872 96630 64326 29372 53428 18044 -44362 -35846 -2201
14400b201O196j9275k7474L6162M88k499N6592k9827n5916R917k9244M841N4797
$$ -2201 3995 -15280 -42754 -6592 -6104 -8603 47989 18162 -37754 -27837 -57081 -52240 2557
14387B557j6839j0517K8531M5676M0982m8590l5197l5154j26749J3524Q2407K7488
$$ 2557 -14282 -24799 3732 49408 90390 41800 6603 -28551 -155300 -141776 -59369 -31881
14375c1881J05l1076n6630k9813M0347N1645m709l4637m140o4268l5277J01844
$$ -31881 -31776 -62852 -119482 -149295 -108948 -57303 -62012 -96649 -100789 -165057 -200334 -98490
14363i8490N7227m6450l2209J3414J7020L1459o2353K2337N9184K1882j5531J7636
$$ -98490 -41263 -87713 -119922 -106508 -89488 -58029 -120382 -98045 -38861 -16979 -32510 -14874
14351a4874q1493J11006R6389j6181o6125l4238o3450l2369M8899J01765k963
$$ -14874 -96367 14639 111028 94847 28722 -5516 -68966 -101335 -52436 49329 46366
14340D6366r2888l7517J9345O9158j9186n6192l266O907k3236J9690Q7632L2569
$$ 46366 -46522 -84039 -64694 4464 -14722 -70914 -74180 -67273 -90509 -70819 16813 49382
14328D9382k8578r4240m139O5472M3188K9587O4495m6875q0607o1468l1595n939
$$ 49382 20804 -73436 -77575 -12103 31085 60672 125167 78292 -2315 -63783 -95378 -101317
14316a01317J3523J7363Q0722J15669L4933n840l5036q8550p7567M2556j6024
$$ -101317 -87794 -70431 10291 125960 160893 155053 120017 31467 -46100 -3544 -19568
14305a9568n4909L4961k1013n0581N639P4645J3625R5415j2367q2976k1368L5050
$$ -19568 -74477 -39516 -60529 -111110 -105471 -30826 -17201 78214 65847 -17129 -38497 -3447
14293c447l13l1142O1958L3520p5168o4690N2282K1979j6034j4808l6990J0137
$$ -3447 -3760 -34902 27056 60576 -14592 -79282 -27000 -5021 -21055 -35863 -72853 -62716
14281f2716l4752J37661Q9644M74m8813o4640L5099l3755l5088l2138L1119Q3861
$$ -62716 -97468 40193 129837 130311 81498 16858 51957 18202 -16886 -49024 -17905 65956
14269F5956N2174o8740L127K7519j8775n6401j3511N939l7236K4511O1064J08787
$$ 65956 118130 49390 52517 80036 61261 4860 -8651 -2712 -39948 -15437 45627 154414
14257A54414J5403j5786l0187j1108k0719m8385l2656N5628l8662n7145K7643
$$ 154414 169817 154031 123844 112736 92017 43632 10976 66604 27942 -29203 -1560
14246a560Q1272K8493n527O5727j416l5010o8273k5059J2111K9684P9995m3118
$$ -1560 79712 108205 102678 168405 166989 131979 63706 38647 50758 80442 160437 117319
14234A17319n6600k8757J5971L9566l6284j2791p1611M2324j4035n3335n5468
$$ 117319 60719 31962 47933 87499 51215 38424 -33187 9137 -4898 -58233 -113701
14223a13701k9999Q568o2289L1226J7097P8743K5199j0168j942O5199L5066K6746
$$ -113701 -143700 -135132 -197421 -166195 -149098 -70355 -45156 -55324 -57266 7933 42999 69745
14211F9745J5217q3938n4885k0279R7420R6699K9662q0740m2972m3459K2778N0164
$$ 69745 84962 1024 -53861 -74140 23280 119979 149641 68901 25929 -17530 5248 55412
14199E5412R904L9471n266L2585o508n9759p0101J3453K9682l5644o0071j0682
$$ 55412 65316 104787 99521 132106 125598 65839 -4262 9191 38873 3229 -56842 -67524
14187f7524M3995K0251L9659p1339n062K5404K08l3977l1080k9678j9665N1169
$$ -67524 -23529 -3278 36381 -34958 -40020 -14616 -14408 -48385 -79465 -109143 -128808 -77639
14175g7639O5512P2965l1434n6146j0769M815J4994R71q4830M2106L5927K910
$$ -77639 -12127 60838 29404 -26742 -37511 -32696 -17702 -16731 -101561 -59455 -23528 -20618
14163b0618N3571L3578m5392j17482k6329R552K620P3226P0455O5393l9832L074
$$ -20618 32953 66531 21139 -96343 -122672 -113120 -110500 -37274 33181 98574 58742 61816
14151F1816j02145p7676J00550L5401N5840j9382J4047j402o5916k2111j6626
$$ 61816 -40329 -118005 -17455 17946 73786 54404 68451 67049 1133 -20978 -37604
14140c7604m6961L3339L4514J4856J3569j823M7474P5427M9954q2117q7220l9861
$$ -37604 -84565 -51226 -16712 -1856 11713 9890 57364 132791 182745 100628 13408 -26453
14128b6453o9388J9671N5303J7477J0889m8878n5862j2798M0177q416K4009o779
$$ -26453 -95841 -76170 -20867 -3390 7499 -41379 -97241 -110039 -69862 -78278 -54269 -61048
14116f1048J1898J5632o4597o165L5985P1972J9751J712k6688M193j0025n7136
$$ -61048 -49150 -33518 -98115 -104280 -68295 3677 23428 25140 -1548 2645 -7380 -64516
14104f4516o4977k6140K9248N0101N8841L6088q157o5735n6996L5077J9563J14097
$$ -64516 -129493 -155633 -126385 -76284 -17443 18645 10488 -55247 -112243 -77166 -57603 56494
14092E6494N1705n0168l0330K3769j0222k8375l5932J2949j3234o7486M211L8222
$$ 56494 108199 58031 27701 51470 41248 12873 -23059 -10110 -23344 -90830 -86619 -48397
14080d8397M9056M0563K4721l3092M672n8219j9682J6787P8608n555J1746K4944
$$ -48397 659 41222 65943 32851 37523 -20696 -40378 -23591 55017 49462 61208 86152
14068H6152j3858j00372o077J2450j08961k3578m0232J10843Q4939O0676K4175
$$ 86152 72294 -28078 -34155 -21705 -130666 -154244 -194476 -83633 1306 61982 86157
14057H6157l1918m7085O9306P3319q2129p3615p9727l3725J05600R1241k4569
$$ 86157 54239 7154 76460 149779 67650 -5965 -85692 -119417 -13817 77424 52855
14046E2855p9186l5651R5491j9825q5419r281L0642j13956l5787R7315L7733L6437
$$ 52855 -26331 -61982 33509 13684 -71735 -81016 -50374 -164330 -200117 -102802 -65069 -28632
14034b8632n275L2128P7952o091j1149j023n7032L0836K3441Q2555L6389k9230
$$ -28632 -33907 -1779 76173 70082 58933 57910 878 31714 55155 137710 174099 144869
14022A44869p4583p8924o9738J0267J4300o8738O8584K7906m3449K266L4300L2920
$$ 144869 70286 -8638 -78376 -68109 -53809 -122547 -53963 -26057 -69506 -67240 -32940 -20
14010b0J0872p624o1524R043J0922J3492M0133j0951k4998L5005Q859o4969n6187
$$ -20 10852 3228 -58296 -49253 -38331 -24839 15294 4343 -20655 14350 23209 -41760 -97947
13997i7947M8368K0655k7575m1399j1061o6824J3899J4402M4820M9547L783O5758
$$ -97947 -49579 -28924 -56499 -97898 -108959 -175783 -161884 -147482 -102662 -53115 -49332 16426
13985A6426n2052r858N0447N6332p8257j402l7349m6366l6353K246k3240N920
$$ 16426 -35626 -45484 4963 61295 -16962 -18364 -55713 -102079 -138432 -136186 -159426 -153506
13973a53506M4885O7310J2527n4711O3305J34290K5490n3361Q958J27827K6409
$$ -153506 -108621 -41311 -28784 -83495 -20190 114100 139590 86229 95187 223014 249423
13962B49423p1427q3916l8925k0571n0216K460n8712o4958J8057Q9658M7619k9836
$$ 249423 177996 94080 55155 34584 -15632 -13172 -71884 -136842 -118785 -29127 18492 -11344
13950a1344L0551k2658l5052l7880O0819K1980o4854k4697P9274J7931j477k8869
$$ -11344 19207 -3451 -38503 -76383 -15564 6416 -58438 -83135 -3861 14070 12593 -16276
13938a6276K9352l5502p8345N4573K8885n440j0975p116m2668j1005N1474N1170
$$ -16276 13076 -22426 -100771 -46198 -17313 -22753 -33728 -40844 -83512 -94517 -43043 8127
13926H127N018l8570l5940N3507R1284m3068j7800K1490p720o9095m647L1890
$$ 8127 13145 -25425 -61365 -7858 83426 40358 22558 44048 36328 -32767 -37414 -5524
13914e524O780N228Q2667M9582n4049K578L3824N1115l4963j15137l2450k157
$$ -5524 1256 6484 89151 138733 84684 87262 121086 172201 137238 22101 -10349 -12506
13902a2506K9935L6070p1867o8040k2355O0695j701p2466m1928M5909M2800L9979
$$ -12506 17429 53499 -18368 -86408 -108763 -48068 -49769 -122235 -164163 -118254 -75454 -35475
13890c5475k926O355M8093J0954K1342O9664M3495K6527n6366j4530m3960J4731
$$ -35475 -38401 -32046 16047 27001 48343 118007 161502 188029 131663 117133 73173 87904
13878H7904l6008j9851j5022N9314N5249n2968m3533J8775L5738m5276k0269q106
$$ 87904 51896 32045 17023 76337 131586 78618 35085 53860 89598 44322 24053 15947
13866A5947k7569k6984K7765j3208k104l1706j4119n3556P8039M3971K4610n5104
$$ 15947 -11622 -38606 -10841 -24049 -26153 -57859 -71978 -125534 -47495 -3524 21086 -34018
13854c4018n7089p7219l2936J31648N336r015M5236K4852K8825n0687k3611J575
$$ -34018 -91107 -168326 -201262 -69614 -64278 -73293 -28057 -3205 25620 -25067 -48678 -47103
13842d7103K2494O114j5715K403N0467M500L4915M8351l6859m8910p2721o9189
$$ -47103 -24609 -18495 -34210 -31807 18660 23160 58075 106426 69567 20657 -52064 -121253
13830a21253R222J9626L6473r665n8397p4905R1970J03768L3565j13317J8421
$$ -121253 -112031 -92405 -55932 -65597 -123994 -198899 -106929 -3161 30404 -82913 -64492
13819f4492N7338O9784M9856r304n6987Q770j01251o848L698j4134J7509J1866
$$ -64492 -7154 62630 112486 103182 46195 54965 -46286 -53134 -49436 -63570 -46061 -34195
13807c4195O3384K6158p1698n0879P403j9543J6543M6972q7986m8626j715J7763
$$ -34195 29189 55347 -16351 -67230 -59827 -79370 -62827 -15855 -103841 -152467 -154182 -136419
13795a36419j6675l2929N1036P0727j4986j0985O9776Q2337R0363K8732k8293
$$ -136419 -153094 -186023 -134987 -64260 -79246 -90231 -20455 61882 152245 180977 152684
13784A52684N676l7603o3553n8158P1764l0816n5555K8554m2602M5902P0216L6064
$$ 152684 158360 120757 57204 -954 70810 39994 -15561 12993 -29609 16293 86509 122573
13772A22573n2900N671j3466L654p780m3887o69M046n881P5972r140k8982k0352
$$ 122573 69673 75344 61878 65532 57752 13865 13196 17242 11361 87333 78193 49211 28859
13759B8859p8611K1565R3993o2260l0124P819L6108l0762o7755k7132N9385K0482
$$ 28859 -49752 -28187 65806 3546 -26578 -18759 17349 -13413 -81168 -108300 -48915 -28433
13747b8433n1038r836L8860l3789j4988K4962k6571N1260O5649K7704N8586m2721
$$ -28433 -79471 -89307 -50447 -84236 -99224 -74262 -100833 -49573 16076 43780 102366 59645
13735E9645m7242L946m667l730j0011o0981j2954N8047Q2384P1368k1465m7054
$$ 59645 12403 16349 11682 7952 -2059 -63040 -75994 -17947 64437 135805 114340 67286
13723F7286q7032N7627P7627k5029n3382q2026p4954K665P2492J07419J12433
$$ 67286 -19746 37881 115508 90479 37097 -44929 -119883 -117218 -44726 62693 175126
13712A75126m0458q7354L2615N112l9556l1904J1979J47385N8941m9445m9877
$$ 175126 134668 47314 79929 85041 45485 13581 25560 172945 231886 182441 132564
13701A32564j00552p2079r25N9023L0601j13877n3494J01422l5136J4173l5070
$$ 132564 32012 -40067 -40992 18031 48632 -65245 -118739 -17317 -52453 -38280 -73350
13690g3350M9548K3940J109j0024L1097K4774K670m9883j2840O8168L3064N8151
$$ -73350 -23802 138 1247 -8777 22320 47094 49764 -119 -12959 55209 88273 146424
13678A46424m9470j9730p0953R381l6075K1477N5218R271J6574l3390m4897K020
$$ 146424 96954 77224 6271 15652 -20423 1054 56272 65543 82117 48727 3830 5850
13666E850Q535N5140L2211l8354L1680p2330k3695o2405M6390o420p826k9721
$$ 5850 14385 69525 101736 63382 95062 22732 -963 -63368 -16978 -23398 -31224 -60945
13654f0945J6812Q157k3778M5681O2444o3816o20m888m7236m0497L6215J0554
$$ -60945 -44133 -35976 -59754 -14073 48371 -15445 -16065 -20953 -68189 -108686 -72471 -61917
13642f1917n8960J0623K3434k3239n3990P8417P3484J15472j04533p648n1815
$$ -61917 -120877 -110254 -86820 -110059 -164049 -85632 -12148 103324 -1209 -8857 -60672
13631f0672L3026N0478j5641P3352l837j02422o5849J58518K4731j13043o6649
$$ -60672 -27646 22832 7191 80543 76706 -25716 -91565 66953 91684 -21359 -88008
13620h8008l6429P4824M5896k1308M5527J3068M2539j9482n1278j10764j3078
$$ -88008 -124437 -49613 -3717 -25025 20502 33570 76109 56627 5349 -105415 -118493
13609a18493n1067P5873N5713J7006R2246o006K8603k4107m7758N4149K1669M2851
$$ -118493 -169560 -93687 -37974 -20968 71278 65272 93875 69768 22010 76159 97828 140679
13597A40679O3044r1727p9298K117l1065K8817r719L66K7001N3203o7507o0988
$$ 140679 203723 111996 32698 34815 3750 32567 22848 23214 50215 103418 35911 -25077
13585b5077m1162K4475k8056K0703l1320m2199K3035L1841N3451J00995J0891
$$ -25077 -66239 -41764 -69820 -49117 -80437 -122636 -99601 -67760 -14309 86686 97577
13574I7577O351N0544j854j44057j34331m4518J25036j1509J1321n3272M7151
$$ 97577 103928 154472 152618 8561 -125770 -170288 -45252 -56761 -45440 -98712 -51561
13563e1561j5312R569o900K5120Q3836M4226o7785o1562l7597n4534J17834N4255
$$ -51561 -66873 -57304 -64204 -39084 44752 88978 21193 -40369 -77966 -132500 -14666 39589
13551C9589j02622m6053Q8577R5485Q0117R315n3069k6794p1032q1860M3796l5997
$$ 39589 -63033 -109086 -20509 74976 155093 164408 111339 84545 13513 -68347 -24551 -60548
13539f0548K0777K7812P5739M5299N1113J2876o3872O8797J11766l8493l3885
$$ -60548 -39771 -11959 63780 109079 160192 173068 109196 177993 289759 251266 217381
13528B17381J9812P096o7150q9592j3073O4685K752J5175k3926r3049L7319k6749
$$ 217381 237193 244289 177139 87547 74474 139159 141911 157086 133160 40111 77430 50681
13516E0681K5479O380K2258k7258m1363j0705k7620l6958p1612k3648R0549k2861
$$ 50681 76160 82540 104798 77540 36177 25472 -2148 -39106 -110718 -134366 -43817 -66678
13504f6678m5523k4054k390L401k6214M8852P6034N0569N4334O770M1640q253
$$ -66678 -112201 -136255 -138645 -135244 -161458 -112606 -36572 13997 68331 75101 116741 108488
13492A08488o4387k6309l5487L0918J3479J4707R0274J2333j3823l9534m2672
$$ 108488 44101 17792 -17695 13223 26702 41409 131683 144016 130193 90659 47987
13481D7987l2921L7083R6946K1536J0357J10741M5385M3878r9914j23954o9807
$$ 47987 15066 52149 149095 170631 180988 291729 337114 380992 281078 157124 87317
13470H7317n6832N170P504m9641p8194R379N4623J38979m2041j31409m1051L2656
$$ 87317 30485 35655 43159 -6482 -84676 -75297 -20674 118305 76264 -55145 -96196 -63540
13458f3540J17369J104r6302K6630M2714J8480K9891N5999L961n5820M853M0682
$$ -63540 53829 54933 -41369 -14739 27975 46455 76346 132345 136306 80486 85339 126021
13446A26021J7177q249q9558M3121m6015l8167o459O1200J4789m3314o7423Q620
$$ 126021 143198 134949 45391 88512 42497 4330 -2129 59071 73860 30546 -36877 -28257
13434b8257K0917J30542J37027m1088n9921n713n4344J3013r6576j2744Q863R757
$$ -28257 -7340 123202 260229 219141 159220 153507 99163 112176 15600 2856 11719 21476
13422B1476j9021n8010j4409L009Q3017M911J5076K2665o51K7874o0250n0392
$$ 21476 2455 -55555 -69964 -66955 16062 20973 36049 58714 58063 85937 25687 -24705
13410b4705k0643l9524O1434O1313m8627M643K3419L6575M9103N4653m3976j30699
$$ -24705 -45348 -84872 -23438 37875 -10752 -6109 17310 53885 102988 157641 113665 -17034
13398a7034r1406N8369O8580M1256k7934m6346P1156L6694j13400K838O4740J856
$$ -17034 -108440 -50071 18509 59765 31831 -14515 56641 93335 -20065 -17227 47513 49369
13386D9369K902L5363M5502P2479m5715j4402l9749O666n903j4797K5682K0086
$$ 49369 52271 87634 133136 205615 159900 145498 105749 112415 106512 91715 117397 137483
13374A37483j8097L2621K8564q758P3221J33242J87082K5952r1176j09032j63189
$$ 137483 119386 152007 180571 171813 245034 378276 565358 591310 500134 391102 227913
13363B27913o2289p6555J6875N5989O2802o9363l2348k2628m9798N577O2938O5682
$$ 227913 165624 89069 105944 161933 224735 155372 123024 100396 50598 56175 119113 184795
13351A84795J4765q6538m0631L1110J0392m5814m2725J00566J0471M7855l969
$$ 184795 199560 113022 72391 103501 113893 68079 25354 125920 136391 184246 180277
13340A80277j05283o5463J4237L6180K1879n5721l5091j10449O5178O4317N8497
$$ 180277 74994 9531 23768 59948 81827 26106 -8985 -119434 -54256 10061 68558
13329F8558o9144l1126Q1905K0359P6727J48698P6528M426J2762r9236l5233j00344
$$ 68558 -586 -31712 50193 70552 147279 295977 372505 376931 389693 290457 255224 154880
13317A54880q9420l2954L3530k8432n3108q771m7749r437j0476J6575M5317l3724
$$ 154880 65460 32506 66036 37604 -15504 -24275 -72024 -81461 -91937 -75362 -30045 -63769
13305f3769m3981J8619M1967k9941r0772k9913J25226L4692q2146l2912M1870
$$ -63769 -107750 -89131 -47164 -77105 -167877 -197790 -72564 -37872 -120018 -152930 -111060
13294a11060J17995J2976j9763o0393L2210L7776L5051m6969p4121R5919M0787
$$ -111060 6935 19911 148 -60245 -28035 9741 44792 -2177 -76298 19621 60408
13283F0408N1867k9533Q3483O6246n8815n459p6680K6187R2923q1012j38432k9449
$$ 60408 112275 82742 166225 232471 173656 168197 91517 117704 210627 129615 -8817 -38266
13271c8266p3242K4116j8859L1446O947l7744k5786j4565P3045Q9769J2324j0031
$$ -38266 -111508 -87392 -106251 -74805 -67858 -105602 -131388 -145953 -72908 16861 29185 19154
13259A9154N723k2335K395Q1799k5782m4249k377r0000l5352M9117J65761P6174
$$ 19154 24877 2542 4937 86736 60954 16705 14328 -75672 -111024 -61907 103854 180028
13247A80028K9367m1942k9798n9792n1070K1552n0761k0605J0748N762M2784o9937
$$ 180028 209395 167453 137655 77863 26793 48345 -2416 -23021 -12273 -6511 36273 -33664
13235c3664r7054L0412O9546N392n0371J0581P5651k2016J07221M2361n1477m6897
$$ -33664 -130718 -100306 -30760 -25368 -75739 -65158 10493 -11523 95698 138059 86582 39685
13223C9685l5554k7919M645J9374m1233L3763L5372M6820o0981o0364l7764n8725
$$ 39685 4131 -23788 -19143 231 -41002 -7239 28133 74953 13972 -46392 -84156 -142881
$$ [...]
##END NTUPLES=NMR SPECTRUM
##END=
