##TITLE=Analysis number 329961
Compound Code cc 67809
Book Reference 521/123
Project Code adrs
Chemist Name evam
##JCAMPDX= 6.0         $$ Bruker NMR JCAMP-DX V2.0
##DATA TYPE= NMR SPECTRUM
##DATA CLASS= NTUPLES
##ORIGIN= Bruker BioSpin GmbH
##OWNER= nmr
$$ XWIN-NMR		Version 3.5
$$ Tue Oct 16 09:31:57 2007 GMT Daylight Time (UT+1h)  MAYBRIDGE\nmr@NMR_250MHZ
##.OBSERVE FREQUENCY= 250.131544655141
##.OBSERVE NUCLEUS= ^1H
##.ACQUISITION MODE= SIMULTANEOUS (DQD)
##.ACQUISITION SCHEME= undefined
##.AVERAGES= 16
##.DIGITISER RES= 18
##SPECTROMETER/DATA SYSTEM= dpx250
##.PULSE SEQUENCE= zg30
##.SOLVENT NAME= CDCl3
##.SHIFT REFERENCE= (INTERNAL, CDCl3, 0, 16.522)
##AUDIT TRAIL= $$ (NUMBER, WHEN, WHO, WHERE, WHAT)
$$ ##TITLE= Audit trail, XWIN-NMR		Version 3.5
$$ ##JCAMPDX= 5.01
$$ ##ORIGIN= Bruker BioSpin GmbH
$$ ##OWNER= nmr
$$ C:\u/data/dgb/nmr/ADRS/800/pdata/1/auditp.txt
$$ ##AUDIT TRAIL=  $$ (NUMBER, WHEN, WHO, WHERE, WHAT)
(   1,<2007-10-16 09:31:33.57 +100>,<MAYBRIDGE\nmr>,<NMR_250MHZ>,
      <created by zg, POWCHK disabled, PULCHK disabled
       configuration hash MD5:
       76 6E 9A 78 1E 09 19 81 EC 84 63 8F B0 6A 59 2D
       data hash MD5: 64K
       4A 91 C7 F3 EC 7B 2C 80 B8 C4 0D C4 85 4E CF 03>)
(   2,<2007-10-16 09:31:47.88 +100>,<MAYBRIDGE\nmr>,<NMR_250MHZ>,
      <Start of raw data processing
       ef LB = 0.3 FT_mod = 6 PKNL = 1 SI = 32K 
       data hash MD5: 32K
       AB D5 5B 9C 68 C1 64 DC 82 89 AE DE 90 5C BA 8F>)
(   3,<2007-10-16 09:31:49.43 +100>,<MAYBRIDGE\nmr>,<NMR_250MHZ>,
      <apk 
       data hash MD5: 32K
       A6 A5 44 9E 83 FF 41 9A 5F E6 ED 1B 93 65 D7 53>)
(   4,<2007-10-16 09:31:50.15 +100>,<MAYBRIDGE\nmr>,<NMR_250MHZ>,
      <abs ABSG = 5 
       data hash MD5: 32K
       DA E2 EF 83 77 02 55 64 C1 1B EF 8F 3A 34 43 BF>)
$$ ##END=
$$ 
$$ hash MD5
$$ A9 C3 45 B3 81 B8 15 F6 4F 72 39 9C AC D6 87 66
##$RELAX= 
##$RELAX= 
##$RELAX= 
##$RELAX= 
##$RELAX= 
##$RELAX= 
##$RELAX= 
$$ Bruker specific parameters
$$ --------------------------
##$DU= <C:\u>
##$EXPNO= 800
##$NAME= <ADRS>
##$PROCNO= 1
##$TYPE= <nmr>
##$USER= <dgb>
##$AMP= (0..31)
100 100 100 100 100 100 100 100 100 100 100 100 100 100 100 100 100 100 
100 100 100 100 100 100 100 100 100 100 100 100 100 100 
##$AQSEQ= 0
##$AQ_mod= 3
##$AUNM= <au_zg>
##$AUTOPOS= <8 >
##$BF1= 250.13
##$BF2= 250.13
##$BF3= 250.13
##$BF4= 250.13
##$BF5= 500.13
##$BF6= 500.13
##$BF7= 500.13
##$BF8= 500.13
##$BYTORDA= 1
##$CFDGTYP= 0
##$CFRGTYP= 5
##$CHEMSTR= <none>
##$CNST= (0..31)
1 1 145 1 1 1 1 1 1 1 1 1 1 1 1 1 1 1 1 1 1 1 1 1 1 1 1 1 1 1 1 1 
##$CPDPRG= <>
##$CPDPRG1= <>
##$CPDPRG2= <>
##$CPDPRG3= <>
##$CPDPRG4= <mlev>
##$CPDPRG5= <mlev>
##$CPDPRG6= <mlev>
##$CPDPRG7= <mlev>
##$CPDPRG8= <mlev>
##$CPDPRGB= <>
##$CPDPRGT= <>
##$D= (0..31)
0 1 0 0 0 0 0 0 0 0.06 0 0 0 0 0 0 0.0002 0 0 0 0 0 0 0 0 0 0 0 0 0 0 
0 
##$DATE= 1192523492
##$DBL= (0..7)
120 120 120 120 120 120 120 120 
##$DBP= (0..7)
150 150 150 150 150 150 150 150 
##$DBP07= 0
##$DBPNAM0= <>
##$DBPNAM1= <>
$$ [...]
##$SUBNAM7= <"">
##$SUBNAM8= <"">
##$SUBNAM9= <"">
##$SW= 20.6930455092707
##$SWIBOX= (0..15)
0 0 3 0 0 0 0 0 0 0 0 0 0 0 0 0 
##$SW_h= 5175.983436853
##$TD= 65536
##$TD0= 1
##$TE= 296.16
##$TE2= 300
##$TE3= 300
##$TEG= 300
##$TL= (0..7)
0 120 120 120 120 120 120 120 
##$TP= (0..7)
150 150 150 150 150 150 150 150 
##$TP07= 0
##$TPNAME0= <>
##$TPNAME1= <>
##$TPNAME2= <>
##$TPNAME3= <>
##$TPNAME4= <>
##$TPNAME5= <>
##$TPNAME6= <>
##$TPNAME7= <>
##$TPOAL= (0..7)
0.5 0.5 0.5 0.5 0.5 0.5 0.5 0.5 
##$TPOFFS= (0..7)
0 0 0 0 0 0 0 0 
##$TUNHIN= 0
##$TUNHOUT= 0
##$TUNXOUT= 0
##$USERA1= <user>
##$USERA2= <user>
##$USERA3= <user>
##$USERA4= <user>
##$USERA5= <user>
##$V9= 5
##$VALIST= <valist>
##$VCLIST= <CCCCCCCCCCCCCCC>
##$VD= 0
##$VDLIST= <DDDDDDDDDDDDDDD>
##$VPLIST= <PPPPPPPPPPPPPPP>
##$VTLIST= <TTTTTTTTTTTTTTT>
##$WBST= 1024
##$WBSW= 4
##$XGAIN= (0..3)
0 0 0 0 
##$XL= 0
##$YL= 0
##$YMAX_a= 607094
##$YMIN_a= -659356
##$ZGOPTNS= <>
##$ZL1= 120
##$ZL2= 120
##$ZL3= 120
##$ZL4= 120
##$ABSF1= 16.522
##$ABSF2= -4.171173
##$ABSG= 5
##$ABSL= 3
##$ALPHA= 0
##$AQORDER= 0
##$ASSFAC= 0
##$ASSFACI= 0
##$ASSFACX= 0
##$ASSWID= 0
##$AUNMP= <proc_1d>
##$AZFE= 0.1
##$AZFW= 0.1
##$BCFW= 0
##$BC_mod= 0
##$BYTORDP= 0
##$COROFFS= 0
##$CY= 12.5
##$DATMOD= 1
##$DC= 0
##$DFILT= <>
##$DTYPP= 0
##$F1P= 14.0000005364418
##$F2P= -0.99999901652339
##$FCOR= 0.5
##$FTSIZE= 32768
##$FT_mod= 6
##$GAMMA= 0
##$GB= 0
##$INTBC= 1
##$INTSCL= 1
##$ISEN= 128
##$LB= 0.3
##$LEV0= 0
##$LPBIN= 0
##$MAXI= 10000
##$MC2= 0
##$MEAN= 0
##$ME_mod= 0
##$MI= 0
##$NCOEF= 0
##$NC_proc= -4
##$NLEV= 6
##$NOISF1= 0
##$NOISF2= 0
##$NSP= 0
##$NTH_PI= 0
##$NZP= 0
##$OFFSET= 16.522
##$PC= 1
##$PHC0= 155.2507
##$PHC1= 4.185046
##$PH_mod= 1
##$PKNL= yes
##$PPARMOD= 0
##$PSCAL= 4
##$PSIGN= 0
##$REVERSE= no
##$SF= 250.13
##$SI= 32768
##$SIGF1= 0
##$SIGF2= 0
##$SINO= 400
##$SIOLD= 32768
##$SREGLST= <1H.CDCl3>
##$SSB= 0
##$STSI= 32768
##$STSR= 0
##$SW_p= 5175.98343685301
##$SYMM= 0
##$S_DEV= 0
##$TDeff= 65536
##$TDoff= 0
##$TI= <Analysis number 999999
Compound Code 99
Book Reference 9
Project Code 9>
##$TILT= no
##$TM1= 0
##$TM2= 0
##$TOPLEV= 0
##$USERP1= <user>
##$USERP2= <user>
##$USERP3= <user>
##$USERP4= <user>
##$USERP5= <user>
##$WDW= 1
##$XDIM= 32768
##$YMAX_p= 312058133
##$YMIN_p= -200708
$$ End of Bruker specific parameters
$$ ---------------------------------
##NTUPLES= NMR SPECTRUM
##VAR_NAME=  FREQUENCY,     SPECTRUM/REAL,   SPECTRUM/IMAG
##SYMBOL=    X,             R,               I
##VAR_TYPE=  INDEPENDENT,   DEPENDENT,       DEPENDENT
##VAR_FORM=  AFFN,          ASDF,            ASDF
##VAR_DIM=   32768,         32768,           32768
##UNITS=     HZ,            ARBITRARY UNITS, ARBITRARY UNITS
##FACTOR=    0.157963299565203, 1,           1
##FIRST=     4132.6476996994, 0,             0
##LAST=      -1043.33573715361, 0,           0
##MIN=       -1043.33573715361, -200708,     0
##MAX=       4132.6476996994, 312058133,     0
$$ Real data points
##PAGE= N=1
##DATA TABLE= (X++(R..R)), XYDATA
$$ [...]
28968 -126695 -66112 -64524 -89151 -95788 -100181 -39720 37721 9492 -6593 31349 12024 -27465
28956 -27465 -27867 1656 -43981 -57581 -50431 -23587 -21979 -16258 -15359 5050 11284 -4554 -31124
28943 -31124 -62353 -36336 -45362 -35634 30234 97143 54388 42840 58 -9187 -34773 -20794
28931 -20794 -7657 -46945 -41338 -33545 -34476 -30736 10580 -11806 10857 21253 20228 -14670 -29336
28918 -29336 -16212 -59420 -42405 -66961 -45495 -7362 -16153 -58280 -80795 -54352 -57682 -11506
28906 -11506 41082 11617 -24885 -15664 -19467 -39471 -41001 -27530 -35068 -63808 -75084 -31839
28894 -31839 -35287 -51082 -40375 -2107 23519 35156 63638 91266 113282 75802 53763 9976
28882 9976 8376 40248 50025 26752 -18262 -26639 -11725 8454 49764 78482 40235 -5460
28870 -5460 17434 51976 37028 9837 21652 28228 -3689 43152 81778 81208 27232 51979
28858 51979 60872 38007 26281 14496 34104 -27603 -65451 -38857 -78281 -95508 -81901 -60766
28846 -60766 -61475 -76558 -21258 5674 -33608 -82712 -93087 -61285 2789 19614 -3769 -40636
28834 -40636 -60812 -15103 28874 20000 9497 -16210 -26269 -2202 -5813 2078 39336 8652
28822 8652 6713 27442 26174 16680 -19506 -11819 -11098 -38769 -46769 -39037 38112 72129 46779
28809 46779 10901 62430 71421 23529 -20238 -27457 -14347 20854 40659 25904 58688 67817
28797 67817 57981 -5521 -31434 -16761 -6727 -17666 -103070 -25545 -38624 -52454 -7477 49142
28785 49142 69688 32875 -16093 -21769 -1057 1893 21551 34137 13135 -48786 -33083 60137
28773 60137 106001 53561 44886 120081 116160 80636 62635 25204 2447 -4518 11451 50146
28761 50146 1453 -15034 -3163 -13381 -20774 -5167 -12468 -2813 40146 45507 22966 -7902
28749 -7902 -30548 10270 -15304 -7702 -5830 11998 21312 -6438 6971 -13602 -6718 30255 107989
28736 107989 108681 81173 94203 60341 28101 45842 -8414 -34888 -16287 -58830 -58405 -40098
28724 -40098 -3444 -765 14897 3005 5183 32420 60980 102397 89729 41680 65187 79872
28712 79872 79749 45217 20858 13880 -9055 8126 22186 -31446 -61206 -62092 -49014 -2216 -1850
28699 -1850 25386 56624 74866 64965 5290 -43138 -68770 -85692 -120289 -130228 -107477 -93269
28687 -93269 -105862 -78020 -62383 -18228 12366 3512 51776 84892 107779 68457 64835 66291
28675 66291 90173 106173 80652 46048 812 -17915 813 -38299 -41786 10072 78322 47262
28663 47262 49292 59033 -434 -11847 -4971 15219 6909 38817 103155 66950 11498 -27947
28651 -27947 -36351 -37541 -33933 -27589 -18748 -58202 -70229 -41211 -77067 -85193 -57858 -44502 -59815
28638 -59815 -3805 40792 58187 102090 105868 86829 79677 67798 61557 108517 103017 108842 125040
28625 125040 65735 39260 16618 2750 -4391 -30284 -80488 -130009 -139021 -46284 12729 12904
28613 12904 -16073 27306 17672 -27122 -40746 -51025 -63410 -61425 -32209 31530 21252 -20619
28601 -20619 -28171 -33671 -46965 -19947 -12772 -2264 8224 -33130 8961 55245 18575 -7364
28589 -7364 -25361 -43827 -46441 -42767 -4390 66593 69958 23948 33367 24213 19783 87984 106952
28576 106952 115140 51568 10291 27524 26496 51181 48415 37315 19129 -33895 -30643 -22903
28564 -22903 -36699 -34493 -30587 14458 -34706 -58728 -46133 -28721 9343 26561 32819 44204
28552 44204 22960 39688 102708 86038 46156 23129 13188 12406 -1430 -7489 8749 -21215
28540 -21215 -24368 -10191 13436 56686 14261 -71311 -79573 -5035 23052 -14325 -6905 -20754
28528 -20754 -39386 -27778 12250 25953 61521 85294 61961 29378 39920 -29040 -23502 -31933
28516 -31933 -43578 -33082 -33956 10889 69663 42671 34352 -5672 -27920 -9924 35839 20342
28504 20342 17191 36003 12678 14013 -9881 -50441 -58598 -6191 22843 60443 41134 40238 48450
28491 48450 70111 106211 56840 19425 14509 77037 17032 -5987 -58391 -22430 44267 40461
28479 40461 28533 35174 -14917 -51462 -34292 -55261 -21981 -17562 -8158 11034 -3485 -11840
28467 -11840 23974 59723 54964 60076 18815 -5837 49431 23000 34824 49447 39934 61280
28455 61280 92023 80800 69736 86043 81845 1791 -25640 58655 72302 -8178 -27965 -30331
28443 -30331 -3733 53754 79749 -5021 -56379 -10664 31701 38044 68374 66978 27343 27635
28431 27635 22340 5945 26993 51033 -23214 -91664 -23766 68769 72836 66480 36174 23347
28419 23347 -1539 -59153 -67401 -16489 40604 61834 61634 76361 56268 71485 85941 62051
28407 62051 35095 17150 50331 48995 40900 24518 29923 49821 28853 2474 -1505 33716
28395 33716 26309 43050 31185 69947 117538 149519 116050 110261 75546 19992 10882 25227
28383 25227 41879 55916 44009 33395 50863 4616 -29679 -34597 -37346 -57132 -13969 15450
28371 15450 2540 17622 15974 -3625 -25961 -13563 -24118 -55889 -28870 8663 -15267 6599
28359 6599 -17238 -13125 -6993 -41575 -46810 -15357 -41556 -27590 -5016 10340 14564 8559 -6979
28346 -6979 -52876 -26280 1462 13502 -17486 -8124 187 -22576 -2367 -42765 -10929 -8672
28334 -8672 -39202 -41034 -37311 -17587 -12508 -33422 -96572 -94697 -102955 -31654 21762 28029 28424
28321 28424 95489 160546 85986 -2764 11051 -2465 -14905 -6905 -23895 -576 -10206 -31680
28309 -31680 -72429 -44559 15533 32691 10809 -22704 -27143 -4600 2848 14762 56084 59607
28297 59607 -72 -34709 -9805 1604 -14240 -29660 550 64371 109434 75157 49432 37382
28285 37382 -13326 -10913 20588 13680 -907 32165 44816 42201 66902 107744 116666 118476 41819
28272 41819 -54896 -59411 -43399 -24287 13005 43607 51983 52460 58121 1409 -32467 -5840 44704
28259 44704 94335 49320 7815 4011 -16350 -6902 -8157 12361 -494 -19049 -11945 13841
28247 13841 14428 1133 -17139 -24648 -19259 14946 12910 26777 39280 14196 -29890 -17874 10010
28234 10010 -39222 -85645 -81199 -73437 -75609 -33261 3878 -20780 -28392 -60862 -81632 -37013
28222 -37013 43965 36394 -19912 -28987 16219 27295 2123 -9957 17418 69356 81458 59678
28210 59678 68571 32839 6488 -14217 5805 18935 53841 99109 102948 108168 96019 8156
28198 8156 -13538 -4459 -19437 -44188 -42193 57097 91406 64883 60778 52610 -37407 -2823 -3023
28185 -3023 7267 26814 -10215 -69995 -63843 -37576 -11592 59376 96629 57718 44015 9403
28173 9403 5203 47051 22292 -3882 41177 21621 -5339 5767 31686 72445 38611 39534
28161 39534 17270 49395 49962 20455 31000 47986 24782 33089 20236 25705 7142 -10216
28149 -10216 3325 20036 -3337 -22203 -20447 17295 20525 -13429 -7002 -16550 -77525 -96280
28137 -96280 -45321 -46521 -19851 31188 84816 118195 141385 170872 97215 142706 145770 90793
28125 90793 44373 56867 29436 -7594 10536 -8995 -50732 -53381 22515 37720 63171 57719
28113 57719 71908 48447 7525 -42542 -68958 -66489 -56407 -15740 -39697 -78200 -85778 -62495
28101 -62495 -75997 -118239 -77821 -56325 -50908 -11304 -30066 10857 15594 39485 6106 31292
28089 31292 69069 75267 94525 58283 36007 63007 111722 115473 89891 106483 128129 85944
28077 85944 70126 2863 34311 96313 46533 1245 20506 25234 -764 15750 12469 -21336
28065 -21336 -406 28873 -11019 -46282 -36088 -65655 -51542 -56612 -37461 13604 14341 41561
28053 41561 54625 23366 -14130 -25457 -25467 -53142 -62361 -17889 22395 25349 47367 48690 36895
28040 36895 -25855 -32285 13293 63622 71407 116131 83383 80968 100425 108891 78057 16553
28028 16553 -4286 -21665 -37445 -6002 -3486 -63647 -11023 50092 32423 -1927 23608 36439
28016 36439 48565 8938 2310 44862 10744 31917 33812 -18262 -93058 -110756 -28091 16788
28004 16788 23562 16978 -23366 -33252 -61989 -65357 -9334 17562 59441 41252 -2377 -21240
27992 -21240 -15935 10426 10251 51734 108321 87157 69190 43035 64753 50739 13431 -6416
27980 -6416 14177 26166 63837 59408 36859 20547 43475 51575 38553 55073 119633 100556
27968 100556 81703 18239 -3183 19765 63415 80417 86915 101358 64703 32571 17201 19462
27956 19462 34919 -4043 11640 41059 3695 1742 -1351 2995 8247 -5600 -2012 -33877 -39041
27943 -39041 -20809 -31043 1377 46718 51945 54019 68316 62190 -7403 22760 44578 69132
27931 69132 13448 -8652 -59054 -69803 -55229 48497 105773 92005 121378 90603 36173
27920 36173 27026 29990 12262 -5020 -18063 -10870 -23897 31790 51487 -1868 -29200 -43941
27908 -43941 -8087 24662 24089 3091 3602 -323 17914 41048 82849 72188 24000 -24307 -44215
27895 -44215 -36877 20483 43714 15650 -16135 332 11912 -16727 -61306 -43640 17397 84883
27883 84883 82568 -4933 -27931 423 11086 -20618 12874 39414 -5324 -14310 15435 57526
27871 57526 76254 74040 54375 -1642 -12672 -2531 -12137 -7414 32816 -7244 8551 -21550
27859 -21550 -46046 -46652 -65652 -108526 -102177 -51996 -45241 -52144 -48681 -52101 -36625 47489 85169
27846 85169 -3644 -46068 -24119 -20529 3917 40517 27715 30757 35283 10068 11495 38652
27834 38652 20161 5804 19044 9639 30441 82719 55032 -14265 -33788 -45826 -39335 -8810
27822 -8810 -14911 25072 60215 46518 15373 -48536 -30372 59885 112969 82828 23102 9583
27810 9583 -11030 -33198 -35232 -45225 -14060 -15815 14395 85078 79525 116359 133878 98504 88756
27797 88756 74667 36726 31092 94608 81559 50296 36861 18872 45639 70523 91612 116083
27785 116083 109428 141376 117956 104638 71129 48612 22445 -3921 -29519 -21591 -193 27985
27773 27985 58543 24333 -16676 -70432 -102805 -77955 -13263 41193 765 -39551 -21814 -35637
27761 -35637 -32693 -68922 -84694 -69160 -41963 -26853 41514 1589 4644 -6411 -20417 -49268
27749 -49268 -90400 -115929 -72034 -8463 -5574 -46242 -107208 -101016 -91770 -65804 -14382 -28012
27737 -28012 -17003 13032 2173 -5044 -8222 -20500 -23838 -40867 -74827 -100128 -72253 -14170
27725 -14170 24119 1754 -91534 -86985 -37932 -30865 6263 53386 37497 38195 55362 63623 79594
27712 79594 27243 -34535 -9429 23305 64617 13480 8164 11008 20745 75741 57793 38623
27700 38623 93760 116646 72898 21190 -45141 -35918 -3389 68953 100583 61868 20230 48750
27688 48750 23266 -12380 -26347 -29825 -23327 -12689 -8574 -23821 -19872 33065 61971 76607
27676 76607 33515 -9788 -23577 -24757 7983 81107 112861 79831 45916 49055 66604 89825
27664 89825 97024 24158 -44396 -101075 -46316 24368 12693 -5311 15613 -10248 -39170 -54926
27652 -54926 -64925 -34516 -8041 -18772 -18372 -11809 -20840 11423 46419 39111 -715 -41544 -77367
27639 -77367 -6654 12005 -524 2488 36030 45624 52738 7242 27966 22093 -11011 23186
27627 23186 101968 116192 89797 65974 18995 21710 66522 37622 28030 -4876 -28365 -42400
27615 -42400 -31016 -16276 -44158 -10854 24981 69584 115978 107721 86303 67802 39818 13270
27603 13270 60167 85552 66182 48632 36127 27705 -27959 3072 39178 29945 84489 88277
27591 88277 31268 -28591 -21974 9290 48518 5769 -23611 64162 99835 38337 -22054 28417
27579 28417 26445 -36598 -44583 2538 22267 35080 34162 11668 16328 81580 125151 61299 15670
27566 15670 41833 64284 46155 26702 1436 45335 50561 24930 59790 17428 18216 47447
27554 47447 31205 25899 5574 -29884 -31066 -83981 -95955 -17616 54021 89585 62787 19324
27542 19324 -46809 -15348 38664 44100 37277 -12029 -8934 44142 57458 27146 29466 1426
27530 1426 -29061 -33453 -11347 -37260 -47995 -35332 -47338 -52768 -14270 10250 23028 -4553
27518 -4553 6041 53531 64847 76141 33020 -14336 -61965 -23670 16928 22246 7748 55329
27506 55329 32119 7593 28625 35460 60356 36823 15947 -17746 -39293 -40566 24144 26579
27494 26579 -6915 14424 36446 121550 154133 82803 97550 135102 73794 48531 8963 14596
27482 14596 63559 31990 42763 94750 99314 64414 1575 -19891 -14474 6416 28740 7719
27470 7719 -6860 -45856 -117934 -146832 -99555 -72501 -103954 -95066 -66549 9416 14395 -19044
27458 -19044 -66001 -123845 -84288 -46911 -47598 -35904 41399 64503 26699 -30032 -47163 -78729
27446 -78729 -43671 -31130 -39813 -45944 1742 46853 20667 -23186 42304 63087 12810 24189
27434 24189 43760 22896 833 -19730 -11344 -10467 -38249 -93670 -107944 -74943 -59772 -62384
27422 -62384 -17954 18645 76309 127112 121812 44053 -15499 -9059 -26034 -34624 -26492 -18911 -33759
27409 -33759 -79595 -45090 17341 -3252 -9901 41858 38103 66124 106999 105391 110688 65967
27397 65967 79021 91223 91474 99281 51590 52374 54015 64634 99444 38076 -29404 -22593 -42642
27384 -42642 -89219 -24937 -6449 -30244 -30850 -21647 -33506 -56531 -48304 -47430 1244 48895 86219
27371 86219 113536 102819 59534 -221 22139 68004 89986 44865 -8657 42310 61607 45642
27359 45642 62315 133024 134085 116680 128223 73451 11675 -18736 250 -30387 -100133 -80807
27347 -80807 -39903 -36420 -80847 -36473 22720 29541 30132 27663 -9877 -9984 -8847 -14877 -29310
27334 -29310 -53177 -24532 7647 27931 4758 16342 47698 27416 26662 52641 76010 119231
27322 119231 116979 133502 114909 53399 -4766 3151 -1881 46841 35442 18959 -3164 17002
27310 17002 -33963 -109689 -95574 -79560 -44830 -15090 25834 55136 19631 38889 13750 20133
27298 20133 39831 36549 19792 -22792 -72787 -65572 -55656 -66406 -81020 -41194 8381 49452
27286 49452 24663 42841 75938 31918 24778 36732 33001 20409 36768 -16570 -86050 -64117
27274 -64117 -8256 4438 -11448 21415 9411 26918 50694 40039 52556 66411 27255 298
27262 298 33870 35147 28743 30439 22281 5045 46974 46678 66036 48980 49651 47143 -501 -33707
27248 -33707 -44372 -75516 -104692 -108605 -57873 -44743 -44558 -34051 2084 12117 -46549 -78266
27236 -78266 -61690 -75937 -70705 -41327 -21414 -21153 -34907 630 -16545 -24726 -39487 -82152
27224 -82152 -51381 -12072 -13932 -34267 -50950 -36049 -46113 -70374 -100622 -99112 -51365 -23111
27212 -23111 -36938 -8333 42789 68614 47567 43298 19829 42440 37143 13003 27955 14066
27200 14066 7820 49110 97377 121236 28956 34496 -28230 -27436 33100 16207 -6124 38705
27188 38705 76306 27378 -491 -2097 4152 28517 -27614 -21077 -20822 -16480 -50368 -38069 -44581
27175 -44581 -99181 -80064 -11969 5280 14059 41082 10489 57315 51697 50260 47431 11437
27163 11437 -31243 -28712 7215 1395 -33714 -52775 -31014 -13502 12572 14255 31081 5644
27151 5644 -8756 -41764 -36399 9007 30095 27264 -3404 10966 -214 -2814 24314 -2992
27139 -2992 15347 51481 43282 18298 50027 49630 51657 39815 13700 -49462 -25993 45804 78315
27126 78315 72536 78054 102949 84829 66447 88475 87688 39875 5582 27677 72710 8343
27114 8343 -55571 -15557 -25016 1104 13995 53778 38049 7460 62214 92535 103200 32100
27102 32100 -33932 -30627 -27857 -21183 -2392 -17766 68052 97701 89312 83380 53974 14647 -15367
27089 -15367 10734 33627 53219 49366 30293 -12792 -10126 25414 -19093 -18613 44257 48686 -12199
27076 -12199 -13781 15947 21811 58223 57097 42210 19774 19404 20408 21323 21980 53390 -19585 -70737
27062 -70737 -11556 -39179 -39691 -25219 -39133 -19177 -2710 -31929 -60985 -83689 -67541 -19891
27050 -19891 -7233 -27531 -36996 -45393 -41622 -43570 -22250 -24826 -19899 2671 8047 7107 39673
27037 39673 81450 32097 45482 26374 33201 108234 75043 16526 -20502 4035 23904 20886
27025 20886 37481 16087 -22978 -16311 402 30024 5143 -30116 -25044 -23957 -36303 -34511
27013 -34511 -18137 -33649 -29703 -14641 -15771 -16127 -23003 -17842 -11731 -42748 -83045 -72558 -77913
27000 -77913 -81458 -5218 39094 71332 80508 30053 -14702 -39236 -15554 29629 37276 12995
26988 12995 -42788 -44584 -3750 46883 88818 23171 -39570 -60135 -55430 7560 69881 72271
26976 72271 18764 -34221 -46654 -24283 1854 -37946 -30314 -34660 -35971 -70113 -71879 -34066
26964 -34066 -6666 13568 889 30972 86186 125687 85395 72216 68320 44671 39083 9482
26952 9482 44417 43020 -5623 4579 -54299 -31195 7223 83588 79070 12330 5657 6818 -37671
26939 -37671 -32467 -58892 -63526 -93546 -109775 -95618 -50586 -35469 -72035 -54534 6086 58208
26927 58208 25212 3254 12100 -8683 -40558 -4051 88948 89695 -5366 3137 -10099 -18180 10938
26914 10938 20777 16925 8295 21652 28499 3648 -11669 -27517 9050 16237 -44727 -39374 -7984
26901 -7984 -18975 -83495 -93200 -76909 -24714 19309 24973 27268 14651 -29335 43056 66192
26889 66192 54474 22213 58169 53262 14734 -17819 -34280 -21759 13670 63620 29833 -35081
26877 -35081 317 18233 -21848 -10895 2610 22100 -11861 -12436 18069 9456 -33397 -46589
26865 -46589 -57700 -70561 -57278 -13565 -5958 3057 1549 -36984 -38639 -34426 -7809 -19805 -22603
26852 -22603 -12060 67155 88259 33600 -13238 -56182 -54436 -106016 -93108 -33936 -36973 -76920
26840 -76920 -63170 -11307 36179 71218 14427 -28165 -67309 -91674 -55575 -29414 -30035 -18582
26828 -18582 -1699 -2040 27271 64353 28661 18803 904 -33860 -83719 -54090 -17631 -20075
26816 -20075 -21662 -64510 -63090 -36841 16918 54025 6938 -37753 5248 36648 -3423 -13925
26804 -13925 -637 3412 -29296 -80099 -59026 -43385 -42141 -52318 -32955 -26159 8093 90858
26792 90858 38093 -985 25368 41574 16547 -14972 -30930 -46030 -32895 -14451 -36459 -42893
26780 -42893 -24959 -37861 -65376 -84801 -11654 65409 37845 45278 13327 53103 96526 127323
26768 127323 75715 69327 40482 35635 72969 155680 107511 49529 93185 117324 72319 74862
26756 74862 91519 81562 54606 75118 73852 88736 106343 72676 38795 54315 20940 25412
26744 25412 46125 45972 59101 31149 1725 -30649 -21408 32978 38606 58445 57325 69312 15555
26731 15555 -39539 -49007 -12327 23484 29242 34314 -10854 -52444 -64598 -82925 -54856 -36517
26719 -36517 -25018 -32836 -84345 -86990 -65250 -28698 -17371 24242 48272 43131 29661 -2062
26707 -2062 -30093 -36864 -42972 12441 34626 -12412 -30919 14886 31821 -10169 -26120 -8636
26695 -8636 16815 39152 70299 -7938 -14246 20757 70462 76328 102898 106823 106227 34530 -20257
26682 -20257 16426 37901 -6 -10782 18331 -6527 -1173 -42470 -30248 -22304 -41796 563
26670 563 43684 40218 17478 -12077 -10157 19026 48522 76728 29516 -5582 18309 96842
26658 96842 132228 95132 -2096 12810 21334 -47179 -19167 -53527 -49490 15110 -27775 -40161
26646 -40161 -16347 3325 31914 67619 78337 79131 41904 -29644 -48571 -2367 30421 55357
26634 55357 74966 65728 8083 -16240 18244 84104 110176 111878 102336 54212 -176 26536
26622 26536 60362 36756 -44128 -29895 30944 -5945 -33292 7931 8580 3424 11276 -8351
26610 -8351 -12483 2896 -25764 -10466 37854 30632 -11030 -51204 -73875 -84330 -59802 -37360
26598 -37360 9858 23634 10822 -38877 -54372 -34998 -13092 -1390 7186 -872 24349 26626
26586 26626 -8847 4098 51291 88683 87442 104334 70830 38881 43520 62303 99635 20679
26574 20679 -12968 6073 -131 -20146 -74697 -81261 -28291 23493 29734 1256 24584 -851
26562 -851 -36163 -8694 32591 16575 -43199 -81297 -46578 -43518 -89984 -90505 -83891 -42383 2993
26549 2993 39646 46839 13387 6711 21089 48852 26294 6561 -11925 -45471 -30237 -7800
26537 -7800 -5638 -4185 26650 4981 -20306 -3765 -10564 4391 33672 12135 32353 61332
26525 61332 92065 118451 126093 142661 71113 61355 61621 81655 50553 -2396 3256 25650 39329
26512 39329 12475 -7229 -7696 -11371 -8916 -6578 -23062 20082 47919 55178 18812 19332 9799
26499 9799 36068 65637 91618 102353 52859 -16019 -54645 -65658 -66344 -65153 -29812 7818
26487 7818 -17389 30725 19499 17790 5672 -10477 23314 49228 16137 -2310 15448 3154
26475 3154 44328 54510 295 -52493 -63478 -45244 -22265 33399 61037 72050 49363 7547
26463 7547 9067 -3024 -20058 -16075 21638 22305 9168 -21775 -49352 -31856 -14483 -25432 -67133
26450 -67133 -80881 -52165 -2595 69207 64378 -5311 3162 47818 47408 19106 16002 -11637 -15268
26437 -15268 31059 45631 41393 -11590 -76990 -76740 -26364 -51329 -73493 -60632 -48271 -18609
26425 -18609 -5456 5506 -32947 -72636 -70550 -11307 60735 86824 93034 84956 74567 40240
26413 40240 42513 6935 -52540 -24733 -12923 -32248 -9103 5881 5959 20853 44405 35948 18145
26400 18145 18787 33704 33554 10282 19258 -9605 -11342 29884 86117 170976 121791 82465 27829
26387 27829 -1351 -27848 8967 37170 28339 54575 116462 134120 121107 105688 71829 64319
26375 64319 21976 3511 20032 34299 34505 55870 37185 49857 60502 74590 59061 25367
26363 25367 44254 55800 22881 -3074 -14310 985 13912 20786 26705 32445 27639 59360
26351 59360 71763 63486 43311 56046 31234 81824 40596 25661 6752 16698 -3120 -12883
26339 -12883 -11493 11975 -10908 -68252 -44157 -15659 -4798 9065 -49184 -84496 -67428 -40075
26327 -40075 -24611 -27984 -102859 -130766 -124533 -96875 -70481 -93818 -42093 -2029 -30667 -4886
26315 -4886 -12277 9438 29092 5075 -13255 -49303 -28479 -48833 -60687 9450 14312 -14403
26303 -14403 -22015 29874 19987 29502 15566 27042 48629 20152 391 62855 105598 80532
26291 80532 35564 -9370 -26422 14951 41074 30193 6804 33891 45868 27451 29380 28754
26279 28754 23817 29997 52220 51569 62042 47095 37240 58936 97964 95652 56715 45730 49758
26266 49758 24466 7718 -13299 -29835 -38805 -21063 259 -26425 -10876 420 1913 -32027
26254 -32027 -35340 19790 53126 21708 11405 11124 -26391 25108 42800 22538 -2232 41482
26242 41482 28367 -4692 4978 24283 23065 23271 13653 60399 80118 26556 41294 15528 16097
26229 16097 230 2000 6465 -2677 11072 15569 10717 -31977 -20543 21908 50184 83611 81732
26216 81732 45699 57178 55189 88178 96337 58459 71217 73063 41123 3863 14388 -53039
26204 -53039 -85075 -41441 -6910 -49905 13460 18148 13645 16070 11212 -50890 -53205 -8281 16089
26191 16089 14601 63496 80104 98760 44300 25769 25374 20824 63252 22474 8591 -2716
26179 -2716 19603 33302 41746 41918 58963 -11167 -83454 -51683 31931 57105 90019 98572 85000
26166 85000 82573 78138 83228 88333 63574 58667 73695 39679 -2738 -14529 -2485 -4383 -7524
26153 -7524 -7416 -202 -11570 -28480 8750 -94 33384 108325 122766 94324 7181 -56518 -120261
26140 -120261 -85285 -34569 -40485 -50600 -46927 -41296 -47104 -47170 -11491 -19168 -9932 -13197 15881
26127 15881 -3203 -62823 -27133 24490 -3891 -13229 39067 30333 64338 67670 47099 12406
26115 12406 -19943 -7950 -17231 -26074 -11156 14146 14850 -5430 -15452 -580 7330 37539 26452
26102 26452 6344 11417 44221 49768 -5674 25816 55885 36217 -26317 -87275 -112624 -35677
26090 -35677 -88318 -100139 -46304 -31497 -36463 -25395 -24928 29535 59336 52630 -863 -51702
26078 -51702 -60158 -48369 -58904 -76075 -84972 -11178 -37221 -48469 -15411 -5892 1916 22989
26066 22989 -9609 16003 -7866 -1996 9931 4310 -905 2378 -41315 -38872 -30883 8935 66238
26053 66238 66287 43828 -7098 -891 -7408 8795 -41079 -98795 -148669 -144970 -148073 -63931 -1358
26040 -1358 27029 -9164 -30060 9341 67331 27445 -33934 18458 3857 -57755 -26786 33349
26028 33349 14951 30450 29925 3442 42653 53208 46766 69834 -1492 -59441 -77133 -41878
26016 -41878 -20165 214 -6380 43554 79469 24028 -26012 -48268 -64619 -86756 -21442 -8749
26004 -8749 -25335 9874 93098 91757 59448 40775 28627 -12976 -30030 -52266 -37946 12372
25992 12372 58271 66376 85859 66852 37404 7022 -72456 -82873 -64701 -49504 -40174 -77677
25980 -77677 -136533 -137675 -104964 -23698 12274 -9071 -14605 -7594 -36323 -27120 -31025 -67314 -73023
25967 -73023 -93894 -147806 -118405 -127898 -127722 -110574 -111322 -97929 -71268 -51602 13823 31917 -1207
25954 -1207 4757 30356 51123 59666 11225 -18231 -54056 -63845 -6873 31474 54057 79967
25942 79967 83193 49120 17058 -34036 -4120 -24967 -28633 -28817 8448 -9896 -8017 21992 50350
25929 50350 49882 6593 -27029 6683 34814 48799 20660 21446 16899 37826 30266 36796 15107
25916 15107 1505 52407 46536 83863 75118 52762 67795 88467 83773 83777 95936 128433 36194
25903 36194 -24285 1077 -21233 -70950 -72937 -67613 -54722 6048 19416 -15842 -24966 -51411
25891 -51411 -54924 -64790 -97234 -62359 -6713 38322 43308 21604 -5540 -12181 -18749 -26386 -4568
25878 -4568 -50198 -42553 -27297 -65505 -87028 -76147 -59690 -30111 45136 24694 30495 35925
25866 35925 31487 46920 46323 33398 18763 57626 92100 105794 74382 78323 71003 21753 4138
25853 4138 10616 61648 83088 41143 -22938 43380 78325 35086 28664 15866 -44601 -46550
25841 -46550 -59742 -54578 -21967 45246 86948 96243 82687 55793 23538 42341 27024 2834
25829 2834 32359 29317 6126 -27508 -10589 11799 56100 52631 22948 41106 43829 15564
25817 15564 73570 96651 67379 7670 11343 11757 -15775 -16000 26381 1104 -37621 -12869 25771
25804 25771 44913 16290 20555 47961 2222 23350 20773 48903 35088 11579 24170 31281
25792 31281 61946 38756 -8404 -27509 -16031 -49982 -57623 60815 113130 104309 95075 36486
25780 36486 -24159 -29568 16519 15463 58760 79793 7965 -25592 -148 18076 -10193 -2857
25768 -2857 40179 37165 25296 9197 34590 38116 58256 97826 90042 78997 52189 39813
25756 39813 59628 40491 -5809 49346 71674 50111 -57966 -99937 -58986 -52872 6642 62735
25744 62735 77405 56890 28298 10773 46296 51461 40449 35452 4859 -33656 30885 99231
25732 99231 85934 48709 73117 29765 32327 3599 -41666 -14829 922 30076 35774 11142
25720 11142 -26112 274 35838 61187 40660 65682 53120 -40884 -87061 -69428 -30336 28838
25708 28838 80426 50686 3464 -48582 -87433 -56861 -44666 -32899 15578 30820 41204 46693
25696 46693 29308 -26140 -80276 -76114 -83779 -70148 -42777 -44282 -56155 -85099 -83479 -71818
25684 -71818 -26663 25170 22013 -15837 -23163 -10850 22075 21088 24862 -19051 -23812 -30250 -38524
25671 -38524 -19586 15367 20397 6879 -16540 -30789 -41686 8797 30354 10097 -18122 3666
25659 3666 8803 3282 -2753 -99588 -136472 -107576 -13807 16490 37515 50637 14404 -33373
25647 -33373 -39555 -38401 -2829 22777 34627 41330 32095 10545 -8347 -25902 -5086 48449
25635 48449 65679 74628 26817 -13671 -9291 15506 12663 -8634 -37935 -6207 20500 -38508
25623 -38508 -108223 -137728 -82056 -21917 9059 -7679 -78322 -52057 18171 -5168 -26337 991
25611 991 14564 25099 80965 106973 100832 88478 31164 -24140 -37044 -4505 42789 31831
25599 31831 72745 77761 52182 25694 6958 47001 77471 61688 48645 28759 -28687 -62680
25587 -62680 -31244 -10455 5603 16746 -1154 -13556 4276 35962 21219 -25536 12052 -6439
25575 -6439 -25733 -38276 -69449 -51392 -64393 -67395 -16821 51978 42857 -14352 -38483 -9142
25563 -9142 41439 2339 30140 79717 24505 17652 36055 92276 72096 29498 53783 86359
25551 86359 59685 -28414 10156 36594 52531 65635 118189 168233 116586 89047 73405 8262
25539 8262 12169 -8613 -26427 9871 51961 34671 64224 54322 -13976 -68517 -64607 -73748 -31322
25526 -31322 33099 39905 -13822 -14900 -56154 -92088 -79772 -40569 -38679 -71308 -96386 -13938
25514 -13938 36016 59141 -18607 -46897 6161 54695 61648 61634 48044 -13607 54320 85423
25502 85423 65470 24612 20442 19748 -56213 -43354 28736 70792 15587 18031 -2785 32473
25490 32473 16486 46787 111454 113817 71970 49548 41610 31924 29280 31955 61845 11882 -57672
25477 -57672 -87188 -81149 -33414 -38934 -17853 -20960 -22594 -43397 -5870 -883 -26566 -15807 29300
25464 29300 63799 11794 -40649 -53892 -42283 9782 81667 94637 98386 76186 -11436 33081
25452 33081 57335 58111 54162 -12235 -10757 -5430 -14445 -11028 37421 12609 -28879 14373 38461
25439 38461 59420 108421 130553 93475 131454 119488 59239 -36324 16797 84941 92427 93067
25427 93067 66547 -850 -52865 -94436 -52939 -12913 24663 35819 -36870 -22398 25814 27119
25415 27119 48358 27504 29044 60727 64955 34632 39564 29785 -7500 -19451 26093 26054 80478
25402 80478 118912 85182 48634 -31830 -53914 -52789 -68509 -92401 -37604 20738 60298 59906
25390 59906 47648 15685 9311 -1669 -11439 36733 -10989 -115935 -91396 645 12763 -35566
25378 -35566 -13006 42980 44350 16916 -40135 -48693 -70898 -109304 -72196 -68877 -6845 77480
25366 77480 74681 29432 17310 16845 26434 46226 -4610 -55847 -63176 -59554 1148 7707 3383
25353 3383 34774 18080 -4842 -5087 -6478 -40655 -68437 -7726 -17718 -21693 10145 70067 67731
25340 67731 17683 50226 49577 28663 173 41373 57538 45274 29990 55669 32668 4676
25328 4676 53920 49178 55879 51610 16309 356 24408 31895 -14480 -35110 -26990 1054 -18902
25315 -18902 -19189 1423 -17879 37746 -13136 -44969 -2505 62103 54273 17341 -560 -3267
25303 -3267 9079 39078 5416 -10261 -36590 -48592 3421 5367 17938 22829 28659 47862
25291 47862 10732 5948 2635 -3266 -28448 -20755 2695 -25495 -25935 -2137 27970 37253 15295
25278 15295 6262 44748 48097 17213 8254 7598 11357 -9030 -2410 -36962 -59683 35381 94541
25265 94541 58622 17972 33675 89095 126920 113008 97935 62497 36038 20806 20144 50107
25253 50107 14551 -24663 -34692 -68604 -105976 -33424 12631 5843 19807 9548 33917 55178
25241 55178 78951 66182 45908 78051 143147 130630 67520 49201 39022 25389 -14132 10079
25229 10079 28276 52429 44554 20234 52667 110162 63824 27124 9012 -31166 -73163 -101008
25217 -101008 -99312 -52951 -61334 -79145 5745 17632 2616 38844 51231 50311 82175 28745
25205 28745 23396 9607 13361 -4588 24714 43903 43739 22332 14513 37440 62801 68907 43847
25192 43847 -11029 4709 -11331 -44472 -38333 5503 13941 3059 9071 -70348 -51459 -52154 1583
25179 1583 55080 67537 52172 -25065 -1192 36807 90105 110533 93585 63330 50453 -1899
25167 -1899 -23139 -42083 -52598 9881 24878 24024 62237 43805 39643 30873 25943 33734 60456
25154 60456 62416 67391 91498 120399 49074 35380 79614 92743 156988 177331 170643 137514
25142 137514 96039 34757 19219 79708 59562 24346 -23748 -30271 -57484 -6669 15998 -17012
25130 -17012 9649 297 -66199 -65545 2162 57633 64599 45382 18260 10625 6419 -43111 -11655
25117 -11655 18944 72527 64589 62643 58619 65954 6203 -38675 -24263 8683 52986 43363 45741
25104 45741 57843 5507 -55268 -75848 -46953 582 89150 101802 63115 592 30958 83011
25092 83011 59260 -31162 -20181 -144 -9024 32099 25248 -28312 -9481 58878 -1144 -45262
25080 -45262 -16257 -20704 -46817 -48090 -28837 16051 8806 -13695 8400 18337 23406 -21772 -72408
25067 -72408 -92060 -83457 -45621 -29839 -53498 -29497 -7370 -8350 12658 6644 25023 39709
25055 39709 35983 14293 -5211 20999 2521 37954 72490 81831 103573 123193 85236 113257
25043 113257 62369 20089 4608 -29672 -68451 -32512 66624 43283 2930 -28081 -27902 1275
25031 1275 -6605 28256 -6047 -8641 61219 78765 85858 85477 99946 49944 -6795 3525 33536
25018 33536 70651 77473 45306 6813 312 -30659 -98686 -114253 -100029 -68205 -45070 -33033
25006 -33033 -33670 -56143 -12989 -5640 2620 2034 15956 1495 56460 88675 71598 694 -41538
24993 -41538 -42765 -70585 -61076 -2157 39888 14059 1171 -1915 -15578 -32846 30731 74802
24981 74802 72431 49759 27193 565 -33767 -40478 -21840 -72740 -95034 -85782 -42146 -33258
24969 -33258 -58298 -86419 -47294 2311 23945 17315 24144 -25288 -11073 -18984 -10538 1269
24957 1269 700 -2486 -18559 -49445 -22621 678 -21493 -51133 -36166 -21042 -54354 -33282
24945 -33282 -19166 -25799 -19849 22357 13559 -7325 -24536 -36248 -38952 -17327 -22338 -45496 -67808
24932 -67808 -38370 7736 20412 33601 62946 -14980 -42079 -9470 22597 -9025 -9774 -654
24920 -654 30347 54390 104374 122898 104478 29192 2359 -17370 -32560 -11618 31486 20976
24908 20976 -1723 29628 32213 30868 34828 79518 66840 50915 88658 46969 25904 31400
24896 31400 37826 11264 -2329 -37950 -30539 -2779 28380 -1238 -50723 -81083 -37980 -59026
24884 -59026 -66306 -25685 -31613 -30140 -1986 -12064 -40728 -83405 -125410 -107555 -72146 -92963
24872 -92963 -54321 26822 -1217 -27761 14448 36811 36336 -1821 25187 -7554 -50681 -47305
24860 -47305 -39623 -66388 -85649 -79513 -70995 -72414 -73180 -69623 -42483 36669 114427 64950 14839
24847 14839 24685 44743 32680 27485 31188 50552 53307 33513 -8032 -18569 -88496 -90325 -26755
24834 -26755 8016 6019 66032 81428 14280 -12353 -25278 -50785 -44176 -15734 74372 55938
24822 55938 42940 35898 40024 75770 10521 -21497 -27152 4157 191 -35956 -77254 -64705
24810 -64705 -39359 -9951 -14783 -33816 -72332 -4836 33190 -14218 186 6983 6140 17694
24798 17694 65014 54497 8273 -23402 18437 34297 12361 18311 30808 -16220 -16386 36413
24786 36413 71181 68339 60006 25185 -12410 -27086 -21377 -14562 -13030 -26049 12812 50263 37501
24773 37501 -11445 27639 7476 -30346 -20501 6466 -28549 8690 36738 -48589 -83078 -55195
24761 -55195 -40366 -17704 16925 24085 -58976 -106208 -103988 -57662 -55061 -25821 -5413 -58075
24749 -58075 -37304 -37277 37370 86024 58342 28365 -13371 -8512 -68643 -37357 -37689 -23079 -21644
24736 -21644 -17473 -1209 24557 89533 129697 76319 -3592 -32449 -66534 -67634 -50461 41537
24724 41537 42702 33370 38605 5334 -33356 -22892 -4525 10692 15500 -19454 -72685 -89152
24712 -89152 -49424 20354 23795 23808 31643 -21351 -26477 -59502 -33643 39218 42899 66554 44155
24699 44155 53732 54445 61563 25205 61256 -33781 -75487 -19292 31976 61554 80010 70132 23677
24686 23677 9495 33205 57372 35999 47156 30971 -45817 -75721 -38865 -9256 -5196 -42122
24674 -42122 -80473 -67782 -13613 102538 113968 6005 -26043 19040 95081 18409 -8030
24663 -8030 -10884 -16947 16599 -31228 -80052 -54115 -59470 -84537 -99901 -72114 -24450 -16235 -30905
24650 -30905 -52134 -96094 -92165 -51662 6618 -2666 28927 -889 -26749 -43884 -19206 -30055
24638 -30055 -68253 -44018 5573 -15053 -7399 -52251 -6880 -13217 -21065 -13712 14328 1701
24626 1701 20401 30614 -48217 -54240 -88878 -40393 7038 61461 84441 58157 39998 25175
24614 25175 37943 30272 19202 63906 80875 22835 -1796 -27215 13848 24763 36542 5574
24602 5574 19102 55120 88912 120282 88503 60191 45595 20457 44659 6201 -640 69429
24590 69429 29174 32969 71223 71837 46061 35217 -2530 -39682 -19341 14772 34159 43293
24578 43293 32008 3275 8518 77948 60333 -4586 -39748 -101437 -96947 -50859 -41839 -21619
24566 -21619 45417 67924 42886 53845 12607 27380 32489 64156 7930 -44165 -53921 -38722
24554 -38722 -63238 -22662 -10313 39501 102477 75053 79668 111785 66951 39667 -6951 -22669
24542 -22669 -23996 -47505 -77564 -56266 -10230 26321 -18315 -56173 -45938 -25855 16539 26646
24530 26646 15064 41436 20580 14401 53968 43960 31547 61386 60834 -21202 -99219 -108059
24518 -108059 -45249 -18068 -30006 30959 53597 23179 34054 1821 -44931 -64988 -70931 -67723
24506 -67723 -43564 -21260 -58476 -77396 -37219 402 24134 -2418 731 4131 -52501 -6051
24494 -6051 23823 -42499 -26583 -7062 -1687 -20862 -23763 -66645 -55690 20829 25679 1037
24482 1037 -38080 -57273 -47606 -4861 -22211 -28939 -50964 -66928 -77357 -58155 -7596 -50519
24470 -50519 -32775 5843 -13506 -9413 22710 92942 110344 31276 6404 6897 -27891 -13304
24458 -13304 51833 97826 57812 2441 -67725 -89625 -44132 -26024 -29124 -10088 540 -34726
24446 -34726 -24536 -4513 10972 9965 -27500 -8781 -49056 -33131 -19483 22196 94661 102221
24434 102221 63428 4253 -63799 -87899 -76720 -68346 -70822 -25779 -16664 16781 -1788 -18630
24422 -18630 32642 40951 24117 28027 33774 10454 -7581 -13888 30299 75960 54880 21250
24410 21250 -48908 -22847 42289 -271 10990 -27438 -51884 22595 38679 -24353 -40811 -12737
24398 -12737 -59658 -54875 -66856 -69928 -16402 29659 -2115 31710 90989 69964 28307 80579
24386 80579 106256 131896 115302 103437 93851 92395 62685 43273 64901 56252 39052 61090
24374 61090 54665 16884 10061 38731 1750 -21131 -11037 12398 37417 31679 -910 3921
24362 3921 41701 6596 -1780 49918 59169 41335 2828 -25343 -18268 18325 21518 19467 49874
24349 49874 83204 50373 13577 -38874 -73397 -84219 -42884 -32716 11422 34681 33565 38059
24337 38059 46813 -18957 -6310 -17168 14580 62 5486 -3865 -35266 -3708 -6479 -7165 -13132
24324 -13132 -14602 -17448 -44281 -12812 -7311 3787 -1005 12235 -25700 -49266 22509 33634
24312 33634 6226 7161 8541 22136 -7330 -16819 -30667 9901 66093 112427 41332 -213
24300 -213 -2180 1066 902 27458 33875 -7807 -46748 -28584 7179 22030 20241 -6451 12108
24287 12108 50495 -7760 -14750 -25321 4714 -20156 -28864 -50249 -42663 -35509 -46851 -28308
24275 -28308 -38766 -70057 -56498 -97364 -58476 -30080 -17703 20681 4692 -19483 -71736 -45396
24263 -45396 -13538 -31583 -7514 -31163 -4470 7633 24636 -6305 -33222 19916 18357 -13760
24251 -13760 -38601 -4925 28749 -16726 -38601 -46191 -1375 27541 37085 34895 14721 15017 -28661
24238 -28661 -875 16358 19314 29459 -46519 -73647 -80070 -76952 -39404 -53154 -71617 -42818
24226 -42818 13178 35290 26506 42116 26432 -11136 -54726 -76930 -84411 -81644 -52791 -26747
24214 -26747 -48532 -30857 1868 28010 60829 79391 40782 25740 47941 34265 10501 -43305
24202 -43305 -30227 -7102 17284 -3088 -65265 -37879 10259 -25107 -71413 -29092 -19528 -10627
24190 -10627 23796 52359 105043 83394 -10525 -23567 -44684 -39397 -60911 -57103 -37221 -38701
24178 -38701 -78046 -59189 -41815 -5774 8524 32813 17317 27639 -2826 -8392 -34546 -37258
24166 -37258 -28245 -36308 -53697 -24451 -14219 -22156 -38717 -30046 -38201 -40184 -38895 -24637 -45875
24153 -45875 -72763 -103282 -90217 -35968 18046 32834 48051 31664 -81333 -97352 -41449
24142 -41449 13124 -23973 -60784 -56146 -42903 -46411 -45135 -7446 44827 38861 21987 -27519
24130 -27519 -39284 14879 -2632 -11525 -17526 -67058 -83564 -70744 -89080 -56894 21277 -10378
24118 -10378 -11554 2510 -45567 -62770 -30082 -29831 -8541 20497 10151 -20982 -77611 -34837
24106 -34837 -12064 28619 49303 82380 64702 4564 -8573 51022 96024 62129 15280 -2555
24094 -2555 17584 15202 20689 246 31212 18585 7360 63584 66523 56358 78252 37215
24082 37215 -22407 -45539 18721 21289 -15390 11630 15133 18053 -33732 -76441 -39167 1712
24070 1712 -24090 -16589 -36698 -70899 -96671 -66974 -17309 -42400 -110465 -66052 -25132 -73193
24058 -73193 -58911 -49215 -9015 1885 -7209 -17455 -14059 37153 110343 84722 -1904 -13149
24046 -13149 8554 -19794 -80039 -138549 -158795 -194349 -155734 -114860 -166465 -143302 -70574 -70960
24034 -70960 -95889 -84669 -53021 -49526 -76975 -48833 -35015 -41672 -41384 -50477 -60173 -79785 -57469
24021 -57469 -12247 3814 -6929 -41 2088 -38789 -46721 -41224 -44786 -63275 -53221 -47288 -76732
24008 -76732 -30857 -5218 -57125 -98848 -75058 -62309 -76417 -87052 -75017 -47811 -33676 2299
23996 2299 -34216 -48040 -42711 -46854 -37739 -14784 49003 61359 106543 109739 12769 -8014 20471
23983 20471 43520 -25994 -43082 -13332 -7446 26233 6815 42031 39643 32328 61951 28137
23971 28137 -1226 -41488 -60415 -42153 -38229 -52246 -10251 -17147 -44376 -71705 -68062 -64544
23959 -64544 -41147 -21370 -52545 -81734 -79292 -54752 -22362 -9325 -16617 -56338 -49284 -40523
23947 -40523 -30177 -18396 -34006 -69414 -90341 -54304 -86511 -95383 -99047 -102457 -15193 1540
23935 1540 -41518 -109380 -131879 -69234 -31052 -45881 -9204 3356 -1000 12787 -645 -42691
23923 -42691 -51117 -45080 8695 10620 -23190 -96999 -134041 -97909 -27368 -82823 -120067 -103274
23911 -103274 -37809 -41458 -69155 -71102 -48844 -40833 1498 5584 8947 -5179 -32226 -40227 -20954
23898 -20954 -30440 -57849 -34298 -13857 9627 -748 32864 16311 25534 133425 152688 66791
23886 66791 65802 25339 13115 -4467 -26059 -5587 -37199 3611 62575 10438 28505 40983
23874 40983 57857 -4483 -20878 28820 61928 25013 -14402 -22875 -81307 -81651 -63171 -36750
23862 -36750 -20630 4912 -18974 18401 57709 41507 25059 -2557 -21389 -70035 -38729 -24982
23850 -24982 -58914 -11518 -18088 -41437 -81314 -48894 -24988 -5754 15564 27534 27013 43209
23838 43209 23913 -12001 -26267 -46565 -84895 -83229 -58497 -30835 18012 -4350 -52439 -27724
23826 -27724 24426 9934 -7545 -14991 -43491 -58148 -68831 -108216 -77363 -58929 -54578 26932
23814 26932 75295 72175 27716 -15541 7988 7273 -3701 -1009 15563 12814 -8562 24272 41265
23801 41265 56778 36643 11125 -2209 -8612 -33218 -15579 -12071 -26808 -49308 30380 73823
23789 73823 113951 120913 66813 37323 50278 59306 30540 -29883 -43183 -7730 21783 12623
23777 12623 -4313 8875 -11094 -38628 -1248 29052 -2772 43022 19978 -24879 -64677 -65822
23765 -65822 -1239 -9131 8772 11454 38446 5655 3893 27878 14260 -23191 -14347 7500
23753 7500 24902 65061 -19820 -69243 -109273 -44890 1359 -16503 -49621 -94634 -95925 -43374
23741 -43374 17938 -21548 -76802 -127818 -89329 -86577 -61277 -45233 2234 -12094 -80431 -76591
23729 -76591 -33421 -3283 -13033 -27974 -30938 -97104 -128063 -71722 -92243 -62917 4164 -32207
23717 -32207 -64650 -83077 -92821 -54306 -11395 -31239 -52695 -8069 11904 -16858 9127 25164
23705 25164 -4723 -17430 -44013 1831 -20999 -72651 -37615 31907 55705 26515 -13728 13057
23693 13057 28982 63051 95614 88425 54352 36601 -1597 3394 35693 -7280 -12701 17652
23681 17652 -25864 26767 30870 3728 -26141 -22551 -38415 -26969 -9432 8578 48001 32137
23669 32137 -58074 -92195 -146413 -107919 -45971 8610 -18925 795 59953 69855 50080 82742
23657 82742 36025 15498 -11842 -20260 -45822 -9824 11235 7077 -8696 -2127 -3233 18438
23645 18438 45654 37150 33781 21133 -1758 -32951 -67309 -86947 -102730 -105621 -77739 -40989
23633 -40989 28198 72177 53029 32073 24595 -17305 -16602 -13353 28447 47994 10968 -13293
23621 -13293 3130 48570 49825 -17789 -97556 -84497 -53378 -7045 -11341 -4546 85351 92694
23609 92694 43303 59061 50611 45441 29302 1816 314 1613 -12801 21018 43004 -10273
23597 -10273 -18982 -56944 -36289 50310 54254 86161 136930 148034 79119 52631 39885 15098
23585 15098 5909 31708 42405 47452 51303 57597 22920 78313 91288 97446 93917 36858 48066
23572 48066 34127 19129 46196 91758 24638 -10600 5247 -20480 -10174 25934 38764 -31749
23560 -31749 -56652 -63554 -19779 -21286 -8153 2409 -9759 -19395 3422 60447 50276 43545
23548 43545 15804 28758 15701 -4538 22599 28148 2480 -75117 -125354 -73635 2997 57196
23536 57196 78142 -14580 -79653 -77737 -45987 -46715 -86998 -48345 -11286 24405 56782 54931
23524 54931 40542 36712 54849 22628 20429 49827 40118 18653 50332 71053 47532 51968
23512 51968 35774 19968 43883 17771 4918 -27243 -21882 -25660 -24496 -41174 -60214 8108
23500 8108 45755 37091 60763 7551 -31165 -78621 -89118 -27436 1916 17104 8807 10113
23488 10113 -9549 -32949 6775 6438 20346 39090 -5700 -13070 -17079 -38662 -50971 -57171 -71608
23475 -71608 -57435 23175 80008 79896 56189 27257 -274 1488 2636 10779 45603 33276 -14230
23462 -14230 -30152 -42412 -24851 60737 94459 55781 14888 586 10776 80442 103092 97213
23450 97213 54617 6805 -17787 -47605 1717 45485 30506 37662 48911 19376 -4022 -8119
23438 -8119 2174 7861 17761 41914 37493 -33364 -60798 -24577 -8568 -5800 -37142 -6334 55597
23425 55597 59874 31703 -8892 -33762 -32037 -9350 8342 -13220 -11200 7912 -4594 -37850
23413 -37850 -20143 1400 60359 76182 65290 10535 11581 49676 -11715 -5573 23836 29421
23401 29421 35772 33849 34195 41353 -31137 32221 47133 30487 46461 25560 -6426 256 -17883
23388 -17883 -29623 -46560 -58339 -42082 -44164 -56409 -98045 -113688 -92264 -56498 -41985 -34525
23376 -34525 -34873 -40496 -3205 14990 47683 28990 -7669 -10686 -10844 46147 98751 65285 50381
23363 50381 37530 40833 11756 4063 -7712 -12846 -19909 21627 56316 58800 -41795 -48405 -40194
23350 -40194 -7813 -17167 -21174 -73462 -61747 -67843 -79180 -83854 -100430 -49937 -67165 -76566 -39717
23337 -39717 17802 33760 36844 36244 30473 5400 -6981 28083 24737 -27405 -9052 16039 -6719
23324 -6719 -77257 -56748 -13660 -28993 -17093 -37244 -36878 3431 -5922 38483 48171 64267 48203
23311 48203 29580 14377 6209 36554 58556 44846 -19089 -41224 -48959 -23260 -28737 -23455
23299 -23455 -6551 -32813 776 73863 62846 42491 31624 26589 -2898 -20039 -46768 -47457
23287 -47457 -69712 -70168 -34482 -54144 -27633 17301 102945 92797 92194 80220 55072 103703
23275 103703 48135 29131 64891 16408 -67811 -35923 4119 -48112 -45709 -28635 -35987 -43377
23263 -43377 -32658 9183 30458 13069 66461 63463 8386 -9678 -26519 -34517 -64493 -89608
23251 -89608 -74442 -45087 -74019 -109497 -58624 -56133 -97364 -106946 -115215 -94378 -60403 -36420
23239 -36420 -74452 -43731 16363 6993 -20215 -28060 -28827 -57487 -79321 -55151 -32869 -26733 -20130
23226 -20130 -806 -4769 -21515 -53750 -45519 -62172 -68357 5114 12461 -25311 -58332 -28785
23214 -28785 12644 3291 27708 19545 -65443 -38999 16630 9132 8973 579 2292 -23414 -59929
23201 -59929 -54828 -34099 13915 -17463 -49978 -60026 -103420 -72883 -22154 -31888 -48237 -66221
23189 -66221 -130724 -71794 -34909 -18610 33700 77975 70104 65628 28847 15878 18026 62961
23177 62961 69304 41693 39021 68563 71850 60031 77986 81500 103330 91557 30440 -44370
23165 -44370 -70158 -75122 -17861 6296 -1065 -22159 -22849 -38991 -41858 12738 31160 32180 -11773
23152 -11773 -10716 -15841 18990 42356 -26 15945 25630 554 -13183 -1898 -7003 -48118
23140 -48118 -75357 -88848 -56279 -15269 -2084 14635 18084 11949 72846 85093 22353 4469
23128 4469 1740 10436 25519 26969 27019 40818 10007 50798 51082 32163 17840 7995 -19662 -13052
23114 -13052 -36834 -35438 -12248 -32951 -72798 -80950 -55480 -33200 -51989 -103009 -92971 -49296
23102 -49296 -19137 -10956 -17562 7169 27560 35060 -9726 -9521 -6833 26119 -12662 -13331 35210
23089 35210 27330 10721 -30534 29260 45723 45545 45471 48948 7565 -34680 -42712 -28834 -33443
23076 -33443 -50904 -35312 11839 8025 -8924 -12783 -16462 -45147 -22677 -17487 -56525 -33029
23064 -33029 -16907 -40215 -13839 -19207 -71923 -67444 -32287 -46643 -35023 -12603 -714 -61665
23052 -61665 -64473 -46757 -4932 74996 57941 47643 21024 18169 76627 62653 22996 -19765
23040 -19765 -36923 -9664 -17363 -8101 -28201 -14649 -44122 -11612 28034 9861 35785 24654
23028 24654 8201 -433 -6152 -15888 -34168 -9345 -7283 -26731 -75902 -41079 -3700 -28807
23016 -28807 -36896 27838 -16070 -45124 -43761 -3138 -36799 -77829 -104803 -84812 -50321 -9538
23004 -9538 -21219 -103139 -127154 -83750 -54793 -113105 -102585 -35592 -5636 -37344 -11441 -42790
22992 -42790 -112169 -130041 -68253 37069 62239 18421 7398 16630 6691 -10886 -18296 -36654
22980 -36654 -121924 -112613 -66042 -40854 -38665 -13866 -12045 -72810 -73466 -71724 -53889 -46161 -41248
22967 -41248 -72699 -67885 -10039 -12506 -3533 -38101 -10215 -12298 -15386 -13561 7244 11928 -6442
22954 -6442 -14905 147 31344 48381 23272 24694 -9764 7350 5545 -38286 -50830 -21722
22942 -21722 -17099 -50716 -47146 -62441 -48094 -68333 -40661 -3839 12538 4032 2466 19268
22930 19268 -199 12486 -62281 -111462 -120548 -63456 -20893 -66102 -94793 -93035 -94407 -103665
22918 -103665 -53949 10577 -1199 -40876 -66891 -50031 -77533 -90890 -100089 -94670 -21096 47327
22906 47327 -17440 662 4951 -12047 -19619 -259 3473 -8549 4783 20946 -41875 -87749
22894 -87749 -78444 -24429 30181 15278 -35417 3628 -5330 -16691 -28301 -41823 4527 4320
22882 4320 -17948 -23243 -23725 -7303 -35697 -61616 -18097 -29625 -44261 -591 37287 35244 32344
22869 32344 23473 -28374 -53645 -66622 -61507 -32533 -24102 11512 28048 -1557 5199 -12649
22857 -12649 -55366 -67518 2452 78681 91255 111922 58108 13046 20326 55881 45712 -31543
22845 -31543 -50614 -28704 -9143 -27496 -85163 -99082 -83267 -114061 -130356 -112831 -91172 -46495
22833 -46495 -25196 -32802 14599 -5086 -21090 -24213 -45083 -62 25353 4581 -23880 -3034
22821 -3034 -580 14369 23556 56425 114957 102072 59466 10780 53233 68360 49774 80906
22809 80906 11401 -44757 -27536 -23660 -20175 -28616 -27632 -49975 12757 22759 -48633 -44809 -1382
22796 -1382 -2078 -27393 -97992 -79204 -93256 -76079 -52528 -42245 -55367 -66803 -33208 -48893
22784 -48893 -85152 -66538 -37075 -50014 33168 6332 -38800 -13924 9665 68708 62409 273
22772 273 18574 13399 -33949 -42852 -55367 -52688 18346 46508 -4709 5051 10722 29570 74276
22759 74276 70981 49550 23224 16322 -1016 59831 68160 71699 95465 38508 -36725 -46747
22747 -46747 -13434 45497 106752 62366 10927 6689 11447 45264 55543 -12912 -30199 -26309
22735 -26309 6251 12167 30696 3505 -22929 -43717 -58745 4563 5455 30821 -253 -63224
22723 -63224 -91411 -68844 -40346 8034 82382 89582 118265 76496 24135 13730 -11927 -24772
22711 -24772 -45582 -50674 -15914 -21580 -61338 -24991 -34378 -28757 -60132 -76987 -73302 -71438 -9119
22698 -9119 11606 -11281 -54627 -107991 -109531 -76913 -2333 -31697 -57992 -40503 -17088 -14916
22686 -14916 42764 64966 82976 58695 38697 39942 15608 -3384 27684 44223 -7341 -75009
22674 -75009 -73405 -35800 -36663 -12078 6913 9419 23034 22511 -9786 -27932 -25355 -88696 -54469
22661 -54469 -64475 -141813 -160426 -126461 -52638 9850 75162 88396 43300 -14852 -37388 -77993
22649 -77993 -57614 -47421 -72456 -41854 5958 9793 -3080 19417 6497 -16082 -14216 -26592
22637 -26592 -41177 -36828 -9463 -36113 1570 -17200 -75847 -101806 -150499 -130170 -73381 -19275
22625 -19275 -27733 -31274 -32614 -23832 5557 5378 -10489 -11503 -4061 -6716 -15655 -12420 2631 4147
22611 4147 -34867 -69011 -104915 -126102 -89599 -35649 8501 -3331 -17747 -13890 -48177 -128708
22599 -128708 -151955 -169985 -129187 -94518 -67400 2342 17340 -55070 -75688 -53335 -32148
22588 -32148 12407 -22562 -91766 -93726 -96194 -93226 -57108 -69005 -64773 -114326 -166293 -180226
22576 -180226 -77448 23250 108212 102162 28632 7361 -20746 -12975 22880 19555 -11098 -54926
22564 -54926 -60937 -86369 -96646 -92784 -122748 -99571 -74958 -53169 -57857 -45104 -58256 6363
22552 6363 25885 56399 64564 87158 84881 47740 49346 54512 86666 102882 20710 -10032 34883
22539 34883 -10742 -46054 -20806 39028 42542 33149 -11063 -37668 2648 40880 10975 9389
22527 9389 34155 47996 9562 15191 34295 12419 -22071 14975 45188 35477 71839 41827
22515 41827 7216 -32050 -70389 -40955 -36896 -20804 -10946 -14324 6485 -6059 -13062 -57442
22503 -57442 -10356 -40943 -43471 -87406 -85180 -67611 -30622 -63690 -34483 27257 25188 -56200
22491 -56200 -101218 -72257 -65770 -109155 -97809 -69062 -68938 -47624 -883 8536 -19729 -16607 35964
22478 35964 -31156 -31890 -36151 -63240 -102832 -109096 -17970 -1104 -9905 -65464 -74384 -38866 -57016
22465 -57016 -60854 -47320 -66122 -82155 -65617 -52059 -76269 -119346 -128518 -81315 -77187 -64229
22453 -64229 21689 38325 11945 -15772 -46662 -53361 26400 65407 41154 24632 12446 19083
22441 19083 37189 46050 38764 13204 -12887 -52504 -78459 -68882 -12041 -8729 -2414 -9284 -40148
22428 -40148 36015 57449 23034 35590 37032 42090 54463 42725 6966 -79315 -83131 -7370
22416 -7370 19036 49648 8826 -94648 -55629 -16215 -3704 -15981 -51816 -72389 -105739 -96267
22404 -96267 -55661 -7969 1857 -11260 -42834 -57702 -30437 -3577 -26857 41596 68568 6697
22392 6697 -62557 -68748 -57832 944 55972 69201 51072 58658 23235 -14181 -19396 -53730
22380 -53730 -46617 -9134 55291 70349 65360 58436 57122 25091 -9919 -44836 -53255 -10562 53623
22367 53623 112373 103389 31208 5424 9959 2007 -9690 -19870 -17865 -24657 -9858 -35527 -44781
22354 -44781 -47517 -87894 -121389 -142654 -111808 -28028 43130 21735 26129 26523 17385 -10482 -60241
22341 -60241 -98417 -55173 -4408 22202 73087 78623 100359 68698 39995 -8526 -37747 -2543
22329 -2543 25619 30203 -2793 -33472 -35068 -17193 -27588 -68022 -72668 -37981 -2719 -2022 7385
22316 7385 2889 -55478 -29536 6141 -4499 -88639 -105578 -59570 -45919 -19027 -6659 -19170
22304 -19170 -53463 -60590 -33072 15016 72621 55178 -37346 -14009 35694 66184 65726 44993
22292 44993 71460 43774 18185 -37784 -67042 -13678 3644 9279 40052 80824 56885 -39873
22280 -39873 -47337 -17829 -23720 -22272 -24240 16105 27637 45914 31508 -4425 -50827 -25918
22268 -25918 -11903 -11878 21375 33518 -26524 -78495 -65212 -22673 30800 -8727 -58183 -33539
22256 -33539 -22250 3132 -15012 6298 25598 10209 -14086 -22847 -45160 -29752 -37992 -17476
22244 -17476 -12738 -80437 -86356 -82305 -97514 -83404 -40665 -29576 15920 17546 10920 22810 29718
22231 29718 20400 27730 3132 -43069 -50110 -14949 -3446 13794 -3639 28121 70320 100529
22219 100529 79424 63606 17136 6270 43349 11988 -12994 -25801 -7161 -37736 -71532
22208 -71532 -53807 -19974 28393 31617 5070 -15829 -53521 -85247 -121180 -79707 -58856 -43637
22196 -43637 -77757 -59986 -67730 -46885 -14317 45122 46152 41820 72903 94421 90158 35993
22184 35993 -18141 -18668 -6379 11593 -29796 -78062 -72036 -79485 -94323 -63278 -42089 7504
22172 7504 49974 60695 26927 -9391 -797 22265 9415 32374 39678 -42991 -65868 -47658
22160 -47658 -71433 -112564 -83601 -38794 -31751 16562 29000 -29304 -23536 -27622 -6164 -51187
22148 -51187 -97316 -56193 -37693 -49501 -19204 -6917 -44269 -35771 -10807 -86486 -113954 -90398
22136 -90398 -80139 -93501 -63952 -24496 37274 41728 18749 -39465 -75824 -56885 -5383 -32075
22124 -32075 -49999 -45145 -26255 2542 -6568 -24302 -38415 -4930 -57554 -58546 -11186 -22311
22112 -22311 -5829 -692 -20886 -58726 -66167 -35229 30746 35523 14749 19792 11704 61967 63574
22099 63574 63086 75162 22832 -34803 -29212 -26258 -61874 -76733 -46065 -38285 19710 7409 -8017
22086 -8017 -24783 -37638 -38126 -33716 -18581 -44627 -46650 -5105 -3225 -6193 20245 40248 68966
22073 68966 76153 10621 -40076 -43884 46499 85710 60469 31980 -7555 13907 14046 19355 5947
22060 5947 -36733 -61329 -78029 -51216 -35335 7206 -54395 -96637 -89220 -30908 -20184 -39265
22048 -39265 -37759 -48222 -35056 -8815 24531 86619 111940 37539 8537 16529 -3002 -14032
22036 -14032 -13931 -10492 15667 16975 -27388 -23439 -22064 -16795 -8081 -34706 -12529 8050 -5906
22023 -5906 -18828 -22234 -3809 -1397 -23581 -66009 -33494 -40235 -26178 -9788 -6270 5573 19572
22010 19572 47377 -5979 -43414 -63444 -58137 -37959 5816 -7590 29505 34096 -1388 -67965
21998 -67965 -48919 -87843 -64628 -39847 9816 -28125 -1516 1199 -22705 -25666 -28941 -14012
21986 -14012 -26026 2719 39950 72912 46796 22522 10016 34124 45755 45448 22715 -9946
21974 -9946 -60221 -69084 -32489 -34171 3538 10222 34507 -14351 -51313 -65752 -47202 -24850
21962 -24850 7897 -26781 -47606 -62463 -41424 4260 7440 17470 -12553 -55509 -13163 -17011
21950 -17011 -461 40385 82122 42397 -32438 -16928 -19211 15177 24392 21479 -18230 -105891
21938 -105891 -128376 -35923 -8366 -68485 -86718 -120807 -99696 -68611 -29336 -35550 -61813 -37189
21926 -37189 -77425 -80080 -35842 -15174 22011 57772 6414 -14137 13311 50714 38963 -7269
21914 -7269 9344 -1847 -37426 -53130 -81390 -141385 -159861 -140056 -72251 -94580 -72361 -18127
21902 -18127 28844 55511 42955 15337 -2071 -35697 -28461 10091 -13357 -22996 32288 28369
21890 28369 -15857 12079 42500 68705 63046 6493 -3031 -16806 -18487 12187 21173 -5442
21878 -5442 9264 34219 7486 17195 78017 44867 11155 26700 32500 -3855 -72664 -64203
21866 -64203 -38506 -71633 -3588 50036 50113 27975 41624 20234 -8223 -5773 -16839 5679
21854 5679 -15941 15439 8051 -42507 -16987 -28223 -86538 -86085 -55763 -73386 -92119 -37220
21842 -37220 13096 -2565 -15122 -20291 -8580 -4758 -260 51173 56058 51753 12170 -14884 -13160
21829 -13160 -23440 18658 42959 30947 38613 52234 80413 49910 -31614 -35794 -31397 -60301
21817 -60301 -56111 -21419 -2260 17259 22515 -10551 53111 38710 22913 13879 19055 46996
21805 46996 55379 15099 -1082 17337 -13149 -52855 -37319 -42212 -59371 -37624 -43506 -43107 -13808
21792 -13808 7898 -15347 -9832 -37179 -95698 -118515 -62809 -34899 -18639 11122 16706 -9334
21780 -9334 -30167 -28394 -36549 -1695 20139 36196 11241 -17124 -38724 -79143 -115722 -45509
21768 -45509 -34302 2151 20212 21311 -6061 14044 33418 29771 12026 43000 59823 60919
21756 60919 29651 27288 16838 -14974 -35427 -45580 -22634 274 -25969 5739 18521 25394
21744 25394 9043 36626 72786 3374 -70876 -87388 -36549 29932 16309 12605 -9927 -87207
21732 -87207 -120484 -93575 -54027 -77630 -89907 -89964 -49953 -621 -646 -30995 -41790 -54423 -51375
21719 -51375 -585 6964 -10301 16266 49648 23446 -86928 -107170 -55681 -93179 -135163 -141079
21707 -141079 -113925 -54023 -17015 8515 3794 14333 -2898 848 39847 17174 -41802 -48045
21695 -48045 26594 93956 87306 59359 66045 76626 65371 10533 -20167 -30299 -95067 -88190
21683 -88190 -30673 -8274 -17394 -25551 -59257 -81534 -75301 -65659 -22166 -17187 8921 11826 34088
21670 34088 47262 -2271 2702 -11111 -42396 -27665 -31055 43447 71449 44966 -9445 -78043
21658 -78043 -79313 -76435 -51264 -15749 -21697 -7397 -25693 24329 48746 16883 15328 76544
21646 76544 122181 98769 43202 33914 20419 -1280 -24849 -82592 -65813 -78962 -47872 19682
21634 19682 21180 4005 -13869 -56084 -87450 -49400 -17612 -21770 -34962 40930 53848 55100
21622 55100 12827 -68295 -77893 -39832 -5560 44679 45411 23524 9773 -20358 -17181 -40692
21610 -40692 -73035 -46597 25040 55710 36289 732 5267 35353 41118 46458 110378 103499
21598 103499 42909 2855 11803 76942 70235 42134 62991 49316 48015 25438 27549 20895
21586 20895 7656 -8694 39083 18893 26558 18164 -14266 -3806 -2947 -12224 -29994 -19246 410
21573 410 17821 11973 16275 36528 29048 -68722 -95199 -79550 -25602 -7976 26871 -499 53821
21560 53821 40822 31327 58564 51067 37223 -13902 -8439 -9354 1212 17957 24280 -11570 -7423
21547 -7423 15266 45143 32311 -37732 -26843 1678 -32728 -95063 -151973 -76031 -48430 -39318
21535 -39318 -37804 -22524 5820 -27415 19961 95373 100851 90028 56245 35353 93757 164062
21523 164062 101342 15865 961 8530 -27678 -6561 28871 53200 55525 15010 -29034 -78948
21511 -78948 -120575 -125654 -121226 -80334 -22157 13111 -11921 6966 61515 107182 90586 67910
21499 67910 34096 31812 -17046 -76988 -83977 -63039 -21762 15139 -30067 -83258 -63546 -60586
21487 -60586 -41633 -41736 -19146 -21531 -30113 -7401 -25110 -50876 -71714 -29514 17451 12013 28907
21474 28907 12243 12050 17154 21607 73887 97576 37405 2280 -29148 -39430 -46152 6718 20766
21461 20766 70368 122269 76187 3584 9545 8105 -38488 -47999 -88353 -94118 -7049 39543
21449 39543 7840 -17050 29195 59494 34644 19076 52294 28309 13104 8564 -26468 -79384
21437 -79384 -104081 -113468 -126569 -110166 -121001 -109330 -11323 7199 -10856 -27602 -54862 -45447
21425 -45447 -6425 -2051 -41512 -36050 17889 53237 63572 31525 17327 -19631 16920 5127
21413 5127 -31944 -49726 -83196 -70969 -75130 -105686 -74528 -15365 19557 -16422 -21080 -36437
21401 -36437 -56852 -8717 6726 -26914 -39612 -2991 80406 86139 52492 18500 34797 41786
21389 41786 31685 19694 15074 16784 35130 -10724 -49671 -8222 62417 60721 58011 19981
21377 19981 -28936 -62855 -91610 -27687 2230 -79669 -156363 -148740 -68320 -21988 -18458 14581
21365 14581 -3950 19872 21715 15229 -7494 -11634 -13598 -47630 -27045 56890 59622 35107 42044
21352 42044 31217 45100 25406 -4610 -15814 378 11169 52274 48603 18176 28073 37599
21340 37599 74477 34512 41749 38747 13394 -15617 -33790 -17447 35354 39398 -17860 -46930
21328 -46930 -48707 33695 57974 65775 52658 43780 -7345 -90119 -90417 -37390 -69149 -78515 -93570
21315 -93570 -12502 38761 52969 5794 -49797 -91107 -108108 -84830 -102701 -88251 -44615 -40849
21303 -40849 -30490 4496 36500 21682 7382 46915 38943 29494 4763 3998 6617 -30088 -16654
21290 -16654 -26708 -23780 -65955 -82543 -58325 -64881 -79663 -85184 -72476 -80285 -77312 -15449 22315
21277 22315 40085 75260 55209 60250 -8488 2699 102576 99317 49975 17677 -7357 -16978
21265 -16978 -18712 -39114 -41509 -70175 -67651 -45372 -60142 -72954 -49903 -10497 45831 55282
21253 55282 54702 60510 19023 -48246 -19746 -26823 23697 38699 84679 81471 23999 -22392 8680
21240 8680 -22621 -37799 -21501 -9947 1847 -16652 -1269 -20745 -45065 -28984 -30821 -19046
21228 -19046 21099 35483 7329 3778 -9955 -16398 -34150 -33859 -37523 -46328 -53718 -33688 25345
21215 25345 18843 14290 -2788 -25533 -32243 -43570 -57747 -73792 -89675 -37791 -74365 -149375
21203 -149375 -104312 -59199 -7827 -27816 -73500 -100773 -22284 3217 56759 55676 72552 92491
21191 92491 43174 10762 -16436 -19662 -201 -3710 -25552 -39472 2597 5244 -6277 33619
21179 33619 38168 19978 57579 40608 -10736 -57641 -40137 -19528 -46782 -53465 -56150 -67878
21167 -67878 -34310 15543 -19275 -41988 -21445 8612 14226 30196 27783 -132 -7367 10281
21155 10281 25290 15594 21094 57308 55325 13992 44108 -5686 -33126 -175 -63671 -143720
21143 -143720 -128331 -126917 -112621 -95420 -67926 -10531 -212 -40022 -32623 74 -23273 34236
21131 34236 32536 37954 31596 -18164 -63002 -78587 -69022 -64769 -91289 -104633 -65432 -83753 -80474
21118 -80474 -73955 -47685 -27737 -19660 -15486 -16382 -51589 -93712 -67957 -31345 -16689 7842 -41208
21105 -41208 -74820 -70301 -78643 -74937 -101441 -109409 -88213 -62118 -17570 -1417 -773 20594 97465
21092 97465 103949 105205 59858 -4210 -9070 38769 14634 8009 16459 -10910 31208 19927 -12560
21079 -12560 10132 16552 -15045 -41753 -49734 -36662 19258 -3014 -41160 -62469 -85662 -120557
21067 -120557 -88506 -63866 -66151 -56848 -43897 -44551 -44566 -95186 -110358 -87467 -58686 -43396 -19816
21054 -19816 6298 8438 -19443 -24614 -49052 -64186 -45979 -10676 -20569 3306 8428 15136 -6415
21041 -6415 5709 -64438 -44581 -41888 -72745 -44365 -61849 -90094 -102933 -86825 -104516 -43950
21029 -43950 17317 -22991 -40926 -38474 -74430 -94877 -74790 -67099 -45203 -8886 31234 5002
21017 5002 -24765 -41701 -35655 -43446 -21825 -68987 -89684 -74588 -57478 -62462 -79395 -80789 -58970
21004 -58970 -59719 -61350 -55777 -64870 -26656 -17482 -28860 4659 51346 106102 29496 -43028 -76327
20991 -76327 -71012 -47342 -25779 -9353 6163 31051 28954 33525 31583 65032 136966 117239
20979 117239 53283 26918 1245 -3301 -43758 -25689 -13905 -5422 4951 -13162 -44861 -22071
20967 -22071 17953 16770 43426 40050 37738 19001 25885 24135 12886 16409 25906 76240 79777
20954 79777 67688 69192 31355 -10040 -7419 -49754 -52852 -77201 -94999 -67870 -44371 -4690
20942 -4690 48054 14384 -68345 -94804 -115853 -81363 -18162 19612 36005 15128 -26547 -24330
20930 -24330 -46721 -44696 -93421 -108271 -26983 32547 -7557 -12806 -33015 -74413 -70049 -31770
20918 -31770 22287 49444 22818 30144 13089 -1662 -5766 34658 57926 38775 11454 -48157
20906 -48157 -16796 29561 51670 8122 -31338 -16159 -5931 9722 -31374 10616 -20272 -14823
20894 -14823 -32158 -65307 -62781 -56566 -37429 -19318 -4320 -11538 -28573 -2973 -5575 -71580
20882 -71580 -110179 -72820 -45487 -45250 -52168 -8057 -11260 -16107 -21590 -35896 -66749 -69735 -42056
20869 -42056 -42165 -21964 -17629 -80645 -127154 -76425 -15975 -7856 34930 73963 44051 19357
20857 19357 25205 70842 82128 65783 42791 72057 60238 12031 -41358 -85726 -77171 -62925
20845 -62925 -93164 -127667 -64930 -17052 -33458 -74489 -118104 -124879 -42337 61225 74063 32936
20833 32936 35666 39417 20613 30790 -19613 -84357 -125652 -97858 -60141 -36534 -11179 21083
20821 21083 4512 -35971 -13610 -17470 -18177 -27047 -49987 -38937 736 -46416 -25779 35754
20809 35754 28299 -13256 -11446 39531 34108 20650 -9329 -26482 -15851 -1509 10678 18527
20797 18527 -11927 -40828 -65446 -37507 -59150 -113314 -85951 -54347 -48305 1341 35644 24490
20785 24490 30289 -15690 -22162 -23027 -24605 -38390 -34353 -44195 -87441 -120231 -109600 -93992 -109926
20772 -109926 -87450 -46442 -31989 -10628 -79003 -92080 -73201 -32849 5123 8774 -30031 -47065
20760 -47065 -67511 -17720 24078 12605 -13156 4444 28568 53793 27171 -15808 -32314 -25186
20748 -25186 -41593 -71121 -119469 -152037 -144539 -96189 -44994 -44842 -17608 -16541 11207 18917 38643
20735 38643 15832 -1334 20841 39490 7386 -22366 -23238 -8742 19335 74834 57113 59382
20723 59382 66787 64093 45102 -10463 -4187 -43581 -82702 -80768 -62269 -51094 -9633 -27352
20711 -27352 10776 16471 -32230 -14408 -19527 -43465 -61214 -75998 -67268 -55984 -45951 -73589
20699 -73589 -75758 -7573 79581 -17913 -79811 -28235 31850 31196 -43413 -60228 -56493 18772
20687 18772 28740 -31496 -14999 -16676 -8912 11814 22171 46552 50078 7217 -8282 23755
20675 23755 -7991 -13722 -1003 8688 -14710 8310 -6810 -7747 -10476 -55132 -97380 -31718 4132
20662 4132 -20519 -35005 -25752 -43423 -63921 -83617 -52479 -33616 -33962 -41714 -2915 59680 93445
20649 93445 94112 40397 -1994 -25346 -29558 -32544 -66193 -118489 -105636 -35450 -20341 -40146
20637 -40146 -68505 -96813 -71853 -80606 -73679 -47378 -40007 -6197 25851 89469 79235 74752
20625 74752 20535 26538 37507 7575 -28709 -80240 -45940 -21587 -6247 -21694 -4300 22996
20613 22996 -21389 -62639 -408 25336 32487 749 -27194 -19811 -26539 -33518 4307 86289
20601 86289 97613 44326 -37646 -66947 -59509 -37679 7318 5311 -15117 -14392 -21312 -36580 8368
20588 8368 73429 77870 71636 88030 63727 38784 17263 -22460 -36099 -37469 18833 52876
20576 52876 55483 60899 53688 81603 86913 115984 93255 82402 83045 48744 -4154 -16679 -1503
20563 -1503 105772 133208 110835 89319 53152 47557 20377 -14191 -17327 -73171 -129355 -104764
20551 -104764 -83336 -57416 -12746 -34320 -97523 -25521 42120 15202 -75052 -82936 -36167 -27927
20539 -27927 -37087 -83749 -101196 -97287 -129952 -103836 -74829 -45760 28240 8935 -12398 36095
20527 36095 22333 36555 24746 -44546 -80140 -48828 -20626 7701 60411 39782 18884 10186
20515 10186 -5175 -42027 -35715 -42707 -48583 -33261 4488 14883 -62878 -87778 -89981 -76677
20503 -76677 8192 60248 69594 16827 -8327 -24171 -83746 -85853 -43166 -22166 -18462 8412
20491 8412 57394 64091 -4766 -14270 11295 35522 42745 35451 40484 24778 -21278 -16089 -44197
20478 -44197 15919 21385 4900 -8867 -28552 -8290 43217 44595 -30274 -64270 -30517 -25827
20466 -25827 -8464 -10451 -45540 -82674 -65413 -53313 -61737 6875 18650 7803 -40096 -92644
20454 -92644 -56917 -39508 -67888 -42406 -16918 -7157 19041 -36744 -99304 -75166 -86487 -82519
20442 -82519 -35675 -30250 -44831 -79990 -78173 -111426 -139708 -136735 -114956 -70910 -77884 -54506
20430 -54506 6006 6188 -12804 66900 119504 59572 5918 -41521 -49728 -63140 -30488 -13391
20418 -13391 -34617 11221 56427 96272 73730 7366 -41751 -60288 -38657 -39933 -23307 -37316
20406 -37316 -60536 -130669 -174910 -138175 -93824 -93708 -95641 -70535 -69612 -22813 8772 -10955 -27958
20393 -27958 -5919 24267 -29442 -106458 -95533 -50042 -55415 -9455 -18746 -3867 19040 31005
20381 31005 57530 57020 13943 5600 24544 14077 7867 14355 37092 11185 -3847 -26017 -48043
20368 -48043 -27218 2217 7397 58602 77167 25421 -16683 20137 39213 12165 15676 -5006
20356 -5006 1092 -538 -39769 -15351 -11457 -11763 -19379 12649 77789 88430 61778 51658 -14557
20343 -14557 -35346 -57371 -62971 -29449 -8302 13802 -14487 -33315 -14981 12114 -42088 -63592
20331 -63592 -39383 -40212 -7772 31831 2655 -52119 -8102 6482 2006 2609 -53393 -74988 -59923
20318 -59923 -33201 -29571 -11591 4402 16949 23244 58161 16848 -6590 -34522 -28066 954
20306 954 26294 6987 -49683 -27460 1157 28202 29750 18080 -14469 -34593 -38601 -52320
20294 -52320 -60167 -37827 16668 8754 -26740 29048 -18701 -42313 -17206 16745 -6563 -75175
20282 -75175 -59502 -60518 -36137 -43906 -48805 -39543 -34315 -13918 14718 42998 71565 45332 -164
20269 -164 -54715 -29700 16353 -3568 6330 -19266 -10574 64923 74690 62653 57161 42720 20894
20256 20894 -21603 -12759 -4030 31922 49064 -32216 -42306 -22663 13512 79647 105950 95430
20244 95430 92494 84838 21206 37928 15235 21762 40715 84207 45162 65385 126790 115227
20232 115227 66818 18395 -23982 -18680 -24980 27104 62637 118548 91016 378 -37928 -72353
20220 -72353 -81943 -90703 -93017 -66474 -43491 -26908 37533 55522 28557 -13960 -62690 -87680
20208 -87680 -73862 -32718 -24061 -39993 -16228 38939 46615 20801 -22519 -43318 -38732 -54952
20196 -54952 -43719 10845 43985 18026 -5546 -16252 172 8669 -54950 -86849 -27109 -16946
20184 -16946 -9951 -13335 -80050 -81497 -89324 -57223 9003 -25256 -84760 -69985 -63383 -24796 -2809
20171 -2809 18121 45244 78651 55998 14513 -16052 -15538 -28193 -58475 -59399 -40264 -32952 -31140
20158 -31140 -12765 -6451 -5349 -5493 43265 74058 58696 83247 72280 45001 32452 -21219
20146 -21219 -20723 -25191 -62514 -46678 -46646 -35278 -13106 25616 29882 38328 25434 -16362 -33475
20133 -33475 -42601 -67696 -26200 18294 42264 4727 29594 33635 48627 81544 39930 -8145
20121 -8145 -27752 -33018 -43879 -14035 564 48978 6659 -65505 -88400 -63053 -7492 -18030
20109 -18030 -3442 33600 28986 19044 18087 20585 49076 67856 27931 11232 32751 22525 38429
20096 38429 57107 23391 35258 24498 -79488 -103938 -90568 -39740 -28309 -7592 27439
20085 27439 31509 -22517 -8019 -2043 48242 22774 12900 45865 58451 22985 19948 46274
20073 46274 14693 -25823 -5057 33269 77507 81705 54577 47571 18486 75615 44030 43561
20061 43561 26833 12823 5801 16341 52425 53496 24143 15583 -47798 -23113 18151 7221
20049 7221 -10221 25280 71364 12039 -16030 -48800 -89416 -107592 -98792 -55908 -19403 10130
20037 10130 44689 13408 -10672 -25817 11838 -9188 -34238 -4396 2074 8002 50740 45305
20025 45305 -9040 -51116 -43786 -28234 -49177 -90781 -64756 -366 1233 9021 26597 29557
20013 29557 -13228 -32854 -45474 -25404 -83645 -165771 -86377 -14118 -25236 -65024 -59996 -35318
20001 -35318 2598 -3871 -50764 -91225 -75990 -81753 -90378 -118046 -118827 -112877 -83227 -50395 -43360
19988 -43360 -36535 -8462 15842 46627 17541 9093 5835 -3545 -35223 -40140 -6558 -11332 -56095
19975 -56095 -24110 16258 -2884 -3485 -32066 -103604 -124099 -101137 -56833 -12607 77407 76710
19963 76710 99138 101934 94404 51380 47532 -14382 -68463 -38614 2832 7085 -11373 -31571
19951 -31571 -86332 -123368 -61682 -6116 32386 2230 -20434 19096 52850 61393 40940 -26657
19939 -26657 -22388 -9262 -36506 -54940 -53314 -60067 -29475 4846 25902 46306 45580 77564 136549
19926 136549 181748 105199 -9270 -56878 -82557 -86446 -35479 -82335 -114205 -96638 -46814
19915 -46814 -22945 -6492 4068 -7329 1378 13408 21895 51660 72389 40932 -29286 -44071
19903 -44071 -73850 -27566 15563 16565 15045 7911 16025 -13470 6299 -10634 -45286 -53744 -47948
19890 -47948 -8339 -24002 -25500 -42683 -13234 -11459 -29320 -61769 -82075 -37500 -38866 -20652
19878 -20652 -14370 -31195 36068 16621 20139 9358 -39135 -51807 -70959 -33570 -18144 25511
19866 25511 53516 69364 41182 8774 -24974 -47200 -67096 -50621 -69339 -53838 13975 10792
19854 10792 27986 -17770 -10666 -36821 -49728 -94186 -74525 -7121 19659 28984 44837 -995
19842 -995 -27042 -34345 -10007 30109 40733 67256 46827 79730 89585 71745 40144 13640
19830 13640 49861 39316 36568 64612 95666 36141 -23081 -19755 -11984 11203 26601 -8271
19818 -8271 -36530 -12210 42908 4502 26602 -10440 5127 19641 -21970 -16961 13518 52132
19806 52132 109148 76511 40860 44454 45514 21599 65031 64438 11315 9718 -18928 -20231 -13909
19793 -13909 -51665 -70745 -38821 -53435 -5660 24773 20262 37561 91899 81745 81388 65784
19781 65784 78287 24064 18258 29384 51223 43850 29120 35220 32956 -27486 -32052 -9655 -12260
19768 -12260 -38467 -22569 -2539 54939 76651 31094 -24307 25386 52579 53202 42137 47422
19756 47422 13961 -78983 -71815 -27447 -75740 -71351 -24318 -32419 -7561 62042 60735 66189 103562
19743 103562 69399 58923 44732 48011 57101 19317 -39441 -40009 -6621 2594 -2915 19470 16782
19730 16782 41384 52229 53824 45146 36867 -31185 -70404 -80752 -103670 -79166 -25105 -2033
19718 -2033 -29716 -6619 3089 35220 66482 97536 67176 11229 20033 4091 -1897 48538
19706 48538 36686 38665 99332 65362 21868 16576 30026 5439 -24938 21971 41539 6081
19694 6081 -1151 9519 -55810 -79307 -51884 -16968 -31857 -20646 -18513 7979 18419 -18624
19682 -18624 -70526 -95945 -44709 -23671 -21638 -10675 -27062 -32147 -58629 -62422 -66949 -49844
19670 -49844 6270 22283 11076 39938 10800 -38426 -87691 -100710 -17676 7119 28539 286
19658 286 -727 38431 57187 22426 -20985 -647 22416 60782 63812 60664 105 -13974 2068
19645 2068 40692 23363 -7286 -30503 -62483 -70107 -37840 36412 13654 4848 10349 -3678
19633 -3678 17989 -446 -15764 1056 2815 -12872 -23113 2114 45 11170 -22788 -60991
19621 -60991 -49832 35207 30126 -2507 -1451 2025 -24240 -28407 -32912 -38307 -27776 -25999 -46672
19608 -46672 -69906 -74113 -20296 37836 55959 41496 48900 31356 29590 32524 53303 61676 46008
19595 46008 16062 54389 48724 49540 9445 40827 77347 94726 130105 99706 77711 118079
19583 118079 165743 92638 41603 36313 -7575 9666 26844 25865 21058 -9199 -16246 -5633
19571 -5633 -18874 -24390 6555 63435 79379 37448 2880 29120 47514 -828 -24329 1680
19559 1680 -1395 -24127 50597 74281 40476 25926 22650 31573 44242 -8456 -56472 -28035
19547 -28035 -24810 -6302 -32552 -33645 -45670 -59015 -72271 -48904 -17956 40717 87349 58861
19535 58861 66022 33230 40341 73816 58597 82770 68495 25665 12291 4950 33195 53052
19523 53052 37560 37682 29184 38467 42674 34484 40730 63529 44216 82594 90992 96865 106396 91343
19509 91343 99071 115771 114199 23290 -20161 36168 102599 168922 136587 86869 45125 5150
19497 5150 9673 15139 40084 77246 90997 91720 92216 92185 89433 56078 38603 18785 60359 48785
19483 48785 47977 50897 35152 25861 23730 -5544 -1322 -2744 13771 55329 68894 64114 38268
19470 38268 34561 40783 76491 140790 123723 86657 103529 55746 2698 13594 13712 53431
19458 53431 65015 49810 41960 20460 478 55472 66719 40533 71491 100991 86436 25165
19446 25165 29873 50272 61774 120768 163615 120432 37271 21934 -21732 -29127 7227 36318
19434 36318 16242 142 43205 48536 13531 3992 59015 54988 10054 46643 75563 88150
19422 88150 65972 24128 26261 73950 105093 121534 51554 66929 95118 104632 114378 116835
19410 116835 112148 47271 58642 40079 56835 51279 105160 132402 119593 80451 70579 123335
19398 123335 122788 58703 21528 -22468 -17180 -5869 -2841 5420 88086 133961 58955 -7752
19386 -7752 -21091 -3826 17178 51518 19193 39319 37748 -5109 -12268 -7220 -7958 -11233 -26036
19373 -26036 46795 87217 73250 33894 29041 -26165 -102642 -87224 -12538 44112 61568 49998
19361 49998 -250 -45458 -32754 -10900 13718 -506 -29916 -13046 -26693 -42850 -4934 28373
19349 28373 35567 100385 100763 56736 29376 -22168 -33218 9630 39879 17792 -33422 -64995
19337 -64995 -37505 -8962 30038 70485 78502 88885 125822 107216 46990 36627 16486 -972
19325 -972 -3947 4235 62764 86675 10270 35793 95325 78066 87321 118130 103038 71134 55417
19312 55417 80937 106352 65345 41729 76812 61012 80031 116196 147292 113350 49255 13933
19300 13933 -8721 47481 70183 92054 102580 87048 115653 144930 148511 166555 168361 142042
19288 142042 164557 162534 153574 90993 109128 89956 58425 67064 112938 158183 171859 193388
19276 193388 202228 192213 185139 249686 371651 501863 553183 610662 694996 834361 919508
19265 919508 853003 779173 685744 627809 595428 569734 487193 495833 600377 695592 808549
19254 808549 886349 938581 916297 877128 864722 835151 849517 818057 735997 654629 534732
19243 534732 421135 312554 299086 277128 231466 245501 253046 246956 191478 162449 201498
19232 201498 220541 202105 223873 241694 302717 327373 320039 295167 310900 293898 267558 301048
19220 301048 294058 318887 397625 406463 484258 614152 795932 939539 1045476 1113961 1113364
19209 1113364 1036539 948015 927799 918437 896107 870380 836173 815079 819569 795704 793926 759296
19197 759296 635840 535378 520607 407329 322633 278009 294886 359459 359048 314890 326115
19186 326115 317409 295741 271382 258703 239918 159673 111692 120912 165164 170428 132932 158249
19174 158249 166135 197357 182182 129156 97867 80065 72974 103655 60052 58156 110195 97764
19162 97764 97842 146512 174936 179266 108425 52151 112044 185836 175912 114459 99037 74427 64623
19149 64623 57199 48461 41232 8772 40905 106086 135976 134161 139152 139021 126090 158291 191358
19136 191358 172659 128264 143967 124513 118224 131132 118557 134873 156190 157254 139338 163753
19124 163753 160186 164247 127782 123637 168274 129865 149360 177253 141175 121276 142275 190548
19112 190548 217092 264463 256382 168068 149122 160926 128701 29294 32604 94596 125645 153414
19100 153414 188153 193430 145301 136993 167463 158784 103346 82202 68394 76897 81948 57461
19088 57461 69097 79179 95626 98841 139911 116088 83581 113558 109655 139325 108161 50696
19076 50696 65136 114734 142241 151893 156440 165803 137152 56103 77788 90314 129132 121405
19064 121405 123654 123991 112028 95193 36150 57219 113726 175947 199389 209405 179484 113240
19052 113240 112939 157933 166923 152952 196496 206270 178215 159713 145908 173950 188430 198706
19040 198706 166860 188084 142552 118835 76278 56537 83746 118423 184022 118579 86195
19029 86195 89938 134522 181989 200397 191662 229557 224620 164702 120855 132810 127394 103766
19017 103766 35239 -27401 7168 56719 110269 141860 191112 154029 209774 341012 387634
19006 387634 373344 337174 325038 313161 375435 393043 385478 385552 339601 339637 354641 370947 307943
18993 307943 269726 277727 275250 306777 297006 325139 326421 324637 367209 329700 313397 332505
18981 332505 299381 334909 287523 335326 371378 335497 290620 209681 183406 241722 263258
18970 263258 255389 279744 281129 268207 295589 333745 358568 255158 211328 223371 272676 313490
18958 313490 341346 388885 405944 475606 542618 558208 535883 514515 475926 417646 422154 417338
18946 417338 388943 444087 507457 463385 363664 330822 344250 330448 324208 331442 338993 351999
18934 351999 380228 392789 394462 408247 402526 421478 502207 477953 465702 493018 557778 566051
18922 566051 600511 652180 681529 640640 692031 760492 823112 851289 868180 880830 897332
18911 897332 924204 966231 961074 967440 979205 1013851 1064127 1047659 1030538 947551 856541 825079
18899 825079 854664 854420 808750 835470 789721 784885 715595 691044 722613 686324 621281 544138
18887 544138 485917 480130 460851 440207 482640 492226 498790 554282 640495 729454 790370 808127
18875 808127 798705 807228 844071 901992 908988 974777 1088344 1194875 1252746 1284192 1340060 1411710
18863 1411710 1468166 1609693 1649818 1755478 1782919 1770429 1795100 1757397 1661225 1554172 1532954
18852 1532954 1539783 1600766 1597662 1614952 1610098 1581856 1541737 1483601 1354204 1271758 1192963 1088618
18840 1088618 1084480 1037038 1015103 1048316 1039881 956985 927193 975522 982465 955826 1000967 1095092
18828 1095092 1231921 1381078 1461312 1575054 1621625 1527639 1448967 1413226 1394429 1351449 1401495
18817 1401495 1484442 1536054 1546626 1563116 1653559 1757120 1793876 1820586 1895183 1934279 1944970
18806 1944970 1954033 2033825 2131401 2229732 2393247 2510025 2553842 2598722 2692849 2785738 2904100
18795 2904100 3049170 3234241 3405393 3601025 3917957 4182626 4423097 4726481 5012968
18786 5012968 5306182 5727657 6167678 6658796 7260396 7927515 8644345 9455383 10354845
18777 10354845 11300557 12327642 13569214 15107938 17100423 19739350 23505012 28352761
18769 28352761 33845404 39244681 43507685 45804917 46847062 47779752 50101801 55073688
18761 55073688 63880294 78087715 99691442 129606223 164630724 198579336 223348191
18754 223348191 230957530 224457016 207703484 184912896 158608527 133094442 111046792
18747 111046792 95626743 87979183 87077675 89878054 92405681 90700571 83155738 71791611
18739 71791611 59116880 47851322 39177338 33036701 28952714 26294791 24490586 23386116
18731 23386116 22789905 22567222 22688065 23072365 23618747 24416461 25413551 26799851 28818362
18722 28818362 31660544 35590927 40917646 48295363 58578077 71921163 86776454 100317101
18714 100317101 108997485 110643401 107683193 103732958 103165147 109385568 124675465 149950397
18706 149950397 183604194 222652050 261877236 293445167 312058133 310907329 284963424
18699 284963424 242673391 193978194 149067266 114682635 91329642 77151289 69674896
18692 69674896 66555849 65520146 64361255 60964787 54731604 46854395 38632747 31514975
18684 31514975 25985035 21990467 19137767 17213429 15724165 14451845 13296914 12153944
18676 12153944 11116760 10205348 9343087 8537912 7869180 7271026 6658129 6199080 5763379
18667 5763379 5389662 5093662 4770052 4529940 4280095 4085281 3911279 3774995 3699234 3636478
18657 3636478 3538949 3468013 3506647 3594203 3687435 3809230 3851570 3740366 3616648 3483721
18647 3483721 3434684 3471769 3625147 3885118 4232046 4639940 5071059 5416561 5571029 5422011
18637 5422011 5004244 4403700 3839094 3291617 2847717 2606708 2455236 2339739 2232815
18628 2232815 2257466 2290483 2254217 2230893 2284992 2362665 2430592 2493595 2572685 2565488 2441270
18617 2441270 2282530 2118857 2006426 1962707 1925290 1899986 1946677 1984528 2005754 2016701 2021315
18606 2021315 2039025 2003136 1987022 1893472 1863001 1881645 1957669 2033265 2199523 2445979 2708812
18595 2708812 2964592 3049393 2925879 2654402 2386959 2148963 1988995 1860360 1727678 1631501
18585 1631501 1600458 1570289 1537817 1469382 1434301 1368885 1249069 1147410 1111636 1143406 1147971
18574 1147971 1184464 1288307 1289346 1212920 1182843 1191259 1219879 1213496 1184528 1246638 1227908 1245491
18562 1245491 1349641 1415512 1453377 1533967 1621960 1734470 1894546 2046844 2131828 2149806
18552 2149806 2094528 1992843 1917098 1842221 1815687 1933111 2158187 2537324 2900802 3194364
18542 3194364 3434473 3516181 3339231 2996021 2574329 2107863 1735133 1495609 1318968 1296931
18532 1296931 1235656 1196548 1209227 1295214 1393960 1431424 1413504 1303340 1190908 1121702 1065922
18521 1065922 998300 1056552 1082906 1073649 1089754 1110918 1073973 1128878 1121944 1091818 1034827 1047285
18509 1047285 1046163 985128 982396 964247 929514 926658 1008168 1064729 1050754 1016299 1008764 997480
18497 997480 988016 995086 998570 1016222 1063828 1098458 1199043 1307869 1345067 1362161 1350164 1318567
18485 1318567 1341627 1358854 1342770 1361965 1373590 1408784 1453711 1559826 1683893 1694533 1699367
18474 1699367 1753817 1833020 1832222 1900956 1943711 1894897 2003548 2046124 2059969 2085153 2133400
18463 2133400 2190797 2242335 2331601 2434848 2478565 2549479 2607285 2701921 2828472 2925563 3122673
18452 3122673 3363124 3632745 3926439 4336866 4575302 4568592 4484464 4421175 4438306 4540768
18442 4540768 4673957 4873196 5229135 5634871 6086927 6563176 7109041 7694630 8220505
18433 8220505 8748824 9303239 9871562 10540259 11314411 12121307 12989920 14057591 15331910
18424 15331910 16936672 18967836 21675802 25213624 29624266 34760759 39849911 44767566
18416 44767566 50470263 57008998 62952472 67312048 72173923 79922145 91986363 109085975
18408 109085975 131347577 155793984 177938009 201268876 229552018 254421245 261336207
18401 261336207 254554626 246945426 236242623 215400216 188892770 165086309 146142458
18394 146142458 130132133 116406735 105886268 99861201 96861345 92272485 84167425
18387 84167425 75394269 67569786 60040870 51923886 44071246 37453737 32522522 29095137
18379 29095137 26865534 25485750 24656473 24269880 24229760 24406414 24855995 25653313 27006108
18370 27006108 29103276 32264948 36859312 43062229 50222323 57120788 63677560 71214511
18362 71214511 79803812 86835594 90913480 95311264 102618940 112103870 121479747 132496600
18354 132496600 148773636 167851726 179942213 183667369 188537634 194989500 190807330
18347 190807330 171904698 150114637 131439432 114014031 95240950 78026299 64229319
18340 64229319 54135631 47417145 43375795 40839256 38034289 34395905 30911628 27999309
18332 27999309 25268922 22497895 20053326 18228536 17117771 16581536 16087022 15247551
18324 15247551 14196861 13066264 11957052 10896464 10037793 9467485 9127823 8889205 8761225
18315 8761225 8899034 9172737 9261948 8886549 8262201 7640922 6978298 6320425 5813271 5334455
18305 5334455 4910270 4547431 4251321 4131319 4065972 3955612 3902895 3829627 3708561 3557868
18295 3557868 3367877 3196845 2995982 2802651 2719839 2637669 2644367 2714527 2810825 2869796 2885749
18284 2885749 2849464 2801611 2822483 2821328 2820157 2862375 2963924 3183700 3437444 3592520 3761200
18273 3761200 3958772 4078925 4064412 3948706 3858795 3785460 3734836 3742424 3815609 3897679 3982018
18262 3982018 3969967 3985484 4071447 4019909 3777006 3475240 3222737 3143676 3102057 3037242 2920671
18251 2920671 2890338 2911830 2958918 2963590 2961227 2945224 2921417 2871609 2746126 2573333 2464280
18240 2464280 2425002 2442687 2468173 2566068 2701506 2839648 2973558 3006689 2963485 2833931
18230 2833931 2671360 2509315 2327238 2155196 2081750 2122630 2164263 2273773 2395036 2514613
18220 2514613 2617751 2736700 2873113 3143362 3451052 3711893 3908053 3963817 3817485 3681491
18210 3681491 3659035 3737711 4051737 4375144 4590011 4560615 4365450 4225688 4339619 4624975
18200 4624975 4662351 4493270 4368450 4294258 4314827 4448105 4637666 4969252 5391694 5785296
18190 5785296 5946421 5968667 6007534 6120829 6439649 6913339 7509600 7980472 8210427 8433879
18180 8433879 8849282 9529174 10471373 11742028 13298677 15024191 16812245 18957046 21642494
18171 21642494 24875472 28518197 33025280 39301925 48434233 61750689 82359420 115013060
18163 115013060 162924330 215765726 231483956 195330979 146082437 102621022 72777655
18156 72777655 54714191 43811756 36708541 31836717 28628755 26846362 26431923 27354376
18148 27354376 28816188 29305178 27784434 25264439 23202656 22166921 22307103 23187190
18140 23187190 24412856 26228043 28816342 32126863 36205487 41600721 49292548 60658461
18132 60658461 77820478 104511935 146011915 204880663 264471009 272381893 224060255
18125 224060255 165194589 115278071 81984666 61609220 48821624 40430864 34766375
18118 34766375 30977711 28597003 27527553 27896338 29831018 33477911 39475412 49421595
18110 49421595 64607626 79987682 79636243 64332191 47248472 33110338 23878956
18103 23878956 18315494 14875760 12572000 10834018 9470467 8356931 7463395 6747082
18095 6747082 6123891 5734179 5510969 5361889 5249036 5249680 5169139 4814284 4254351 3755875
18085 3755875 3349613 3069608 2811642 2550846 2329447 2234877 2152958 2063637 1925667 1866371
18075 1866371 1847776 1846013 1829647 1823663 1780888 1741788 1643140 1585726 1581688 1565522 1605368 1670131
18063 1670131 1788891 1959656 2235779 2679559 3123277 3220816 2949323 2531067 2126217 1819108
18053 1819108 1684875 1544405 1446842 1361257 1336180 1342737 1354223 1337831 1275610 1224567 1211553
18042 1211553 1193279 1219025 1245716 1299395 1393289 1525056 1767799 2119852 2544439 2939289
18032 2939289 3022039 2830236 2614945 2528332 2593595 3003835 3612464 4093694 4277774 4004766
18022 4004766 3320479 2634802 2068007 1676559 1396596 1128995 964680 901072 810460 778983
18012 778983 814564 869050 927538 922688 887645 928388 1043457 989568 849689 827472 778920
18001 778920 736506 761421 851768 884071 892593 868082 795859 692106 653161 631524 643970
17990 643970 692918 732484 788031 833413 832757 840241 793650 803094 860777 949959 1026484 1177311
17978 1177311 1362773 1609853 1952409 2508674 3083639 3306076 2985709 2458937 2008340
17969 2008340 1758043 1688752 1792764 2072445 2377785 2427487 2156845 1731134 1352309 1132876
17959 1132876 985310 883259 832930 747655 690434 638032 594771 559618 514776 489642 500377
17948 500377 509613 516093 481894 443135 441317 457933 437197 411299 367440 386485 387633 366929
17936 366929 363170 421603 574411 749700 840445 872284 782792 747016 710658 698950 666784
17925 666784 612948 563228 545182 583583 610802 594964 626681 700382 746052 732302 727587 744566
17913 744566 787763 820329 818960 934736 1019149 1054162 1080931 1095088 1130008 1184058 1219147
17902 1219147 1314403 1440908 1631339 1786377 1909911 1969198 1931723 1894184 1852441 1824958
17892 1824958 1829721 1741666 1592621 1486768 1368692 1285474 1215018 1230119 1253329 1198512 1181444
17881 1181444 1177546 1165080 1162779 1112290 1081601 1135508 1239859 1255331 1286725 1271436 1199147
17870 1199147 1182664 1258664 1342777 1403896 1435813 1498726 1613384 1807573 2054140 2414030
17860 2414030 2821501 3293856 3667691 3635901 3409653 3137347 2979162 2877173 2845053 2871332
17850 2871332 2857776 2872845 2910381 2909154 2984989 3111702 3275320 3487082 3702643 3949454
17840 3949454 4216116 4544294 4928072 5419413 6009713 6489721 6802736 7077709 7283596
17831 7283596 7352110 7411796 7753561 8432873 9439675 10570895 11555587 12160251 12746446
17822 12746446 13661048 15029084 16965184 19574620 22765400 26701428 31444485 37349573
17814 37349573 44884825 55459094 71467579 97026610 137901118 197098179 259902533
17807 259902533 273964039 227952359 168428738 116491908 81231598 59845322 46837717
17800 46837717 38547506 32985709 28756001 24919532 21852085 19597933 18021977 17123273
17792 17123273 16745010 16586169 16717214 17010072 17354227 18027787 19293980 21154658 23769463
17783 23769463 26993136 30598030 34999877 40907855 49705725 63381739 85613829 121155626
17775 121155626 171621888 220780911 223155986 180346858 130472969 88749589 61252391
17768 61252391 44764926 34712016 28208833 23617239 19925778 16810255 14328855 12420904
17760 12420904 10915250 9678751 8749899 8068979 7589726 7224353 6735053 6093323 5579604
17751 5579604 5231916 5019884 4779999 4375089 3845970 3377546 2951090 2608663 2379246
17742 2379246 2183926 1975241 1839489 1771810 1707226 1657152 1531023 1460374 1438955 1396438
17732 1396438 1395303 1305985 1202541 1152327 1114170 1096020 1153853 1206468 1233176 1209429 1122373
17721 1122373 1038049 996764 977103 952629 920466 877209 793036 782165 792247 754530 706703
17710 706703 684587 655720 637497 614569 631125 580285 494974 473275 438873 420063 440690
17699 440690 476085 485753 468518 393433 376075 400512 470101 485440 487610 466449 470824 524980
17687 524980 572276 608511 698998 838511 1067383 1308556 1525808 1758384 1986220 2110745
17677 2110745 1921101 1552480 1187538 948638 773773 648304 614313 617072 621734 559851
17667 559851 527851 501104 539590 589234 562111 478098 513463 530220 544010 529624 536841 478847
17655 478847 424770 424815 437686 485920 596657 743636 877699 1028204 1176684 1402978 1649689
17644 1649689 1762358 1557141 1201530 925434 732629 597621 517352 510415 433301 399641
17634 399641 432944 479394 450018 405899 351069 292527 277962 224981 184406 175128 142678 161390
17622 161390 138873 149608 169517 182973 188915 213252 248819 230543 199067 142560 115228 114213
17610 114213 136262 116689 116909 140241 62641 84006 141758 182442 179211 158049 154168 140296
17598 140296 98590 69748 99869 184396 228429 213048 166055 122106 126937 123208 112818 132641
17586 132641 114996 114626 103939 44653 64897 112560 70536 44495 83171 103460 105705 163003
17574 163003 215149 223712 275724 293733 334003 341495 338710 380193 412582 452269 483332 552062
17562 552062 658694 825241 1088015 1360417 1525645 1354311 1058513 809603 596704 495966
17552 495966 379109 281891 213050 225521 221441 193157 163290 197638 234069 289214 271573
17541 271573 225361 194086 174776 213028 256162 295789 303206 335395 333199 300605 312100 324699
17529 324699 362683 456951 575550 744094 988322 1142910 1004162 758724 583280 493393
17519 493393 383037 274728 183533 188132 218073 217691 158327 121661 145661 106578 123244 147535
17507 147535 113734 85701 132031 142124 77640 18765 -14563 24519 45451 -4011 -9875 41441
17495 41441 75749 88556 39863 -2529 -41563 -4800 41628 46659 11111 -8867 11664 -9492
17483 -9492 -47535 -54085 -34252 45194 59728 79251 74511 95987 101451 95148 79931 81657 95875
17470 95875 126551 105487 73890 22550 9355 4965 21453 13836 15050 33742 47833 80475
17458 80475 103669 83911 90180 120214 138804 146926 155588 147477 136305 160263 150786 147772 159917
17445 159917 214051 318530 402205 450990 453059 336504 142291 -1673 -45875 1050 -14401
17434 -14401 -33620 -43728 24460 -15025 -60098 -66109 -32050 20630 22027 -34191 -94082 -106824
17422 -106824 -44758 42334 63831 62429 5087 -49214 -73793 -88695 -11526 38546 -8400 -14118
17410 -14118 -21907 20354 15070 4462 4621 -12600 -42113 -39395 -9284 -18686 -25827 -16607 5207
17397 5207 46471 11305 49972 90521 99282 83436 88480 99290 52068 8365 -3440 -531
17385 -531 -14060 -1245 24748 -21750 32343 61253 57749 56467 59881 -3481 -16838 -53584 -18727
17372 -18727 9064 -1688 -24102 -38297 -50053 -33242 -25789 -41974 -42273 -27020 24328 74858
17360 74858 47020 8874 -24271 -56241 -9636 51837 32067 2199 -56483 -13535 11659 49039
17348 49039 -2280 -58039 -55894 27612 108804 116762 85599 71151 33007 31494 56404 54308
17336 54308 4925 -48294 -55498 6624 -543 -26519 -63284 -38467 10277 -6210 -37476 23002
17324 23002 18879 18571 -10575 11260 14552 -20359 -56414 -16049 -73275 -66762 -13817 19233 31192
17311 31192 49480 35049 26032 -5022 -22161 -28141 -2732 -25040 24288 61382 74215 54401
17299 54401 75685 111075 130598 131662 35408 41600 71088 46226 43667 41962 26602 45548
17287 45548 38337 -20005 -9293 -10031 12672 17424 7677 42534 65574 36015 31738 85243 105514
17274 105514 45033 60181 63453 -2488 15210 38395 20702 39666 73883 91120 86780 103187
17262 103187 93114 121537 165493 197738 247551 342993 484281 747002 1089507 1364575 1316725
17251 1316725 1028409 781945 577906 447554 338801 269668 170976 154952 158512 113461
17241 113461 82118 77401 88488 75570 62813 49613 73464 84558 96028 137307 98053 115382
17229 115382 122412 173164 198993 135000 145981 221046 330669 465629 663383 932914 1124046
17218 1124046 1108179 911577 698795 481955 379708 287880 194032 145436 101560 67960
17208 67960 15741 35756 14183 -4360 25905 62773 82699 80567 100819 147443 145488 50311
17196 50311 21806 -15186 -8717 -5011 45800 -2675 -12903 -4276 -22255 -40755 -36013 -27805 42358
17183 42358 72875 80712 86803 60101 30567 10380 -54257 -70761 -25918 10833 14062 -1450
17171 -1450 -15395 -31352 -49141 -24799 -53575 -92237 -60568 -74131 -67381 -26750 21892 9587
17159 9587 10667 17113 44246 25873 12315 17327 -11075 -42408 19040 54074 79717 110595
17147 110595 63749 -12342 962 28451 -14774 -1574 4789 -37399 -23413 -7492 -61327 -77650
17135 -77650 -47878 -44916 -2560 11510 -19619 -15659 16192 7347 -40620 -10566 49829 26383
17123 26383 49572 68847 36563 -31441 -4401 -9456 -48857 -54688 -11527 -41682 -39052 -25502
17111 -25502 -58704 -39745 25521 94984 63020 58530 113529 65948 -9583 -62161 -69764 -47907
17099 -47907 -52020 -49376 -77004 -101280 -80371 -71977 -57455 -53635 -15181 54295 46139 49462 59724
17086 59724 74427 85686 103986 134617 130704 72474 15105 49693 58092 51045 4185 -50845
17074 -50845 -78204 -44386 51172 78103 35829 54014 49691 15517 -2693 -25793 16460 14441
17062 14441 -5567 -62771 -61053 2805 -28840 -21744 -47806 -67776 -56751 -71040 -2320 63679
17050 63679 57148 -18275 -69979 -64470 -50775 -38396 -9537 -12665 1126 -20890 -38844 28503
17038 28503 976 -12139 21751 6175 -14442 -7152 -32951 -55363 -11628 -2932 -61413 -71319
17026 -71319 -34289 -66337 -69979 -6209 58754 113757 102443 25730 23285 421 38101 47748
17014 47748 53620 -5602 -111754 -77546 -65915 -82560 -55198 -9288 9503 13241 4469 -33708
17002 -33708 -47839 -73733 -86311 -82716 -55489 -6041 48400 70433 58171 -6365 -35773 -8181
16990 -8181 29393 30016 27649 31218 30902 44263 61095 60803 31695 4774 -84276 -111716 -47072
16977 -47072 -35220 -39757 -15593 15725 2374 27722 10458 -15615 -34864 -41161 -87191 -86759
16965 -86759 -34139 -52447 -80038 -57325 -60775 -89930 -109138 -135517 -107514 -78608 -94533 -43929
16953 -43929 -56643 -102870 -88437 -66073 -89576 -121893 -116235 -120786 -94429 -115117 -70936 23875
16941 23875 6079 -40322 -79859 -16087 30461 19859 36840 19471 15748 24788 38463 84325
16929 84325 91495 90259 73224 30777 4940 5534 -21579 -50544 -42677 -19430 14988 13740 6555
16916 6555 30723 50790 44710 44662 46141 24555 -29137 -78067 -82223 -41319 -13417 -15816 -14626
16903 -14626 87011 73391 8277 48369 39545 -17965 -61288 -38705 -20521 -5821 8496 -16786
16891 -16786 -7549 14938 32962 60839 37649 9709 -10291 -8900 -14432 -16347 -12632 -18143 -32255
16878 -32255 -65180 -40514 13157 17086 -1082 -11016 33258 -2521 -22848 -9950 -7766 -59798
16866 -59798 -37545 -24758 17856 -7111 -16819 36125 48364 55868 85212 25209 5745 47668
16854 47668 52263 12250 -12649 -74763 -66429 -43148 8884 70179 60628 13297 44628 65828
16842 65828 33565 48143 25139 10732 -55285 -56825 -17735 33122 60329 70300 36992 49723
16830 49723 71383 21749 35783 61822 20005 7907 32677 61174 23248 -24048 9337 27773
16818 27773 56239 11301 -32246 -41725 -97382 -53824 17089 48994 29284 31740 24920 73100
16806 73100 70189 37019 8579 1719 7476 15006 8661 -27801 -97325 -104505 -79244 -95878 -92437
16793 -92437 -35396 -31481 7490 -19945 -51289 -21377 29732 34495 20468 47847 32024 -38464
16781 -38464 -43653 8333 -4952 -24376 -53835 -88488 -101698 -75487 -61805 -16022 -11132 506
16769 506 15096 15743 11216 17827 37366 46819 25782 55064 48876 -15855 -32302 -60535 -94011
16756 -94011 -74231 -81659 -54144 -22220 43479 63466 50597 16106 12551 -30363 -114501 -75890
16744 -75890 12445 73623 71797 25918 -935 -64136 -60000 -14471 -2296 71323 3124 -52010
16732 -52010 -46644 -19347 -20660 10209 29646 -7605 -32862 617 -4525 -18026 -22466 -25777 -7189
16719 -7189 8056 4843 17107 40194 56755 52828 10495 -39628 -56671 -69564 -57883 -45864
16707 -45864 -40066 -17130 -9836 21691 30712 28200 21032 27837 21482 16301 18296 7035 -14758
16694 -14758 -44878 -22652 -10389 -39006 3959 11371 8790 4924 36131 -1583 9936 31629
16682 31629 22688 16709 17210 9470 -16692 -36284 28268 59148 51439 -13757 -61502 -94499 -93996
16669 -93996 -85375 -6114 14475 16544 6859 -16850 -33290 22718 62890 76112 61704 75414
16657 75414 48559 81605 91761 54326 -26407 -24262 30486 46246 28584 -1688 15921 4341
16645 4341 -6573 -16062 18265 15815 17713 35445 54724 29142 -32259 -16673 -54460 -58307 -8911
16632 -8911 790 -3260 5580 -28682 -47504 -8362 -7756 -7167 7390 -5146 -27608 -62524 -69342
16619 -69342 -35885 -68488 -98905 -99661 -110704 -125222 -91943 -110628 -138747 -156418 -107985 -118415
16607 -118415 -122474 -105087 -78048 -34155 -16315 -16547 -7454 57490 29574 -17504 -48326 -62138
16595 -62138 -34851 -15564 -7386 -10801 -1413 -77166 -85642 -43950 -29101 -46338 -45571 -53722 -44207
16582 -44207 -7230 25808 29582 12709 -1314 -11270 -56124 -100399 -72459 -25829 -14357 6589
16570 6589 24648 47847 73549 48096 19984 19278 39821 44301 35940 -18397 -64266 -95437 -90060
16557 -90060 -85740 -67969 -81282 -115430 -145218 -136796 -121670 -78972 -71892 -86371 -76313 188
16545 188 918 -13099 -57596 -46492 -49637 -24843 -18620 -95384 -37997 19509 4798 -46269 -49427
16532 -49427 -22206 5060 58352 48383 -5320 -50045 -34584 -9317 -860 -37654 -3949 12808
16520 12808 -18833 -5896 21819 -1690 -9764 -10034 -9105 -15803 -42357 -33051 -17391 4814 19983
16507 19983 -4703 -42768 -48138 -17383 -30034 3601 13724 -25637 -50722 -44310 -15133 -7032
16495 -7032 -71893 -56744 -36141 1455 24594 49669 49430 -61108 -120649 -140368 -111693 -48516
16483 -48516 -34083 -31719 31969 32384 -11672 -21144 -27796 -3287 36569 54029 47281 -6670 -50525
16470 -50525 -111675 -109448 -78131 -67832 -27872 -15877 -31483 -9255 -26884 -41737 -47747 -118409
16458 -118409 -116256 -71250 -35017 -82441 -104305 -64051 -67752 33164 71924 62111 46062 67289
16446 67289 85836 75140 84636 76632 52330 67115 60836 46459 41722 5400 25801 -14922
16434 -14922 -121098 -135753 -61620 -46195 -14511 -62660 -94324 -33579 1164 -39098 -64387
16423 -64387 -27547 45721 54472 9746 -32299 -34738 -75988 -47014 51058 34667 -15429 -38569
16411 -38569 -42205 -20678 -61553 -125369 -102555 -109667 -76529 -17363 41157 55304 19902 23001
16399 23001 -7928 -3702 -12117 -29518 -6577 43594 13636 -35180 -67191 -34132 8743 28394
16387 28394 -29269 -39532 -32451 5686 70152 77057 29526 -36569 -34063 -54643 -51413 -69749
16375 -69749 7483 -10836 8035 33730 43853 24730 12628 10267 9442 15621 32744 64468
16363 64468 62588 86512 76717 75251 56289 28726 23495 -31883 20476 26017 -16900 -24248 -28117
16350 -28117 -10330 -18948 -29785 -1753 -30556 -38869 -45324 6258 51300 76534 63702 18286
16338 18286 -11751 -41868 -22739 34982 44846 8199 -29506 -48021 -25479 -19719 -4978 33600
16326 33600 3209 -53979 -46659 26577 22184 -2386 -44630 -80129 -67946 -24201 -27581 -76763
16314 -76763 -90696 -70621 -63395 -50668 -50986 -62062 -10994 -10831 -35338 -20026 61326 34391 -4285
16301 -4285 -19920 4246 -7933 29853 -1739 -30897 -61769 -48784 -40487 -7335 12747 27653
16289 27653 4011 -64541 -125512 -95853 -20707 33041 21361 16629 18090 -44645 -93959 -96913
16277 -96913 -23676 -12679 -28824 10146 51247 66514 23229 -5242 -19720 -20461 -3429 -12401
16265 -12401 36191 33038 -14079 -37376 -29799 -6881 8594 15070 25187 -19020 -21320 -45870
16253 -45870 -78068 -4546 20513 -9499 -48157 -87003 -102260 -54812 7804 -2280 1492 19470
16241 19470 9346 -13137 -29596 -40943 -28389 -43963 -25791 -31688 -1306 -4341 -5457 -72232
16229 -72232 -61228 -1873 11090 -22936 -11750 1299 -40511 -38906 -5 37967 13973 -37153
16217 -37153 -21556 -20156 -13949 -18317 -4939 -553 -47188 -17939 10008 11046 -22301 -2588 7767
16204 7767 -17120 -58435 -77166 -90350 -89741 -33809 5006 19559 -20586 -1429 -20843 1143
16192 1143 24603 -32278 -13936 10929 44749 23211 -33888 -18238 -11877 -7351 22197 35905
16180 35905 23668 -23008 -22635 7168 30025 33231 42618 7645 -20420 3765 20754 74256
16168 74256 75644 93578 101559 49070 37029 26317 10297 21643 -843 -11590 8073 13089
16156 13089 11256 4083 -6594 -15453 -37949 -59230 -89722 -76635 -44984 -35210 -45983 -56563
16144 -56563 -70077 -30701 -36331 -33125 -67617 -122349 -141210 -87467 -80889 -69465 -52162 -58658
16132 -58658 -26312 -51309 -37736 -66177 -94449 -78033 -71430 -73942 -74283 -95313 -33273 12756
16120 12756 -10023 -55317 -88442 -48659 -32582 -44730 10608 4193 -35955 -41138 -36364 15609
16108 15609 42782 30560 9842 29163 -32104 -28795 3937 17838 -1560 -11717 22354 2873
16096 2873 -71033 -46755 -22481 -55332 -83951 -95734 -75824 -41668 -62225 -17670 24190 290
16084 290 -46941 -12699 3565 -19073 -7424 44126 54128 5989 56992 97902 82725 3113
16072 3113 -38229 -22286 -11104 -44805 -59733 -43130 -65082 -51585 7468 66462 42852 8738
16060 8738 20293 685 -6580 -9346 -43555 -104996 -104990 -76252 -60119 7015 21507 54279 41387
16047 41387 -8939 -51251 -51228 -64680 -74645 -52165 -18944 -1732 -15423 -30222 -3613 41255
16035 41255 60693 12020 -26284 -32466 2309 -44276 -49461 -29557 11807 45660 131591 113382
16023 113382 93363 41960 31046 61995 45660 27123 -14747 -86491 -75131 -37688 9423
16012 9423 2867 28158 107320 59492 20408 -19909 2465 54025 83996 95201 45719 36874
16000 36874 80871 15382 3027 2281 -2446 11122 -15154 1521 87287 112320 44921 7685
15988 7685 -2581 -7557 -760 -16910 -38217 -41597 -36600 -32830 -320 -1727 -13274 22177 22678
15975 22678 20770 29395 38654 58536 20975 14691 50310 33324 7390 26173 29899 3262 18169
15962 18169 60314 61333 -26544 -73760 -78924 -55449 -51848 -68630 -94684 -33279 29748 38401
15950 38401 20951 -35542 -17519 -3482 3435 13115 77593 39282 -3222 -26663 6074 6078 -35133
15937 -35133 -38485 4446 44764 15619 -44990 -94266 -22416 16919 -42841 -38622 -1594 33209
15925 33209 34794 34265 30634 39618 29919 45490 -34 -46130 -54874 -6275 -2185 -39867 -6008
15912 -6008 25615 -17453 -51843 -30556 33649 27387 -2437 -12262 -22128 -60176 -50979 -46522 -3876
15899 -3876 34703 33023 -8504 6795 14743 -34856 -46863 -16077 33149 34465 -21140 8516
15887 8516 -13964 -43716 -51493 16299 88601 61424 35997 55019 45194 35079 9952 -4703
15875 -4703 -49221 -51250 689 60536 -30481 -82606 -54187 -10097 -8119 -11337 31422 91525
15863 91525 101923 47766 9169 -21950 -20458 -18100 -38380 -23245 -43070 -30601 -32600 -70985
15851 -70985 -5284 72030 81145 56974 63232 90649 55050 15499 5031 25350 23381 13364
15839 13364 16721 80811 87908 113714 110884 46263 44771 1254 50227 64234 25350 -20853
15827 -20853 -41956 -37668 -43884 -28833 -6414 30043 -10151 -42262 -20279 -8323 -20559 -62519
15815 -62519 -83927 -48408 -38299 -7201 74928 93948 113224 122298 125338 79283 17365 -69887
15803 -69887 -84605 -77021 -11558 23716 7771 -33473 -50404 -102349 -95824 -109510 -79136 -50823
15791 -50823 -102570 -179575 -133668 -61273 -45238 -18336 -56107 22355 76365 57293 -14236 -23815
15779 -23815 -47770 -59297 -43215 -18365 5002 29575 24416 40033 48966 -15610 -12808 -944
15767 -944 -6378 16067 -9101 362 10993 37408 54890 35062 44272 62872 94495 138807 116139
15754 116139 79357 47962 14099 10890 30538 -4822 -30205 -43853 -39557 -47870 -86761 -64459
15742 -64459 -12602 21534 27166 26367 21803 31856 53468 52113 55107 43021 21834 29894 -38137
15729 -38137 -22512 -12934 11720 56257 95304 116897 77246 55319 30248 38373 78227 69644
15717 69644 58724 74179 10981 -39324 -36053 -31052 -38526 9716 27970 -22241 -804 -22979
15705 -22979 -27183 -35691 23298 74577 98838 54924 23906 27305 35787 60826 39651 35376 37852
15692 37852 4904 -52402 -79731 -65386 -87405 -73461 -59354 -18635 -32771 -62279 -51068 -65
15680 -65 9788 11903 46455 39011 54302 45949 8804 -8999 -8612 -6706 -4558 307 52864 71086
15666 71086 -25012 -86224 -112762 -119440 -107512 -45113 -10262 -13320 -30585 -39081 -38169 -62697 -63064
15653 -63064 -13457 11279 37224 16836 -17773 -14013 11263 -3032 -50094 -76964 -55463 -46649
15641 -46649 6372 47413 69984 70061 85108 111399 73561 22418 -12838 -135 -3734 910 2334
15628 2334 16351 -12920 -15148 4742 21848 53220 70977 72527 44922 40662 57435 21652
15616 21652 13187 -17643 4911 -45376 -78511 -51755 -78553 -83592 -105420 -96459 -108588 -116627
15604 -116627 -75155 -34759 -29122 -48812 -29407 -36588 30812 62759 4156 -39927 -67180 -45449
15592 -45449 27181 61870 -5034 32968 85946 36587 -37708 -51776 -32864 -13862 85355 116463
15580 116463 41585 54745 91452 116217 49092 37742 31223 23202 25022 76273 129355 78499
15568 78499 12521 -13592 6506 144 4631 59189 48783 36537 22018 57411 103369 86202
15556 86202 11438 -989 68291 72889 35901 61666 10148 37989 67987 40302 51525 12342
15544 12342 -3685 38690 16288 11230 14906 44321 39794 405 -3180 35562 13179 -54041
15532 -54041 -58658 -52556 -23117 42555 57031 47686 18490 -29740 1451 24328 30059 60998
15520 60998 35991 2392 29297 52689 29685 3686 -22038 -32502 -57741 -55505 -66507 -12958
15508 -12958 52002 65945 96267 90213 79095 48229 31338 36646 54062 13692 -42909 -36391
15496 -36391 -43781 -25854 26621 70329 -3679 -16793 92433 61815 26230 24986 5318 18831
15484 18831 61593 79187 70613 99164 122221 122996 133954 89241 62622 51819 62464 117378
15472 117378 118725 134746 143354 100922 75616 86081 17886 3632 -3415 18613 87947 137381
15460 137381 77906 32099 23767 28683 8630 4640 -19560 -16117 -38008 -41289 36287 43122 46762
15447 46762 50098 76413 115041 63400 32269 53768 6209 -15775 28800 63016 89484 101647
15435 101647 87855 55081 18766 -10093 -18177 23061 73335 99183 87655 61344 82375 114821
15423 114821 94897 112664 85450 57033 78922 101799 91840 78300 29862 -29647 8007 50030
15411 50030 78678 56344 77366 73349 55961 74253 63555 46331 45168 34525 60140 51743
15399 51743 -7528 -29560 -35589 -16796 11915 26505 38965 29288 -13864 -27818 10351 12275
15387 12275 -23791 38048 47474 55282 31430 24774 -35185 -2724 635 66701 48613 20129
15375 20129 15971 28395 36655 470 19625 -5556 -59983 1813 79499 84247 28358 -3774
15363 -3774 -6423 -49256 -35158 2599 16642 -16521 -23083 -29002 2098 13216 -2066 -21669
15351 -21669 -6934 -27149 -31511 -34136 -11751 -18939 358 30893 57477 58698 60599 26539 9230
15338 9230 24890 2640 31143 21504 19197 54216 51655 22163 -86 -42711 -20055 7096
15326 7096 35863 101503 107364 92654 40754 25160 16864 37287 82929 62640 34492 63435
15314 63435 30497 -5184 15815 29027 22038 14123 -35579 -65633 -34335 -61766 -66031 -26269
15302 -26269 -1307 -24200 -1563 21763 14026 -15459 -11361 6760 3592 17044 15972 21240 23247
15289 23247 59333 49606 -18506 13451 35748 82203 98743 38507 -40320 -96741 -81952 -67001
15277 -67001 -3241 524 -21972 -8705 -18727 -37077 -35602 12775 22336 3188 25815 -3329
15265 -3329 -14226 -25120 -43016 -11336 -3536 -42639 -1818 28188 68561 40256 -3006 -43417
15253 -43417 -4876 50678 28650 7303 -29284 -41557 -28678 -36437 -19737 -4965 -342 7758
15241 7758 -3505 38116 48770 36595 50783 86577 72731 78684 100399 57022 22249 -1984
15229 -1984 -28255 -61316 8813 18057 -6004 56190 91330 102916 60257 41560 52037 64748
15217 64748 53996 36662 -1367 28544 47068 38908 32239 27556 -1378 29108 -29613 -66644
15205 -66644 -32519 -36100 -8575 49032 87060 96710 91930 47655 57954 63463 78415 42777
15193 42777 5403 -2992 -34159 -21025 -63025 -49250 -42057 -64251 -27761 2826 -17416 -11475
15181 -11475 -12546 -6638 -35333 -18350 -23129 12581 81313 94845 63274 64958 61305 16703 -9448
15168 -9448 -10815 -28081 -18644 34692 54148 17141 23728 1600 477 12418 62781 81211 39808
15155 39808 10274 2398 -4379 -8596 -22689 -24639 11483 82950 82279 77226 55637 28984 -278
15142 -278 -7480 6531 -8673 -61968 -71796 -73828 -63157 14417 54959 33831 10711 41965 25824
15129 25824 36975 79432 56314 69176 24397 37363 30588 -5770 -38473 -7605 16482 25868
15117 25868 23132 21879 -2217 20799 -6436 -31896 -61347 -58326 -35484 -51648 -27038 -33242
15105 -33242 -25912 -33561 -115777 -134602 -91122 -26027 -11555 -12918 9922 63092 110533 104518
15093 104518 59927 31582 30250 68077 84006 57192 77999 45097 73956 56739 30872 41892
15081 41892 99372 163107 128580 72490 63101 76961 112656 74333 36880 6127 25780 1884
15069 1884 -25782 -398 -50789 -52883 11797 11143 18194 -5627 -38445 -58104 -31419 20945 90071
15056 90071 87701 60047 69083 22650 -5067 -23091 18102 37918 67049 104298 62035 17142
15044 17142 19725 57117 80581 65492 27079 -4932 30939 15779 -5099 6115 44786 68573
15032 68573 68922 40850 17105 41514 16870 50011 86391 86384 47332 -17109 -20158 15466 22889
15019 22889 8634 21314 7762 -63322 -70719 -17420 -15309 13413 48705 71605 70365 68080
15007 68080 41122 34246 -7747 44928 85973 88772 82775 77181 33644 11950 1472 5435 16276
14994 16276 46419 90201 113075 121051 75070 58074 33415 294 -28558 -75458 -103088 -72155
14982 -72155 -59599 -58595 -88507 -124510 -92091 -11100 7416 8293 23966 31697 -3432 -8337 -17084
14969 -17084 17001 38147 -6619 -36596 -3298 48204 56048 39880 61552 20101 -12187 -28182
14957 -28182 19000 44650 28904 68153 79175 50296 11232 -36860 -26977 1242 -20109 -77126
14945 -77126 -55979 -27269 12542 14272 38469 74851 69458 29292 9937 3229 -7324 -4109
14933 -4109 -27644 25121 58998 35491 57127 53255 80820 125464 134907 93341 82089 68205
14921 68205 17762 8104 59279 78267 51294 12543 20425 69076 86853 113031 139578 149437
14909 149437 99667 76621 50800 43391 67558 89817 45030 7207 13118 10730 68947 116167
14897 116167 101525 80093 68018 102797 126699 142438 110162 63753 30588 35939 103994 89780
14885 89780 76813 72081 41602 37665 33707 11818 21036 22295 52240 43168 45774 43111 -13219
14872 -13219 -58580 -51575 21749 32929 34594 1544 -43482 1411 21255 13401 -10489 -9239
14860 -9239 3909 4199 386 17248 52182 34200 26982 55791 46250 -19181 -61944 -21340 -41353
14847 -41353 -70213 -94744 -70507 -47520 -39734 -9344 21633 7577 5510 16977 -19662 25761
14835 25761 40402 38514 48771 26662 10380 22322 72269 112440 114127 59619 1973 4814
14823 4814 -13726 41755 71916 61081 35537 32082 10618 7147 1695 60465 117403 73289
14811 73289 22203 10202 48110 37995 72297 78243 88596 63124 67287 38929 104694 96343
14799 96343 78635 70324 30153 25155 45150 11381 -41822 -1657 44586 72158 27662 12844
14787 12844 577 -36609 1491 88522 138820 134556 71965 -29243 -36409 -7733 -12165 -55556
14775 -55556 -51883 -74143 -36443 -7962 -18315 -16387 7137 64231 40122 2305 29243 27945
14763 27945 -1879 40451 77738 100313 92250 84317 77439 88742 112013 110782 81475 79600 79943
14750 79943 47103 32383 8632 13087 30045 39784 79995 96948 63872 48251 95790 142994
14738 142994 113639 72123 15992 34956 97243 91837 77141 72047 58970 88087 92083 90592
14726 90592 86867 77886 111584 127495 93487 75974 130445 170875 172098 90676 81162 97525
14714 97525 77663 38614 -4450 4242 -10325 -26858 -12400 27851 13560 -10914 48090 60316
14702 60316 40536 16086 12169 37885 104403 84717 24982 -43868 -45466 6576 34442 32983
14690 32983 38259 18275 11312 13946 66799 108919 110115 78416 30444 58697 119140 140636
14678 140636 142374 63413 10673 24523 45030 21476 35943 58794 54203 4984 8437 39851
14666 39851 91933 85688 43035 14535 4420 70533 64377 544 -2586 40517 59463 66820
14654 66820 52151 36614 33747 14951 25514 77127 99718 108398 138800 68156 27573 55019
14642 55019 66949 55827 25732 21799 73018 120970 120415 106720 126293 127234 108362 103395 140824
14629 140824 162258 102826 79415 89414 58186 49370 51157 42292 67535 81612 63196 56020
14617 56020 96359 115489 103349 95703 63621 18445 63236 125454 177584 156803 137305 124781
14605 124781 157677 150333 115566 94559 158573 193103 209198 167937 108509 133789 182471 202951
14593 202951 165402 166702 185843 170841 176699 259524 355410 430580 467434 543731 605303 638167
14581 638167 668616 764908 862397 975388 1054615 1097194 1092128 1122141 1136681 1120036 1083129
14570 1083129 1008685 898604 819888 754577 688904 627851 593210 569419 538899 557964 500896
14559 500896 477008 510549 500841 455893 462889 511363 534786 479608 506799 530611 560766 580047
14547 580047 616694 672524 733217 799479 965132 1126698 1154135 1205114 1238349 1245200 1231000
14536 1231000 1204139 1182610 1112350 981380 849734 688259 608110 539926 467341 390398 395372
14525 395372 427485 410611 398013 380250 334299 250666 217661 243340 231075 188699 144718
14514 144718 112916 151412 181823 173191 134891 109985 138761 144837 102745 66724 84684 128448
14502 128448 151463 166355 121203 142017 181942 172624 132927 88347 118483 106799 85461 103276
14490 103276 147083 143726 119420 131394 189729 200875 174207 132807 140839 145301 204776 205927
14478 205927 185742 186514 204006 244134 257949 240133 163605 132611 113258 148251 118061 146721
14466 146721 145457 109737 99433 110494 108862 91599 129907 134382 123577 98023 40259 5322
14454 5322 30608 69119 65891 107452 172238 198426 198036 179201 170858 230461 260630 245213 215352
14441 215352 185229 184712 199996 163237 112494 115084 119987 138376 131434 41638 -8811 -5349 15810
14428 15810 74384 138145 214004 193866 127081 99871 129424 97226 70813 23720 2247 28240
14416 28240 82814 140792 135293 136125 133957 121709 153329 156611 136501 113196 139211 144894 134730
14403 134730 92451 139902 162769 93498 68746 67781 100426 143583 166514 145086 116697 143308
14391 143308 118729 138402 216736 254281 225030 218846 253104 279874 252608 327864 401342 413488
14379 413488 415320 435253 419370 348912 304571 339843 413629 413231 330046 279557 302463 319460
14367 319460 320207 322545 291744 236774 251921 214090 148734 169397 237248 311157 317309 296361
14355 296361 272078 250824 245147 296257 326840 344916 333641 295628 281389 310241 350642 406695
14343 406695 430533 473642 430586 471653 487514 474536 475673 460132 441584 403174 344496 341254
14331 341254 350300 320931 296995 264955 299322 294813 282801 325454 371013 365976 335888 360928
14319 360928 351803 377971 444402 460330 409556 402801 418652 422441 396853 361988 408184 395130
14307 395130 365479 379000 372839 365284 384170 436210 403292 431130 423174 436263 403531 414138
14295 414138 414187 351943 360259 353593 369425 374677 369676 373428 386106 411240 451282 441936 391174
14282 391174 363511 411908 457310 427332 384201 414971 477810 464114 380068 377219 445094 429105
14270 429105 372007 353358 321115 300058 332004 387488 392305 435283 356028 296167 309329 334800
14258 334800 369568 403401 382930 428118 517434 595953 669516 719481 711956 699754 709755 810107
14246 810107 839514 820112 785652 784062 722495 737266 715199 708634 687764 680461 707558 741384
14234 741384 745842 749016 742980 768442 755080 764652 765629 777646 810102 802513 754084 715446 745814
14221 745814 793089 914410 953691 981896 1041327 1120121 1221392 1254982 1245650 1350139 1400325
14210 1400325 1418576 1430819 1408702 1408897 1397313 1390054 1429748 1429702 1456820 1522547 1557232 1618810
14198 1618810 1653244 1726975 1741727 1678301 1683826 1740755 1786778 1827334 1872504 1893676 1996518
14187 1996518 2046138 2108381 2147654 2187273 2260548 2307640 2391118 2504804 2606262 2743615 2835047
14176 2835047 2928639 3050191 3180246 3314562 3491084 3658938 3770416 3913457 4117702 4334616
14166 4334616 4554133 4855922 5182773 5440085 5701472 6030726 6441892 6801052 7210763
14157 7210763 7703249 8208606 8721502 9370995 10136692 10992208 11948342 13022687 14197757
14148 14197757 15625369 17249620 19187051 21503841 24168016 27175721 30608334 34614924
14140 34614924 39356854 45001819 51706810 59652646 69135309 80455028 93816402 109159019
14132 109159019 126097500 143933145 161869264 178733079 193284732 204499111 211443650
14125 211443650 213539918 210720539 203474070 192667032 179238825 164371763 149203561
14118 149203561 134627162 121354417 109843485 100171763 92324029 86108057 81233035
14111 81233035 77505559 74869664 73216536 72340479 72294637 73050287 74715213 77238038 80661604
14102 80661604 85104311 90643347 97480854 105869892 115970065 127888395 141406543 156092814
14094 156092814 171171713 185655021 198564986 208697445 215062792 216990329 213940792
14087 213940792 205935714 193593207 177991295 160341968 141742453 123313291 106053957
14080 106053957 90572186 77257449 66132852 56930757 49456910 43300553 38189228
14073 38189228 33903029 30239277 27085223 24363931 21928769 19828654 17958107 16285100
14065 16285100 14773181 13496381 12441908 11453878 10657043 9992531 9384641 8843046 8451584
14056 8451584 8128241 7890146 7751563 7588964 7501703 7380696 7272954 7204375 7067256 6949666
14046 6949666 6892982 6789052 6651360 6513060 6372410 6280655 6211104 6189080 6106463 6012666
14036 6012666 5947911 5866358 5691786 5513985 5415470 5261354 5060604 4931307 4797960 4645708
14026 4645708 4492229 4303292 4051834 3727209 3405611 3127045 2900840 2692330 2433428
14017 2433428 2243835 2103547 1995589 1910737 1866369 1768928 1623132 1547080 1490309 1453899
14007 1453899 1411375 1347135 1358038 1388890 1424154 1406579 1399843 1500071 1609138 1660668 1703631
13996 1703631 1800075 1901032 2020196 2153393 2349495 2504434 2615631 2662696 2665438 2572000
13986 2572000 2425316 2288639 2107139 1944005 1812467 1723259 1563989 1379858 1249294 1201808
13976 1201808 1163162 1090425 1019442 924319 854664 792263 706407 615666 630289 646317 620043
13965 620043 599671 596320 634635 676323 684532 701933 723364 714675 662072 680759 735819 757474
13953 757474 723711 708591 679544 716786 754641 755859 738540 739831 734093 685081 641214 621116
13941 621116 594088 538482 491416 474720 454995 408634 416134 406900 301799 224318 223497 261137
13929 261137 225523 166828 132071 176122 179714 207248 204547 194141 179640 185366 167172 162602
13917 162602 173954 176473 180081 174409 164549 162237 155196 147486 175216 197411 104785 63393 39640
13904 39640 27709 17780 22112 77022 156355 141054 148984 159308 204913 222318 208266 149730
13892 149730 108252 139359 121614 94767 56387 88400 49038 53144 85614 74777 74896 68863
13880 68863 34934 136454 151906 89833 38337 -14243 3031 31991 22957 1272 36401 70655
13868 70655 42713 56340 40061 14853 5364 -14202 -13919 19106 67120 96431 78883 49429
13856 49429 59353 69339 66370 70272 51849 33320 51837 71102 52265 46795 57857 93498 84997
13843 84997 51677 69592 79216 63676 46550 4020 -7200 43701 106919 108503 72268 66803
13831 66803 78775 130179 185875 183114 186046 142798 141418 168686 154892 151089 175174 176708 189095
13818 189095 180166 164076 116482 123579 143939 108609 79277 76250 67101 43207 39926 66870
13806 66870 90603 57024 24619 -2734 -4942 63360 83997 46938 27472 -3609 29570 40272
13794 40272 66514 53762 66014 69615 51360 118631 164454 168745 182588 130300 38540 27684
13782 27684 27838 -9068 -674 48447 79557 83592 51779 24325 -5118 -26057 1737 32035
13770 32035 18091 13908 -15111 -21035 -56485 -69859 -80473 -52252 -42649 -4196 47397 66729
13758 66729 61945 83711 61781 56722 25843 -54422 -68835 27612 11877 -3271 22316 58087
13746 58087 35567 34349 66504 51355 55593 46992 6751 -38494 -1381 85254 147247 141295
13734 141295 145845 125751 66366 80290 107120 83549 58858 29004 38471 24784 37380 40465
13722 40465 35074 8986 -29227 -53667 -34748 -32835 -37408 -49736 -62142 -18804 15966 -5326
13710 -5326 55454 66188 58357 35737 16501 19276 73716 76212 32481 30171 40244 52660 56720
13697 56720 35614 59170 85807 108065 115004 139593 172659 210655 200120 131035 149364 195400
13685 195400 225471 299489 343595 455803 507042 573347 590515 587514 670171 736786 778294
13674 778294 871308 981693 1070611 1082623 1106444 1146511 1112832 1071447 1055157 984151 926380
13663 926380 812193 698862 652594 581906 513524 490982 527063 493856 473826 431804 413201
13652 413201 404962 457560 429960 421326 421808 445002 508959 601070 643006 684983 726190 818327
13640 818327 881804 960031 1008318 1076310 1106657 1168449 1230361 1197698 1147614 1088886 1002797
13629 1002797 945866 853828 719303 641674 608189 538056 426637 307601 241861 224938 210585
13618 210585 158837 139437 141822 175683 159016 169581 157665 86126 12648 24380 33936 22628
13606 22628 13117 -2786 -40852 -44151 -14821 1640 6548 -16753 -25866 19983 7933 18086
13594 18086 -4064 -11563 29510 75851 99069 76233 27888 21651 20741 94749 64835 28519
13582 28519 31004 47046 15676 -14831 -13459 40500 126810 67965 5051 55405 130648 138175
13570 138175 170594 126812 82488 75483 16662 -13674 -14469 24836 -21385 -6795 37034 10037
13558 10037 -12089 25459 29975 54957 52618 -5084 -60839 -67988 -53362 -82337 -99921 -51353
13546 -51353 -1297 15657 27508 25918 23650 -65794 -43400 8678 56448 32623 -7594 -68513
13534 -68513 -20601 73537 72163 65987 57204 36229 21847 20006 -11067 -14708 -11227 -1532 16100
13521 16100 4966 33963 19445 49745 75072 -4936 -51861 -11660 -13449 5389 -37411 -59067
13509 -59067 -13041 31161 63830 42299 3209 -4746 -39948 -70867 -38210 -29049 -23876 -47303
13497 -47303 -45179 -640 35172 33032 91628 117179 98984 65572 16691 -36686 -44973 -20889
13485 -20889 4379 8339 -46057 -79915 -72748 -72969 -66462 -41728 -47444 42031 52035 74809 37172
13472 37172 10668 39392 39414 25064 9353 -12543 -23801 -182 -34069 -60309 -12790 -17882
13460 -17882 -26367 37447 47612 36005 2574 -28429 -19287 -20616 7011 -8044 -14014 -14453 618
13447 618 48994 49731 20057 -62518 -49189 -29046 313 56326 59067 18192 -33597 -46645 -39436
13434 -39436 -57981 -71664 -41547 -22684 -71729 -59214 -15849 12666 42927 106116 70623 11945
13422 11945 10597 -22208 -57880 4711 -12220 -65470 3603 27023 29563 16303 2243 -5824
13410 -5824 36492 6383 -25918 -29415 -35399 -23347 3838 38171 49187 54208 8263 -22987
13398 -22987 33982 74404 84401 75424 86326 66177 34387 -29391 -22408 -34740 -17327 43398
13386 43398 62976 33563 -15267 -37913 -26394 -30662 -22085 -38204 -67692 -75887 -27078 -19534
13374 -19534 -28431 -9677 -7410 -1869 9703 9278 33849 2820 -59508 -39930 11300 45947 38468
13361 38468 8675 -32759 -39863 -46644 -52257 -65134 -41975 -43549 -874 76724 94007 68568
13349 68568 33752 3676 -65076 -52981 -14436 19606 -11624 -25657 42757 61588 543 -27138
13337 -27138 73 -3500 2905 46508 21682 -27984 -45652 1578 51972 -11108 -88918 -95735
13325 -95735 -69592 -30512 -21951 -11611 -25288 -22574 21132 30323 28142 9531 -31501 -51764
13313 -51764 -20675 -12855 15359 35932 -58880 -92986 -43522 -29262 8930 23884 -525 -80484
13301 -80484 -135908 -58166 17762 8680 -18866 -22424 -54375 -83590 -95999 -23305 -7743 24295
13289 24295 60695 14204 -231 -7051 -31148 -44722 -57643 -82504 -74663 -22293 28179 64574
13277 64574 40509 -25421 -7595 28845 43789 10796 16092 52931 43881 23132 2817 28271
13265 28271 -13227 -37889 -36631 -70804 -82553 -10138 45953 21036 5657 12009 -39765 -119260
13253 -119260 -141388 -158581 -151258 -86246 -61167 -44762 -14910 676 37881 37660 44540 17177
13241 17177 -17591 951 18785 -2200 13627 -8667 -43576 -22446 29782 26160 -43130 11822
13229 11822 20666 -29566 -58551 33890 82112 64051 82450 70912 4872 -68212 -125466 -129170
13217 -129170 -140811 -64969 -2099 -24621 -39352 -64195 -81922 -74639 -48855 -26316 -48404 -79416
13205 -79416 -88063 -76350 -63104 -42191 -26704 -36507 -26092 9157 -33151 -59879 -109384 -78132
13193 -78132 -23472 -76231 -130876 -89471 -66995 -71367 -61793 35989 88245 44408 -52544 -90332
13181 -90332 -108964 -134771 -72113 13995 -5740 -16922 -23420 -32337 3695 40429 8789 18223
13169 18223 8289 -381 27552 5294 42094 50716 -33685 135 35111 29794 -42328 -41201 -46671
13156 -46671 -34819 -10960 33166 25573 32511 46915 5826 -10009 1929 46586 34100 26384
13144 26384 -21774 -36367 -51841 -77797 -63974 -39634 -53520 -78163 -91579 -115159 -80218 -68703
13132 -68703 -55686 -109742 -125890 -50474 -57467 -62157 -63935 -53201 -101964 -86840 -37074 -67074
13120 -67074 -45278 -6437 1998 31908 69624 18007 -14371 6851 -604 -22377 -18279 -18521 -23145
13107 -23145 8256 2071 -65776 -88023 -87872 -43138 -52847 -60120 -7691 -48505 -53689 11375 50577
13094 50577 41843 45349 47949 30364 28503 4352 -33050 -109929 -131388 -75072 -27147 -10073
13082 -10073 18248 9196 17652 -9744 -31938 -9938 -15951 35894 65689 46226 -8674 -37593
13070 -37593 9610 19385 59498 66498 20833 11690 1279 7239 -16976 -49294 -47027 -31672 -30131
13057 -30131 -54671 -62792 -65746 -85146 -110590 -90901 -62652 -78093 -86674 -77236 -141986 -141701 -70160
13044 -70160 -1066 59021 89693 100114 60740 14760 -505 14637 478 9361 43439 63990
13032 63990 13361 19044 76368 97872 61093 -8330 -24836 28930 11254 -14857 -31637 -21260
13020 -21260 -7294 -19581 -45251 -72317 -59553 -86957 -137994 -133327 -62618 -2986 -19945 -26893
13008 -26893 -10170 6309 -41314 -100714 -123853 -141608 -85574 -27215 -14827 10165 9192 -4575
12996 -4575 3489 12346 5995 7838 28472 -8669 815 -37698 -42648 -7190 11447 10068 27491
12983 27491 32023 32144 14724 9459 11642 -34232 -54678 -39098 -26138 -41113 -78238 -49590 3753
12970 3753 27420 -2754 5410 48606 58128 9345 9110 -41063 -50731 -54124 -31956 -41645 -45425
12957 -45425 -61799 -64796 -68611 -83073 -72423 -75534 -111051 -80140 -47789 -10389 -4584 -28144
12945 -28144 -31637 -51420 7742 33981 26328 15959 22903 51636 36037 4761 5144 -20734 -45601
12932 -45601 -51769 -1283 -10547 10274 -276 -5852 4920 4115 42373 39682 -17743 15857 44530
12919 44530 28638 20965 -11378 -5483 5349 41162 81671 43446 46519 7451 8848 -13136
12907 -13136 -26579 -31447 -37024 13644 968 -8937 -20997 -43036 -63353 -78240 -73309 -74512 -94803
12894 -94803 -114097 -74419 -20606 -32284 -41369 -58570 -40835 -6988 7744 48158 -11062 -27687
12882 -27687 -56144 -63033 -100236 -62641 14242 39033 -25342 -55349 -50008 -38835 -37113 -34301
12870 -34301 -26451 -31794 -87890 -62155 -9249 -52932 -69931 -126750 -120115 -43357 6503 301
12858 301 1408 29083 56789 36182 37935 89729 91166 104322 130318 44856 -21821 -41103 -13842
12845 -13842 34378 12782 36450 3995 -40609 -40479 -14367 54322 70013 35490 32081 35921
12833 35921 28612 -22 -10458 3195 -20989 23782 15958 50655 33264 -65997 -71031 -110125
12821 -110125 -87828 -30581 37403 9374 -97860 -115544 -63649 -57206 -53669 -13164 15606 4702
12809 4702 -21606 -28551 -24613 -38817 -11740 -3254 47561 43626 70327 44366 30173 51884 50550
12796 50550 41633 36278 31903 -23308 -28574 -18200 -26961 3074 -3055 13901 20999 -17657 12170
12783 12170 17000 -26796 -28335 -73229 -47983 6680 39066 23712 21032 -14436 4193 36934
12771 36934 51599 5050 -27652 7315 -1457 -88522 -84846 -53208 14697 12673 -13906 -21423
12759 -21423 10529 36361 -16786 -56935 -29706 8601 28991 31876 39801 -3351 -14600 -24304
12747 -24304 -20391 -3876 11039 -32214 -24519 35313 2618 -61347 -66773 -74868 -25511 32661
12735 32661 102533 103002 110899 106871 34434 22430 49420 77445 -5335 -43671 -15920 -48643
12723 -48643 -33513 -5650 -20078 -37413 21540 39505 23393 -23137 -79289 -69194 -52378 -38868
12711 -38868 -91994 -86859 850 17218 22595 8447 7092 -22221 -53389 -72661 -41055 34605
12699 34605 52580 60710 62040 -37852 -83523 -62113 -75508 -56788 -44948 -19914 -19504 50879
12687 50879 80985 65178 31914 7738 -31081 -38047 -51248 2343 -37164 -93053 -10773 39207
12675 39207 73705 60019 16763 -31540 -44679 -40609 -83895 -135387 -112729 -48150 31803 66554
12663 66554 29269 -31298 -80438 -92031 -13174 -7050 5743 15175 32956 -15904 -98353 -98722
12651 -98722 -57189 -8652 -8238 -3680 -2880 18791 26545 -11516 -39687 -58293 -54330 -40744 -30432
12638 -30432 -85377 -113049 -53620 5259 -244 -13763 22870 47371 39276 55080 12875 -19692
12626 -19692 -60511 -88382 -71272 -16740 2486 -7840 -22515 -54601 -22042 46680 57632 19558
12614 19558 -24453 13860 2019 -38489 -103133 -125026 -117227 -23694 11976 9744 1582 -60568
12602 -60568 -88620 -116595 -160224 -141021 -97526 -90090 -75955 -62598 -41427 -30019 -35081 -37511
12590 -37511 -55653 -9909 61757 45887 35666 103195 119531 112620 19853 -27600 -6886 -17376
12578 -17376 -52202 -49500 -92838 -59438 54755 93806 100447 19752 -4067 25499 31688 30202
12566 30202 4385 -79930 -82728 -65381 -39256 -26228 -20184 -4111 -20810 -11746 -25704 -32346
12554 -32346 -11513 53460 57841 -2908 -41585 -45170 -13018 -32329 -67333 -69142 -69083 -56218 -52405
12541 -52405 -37416 20177 -15426 -55642 -20675 -9377 -65124 -47095 -2106 33866 33357 28798
12529 28798 -1911 -31567 -117837 -81613 -11581 -26374 -25698 -43995 -48661 -29184 -22100 -4529
12517 -4529 30309 7409 5560 36054 33244 -43747 -109265 -55554 -19654 -47289 -14556 14629
12505 14629 34630 -5192 -12778 -20890 -36279 -14256 17901 41478 56779 -2042 24302 50318
12493 50318 30138 30349 54811 81583 94604 107251 -474 -28307 -56617 -74429 -79008 -26949
12481 -26949 17 10676 40752 6518 -18303 -40421 -49488 -32820 -23135 -45431 -22066 -69081
12469 -69081 -91956 -52506 -18454 -17137 -26754 -14862 57635 65479 2613 -39529 4504 17714
12457 17714 23253 22105 -49692 -2764 47960 14445 -34601 -75603 -105015 -152554 -174966 -130224
12445 -130224 -57818 -46764 -48395 -45750 -75250 -50536 -7986 -17945 -35866 1069 18129 40900
12433 40900 12395 -33413 -40332 6198 52793 39187 -4080 -57832 -56304 -9449 53949 48792
12421 48792 25674 35315 53594 123964 154529 111264 83941 70117 62955 43093 71992 87467
12409 87467 42993 47043 49902 23642 28855 -6749 -481 20347 56182 91543 30284 -47517
12397 -47517 -62897 -63006 -57460 -71151 -35748 22829 93246 107843 53628 42806 744 -28378
12385 -28378 50374 95289 77179 115241 80255 63271 38661 -21782 -38142 -43466 -44518 13597
12373 13597 53540 24493 -20243 -23270 -15185 -32034 -44077 -57387 -56157 -65240 -27309 -21356 -3036
12360 -3036 60243 65963 26555 4024 -35391 -73508 -110568 -87265 -71325 -39442 -21093 -43095
12348 -43095 -34039 -33553 -17696 24169 35915 22448 -35450 -48461 -75816 -80557 -36739 -17213
12336 -17213 -3144 -23330 -16523 -26637 -41716 -64720 -42665 -10248 -28816 -33463 8730 14554
12324 14554 15260 24369 6575 26376 60481 78099 84939 86354 84720 20774 -3655 47581 63579
12311 63579 96696 82101 51750 37711 20803 12534 25310 -36314 -14622 50633 66277 48611
12299 48611 25145 32736 46519 43547 6657 -19450 -14835 -13288 -7466 6320 -17246 -48582 -48268
12286 -48268 -34946 -40516 -28067 -46454 -26403 2863 19182 17200 -2361 -42304 -72538 -60536
12274 -60536 -48385 -29537 -31788 -22428 -50901 -22230 943 18292 -16617 11184 22384 3681
12262 3681 -2574 16130 55682 100435 18645 8166 24019 34437 62460 -435 -27067 853
12250 853 2058 5957 30734 31594 45924 -3834 -19986 39706 18257 -18753 -49747 -41320 7644
12237 7644 -3921 -36880 -84111 -82954 -17950 -29050 -40299 -14878 37743 40974 60785 -1414
12225 -1414 -31375 -55520 -82590 -59051 -50671 -48283 -31401 -54340 -54237 -60782 -82378 -98162 -70550
12212 -70550 -22323 -34366 -48850 -3377 61316 48567 33902 8953 -20550 -50073 -70663 -38744
12200 -38744 -1034 27683 42759 3778 -55737 -100693 -56686 7431 31660 44394 14373 -28252
12188 -28252 -45725 7505 5372 -6892 22056 77822 92545 76981 64123 5455 -17914 7011
12176 7011 -859 -22225 -433 -26286 -34086 -6101 84221 123327 91664 46850 13185 -193
12164 -193 26575 39575 41630 -12653 -36796 29050 41486 62517 -6987 -34804 -13116 -33759
12152 -33759 -36986 -49064 -29713 -43139 -38879 -5453 -20368 -93244 -119085 -123419 -97069 -84883
12140 -84883 -116293 -57373 -19415 -7091 34619 45798 29231 22026 12402 22311 16174 -7093
12128 -7093 20110 3323 -46261 -58012 -67750 -80966 -46649 29843 71625 -4551 -40297 -36778
12116 -36778 -56443 -34980 -30341 -40023 -31231 -27833 -9530 -3497 -33758 -71407 -93012 -29424 17044
12103 17044 -887 33819 11702 -42117 -22610 59777 42296 43499 25259 -24645 -54131 -67756
12091 -67756 -91087 -92115 -19099 4945 8248 14431 9521 29359 52951 -11051 -41084 -12891
12079 -12891 27585 47566 104525 69885 26731 16222 -6611 -11069 25238 20255 -28357 -46635
12067 -46635 -42428 -22528 -62545 -77264 -76214 -84633 -95260 -86835 -39992 -28046 -61045 -44125
12055 -44125 -43491 -41869 -25240 -7183 17840 2148 3152 -3567 -24744 -34247 3606 5344 28098
12042 28098 38993 28320 -13286 10786 -13639 -14976 15882 10223 21 2043 27555 17860
12030 17860 -33780 -31645 -15024 -6038 28865 76943 -13831 -60823 -56233 -41890 -17763 -11882
12018 -11882 -18454 -19761 -8905 -46406 -39968 -30243 6289 22953 21312 612 -38738 -66193 -76205
12005 -76205 -36081 -33735 -9718 -16537 -13682 28834 93149 124722 110278 75843 75981 -6203 -29706
11992 -29706 -64347 -53590 -55569 -67735 -60605 -75164 -105183 -103120 -76124 -31607 -24345 14014
11980 14014 43978 56978 36810 67398 90535 54865 53370 67343 36404 -8778 5155 30322
11968 30322 31379 51136 75281 67401 73705 87192 57291 37958 22359 15916 39363 26891
11956 26891 15328 -28318 -70455 -61172 -96915 -84476 -40730 42220 29810 -43485 -57541 -13317
11944 -13317 23014 37436 43936 -8436 -1983 27745 5686 42075 58118 45364 51732 36530
11932 36530 28795 25836 8771 -5661 32569 50811 15700 -16997 -33364 -58371 -45727 -45548
11920 -45548 -40705 -873 -43296 -53303 -34683 -6859 -30264 -85328 -88420 -75896 -20594 34193
11908 34193 41202 17529 19076 66065 60018 32468 -11538 -7020 5900 4700 -20753 -24502 9002
11895 9002 72831 57006 12452 723 -25870 -46523 3077 64665 99898 59985 25378 7139
11883 7139 -40990 -52294 -39379 -34522 -36875 -46609 -38423 -36172 -32539 -11144 -239 -30693 -65000
11870 -65000 -39838 -20659 -27370 -37173 -42443 20964 10455 -6833 5981 6889 30912 56360 95917
11857 95917 76275 39461 25382 45267 27860 15265 -6379 -28637 -51520 -34544 -8518 -28696
11845 -28696 -34628 -19461 -3369 -17972 -5217 -11239 -20434 22784 33418 40314 22502 43500
11833 43500 50655 28349 -8482 -25748 -36594 -57094 -76736 -59427 5287 41849 27943 -43376
11821 -43376 -46735 -68846 -62930 -50282 -70650 -76357 -103798 -52417 11687 29223 27276 72632
11809 72632 14660 -60910 -55515 -11019 24797 53695 81035 51363 -16579 -8635 41549 41504 -38457
11796 -38457 -46088 -71008 -75826 -52027 -43939 5340 14333 14611 -16766 -33644 -37235 -15250 19710
11783 19710 77308 61488 -15126 -14517 -9876 -3042 15064 40650 33632 56816 31124 -11243 -11733
11770 -11733 44404 77082 70472 50703 37981 26257 -1952 -315 -3860 -38531 -58778 -54754
11758 -54754 -17622 -37423 -51411 -86470 -101537 -77243 -74559 -63302 -37087 -4073 55825 18503
11746 18503 -28578 -73545 -54451 -47674 -16145 -27833 8092 9612 -35262 -69999 -97236 -55926
11734 -55926 -31832 8426 23734 -32103 -53513 -50942 -55130 -55622 -5048 -35317 -71265 -69696 -29018
11721 -29018 -13747 -32083 -35019 -77044 -134655 -179850 -107721 -100660 -95529 -73513 -106491 -97227
11709 -97227 -61080 -88872 -87345 -106160 -97487 -7206 21464 -30995 -84385 -55143 -61951 -37632
11697 -37632 21105 62634 24249 -16043 -14076 -38921 -30143 42588 29969 -13273 -40971 -18946
11685 -18946 -13154 -54686 -101320 -82160 -24414 -3778 7842 16279 -16887 -6398 21071 32336
11673 32336 23317 15561 27740 15908 5278 39063 42878 35780 87522 138779 103121 31185
11661 31185 23097 28910 30610 31257 77339 121490 63584 25329 -6468 -31612 -83663 -68100 -44317
11648 -44317 -18012 9967 11203 -13546 -35059 -88618 -84063 -53582 -37250 -59884 -98474 -81488
11636 -81488 -54615 29184 47023 20844 -11478 -71878 -102344 -92659 -47199 -8336 7790 -47135
11624 -47135 -59499 -24718 39603 34130 -37606 -45809 -25957 -2475 47900 54808 18379 -5158
11612 -5158 -30864 -32444 -12019 -28399 -20323 4872 21465 65078 93412 35272 25277 -11892
11600 -11892 -12577 -17294 -14317 46849 61047 16089 -16393 5318 45147 28687 9927 24868
11588 24868 693 -12094 16405 30934 51747 69246 104441 77681 39475 -36792 -63694 -6433
11576 -6433 27539 11836 -14981 -37926 -57802 3587 -3620 20798 77747 71104 14571 17703
11564 17703 -30113 -41392 -55062 -76179 -98763 -64853 -110231 -130422 -104125 -56500 -45606 -82374
11552 -82374 -55302 -95788 -96479 -60205 -4676 2303 -45402 -94805 -6015 36480 36474 29173 7561
11539 7561 36328 60954 48225 -3926 -958 68391 23202 8494 55880 39051 43633 60468
11527 60468 48187 88058 104934 58093 23694 37824 77935 32983 10056 18021 -13997 -9778
11515 -9778 -6223 -25106 -51265 -94553 -112857 -132016 -88644 -61167 -66848 -53408 -106 1841
11503 1841 -38463 -52104 3045 -758 -38316 -59475 -58150 -17115 -9742 35146 37221 21744 36705
11490 36705 33796 41294 17769 -5011 22309 9118 60610 110193 96692 50900 5222 -26628
11478 -26628 -46994 -53656 -91385 -67151 -61113 -73817 -24899 -27896 -39499 -63678 -28718 -28406 2423
11465 2423 25057 98582 165056 171877 126056 133811 100898 29868 28993 90015 74049 27576 -24942
11452 -24942 -45258 -3258 12698 45315 105732 89612 57290 2015 -50585 -44290 -19594 -12811
11440 -12811 15314 8208 4726 -43837 -56360 -44273 -69151 -71663 -72458 -74351 -1951 -18504 -36564
11427 -36564 -24205 31224 18106 -42064 -78707 -46872 7537 44790 12583 -49901 -77306 -52378
11415 -52378 -47620 -80426 -80054 -134204 -140803 -141345 -134045 -120932 -83060 11709 -12565 -89830 -61103
11402 -61103 -64480 -55180 -44060 -87066 -80473 -96211 -36850 13953 20713 -32939 -15712 38587
11390 38587 65417 50647 -6707 -49006 -87833 -73815 -62084 -89405 -73376 -55158 -23892 -43174
11378 -43174 -53521 -44832 -8036 -28454 -62449 -69752 -110393 -107822 -52644 -45069 -21537 -23590 -49268
11365 -49268 -45766 -16568 -7552 10490 -2115 -4108 -55710 -53092 -18088 -22035 -49413 -78664 -56920
11352 -56920 -26999 -17978 35108 15286 30817 78437 72988 23380 -15642 -55251 -96611 -104666
11340 -104666 -64766 -87748 -76196 -55104 -30036 -48221 -86577 -92589 -127898 -118940 -30199 -15033
11328 -15033 18609 35713 41240 6461 11011 26786 25679 61320 49584 40325 24170 22777 38456
11315 38456 35557 -9645 -54043 -24690 -47048 -87909 -100663 -63909 7514 34534 49545 66879
11303 66879 63990 85570 78226 64988 42403 -17609 -12187 -10403 11413 24222 14085 13981 12344
11290 12344 1539 21999 34745 -18171 -74780 -53660 -35776 -9101 -17918 -25658 -12657 -14727
11278 -14727 41578 41882 70088 94062 150557 111986 44982 -25736 -21672 -36346 -80311 -69029
11266 -69029 -37557 -25796 21739 60819 69344 49862 -10253 -44118 -17529 -39668 -12857 -54525
11254 -54525 -70222 -35422 -27233 -11639 21884 70072 46463 -9867 13461 4249 -60131 -66505
11242 -66505 -43778 -5786 61673 35390 30384 23051 49524 30311 -22136 -36732 -22490 14991
11230 14991 -15050 -48460 -51015 -32288 -6721 -31356 -23053 32390 58197 38383 24292 -20241
11218 -20241 -99968 -101828 -61781 -14504 -1294 -22448 -31921 -40327 -64503 -49928 5004 23297
11206 23297 16598 25682 13909 -23830 -27617 -19155 11182 29979 -20333 -41138 25813 39469
11194 39469 21361 -6372 -4739 -10179 16107 67564 93301 77847 22432 -37580 -55588 -49441
11182 -49441 -9524 -39401 -18648 5261 23244 17794 24661 -32086 -63806 -23863 -12759 -59338
11170 -59338 -97332 -72779 -18390 -32074 -41208 -34798 -50533 -53855 -48707 -1933 28897 22910 13350
11157 13350 -7187 14920 50086 86030 79751 72639 44786 25728 -22070 -43075 1487 23176
11145 23176 3545 -11543 450 1814 51120 52095 60916 43374 8446 -42265 -72242 -61866
11133 -61866 -32498 -36257 -42671 -4394 -15990 -84530 -72046 -10409 -8976 -15833 -33076 -1939
11121 -1939 -14070 -2622 30669 -3641 13820 21022 9607 -19139 -16622 11483 -22953 -8890
11109 -8890 11294 6121 -14945 -19241 -3065 2474 -29382 17727 22238 24976 -24131 -22789 8544
11096 8544 15984 47532 -16358 -22022 6510 20435 37815 -18421 -22343 -18237 -16868 -16043 -45965
11083 -45965 -61592 -85916 -108445 -38402 -37383 -23898 -16805 -42723 -17961 44223 59708 74582
11071 74582 39587 24619 22808 -11083 -12136 -15143 -25807 -8774 23455 -9230 -39567 -12131
11059 -12131 32102 52212 -19030 -62359 -48231 -33776 -65999 -79083 -86086 -86896 -47647 3144
11047 3144 -25065 -34081 -34621 -30750 -66889 -98163 -58591 -68863 -27818 46199 46163 18333 9389
11034 9389 13152 10679 -733 238 34567 62822 5435 -17416 -18354 -29267 6732 -24304 -7638
11021 -7638 56719 71956 28339 -24095 5162 18575 27248 20367 -12743 -19555 -5063 29851
11009 29851 37505 51838 55654 12974 9795 30047 37107 52094 -26581 -83026 -39076 -29322 4707
10996 4707 -4221 -901 -49648 2693 55886 39253 11181 -28175 -51910 -55794 -25240 32016
10984 32016 78639 106703 79460 60685 191 23947 17990 -48372 -92200 -81320 -79124 -42521
10972 -42521 -61869 -34307 -318 44803 13382 20263 29243 30733 9476 -2788 -3243 15896 -11458
10959 -11458 -44833 -78349 -79975 -64005 -44753 -44426 -34570 3165 42188 53372 67111 37227
10947 37227 15815 15128 4035 39367 77661 120916 72276 17013 -7123 562 31928 43767
10935 43767 52791 71291 24567 21237 20823 -13109 -85896 -68501 -43461 -13393 -14808 -15029 11405
10922 11405 24376 -25072 -20965 -24100 8035 18012 -20520 -12981 13693 22861 31247 4400 -61892
10909 -61892 -78536 -55573 -44654 -30135 -10763 47519 73787 47311 19371 -4178 2494 75784
10897 75784 86450 36519 -9357 -11018 34399 96099 55228 42279 44269 -17450 -14007 -64029
10885 -64029 -100716 -97733 -145745 -164007 -126620 -81260 -104361 -130887 -132746 -157787 -134900 -24054
10873 -24054 6249 -10173 -36045 -34546 -24859 -47988 -32086 -25831 -75985 -52020 30212 43547
10861 43547 42542 -62786 -119101 -53667 -42508 -26605 -29691 -37338 -43174 10383 -3655 -65836
10849 -65836 -64758 -37823 -32835 7576 55040 98020 76598 48795 95410 89323 65694 62428
10837 62428 74061 48447 78644 125808 60176 36403 68347 54220 19725 -19657 -35716 -15865
10825 -15865 8684 -14942 4608 53858 65155 96359 123344 75528 60951 64198 36544 5509
10813 5509 -72367 -52762 -13276 627 -19567 -20367 30339 46809 -474 -16879 -26290 12128
10801 12128 -10820 -33728 -23444 29985 65097 66359 39312 18541 19347 52223 40649 52306
10789 52306 30576 -37374 -5319 13062 33183 -9333 -24664 -6762 21991 40055 13423 -22680
10777 -22680 -1023 18912 -2228 -9074 26577 43951 60448 45503 30736 36108 31874 1900
10765 1900 23631 73143 53118 13673 -34953 -60867 -33311 -59439 -28006 -6895 23109 4893
10753 4893 -38340 30010 -19781 -24052 27223 -232 20633 13502 40290 73250 75462 66335 25013
10740 25013 -2851 -84256 -107752 -57605 -45082 -28093 -33897 -56032 -9700 34138 66734 78648
10728 78648 95581 67450 -999 -47229 21962 82245 70521 50998 23679 53087 43889 32684
10716 32684 36151 33665 -1387 -57545 -79676 -24405 -24948 -43257 -64043 -58278 -68681 -58213 -13801
10703 -13801 77050 49203 -6596 -47465 -58949 -50918 -48468 -47414 -13096 5133 -21279 -18479
10691 -18479 36873 38459 45144 57383 42842 10235 -6795 -296 472 12201 27191 58492 74562
10678 74562 16394 -44393 -28630 -87253 -119788 -53549 1465 -6100 -22114 -63534 -78092 -36823
10666 -36823 -37652 -31327 27697 34626 -11789 10692 42276 48351 18607 -22676 29306 11037 -63627
10653 -63627 -37038 -32585 -73092 -23643 58993 34919 72251 108010 66312 64814 60908 51209
10641 51209 40583 74105 83329 64050 4365 27861 102177 113435 76779 40987 -3846 -31736
10629 -31736 -33542 -82016 -80863 -37424 -20741 -49253 -26893 -13223 8439 18943 24259 23965 15610
10616 15610 15564 56370 60189 29457 -6110 -65708 -95817 -79412 -3726 76136 45500 34759
10604 34759 97004 101834 70020 53920 36904 25925 -51886 -39128 -2726 -26295 7315 41201
10592 41201 64540 50869 85053 55111 47032 19688 -11518 -3541 15551 31915 40845 22733
10580 22733 9736 -900 30416 39831 32804 -2423 17212 11569 42341 80500 89069 135709
10568 135709 118653 46739 -47758 -69829 -25737 -28897 -16920 33924 58481 34535 49421 19695
10556 19695 10397 21516 24556 73550 33396 -7561 24761 55688 76788 8022 -504 21912
10544 21912 74522 64043 18260 31741 7858 64349 79701 59043 93628 77402 93394 135641
10532 135641 144220 121059 82631 95435 91384 148345 218919 293178 349246 432074 554865 612394
10520 612394 687333 833917 907748 982367 987995 996946 992291 1027617 1068998 1067561 1068578 1096689
10508 1096689 1093327 1022213 890153 773011 667727 597652 461502 331050 276982 260429
10498 260429 239158 193892 161812 126798 111131 114513 148461 137313 126412 147117 144793 133948
10486 133948 67006 28242 74981 86642 68506 40782 81286 104910 112842 68755 58658 38004
10474 38004 -2092 -42891 -79310 -60728 -26789 -9046 3200 -7087 -2370 1373 18442 55780
10462 55780 -19403 -42136 -43507 -46442 -40038 -7006 33901 56733 14288 -25425 24993 40443
10450 40443 32997 -12596 6156 36019 80533 80785 70027 37051 37065 33136 43243 40395 14302
10437 14302 -15117 -18098 -44369 -27306 69417 47263 47879 55735 84938 99645 73783 24287
10425 24287 -27684 27953 60250 110130 154255 125822 135360 178302 170992 200669 243373 221393
10413 221393 212092 240038 233866 205850 193975 192030 215550 207380 185327 177475 136213 123764
10401 123764 147515 171752 157953 107769 45126 38748 25154 -3770 41853 62826 93092 162145
10389 162145 146876 85636 50094 63498 137104 121778 77518 49367 39605 48898 71631 77505
10377 77505 98091 53991 53289 82602 81926 64148 46055 40873 30758 50166 76944 170612 199584
10364 199584 175943 125961 49573 -22600 -11189 -1373 -16090 1667 23484 17273 -18509 -14858
10352 -14858 22105 19781 -10228 2430 51552 12833 6982 7677 -3090 1617 23910 28693 54907
10339 54907 68515 65610 50651 -20657 -48185 -31596 26726 95339 101435 85830 81016 62074
10327 62074 25934 27920 94874 107633 74925 36469 25725 36388 17600 3738 -12147 -67019
10315 -67019 -67537 -19805 -12057 25573 36737 -13936 13196 77935 89064 159334 171681 171504 92622
10302 92622 45866 51381 42873 70388 52511 39430 18201 29525 55168 59350 35870 28479
10290 28479 69312 73072 106618 105934 66994 14994 58515 76525 84680 44969 13646 604
10278 604 8506 52903 73881 63580 21666 -12077 -29039 -37862 -10787 -11294 26809 52891 47298
10265 47298 59970 124828 162674 105088 87977 64968 68657 66483 65737 62846 93721 128024 159966
10252 159966 139669 150683 135345 130070 83553 33688 41290 75986 135117 93806 89764 86722
10240 86722 35644 25365 62990 92356 124593 186234 150974 128857 117415 123255 109760 114946
10228 114946 150884 157342 124160 147518 153946 213809 276845 309196 326143 343489 314398 315995
10216 315995 294869 180042 92061 91057 90399 56281 25137 38449 113982 139474 90899 8465
10204 8465 64595 89122 136338 156618 94890 73642 118077 122424 74493 31058 -7851 -13311
10192 -13311 -22596 14972 75159 96077 109681 95356 58594 45563 112062 94492 57017 72462
10180 72462 35439 23909 60767 87300 59316 31644 36612 30352 64857 63844 37913 -915
10168 -915 -29268 10726 66152 45030 -27162 -25716 -7713 23305 36227 51460 56824 78012
10156 78012 59108 40706 47980 48165 38762 19038 9088 33811 24907 3046 7685 13277 -27427
10143 -27427 -44736 -15147 9539 58507 19438 18528 55771 71986 57746 27301 38873 34920
10131 34920 35492 19304 30407 25961 1704 -31778 -69052 -59873 3382 12293 45368 47984 -3705
10118 -3705 -22362 -29187 9264 57212 27810 27132 96603 98829 87768 95789 82996 79410 85679
10105 85679 58651 51877 70296 114201 83454 30833 -28705 -36297 4471 17910 347 65381
10093 65381 146255 177776 141284 169876 178818 126074 94455 75396 34640 11847 48954 42815
10081 42815 21080 14152 -5617 7852 8936 -11812 16070 23652 21975 -21336 -17627 8640 6976
10068 6976 27201 30184 1623 30405 69382 45422 40625 -297 -14907 46669 94496 82115
10056 82115 131263 148504 108132 107477 122584 137179 190297 211794 191311 180668 148789 182269
10044 182269 169919 133251 92710 49448 70060 93478 57059 19469 52679 121258 124940 90809
10032 90809 37888 20740 9881 -28356 -36801 4404 40867 102781 95036 73769 33893 18242
10020 18242 3700 52730 138055 151496 107767 68453 30952 26005 42562 93298 124604 85568
10008 85568 5768 -28458 -15232 -37168 -59257 -41583 -303 58415 65093 72783 16088 20301
9996 20301 10662 79603 56989 49093 73024 93874 95895 107605 72399 59884 56284 60432 101016
9983 101016 118898 119394 114318 94075 88906 71168 32354 58193 110942 131294 84633 100069
9971 100069 114915 74264 65033 103568 101373 79130 68903 59238 45707 69675 87402 105261
9959 105261 79480 70667 76824 118396 99870 85577 118459 116250 107675 154544 177711 202002
9947 202002 153260 151204 163473 113707 108802 150416 121754 128788 114459 104162 107808 124703
9935 124703 107006 122231 157084 105383 79873 42931 79 -1747 58033 41528 41685 59207
9923 59207 96211 106538 130088 120964 108302 109092 73802 15848 18923 87156 103914 100892 137845
9910 137845 164216 128472 45407 70078 145583 190851 182562 164152 209269 294412 361927 332673
9898 332673 282854 229393 222126 208890 191203 174531 138219 121842 91942 73602 70161 43452
9886 43452 55115 57651 69768 80622 98485 118338 115177 127772 148531 164412 188392 223613
9874 223613 209903 152172 103590 98432 115434 146477 136812 128848 125767 149969 170375 201118
9862 201118 239925 255772 226910 196214 222939 269305 312626 349684 382108 338481 325818 401607
9850 401607 400404 327404 297755 324051 283401 209522 185543 195572 201041 220869 275874 285843
9838 285843 265801 230523 216617 199733 148470 135646 148942 226468 281909 245197 245279 247467
9826 247467 255602 304355 317279 306078 306711 333954 314772 296848 274640 257611 257710 269407 238729
9813 238729 224071 274641 298963 274554 292684 270516 228944 195313 198470 230022 302952 295908
9801 295908 245228 199007 197535 234393 271801 284805 254288 266607 270791 217327 162257 122430
9789 122430 161683 144662 112064 124113 191709 241849 248769 219208 206563 158714 150201 160653
9777 160653 222545 204654 187820 226279 286644 340058 383110 347135 281178 279074 308185 289268
9765 289268 315189 329800 354192 361871 309451 290953 306743 302989 292532 367016 400074 401286
9753 401286 393628 364393 362860 361778 330822 342600 322932 379091 417067 398003 386497 354450
9741 354450 375946 386088 353869 365056 393585 348336 331756 382643 377975 394002 415036 503214
9729 503214 565031 590729 599043 659253 661739 662779 616594 630035 633348 682442 727866 710319
9717 710319 711794 689081 659132 715888 726257 714742 745785 743495 739250 755994 765402 790344
9705 790344 828451 814704 816833 825067 835353 851980 834066 835968 934404 962587 993170 1023354
9693 1023354 1015178 1037258 1116037 1181708 1233070 1299059 1375637 1411126 1476958 1529223 1550863 1593510
9681 1593510 1656984 1736083 1821878 1903655 1969561 2030130 2152622 2250701 2310172 2432946 2623558
9670 2623558 2776150 2912371 3081263 3273617 3433856 3608457 3858725 4179238 4528484 4844239
9660 4844239 5231046 5679983 6255995 6961755 7681239 8486425 9499254 10633265 11921712
9651 11921712 13413328 15108395 17135624 19534824 22298006 25561921 29369520 33806111
9643 33806111 38757709 43808233 48531831 52304624 54459242 54721471 53112751 50191532
9635 50191532 46629259 42835617 39226009 36064563 33312110 31036343 29070238 27454032
9627 27454032 26209131 25188618 24412646 23908967 23643224 23608268 23747862 24101648 24705171
9618 24705171 25630294 26884242 28434217 30416763 32821883 35685043 39144703 43383726
9610 43383726 48539005 54733059 62241193 71336548 82240221 94759378 107909720 119574097
9602 119574097 126869412 127509934 121273673 110253161 97186405 84318479 72892958 63335619
9594 63335619 55502048 49168940 44021296 39722686 36254795 33414293 31060292 29095978
9586 29095978 27465156 26144432 25079467 24285904 23679259 23308108 23179383 23306583 23742767
9577 23742767 24356854 25180997 26253609 27626448 29378758 31434745 33849334 36695818
9569 36695818 39851405 43285423 46739282 49757319 51826509 52348081 50986946 47920143
9561 47920143 43724248 39039217 34326602 30014107 26172835 22830691 20090333 17783022
9553 17783022 15748466 14023704 12542344 11264293 10146830 9256717 8484557 7758779 7136323
9544 7136323 6523798 5959616 5504101 5096976 4707332 4417542 4143286 3885734 3697023 3487423
9534 3487423 3276521 3138538 3050511 2917554 2833463 2800286 2754286 2776376 2781557 2775364 2776214 2820582
9522 2820582 2859961 2846551 2754546 2578441 2426369 2289895 2288697 2256601 2102374 1959844 1925462
9511 1925462 1854695 1781559 1701588 1623707 1527171 1498754 1493932 1432675 1364913 1331201 1312431 1271047
9499 1271047 1244011 1193301 1170839 1181233 1158427 1145309 1112524 1095741 1133353 1147510 1162458
9488 1162458 1213570 1301589 1395486 1483320 1512457 1518246 1465473 1375918 1349422 1346763 1292068 1223352
9476 1223352 1167098 1128095 1157696 1127322 1097201 1066297 1015354 907438 885417 917498 902976
9465 902976 805258 706033 643824 552438 585514 619277 615701 600425 554744 531472 543893 550962
9453 550962 550723 570310 561640 515319 518508 519445 490227 484428 506319 502316 531408 564938 542930
9440 542930 493718 457623 426978 422848 424319 419952 395168 348232 333565 309196 323732 341716
9428 341716 332007 305080 286428 285603 310236 273305 200600 217262 218589 188734 183777 191463 187703
9415 187703 211268 213703 227454 211862 145442 117808 128821 108252 134863 151197 166069 152579
9403 152579 127831 143761 161957 199264 197200 171403 180757 173847 137946 145705 155295 173385 180210
9390 180210 213502 213670 172519 138006 136157 149061 100659 111871 126668 155747 164269 139396
9378 139396 182858 182880 177613 176816 203782 216860 217539 175360 106674 111435 150368 150312 161712 131482
9364 131482 131364 173948 133871 113483 115804 130705 129573 146890 156839 134850 167890 153439 191921
9351 191921 218557 187774 190282 212306 229888 212426 171922 132512 102369 86940 111072 141781
9339 141781 174530 195314 239837 200135 131636 111571 159714 139577 189356 222081 213780 174320
9327 174320 187024 182173 195209 197907 230831 270653 204303 192430 183747 147923 113507 84906
9315 84906 89717 134016 163977 152783 161960 182693 203775 220353 258095 322573 284024 267561
9303 267561 185021 213395 266514 235529 194559 245317 319116 330267 335882 314339 278641 228486
9291 228486 194917 238742 319293 357683 372715 337049 383005 374609 360131 405836 403834 382398
9279 382398 363731 335971 321002 344003 378889 372424 366800 358928 365569 459811 499264 447571
9267 447571 449257 435721 488152 575257 645940 689098 717210 735659 757213 757628 820333 857149
9255 857149 856604 916044 1005082 1052122 1101827 1129855 1213201 1357307 1538596 1692587 1828468
9244 1828468 1994849 2198076 2468367 2753668 3023890 3398442 3782465 4315869 4958533 5737843
9234 5737843 6602738 7636113 8995877 10574385 12397227 14249454 15798076 16638231 16516607
9225 16516607 15447636 13755090 11876030 10048776 8484959 7155820 6100690 5238887
9217 5238887 4526542 3947266 3397904 2985571 2639361 2355960 2126658 1959475 1768454 1531456
9207 1531456 1382968 1301383 1243624 1147025 1068457 968194 872831 791164 678462 608738 576586
9196 576586 534805 521482 519573 499393 520421 546401 522921 419005 371913 424513 453567 462410
9184 462410 415037 385075 404198 368399 367743 365657 385712 369084 322567 307519 274620 274639 285661
9171 285661 304485 309258 317276 358827 383613 357604 267607 280834 304321 329856 285888 262059
9159 262059 240413 224954 207381 227778 258327 255670 294645 295234 262367 232922 193576 236312
9147 236312 223724 234003 236191 154075 133270 178666 241399 301305 326288 288865 258364 282347
9135 282347 271067 247420 231610 200749 147063 103751 155857 192497 205744 208191 233673 156090
9123 156090 139104 146800 160615 206681 180211 140799 142920 174346 175006 155453 135925 170298
9111 170298 190494 163444 117713 81669 63444 70362 60193 103272 107267 140813 205224 222873
9099 222873 211031 195832 186462 192624 166618 176253 187002 205437 195829 133512 46550 67015
9087 67015 121509 165287 114165 150635 142514 112433 184118 188014 185934 129296 101762 105440 98442
9074 98442 95145 137208 155967 121667 162095 184028 185440 166385 144213 170483 158845 158355 106931
9061 106931 94379 105186 104061 120893 138588 164466 198204 178170 166271 193598 145934 75984
9049 75984 96173 147876 142124 107534 42463 -10575 -18330 64388 67306 99499 117775 128036
9037 128036 107659 111207 166501 208956 217973 199811 195751 211901 194627 149760 128144 100020
9025 100020 107532 69434 90802 87779 78096 142782 167007 179636 152975 141280 151116 109088
9013 109088 108323 103607 151897 138937 139793 139844 144559 135339 103213 129131 145633 101527 60713 68712
8999 68712 81722 91266 140655 107856 68547 87881 107884 121671 118416 64108 47656 73727
8987 73727 62348 72431 63994 79673 84837 76382 87108 81113 57246 70177 77924 55842 63098
8974 63098 47846 57293 47417 33387 44169 63478 85975 101941 62317 50102 74196 119506
8962 119506 116303 132396 135189 78392 79074 99691 77501 54077 19688 32716 75529 31508
8950 31508 27080 46078 19192 -33948 -32387 17843 75771 82815 72468 58139 18563 7535
8938 7535 40340 98289 171361 173361 158377 126781 45973 87419 122084 73095 51811 59602
8926 59602 89847 84484 91925 121179 97731 46566 38774 41533 47961 43223 9890 -17094 -36179
8913 -36179 -36188 35949 58040 28339 -8364 2643 -6562 39548 75395 94463 60416 2196 -29550
8900 -29550 34827 37012 37261 89548 122486 123730 107753 60773 58408 75770 85623 74924 91875
8887 91875 96514 124984 123027 98604 133313 105581 83795 55354 27247 64513 94610 85430
8875 85430 58714 19363 -35016 -57367 -5417 -8174 4138 30498 19593 -19438 544 44827
8863 44827 54426 29337 758 -4794 -24726 -7925 52487 83345 55363 -34361 -121130 -116854
$$ [...]
##END NTUPLES=NMR SPECTRUM
##END=
