##TITLE=Analysis number 329979
Compound Code cc 67846
Book Reference 521/121
Project Code adrs
Chemist Name evam
##JCAMPDX= 6.0         $$ Bruker NMR JCAMP-DX V2.0
##DATA TYPE= NMR SPECTRUM
##DATA CLASS= NTUPLES
##ORIGIN= Bruker BioSpin GmbH
##OWNER= nmr
$$ XWIN-NMR		Version 3.5
$$ Wed Oct 17 13:16:18 2007 GMT Daylight Time (UT+1h)  MAYBRIDGE\nmr@NMR_250MHZ
##.OBSERVE FREQUENCY= 250.131544655141
##.OBSERVE NUCLEUS= ^1H
##.ACQUISITION MODE= SIMULTANEOUS (DQD)
##.ACQUISITION SCHEME= undefined
##.AVERAGES= 16
##.DIGITISER RES= 18
##SPECTROMETER/DATA SYSTEM= dpx250
##.PULSE SEQUENCE= zg30
##.SOLVENT NAME= CDCl3
##.SHIFT REFERENCE= (INTERNAL, CDCl3, 0, 16.522)
##AUDIT TRAIL= $$ (NUMBER, WHEN, WHO, WHERE, WHAT)
$$ ##TITLE= Audit trail, XWIN-NMR		Version 3.5
$$ ##JCAMPDX= 5.01
$$ ##ORIGIN= Bruker BioSpin GmbH
$$ ##OWNER= nmr
$$ C:\u/data/dgb/nmr/ADRS/830/pdata/1/auditp.txt
$$ ##AUDIT TRAIL=  $$ (NUMBER, WHEN, WHO, WHERE, WHAT)
(   1,<2007-10-17 13:15:52.43 +100>,<MAYBRIDGE\nmr>,<NMR_250MHZ>,
      <created by zg, POWCHK disabled, PULCHK disabled
       configuration hash MD5:
       76 6E 9A 78 1E 09 19 81 EC 84 63 8F B0 6A 59 2D
       data hash MD5: 64K
       9F 65 6C 42 C2 D2 7E 58 81 07 3C 6F 30 77 E3 7B>)
(   2,<2007-10-17 13:16:07.83 +100>,<MAYBRIDGE\nmr>,<NMR_250MHZ>,
      <Start of raw data processing
       ef LB = 0.3 FT_mod = 6 PKNL = 1 SI = 32K 
       data hash MD5: 32K
       B0 C5 53 B5 AD 67 34 8D 1D 5D 27 FC A7 50 C3 67>)
(   3,<2007-10-17 13:16:09.94 +100>,<MAYBRIDGE\nmr>,<NMR_250MHZ>,
      <apk 
       data hash MD5: 32K
       7E 24 35 F7 DA AC C3 0F BA DB EA E2 19 57 4C 8D>)
(   4,<2007-10-17 13:16:10.71 +100>,<MAYBRIDGE\nmr>,<NMR_250MHZ>,
      <abs ABSG = 5 
       data hash MD5: 32K
       E1 31 7B 96 39 94 58 F2 86 51 CF A4 EA FB 31 A5>)
$$ ##END=
$$ 
$$ hash MD5
$$ 17 A8 AD 31 4A 5C 7A 59 11 2F 11 D9 7D E8 1C 8C
##$RELAX= 
##$RELAX= 
##$RELAX= 
##$RELAX= 
##$RELAX= 
##$RELAX= 
##$RELAX= 
$$ Bruker specific parameters
$$ --------------------------
##$DU= <C:\u>
##$EXPNO= 830
##$NAME= <ADRS>
##$PROCNO= 1
##$TYPE= <nmr>
##$USER= <dgb>
##$AMP= (0..31)
100 100 100 100 100 100 100 100 100 100 100 100 100 100 100 100 100 100 
100 100 100 100 100 100 100 100 100 100 100 100 100 100 
##$AQSEQ= 0
##$AQ_mod= 3
##$AUNM= <au_zg>
##$AUTOPOS= <25 >
##$BF1= 250.13
##$BF2= 250.13
##$BF3= 250.13
##$BF4= 250.13
##$BF5= 500.13
##$BF6= 500.13
##$BF7= 500.13
##$BF8= 500.13
##$BYTORDA= 1
##$CFDGTYP= 0
##$CFRGTYP= 5
##$CHEMSTR= <none>
##$CNST= (0..31)
1 1 145 1 1 1 1 1 1 1 1 1 1 1 1 1 1 1 1 1 1 1 1 1 1 1 1 1 1 1 1 1 
##$CPDPRG= <>
##$CPDPRG1= <>
##$CPDPRG2= <>
##$CPDPRG3= <>
##$CPDPRG4= <mlev>
##$CPDPRG5= <mlev>
##$CPDPRG6= <mlev>
##$CPDPRG7= <mlev>
##$CPDPRG8= <mlev>
##$CPDPRGB= <>
##$CPDPRGT= <>
##$D= (0..31)
0 1 0 0 0 0 0 0 0 0.06 0 0 0 0 0 0 0.0002 0 0 0 0 0 0 0 0 0 0 0 0 0 0 
0 
##$DATE= 1192623351
##$DBL= (0..7)
120 120 120 120 120 120 120 120 
##$DBP= (0..7)
150 150 150 150 150 150 150 150 
##$DBP07= 0
##$DBPNAM0= <>
##$DBPNAM1= <>
$$ [...]
##$SUBNAM7= <"">
##$SUBNAM8= <"">
##$SUBNAM9= <"">
##$SW= 20.6930455092707
##$SWIBOX= (0..15)
0 0 3 0 0 0 0 0 0 0 0 0 0 0 0 0 
##$SW_h= 5175.983436853
##$TD= 65536
##$TD0= 1
##$TE= 296.16
##$TE2= 300
##$TE3= 300
##$TEG= 300
##$TL= (0..7)
0 120 120 120 120 120 120 120 
##$TP= (0..7)
150 150 150 150 150 150 150 150 
##$TP07= 0
##$TPNAME0= <>
##$TPNAME1= <>
##$TPNAME2= <>
##$TPNAME3= <>
##$TPNAME4= <>
##$TPNAME5= <>
##$TPNAME6= <>
##$TPNAME7= <>
##$TPOAL= (0..7)
0.5 0.5 0.5 0.5 0.5 0.5 0.5 0.5 
##$TPOFFS= (0..7)
0 0 0 0 0 0 0 0 
##$TUNHIN= 0
##$TUNHOUT= 0
##$TUNXOUT= 0
##$USERA1= <user>
##$USERA2= <user>
##$USERA3= <user>
##$USERA4= <user>
##$USERA5= <user>
##$V9= 5
##$VALIST= <valist>
##$VCLIST= <CCCCCCCCCCCCCCC>
##$VD= 0
##$VDLIST= <DDDDDDDDDDDDDDD>
##$VPLIST= <PPPPPPPPPPPPPPP>
##$VTLIST= <TTTTTTTTTTTTTTT>
##$WBST= 1024
##$WBSW= 4
##$XGAIN= (0..3)
0 0 0 0 
##$XL= 0
##$YL= 0
##$YMAX_a= 386422
##$YMIN_a= -552996
##$ZGOPTNS= <>
##$ZL1= 120
##$ZL2= 120
##$ZL3= 120
##$ZL4= 120
##$ABSF1= 16.522
##$ABSF2= -4.171173
##$ABSG= 5
##$ABSL= 3
##$ALPHA= 0
##$AQORDER= 0
##$ASSFAC= 0
##$ASSFACI= 0
##$ASSFACX= 0
##$ASSWID= 0
##$AUNMP= <proc_1d>
##$AZFE= 0.1
##$AZFW= 0.1
##$BCFW= 0
##$BC_mod= 0
##$BYTORDP= 0
##$COROFFS= 0
##$CY= 12.5
##$DATMOD= 1
##$DC= 0
##$DFILT= <>
##$DTYPP= 0
##$F1P= 14.0000005364418
##$F2P= -0.99999901652339
##$FCOR= 0.5
##$FTSIZE= 32768
##$FT_mod= 6
##$GAMMA= 0
##$GB= 0
##$INTBC= 1
##$INTSCL= 1
##$ISEN= 128
##$LB= 0.3
##$LEV0= 0
##$LPBIN= 0
##$MAXI= 10000
##$MC2= 0
##$MEAN= 0
##$ME_mod= 0
##$MI= 0
##$NCOEF= 0
##$NC_proc= -3
##$NLEV= 6
##$NOISF1= 0
##$NOISF2= 0
##$NSP= 0
##$NTH_PI= 0
##$NZP= 0
##$OFFSET= 16.522
##$PC= 1
##$PHC0= 157.4884
##$PHC1= 5.424068
##$PH_mod= 1
##$PKNL= yes
##$PPARMOD= 0
##$PSCAL= 4
##$PSIGN= 0
##$REVERSE= no
##$SF= 250.13
##$SI= 32768
##$SIGF1= 0
##$SIGF2= 0
##$SINO= 400
##$SIOLD= 32768
##$SREGLST= <1H.CDCl3>
##$SSB= 0
##$STSI= 32768
##$STSR= 0
##$SW_p= 5175.98343685301
##$SYMM= 0
##$S_DEV= 0
##$TDeff= 65536
##$TDoff= 0
##$TI= <Analysis number 999999
Compound Code 99
Book Reference 9
Project Code 9>
##$TILT= no
##$TM1= 0
##$TM2= 0
##$TOPLEV= 0
##$USERP1= <user>
##$USERP2= <user>
##$USERP3= <user>
##$USERP4= <user>
##$USERP5= <user>
##$WDW= 1
##$XDIM= 32768
##$YMAX_p= 521050258
##$YMIN_p= -204388
$$ End of Bruker specific parameters
$$ ---------------------------------
##NTUPLES= NMR SPECTRUM
##VAR_NAME=  FREQUENCY,     SPECTRUM/REAL,   SPECTRUM/IMAG
##SYMBOL=    X,             R,               I
##VAR_TYPE=  INDEPENDENT,   DEPENDENT,       DEPENDENT
##VAR_FORM=  AFFN,          ASDF,            ASDF
##VAR_DIM=   32768,         32768,           32768
##UNITS=     HZ,            ARBITRARY UNITS, ARBITRARY UNITS
##FACTOR=    0.157963299565203, 1,           1
##FIRST=     4132.6476996994, 0,             0
##LAST=      -1043.33573715361, 0,           0
##MIN=       -1043.33573715361, -204388,     0
##MAX=       4132.6476996994, 521050258,     0
$$ Real data points
##PAGE= N=1
##DATA TABLE= (X++(R..R)), XYDATA
$$ [...]
16514e5191Q561M4160O6761J51j2331j5725m6214L529J8544N565j5349k4487k9338
$$ -55191 -46630 -2470 64291 64442 52111 36386 -9828 -6299 12245 17810 2461 -22026 -51364
16501e1364M258j601Q641j696O51k4816K0445J5809J6120m413j3841K9132j522
$$ -51364 -47106 -48707 -40066 -41762 -41111 -65927 -45482 -29673 -13553 -17966 -31807 -2675 -4197
16488d197j2881j2901k324Q318J7779j9628j4522r450J5140L9978O821k1253J7285
$$ -4197 -17078 -29979 -32303 -23985 -6206 -25834 -40356 -49806 -34666 5312 12133 -9120 8165
16475H165j3481m2404J9303j477j2934k153J3660N650q833M573L2731N908K900
$$ 8165 -5316 -47720 -28417 -29894 -42828 -44981 -31321 -25671 -34504 -29931 2800 8708 11608
16462A1608k9839J2134R169j9490m860O814n835Q93J6699L2234k1824m2547k71
$$ 11608 -18231 -6097 3072 -16418 -21278 -14464 -20299 -19406 -2707 29527 7703 -34844 -35115
16449c5115j963J8018L0774k972m510k6897Q701k18j9734j4965J760M9312N282
$$ -35115 -37078 -19060 11714 8742 4232 -22665 -13964 -14182 -33916 -48881 -47121 2191 7473
16436G473K87j9929J6777j382o681J4392L0816N146j0212k7497O638P782k482
$$ 7473 7760 -12169 4608 3226 -3455 10937 41753 46899 36687 9190 15828 23610 21128
16423B1128l399J1762m041j5890J6087J7213l8107m1323n368M7878L1014k4914
$$ 21128 17729 29491 25450 9560 25647 42860 4753 -36570 -41938 5940 36954 12040
16411A2040j4055L332p830j7226K0422M2466m940l5753l9059K0118L3491J3452
$$ 12040 -2015 1317 -6513 -23739 -3317 39149 34209 -1544 -40603 -20485 13006 26458
16399B6458K130k6615j2105L6014K174k5890m186J8863j9398k1654l392Q491j5844
$$ 26458 28588 1973 -10132 25882 28056 2166 -2020 16843 -2555 -24209 -27601 -19110 -34954
16386c4954j485K2235P652j8954k1664J9408L6771J4480l0202J7778L554O071
$$ -34954 -36439 -14204 -6552 -25506 -47170 -27762 9009 23489 -6713 11065 14619 20690
16374B0690J015L057K2705j6939j2919J1533R076M881k8343l0455J080Q605k5681
$$ 20690 21705 24762 47467 30528 17609 29142 38218 43099 14756 -15699 -14619 -6014 -31695
16361c1695m1757J7485L3027l047K11N7J166K1471J1250j2638k1752J8314m859
$$ -31695 -73452 -55967 -22940 -25987 -25776 -25719 -24553 -3082 8168 -4470 -26222 -7908 -12767
16348a2767P542k6259J4122P804j366j4236j5582j4981J5450M2673j754J5307
$$ -12767 -5225 -31484 -17362 -9558 -10924 -25160 -40742 -55723 -40273 2400 646 15953
16336A5953j9582q921l1017j2032M3122K9201K8798j7594q826q314K3373J1261
$$ 15953 -3629 -12550 -43567 -55599 -12477 16724 45522 27928 19102 10788 34161 45422
16324D5422l6689l0083k3416n421L0835L7222j4656m648k651K0335p817j3044
$$ 45422 8733 -21350 -44766 -50187 -19352 17870 3214 -1434 -4085 16250 8433 -4611
16312d611J3554k3411m6080J0891j1763r056L4592L5635p087j8033J0382J97K0046
$$ -4611 8943 -14468 -60548 -49657 -61420 -70476 -35884 -249 -7336 -25369 -14987 -14790 5256
16299E256k099j0125r789k0467J1589J8157n233J6825j0376j3926J4470J0855
$$ 5256 3157 -6968 -16757 -37224 -25635 -7478 -12711 4114 -6262 -20188 -5718 5137
16287E137p179J6955L0014N49r059k7100k6923l2777K3096L6765m007P120p519
$$ 5137 -2042 14913 44927 45476 36417 9317 -17606 -50383 -27287 9478 5471 12591 5072
16274E072o669m333M36n218j9558P934J4177J310J659J5509L0429j1571l075K472
$$ 5072 -1597 -5930 -5494 -10712 -30270 -22336 -8159 -6849 -5190 10319 40748 29177 26102 28574
16260B8574K402j1392k1631j4494l642L514j6648K867k9794J2147J2087R506J4111
$$ 28574 30976 19584 -2047 -16541 -20183 -16669 -33317 -30450 -60244 -48097 -36010 -26504 -12393
16247a2393J5163k360K6313p990P791K754J3063m792l2118m0027R886L9121Q265
$$ -12393 2770 410 26723 18733 26524 29278 42341 37549 5431 -34596 -24710 14411 22676
16234B2676l5876j2072J6659l87q333K8648K5537k1621m303M625j313O011r368
$$ 22676 -13200 -25272 -8613 -9000 -17333 11315 36852 15231 10928 15553 14240 20251 10883
16221A0883j0851Q588r063j9579L4723L9499m561m5784j6110J580o422o321k581
$$ 10883 32 8620 -443 -20022 14701 54200 49639 3855 -12255 -10675 -17097 -23418 -25999
16208b5999l485K1620O427K295k4975n053J4104R167M615M565J2494K4835J577
$$ -25999 -29484 -7864 -1437 858 -24117 -29170 -15066 -5899 -1284 3281 15775 40610 42187
16195D2187k2158n1814k9457j8629J3597J1390J3953P895P043K235p303J0561
$$ 42187 20029 -31785 -61242 -79871 -66274 -54884 -40931 -33036 -25993 -23758 -31061 -20500
16183b0500J0808r048R784j4666J0981K222J9508M415m331J042K7470k5691m2249
$$ -20500 -9692 -18740 -8956 -23622 -12641 -10419 9089 13504 9173 10215 37685 11994 -30255
16170c0255Q56O352j4303K953J934N683k5172k3722P207L2219M2265Q970j4137
$$ -30255 -29399 -23047 -37350 -34397 -32463 -26780 -51952 -75674 -68467 -36248 6017 14987 850
16157H50k2907j4050j186n510K1166L140j2979Q484j2494j3941N767J7679R784
$$ 850 -22057 -36107 -37293 -42803 -21637 -18497 -31476 -22992 -35486 -49427 -43660 -25981 -16197
16144a6197n880k4427J8479j4651j519J5238J2511J2574K6823K9909K4145R470
$$ -16197 -22077 -46504 -28025 -42676 -44195 -28957 -16446 -3872 22951 52860 77005 86475
16132H6475K891l0936m3085j8413k355J4905n403j6664M141J1989L087j2917r078
$$ 86475 89366 58430 15345 -3068 -5423 9482 4079 -12585 -8444 3545 6632 -6285 -15363
16119a5363j1530k2177r29j3012J1831j0575j2152J7635J5079J809l289M010j0343
$$ -15363 -26893 -49070 -49999 -63011 -51180 -61755 -73907 -56272 -41193 -39384 -42673 -38663 -49006
16106d9006l800J8956Q186p114J6868J9674l750k1297P25J1358K14N087j8648
$$ -49006 -52806 -33850 -25664 -32778 -15910 3764 14 -21283 -20558 -9200 -8986 -3899 -22547
16093b2547k025Q709j3215k472O979N917K4627n440p803j0587K619K3957L914
$$ -22547 -24572 -15863 -29078 -31550 -24571 -18654 5973 533 -7270 -17857 -15238 8719 12633
16080A2633k1997L590O986k426J7027j5514m687J8290k1100K9393M600R338r521
$$ 12633 -9364 -5774 1212 -1214 15813 299 -4388 13902 -7198 22195 26795 36133 26612
16067B6612l8587j8643J1830K5312Q86q961l9492o510K8225k0034r740M4468k305
$$ 26612 -11975 -30618 -18788 6524 7410 -1551 -41043 -47553 -19328 -39362 -49102 -4634 -6939
16054f939n3004l5560P061M2725Q54P083L0580J5257j5490k0892j1819J1857L7962
$$ -6939 -59943 -95503 -88442 -45717 -44863 -37780 -7200 8057 -7433 -28325 -40144 -28287 9675
16041I675j9717k4851l179K0288L5016J5008l0593k503k782j4053j1984K901j224
$$ 9675 -10042 -34893 -38072 -17784 17232 32240 1647 -856 -3638 -17691 -29675 -26774 -27998
16028b7998K5735q661J1848l321l4121k753l73J1631K0409j5056J334K0579J5178
$$ -27998 -2263 -10924 924 -2397 -36518 -39271 -39644 -28013 -7604 -22660 -21326 -747 14431
16015A4431j0518k1765k2413k0047l328K9040J6109l6603J1557N2029J7887j0627
$$ 14431 3913 -17852 -40265 -60312 -63640 -34600 -18491 -55094 -43537 8492 26379 15752
16003A5752j9208m491L963j9515k4885K973K6199k474J3020j476N464j9077r682
$$ 15752 -3456 -7947 -3984 -23499 -48384 -45411 -19212 -21686 -8666 -10142 -4678 -23755 -33437
15990c3437l9904R747L6449r446J6435J6507j2942m195K4479J9161L0265r199
$$ -33437 -73341 -63594 -27145 -36591 -20156 -3649 -16591 -20786 3693 22854 53119 43920
15978D3920j7765j1384j2005p0K9671p928k2796J208M173Q653j515m535l2881
$$ 43920 26155 14771 2766 2696 32367 24439 1643 2851 7024 15677 14162 9627 -23254
15965b3254r641J173J4743J8305K8074j2603k2760k3194J2257J9022J2146J671
$$ -23254 -32895 -31722 -16979 1326 29400 16797 -5963 -29157 -16900 2122 14268 15939
15953A5939R470k92k2003k8542j0176M1936K2580J708l2241j5331J5455M908R360
$$ 15939 25409 25117 3114 -25428 -35604 6332 28912 30620 -1621 -16952 -1497 3411 12771
15940A2771k386j0712j5791L756K2441K822K4281P666j1891k9968r027K2817j1591
$$ 12771 10385 -327 -16118 -12362 10079 12901 37182 44848 32957 2989 -6038 16779 5188
15927E188j9283m831J7082K7014J1318J2069k6518j2392J6357R783O022q71j207
$$ 5188 -14095 -18926 -1844 25170 36488 48557 22039 9647 26004 35787 41809 40938 39731
15914C9731J2584k4888m8631o370M975K2636K48r535l966K1269K5211k8552o575
$$ 39731 52315 27427 -21204 -27574 -22599 37 285 -9250 -13216 8053 33264 4712 -1863
15901a863j708j1256j4029J2599J5486K5439j7728j131K7194k853r296j6725n643
$$ -1863 -3571 -14827 -28856 -16257 -771 24668 6940 5809 33003 30150 20854 4129 -1514
15888a514l03j3989j6440k2697O335J4293O153O613M724K54k758J733J1931r067
$$ -1514 -1817 -15806 -32246 -54943 -48608 -34315 -28162 -21549 -16825 -16571 -19329 -17596 -5665 -14732
15874a4732j5456r244J603J9139o877p00M450m0732l187l257N200K6928Q540J6425
$$ -14732 -30188 -39432 -37829 -18690 -25567 -26267 -21817 -62549 -65736 -68993 -63793 -36865 -28325 -11900
15860a1900J5383J902j5640M078J4541j9540R059q648l9195k5798K3035J7670
$$ -11900 3483 5385 -10255 -6177 8364 -11176 -2117 -10765 -49960 -75758 -52723 -35053
15848c5053K7129k205j3648M948N470j1258l5580j9233Q69K3036N5626p134j0079
$$ -35053 -7924 -10129 -23777 -18829 -13359 -24617 -60197 -79430 -78561 -55525 101 -7033 -17112
15835a7112k6279j9822j0706O129L1566M464j2065J2897M620J3542L5434R876
$$ -17112 -43391 -63213 -73919 -67790 -36224 -31760 -43825 -30928 -26308 -12766 22668 32544
15823C2544j8825k1024J3443q870j9896j1558j6509k5027k7385K7748M5377O879
$$ 32544 13719 -7305 6138 -2732 -22628 -34186 -50695 -75722 -103107 -75359 -29982 -23103
15811b3103j8859J8706K9069k3200m2196K2772m336O469J0915J6934M874J2160
$$ -23103 -41962 -23256 5813 -17387 -59583 -36811 -41147 -34678 -23763 -6829 -1955 10205
15799A0205k8856k3734q32J052l36L6624K7394J3401L4713k3998n6202k3936L2034
$$ 10205 -18651 -42385 -43217 -42165 -42501 -5877 21517 34918 69631 45633 -10569 -34505 -2471
15786b471o628j2984p013J6017j7161k0888J2233L9496L1262k2055j0715J9009
$$ -2471 -9099 -22083 -29096 -13079 -30240 -51128 -38895 601 31863 9808 -907 18102
15774A8102J2952p141j9752P01j5716p824q983j445j3834R706J1363K281j6628
$$ 18102 31054 23913 4161 4862 -10854 -18678 -27661 -29106 -42940 -33234 -21871 -19590 -36218
15761c6218n250j0057J7045l8064l5346J1254N348K5841J5719J2691n018M409
$$ -36218 -41468 -51525 -34480 -72544 -107890 -96636 -91288 -65447 -49728 -37037 -42055 -37646
15749c7646J4775K5155K950M820k7468p487J613p066O052K5510j5618J4744J6627
$$ -37646 -22871 2284 5234 10054 -17414 -24901 -23288 -30354 -24302 1208 -14410 334 16961
15736A6961k8390j8811l1082o680K3199M2698K2420q339L283l2290J5732j2329
$$ 16961 -11429 -30240 -61322 -68002 -44803 -2105 20315 11976 15259 -17031 -1299 -13628
15724a3628J8681Q982P388o204m4827l9992N832K6069j0818k234R140K0273N094
$$ -13628 5053 14035 21423 15219 -29608 -69600 -63768 -37699 -48517 -50751 -41611 -21338 -16244
15711a6244J0538M917q391p11j0247k7213J1340q104K7051L0457J4791K236q145
$$ -16244 -5706 -789 -9180 -9891 -20138 -47351 -36011 -44115 -17064 13393 28184 30420 22275
15698B2275j5276r367m347L426O133K0316J0564p443j1342K2316J389n6822p081
$$ 22275 6999 -2368 -6715 -3289 2844 23160 33724 26281 14939 37255 38644 -18178 -25259
15685b5259j191l2772p12M9805M3165J9579k4599k7506p79l488m151J8110R591
$$ -25259 -26450 -59222 -59934 -10129 33036 52615 28016 510 -269 -3757 -7908 10202 19793
15672A9793q612p460j1111M173J2295J9914m767J654J3374k7523J5678p235q994
$$ 19793 11181 3721 -7390 -3217 9078 28992 24225 25879 39253 11730 27408 20173 11179
15659A1179k0240J4626m176m379l131J3664J5478p863m485l9356k7364K7588J3325
$$ 11179 -9061 5565 1389 -2990 -6121 7543 23021 15158 10673 -28683 -56047 -28459 -15134
15646a5134J0767J4617k5456m0556j3709O7j118J2991L1472K6696O466o221l1459
$$ -15134 -4367 10250 -15206 -55762 -69471 -69404 -70522 -57531 -26059 637 7103 882 -30577
15633c0577j5203J1047r207j6621K8533M0054L246j7309M998k2763l0943J3447
$$ -30577 -45780 -34733 -43940 -60561 -32028 8026 11272 -6037 -1039 -23802 -54745 -41298
15621d1298j899J4402J3407r334L940K0249o014J64K7480j505M200O113P552m1228
$$ -41298 -43197 -28795 -15388 -24722 -20782 -533 -6547 -6383 21097 19592 23792 29905 37457 -3771
15607c771j7637K1410j2255L106k0636j0186K945n656m916L0274J8504L5723j545
$$ -3771 -21408 2 -12253 -9147 -29783 -39969 -37024 -42680 -47596 -17322 1182 36905 35360
15594C5360m7713j1370M574K6278J5442O412j2415L63O908j4320J9705J8916k1373
$$ 35360 -12353 -23723 -19149 7129 22571 28983 16568 16931 23839 9519 29224 48140 26767
15581B6767L199J3484O240p301l7651J6042J8186j2268k376m728j4149J1809O126
$$ 26767 29966 43450 49690 42389 4738 20780 38966 26698 24322 19594 5445 17254 23380
15568B3380J0574n132j2619k4596j6542p919k481R682M478k3156Q132L419q540
$$ 23380 33954 28822 16203 -8393 -24935 -32854 -35335 -25653 -21175 -44331 -36199 -32780 -41320
15555d1320J4241L8947R214j4525j1321j7161j0643L2050P007m400J5695J8561
$$ -41320 -27079 11868 21082 6557 -4764 -21925 -32568 -518 6489 2089 17784 36345
15543C6345n3834k1374J2486P994J853o953K964K2424j6886Q749j3594P198J1244
$$ 36345 -17489 -38863 -26377 -18383 -16530 -23483 -20519 1905 -14981 -6232 -19826 -12628 -1384
15530a384O566J9538k5431j182K6581k858k5283j7728j390J0965L2996M2132J8471
$$ -1384 5182 24720 -711 -1893 24688 21830 -3453 -21181 -22571 -11606 21390 63522 81993
15517H1993r112j5692j2272l2717l7698m7507J393M46M5062L1498j5241j3645
$$ 81993 72881 57189 44917 12200 -25498 -73005 -71612 -71166 -26104 5394 -9847 -23492
15505b3492j726j0469O140O020L0479K8458J0640O254l9352k840k647K0721N472
$$ -23492 -25218 -35687 -29547 -23527 6952 35410 46050 52304 12952 10112 7465 28186 33658
15492C3658l0195r303J907N715q589J501k443j4929N8556J6075m3188k1723m02
$$ 33658 3463 -5840 -3933 1782 -6807 -5306 -7749 -22678 35878 51953 8765 -12958 -13360
15479a3360M959J9387j1986l2144K50K0119J8611M128j7000k8414R308K6496J658
$$ -13360 -8401 10986 -1000 -33144 -32894 -12775 5836 9964 -7036 -35450 -26142 354 2012
15466B012K802k797k9585k5552J7442J0421K6336K2918k1605l4911J1033L3556
$$ 2012 4814 2017 -27568 -53120 -35678 -25257 1079 23997 2392 -32519 -21486 12070
15454A2070n963k4978o503M6879j248j3576o545j3938j2137J5427r087l015k283
$$ 12070 6107 -18871 -25374 21505 20257 6681 136 -13802 -25939 -10512 -19599 -22614 -24897
15441b4897j0167m900M821J8156J7600K1219Q864L437J51l4666J769n358j2057
$$ -24897 -35064 -39964 -35143 -16987 613 21832 30696 34133 34284 -382 1387 -3971 -16028
15428a6028q464R868J0289J5771j3153o347k5451j8857J2377m093j5298L8477
$$ -16028 -24492 -14624 -4335 11436 -1717 -8064 -33515 -52372 -39995 -44088 -59386 -20909
15416b0909L4576K8423m947j1401j8863l8196Q843L0440j2293K2028k939M468
$$ -20909 13667 42090 37143 25742 6879 -31317 -22474 7966 -4327 17701 14762 19230
15404A9230L0073j3838K372R831j8017n860j7250j7972K5391J4855j5067Q064
$$ 19230 49303 35465 37837 47668 29651 23791 6541 -11431 13960 28815 13748 21812
15392B1812J3735J8139l2936l338j3002j747P469J445k6936q948J8327q464j2085
$$ 21812 35547 53686 20750 17412 4410 2663 10132 11577 -15359 -24307 -5980 -14444 -26529
15379b6529j9265L038M9108L0073k21R228k6759m1638j4432k984J0483K2159M469
$$ -26529 -45794 -42756 6352 36425 36204 45432 18673 -22965 -37397 -40381 -29898 -7739 -3270
15366c270J11L1988n965J3199K0282k9719m2955j6629j619J478p932J3241J269
$$ -3270 -3159 28829 22864 36063 56345 26626 -16329 -32958 -34577 -33099 -41031 -27790 -26521
15353b6521l7141j4642J9592L1073L1822N920J015R693o750L30K1027o535j3983
$$ -26521 -63662 -78304 -58712 -27639 4183 10103 11118 20811 14061 14391 35418 28883 14900
15340A4900O166M548K943j9374j0171k2208M8191J7327k4517l4219n40J2506o724
$$ 14900 21066 25614 28557 9183 -988 -23196 24995 42322 17805 -16414 -16954 -4448 -11172
15327a1172J0234K7019k8223m6595Q501K3216L2174k5328j0615J3257k598p296
$$ -11172 -938 26081 -2142 -48737 -40236 -17020 15154 -10174 -20789 -7532 -10130 -17426
15315a7426L106Q573L0502j3345r629J9258j5055l3604J0285l846j8779L666J22
$$ -17426 -14320 -5747 24755 11410 1781 21039 5984 -27620 -17335 -21181 -39960 -36294 -36172
15302c6172L4330M3239O600l6284m582j7948J7631N582l4592m748J9725m384O762
$$ -36172 -1842 41397 47997 11713 7131 -10817 6814 12396 -22196 -26944 -7219 -11603 -4841
15289d841K5519j9888l0693K2998J4321j4570q818J1982J9897N028K2508q085
$$ -4841 20678 790 -29903 -6905 7416 -7154 -15972 -3990 15907 20935 43443 35358
15277C5358j1716N946J9191j7147k4440q346k8083j0568J4449J1485n166L530
$$ 35358 23642 29588 48779 31632 7192 -1154 -29237 -39805 -25356 -13871 -19037 -15507
15265a5507L6168L7305N564k8254k6619K2947Q689k364k3762j4238j3280k3912
$$ -15507 20661 57966 63530 35276 8657 31604 40293 37929 14167 -71 -13351 -37263
15253c7263k7185L0686K8212K3010J5024n241J2931J0978k7392k0282j514q31
$$ -37263 -64448 -33762 -5550 17460 32484 27243 40174 51152 23760 3478 1964 1133
15241A133L1849l4808j7985M382j2201M4420J0885p945K09m743k3359l407k207
$$ 1133 32982 -1826 -19811 -15429 -27630 16790 27675 19730 19939 15196 -8163 -11570 -13777
15228a3777J3777J9136j8740k6523J4653k163l6623j2394K4437L4935k0588l5800
$$ -13777 0 19136 396 -26127 -11474 -13637 -50260 -62654 -38217 -3282 -23870 -59670
15216e9670j7180L1050n646j1310l4585L4021J9261j8751J3659K2279K0954N203
$$ -59670 -76850 -45800 -51446 -62756 -97341 -63320 -44059 -62810 -49151 -26872 -5918 -715
15204g15k1650j9902P172M801j0870J547K9288n722K0567l509j4053l649k3785
$$ -715 -22365 -42267 -35095 -30294 -41164 -39617 -10329 -16051 4516 1007 -13046 -16695 -40480
15191d0480M4732K0660J1417j6565l6696m444K6169L0546Q691k0898k5030P616
$$ -40480 4252 24912 36329 19764 -16932 -21376 4793 35339 44030 23132 -1898 5718
15179E718r115k252j8714j5898L2Q760j4476K907k788N451J2504k0785J2352K2621
$$ 5718 -3397 -5649 -24363 -40261 -40229 -31469 -45945 -43038 -45826 -40375 -27871 -48656 -36304 -13683
15165a3683J0886K957J1316J4681M1583j7652m9288l6654M666L3994j3025L266
$$ -13683 -2797 160 11476 26157 67740 50088 800 -35854 -31188 2806 -10219 -6953
15153f953K4414j844o0708J677J6719K7070J50l81q084j0915J8328J9705M801
$$ -6953 17461 15617 -45091 -43414 -26695 375 525 144 -7940 -18855 -527 19178 23979
15140B3979n435l3907j5744K0550J1941r149j2485j3891J934J5524K9341M771
$$ 23979 18544 -15363 -31107 -10557 1384 -7765 -20250 -34141 -32207 -16683 12658 17429
15128A7429o160j0981j1042k940J8428J7525R099m066P208M741j8354k0398k0783
$$ 17429 11269 288 -10754 -13694 4734 22259 31358 27292 34500 39241 20887 489 -20294
15115b0294J5241K3737j0596k7376K645M716m008r271R76K4985j9649k3677L367
$$ -20294 -5053 18684 8088 -19288 -16643 -11927 -15935 -25206 -24230 755 -18894 -42571 -39204
15102c9204J2919O851m300j2025M2951L280K433n2601L682J895K3890J0999r852
$$ -39204 -26285 -19434 -23734 -35759 7192 10472 12905 -39696 -36014 -34119 -10229 770 -9082
15089i082R147l878K3608o04j8804l6378O042j1702j8515J0345Q657Q683J8537
$$ -9082 65 -3813 19795 19191 387 -35991 -29949 -41651 -60166 -49821 -41164 -32481 -13944
15076a3944j200k622K0612o130q20K2370k5907k417J4420j070n647o685q490J3163
$$ -13944 -15144 -17766 2846 -3284 -4104 18266 -7641 -10058 4362 3292 -2355 -9040 -17530 -4367
15062d367J9175k3377r566J9671K4980J0778L275j5751k4650L693j3369m06k357
$$ -4367 14808 -8569 -18135 1536 26516 37294 40569 24818 168 3861 -9508 -9914 -12271
15049a2271P039R891j4811M634j1883K0485j241k2164J5361n79Q521j4762k331
$$ -12271 -5232 4659 -10152 -5518 -17401 3084 1843 -20321 -4960 -5539 2982 -11780 -14111
15036a4111j5086n633K8639J2007j2548k4204m573R446j4231K118K4046J6178
$$ -14111 -29197 -34830 -6191 5816 -6732 -30936 -35509 -26063 -40294 -38176 -14130 2048
15024B048J1882j0833L743J2226p018j8175J7735J5339q732K4721n4445l2245
$$ 2048 13930 3097 6840 19066 12048 -6127 11608 26947 18215 42936 -11509 -43754
15012d3754K0534K4266M047l873j3760j7284L194K9665J6126k7324j3366l44O825
$$ -43754 -23220 1046 5093 1220 -12540 -29824 -26630 3035 19161 -8163 -21529 -21873 -15048
14999a5048k1827l1828N954J8918r480J077L5723K535K522L5244L8086p261j7225
$$ -15048 -36875 -68703 -62749 -43831 -53311 -52234 -16511 -13976 -11454 23790 61876 54615 37390
14986C7390k0341j2483J2703j6898k4443L468K9842P657K0260j1156j4772j6735
$$ 37390 17049 4566 17269 371 -24072 -20604 9238 16895 37155 25999 11227 -5508
14974e508j8214o038j1169J7492M2789K8536j4026r798n969J5542J5915k1068
$$ -5508 -23722 -29760 -40929 -23437 19352 47888 33862 24064 18095 33637 49552 28484
14962B8484r363j8332l580P037j7795p433l933j2323L8634l76R067L8964j8934
$$ 28484 19121 789 -2791 4246 -13549 -20982 -24915 -37238 1396 1020 10087 49051 30117
14949C0117l6601K811Q437Q818j7395j8109K2287J9479j65l8163q197n543J9116
$$ 30117 -6484 -3673 4764 13582 -3813 -21922 365 19844 19679 -18484 -26681 -32224 -13108
14936a3108J5513o026J6257O88n386k1821j3765m468J6755K3315M671m056j0029
$$ -13108 2405 -3621 12636 13324 7938 -13883 -27648 -32116 -15361 7954 12625 8569 -1460
14923a460j48l3750m239K7477q36l913q139K5306N80Q972m239J4322l190k865
$$ -1460 -1608 -35358 -39597 -12120 -12956 -16869 -25008 298 878 9850 5611 19933 16743 13878
14909A3878k0005j5572n280J1258m635j9782K4960J0512j1115l9219k6058L6589
$$ 13878 -6127 -21699 -26979 -15721 -20356 -40138 -15178 -4666 -15781 -55000 -81058 -44469
14897d4469o690P102J5432J1210K1998q145L625J4218j5904k8142j4798N3830
$$ -44469 -51159 -44057 -28625 -17415 4583 -3562 63 14281 -1623 -29765 -44563 9267
14885I267M2109k248j3621r739j8768m1788J902J3908J3861k2371j1595L8237
$$ 9267 51376 49128 35507 25768 7000 -34788 -32886 -18978 -5117 -27488 -39083 -846
14873h46p017R678K4250k4147o315k2504M172J0630l578J5623K1104k672N400
$$ -846 -7863 1815 26065 1918 -4397 -26901 -22729 -12099 -15677 -54 21050 18378 23778
14860B3778j0977j8822j8621J2899j7205k3096k7029K3185K364L263L80J0964
$$ 23778 12801 -6021 -24642 -11743 -28948 -52044 -79073 -55888 -53524 -50261 -49881 -38917
14848c8917J7245J5838J4087M105o477k1109Q605J1358K6345N204k2723o184k30
$$ -38917 -21672 -5834 8253 12358 5881 -15228 -6623 4735 31080 36284 13561 7377 7147
14835G147j7771q819l651O985J9629k19m833O04R072J7258K053q238P738L44O36
$$ 7147 -10624 -19443 -23094 -16109 3520 3301 -1532 -928 8144 25402 27455 19217 26955 27299 27935
14820B7935p147N309Q198J1290J593r192j7431J670l2316K070m610J2464m605
$$ 27935 20788 26097 34295 45585 47178 37986 20555 22225 -10091 -8021 -12631 -167 -4772
14807d772J4929m35j4982n426m617l0878J1404K2560N411L4027l5632l1333j4604
$$ -4772 10157 9722 -5260 -10686 -15303 -46181 -34777 -12217 -6806 27221 -8411 -39744 -54348
14794e4348j4842R815L4889P34j1840R115J9910j1669K7523O835O40j9969j826
$$ -54348 -69190 -59375 -24486 -23752 -35592 -26477 -6567 -18236 9287 16122 16762 -3207 -5033
14781e033j0313j5768R944K2201Q842k6404K1799L8162J0786j1414j8305J3N458
$$ -5033 -15346 -31114 -21170 1031 9873 -16531 5268 43430 54216 42802 24497 24510 29968
14768B9968O364L328l7453k0193R454l575O630J2083N468j2216q301J2527N122
$$ 29968 36332 39660 2207 -17986 -8532 -12107 -5477 6606 12074 -142 -8443 4084 9206
14755I206k3022j01J0136j613k8051j8394K6357K3650M509j9019L577J414k9936
$$ 9206 -13816 -13917 -3781 -5394 -33445 -51839 -25482 -1832 2677 -16342 -12765 -11351 -41287
14742d1287j469K0647M1393J3089J1552k7125j9062l955j5380j0738k653j3168
$$ -41287 -42756 -22109 19284 32373 43925 16800 -2262 -6217 -21597 -32335 -34988 -48156
14730d8156J5310L2221K902n668M308k029j4739l137J4806L142Q155L503m636
$$ -48156 -32846 -625 2277 -3391 917 -1112 -15851 -18988 -4182 -1040 7115 10618 5982
14717E982K3663J6955k57J3017q587n4777m1005K0461N815L389j1673J6166k0013
$$ 5982 29645 46600 46343 59360 50773 -4004 -45009 -24548 -18733 -15344 -27017 -10851 -30864
14704c0864m508R707j1646J0978K5252J4179o132j710J4392q849J1084j7647j2181
$$ -30864 -35372 -25665 -37311 -26333 -1081 13098 6966 5256 19648 10799 21883 4236 -7945
14691g945J5193K3158K4009m118m5477m4515K7023K7975K4289J5672k853k946
$$ -7945 7248 30406 54415 50297 4820 -39695 -12672 15303 39592 55264 52411 49465
14679D9465J943J4809k6503q979k4240K590K1097j3770k08k0619j3899P821k8700
$$ 49465 51408 66217 39714 30735 6495 9085 30182 16412 16204 -4415 -18314 -10493 -39193
14666c9193L199n598J8058L5866J7749J216j7950n189m764J6197j1732j5232k2151
$$ -39193 -35994 -41592 -23534 12332 30081 31297 13347 8158 3394 19591 7859 -7373 -29524
14653b9524N759L0308L0239r283l8551j3835Q902K5724n813P914j5759r732L453
$$ -29524 -23765 6543 36782 27499 -11052 -24887 -15985 9739 3926 11840 -3919 -13651 -10198
14640a0198o563L839j3820j5951M106K7396J4458P33k375J1446J9390m854j9397
$$ -10198 -16761 -12922 -26742 -42693 -38587 -11191 3267 4000 1625 13071 32461 27607 8210
14627H210K62j4041l2475k6706J8324J7054p587K799N0901J2841J8282Q035l0453
$$ 8210 8472 -5569 -38044 -64750 -46426 -29372 -36959 -34160 16741 29582 47864 55899 25446
14614B5446l5183k6866J9859K199p554J216o881L2583J5273J7887j2603m3881
$$ 25446 -9737 -36603 -16744 -14545 -22099 -20883 -27764 4819 20092 37979 25376 -18505
14602a8505q897j1124Q256j0807O389L7044q243J8N785L177K57k304J3322k4412
$$ -18505 -27402 -38526 -30270 -41077 -34688 2356 -5887 -5869 -84 3093 3350 1046 14368 -10044
14588a0044m060O198j1168k1862K947K4236M840j205L0613K1430k0443j5893r060
$$ -10044 -14104 -7906 -19074 -40936 -37989 -13753 -8913 -10118 20495 41925 21482 5589 -3471
14575c471N290K434j8980O726L414J7591J8695J6748j4194k5794J873P550j4031
$$ -3471 1819 4253 -14727 -8001 -4587 13004 31699 48447 34253 8459 10332 17882 3851
14562C851K8323J3248j6841k6740j9635J2305N395k5013K907J5093p91j7357j2914
$$ 3851 32174 45422 28581 1841 -17794 -5489 -94 -25107 -22200 -7107 -7898 -25255 -38169
14549c8169p368K8658L4612k299K639l319j5243q311l749j6946J6877J6278J596
$$ -38169 -45537 -16879 17733 15434 18073 14754 -489 -8800 -12549 -29495 -12618 3660 5256
14536E256j2507j600j0738R754L0303l1241k7302m402L2669J1485j4900m943J8582
$$ 5256 -7251 -8851 -19589 -9835 20468 -10773 -38075 -42477 -9808 1677 -13223 -18166 416
14523D16L4429p103k8680q400L2064M3818j1953j8226p328k7186m3781L785J4248
$$ 416 34845 27742 -938 -9338 22726 66544 54591 36365 29037 1851 -41930 -38145 -23897
14510b3897O63l121o620J840L165J0504K9128J6819J3971l1246p932j734j3238
$$ -23897 -23234 -26355 -32975 -31135 -27970 -17466 11662 28481 42452 11206 3274 1540 -11698
14497a1698k7136r692N757J5201O768J017K86N927L3250N080l1593L2497K1948
$$ -11698 -38834 -48526 -42769 -27568 -20800 -19783 -19497 -13570 19680 24760 -6833 25664 47612
14484D7612k589m324k1579j4790O03j0466k3808J2042k957k6232p806J3032m981
$$ 47612 45023 40699 19120 4330 4933 -5533 -29341 -17299 -20256 -46488 -54294 -41262 -46243
14471d6243M784Q36P145R341j5753L945J4715N0118J2084j921k1574j2496O360
$$ -46243 -41459 -40623 -33478 -24137 -39890 -35945 -21230 28888 40972 39051 17477 4981 11341
14458A1341J5050O46Q582o995k2180l5414K989j2358j0459L4429Q730k7157j6902
$$ 11341 26391 27037 35619 28624 6444 -28970 -25981 -38339 -48798 -14369 -5639 -32796 -49698
14445d9698K0865N313Q572k3419M88J6935k5386J5945Q674J8890n92j6171k3242
$$ -49698 -28833 -23520 -14948 -38367 -37879 -20944 -46330 -30385 -21711 -2821 -3413 -19584 -42826
14432d2826j9131j2408Q214M0846J9740q782R230M4087J8917k119m7801k9648
$$ -42826 -61957 -74365 -66151 -25305 -5565 -14347 -5117 38970 57887 55768 7967 -21681
14420b1681J4960J1412K6499J3532L954o936n492l4632j794k5866L852p143j1373
$$ -21681 -6721 4691 31190 44722 48676 41740 36248 1616 -178 -26044 -22192 -29335 -40708
14407d0708k7117K7803M0168J8442k2235k2520o832K931N225l757k1332k287M4718
$$ -40708 -67825 -40022 146 18588 -3647 -26167 -32999 -30068 -24843 -28600 -49932 -52219 -7501
14394g501K8458k844k1878K7146K7863J906j0471k9869L405l193k2231J0029J7478
$$ -7501 20957 18113 -3765 23381 51244 53150 42679 12810 16215 13022 -9209 820 18298
14381A8298j1723j9656j2900J3231J6774N56N269J3382j3596r892k6331q263M166
$$ 18298 6575 -13081 -25981 -12750 4024 4580 9849 23231 9635 -257 -26588 -34851 -30685
14368c0685J2547L0264j068k7443q137J9131r051r884K4020J3870j3688Q134K9324
$$ -30685 -18138 12126 11058 -16385 -24522 -5391 -14442 -24326 -306 13564 -124 8010 37334
14355C7334n738k0973J5192K0628M128l6180n0107l470K5784J0692r921q287J2875
$$ 37334 31596 10623 25815 46443 50571 14391 -35716 -39186 -13402 -2710 -12631 -20918 -8043
14342h043K6597m2772j7285L1522J7303L30J7035J1003Q962k2918m2060j2671
$$ -8043 18554 -24218 -41503 -9981 7322 7652 24687 35690 44652 21734 -20326 -32997
14330c2997J6465J0671K8567K9570P36j6264m9064j8200J2075J1587J3335n479
$$ -32997 -16532 -5861 22706 52276 53012 36748 -12316 -30516 -18441 -6854 6481 1002
14318A002k4151J9526J1184M344k0135l0062K7835P225j1176j1252J234m904N439
$$ 1002 -23149 -3623 7561 11905 -8230 -38292 -10457 -3232 -14408 -25660 -24426 -29330 -23891
14305b3891q612M661Q887J1015J0959j1015k1862J8903k8805j0501K9953L5582
$$ -23891 -32503 -27842 -18955 -7940 3019 -7996 -29858 -10955 -39760 -50261 -20308 15274
14293A5274m981j6181p287L7955k4600n7873J5463R04O777j658l188P696J732
$$ 15274 10293 -5888 -13175 24780 180 -57693 -42230 -41326 -34549 -36207 -39395 -31699 -29967
14280b9967P038N126j1188j253M777j1477o999O784P473K4500O836q740J4959
$$ -29967 -22929 -17803 -28991 -30244 -25467 -36944 -43943 -37159 -29686 -5186 1650 -7090 7869
14267G869r561k0055J2906L3346p505l8857l089R951J1338K4524J5877r33j1502
$$ 7869 -1692 -21747 -8841 24505 17000 -21857 -24946 -14995 -3657 20867 36744 35811 24309
14254B4309l8292l9428O669L3517J174m764J0570p685J080j2971r854P648q287
$$ 24309 -13983 -53411 -46742 -13225 -12051 -16815 -6245 -13930 -12850 -25821 -35675 -28027 -36314
14241c6314L0831K8307m582M588O085j9136l300J3646J3494k1491j0391J5659
$$ -36314 -5483 22824 18242 22830 28915 9779 6479 20125 33619 12128 1737 17396
14229A7396l033j5609n190j3614k4079K0791j0278K8205J5046J4133J9830j8273
$$ 17396 14363 -1246 -6436 -20050 -44129 -23338 -33616 -5411 9635 23768 43598 25325
14217B5325q561J9637j5480k7120K3684O066N700n820k0461l3092J7278j741o810
$$ 25325 16764 36401 20921 -6199 17485 23551 29251 23431 2970 -30122 -12844 -14585 -21395
14204b1395M105n76J5094k936l5025l8185J6993M3163L4967k233j4917J937Q376
$$ -21395 -17290 -17866 -2772 -5708 -40733 -78918 -61925 -18762 16205 13972 -945 992 9368
14191I368j7674m0378q486k0662J1501L7574j193J1535K630m401j3378R145J2208
$$ 9368 -8306 -48684 -57170 -77832 -66331 -28757 -29950 -18415 -15785 -20186 -33564 -24419 -12211
14178a2211k8188K0354K7758J5252R163Q062k4517J4739k9781j2086J4693J8305
$$ -12211 -40399 -20045 7713 22965 32128 40190 15673 30412 631 -11455 3238 21543
14166B1543l0417M472L3959Qm637m501k9094k5031L0224J5127j3574j1253j6513
$$ 21543 -8874 -4402 29557 29565 24928 20427 -8667 -33698 -3474 11653 -1921 -13174 -29687
14153b9687j2542K3021K0127p730R0r203j3483J1161J2154K5635P567J038k0917
$$ -29687 -42229 -19208 919 -6811 -6721 -15924 -29407 -18246 -6092 19543 27110 28148 7231
14140G231r068P507o322K2943K8761J1903l4313j1647N628J3334L908q211l7061
$$ 7231 -1837 5670 -652 22291 51052 62955 28642 16995 22623 35957 39865 31654 -5407
14127e407j9249N038Q509J8043j6322N556j2279m504K6978J0740J4586J2470j4095
$$ -5407 -24656 -19618 -11109 6934 -9388 -3832 -16111 -20615 6363 17103 31689 44159 30064
14114C0064k9674j654j2921R23P043j116j6983j288J4313j0599O674K9622M1094
$$ 30064 390 -1264 -14185 -13262 -6219 -7335 -24318 -25606 -11293 -21892 -15218 14404 55498
14101E5498j2168o245M250j9132p449j4706L574J4880q878k4858j8065J2961J0451
$$ 55498 43330 37085 41335 22203 14754 48 3622 18502 9624 -15234 -33299 -20338 -9887
14088i887K2231l359k2966N01J8781L5551k1904K517k16J95k2914K8184J7106
$$ -9887 12344 8985 -13981 -13480 5301 40852 18948 21465 21249 21444 -1470 26714 43820
14075D3820o464j158k3782j1435K7634j6296J2035m638l2146n347l156J4565J2799
$$ 43820 37356 36198 12416 981 28615 12319 24354 19716 -12430 -17777 -20933 -6368 6431
14062F431n027j0771N0030k159k2185L087N23j2689j9042j0411J1499L3136K0071
$$ 6431 1404 -9367 40663 38504 16319 19406 19929 7240 -11802 -22213 -10714 22422 42493
14049D2493o751j3027N041M561k6107J6345j213k7186m5015k485J6697K2862K63
$$ 42493 35742 22715 27756 32317 6210 22555 21342 -5844 -50859 -53344 -36647 -13785 -13522
14036a3522j9610N584r50J1561J227M510N859j5344O730J7910L29J2703r373k7366
$$ -13522 -33132 -27548 -28498 -16937 -15710 -11200 -5341 -20685 -13955 3955 4284 16987 7614 -19752
14022a9752k8030j9176j7845J6449M7706j5277j2934j1010J1957J9250J3503j8444
$$ -19752 -47782 -66958 -84803 -68354 -20648 -35925 -48859 -59869 -47912 -28662 -15159 -33603
14010c3603p216J1269J1053J2736j0076n977j171k4j341m713l3276Q920N6602
$$ -33603 -40819 -29550 -18497 -5761 -15837 -21814 -22985 -23009 -24350 -29063 -62339 -53419 3183
13997C183K1417k0683J4076J5413k597J2014J8190k1082j6245j617j5919k9457
$$ 3183 24600 3917 17993 33406 30809 42823 61013 39931 23686 22069 6150 -23307
13985b3307P447J6619P009L8941J3526j2371n3133k0036N155O314j7425q845j724
$$ -23307 -15860 759 7768 46709 60235 47864 -5269 -25305 -20150 -13836 -31261 -40106 -41830
13972d1830J1077L0878O914M019J1135k101M939L1k7782L0108J7916k4659j2594
$$ -41830 -30753 125 7039 11058 22193 20092 25031 25062 -2720 27388 45304 20645 8051
13959H051k5439J1198R006r40j5014j3922M507J1071j2775J5951k5556Q617q831
$$ 8051 -17388 -6190 2816 1876 -13138 -27060 -22553 -11482 -24257 -8306 -33862 -25245 -34076
13946c4076K2435J4820P224j9459O266L554l2467n797Q245K2770j704O722o198
$$ -34076 -11641 3179 10403 -9056 -2790 764 -31703 -37500 -29255 -6485 -8189 -1467 -7665
13933g665l4873j5910k60M2746O656K543m455j7201K4564J4526Q384J2352j0084
$$ -7665 -42538 -58448 -58708 -15962 -9306 -6763 -11218 -28419 -3855 10671 19055 31407 21323
13920B1323m805Q441j5143K1235j2422l2359J47J2489J7688J0535r734q667r882
$$ 21323 16518 24959 9816 31051 18629 -13730 -13583 -1094 16594 27129 17395 8728 -1154
13907a154l8832l871J2520P369J3675J6034m636N411K681l0589k2001N091j848
$$ -1154 -39986 -43857 -31337 -23968 -10293 5741 1105 6516 9197 -21392 -43393 -38302 -40150
13894d0150k6618j6258n52K2908N6514K2843k5308n328j4534L757j3091J4376
$$ -40150 -66768 -83026 -83578 -60670 -4156 18687 -6621 -11949 -26483 -22726 -35817 -21441
13882b1441M2824K2369P470j8630k2256K0919J5933l7326n552P53l3356J114k667
$$ -21441 21383 43752 51222 32592 10336 31255 47188 9862 4310 5063 -28293 -27179 -29846
13869b9846J4503j4266M258L0547K523J8179j2095N442j7993o190J9015j1364
$$ -29846 -15343 -29609 -25351 5196 7719 25898 13803 19245 1252 -4938 14077 2713
13857B713M367r350K0320q148N164j3093j0106L1348k8283p259p249l6854J7036
$$ 2713 7080 -2270 18050 9902 15066 1973 -8133 23215 -5068 -12327 -19576 -56430 -39394
13844c9394K9206k258j2316J738N506J5661R183M469l504q718r194M484L6004
$$ -39394 -10188 -12446 -24762 -23024 -17518 -1857 7326 11795 8291 -427 -9621 -5137 30867
13831C0867l736k2724P264J6128q37k3797j7590J6024K6312K71p035L915L5770
$$ 30867 27131 4407 11671 27799 26962 3165 -14425 1599 27911 28182 21147 25062 60832
13818F0832K363j4281k7105k3870k466O895J2403N875L8783L69n865l8024j251
$$ 60832 63195 48914 21809 -2061 -4527 2368 14771 20646 59429 59798 53933 15909 14658
13805A4658k0845k8199J4926J7023J2530O492R531k7419O558Q509l175J6301l3847
$$ 14658 -6187 -34386 -19460 -2437 10093 16585 26116 -1303 5255 13764 10589 26890 -6957
13792f957j4964M242k1547J3040R259K4479M256N033J7949m575l3683j5190r268
$$ -6957 -21921 -17679 -39226 -26186 -16927 7552 11808 16841 34790 30215 -3468 -18658 -27926
13779b7926n959j3864P368K1364L3630Q743l1674l8568J2138K8332j4815Q259
$$ -27926 -33885 -47749 -40381 -19017 14613 23356 -8318 -46886 -34748 -6416 -21231 -12972
13767a2972M109R843j9318J6831r255O869K2913O234j2689n365j7525J6130J450
$$ -12972 -8863 980 -18338 -1507 -10762 -3893 19020 25254 12565 7200 -10325 5805 7255
13754G255O891j773n088J72M585n045m2322j8114K2192l223k1236j0945N489K2215
$$ 7255 14146 12373 7285 7457 12042 6997 -35325 -53439 -31247 -34470 -55706 -66651 -61162 -38947
13740c8947M1475L5053p339j7595j4479j0106j1875L2542M914l5856M490K725
$$ -38947 2528 37581 30242 12647 -1832 -11938 -23813 8729 13643 -22213 -17723 -14998
13728a4998J8617J0180l50J6664q377j7038k1984p314J2140J3146J6215k7347
$$ -14998 3619 13799 13449 30113 21736 4698 -17286 -24600 -12460 686 16901 -10446
13716a0446J0588J6434J2954j2547l9739K592K2685Q836j1717K167J7802J2938
$$ -10446 142 16576 29530 16983 -22756 -20164 2521 11357 -360 1807 19609 32547
13704C2547j1149J0183k4212k3818M933l3056j1318L6481J7841r854j9682j9129
$$ 32547 21398 31581 7369 -16449 -11516 -44572 -55890 -19409 -1568 -11422 -31104 -50233
13692e0233L52K9390M1462P784R34J3235L675l503j1996K0559K8851j1229k3934
$$ -50233 -49881 -20491 20971 28755 29689 42924 46599 43096 31100 51659 80510 69281 45347
13679D5347k7651L131J5794r909q358Q105J8358k7751j8629K908r36J8928M2172
$$ 45347 17696 20827 36621 26712 18354 26459 44817 17066 -1563 1345 409 19337 61509
13666F1509N372k6390m7730j1815N9708j3164l732p220J6614P462J0965k7972
$$ 61509 66881 40491 -7239 -19054 40654 27490 23758 16538 33152 40614 51579 23607
13654B3607l3084j2825p98K0375L730N381J0658K2812J4522R747j6744k5565j9623
$$ 23607 -9477 -22302 -23100 -2725 1005 6386 17044 39856 54378 64125 47381 21816 2193
13641B193j6945J1489J4615K2466J543l3686m149J0533j3440l0346n388K7117
$$ 2193 -14752 -3263 11352 33818 35361 1675 -2474 8059 -5381 -35727 -41115 -13998
13629a3998o039j6609j7927J6514K4581K8215N172j2993K323K353j0541J4083
$$ -13998 -20037 -36646 -54573 -38059 -13478 14737 19909 6916 9239 11592 1051 15134
13617A5134N511J8518Q388L234k4605J3417J1126J5620k3773j2463k3663q773
$$ 15134 20645 39163 47551 50785 26180 39597 50723 66343 42570 30107 6444 -2329
13605b329K427j0922k4389j2725o243K3624J3270q856J5046j5724j9295j4417
$$ -2329 98 -10824 -35213 -47938 -54181 -30557 -17287 -26143 -11097 -26821 -46116 -60533
13593f0533o12J9924J0792Q827K0021O676L977R47l858K412Q360j3090J404J5852
$$ -60533 -61145 -41221 -30429 -21602 -1581 5095 9072 10019 6161 8573 16933 3843 5247 21099
13579B1099K235l504J3013L511k9870N370K3000j2245k1296J9424K4353p260m4072
$$ 21099 23334 19830 32843 36354 6484 11854 34854 22609 1313 20737 45090 37830 -6242
13566f242o774l957M582n630J1810Q396n285l5648k4960K1308K096j4600K2879
$$ -6242 -13016 -16973 -12391 -18021 -6211 2185 -3100 -38748 -63708 -42400 -40304 -54904 -32025
13553c2025O136K7446j5655M336Q805p482J5257M2357l9335j5187K9291j0246
$$ -32025 -25889 1557 -14098 -9762 -957 -8439 6818 49175 9840 -5347 23944 13698
13541A3698J2091J3179j7255L1104K9843l7141l2290P195K004n622j7934j6385
$$ 13698 25789 38968 21713 52817 82660 45519 13229 20424 22428 16806 -1128 -17513
13529a7513L5440J698n600M151k1449j6203K1433L958K8862l146k7007Q997P631
$$ -17513 17927 19625 14025 18176 -3273 -19476 1957 5915 34777 31631 4624 13621 21252
13516B1252P484O559m1419R573J8762o665J9924L740j1388j4610p911L619P837
$$ 21252 28736 35295 -6124 3449 22211 15546 35470 39210 27822 13212 5301 8920 16757
13503A6757o566K527j4153j5500q769l6097j0891M6610K2166J6839j2480N068
$$ 16757 10191 12718 -1435 -16935 -25704 -61801 -72692 -26082 -3916 12923 443 5511
13491E511J2022J5352R335j6000k7981N005K1784K0297k0794Q682M261Q082K2801
$$ 5511 17533 32885 42220 26220 -1761 3244 25028 45325 24531 33213 37474 45556 68357
13478F8357j8289o631K766O815k0017k0794M69n336p156k7407J821K8012K3291
$$ 68357 50068 43437 46203 53018 33001 12207 12676 7340 184 -27223 -25402 2610 25901
13465B5901J7375l4523l5546K3172l151J3489j0633J417J4581J6718J4851l5336
$$ 25901 43276 8753 -26793 -3621 -6772 6717 -3916 -2499 12082 28800 43651 8315
13453H315J841n421O945L1339o388j4940L31K46m337j555q566l165o523J1524
$$ 8315 10156 4735 11680 43019 36631 21691 22022 22268 17931 16376 7810 4645 -1878 9646
13439I646n635N99q125l0188O331J6234K5651j963k1900l783j1116K3308O0785
$$ 9646 4011 4610 -3515 -33703 -27372 -11138 14513 12550 -9350 -13133 -24249 -941 59844
13426E9844j5291l1452j613K6134J3284N360O99p219l4247k5798K2095M5909n437
$$ 59844 44553 13101 11488 37622 50906 56266 56965 49746 15499 -10299 11796 57705 52268
13413E2268k3807L2265k9639N094K0106R746m1906j4685L2950k030l9809j1356
$$ 52268 28461 60726 31087 36181 56287 66033 24127 9442 42392 40362 553 -10803
13401a0803K1720K0442k7838K45l950j2220l319k981m054J7123M458l788k4938
$$ -10803 10917 31359 3521 3766 -184 -12404 -15723 -18704 -22758 -5635 -1177 -4965 -29903
13388b9903j776J5329K9699K7836j6168l546q699j8541J1715J1993j5404k0322
$$ -29903 -31679 -16350 13349 41185 25017 21471 12772 -5769 5946 17939 2535 -17787
13376a7787J0261J139P600r66m162Q270J2063L371l98j9454l2631M257J8062K94
$$ -17787 -7526 -6387 1213 247 -3915 4355 16418 19789 19391 -63 -32694 -28437 -10375 -10081
13362a0081j8101l3120q797K7233N5425J1202j5669Q242K4571J8539K9589k7096
$$ -10081 -28182 -61302 -70099 -42866 12559 23761 8092 16334 40905 59444 89033 61937
13350F1937k6201l617k9734M108J4880N385k413K427K9192q592j8898r206j8264
$$ 61937 35736 32119 2385 6493 21373 26758 24345 26772 55964 47372 28474 19268 1004
13337A004J515J6461J3975k9897j9240J0247n240l7993L7516K5119j4397l8039
$$ 1004 2519 18980 32955 3058 -16182 -5935 -11175 -49168 -11652 13467 -930 -38969
13325c8969m955K1160J5188K967M2148N248k1303k2448J543j5712P759J8254q877
$$ -38969 -43924 -22764 -7576 -4609 37539 42787 21484 -964 579 -15133 -7374 10880 2003
13312B003j3175l395N019J6919m526q999M934k285k470j0732j8185k625r604J9478
$$ 2003 -11172 -14567 -9548 7371 2845 -6154 -1220 -3505 -5975 -16707 -34892 -37517 -47121 -27643
13298b7643L6075J7455O252k0073j4058j1274k1995J5444K1929K4354J3369j7662
$$ -27643 8432 25887 32139 12066 -1992 -13266 -35261 -19817 2112 26466 39835 22173
13286B2173k9595j9084m161J7800K0114l65j4353P953J5525J4106K706j4725l220
$$ 22173 -7422 -26506 -30667 -12867 7247 6882 -7471 482 16007 30113 32819 18094 14874
13273A4874P178J760k0070k1887j5035K480o143k2639K6485l427j7433L2844K8079
$$ 14874 22052 23812 3742 -18145 -33180 -30700 -36843 -59482 -32997 -36424 -53857 -21013 7066
13260G066l030K3672J465J2245l814k1982j5313l716J4373o495k4939j9675J4432
$$ 7066 4036 27708 29173 41418 37604 15622 309 -3407 10966 4471 -20468 -40143 -25711
13247b5711k8031J7786K6641q396j1168J6890K1290k8263k7006j4459M0298L4414
$$ -25711 -53742 -35956 -9315 -17711 -28879 -11989 9301 -18962 -45968 -60427 -20129 14285
13235A4285j9071J6802K2776J0776j8452j5895J3912J5352J9548J3117r734O70
$$ 14285 -4786 12016 34792 45568 27116 11221 25133 40485 60033 73150 63416 64086
13223F4086j4528r622P901J5668p826J696J540j9059p80l0730J9333L0608j9853
$$ 64086 49558 39936 47837 63505 55679 57375 58915 39856 39076 8346 27679 58287 38434
13210C8434k7350k1488J4526L1563j0556J556p208k8515M084K5523K5148K630
$$ 38434 11084 -10404 4122 35685 25129 26685 19477 -9038 -4954 20569 45717 48347
13198D8347q141p690n729m1366n849R683k772O561o201O15j521J4367J3521J6225
$$ 48347 40206 32516 26787 -14579 -20428 -10745 -13517 -6956 -13157 -12542 -14063 304 13825 30050
13184C0050j3982k9802J6068K3060n565L144m107j8887j0801j4793L1437Q256
$$ 30050 16068 -13734 2334 25394 19829 22973 18866 -21 -10822 -25615 5822 14078
13172A4078R583K0328j5033o038l5779J1169J6385R548L053K6108l2494o506K65
$$ 14078 23661 43989 28956 22918 -12861 -1692 14693 24241 27294 53402 20908 14402 14667
13159A4667J2783q28p849j5845k0557J4144n988M51K7972j531j2668J6649L134
$$ 14667 27450 26622 18773 2928 -17629 -3485 -9473 -9022 18950 17419 4751 21400 24534
13146B4534K4689J3261L309m79j3446k7304O470J2698K9258l2425q791k151k7579
$$ 24534 49223 62484 65793 65314 51868 24564 31034 43732 72990 40565 31774 29623 2044
13133B044J8718J1195j7412r682m443M816n398p458k656J0668J2438l155j0553
$$ 2044 20762 31957 14545 4863 420 5236 -162 -7620 -10276 392 12830 9675 -878
13120h78K5926K7476K2270J3217o0137k3831J6745q306l3425l837j93M4305j6536
$$ -878 25048 52524 74794 88011 27874 4043 20788 12482 -20943 -24780 -24973 19332 2796
13107B796k0923J6579O22j7083j9253l041n999J7298R162J3528J5419J9764K557
$$ 2796 -18127 -1548 -926 -18009 -37262 -40303 -46302 -29004 -19842 -6314 9105 28869 31426
13094C1426j2007j3192M869r648Q015R30J012m5140J2673L6268O535n414k794
$$ 31426 19419 6227 11096 1448 9463 10393 11405 -33735 -21062 15206 21741 16327 13533
13081A3533Q386J2117j5982K1794K1574O003N636j5115q901J4688J453k8778J7871
$$ 13533 21919 34036 18054 39848 61422 67425 73061 57946 49045 63733 65186 36408 54279
13068E4279K7411j0030n447N527j382j1827m312K7630j6818m0969m2469j056K9701
$$ 54279 81690 71660 66213 71740 70358 58531 54219 81849 65031 24062 -18407 -19463 10238
13055A0238L5831K7048N697l1858j3463m801J8792N9982J1402L2857N0701N4541
$$ 10238 46069 73117 78814 46956 33493 28692 47484 107466 118868 151725 202426 256967
13043B56967Q2909Q9587P7217J37002J25740Q8976J16741Q5715K9767j1537o5424
$$ 256967 339876 429463 506680 643682 769422 858398 975139 1060854 1090621 1079084 1013660
13032A013660q7276j01041j06489j02345j34005j52305r4281k7166j8950j7952
$$ 1013660 926384 825343 718854 616509 482504 330199 235918 208752 189802 171850
13022A71850J7108k574j3823l8396m6988J0306l2551j0601k479j7887J317J4776
$$ 171850 188958 186384 172561 134165 87177 97483 64932 54331 51852 33965 35282 50058
13010E0058j2875K575L6096L117j8734j3273o166j6696p659K7767k991j0471L3063
$$ 50058 37183 39758 75854 78971 60237 46964 40798 24102 16443 44210 41219 30748 63811
12997F3811L371k3003k0981k4748M111J5931q028q779j2968J8251M8036L7022
$$ 63811 67182 44179 23198 -1550 2561 18492 10464 1685 -11283 6968 55004 92026
12985I2026K4421R625k8629r652j7656n727l631m321j2697l0597N594j1562O52
$$ 92026 116447 126072 97443 87791 70135 64408 60777 56456 43759 13162 18756 7194 7846
12972G846L995R381L309P653K0632p948q795p211J8826l461m0421J5904m803r484
$$ 7846 11841 21222 24531 32184 52816 44868 36073 28862 47688 44227 3806 19710 14907 5423
12958E423Q79p858J7258j745k3847J1767n501J3432K9128J7740J1032j4149k4089
$$ 5423 6302 -1556 15702 13957 -9890 1877 -3624 9808 38936 56676 67708 53559 29470
12945B9470J4825L6360P690k4226o728o480j5656R643l2289p291K5952J205k878
$$ 29470 44295 80655 88345 64119 57391 50911 35255 44898 12609 5318 31270 32475 29597
12932B9597j0784l8574l847J1526m862M71j0837p54j353P466k1504k7281m371
$$ 29597 18813 -19761 -23608 -12082 -16944 -16473 -27310 -28064 -29417 -21951 -43455 -70736 -75107
12919g5107J1731k6684j3229M7480K8336J4152J1513j7409L33j2770J4263N580
$$ -75107 -63376 -90060 -103289 -55809 -27473 -13321 -1808 -19217 -18884 -31654 -17391 -11811
12907a1811n355L487k734p264Q821J7969O931J1498j4979k7994l818K9390J6418
$$ -11811 -17166 -13679 -16413 -23677 -14856 3113 10044 21542 6563 -21431 -25249 4141 20559
12894B0559k608J4360J1945j4310n10J3467M442q593J0535O272k8073J64J0549
$$ 20559 17951 32311 44256 29946 29436 42903 47345 38752 49287 55559 27486 27650 38199
12881C8199j3952n522J9192O691M2313M6817M45l496o665K0205J6029N196M3170
$$ 38199 24247 18725 37917 44608 86921 133738 134183 130687 124022 144227 160256 165452 208622
12868B08622M44k2282j7697j1407k080j2958m4600k2997r586j6740j2212M759
$$ 208622 209066 186784 169087 157680 155600 142642 98042 75045 65459 48719 36507 41266
12856D1266j9903J419K3642J7935J8214j069L412k5200o664K2620J4942J2051
$$ 41266 21363 22782 46424 64359 82573 81504 84916 59716 53052 75672 90614 102665
12844A02665k9004k4692P353l098J8621n433m921m141o85Q692p942j1576J2424
$$ 102665 73661 48969 56322 53224 71845 66412 61491 57350 56665 65357 57415 45839 58263
12831E8263J0185Q496j0119j515j8777k9390J4618J9458M08j9760K2169J0348
$$ 58263 68448 76944 66825 65310 46533 17143 31761 51219 51627 31867 54036 64384
12819F4384J441l624m812m497j8124J3242r664r411l6256j0160j5727J5471M5699
$$ 64384 65825 62201 57389 52892 34768 48010 38346 28935 -7321 -17481 -33208 -17737 27962
12806B7962O4752l59l4383j8093Q456M899j7195K6202K5993J2868J0068j1571
$$ 27962 92714 92355 57972 39879 48335 53234 36039 62241 88234 101102 111170 99599
12794I9599j7548j8670l649k3257J2274K6902M38k9651k6647N663J6686J3100
$$ 99599 82051 63381 59732 36475 48749 75651 76089 46438 19791 25454 42140 55240
12782E5240J9609K7951k0457j4000K8028K2582l6138m2426k4941m153K0898J9015
$$ 55240 74849 102800 82343 68343 96371 118953 82815 40389 15448 11295 32193 51208
12770E1208R961k3649K3079N8137N886M237m740n473Q144Q657q437k9323k552
$$ 51208 61169 37520 60599 118736 124622 128859 124119 118646 126790 135447 127010 97687 95135
12757I5135K5175P984R713q378k2995k0728l379M0269j9338J4830L2565K9807
$$ 95135 120310 128294 138007 129629 106634 85906 82527 122796 103458 118288 150853 180660
12745A80660P081L4629L296j013J7044J5962j3597n4674k9227j0416m004N472
$$ 180660 187741 222370 225666 224653 241697 257659 244062 189388 160161 149745 145741 151213
12733A51213M074k4183r441Q119J7337J3627K9199j5466L533j5993o833J3619
$$ 151213 155287 131104 121663 129782 147119 160746 189945 174479 178012 162019 155186 168805
12721A68805J0418O512k5130n409J399N143r412L5797K0429k1963l3312j0419
$$ 168805 179223 185735 160605 155196 156595 161738 152326 188123 208552 186589 153277 142858
12709A42858K4393J9685k638R973P200j2670k0764J4617q3K5447P193J3876J5439
$$ 142858 167251 186936 184298 194271 201471 188801 168037 182654 182571 208018 215211 229087 244526
12696B44526K2589l653M9644N456j800J480J4940n485o48J6221l0133M2212M6306
$$ 244526 267115 263462 313106 318562 316762 318242 333182 327697 327049 343270 313137 355349 401655
12683D01655L7234j676J9937K0813P810J8924K3746K4151L1849M444O527K0375
$$ 401655 438889 437213 457150 477963 485773 504697 528443 552594 584443 588887 595414 615789
12671F15789N285L3157J8470P850J5044K2470q616J3419K8447K6302Q609N0962
$$ 615789 621074 654231 672701 680551 695595 718065 709449 722868 751315 777617 786226 837188
12659H37188K6395M7508Q5300O6574M6976N2347O7033J08362J27242J29325J12079
$$ 837188 863583 911091 996391 1062965 1109941 1162288 1229321 1337683 1464925 1594250 1706329
12648A706329Q5384R4134J43627J57936J76035K18775K59810K95467L49744L88919
$$ 1706329 1791713 1885847 2029474 2187410 2363445 2582220 2842030 3137497 3487241 3876160
12638C876160M80946O50736P70461R56507J136298J268164J438041J584386J691675
$$ 3876160 4357106 5007842 5778303 6734810 7871108 9139272 10577313 12161699 13853374
12629A3853374J877747K244930K838975L848145N502829Q145525J2018350J6847480
$$ 13853374 15731121 17976051 20815026 24663171 30166000 38311525 50329875 67177355
12621F7177355K1514753K4879814K6217481K5395260K2430020J6906676Q550943
$$ 67177355 88692108 113571922 139789403 165184663 187614683 204521359 213072302
12614B13072302j520306j0940386j8391782k3092518k5370476k5458255k3564599
$$ 213072302 211551996 200611610 182219828 159127310 133756834 108298579 84733980
12607H4733980j9751210j5128127j0814667p375588n080578l705659k818585k272467
$$ 84733980 64982770 49854643 39039976 31664388 26583810 22878151 20059566 17787099
12599A7787099j972776j796233j666016j525907j411988j260464j101798q90564
$$ 17787099 15814323 14018090 12352074 10826167 9414179 8153715 7051917 6161353
12591F161353o77170n45605m24286l57687k97022k43563j95060j90915k10273
$$ 6161353 5484183 4938578 4514292 4156605 3859583 3616020 3420960 3230045 3019772
12582C019772j54838j09747j00075j14813m3369k569L0640R6772J47885J54119
$$ 3019772 2864934 2755187 2655112 2540299 2496930 2494361 2525001 2621773 2769658 2923777
12572B923777P5156K2888m4233j10558j32849k25477k39078k67295k44489k17003
$$ 2923777 2998933 3021821 2977588 2867030 2734181 2508704 2269626 2002331 1757842 1540839
12562A540839k08820j62477j43955p4379m7431m4561o0268m7852o7312l2616q933
$$ 1540839 1332019 1169542 1025587 951208 903777 859216 798948 751096 683784 651168 642235
12551F42235l6809k9641n2916m673J5032K6954p144k3090k9869n0579k4483j3220
$$ 642235 605426 575785 522869 518196 533228 560182 553038 529948 500079 449500 425017 411797
12539D11797q088J0515L6066J8734l2343l5627l0782q83K6983l707j1908j0353
$$ 411797 403709 414224 450290 469024 436681 401054 370272 369389 396372 392665 380757 370404
12527C70404k7870k794J6981P522m0187j9615j1055l1753k6072K5143r50J866
$$ 370404 342534 339740 356721 364243 324056 304441 293386 261633 235561 260704 259754 261620
12515B61620q87L621l36J6385j1175k1154r76j5608k6537j3572J3610L8236p536
$$ 261620 260733 264354 264018 280403 269228 248074 247098 231490 204953 191381 204991 243227 235691
12502B35691O118K0882k1068L3o5767r502P508k7294J0670O809j3717m325j0088
$$ 235691 241809 262691 241623 241656 175889 166387 173895 146601 157271 164080 150363 146038 135950
12489A35950K1330j2322q03r895j3089L8459J6735k241j2018K4701Q6233R7068
$$ 135950 157280 144958 144155 134260 121171 159630 176365 174124 162106 186807 273040 370108
12477C70108L5983M8708P2162J9846R869J1709Q35m1407o5212n6129o8031o2213
$$ 370108 406091 454799 526961 546807 556676 568385 569220 527813 462601 406472 338441 276228
12465B76228k4439j2735l8890k0693j1709m3695m5479M122M4568K8607j0200o398
$$ 276228 251789 239054 200164 179471 167762 124067 78588 82710 127278 155885 145685 139287
12453A39287j7735j4472p312q829k0158P095N780K3500J1339j9449o057M1510
$$ 139287 121552 107080 99768 90939 70781 77876 83656 107156 118495 99046 92989 134499
12441A34499L5193k5425r799l1931L751J5304J7200l3131k4002N541k0450k6616
$$ 134499 169692 144267 134468 102537 106288 121592 138792 105661 81659 87200 66750 40134
12429D0134J2293l152p529j6060m534J9236K1196K0008L880o830o621j7446Q895
$$ 40134 52427 49275 41746 25686 21152 40388 61584 81592 85472 78642 72021 54575 63470
12416F3470J4907K1461j4741m3207J315J1888j3394n537q27p649j945j2615k0779
$$ 63470 78377 99838 85097 41890 43205 55093 41699 36162 35335 27686 25741 13126 -7653
12403g653M463J2690M63J5226L9000j927k753j489N587j4989N009j2555m276j0753
$$ -7653 -3190 9500 9963 25189 64189 62262 59509 58020 63607 48618 53627 41072 36796 26043
12389B6043n602j6242k6746j2614K2751J4055K7020K127k9134K5438L0129k5722
$$ 26043 20441 4199 -22547 -35161 -12410 1645 28665 30792 1658 27096 57225 31503
12377C1503j3671K5465j6391j2827K851J8254L083K621k6692K6787M3450M227
$$ 31503 17832 43297 26906 14079 16930 35184 38267 40888 14196 40983 84433 88660
12365H8660j5898l0759n232J6873k8634k524Q814J4237j5252j1039k469J4122
$$ 88660 72762 42003 36771 53644 25010 22486 31300 45537 30285 19246 16777 30899
12353C0899J6450J5619j1649k7768j3905L4000j1773j8932j9260j5818k7682K9740
$$ 30899 47349 62968 51319 23551 9646 43646 31873 12941 -6319 -22137 -49819 -20079
12341b0079K8920K833K653J7441M0009j0350k5875L0396r724J84J4707q879k4884
$$ -20079 8841 11674 14327 31768 71777 61427 35552 65948 56224 56408 71115 62236 37352
12328C7352k6736j7816J1191J1835l1057J1504K3849l01j0777J8896K8210K43
$$ 37352 10616 -7200 3991 15826 -15231 -3727 20122 19821 9044 27940 56150 56393
12316E6393K1J384O009L0538K6531j4066j1638Q822Q563P975M702j6740j9440
$$ 56393 56414 57798 63807 94345 120876 106810 95172 103994 112557 120532 125234 108494 89054
12303H9054k87j439j0200j5834m7332l3117m853l503j0009R886J3393J1241J5170
$$ 89054 88767 87328 77128 61294 13962 -19155 -24008 -27511 -37520 -27634 -14241 -3000 12170
12290A2170J4801k7523j4423k0922J1206J0379j2038l863K741o651O967J9530
$$ 12170 26971 -552 -14975 -35897 -24691 -14312 -26350 -30213 -27472 -34123 -27156 -7626
12278g626J9176N420j0417J4410m455j7215l1355j681J8545K0339j727K693k3292
$$ -7626 11550 16970 6553 20963 16508 -707 -32062 -33743 -15198 5141 3414 6107 -17185
12265a7185k5003j196J8772L6921K2J254J7433p687j1958k9743j6435K1069K0831
$$ -17185 -42188 -43384 -24612 12309 12331 13585 31018 23331 11373 -18370 -34805 -13736 7095
12252G095J4176j7510N878J8837K6870J0007l0353j9534j4759Q954J9472l423
$$ 7095 21271 3761 9639 28476 55346 65353 35000 15466 707 9661 29133 25710
12240B5710m302K530n180k895k7363j5951l834p450K0024L5564K6984M289k0393
$$ 25710 21408 23938 18758 15863 -11500 -27451 -31285 -38735 -18711 16853 43837 48126 27733
12227B7733k876L260J0781J4473k3114l4486j9311J6507K3160J118M1138J2201
$$ 27733 24857 28117 38898 53371 30257 -4229 -23540 -7033 16127 17245 58383 70584
12215G0584L46J4110o399j7765P43o384J5509J4179q049R312O789J4525N896n692
$$ 70584 70930 85040 78641 60876 61619 55235 70744 84923 76874 86186 92975 107500 113396 107704
12201A07704K6836P888K3819K7637M6017Q4427J23202J50273J68054J19074J15254
$$ 107704 134540 142428 166247 193884 239901 324328 447530 597803 765857 884931 1000185
12190A000185Q7020M6916l4096m8861r3784j21218j35187q7127j14234j24780
$$ 1000185 1087205 1134121 1100025 1051164 957380 836162 700975 613848 499614 374834
12180C74834j06013p2682m6669j4171n765j8082k7105j9047m104J4151R692l0657
$$ 374834 268821 196139 149470 135299 129534 111452 84347 65300 61196 75347 85039 54382
12168E4382k1117k1335q940R344o663p749R485k1901K149j948K6517K2448k2495
$$ 54382 33265 11930 2990 12334 5671 -2078 7407 -14494 -12345 -14293 12224 34672 12177
12155A2177l4354p051j4782j4165M1592J5761o976J4954P835k4384J3239N701
$$ 12177 -22177 -29228 -44010 -58175 -16583 -822 -7798 7156 14991 -9393 3846 9547
12143I547j1450K9940R683p355j9523j4019N644j2731o547M874K7472j0928l1268
$$ 9547 -1903 28037 37720 30365 10842 -3177 2467 -10264 -16811 -11937 15535 4607 -26661
12130b6661l1074J5081L1573J8341K9771M114j8901k5218J0589J8681N889J8210
$$ -26661 -57735 -42654 -11081 7260 37031 41145 22244 -2974 7615 26296 32185 50395
12118E0395J4946j943m530J1406N918j9945k2861r812n641J4759Q601J3655n576
$$ 50395 65341 63398 58868 70274 76192 56247 33386 23574 17933 32692 41293 54948 49372
12105D9372k2589q619K2055O444R752K4202L9226J1884j1332K4574J3755K7952
$$ 49372 26783 18164 40219 46663 56415 80617 119843 131727 120395 144969 158724 186676
12093A86676K8870L6056L4774N9188Q1546O8161J25978J60153K15283K42835K47395
$$ 186676 215546 251602 286376 345564 427110 495271 621249 781402 996685 1239520 1486915
12082A486915K28952J93940J69435O2270o7880j20887j94350k28655k08404k53858
$$ 1486915 1715867 1909807 2079242 2141512 2073632 1952745 1758395 1529740 1321336 1067478
12072A067478k30153j78864j54518j28183q2223m8401l4381j0233j1656l2516
$$ 1067478 837325 658461 503943 375760 293537 245136 210755 200522 188866 156350
12062A56350l0527k5045j1637l1900k5557k098l1722k2286K3835n5j1833L5535
$$ 156350 125823 100778 89141 57241 31684 29586 -2136 -24422 -587 -642 -12475 23060
12050B3060J4878J1750J6420k9706k9094J9521K0174J4406J988k0028K3949j790
$$ 23060 37938 49688 66108 36402 7308 26829 47003 61409 63397 43369 67318 65528
12038F5528l6911j7138m3100k3655L6224K5614j3539j9900j2757N699J4106M3071
$$ 65528 28617 11479 -31621 -55276 -19052 6562 -6977 -26877 -39634 -33935 -19829 23242
12026B3242l856k1742K0497L529k3942N624j033l453J6629j752K474J3993K275
$$ 23242 19386 -2356 18141 21670 -2272 3352 2319 -1134 15495 13743 16217 30210 32485
12013C2485J3008J0122K1582j0400n5663q356O880J1941j2582k0750K2134j3082
$$ 32485 45493 55615 77197 66797 11134 2778 9658 21599 9017 -11733 10401 -2681
12001b681j3566K7183N512k4517P150L6319L660j0226m243j7490J7057j1903m586
$$ -2681 -16247 10936 16448 -8069 -919 35400 39060 28834 24591 7101 24158 12255 7669
11988G669j190k3813q187p884q11N454J1947L429L029j0742O110j941J34k2402
$$ 7669 6479 -17334 -25521 -33405 -34216 -28762 -16815 -13386 -10357 -21099 -14989 -16930 -16796 -39198
11974c9198J3015J3885R121k1811j2917O467O768J8217k0767M161J77O556M903
$$ -39198 -26183 -12298 -3177 -24988 -37905 -31438 -24670 -6453 -27220 -23059 -22882 -16326 -11423
11961a1423j6368L512J5558p829j8489J1585J6954L7279Q230j8264j2181l0016
$$ -11423 -27791 -24279 -8721 -16550 -35039 -23454 -6500 30779 39009 20745 8564 -21452
11949b1452p783J3126L548M1538j0891n0583o44J4474L1752J1086J2567P431k1734
$$ -21452 -29235 -16109 -12561 28977 18086 -32497 -33141 -18667 13085 24171 36738 44169 22435
11936B2435j4054j2548K383j1260j7250K2493M574P249J0760Q615r879k3526j0619
$$ 22435 8381 -4167 -1784 -13044 -30294 -7801 -3227 4022 14782 23397 13518 -10008 -20627
11923b0627J3822K875J7721j8644k0458L30j0566K9835K6083J8892K2181k3692
$$ -20627 -6805 -3930 13791 -4853 -25311 -24981 -35547 -5712 20371 39263 61444 37752
11911C7752k9656k9616n276p940o79j0948K021J7345L0353J6824j696l0195j6577
$$ 37752 8096 -21520 -26796 -34736 -35415 -46363 -44342 -26997 3356 20180 18484 -11711 -28288
11898b8288Q628L2454L6651J5158k6505l0454k0181l4905K1306L2450J3967K3555
$$ -28288 -19660 12794 49445 64603 38098 7644 -12537 -47442 -26136 6314 20281 43836
11886D3836Q983k2101l9058J29M396p927K18K2222j8442j7777m832j108Q471j3146
$$ 43836 52819 30718 -8340 -8211 -3815 -11742 -11524 10698 -7744 -25521 -30353 -31461 -22990 -36136
11872c6136k0658J3993K2894K414j6187k46L0809L6216n341k3027k786K2882j6356
$$ -36136 -56794 -42801 -19907 -17493 -33680 -33926 -3117 33099 27758 4731 1945 24827 8471
11859H471m261l573k7813K2541L8725K8163J3899l3794m8063R986M743k035j6620
$$ 8471 4210 637 -27176 -4635 34090 62253 76152 42358 -5705 4281 9024 6989 -9631
11846i631r351J1664Q253J7843p532k944P995j206k909J2651o16j1156P799J2917
$$ -9631 -18982 -7318 935 18778 11246 8302 16297 15091 12182 24833 24217 13061 20860 33777
11832C3777j7998m420L8781n525l3582j0438J2157P442l3166j3367m723K2768
$$ 33777 15779 11359 50140 44615 11033 595 12752 20194 -12972 -26339 -31062 -8294
11820h294j6174r935K4511N85k7042j475L445P689l988L3726K3675N614j5704
$$ -8294 -24468 -34403 -9892 -9307 -36349 -37824 -34379 -26690 -30678 3048 26723 32337 16633
11807A6633J0408J0337j9036o1201n139L8435J1813J5977P473n496k759p768O00
$$ 16633 27041 37378 18342 -42859 -47998 -9563 2250 18227 25700 20204 17445 9677 10277
11794A0277l716K3114j3525l3242j1497R596K4994j828r528o908N058K6653j8759
$$ 10277 6561 29675 16150 -17092 -28589 -18993 6001 4173 -5355 -12263 -7205 19448 689
11781F89J4825K3534O828k8032l2292j9361j4051J8028L9356J486o484M418l224
$$ 689 15514 39048 45876 17844 -14448 -33809 -47860 -29832 9524 11010 4526 8944 5720
11768E720q86j2266q802r853N094L227K4785J8378o367k2853j3862L308N309K684
$$ 5720 4834 -7432 -16234 -26087 -20993 -17766 7019 25397 19030 -3823 -17685 -14377 -9068 -6384
11754f384K2489L897k3746j6866J1195K699p455J1028J3812k4371j2623N028L1514
$$ -6384 16105 20002 -3744 -20610 -9415 -6716 -14171 -3143 10669 -13702 -26325 -21297 10217
11741A0217J0233J0338L978k8680J0129j8336l6431k2684R124J0390M6033j1025
$$ 10217 20450 30788 34766 6086 16215 -2121 -38552 -61236 -52112 -41722 4311 -6714
11729f714k1689J7811L945J2877l4155M12p5l34L777p91N907K4154M67l3896L562
$$ -6714 -28403 -10592 -6647 6230 -27925 -27513 -27588 -27922 -24145 -24936 -19029 5125 5592 -28304 -24742
11714b4742J8452J611k4446j3021J7814K4985K006J358N936j6498q210p346k7684
$$ -24742 -6290 -4679 -29125 -42146 -24332 653 2659 4017 9953 -6545 -14755 -22101 -49785
11701d9785P611R029J0617J9731Q030k1322k4444j9674J5788K7642m075j0131
$$ -49785 -42174 -33145 -22528 -2797 5233 -16089 -40533 -60207 -44419 -16777 -20852 -30983
11689c0983N998J8111L02k2820J0692J6893j9048o762L228L6172o42k6976n198
$$ -30983 -24985 -6874 -6572 -29392 -18700 -1807 -20855 -27617 -24389 11783 11141 -15835 -21033
11676b1033k3444j460K7173Q964o183K471j3030n907J1413L4587O791k5733Q408
$$ -21033 -44477 -45937 -18764 -9800 -15983 -13512 -26542 -32449 -21036 13551 20342 -5391 3017
11663C017M1373j4557l8423j4217J5953J7287N269l0818N58J9598m6422K1596
$$ 3017 44390 29833 -8590 -22807 -6854 10433 15702 -15116 -14558 5040 -41382 -19786
11651a9786Q047O099j4270q095j6326K3478J2786l027Q564J6959n550k3605L588
$$ -19786 -11739 -5640 -19910 -28005 -44331 -20853 -8067 -11094 -2530 14429 8879 -14726 -11138
11638a1138m989M498L943J3308Q080j5130j6630J8070L5610m98m4932J5216j7250
$$ -11138 -16127 -11629 -7686 5622 13702 -1428 -18058 12 35622 35124 -9808 5408 -11842
11625a1842j4195m742K6276q203o428j0491n035K1021P24M7813q763m1566j8002
$$ -11842 -26037 -30779 -4503 -12706 -19134 -29625 -34660 -13639 -12915 34898 26135 -15431 -33433
11612c3433r030j0696r510l405M2616M0924J222k435k601j3609J4068J2510k9880
$$ -33433 -42463 -53159 -62669 -66074 -23458 17466 18688 16253 13652 43 14111 26621 -3259
11599c259l7457l912M80J8593K1146J7320J0405K0051J4309J461k2687k6241q263
$$ -3259 -40716 -44628 -44148 -25555 -4409 12911 23316 43367 57676 59137 36450 10209 1946
11586A946Q45R419N772p460k2469l2007J4970J1481K5417K1073j5636p29J0873
$$ 1946 2791 12210 17982 10522 -11947 -43954 -28984 -17503 7914 28987 13351 12622 23495
11573B3495L92l2292q886K687K9565l1871j6238J5736n071J8185K9842J3332l347
$$ 23495 23887 -8405 -17291 -14604 14961 -16910 -33148 -17412 -22483 -4298 25544 38876 35529
11560C5529J5095p601j4676k529k7512j5964K4876jm4725O149l097J8672K0714
$$ 35529 50624 43023 28347 25818 -1694 -17658 7218 7217 -37508 -31359 -34456 -15784 4930
11547D930k1804m7764j249O441k1206L8428J2246k8456K0044J2370o113j286J9918
$$ 4930 -16874 -64638 -65887 -59446 -80652 -42224 -29978 -58434 -38390 -26020 -32133 -33419 -13501
11534a3501N581n844j4378j6781J40L6229Q786J1479K4545J0555k9917k7235q387
$$ -13501 -7920 -13764 -28142 -44923 -44783 -8554 232 11711 36256 46811 16894 -10341 -18728
11521a8728K357N262p262R689L1641r15l4792j2525J5348k41K3016J0142j3935
$$ -18728 -16371 -11109 -18371 -8682 22959 22044 -12748 -25273 -9925 -10166 12850 22992 9057
11508I057p751k9924L20J8728J2402r342k5018o282k310J1832K1665L0393n780
$$ 9057 1306 -28618 -28298 -9570 2832 -6510 -31528 -37810 -40120 -28288 -6623 23770 17990
11495A7990L6634J9966k9088O443N982j4323k3684P521j1988j2141o029m3608
$$ 17990 54624 74590 45502 51945 57927 43604 19920 27441 15453 3312 -2717 -46325
11483d6325j19K1792L1460M6543L855k1969q557j1235J3296Q789J2772q557j2783
$$ -46325 -46444 -24652 6808 53351 57206 35237 26680 15445 28741 37530 50302 41745 28962
11470B8962m672K3207M90k4238O641J9999j4274l9358r062J7540P085J5753N075
$$ 28962 24290 47497 47987 23749 30390 50389 36115 -3243 -12305 5235 12320 28073 33148
11457C3148m710r330J0557Q193K2436J694j3301O57j7101j2598m0586n005K1397
$$ 33148 28438 19108 29665 37858 60294 61988 48687 49344 32243 19645 -20941 -25946 -4549
11444d549K2552j233K0370m199l1091J1841N876l1892k9847L1925J3081K2226
$$ -4549 18003 16770 37140 32941 1850 13691 19567 -12325 -42172 -10247 2834 25060
11432B5060J5131r908R922o238n8967l5R996P373K5670K1489K9498o08o950j3015
$$ 25060 40191 30283 40205 33967 -25000 -25035 -15039 -7666 18004 39493 68991 68383 61433 48418
11418D8418j3730J7528k9054M842k2940j6204J9924r674j8711j0307l093k6585
$$ 48418 34688 52216 23162 28004 5064 -11140 8784 -890 -19601 -29908 -33001 -59586
11406e9586J3975K784N658Q448j0387J1109J1640n833j8373K4264N355o310j4205
$$ -59586 -45611 -42827 -37169 -28721 -39108 -27999 -16359 -22192 -40565 -16301 -10946 -17256 -31461
11393c1461Q229K9180J5559j0798o352r830k587O290J361L450l04K164K6503K233
$$ -31461 -23232 5948 21507 10709 4357 -5473 -8060 -1770 -409 3041 2737 4901 31404 33637
11379C3637P277L1917J5065j4464k7278j0063J1270o877j8604j3311k53K7522
$$ 33637 40914 72831 87896 73432 46154 36091 47361 40484 21880 8569 8316 35838
11367C5838k2342j1811J7733M619l3646j3288k4692J6573J1830P057k890K0405
$$ 35838 13496 1685 19418 24037 -9609 -22897 -47589 -31016 -19186 -12129 -15019 5386
11355E386N619j0660l2148J2726M1020j994j2919j6438j6176j5508j447Q870N982
$$ 5386 11005 345 -31803 -19077 21943 19949 7030 -9408 -25584 -41092 -42539 -33669 -27687
11342b7687K0004P756l9499j6203K5861N9070M636k1298j1753j406n030m603L661
$$ -27687 -7683 73 -39426 -55629 -29768 29302 33938 12640 887 -519 -5549 -10152 -6491
11329f491j1695k7102j7408L568L5095J1349r114Q257L3445O747k3508k483J057
$$ -6491 -18186 -45288 -62696 -59128 -24033 -12684 -21798 -13541 19904 26651 3143 660 1717
11316A717r507Q418l464j5394K0177K6571J63j5749r732k1213q122M76Q403j7264
$$ 1717 -7790 628 -2836 -18230 1947 28518 28681 12932 3200 -18013 -26135 -25659 -17256 -34520
11302c4520K4286j184R359k1996l360J6643L4064k830k7645M789j0406m133K7261
$$ -34520 -10234 -11418 -2059 -24055 -27415 -10772 23292 20462 -7183 -2394 -12800 -16933 10328
11289A0328O824O470j8356J6831R249k4845k8388J0295L6800J2922l71j100k543
$$ 10328 17152 23622 5266 22097 31346 6501 -21887 -11592 25208 38130 37759 36659 34116
11276C4116M880J9878p062r834j9758j3172j1486k8517j985J2313J3776N495N542
$$ 34116 38996 58874 51812 41978 22220 9048 -2438 -30955 -32940 -20627 -6851 -1356 4186
11263D186q645k620O69k6351j3152K3894J5696l8195J1516K9941j2502j5364J2637
$$ 4186 -4459 -7079 -6410 -32761 -45913 -22019 -6323 -44518 -33002 -3061 -15563 -30927 -18290
11250a8290J8095J466O68n016l808n393K8535N268Q375j3045j3876J0687q831
$$ -18290 -195 1271 1939 -3077 -6885 -12278 16257 21525 29900 16855 2979 13666 4835
11237D835K3510j1197p366j5205O248j8778K5329J5859j7486k7216j7642K6782
$$ 4835 28345 17148 9782 -5423 825 -17953 7376 23235 5749 -21467 -39109 -12327
11225a2327J0898N238P500L575K3182J6161j2748k5934j0900o919J1130K5578
$$ -12327 -1429 3809 11309 14884 38066 54227 41479 15545 4645 -2274 8856 34434
11213C4434k058m428P179n750q10j4866k1909j3109o951m827p458P355O358Q925
$$ 34434 32376 27948 35127 29377 28567 13701 -8208 -21317 -28268 -33095 -40553 -33198 -26840 -17915
11199a7915K6795N471K5149J5530k254j2980m201k4704j867J8591J1390N625l7560
$$ -17915 8880 14351 39500 55030 52776 39796 35595 10891 9024 27615 39005 44630 7070
11186G070k7480M310k454K154J4402L480M767M224L718r284K9212j0971k4002
$$ 7070 -20410 -16100 -18554 -16400 -1998 1482 6249 10473 14191 4907 34119 23148 -854
11173h54j5162M973J4609o410j7340L1401Q793L859l4009Q729K1992j4475J1124
$$ -854 -16016 -11043 3566 -2844 -20184 11217 20010 23869 -10140 -1411 20581 6106 17230
11160A7230J03N504r968j4321J4283P090p897n666J1683L1214j8612l9273k295
$$ 17230 17333 22837 12869 -1452 12831 19921 12024 6358 18041 49255 30643 -8630 -10925
11147a0925p278p965P85K2008J3959q053l3380n181J5366J6521j3040J7639K480
$$ -10925 -18203 -26168 -25383 -3375 10584 2531 -30849 -36030 -20664 -4143 -17183 456 2936
11134B936K185k8641O150K0375J3992j2236p808J5336K4778L329Q085R358K856
$$ 2936 5121 -23520 -17370 3005 16997 4761 -3047 12289 37067 40396 48481 57839 60695
11121F0695j7239m4214O126l875j4965k50J8842O703p322K5780N44p170j8417
$$ 60695 43456 -758 5368 1493 -13472 -13722 5120 11823 4501 30281 30825 23655 5238
11108E238L785j3975P319K925l0078n281Q17K972K2085K6643j4264m6058m103
$$ 5238 9023 -4952 2367 5292 -24786 -30067 -29250 -26278 -4193 22450 8186 -37872 -41975
11095d1975J6777J0774l748q19J6776J6256K8424j2593j2361k5221J3944P213
$$ -41975 -25198 -14424 -18172 -18991 -2215 14041 42465 29872 17511 -7710 6234 13447
11083A3447J7563O485k4346j2919J2271k053k1611j714K9370J9840O636r530k2059
$$ 13447 31010 37495 13149 230 12501 10448 -11163 -12877 16493 36333 42969 33439 11380
11070A1380J1255k711k7999m545K3849L718p477K1777K0562M662R491j3644j4712
$$ 11380 22635 19924 -8075 -12620 11229 14947 7470 29247 49809 54471 63962 50318 35606
11057C5606O453j3346N668j715j2873J386J3207p184o643k1193l950Q001K3249
$$ 35606 42059 28713 34381 32666 19793 21179 34386 27202 20559 -634 -4584 3417 26666
11044B6666K5444J3002R733j0478p92k278j4337n765j973j1133j5735j4186j018
$$ 26666 52110 65112 74845 64367 63575 61297 46960 41195 39222 28089 12354 -1832 -2850
11031b850j4742l3484K7489K8348J717j0634J5715K5157o002m1704n589K7990
$$ -2850 -17592 -51076 -23587 4761 6478 -4156 11559 36716 30714 -10990 -16579 11411
11019A1411k7185l0960L0324P272M39L9144N224k0348R711j0768p211j2181J988
$$ 11411 -15774 -46734 -16410 -9138 -8699 30445 35669 15321 25032 14264 7053 -5128 -3140
11006c140M2237M2705K2727m737l7509q937K5295J0230J4070K1252l3082k2281
$$ -3140 39097 81802 104529 99792 62283 53346 78641 88871 102941 124193 91111 68830
10994F8830n5201k9789K1675K7832J5002K7053o461J771j0439J6630N1625N3230
$$ 68830 13629 -16160 5515 33347 48349 75402 68941 70712 60273 76903 128528 181758
10982A81758L5530N0070K1146K8261R6968J22823J92752K82434M24883N75093
$$ 181758 217288 267358 288504 316765 413733 536556 729308 1011742 1436625 2011718
10972B011718N56383K16025k84703n21570n40060m27587k80791j84666j33957
$$ 2011718 2568101 2784126 2499423 1977853 1437793 1010206 729415 544749 410792
10963D10792r5539k4963k5004p2735m5321q435q287l182N254k1913k1253K373
$$ 410792 315253 290290 265286 192551 147230 138795 130508 127326 132580 110667 89414 91787
10951I1787K6144l0568j6977K6024J3724k6055m1399N925M6565J9369l7382R862
$$ 91787 117931 87363 70386 96410 110134 84079 42680 48605 95170 114539 77157 87019
10939H7019K0332J3724j6058M030k1111j0079N107L749j1601j8499J0276J2484
$$ 87019 107351 121075 105017 109047 87936 77857 82964 86713 75112 56613 66889 79373
10927G9373p799l043l996j9777J6113K581r708j0682M012j0042m944L2250j0944
$$ 79373 71574 68531 64535 44758 60871 63452 53744 43062 47074 37032 32088 64338 53394
10914E3394K482o016j8481m911k0245L258K8899K6387q722J982J1118K555l6388
$$ 53394 55876 49860 31379 26468 6223 9481 38380 64767 56045 58027 69145 71700 35312
10901C5312j0345O903J3941J6156j1507j938L1357R542k8926k4583l1728J2378
$$ 35312 24967 31870 45811 61967 50460 48522 79879 89421 60495 35912 4184 16562
10889A6562J3321j0811M45Q727J8578k6454j9504k6001P224R49j0154J0160K0946
$$ 16562 29883 19072 19517 28244 46822 20368 864 -25137 -17913 -16964 -27118 -16958 3988
10876C988n171K9822R019l397q39l510J2077j5354k6M51j8134j025l906j4857
$$ 3988 -1183 28639 37658 34261 33422 29912 41989 26635 26609 27060 8926 7901 3995 -10862
10862a0862j856j6293k3823l3802k0184l0150o7418J278L9874M4244J08539M9309
$$ -10862 -12718 -29011 -52834 -86636 -106820 -136970 -204388 -203110 -163236 -118992 -10453 38856
10850C8856K397n835K2013j260j5777K1179l062O52O475l409P724L7622J7164
$$ 38856 41253 35418 57431 56171 40394 61573 58511 59163 65638 62229 69953 107575 124739
10837A24739j6290J6282J2309m7650p2676j998K9193K776L0844O096l36N695O697
$$ 124739 108449 124731 137040 89390 16714 14716 43909 46685 77529 83625 83289 88984 95681
10824I5681k4135r593r837r511l316l189J4829L063Q807J0781J6488K2538K0740
$$ 95681 71546 61953 52116 42605 39289 36100 50929 53992 62799 73580 90068 112606 133346
10811A33346N593N5320O0430N8842M8249L2974O604l4771r0071o2023o0266n3571
$$ 133346 138939 194259 254689 313531 361780 394754 401358 366587 276516 214493 154227 100656
10799A00656l3533j1369k013m103K1257Q600L1887J7117J4410j072k0393j1163
$$ 100656 67123 55754 53741 49638 70895 79495 111382 128499 142909 141837 121444 110281
10787A10281K9320k575m520j2753r105k1693k762r2J1229Q443k8048l8779n943
$$ 110281 139601 137026 132506 119753 110648 88955 86193 86101 97330 105773 77725 38946 33003
10774C3003n37k2183O055K8472k72J6576L8624j185k2297k9347J2367J6615K5369
$$ 33003 32466 10283 16338 44810 44538 61114 99738 98553 76256 46909 59276 75891 101260
10761A01260j1234J8904M9814k6021j9903O945j9478l0140K6621L0046j6696l2265
$$ 101260 90026 108930 158744 132723 112820 119765 100287 70147 96768 126814 110118 77853
10749G7853k4330k5755r024j746J6711K900Q696j2174J635R392J1126l159K5068
$$ 77853 53523 27768 18744 16998 33709 36609 45305 33131 34766 44158 55284 52125 77193
10736G7193M886l1578m3817k9761J9418M9923K8035J5616J4089k9427o4843P27
$$ 77193 82079 50501 6684 -23077 -3659 46264 74299 89915 104004 74577 9734 10461
10724A0461K9501J4939K4717o503p230R933L8741J8376j3288r577J9444L991p93
$$ 10461 39962 54901 79618 73115 65885 75818 114559 132935 119647 110070 129514 133505 132712
10711A32712P113P655m3396J2440L0623j8487J2237J9907K9154L389k5026J5265
$$ 132712 139825 147480 104084 116524 147147 128660 140897 160804 189958 193347 168321 183586
10699A83586p883K833K610l0253j609L0177l4188q823k652J5676L2153k424k4598
$$ 183586 175703 178536 181146 150893 149284 179461 145273 136450 133798 149474 181627 179203 154605
10686A54605J9263N5699K6374k91J4026L1795M8129M2719M9859M960m5920o5669
$$ 154605 173868 229567 255941 255650 269676 301471 349600 392319 442178 447138 401218 335549
10674C35549p7696m6284R186Q138J5170m591k6591O457J5063K4553L0096L667
$$ 335549 257853 211569 220755 228893 244063 239472 212881 219338 234401 258954 289050 292717
10662B92717L1834k127k3911l8571j7574n688O040R44K4469P411k837J2424r17
$$ 292717 324551 322424 298513 259942 242368 236680 242720 243664 268133 275544 272707 285131 284214
10649B84214J8074J2142m473m052j4361k324J3312J7888L816K3083J5707J9743
$$ 284214 302288 314430 309957 305905 291544 289220 302532 320420 324236 347319 363026 382769
10637C82769K3079L2129K7131L0576R429j1259K0082L4884K3424o74j2676j8346
$$ 382769 405848 437977 465108 495684 505113 493854 513936 548820 572244 571570 558894 540548
10625E40548q272j5638M0677M5775L6643K9878M0228L7666O7188J8717j13Q064
$$ 540548 532276 516638 557315 603090 639733 669611 709839 747505 814693 833410 833297 841361
10613H41361n135K1541K7650L8211J0359K2030K7143O1428N9180L4709L6033O5098
$$ 841361 836226 857767 885417 923628 933987 956017 983160 1044588 1103768 1138477 1174510 1239608
10601A239608K1113J427j041j6339O478L9405J03109R8718J05166J04489J37057
$$ 1239608 1260721 1262148 1261107 1244768 1251246 1290651 1393760 1492478 1597644 1702133 1839190
10590A839190J67700J91392J77476J61535J61742J72946J73909J45326J80771
$$ 1839190 2006890 2198282 2375758 2537293 2699035 2871981 3045890 3191216 3371987
10581C371987K36775L04016L42842L91789M42376N16547O31683Q28014R76294
$$ 3371987 3608762 3912778 4255620 4647409 5089785 5606332 6238015 7066029 8042323
10572H042323J224100J454833J370212J067365R94933J270974J799045K489257
$$ 8042323 9266423 10721256 12091468 13158833 14153766 15424740 17223785 19713042
10564A9713042L249360M280261N860879Q333395J2194815J8241113K7450410M0880914
$$ 19713042 22962402 27242663 33103542 41436937 53631752 71872865 99323275 140204189
10556A40204189O1779131R5289749J26629094R7148095j608145p9249880j09526493
$$ 140204189 201983320 297273069 423902163 521050258 519442113 440192233 330665740
10549C30665740j00988383p1492488m5087848k8543868j8874697j3170257r701577
$$ 330665740 229677357 158184869 113097021 84553153 65678456 52508199 42806622
10542D2806622p380104n656845m295286l239981k418182j616658j086539j024188
$$ 42806622 35426518 29769673 25474387 22234406 19816224 18199566 17113027 16088839
10534A6088839j381854j655059j588313j309389r05508m39259N7666M83463K95082
$$ 16088839 14706985 13051926 11463613 10154224 9248716 8809457 8867123 9350586 9645668
10525I645668m26357r89266j146648r39432p06133o10288n42582m83335l88391
$$ 9645668 9219311 8230045 7083397 6143965 5437832 4827544 4284962 3801627 3413236
10516C413236k82677j95191j55612j35896j29276j38295j43677j18586j20188
$$ 3413236 3130559 2935368 2779756 2643860 2514584 2376289 2232612 2114026 1993838
10507A993838j24186j01642j08779j42644j24928p3536n4494m7200n0723n8727
$$ 1993838 1869652 1768010 1659231 1516587 1391659 1318123 1263629 1216429 1165706 1106979
10497A106979n2127k0407o9j9210n4087n4577l7833m7224m8180m4466k5772J3347
$$ 1106979 1054852 1034445 1034376 1015166 961079 906502 868669 821445 773265 728799 703027 716374
10485G16374M3265L2678M2675K5008k4918j8264R418M0570P9431J56802K27510
$$ 716374 759639 792317 834992 860000 835082 816818 826236 866806 946237 1103039 1330549
10474A330549K96214J73498q4681k23900k58477k11168j32950r7079q7876m4625
$$ 1330549 1626763 1800261 1715580 1491680 1233203 1022035 889085 792006 704130 659505
10464F59505p3085m3129l911l3086n2094j7978J411p578k3015k5442q695J056
$$ 659505 586420 543291 539380 506294 454200 436222 437633 430055 407040 381598 372903 373959
10452C73959j2010j4211J5815Q775k1076J899q49m762N635k5971j561J3116N69
$$ 373959 361949 347738 363553 372328 351252 353151 352302 347540 353175 327204 325643 338759 339328
10439C39328j0113j6684q873J5238L6342J3793J1529N274k7552n5658n5734k0338
$$ 339328 329215 312531 303658 318896 355238 369031 380560 385834 358282 302624 246890 226552
10427B26552n2027O613K1864M077N117L3663J351L5499p131j3825J0918j9473
$$ 226552 174525 181138 203002 207079 212196 245859 247210 282709 275578 261753 272671 253198
10415B53198n248J2151J6445L1495Q329n766O0285O2171L9300O3084M4148J0450
$$ 253198 247950 260101 276546 308041 316370 310604 370889 433060 472360 535444 579592 590042
10403E90042j8115k161L4172L0167L7586Q567N008n9936p3344m2532m2974l0017
$$ 590042 571927 569766 603938 634105 671691 680258 685266 625330 551986 509454 466480 436463
10391D36463m2966o7629l7978k9190l2032k0492o003l117r826n141Q389j315k765
$$ 436463 393497 325868 287890 258700 226668 206176 200173 197056 187230 182089 190478 189163 186398
10378A86398J9498k4753j5428l396K3021M8273P168l0995l9876l3932l0129J3463
$$ 186398 205896 181143 165715 162319 185340 233613 240781 209786 169910 135978 105849 119312
10366A19312J2625j2933J6756K2835J2136M708L0167K7816j8756m5870k0170J2245
$$ 119312 131937 119004 135760 158595 170731 175439 205606 233422 214666 168796 148626 160871
10354A60871j0776j1728k8870m6463k0484j7168K2499J6802m332L485j0475j776
$$ 160871 150095 138367 109497 63034 42550 25382 47881 64683 60351 63836 53361 51585
10342E1585n656L318K3871l1367j1594L2773L7527J0053k782O356L1650K7493
$$ 51585 45929 49247 73118 41751 30157 62930 100457 110510 107728 114084 145734 173227
10330A73227k7573k9993j1099r339L65n086l1556l2921L539m201O717K1655k689
$$ 173227 145654 115661 104562 95223 95588 90502 58946 26025 29564 25363 32080 53735 51046
10317E1046k8837J165p52j0899j7771P408J6276K9682K7526p593K5171L791n895
$$ 51046 22209 23374 22622 11723 -6048 1360 17636 47318 74844 67251 92422 96213 90318
10304I0318k8650k0766K5365P2440m887r194k01l1604k2504J4042J4616k4511
$$ 90318 61668 40902 66267 138707 133820 124626 124425 92821 70317 84359 98975 74464
10292G4464J989O90j1429j7457J3724L4698M076k6293M984K5703q617J2103j8967
$$ 74464 76453 77143 65714 48257 61981 96679 100755 74462 79446 105149 96532 108635 89668
10279H9668J0957Q601m271j7129k5713j9245J0669J7835r054q417J6621j3771
$$ 89668 100625 109226 104955 87826 62113 42868 53537 71372 62318 53901 70522 56751
10267E6751j1444N008K875l1159J4527J5475k070K8509N368m88J4745J2285J260
$$ 56751 45307 50315 53190 22031 36558 52033 49963 78472 83840 83352 98097 110382 111642
10254A11642L8313L8733N9229R3188M7608j6361k4839p7992r7632m3263R20J6369
$$ 111642 149955 188688 247917 341105 388713 372352 347513 269521 171889 128626 129546 145915
10242A45915J2607j1675k9556J1308N9800P129j5707K0561Q216k935j1465L0547
$$ 145915 158522 146847 117291 128599 188399 195528 179821 200382 208598 205663 194198 224745
10230B24745j3890L595N7664O1695M5184M4680J2344N540M1723Q0225R1544J16119
$$ 224745 210855 214450 272114 333809 378993 423673 436017 441557 483280 563505 655049 771168
10218G71168K00095K26284L03494M37791O15613Q87317J321800J820815K017044
$$ 771168 971263 1197547 1501041 1938832 2554445 3441762 4763562 6584377 8601421
10209H601421J345331r6970j363595j899314j822539j399693r27345n88370l91792
$$ 8601421 9946752 9849782 8486187 6586873 4764334 3364641 2437296 1848926 1457134
10200A457134k63942k11255j72643j14307o4746n4087j9313q920l6523p7334n5410
$$ 1457134 1193192 981937 809294 694987 630241 576154 556841 547921 511398 434064 378654
10189C78654l7050l4106m0752l9382m756L0592J2978l4326n7900q407k1155J5533
$$ 378654 341604 307498 266746 227364 222608 253200 266178 231852 173952 165545 144390 159923
10177A59923k8446P33J2466m532n454Q04J526m618j4337r2o374J1023k427l0404
$$ 159923 131477 132210 144676 140144 134690 135494 137020 132402 118065 117973 111599 122622 120195 89791
10163H9791k3482J2572j5060l2249K0269j812J0861l3011N1l900k41J8883J9913
$$ 89791 66309 78881 63821 31572 51841 50029 60890 27879 27930 24030 23789 42672 62585
10150F2585M4140p626k3379O780L87j45K252L1598J4288J3063R613k4269J7094
$$ 62585 106725 99099 75720 82500 82887 82742 84994 116592 130880 143943 153556 129287 146381
10137A46381M2846O5733R6614J06148J42918K09288L05109N03279O20172M29943
$$ 146381 189227 254960 351574 457722 600640 809928 1115037 1618316 2238488 2668431
10127B668431k9224l88375n05961m93895l77253k43641j47122o7788q4780p2683
$$ 2668431 2639207 2250832 1744871 1250976 873723 630082 482960 415172 330392 257709
10117B57709l9829l8770j3438m712j2205M398J738j2010l1335m8098k3639J8879
$$ 257709 217880 179110 165672 160960 148755 153153 154891 142881 111546 63448 39809 58688
10105E8688n373j7152k3249K9564J4327k3000j5816k14j7556n618J0792p226K0625
$$ 58688 53315 36163 12914 42478 56805 33805 17989 17775 219 -5399 5393 -1833 18792
10092A8792K7279j636k146k0661J7902L5273r692j9186k095L629L2862K111j6564
$$ 18792 46071 44435 42289 21628 39530 74803 65111 45925 43830 47459 80321 82432 65868
10079F5868k1149m6l2782l427j0127K1207K9315k544j817N291j880Q721R331k880
$$ 65868 44719 44673 11891 8464 -1663 19544 48859 46315 44498 49789 47909 56630 65961 63081
10065F3081j2422l791P965M971p443l2894q687L6383q996r106J0740p385J0809
$$ 63081 50659 46868 54833 59804 52361 19467 10780 47163 38167 29061 39801 32416 43225
10052D3225J7001O4071O1467k1653p972j9294j9337k0609p280k9636k4197j3647
$$ 43225 60226 124297 185764 164111 156139 136845 117508 96899 89619 59983 35786 22139
10040B2139m795k242n11K0273L788j515j6071J4126L4742R520k7702k9379k1197
$$ 22139 17344 15102 14591 34864 38652 37137 21066 35192 69934 79454 51752 22373 1176
10027A176J9163j1149K5686K5934o164j5743J7840K1209k055l8332j2390L3430
$$ 1176 20339 9190 34876 60810 54646 38903 56743 77952 75897 37565 25175 58605
10015E8605l154k2321j1402J786K137J9007K4425n07j2777j7400j0713m467Q440
$$ 58605 55451 33130 21728 23514 25651 44658 69083 68576 55799 38399 27686 23219 31659
10002C1659J3970j1956j0872n512j344J5363Q895j3465o037M439K9651j6989k2352
$$ 31659 45629 33673 22801 17289 15945 31308 40203 26738 20701 25140 54791 37802 15450
9989A5450j4339j6527J8965j2361R232O185j353J134r12o584p352q010J3965J4422
$$ 15450 1111 -15416 3549 -8812 420 6605 5252 6386 5474 -1110 -8462 -16472 -2507 11915
9975A1915j8925p620L3527J4126L409J8121P986o935j0546l755K9359L954k1347
$$ 11915 -7010 -14630 18897 33023 36432 54553 62539 55604 45058 41303 70662 74616 53269
9962E3269n7550k1055k164L339K6641K5747j6919N2o090K553J0485Q911K635P199
$$ 53269 -4281 -25336 -27500 -24161 2480 28227 11308 11360 5270 7823 18308 27219 29854 37053
9948C7053O636K144l449o349j6168P640j538J677l2070j4578j463K6750O402K0578
$$ 37053 43689 45833 42384 36035 19867 27507 25969 27646 -4424 -19002 -20465 6285 12687 33265
9934C3265J7697j3567P315O593Q091p878j898j8389n252j3701R85k2783o20K986
$$ 33265 50962 37395 44710 51303 59394 51516 49618 31229 25977 12276 13261 -9522 -10142 -7156
9920g156k273l299M679k2363Q505J4365O764q12k6014J423L1329J0017r858P098
$$ -7156 -9429 -12728 -8049 -30412 -21907 -7542 -778 -1590 -27604 -26181 5148 15165 5307 12405
9906A2405J3148n166J6131L0099j6669n759J6473R276J3524J4106k6680k3058
$$ 12405 25553 20387 36518 66617 49948 44189 60662 69938 83462 97568 70888 47830
9894D7830K197m399K695j3480n842N647J2484l168J5179J2381J523k0882l0693
$$ 47830 50027 45628 48323 34843 29001 34648 47132 43964 59143 71524 73047 52165 21472
9881B1472k182j6006l3699J5068K0129L9732L021k1429j9170l8760P104l133R276
$$ 21472 19290 3284 -30415 -15347 4782 44514 47535 26106 6936 -31824 -24720 -27853 -18577
9868a8577J7000M5299J0000l4808j225k7006j5160J8690K6409K4795n673q899
$$ -18577 -1577 43722 53722 18914 17689 -9317 -24477 -5787 20622 45417 39744 30845
9856C0845o833O725R060o044j0317j4465o832R603j344J5265L3435k4814l3299
$$ 30845 24012 30737 39797 33753 23436 8971 2139 11742 10398 25663 59098 34284 985
9843I85K781l042J0099J2397R1J4242J2860j5161k4584j1877K6985o876m1260
$$ 985 3766 724 10823 23220 23311 37553 50413 35252 10668 -1209 25776 18900 -22360
9830b2360l598M0842J0690r858l2398k7493j808K1038L1492K1480k403r394K36
$$ -22360 -25958 14884 25574 15716 -16682 -44175 -45983 -24945 6547 28027 25624 16230 16466
9817A6466M371J637p877j5559j180j245p944q905J8122L9751M3317L299j8846
$$ 16466 20837 22474 14597 -962 -2142 -3387 -11331 -20236 -2114 37637 80954 84253 65407
9804F5407m9073P791m001J0003K1645j1122m188L187N556J9548J383j3900P680
$$ 65407 16334 24125 20124 30127 51772 40650 36462 39649 45205 64753 66136 52236 59916
9791E9916k0546k0645J8164R620N248j9085J6547k046j0088k5882L391L2752K8198
$$ 59916 39370 18725 36889 46509 51757 32672 49219 47173 37085 11203 14594 47346 75544
9778G5544k2188r559p442l3752n973K2085L3281j816l7459l814k359J4018P106
$$ 75544 53356 43797 36355 2603 -3370 18715 51996 50180 12721 8907 6548 20566 27672
9765B7672j0909m090k2123P662K6191k292j7365J7312P370J3373p939j6863k9547
$$ 27672 16763 12673 -9450 -1788 24403 22111 4746 22058 29428 42801 34862 17999 -11548
9752a1548k3853L5519n283r516L5827K4056p048K0165P528l2077j3988K2359m166
$$ -11548 -35401 118 -5165 -14681 21146 45202 38154 58319 65847 33770 19782 42141 37975
9739C7975j268Q77M197J128K9298O838j9325k4939m6324J722L7651k552l5885
$$ 37975 36707 37584 41781 42909 72207 79045 59720 34781 -11543 -9821 27830 25278 -10607
9726a0607L3423P590r627M253k9079n916L2854J5105O283j6125j2833q977k9832
$$ -10607 22816 30406 20779 25032 -4047 -9963 22891 37996 44279 28154 15321 6344 -23488
9713b3488j24K3864J8561k4190j304Q242J447k262K1830J5417J9092P663k3664
$$ -23488 -23612 252 18813 -5377 -6681 1561 3008 746 22576 37993 57085 64748 41084
9700D1084k2727K0894J5605J2681j0261k4511k5226K0720K6618k2926j1833l361
$$ 41084 18357 39251 54856 67537 57276 32765 7539 28259 54877 31951 20118 16757
9688A6757J644K2043J6103j4084m074M515J3809j7770l5426j4513r284J3403R256
$$ 16757 18401 40444 56547 42463 38389 42904 56713 38943 3517 -10996 -20280 -6877 2379
9675B379k900l4297j4327m072L2236J2636Q619J6707Q168m31j3646q55P316O619
$$ 2379 -521 -34818 -49145 -53217 -20981 -8345 274 16981 25149 24718 11072 10217 17533 24152
9661B4152K092l418m085J8760J6762k1018m6560j2733k379M4910R226m449K9003
$$ 24152 26244 22826 18741 37501 54263 33245 -13315 -26048 -28427 16483 25709 21260 50263
9648E0263L2387M48l5437j1717r311j8847Q47j178K2135j335k8176k5531R157
$$ 50263 82650 83098 47661 35944 26633 7786 8633 7455 29590 28255 79 -25452 -16295
9635a6295k439N297K5878O586j6594o731j4872K8842J9314k5719J6849J3067p239
$$ -16295 -18734 -13437 12441 19027 2433 -4298 -19170 9672 28986 3267 20116 33183 25944
9622B5944j0711Q910j3061O523k0355m6082k4610L576J4317K9402M2066L8459
$$ 25944 15233 24143 11082 17605 -2750 -48832 -73442 -69866 -55549 -26147 15919 54378
9610E4378J1965k818j1776J5052j6692l2084k010R70L2216j8371j5406L29J4600
$$ 54378 66343 63525 51749 66801 50109 18025 16015 16985 49201 30830 15424 15753 30353
9597C0353J0425n969j0496q067L15o681R10k8542J6187K8107j966P00P88k675
$$ 30353 40778 34809 24313 16246 16561 9880 10790 -17752 -1565 26542 24576 25276 26064 23389
9583B3389k3599o148K3140R391K2749J0678J922l894j2274k8967r780K821J969
$$ 23389 -210 -6358 16782 26173 48922 59600 61522 57628 45354 16387 6607 9428 11397
9570A1397J0064K8922M0363m762l8248k3005J2476J3882R167O849k1136J3953
$$ 11397 21461 50383 90746 85984 47736 24731 37207 51089 60256 67105 45969 59922
9558E9922L543k5364Q295R953j6522j4709K7951L1226J1245K1770m2073l0143
$$ 59922 63465 38101 46396 56349 39827 25118 53069 84295 95540 117310 75237 45094
9546D5094k7480p342j697J4656P991m04Q506j1757r06j697l4701K1796J6350J1527
$$ 45094 17614 10272 8575 23231 31222 30818 39324 27567 26661 24964 -9737 12059 28409 39936
9532C9936O756m539Q70k1900o203q49Q425J3104P2J4562J36k2145J460R716M387
$$ 39936 46692 42153 43023 21123 14920 14071 22496 35600 35672 50234 50370 28225 29685 39401 43788
9517D3788K4523K0123j5874j3252r145p189N022K10L894K572m310k5266L227j5360
$$ 43788 68311 88434 72560 59308 50163 42974 47996 48206 52100 54672 50362 25096 28323 12963
9503A2963K282J2560K8852j186j4531j4841L4724L1143j0897N281K7195k9115
$$ 12963 15245 27805 56657 55471 40940 26099 60823 91966 81069 86350 113545 84430
9491H4430k6625K8918j5308p789L42J5872M745J4118O031R048j4367j6442l5040
$$ 84430 57805 86723 71415 63626 63968 79840 84585 98703 104734 113782 99415 82973 47933
9478D7933K1965M4407m9018l2741K2629J6493P866k0220r709J3379K331j4340
$$ 47933 69898 114305 65287 32546 55175 71668 79534 59314 49605 62984 65315 50975
9466E0975O038q888n508K726Q764N589K5613M701k0547p382j6609j5139N839l260
$$ 50975 57013 48125 42617 45343 54107 59696 85309 90010 69463 62081 45472 30333 36172 32912
9452C2912Q382k4195k4819J6568J3152J4200M0521k2531j1383J7087J5091J2471
$$ 32912 41294 17099 -7720 8848 22000 36200 76721 54190 42807 59894 74985 87456
9440H7456q101k1651l6666j7242j9214n247L566K0281K9504J3773j080M352l315
$$ 87456 79355 57704 21038 3796 -15418 -20665 -17099 3182 32686 46459 45379 49731 46416
9427D6416K7310L2943l6728l1808P619M3379R488m4260j8541J6382J2424o230
$$ 46416 73726 106669 69941 38133 45752 89131 98619 54359 35818 52200 64624 58394
9415E8394K125J8024j5991N447l9221j0331Q374J7092J3308P134J6823r044l5705
$$ 58394 60519 78543 62552 67999 28778 18447 26821 43913 57221 64355 81178 72134 36429
9402C6429L803K7000M848K6929J527j8852p459l819l803J460j2147k4565k2958
$$ 36429 40232 67232 72080 99009 100536 81684 74225 70406 66603 68063 55916 31351 8393
9389H393j6824K3961J0803M975L9492L839j3287j6100J479O258J8137O05m76k2173
$$ 8393 -8431 15530 26333 31308 70800 74639 61352 45252 46731 52989 71126 71731 71255 49082
9375D9082m8132n123L0524Q737K5275L286J2339J4315K118k7496p033Q172K1826
$$ 49082 950 -4173 26351 35088 60363 63649 75988 90303 92421 64925 57892 66064 87890
9362H7890M9496j4903m2135k7626P874p661J309l0947k095K9330J3276J9259k3138
$$ 87890 137386 122483 80348 52722 60596 52935 54244 23297 21202 50532 63808 83067 59929
9349E9929k4600j2529K0409j163l1801R262M956j4254j2981K6699M0002Q009P720
$$ 59929 35329 22800 43209 42046 10245 19507 24463 10209 -2772 23927 63929 71938 79658
9336G9658k9311k039J2612j647J0510n579k1777q953M0118J1244l55P055j1178
$$ 79658 50347 48308 60920 59273 69783 64204 42427 33474 73592 84836 84481 91536 80358
9323H0358k7579N143R634J0516R448Q109j0126r871K068j5613J108K0429j760
$$ 80358 52779 57922 67556 78072 87520 95629 85503 75632 77700 62087 63195 83624 81864
9310H1864j8277j9877k0331L095L5378K6090j1333J6346L5671k1757j9182j6090
$$ 81864 63587 43710 23379 26474 61852 87942 76609 92955 128626 106869 87687 71597
9298G1597l736L1319R055j5530J7784j2712q699J7825K0438J0288J3516j3220
$$ 71597 67861 99180 108235 92705 110489 97777 89078 106903 127341 137629 151145 137925
9286A37925l7335p665j3104O406o722j4658q574K3159L1838K8098j3127k6082
$$ 137925 100590 92925 79821 86227 79505 64847 56273 79432 111270 139368 126241 100159
9274A00159j3346J5952k2462k5343J2313J5711J8607M2343M379l4728K3573k0692
$$ 100159 86813 102765 80303 54960 67273 82984 101591 143934 148313 113585 137158 116466
9262A16466j5033j3350k9935p138M724M876P295M411K0467l310L7739J6576k5518
$$ 116466 101433 88083 58148 51010 55734 60610 67905 72316 92783 89473 127212 143788 118270
9249A18270r562K4942k0193l1036K15j885K0977J5857P462L4330K868l941n327
$$ 118270 108708 133650 113457 82421 82636 80751 101728 117585 125047 159377 162245 158304 152977
9236A52977k2418j0014J249j9992j1268l8063j8069M56N766o729R389L173J8791
$$ 152977 130559 120545 121794 101802 90534 52471 34402 34858 40624 33895 43284 46457 65248
9223F5248L1994q051j5505K5149R727j7901j6227M9202K11l081k2686j7500m991
$$ 65248 97242 89191 73686 98835 108562 90661 74434 123636 123847 120766 98080 80580 75589
9210G5589J6236M786k8551N255L9649Q373N943j7079J3214K9778r564J4012P110
$$ 75589 91825 96611 68060 73315 112964 121337 127280 110201 123415 153193 143629 157641 164751
9197A64751j5341k7575J0960j8672J0796J4859j764N719K0618N59l5519j3587
$$ 164751 149410 121835 132795 114123 124919 139778 138014 143733 164351 164910 129391 115804
9185A15804j8987M20k885J916P805K3026J8696q571j5804L2298K5478k2347j1619
$$ 115804 96817 97237 94352 96268 104073 127099 145795 137224 121420 153718 179196 156849 145230
9172A45230m371J5587M443N991l188p631O155J6295J0003o2j8484k9863j3268
$$ 145230 140859 156446 160889 166880 163692 156061 162216 178511 188514 188452 169968 140105 126837
9159A26837J7229K7909k6119k9284P600K3456q830o130j1366k387J8423Q38l64
$$ 126837 144066 171975 145856 116572 124172 147628 138798 132668 121302 118915 137338 138176 137812
9146A37812r23j1059J2418Q085k083Q007L3292J9292j1228l057k1751k2828K9539
$$ 137812 136889 125830 138248 146333 144250 152257 185549 204841 193613 190556 168805 145977 175516
9133A75516K7473L0581Q183l0755J385q898l0020J2666q79j7653j6610J1630K5060
$$ 175516 202989 233570 241753 210998 212383 203485 173465 186131 185252 167599 150989 162619 187679
9120A87679k885n050L478J7653K2030n82k5889j5614Q193j683O187k2046r143
$$ 187679 184794 179744 183222 200875 222905 222323 196434 180820 189013 187330 193517 171471 162328
9107A62328P449O78J652o665L6130j290k6456Q100J1098l697l7449J3742N634
$$ 162328 169777 170455 172107 165442 201572 200282 173826 181926 193024 189327 151878 165620 171254
9094A71254J6279l248J752J819R225L1855N507J5535j779j7517l0251k8747J0791
$$ 171254 187533 184285 186037 187856 197081 228936 234443 249978 248199 230682 200431 171684 182475
9081A82475J9083P146J2012J0898l81K70q902k8658r386Q601m398J6435J3776
$$ 182475 201558 208704 220716 231614 231233 231503 222601 193943 184557 193158 188760 205195 218971
9068B18971J2147p593j0118K121K0230J6716k5728J3894J3525M944l610m165k4731
$$ 218971 231118 223525 213407 215528 235758 252474 226746 240640 254165 259109 255499 251334 226603
9055B26603k522J46j8406l3459k4381M695Q195J894P680L030K1408M232J637q550
$$ 226603 224081 224227 205821 172362 147981 152676 160871 162765 170445 173475 194883 199115 200752 192202
9041A92202J0599J2726J1060Q456L4300p562n1729j9772J5500L0087J7927j8134
$$ 192202 202801 215527 226587 235043 269343 261781 210052 190280 205780 235867 253794 235660
9029B35660r855N014j6906j0618l4724M773l146K5554J7410R631J7203L0317r459
$$ 235660 225805 230819 213913 203295 168571 173344 170198 195752 213162 222793 239996 270313 260854
9016B60854j0927r689Q542o074j4456O330L414l6k3682l0613J5013o258J5615
$$ 260854 249927 240238 248780 242706 228250 234580 237994 237958 214276 183663 198676 192418 208033
9003B08033K6416J4155q959k0026J3051j1530N639l0402k0244J5164J5502L9145
$$ 208033 234449 248604 239645 219619 232670 221140 226779 196377 176133 191297 206799 245944
8991B45944R424l145J2127J5323K1700o623p1479k2051M8817L5115M198j5266
$$ 245944 255368 252223 264350 279673 301373 294750 223271 201220 250037 285152 289350 274084
8979B74084k6839K2359J1334J9639J9944k4836j28n98j0087k9714Q718J6320J4890
$$ 274084 247245 269604 280938 300577 320521 295685 295557 294959 284872 255158 263876 280196 295086
8966B95086J307k6542R414j1755k1923L1866L2430N244j0349r956j3283l0233
$$ 295086 296393 269851 279265 267510 245587 277453 309883 315127 304778 294822 281539 251306
8954B51306J4322J4296K1597M1890N1041j0985l0971j8249j011o743k8941L734
$$ 251306 265628 279924 301521 343411 394452 383467 352496 334247 333236 326493 297552 301286
8942C01286O265m347J6364K5587m617N68j4926m75P817J3518M542J3944J5401
$$ 301286 307551 303204 319568 345155 340538 341106 326180 325705 333522 347040 351582 365526 380927
8929C80927q35j7409K859K2184Q33m828k891o847j8237k2685k1298p983J1861
$$ 380927 380092 362683 365542 387726 388559 383731 380840 373993 355756 333071 311773 303790 315651
8916C15651M0506L9538J2363J885j5963r05P934J2503L7l828k4220J052K8317
$$ 315651 356157 395695 408058 409943 393980 393075 401009 413512 413549 409721 385501 386553 414870
8903D14870J1550J7827o956o065K201j1228k6226k654J5292L6514l208k7406k6858
$$ 414870 426420 444247 437291 431226 433427 422199 395973 393319 408611 445125 441917 414511 387653
8890C87653K2916J309L7485O999O112J7525p366q039K7835L4704p460m255j3571
$$ 387653 410569 411878 449363 456362 462474 479999 472633 464594 492429 527133 519673 515418 501847
8877E01847j3288l2672M1856M0392L0529j5738k2167k3801l2135K6001M1286R036
$$ 501847 488559 455887 497743 538135 568664 552926 530759 506958 474823 500824 542110 551146
8865E51146k3951J5587p0n477O462J7022L3152L370M9247L3363r696O022r408
$$ 551146 527195 542782 542712 537235 543697 560719 593871 597241 646488 679851 670155 676177 666769
8852F66769k2352O721j1278o232J0993J9890m626J2679J0996J8400J5048J544
$$ 666769 644417 651138 639860 633628 644621 664511 659885 672564 683560 701960 717008 718552
8840G18552q702J4097J1990L3851J4102N463Q667l57O142R366L7549L2982J2618
$$ 718552 709850 723947 735937 769788 783890 789353 798020 797663 803805 813171 850720 883702 896320
8827H96320j0342k5732J3861n93r437K253M5915K7747K9069k0451J9933K5031
$$ 896320 885978 860246 874107 873514 864077 866330 912245 939992 969061 948610 968543 993574
8815I93574L4637M0999J7336l0594j7575J1079M0291L0540k221J2713J7575K1992
$$ 993574 1028211 1069210 1086546 1055952 1038377 1049456 1089747 1120287 1118066 1130779 1148354 1170346
8803A170346K0351K2857L6278J1025K1547K0369k0697J3378M710K2909J9098L2071
$$ 1170346 1190697 1213554 1249832 1260857 1282404 1302773 1282076 1295454 1300164 1323073 1342171 1374242
8791A374242K5398K9976J5033L3082N331K9994L7669N1360K9376K3723p178M9395
$$ 1374242 1399640 1429616 1444649 1477731 1483062 1513056 1550725 1602085 1631461 1655184 1648006 1697401
8779A697401K9942M0899M6885N4430L0050N9868N5296N2348L9892L5125K1569
$$ 1697401 1727343 1768242 1815127 1869557 1899607 1959475 2014771 2067119 2107011 2142136 2163705
8768B163705J3844P702K3375P3460Q3301N8895N9962L5827J3366N2753P4902O9704
$$ 2163705 2177549 2185251 2208626 2282086 2365387 2424282 2484244 2520071 2533437 2586190 2661092 2730796
8756B730796P2469M2441M7614P4043N8494O5146R0860N9763P1066Q9956R7046
$$ 2730796 2803265 2845706 2893320 2967363 3025857 3091003 3181863 3241626 3312692 3402648 3499694
8745C499694N5278P1545J08475R6841R3006R0111Q0191Q9034J09358J18337J32676
$$ 3499694 3554972 3626517 3734992 3831833 3924839 4014950 4095141 4184175 4293533 4411870 4544546
8734D544546J32977J29617J35372J27733J33714J58101J47447J64606J72033J54008
$$ 4544546 4677523 4807140 4942512 5070245 5203959 5362060 5509507 5674113 5846146 6000154
8724F000154J60626J93463J97667J58553J64331J88451K05417K51254K50395K51290
$$ 6000154 6160780 6354243 6551910 6710463 6874794 7063245 7268662 7519916 7770311 8021601
8714H021601K46888K46246K46746K84973K65502K43413K76436L10848L12105L19115
$$ 8021601 8268489 8514735 8761481 9046454 9311956 9555369 9831805 10142653 10454758 10773873
8704A0773873L05589L03348L07547L33830L21591L24611L16356L22665K87465
$$ 10773873 11079462 11382810 11690357 12024187 12345778 12670389 12986745 13309410 13596875
8695A3596875L02847L19541K94570K82340K63088K40929K08151J97289K03565
$$ 13596875 13899722 14219263 14513833 14796173 15059261 15300190 15508341 15705630 15909195
8686A5909195J71938J52165J38918J07420P2050M0539j0161j8427j4020o6935
$$ 15909195 16081133 16233298 16372216 16479636 16551686 16592225 16582064 16563637 16549617 16482682
8676A6482682j42205j58487j44293j54506j72956k03231k49450k57865k92499
$$ 16482682 16340477 16181990 16037697 15883191 15710235 15507004 15257554 14999689 14707190
8667A4707190l18812l28541l20121k55047k75380k94366l17733l41070l28737
$$ 14707190 14388378 14059837 13739716 13484669 13209289 12914923 12597190 12256120 11927383
8658A1927383l20277l06625k74828k91525l02937k99193k71283k79732k73333
$$ 11927383 11607106 11300481 11025653 10734128 10431191 10131998 9860715 9580983 9307650
8649I307650k87836k91172k39567k30282k62478k46534k22228k23332k07482j98816
$$ 9307650 9019814 8728642 8489075 8258793 7996315 7749781 7527553 7304221 7096739 6897923
8639F897923j78957j87413k02276j89209j52216j42286j61541j30165j03177j54302
$$ 6897923 6718966 6531553 6329277 6140068 5987852 5845566 5684025 5553860 5450683 5296381
8629E296381j58576j80060j49361r1241r3054j65414j55023j19461r2737r1710
$$ 5296381 5137805 4957745 4808384 4717143 4624089 4458675 4303652 4184191 4091454 3999744
8619C999744j12641q8485r4926p3700o6775r4779o9310q3532o1060q0107m7145
$$ 3999744 3887103 3798618 3703692 3629992 3563217 3468438 3399128 3315596 3254536 3174429 3127284
8608C127284l9307r0009p6606l8939m2751n4743p5811o1354m9702q6912q7782
$$ 3127284 3087977 2997968 2921362 2882423 2839672 2784929 2709118 2647764 2598062 2511150 2423368
8597B423368K546l2078o3371o4142n9143k5330o1377o9829n8473l5899m8672o2181
$$ 2423368 2425914 2393836 2330465 2266323 2207180 2181850 2120473 2050644 1992171 1956272 1907600 1845419
8585A845419l6499J7031j2587n7503l2090K2330k1620k8026l1211n2470o5801
$$ 1845419 1808920 1825951 1813364 1755861 1723771 1746101 1724481 1696455 1665244 1612774 1546973
8574A546973j1018l9129p2719j7298L193l0079m0282J434o703k6521j2587K0748
$$ 1546973 1535955 1496826 1424107 1406809 1410002 1379923 1339641 1341075 1334372 1307851 1295264 1316012
8562A316012o486k1293l3707m3328l7111k1784l0951k6650l2481M980M993k2184
$$ 1316012 1309526 1288233 1254526 1211198 1174087 1152303 1121352 1094702 1062221 1067201 1072194 1050010
8550A050010k9182o964l0246o085j1420k2873n312k154K1179o411o3503k0059
$$ 1050010 1020828 1013864 983618 977533 966113 943240 937928 935774 956953 950542 887039 866980
8538H66980k4449n059L387n119J4998j846j5987J1576J0191k0872l2969j8238
$$ 866980 842531 837472 840859 835740 850738 848892 832905 844481 854672 833800 800831 782593
8526G82593m3032l0233o20k3925j0483R79j0305k6713J3312K3622P013j0767N93
$$ 782593 739561 709328 708708 684783 674300 675279 664974 638261 651573 675195 682208 671441 672034
8513F72034L144l0331l299N240k4397j5154l4480J3433o590j9843r804o392k722
$$ 672034 675178 644847 641548 646788 622391 607237 572757 586190 579600 559757 549953 543561 540839
8500E40839l953j6540L897r756J2159J5588J6858pJ1589R059k554l0436l9311
$$ 540839 536886 520346 524243 514487 526646 542234 559092 559085 570674 579733 577179 546743 507432
8487E07432j0146K3644l6627k7503l65K1870J738n131j8942l1303L16j4191K300
$$ 507432 497286 520930 484303 456800 456435 478305 480043 474912 455970 424667 424983 410792 413092
8474D13092J8927J5072O340J7363j1032j8766j7187k6289L153j2181j848M487
$$ 413092 432019 447091 453431 470794 459762 440996 423809 397520 400673 388492 386644 391131
8462C91131k404k4869j7942K8939J3263j1507j4081L817O483j5124n62j5122M659
$$ 391131 388727 363858 345916 374855 388118 376611 362530 366347 372830 357706 357144 342022 346681
8449C46681l106O238q889o135k099j5329j8387L950m38k1587J2113J0188K640
$$ 346681 343575 349813 340924 334789 332690 317361 298974 302924 302486 280899 293012 303200 305840
8436C05840J2851J6436K4177r210m1824l0882L173L4846J771J4358q351j5845
$$ 305840 318691 335127 359304 350094 308270 277388 280561 315407 317178 331536 323185 307340
8424C07340Q521r355l6129J8710L354k0198l6403j8957j400p597N658L4139K7462
$$ 307340 315861 306506 270377 289087 292441 272243 235840 216883 215483 207886 213544 247683 275145
8411B75145o606K0477J3179O673k9980k1691j3084p398p262K0656p056n318n4
$$ 275145 268539 289016 302195 308868 278888 257197 244113 236715 229453 250109 243053 237735 237681
8398B37681j3388Q957J4567p146O316Q680j5261l1665j1178K5295P850J3l580
$$ 237681 224293 233250 247817 240671 246987 255667 240406 208741 197563 222858 230708 230721 227141
8385B27141M076J1924k1117j7330J2274k9261P432j0861j1901K7946L1676Q234
$$ 227141 231217 243141 222024 204694 216968 187707 195139 184278 172377 200323 231999 240233
8373B40233K679j6536m2267j3032j522L6186K173O838J879k0762m8312j2356J1795
$$ 240233 242912 226376 184109 171077 169555 205741 207914 214752 216631 195869 147557 135201 146996
8360A46996K3907K0563P289K7129Q318j120J3319P779L88K844n221k4906k8376
$$ 146996 170903 191466 198755 225884 234202 233082 246401 254180 254568 257412 252191 227285 198909
8347A98909j8118qj4308j3561O089J7845j6055J901O463O543J9960j3788j0976
$$ 198909 180791 180783 166475 152914 159003 176848 160793 162694 169157 175700 195660 181872 170896
8334A70896L991j5160l1351N474K1010K6923l121Q760K298J0663J3225L103k9694
$$ 170896 174887 159727 128376 133850 154860 181783 178662 187422 189720 200383 213608 216711 187017
8321A87017k7402k4837O341L4263j8123l2727L103L3532K53J604p864J7907K3484
$$ 187017 159615 134778 141119 175382 157259 124532 127635 161167 161420 163024 155160 173067 196551
8308A96551O394l7006l6923j6938J1278K0838J0040m7206q191J2446j4993j5683
$$ 196551 202945 165939 129016 112078 123356 144194 154234 107028 98837 111283 96290 80607
8296H0607K3267J8351K235K5229R773p064m3868k984l041j7924J3953j0760j7242
$$ 80607 103874 122225 124460 149689 159462 152398 108530 105546 102505 84581 98534 87774 70532
8283G0532J386K1402j0389J449m525L3939N742P767K4096j0k4177K1152K2357
$$ 70532 71918 93320 82931 84380 79855 113794 119536 127303 151399 151389 127212 148364 170721
8270A70721r541j0364j4852l1232k1188j3289k470J6156K1280J0640l15J1445
$$ 170721 161180 150816 135964 104732 83544 70255 67785 83941 105221 115861 115546 126991
8258A26991O59K753J7725o515k6676j8433J3306J9407l817L646k1657j8832r396
$$ 126991 127650 130403 148128 141613 114937 96504 109810 129217 125400 129046 107389 88557 79161
8245G9161J8769Q686K419p484k0914j73j7373j5786R421J8142k43J9065P772Q273
$$ 79161 97930 106616 109035 101551 80637 80464 63091 47305 56726 74868 74625 93690 101462 109735
8231A09735j4429m230j9651k1756k5846l0408M0191K5820J6957J7640J3345N308
$$ 109735 95306 91076 71425 49669 23823 -6585 33606 59426 76383 94023 107368 112676
8219A12676l3283k4077L2290J0429J719k3198j3487O509O18P449n274j7711J4503
$$ 112676 79393 55316 87606 98035 99754 76556 63069 69578 70196 77645 72371 54660 69163
8206F9163M2538J5233K1921k3036m3506k4581k7225O616L3686J4439O783R81J2087
$$ 69163 111701 126934 148855 125819 82313 57732 30507 37123 70809 85248 92031 93012 105099
8193A05099j2757k5962K703L239q65l682o281r964J5831L543l6513K61J6375k0574
$$ 105099 92342 66380 69083 72322 71457 67775 61494 51530 67361 70904 34391 34652 51027 30453
8179C0453J203K6180j85k5088k6937L0241k6276J1023L4413N762K106l1619K4715
$$ 30453 31656 57836 57651 32563 5626 35867 9591 20614 55027 60789 62895 31276 55991
8166E5991M098K908K1197L2732k1049p361M668j7181o839K343K542j4813M915
$$ 55991 60089 62997 84194 116926 95877 88516 93184 76003 69164 71507 74049 59236 64151
8153F4151j6111J0225K3039j1900j6215j5668r762j827o511k373O187J3063j8337
$$ 64151 48040 58265 81304 69404 53189 37521 27759 25932 19421 17048 23235 36298 17961
8140A7961j9171P405m9L2265P824j373J295k9142j4342M5988K018j2776p796m9307
$$ 17961 -1210 6195 6146 38411 46235 44862 46157 17015 2673 48661 50679 37903 30107 -19200
8126a9200o020k6200K7112L9344J1978l5300k9858K6909L0242J8174J1335K192
$$ -19200 -25220 -51420 -24308 15036 27014 -8286 -38144 -11235 19007 37181 48516 50708
8114E0708o725J1774n288p069k9068j8713L3017L0722K4793R313k034k3294M586
$$ 50708 43983 55757 50469 43400 14332 -4381 28636 59358 84151 93464 91430 68136 72722
8101G2722j0200k2913J663n539k288K4682k8777m2296k9355J6026K7880J0137
$$ 72722 62522 39609 41272 35733 33445 58127 29350 -12946 -42301 -26275 1605 11742
8089A1742j4993k264K2523K0747O685r630R8J5808j3091P250p895j8674p013N1126
$$ 11742 -3251 -5515 17008 37755 44440 34810 34908 50716 37625 44875 36980 18306 11293 62419
8075F2419K0103j0058j3563J4062k5245p237r7k1565j185P698q67J7164J4718
$$ 62419 82522 72464 58901 72963 47718 40481 40384 18819 17634 25332 24465 41629 56347
8062E6347j1524l702J4986k1234j8712J9952K6935j9122N656J6132r031k1258
$$ 56347 44823 41121 56107 34873 16161 36113 63048 43926 49582 65714 56683 35425
8050C5425M456J7736j3477k5720L2828K5524j1508J6540j9214J6286L1355q467
$$ 35425 39881 57617 44140 18420 51248 76772 65264 81804 62590 78876 110231 101764
8038A01764k2840L947M7m1527J6165N0061j6588n3317l4635L0390J6792j9382
$$ 101764 78924 82871 82918 41391 57556 107617 91029 37712 3077 33467 50259 30877
8026C0877j6213N022K4661j0185o686j0298L2321K7914R777k2810k833k146k9362
$$ 30877 14664 19686 44347 34162 27476 17178 49499 77413 87190 64380 61547 59401 30039
8013C0039j1259P964O824j8007J2360r869J6042K240o080j694K0672l6084l795
$$ 30039 18780 26744 33568 15561 27921 18052 34094 36334 30254 28560 49232 13148 9353
8000I353K4139J2018Q327j242j0892k0136K0105K71n404L759l6822l2029j7356
$$ 9353 33492 45510 53837 52595 41703 21567 41672 41943 36539 40298 3476 -28553 -45909
7987d5909Q614M0642J8075K6611J1356k079k1645k0795k32o369j719K2554N885
$$ -45909 -37295 3347 21422 48033 59389 57310 35665 14870 14638 8269 6550 29104 34989
7974C4989p565k668k7693l622k441P026j714M3767K446k2976q387J3641J2867
$$ 34989 27424 24756 -2937 -6559 -9000 -1974 -3688 40079 42525 19549 11162 24803 37670
7961C7670k6236R207J6439Q305j266O762q650j9144j1493O616k469j8435j2778
$$ 37670 11434 20641 37080 45385 44119 50881 42231 23087 11594 18210 15741 -2694 -15472
7948a5472k3025K6412j6049j3880M8269K3695r883r754k1213J5749L8406L6142
$$ -15472 -38497 -12085 -28134 -42014 6255 29950 20067 10313 -10900 4849 43255 79397
7936G9397o184k0707O75l562k0035j7829L5653M978n402J5330K4159M500l3290
$$ 79397 73213 52506 53181 49619 29584 11755 47408 52386 46984 62314 86473 90973 57683
7923E7683p353j4307J61L0860L94k9998k3363R108J7170j576L022l182j2186j8673
$$ 57683 50330 36023 36184 67044 67438 37440 14077 23185 40355 38779 41801 38619 26433 7760
7909G760M210j1260n926L1615P991O38p434J3996J8103N772P175J8811k4004o4651
$$ 7760 11970 710 -5216 26399 34390 35028 27594 41590 59693 65465 72640 91451 67447 2796
7895B796m2713j0909K4480L5544J6577l775j8909o043J6808J7189k5792j3134
$$ 2796 -39917 -50826 -26346 9198 25775 22000 3091 -2952 13856 31045 5253 -7881
7883g881J1623J1998M383N920P734L44j6900j1318J3326N088J1165J2334L1846
$$ -7881 3742 15740 20123 26043 33777 34121 17221 5903 19229 24317 35482 47816 79662
7870G9662j4074k3794l783j3272O891P588K0999L874L087j0742j3437k0397m484
$$ 79662 65588 41794 38011 24739 31630 39218 60217 64091 67178 56436 42999 22602 18118
7857A8118m499Q501J497n475r158j1997r212j0390J1252K4513J4395l341Q181
$$ 18118 13619 22120 23617 18142 8984 -3013 -12225 -22615 -11363 13150 27545 24204 32385
7844C2385J4142J5879j2854l3421k9046M3936J5823l8731n240j2701L2796K5607
$$ 32385 46527 62406 49552 16131 -12915 31021 46844 8113 2873 -9828 22968 48575
7832D8575j7348j4528q561k4149k1398j6480R818j3930L0049L8970O90j393R017
$$ 48575 31227 16699 8138 -16011 -37409 -53889 -44071 -58001 -27952 11018 11708 10315 19332
7819A9332Q796Q64K3534j881J7475k073m0465k2326o789J9295j6852k8070m191
$$ 19332 28128 28992 52526 50645 68120 66047 25582 3256 -3533 15762 -1090 -29160 -33351
7806c3351K1299K4896P91j4650n18P333K4838J3461J1969j3940j0495l775r566
$$ -33351 -12052 12844 13635 -1015 -1533 5800 30638 44099 56068 42128 31633 27858 18292
7793A8292R691j5207r719J9677K536P065k4386q648n75k941n775j524J396j377
$$ 18292 27983 12776 3057 22734 25270 32335 7949 -699 -1274 -4215 -9990 -11514 -10118 -11495
7779a1495M71J2556K1080j4811R69M497M70J0865J938k2272j7878K9418K7962
$$ -11495 -11024 1532 22612 7801 8770 13267 13737 24602 26540 4268 -13610 15808 43770
7766D3770J1262k9274N70k5979j1618K4181K0398q866J03J5688j2545O242q47
$$ 43770 55032 25758 26328 349 -11269 12912 33310 24444 24547 40235 27690 33932 33085
7753C3085K6381j421l3836l7762q168k565q984j5552J8309K0468k381k1816K4893
$$ 33085 59466 58045 24209 -13553 -21721 -24286 -33270 -48822 -30513 -10045 -12426 -34242 -9349
7740i349j722K1758P820L903J6128l520Q948j3426j3226m0314r736J3545O483
$$ -9349 -11071 10687 18507 22410 38538 35018 43966 30540 17314 -23000 -32736 -19191 -12708
7727a2708p393M396K5097l3094p076J2001k823K7219l175k9293k0295L2547K2074
$$ -12708 -20101 -15705 9392 -23702 -30778 -18777 -21600 5619 2444 -26849 -47144 -14597 7477
7714G477Q935K0955k215l940O753L1430K201j9247n3385L941P251J3290r68n672
$$ 7477 16412 37367 35152 31212 37965 69395 71596 52349 -1036 2905 10156 23446 22478 16806
7700A6806o309k325j4723j8122r574K4104L3583j4890k1511J5215Q563o058l1882
$$ 16806 10497 8172 -6551 -24673 -34247 -10143 23440 8550 -12961 2254 10817 4759 -27123
7687b7123j107J5946Q093L6799J7519j6590j5790p588k1008J8887j8100L274J0781
$$ -27123 -28230 -12284 -4191 32608 50127 33537 17747 10159 -10849 8038 -10062 -6788 3993
7674C993m325j1977J2958j0023l864P234O322L3084j5630q45K2126k5036l6137
$$ 3993 -332 -12309 649 -9374 -13238 -6004 318 33402 17772 16927 39053 14017 -22120
7661b2120l6182M18J4394O925k2621J0597L5889j2411k2873N5m494L4422K3013
$$ -22120 -58302 -57884 -43490 -36565 -59186 -48589 -12700 -25111 -47984 -47929 -52423 -18001 5012
7648E012P916K486n705j7042k6112O319J4355j7927J0952L9408l1962j7872P693
$$ 5012 12928 15414 9709 -7333 -33445 -27126 -12771 -30698 -19746 19662 -12300 -30172 -22479
7635b2479Q487Q461J8600j6434l9329J1665O900l3724l61J4450K2093l981r448
$$ -22479 -13992 -5531 13069 -3365 -42694 -31029 -24129 -57853 -58214 -43764 -21671 -25652 -35100
7622c5100J0982J2100K3147M385O107J2400j3549l235Q691m403J884K746J0965
$$ -35100 -24118 -12018 11129 15514 21621 34021 20472 17237 25928 21525 23409 26155 37120
7609C7120k589k0991j498K356j8220R40p654k8450L1930J4852j9543m032m950
$$ 37120 34531 13540 12042 14398 -3822 -2882 -10536 -38986 -7056 7796 -11747 -15779 -20729
7596b0729o420j9852J075l961M8608J0744m841q856q294J3542J683R180K3215
$$ -20729 -27149 -47001 -45926 -49887 -1279 9465 4624 -4232 -12526 1016 2699 11879 35094
7583C5094K331m0205K2473j4037R553m891k7056q50J9638M1300o969n2301q318
$$ 35094 37425 -2780 19693 5656 15209 10318 -16738 -17588 2050 43350 36381 -15920 -24238
7570b4238j02K1884n458Kn118k1377L097O2835M626k1759Q564J729J3839r704
$$ -24238 -24340 -2456 -7914 -7912 -13030 -34407 -31310 31525 36151 14392 22956 24685 38524 28820
7556B8820j3752j8487j1377l8499p662K4060K4914j6661l520J5312Q011l452q754
$$ 28820 15068 -3419 -14796 -53295 -60957 -36897 -11983 -28644 -32164 -16852 -8841 -12293 -21047
7543b1047k0852n257J5351J1684l3524q728J4942j9764k3746O283L0401K9487
$$ -21047 -41899 -47156 -31805 -20121 -53645 -62373 -47431 -67195 -90941 -84658 -54257 -24770
7531b4770K05p570J4584L8686p875M817K149k9461l1352p811R648K5460J8681
$$ -24770 -24565 -32135 -17551 21135 13260 18077 20226 -9235 -40587 -48398 -38750 -13290 5391
7518E391M616j0111l5190j8976J0547q552K4358O421p932K1975L0003K264M32
$$ 5391 10007 -104 -35294 -54270 -43723 -52275 -27917 -21496 -29428 -7453 22550 24814 25246
7505B5246j0855N265k7984j9174J9299j4331J3952K3984L5979J4273k8407l9718
$$ 25246 14391 19656 -8328 -27502 -8203 -22534 -8582 15402 51381 65654 37247 -2471
7493b471J138R908k5599J7735M377j4321n254O986J785r142k9050J5285K1193
$$ -2471 -1333 8575 -17024 711 5088 -9233 -14487 -7501 -5716 -14858 -43908 -28623 -7430
7480g430k7719j006M257N162K5919M5193J7111q857l7416k8100J342n255O258
$$ -7430 -35149 -36155 -31898 -26736 -817 44376 61487 52630 15214 -12886 -11544 -16799 -10541
7467a0541L734J5215k2023J8013O760k4728q541K3003P892O225p217j5360j3030
$$ -10541 -6807 8408 -13615 4398 11158 -13570 -22111 892 8784 15009 7792 -7568 -20598
7454b0598k6390J1747J0756k638j3654M128k1506K6669N0815Q244k5371k472q989
$$ -20598 -46988 -35241 -24485 -27123 -40777 -36649 -58155 -31486 19329 27573 2202 -270 -9259
7441i259L1989K0210m1844l4154m258M150k22j7643k653M2353J9370o219k1406
$$ -9259 22730 42940 1096 -33058 -37316 -33166 -33388 -51031 -53684 -11331 8039 1820 -19586
7428a9586P032J0308k0840j59K5567O353j7844o903O355J435K2548L1585k0557
$$ -19586 -12554 -2246 -23086 -23245 2322 8675 -9169 -16072 -9717 -8282 14266 45851 25294
7415B5294q124j0450l6663k1285K995J9902J1323L5761L1854r800j7205N964k1525
$$ 25294 17170 6720 -29943 -51228 -48233 -28331 -17008 18753 50607 40807 23602 29566 8041
7402H041j1835m411R626j3299m2902K652K4906R043J1331r674j1139mJ6661K3220
$$ 8041 -3794 -8205 1421 -11878 -54780 -52128 -27222 -18179 -6848 -16522 -27661 -27665 -11004 12216
7388A2216k0175o717J0286k162K8466j2580m339j206j7860J4547M521J0602K6191
$$ 12216 -7959 -14676 -4390 -6552 21914 9334 4995 3789 -14071 476 4997 15599 41790
7375D1790o4l936j6171L843j8445k3324K0129M473j5428j3477j8694j975L1690
$$ 41790 41726 37790 21619 25462 7017 -16307 3822 8295 -7133 -20610 -39304 -41279 -9589
7362i589P440p500r527K0388j14J2853j185j710N798L69P463J1528q823j9702
$$ -9589 -2149 -9649 -19176 1212 1098 13951 12766 11056 16854 17223 24686 36214 27391 7689
7348G689k2314p754n778M433j4770r410K0366J3367K0452o370J0694l672j2955
$$ 7689 -14625 -22379 -28157 -23724 -38494 -47904 -27538 -14171 6281 -89 10605 6933 -6022
7335f022j0860J5098j5914O883l268k5152J6244K5321K3639o40k2703l7720k2784
$$ -6022 -16882 -1784 -17698 -10815 -14083 -39235 -22991 2330 25969 25329 2626 -35094 -57878
7322e7878L427L0364j505k139n252K2820J1561p580l1449m376L8865K2716J7059
$$ -57878 -54451 -24087 -25592 -27731 -32983 -10163 1398 -6182 -37631 -42007 -3142 19574 36633
7309C6633L0990K2180j672k2369k6883K145K4565J2308k9982k5554j9143L039
$$ 36633 67623 89803 88131 65762 38879 41024 65589 77897 47915 22361 3218 6257
7297F257P875o857J3776J5119j9668k6263K5395R168j7885K81j4420J8656j1132
$$ 6257 14132 7275 21051 36170 16502 -9761 15634 24802 6917 7198 -7222 11434 302
7284C02j6467k5321j540M0859M1742k1172l4904k0718j4622K4173K1581q545j1731
$$ 302 -16165 -41486 -43026 -2167 39575 18403 -16501 -37219 -51841 -27668 -6087 -14632 -26363
7271b6363J0759K1819J8360k0032p323o323k0070k0848Q294K8312K394o587k205
$$ -26363 -15604 6215 24575 4543 -2780 -9103 -29173 -50021 -41727 -13415 -11021 -17608 -19813
7258a9813j3775M077J5957L8717j5950r693N941m5358n88L5604J8711P564N749
$$ -19813 -33588 -29511 -13554 25163 9213 -480 5461 -39897 -40485 -4881 13830 21394 27143
7245B7143l810l3124p543j916K609j2731K9579K5356J1140J1096k0591l4176O293
$$ 27143 23333 -9791 -17334 -19250 -16641 -29372 207 25563 36703 47799 27208 -6968 -675
7232f75L3306J1977k2449j0981K7024p81r592j2427j9153K5522K0528j7987k9066
$$ -675 32631 44608 22159 11178 38202 37421 27829 15402 -3751 21771 42299 24312 -4754
7219d754J6499K543j9692j1862m507N07q696K1414R102O167K7478P70k3592n368
$$ -4754 11745 14288 -5404 -17266 -21773 -21266 -29962 -8548 554 6721 34199 34969 11377 6009
7205F009j0891k096O027N642k1357j8869R466M3525J0809k9301k2660o064J4343
$$ 6009 -4882 -6978 -951 4691 -16666 -35535 -26069 17456 28265 -1036 -23696 -29760 -15417
7192a5417m227j3902K6453m139K8403l948K592m998j0858J814K3565k3185P822
$$ -15417 -19644 -33546 -7093 -11232 17171 13223 15815 10817 -41 1773 25338 2153 9975
7179I975N025k815o565j6580O852K2747Q769j2864N28j6353p951j908J9362Q420
$$ 9975 15000 12185 5620 -10960 -4108 18639 27408 14544 15072 -1281 -9232 -11140 8222 16642
7165A6642L466J9792r836l1556l1730o358J8824Q31j8696N833K2088L397k6119
$$ 16642 20108 39900 30064 -1492 -33222 -39580 -20756 -19925 -38621 -32788 -10700 -7303 -33422
7152c3422J8394J3999J616k0653q157J6288j6613r159J8633J5843j3405R472p60
$$ -33422 -15028 -1029 587 -20066 -28223 -11935 -28548 -37707 -19074 -3231 -16636 -7164 -7924
7139g924L015k7023j3965J4221J2481M364K0440K030k7281j7211Q996K2409J4468
$$ -7924 -4909 -31932 -45897 -31676 -19195 -14831 5609 7639 -19642 -36853 -27857 -5448 9020
7126I020K4762r906m8132l0410j1506M528L112L0247K6559K4175q865k7424k867
$$ 9020 33782 23876 -24256 -54666 -66172 -61644 -58532 -28285 -1726 22449 13584 -13840 -16707
7113a6707N696K1492q218j2131j8634l46r524N268L3069r541J4633j4911l917
$$ -16707 -11011 10481 2263 -9868 -28502 -28848 -38372 -33104 -35 -9576 5057 -9854 -13771
7100a3771K3670p132j4661L7714J4073k9951k4809k6671P36L9850K3960L316n33
$$ -13771 9899 2767 -11894 25820 39893 9942 -14867 -41538 -40802 -952 23008 26324 25791
7087B5791l488j2319l3752p92J3090J1697K0406o081l6374j831J67K3489q628
$$ 25791 22303 9984 -23768 -24560 -11470 227 20633 14552 -21822 -23653 -23486 3 -8625
7074h625J6607K921j9156k2213j1775n255K4714J5883N227j7092O809J0799K0023
$$ -8625 7982 10903 -8253 -30466 -42241 -47496 -22782 -6899 -1672 -18764 -11955 -1156 18867
7061A8867r579m111K8869j6514l2516L5246J1708p032l2322K915n537k2583J7063
$$ 18867 9288 5177 34046 17532 -14984 20262 31970 24938 -7384 -4469 -10006 -32589 -15526
7048a5526L0660J3029m499p421J566l3212n163L3366J8535j2989l0032j5121J6246
$$ -15526 15134 28163 23664 16243 17809 -15403 -20566 12800 31335 18346 -11686 -26807 -10561
7035a0561l4392j6011p690m599J8795K1386j3459j0853L3617K8205J4065j100
$$ -10561 -44953 -60964 -68654 -73253 -54458 -33072 -46531 -57384 -23767 4438 18503 17403
7023A7403l6430j1819L379K3236K6672j8961M989j054j6734o581J2900J0125q226
$$ 17403 -19027 -30846 -27467 -4231 22441 3480 8469 7415 -9319 -15900 -3000 7125 -1101
7010a101j0522n613J1641o862j0630O699L033n246k9402J7937J7633J3504Q673
$$ -1101 -11623 -17236 -5595 -12457 -23087 -16388 -13355 -18601 -48003 -30066 -12433 1071 9744
6997I744l1355J873J3709j0688K29j2510q284K6977K0290j3811l8467l459K5550
$$ 9744 -21611 -19738 -6029 -16717 -16488 -28998 -37282 -10305 9985 -3826 -42293 -45752 -20202
6984b0202K954k5518j3616K1387L2946J5614M695o405n0588l7353K2911K2311
$$ -20202 -17248 -42766 -56382 -34995 -2049 13565 18260 11855 -38733 -76086 -53175 -30864
6972c0864k175J635J2859K7632r032r828l6533q690K9855j5586N495M5694J0844
$$ -30864 -33039 -31404 -18545 9087 55 -9773 -46306 -54996 -25141 -40727 -35232 10462 21306
6959B1306j3845j4963J795K5111J4908n941m573k046k9118j6249j3633K2332J5266
$$ 21306 7461 -7502 -5707 19404 34312 28371 23798 21752 -7366 -23615 -37248 -14916 350
6946C50j1274n500J241K3450J2146k1433N934P585N277j5503j688J6443k829l0597
$$ 350 -10924 -16424 -15183 8267 20413 -1020 4914 12499 17776 2273 585 17028 14199 -16398
6932a6398o432K8485O57l9810k7256L2151O5483M7851J7136m6240m3126K4784
$$ -16398 -22830 5655 6312 -33498 -60754 -28603 36880 84731 101867 55627 12501 37285
6920C7285R99l2363l6029K6023J5819n207j4405j0097K345l6638j0637M0955P374
$$ 37285 38284 5921 -30108 -4085 11734 6527 -7878 -17975 -15630 -52268 -62905 -21950 -14576
6907a4576M817r131R383k351O041L402n74J6662j2473j0829k342n54K0950j4269
$$ -14576 -9759 -18890 -9507 -11858 -5817 -2415 -2989 13673 1200 -9629 -11971 -12525 8425 -5844
6893e844J5223m629j517m37J8648k654O576j5167k7033j4108m1812P303N063L517
$$ -5844 9379 4750 3233 2796 21444 18790 25366 10199 -16834 -30942 -72754 -65451 -60388 -56871
6879e6871O759K0395N413O46L926J7222J741l115L039j860M1574q747m126M561
$$ -56871 -50112 -29717 -24304 -23658 -19732 -2510 -769 -3884 -845 -2705 38869 30122 25996 30557
6865C0557J1028j5312k9967k6748k1174L0055L6222K2899J0497j7287j5143l7794
$$ 30557 41585 26273 -3694 -30442 -51616 -21561 14661 37560 48057 30770 15627 -22167
6853b2167l6907n094J9865P821J2548K506J6336K5854K6654r623n029p922n954
$$ -22167 -59074 -64168 -44303 -36482 -23934 -21428 -5092 20762 47416 37793 32764 24842 18888
6840A8888J5506l095n106k3503Q33J1399n186k527q54j5001j7840K5123K3999
$$ 18888 34394 31299 26193 2690 3523 14922 9736 7209 6355 -8646 -26486 -1363 22636
6827B2636k3171o492P568p828K2866k4671q588K2217J9734O91O796j2984j5686
$$ 22636 -535 -7027 541 -7287 15579 -9092 -17680 4537 24271 24962 31758 18774 3088
6814C088o762m804K512q8p845O572J6618M685k5659j0315J6840j7079Q06J3412
$$ 3088 -3674 -8478 -5966 -6054 -13899 -7327 9291 13976 -11683 -21998 -5158 -22237 -21431 -8019
6800h019p072j7306J5098l79j021J5530K9243k2552k573k731O670L4153K4599
$$ -8019 -15091 -32397 -17299 -17678 -18699 -3169 26074 3522 949 -1782 4888 39041 63640
6787F3640n3733k1880o133m259J0888k355n590q62J5841K215K0077j4975k5596
$$ 63640 9907 -11973 -18106 -22365 -11477 -13832 -19422 -20284 -4443 -2228 17849 2874 -22722
6774b2722J997K1592O962L024L1291N755j6002j2910r482k194k7968N47K2543
$$ -22722 -20725 867 7829 10853 42144 47899 31897 18987 9505 7311 -20657 -20110 2433
6761B433j0738k555J3858k259K5807J4578k5511k4360K391j6861q120J0337J8392
$$ 2433 -8305 -10860 2998 739 26546 41124 15613 -8747 -6356 -23217 -31337 -21000 -2608
6748b608P926p650N762K1169M319j0565J2991L685j0005j2808k3793j6039K2021
$$ -2608 5318 -2332 3430 24599 28918 18353 31344 35029 25024 12216 -11577 -27616 -5595
6735e595L8626l6189l5065K1780J3279j5705j2121K855J9757k2062o022J1815
$$ -5595 33031 -3158 -38223 -16443 -3164 -18869 -30990 -28135 -8378 -30440 -36462 -24647
6723b4647j8336J1480L963J0213j3785j5193P85J1485J297j0225j1977K0178L3340
$$ -24647 -42983 -31503 -27540 -17327 -31112 -46305 -45520 -34035 -32738 -42963 -54940 -34762 -1422
6710a422j7434k2929J9027J7519r238j318J2081Q55k4587k0674P436N0113j4369
$$ -1422 -18856 -41785 -22758 -5239 -14477 -15795 -3714 -2859 -27446 -48120 -40684 9429 -4940
6697d940j4403J2050j295L753l216j2117k4019R949K2573J6383J4423k7005J0773
$$ -4940 -19343 -7293 -8588 -4835 -8051 -20168 -44187 -34238 -11665 4718 19141 -7864 2909
6684B909o029K48j8914N984L5405J3412M333j8064r279J384m3824k0671J6086
$$ 2909 -3120 -2872 -21786 -15802 19603 33015 37348 19284 10005 11389 -32435 -53106 -37020
6671c7020O45K6220L0023q219k7487K3804k1328j2616J3718k3627k0530J7642
$$ -37020 -36375 -10155 19868 11649 -15838 7966 -13362 -25978 -12260 -35887 -56417 -38775
6659c8775K9047K046l15p920K0334n931k4291j6062k545K0901N579N136N231J77
$$ -38775 -9728 -7682 -7997 -15917 4417 -1514 -25805 -41867 -44412 -23511 -17932 -12796 -7565 -7388
6645g388j0110K1679J8713q339k2466q853L0447l363J4030j8783m1165q703k4075
$$ -7388 -17498 4181 22894 14555 -7911 -16764 13683 10320 24350 5567 -35598 -44301 -68376
6632f8376J2992M3402K4048p576j6747M310k1260j3941J8637j0117j5638Q995
$$ -68376 -55384 -11982 12066 4490 -12257 -7947 -29207 -43148 -24511 -34628 -50266 -41271
6620d1271j4685k3527L6906K4983M4814k1989J5148L350l3123m506K4408J1945
$$ -41271 -55956 -79483 -42577 -17594 27220 5231 20379 23729 -9394 -13900 10508 22453
6608B2453j5744n13J2596k2037J286k466k4383P584K4938K4926j125k4259m273
$$ 22453 6709 6196 18792 -3245 -1959 -4425 -28808 -21224 3714 28640 27515 3256 -1017
6595a017j7928o96r017j9279j6343M598P184P627P691N7194L3345p301r18l4811
$$ -1017 -18945 -19641 -28658 -47937 -64280 -59682 -52498 -44871 -37180 20014 53359 46058 45140 10329
6581A0329k9322N25M568N591J1779j1114L0180P192j1245j0994p834m088l566
$$ 10329 -18993 -18468 -13900 -8309 3470 -7644 22536 29728 18483 7489 -345 -4433 -7999
6568g999k6642n130L3308L5613K8435r372k2136m820j5810l686r499m2096J0085
$$ -7999 -34641 -39771 -6463 29150 57585 48213 26077 21257 5447 1761 -7738 -49834 -39749
6555c9749L0658N028j8829J6866J3263J000r292P031J5044P560k1272l5076j9928
$$ -39749 -9091 -4063 -22892 -6026 7237 8237 -1055 5976 21020 28580 7308 -27768 -47696
6542d7696J7879Q801j0623Q340L4797O679P992l8839q18N303p260l0579K3773
$$ -47696 -29817 -21016 -31639 -23299 11498 18177 26169 -12670 -13488 -8185 -15445 -46024 -22251
6529b2251N0799j4291j8669l1259N025J9095j3587K918j1114p840j7069l7721
$$ -22251 28548 14257 -4412 -35671 -30646 -11551 -25138 -22220 -33334 -41174 -58243 -95964
6517i5964l190K2449K0644L6446K4866l752l4765j5872J619j3827M4489Q191J8962
$$ -95964 -99154 -76705 -56061 -19615 5251 1499 -33266 -49138 -47519 -61346 -16857 -8666 10296
6504A0296K1527J463n101l5257q500j6403l5273k1750K3202K241l925L7184L8006
$$ 10296 31823 33286 28185 -7072 -15572 -31975 -67248 -88998 -65796 -63555 -67480 -30296 7710
6491G710K2869q116m6751J4449l34j7715J5199J142m63L251J6290j4058o475J0417
$$ 7710 30579 22463 -24288 -9839 -10173 -27888 -12689 -11547 -12010 -8759 7531 -6527 -13002 -2585
6477b585l4238r539k708L7921K8279N505q155l7304o440J9969o007J20j6329J6291
$$ -2585 -36823 -46362 -49070 -11149 17130 22635 14480 -22824 -29264 -9295 -15302 -15182 -31511 -15220
6463a5220J4105j430k4510m447k2818k209q63K1426R864n3945J646P811N75M5599
$$ -15220 -1115 -2545 -27055 -31502 -54320 -56529 -57392 -35966 -26102 -80047 -78401 -70590 -70015 -24416
6449b4416L4547k6722J0692L3985J8241j8017r485o203j517k3841j0883l138k58
$$ -24416 10131 -16591 -5899 28086 46327 28310 18825 12622 11105 -12736 -23619 -26757 -27015
6436b7015Q591j2876J479K0882J2031j4920m0612Q8M50k2731K55K9472J1886j9305
$$ -27015 -18424 -31300 -29821 -8939 3092 -11828 -52440 -52352 -51902 -74633 -74378 -44906 -33020 -52325
6422e2325q161J6268L8209o617j4200R404p225J4563k7908J2617K2850j9191J1147
$$ -52325 -60486 -44218 -6009 -12626 -26826 -17422 -24647 -10084 -37992 -25375 -2525 -21716 -10569
6409a0569J2210K262k5110K3057K1509j2086l948K856j694M969l222j7563k077
$$ -10569 1641 3903 -21207 1850 23359 11273 7325 10181 8487 13456 10234 -7329 -9406
6396i406k5201l4984Q66L3376K0671k2275j8450j4995O571K3207Q944J8626j5141
$$ -9406 -34607 -69591 -68725 -35349 -14678 -36953 -55403 -70398 -63827 -40620 -31676 -13050 -28191
6383b8191N217M1168O224q078l222k5243k63k0724P612J0986J8371j546j5404
$$ -28191 -22974 18194 24418 16340 13118 -12125 -12388 -33112 -25500 -14514 3857 2311 -13093
6370a3093K9560k9738r400j6210K2426j6453n464J5194K0968L573l350j5298j8835
$$ -13093 16467 -13271 -22671 -38881 -16455 -32908 -38372 -23178 -2210 1363 -1987 -17285 -36120
6357c6120j9880K153K9490N5394q877k240K734j5473k713j3758j2964k2262p871
$$ -36120 -56000 -53847 -24357 31037 22160 19920 22654 7181 4468 -9290 -22254 -44516 -52387
6344e2387J1155N91l356K812J6508j9817M815J5327N131k8757l4382J0804L7689
$$ -52387 -41232 -40641 -43997 -41185 -24677 -44494 -39679 -24352 -19221 -47978 -82360 -71556 -33867
6331c3867K6002l1612N819K9192l908j9527j3625J937K3462J7270K6517K4395
$$ -33867 -7865 -39477 -33658 -4466 -8374 -27901 -41526 -39589 -16127 1143 27660 52055
6319E2055l9808J3685j3855j0209L607r030j1816J8258j4875K002l37K2348K7998
$$ 52055 12247 25932 12077 1868 5475 -3555 -15371 2887 -11988 -9986 -10323 12025 40023
6306D0023j1175k0725q708L841n205J5841p226j2675P820J580k1776k0527k4456
$$ 40023 28848 8123 -585 3256 -1949 13892 6666 -6009 1811 3391 -18385 -38912 -63368
6293f3368p130N757O401r670K1385K7683O547k4077J0049K158J0346j2948q570
$$ -63368 -70498 -64741 -58340 -68010 -46625 -18942 -12395 -36472 -26423 -24265 -13919 -26867 -35437
6280c5437L1952J9051Q652L6196m923l9205m277r977m348r213q722k0546K472
$$ -35437 -3485 15566 24218 60414 55491 16286 12009 2032 -2316 -11529 -20251 -40797 -38325
6267c8325Q029j8130n544P343l688K26J8800J8128j0054j2344P874M987J4445
$$ -38325 -30296 -48426 -53970 -46627 -50315 -50089 -31289 -13161 -23215 -35559 -27685 -22698 -8253
6254h253K8599n800j8826k4838m083K8845k9436l6191J3130r738L2072K4679m884
$$ -8253 20346 14546 -4280 -29118 -33201 -4356 -33792 -69983 -56853 -66591 -34519 -9840 -14724
6241a4724M366j7689K4125Q736l568J5094p480l745J0136Q96l0819m8048k972
$$ -14724 -10358 -28047 -3922 4814 1246 16340 8860 5115 15251 16147 -14672 -62720 -65692
6228f5692R256K0737M0348J2392N737k372j8804j9711k7772j856L1800L0205L9032
$$ -65692 -56436 -35699 4649 17041 22778 20406 1602 -18109 -45881 -47737 -15937 14268 53300
6215E3300q875j9243m599k4979q2j4748k1804L959K0028N77L525K5895P465J5744
$$ 53300 44425 25182 20583 -4396 -4478 -19226 -41030 -37071 -17043 -16466 -12941 12954 20419 36163
6201C6163J4441r572k7376p223k6918l669L0032L3103k3034q874J0108J3044j2269
$$ 36163 50604 41032 13656 6433 -20485 -24154 5878 38981 15947 7073 17181 30225 17956
6188A7956k2512M754k2808k3155K2219k4939J7666j1372m993K819O730j1312J3130
$$ 17956 -4556 198 -22610 -45765 -23546 -48485 -30819 -42191 -47184 -44365 -37635 -48947 -35817
6175c5817J420J7731J0571k517J9887L9706j3772j3299r263l8148o469J5236j0875
$$ -35817 -34397 -16666 -6095 -8612 11275 50981 37209 23910 14647 -23501 -29970 -14734 -25609
6162b5609k1604R836K4761o31k3998K0713K6559M86k2408J8067r84k635K5864
$$ -25609 -47213 -37377 -12616 -13247 -37245 -16532 10027 10513 -11895 6172 5188 2553 28417
6149B8417o808j0100j5671m271P117o358K5025j9588o034O924K0162L728k9887
$$ 28417 21609 11509 -4162 -8433 -1316 -7674 17351 -2237 -8271 -1347 18815 22543 -7344
6136g344k6539l035j295J1558q458j1144P626L675J2796P09J3443j843J0445J044
$$ -7344 -33883 -36918 -38213 -26655 -35113 -46257 -38631 -34956 -22160 -21451 -8008 -9851 594 1638
6122A638k888j6847j9844K5160L1251M43J508k4027p458K378Q967r372R832K2284
$$ 1638 -1250 -18097 -37941 -12781 18470 18913 20421 -3606 -11064 -8686 281 -9091 741 23025
6108B3025o463o681J0082J0759P970J5373l2067m6000k9960j0299O563K6387J2734
$$ 23025 16562 9881 19963 30722 38692 54065 21998 -24002 -53962 -64261 -57698 -31311 -18577
6095a8577J8820L164j2675j0773M3066J2314l3999k0541k6854m1423K2484K4149
$$ -18577 243 3407 -9268 -20041 23025 35339 1340 -19201 -46055 -87478 -64994 -40845
6083d0845M830m932M931r281K3867M0277M368j1000L806j151J0072k4725k1718
$$ -40845 -36015 -40947 -36016 -45297 -21430 18847 23215 12215 16021 14870 24942 217 -21501
6070b1501M447J2077J0652K7284m045r328j3564j904Q775p439r462K973L881j289
$$ -21501 -17054 -4977 5675 32959 28914 19586 6022 4118 12893 5454 -4008 -1035 2846 1557
6056A557p232j011K67j2895j0124m231O161K4351K504k2239n710j7783k5591K145
$$ 1557 -5675 -6686 -6419 -19314 -29438 -33669 -27508 -3157 -653 -22892 -28602 -46385 -71976 -69831
6042f9831K9252K2606O997p860K1651Q762k3383m623P476k0649j1200r25J3822
$$ -69831 -40579 -17973 -10976 -18836 2815 11577 -11806 -16429 -8953 -29602 -40802 -41727 -27905
6029b7905J6307K4028J5819L885l9168P142q950M414j4614J1841l96J9555K298
$$ -27905 -11598 12430 28249 32134 -7034 108 -8842 -4428 -19042 -7201 -7597 11958 14256
6016A4256j569k9850j3545M155N49L520P641R225n87M985L1114m474j9192k2215
$$ 14256 12687 -17163 -30708 -26553 -26004 -22484 -14843 -5618 -6205 -1220 29894 25420 6228 -15987
6002a5987J3014L982l306j042J3455J0889J0308k422k9971l512J1763j946j9081
$$ -15987 -2973 1009 -2297 -3339 10116 21005 31313 28891 -1080 -4592 7171 5225 -13856
5989a3856k1432R790K0710k509J7601L6665K8791l8021l5083j4720R285O771j6541
$$ -13856 -35288 -25498 -4788 -7297 10304 46969 75760 37739 2656 -12064 -2779 3992 -12549
5976a2549j0188N691J3563k2973k9619J4193K4241k9539m1548J508L1531L9399
$$ -12549 -22737 -17046 -3483 -26456 -56075 -41882 -17641 -47180 -88728 -87220 -55689 -16290
5964a6290j2390l728M0417O04k4205l754J8334K374J273k361J9899n210l6721
$$ -16290 -28680 -32408 8009 8613 -15592 -19346 -1012 1362 2635 274 20173 14963 -21758
5951b1758k1989j9141Q926N731L3784J3558j1494j703k7869r495L442J670J2459
$$ -21758 -43747 -62888 -53962 -48231 -14447 -889 -12383 -14086 -41955 -51450 -48008 -46338 -33879
5938c3879l996j3410L4826n986r960k885J820J0064K4287Q203l168q796J994j8029
$$ -33879 -37875 -51285 -16459 -22445 -32405 -35290 -33470 -23406 881 9084 5916 -2880 -886 -18915
5924a8915j6370R950K9401j8681k7597P733J578k224J8598j5373j1800K5419K7334
$$ -18915 -35285 -25335 4066 -14615 -42212 -34479 -32901 -35125 -16527 -31900 -43700 -18281 9053
5911I053k5192j0043p188j384J040k1172L524l212J3386J6405K7363q369K2409
$$ 9053 -16139 -26182 -33370 -34754 -33714 -54886 -51362 -54574 -41188 -24783 2580 -5789 16620
5898A6620K2996j7649k8298k9221n825J9525M700J8826J07K3092L506m610J832
$$ 16620 39616 21967 -6331 -35552 -41377 -21852 -17152 1674 1781 24873 28379 23769 25601
5885B5601J868j8166k7337j6007N648m987p939K4109J192q197l116J9856j640
$$ 25601 27469 9303 -18034 -34041 -28393 -33380 -41319 -17210 -16018 -24215 -27331 -7475 -9115
5872i115j3268N302j9156J9290K3485j3415l0326j6957J7634N438N69J0913J8218
$$ -9115 -22383 -17081 -36237 -16947 6538 -6877 -37203 -54160 -36526 -31088 -30519 -19606 -1388
5859a388k7686M484L8560k696L402K5401q239j6458J0644k477m863m1187k7605
$$ -1388 -29074 -24590 13970 11274 14676 40077 31838 15380 26024 23547 18684 -22503 -50108
5846e0108N392k0711M80o128J3457K5609k2870q057L9488L2305J6384P905k761
$$ -50108 -44716 -65427 -64947 -71075 -57618 -32009 -54879 -62936 -23448 8857 25241 33146 30385
5833C0385p571l2140l3699p131L25K0118o33J1702K9650n580j9161j4768k867
$$ 30385 22814 -9326 -43025 -50156 -49831 -29713 -30346 -18644 11006 5426 -13735 -28503 -31370
5820c1370J8920J3409P726L0792N781j0568Q799l2539j2111j9923J0482K9841
$$ -31370 -12450 959 8685 39477 45258 34690 43489 10950 -1161 -21084 -10602 19239
5808A9239n219m684n651p759K0561o199J0186J6101j4502j6029P260M2809j7155
$$ 19239 14020 9336 3685 -4074 16487 10288 20474 36575 22073 6044 13304 56113 38958
5795C8958j2702j1590j7774j3817J9943j5505l3504K559L4147N3699K214k764
$$ 38958 26256 14666 -3108 -16925 3018 -12487 -45991 -43432 -9285 44414 46628 43864
5783D3864m551j9838k4375r007r997j5136L0391j1566k122j5535r544J7426L028
$$ 43864 39313 19475 -4900 -13907 -23904 -39040 -8649 -20215 -22337 -37872 -47416 -29990 -26962
5770b6962l4652J1284O405n02L270k71J7465J8714J1279q662j6193O360L4356
$$ -26962 -61614 -50330 -43925 -44427 -41157 -41428 -23963 -5249 6030 -2632 -18825 -12465 21891
5757B1891j3588m277J6167O6r193L181k9648O101J6114k6979l4423l5983L4459
$$ 21891 8303 4026 20193 20259 11066 14247 -15401 -9300 6814 -20165 -54588 -90571 -56112
5744e6112K6443J2978j7996M43K974J9210J3764j9860l0504j6481J6398P051J4839
$$ -56112 -29669 -16691 -34687 -34244 -31270 -12060 1704 -18156 -48660 -65141 -48743 -41692 -26853
5731b6853J4082j3048q982k348J5353P876k6067J3847M4134M1431Q149k5002k3869
$$ -26853 -12771 -25819 -34801 -37149 -21796 -13920 -39987 -26140 17994 59425 67574 42572 18703
5718A8703j4762Q667k3348j7860j5700j1035P016K2629k101p304j1106L702L6110
$$ 18703 3941 12608 -10740 -28600 -44300 -55335 -48319 -25690 -27791 -35095 -46201 -42499 -6389
5705f389K5091j2550j3114J0852L20K855J1942m830P015K1221k3167j5206Q287
$$ -6389 18702 6152 -6962 3890 4210 7065 19007 14177 21192 42413 19246 4040 12327
5692A2327p277K004L621k0425j2734J2732l429J0693K9567K218k2081L336k6409
$$ 12327 5050 7054 10675 -9750 -22484 -9752 -13181 -2488 27079 29297 7216 10552 -15857
5679a5857j2659K6306L130j2208M061j2864k0443K6671n790N043L8562K849k9580
$$ -15857 -28516 -2210 920 -11288 -7227 -20091 -40534 -13863 -19653 -14610 23952 26801 -2779
5666b779o094M593j1401N768L3191R611l4270k0372J682j3225J6258J8077j4285
$$ -2779 -8873 -4280 -15681 -9913 23278 32889 -1381 -21753 -20071 -33296 -17038 1039 -13246
5653a3246N901L817q480j5682j7068L3805K1898J6587k497k0039j5501j1389p539
$$ -13246 -7345 -3528 -12008 -27690 -44758 -10953 10945 27532 25035 4996 -10505 -21894 -29433
5640b9433l4340j576J6916n226j7992J9359K9990j1411K2540P971l6015k9188
$$ -29433 -63773 -65349 -48433 -53659 -71651 -52292 -22302 -33713 -11173 -3202 -39217 -68405
5628f8405k231K2716J3723r722O939j0340J0846J6610M626P28j0802j6937K6362
$$ -68405 -70636 -47920 -34197 -43919 -36980 -47320 -36474 -19864 -15238 -14510 -25312 -42249 -15887
5615a5887J1042J2157K1348K3168k3116j8992k3088j5357Q119R735q60r266K2607
$$ -15887 -4845 7312 28660 51828 28712 9720 -13368 -28725 -20606 -10871 -11731 -20997 1610
5602A610L064l580j76J5630j425j9635j3689K1513m521k7501K445K5469J2244
$$ 1610 4674 1094 918 16548 15123 -4512 -18201 3312 -1209 -28710 -26265 -796 11448
5589A1448J7532R666l1200m255q826Q271q904j7063J3884J2580L0795j2978k4719
$$ 11448 28980 38646 7446 3191 -5635 2636 -6268 -23331 -9447 3133 33928 20950 -3769
5576c769m978o095j8397j3202J8060N185J3117R44K996k756P296l1087M54J7660
$$ -3769 -8747 -14842 -33239 -46441 -28381 -23196 -10079 -9135 -6139 -8895 -1599 -32686 -32232 -14572
5562a4572J6681j4049k7464l6011j4090M973K4860J5422J2337N695k4626K3914
$$ -14572 2109 -11940 -39404 -75415 -89505 -84532 -59672 -44250 -31913 -26218 -50844 -26930
5550b6930J1780Q665m311Q215L603n236j9720j4700j443J1949Q769K3526l7675
$$ -26930 -15150 -6485 -10796 -2581 1022 -4214 -23934 -38634 -40077 -28128 -19359 4167 -33508
5537c3508P978L1799j489l7869l7143J8697L8926K7389q123n052q735P722j1028
$$ -33508 -25530 6269 4780 -33089 -70232 -51535 -12609 14780 6657 1605 -7130 592 -10436
5524a0436R088r941J865k2756j3090K464K024J5978J0388J3925J6499M813p244
$$ -10436 -1348 -11289 -9424 -32180 -45270 -42806 -40782 -24804 -14416 -491 16008 20821 13577
5511A3577j9200j9315L9803L3647j8260k0582P156k387j5848m462J545r364j0261
$$ 13577 -5623 -24938 14865 48512 30252 9670 16826 14439 -1409 -5871 -4326 -13690 -23951
5498b3951J5885j279M432K5412J4916l2244k0574m1348j385K1462J2608L193N292
$$ -23951 -8066 -9345 -4913 20499 35415 3171 -17403 -58751 -60136 -38674 -26066 -22873 -17581
5485a7581N01P197J429j4942j326J9092J6596m959m928o800N716J3332j1746M114
$$ -17581 -17080 -9883 -8454 -23396 -24722 -5630 10966 6007 1079 -5721 -5 13327 1581 5695
5471E695L919l042r356M91q569L403j0354K462K048R613n5L53K4309j6590J055
$$ 5695 9614 6572 -2784 -2293 -10862 -7459 -17813 -15351 -13303 -3690 -3745 -3392 20917 4327 5382
5456E382L5j60j3869K1511J6865J3827m0925j559L4526j3391j7377l443J1607
$$ 5382 5417 5257 -8612 12899 29764 43591 2666 1107 35633 22242 4865 1422 13029
5443A3029J8219j3764k9852k1445l651J035N465k524R898K967J0J9738m3690r628
$$ 13029 31248 17484 -12368 -33813 -37464 -36429 -30964 -33488 -23590 -20623 -20613 -875 -44565 -54193
5429e4193p377j4764M0954K3581J3302J2192k1543r985L141N90k8932l1473J2108
$$ -54193 -61570 -76334 -35380 -11799 1503 13695 -7848 -17833 -14692 -14102 -43034 -74507 -62399
5416f2399J8252M068K6826O779k897o226k785J3677l4083Q333J1626K561J5455
$$ -62399 -44147 -40079 -13253 -6474 -9371 -15597 -18382 -4705 -38788 -30455 -18829 -16268 -813
5403h13j0557Q82j0972q59j4684L3731J5688j4779k663Q852j4747R776N0632P789
$$ -813 -11370 -10488 -21460 -22319 -37003 -3272 12416 -2363 -5026 3826 -10921 -1145 49487 57276
5389E7276j2248l4146K8238O543j002Q146l0794m3969J4813J6650k3951r511J4010
$$ 57276 45028 10882 39120 45663 44661 52807 22013 -21956 -7143 9507 -14444 -23955 -9945
5376i945q840j1820Q560k634k470K6990J4562K374Q35m576q254n80j1356r859
$$ -9945 -18785 -30605 -22045 -24679 -27149 -159 14403 16777 17612 13036 4782 4202 -7154 -17013
5362a7013J3328r115K2814l77j9463l4343K851K7957O578L335j5392o437Q176
$$ -17013 -3685 -12800 10014 9637 -9826 -44169 -41318 -13361 -6783 -3448 -18840 -25277 -17101
5349a7101K489Q828M8629l1592k1344M894M05K551K1229j7856j7269J3153j2188
$$ -17101 -14612 -5784 42845 11253 -10091 -5197 -4792 -2241 18988 1132 -16137 -2984 -15172
5336a5172O426M610J2525k974K1208L5413j3531l4316K196k2519j1165K854J1417
$$ -15172 -8746 -4136 8389 5415 26623 62036 48505 14189 16385 -6134 -17299 -14445 -3028
5323c028q015J3846q002K979p588k1835M319K667K7550K16k2518n648j3139N114
$$ -3028 -11043 2803 -5199 -2220 -9808 -31643 -27324 -24657 2893 3109 -19409 -25057 -38196 -33082
5309c3082Q006P255R382O959j6521K5484J9598M688j2286m809K404J1949k206
$$ -33082 -25076 -17821 -8439 -1480 -18001 7483 27081 31769 19483 14674 17078 29027 26821
5296B6821k9074j3242j1641J8610o254K338o574K9494o862M989p721R08o491M250
$$ 26821 -2253 -15495 -27136 -8526 -14780 -12442 -19016 10478 3616 8605 884 1792 -4699 -449
5282d49k9851j0801J3294P10K6637K6039Q433j1905r042M393L228M24K186k2196
$$ -449 -30300 -41101 -27807 -27097 -460 25579 34012 22107 13065 17458 20686 21110 23296 1100
5268A100j0695K930j6839R085K7520O127l866O589J1994q480k2845k6579k9475
$$ 1100 -9595 -6665 -23504 -14419 13101 19228 15362 21951 33945 25465 2620 -23959 -53434
5255e3434J8275L4120k6288j9596K2K530K6020K9331J7722K0867N831j879N633
$$ -53434 -35159 -1039 -27327 -46923 -46901 -44371 -18351 10980 28702 49569 55400 53521 59154
5242E9154k4131l496l9335k8368L0320J2084J7566J444P405J4469J4529r193j9389
$$ 59154 35023 31527 -7808 -36176 -5856 6228 23794 25238 32643 47112 61641 52448 33059
5229C3059j3896K0213J9798j9085k8713l0379o169K5547q308L223K548j1046N156
$$ 33059 19163 39376 59174 40089 11376 -19003 -25172 375 -7933 -4710 -2162 -13208 -8052
5216h052P939J9010K7832K0659J005J926j4943m3681m1638k357j3379L316K8009
$$ -8052 -113 18897 46729 67388 68393 70319 55376 11695 -29943 -32300 -45679 -42363 -14354
5203a4354N43k0610m97k4053k6731J6659L9537J0739J3398J5191Q002j6281k2229
$$ -14354 -13811 -34421 -34918 -58971 -85702 -69043 -29506 -18767 -5369 9822 17824 1543 -20686
5190b0686J1253J2123j934k819m45K8863j266l9757j4449O879J0692j263J526
$$ -20686 -9433 2690 756 -2063 -2508 26355 25089 -14668 -29117 -22238 -11546 -12809 -11283
5177a1283l1447J0995K1367K5053J1961l3999J9437j4262m2191n072J8501J4480
$$ -11283 -42730 -31735 -10368 14685 26646 -7353 12084 -2178 -44369 -49441 -30940 -16460
5165a6460q528J3901J6577J3848k5717k8375L14J4003O426k633J4197j401m618
$$ -16460 -24988 -11087 5490 19338 -6379 -34754 -34440 -20437 -14011 -16644 -2447 -3848 -8466
5152h466k1257j270J2243L726r204L0837K1796k7364k1021k3713L1435L0091O820
$$ -8466 -29723 -30993 -18750 -15024 -24228 6609 28405 1041 -19980 -43693 -12258 17833 24653
5139B4653k1821k9090J1282J1581O146q32j1195k9150K101Q807J6654K8033K5254
$$ 24653 2832 -26258 -14976 -3395 2751 1919 -9276 -38426 -36325 -27518 -10864 17169 42423
5126D2423j9041j0781j5183r496M487m304N743J5922J3771J009j4234k2445J366
$$ 42423 23382 12601 -2582 -12078 -7591 -11895 -6152 9770 23541 24550 10316 -12129 -10763
5113a0763J2996K5167J7001K5958k64P43p64j2869k6341n067K8682r252j3474
$$ -10763 2233 27400 44401 70359 70095 70838 70074 57205 30864 25797 54479 45227 31753
5100C1753j1839M775n034j9611q386K0015l545N302J5825K0159k2821k1340l6968
$$ 31753 19914 24689 19655 44 -8342 11673 8128 13430 29255 49414 26593 5253 -31715
5087c1715L483K896J4535J469j3566j0834K8846j5152j4808k501L017k4302K3234
$$ -31715 -28232 -25336 -10801 -9332 -22898 -33732 -4886 -20038 -34846 -37347 -34330 -58632 -35398
5074c5398K3558P147K8681L379k8642k7385J0725L6955J4605l3755J5204l92J6197
$$ -35398 -11840 -4693 23988 27367 -1275 -28660 -17935 19020 33625 -130 15074 14682 30879
5061C0879Q602k8324p121J4527M862J381j0851n270L988n063J5828j3567J1611
$$ 30879 39481 11157 4036 18563 23425 24806 13955 8685 12673 7610 23438 9871 21482
5048B1482R809k6200J983P650l477J473O045r675k1590J8826J9544P785j77l745
$$ 21482 31291 5091 7074 14724 11247 12720 18765 9090 -12500 6326 25870 33655 33478 29733
5034B9733m63k7132k6021j7751j077M990L95j4594l649q238L3541K4915J2498
$$ 29733 29270 2138 -23883 -41634 -42711 -37721 -37326 -51920 -55569 -63807 -30266 -5351 7147
5021G147r031j4549n576J513J6634k6903J4120J067j2821K0592J5229j48j1729
$$ 7147 -1884 -16433 -22009 -20496 -3862 -30765 -16645 -15578 -28399 -7807 7422 7274 -4455
5008d455M861J8021k7532l4522k6900o909J8156k699N522r055l1233K8902J3731
$$ -4455 406 18427 -9105 -43627 -70527 -77436 -59280 -61979 -56457 -65512 -96745 -67843 -54112
4995e4112R834L9229M0444K91m2686o331p335N432M317r752j5370k2565l5N2912
$$ -54112 -44278 -5049 35395 35686 -7000 -13331 -20666 -15234 -10917 -20669 -36039 -58604 -58639 -5727
4981e727n248J6278K9751l7919l2841j8132J8296K8943K6318j305P337o917m8688
$$ -5727 -10975 5303 35054 -2865 -35706 -53838 -35542 -6599 19719 18414 25751 18834 -29854
4968b9854l60j7918m952k422p52J2508r845j5249M1850K1531j24K1060J9152k8688
$$ -29854 -30214 -48132 -53084 -55506 -56258 -43750 -53595 -68844 -26994 -5463 -5587 15473 34625 5937
4954E937l5366N997l150P189j3361l2351n294J6030L3461K7234j0709J8829j503
$$ 5937 -29429 -23432 -26582 -19393 -32754 -65105 -70399 -54369 -20908 6326 -4383 14446 12943
4941A2943r930j0558m461J4828n073k6600K0452J1581l612r646l316J9012J7383
$$ 12943 3013 -7545 -12006 2822 -2251 -28851 -8399 3182 -430 -10076 -13392 5620 23003
4928B3003k2083R014j835Q550r722j5268p542Q049J2236J1352r035M251j026l326
$$ 23003 920 9934 8099 16649 6927 -8341 -15883 -7834 4402 15754 6719 10970 9944 6618
4914F618J4836j8231J6855J9077l8238j2439J0304k1038J8748p157J7799L4353
$$ 6618 21454 3223 20078 39155 917 -11522 -1218 -22256 -3508 -10665 7134 41487
4902D1487J2575k4804j1420J257j700j4944j0912k1050j8046j5510K6762K2241
$$ 41487 54062 29258 17838 19095 17395 2451 -8461 -29511 -47557 -63067 -36305 -14064
4890a4064M957J340J2431o844R199j0533o809r372r258l2492j377J2603K768R112
$$ -14064 -9107 -7767 4664 -2180 7019 -3514 -10323 -19695 -28953 -61445 -62822 -50219 -47451 -38339
4876c8339n015J080j4916K5103L2847j8758l106K2325O804o578J7228l7318k1410
$$ -38339 -43354 -42274 -57190 -32087 760 -17998 -21104 1221 8025 1447 18675 -18643 -40053
4863d0053J0794k0673k8923J8704L4141O095J8510k6810k1823K2774K1014J7955
$$ -40053 -29259 -49932 -78855 -60151 -26010 -19915 -1405 -28215 -50038 -27264 -6250 11705
4851A1705P27j7787l964k354M186K4056K3218j1485m5678m698k305J6027K297
$$ 11705 12432 -5355 -9319 -11673 -7487 16569 39787 28302 -17376 -22074 -24379 -8352 -6055
4838f055K0568j498j3642o485j6609l3854J2478J6221j797o097M3991J9126k7442
$$ -6055 14513 13015 -627 -7112 -23721 -57575 -45097 -28876 -30673 -36770 7221 26347 -1095
4825a095M384R141j1231k1790k087k8325J3456N1522Q04l683l167j9357L603L550
$$ -1095 3289 12430 1199 -20591 -22678 -51003 -37547 13975 14779 11096 7929 -11428 -7825 -4275
4811d275j681L3093m974k0671J0915N955k6521O855M161n342J5089m8143l4793
$$ -4275 -5956 27137 22163 1492 12407 18362 -8159 -1304 2857 -2485 12604 -35539 -70332
4798g0332L4673K7275n030k290M0390O650m9412j5231K3465J8832j1117j0830
$$ -70332 -35659 -8384 -13414 -15704 24686 31336 -18076 -33307 -9842 8990 -2127 -12957
4786a2957J1673o104P728j4295o012j8654k6102k465L8849j2895J0951K2519j029
$$ -12957 -1284 -7388 340 -13955 -19967 -38621 -64723 -67188 -28339 -41234 -30283 -7764 -8793
4773h793j2692J1373J5228r823n5025k61K6110N227K625K879J1274j6557J5427
$$ -8793 -21485 -10112 5116 -4707 -59732 -59993 -33883 -28656 -26031 -23152 -11878 -28435 -13008
4760a3008M393k5566k6926N957J876m803J3211j2513j8631Q615K904K0002J4576
$$ -13008 -8615 -34181 -61107 -55150 -53274 -58077 -44866 -57379 -76010 -67395 -64491 -44489 -29913
4747b9913Q57M300K3574M220k1570j3680j9620j096N646J9474K0851J0772N287
$$ -29913 -29056 -24756 -1182 3038 -18532 -32212 -51832 -52928 -47282 -27808 -6957 3815 9102
4734I102Q780j1123r760K041K8891k7722l6654p807o338M4788n013j7028k6026
$$ 9102 17882 6759 -3001 -960 27931 209 -36445 -44252 -50590 -5802 -10815 -27843 -53869
4721e3869l01J7218J085k5260L415L0802L0813P111k0068p852O681o053K0402
$$ -53869 -54170 -36952 -35867 -61127 -57712 -26910 3903 11014 -9054 -16906 -10225 -16278 4124
4708D124K939K0982J1012j1035j2655J8972o180j8593k4026m110J6545K1417N273
$$ 4124 7063 28045 39057 28022 15367 34339 28159 9566 -14460 -18570 -2025 19392 24665
4695B4665P743P262m876j1234j2624N350n603J3746k786l8469r157q355N86L0502
$$ 24665 32408 39670 34794 23560 10936 16286 10683 24429 21643 -16826 -25983 -34338 -33752 -3250
4681c250n735j5297J7501K9596j7969j1392Q805K3824N743K186j5802j3903l5194
$$ -3250 -8985 -24282 -6781 22815 4846 -6546 2259 26083 31826 34012 18210 4307 -30887
4668c0887m294J1656L7972l252J3832o86m818k1280k8266j3130k5547l421l210
$$ -30887 -35181 -23525 14447 11195 25027 24341 19523 -1757 -30023 -43153 -68700 -72121 -75331
4655g5331L4508L5970K6535l412n702m95r040P108j3557J2618K6349j9343l3165
$$ -75331 -40823 -4853 21682 18270 12568 12073 3033 10141 -3416 9202 35551 16208 -16957
4642a6957K6952Q289j3309j1183j4492r678J8346q672J7045K3124j1605K0766
$$ -16957 9995 18284 4975 -6208 -20700 -30378 -12032 -20704 -3659 19465 7860 28626
4630B8626K0980K4689J2162l094m557j7725m3379k2961Q197m956L4810m0620l8087
$$ 28626 49606 74295 86457 83363 78806 61081 17702 -5259 2938 -2018 32792 -7828 -45915
4617d5915r448M474k578o819K7933L4532J7532j5589j5239k5541j3452m161K593
$$ -45915 -55363 -50889 -53467 -60286 -32353 2179 19711 4122 -11117 -36658 -50110 -54271 -51678
4604e1678J5068L3750L5796J598l1347j3535j4148l599l022J8450j6106j4878
$$ -51678 -36610 -2860 32936 34534 3187 -10348 -24496 -28095 -31117 -12667 -28773 -43651
4592d3651K5448o366l7824Q846L1887o318r942J6448J4148K1306O518l438k4952
$$ -43651 -18203 -24569 -62393 -53547 -21660 -27978 -37920 -21472 -7324 13982 20500 17062 -7890
4579g890j8013j8588N177j83K503J9500k272K71j5751P155L666L7862J3566M598
$$ -7890 -25903 -44491 -39314 -39497 -36994 -17494 -19766 -19495 -35246 -28091 -24425 13437 27003 31601
4565C1601M593j5693O274p227l0125l3941k4709P71L0028J9660R006k4503p419
$$ 31601 36194 20501 26775 19548 -10577 -44518 -69227 -68456 -38428 -18768 -9762 -34265 -41684
4552d1684J1289K8032K6154j7492k2723k5387J0715K1726j4621J4614K0457K1129
$$ -41684 -30395 -2363 23791 6299 -16424 -41811 -31096 -9370 -23991 -9377 11080 32209
4540C2209J1382k819k0576m3553j4540J0854L9056K558j8484j3397j1897m409
$$ 32209 43591 40772 20196 -23357 -37897 -27043 12013 14571 -3913 -17310 -29207 -33616
4528c3616j359j4997K9760M1450K9118j6669j5286k663k2441k4119J610m43J2048
$$ -33616 -34975 -49972 -20212 21238 50356 33687 18401 15738 -6703 -30822 -29212 -29655 -17607
4515a7607L9917K8827m6185l0156J713j0168J1917J7435K5717r626j3375p338
$$ -17607 22310 51137 4952 -25204 -23491 -33659 -21742 -4307 21410 11784 -1591 -8929
4503h929O68l633j2358j4818J0707j0822J0537K1866o076j2689n7j3300J3380
$$ -8929 -8261 -11894 -24252 -39070 -28363 -39185 -28648 -6782 -12858 -25547 -25604 -38904 -25524
4490b5524J0925J5792n653j1647K8088K8601K6552l9386m0026k3141r125n907
$$ -25524 -14599 1193 -4460 -16107 11981 40582 67134 27748 -12278 -35419 -44544 -50451
$$ [...]
##END NTUPLES=NMR SPECTRUM
##END=
