##TITLE=Analysis number 330052
Compound Code cc 67910
Book Reference 423/192/11
Project Code adrs
Chemist Name bruced
##JCAMPDX= 6.0         $$ Bruker NMR JCAMP-DX V2.0
##DATA TYPE= NMR SPECTRUM
##DATA CLASS= NTUPLES
##ORIGIN= Bruker BioSpin GmbH
##OWNER= nmr
$$ XWIN-NMR		Version 3.5
$$ Tue Oct 23 09:38:04 2007 GMT Daylight Time (UT+1h)  MAYBRIDGE\nmr@NMR_250MHZ
##.OBSERVE FREQUENCY= 250.131544655141
##.OBSERVE NUCLEUS= ^1H
##.ACQUISITION MODE= SIMULTANEOUS (DQD)
##.ACQUISITION SCHEME= undefined
##.AVERAGES= 16
##.DIGITISER RES= 18
##SPECTROMETER/DATA SYSTEM= dpx250
##.PULSE SEQUENCE= zg30
##.SOLVENT NAME= CDCl3
##.SHIFT REFERENCE= (INTERNAL, CDCl3, 0, 16.4506)
##AUDIT TRAIL= $$ (NUMBER, WHEN, WHO, WHERE, WHAT)
$$ ##TITLE= Audit trail, XWIN-NMR		Version 3.5
$$ ##JCAMPDX= 5.01
$$ ##ORIGIN= Bruker BioSpin GmbH
$$ ##OWNER= nmr
$$ C:\u/data/dgb/nmr/ADRS/1120/pdata/1/auditp.txt
$$ ##AUDIT TRAIL=  $$ (NUMBER, WHEN, WHO, WHERE, WHAT)
(   1,<2007-10-23 09:37:36.29 +100>,<MAYBRIDGE\nmr>,<NMR_250MHZ>,
      <created by zg, POWCHK disabled, PULCHK disabled
       configuration hash MD5:
       76 6E 9A 78 1E 09 19 81 EC 84 63 8F B0 6A 59 2D
       data hash MD5: 64K
       6A EF 73 40 1E 52 78 8D 9E 3B 35 61 BF EC 6D E2>)
(   2,<2007-10-23 09:37:54.54 +100>,<MAYBRIDGE\nmr>,<NMR_250MHZ>,
      <Start of raw data processing
       ef LB = 0.3 FT_mod = 6 PKNL = 1 SI = 32K 
       data hash MD5: 32K
       FE A9 AF 1C 51 7F 2F 1A 5F 2E 04 6A BD 05 0B 55>)
(   3,<2007-10-23 09:37:56.49 +100>,<MAYBRIDGE\nmr>,<NMR_250MHZ>,
      <apk 
       data hash MD5: 32K
       97 70 32 33 D4 47 F7 F2 7E 45 45 9C 2E 88 E4 89>)
(   4,<2007-10-23 09:37:57.20 +100>,<MAYBRIDGE\nmr>,<NMR_250MHZ>,
      <abs ABSG = 5 
       data hash MD5: 32K
       C2 C5 63 0E 7B B8 84 31 C9 B7 66 A4 51 0B 45 96>)
$$ ##END=
$$ 
$$ hash MD5
$$ E8 64 D7 E1 38 0B E5 D0 A6 CB 4B 9A 70 06 50 28
##$RELAX= 
##$RELAX= 
##$RELAX= 
##$RELAX= 
##$RELAX= 
##$RELAX= 
##$RELAX= 
$$ Bruker specific parameters
$$ --------------------------
##$DU= <C:\u>
##$EXPNO= 1120
##$NAME= <ADRS>
##$PROCNO= 1
##$TYPE= <nmr>
##$USER= <dgb>
##$AMP= (0..31)
100 100 100 100 100 100 100 100 100 100 100 100 100 100 100 100 100 100 
100 100 100 100 100 100 100 100 100 100 100 100 100 100 
##$AQSEQ= 0
##$AQ_mod= 3
##$AUNM= <au_zg>
##$AUTOPOS= <4 >
##$BF1= 250.13
##$BF2= 250.13
##$BF3= 250.13
##$BF4= 250.13
##$BF5= 500.13
##$BF6= 500.13
##$BF7= 500.13
##$BF8= 500.13
##$BYTORDA= 1
##$CFDGTYP= 0
##$CFRGTYP= 5
##$CHEMSTR= <none>
##$CNST= (0..31)
1 1 145 1 1 1 1 1 1 1 1 1 1 1 1 1 1 1 1 1 1 1 1 1 1 1 1 1 1 1 1 1 
##$CPDPRG= <>
##$CPDPRG1= <>
##$CPDPRG2= <>
##$CPDPRG3= <>
##$CPDPRG4= <mlev>
##$CPDPRG5= <mlev>
##$CPDPRG6= <mlev>
##$CPDPRG7= <mlev>
##$CPDPRG8= <mlev>
##$CPDPRGB= <>
##$CPDPRGT= <>
##$D= (0..31)
0 1 0 0 0 0 0 0 0 0.06 0 0 0 0 0 0 0.0002 0 0 0 0 0 0 0 0 0 0 0 0 0 0 
0 
##$DATE= 1193128654
##$DBL= (0..7)
120 120 120 120 120 120 120 120 
##$DBP= (0..7)
150 150 150 150 150 150 150 150 
##$DBP07= 0
##$DBPNAM0= <>
##$DBPNAM1= <>
$$ [...]
##$SUBNAM7= <"">
##$SUBNAM8= <"">
##$SUBNAM9= <"">
##$SW= 20.6930455092707
##$SWIBOX= (0..15)
0 0 3 0 0 0 0 0 0 0 0 0 0 0 0 0 
##$SW_h= 5175.983436853
##$TD= 65536
##$TD0= 1
##$TE= 295.16
##$TE2= 300
##$TE3= 300
##$TEG= 300
##$TL= (0..7)
0 120 120 120 120 120 120 120 
##$TP= (0..7)
150 150 150 150 150 150 150 150 
##$TP07= 0
##$TPNAME0= <>
##$TPNAME1= <>
##$TPNAME2= <>
##$TPNAME3= <>
##$TPNAME4= <>
##$TPNAME5= <>
##$TPNAME6= <>
##$TPNAME7= <>
##$TPOAL= (0..7)
0.5 0.5 0.5 0.5 0.5 0.5 0.5 0.5 
##$TPOFFS= (0..7)
0 0 0 0 0 0 0 0 
##$TUNHIN= 0
##$TUNHOUT= 0
##$TUNXOUT= 0
##$USERA1= <user>
##$USERA2= <user>
##$USERA3= <user>
##$USERA4= <user>
##$USERA5= <user>
##$V9= 5
##$VALIST= <valist>
##$VCLIST= <CCCCCCCCCCCCCCC>
##$VD= 0
##$VDLIST= <DDDDDDDDDDDDDDD>
##$VPLIST= <PPPPPPPPPPPPPPP>
##$VTLIST= <TTTTTTTTTTTTTTT>
##$WBST= 1024
##$WBSW= 4
##$XGAIN= (0..3)
0 0 0 0 
##$XL= 0
##$YL= 0
##$YMAX_a= 370227
##$YMIN_a= -483081
##$ZGOPTNS= <>
##$ZL1= 120
##$ZL2= 120
##$ZL3= 120
##$ZL4= 120
##$ABSF1= 16.45064
##$ABSF2= -4.242533
##$ABSG= 5
##$ABSL= 3
##$ALPHA= 0
##$AQORDER= 0
##$ASSFAC= 0
##$ASSFACI= 0
##$ASSFACX= 0
##$ASSWID= 0
##$AUNMP= <proc_1d>
##$AZFE= 0.1
##$AZFW= 0.1
##$BCFW= 0
##$BC_mod= 0
##$BYTORDP= 0
##$COROFFS= 0
##$CY= 12.5
##$DATMOD= 1
##$DC= 0
##$DFILT= <>
##$DTYPP= 0
##$F1P= 14.0000005364418
##$F2P= -0.99999901652339
##$FCOR= 0.5
##$FTSIZE= 32768
##$FT_mod= 6
##$GAMMA= 0
##$GB= 0
##$INTBC= 1
##$INTSCL= 1
##$ISEN= 128
##$LB= 0.3
##$LEV0= 0
##$LPBIN= 0
##$MAXI= 10000
##$MC2= 0
##$MEAN= 0
##$ME_mod= 0
##$MI= 0
##$NCOEF= 0
##$NC_proc= -2
##$NLEV= 6
##$NOISF1= 0
##$NOISF2= 0
##$NSP= 0
##$NTH_PI= 0
##$NZP= 0
##$OFFSET= 16.45064
##$PC= 1
##$PHC0= 158.025
##$PHC1= 7.334637
##$PH_mod= 1
##$PKNL= yes
##$PPARMOD= 0
##$PSCAL= 4
##$PSIGN= 0
##$REVERSE= no
##$SF= 250.130017847498
##$SI= 32768
##$SIGF1= 0
##$SIGF2= 0
##$SINO= 400
##$SIOLD= 32768
##$SREGLST= <1H.CDCl3>
##$SSB= 0
##$STSI= 32768
##$STSR= 0
##$SW_p= 5175.98343685301
##$SYMM= 0
##$S_DEV= 0
##$TDeff= 65536
##$TDoff= 0
##$TI= <Analysis number 999999
Compound Code 99
Book Reference 9
Project Code 9>
##$TILT= no
##$TM1= 0
##$TM2= 0
##$TOPLEV= 0
##$USERP1= <user>
##$USERP2= <user>
##$USERP3= <user>
##$USERP4= <user>
##$USERP5= <user>
##$WDW= 1
##$XDIM= 32768
##$YMAX_p= 309560669
##$YMIN_p= -55063
$$ End of Bruker specific parameters
$$ ---------------------------------
##NTUPLES= NMR SPECTRUM
##VAR_NAME=  FREQUENCY,     SPECTRUM/REAL,   SPECTRUM/IMAG
##SYMBOL=    X,             R,               I
##VAR_TYPE=  INDEPENDENT,   DEPENDENT,       DEPENDENT
##VAR_FORM=  AFFN,          ASDF,            ASDF
##VAR_DIM=   32768,         32768,           32768
##UNITS=     HZ,            ARBITRARY UNITS, ARBITRARY UNITS
##FACTOR=    0.157963299565203, 1,           1
##FIRST=     4114.79880794984, 0,            0
##LAST=      -1061.18462890317, 0,           0
##MIN=       -1061.18462890317, -55063,      0
##MAX=       4114.79880794984, 309560669,    0
$$ Real data points
##PAGE= N=1
##DATA TABLE= (X++(R..R)), XYDATA
$$ [...]
15135b0503P035J2030p47L287N495N635k379k734k606o775J548P728J600m518
$$ -20503 -13468 -1438 -2185 1102 6597 12232 9853 7119 4513 -2262 -714 7014 8614 4096
15121D096k10n678K095N275n3N538O402l481o942K94p161J600Q929m869L25J417
$$ 4096 3886 -1792 303 5578 5525 11063 17465 13984 7042 7336 175 1775 10704 5835 6160 7577
15105G577m957j307q65O447J758k065k547r850J0340N834O14L89j595l901n134
$$ 7577 2620 1313 448 6895 8653 6588 4041 -5809 4531 10365 10979 11368 9773 5872 738
15090G38L000p932n036Om48k371K904O784L948j457k037M938j083o093m368J3436
$$ 738 3738 -4194 -9230 -9224 -9672 -12043 -9139 -2355 1593 136 -1901 3037 1954 -4139 -8507 4929
15074D929J4918K537J462o089j4167K178j047j391j957k172r412M26K693l460
$$ 4929 19847 22384 23846 17757 3590 5768 4721 3330 1373 -799 -10211 -9785 -7092 -10552
15060a0552k436J172J4194J2409j282m852j187k43p731j1556k010J739m265R593
$$ -10552 -12988 -11816 2378 14787 13505 8653 7466 7223 -508 -12064 -14074 -12335 -16600 -7007
15046g007J1550O817n214r041J1108J575q000K165K579L593j387j0392j123p927
$$ -7007 4543 11360 6146 -2895 8213 9788 1788 3953 6532 10125 8738 -1654 -2777 -10704
15032a0704j790J3445N706k003R173j156j3709q32O351P85n710N40l648p622j967
$$ -10704 -12494 951 6657 4654 13827 12671 -1038 -1870 4481 5266 -444 96 -3552 -11174 -13141
15017a3141M826L095K750O919n23q81J03j0940K059P670M656q67P761j023J532
$$ -13141 -8315 -5220 -2470 4449 3926 3045 3148 -7792 -5733 1937 6593 5726 13487 12464 13996
15002A3996p48o733n742m790m735R0M629J1767R57j0355n492n673J0668N793m77
$$ 13996 13248 6515 773 -4017 -8752 -8662 -4033 7734 8691 -1664 -7156 -12829 -2161 3632 3155
14987C155r078j2714p21N260r79k424J962L242k715L89n98J695L737k545o7k672
$$ 3155 -5923 -18637 -19358 -14098 -15077 -17501 -15539 -12297 -15012 -14623 -15221 -13526 -9789 -12334 -12401 -15073
14971a5073P325N585k532n181j4337m827K85M414J2438K662L231P814K770j801
$$ -15073 -7748 -2163 -4695 -9876 -24213 -29040 -28755 -24341 -11903 -9241 -6010 1804 4574 2773
14957B773L783l340n823l15J3601P00J84M405M23p016o579o325k91R089N805o716
$$ 2773 6556 3216 -2607 -2922 10679 11379 11563 15968 16391 9375 2796 -3529 -3820 5269 11074 4358
14941D358j193Q484k571n181l193j0460o724P68J4198k836K221J1925J1565r903
$$ 4358 3165 11649 9078 3897 704 -9756 -16480 -15712 -1514 -4350 -2129 9796 21361 11458
14927A1458n685P444j0854j950k075j847K858o011r29P570M325r059r532P724
$$ 11458 5773 13217 2363 413 -1662 -3509 -651 -6662 -7591 -21 4304 -4755 -14287 -6563
14913f563J0554N677j5860r034j58P14k589M131K437q254J847N915N228O439M638
$$ -6563 3991 9668 -6192 -15226 -15384 -14670 -17259 -13128 -10691 -18945 -17098 -11183 -5955 484 5122
14898E122q434L123R160p209r373p734N160P221m951n551J5238L663r510m2J0478
$$ 5122 -3312 -189 8971 1762 -7611 -15345 -10185 -2964 -7915 -13466 1772 5435 -4075 -4117 6361
14883F361n650j0285k200R218M757l397j787m715R666k192M234k60j618r645L298
$$ 6361 711 -9574 -11774 -2556 2201 -1196 -2983 -7698 1968 -224 4010 3750 2132 -7513 -4215
14868d215M08O513N922p18n136j0295J112K633p904o042M911R689P22j984O331
$$ -4215 -3807 2706 8628 7910 2774 -7521 -6409 -3776 -11680 -17722 -12811 -3122 -2400 -4384 1947
14853A947N483M88n899q486O02k586q401J1840J3041m834o441q30M063o738k43
$$ 1947 7430 7918 2019 -6467 -5865 -8451 -16852 -5012 8029 3195 -3246 -4076 -13 -6751 -6994
14838f994j601J1254Q90o281m120l74L919l834j668R116M224o582L382M659j030
$$ -6994 -8595 2659 3549 -2732 -6852 -7226 -3307 -7141 -8809 307 4531 -2051 1331 5990 4960
14823D960j028K728m833m503K722j362m297L485J593N601j47O04l419q66l241
$$ 4960 3932 6660 1827 -2676 46 -1316 -5613 -2128 -535 5066 4919 5523 2104 1238 -2003
14808b003O686J180k382j951O249J51N83m403p437r95M123k875k845o548L907
$$ -2003 4683 5863 3481 1530 7779 7930 8513 4110 -3327 -4322 -199 -3074 -5919 -12467 -8560
14793h560l973j0693L358J1166M588M270l138o939M399L096r330J524Q079N56
$$ -8560 -12533 -23226 -19868 -8702 -4114 156 -2982 -9921 -5522 -2426 -11756 -10232 -2153 -1597
14779a597P338j702R9k734O184N900L74j0442j4279O425l058k867O217j884O6
$$ -1597 5741 4039 4138 1404 7588 13488 13862 3420 -10859 -4434 -7492 -10359 -4142 -6026 -5960
14764e960j681q25M209L238M047M920M134m040q847m121M134P676m366k050o990
$$ -5960 -7641 -8466 -4257 -1019 3028 7948 12082 8042 -805 -4926 -792 6884 2518 468 -6522
14749f522p483K51o601O542J0878j3r399J778J308P535l158L747k596m124J1947
$$ -6522 -14005 -13754 -20355 -13813 -2935 -2948 -12347 -10569 -9261 -1726 -4884 -1137 -3733 -7857 4090
14734D090Q85M157L455p339p957K331Q59J73J0375R622p479j116P265l28p790
$$ 4090 4975 9132 12587 5248 -2709 -378 481 654 11029 20651 13172 12056 19321 18993 11203
14719A1203l233O888R905p269j7430l192p683p583j111o65Q081j066k108n114
$$ 11203 7970 14858 24763 17494 64 -3128 -10811 -18394 -19505 -20170 -12089 -13155 -15263 -20377
14705b0377j044R119J5531k738o276P865o434Q22M710l354N713r9n977n698K546
$$ -20377 -21421 -12302 3229 491 -5785 2080 -4354 -3532 1178 -2176 3537 3438 -2539 -8237 -5691
14690e691Q63m323m775L885M133m726L27R165l111n976R08O54J895l239L15J0115
$$ -5691 -4828 -9151 -13926 -10041 -5908 -10634 -10307 -1142 -4253 -10229 -9321 -8667 -6772 -10011 -9696 419
14674D19O979m18j998o680k235P787o07J675K883K361K148n197o677L327K233
$$ 419 7398 6980 4982 -1698 -3933 3854 3247 4922 7805 10166 12314 7117 440 3767 6000
14659F000k983j599O895P41k893p683j2430M416P045j0924l367J7386J8332l580
$$ 6000 3017 1418 8313 9054 6161 -1522 -13952 -9536 -2491 -13415 -16782 604 18936 15356
14645A5356j0634k092N236P86j144j678o342r864l499K829Q113k572M120P505
$$ 15356 4722 2630 7866 8652 7508 5830 -512 -10376 -13875 -11046 -2933 -5505 -1385 6120
14631F120K418j93k775m000l95R93Q057J23n988k753Q630P02j2298K610J0089
$$ 6120 8538 8345 5570 1570 1175 2168 10225 10348 4360 1607 10237 10939 -1359 1251 11340
14616A1340p760L084K623r180M806l904k992N454O396M614J593q6j045l436O535
$$ 11340 3580 6664 9287 107 4913 1009 -1983 3471 9867 14481 16074 15988 14943 11507 18042
14601A8042p281p170J839k630M588N978L400l755j849k962j38r617j804P045K370
$$ 18042 10761 3591 5430 2800 7388 13366 16766 13011 11162 8200 8062 -1555 -3359 3686 6056
14586F056m713M961J343q223n9J879J635n99j0285k846M396m17O30o316N427L689
$$ 6056 1343 6304 7647 -576 -635 1244 2879 2280 -8005 -10851 -6455 -6872 -6242 -12558 -7131 -3442
14570c442n80o939M632N440k369q00N448Q730j246l371m867j236L595P069j0308
$$ -3442 -4022 -10961 -6329 -889 -3258 -4058 1390 10120 8874 5503 636 -600 2995 10064 -244
14555b44l699j817q191K727M528O034M772r245O78M339o594n249J511N774p138
$$ -244 -3943 -5760 -13951 -11224 -6696 -662 4110 -5135 -4457 -118 -6712 -11961 -10450 -4676 -11814
14540a1814o253O441l129j525P317M138p50J6K242m38k653n81L001R19K255k031
$$ -11814 -18067 -11626 -14755 -16280 -8963 -4825 -5575 -5559 -3317 -3755 -6408 -6989 -3988 -3069 -814 -2845
14524b845q511j919P703m06K787K972l87q671q32J4252O914r482q63M42p019k232
$$ -2845 -11356 -13275 -5572 -5978 -3191 -219 -606 -9277 -10109 4143 11057 1575 712 1154 -5865 -8097
14508h097J111m44P239J436P356m963j1980K367O08M814M389m30r23K856R330
$$ -8097 -6986 -7430 -191 1245 8601 3638 -8342 -5975 -5367 -553 3836 3406 2483 5339 14669
14493A4669K992k578j844P069j3060q726m802j399R604J0426j5484l499Q160r034
$$ 14669 17661 15083 13239 20308 7248 -1478 -6280 -7679 1925 12351 -3133 -6632 1528 -7506
14479g506j2563P465K315O792M298P76q422k207J7108J9979p642k942O139m386
$$ -7506 -20069 -12604 -10289 -3497 801 1577 -6845 -9052 8056 28035 20393 17451 23590 19204
14465A9204m148m890o720r464n16j1784O150J0005R252n864j3481m4J1791M128
$$ 19204 15056 10166 3446 -6018 -6534 -18318 -12168 -2163 7089 1225 -12256 -12300 -509 3619
14451C619j732J1678N90o414m248l7P062m940M566l267k980k433N51K502k537
$$ 3619 1887 13565 14155 7741 3493 3456 10518 5578 10144 6877 3897 1464 2015 4517 1980
14436A980n1J789M346L461L719m605r167N083k617k112K680q523k58k228N875
$$ 1980 1929 3718 8064 11525 15244 10639 1472 6555 3938 1826 4506 -4017 -4275 -6503 -628
14421f28m426m669N146L163K571P216k167r552m10L117o844r597J0445R929L915
$$ -628 -5054 -9723 -4577 -1414 1157 8373 6206 -3346 -3756 -639 -7483 -17080 -6635 3294 7209
14406G209r952m361K053L837l273q103J0950J6157p78o95p869o783q386M936L576
$$ 7209 -2743 -7104 -5051 -1214 -4487 -12590 -1640 14517 13739 13044 5175 -1608 -9994 -5058 -1482
14391a482L16R293j815p888O189N41n22j862K213L20n128R23O21J617l73p388
$$ -1482 -1166 8127 6312 -1576 4613 5154 4632 2770 4983 5303 175 1098 1719 3336 2963 -4425
14375d425k808l279O242n145N184n716K843J001Q295K660n322m75J82N296m471
$$ -4425 -7233 -10512 -4270 -9415 -4231 -9947 -7104 -6103 2192 4852 -470 -945 -763 4533 62
14360F2K658L912P855L652m801j339K549k117O675P256p558j682k287m651R853
$$ 62 2720 6632 14487 18139 13338 11999 14548 12431 19106 26362 18804 17122 14835 10184 20037
14345B0037k056j5371q569M037J957l551K163N213L981K874n357p820J484K142
$$ 20037 17981 2610 -5959 -1922 35 -3516 -1353 3860 7841 10715 5358 -2462 -978 1164
14331A164M018o943l968k889R35O754J0469q917k620L838J943J396J1081J72r502
$$ 1164 5182 -1761 -5729 -8618 -7683 -929 9540 623 -1997 1841 3784 5180 16261 16433 6931
14316F931o864n599m517L999N82n987M89N277L971M878n219k959J3978K157k810
$$ 6931 67 -5532 -10049 -6050 -5468 -11455 -10966 -5689 -1718 3160 -2059 -5018 8960 11117 8307
14301H307r675k747R678l899j0918M861n736J542L606L298Q955o551j152M672
$$ 8307 -1368 -4115 5563 1664 -9254 -4393 -10129 -8587 -4981 -1683 7272 721 -431 4241
14287D241P90O944Q47K476L520m771r665M207m251j804M409l136K07L649p491
$$ 4241 5031 11975 12822 15298 18818 14047 4382 8589 4338 2534 6943 3807 4014 7663 172
14272A72N115R260j614m640j862J792j2164j025l170L916J870J0718n129j2601
$$ 172 5287 14547 12933 8293 6431 8223 -3941 -4966 -8136 -4220 -2350 8368 3239 -9362
14258i362M08K648O162k176K30N990l205n10N62P90J011L96Q060N907l521m727
$$ -9362 -8954 -6306 -144 -2320 -2090 3900 695 185 747 1537 2548 2944 11004 16911 13390 8663
14242H663n591j896mM187M373k523j634N4N873P005P13L639J2467J3924J0439
$$ 8663 3072 1176 1172 5359 9732 7209 5575 5629 11502 18507 19220 22859 35326 49250 59689
14227E9689K6445J8029J7190N402n886j9079k1277k5468j0191j151l073o647r882
$$ 59689 86134 104163 121353 126755 120869 101790 80513 55045 44854 43703 40630 33983 24101
14214B4101q493k622J6L440k639K37m901O115R844j421n128p038j006L163O02
$$ 24101 15608 12986 13002 16442 13803 14040 9139 15254 25098 23677 18549 11511 10505 13668 14270
14199A4270Q177M483R073Q235P057P376J016M615j0587q559J0284P914k706L832
$$ 14270 22447 26930 36003 44238 51295 58671 59687 64302 53715 45156 55440 63354 60648 64480
14185F4480Q819K733R496J7621J8323K6940K6870J3788J6277J1826J862J518n206
$$ 64480 73299 76032 85528 103149 121472 148412 175282 189070 205347 217173 219035 220553 215347
14172B15347j4379j6678l0871k5618o601r749j7216j0531j1746p498j5208j1812
$$ 215347 200968 184290 153419 127801 121200 111451 94235 83704 71958 64460 49252 37440
14160C7440j1646L61J782N256l71l456q539q888m876l070n420N917J6270J999
$$ 37440 25794 26155 27937 33193 32822 29366 20827 11939 7063 3993 -1427 4490 20760 22759
14146B2759p076q164R406N289K737q926j6087L809L942m737j883N189O718j6514
$$ 22759 15683 7519 16925 22214 24951 16025 -62 3747 7689 2952 1069 6258 12976 -3538
14132c538m93J0368j87O142O098L772J086j4403o296j1994L756J3831N805R883
$$ -3538 -4031 6337 6150 12292 18390 22162 23248 8845 2549 -9445 -5689 8142 13947 23830
14118B3830k432r091P61K783J670r537j1241m76L886l572K592J1409R235k561
$$ 23830 21398 12307 13068 15851 17521 7984 -3257 -3733 153 -3419 -827 10582 19817 17256
14104A7256n374l823p352k08L141P819R867p097j5152j2125o353J199P662J2394
$$ 17256 11882 8059 707 499 3640 11459 21326 14229 -923 -13048 -19401 -18202 -10540 1854
14090A854L139j504j039k747n638k062M983k737P381R446o957j922J0133o65k121
$$ 1854 4993 3489 2450 -297 -5935 -7997 -3014 -5751 1630 11076 4119 2197 12330 11665 9544
14075I544M994k251j1188Q957N814o031p916n30l534J347M967j2486j556O499
$$ 9544 14538 12287 1099 10056 15870 9839 1923 1393 -2141 -794 4173 -8313 -9869 -3370
14061c370J220O328r30j849o11n465J526J742K622N915J0614J1650O80l40j8986
$$ -3370 -2150 4178 3248 1399 788 -4677 -3151 -1409 1213 7128 17742 29392 30072 29732 10746
14046A0746r477P80k447p612m447k214q12k491O160P399Q544Q834L928j1235L883
$$ 10746 1269 2049 -398 -8010 -12457 -14671 -15483 -17974 -11814 -4415 4129 12963 16891 5656 9539
14031I539J351k375N421q06q07m574p535P215J881o458Q13o38O244O957Q010K368
$$ 9539 10890 8515 13936 13130 12323 7749 214 7429 9310 2852 3665 3027 9271 16228 24238 26606
14015B6606m341O179o074l135m234o108Q307O804O608P261M986l465q032p382
$$ 26606 22265 28444 22370 19235 15001 8893 17200 24004 30612 37873 42859 39394 31362 23980
14001B3980J450R926l314q751n3M514K7L427n039m505J145P123P663n50M048M258
$$ 23980 25430 35356 32042 23291 23238 27752 27779 31206 26167 21662 22807 29930 37593 37043 41091 45349
13985D5349m335q01N873q252k318M136Q10n429r13Q650r07j1342o469P85L403
$$ 45349 41014 40213 46086 37834 35516 39652 40462 35033 34120 42770 41863 30521 24052 24837 28240
13970B8240m717l863j773j881k297n386Q053l579O386M793l699p83k398j823J793
$$ 28240 23523 19660 17887 16006 13709 8323 16376 12797 19183 23976 20277 19494 17096 15273 17066
13955A7066J0093L852N857N935r512j4140q146l453N60Q28q148j458P526L984
$$ 17066 27159 31011 36868 42803 33291 19151 11005 7552 8112 8940 792 -666 6860 10844
13941A0844M107J372N844o014j3768j082J8115R905J271j308l883O99M127l598
$$ 10844 14951 16323 22167 16153 2385 1303 19418 29323 30594 29286 25403 26102 30229 26631
13927B6631N382O737k43N211M16m816J369K266k162j612m033k867O835M40J272
$$ 26631 32013 38750 38507 43718 44134 39318 40687 42953 40791 39179 35146 32279 39114 39554 40826
13912D0826M65r476j0097K887J2679L492j1370L346P943k599m563p816M439J679
$$ 40826 41291 31815 21718 24605 37284 40776 29406 32752 40695 38096 33533 25717 30156 31835
13898C1835Q27J857o660N25n83P516J19l92L613O16o003M552P255q331j915J170
$$ 31835 32662 34519 27859 28384 27801 35317 35436 35044 38657 39273 33270 37822 45077 36746 34831 36001
13882C6001J1438L374n720n591P80k937k684N755j990J367N495M181J325l241
$$ 36001 47439 50813 45093 39502 40282 37345 34661 40416 38426 39793 45288 49469 50794 47553
13868D7553O99M80R61N312N595K017k462j9165l817P50j631n013j337K06Q669
$$ 47553 48252 48732 49693 55005 60600 62617 60155 40990 37173 37923 36292 31279 29942 30148 38817
13853C8817M912O865J3132o39K341J2912J8163K294J6065J6325J2431L839O618
$$ 38817 43729 50594 63726 63087 65428 78340 96503 98797 114862 131187 143618 147457 154075
13840A54075L618Q34K751k908l871j3317j8686k51N926M968J2163N398n308J0611
$$ 154075 157693 158527 161278 158370 154499 141182 122496 122245 128171 133139 145302 150700 145392 156003
13826A56003o249K08L055k528q785j0152m116l609K732r06k248j046J842l421
$$ 156003 149754 149962 153017 150489 141704 131552 127436 123827 126559 125653 123405 122359 124201 120780
13812A20780L389Q196J1952L208M980p55K735O531N871j017J529O990O556M656
$$ 120780 124169 132365 144317 147525 152505 151750 154485 161016 166887 165870 167399 174389 180945 185601
13798A85601Q528P762J351O087l51M761J6646J3410J3049Q492J0547J3827J2496
$$ 185601 194129 201891 203242 209329 208978 213739 230385 243795 256844 265336 275883 289710 302206
13785C02206R918J9967P042Q091J5858J7945K4373L0347L0175L2106J5895J6066
$$ 302206 312124 332091 339133 347224 363082 381027 405400 435747 465922 498028 513923 529989
13773E29989K6285L3555L8262M1628K8976M0257N4992N9550O3893P2148Q2337
$$ 529989 556274 589829 628091 669719 698695 738952 793944 853494 917387 989535 1071872
13762A071872Q3359Q4028R5940J22486J38120J51886J77161K08609K44064K80373
$$ 1071872 1155231 1239259 1335199 1457685 1595805 1747691 1924852 2133461 2377525 2657898
13752B657898L25797L70206M37112N14474N85467O71897P64903Q72788J007681
$$ 2657898 2983695 3353901 3791013 4305487 4890954 5562851 6327754 7200542 8208223
13743H208223J209069J469076J823847K242779K715661L174937L486785L616466
$$ 8208223 9417292 10886368 12710215 14952994 17668655 20843592 24330377 27946843
13735B7946843L536500L192810K569221J700420O00446n81631j684344k588024
$$ 27946843 31483343 34676153 37245374 38945794 39546240 38964609 37280265 34692241
13727C4692241l230767l610713l733909l600746l280889k822659k334566j877914
$$ 34692241 31461474 27850761 24116852 20516106 17235217 14412558 12077992 10200078
13719A0200078j490690j194134r81294q25165o82408n89885n15739m44618l77757
$$ 10200078 8709388 7515254 6533960 5708795 5026387 4436502 3920763 3476145 3098388
13710C098388l32739k89859k32311k06958j84840j63885j39866j19032j14346
$$ 3098388 2765649 2475790 2243479 2036521 1851681 1687796 1547930 1428898 1314552
13701A314552r5521p7829p7494p2418o1237n1201n0410m1290l6347m5353m5678
$$ 1314552 1219031 1141202 1063708 991290 930053 878852 828442 787152 750805 705452 659774
13690F59774k8303k3554k6773l6299k9335k1844k0657j8864l0200k1873k1713
$$ 659774 631471 607917 581144 544845 515510 493666 473009 454145 423945 402072 380359
13679C80359j1188p669j3349j2581L142j4058k0002r895l972r126j3261j0345
$$ 380359 369171 361502 348153 335572 338714 324656 304654 294759 290787 281661 268400 258055
13667B58055p48q117j7239j1052j024J184m256k335j4561l498n344r128R69m537
$$ 258055 257307 249190 231951 220899 219875 221059 216803 214468 199907 196409 191065 181937 182906 178369
13653A78369j0173n518L752j1327k903J1121R44n970j104j2183m790m754j1689
$$ 178369 168196 162678 166430 155103 152200 163321 164265 158295 157191 145008 140218 135464 123775
13640A23775k483R211M135o753m380o912j3193p766j118N972K342l27M903J0756
$$ 123775 121292 130503 134638 127885 123505 116593 103400 95634 94516 100488 102830 102503 107406 118162
13626A18162K236m775m513k269R88L140o091n74j2012m381k143l04K000N729P567
$$ 118162 120398 115623 111110 108841 109829 112969 106878 106304 94292 89911 87768 87464 89464 95193 102760
13611A02760J546k049J816K518n986O196J0601r563j12j3162j1333J168P993n847
$$ 102760 104306 102257 104073 106591 100605 106801 117402 107839 107727 94565 83232 84400 92393 86546
13597H6546j4522j0149j377n98o978k129k5N77N622P60j1254l550o266p046m503
$$ 86546 72024 61875 60498 59900 52922 50793 50768 51345 56967 57727 46473 42923 36657 29611 25108
13582B5108Q873J0938J2201p85l325m112O869k257o623K71L450N938q877r554
$$ 25108 33981 44919 57120 56335 53010 48898 55767 53510 46887 47158 50608 56546 47669 38115
13568C8115l155m071j944l475P788K012J389J276l580j3919j415N32j926O2K073
$$ 38115 34960 30889 28945 25470 33258 35270 36659 37935 34355 20436 19021 19553 17627 17689 19762
13553A9762n123J411J913L106L165p739m365L168k802k208M66N821o957P43J162
$$ 19762 14639 16050 17963 21069 24234 16495 12130 15298 12496 10288 10754 16575 9618 10361 11523
13538A1523M950J215N155J876k234r747o431m212M928L686N864n058K355O665
$$ 11523 16473 17688 22843 24719 22485 12738 6307 2095 7023 10709 16573 11515 13870 20535
13524B0535J2749P585l286m117k482k590p58j1721p214n991N88M950M074J0490
$$ 20535 33284 40869 37583 33466 30984 28394 27636 15915 8701 2710 3298 8248 12322 22812
13510B2812L286p187R86P785L879p176r046j120j1680j262M123Q621M236o696
$$ 22812 26098 18911 19897 27682 31561 24385 15339 14219 2539 1277 5400 14021 18257 11561
13496A1561l685j70N846N05O228M499m125p365L426p673N31L273J53M988J320
$$ 11561 7876 7706 13552 14057 20285 24784 20659 13294 16720 9047 9578 12851 13004 17992 19312
13481A9312l434o059o589L097l96k434J0680M089l430O32L789K972K684J503L627
$$ 19312 15878 9819 3230 6327 5931 3497 14177 18266 14836 15468 19257 22229 24913 26416 30043
13466C0043n980M483L70j882k069j741rm111l19Q4k770K724r81L587J0023m61
$$ 30043 24063 28546 28916 27034 24965 23224 23215 19104 18785 18869 16099 18823 17842 21429 31452 30991
13450C0991q940j0681j737k529R322N994P909k462j841L107R80m196m686o061
$$ 30991 22051 11370 9633 7104 16426 22420 30329 27867 26026 29133 30113 25917 21231 15170
13436A5170j053P670J0428R92j1450r90j477n440K370o35J513O18O764J905j1939
$$ 15170 14117 21787 32215 33207 21757 20767 19290 13850 16220 15585 17098 17716 24480 26385 14446
13421A4446N133L51j0568j0314K333J5341J582l573L76m958Q36m354k34J803R396
$$ 14446 19579 19930 9362 -952 1381 16722 18304 14731 15107 10149 10985 6631 6397 8200 17596
13406A7596M95l821l325J735K598m451j0820k304L066N555L492P057M242l921
$$ 17596 18091 14270 10945 12680 15278 10827 7 -2297 769 6324 9816 16873 21115 17194
13392A7194j1035o13K781m406J0214N150m009r895n645Q131l755k119Q097J994
$$ 17194 6159 5546 8327 3921 14135 19285 15276 5381 -264 7867 4112 1993 10090 12084
13378A2084M95r46o589Q511j438o823K462p53K664K499L689O67r17K956j254p874
$$ 12084 12579 11633 5044 13555 12117 5294 7756 7003 9667 12166 15855 16522 15605 18561 17307 9433
13362I433o139Q824J2242l713K936q293o551p187p890o94Q291P922Q18n379J21
$$ 9433 3294 12118 24360 20647 23583 15290 8739 1552 -6338 -7032 1259 9181 9999 4620 4741
13347D741J397M034K398J504j1461k079R940j677L94l267j77n791M869J0602o994
$$ 4741 6138 10172 12570 14074 2613 534 10474 8797 9191 5924 5747 -44 4825 15427 8433
13332H433M700k077j6736L462J79Q404M391p11J1386n7j1046m860M476R45p805
$$ 8433 13133 11056 -5680 -2218 -2039 6365 10756 10045 21431 21374 10328 5468 9944 10889 3084
13317C084p327k351J1416O177j129n53L557M747N607j307J966m59N054p280N072
$$ 3084 -4243 -6594 4822 10999 9870 9317 12874 17621 23228 21921 23887 23428 28482 21202 26274
13302B6274q136q140M567O564L886M002J0925O021j843j349Q593M915O104R248
$$ 26274 18138 9998 14565 21129 25015 29017 39942 45963 44120 42771 51364 56279 62383 71631
13288G1631J2888K1216J3430J4175K7193L1377J9672O766j1262j2154j1506j8180
$$ 71631 84519 105735 119165 133340 160533 191910 211582 218348 207086 194932 183426 165246
13276A65246j7959j1541k2355k1896j1354m711j0744j1369n817o923k618J0171
$$ 165246 147287 135746 113391 91495 80141 75430 64686 53317 47500 40577 37959 48130
13264D8130n384j9349l635o223o651J602l295m602k166j684K113O606Q481m125
$$ 48130 42746 23397 19762 13539 6888 8490 5195 593 -1573 -3257 -1144 5462 13943 9818
13250I818o406l504P523l92r634J059N450J3199K508J643L789j1439p021P87k568
$$ 9818 3412 -92 7431 7039 -2595 -1536 3914 17113 19621 21264 25053 13614 6593 7380 4812
13235D812l77j867k572L409j1844o830P320Q322L148K44l534J892M782N115o107
$$ 4812 4435 2568 -4 3405 -8439 -15269 -7949 373 3521 3765 231 2123 6905 12020 5913
13220E913J33K0J359m916m050Q091O321q642q837q021n07J3474R275O116n258
$$ 5913 6046 6066 7425 2509 -1541 6550 12871 4229 -4608 -12629 -13136 338 9613 15729 10471
13205A0471m380n248J2447Q692o414l953p566l947r56N345l47R51j770l502J0454
$$ 10471 6091 843 13290 21982 15568 11615 4049 102 -854 4491 4144 5095 3325 -177 10277
13190A0277Q567m429n949L667M869p262L69L96j967j982N742n0l305K332L370
$$ 10277 18844 14415 8466 12133 17002 9740 10109 10505 8538 6556 12298 12248 8943 11275 14645
13175A4645J508J0506J114n978r685o553P860K882o19P51p671r954m450r218P462
$$ 14645 16153 26659 27773 21795 12110 5557 13417 16299 15680 16431 8760 -1194 -5644 -14862 -7400
13160g400J2691Q371J614q096J815L648J1781q111q565M674Q40O76O139L031m642
$$ -7400 5291 13662 15276 7180 8995 12643 24424 16313 7748 12422 13262 13938 20077 23108 18466
13145A8466m663N97j906k913l617q257O885O478j162l373j631J978k273n449R45
$$ 18466 13803 14400 12494 9581 5964 -2293 4592 11070 9908 6535 4904 6882 4609 -840 105
13130A05P856M09O216N241N689o612m230J63p970p454P248M118L971K541O141
$$ 105 7961 8370 14586 19827 25516 18904 14674 14837 6867 -587 6661 10779 14750 17291 23432
13115B3432q1n868p492J198k343l381P061O589J327O930j640l50N112q86J632
$$ 23432 23351 17483 9991 11189 8846 5465 12526 19115 20442 27372 25732 25382 30494 29608 31240
13100C1240J604p699r942n983O183K245o751N798K658l976K0421P200j1445k437
$$ 31240 32844 25145 15203 9220 15403 17648 10897 16695 19353 15377 35798 42998 31553 29116
13086B9116k167j941m131m511j996M504Q261J476l899K828O668N634j999j041
$$ 29116 26949 25008 20877 16366 14370 18874 27135 28611 24712 27540 34208 39842 37843 36802
13072C6802j15j248p667j621j525L7Q72M475N226P155m988k485J207M565n927
$$ 36802 36687 35439 27772 26151 24626 24663 25535 30010 35236 42391 37403 34918 36125 40690 34763
13057C4763j6090M784P827l227p510M467P994R76n303r709L005L649P62p929m615
$$ 34763 18673 23457 31284 28057 20547 25014 33008 33984 28681 18972 21977 25626 26388 18459 13844
13042A3844M951R164q31j485O101k405L069P056m07O173o453p455m989l499r678
$$ 13844 18795 27959 27128 25643 31744 29339 32408 39464 39057 45230 38777 31322 26333 22834 13156
13027A3156O352K927j260k1K364L577j188L717q789o192K462K001J204J5700l172
$$ 13156 19508 22435 21175 21154 23518 27095 25907 29624 20835 14643 17105 19106 20310 36010 32838
13012C2838j1774l41l231L695j439M412N300K108o275J4122J3310o580j1477m093
$$ 32838 21064 20723 17492 21187 19748 24160 29460 31568 25293 39415 52725 46145 34668 30575
12998C0575k00j527l716n055j28K450N156M248Q471P141q844o37N784K435K168
$$ 30575 30375 28848 25132 20077 19949 22399 27555 31803 40274 47415 38571 37934 43718 46153 48321
12983D8321k139o969r068k613K882p1N789L892n308j0118m772K714M41L636k78
$$ 48321 46182 39213 30145 27532 30414 30343 36132 40024 34716 24598 19826 22540 22981 26617 26339
12968B6339k685P755P170P57j031M37M151N009j164k671o0l458J197r58q363k636
$$ 26339 23654 31409 38579 39336 38305 38742 42893 47902 46738 44067 44007 40549 41746 40788 32425 29789
12952B9789J450r43j62n156j274j291Q648l545p503J437j335J192P01K867m54
$$ 29789 31239 30296 30134 24978 23704 22413 31061 27516 20013 21450 20115 21307 22008 24875 24421
12937B4421J08L381p448R024K001j907K105q996l423P80J945k768p85P882o688
$$ 24421 24529 27910 20462 29486 31487 29580 31685 22689 19266 20046 21991 19223 18438 26320 19632
12922A9632K846j048j0277Q51P496N206Q412O268j799j5906l104O312K882k018
$$ 19632 22478 21430 11153 12004 19500 24706 33118 39386 37587 21681 18577 24889 27771 25753
12908B5753n434J408r366J0580P258j646p85m254r600J431N325M312J440p991
$$ 25753 20319 21727 12361 22941 30199 28553 27768 23514 13914 15345 20670 24982 26422 18431
12894A8431j1534n720J605J0577P212K248K972K722M875k524N331o485m138P536
$$ 18431 6897 1177 2782 13359 20571 22819 25791 28513 33388 30864 36195 29710 25572 33108
12880C3108L61n730l06P528n786r834P70N341P578J196k815o073n812L256J0534
$$ 33108 33469 27739 27433 34961 29175 19341 20111 25452 33030 34226 31411 25338 19526 22782 33316
12865C3316o406q421k679l706q393k094J4185Q691r5l206m119l170J945P34K154
$$ 33316 26910 18489 15810 12104 3711 1617 15802 24493 24398 21192 17073 13903 15848 16582 18736
12850A8736M39O879m619k957P29n888P314J4280M603j0427l315M812j618l802
$$ 18736 19175 26054 21435 18478 19207 13319 20633 34913 39516 29089 25774 30586 28968 25166
12836B5166J4617N896j832n601R24k517o257l095O102P280L346o904m970L523
$$ 25166 39783 45679 43847 38246 39170 36653 30396 27301 33403 40683 44029 37125 32155 35678
12822C5678Q103L520j520L7J875J0584P61l538k703j828J086M249n439p821N106
$$ 35678 43781 47301 45781 45818 47693 58277 59038 55500 52797 50969 52055 56304 50865 43044 48150
12807D8150J027n787P444o36o006R135O175m358p86j168m546O780J0984k083p223
$$ 48150 49177 43390 50834 50198 44192 53327 59502 55144 54358 53190 48644 55424 66408 64325 57102
12792E7102J363O212o58l314L628Q371M192R518j4896p099N965l703q716l039
$$ 57102 58465 64677 64019 60705 64333 72704 76896 86414 71518 64419 70384 66681 57965 54926
12778E4926j400O175l876O945o26j32m98Q025J8052J1724L576o631j958K864M313
$$ 54926 53526 59701 55825 62770 62144 62012 61514 69539 87591 99315 102891 96260 94302 97166 101479
12763A01479l811k330L677l210l947j2293l280M969J3688R164N552J2702J830
$$ 101479 97668 95338 99015 95805 91858 79565 76285 81254 94942 104106 109658 122360 124190
12750A24190q434J348K686o890L083Q268P627r101k195Q658l899l458J862P800
$$ 124190 115756 117104 119790 112900 115983 124251 131878 122777 120582 129240 125341 121883 123745 131545
12736A31545j138j480O155m1q345L418K0548N204L523N007L429P311L768n896
$$ 131545 130407 128927 135082 135041 126696 130114 150662 155866 159389 164396 167825 175136 178904 173008
12722A73008m32J1364J7179O591j0078K884P326K533J5057R548k586M058J6039
$$ 173008 172576 183940 201119 207710 197632 200516 207842 210375 225432 234980 232394 236452 252491
12709B52491o073n69M132J1948J6644J3990J1567Q527J3327j275M528R838J3962
$$ 252491 246418 245849 249981 261929 278573 292563 304130 312657 325984 324709 329237 339075 353037
12696C53037K1707J1193J5383J9799K6838J5961K5410J8223K9252K8008K7731
$$ 353037 374744 385937 401320 421119 447957 463918 489328 507551 536803 564811 592542
12685E92542L3298K8997K4646L5072L8472M0710M3551M5927M8660M9971N8885
$$ 592542 625840 654837 679483 714555 753027 793737 837288 883215 931875 981846 1040731
12674A040731O9218P0846P3282Q5235R2272J00978J07782J03949J19764J25998
$$ 1040731 1109949 1180795 1254077 1339312 1431584 1532562 1640344 1744293 1864057 1990055
12664A990055J28484J28433J21294J04455J06731R8828J03907Q6258P9568O2296
$$ 1990055 2118539 2246972 2368266 2472721 2579452 2678280 2782187 2868445 2948013 3010309
12654C010309N0009L4632K2025Q146O852o170n442k817l90J8758J7076K2202L8344
$$ 3010309 3060318 3094950 3116975 3125121 3131973 3125803 3120361 3117544 3117154 3135912 3152988 3175190 3213534
12641C213534O3971P4321Q3671Q9305Q1222R4392J04333J02325R8349R4761R2256
$$ 3213534 3277505 3351826 3435497 3524802 3606024 3700416 3804749 3907074 4005423 4100184 4192440
12630D192440P8268P1133N8359M2957L0562K0871J1923o524l456m225Q41j8462
$$ 4192440 4270708 4341841 4400200 4443157 4473719 4494590 4506513 4499989 4496533 4492308 4493149 4474687
12618D474687k3538k7907k9007l1863n2117m8142m8377n6794o0672p1555o6599
$$ 4474687 4451149 4423242 4394235 4362372 4310255 4262113 4213736 4156942 4096270 4024715 3958116
12607C958116n6508n6073n1179m0777k6491m266N147J5293K1473L7468M5531M0735
$$ 3958116 3901608 3845535 3794356 3753579 3727088 3722822 3727969 3743262 3764735 3802203 3847734 3888469
12595C888469N6471O4407M3532N2662N1820L6087K2663K9747K1644J3545O813
$$ 3888469 3944940 4009347 4052879 4105541 4157361 4193448 4216111 4245858 4267502 4281047 4287860
12584D287860J4746L84r773J072J3531J2081J0740K1566K5150K4066J7423K7590
$$ 4287860 4302606 4302990 4293217 4294289 4307820 4319901 4330641 4352207 4377357 4401423 4418846 4446436
12572D446436J6669J0027o051k1181k2884l2851l3027l3797m0233m3639m5770
$$ 4446436 4463105 4473132 4467081 4445900 4423016 4390165 4357138 4323341 4283108 4239469 4193699
12561D193699l7017j6587l330L593J1146K3550M2818O3597P1427P9833Q1134Q5419
$$ 4193699 4156682 4140095 4136765 4140358 4151504 4175054 4217872 4281469 4352896 4432729 4513863 4599282
12549D599282P5878Q6962Q3697P8944O8927N6364M9325L9207K7434L1361J8550
$$ 4599282 4675160 4762122 4845819 4924763 4993690 5050054 5099379 5138586 5166020 5197381 5215931
12538E215931R373J275j2657r946k0834l4189n2298o3311n3400p4441q3115j05491
$$ 5215931 5225304 5226579 5213922 5203976 5183142 5148953 5096655 5033344 4979944 4905503 4822388 4716897
12526D716897j22208j13577j06129j10597j06321r7614r5231p9583p0336m6162
$$ 4716897 4594689 4481112 4374983 4264386 4158065 4060451 3965220 3885637 3815301 3769139
12516C769139l3496j7809j3392L89N152P982J8744K030j3176k1595l3248n0522
$$ 3769139 3735643 3717834 3704442 3704831 3709983 3717965 3736709 3738739 3725563 3703968 3670720 3620198
12504C620198o0705p9992j04581j14010j17463j28110j44727j52938j35176j43770
$$ 3620198 3559493 3479501 3374920 3260910 3143447 3015337 2870610 2717672 2582496 2438726
12494B438726j39967j37908j27652j26467j23778j07360j01794j06918r4810q2735
$$ 2438726 2298759 2160851 2033199 1906732 1782954 1675594 1573800 1466882 1372072 1289337
12484A289337p4585o1298o2095o2652o1757m5485m9674n3156m9895l4473k6703
$$ 1289337 1214752 1153454 1091359 1028707 966950 921465 871791 818635 768740 734267 707564
12473G07564l6077k8603l0059k2573j3299j8056k7346k0529k3926k3692j9562
$$ 707564 671487 642884 612825 590252 576953 558897 531551 511022 487096 463404 443842
12462D43842j5987j3458r44q484k8677k2279p504q616j0200k048m17q677j3817
$$ 443842 427855 414397 413453 404969 376292 354013 346509 337893 327693 325645 325228 316551 302734
12449C02734j8375r190r146j102M863K374j0480j0072j2004l376q372j2421J458
$$ 302734 284359 275169 266023 264921 269784 272158 261678 251606 239602 236226 227854 215433 216891
12436B16891j824j1240j1033k021M066n021J499J237j5409j4489O233Q807l457
$$ 216891 215067 203827 192794 190773 194839 189818 191317 192554 177145 162656 168889 177696 174239
12423A74239K54q321p794N237p147j957m648q51J971L352k216n592r558N311N120
$$ 174239 174493 166172 158378 163615 156468 154511 149863 149012 150983 154335 152119 146527 136969 142280 147400
12408A47400o621j0444l425l009L217j0170o932J986R392k669l339n68j329r829
$$ 147400 140779 130335 126910 123901 127118 116948 110016 112002 121394 118725 115386 114818 113489 103660
12394A03660N39k891L41o65K065k846K1P05M850n370k274L507r594j651J475J376
$$ 103660 104199 101308 101649 100984 103049 100203 100224 100929 105779 100409 98135 101642 92048 90397 91872 93248
12378I3248Q905m452j1055r506J1168o219o048J505J2298n720l614j636J18k867
$$ 93248 102153 97701 86646 77140 88308 82089 76041 77546 89844 84124 80510 78874 78992 76125
12364G6125M006K723n990m942o227N84P127R627o769n464l044j837K111J0951
$$ 76125 80131 82854 76864 71922 65695 66279 73406 83033 76264 70800 67756 65919 68030 78981
12350G8981N257L446K041j5598k149R320o546p136n274k677m418N629J0941M464
$$ 78981 84238 87684 89725 74127 71978 81298 74752 67616 62342 59665 55247 60876 71817 76281
12336G6281j546L64M755J815m767M7r813K84J0533R013L150k62R487J1890O909
$$ 76281 74735 75099 79854 81669 76902 76949 67136 67420 77953 86966 90116 89854 99341 111231 118140
12321A18140q347o788m242J2282J6825R891J0580J2426N696K0914L1298J3567
$$ 118140 109793 103005 98763 111045 127870 137761 148341 160767 166463 187377 218675 232242
12309B32242J2649L0978M6415M6865M9520N8463P8422R5982J10725J33063J48367
$$ 232242 244891 275869 322284 369149 418669 477132 555554 651536 762261 895324 1043691
12298A043691J52392J37395J10606O6765J0247m5292r7820j15420j12288j01992
$$ 1043691 1196083 1333478 1444084 1510849 1521096 1475804 1377984 1262564 1150276 1048284
12288A048284q1863n3176l6586j2400J096K8814O1758Q0033J10966J43767J93227
$$ 1048284 966421 913245 876659 864259 865355 894169 955927 1035960 1146926 1290693 1483920
12277A483920K43681K77993L06160L06943K54006J64588M4305p9977j81566k53433
$$ 1483920 1727601 2005594 2311754 2618697 2872703 3037291 3081596 3001619 2820053 2566620
12267B566620k82353k80638k46920j98153j46334r8824o5527k5577J0958L2937
$$ 2566620 2284267 2003629 1756709 1558556 1412222 1313398 1247871 1222294 1233252 1266189
12257A266189O8509R1365J05280J48427K24600K72080L11840L30118L48626L47788
$$ 1266189 1334698 1426063 1531343 1679770 1904370 2176450 2488290 2818408 3167034 3514822
12247C514822L19156K56173J68438O7723p8438k07674k98254l51039l69056l31850
$$ 3514822 3833978 4090151 4258589 4326312 4247874 4040200 3741946 3390907 3021851 2690001
12237B690001k80768k23005j64315j14286l6726R041N7658J07850J51177K20462
$$ 2690001 2409233 2186228 2021913 1907627 1870901 1879942 1937600 2045450 2196627 2417089
12227B417089L02035M03631N27887O09963O44739O05469M79978K66057R636k46692
$$ 2417089 2719124 3122755 3650642 4260605 4905344 5510813 5990791 6256848 6266484 6019792
12217F019792m54998n97570o44199o24856n30951m25212l12026k21679j51679
$$ 6019792 5564794 4967224 4323025 3698169 3167218 2742006 2429980 2208301 2056622
12208B056622r0561n5311p687M0167R2943J61830K26976K96735L33513L64274
$$ 2056622 1966061 1910750 1903063 1943230 2036173 2198003 2424979 2721714 3055227 3419501
12198C419501L45973L02560K23632J04974j2752j19680k34983l22294l54834l65925
$$ 3419501 3765474 4068034 4291666 4396640 4383888 4264208 4029225 3706931 3352097 2986172
12188B986172l65602l33384k89933k40955j80746j41621r7882l8565j1936O660
$$ 2986172 2620570 2287186 1997253 1756298 1575552 1433931 1336049 1297484 1285548 1292208
12178A292208K9376O6049J02557J56383K08175K64572L12245L19315K93712K19508
$$ 1292208 1321584 1387633 1490190 1646573 1854748 2119320 2431565 2750880 3044592 3264100
12168C264100R4930n1887j72870k55661l29284l50366l36892k65549k07408j69378
$$ 3264100 3359030 3307143 3134273 2878612 2549328 2198962 1862070 1596521 1389113 1219735
12158A219735j24504r3336n1196k8788m832J6087K6494O1857R0778J11190J37353
$$ 1219735 1095231 1001895 950699 921911 917079 933166 959660 1021517 1112295 1223485 1360838
12147A360838J26891J05834O2372j320n6411j11559j50951j62056j73799j55106
$$ 1360838 1487729 1593563 1655935 1654615 1598204 1486645 1335694 1173638 999839 844733
12137H44733j31653j15245q3793p0108n7341m6542l4954k9182k6174k3833j2053
$$ 844733 713080 597835 514042 443934 386593 340051 305097 275915 249741 225908 213855
12126B13855j0337k3138j9581n480o055o779k826L212p421j2884l382o166j2137
$$ 213855 203518 180380 160799 155319 149264 142485 139659 142871 135450 122566 119184 113018 100881
12113A00881n677k160J469j100R53k843o803k399q95k438N312m469P76J318J429
$$ 100881 95204 93044 94513 93413 94366 91523 84720 82321 81426 78988 84300 79831 80607 81925 83354
12098H3354j3905j7279R84J0399L401L05l181J271K452j5n815Q72J231L975J2407
$$ 83354 69449 52170 53154 63553 66954 67259 64078 65349 67801 67786 61971 62843 64074 68049 80456
12083H0456K943j8657j0248O493j254r390K545Q833m605j415j1968m08J970P67
$$ 80456 83399 64742 54494 60987 59733 50343 52888 61721 57116 55701 43733 43325 45295 46062
12069D6062j868m322N182R39p26J0969Q361o694q283k561l693J549L715O669o231
$$ 46062 44194 39872 45054 45993 45267 56236 64597 57903 49620 47059 43366 44915 48630 55299 49068
12054D9068p049k78L906l018k995q405K250J1060M661l103m884J906J0421q5j0765
$$ 49068 42019 41741 45647 42629 39634 31229 33479 44539 49200 46097 41213 43119 53540 53455 42690
12039D2690o061m644J307r484P681J4731j117L31M080N154M137j086Lr756j930
$$ 42690 36629 31985 33292 23808 31489 46220 45103 45434 49514 54668 58805 57719 57722 47966 46036
12024D6036J865M964k755N46j875m595n811j955R50N817r432o270P046L992kJ3228
$$ 46036 47901 52865 50110 50656 48781 44186 38375 36420 37370 43187 33755 27485 34531 38523 38521 51749
12008E1749L254M709m62j2454k287M228n830n693M320l957K337l75R72j2308q292
$$ 51749 55003 59712 59250 46796 44509 48737 42907 37214 41534 37577 39914 39539 40511 28203 19911
11993A9911J1855M838N698N467k97m022o510k519k565J09L098j811p224o528K980
$$ 19911 31766 36604 42302 47769 47472 43450 36940 34421 31856 31965 35063 33252 26028 19500 22480
11978B2480k757Q91P830R018k654r829K596J6241N842l379j566L704J359p533
$$ 22480 19723 20614 28444 37462 34808 24979 27575 43816 49658 46279 44713 48417 49776 42243
11964D2243j973j416r527j462O489K748n62l188j3695j425J0002K0736R799J367
$$ 42243 40270 38854 29327 27865 34354 37102 36540 33352 19657 18232 28234 48970 58769 60136
11950F0136m808R204K4577n77j1094m243M222q19j0588o530K629j0890n316M123
$$ 60136 55328 64532 89109 88532 77438 73195 77417 76598 66010 59480 62109 51219 45903 50026
11936E0026n616J203j105N340R04j0245l439P023m243r382P909R650j257M29O695
$$ 50026 44410 45613 44508 49848 50752 40507 37068 44091 39848 30466 38375 48025 46768 47197 53892
11921E3892n041J640k204j196n232m070p061n421n30P98P69p525O925P570q762
$$ 53892 48851 50491 48287 47091 41859 37789 30728 25307 24777 25575 26344 18819 25744 33314 24552
11906B4552j178k641q875L335P92L904j228q300J248N43l498Q211P320K867Q148
$$ 24552 23374 20733 11858 15193 15985 19889 18661 10361 11609 12152 8654 16865 24185 27052 35200
11891C5200N765P768J077J359n443r910L315M380M77m570M18k250k148m152q527
$$ 35200 40965 48733 49810 51169 45726 35816 39131 43511 43988 39418 39836 37586 35438 31286 22759
11876B2759l858J1548K817o401j323j649L291j875j130J057J385J0044j074J674
$$ 22759 18901 30449 33266 26865 25542 23893 27184 25309 24179 25236 26621 36665 35591 37265
11862C7265K71q868n483j2007L449J2595M063j2616j045Q73m973l24j981M24m
$$ 37265 37536 28668 23185 11178 14627 27222 31285 18669 17624 18497 13524 13200 11219 11643 11639
11847A1639Q49M632J461l088L119R190m933r881l252M634j0069n32J0093N587
$$ 11639 12488 17120 18581 15493 18612 27802 22869 12988 9736 14370 4301 3769 13862 19449
11833A9449M705q097n160L28P523M774R736M308m740m530k767l406J0419j587
$$ 19449 24154 16057 10897 11225 18748 23522 33258 37566 32826 28296 25529 22123 32542 30955
11819C0955J214Q6q953k627N941o859n533l504n092k543J742K404O889J0366M064
$$ 30955 32169 32255 23302 20675 26616 19757 14224 10720 5628 3085 4827 7231 14120 24486 28550
11804B8550k144r410k001L240j851l600J2002J1344J735n713m14P769k334k148
$$ 28550 26406 16996 14995 18235 16384 12784 24786 36130 37865 32152 31738 39507 37173 35025
11790C5025j1342n665O917J60r790o386n230K774m11l119P106L325K216J111N641
$$ 35025 23683 18018 24935 25095 15305 8919 3689 6463 6052 2933 10039 13364 15580 16691 22332
11775B2332Q486K768K652L58k310j416j728M670M078L164R386l108l470L310o009
$$ 22332 30818 33586 36238 36596 34286 32870 31142 35812 39890 43054 52440 49332 45862 49172 43163
11760D3163o772l508l711N391J767P67l574N8N045L155Q835J649l325j413J0907
$$ 43163 36391 32883 29172 34563 36330 37097 33523 33581 38626 41781 50616 52265 48940 47527 58434
11745E8434K625k528J055m079q027j3100q370m337Q90n07m373J590Q192J67J008
$$ 58434 61059 58531 59586 55507 47480 34380 26010 21673 22563 22056 17683 19273 27465 27632 28640
11730B8640k832q20m920Q356Q956M698q549k206K450M725o370j775R113p755m849
$$ 28640 25808 24988 20068 28424 37380 42078 33529 31323 33773 38498 32128 30353 39466 31711 26862
11715B6862L108J0904J1258n089q05j759m14O139R98l054q444o583r46O60J505
$$ 26862 29970 40874 52132 47043 46238 44479 44065 50204 51202 48148 39704 33121 32175 32835 34340
11700C4340P168p075J786N176n213j2208l293Q721M225J3J781j11N054o16j01
$$ 34340 41508 34433 36219 41395 36182 23974 20681 29402 33627 33640 35421 35310 40364 39748 39647
11685C9647k669n660m756K452J0907J760k150m486M037N265m742r01J3355o315
$$ 39647 36978 31318 26562 29014 39921 41681 39531 35045 39082 44347 39605 38704 52059 45744
11671D5744k565L982m107P688K383k284j0872O851M264o556K397P722Q478M35
$$ 45744 43179 47161 43054 50742 53125 50841 39969 46820 51084 44528 46925 54647 63125 63560
11657F3560l372q268j346l805M840P615R64k850j057J55R692P257N286J0362J5718
$$ 63560 60188 51920 50574 46769 51609 59224 60188 57338 56281 56436 66128 73385 78671 89033 104751
11642A04751j059r902n757R982P075l606l634J970J9600O579O199J8734J5732
$$ 104751 103692 93790 88033 98015 105090 101484 97850 99820 119420 125999 132198 150932 166664
11629A66664m897M602J4551O112J0041J7395K8380K5503K3282L6260L0990J9313
$$ 166664 161767 166369 180920 187032 197073 214468 242848 268351 291633 327893 358883 378196
11617C78196L3222N1723N6956O1235P3333R0215R9386J10980J23335J58792J80234
$$ 378196 411418 463141 520097 581332 654665 744880 844266 955246 1078581 1237373 1417607
11606A417607K14980K66634L24789M02135N12714O28096P28851P57769O55652
$$ 1417607 1632587 1899221 2224010 2626145 3138859 3766955 4495806 5253575 5909227
11597E909227M16139P4163k57288m91562o05958n96901n13855m12175l06903k19805
$$ 5909227 6325366 6399529 6142241 5650679 5044721 4447820 3933965 3521790 3214887 2995082
11587B995082j37183p4734k2989M2607J08617J72801K59121L60774M87209O25658
$$ 2995082 2857899 2783165 2760176 2802783 2911400 3084201 3343322 3704096 4191305 4816963
11577D816963P26701P20106N65641K46669j34244m90119p29897q12149p67132
$$ 4816963 5543664 6263770 6829411 7076080 6941836 6451717 5721820 4909671 4142539
11568D142539o53162n27881m09522l18553k41608j89374j48962j18571q1026m2919
$$ 4142539 3489377 2961496 2551974 2233421 1991813 1802439 1653477 1534906 1453880 1410961
11558A410961l0867m605J9973M4421N2676P4862R4802J19069J63171J94630K44544
$$ 1410961 1380094 1375489 1395462 1439883 1492559 1567421 1662223 1781292 1944463 2139093 2383637
11547B383637L18139M16652N24242O52303P67605Q12005P43623N23223J62980
$$ 2383637 2701776 3118428 3642670 4294973 5062578 5874583 6618206 7141429 7304409
11538G304409k29877n30060o74758o99486o04161m68406l26953k07908j22749
$$ 7304409 7074532 6544472 5869714 5170228 4566067 4097661 3770708 3562800 3440051
11529C440051n0827K4352J05122J79124K56083L60125M83255O02027P34007Q62248
$$ 3440051 3389224 3413576 3518698 3697822 3953905 4314030 4797285 5399312 6133319 6995567
11519F995567R08224Q60730P11692M75428K11120j7431j98902l87283n80396p33391
$$ 6995567 7903791 8764521 9476213 9951641 10162761 10145330 9946428 9559145 8978749 8245358
11509H245358q34969q66341q00265p07183n91049m66423l67529k67826j74966
$$ 8245358 7410389 6544048 5743783 5036600 4445551 3979128 3611599 3343773 3168807
11500C168807j16049n0845J0047P0336J43002K35787L38948M41637N32375N60289
$$ 3168807 3052758 3001913 3011960 3082296 3225298 3461085 3800033 4241670 4774045 5334334
11490E334334M75621K55028l8397l32389n60720o56140o62207n87808m74442l77142
$$ 5334334 5809955 6064983 6026586 5694197 5133477 4477337 3815130 3227322 2752880 2375738
11480B375738k97042k29786j76565j43189j18414q2831n5268l9349j6976O280
$$ 2375738 2078696 1848910 1672345 1529156 1410742 1327911 1272643 1233294 1216318 1222598
11470A222598K5131K5038N0509Q3860R1889J19738J51909J90841K50934L12063
$$ 1222598 1247729 1272767 1323276 1407136 1499025 1618763 1770672 1961513 2212447 2524510
11460B524510M13778N31336O53145P35266P34315N62646K60909j13583m53077
$$ 2524510 2938288 3469624 4122769 4858035 5592350 6154996 6415905 6302322 5849245
11451E849245o41602o78963o18927m97168l67054k53459j78558j02416n2890K326
$$ 5849245 5207643 4528680 3909753 3412585 3045531 2792072 2613514 2511098 2458208 2460534
11441B460534N9098J11780J80950K49719L47127M59606N44484N84708N17455L31342
$$ 2460534 2519632 2631412 2812362 3062081 3409208 3868814 4413298 4998006 5515461 5846803
11431E846803M3787k82183n44371o78245o91594o31179n33884m18559l35493k58795
$$ 5846803 5890590 5608407 5064036 4385791 3694197 3063018 2529134 2110575 1775082 1516287
11421A516287k16505j74474j44811j23592j00531p2852o8629n4836m7958m5840
$$ 1516287 1299782 1125308 980497 856905 756374 683522 614893 560057 512099 466259
11411D66259m3929l1836l0622j9993k3832k0667k0873k0222j8217j8146j0047
$$ 466259 422330 390494 359872 339879 316047 295380 274507 254285 236068 217922 207875
11400B07875j2503r770j0605m545j2563r256j802K12o128o235q371l869p309J268
$$ 207875 195372 185602 174997 170452 157889 148633 146831 147043 140915 134680 126309 122440 115131 116399
11386A16399r13r953M887L675r101j0811k853L58O691k779n399K760m278k395
$$ 116399 115486 105533 110420 114095 104994 94183 91330 91688 98379 95600 90201 92961 88683 86288
11372H6288j0395j755m990k565l18L803q92j380n137m36j2329j58J268O614O65
$$ 86288 75893 74138 69148 66583 66265 70068 69176 67796 62659 62223 49894 49736 51004 57618 58283
11357E8283o0j3032P17J600j918O1l739m798O02j506N131J642L236j730m663m138
$$ 58283 58223 45191 45908 47508 45590 45651 41912 37114 37716 36210 41341 42983 46219 44489 39826 35688
11341C5688o380l210R285m3R664P37m472o247L022n519j3625O308P482P617J0944
$$ 35688 29308 26098 35383 35340 45004 45741 41269 35022 38044 32525 18900 25208 32690 40307 51251
11326E1251j469j1729m342J0922p03n738j4119j972Q630L383o516K768M961o161
$$ 51251 49782 38053 33711 44633 43930 38192 24073 22101 30731 34114 27598 30366 35327 29166
11312B9166j2191j945M406J007n562Q052M414m344M697m940j5124j0037M876K9029
$$ 29166 16975 15030 19436 20443 14881 22933 27347 23003 27700 22760 7636 -2401 2475 31504
11298C1504P065o75n910L45J363J594j1558J632P456J263j3770m988K750M503
$$ 31504 38569 37894 31984 32329 33692 35286 23728 25360 32816 34079 20309 15321 18071 22574
11284B2574k05K12l528p054Q20R518O062p689l744r71j1940J79P826k206L270
$$ 22574 22369 22581 19053 11999 12819 22337 28399 20710 16966 15995 4055 4234 12060 9854 13124
11269A3124m861J940N44P665k969n785j39k296N782p40Q2k557q89m749k151p947
$$ 13124 8263 10203 10747 18412 15443 9658 9519 7223 13005 12265 12347 9790 8901 4152 2001 -5946
11253e946Q695N533J973L625P797n675q449L752M301j0662K395L465l301M126
$$ -5946 2749 8282 10255 13880 21677 16002 7553 11305 15606 4944 7339 10804 7503 11629
11239A1629j681K477O503m89k58Q60n029r181p381j1477k389Q901j882q30k816
$$ 11629 9948 12425 18928 18439 18181 19041 14012 4831 -2550 -14027 -16416 -7515 -9397 -10227 -13043
11224a3043R951M467K284l783m396l020L682R462J0401Q690L767l469K464j885
$$ -13043 -3092 1375 3659 -124 -4520 -7540 -3858 5604 16005 24695 28462 24993 27457 25572
11210B5572K42k065J405p480j0040L709L792J594N083k674m578J175n121o788
$$ 25572 25814 23749 25154 17674 7634 11343 15135 16729 21812 19138 14560 15735 10614 3826
11196C826r361l684O932J819N039m938k807J748P00R762J0509L784j0015k470
$$ 3826 -5535 -9219 -2287 -468 4571 -367 -3174 -1426 -726 9036 19545 23329 13314 10844
11182A0844j648j2875m928L085J0048j929l14j90O30M054P163o85o151P359j254
$$ 10844 9196 -3679 -8607 -5522 4526 2597 2283 2093 2723 6777 13940 13255 7104 14463 13209
11167A3209m235K952K182K693R687Q890j1236n421L403L813o506p655Q496l46
$$ 13209 8974 11926 14108 16801 26488 35378 24142 18721 22124 25937 19431 11776 20272 19926
11153A9926Q62o284n803j421N289N708j580p84l611r855n062J2610P372L38L732
$$ 19926 20788 14504 8701 7280 12569 18277 16697 15913 12302 2447 -2615 9995 17367 17705 21437
11138B1437O104J0743m682m401K7k586L761N601K6l552J746J263n794o374L06
$$ 21437 27541 38284 33602 29201 29228 26642 30403 36004 36030 32478 34224 35487 29693 23319 23625
11123B3625l963n847j423n39M586M281j4195p81J35J949L962L623l467K598M934
$$ 23625 19662 13815 12392 11853 16439 20720 6525 5744 5879 7828 11790 15413 11946 14544 19478
11108A9478M559J2159L808j085m878K047N015R300O121o084q194J777j3290j1529
$$ 19478 24037 36196 40004 38919 34041 36088 41103 50403 56524 50440 42246 44023 30733 19204
11094A9204M784q09M409J539n167p014j3203k29J86M377j971Q130k881M741R533
$$ 19204 23988 23179 27588 29127 23960 16946 3743 3514 3700 8077 6106 14236 11355 16096 25629
11079B5629J1278K465N319p1m689j749p5Q156p276j4076q273j883Q91M25j898
$$ 25629 36907 39372 44691 44620 39931 38182 38107 46263 38987 24911 16638 14755 15646 16071 14173
11064A4173j0123J262J0706J863p099l652k566O610N229O568M168J0981J2963
$$ 14173 4050 5312 16018 17881 10782 7130 4564 11174 16403 22971 27139 38120 51083
11051E1083n565j3904q901q443m094N809k364P886M427j4920j6603N792P04M648
$$ 51083 45518 31614 22713 14270 10176 15985 13621 21507 25934 11014 -5589 203 907 5555
11037E555n99k977P353p611j0404o67M152m872k32J1692Q048J280p513Q998K154
$$ 5555 4956 1979 9332 1721 -8683 -9350 -5198 -10070 -10302 1390 9438 10718 3205 12203 14357
11022A4357k80J560L361L767O076J356k311Q083O133m685j8896q746j380o574
$$ 14357 14077 15637 18998 22765 28841 30197 27886 35969 42102 37417 18521 9775 8395 1821
11008A821R93J238J1709K015L040J91L275O706k836j299m214l220P474Q509j367
$$ 1821 2814 4052 15761 17776 20816 21007 24282 30988 28152 26853 22639 19419 26893 35402 34035
10993C4035L472O558n25o398j2281j0977j352l612J664L802r58m889Q209K391
$$ 34035 37507 44065 43540 37142 24861 13884 12532 8920 10584 14386 13428 8539 16748 19139
10979A9139k639j4618n844Q326o540n616J23J3887l402j1560R736k732o652m728
$$ 19139 16500 1882 -3962 4364 -2176 -7792 -7669 6218 2816 -8744 992 -1740 -8392 -13120
10965a3120j260J0354R000l421M361J004L950l764l763K641R68k714m499J2308
$$ -13120 -14380 -4026 4974 1553 5914 6918 10868 7104 3341 5982 6950 4236 -263 12045
10951A2045p359j0786K800J6888J4684n71q783j2405j844j174o089n433l979J0524
$$ 12045 4686 -6100 -3300 13588 28272 27701 18918 6513 4669 3495 -2594 -8027 -12006 -1482
10937a482J3024p641o225L466k353M384K38L959K317o394j0077J920O230J0590
$$ -1482 11542 3901 -2324 1142 -1211 3173 3411 7370 9687 3293 -6784 -4864 1366 11956
10923A1956J6157o302r695k22o58q802k892n249L905K728k522K819o663n155k247
$$ 11956 28113 21811 12116 11894 11236 2434 -458 -5707 -1802 926 -1596 1223 -5440 -10595 -12842
10908a2842M157J381m274m756J732L639M66m889P240M43Q098m870M072P521P928
$$ -12842 -8685 -7304 -11578 -16334 -14602 -10963 -10497 -15386 -8146 -7703 395 -4475 -403 7118 15046
10893A5046l943j0111J601R32m814J422L173J420q589L8R0p586R213R722M489
$$ 15046 11103 992 2593 3525 -1289 133 3306 4726 -3863 -3825 -3735 -11321 -2108 7614 12103
10878A2103m721k489L317n351n552j0319j181j319l597N598Q127P926q352N58
$$ 12103 7382 4893 8210 2859 -2693 -13012 -14193 -15512 -19109 -13511 -5384 2542 -5810 -5252
10864e252J987j159L802m86j884L826N655r822k007l912K90l58K576q44j084j59
$$ -5252 -3265 -4424 -622 -1108 -2992 834 6489 -3333 -5340 -9252 -8962 -9320 -6744 -7588 -8672 -8831
10848h831n77J373L927P5k259K405M608p55N241l927m626j1261j0463Jj872R65
$$ -8831 -9408 -8035 -4108 -4033 -6292 -3887 721 -34 5207 1280 -3346 -14607 -25070 -25069 -26941 -25976
10832b5976J0824Q072J312L042J711j251R537J3376j338o377p220k105k547j1778
$$ -25976 -15152 -7080 -5768 -2726 -1015 -2266 7271 20647 19309 12932 5712 3607 1060 -10718
10818a0718r585J564J2772J3510k937r183N357J659K011j75K068j0947l874L791
$$ -10718 -20303 -18739 -5967 7543 4606 -4577 780 2439 4450 4275 6343 -4604 -8478 -4687
10804d687M627L715R84n044l058m560N539K898l728K947P20L704M64J38n363j0033
$$ -4687 -60 3655 4639 -405 -3463 -8023 -2484 414 -3314 -367 353 4057 4521 4659 -704 -10737
10788a0737j1012N398J3095R443o705n606K174J3L1J596O384J842l622n212j342
$$ -10737 -21749 -16351 -3256 6187 -518 -6124 -3950 -3937 -3906 -2310 4074 5916 2294 -2918 -4260
10773d260n561J567O251K594O918q104r581J1343p33j0891p755P856L556m459
$$ -4260 -9821 -8254 -2003 591 7509 -595 -10176 1167 434 -10457 -18212 -10356 -6800 -11259
10759a1259J634Q934P5m206J302l119N611M121J533l951j1920M730J02m137N550
$$ -11259 -9625 -691 -616 -4822 -3520 -6639 -1028 3093 4626 675 -11245 -6515 -6413 -10550 -5000
10744e000O11n138J797J199o063j972K775P947R246j583P556n992j8320L08K981
$$ -5000 -4389 -9527 -7730 -6531 -12594 -14566 -11791 -3844 5402 3819 11375 5383 -12937 -12629 -9648
10729i648O063j893n829k585L326R41o801j268N012O174r34K733M633k325J292
$$ -9648 -3585 -5478 -11307 -13892 -10566 -9625 -16426 -17694 -12682 -6508 -7442 -4709 -76 -2401 -1109
10714a109q081m464k245J471R911M782l209M944J0276K686q163k634o041j889
$$ -1109 -9190 -13654 -15899 -14428 -4517 265 -2944 2000 12276 14962 6799 4165 -1876 -3765
10700c765N548k44M712k158j1798n071M319M081L92k383m683K872J577J529O121
$$ -3765 1783 1539 6251 4093 -7705 -12776 -8457 -4376 -3984 -6367 -11050 -8178 -6601 -5072 1049
10685A049M124J912n297j0131L746l879j854N602P602K220m475k634n383M00J4210
$$ 1049 5173 7085 1788 -8343 -4597 -8476 -10330 -4728 2874 5094 619 -2015 -7398 -6998 7212
10670G212J0391r193r728J2391P527j29k742j1481n912Q55j116r278k14O04p992
$$ 7212 17603 8410 -1318 11073 18600 18471 15729 4248 -1664 -809 -1925 -11203 -11417 -10813 -18805
10655a8805l418P063J1829J3567k676p706J981K199O405j0555j1859o565K238
$$ -18805 -22223 -15160 -3331 10236 7560 -146 1835 4034 10439 -116 -11975 -18540 -16302
10642a6302M299k722l460r50N131O971k730K117M629K780J947o159l436J0110
$$ -16302 -12003 -14725 -18185 -19135 -14004 -7033 -9763 -7646 -3017 -237 1710 -4449 -7885 2225
10628B225p33k295K39K99q679K37Q671N070J042n849K389J542L154n864J681m768
$$ 2225 1492 -803 -564 -265 -8944 -8707 -36 5034 6076 227 2616 4158 7312 1448 3129 -1639
10612a639M843Q294M587k170p17k476l826n869K715m984l197n965k603N035L456
$$ -1639 3204 11498 16085 13915 13198 10722 6896 1027 3742 -1242 -4439 -10404 -13007 -7972 -4516
10597d516J908J0916K188q457r257o632j72N583P999M502p406j2591N227N795
$$ -4516 -2608 8308 10496 2039 -7218 -13850 -14022 -8439 -440 4062 -3344 -15935 -10708 -4913
10583d913j123J98p497L854J2544L982j471n542o4j310k714k157o64n58k126K031
$$ -4913 -6036 -5838 -13335 -9481 3063 7045 5574 32 -32 -1342 -4056 -6213 -6877 -7435 -9561 -7530
10567g530K671L822j0577M845J4472L888j0332m304M976J380j058j852m426n942
$$ -7530 -4859 -1037 -11614 -6769 7703 11591 1259 -3045 1931 3311 2253 401 -4025 -9967
10553i967L581l754Q10M519r15P20K487L50j870j303K494P820K868l597M19M260
$$ -9967 -6386 -10140 -9330 -4811 -5726 -5006 -2519 -2169 -4039 -5342 -2848 4972 7840 4243 4662 8922
10537H922o536Q066O74k0292o580N354R124J0322R492J079j0130j0491j190k164
$$ 8922 2386 10452 11126 -9166 -15746 -10392 -1268 9054 18546 19625 9495 -996 -2186 -4350
10523d350o049p85n05J0412L736o44q711M919L501p28j001m85O4M447M010J755
$$ -4350 -10399 -11184 -11689 -1277 2459 1815 -6896 -1977 1524 796 -205 -690 -626 3821 7831 9586
10507I586m7Q65m720j0863Q777R981N04m940r512J607L296o507j973K252n106
$$ 9586 9539 10404 5684 -5179 3598 13579 14083 9143 -369 1238 4534 -1973 -3946 -1694 -6800
10492f800j1337N950J3972O045L416M690K265j099l838N269P96l911N06j229n423
$$ -6800 -18137 -12187 1785 7830 11246 15936 18201 17102 13264 18533 19329 15418 15924 14695 9272
10477I272N265J289p04r063m952M846J1843K388r794k959j491q041q307k471K514
$$ 9272 14537 15826 15122 6059 1107 5953 17796 20184 10390 7431 5940 -2101 -10408 -12879 -10365
10462a0365L116P499p499L447P285J0564K588p596q153n305J0975n839j2235j202
$$ -10365 -7249 250 -7249 -3802 3483 14047 16635 9039 886 -4419 6556 717 -11518 -12720
10448a2720R649L242k343L750R905Q776n199o418l838j842l538m650K9l431n827
$$ -12720 -3071 171 -2172 1578 11483 20259 15060 8642 4804 2962 -576 -5226 -5197 -8628 -14455
10433a4455L295O523M139p421o400Q688M852K549j2053p181q213K199O309J282
$$ -14455 -11160 -4637 -498 -7919 -14319 -5631 -779 1770 -10283 -17464 -25677 -23478 -17169 -15887
10419a5887M232R220k019P654M976N098J629j0236l125p372r037K195q56P598
$$ -15887 -11655 -2435 -4454 3200 8176 13274 14903 4667 1542 -5830 -14867 -12672 -13528 -5930
10405e930M560L649p98O31O297K660m453j2234m606l870N625K326k844j087M307
$$ -5930 -1370 2279 1481 2112 8409 11069 6616 -5618 -10224 -14094 -8469 -6143 -8987 -10074 -5767
10390e767Q233m106k367J648l824j145k259K275M319P50r729n169P015M880m621
$$ -5767 2466 -1640 -4007 -2359 -6183 -7328 -9587 -7312 -2993 -2243 -11972 -17141 -10126 -5246 -9867
10375i867j133J3470M347j121m917r94k051j067n918r248J3863O578j069j182
$$ -9867 -11000 2470 6817 5696 779 -215 -2266 -3333 -9251 -18499 -4636 1942 873 -309
10361c09J633N554l767j2256j4120J601J2088K339M473P705n583L079M523n415
$$ -309 1324 6878 3111 -9145 -23265 -21664 -9576 -7237 -2764 4941 -642 2437 6960 1545
10347A545l005m611o051n197M290l798q480M178J4608K137l978O134n461l401
$$ 1545 -1460 -6071 -12122 -17319 -13029 -16827 -25307 -21129 -6521 -4384 -8362 -2228 -7689 -11090
10333a1090l847J231l654L095Q218j54j681l562L704L126k985N053K152n94m3
$$ -11090 -14937 -13706 -17360 -14265 -6047 -6201 -7882 -11444 -7740 -4614 -7599 -2546 -394 -988 -1031
10318a031M206L651n82j760l136K668n868o195k738P192n589O542K79M260K637
$$ -1031 3175 6826 6244 4484 1348 4016 -1852 -8047 -10785 -3593 -9182 -2640 -2361 1899 4536
10303D536P642P30r020m183O3l306Q075L727n00j1434l148L245O141l222m093
$$ 4536 12178 12908 3888 -295 -232 -3538 4537 8264 7764 -3670 -6818 -3573 2568 -654 -4747
10288d747K27R233M320l691n116j276J101N42k51J643L68M300o188q639M447P249
$$ -4747 -4520 4713 9033 5342 226 -1050 51 593 342 1985 2353 6653 465 -8174 -3727 3522
10272C522n386J957Q741Q879M231l2o182j669k731o56j501n139L842K929l250
$$ 3522 -1864 93 8834 17713 21944 21912 15730 14061 11330 10674 9173 4034 7876 10805 7555
10257G555M406O100l144k036j636l613m41M569k537l976L254m241n262j670Q832
$$ 7555 11961 18061 14917 12881 11245 7632 7191 11760 9223 5247 8501 4260 -1002 -2672 6160
10242F160R175j79K981m253m732l643q009P578L307r432L599O174p189l532l100
$$ 6160 15335 15156 18137 13884 9152 5509 -2500 5078 8385 -1047 2552 8726 1537 -1995 -5095
10227e095J784o11Q710K469J613j1982p029M221L038j020J457N120O118N109o506
$$ -5095 -3311 -3922 4788 7257 8870 -3112 -10141 -5920 -2882 -3902 -2445 2675 8793 13902 7396
10212G396j947J117L33k838M0L762j525l154K068N040k621k397n865n063o21J3332
$$ 7396 5449 6566 6899 4061 4101 7863 6338 3184 5252 10292 7671 5274 -591 -5654 -6275 7057
10196G057J3182o278j0507j061L129r14M183k125o177L395J0444J1850k501j0824
$$ 7057 20239 13961 3454 2393 5522 4608 8791 6666 489 3884 14328 26178 23677 12853
10182A2853m655N012K129k51j2544j0502L35N815M104Q075j269L428k328k823
$$ 12853 8198 13210 15339 15088 2544 -7958 -7623 -1808 2296 10371 9102 12530 10202 7379
10168G379Q51R055p144l497n778j044k677m678J421M768J1049k90p582p792l109
$$ 7379 8230 17285 10141 6644 866 -178 -2855 -7533 -6112 -1344 9705 9415 1833 -5959 -9068
10153i068O680R290J3116k909p973j620q181O852O660m657o973l342k742J345
$$ -9068 -2388 6902 20018 17109 9136 7516 -665 6187 12847 8190 1217 -2125 -4867 -3522
10139c522L908L33O707l259p135j0683n965j756q10M070k611j534P795M179p93
$$ -3522 386 719 7426 4167 -2968 -13651 -19616 -21372 -22182 -18112 -20723 -22257 -14462 -10283 -11076
10124a1076O384j384n967P395O193P792P866j227n749p130l445k695n404k410
$$ -11076 -4692 -6076 -12043 -4648 1545 9337 17203 15976 10227 3097 -348 -3043 -8447 -10857
10110a0857N647k494m641O371N94p35J917j73L580M274N998j584j698j743J724
$$ -10857 -5210 -7704 -12345 -5974 -5380 -6115 -4198 -4371 -791 3483 9481 7897 6199 4456 6180
10095F180n444j148Q774R181K471j7416L964R398J2056k077j1094n606J681J365
$$ 6180 736 -412 8362 17543 20014 2598 6562 15960 28016 25939 14845 9239 10920 12285
10081A2285m28j440n497K477K311j609M718j3650j1211N660J4644J6307p001r365
$$ 12285 11857 10417 4920 7397 9708 8099 12817 -833 -12044 -6384 8260 24567 17566 8201
10067H201r066Q490L656L129K424o47j2824R271K261N74l620P4K969J950q737
$$ 8201 -865 7625 11281 14410 16834 16187 3363 12634 14895 15469 11849 11923 14892 16842 8105
10052H105q365J821N909k435j684k655O436J785K955N631l115M392k602m628j75
$$ 8105 -260 1561 7470 5035 3351 696 7132 8917 11872 17503 14388 18780 16178 11550 11375
10037A1375p671O143q9m053k574Q039J0034L640k36m162q67R15m652K857q85Q
$$ 11375 3704 9847 9758 5705 3131 11170 21204 24844 24608 20446 19579 20494 15842 18699 17814 17822
10021A7822j56J048R363K19j3141l426N503Q63L118l111q439q508Q284P57O700
$$ 17822 17666 18714 28077 28296 15155 11729 17232 18095 21213 18102 9663 1155 9439 10196 16896
10006A6896M710m74M61j429l509m746M346O738J670P294O771r692N7R422k150
$$ 16896 21606 21132 21593 20164 16655 11909 16255 22993 24663 31957 38728 29036 29093 38515 36365
9991C6365o116Q031l104r220j909k025r2N889k220l170J635K655o403J773J387
$$ 36365 30249 38280 35176 25956 24047 22022 21930 27819 25599 22429 24064 26719 20316 22089 23476
9976B3476l224l629J4099R12L94m903k57J7431L386n562q180J201K819M358m403
$$ 23476 20252 16623 30722 31634 32028 27125 26868 44299 47685 42123 33943 35144 37963 42321 37918
9961C7918n677O76M141j352q588k381P938L323J671O200j276n155o33l098o318
$$ 37918 32241 32917 37058 35706 27118 24737 32675 35998 37669 43869 42593 37438 36805 33707 27389
9946B7389n430L296J0344J2983j794M255J0453M663q93n464K492L741j0663p107
$$ 27389 21959 25255 35599 48582 46788 51043 61496 66159 65266 59802 62294 66035 55372 48265
9932D8265M521k627m995J772l443m019K50j774n255j599l091o240k55L814R481
$$ 48265 52786 50159 45164 46936 43493 39474 39724 37950 32695 31096 28005 21765 21510 25324 34805
9917C4805P607O975Q883q048r774O436n81q116o054O911J0811J0364n515n249
$$ 34805 42412 49387 58270 50222 40448 46884 46303 38187 32133 39044 49855 60219 54704 49455
9903D9455K810m623k519M078m047p908j439M566Q553n004j772j731j522M65r26
$$ 49455 52265 47642 45123 49201 45154 37246 35807 40373 48926 43922 42150 40419 38897 39362 38436
9888C8436l857m160J750R486K397n81K041r968m603N177K447q68j117l887n179
$$ 38436 34579 30419 32169 41655 44052 43471 45512 35544 30941 36118 38565 37697 36580 32693 27514
9873B7514M994J523p05Q82J0330M79L59O708n226J707n170m835N589M645n4m327
$$ 27514 32508 34031 33326 34208 44538 45017 45376 52084 46858 48565 43395 38560 44149 48794 48740 44413
9857D4413L517k013n155K127P227q990j0785k617M746O449K409l457m022M695
$$ 44413 47930 45917 40762 42889 50116 41126 30341 27724 32470 38919 41328 37871 33849 38544
9843C8544o64m781m165l058r794J903O71J705K051M308m392o058l683K547R466
$$ 38544 37880 33099 28934 25876 16082 17985 18656 20361 22412 26720 22328 16270 12587 15134 24600
9828B4600M166r622l915M189M782j906J2471L076n375N340l149n952J612l660
$$ 24600 28766 19144 15229 19418 24200 22294 34765 37841 32466 37806 34657 28705 30317 26657
9814B6657o915k889O29M910K200N317k08K725j118m772n020j563K825R44j1131
$$ 26657 19742 16853 17482 22392 24592 29909 29701 32426 31308 26536 21516 19953 22778 23722 12591
9799A2591j453N947M067L072l433Q303M817O318N971m080q826j250r045n2L560
$$ 12591 11138 17085 21152 24224 20791 29094 33911 40229 46200 42120 33294 32044 22999 22947 26507
9784B6507J158K194l638l882N393n140L798M869N878k683N627n918n569M143K345
$$ 26507 27665 29859 26221 22339 27732 22592 26390 31259 37137 34454 40081 34163 28594 32737 35082
9769C5082J2376n7p931p055j1835L849O997L597O442J228j638Q187N368n290j6
$$ 35082 47458 47401 39470 32415 20580 24429 31426 35023 41465 42693 41055 49242 54610 49320 49304
9754D9304j966r135q69Q435L743N268n30p888j3712P679L419N359J206l387j3327
$$ 49304 47338 38203 37334 45769 49512 54780 54250 46362 32650 40329 43748 49107 50313 46926 33599
9739C3599j259O594R63M831J599l894n488m67P729J330J2236n482o9O18q490J894
$$ 33599 32340 38934 39897 44728 46327 42433 36945 36478 44207 45537 57773 52291 52222 52840 44350 46244
9723D6244P366m616r228J9498J868o398k116J748J0631p53m848j4946l273Q294
$$ 46244 53610 48994 39766 59264 61132 54734 52618 54366 64997 64244 59396 44450 41177 49471
9709D9471O020K273l031L592R340J1336k649o209l781l663M49n222P491j58R994
$$ 49471 55491 57764 54733 58325 67665 79001 76352 70143 66362 62699 63148 57926 65417 65259 75253
9694G5253Q875J2329M119q41O374K944m439M759J791M764N113m280O73j797K022
$$ 75253 84128 96457 100576 99735 106109 109053 104614 109373 111164 115928 121041 116761 117434 115637 117659
9679A17659m050q25J1581L467J395M50L032M981M647R249K353L938N928p733j668
$$ 117659 113609 112784 124365 127832 129227 129677 132709 137690 142337 151586 153939 157877 163805 156072 154404
9664A54404J3586R840o018N436J3301Q998J191K524J5244J1823N860P575J8295
$$ 154404 167990 177830 171812 177248 190549 199547 200738 203262 218506 230329 236189 243764 262059
9651B62059J4920N728Q038K3737K9341K6112K0185K2911K8112K6616K5956L3171
$$ 262059 276979 282707 290745 314482 343823 369935 390120 413031 441143 467759 493715 526886
9639E26886L8852L7460M6415M5317O2501O8810P9712R0199Q4623Q2465R2251Q8378
$$ 526886 565738 603198 649613 694930 757431 826241 905953 996152 1080775 1163240 1255491 1343869
9627A343869R0643R1241Q5093Q6669P3391N8623N0227M7913M6191M0939K5258
$$ 1343869 1434512 1525753 1610846 1697515 1770906 1829529 1879756 1927669 1973860 2014799 2040057
9616B040057J7935K0370K1464K4410M1437N7439O2711Q8601J14516J15638J25806
$$ 2040057 2057992 2078362 2099826 2124236 2165673 2223112 2285823 2374424 2488940 2604578 2730384
9605B730384J32664J26871J24688J27025J13216R1731P4914N6502N6647L5930
$$ 2730384 2863048 2989919 3114607 3241632 3354848 3446579 3521493 3577995 3634642 3670572
9595C670572J1151j066j3335k4651l0544k1213k2581p901o914J4356L5770L8697
$$ 3670572 3681723 3680657 3667322 3642671 3612127 3590914 3568333 3560432 3553518 3567874 3603644 3642341
9583C642341M2639M2003L8577L8784K8365J7762J8853J1319j2150k0897j6935
$$ 3642341 3684980 3726983 3765560 3804344 3832709 3850471 3869324 3880643 3868493 3847596 3830661
9572C830661k2498k4167k3099j2253j59P785K6765M2156M9249N0104M2420L5311
$$ 3830661 3808163 3783996 3760897 3748644 3748485 3756270 3783035 3825191 3874440 3924544 3966964 4002275
9560D002275L1430K6020J5761P680Q363O43j4750k6994j0037k3852k5525o456
$$ 4002275 4033705 4059725 4075486 4083166 4091529 4092172 4077422 4050428 4040391 4016539 3991014 3984558
9548C984558J7362K3514M6908N6808N8606P4474R5909Q1142Q0174O0399N5903
$$ 3984558 4001920 4025434 4072342 4129150 4187756 4262230 4358139 4439281 4519455 4579854 4635757
9537D635757L4072J9888R679l135j8379l2001l1309k0605l3567j5614O075L7168
$$ 4635757 4669829 4689717 4699396 4696261 4677882 4645881 4614572 4593967 4560400 4544786 4550861 4588029
9525D588029O4834Q5588J08253J18278J04577J01613R7982Q4725N9975N4325M3454
$$ 4588029 4652863 4738451 4846704 4964982 5069559 5171172 5269154 5353879 5413854 5468179 5511633
9514E511633J9883J1338N632k4444m4232n5841n1968l6041l3893k2181j439J9000
$$ 5511633 5531516 5542854 5548486 5524042 5479810 5423969 5372001 5335960 5302067 5279886 5278447 5297447
9502E297447K6926L2232L6548K8918K5014J7162K605j5507j7805l9750n0860n0582
$$ 5297447 5324373 5356605 5393153 5422071 5447085 5464247 5466852 5451345 5433540 5393790 5342930 5292348
9490E292348n6669n6240m3260m3502l4501j8691l384J5391L2237L9445L0945K1682
$$ 5292348 5235679 5179439 5136179 5092677 5058176 5039485 5036101 5051492 5083729 5123174 5154119 5175801
9478E175801L765k6214n0783o4328q9061j02632j18662j41686j59300j84934j96558
$$ 5175801 5179566 5153352 5102569 5038241 4949180 4846548 4727886 4586200 4426900 4241966 4045408
9467D045408j99606j86027j64310j55015j34277j00640p8838o5994l0717l1495
$$ 4045408 3845802 3659775 3495465 3340450 3206173 3105533 3026695 2960701 2929984 2898489
9457B898489k0942k8503l3902m8442o4476p6250q9261q3225r3499r5835j05069
$$ 2898489 2877547 2849044 2815142 2766700 2702224 2625974 2536713 2453488 2359989 2264154 2159085
9446B159085j25581j37011j36513j29077j18229j07889j14803j00226r2232r2752
$$ 2159085 2033504 1896493 1759980 1630903 1512674 1404785 1289982 1189756 1097524 1004772
9436A004772o9509o7005o7721n0757m6153l8722m1842k3494k1479l6777l6489
$$ 1004772 935263 868258 800537 749780 703627 664905 623063 599569 578090 541313 504824
9425E04824k9863k1506j3698j0566j5290k2067r183j6947j8516j6071j078j0394
$$ 504824 474961 453455 439757 429191 413901 391834 382651 365704 347188 331117 330039 319645
9413C19645k5694k2657j4872m889k815L707k863j3883j4053j6763n169M807o367
$$ 319645 293951 271294 256422 251533 248718 252425 249562 235679 221626 204863 199694 204501 198134
9400A98134j807l58j3250j2331q547J5723K6731K1480J4115R576N071M237n701
$$ 198134 196327 195969 182719 170388 161841 177564 204295 225775 239890 249466 254537 258774 253073
9387B53073j0096r530n841l164j1257l050J990J0217K1065J4887J992j523j359
$$ 253073 242977 233447 227606 224442 213185 210135 212125 222342 243407 258294 260286 258763 257404
9374B57404j0780j6293j5543r842k768r000j1451n213j2819r218j1565p474M21
$$ 257404 246624 230331 214788 204946 202178 193178 181727 176514 163695 154477 142912 135438 135859
9361A35859N427P529n093l622L501k486O03o138K940j144p626M564p240p300P23
$$ 135859 141286 148815 143722 140100 143601 141115 141718 135580 138520 137376 129750 134314 127074 119774 120497
9346A20497P9N130L864m478k904Q371J748K825J3168Q324Q215j321J136J593L250
$$ 120497 120576 125706 129570 125092 122188 130559 132307 135132 148300 156624 164839 163518 164654 166247 169497
9331A69497P40J2493R282J1934J6008J3543K2700K0367K5518K2761L6502N0913
$$ 169497 170237 182730 192012 203946 219954 233497 256197 276564 302082 324843 361345 412258
9319D12258O0189P4241Q5336Q8658J06584R8378R7855Q8405N6977J0481k9243
$$ 412258 472447 546688 632024 720682 827266 925644 1023499 1111904 1168881 1179362 1150119
9308A150119n8916q7656j02496j04152j01383r7004q8517p1717n3729m2469l0498
$$ 1150119 1091203 1003547 901051 796899 695516 598512 509995 438278 384549 342080 311582
9297C11582k5341k8593j2764j4774j4870k0405q323j5401j3171o781Q43Q026p325
$$ 311582 286241 257648 244884 230110 215240 194835 186512 171111 157940 151159 152002 160028 152703
9284A52703j4342L577O028L659k853j3232r653P130L818M439k188J123m720p139
$$ 152703 138361 141938 147966 151625 148772 135540 125887 133017 136835 141274 139086 140209 135489 128350
9270A28350O187R917Q822p91r109r8j709j910k628j046j3843p021J8623J1501
$$ 128350 134537 144454 153276 152485 143376 143278 141569 139659 137031 135985 122142 115121 133744 145245
9256A45245K405O382J1679L769r38m201m402K145M356M875N972M678J5955J9322
$$ 145245 147650 154032 165711 169480 168542 164341 159939 162084 166440 171315 177287 181965 197920 217242
9242B17242J3947J799P139o625p554J6041J6285J8563K2271R740K1774K2656K6605
$$ 217242 231189 232988 240127 233502 225948 241989 258274 276837 299108 308848 330622 353278 379883
9229C79883J8600J3617J2262K4469K5184K3468K9683L5815K6904K5323L8409O8374
$$ 379883 398483 412100 424362 448831 474015 497483 527166 562981 589885 615208 653617 721991
9217G21991Q2174J06656J17214J16992J21620J36380J46391J59915J77589K09827
$$ 721991 804165 910821 1028035 1145027 1266647 1403027 1549418 1709333 1886922 2096749
9207B096749K14817J99280J81760J24696P9943L3190j9117o4845q8787j09848
$$ 2096749 2311566 2510846 2692606 2817302 2897245 2930435 2911318 2846473 2757686 2647838
9197B647838r9671r0343p8505n4052k0633J2838M7803R2899J34725K04960L13345
$$ 2647838 2548167 2457824 2379319 2325267 2304634 2317472 2365275 2458174 2592899 2797859 3111204
9186C111204M46054O36148Q48115Q48218M29873j15756l94872n14244m80171l91568
$$ 3111204 3557258 4193406 5041521 5889739 6319612 6203856 5808984 5294740 4814569 4423001
9176D423001l20075k71098k44956k27618j96559j71573j46495j09077q2594n5817
$$ 4423001 4102926 3831828 3586872 3359254 3162695 2991122 2844627 2735550 2652956 2597139
9166B597139l6008k0077Q240L2710M5717O5064J07262J60351J93840K19735K50929
$$ 2597139 2561131 2541054 2549294 2582004 2627721 2692785 2800047 2960398 3154238 3373973 3624902
9155C624902K70364K91262K76311K56833K12949J66582J20397N2596j6782o5803
$$ 3624902 3895266 4186528 4462839 4719672 4932621 5099203 5219600 5272196 5255414 5189611
9145E189611j18230j63124j82417j95380j95768j58628j20010r8866n6204R249
$$ 5189611 5071381 4908257 4725840 4530460 4334692 4176064 4056054 3957188 3900984 3910233
9135C910233M5116Q1622J30983J92431K31114K60604K91151L08338L09649K91239
$$ 3910233 3955349 4036971 4167954 4360385 4591499 4852103 5143254 5451592 5761241 6052480
9125F052480K54752K06579J35413N4075k8206j11683j98994k83726l32347l50874
$$ 6052480 6307232 6513811 6649224 6703299 6675093 6563410 6364416 6080690 5748343 5397469
9115E397469l47414l43418l27953k91566k36431j74058j26656r3671n9236l2252
$$ 5397469 5050055 4706637 4378684 4087118 3850687 3676629 3549973 3456302 3397066 3364814
9105C364814J2083M5237J03311J55781J78808K19089K36490K43362K27770J89946
$$ 3364814 3376897 3422134 3525445 3681226 3860034 4079123 4315613 4558975 4786745 4976691
9095D976691J33910N4945l5030j17514j97532k48650k59397k45731k28440j92676
$$ 4976691 5110601 5165546 5130516 5013002 4815470 4566820 4307423 4061692 3833252 3640576
9085C640576j48353j21050q5118m2278m420L6694P1856J19284J61521K06860K36729
$$ 3640576 3492223 3371173 3286055 3243777 3239357 3276051 3347907 3467191 3628712 3835572 4072301
9074D072301K78512L01969K96866K93560K75444K30739J47814N7150l3655r4506
$$ 4072301 4350813 4652782 4949648 5243208 5518652 5749391 5897205 5954355 5920700 5826194
9064E826194j51657k04520k59928k91553l02154l01970k87259k51924k09295j81332
$$ 5826194 5674537 5470017 5210089 4918536 4616382 4314412 4027153 3775229 3565934 3384602
9054C384602j37797j05892p3075k8136J2182M4935P7870J01747J23237J34373
$$ 3384602 3246805 3140913 3067838 3039702 3051884 3096819 3174689 3276436 3399673 3534046
9044C534046J19049R0485O8584K8872k7390j15760j65790j47490j52305j77261
$$ 3534046 3653095 3743580 3812164 3841036 3813646 3697886 3532096 3384606 3232301 3055040
9034C055040j85703j90077j92328j93848j62367j37268j01162q2385o4934n3112
$$ 3055040 2869337 2679260 2486932 2293084 2130717 1993449 1892287 1809902 1744968 1691856
9024A691856k6988J461J0117J4053K5919M2344O6704Q2443R6587R5647J09425
$$ 1691856 1664868 1666329 1676446 1690499 1716418 1758762 1825466 1907909 2004496 2100143 2209568
9013B209568Q0826O0608K4825m896m3328q3455j08973j10490j07556j04509r0676
$$ 2209568 2290394 2351002 2375827 2370931 2327603 2244148 2135175 2024685 1917129 1812620 1721944
9002A721944o6004n0541l9235l2801k4977k84J5225K7769N0479P1082Q6252R7792
$$ 1721944 1655940 1605399 1566164 1533363 1508386 1508102 1523327 1551096 1601575 1672657 1758909 1856701
8990A856701R3527Q9823R8762Q0811N9481K7066p802o5566r2445j03920j20527
$$ 1856701 1950228 2040051 2138813 2219624 2279105 2306171 2298369 2232803 2140358 2036438 1915911
8979A915911j22356r8930r1665o4109m9186l6250l3179l8690k7314j081n554k0688
$$ 1915911 1793555 1694625 1602960 1538851 1489665 1453415 1420236 1381546 1354232 1353151 1347597 1326909
8967A326909k5827o097J9229L3197N0198O4747O6598O7064O8222P2878O9038Q6219
$$ 1326909 1301082 1294985 1314214 1347411 1397609 1462356 1528954 1596018 1664240 1737118 1806156 1892375
8955A892375J12760J31868J56561J81373J42701J07541J13742J44530J68241J72888
$$ 1892375 2005135 2137003 2293564 2474937 2617638 2725179 2838921 2983451 3151692 3324580
8945C324580J89272K01128K33916K83405L14809L64400M10708M64707N47319O31281
$$ 3324580 3513852 3714980 3948896 4232301 4547110 4911510 5322218 5786925 6334244 6965525
8935F965525P44862Q99222J095352J362392J684967K061910K461754K868827L212888
$$ 6965525 7710387 8609609 9704961 11067353 12752320 14814230 17275984 20144811 23357699
8926B3357699L412607L556890L694212M089097M983405O407135Q568338J1853233
$$ 23357699 26770306 30327196 34021408 38110505 43093910 49501045 58069383 69922616
8918F9922616J6699408K4004823L5249380N0634887O1834956M7579846L634753
$$ 69922616 86622024 110626847 145876227 196511114 258346070 305925916 309560669
8911C09560669l4076333n0047272n3367874m4791642l1959587k1697162j4886317
$$ 309560669 275484336 225437064 172069190 127277548 95317961 73620799 58734482
8904E8734482j0495649p640487n706880m342577l436968k899121k678905k503009
$$ 58734482 48238833 40598346 34891466 30548889 27111921 24212800 21533895 19030886
8896A9030886k288505k042960j755328j475004j246949j058024r06608p84248
$$ 19030886 16742381 14699421 12944093 11469089 10222140 9164116 8257508 7473260
8888G473260o76978n90946n14927m46078l79266l42892l12435k85885k61773k37372
$$ 7473260 6796282 6205336 5690409 5244331 4865065 4522173 4209738 3923853 3662080 3424708
8878C424708k11042j67565j33323j17914j23659j29046j18590j15797j18341j03962
$$ 3424708 3213666 3046101 2912778 2794864 2671205 2542159 2423569 2307772 2189431 2085469
8868B085469q4602q8644o8512o0904o0850n5686m3034m1837n2735n1847n1029
$$ 2085469 2000867 1912223 1843711 1782807 1721957 1666271 1623237 1581400 1528665 1476818 1425789
8857A425789n2521o7861o5135n0075n5343m8233l4438k6950j6084l3403l4414
$$ 1425789 1373268 1305407 1240272 1190197 1134854 1086621 1052183 1025233 1009149 975746 941332
8846I41332k4608j3604j5430k2644j4503j1281j0289J85r554j8080j8203k0462
$$ 941332 916724 903120 887690 865046 850543 839262 828973 829158 819604 801524 783321 762859
8834G62859n808l729k025j2004j7108r807j6409k5961k5504k2908k1899j0308
$$ 762859 757051 753322 751297 739293 722185 712378 695969 670008 644504 621596 599697 589389
8822E89389k856r326l862o23o051o140j5836k5986k4149m251J784j225l533m736
$$ 589389 586533 577207 573345 572722 566671 560531 544695 518709 494560 490309 492093 490868 487335 482599
8808D82599J36j220o278n019o994m94P29l009J937P056M851L284O245J107K292
$$ 482599 482735 481515 475237 470218 463224 462730 463459 460450 462387 469443 474294 477578 483823 484930 487222
8793D87222J1303R703J5018L0749M3550M8868K5138m7022r4608q4642n6777k5108
$$ 487222 498525 508228 523246 553995 597545 646413 671551 624529 529921 445279 388502 363394
8781C63394k3012k1867j2340m176m457k584j232o723q765l062p10q296J3227O253
$$ 363394 340382 318515 306175 301999 297542 294958 293726 287003 278238 275176 274466 266170 279397 285650
8767B85650o794k892j0495j1278o008n311K751J329M420J4049n68r651j5389k145
$$ 285650 278856 275964 265469 254191 248183 242872 245623 246952 251372 265421 264853 255202 239813 237668
8753B37668L220O70l214o377J547L363o490n330n205l150j3037n403k614K28Q455
$$ 237668 240888 241558 238344 231967 233514 236877 230387 225057 219852 216702 203665 198262 195648 195876 204331
8738B04331N95j1276j6608j7856j5575j2941q304j4717n53K739L403Q405Q627
$$ 204331 204926 193650 177042 159186 143611 130670 122366 107649 107096 109835 113238 121643 130270
8725A30270N263j340r41Q211K909l07j2466l620L224R005O312O838Q477k480q632
$$ 130270 135533 134193 133252 141463 144372 144065 131599 127979 131203 140208 146520 153358 161835 159355 150723
8710A50723O027R147J0406J2328O62O828m226j2086m018k227k422O878O513l656
$$ 150723 156750 165897 176303 188631 189293 196121 191895 179809 175791 173564 171142 178020 184533 180877
8696A80877j098M901j1146j6429j7266p174J145l993J952L569R328k368Q17p289
$$ 180877 179779 184680 173534 157105 139839 132665 133810 129817 131769 135338 144666 142298 143115 135826
8682A35826m297m346j0298L547K130j5381j3650l415M885J1758J1538l929n407
$$ 135826 131529 127183 116885 120432 122562 107181 93531 90116 95001 106759 118297 114368 108961
8669A08961j919J92L350J489J897J2057o717k123K398N008o9k0J3629L528J585
$$ 108961 107042 107234 110584 112073 113970 126027 119310 117187 119585 124593 124524 124504 138133 141661 143246
8654A43246M359M277J0280J0318O467Q853l175j1237r743q037N236N119J550n882
$$ 143246 147605 151882 162162 172480 178947 187800 184625 173388 163645 155608 160844 165963 167513 161631
8640A61631j3330j4368l914j364K103p822l684L913q835k220N479M531M402N976
$$ 161631 148301 133933 130019 128655 130758 122936 119252 123165 114330 112110 117589 122120 126522 132498
8626A32498L970K210l345m982n700l839P015P98j455n21k314o162K81P179L027
$$ 132498 136468 138678 135333 130351 124651 120812 127827 128625 127170 126649 124335 118173 118454 125633 128660
8611A28660M666K3345K1575K2389K6561J7905K794p223j0545j7171j5601k158
$$ 128660 133326 156671 178246 200635 227196 245101 247895 240672 230127 212956 197355 195197
8599A95197N650Q567l71q092K849J4315R62N469L864j824j0320r980j1982q090
$$ 195197 200847 209414 209043 200951 203800 218115 219077 224546 228410 226586 216266 206286 194304 186214
8585A86214j499j0845k5850j3051J793Q153p990j1567N025J846k229n108j4165
$$ 186214 184715 173870 148020 134969 136762 144915 136925 125358 130383 132229 130000 124892 110727
8572A10727o238M255K272j1516m994m29n460m252o052K712J791m161n394k740
$$ 110727 104489 108744 111016 99500 94506 94077 88617 84365 78313 81025 82816 78655 73261 70521
8558G0521K625N523N521L157Q37k377J286J618Q593o183n8O281k256O177L007
$$ 70521 73146 78669 84190 87347 88184 85807 87093 88711 97304 91121 91063 97344 95088 101265 104272
8543A04272J486k692p867M582K844k45K403l998m370J3294J555l872J1768J5936
$$ 104272 105758 103066 95199 99781 102625 102380 104783 100785 96415 109709 111264 107392 119160 135096
8529A35096O263M882N823Q105J4406K128R296J6514L2324N6504N4268N9919O5521
$$ 135096 141359 146241 152064 160169 174575 176703 185999 202513 234837 291341 345609 405528 471049
8516D71049P2356Q5502R8464J03765R9925Q0174N8310L3918K67k6470p0633r8342
$$ 471049 543405 628907 727371 831136 931061 1011235 1069545 1103463 1103730 1077260 1006627 908285
8504I08285j10507q6969r4059q6956o8148n5961n2285k9260n302M331m14j9336
$$ 908285 797778 710809 616750 529794 461646 405685 353400 324140 318838 323169 322755 303419
8492C03419k4315l9146l5246k6257k3527k2280k4517j3611r65L644J844p104l95
$$ 303419 279104 239958 204712 178455 154928 132648 108131 94520 93555 97199 99043 91939 91544
8479I1544j6066q930K946K629p103j613L783N896J705j1069m250m727o62K176
$$ 91544 75478 66548 69494 72123 65020 63407 67190 73086 74791 63722 59472 54745 54083 56259
8465E6259p879p057k494Q338Q449l996o569j3091j4803m642j5025q348q415j3865
$$ 56259 48380 41323 38829 47167 55616 51620 45051 31960 17157 12515 -2510 -10858 -19273 -33138
8451c3138l936o749r050k190J5861J6433L740Q824J0625K210N180p473j2063r567
$$ -33138 -37074 -43823 -52873 -55063 -39202 -22769 -19029 -10205 420 2630 7810 337 -11726 -21293
8437b1293n474P266Q714O164O084O785J5480K1337K2845J0017j102K113n18q658
$$ -21293 -26767 -19501 -10787 -4623 1461 8246 23726 45063 67908 77925 76823 78936 78418 69760
8423F9760q878n416J4212L167n040k716K747P7n129o243j47J332q585k198O48
$$ 69760 60882 55466 69678 72845 67805 65089 67836 67913 62784 56541 56394 57726 49141 46943 47591
8408D7591M381M067l868J984L746m945j202l112p055l229J054k979M810K15m630
$$ 47591 51972 56039 52171 54155 57901 52956 51754 48642 41587 38358 39412 36433 41243 41458 36828
8393C6828K390M188L799q15m892L81K524p218N750J2282j418k791m78P247j1240
$$ 36828 39218 43406 47205 46390 41498 41879 44403 37185 42935 55217 53799 51008 50530 57777 46537
8378D6537j6716r901R475K061P27M761n564k019J889M61l507l519J753Q265n69
$$ 46537 29821 19920 29395 31456 32183 36944 31380 29361 31250 31711 28204 24685 26438 34703 34134
8363C4134M125l321l612l761L789n84k033P873R01J112q236q523J2804R475L510
$$ 34134 38259 34938 31326 27565 31354 30770 28737 36610 37511 38623 30387 21864 34668 44143 47653
8348D7653K442k583K903l7l04p705j0903J0416K535p415j11o604L806M165k621
$$ 47653 50095 47512 50415 50378 50074 42369 31466 41882 44417 37002 36891 30287 34093 38258 35637
8333C5637k083j768P747J837m215P091L199n706j071L155M43J126o125L399j0150
$$ 35637 33554 31786 39533 41370 37155 44246 47445 41739 40668 43823 44266 45392 39267 42666 32516
8318C2516r705K278M591K753K79p737M956M539p79n460m2N775j518J163M1k150
$$ 32516 22811 25089 29680 32433 32712 24975 29931 34470 33691 28231 28189 33964 32446 33609 33650 31500
8302C1500J573Q615p663P329N589L918K750q11j2788l306o266j709N207R415K65
$$ 31500 33073 41688 34025 41354 46943 50861 53611 52800 40012 36706 30440 28731 33938 43353 43618
8287D3618O982q368j0336J838n43l675j120l021J658Q717L452r080j932J774M945
$$ 43618 50600 42232 31896 33734 33191 29516 28396 25375 27033 35750 39202 30122 28190 29964 34909
8272C4909K833K599p806m96n769p440O415J05O695N523k067P798o123L046L980
$$ 34909 37742 40341 32535 32039 26270 18830 25245 25350 32045 37568 35501 43299 37176 40222 44202
8257D4202l275j0740q535n571m210L131J1849J727n990N810R265j633l998m558
$$ 44202 40927 30187 21652 16081 11871 15002 26851 28578 22588 28398 37663 36030 32032 27474
8243B7474r913l357M591R477J3870m318r922j1645l314l372N164k689J4103J7502
$$ 27474 17561 14204 18795 28272 42142 37824 27902 16257 12943 9571 14735 12046 26149 43651
8229D3651L38K107k937o1K8q90r292o606m080O495J1484k06j343j3705M281N891
$$ 43651 43989 46096 43159 43098 43126 42236 32944 26338 22258 28753 40237 40031 38688 24983 29264 35155
8213C5155m561J146j909k297Q533J1011P28j7461P70N25K072k230j105n453O924
$$ 35155 30594 31740 29831 27534 36067 47078 47806 30345 31115 31640 33712 31482 30377 24924 31848
8198C1848n416p079L357J096P06N196l970n007m884J3495j899j126J025j300j2759
$$ 31848 26432 19353 22710 23806 24512 29708 25738 20731 15847 29342 27443 26317 27342 26042 13283
8183A3283j0100K834K235m257M395O583L578N54L279L507o79K626O048K02L331
$$ 13283 3183 6017 8252 3995 8390 14973 18551 19105 22384 25891 25212 27838 33886 34088 37419
8168C7419O668L124n199l494j814l813n460L605n308K609J20j610P396J301J784
$$ 37419 44087 47211 42012 38518 36704 32891 27431 31036 25728 28337 28457 26847 34243 35544 37328
8153C7328n778k380n516O589O164O964n048n919j1014k016M614J468m231p063
$$ 37328 31550 29170 23654 30243 36407 43371 38323 32404 21390 19374 23988 25456 21225 14162
8139A4162k54L778P798J493m599r24N470M292k529k78J747j901N921j2443l920
$$ 14162 13908 17686 25484 26977 22378 21454 26924 31216 28687 28409 30156 28255 34176 21733 17813
8124A7813N328K371k039J1597J07j487K78j2722l073J831j815K595l07l714l046
$$ 17813 23141 25512 23473 35070 35177 33690 33968 21246 18173 20004 18189 20784 20477 16763 13717
8109A3717n488p701L164R983l50L164M13n53p285K978P729N979J175l933k719
$$ 13717 8229 528 3692 13675 13325 16489 16902 16349 9064 12042 19771 25750 26925 22992 20273
8094B0273K51N71K650K941k321J668q336n888m273O884J396P374o049p2J853J326
$$ 20273 20524 21095 23745 26686 24365 26033 17697 11809 7536 14420 15816 23190 17141 17069 18922 20248
8078B0248K8p265M818J5072j0735k754J644Q659j774K656j376J81j0796j0442
$$ 20248 20276 13011 17829 32901 22166 19412 21056 29715 27941 30597 29221 29402 18606 8164
8064H164m383QJ4340Q891M075n150q759o97J198L8n529R549o228r951Q188O352
$$ 8164 3781 3789 18129 27020 31095 25945 17186 16489 17687 17725 12196 21745 15517 5566 13754 20106
8048B0106M456j664N38k96Q635J1224n810q355k732L64k559J359O391l079N039
$$ 20106 24562 22898 23436 23140 31775 42999 37189 28834 26102 26466 23907 25266 31657 28578 33617
8033C3617r19l191k99k599L441j541k462L657q222J018m33J35j4683n506P107
$$ 33617 32698 29507 29208 26609 30050 28509 26047 29704 21482 22500 22067 22202 7519 2013 9120
8018I120R544Q413N130J3370L825j1693l396j952o901j171M380J704j359N017
$$ 9120 18664 27077 32207 45577 49402 37709 34313 32361 25460 24289 28669 30373 29014 34031
8004C4031P532q061l514O395n701o62O310k886M021j600j493j00n00j906l993
$$ 34031 41563 33502 29988 36383 30682 30020 36330 33444 37465 35865 34372 34272 33772 31866 27873
7989B7873m399Q200O756k143m783p538J291m04o079M504K514l256J453N367J532
$$ 27873 23474 31674 38430 36287 31504 23966 25257 24853 18774 23278 25792 22536 23989 29356 30888
7974C0888o837l908P288N528o50O496L924J719p08M29O231K844j7860q237k536
$$ 30888 24051 20143 27431 32959 32309 38805 42729 44448 43740 44169 50400 53244 35384 27147 24611
7959B4611m527M440P245R213l724o445R2O474L291p46m0j0015n192N475Q05o908
$$ 24611 20084 24524 31769 40982 37258 30813 30905 37379 40670 39924 39884 29869 24677 30152 30957 24049
7943B4049n406Q79O786K151m979o678k800L426K369q61m253N494K819m775Q84
$$ 24049 18643 19522 26308 28459 23480 16802 14002 17428 19797 18936 14683 20177 22996 18221 19105
7928A9105R60J045M807M356M168j2320r99M924j311p675J729K544J001m231j9
$$ 19105 20065 21110 25917 30273 34441 22121 21122 26046 24735 17060 18789 21333 22334 18103 18084
7913A8084M763N339j640J367n255O727O831l309L499m102K31J989m470M638k288
$$ 18084 22847 28186 26546 27913 22658 29385 36216 32907 36406 32304 32535 34524 30054 34692 32404
7898C2404o827j1423j856R833J5336K69j2317m686O520k623O523q19n458j1422
$$ 32404 25577 14154 12298 22131 37467 37736 25419 20733 27253 24630 31153 30334 24876 13454
7884A3454j442R259J2987P335j415q570p213L175m399j2248j296J2002J2663M239
$$ 13454 12012 21271 34258 41593 40178 31608 24395 27570 23171 10923 9627 21629 34292 38531
7870C8531j1832q515j1521l199n98J651O927O263Q325M956j4094m27j312l821
$$ 38531 26699 18184 6663 3464 2866 4517 11444 17707 26032 30988 16894 16467 15155 11334
7856A1334N925L592K69k461M946m135p58p73p065M199K271M584j371k255j666
$$ 11334 17259 20851 21120 18659 23605 19470 18712 17939 10874 15073 17344 21928 20557 18302 16636
7841A6636q32O43m561m039J587J519m542k915N802l791L432K635j0038p739M032
$$ 16636 15804 16447 11886 7847 9434 10953 6411 3496 9298 5507 8939 11574 1536 -6203 -2171
7826b171J981L840J1593n83q616M068L846P512m09j1203l716N129k98k650j548
$$ -2171 -190 3650 15243 14660 6044 10112 13958 21470 21061 9858 6142 11271 10973 8323 6775
7811F775M53J2430j18q228n389K845o974r168J441Q130q29P225O32p151L804Q155
$$ 6775 7228 19658 19540 11312 5923 8768 1794 -7374 -5933 2197 1368 8593 9225 2074 5878 14033
7795A4033K255l0m734j2178K661L310O16k506l575j61L024R623O49p550M893K062
$$ 14033 16288 16258 11524 -654 2007 5317 5933 3427 -148 -309 2715 12338 12987 5437 10330 12392
7779A2392L962l325L599q806L621M469o796j009J133J81O273Q012J2507p772j0502
$$ 12392 16354 13029 16628 7822 11443 15912 9116 8107 9240 9421 15694 23706 36213 28441 17939
7764A7939q334r247l062k841M408J3840J0870m65l206j1392p737L29P621R957
$$ 17939 9605 358 -2704 -5545 -1137 12703 23573 23108 19902 8510 773 1102 8723 18680
7750A8680K807O13q840q163q4J629P515q723j0254j588J864R372n695l063Q808
$$ 18680 21487 22100 13260 5097 5013 6642 14157 5434 -4820 -6408 -4544 4828 -867 -3930 4878
7735D878M382M373n962p360P183P102o303k139k676N246M851J0061L07p024k544
$$ 4878 9260 13633 7671 311 7494 14596 8293 6154 3478 8724 13575 23636 23943 16919 14375
7720A4375N376r404j0361O168r357j152O910o16M514p345q935M072K869M089m742
$$ 14375 19751 10347 -14 6154 -3203 -4355 2555 1939 6453 -892 -9827 -5755 -2886 1203 -3539
7705c539J810N230J94n338l29J4373N363K500r965q970m189o301k514l497L943
$$ -3539 -1729 3501 3695 -1643 -1972 12401 17764 20264 10299 1329 -2860 -9161 -11675 -15172 -11229
7690a1229R464N199Q446k506j744l512k282J636Q586l073m801L369o950j699N301
$$ -11229 -1765 3434 11880 9374 7630 4118 1836 3472 12058 8985 4184 7553 603 -1096 4205
7675D205q184O709O743K529J612M492m150j3177j2438K840P950N94j133j022L71
$$ 4205 -3979 2730 9473 12002 13614 18106 13956 779 -11659 -8819 -869 -275 -1408 -2430 -2059
7660b059K77J0131J229m401M547p0n632r88K057L656L590j472q501l459N26l489
$$ -2059 -1782 8349 9578 5177 9724 9654 4022 3034 5091 8747 12337 10865 2364 -1095 -569 -4058
7644d058q201k849J4857J5466J1723N209n770j094K068J610n307r816j0676J312
$$ -4058 -12259 -15108 -251 15215 26938 32147 26377 25283 27351 28961 23654 13838 3162 4474
7630D474K955k317j1054j786j507j462P707P733j752K149M491m350q4R145k651
$$ 4474 7429 5112 -5942 -7728 -9235 -10697 -2990 4743 2991 5140 9631 5281 5197 14342 11691
7615A1691j1557p168o85R306P522L093P846O39q101q456m44k688J4187M452o059
$$ 11691 134 -7034 -7719 1587 9109 12202 20048 20687 12586 4130 3686 998 15185 19637 13578
7600A3578m717k278p909n760N229P158L225J27N778p951o10N583k162J333o461
$$ 13578 8861 6583 -1326 -7086 -1857 5301 8526 8653 14431 6480 5870 11453 9291 10624 4163
7585D163n350J681L62N736L713M1L113j31M482j308l07j0029p244k255o703J776
$$ 4163 -1187 494 856 6592 10305 10346 13459 13328 17810 16502 16195 6166 -1078 -3333 -10036 -8260
7569h260p5K873m754j841N54O02j114Q451O183n293k9K747l049J0632j178o016
$$ -8260 -8335 -5462 -10216 -12057 -11503 -10901 -12015 -3564 2619 -2674 -2703 44 -3005 7627 6449 433
7553D33j401m031k164R622P99Q862J0441n374q529q268l877o402L136K686P620
$$ 433 -968 -4999 -7163 2459 3258 12120 22561 17187 8658 390 -3487 -9889 -6753 -4067 3553
7538C553M049j134k276l339L578M206j98M5J990L98m334q111L414N63P3n11J773
$$ 3553 7602 6468 4192 853 4431 8637 8439 8484 10474 10872 6538 -1573 1841 2404 2477 1966 3739
7521C739P76j586j045M25lP819J531r053O63N523M244j3852K447N722L580M105
$$ 3739 4515 2929 1884 2309 2306 10125 11656 2603 3266 8789 13033 -819 1628 7350 10930 15035
7505A5035j4969o220Q79L696l034l000N644j111m926j206j633p310J363Q348O651
$$ 15035 66 -6154 -5275 -1579 -4613 -7613 -1969 -3080 -8006 -9212 -10845 -18155 -16792 -8444 -1793
7490a793N717P28M556l375k699p012O05p99L663P528j353n836j655l214p381N932
$$ -1793 3924 4652 9208 5833 3134 -3878 -3273 -4072 -409 7119 5766 -70 -1725 -4939 -12320 -6388
7474f388J2959J724n854j1129j1139l4O989J613J1119J1435p561j8888q08Q597
$$ -6388 6571 8295 2441 -8688 -19827 -19861 -12872 -11259 -140 11295 3734 -15154 -15962 -7365
7460g365o709J787L44N140K45J25m783N502J4395J267n397q482Q772J0479o117
$$ -7365 -14074 -12287 -11943 -6803 -6558 -6433 -11216 -5714 8681 9948 4551 -3931 4841 15320 9203
7445I203L421r68p347j847K230j221j123n003J006L792N218j887K280k842O427
$$ 9203 12624 11656 4309 2462 4692 3471 2348 -2655 -1649 2143 7361 5474 7754 4912 11339
7430A1339J29l377j930M914Q54j0314q110l754K786J177L551l619k011l608l83
$$ 11339 11468 8091 6161 11075 11929 1615 -6495 -10249 -7463 -6286 -2735 -6354 -8365 -11973 -12356
7415a2356L058K576k292M298P102k880k703n45p122o160R566J3055O930L475n18
$$ -12356 -9298 -6722 -9014 -4716 2386 -494 -3197 -3742 -10864 -17024 -7458 5597 12527 16002 15484
7400A5484j132n213m182J54J565o594l000P284R00j3975p660J0648Q199k172n802
$$ 15484 14352 9139 4957 5111 6676 82 -2918 4366 5266 -8709 -16369 -5721 2478 306 -5496
7385e496q21q1O608m572q748L647J609j576J1545O748p646j786O920M665j627
$$ -5496 -6317 -6398 210 -4362 -13110 -9463 -7854 -9430 2115 8863 1217 -569 6351 11016 9389
7370I389m816K463j473m085j0254r513K572M997J468j44N305R251m222j1710o516
$$ 9389 4573 7036 5563 1478 -8776 -18289 -15717 -10720 -9252 -9396 -4091 5160 938 -10772 -17288
7355a7288M151k488P813O578M947j798K372J293k713k584M939O237n533k406K453
$$ -17288 -13137 -15625 -7812 -1234 3713 1915 4287 5580 2867 283 5222 11459 5926 3520 5973
7340E973j1325o800k734Q597J2396n67j1065k803P418J1327J041l425L266L621
$$ 5973 -5352 -12152 -14886 -6289 6107 5540 -5525 -8328 -910 10417 11458 8033 11299 14920
7326A4920J628n076j2009j2979R93J2285R716N613r108p081K943M015k616m55
$$ 14920 16548 11472 -537 -13516 -12523 -238 9478 15091 5983 -1098 1845 5860 3244 2789
7312B789N763P819j77o820j663j2421k688m79J893l962l779K885P390P33K340
$$ 2789 8552 16371 16194 9374 7711 -4710 -7398 -7877 -5984 -9946 -13725 -10840 -3450 -2717 -377
7297c77J762l530l602K544L995K652L387M31q009r734k057L782k980m027M74k04
$$ -377 1385 -2145 -5747 -3203 792 3444 6831 7262 -747 -10481 -12538 -8756 -11736 -15763 -15289 -15493
7281a5493Q51L789M956l94k538k686K58l209N419M780K93n310k3j857j172k920
$$ -15493 -14642 -10853 -5897 -6291 -8829 -11515 -11257 -14466 -9047 -4267 -3974 -9284 -9307 -11164 -12336 -15256
7265a5256J0652R030l909R17J498K629p53m794l672r752K514K384J0228J0550
$$ -15256 -4604 4426 517 1434 2932 5561 4808 14 -3658 -13410 -10896 -8512 1716 12266
7251A2266N475N977Q9o534q032o50p86j51Q434L785k61J187J900j0273k800O694
$$ 12266 17741 23718 23807 17273 9241 8591 7805 7654 16088 19873 19612 20799 22699 12426 9626 16320
7235A6320r751N14L946p412k934k644P816n725o711L427P74L012N849K351m865
$$ 16320 6569 7083 11029 3617 683 -1961 5855 130 -6581 -3154 -2380 632 6481 8832 3967
7220C967N53k810j557L011P269j262j7276j828K109M813O241l193l706L831m147
$$ 3967 4520 1710 153 3164 10433 9171 -8105 -9933 -7824 -3011 3230 37 -3669 162 -3985
7205c985r203Q858K1001l026j1779k082r782o398J1315J8251M693n683k059J323
$$ -3985 -13188 -4330 16671 13645 1866 -216 -9998 -16396 -5081 13170 17863 12180 10121 11444
7191A1444k759j2389l913K372K702K705k474n297J536R23N84l941K733M141P91
$$ 11444 8685 -3704 -7617 -5245 -2543 162 -2312 -7609 -6073 -5150 -4566 -8507 -5774 -1633 -842
7176h42p024r060O106K601J031j673N441J0980K434M576K726m985r020k288l238
$$ -842 -7866 -16926 -10820 -8219 -7188 -8861 -3420 7560 9994 14570 17296 12311 3291 1003 -2235
7161b235k108M091J046N181O471j8379j138k968M945m514M039N237L089o51J874
$$ -2235 -4343 -252 794 5975 12446 -5933 -7071 -10039 -5094 -9608 -5569 -332 2757 2106 3980
7146C980K714l811Q386J020k640L387k044m670O722o65j70l894o465j050j915
$$ 3980 6694 2883 11269 12289 9649 13036 10992 6322 13044 12379 12209 8315 1850 800 -1115
7131a115l249L070L084m967q161n780N686P765N709L629O745r456l323l999K337
$$ -1115 -4364 -1294 1790 -3177 -11338 -17118 -11432 -3667 2042 5671 12416 2960 -363 -4362 -2025
7116b025Q355K251P097K192r017o236k427L50M119O94J74j696j511Q642J0626
$$ -2025 6330 8581 15678 17870 8853 2617 190 540 4659 5353 5527 3831 2320 10962 21588
7101B1588J607l415p910q579L202l751k864p9O685J090k419j097j357n55j17K591
$$ 21588 23195 19780 11870 3291 6493 2742 -122 -201 6484 7574 5155 4058 2701 2146 2029 4620
7085D620n411M384n38l037k019L278R025k968l509Q772M782l190p581K353l549
$$ 4620 -791 3593 3055 18 -2001 1277 10302 7334 3825 12597 17379 14189 6608 8961 5412
7070E412o804l378K60r651m000L063M766J901l028M621j2k814M538M847J2902
$$ 5412 -1392 -4770 -4510 -14161 -18161 -15098 -10332 -8431 -11459 -6838 -6850 -9664 -5126 -279 12623
7055A2623K690M164l658j2177o940K921L28J1238K653n333l49m261l51O699k233
$$ 12623 15313 19477 15819 3642 -3298 -377 -49 11189 13842 8509 8160 3899 3548 10247 8014
7040H014m374p008j777l520K829K764P85o743r713K291J0430M095P576M65O13
$$ 8014 3640 -3368 -5145 -8665 -5836 -3072 -2287 -9030 -18743 -16452 -6022 -1927 5649 6114 6727
7025F727K94Q683j890j1746M767m988J944R247k180L47j0033j805K263J872M799
$$ 6727 7021 15704 13814 2068 6835 1847 3791 13038 10858 11205 1172 -633 1630 3502 8301
7010H301j115j544r59J474n33o532k188o808l004j3125l375J2455O589M261l731
$$ 8301 7186 5642 4683 6157 5624 -908 -3096 -9904 -12908 -26033 -29408 -16953 -10364 -6103 -9834
6995i834L151l226J895O951Q461K286Q193Q070O66p548l27l460n969j1209l769
$$ -9834 -6683 -9909 -8014 -1063 7398 9684 17877 25947 26613 19065 18738 15278 9309 -1900 -5669
6980e669J892N244l522n11j874M750J345K335l199K329j1209j3834L6L597R110
$$ -5669 -3777 1467 -2055 -2566 -4440 310 1655 3990 791 3120 -8089 -21923 -21887 -18290 -9180
6965i180M665J4024k969k098m856J297M075Q56K202m559n411o238J249L66m747
$$ -9180 -4515 9509 6540 4442 -414 883 4958 5814 8016 3457 -1954 -8192 -6943 -6577 -11324
6950a1324p031M658L871J935j642K9J3457K236J658j4139J791M272M71n326K614
$$ -11324 -18355 -13697 -9826 -7891 -9533 -9504 3953 6189 7847 -6292 -4501 -229 242 -5084 -2470
6935b470M349m082o223M040O838l94Q702p939P01M484q390k059L580l422l492
$$ -2470 1879 -2203 -8426 -4386 2452 2058 10760 2821 3522 8006 -384 -2443 1137 -2285 -5777
6920e777L508K69n948N823O103L267m52l531j170M092j415r535p22K908k189P721
$$ -5777 -2269 -2000 -7948 -2125 3978 7245 6793 3262 2092 6184 4769 -4766 -5488 -2580 -4769 2952
6904B952m102l114L926M587M479j876P084m492p353J031n261m815l685k485o137
$$ 2952 -1150 -4264 -338 4249 8728 6852 13936 9444 2091 3122 -2139 -6954 -10639 -13124 -19261
6889a9261L141L682Q440N059L259m306J66K030N192R69q249o043K130M034j620
$$ -19261 -16120 -12438 -3998 1061 4320 14 180 2210 7402 8371 122 -5921 -3791 243 -1377
6874a377q8L068R8R6q596M589N031N176j0997j2624L52L676j523K954J424P55
$$ -1377 -1465 1603 1701 1797 -6799 -2210 2821 7997 -3000 -15624 -15272 -11596 -13119 -10165 -8741 -7986
6858g986O596N10l010q470K067N495k136N878n980q742k59L492K606r52M586K717
$$ -7986 -1390 -880 -3890 -12360 -10293 -4798 -6934 -1056 -7036 -15778 -16037 -12545 -9939 -10891 -6305 -3588
6842c588J1740L122m373j6502P57J3944O195j2898l371K765K334N135o81P060
$$ -3588 8152 11274 6901 -9601 -8844 5100 11295 -1603 -4974 -2209 125 5260 4579 11639
6828A1639m132m820j4584J55J0852J1596J0642m944n534p242j2778o012K283L163
$$ 11639 7507 2687 -11897 -11742 -890 10706 21348 16404 10870 3628 -9150 -15162 -12879 -9716
6814i716j806M488n438k02J364O016j734k575K454R6l868K262j114Q414Q295n533
$$ -9716 -11522 -7034 -12472 -12674 -11310 -5294 -7028 -9603 -7149 -7053 -10921 -8659 -9773 -1359 6936 1403
6798A403L164N008q397n3o466k512j801L248O304J0877K148j2306j2672m068O727
$$ 1403 4567 9575 1178 1125 -5341 -7853 -9654 -6406 -102 10775 12923 617 -12055 -16123 -9396
6783i396J0242j536l056O306J1456j0160o492j0014K272J0966N569k170k408l705
$$ -9396 846 -690 -3746 2560 14016 3856 -2636 -12650 -10378 588 6157 3987 1579 -2126
6769b126n726k143J367J1925j1607l920R688Q264K082L225p867p078M550L710
$$ -2126 -7852 -9995 -8628 3297 -8310 -12230 -2542 5722 7804 11029 3162 -3916 634 4344
6755D344q281J6840j02R27P713k17j4603j2775k788N473P290o0L054O43O215k954
$$ 4344 -3937 12903 12801 13728 21441 21224 6621 -6154 -8942 -3469 3821 3761 6815 7458 13673 10719
6739A0719m089k250J692q773J087M575P384K532M441M00K873P815M349J1390Q729
$$ 10719 6630 4380 6072 -2701 -1614 2961 10345 12877 17318 17718 20591 28406 32755 44145 52874
6724E2874K4414J9658J5890L6929O2967O6128K5201m1385n2680n4513m4014k9904
$$ 52874 77288 96946 112836 149765 212732 278860 304061 262676 209996 155483 111469 81565
6712H1565j3311j4844j8902p562p820n509M800K313l042O23M077K194m508m374
$$ 81565 68254 53410 34508 26946 19126 13617 18417 20730 17688 18311 22388 24582 20074 15700
6698A5700o168p077R621Q526O666J033j2311k308k288n549o159n346m620R307
$$ 15700 9532 2455 12076 20602 27268 28301 15990 13682 11394 5845 -314 -5660 -10280 -973
6684i73L821l744N854k524o351R423K399n856P131K53l678N95L982N976J900p00
$$ -973 2848 -896 4958 2434 -3917 5506 7905 2049 9180 9433 5755 6350 10332 16308 18208 17508
6668A7508k835p827l067l786k600L828L075l31n393j426J863M69k802j305N924
$$ 17508 14673 6846 3779 -7 -2607 1221 4296 3965 -1428 -2854 -991 -522 -3324 -4629 1295
6653A295R0n435J893L548l277o870J725P786P380p45q135R838J758K977j494r079
$$ 1295 1385 -4050 -2157 1391 -1886 -8756 -7031 755 8135 7390 -745 9093 10851 13828 12334 3255
6637C255k006M895l737l73J693Q316J144O306K404q299q063M034k716m513L826
$$ 3255 1249 6144 2407 2034 3727 12043 13187 19493 21897 13598 5535 9569 6853 2340 6166
6622F166r38j997J209k161j66K108j94L914k327J472q838N79J3075o16q300j087
$$ 6166 5228 3231 4440 2279 2113 4221 4027 7941 5614 7086 -1752 -1173 11902 11286 2986 1899
6606A899m306L994n08j527P59L41N199M553L116o414n402K668r887n675J145J0679
$$ 1899 -2407 1587 1079 -448 311 652 5851 10404 13520 7106 1704 4372 -5515 -11190 -10045 634
6590F34Q28j034K834r156j0043J050J1210k210Q116J70j0846R48j062J981L369
$$ 634 1462 428 3262 -5894 -15937 -14887 -3677 -5887 2229 2399 -8447 -7499 -8561 -6580 -3211
6575c211P398o734j3746J264j720O200M480L091M295n491m266R072O033l832n050
$$ -3211 4187 -2547 -16293 -15029 -16749 -10549 -6069 -2978 1317 -4174 -8440 632 6665 2833 -2217
6560b217M54J048J39p150K500O804M923k149j03n049j1072N95J737j884O286M99
$$ -2217 -1763 -715 -576 -7726 -5226 1578 6501 4352 4249 -800 -11872 -11277 -9540 -11424 -5138 -4639
6544d639J3068J762p730K438P052o980o628q77L320K793o360k833R583J2325k882
$$ -4639 8429 10191 2461 4899 11951 4971 -1657 -2534 786 3579 -2781 -5614 3969 16294 13412
6529A3412K731l176l945l635k154n577K321j662M981J1521K398j714o234k240
$$ 13412 16143 12967 9022 5387 3233 -2344 -23 -1685 3296 14817 17215 15501 9267 7027
6515G027j315m415j216l121l845R021J3375l72J776L988n133o599q676L363N40
$$ 7027 5712 1297 81 -3040 -6885 2136 15511 15139 16915 20903 15770 9171 495 3858 4398
6500D398p442j264L364O083J021M60l227j9N923L605k947n088k954p857M270N024
$$ 4398 -3044 -4308 -944 5139 6160 6620 3393 3374 9297 12902 9955 4867 1913 -5944 -1674 3350
6484C350o665o133J0732J717j246R65l541K92M230k750m300K690L329L933j0593
$$ 3350 -3315 -9448 1284 3001 1755 2720 -821 -529 3701 951 -3349 -659 2670 6603 -3990
6469c990o603N686O909P057L392k424r753k247m962l287k28M222K173k306M71
$$ -3990 -10593 -4907 2002 9059 12451 10027 274 -1973 -6935 -10222 -10450 -6228 -4055 -6361 -5890
6454e890K495N090P524j72r221l704k628N7M861n10l366N235j332J420p865o228
$$ -5890 -3395 1695 9219 9047 -174 -3878 -6506 -6449 -1588 -2098 -5464 -229 -1561 -141 -8006 -14234
6438a4234l5j301J0934l240N247L622l947M629M559m787j1439J635Q00O447J3005
$$ -14234 -14269 -15570 -4636 -7876 -2629 993 -2954 1675 6234 1447 -9992 -8357 -7557 -1110 11895
6423A1895k056m966n942j112N841M741k775k345p220j593L553O044L701p482N151
$$ 11895 9839 4873 -1069 -2181 3660 8401 5626 3281 -3939 -5532 -1979 4065 7766 284 5435
6408E435L73L2o074n708K348Q869K124P00k731m625m687P617R98J861P31k703
$$ 5435 5808 5840 -234 -5942 -3594 5275 7399 8099 5368 743 -3944 3673 4671 6532 7263 4560
6392D560j894K61O45O339M135q811M49m930m804Q296J143l481j349j2191j603
$$ 4560 2666 2927 3572 9911 14046 5235 5684 754 -4050 4246 5389 1908 559 -11632 -13235
6377a3235J0970R295J179k060K919O513m221n281p998J441O520Q125L277n647
$$ -13235 -2265 7030 8209 6149 9068 15581 11360 6079 -1919 -478 6042 14167 17444 11797
6363A1797m819J684q171j3020O29P728k590r33J574N412K388P09k429L776P948
$$ 11797 6978 8662 491 -12529 -11900 -4172 -6762 -7695 -6121 -709 1679 2388 -41 3735 11683
6348A1683L731k425p077k533r77K283m340M127J0041K457P639J007p188m433l793
$$ 11683 15414 12989 5912 3379 2402 4685 345 4472 14513 16970 24609 25616 18428 13995 10202
6333A0202m925l313q755J06j680j106O838L143j094K585J278j5717n934P03j415
$$ 10202 5277 1964 -6791 -6685 -8365 -9471 -2633 510 -584 2001 3279 -12438 -18372 -17669 -19084
6318a9084K351k209q447J99J0787Q985M541P708j3056j831L86j823m105K16J779
$$ -19084 -16733 -18942 -27389 -27190 -16403 -7418 -2877 4831 -8225 -10056 -9670 -11493 -15598 -15382 -13603
6303a3603j56j454O939N75k571J2527L710j064M9l932q825m967J137L322L494
$$ -13603 -13759 -15213 -8274 -7699 -10270 2257 5967 4903 4952 1020 -7805 -12772 -11635 -8313 -4819
6288d819J224m770P143k525J0517p66r06J95J170J0538l460o88K730j0532o074
$$ -4819 -3595 -8365 -1222 -3747 6770 6004 5098 5293 6463 17001 13541 12853 15583 5051 -1023
6273a023K708M151j0182n061Q065K008Q518N49k342k334k571l458R46L938Q648
$$ -1023 1685 5836 -4346 -9407 -1342 666 9184 9733 7391 5057 2486 -972 -26 3912 12560
6258A2560p648r462n83K270J1943j3927l624L429l867m828R73P996K806K521M581
$$ 12560 4912 -4550 -5133 -2863 9080 -4847 -8471 -5042 -8909 -13737 -12764 -4768 -1962 559 5140
6243E140n643j811K945M756L127n204o982j691j996l81J807R40M634l483L180
$$ 5140 -503 -2314 631 5387 8514 3310 -3672 -5363 -7359 -7740 -5933 -4993 -359 -3842 -662
6228f62R00j163j138Q091L414j222l759L269j279O867q01j6410n054K921J2185
$$ -662 238 -925 -2063 6028 9442 8220 4461 7730 6451 13318 12517 -3893 -8947 -6026 6159
6213F159N804o971l3j782o641m264Q951R11k219j1511r275Q038K075P452L285
$$ 6159 11963 4992 4959 3177 -3464 -7728 1223 2134 -85 -11596 -20871 -12833 -10758 -3306 -21
6198b1K730Q947k636o546k380j701L891O900l132m089j726k821j224K78k730R079
$$ -21 2709 11656 9020 2474 94 -1607 2284 9184 6052 1963 237 -2584 -3808 -3530 -6260 2819
6182B819R35j338J122K91N983M191j5395p616R037M441k951L792m636o05N654
$$ 2819 3754 2416 3538 3829 9812 14003 -1392 -9008 29 4470 1519 5311 675 70 5724
6167E724L159M89l818j330J544j328o744k172M149M046N873M414K108k352j828
$$ 5724 8883 9372 5554 4224 5768 4440 -2304 -4476 -327 3719 9592 14006 16114 13762 11934
6152A1934j1213k445L630J851p27j045l035N671r48N689N241n151j3269q997L314
$$ 11934 721 -1724 1906 3757 3030 1985 -1050 4621 3673 9362 14603 9452 -3817 -12814 -9500
6137i500M925J9710L78m201M722N25q431j3278k922K133O462J061m92N981r289
$$ -9500 -4575 15135 15513 11312 16034 16559 8128 -5150 -8072 -5939 523 1584 1092 7073 -2216
6122b216j3855Q987N670L029K50M950k870r281O919M921l104j0507o657Q046Q053
$$ -2216 -16071 -7084 -1414 1615 1865 6815 3945 -5336 1583 6504 3400 -7107 -13764 -5718 2335
6107B335k284M54k844n575Q809M481m639k434J005q268m021P782O057q809r231
$$ 2335 51 505 -2339 -7914 895 5376 737 -1697 -692 -8960 -12981 -5199 858 -7951 -17182
6092a7182N046j744j46K44Q805R694j933J261n902m606n199J0878J932N912m626
$$ -17182 -12136 -13880 -14026 -13782 -4977 4717 2784 4045 -1857 -6463 -11662 -784 1148 7060 2434
6077B434o978j0808N257rn801l324J1810P616k967L948L630N407o773q487n772
$$ 2434 -4544 -15352 -10095 -10104 -15905 -19229 -7419 197 -2770 1178 4808 10215 3442 -5045 -10817
6062a0817Q0R005O464o305m982j660j981J207J325K68O97p807l112O117n402N290
$$ -10817 -10737 -1732 4732 -1573 -6555 -8215 -10196 -8989 -7664 -7396 -6699 -14506 -17618 -11501 -16903 -11613
6046a1613P903p167n727R384o16R50N454Q270n89k434k1132p71J2850O731R4o207
$$ -11613 -3710 -10877 -16604 -7220 -7836 -6886 -1432 6838 6249 3815 -17317 -18088 -5238 1493 1587 -4620
6030d620K776N025O285m342j3941N429N707J777n409p028k002O392l671N20M241
$$ -4620 -1844 3181 9466 5124 -8817 -3388 2319 4096 -1313 -8341 -10343 -3951 -7622 -7102 -2861
6015b861J923j794J597L705M343J1085q279r408m068O780n99r660m685K408O399
$$ -2861 -938 -2732 -1135 2570 6913 17998 9719 311 -3757 3023 2424 -7236 -11921 -9513 -3114
6000c114m692j68j477K709L342m610l436J444J612O535J0283m085l051n138k607
$$ -3114 -7806 -7974 -9451 -6742 -3400 -8010 -11446 -10002 -8390 -1855 8428 4343 1292 -3846 -6453
5985f453L820j801m678n566J220n61J329K516J7298K121q225K29L020j575n234
$$ -6453 -2633 -4434 -9112 -14678 -13458 -14019 -12690 -10174 7124 9245 1020 1249 4269 2694 -2540
5970b540m528l382K922M932J6522M457o298j1656j01M959P857l459L430K448p341
$$ -2540 -7068 -10450 -7528 -2596 13926 18383 12085 429 328 5287 13144 9685 13115 15563 8222
5955H222m398l80k16N833m271j575M282P442m036L85M267l457j989o237m837l848
$$ 8222 3824 3444 3228 9061 4790 3215 7497 14939 10903 11288 15555 12098 10109 3872 -965 -4813
5939d813m86J926K900J369J721N55j0432l075L616oQ131O428l803j152K903l575
$$ -4813 -5299 -3373 -473 896 2617 3172 -7260 -10335 -6719 -6725 1406 7834 4031 2879 5782 2207
5923B207m159q459o476K404M746l532K109J1231J301q835K390J586k471m482Q809
$$ 2207 -1952 -10411 -16887 -14483 -9737 -13269 -11160 71 1372 -7463 -5073 -3487 -5958 -10440 -1631
5908a631J956j441N017N027M3l03n530M255K361L99K701j7j3986n855j723m984
$$ -1631 325 -1116 3901 8928 8971 8668 3138 7393 9754 10153 12854 12837 -1149 -7004 -8727 -13711
5892a3711N037O08O608q821O838J284m331o370k393j328J401P460P02M981m178
$$ -13711 -8674 -8066 -1458 -10279 -3441 -2157 -6488 -12858 -15251 -16579 -15178 -7718 -7016 -2035 -6213
5877f213q986n826Q571J2592P102q330j741O375n19p194l612q853P643Q955n973
$$ -6213 -15199 -21025 -12454 138 7240 -1090 -2831 3544 3025 -4169 -7781 -16634 -8991 -36 -6009
5862f009p007j290R930M014O615j163l765j507m661k177r465j710K362P441K070
$$ -6009 -13016 -14306 -4376 -362 6253 5090 1325 -182 -4843 -7020 -16485 -18195 -15833 -8392 -6322
5847f322O37K71M73O62J762j152N7K625n213N88o545K671m85J046j7L23J859q493
$$ -6322 -5685 -5414 -4941 -4279 -2517 -3669 -3612 -987 -6200 -5612 -12157 -9486 -9971 -8925 -8942 -8619 -6760 -15253
5829a5253Q79M737r54J051p900q39k330P533R586l622j343r382L063L490o939
$$ -15253 -14374 -9637 -10591 -9540 -17440 -18279 -20609 -13076 -3490 -7112 -8455 -17837 -14774 -11284 -18223
5814a8223o52P765m177o5N666Q31l886L010J492L183l743K321M863k092n279K58
$$ -18223 -18875 -11110 -15287 -15352 -9686 -8855 -12741 -9731 -8239 -5056 -8799 -6478 -1615 -3707 -8986 -8728
5798h728J58k229R443K245K501r239l344L569J272K602n061j578J3355K991o577
$$ -8728 -8570 -10799 -1356 889 3390 -5849 -9193 -5624 -4352 -1750 -6811 -8389 4966 7957 1380
5783A380K308k28j450n986r27L660n650L030K758L28L089J680J0127j122j1681
$$ 1380 3688 3460 2010 -3976 -4903 -1243 -6893 -3863 -1105 -777 2312 3992 14119 12997 1316
5768A316n910l865R530j916p967o052O998J995j284N512k239j129k116n974R152
$$ 1316 -4594 -8459 1071 -845 -8812 -14864 -7866 -5871 -7155 -1643 -3882 -5011 -7127 -13101 -3949
5753c949N650j908j1955K262K262J544m534o038K585j23P433k88K64M33M275K599
$$ -3949 1701 -207 -12162 -9900 -7638 -6094 -10628 -16666 -14081 -14204 -6771 -7059 -6795 -6362 -2087 512
5737E12K292n374m317J475J43J4306J1379k541p370R2r62N916J823J39M75j0026
$$ 512 2804 -2570 -6887 -5412 -5269 9037 20416 17875 10505 10597 9635 15551 17374 17513 17988 7962
5721G962j1335m208J2217L312o384r599r12N984l620q16l36L937O81K474o232
$$ 7962 -3373 -7581 4636 7948 1564 -8035 -8947 -2963 -6583 -7399 -7735 -3798 -3117 -643 -6875
5706f875k491Q136N203P00km785j1668l273J020J3825N265n462m67J145j1477
$$ -6875 -9366 -1230 3973 4673 4671 -114 -11782 -15055 -14035 -210 5055 -407 -874 271 -11206
5691a1206r048N608O623N304n346o851R295j687r402K287L009p18J6911J625j2973
$$ -11206 -20254 -14646 -8023 -2719 -8065 -14916 -5621 -7308 -16710 -14423 -11414 -12132 4779 6404 -6569
5676f569j2324k398O037L457P476J148L419m690O032L939o328p295N02K284M918
$$ -6569 -18893 -21291 -15254 -11797 -4321 -3173 246 -4444 1588 5527 -801 -8096 -7594 -5310 -392
5661c92m957m393K703J1340J2170r222k29J7052j547j2180Q09L71k072j589N492
$$ -392 -5349 -9742 -7039 4301 16471 7249 7020 24072 22525 10345 11154 11525 9453 7864 13356
5646A3356N106l596j4991m970k742p7O309K331j115p64m487m236Q788N33P09P41
$$ 13356 18462 14866 -125 -5095 -7837 -7914 -1605 726 -389 -1153 -5640 -9876 -1088 -555 154 895
5630H95l343j4162j1350M155Q424J0267j694l397O9k293N305N55m563M6L761J2827
$$ 895 -2448 -16610 -27960 -23805 -15381 -5114 -6808 -10205 -10136 -12429 -7124 -6569 -11132 -11086 -7325 5502
5614E502P881j370o472j688L235j2229j8189m57O505Q187Q580M817N278L667n735
$$ 5502 13383 12013 5541 3853 7088 -5141 -23330 -23787 -17282 -9095 -515 4302 9580 13247 7512
5599G512j1237K382O828k37n520p707l183J3130o07m28o696M658j716l3N228l787
$$ 7512 -3725 -1343 5485 5248 -272 -7979 -11162 1968 1361 933 -5763 -1105 -2821 -2854 2374 -1413
5583a413q801l261L05J3010j655o804O215J310L311L126k856P230Q706j0058o907
$$ -1413 -10214 -13475 -13170 -160 -1815 -8619 -2404 -1094 2217 5343 2487 9717 18423 8365 1458
5568A458M06n394j32L074l9k867o325P914o255R60k499Q136J2987J990j479p225
$$ 1458 1864 -3530 -3662 -588 -627 -3494 -9819 -1905 -8160 -7200 -9699 -1563 11424 13414 11935 4710
5552D710k530J092p056k39N164J4065M752j6413l117K045O25P97p089r394r258
$$ 4710 2180 3272 -3784 -4023 1141 15206 19958 3545 428 2473 3098 3895 -3194 -12588 -21846
5537b1846L800P528N097R396l069l981M44K574m636q057R44J09K747J967J646
$$ -21846 -18046 -10518 -5421 3975 906 -3075 -2631 -57 -4693 -12750 -11806 -11697 -8950 -6983 -5337
5522e337o586K313Q598J847R05R44j465P02l024J987J717j643L34Q097K116l80
$$ -5337 -11923 -9610 -1012 835 1740 2684 1219 1921 -1103 884 2601 958 1292 9389 11505 11125
5506A1125r2p280j583r308N584J801o032n002K125J440M169m954m795r65M769
$$ 11125 11033 3753 2170 -7138 -1554 247 -5785 -10787 -8662 -7222 -3053 -8007 -12802 -13767 -8998
5491h998L989Q200l031Q54m182k338j453m45k267m642P506O192K096l213q728
$$ -8998 -5009 3191 160 1014 -3168 -5506 -6959 -7404 -9671 -14313 -6807 -615 1481 -1732 -10460
5476a0460j2l82O030L833k167N506l406J362J0032J209j4046k749M453k992n901
$$ -10460 -10472 -10854 -4824 -991 -3158 2348 -1058 304 10336 11545 -2501 -5250 -797 -3789 -9690
5461i690M169N418K194L11n886j543k792J142o083k526R591l885P139J1557J767
$$ -9690 -5521 -103 2091 2402 -3484 -5027 -7819 -6677 -12760 -15286 -5695 -9580 -2441 9116 10883
5446A0883r05Q528o462J473J162l871m395J306j115m071k844n136j88j486k65
$$ 10883 9978 18506 12044 13517 14679 10808 6413 7719 6604 2533 -311 -5447 -5635 -7121 -7386
5431g386l779o296M005r90k57J43K871O223M90M53n107L471n576p434O438L094
$$ -7386 -11165 -17461 -13456 -14446 -14703 -14560 -11689 -5466 -4976 -4523 -9630 -6159 -11735 -19169 -12731 -9637
5415i637l350j341N757Q63N686o474m940J0247O802n538l59J521m949j859j0102
$$ -9637 -12987 -14328 -8571 -7708 -2022 -8496 -13436 -3189 3613 -1925 -2284 -763 -5712 -7571 -17673
5400a7673J005J2577Q402M02l412Q25r29l195K498o150m3N187l93M158J1638o712
$$ -17673 -16668 -4091 4311 4713 1301 2126 1197 -1998 500 -5650 -5693 -506 -899 3259 14897 8185
5384H185j5407m568L626K145L97N101l558q709J547O049K356o124k662L497P249
$$ 8185 -7222 -11790 -8164 -6019 -5622 -521 -4079 -12788 -11241 -5192 -2836 -8960 -11622 -8125 -876
5369h76M579L498N378m714r635l093J270L216O3o108j0075M913L728k301N697
$$ -876 3703 7201 12579 7865 -1770 -4863 -3593 -377 -314 -6422 -16497 -11584 -7856 -10157 -4460
5354d460J773N894P127k935r720N588r361P495k816l478P268N609l446K104J872
$$ -4460 -2687 3207 10334 7399 -2321 3267 -6094 1401 -1415 -4893 2375 7984 4538 6642 8514
5339H514J960J344o549m151K684J085l365k962n789l245k973q657O737J8179o126
$$ 8514 10474 11818 5269 1118 3802 4887 1522 -1440 -7229 -10474 -13447 -22104 -15367 2812 -3314
5324c314j113P086K130o912j846n851k98L427Q125O27m004n408p702O991j4k585
$$ -3314 -4427 2659 4789 -2123 -3969 -9820 -10118 -6691 1434 2061 -1943 -7351 -15053 -8062 -8076 -10661
5308a0661J993R531L513m41L060k026L204o312p055J209l452n665R328J6150J144
$$ -10661 -8668 863 4376 3935 6995 4969 8173 1861 -5194 -3985 -7437 -13102 -3774 12376 13520
5293A3520P354j1194q468r916N252J0022r00r588k548r34k669J985Q105M449l859
$$ 13520 20874 9680 1212 -8704 -3452 6570 5670 -3918 -6466 -7400 -10069 -8084 21 4470 611
5278F11q345j1028J186N709J543J63K711R574R445r020p351j697R427Q244q58
$$ 611 -7734 -18762 -17576 -11867 -10324 -10161 -7450 2124 11569 2549 -4802 -6499 2928 11172 10314
5263A0314k01o005L722q005l538K043J0037m60k074Q37K034p148K308o794m513
$$ 10314 10113 4108 7830 -175 -3713 -1670 8367 7907 5833 6670 8704 1556 3864 -2930 -7443
5248g443n169N141J2164Q971N29o900j1310k120L998L738q03J27l01K73K895L738
$$ -7443 -12612 -7471 4693 13664 14193 7293 -4017 -6137 -2139 1599 796 923 622 895 3790 7528
5232G528k368M905o163n517j505k256N66O096q75n418M372L464n767K34O793K615
$$ 7528 5160 10065 3902 -1615 -3120 -5376 -4810 1286 411 -5007 -635 2829 -2938 -2704 4089 6704
5216F704o580k519j19r207J321K706l419Q531l28n634m27l140J022L405J019J862
$$ 6704 124 -2395 -2514 -11721 -10400 -7694 -11113 -2582 -2910 -8544 -8971 -12111 -11089 -7684 -6665 -4803
5200d803K817N135N477n611l603P683j40q427K356J0005K487N143m274p935o850
$$ -4803 -1986 3149 8626 3015 -588 7095 6955 -1472 884 10889 13376 18519 14245 6310 -540
5185e40k834K696M822l576m817k623N206q920J096N196j208J085P592m55m794
$$ -540 -3374 -678 4144 568 -4249 -6872 -1666 -10586 -9490 -4294 -5502 -4417 3175 2720 -2074
5170b074m005K274p603P61L516Q403j827p444j430q76L03M951L298Q68o92j0795
$$ -2074 -6079 -3805 -11408 -10647 -7131 1272 -555 -7999 -9429 -10305 -10002 -5051 -1753 -885 -1577 -12372
5154a2372o845n757P571N123M523P368Q846J336K528j0723j0534o417J769o005
$$ -12372 -19217 -24974 -17403 -12280 -7757 -389 8457 9793 12321 1598 -8936 -15353 -13584 -19589
5140a9589J2479J8536N044j340j4155k162M72M315L403K133q011L263Q538j977
$$ -19589 -7110 11426 16470 15130 975 -1187 -715 3600 7003 9136 1125 4388 12926 10949
5126A0949K049l247K698M50p242r786J470M38m106M217J2327k977r037k062N692
$$ 10949 12998 9751 12449 12899 5657 -4129 -2659 -2221 -6327 -2110 10217 7240 -1797 -3859 1833
5111A833M066K161j799l270o816m727k038j887k884q38N819Q074N759n135m458
$$ 1833 5899 8060 6261 2991 -3825 -8552 -10590 -12477 -15361 -16199 -10380 -2306 3453 -1682 -6140
5096f140o957M518O950L754K16J10l59K854m004j2556j816J123O936Q848P279
$$ -6140 -13097 -8579 -1629 2125 2341 2451 2092 4946 942 -11614 -13430 -12307 -5371 3477 10756
5081A0756J0056l169m482j6841K32P205j369m224M690Q023k629j890l416m927
$$ 10756 20812 17643 13161 -3680 -3448 3757 2388 -1836 2854 10877 8248 6358 2942 -1985
5067a985M50K076k204m024J34M39O423r78K912n412M615N701J201m019L200l159
$$ -1985 -1535 541 -1663 -5687 -5553 -5114 1309 331 3243 -2169 2446 8147 9348 5329 8529 5370
5051E370q013k355J2498J2989l285j0979q071l360J1016O507j383L226l981o959
$$ 5370 -2643 -4998 7500 20489 17204 6225 -1846 -5206 5810 12317 10934 14160 10179 3220
5037C220j2399N18O072j322O371J1234Q99j1818l802j1732l692k834L062O601
$$ 3220 -9179 -8661 -2589 -3911 2460 13694 14593 2775 -1027 -12759 -16451 -19285 -16223 -9622
5023i622l601Q93P141N373K263o743j1131L958M704J859J1724P75N736J3438J817
$$ -9622 -13223 -12330 -5189 184 2447 -4296 -15427 -11469 -6765 -4906 6818 7593 13329 26767 28584
5008B8584j6283o756m955O441l4n270P409M813n28m720m419j696k331N546p050
$$ 28584 12301 5545 590 7031 6997 1727 9136 13949 13421 8701 4282 2586 255 5801 -1249
4993a249n43L097n94L483n556j106O988O384K763n802l568l657O025m521J536
$$ -1249 -1792 1305 711 4194 -1362 -2468 4520 10904 13667 7865 4297 640 6665 2144 3680
4978C680P58n396n987R70P510Q123m810o796k174J940n148j979p452j142L765
$$ 3680 4438 -958 -6945 -5975 1535 9658 4848 -1948 -4122 -2182 -7330 -9309 -16761 -17903 -14138
4963a4138N848l758O459L59M504L361k787j051j524k550m211m085J921r272P91
$$ -14138 -8290 -12048 -5589 -5230 -726 2635 -152 -1203 -2727 -5277 -9488 -13573 -11652 -20924 -20133
4948b0133Q535O711N185J661J691n805P725K977j1131m903n418M741L903Q4N434
$$ -20133 -11598 -4887 298 1959 3650 -2155 5570 8547 -2584 -7487 -12905 -8164 -4261 -4177 1257
4933A257J283k005j526m871r173N200m633k209J278m421J947L894L637J1759J2445
$$ 1257 2540 535 -991 -5862 -15035 -9835 -14468 -16677 -15399 -19820 -17873 -13979 -10342 1417 13862
4918A3862O985p405p989j447J326K762n492n927N444K469q00j302N187J1036q829
$$ 13862 20847 13442 5453 4006 5332 8094 2602 -3325 2119 4588 3788 2486 7673 18709 9880
4903I880n590j244l493n264o807J1973N830j1071q925k522J0955J2121K512j196
$$ 9880 4290 3046 -447 -5711 -12518 -545 5285 -5786 -14711 -17233 -6278 5843 8355 7159
4889G159k111r151K928p08r236k801K536J0610J3302l528J773j845n244k211J348
$$ 7159 5048 -4103 -1175 -1883 -11119 -13920 -11384 -774 12528 9000 10773 8928 3684 1473 2821
4874B821K639o446q58R26K062k121J148j127N358J769N081K559k546j2606k258
$$ 2821 5460 -986 -1844 -918 1144 -977 171 -956 4402 6171 11252 13811 11265 -1341 -3599
4859c599N954j024k806k697o953q412L091M512M165M546L437m074j0568P811q23
$$ -3599 2355 1331 -1475 -4172 -11125 -19537 -16446 -11934 -7769 -3223 214 -3860 -14428 -6617 -7440
4844g440o637M659P919q553k682k730o671M934j45l492O924J0565O278j2289m013
$$ -7440 -14077 -9418 -1499 -10052 -12734 -15464 -22135 -17201 -17346 -20838 -13914 -3349 2929 -9360 -13373
4829a3373P763J2773p787j046Q850P101k343J974m111q140j0529n311P981O206
$$ -13373 -5610 7163 -624 -1670 7180 14281 11938 13912 9801 1661 -8868 -14179 -6198 8
4815Hj1198n430M590M631k65q07N966n230p514j408k887L204Q304K091r586o346
$$ 8 -11190 -16620 -12030 -7399 -7664 -8471 -2505 -7735 -15249 -16657 -19544 -16340 -8036 -5945 -15531 -21877
4799b1877N234L732L454P044Q40Q18j37L354M593r846k301q37J992n93o215L620
$$ -21877 -16643 -12911 -9457 -2413 -1573 -755 -892 2462 7055 -2791 -5092 -5929 -3937 -4530 -10745 -7125
4783g125J0538n07k612k184n198O82P40k469l384J817K036J312J3288Q486n686
$$ -7125 3413 2906 294 -1890 -7088 -6406 -5666 -8135 -11519 -9702 -7666 -6354 6934 15420 9734
4768I734j2415O607k489k952j842K702j941k113Q578l277j912n16j592j892R327
$$ 9734 -2681 3926 1437 -1515 -3357 -655 -2596 -4709 3869 592 -1320 -1836 -3428 -5320 4007
4753D007L234Q62p680q769R9m752r340m780J669O251O040J563K705K772O660m566
$$ 4007 7241 8103 423 -8346 -8247 -12999 -22339 -27119 -25450 -19199 -13159 -11596 -8891 -6119 541 -4025
4737d025m753L518j407j37p202o946N168p920q73L434K724Q266J0890M839l524
$$ -4025 -8778 -5260 -6667 -6804 -14006 -20952 -15784 -23704 -24577 -21143 -18419 -10153 737 5576 2052
4722B052l27M156M180n606j0167r547M161M252n377O371Q234k130p168p017j638
$$ 2052 1725 5881 10061 4455 -5712 -15259 -11098 -6846 -12223 -5852 2382 252 -6916 -13933 -15571
4707a5571L468K549N107N116l241r493O584P663m123J055R170n853n486J443O759
$$ -15571 -12103 -9554 -4447 669 -2572 -12065 -5481 2182 -1941 -886 8284 2431 -3055 -1612 5147
4692E147J1717n21r544l448n131M138m073p110j181N984N663o232l379k496J234
$$ 5147 16864 16343 6799 3351 -1780 2358 -1715 -8825 -10006 -4022 1641 -4591 -7970 -10466 -9232
4677i232k20l697J620P836J861j437K816J2817l668j0001n339P910P631o126q66
$$ -9232 -9452 -13149 -11529 -3693 -1832 -3269 -453 12364 8696 -1305 -6644 1266 8897 2771 1905
4662A905K278p561l752P430L11j887K393m990n453J803K351q66k18o101m954M951
$$ 1905 4183 -3378 -7130 300 611 -1276 1117 -3873 -9326 -7523 -5172 -6038 -6256 -12357 -17311 -12360
4646a2360J5j655o82N85J2478p89q345k127l57N76J036k53N966J0039m399o170
$$ -12360 -12345 -14000 -14682 -14097 -1619 -2408 -10753 -12880 -13237 -12661 -11625 -11878 -5912 4127 -272 -6442
4630f442K76k719K819P368M981K03l69J142O833M819k843J069l004j765m554l577
$$ -6442 -6166 -8885 -6066 1302 6283 6486 6117 7259 14092 18911 16068 17137 14133 12368 7814 4237
4614D237K38n27j777J236P233o0j2182q689m821L29M233O356P306L667n338n555
$$ 4237 4475 3948 2171 3407 10640 10580 -1602 -10291 -15112 -14783 -10550 -4194 3112 6779 1441 -4114
4598d114J832N260m89K420j0217j3424M46J0230O304K345n289o231l715m028L906
$$ -4114 -2282 2978 2489 4909 -5308 -18732 -18286 -8056 -1752 593 -4696 -10927 -14642 -18670 -14764
4583a4764J3071L721m999n981R076r681j2228j234R560J4644Q210M258j1620j3211
$$ -14764 -1693 2028 -2971 -8952 124 -9557 -21785 -23019 -13459 1185 9395 13653 2033 -11178
4569a1178K262J0211R122n930j2113j161M668o221m668J0995M056j4886l51M050
$$ -11178 -8916 1295 10417 4487 -7626 -8787 -4119 -10340 -15008 -4013 43 -14843 -15194 -11144
4555a1144K159M567l41j0804M383R892K701k04j914l4k112j0521J114k157k890
$$ -11144 -8985 -4418 -4759 -15563 -11180 -1288 1413 1209 -705 -739 -2851 -13372 -12258 -14415 -17305
4540a7305j001O970J0368l42r688L615J0116m541m534m223n313L910Q634l707
$$ -17305 -18306 -11336 -968 -1310 -10998 -7383 2733 -1808 -6342 -10565 -15878 -11968 -3334 -7041
4526g041m921j199J2342O798l954K453M687p902n277q32M524M147L167o990m28
$$ -7041 -11962 -13161 -819 5979 2025 4478 9165 1263 -4014 -4846 -322 3825 6992 2 -426
4511d26j0947o363L554K931j640m468J1492N132p814j0984k321Q090P265j53r56
$$ -426 -11373 -17736 -14182 -11251 -12891 -17359 -5867 -735 -8549 -19533 -21854 -13764 -6499 -6652 -7608
4496g608K746j745L121l465q271p624P935O951Q47o363K972J1408N105Q209m11
$$ -7608 -4862 -6607 -3486 -6951 -15222 -22846 -14911 -7960 -7113 -13476 -10504 904 6009 14218 13807
4481A3807K9j0071j6379k884k700M862j943L989P594N14K050Q192K008m102L48
$$ 13807 13836 3765 -12614 -15498 -18198 -13336 -15279 -11290 -3696 -3182 -1132 7060 9068 4966 5314
4466E314M853Q698j12j1572p276l840L392P127p669P32O756K286m681k772J423
$$ 5314 10167 18865 18753 7181 -95 -3935 -543 6584 -1085 -353 6403 8689 4008 1236 2659
4451B659K238l445j699o842j270M390K099K219O89M769M86L599o363j4350j87
$$ 2659 4897 1452 -247 -7089 -8359 -3969 -1870 349 1038 5807 6293 9892 3529 -10821 -11008
4436a1008J3201P77k179k540J030m162N328L04L40P117J2613n596m492m506j2643
$$ -11008 2193 2970 791 -1749 -719 -4881 447 751 1091 8208 20821 15225 10733 6227 -6416
4421f416k606M344p343l064L581L074P701k34m737r139l340J4886J1859r403o745
$$ -6416 -9022 -4678 -12021 -15085 -11504 -8430 -729 -963 -5700 -14839 -18179 -3293 8566 -837 -7582
4406g582n01P63L79k282l042J238O644O340K052k2p629p612P070J2904K521j639
$$ -7582 -8083 -7320 -6941 -9223 -12265 -11027 -4383 1957 4009 3987 -3642 -11254 -4184 8720 11241 9602
4390I602j0285n125P686K096m29M776L716j1666R65P44M950L589j0121n252M120
$$ 9602 -683 -5808 1878 3974 3545 8321 12037 371 1336 2080 7030 10619 498 -4754 -634
4375f34L605J056o039O39N913p542q741l321L840L040P528M786k487n997j231
$$ -634 2971 4027 -2012 -1373 4540 -3002 -11743 -15064 -11224 -8184 -656 4130 1643 -4354 -5585
4360e585J273p41l671O274M773J111J650K414J28l364p111K878J92l112J259M538
$$ -5585 -4312 -5053 -8724 -2450 2323 3434 5084 7498 7626 4262 -2849 29 221 -2891 -1632 2906
4344B906j127M403R97p561k053l702j630L290k869m612K415K046j597K061q83
$$ 2906 1779 6182 7179 -382 -2435 -6137 -7767 -4477 -7346 -11958 -9543 -7497 -9094 -7033 -7916
4329g916m170k961J59M155L209K034M308K129m946k789r303J917P295J2457M541
$$ -7916 -12086 -15047 -14888 -10733 -7524 -5490 -1182 947 -3999 -6788 -16091 -14174 -6879 5578 10119
4314A0119m485p926q199M946R81n234K301L003K088r41R30O304j622p488o324
$$ 10119 5634 -2292 -10491 -5545 -4564 -9798 -7497 -4494 -2406 -3347 -2417 3887 2265 -5223 -11547
4299a1547r709K658O69J3146P575l855Q267N910l966Q856J1808K072j6255j7995
$$ -11547 -21256 -18598 -17929 -4783 2792 -1063 7204 13114 9148 18004 29812 31884 15629 -2366
4285b366o155L482J2704m831j8067K690N245M23l75P899j139o555k603R176L164
$$ -2366 -8521 -5039 7665 2834 -15233 -12543 -7298 -6875 -7250 649 -490 -7045 -9648 -472 2692
4270B692l23j348M037k559k261k995M629j175n47L613p072m34M137l463M796r26
$$ 2692 2369 1021 5058 2499 238 -2757 1872 697 150 3763 -3309 -3743 394 -3069 1727 801
4254H01K570O528O408k0420j8108Q511J1558L86N505K59L748l209J575L700K287
$$ 801 3371 9899 16307 -4113 -22221 -13710 -2152 -1766 3739 3998 7746 4537 6112 9812 12099
4239A2099p050o580j942n653j3356r031K298J2605J9506K830o972m551j645r508
$$ 12099 5049 -1531 -3473 -9126 -22482 -31513 -29215 -16610 2896 5726 -1246 -5797 -7442 -16950
4225a6950L302J1009Q818R8o406k163n338r647Q758R202o37r584L133R831k529
$$ -16950 -13648 -2639 6179 6277 -129 -2292 -7630 -17277 -8519 683 46 -9538 -6405 3426 897
4210H97K388k512p452q131K164L661o7L94J745R15l580N055K094j587j01J019
$$ 897 3285 773 -6679 -14810 -12646 -8985 -9052 -8658 -6913 -5998 -9578 -4523 -2429 -4016 -4117 -3098
4194c098o38LM430l759N258J679N57M901j211N688J158l217k139m620l502o510
$$ -3098 -3736 -3733 697 -3062 2196 3875 4432 9333 8122 13810 14968 11751 9612 4992 1490 -5020
4178e020l208N205R317K581r329l866l200j208N002J013l232k170n36O358Q729
$$ -5020 -8228 -3023 6294 8875 -454 -4320 -7520 -8728 -3726 -2713 -5945 -8115 -8651 -2293 6436
4163F436M217j663l641m783m537K185R869L148K313m492p83Q67r652q173%j789
$$ 6436 10653 8990 5349 566 -3971 -1786 8083 11231 13544 9052 8269 9136 -516 -8689 -8689 -10478
4147a0478r45m64m05l651P248O512K291o44j1855m774J201L694j771k411L223
$$ -10478 -11423 -11887 -12292 -15943 -8695 -2183 108 -536 -12391 -17165 -15964 -12270 -14041 -16452 -13229
4132a3229k543q403J815n92L157R351RJ98n272k49J3449J2031p493p530m573K246
$$ -13229 -15772 -24175 -22360 -22952 -19795 -10444 -10435 -10237 -15509 -15758 -2309 9722 2229 -5301 -9874 -7628
4116g628J1231L99n029o70J325J0397L969j4431k085q038J149K503K962o539r327
$$ -7628 3603 4002 -1027 -1697 -372 10025 13994 -437 -2522 -10560 -9411 -6908 -3946 -10485 -19812
4101a9812N670J6478k113L746j372l653M004N976M272j153P330K999l891r820
$$ -19812 -14142 2336 223 3969 2597 -1056 2948 8924 13196 12043 19373 22372 18481 8661
4087H661j1394p603n361l876K897j710N276O748O592P996L104p333m871j225j089
$$ 8661 -2733 -10336 -15697 -19573 -16676 -18386 -13110 -6362 230 8226 11330 3997 -874 -2099 -3188
4072c188K920j833j003N624p173j0603k528P428L214j458o54n250j354p63j141
$$ -3188 -268 -2101 -3104 2520 -4653 -15256 -17784 -10356 -7142 -8600 -9254 -14504 -15858 -16621 -17762
4057a7762N30M855J1770K199o01l064p719j0885m872Q983J0309O416n656k100
$$ -17762 -17232 -12377 -607 1592 991 -2073 -9792 -20677 -25549 -16566 -6257 159 -5497 -7597
4043g597K650K980J085J1017L028j0640q188K245J660k231j784K530J832k918
$$ -7597 -4947 -1967 -882 10135 13163 2523 -5665 -3420 -1760 -3991 -5775 -3245 -1413 -4331
4029d331J3222J4179o880q430l288j2924o560K231j405p727O141Q686J0050k645
$$ -4331 8891 23070 16190 7760 4472 -8452 -15012 -12781 -14186 -21913 -15772 -7086 2964 319
4015C19n153o51L290N885J62k111L240R69l538p384N233J2729k99j0315k836j0262
$$ 319 -4834 -5485 -2195 3690 3852 1741 4981 5950 2412 -4972 261 12990 12691 2376 -460 -10722
3999a0722M012L986L209N067q13j446K174L843r994j1810J166N995n55p484N893
$$ -10722 -6710 -2724 485 5552 4739 3293 5467 9310 -684 -12494 -11328 -5333 -5888 -13372 -7479
3984g479J2451n072m367R79m245j68r24j4967o029j74J0636P760r80K973Q327
$$ -7479 4972 -100 -4467 -3488 -7733 -7901 -8825 -23792 -29821 -29995 -19359 -11599 -12579 -9606 -1279
3969a279M037O44l430M077O397k447j4081j293L314l109L919L847p815j4911j128
$$ -1279 2758 3402 -28 4049 10446 7999 -6082 -7375 -4061 -7170 -3251 596 -7219 -22130 -23258
3954b3258N097J5681J1537n597j0615m296J0361J982J011l546N08J199n570J978
$$ -23258 -18161 -2480 9057 3460 -7155 -11451 -1090 892 1903 -1643 -1135 64 -5506 -3528
3940c528N812m242n827P136K277N960m563j946L257l021K708K999r919q825M285
$$ -3528 2284 -1958 -7785 -649 1628 7588 3025 1079 4336 1315 4023 7022 -2897 -11722 -7437
3925g437O554N488n14r493o2j682l639m279M321N761L359N839m979r240O520Q547
$$ -7437 -883 4605 4091 -5402 -5464 -7146 -10785 -15064 -10743 -4982 -1623 4216 -763 -10003 -3483 5064
3909E064P311L074o212p664j532l148j472q38j67l596j891J0145J1952M353m799
$$ 5064 12375 15449 9237 1573 41 -3107 -4579 -5417 -5584 -9180 -11071 -926 11026 15379 10580
3894A0580J170k754L34n27k018j1640J326N37O18L433L316J413K717j697M15L987
$$ 10580 11750 8996 9330 8803 6785 -4855 -3529 -2992 -2374 1059 4375 5788 8505 6808 7223 11210
3878A1210J767l270o578j609K262K23N49o626n54M157J260r862n063k62M793p14
$$ 11210 12977 9707 3129 1520 3782 4005 4554 -2072 -2626 1531 2791 -7071 -12134 -12396 -7603 -8317
3862h317M834K200N092L982K257j378p04p717k288K110K130j645P798l48l640
$$ -8317 -3483 -1283 3809 7791 10048 8670 7966 249 -2039 71 2201 556 8354 8006 4366
3847D366q62n884p885r256L182Q545P453L074k146P399P823n192J443n445k818
$$ 4366 3504 -2380 -10265 -19521 -16339 -7794 -341 2733 587 7986 15809 10617 12060 6615 3797
3832C797k866K015R428k723j0058L543L605Q38r487l426K928Q903O83m870K66
$$ 3797 931 2946 12374 9651 -407 3136 6741 7579 -1908 -5334 -2406 6497 7180 2310 2576
3817B576Q494O139J887k177p327n534Q7j434j329J368j2480j5308P847O222K138
$$ 2576 11070 17209 19096 16919 9592 4058 4145 2711 1382 2750 -9730 -25038 -17191 -10969 -8831
3802h831R73K94M260K008J376n541j416j769L021J118J35q6l758M301M858K731
$$ -8831 -7858 -7564 -3304 -1296 80 -5461 -6877 -8646 -5625 -4507 -4372 -4458 -8216 -3915 943 3674
3786C674o329n744P689N638L72j1100n770M160R776J1624k485j925k984n714M305
$$ 3674 -2655 -8399 -710 4928 5300 -5800 -11570 -7410 2366 13990 11505 9580 6596 882 5187
3771E187L130n567j368l294p628l0r286m272N95M655J618R014J652o732K318J3477
$$ 5187 8317 2750 1382 -1912 -9540 -9570 -18856 -23128 -22533 -17878 -16260 -7246 -5594 -12326 -10008 3469
3755C469M633j886k714r00l200k31n466n443j714j088k024O785N729k510M038
$$ 3469 8102 6216 3502 2602 -598 -829 -6295 -11738 -13452 -14540 -16564 -9779 -4050 -6560 -2522
3740b522L183l173K66L680M912J528k269m272o47q37r486j943J4183N125j1523
$$ -2522 661 -2512 -2246 1434 6346 7874 5605 1333 686 -151 -9637 -11580 2603 7728 -3795
3725c795j0123K816M902R112J732m700J047L298n440P368M19J115r17j3704k028
$$ -3795 -13918 -11102 -6200 2912 4644 -56 991 4289 -1151 6217 6636 7751 6834 -6870 -8898
3710h898J3724k161p76O838N892l015m637j3601l150n465M916O151Q053k721n946
$$ -8898 4826 2665 1889 8727 14619 11604 6967 -6634 -9784 -15249 -10333 -4182 3871 1150 -4796
3695d796L341J988j556P288k876r231m463J0010k313n07j996l091K667L738K649
$$ -4796 -1455 533 -1023 6265 3389 -5842 -10305 -295 -2608 -3115 -5111 -8202 -5535 -1797 852
3680H52Q918N275M515k892n574r415j494m336R891M729K107n285k221k159P736
$$ 852 9770 15045 19560 16668 11094 1679 185 -4151 5740 10469 12576 7291 5070 2911 10647
3665A0647O135l5j055p243j0222p802N582l323J300N881K697m506o031J271J849
$$ 10647 16782 16747 15692 8449 -1773 -9575 -3993 -7316 -6016 -135 2562 -1944 -7975 -6704 -4855
3650d855N667k305l825j674N300J685q108k583j640N254L739l5l895j100l259
$$ -4855 812 -1493 -5318 -6992 -1692 -7 -8115 -10698 -12338 -7084 -3345 -3380 -7275 -8375 -11634
3635a1634L376O85j1445O714Q467J1231k760l622K776M630Q077j490l846o063
$$ -11634 -8258 -7573 -19018 -12304 -3837 7394 4634 1012 3788 8418 16495 15005 11159 5096
3621E096l714l910p179m950R092O855K042J0178O079k814k577l162j1624R87J654
$$ 5096 1382 -2528 -9707 -14657 -5565 1290 3332 13510 19589 16775 14198 11036 -588 399 2053
3606B053l553J4159M592m294l907k62L89l453k077l15q356k031l373o426K779
$$ 2053 -1500 12659 17251 12957 9050 8788 9177 5724 3647 3332 -5024 -7055 -10428 -16854 -14075
3591a4075o80P454K364K636j291l989L770L8p626J0820J1479k593j1038j4551
$$ -14075 -14755 -7301 -4937 -2301 -3592 -7581 -3811 -3773 -11399 -579 10900 8307 -2731 -17282
3577a7282l517J2183J5051K312l799n193l138o32L950j4593q766K510M377L649
$$ -17282 -20799 -8616 6435 8747 4948 -245 -3383 -4015 -65 -14658 -23424 -20914 -16537 -12888
3563a2888J4084K510Q025K196j6146L308Q604Q436k804j1578L353k377j895K298
$$ -12888 1196 3706 11731 13927 -2219 1089 9693 18129 15325 3747 7100 4723 2828 5126
3549E126O094O072n288J030n386k667M058l41j0127L494j2169n525J0069K540
$$ 5126 11220 17292 12004 13034 7648 4981 9039 8698 -1429 2065 -10104 -15629 -5560 -3020
3535c020p816o602N465P366l598j677m929K761R574O204M785n031j4320p685M00
$$ -3020 -10836 -17438 -11973 -4607 -8205 -9882 -14811 -12050 -2476 3728 8513 3482 -10838 -18523 -18123
3520a8123Q623J222N01j322R86J784P041l56Q801M03n270j067O81j5009M475L022
$$ -18123 -9500 -8278 -7777 -9099 -8113 -6329 712 356 9157 9560 4290 3223 3904 -11105 -6630 -3608
3504c608j907L176K18k747j276N090L981o35q979L562O380J482L458n599j605
$$ -3608 -5515 -2339 -2121 -4868 -6144 -1054 2927 2292 -6687 -3125 3255 4737 8195 2596 991
3489I91J353o353L356Q177j2831Q006P658K827r327J260L457o064j00q44L892
$$ 991 2344 -4009 -653 7524 -5307 2699 10357 13184 3857 5117 8574 2510 2410 1566 5458
3474E458O322N153l622j5023n902m431J936L378J2106P079J798k28o796o212M983
$$ 5458 11780 16933 13311 -1712 -7614 -12045 -10109 -6731 5375 12454 14252 14024 7228 1016 5999
3459E999M542K181R0m906m379j235L892J196n299j0261J430L329n763K941p908
$$ 5999 10541 12722 12812 7906 3527 2292 6184 7380 2081 -8180 -6750 -3421 -9184 -6243 -14151
3444a4151l055N684M32M259K858n42J1112P781m770k005m496J715o052k870L669
$$ -14151 -17206 -11522 -11090 -6831 -3973 -4515 6597 14378 9608 7603 3107 4822 -1230 -4100 -431
3429d31m616j941o74M736M131k974j364J5402o261j27k080m862m616l454k305
$$ -431 -5047 -6988 -7662 -2926 1205 -1769 -3133 12269 6008 5881 3801 -1061 -5677 -9131 -11436
3414a1436r469M960J4105O738J1597o062J159N01q969L866J787p834q687l688
$$ -11436 -20905 -15945 -1840 4898 16495 10433 11592 12093 3124 6990 8777 943 -7744 -11432
3400a1432j044P264M94m190K67O4L594L849P608K655L822m304j951N85j419l552
$$ -11432 -12476 -5212 -4718 -8908 -8641 -8577 -4983 -1134 6474 9129 12951 8647 6696 7281 5862 2310
3384B310j1534J599k873n40j369L914N157N378K596j984j412m410R81Q842K214
$$ 2310 -9224 -7625 -10498 -11038 -12407 -8493 -3336 2042 4638 2654 1242 -3168 -2187 6655 8869
3369H869n078K06j238N352J0956j0152j3016n179L112M921J098j1270P027K173
$$ 8869 3791 3997 2759 8111 19067 8915 -4101 -9280 -6168 -1247 -149 -11419 -4392 -2219
3355b219p977K05n120J18R880K225p502M140O64J1247R454m983r205q126l564
$$ -2219 -10196 -9991 -15111 -14993 -5113 -2888 -10390 -6250 -5586 5661 15115 10132 927 -7199 -10763
3340a0763L60L755Q188L798p80n406J849J243n483m437L095P930J828l468m271
$$ -10763 -10403 -6648 1540 5338 4558 -848 1001 2244 -3239 -7676 -4581 3349 5177 1709 -2562
3325b562o239n214P930L130m403L594M040j510j0592K451J2841P391P710L476
$$ -2562 -8801 -14015 -6085 -2955 -7358 -3764 276 -1234 -11826 -9375 3466 10857 18567 22043
3311B2043J637K547r705j1448q452l487R887N003p734k519q7r670m797N898Q073
$$ 22043 23680 26227 16522 5074 -3378 -6865 3022 8025 291 -2228 -2315 -11985 -16782 -10884 -2811
3296b811P172Q105m888p573r996K87Q768K058K672l271L579r081K708j875o557
$$ -2811 4361 12466 7578 5 -9991 -9704 -936 1122 3794 523 4102 -4979 -2271 -4146 -10703
3281a0703O156j162m047p308Q680R501O456j3566M948J0538n128O707o985j2765
$$ -10703 -4547 -5709 -9756 -17064 -8384 1117 7573 -5993 -1045 9493 4365 11072 4087 -8678
3267h678J183L671M317L560j290n893o86l309k894q420n9Q704M545J223r87K262
$$ -8678 -7495 -3824 493 4053 2763 -3130 -3816 -7125 -10019 -18439 -18498 -9794 -5249 -4026 -5013 -2751
3251b751N78K827p778l051M524K570O513J288K198M252R584o302r480M911p469
$$ -2751 -2173 654 -7124 -10175 -5651 -3081 3432 4720 6918 11170 20754 14452 4972 9883 2414
3236B414j201q374o92J3049Q455O9l778M034L846K340l851o858m535o508n790
$$ 2414 1213 -7161 -7853 5196 13651 13720 9942 13976 17822 20162 16311 9453 4918 -1590 -7380
3221g380j941J619O100k160m885j0065J429L877j2241R367P106n849M074O195
$$ -7380 -9321 -7702 -1602 -3762 -8647 -18712 -17283 -13406 -25647 -16280 -9174 -15023 -10949 -4754
3207d754O244O45J188K535M533j735k702j2834n335R550R84k886L563n86L956
$$ -4754 1490 2135 3323 5858 10391 8656 5954 -6880 -12215 -2665 -1681 -4567 -1004 -1590 2366
3192B366j269j252K492O657O138j1319J275M655k641j315k29L162J708Q17m594
$$ 2366 1097 -155 2337 8994 15132 3813 5088 9743 7102 5787 5558 8720 10428 11245 6651
3177F651L709K357l180l250q537N463L812m899P427k43j600r130n326k54L221
$$ 6651 10360 12717 9537 6287 -2250 3213 7025 2126 9553 9310 7710 -1420 -6746 -7000 -3779
3162c779M56n324l204P318P228L118o960j748P448m795J751L834l352R482J33
$$ -3779 -3323 -8647 -11851 -4533 2695 5813 -1147 -2895 4553 -242 1509 5343 1991 11473 11606
3147A1606J098J873K851J742j5228j4143J701N440K424P887K466k0971q335N543
$$ 11606 12704 14577 17428 19170 3942 -10201 -8500 -3060 -636 7251 9717 -11254 -19589 -14046
3133a4046P919M801L731N673j1406J956J0721j104R27k889j0678m354L411J0843
$$ -14046 -6127 -1326 2405 8078 -3328 -1372 9349 8245 9172 6283 -4395 -8749 -5338 5505
3119E505O58m917J475N510j758q95o586p880k051J4697l01K741n274l647M595
$$ 5505 6163 1246 2721 8231 6473 5578 -1008 -8888 -10939 3758 3457 6198 924 -2723 1872
3104A872O217K679n647m077K332N633l351m719j2369q267P970N745R55m281l19
$$ 1872 8089 10768 5121 1044 3376 9009 5658 939 -11430 -19697 -11727 -5982 -5027 -9308 -9627
3089i627O106l073j473N910M817l190R818O150p179l217N12l701o669j321L448
$$ -9627 -3521 -6594 -8067 -2157 2660 -530 9288 15438 8259 5042 5554 1853 -4816 -6137 -2689
3074b689L96K765L153l61o43o821J338J399O014R498P888q94o496q803j0455M47
$$ -2689 -2293 472 3625 3264 2621 -4200 -2862 -1463 4551 14049 21937 21043 14547 5744 -4711 -4264
3058d264K600K344o50K618O72q73n206Q32R947q94j0243R20J251M79p088p422
$$ -4264 -1664 680 30 2648 3320 2447 -2759 -1927 8020 7126 -3117 -2197 -946 -467 -7555 -14977
3042a4977L807K187K083J673R113J033L403p585j0066j964O65P524K034n119p671
$$ -14977 -11170 -8983 -6900 -5227 3886 4919 8322 737 -9329 -11293 -10628 -3104 -1070 -6189 -13860
3027a3860m598O489M068O924J805P937J0415J709q43j0642j3636l401J648J931
$$ -13860 -18458 -11969 -7901 -977 828 8765 19180 20889 20046 9404 -4232 -7633 -5985 -4054
3013d054K627j0284n152J0472j354k236O068M617J605M091O817n589L304m02j0010
$$ -4054 -1427 -11711 -16863 -6391 -7745 -9981 -3913 704 2309 6400 13217 7628 10932 10530 520
2998E20M030l198n903K498Q134j358M580L110l191o552m477m757n907R545M289
$$ 520 4550 1352 -4551 -2053 6081 4723 9303 12413 9222 2670 -1807 -6564 -12471 -2926 1363
2983A363j140O182l202q08L627m240j858Q820Q997M20r196o262k245O574j161
$$ 1363 223 6405 3203 2395 6022 1782 -76 8744 17741 18161 8965 2703 458 7032 5871
2968E871n24K517r626J045J479j130N002j772k168J0570J68l470m758l80K934
$$ 5871 5347 7864 -1762 -717 762 -368 4634 2862 694 11264 11432 7962 3204 2824 5758
2953E758k633O045j368j2052r77K069M816n420o85P910J742p698j0420O96M875
$$ 5758 3125 9170 7802 -4250 -5227 -3158 1658 -3762 -4447 3463 5205 -2493 -12913 -12217 -7342
2938g342N005J0139N333l538J321J488j1732q368k822k907L795q88L443K297J3016
$$ -7342 -2337 7802 13135 9597 10918 12406 674 -7694 -10516 -13423 -9628 -10516 -7073 -4776 8240
2923H240J947j0802n038p038J854N891j676L119J0973O51r935m88o856J480P483
$$ 8240 10187 -615 -5653 -12691 -10837 -4946 -6622 -3503 7470 8121 -1814 -2302 -9158 -7678 -195
2908a95r00p639k216j58L940M146n111j17K561R308k139j0755K064L90k892j542
$$ -195 -1095 -8734 -10950 -11108 -7168 -3022 -8133 -8250 -5689 3619 1480 -9275 -7211 -6821 -9713 -11255
2892a1255L555L102J651L53L780k217M000K522m092m535L698K497K549L596o331
$$ -11255 -7700 -4598 -2947 -2594 1186 -1031 2969 5491 1399 -3136 562 3059 5608 9204 2873
2877B873n648l375R856O568j808p947j1260j62l708L228Q582l006K777m466o614
$$ 2873 -2775 -6150 3706 10274 8466 519 -10741 -10903 -14611 -11383 -2801 -5807 -3030 -7496 -14110
2862a4110k72R716P447r90j703N342p43j2543m648J0497J0238P5L57q452O758
$$ -14110 -14382 -4666 2781 1791 88 5430 4687 -7856 -12504 -2007 8231 8306 8663 211 6969
2847F969J1515k170j6321n205J361O824l753N729N306j817k645k086r163k900
$$ 6969 18484 16314 -7 -5212 -3851 2973 -780 4949 10255 8438 5793 3707 -5456 -8356
2833h356m991N873J0403K774o787k843m699N61M399l339L757L356N206J1651m184
$$ -8356 -13347 -7474 2929 5703 -1084 -3927 -8626 -8065 -3666 -7005 -3248 108 5314 16965 12781
2818A2781o019n486K18n050n281L158K390o750P80R909M766L343k936j1274q55
$$ 12781 6762 1276 1494 -3556 -8837 -5679 -3289 -10039 -9259 650 5416 8759 5823 -5451 -6306
2803f306j077k073j269M453J026m283L697l240K089M802k841O621M459j006L844
$$ -6306 -7383 -9456 -10725 -6272 -5246 -9529 -5832 -9072 -6983 -2181 -5022 1599 6058 5052 8896
2788H896j1204j356L826L542N501j4617p192P654R922K47k193L63J316K588M538
$$ 8896 -2308 -3664 162 3704 9205 -5412 -12604 -4950 4972 5219 3026 3389 4705 7293 11831
2773A1831J16j0584q139K800J0462n430P10N486n576o05L92M234k40l435l021
$$ 11831 11947 1363 -6776 -3976 6486 1056 1766 7252 1676 1071 1463 5697 5457 2022 -999
2758i99j927l6k142j987n484j479J231J0485J705l426J781m114j1047L337k518
$$ -999 -2926 -2962 -5104 -7091 -12575 -14054 -12823 -2338 -633 -4059 -2278 -6392 -17439 -14102 -16620
2743a6620J0357O736N06O62M1j918J948l288j870p400M060j226K087K026k93m19
$$ -16620 -6263 473 979 1641 1682 -236 1712 -1576 -3446 -10846 -6786 -8012 -5925 -3899 -4192 -4611
2727d611P170P495l577J438k794j1006n354M17J0690J3096J1621j2365p990J813
$$ -4611 2559 10054 6477 7915 5121 -5885 -11239 -10822 -132 12964 24585 12220 4230 6043
2713F043m705l785J211J635n104l462M572R65k900J149L575Q915k240m089m412
$$ 6043 1338 -2447 -1236 399 -4705 -8167 -3595 -2630 -5530 -4381 -806 8109 5869 1780 -2632
2698b632l795j802L141J571j598j290k92o41O909L018q571J218J1451L867n751
$$ -2632 -6427 -8229 -5088 -3517 -5115 -6405 -6697 -7338 -429 2589 -5982 -4764 6687 10554 4803
2683D803m276j414L058j552J34J0274j21p566l342N842J34k829l818l807l236
$$ 4803 527 -887 2171 619 753 11027 10906 3340 -2 5840 5974 3145 -673 -4480 -7716
2668g716O567J565N489j172k171M446J0581q687q402J682j765K77L327K461j2027
$$ -7716 -1149 416 5905 4733 2562 7008 17589 8902 500 2182 417 694 4021 6482 -5545
2653e545m135J2502J0181l798n886K899K484j692R9n16n014J024N57j135Q394
$$ -5545 -9680 2822 13003 9205 3319 6218 8702 7010 7109 6593 1579 2603 3160 2025 10419
2638A0419L026M728o176o378j0365j133N73q386j358N573J1689N792j0958j6449
$$ 10419 13445 18173 11997 5619 -4746 -5879 -5306 -13692 -15050 -9477 2212 8004 -2954 -19403
2624a9403o612P927Q60L006R856M336j5198j5967P425J6373K171K045L703m396
$$ -19403 -26015 -18088 -17228 -14222 -4366 -30 -15228 -31195 -23770 -7397 -5226 -3181 522 -3874
2610c874l228o487P184N91P29P96k525j0281Q0o157j639N582K961N363J1318J15
$$ -3874 -7102 -13589 -6405 -5814 -5085 -4289 -6814 -17095 -17015 -23172 -24811 -19229 -16268 -10905 413 528
2594E28j150r51L009k270M382N976J2651k908j3606q296n440O236L463j935q210
$$ 528 -622 -1573 1436 -834 3548 9524 22175 19267 5661 -2635 -8075 -1839 1624 -311 -8521
2579h521m229p917j001J765N414N509R947N480M016L335p619j2197p699L574R458
$$ -8521 -12750 -20667 -21668 -19903 -14489 -8980 967 6447 10463 13798 6179 -6018 -13717 -10143 -685
2564f85K587j1622m153J2187K132M603n959n532J150N022k769N213l033l570k263
$$ -685 1902 -9720 -13873 -1686 446 5049 -910 -6442 -5292 -270 -3039 2174 -859 -4429 -6692
2549f692m871p501j295M075P495P229J032O68P85J3929k192n307m948O74k447
$$ -6692 -11563 -19064 -20359 -16284 -8789 -1560 -528 140 925 14854 12662 7355 2407 3081 634
2534F34J402l50n742j0865k660j5526l268K1154J6475N055R5n068j062j013n68
$$ 634 2036 1686 -4056 -14921 -17581 -33107 -36375 -15221 1254 6309 6404 1336 274 -739 -1307
2519a307m018l720K733R548J0692k591l695k596k879m82k557o882n476q207L743
$$ -1307 -5325 -9045 -6312 3236 13928 11337 7642 5046 2167 1685 -872 -7754 -13230 -21437 -17694
2504a7694J245J773J0133J5543k201j359p022L45r26j843J325M145M321o388r195
$$ -17694 -16449 -14676 -4543 11000 8799 7440 418 763 -163 -2006 -681 3464 7785 1397 -7798
2489g798J142P988P152k049r007J103l245L207Q745Q265j544j189j272k898k510
$$ -7798 -6656 1332 8484 6435 -2572 -1469 -4714 -1507 7238 15503 13959 12770 11498 8600 6090
2474F090j2870j161P464M255j0815k070N781j198L459n59l553j329N145R49j289
$$ 6090 -6780 -7941 -477 3778 -7037 -9107 -3326 -4524 -1065 -1624 -5177 -6506 -1361 -412 -1701
2459a701j205M578J013M619K338j669j411j903m609l092j1385p397n43P34J3729
$$ -1701 -2906 1672 2685 7304 9642 7973 6562 4659 50 -3042 -14427 -21824 -22367 -21633 -7904
2444g904pJ970K588o416J157L982O772J725l737o218R731k067q173L702L628N867
$$ -7904 -7911 -5941 -3353 -9769 -8612 -4630 2142 3867 130 -6088 3643 1576 -6597 -2895 733 6600
2428F600j087j6258m780O24o951O917Q314J341M57J6440R351j0172J854J29n304
$$ 6600 5513 -10745 -15525 -14901 -21852 -14935 -6621 -5280 -4823 11617 20968 10796 12650 12779 7475
2413G475n191m594L23k679p096N053P458M141K480Q51n584O946Q651K583k062
$$ 7475 2284 -2310 -1987 -4666 -11762 -6709 749 4890 7370 8221 2637 9583 18234 20817 18755
2398A8755j5903K986J0090o359j0810L901J0444O683j28j8363o036M529P595L721
$$ 18755 2852 5838 15928 9569 -1241 2660 13104 19787 19659 1296 -4740 -211 7384 11105
2384A1105j0336R67K037l01l547O682Q55o722q847m476Q091J1095m37n124k197
$$ 11105 769 1736 3773 3472 -75 6607 7462 740 -8107 -12583 -4492 6603 6166 1042 -1155
2369a155K504m949j1653q27O632J1272J0504K699O80j1063r330M478P484O661
$$ -1155 1349 -3600 -15253 -16080 -9448 1824 12328 15027 15707 4644 -4686 -208 7276 13937
2355A3937l633l214m790p408O225K533Q609o490l548K139o563o617N116M023N806
$$ 13937 10304 7090 2300 -5108 1117 3650 12259 5769 2221 4360 -2203 -8820 -3704 319 6125
2340F125O469r03o23K336r85j898o457q53M4M03J729n87m943k484k86r814Q9J5012
$$ 6125 12594 11691 11068 13404 12419 10521 4064 3211 3255 3658 5387 4800 -143 -2627 -2913 -12727 -12638 2374
2322B374j307l832L00l090K352N459l738l71j655K884Q869j957n216L941K717
$$ 2374 1067 -2765 -2465 -5555 -3203 2256 -1482 -1853 -3508 -624 8245 6288 1072 5013 7730
2307G730N819k680o989n777l15J245K64n067l092k653N968P466j043p511m248
$$ 7730 13549 10869 3880 -1897 -2212 -967 -703 -5770 -8862 -11515 -5547 1919 876 -6635 -10883
2292a0883j698l678m470k439M18P494J970L428P05r411J341P566L523L902n536
$$ -10883 -12581 -16259 -20729 -23168 -22750 -15256 -13286 -9858 -9153 -18564 -17223 -9657 -6134 -2232 -7768
2277g768n18K522j46K149K705N437Q96k717o818o773l917j937O529o70J107P706
$$ -7768 -8286 -5764 -5910 -3761 -1056 4381 5277 2560 -4258 -11031 -14948 -16885 -10356 -11026 -9919 -2213
2261b213P618O787L4l715L759J2221K402j4179o345O432n756n058N75m961n967
$$ -2213 5405 12192 12226 8511 12270 24491 26893 12714 6369 12801 7045 1987 2562 -2399 -8366
2246h366L052k396r63O34n301L217k59n542l525K650M286K062r86q986m231N559
$$ -8366 -5314 -7710 -8673 -8039 -13340 -10123 -10382 -15924 -19449 -16799 -12513 -10451 -11437 -20423 -24654 -19095
2230a9095K395K759M324L081Q04K382R381J103p689k267R283N592j0963o306O15
$$ -19095 -16700 -13941 -9617 -6536 -5732 -3350 6031 7134 -555 -2822 6461 12053 1090 -5216 -4601
2215d601K951l560J181l535j065m200l306J0864N795K568j3922Q520J1172K865
$$ -4601 -1650 -5210 -4029 -7564 -8629 -12829 -16135 -5271 524 3092 -10830 -2310 8862 11727
2201A1727M67N171l339l292K130j394j926J093J794J631J1242k789j2036M17L050
$$ 11727 12194 17365 14026 10734 12864 11470 9544 10637 12431 14062 25304 22515 10479 10896 13946
2186A3946j144Q171j1057j6319p896Q701Q976J2776j698o199J3570p060j0107
$$ 13946 12802 20973 9916 -6403 -14299 -5598 3378 16154 14456 8257 21827 14767 4660
2173D660j262R725o169k155P556j46j4063J029J048M755Q660M395j0913j3904
$$ 4660 3398 13123 6954 4799 12355 12209 -1854 -825 223 4978 13638 18033 7120 -6784
2159f784L63R862m994o87N095o655n367l93n057k582L608O338j583K721P329L679
$$ -6784 -6421 3441 -1553 -2240 2855 -3800 -9167 -9560 -14617 -17199 -13591 -7253 -8836 -6115 1214 4893
2143D893p092P83J461P222L082l497m874R590Q69K867K972n151o811p753n0O331
$$ 4893 -2199 -1416 45 7267 10349 6852 1978 11568 12437 15304 18276 13125 6314 -1439 -1489 4842
2127D842J884j0527n650P926J89l144j581K138Q4N345K552k068J047m126k613
$$ 4842 6726 -3801 -9451 -1525 -1336 -4480 -6061 -3923 -3839 1506 4058 1990 3037 -1089 -3702
2112c702J5482l15o93m040j447M273j220n507p337R468P031m046j1580K666N173
$$ -3702 11780 11465 10772 6732 5285 9558 8338 2831 -4506 4962 11993 7947 -3633 -967 4206
2097D206j116L190m020q602N86K929J888N998J1145K510j1135p085m462R864L893
$$ 4206 3090 6280 2260 -6342 -5756 -2827 -939 5059 16204 18714 7579 494 -3968 5896 9789
2082I789q200m163L960k386q564o214J1023M137L367J4514M751l969k0643n984
$$ 9789 1589 -2574 1386 -1000 -9564 -15778 -4755 -618 2749 17263 22014 18045 -2598 -8582
2068h582Q861j357j665M911J2071o95n728N67J162M36R15j1656n974K829L438
$$ -8582 279 -1078 -2743 2168 14239 13544 7816 8383 9545 9981 10896 -760 -6734 -3905 -467
2053d67K745p850K567M80k271L507N99o564q74l373J96n110P546k445j851k150
$$ -467 2278 -5572 -3005 -2525 -4796 -1289 -690 -7254 -8128 -11501 -11305 -16415 -8869 -11314 -13165 -15315
2037a5315L513N340q85J218O474M589Q110Q147j0094j7672m834j714R883l334
$$ -15315 -11802 -6462 -7347 -6129 345 4934 13044 21191 11097 -6575 -11409 -13123 -3240 -6574
2023f574k171K964m231r63L779P744Q040M875n957j2956M777j219P254L362l646
$$ -6574 -8745 -5781 -10012 -10975 -7196 548 8588 13463 7506 -5450 -673 -1892 5362 8724 5078
$$ [...]
##END NTUPLES=NMR SPECTRUM
##END=
