##TITLE=Analysis number 329989
Compound Code cc 68239
Book Reference 546/46
Project Code adrs
Chemist Name craigr
##JCAMPDX= 6.0         $$ Bruker NMR JCAMP-DX V2.0
##DATA TYPE= NMR SPECTRUM
##DATA CLASS= NTUPLES
##ORIGIN= Bruker BioSpin GmbH
##OWNER= nmr
$$ XWIN-NMR		Version 3.5
$$ Wed Oct 17 14:19:46 2007 GMT Daylight Time (UT+1h)  MAYBRIDGE\nmr@NMR_250MHZ
##.OBSERVE FREQUENCY= 250.131544655141
##.OBSERVE NUCLEUS= ^1H
##.ACQUISITION MODE= SIMULTANEOUS (DQD)
##.ACQUISITION SCHEME= undefined
##.AVERAGES= 16
##.DIGITISER RES= 18
##SPECTROMETER/DATA SYSTEM= dpx250
##.PULSE SEQUENCE= zg30
##.SOLVENT NAME= CDCl3
##.SHIFT REFERENCE= (INTERNAL, CDCl3, 0, 16.4487)
##AUDIT TRAIL= $$ (NUMBER, WHEN, WHO, WHERE, WHAT)
$$ ##TITLE= Audit trail, XWIN-NMR		Version 3.5
$$ ##JCAMPDX= 5.01
$$ ##ORIGIN= Bruker BioSpin GmbH
$$ ##OWNER= nmr
$$ C:\u/data/dgb/nmr/ADRS/890/pdata/1/auditp.txt
$$ ##AUDIT TRAIL=  $$ (NUMBER, WHEN, WHO, WHERE, WHAT)
(   1,<2007-10-17 14:19:24.26 +100>,<MAYBRIDGE\nmr>,<NMR_250MHZ>,
      <created by zg, POWCHK disabled, PULCHK disabled
       configuration hash MD5:
       76 6E 9A 78 1E 09 19 81 EC 84 63 8F B0 6A 59 2D
       data hash MD5: 64K
       37 2F 05 6C 14 F4 5D D2 81 F2 70 9D 8D AF 18 28>)
(   2,<2007-10-17 14:19:37.18 +100>,<MAYBRIDGE\nmr>,<NMR_250MHZ>,
      <Start of raw data processing
       ef LB = 0.3 FT_mod = 6 PKNL = 1 SI = 32K 
       data hash MD5: 32K
       6E FC 4C 88 FF 6B D7 B0 4B 4A F5 65 A9 22 56 6A>)
(   3,<2007-10-17 14:19:38.83 +100>,<MAYBRIDGE\nmr>,<NMR_250MHZ>,
      <apk 
       data hash MD5: 32K
       CC 14 5A AD 5B E1 6B E2 5C 1C 76 8E 7F 8C CC A9>)
(   4,<2007-10-17 14:19:39.54 +100>,<MAYBRIDGE\nmr>,<NMR_250MHZ>,
      <abs ABSG = 5 
       data hash MD5: 32K
       EE 81 90 FD 08 8E 09 17 F2 B9 C6 3D 24 18 DF 92>)
$$ ##END=
$$ 
$$ hash MD5
$$ AA 6C D6 9A 71 32 55 1D E6 03 AF F2 8D 1F 31 D9
##$RELAX= 
##$RELAX= 
##$RELAX= 
##$RELAX= 
##$RELAX= 
##$RELAX= 
##$RELAX= 
$$ Bruker specific parameters
$$ --------------------------
##$DU= <C:\u>
##$EXPNO= 890
##$NAME= <ADRS>
##$PROCNO= 1
##$TYPE= <nmr>
##$USER= <dgb>
##$AMP= (0..31)
100 100 100 100 100 100 100 100 100 100 100 100 100 100 100 100 100 100 
100 100 100 100 100 100 100 100 100 100 100 100 100 100 
##$AQSEQ= 0
##$AQ_mod= 3
##$AUNM= <au_zg>
##$AUTOPOS= <32 >
##$BF1= 250.13
##$BF2= 250.13
##$BF3= 250.13
##$BF4= 250.13
##$BF5= 500.13
##$BF6= 500.13
##$BF7= 500.13
##$BF8= 500.13
##$BYTORDA= 1
##$CFDGTYP= 0
##$CFRGTYP= 5
##$CHEMSTR= <none>
##$CNST= (0..31)
1 1 145 1 1 1 1 1 1 1 1 1 1 1 1 1 1 1 1 1 1 1 1 1 1 1 1 1 1 1 1 1 
##$CPDPRG= <>
##$CPDPRG1= <>
##$CPDPRG2= <>
##$CPDPRG3= <>
##$CPDPRG4= <mlev>
##$CPDPRG5= <mlev>
##$CPDPRG6= <mlev>
##$CPDPRG7= <mlev>
##$CPDPRG8= <mlev>
##$CPDPRGB= <>
##$CPDPRGT= <>
##$D= (0..31)
0 1 0 0 0 0 0 0 0 0.06 0 0 0 0 0 0 0.0002 0 0 0 0 0 0 0 0 0 0 0 0 0 0 
0 
##$DATE= 1192627163
##$DBL= (0..7)
120 120 120 120 120 120 120 120 
##$DBP= (0..7)
150 150 150 150 150 150 150 150 
##$DBP07= 0
##$DBPNAM0= <>
##$DBPNAM1= <>
$$ [...]
##$SUBNAM7= <"">
##$SUBNAM8= <"">
##$SUBNAM9= <"">
##$SW= 20.6930455092707
##$SWIBOX= (0..15)
0 0 3 0 0 0 0 0 0 0 0 0 0 0 0 0 
##$SW_h= 5175.983436853
##$TD= 65536
##$TD0= 1
##$TE= 296.16
##$TE2= 300
##$TE3= 300
##$TEG= 300
##$TL= (0..7)
0 120 120 120 120 120 120 120 
##$TP= (0..7)
150 150 150 150 150 150 150 150 
##$TP07= 0
##$TPNAME0= <>
##$TPNAME1= <>
##$TPNAME2= <>
##$TPNAME3= <>
##$TPNAME4= <>
##$TPNAME5= <>
##$TPNAME6= <>
##$TPNAME7= <>
##$TPOAL= (0..7)
0.5 0.5 0.5 0.5 0.5 0.5 0.5 0.5 
##$TPOFFS= (0..7)
0 0 0 0 0 0 0 0 
##$TUNHIN= 0
##$TUNHOUT= 0
##$TUNXOUT= 0
##$USERA1= <user>
##$USERA2= <user>
##$USERA3= <user>
##$USERA4= <user>
##$USERA5= <user>
##$V9= 5
##$VALIST= <valist>
##$VCLIST= <CCCCCCCCCCCCCCC>
##$VD= 0
##$VDLIST= <DDDDDDDDDDDDDDD>
##$VPLIST= <PPPPPPPPPPPPPPP>
##$VTLIST= <TTTTTTTTTTTTTTT>
##$WBST= 1024
##$WBSW= 4
##$XGAIN= (0..3)
0 0 0 0 
##$XL= 0
##$YL= 0
##$YMAX_a= 417023
##$YMIN_a= -416038
##$ZGOPTNS= <>
##$ZL1= 120
##$ZL2= 120
##$ZL3= 120
##$ZL4= 120
##$ABSF1= 16.44865
##$ABSF2= -4.244522
##$ABSG= 5
##$ABSL= 3
##$ALPHA= 0
##$AQORDER= 0
##$ASSFAC= 0
##$ASSFACI= 0
##$ASSFACX= 0
##$ASSWID= 0
##$AUNMP= <proc_1d>
##$AZFE= 0.1
##$AZFW= 0.1
##$BCFW= 0
##$BC_mod= 0
##$BYTORDP= 0
##$COROFFS= 0
##$CY= 12.5
##$DATMOD= 1
##$DC= 0
##$DFILT= <>
##$DTYPP= 0
##$F1P= 14.0000005364418
##$F2P= -0.99999901652339
##$FCOR= 0.5
##$FTSIZE= 32768
##$FT_mod= 6
##$GAMMA= 0
##$GB= 0
##$INTBC= 1
##$INTSCL= 1
##$ISEN= 128
##$LB= 0.3
##$LEV0= 0
##$LPBIN= 0
##$MAXI= 10000
##$MC2= 0
##$MEAN= 0
##$ME_mod= 0
##$MI= 0
##$NCOEF= 0
##$NC_proc= -2
##$NLEV= 6
##$NOISF1= 0
##$NOISF2= 0
##$NSP= 0
##$NTH_PI= 0
##$NZP= 0
##$OFFSET= 16.44865
##$PC= 1
##$PHC0= 157.0076
##$PHC1= 6.283522
##$PH_mod= 1
##$PKNL= yes
##$PPARMOD= 0
##$PSCAL= 4
##$PSIGN= 0
##$REVERSE= no
##$SF= 250.13001834482
##$SI= 32768
##$SIGF1= 0
##$SIGF2= 0
##$SINO= 400
##$SIOLD= 32768
##$SREGLST= <1H.CDCl3>
##$SSB= 0
##$STSI= 32768
##$STSR= 0
##$SW_p= 5175.98343685301
##$SYMM= 0
##$S_DEV= 0
##$TDeff= 65536
##$TDoff= 0
##$TI= <Analysis number 999999
Compound Code 99
Book Reference 9
Project Code 9>
##$TILT= no
##$TM1= 0
##$TM2= 0
##$TOPLEV= 0
##$USERP1= <user>
##$USERP2= <user>
##$USERP3= <user>
##$USERP4= <user>
##$USERP5= <user>
##$WDW= 1
##$XDIM= 32768
##$YMAX_p= 369222461
##$YMIN_p= -65192
$$ End of Bruker specific parameters
$$ ---------------------------------
##NTUPLES= NMR SPECTRUM
##VAR_NAME=  FREQUENCY,     SPECTRUM/REAL,   SPECTRUM/IMAG
##SYMBOL=    X,             R,               I
##VAR_TYPE=  INDEPENDENT,   DEPENDENT,       DEPENDENT
##VAR_FORM=  AFFN,          ASDF,            ASDF
##VAR_DIM=   32768,         32768,           32768
##UNITS=     HZ,            ARBITRARY UNITS, ARBITRARY UNITS
##FACTOR=    0.157963299565203, 1,           1
##FIRST=     4114.3012163212, 0,             0
##LAST=      -1061.68222053181, 0,           0
##MIN=       -1061.68222053181, -65192,      0
##MAX=       4114.3012163212, 369222461,     0
$$ Real data points
##PAGE= N=1
##DATA TABLE= (X++(R..R)), XYDATA
$$ [...]
19491 -15541 -614 31316 32417 21597 5704 -21450 -28933 -9720 -17925 -18519 -16451 5053 29739
19478 29739 24119 14944 -4561 -11070 -10529 -29531 -23992 1827 15955 18250 9847 -1457 -6609
19465 -6609 -5425 -18541 -17480 -21476 -9173 8198 13138 -10088 -17998 -3173 -1290 -4648 -16039
19452 -16039 3622 7545 5654 8001 -453 -686 -1818 6108 2479 5394 3443 2979 12870 25948
19438 25948 31060 27818 22869 8794 -1094 -2802 -3827 -3761 8282 9367 10493 9427 14092 11188
19424 11188 21068 20745 13856 17740 13935 23479 11655 1946 8687 6919 22140 27207 13436 17707
19410 17707 21135 27140 12333 3690 9027 9287 -12233 -19459 -18486 -5536 13658 15886 16113 5943
19396 5943 5230 -2071 13364 27732 39383 31262 8656 2298 -14743 -16819 -4395 -3659 -10335 -14735
19382 -14735 -20925 -21180 -18696 5864 26060 20402 11534 3435 -4152 -11067 -6673 -5524 -1732 6973
19368 6973 18845 18493 24336 21186 12294 22824 47349 37080 19859 3497 -3782 -11870 -24404
19355 -24404 -18517 -3099 -3971 -60 6425 13780 -2957 -24693 -19667 -9025 1941 14642 15672
19342 15672 19343 13360 -3401 -2314 -1109 -18462 -14824 -11298 6733 6553 17637 8475 10557 7144
19328 7144 -3995 -15264 -19329 -14247 14242 12623 8968 -72 -2502 7788 558 11776 23795
19315 23795 35755 43681 34814 16270 12778 11192 1835 2416 15837 26476 28997 31951 11160
19302 11160 23280 13955 -8343 -9704 16174 18471 1812 9630 24044 21022 22216 31785 20688
19289 20688 9204 -356 -5222 12964 14475 19590 26197 13451 -5414 -6489 7272 12016 19948
19276 19948 22703 14354 18760 11858 17443 15535 19732 27340 34787 36610 31294 29998 44776 49580
19262 49580 39194 32863 49427 75308 87313 70157 74686 66875 50328 41630 49421 67984 59574
19249 59574 49052 41970 43919 45072 32571 34663 45618 39159 43037 59744 50773 34325 21840
19236 21840 26158 28061 10406 12792 16763 15793 33769 29392 31256 38424 25137 2338 3869 5740
19222 5740 15582 35376 46137 45764 26232 24155 33652 42824 49769 43027 40885 46736 64707 71497
19208 71497 70498 80876 83433 88544 110092 101703 84869 81835 87168 89745 89761 67147 72193 80372
19194 80372 82449 85325 72251 74347 64217 55682 67233 76925 73157 66645 79222 66986 52433
19181 52433 62976 66560 63966 59510 61321 68958 86852 111575 105777 90760 103708 117238 114249
19168 114249 118119 123018 122747 122877 136411 151955 155132 162160 167267 183032 182759 186163 177206 203351
19154 203351 223405 229466 238237 243472 250716 276669 322654 368464 393377 447274 488500 502373
19142 502373 520572 537430 576772 628808 702846 753145 800659 863217 958413 1081584 1259285
19131 1259285 1478716 1775407 2162873 2649498 3220562 3744083 4098647 4280676 4416686
19122 4416686 4628834 5077204 5882831 7201468 9243860 12188782 15833312 19046105 20355256
19113 20355256 19447371 17144003 14694472 12827343 11404363 10123198 8944228 8034973
19105 8034973 7617268 7651468 7806223 7628886 6914416 5849242 4739023 3773946 3085574
19096 3085574 2630913 2324486 2111342 1957994 1832096 1745794 1685282 1617168 1578228 1591543
19086 1591543 1637275 1718263 1822075 1949775 2107538 2300579 2558634 2933680 3449514 4176581
19076 4176581 5139193 6330744 7538701 8399055 8685557 8575547 8447241 8679570 9502469
19067 9502469 10886618 12509630 14131458 16027970 18568358 21565502 23700740 23305019
19059 23305019 20346613 16139832 12093931 9093873 7160090 5974110 5310350 5010643
19051 5010643 4931494 4812539 4471087 3892347 3205777 2576782 2092753 1746436 1486365 1300578
19041 1300578 1166033 1059596 981815 924376 866840 807777 749625 710630 670742 641842 611943
19030 611943 579782 534982 478469 428844 389923 369037 349443 320397 310988 281865 239622 218150
19018 218150 209219 205896 205854 185605 171954 144647 145723 134302 115037 102863 112022 123706 130317
19005 130317 145505 138482 131526 120666 117047 113352 96910 104601 105252 85838 89452 112953 106262
18992 106262 93722 89128 93136 87807 74637 66254 55770 71086 74626 65323 64262 70075 74856
18979 74856 57375 47476 44147 47019 64027 58800 51875 43021 52566 66187 60910 54677 41781
18966 41781 45449 59752 61299 57347 67624 85398 63184 52757 64040 75412 62503 50273
18954 50273 27312 29410 49801 67720 64959 78543 82452 106866 123000 139673 167044 166583 136133
18941 136133 107064 90704 80565 65014 68720 72029 82353 103732 113935 116954 113109 116351
18929 116351 121369 122839 122086 116171 88806 63366 59107 58663 57508 60430 43594 25835 28812 42920
18915 42920 37506 26328 36892 28464 33474 39332 44482 46053 27112 20574 9628 30650 42918
18902 42918 38325 42720 35622 30603 14101 30463 47480 50912 49326 55740 77315 71084 53263
18889 53263 58028 57319 46677 52425 49621 53949 51008 56081 57425 54378 55398 58913 60849 49320
18875 49320 40443 43034 49495 51636 56368 63733 70759 55264 44466 47471 47113 49266 39904 44178
18861 44178 59968 59569 47218 43466 40850 22404 23102 27745 11720 29615 31941 32488 26240 32057
18847 32057 27002 -3866 -15439 -14915 -6948 3743 6500 13409 7103 11451 20346 14318 17678 3938
18833 3938 -10166 -13834 3130 23275 17938 17423 5041 -5696 -9592 -16442 -9043 3259 1805
18820 1805 13867 33688 39943 30669 7920 6979 4403 7587 2127 -22296 -32886 -14990 -7033
18807 -7033 6489 17937 35628 44907 60803 69459 52883 45315 25642 13409 30870 39537 29002
18794 29002 18097 34413 26241 26266 31096 17764 6459 3730 -12638 -4445 -3706 -11722 -11130 -6677
18780 -6677 24511 27723 12620 8431 6708 4647 11238 18899 45368 54599 64778 97943 145700
18767 145700 171511 151320 118299 87362 73004 60785 52696 40822 18155 4200 7829 -12074
18755 -12074 -18492 -17834 -3171 14656 24031 8733 2913 -11064 -6422 -3204 -1402 -848 3588 12860
18741 12860 14881 16757 4518 -14389 -11418 -8665 -20575 -17300 4672 3964 672 -2867 3000 9199
18727 9199 8822 10331 28036 32484 21939 22245 18228 8276 13024 12132 3105 953 15234 16565 12155
18712 12155 20902 19514 22058 29497 31498 27628 20394 10226 3113 4490 14337 6891 -4526 -11577
18698 -11577 -17233 -26620 -5171 8997 18967 27836 17921 -6764 -4134 8285 5098 -3563 -26537
18685 -26537 -25071 -21280 -18712 -97 16569 26415 23631 9041 4199 15381 8274 12124 28909
18672 28909 30737 32187 41205 26254 11379 18835 26113 3446 1022 -10730 -16902 -749 13792
18659 13792 16663 23618 24624 22713 18335 21996 30898 36914 43400 49825 38419 22863 3528 -11396
18645 -11396 -4747 27596 34691 24557 20122 22567 22250 5979 1084 1952 3662 15263 13463 14021
18631 14021 33344 44579 28550 19252 23052 38439 32435 23997 22825 20786 28434 17922 2867
18618 2867 7671 6532 17846 16602 27569 45034 56673 62830 59551 61029 62960 66347 62342 62210
18604 62210 66059 69539 66792 74271 88949 57437 36652 26640 29580 38128 44105 32993 24142
18591 24142 11588 14436 20481 22653 24056 27954 39220 48756 38847 33200 28843 30882 30324 28980
18577 28980 34435 30930 18652 37721 45345 49007 30397 27142 44208 57596 57471 69924 74304
18564 74304 82271 88139 93517 103732 117643 120214 102343 95288 114711 102315 96173 96938 83176
18551 83176 54511 73067 89695 94993 111474 114361 120953 131441 126253 107817 85158 67803
18539 67803 71135 83996 82375 64167 50777 43962 36337 34596 44376 52699 60379 67668 61870 61500
18525 61500 57010 48205 46700 43201 58908 56012 43929 36277 36305 28672 30474 45295 59749 72691
18511 72691 59074 60532 58344 47401 36954 32039 55712 57056 54189 52897 64323 72535 81866
18498 81866 57025 48535 39703 37305 23063 20876 48611 60608 60716 53849 54296 74818 84498 84557
18484 84557 89089 82766 96869 101111 99171 99992 103723 88013 87538 81624 88888 107044 116110 128707
18470 128707 144257 137760 154949 164101 149483 154329 179702 207031 219819 237133 269445 298292
18458 298292 336706 392723 447348 507321 586849 691157 801044 919298 1025393 1142352
18448 1142352 1274042 1457771 1728199 2102194 2656559 3405465 4252600 4896147 5154341
18439 5154341 5157666 5141886 5372936 6056049 7329029 9421505 12830555 17867972 23437197
18430 23437197 26745093 26183996 22821648 18727443 15601052 13522688 11787985 10160539
18422 10160539 8822410 8064322 8027775 8470533 8778387 8360870 7226576 5759668 4394181
18413 4394181 3381451 2744355 2354842 2100439 1910103 1743637 1604766 1505907 1429862 1397870
18403 1397870 1377653 1391494 1425238 1456176 1523333 1647116 1793099 1970887 2229222 2566655
18393 2566655 3054488 3817881 4916595 6317586 7661894 8386196 8387129 8051141 7875578
18384 7875578 8289639 9347071 10689739 11899141 13271287 15481651 18736065 21952470
18376 21952470 22853329 20459696 16142174 11640657 8240070 6167060 4989216 4321328
18368 4321328 3988594 3917848 3978812 3906205 3524380 2940029 2328495 1832483 1485385 1247620
18358 1247620 1084303 975867 895982 808855 726774 637795 578573 511876 453519 408757 359791
18347 359791 322455 299364 288414 291452 272798 247020 226432 205961 192681 187324 181451 163592
18335 163592 174840 174025 172655 155960 132276 126938 120420 115357 109715 108781 112716 115382 112078 106051
18321 106051 93890 88251 83108 87936 89190 78780 78732 90277 94614 89693 92906 98105 93632 88315
18307 88315 94296 93297 100018 97772 102379 82486 82612 92436 107464 76296 53308 40150 50867
18294 50867 53179 43979 48692 54471 56973 58911 55997 53653 56519 63536 56231 39337 40430 37094
18280 37094 26039 25500 33225 19808 23718 46604 52576 53121 56039 47074 51997 42691 32376 20270
18266 20270 1903 11788 29539 48797 53884 55794 52601 53256 49532 65827 65326 56375 64612 71406
18252 71406 68144 35964 22048 15263 636 6513 31114 34981 2306 -5291 3837 19678 17918
18239 17918 -1826 -9073 -7049 -5355 17657 34097 54835 46288 42723 35936 33073 24670 42672
18226 42672 48507 44735 45025 44949 27626 27299 37829 29706 14987 2838 -9583 -17395 -5118 10488
18212 10488 24456 39799 47467 38231 47636 45232 46335 55227 57916 58243 69727 50876 48377 49260
18198 49260 39100 33345 20677 29544 46891 44934 40063 46699 63620 55353 60352 58433 62665
18185 62665 66092 50425 47407 42305 37615 46131 58230 68536 66771 68894 66943 54973 49183
18172 49183 45354 33717 27176 20941 25154 31893 43733 59499 66391 55204 37007 31162 42782
18159 42782 46338 61625 52486 59414 61822 54285 51336 62599 64100 69956 69412 68740 74911 79832
18145 79832 85014 94330 105680 114562 114424 121238 133974 145792 163242 171585 168607 184792 213870
18132 213870 236705 268909 294698 350226 424040 510372 596455 685033 800731 944012 1116313
18121 1116313 1317601 1565266 1823818 2122866 2503024 3031169 3807920 4979370 6917206
18112 6917206 10274683 15959749 23569917 28391285 26517410 20702887 13769380 8487792
18104 8487792 5580414 4010561 3042984 2400750 1958873 1610899 1344911 1130842 971058
18095 971058 829800 709210 619236 552215 483336 415089 362211 318712 293566 263732 225317
18084 225317 203249 195494 186454 169642 149298 147663 147045 146602 154607 152262 138214 125441 102881
18071 102881 94118 72092 49597 54238 62390 74316 79640 87388 60356 40305 55564 63284 63549
18058 63549 65214 70126 64834 58347 53009 61246 55143 33767 23237 15673 13288 13330 13566 12625 8598
18043 8598 13788 33754 32380 22610 13669 2153 6857 6271 17909 22070 10855 16631 31393 53519
18029 53519 42329 25188 32289 43087 14091 9455 23088 41844 40775 48708 50475 40191 26921
18016 26921 13422 4023 5910 12063 -8468 -24008 -14675 -535 11626 10862 4881 2800 10150
18003 10150 17162 11854 11261 19178 20398 5566 -3972 -3037 -2826 -643 2680 -5971 -25260 -14677
17989 -14677 -9976 -12638 -12131 -17332 -18228 -9227 -1061 -1381 -2495 2205 17392 28568 30599 26695 26782
17974 26782 22957 15361 -14860 -17439 -11701 -15530 -14553 -3946 2181 2394 -7090 -3416 -1725 191
17960 191 4586 8047 -1979 65 -7697 -13264 -12423 -1731 12138 -232 2557 16259 24190 20961
17946 20961 22080 30117 30701 22422 350 -15264 -15778 -8205 -2868 21840 28476 21502 15536 11480
17932 11480 -1217 -18713 -6963 23104 36362 30134 32262 49977 50077 40460 54196 68747 61436
17919 61436 79541 79508 86335 92624 85556 61306 41938 47706 46784 54987 57207 70478 83859 89217
17905 89217 92112 70707 50761 45903 51850 44997 33937 30410 39454 38770 31815 22523 -27 -5962
17891 -5962 -9904 5596 31526 39939 45666 39336 28743 33835 39804 38459 41038 36608 44019 52259
17877 52259 47452 44192 48893 54114 48509 54867 56130 49081 70798 89095 92346 73773 50143
17864 50143 27280 20569 24922 25151 46020 54993 48998 48723 63853 79687 93682 101304 84688
17851 84688 63980 46609 23212 9987 9520 19077 25754 26458 30158 12915 -11577 -14889 -1776
17838 -1776 7194 5974 8365 11157 1693 -15882 2762 20416 22474 20784 17390 10236 -4347 -2240
17824 -2240 361 4580 1785 -7220 -14892 -15419 -15630 -11563 -4626 5494 5356 866 785 -8289 -15294 -10913
17808 -10913 -16849 -13899 -15171 -9921 -8887 -6019 -1626 5177 -8636 -19138 -10755 540 15517
17795 15517 9795 -8775 -23347 -12349 -16425 -21041 -14343 12719 26501 34645 24833 5138 -5235
17782 -5235 808 8913 19922 21160 17332 14376 2450 20542 26417 31619 9039 -13839 -25616
17769 -25616 -40478 -23436 -6065 -5771 -25286 -17653 -6910 10517 -9684 -13174 -9067 -13833 -21631
17756 -21631 -31763 -24699 -17508 -16156 -10811 -4854 -20969 -30719 -20347 -7490 -12993 -30730 -21225
17743 -21225 -21667 -12232 -873 3575 7438 -16088 -11371 18400 31680 16322 6165 26904 23681
17730 23681 10522 5835 -7681 -4361 19949 7001 -2227 -9546 -3406 -10341 -15257 -17213 -7641
17717 -7641 -10202 -22167 -27404 -28749 -27005 -20481 -20097 -8141 5296 9044 -8654 -6866 -10077 -3464
17703 -3464 4487 5628 11612 -2994 -13877 -8924 -21126 -28489 -19566 -15090 -4791 2164 3880 5712
17689 5712 8698 16774 20020 14377 -9830 -32258 -36780 -44541 -29862 -24823 -26506 -22072 -13842 -13302
17675 -13302 -4177 -3542 4065 7562 636 -3738 -26575 -32099 -17372 -19889 -24468 -18268 -17935 -32829
17661 -32829 -19275 -3893 3503 -278 9621 16389 18800 16619 4895 18141 37094 19934 -3065
17648 -3065 4595 12890 27476 20632 19540 14934 2795 20382 25567 39818 44351 35430 22341
17635 22341 6572 -7105 8951 24197 32042 25985 1544 -3759 -4040 -1499 8329 15871 10902
17622 10902 12683 13257 4438 -5633 -15768 -14298 -20551 -17092 -20230 -28185 -34490 -57844 -58079 -31991
17608 -31991 -19030 11407 14611 3542 -10224 -5092 -11220 -9504 -9002 -6081 7636 26636 33550
17595 33550 25542 3283 -7121 -8544 -15304 1908 20111 17821 17138 8216 5802 6764 -12889 -17941
17581 -17941 -30190 -49641 -45195 -30640 -32432 -14917 16518 3097 -10461 -11246 -2031 -76 3003
17568 3003 2034 3584 4552 -8277 -17716 -10408 -22951 -41883 -38575 -28182 -20320 -2825 -11622 -16257
17554 -16257 -23572 -10569 27 6717 20863 14484 3983 -6978 -23640 -22778 113 4534 13761
17541 13761 15824 2851 7116 16923 15808 2303 6673 4595 14181 23281 21882 608 -14453
17528 -14453 -23675 -12251 -9526 -19033 -35197 -33395 -24022 -24535 -35171 -33937 -15748 -10050 -7105 -17966
17514 -17966 -31388 -29384 -25653 -27624 -14960 2369 5536 -9639 -20868 -4983 -5549 -11748 -14796
17501 -14796 -3297 18650 22665 17011 9498 -4061 -10007 -3765 4312 942 -23455 -30592 -16638
17488 -16638 -3438 3065 -10123 -9697 -7639 -3390 6443 -9845 -41535 -43314 -46329 -42939 -40590 -28994
17474 -28994 -10038 -2480 -10667 -8660 -6343 -6320 -21623 -22082 -17087 -19556 -12252 -19137 -15558 -15886 1875
17459 1875 22747 18494 6332 2409 -2198 -107 4924 377 -5195 1784 -4476 -18414 10829 39274
17445 39274 48691 85434 148393 160452 135210 101209 60013 22038 -1363 -9366 5243 -1376
17433 -1376 -8138 -11533 -25190 -43947 -39818 -36665 -28461 -38489 -31858 -14432 -10371 4545 17192
17420 17192 5565 -6164 -10589 -1363 -942 -733 25023 34217 30919 25636 23768 13738 -4032 -6726
17406 -6726 -14267 -16141 -19111 -10090 -3138 -9699 -7981 1947 809 8447 5083 5766 16672 16178 -6975
17391 -6975 -5864 8155 14668 6776 -3905 2463 1698 4397 -9195 -6251 -150 -2008 10633 23151
17377 23151 2902 -6882 -5380 -6930 -16964 -22439 -10642 -4101 -10724 -8578 827 7711 20637
17364 20637 13594 -6296 -6625 -2945 -2395 3692 -14885 -13720 -12773 -6817 3360 13302 16659 8925
17350 8925 13933 14346 16604 23761 15336 17137 12167 5294 6582 20469 21518 13124 10415 12439 5989
17335 5989 -3936 1824 26327 25720 24376 20747 15523 5626 -3293 827 4311 11034 8227 -570 -7037
17320 -7037 11571 25243 21948 17335 1015 -2761 142 -7731 -10114 -19318 -21875 -27953 -17923 -21124
17306 -21124 -14427 -7326 -16307 -9941 1215 -15026 -17500 -9427 -7749 511 -6538 -11496 -14420 -27722
17292 -27722 -26351 -24912 -17926 -15479 -5944 -5996 -3336 2377 13565 -5836 -20780 -19961 -12892 -9628
17278 -9628 -6587 -4389 -17269 -29820 -39542 -31784 -6001 -1081 -4437 117 7307 14209 12330 18734
17264 18734 23619 18785 22740 27335 4713 -10371 -30212 -50392 -49720 -31533 -12392 -13776 -8378
17251 -8378 -4739 8858 20456 19660 6899 3659 -3675 -9630 -23880 -35304 -20216 4515 9702
17238 9702 -4982 -15746 -6044 -11924 -2485 4792 -785 4816 7638 -16452 -18872 -14921 -8713 -20682
17224 -20682 -31164 -34419 -33141 -30292 -21254 -16448 -8467 -7642 -6736 -5053 -9365 -206 15791 5649
17210 5649 -5128 -8002 -17839 -24245 -22296 -14552 -12950 -1744 -18917 -21470 -12993 6981 810 1395
17196 1395 -5190 877 -7637 -2929 6510 10928 8930 10600 15284 9641 2778 7732 -1088 -9822 -12181
17181 -12181 3933 17763 34851 26443 10240 1894 7105 4583 16015 30525 34833 51320 46102
17168 46102 22550 14967 -2025 -19478 -17882 -8370 -25113 -10822 -433 12463 13643 7244 5694
17155 5694 2173 -6620 -27788 -20678 14256 33374 32813 10692 2480 -5514 -10645 -16269 -18332 -20651
17141 -20651 -15745 -2641 194 -491 1996 7175 14038 14053 -10930 -14127 1987 15383 12832 -10285
17127 -10285 -17976 -22937 -14775 -7565 -14152 -35815 -30048 -20177 -12087 -19304 -6729 -4489 -7176 -9059
17113 -9059 -7456 -12583 -3218 8767 3587 -5249 -7982 -4287 3391 -1855 -12585 -25608 -34922 -36768
17099 -36768 -33520 -18740 -14222 -12119 -1259 1975 -9617 6170 1384 -7875 -21054 -23436 -23599
17086 -23599 -26900 -16357 -4651 221 -3684 -8912 -6664 -1049 1089 -5599 -8166 -9769 -13029 -15422
17072 -15422 3872 16376 1409 -8535 -9154 -7664 -13381 -24040 -5744 -8781 -10906 1233 9279
17059 9279 11055 15068 10800 -2637 -18166 -25093 -27387 -15609 -2082 5433 -6687 -28794 -33288
17046 -33288 -20691 -6447 7136 -3790 -8233 -7477 7562 9727 -1342 -4177 -5538 -23665 -36770
17033 -36770 -18468 -13641 -20269 -18717 -9415 -188 3276 3979 25451 31947 15564 7198 9553 30561
17019 30561 30757 25699 18246 15757 6389 3004 4516 -4130 -7160 5550 7248 3171 4469 6255
17005 6255 18386 41900 37118 20988 19392 27153 18628 -1061 -4026 -6277 1604 372 -7427 -14240
16991 -14240 -12556 12697 14748 24421 17575 3919 -7799 -6817 -10794 -24556 -21189 -10968 -12852
16978 -12852 -11381 -16638 -2526 4521 -134 13389 11419 423 -4198 -7409 -877 -17492 -27625
16965 -27625 -23346 -12739 252 5850 -6258 -19734 -4219 4211 -1661 -4111 -12761 -13769 -16245
16952 -16245 -9894 -16851 -27482 -7154 -11401 -16999 -13025 -16107 -10201 3621 8059 1814 -14045
16939 -14045 -8822 -9077 -20154 -22435 -21745 -30989 -32411 -20906 -688 -7890 2452 -4435 -13026 -5461
16925 -5461 -4506 -2780 -9067 -11028 4354 18316 6880 -10071 -14393 -25252 -29397 -27898 -16962
16912 -16962 -17742 -12682 -6008 5480 -4934 6376 14496 -3704 -3848 7621 7678 7652 -10192 -19552
16898 -19552 -10977 -1436 21053 28825 11521 13705 19135 19067 9749 6362 4909 10250 1442 10117
16884 10117 9172 15153 16734 8277 1755 1636 -11875 -21675 -37107 -38198 -31640 -12514 4527 16542
16870 16542 4404 -12267 -20619 -11140 -13558 -16042 -6002 10189 16536 18112 13939 17739 17253 16979
16856 16979 -1559 -7585 -3305 -4776 8663 11698 -330 3044 -3453 -10512 639 -2308 -16865
16843 -16865 -29892 -25613 -21776 -2784 9 -15656 -5392 22670 1282 -15732 -1119 26865
16831 26865 27436 17633 19371 31727 17392 -4593 -6636 6943 10191 4868 5026 5696 -12583 -16324
16817 -16324 -27882 -14366 -12799 -21937 -24492 -7150 4294 -8001 -12077 6616 29420 43696
16805 43696 17138 6254 24068 21548 20923 24144 5694 -1376 -10258 -1562 4567 10753 5328 8941
16791 8941 8215 16575 527 -10936 -14594 -21183 -7765 5126 10197 1376 -799 -2441 -8488 3015
16777 3015 16651 5827 8540 6590 6692 9129 10744 11319 11108 8128 12213 15117 -4161 -8464 -8704
16762 -8704 -4789 -19598 -27323 -22923 -10599 -21182 -11734 -5035 -2681 -18154 -11521 6021 14516
16749 14516 17174 18953 8941 -11912 -22006 -28889 -40856 -23714 -7072 -308 1273 -2896 -3764
16736 -3764 -10103 4049 -3105 -1911 3167 -4468 -9397 -10813 -11723 -2394 -7447 -4775 -3591 -20649
16722 -20649 -29064 -5370 -2602 -17928 -39195 -33543 -5953 -8798 -17620 -5180 -15465 -21080 -11159
16709 -11159 -3082 -2170 8166 642 2353 16737 17637 11766 3053 -8011 -7198 -10010 -11870 -3348
16695 -3348 -9622 -17290 -15706 1659 9765 -5681 -13022 -13810 -12646 -15650 -18574 -21759 -13280 -10337
16681 -10337 -9096 4148 11589 -17005 -8775 -2347 2062 4140 10526 8167 10576 14036 14880 23555
16667 23555 25471 21024 30087 36401 48622 63710 79305 66084 61186 64555 66458 75777 78401
16654 78401 82417 73385 75742 74954 64054 55733 56127 46276 45225 43079 38288 40184 24057 18490
16640 18490 26357 18920 549 1486 11597 21559 20811 17598 6979 1075 5363 -1827 10564 27062
16626 27062 15769 -2333 -3727 23280 42336 31222 5791 -7005 -6813 -6228 -9170 -18666 -18910
16613 -18910 -13095 2251 12406 17702 10758 -6070 -370 -2309 9269 18200 -3751 -27078 -13685
16600 -13685 -9058 -6157 -15403 -21558 -27687 -26287 -26449 -18903 -3333 3869 8730 -4259 -3227 -10503
16586 -10503 -6306 2252 8684 -12393 -15130 -5962 8358 26224 19162 11301 10277 12646 5856 1194
16572 1194 8923 14835 4758 -4888 -1306 6810 12860 10644 6380 2943 7747 9497 -1460 -8039
16558 -8039 1377 5096 -3806 -8738 -2077 -1885 8419 17057 14945 -5433 -506 -2973 -8441 -21066
16544 -21066 -22642 -11045 -10 23993 21063 3638 -11272 -9352 -4147 10607 2844 -16643 -7230
16531 -7230 -358 -5090 -3310 10148 15748 11392 6378 -22507 -29592 -11140 15414 25376 18106 15294
16517 15294 14568 13042 17919 2317 -91 11782 19310 21712 24948 18914 32935 31213 21214 18073
16503 18073 15262 10702 48 -3849 -6448 -13889 -12858 -2291 3005 -2407 3989 -14896 -25098
16490 -25098 -42581 -43929 -27211 -11444 3993 2957 -16446 -36334 -42210 -25861 -16922 -9148 -9414
16477 -9414 -869 4637 -1246 -8815 -18811 764 7336 -10200 -5362 4086 -5051 -27941 -34478 -26092
16463 -26092 -24883 -28384 -5644 72 8905 10296 19383 4367 -23856 -44522 -38803 -17755 -184
16450 -184 11647 10763 15229 18852 24324 29008 20384 7374 4777 -6004 -1366 -4754 1291 1214 11968
16435 11968 8475 -392 14077 29351 24448 20815 11204 -3602 -11372 -10108 1223 11423 7520
16422 7520 -4395 -2189 279 -9332 -13708 -6370 17085 15652 10954 516 1488 6999 8099 2904
16408 2904 -3836 -12663 -15437 -10950 -13321 -5974 1800 -10002 -21374 -18243 -18104 -12329 -17832 -5848
16394 -5848 -4804 10614 17954 2153 7147 17838 27324 28647 8498 -8898 -4672 1371 -782
16381 -782 -6139 -5061 4476 21258 23384 15769 11212 29789 28965 19248 9754 -3179 5350 25118
16367 25118 29692 30563 14719 8433 22800 30433 6149 7419 20282 10795 9456 2449 3564 -4647
16353 -4647 -14157 -16166 -2681 5219 -1755 183 4374 -8782 -17570 -26966 -33839 -8446 7585 5810
16339 5810 5988 -5067 -11314 16715 19493 13884 14974 17297 22499 4040 -3210 827 15931 22233
16325 22233 -766 -489 -1260 -23864 -23314 -5634 13387 11408 2388 -6952 -1532 -3258 5007 12103
16311 12103 -780 1518 26336 48949 56767 41938 26173 18722 20011 955 -19556 -14247 -17738
16298 -17738 -21595 -18513 -17627 -19218 -18927 -18524 -17450 4938 24480 14709 12858 8170 2521 15149
16284 15149 9750 -1931 -13797 -14065 -2983 -3224 15619 12475 -4771 -11745 -89 2726 -5167
16271 -5167 9265 9817 -278 4228 12722 21285 7208 8716 4548 22187 30891 31571 43048 45244
16257 45244 47424 41214 36351 52031 77802 74974 68438 63158 53434 43178 37615 45941 46273 36141
16243 36141 33923 14298 15445 17485 19581 16001 20847 31552 33999 28307 24815 19215 1975 -14782
16229 -14782 -3639 3187 -2424 1196 2978 2559 2877 11493 23321 24900 31663 41590 47538 44435
16215 44435 30139 20699 8692 -1264 10436 16685 5264 -4892 -13770 -8783 -14787 -19288 -10454
16202 -10454 -13879 5326 6017 15791 20888 26568 29643 40764 32633 35374 36639 40320 33720 19256
16188 19256 15293 28222 45808 47125 33699 23467 27153 53823 51795 45075 41518 55609 33559
16175 33559 36323 41018 43270 48678 52154 58303 67447 66371 73806 80755 80280 84191 76635 55658
16161 55658 57741 84556 106653 107265 107322 114039 124222 121515 98519 107285 130323 140852 150773 164128
16147 164128 191226 224093 243909 277718 304449 317784 325129 364955 429085 491825 555043 621532
16135 621532 688109 751847 833507 942425 1066054 1239717 1447400 1690207 2002119 2413694
16125 2413694 2950335 3627131 4476310 5520740 6767213 8188588 9787597 11547004 13390249
16116 13390249 15108625 16507618 17665098 18514169 18916353 18800024 18145623 17180667 15939046
16107 15939046 14335082 12539005 10684415 8944155 7361562 5970663 4801254 3832206
16099 3832206 3068095 2481234 2034954 1690493 1440371 1247893 1088420 982824 889613 803429
16089 803429 732143 672002 626826 580527 531086 491817 449788 402560 367063 338954 324129
16078 324129 311688 281251 257449 248733 229574 207854 196636 175257 148075 142896 131472 116776
16066 116776 104752 94563 82532 79035 80920 82092 87602 95487 105840 87204 57346 61183 78083
16053 78083 77856 63308 54547 51584 61118 60422 62877 60771 59771 59750 50672 47402 42404 44225 58977
16038 58977 68227 56729 53047 49516 47587 57186 50018 38225 40345 53217 69080 50093 37231
16025 37231 33237 32442 24167 29761 28411 16217 12789 18935 27542 31925 26751 13179 17672 26604
16011 26604 22936 21999 24116 8846 -7822 76 25247 25438 13284 22671 22093 23497 17389 22959
15997 22959 26497 24435 34236 15223 4474 2677 -2777 -158 1813 3075 13171 14542 7844 -3917
15983 -3917 -18961 -17273 -7402 5067 10225 17242 15652 17299 17571 -2207 -2929 -3769 -17866 -18811 -24743
15968 -24743 -13655 -6178 2737 23875 30613 32576 44371 34046 5194 -11684 -10999 -11689 406
15955 406 -1217 -66 -3999 -21415 -15016 -7792 -3236 725 1145 -894 8988 11906 10530 -47 8089
15940 8089 16686 8996 13823 7567 -13344 -38356 -16416 8975 21655 37506 47673 38453 22553
15927 22553 17640 -797 681 14130 7581 -10870 -5563 -3658 -6601 -4082 -10056 -7048 -8100 12614
15913 12614 19297 4979 26526 30414 -6068 -20481 -30917 -24162 -21959 -19098 -12498 -10778 -10126
15900 -10126 2026 -3988 -13111 -5716 -6240 -17188 -10665 6033 23162 33297 29011 7209 3373
15887 3373 2010 -21 -11621 -26434 -11057 3288 6970 1157 -14210 -11960 -801 -13594 -10416
15874 -10416 7099 2462 -3447 7238 2168 -25907 -32301 -24513 -26100 -34618 -45466 -27077 -12723
15861 -12723 -9221 -14240 -7969 6330 -7341 -6436 -1389 -3647 3444 -2397 -11975 -17484 -30981 -37412
15847 -37412 -39113 -21982 8019 18244 23220 15125 6037 9337 -4847 -21534 -19461 -9071 -10736
15834 -10736 -6728 11539 29055 29725 15399 3830 -7282 10424 9138 6474 -3483 -5280 2766
15821 2766 -9941 -19313 -29426 -36042 -9372 8200 12768 11600 -10223 -40034 -39279 -22344 -26481
15808 -26481 -33018 -29183 -20788 -10538 5579 12017 15882 20462 28542 22435 11622 1689 13414
15795 13414 22789 19080 18377 20971 32155 26538 18503 -2886 -7963 -3241 -3411 8676 11601 -5217
15781 -5217 -4726 -12700 -21924 -16260 -3719 -729 -4876 -24736 -9632 17686 13213 7895 7292 -1605
15767 -1605 -9274 -85 13745 30220 27469 2055 -16170 -23345 -18547 -13590 -4935 -15923 -15648 -1675
15753 -1675 7728 19723 14940 12122 -12394 -23285 -21587 -16358 -16121 -13379 -10464 -16976 -25902 -22157
15739 -22157 -8787 -8391 -13930 -12790 591 19676 35012 28412 15404 7430 14765 21655 -5945
15726 -5945 -26900 -29571 -26299 -26543 -16230 -68 11066 1339 -4285 -10160 -8387 2234 1408 7685
15712 7685 3103 10704 11490 -8424 -10559 4290 5433 894 3569 13022 12276 13664 -488 -18137
15698 -18137 -28223 -26130 -18367 -24259 -21362 -9560 8630 12190 7591 9216 13760 26430 30726
15685 30726 11534 7281 26439 33995 13083 19449 17514 -2318 -2922 1459 -4644 -7101 -2329 2091
15671 2091 8410 9925 6799 14275 15214 10497 1637 -8377 7057 18212 19827 12395 8032 699
15657 699 8323 8297 6736 5686 -2209 -15609 -20454 -16840 -9573 -8172 -4425 5215 9814 17872 35927
15642 35927 23974 11904 14873 19419 15771 24909 17002 -1560 -11878 -13100 -14075 -1451 3246
15629 3246 1259 4052 12997 -8608 -17499 -267 10669 13105 26152 23152 -4820 -24610 -34484
15616 -34484 -21574 -13387 -10939 5940 13033 1262 -8114 7786 4719 7271 4204 -1856 -7963
15603 -7963 -11213 -4399 -1664 -2526 -17483 1764 914 7532 24088 23083 19146 16304 14123 12272
15589 12272 16562 23475 31574 27941 -226 -1630 -6209 -14384 -4581 5673 3590 -4356 -8789 -11298
15575 -11298 -2763 14745 24866 23215 32715 34498 42233 43739 45667 59751 74568 83743 83494 78538
15561 78538 61473 51642 54166 67224 72606 75143 57911 46310 32762 26584 16371 4721 8845
15548 8845 15554 12276 16708 26978 33657 20937 15556 13442 2528 -3703 2408 10402 7804 9281
15534 9281 4899 8105 -1623 12166 22737 13426 19818 41241 56693 51590 28052 -564 -25229
15521 -25229 -25871 5823 2174 -6098 -14258 -8604 3562 7740 14160 20815 19899 16787 3340 -20205
15507 -20205 -13585 -10513 -4751 11178 14337 -3157 -4989 -13275 -16241 3756 17297 12611 -2054
15494 -2054 -1650 5373 -5871 -21324 -22256 -24632 -29699 -29043 -3000 13164 26668 44747 25955 18726
15480 18726 -5244 -28837 -21395 -13757 -2857 -6042 -9724 8797 14939 695 -3511 -8896 -13974
15467 -13974 -8741 -12525 9585 4390 -4883 18474 1026 -5028 11009 1271 7547 14099 3416
15454 3416 1661 8196 4367 -4641 -11676 -12187 -8360 -20100 -24024 -28697 -21038 -675 20132 11195
15440 11195 -18365 -21735 -23296 -14163 11601 28282 21352 26226 24978 23251 36712 25910 22719
15427 22719 9830 -3391 8973 20365 16161 5631 9140 7576 -5370 2623 -1684 435 4634
15414 4634 10230 26578 22020 -4886 -3826 -1361 2214 3732 13509 15868 15359 6704 -1411 -7479
15400 -7479 -11053 -6386 1766 12318 -2398 -12681 -6257 -22396 -35444 -36716 -34474 -26422 -25171
15387 -25171 -12601 -1365 11225 3755 8724 -4231 -6777 3914 1356 -2216 2917 -11379 -13876
15374 -13876 1310 18224 9109 -352 -13961 -16378 1981 1464 -20842 -29872 -18175 8773 8239
15361 8239 9322 6916 7250 4096 12418 19020 13826 13091 1043 3680 2514 13082 7725 -534 4082
15346 4082 9454 6786 -12030 -25554 -15966 -29952 -19800 2407 7688 7939 7347 7895 3794 -136
15332 -136 2574 7119 5293 490 -4305 10754 18359 14543 444 -12674 -19406 -22890 -16818 -14749
15318 -14749 -28952 -23518 -15274 -17653 -25424 -33054 -48175 -36304 -16314 -29360 -32282 -20671 -348
15305 -348 14871 832 -25912 -48074 -47324 -23773 1952 10443 5314 501 13687 4004 7262
15292 7262 4362 5596 1065 2735 -1282 -12820 444 -7268 -23316 -31503 -19223 -19887 -9716 2476
15278 2476 1906 20931 30521 27536 16848 9590 924 9706 276 -10980 -3103 -10120 -6692 -3540
15264 -3540 -13957 -28467 -18272 -20771 -27337 -9977 2975 5613 2530 -2277 -13567 -13544 -6409 -3609
15250 -3609 -7326 -17357 -27719 -21117 -20165 -28823 -15572 -5450 -7567 -19262 -30261 -17695 -15493
15237 -15493 -10840 -15227 -25486 -41494 -54377 -45007 -17329 2975 3854 18973 20728 11661 12979
15224 12979 1174 -26680 -22976 -337 937 -9910 -24159 -11691 11286 28108 19968 8054
15212 8054 4668 -3236 -12446 -7340 -8696 -4084 2852 19712 8227 -7175 602 -205 -2846 -11772
15198 -11772 -2739 11257 20012 17170 14478 14200 14107 2927 -9433 2882 19840 39240 21325
15185 21325 -6512 -14933 1814 3834 -13511 -4062 6559 -3080 1619 10162 -8195 -15848 -162
15172 -162 3322 8273 6069 -13792 -30104 -30246 -31207 -22130 -17294 -8617 2287 -4118 -8418 -18058 -12525
15157 -12525 142 13823 18059 4861 -2625 -22010 -20971 -3904 16189 11596 -7664 -22459
15145 -22459 -20058 -9000 21904 28893 8619 4768 2026 -520 4414 14968 40032 35966 18467
15132 18467 9631 6520 6828 3292 -944 20166 11017 -5461 -13979 -19439 -19583 -2594 4149 -2775
15118 -2775 -13060 -19727 -14158 -8618 -3925 14958 29311 14105 11941 10038 -4369 -4950 2030 11839
15104 11839 18163 20405 10264 8508 7535 -1497 -5626 -9882 -13062 -9696 1288 2304 -883 -7181
15090 -7181 -8088 -11258 -692 -7943 -14438 -14225 -11893 -4373 -2175 1149 14487 16061 8180 -567 -10370
15075 -10370 -6131 2072 -11004 -18955 -35933 -14818 -4 -3540 386 -3911 -2575 -12011 -19045
15062 -19045 -13250 -17563 -20663 -22240 -4507 7347 14688 22090 21527 12294 4215 63 4071 11301
15048 11301 -1874 -6232 -8941 -13696 -5088 6142 6752 15263 6303 -2818 543 4373 -14869 -18677
15034 -18677 -13631 -7560 7330 10731 -5606 -25394 -29664 -19163 -9303 4695 15313 -2400 -10002
15021 -10002 -9665 -9104 -11361 -4412 -1266 7034 -13721 -20032 -9152 3141 13227 23520 28764 27509
15007 27509 32483 33414 26369 20987 18686 15863 6514 -47 7322 23399 15363 17066 7160 -4892
14993 -4892 -14201 -12697 11372 16306 7 7224 8930 4348 -2513 1708 -1041 -4608 -3777 2203
14979 2203 17884 9119 10693 11174 9677 24383 12033 8888 9012 7922 -10777 -31517 -27252 -32642
14965 -32642 -41259 -37608 -34611 -31708 -20361 1486 -784 -1628 -14714 -18514 -13072 -10452 -4074 -12385
14951 -12385 2085 12856 1345 12541 21300 -2794 -10268 -10908 -15074 -16884 -10694 -9572 -4206
14938 -4206 4424 4819 -11170 -7138 7536 20959 3468 -3817 7613 13129 2350 5079 4082 23309
14924 23309 26449 24036 19789 -2274 -6126 -5673 -3130 -6263 -8948 -1933 5991 -4963 -8460 7707
14910 7707 12347 -3536 -30671 -32062 -26722 -8322 6180 10348 -244 -21128 -12060 -1090 635
14897 635 -4639 -10815 -5321 6601 10948 15348 12676 8761 10809 3871 -11170 4597 14952 17271
14883 17271 18963 13833 6868 -11341 -10564 -4201 -9030 -12865 -12546 -11560 4076 867 -8854 2112
14869 2112 9028 -97 5191 13044 15610 24436 18213 11742 17864 22142 11565 2474 736 -9921
14855 -9921 -19808 -14059 13855 16347 7644 -4010 -9275 -4984 -3819 -740 5158 -7715 -24508 -29864
14841 -29864 -20013 -6314 -12728 -20815 -12888 -6458 3377 988 2702 -7327 -4212 -7256 -8645 1245
14827 1245 8486 8494 19373 16492 12939 6076 -9913 -21753 -12784 33138 30874 21291 27453 18417
14813 18417 -2305 -3133 15113 37484 37931 27699 6369 -3254 -12963 -23276 96 21008 15909
14800 15909 13757 -11399 3176 21897 9343 -2847 3630 13710 591 -243 -2569 -15753 -3935
14787 -3935 6609 3939 -2673 6199 26000 31243 28012 26296 21903 25295 7643 5070 8820 9843
14773 9843 5217 1335 939 4332 9132 7311 7671 -541 -4845 -9557 -2599 7115 10595 -5101 1450
14758 1450 8122 9555 25258 24054 1856 -4008 5594 7661 11577 2689 5573 8371 20826 29662
14744 29662 31455 27999 26978 36177 33329 23101 6948 4288 -916 53 7586 1391 13711 23560
14730 23560 12368 15954 8969 8049 3708 11504 24074 14372 -8012 -12810 10165 9370 -21047 -26256
14716 -26256 -17525 -8829 13503 13066 13171 24943 25611 9434 -878 9540 1787 9106 16858 7420
14702 7420 6852 7538 13552 22311 29402 37203 32109 23473 20524 17926 2284 4476 889 -17138 -10812
14687 -10812 -11792 -4733 4832 -4254 -2829 10460 -7278 -16094 -23603 -37025 -27677 -42236 -60371
14674 -60371 -51615 -33065 -27931 -5754 9250 -3457 340 3134 -14307 -9364 -6167 -10819 -23311
14661 -23311 -30160 -27113 -16642 -1886 -938 4102 12303 7937 -5166 3515 8426 -9559 -4510 1262
14647 1262 16529 19838 13868 -7362 -18844 -12794 -9436 1180 14337 955 -1880 -5000 1401
14634 1401 11782 14069 6788 -7480 4 15890 7592 13582 8703 1000 4079 -85 -18013 -8195
14620 -8195 5312 13216 12486 4947 1350 10712 7914 -6518 6363 1595 -14054 -26173 -47894
14607 -47894 -41588 -17918 -18220 -12925 -1670 147 -13015 -20044 -19105 -30810 -19382 -9242 -10308
14594 -10308 -26712 -5456 20263 11000 8157 22439 21688 16147 3600 -12232 -21056 -18560 -6075
14581 -6075 -12216 -45024 -33403 -15587 2781 11917 22695 6000 -19501 -21677 -23867 -27792 -26032
14568 -26032 -23742 -9466 -624 6321 8119 18359 19243 10480 10981 24140 24716 36946 32468 34693
14554 34693 36585 21746 2598 -13608 -19159 -7250 -3334 4670 2358 9736 -3446 -18802 -16090
14541 -16090 8060 8907 13556 17739 19801 1199 -4651 -4580 -15865 -15869 -22140 -20467 -7012 295 -2927
14526 -2927 9890 5686 2256 -3731 -1994 -10852 -7832 -4353 -5177 -3441 13758 21413 5527 -12041
14512 -12041 -17650 -11952 1894 -470 -13003 -24540 -5564 14332 20345 3249 -6887 -9682 -11829
14499 -11829 -24966 -12198 3565 -6626 -7810 -6005 -9591 -17389 -26065 -35248 -34680 -14518 15452
14486 15452 11483 12556 21563 20538 18194 13634 11554 6564 5571 7983 -7622 -11106 -1889 -1587 -5109
14471 -5109 4441 -6183 -17472 -10867 7754 19581 15059 15822 3203 -1888 -1472 20073 5714
14458 5714 -11172 -17517 -15450 -27219 -26973 -22141 -15160 -31387 -12232 10509 18896 11322 3710 -7681
14444 -7681 1066 25536 21530 12628 8935 -9421 -19093 -6888 -9217 -3788 -5566 -7729 -15007 -29786
14430 -29786 -32670 -9629 -13140 -17835 -19082 -43146 -37822 -18921 -20395 -11305 2802 2606 9319 5337
14416 5337 -4462 -10771 -18329 -14638 -27557 -21313 -5759 5307 -1054 -3539 -14426 -5242 1562 11827
14402 11827 16808 433 -3753 19945 17449 7918 -191 7956 20836 22402 11988 12000 15030 687
14388 687 -6202 -9826 -4706 -11824 -363 10186 11485 9248 18705 9467 6407 5688 10811 9578 -8423
14373 -8423 -12063 6753 8514 6689 4958 1663 -19229 -15437 2576 24043 20129 18354 19584 10016
14359 10016 1886 -5611 5554 4726 -9289 -1131 3981 13775 16701 26228 4596 -18350 -16066 -21627
14345 -21627 -19294 -10729 -10436 -13985 -1878 1168 -5750 10226 11797 21395 10949 2000 -5870 4689
14331 4689 5979 11200 10480 1194 -7557 -2371 -8080 -28876 -27526 -10976 -2840 1828 -1395 -10288
14317 -10288 -14301 -19017 -3673 7777 3014 -10590 -19629 -10893 5694 6016 -1179 -18086 -23356
14304 -23356 -15771 104 17164 11475 13060 20603 24415 26516 26002 16701 21502 10682 -10510 -10364
14290 -10364 2275 15806 26213 16057 16384 18698 12066 14048 6632 12928 20502 13021 4577 11459
14276 11459 10229 6200 -4030 -28041 -49340 -24708 2239 2290 -2301 -29074 -28828 -6140 1698
14263 1698 -2921 -15300 -6233 -7588 -7837 19039 30241 20329 -1078 -729 -2698 9354 8531 -5324
14249 -5324 10630 12362 -2650 5326 4747 7457 -3764 7048 6432 -3776 -8140 -2844 -2928 5752
14235 5752 9525 16586 -840 -7204 -685 -4127 3822 10918 14339 28259 27547 24508 11579 -7275
14221 -7275 -6372 -8546 -17045 -23962 -28618 -9605 -3426 -5200 7861 27006 14584 10154 -780 14935
14207 14935 23026 15772 17087 15888 15965 17720 16992 2940 9218 10975 -12246 -12790 -11912 -7302 -6757
14192 -6757 -10505 3396 10604 23698 32361 25214 15821 17088 2457 1297 -4427 -8898 -4969 2429
14178 2429 11421 9340 7891 1157 -10551 -17281 -979 11726 4741 -1347 3822 2583 18892 19092
14164 19092 14290 18458 18414 7738 11464 3828 -8166 -9772 -12092 -13019 -14784 -448 13281 14282
14150 14282 11532 7060 13770 17952 26927 29491 21095 6714 -8965 -13713 -16769 -21195 -25052 -24385
14136 -24385 -18749 -12287 -13410 -18344 -28395 -34724 -32679 -14430 -5695 -1295 12191 -1162 4497
14123 4497 3268 1441 -15086 -24932 -32042 -31064 -27152 -13377 -2644 9986 6000 853 -18144 -14864
14109 -14864 -3602 8134 -1011 -916 -4571 -2820 8727 8476 11110 10640 11157 11020 12243 11061 11191
14094 11191 5076 -959 1022 9492 -2568 -19577 -24031 -17316 -2785 -19436 -25743 -10520 -14598
14081 -14598 -16822 -5067 16206 16238 13514 21157 10156 -9442 -11130 7694 20503 10639 -12975
14068 -12975 -24423 -8149 12809 13145 -9202 -19450 -22302 -21729 -15281 -14878 -6025 -802 -4233 4172
14054 4172 -20303 -43315 -37729 -28080 -32363 -39175 -12939 8010 5969 -1355 1542 3994 9502 -6895
14040 -6895 1485 -2793 -23562 -19736 -4800 -15120 -12805 -7516 -20672 -16481 -31282 -18108 -7429
14027 -7429 -796 -5612 9417 8417 -69 12425 12330 14598 19216 11586 8853 19137 11486 13746
14013 13746 13265 -423 5045 3743 4354 10581 8150 11481 16987 7829 3097 8516 14987 8579 18681
13998 18681 10035 -12178 -5744 6879 29859 29591 15912 20695 19190 14551 19077 17288 20080 21975
13984 21975 12321 8299 18723 29627 8934 5039 5607 -4832 10155 7922 7135 -6690 3173
13971 3173 19012 17104 13898 2300 15071 14849 9117 10990 22753 19545 22500 5444 -2384 623
13957 623 18705 24692 19349 22896 27584 18652 4397 -330 -9382 -1293 9156 7310 -2502 -13794
13943 -13794 2360 108 1781 9000 9222 2305 11095 11465 11299 3145 -3505 -3661 -5671 -17363 -31700
13928 -31700 -13011 -8313 -7162 -4506 4967 13830 -9941 -9831 18365 38070 42713 30772 26353
13915 26353 36941 35465 14128 17905 12621 -1387 -17509 -17770 -9959 -17197 -20955 -787 7909
13902 7909 10557 17318 23513 17177 27455 28069 8460 2975 785 -6636 -5994 13525 17782 6561
13888 6561 12018 3267 4073 7591 -1586 -9090 1355 -6397 -13672 11299 1886 -4952 4618 13115
13874 13115 12827 -7535 -23456 -36984 -38558 -33024 -30890 -16471 -9907 -5001 6106 -3049 -12036
13861 -12036 -16183 -4495 14285 10821 6312 3830 3060 14525 13075 14495 33359 30689 25801 18876
13847 18876 8594 2482 -9602 -14558 -13558 -17196 -6295 -2972 6711 12183 3995 243 -5324 -13924
13833 -13924 -3739 -9128 -2637 -544 4577 16507 -583 12950 19293 9186 7644 -9541 -8789
13820 -8789 -4273 -8051 -5023 -12252 -3573 4613 847 -3728 210 2951 1280 1363 820 4853 9964
13805 9964 -5783 -27872 -31486 -19966 -6337 -17099 -7433 -7493 -10643 7556 20279 26346 13974
13792 13974 1915 6589 -3507 -11710 -19112 -14436 -25502 -22125 -22135 -8330 -7323 2553 -4879 -6197
13778 -6197 9626 13373 -1854 -15756 -30440 -41038 -50623 -40336 -17434 -18941 3672 5533 -7891
13765 -7891 -8158 -10609 8726 19203 -5075 -23906 -13177 7312 4648 521 17574 23698 5769
13752 5769 -19088 -15472 -7370 4682 5909 -1513 -16490 -20019 -23270 -13042 -14540 -33793 -19396
13739 -19396 -3313 10056 15639 11868 4779 7758 12328 -2220 -18230 -5936 2080 12430 14885
13726 14885 4674 13098 16602 7039 -6384 -10292 9163 11923 12425 22853 3870 -3002 10157
13713 10157 -13484 -21129 -16269 -15317 -3577 -15029 -28741 -26807 -10297 13533 5695 -9707 -4008
13700 -4008 9390 17333 20052 2392 -8485 -12587 -4889 3987 7741 7956 6198 -10609 -18175 4110
13686 4110 13748 7427 18569 11755 5769 13345 28758 20967 -5959 -39576 -35144 -28907 -36157 -41313
13672 -41313 -37480 -25782 -18319 -11665 -2948 -308 -651 -5541 -1023 -717 -536 -6482 -4625 -9533 7137
13657 7137 24772 9548 -7198 -15796 7136 19039 4772 2147 2495 -634 3693 -6093 -23378
13644 -23378 -25055 -8351 14512 15524 19594 11433 -2305 -23140 -25512 -12952 -14066 -8111 -5849
13631 -5849 -4737 -4749 -2942 4422 -23679 -32942 -19228 6704 6389 -4815 -11555 -24127 -30948 -29768
13617 -29768 -29683 -22521 -14881 -3912 9173 -8824 -27019 -17431 -21921 -16226 -25161 -21132 -15148 -20374
13603 -20374 -16083 -794 9578 2848 -6534 -15100 -13831 -4996 -20201 -18214 -8943 -11501 -18536 -26462
13589 -26462 -13872 -6581 -12983 -7930 174 13781 11437 4484 309 13286 17023 -3051 -6506
13576 -6506 -2343 6853 4702 3478 20682 29711 24771 10563 -1158 -10431 -2694 16406 20840 5236
13562 5236 -20221 -12740 -4764 -14276 -13995 -20659 -25599 -33590 -19284 -13128 -21053 9812 27096 19517
13548 19517 17679 21720 13531 7642 12917 235 5799 -2479 -17810 -10542 -927 16080 18507 13550
13534 13550 659 -8570 3139 10700 -7940 -21902 -41243 -44470 -24216 -504 10280 5188
13522 5188 12911 12713 11798 12512 5888 -12488 -21294 -21549 -3710 10190 17221 30993 33561 15331
13508 15331 9961 14846 24286 18474 11453 3262 -1317 -29839 -42388 -22411 -3642 9640 19449
13495 19449 20662 29678 20752 9491 8319 11697 14358 7664 5634 18316 19157 15719 35175 19278
13481 19278 10611 12447 -6258 -8208 -10345 -15735 -10853 -4633 -16700 -27523 -21260 -22163 -35121 -29176
13467 -29176 -21031 -28478 -12417 865 6262 -5176 -6197 5738 10239 4596 -19047 -28090 -15229
13454 -15229 -8786 -5440 -2644 -3830 -13105 -7788 3090 17425 11952 5206 1103 -8866 2534 -2894
13440 -2894 -19409 -16110 -14101 8919 14082 19036 11593 5321 4602 732 -10513 -15781 -25730 -15251
13426 -15251 -5845 7091 -1735 -3159 3733 13539 9916 21106 27621 19013 9274 -3702 -5195 -2818
13412 -2818 -4588 1243 -2656 -1997 5931 8403 -3855 12603 23239 25208 12145 -4722 -326 3991
13398 3991 9410 2302 2445 11874 11018 7061 8309 1599 -2555 -10193 -7777 -15400 -4771 -6950 -13357
13383 -13357 210 4360 -7216 -12569 -18034 -15568 393 5696 -3424 -625 1661 -4321 -6844 -3338
13369 -3338 4388 -6051 -10077 5405 17656 7463 -5187 -17738 -26789 -26439 -20204 -23773 -12205
13356 -12205 -155 3959 747 -17363 -31209 -43166 -26799 -3332 9394 3065 -7041 3969
13344 3969 -3948 -1579 4297 12139 14985 15746 14613 2716 10622 12465 10108 16932 11052 20681 24240
13329 24240 14822 19074 16577 17064 26508 24436 21732 18027 21926 20000 14156 5211 -911 -4886 7006
13314 7006 5350 -7571 -10704 -11223 -6389 12076 9805 15171 8198 -1475 -5958 -3709 321 12239
13300 12239 23360 24794 9712 381 -309 1817 -10267 -23312 -23096 -6833 520 -13272 -11390
13287 -11390 -4861 -20102 -26890 -16023 -25575 -26596 -19708 -6513 10516 206 -5205 -18334 -19284
13274 -19284 -15311 -16939 -24975 -12677 1887 8494 19210 14443 -10798 -25763 -26677 -5855 12512
13261 12512 13881 12644 18740 15830 6994 5536 13054 3112 7595 16496 8295 9343 19403 13188
13247 13188 6507 -4713 -6875 5295 14114 14697 19359 14899 19404 23750 9942 -11580 -24215
13234 -24215 -20541 -7930 8782 23707 16855 19045 6337 7746 8430 -10466 -14889 7477 14993
13221 14993 17852 18910 5139 -2268 9141 14877 25978 19594 302 -4957 -19420 -29330 -20412
13208 -20412 -24601 -15979 -7250 1779 -9246 -11705 -6642 -3633 -6475 -15897 -18458 -32234 -24755 -6354
13194 -6354 13225 21776 14794 -19386 -4222 6973 3969 -6524 -8121 2794 4794 -6995 -18958
13181 -18958 -17402 -17020 369 16248 -1779 -13528 5005 6472 -10375 -19031 -20606 -23599 -21247
13168 -21247 -14099 -13391 -2806 7237 17311 22591 34079 7747 -11363 -17497 -3211 7741 -229
13155 -229 -359 1505 -1485 22633 29909 17595 13249 13763 16936 6057 -4511 -13463 -17555 -30033
13141 -30033 -15251 -3080 4734 -766 -11460 -14936 -14107 -4198 -12996 -26833 -12293 -5220 -5317 987
13127 987 7286 15717 8314 6265 331 1633 -16965 -12255 -6260 -356 5018 5045 4779 13368 3846
13112 3846 -290 -19671 -9138 641 4150 21145 20131 16401 24294 22789 11837 -1615 -22207
13099 -22207 -7349 6740 651 -3823 -11188 403 13597 12356 5124 22721 19776 11617 7365
13086 7365 21258 13465 7890 -4218 -10391 -16439 -16657 -17324 -25421 -14160 -15271 -4631 -16830 -15035
13072 -15035 -8324 11284 21570 12317 5665 -8387 -19510 -18065 -4230 -8905 -12067 -17622 -11104
13059 -11104 -7637 -6828 6422 25059 19374 5205 4543 7592 1960 6034 -2101 648 -10102 -17845
13045 -17845 -20050 -22246 -5389 -3214 -4302 9198 25091 26341 32478 17367 15232 12403 12175 14448
13031 14448 21107 27490 20645 12950 -6030 -10349 -3197 570 -16559 -13071 1574 1393 -7732 -13492
13017 -13492 -6851 2737 16664 9966 5793 8498 11024 19464 14711 19328 9145 -8109 5899
13004 5899 2858 4633 6740 12018 7219 1257 -2182 16530 13203 7745 6675 4418 -3792 -13413
12990 -13413 10207 16863 14456 -2669 -8069 -4912 -2596 1662 -2491 -3919 -4819 -10035 -13371 -7474
12976 -7474 3042 -25928 -45383 -31515 -3074 -347 1993 12598 5527 5146 4827 -159 -17574
12963 -17574 -8380 7893 8221 229 -11307 -13807 -8132 -3963 7349 -8831 -37945 -32654 -12042
12950 -12042 -3809 -790 -6967 10324 15579 25181 21118 -1216 -21087 -20797 -12683 -21132 -25038 -26071
12936 -26071 -21867 -9436 -6925 -15437 -29680 -32702 -31010 -24018 -17122 -9756 -1455 5781 2309 104
12922 104 16020 20852 10601 3476 21055 32088 36478 14179 -3910 -5332 8750 9293 -1637
12909 -1637 -6916 -1875 -6524 -8558 6417 3973 -12276 -21755 -13830 -3622 1120 11324 19939 11945
12895 11945 -13638 -10568 -6339 -2356 1812 -4838 1451 3979 18389 24335 12891 14352 16369 3522
12881 3522 115 9179 9643 3028 -1363 20418 37605 30376 14703 5004 1407 4258 958 -15736
12867 -15736 -18693 -27517 -30005 -21895 -17254 -6609 3440 12134 9644 12765 11117 862 -11136
12854 -11136 -27121 -17709 -23262 -14161 -12094 3488 6261 3181 6117 6915 3202 14891 25074 16481
12840 16481 4603 -3424 -6937 -10441 -27063 -34213 -18299 -25577 -43454 -37844 -35666 -41321 -27372
12827 -27372 -17198 -4394 5826 -8162 -19768 -12305 -3588 1503 15277 24102 19519 -2614 -8481
12814 -8481 -24772 -14873 711 8550 7011 -409 6 9961 -3076 -15197 822 9452 -203 -18547
12800 -18547 -19392 -11528 -9482 -10337 -1717 4947 -4486 5586 13029 5796 5645 -4961 -12989 -2494
12786 -2494 -22400 -33035 -14580 -3235 1945 -6192 -7721 7023 2602 -3420 11717 14372 5792
12773 5792 6149 -5345 -21264 -22449 -6556 1010 -11883 -16914 1178 -643 2770 16571 19633
12760 19633 25323 32103 25294 -5992 -12870 -12059 -29704 -25784 -23958 -17188 -23960 -36965 -38864 -41118
12746 -41118 -25203 -19629 -22428 -21368 -11676 -16261 -15220 -3396 6858 5967 -8987 -17900 -22074 1478
12732 1478 15041 797 2497 18482 18451 7807 1521 -12155 -33066 -39547 -35315 -4825 4787
12719 4787 1334 -454 7857 23731 26983 23622 25859 3492 -8471 -4646 1499 -2386 -3799 -2073
12705 -2073 3437 10741 6284 4543 1217 -628 -36 -3741 -3550 -2590 60 2683 -3543 -4189 -17141
12690 -17141 -23592 -3962 -308 3088 1002 -9759 -18389 -16510 -13734 -2828 -8309 -6069 -19037
12677 -19037 -24102 -11147 4294 12139 4103 -352 2199 8243 -103 -2581 650 -18986 -29584
12664 -29584 -22717 -6852 -186 -3068 695 2221 -11195 -31417 -30806 -34410 -37184 -41770 -34378 -18882
12650 -18882 -9417 14 9906 13630 11564 18062 10630 3053 -942 -407 -13807 -11159 12063 -7678
12636 -7678 -34125 -30292 -21512 -13901 -17037 -4879 4081 -6776 -10743 -5182 -11165 -18254 -13815 -3701
12622 -3701 -8232 -12931 -23062 -12413 11971 8845 2933 -2382 -13780 -14834 -14058 -7526 -2079 -2501
12608 -2501 13548 17125 -6740 -42502 -41255 -24254 -1533 425 12881 6499 18893 22082 12193
12595 12193 21635 28146 40725 44068 24467 22149 38921 28512 22135 18164 6612 -848 -2491
12582 -2491 6032 9501 38706 56452 56510 56687 49746 64696 65330 53577 42619 28310 1085 891
12568 891 14911 23770 8534 20972 36624 34893 36439 51108 37060 13236 2815 -7823 6793
12555 6793 5353 12492 3379 6787 15133 33535 27168 23116 30395 45552 59665 51246 57194 74042
12541 74042 82905 83937 87010 77980 86809 99299 115664 149296 165330 158355 147428 123885 111643
12528 111643 103450 98581 102647 94253 82579 63222 60091 71673 78372 75742 65817 67948 69789
12515 69789 75150 81763 87807 90166 105967 118682 116673 119406 135122 155157 153304 148101 149269
12502 149269 150547 142565 106357 102173 106604 106013 107143 101765 96097 108760 133093 147280 140514
12489 140514 128388 113261 115981 125803 125588 122951 101440 91238 96399 94218 81744 70960 68785
12476 68785 77962 105823 109173 96843 77346 80500 82112 85611 87553 104471 115352 121666 111816
12463 111816 101016 99131 109517 126742 124282 127665 118018 107156 88525 88890 102575 107585 102318
12450 102318 93270 74423 60605 50316 51243 62330 69073 63419 47151 51677 55265 53453 44247
12437 44247 25179 21588 23685 27752 14164 17316 3815 9012 17150 20438 23274 21529 16085 15832
12423 15832 5834 10480 5481 14544 23585 44992 48470 40952 20580 19383 30422 7935 16120
12410 16120 13635 11662 83 -5831 -15813 -6752 -3761 -14192 -12091 -16372 -25647 -16674 -22159 -18304
12396 -18304 -5015 -8639 -1406 9223 -550 -10698 -13947 -3335 5446 -6677 -6732 -11085 -14441 -22817
12382 -22817 -23983 -16077 -5030 554 7666 -5465 -4461 -13859 -6178 -7685 -9950 -10568 -1466 -13898
12368 -13898 -37276 -44247 -24422 -853 13839 11169 -2240 -18207 -20124 -23320 -17905 -14017 -11815
12355 -11815 -18447 -31418 -21622 -386 12385 13010 6417 1517 -15821 -32122 -13596 -3225 -6159
12342 -6159 -2494 -4144 -2829 5349 2907 -8271 -18365 -20353 -4635 1745 10564 7733 685 9480
12328 9480 15586 -241 -6489 -1171 4998 1712 6665 4849 -7733 -12102 -565 18422 11358 -4214
12314 -4214 -4391 -11306 -26266 -22161 -22147 -15841 -235 -8231 -5606 649 -9083 -10459 -13352 -9911 -8262
12299 -8262 -30291 -23634 -24108 -13294 -5263 1066 -612 -13091 -6863 14949 15225 12477 9726 5905
12285 5905 -1858 -11169 -17908 -20641 -22479 -22527 -28059 -18650 8685 8899 -1166 2181 426 -15208 -4915
12270 -4915 -8546 -12748 -9201 -9959 -3803 -7427 -2328 -7610 -15622 -24156 -7065 3015 -17752 -29948
12256 -29948 -7019 4409 -375 -5164 -3954 6974 2203 -6283 -7742 -32098 -35399 -34424 -30045 -22562
12242 -22562 -19821 -16531 507 -781 -158 -7572 -30393 -13609 -13961 -12343 -8108 5756 22147 12477
12228 12477 2715 607 14941 37656 29622 9430 -3601 3954 502 -17794 -23566 -16205 -1437
12215 -1437 -6008 3328 2135 -2075 7957 11082 4 9362 21506 24662 34810 22755 -3165
12202 -3165 -8797 -9772 -16853 -18044 -15717 -15802 1021 -5741 1324 19666 23163 9690 -3475 2555
12188 2555 4256 -13566 -16672 -12421 -1893 6002 12301 28575 14422 4212 23217 28105 23893
12175 23893 27040 27168 -3425 -20141 -25353 -34352 -27236 -15226 -4126 -3104 -11576 -25417 -40249
12162 -40249 -28256 -17232 -21632 -13287 12209 7849 -13491 -24257 -6222 7839 4946 1983 3751
12149 3751 4960 15789 26322 50446 42249 24250 8531 7170 15464 31234 58038 61175 45339
12136 45339 32780 35655 34984 30040 30631 38183 34390 33368 29856 32433 35183 17942 17352 40074
12122 40074 60404 43251 25861 40707 33732 17209 22436 29270 39579 23318 13731 8097 12477
12109 12477 20727 26377 28078 32109 30644 32491 35862 38684 25719 25754 20697 -513 -319 12550
12095 12550 12027 9544 12874 -5555 -15403 -15610 -8974 13255 24142 10654 -2046 -11855 -23483
12082 -23483 -24008 -4720 2947 2601 448 -4068 1639 -3559 -13686 -12790 -12089 -7019 -4971 14149 7882
12067 7882 7786 -3665 -14592 -14607 -7057 785 1878 -17632 -16487 -5533 -9244 -11132 -18071 -5094
12053 -5094 639 12510 12419 11818 15809 881 -980 14051 10204 -901 9188 15704 23109 31516
12039 31516 23075 28583 30251 22824 16770 12380 -1145 -327 -4158 -12201 -12755 -15896 -18953 -17846 -8905
12024 -8905 4335 -9469 -6297 6917 11968 9702 15353 2871 -7960 793 2028 8994 10030
12011 10030 19025 15426 5128 -13471 -7788 -7812 -17231 -22626 -13626 10495 35232 31887 6183 15051
11997 15051 29004 22033 13689 8429 -2730 -6131 -9725 -18600 -19474 -4785 20919 17247 -5397
11984 -5397 -23162 -40202 -26892 -28302 -20715 -11470 -24653 -27605 -19793 -10690 -6441 -3148 -6577 -13528
11970 -13528 -12305 -12827 -17196 -10182 -17423 -13502 -13832 -17993 -27877 -25867 -19908 -18609 -2686 -4091 -8109
11955 -8109 -7518 -510 -7799 -5470 -13125 -3263 3071 11532 7701 -11051 -21477 -19431 -20416 -31176
11941 -31176 -26509 -31879 -30634 -32777 -30971 -21321 -8382 -5214 -2953 2133 -3280 -18642 -32566 -28132
11927 -28132 -16302 -6674 -4409 -5137 1345 12780 13444 -10031 -23331 -14686 -8082 -15366 -9486 -13990
11913 -13990 -20296 -23841 -25542 -21625 -39555 -22636 -14314 -3930 3526 5240 -5345 -8830 -1502
11900 -1502 -4490 -6680 -11547 -2893 -3508 8275 -2264 -14715 -12635 -21198 -14166 -14305 -15627 -18139
11886 -18139 -8948 8943 11976 9774 9166 10308 -12634 -27773 -23062 -9104 -18240 -17263 -12629 -18230
11872 -18230 -33683 -34838 -24540 -25542 -30696 -28921 -25458 -28211 -23886 -20256 -18702 -18032 -8366 -5765
11858 -5765 6928 -4348 -20962 -17046 -13189 -17837 -18871 -17875 -2421 397 1471 -2361 3438 20172
11844 20172 25264 17004 2734 -1182 4825 15735 28319 16584 10610 -118 1786 20022 6102
11831 6102 16900 22548 15027 4609 12469 10793 7854 -5649 842 25555 20465 -717 -4096
11818 -4096 5630 15339 20495 -1197 -3177 -2569 -4870 -3901 -18814 -17619 -4713 -15361 -25736 -26739
11804 -26739 -27078 -9011 -6227 -2241 11045 12233 -4898 -20597 -15322 -9865 -15404 -14391 3309
11791 3309 4529 -10165 -12276 -14173 -14634 -14627 -17339 -13722 -11347 -3562 -23448 -24570 -23992 -13280 11137
11776 11137 -1534 -10959 1011 5218 -2388 5671 11212 924 2508 -3025 -18349 -17435 8922
11763 8922 -10866 -23839 -10794 -8647 -152 1505 -11673 -14217 -20781 -17238 -10748 -9463 -3982 9286
11749 9286 9980 14724 9860 -4219 -10193 -13148 -7386 -1211 -3968 -9004 9600 9752 7652 7599 11088
11734 11088 19290 16758 5268 -15121 -34833 -41684 -38617 -24488 -14951 16489 -3574 -18859 -25201
11721 -25201 -20875 -11404 2139 -1906 -11307 770 1855 -18298 -4966 -11483 -14444 -3176 2023
11708 2023 3410 -725 -8030 -4694 470 -5200 -198 12151 12980 7876 10840 11583 -4347 9752
11694 9752 24523 19103 903 -3783 -15382 -3892 -12203 -12055 20571 20683 26917 12223 -16804
11681 -16804 -24307 -2573 10338 7163 3021 12139 23746 7442 -8902 -15809 -31166 -38282 -31859
11668 -31859 -12420 -23555 -20657 -12846 -10501 -5722 9594 2189 -19800 -20161 -14463 -9044 -8193 -8226
11654 -8226 10473 20832 -820 -10702 -109 -1250 -3222 -1901 26849 44748 45376 37651 25694
11641 25694 24630 21750 25959 25464 16352 9554 15766 6613 -17551 -13674 3872 5754 8250 -72
11627 -72 -9515 -31644 -19346 -11693 -5172 2255 -4014 -15981 -15427 -6928 -6491 -5657 -12345 2434 7342
11612 7342 10656 13489 8071 5025 5809 7842 6028 11398 -2224 -16349 -3783 10064 247 -3130
11598 -3130 -13018 -19481 -19263 10607 35748 32578 10307 -7456 -6863 -6309 -198 10138 6337 311
11584 311 -18517 -17749 -16806 -10929 -21754 -18325 -2402 -2783 -26894 -27756 -25223 -28367 -12165 -2378 -974
11569 -974 -2052 -14299 -20302 -2835 28256 26793 -8981 -22133 -17335 -693 7228 -5795 -31933
11556 -31933 -33185 -9789 909 -10433 -14413 -17403 3844 1358 -12161 -20773 -25908 -31624 -25051
11543 -25051 -27952 -20765 -14689 -10327 -6476 -17637 -16181 -12003 -19777 -31620 -27374 -18926 -13195 -13917
11529 -13917 -26523 -27143 -32191 -42254 -52666 -40524 -30586 -23537 -19485 -4556 -15873 -12085 -7075
11516 -7075 -17306 -19649 -11384 715 -3401 -48 -16620 -19863 -17851 -21979 -25862 -23344 -15632 -10469
11502 -10469 -54 11290 14603 14413 23090 16274 9752 -8610 10591 23937 21835 16874 9126
11489 9126 1205 13062 16037 -8445 -3619 6216 8457 13304 17119 6051 -10823 -25379 -20694
11476 -20694 -28338 -20113 -3753 13258 13470 -8814 -16334 -17243 3205 6736 1220 -2337 10744 8053
11462 8053 -11086 -30492 -22313 -15518 -14229 573 10431 8429 16854 7110 9763 5272 383 -645
11448 -645 11727 5441 -18600 -16937 4337 7374 12575 28749 21190 5767 -8899 -637 590
11435 590 15911 25324 28212 34721 31381 1842 -18558 -20447 -10111 -6502 -9621 -19202 -16726 -11632
11421 -11632 7226 23362 8575 -12006 -18405 -23305 -5727 18359 32282 32787 24526 16522 11837
11408 11837 1761 -5404 -12202 -19472 -21568 -23465 -11765 -4124 -1418 -9624 -15267 -17567 -31067 -28252
11394 -28252 -16005 -8059 -11743 -4244 4851 17113 9327 884 -5621 -5622 -4574 4056 -1797 -14390
11380 -14390 -38932 -51047 -59485 -39053 -28991 -8754 -14942 -25090 -31182 -22289 -7218 10736
11368 10736 34184 27593 10174 -10498 -8380 -5586 -354 -2863 -6527 2717 -2357 -10041 -3728 3939
11354 3939 5164 -8145 -21178 -20996 -7045 -14489 -25889 -29033 -28549 -32006 -31847 -31629 -24825 -22252 -30954
11339 -30954 -25805 -24788 -12306 -7871 -7719 -4677 -17454 -27033 -20289 -5412 5265 -4029 -2315 3954
11325 3954 7367 16432 30420 19085 -4552 -7842 -14792 -16092 -17486 -6319 -4813 3732 6184 4437
11311 4437 -1955 -15788 -10723 -9394 -8106 2517 25046 19644 7454 -270 6848 16136 17410 24445
11297 24445 16751 7338 -2251 11534 10859 -14769 -17921 -22588 -11582 -2291 -19837 -33711 -26581
11284 -26581 -19042 -18389 -18353 -15785 -8846 -12504 -1898 -16112 -34453 -22081 -15310 -16436 -18256 -2209
11270 -2209 -5365 -27380 -26276 -8881 5011 2891 1220 7799 13963 8222 1412 -12754 -24538
11257 -24538 -24403 -27316 -18659 988 3564 8850 -1371 -9619 9768 4375 -15204 -32502 -24040
11244 -24040 -25954 -27372 -978 15300 6172 10018 10726 15669 12840 318 2502 -3661 126 -14561
11230 -14561 -13822 -18542 -23155 -13833 -8016 -13375 -8944 -10048 -740 3547 18808 13664 6350 -9230
11216 -9230 -18675 -6533 -8133 -18575 -19224 -7814 -6012 -2873 5284 4646 3307 12987 9857 -670
11202 -670 -2476 4707 16939 14638 3947 7072 -4620 -24815 -29418 -16088 -15631 -17532 -14536 -8370
11188 -8370 -10133 -24794 -11309 -4879 -12119 -13325 -132 -3889 -12659 -18795 -17618 -2728 -2134 2795
11174 2795 -8698 -9533 -11154 -18892 -28562 -38349 -37330 -20769 -19835 -13987 -20420 -13832 -14678 -19855 7654
11159 7654 23034 12020 -11165 -10706 -548 4383 -2543 -7564 -13996 -27046 -36335 -7458 10335
11146 10335 4199 -5569 -458 -5556 -21441 -17818 -17884 -2017 10786 6192 -7586 -8894 -15804 -29180
11132 -29180 -29743 -24314 -22499 -28462 -12673 -6556 -14563 -18873 -7076 4970 17681 13542 7977 6485
11118 6485 -3726 -10255 5269 4082 4204 -14371 -29291 -28941 -9440 -7240 -6720 -17818 -24863 -31943
11104 -31943 -21692 -5332 1330 2328 12007 11796 2579 -9235 -17157 -10029 -12583 -15537 -11449 -4693
11090 -4693 -2555 -13449 -39631 -42306 -26334 -18721 -22734 -23490 -21914 -2366 13189 3371 9256 9570
11076 9570 7462 4681 -10586 -9476 -5929 -2169 -9272 -14335 -20655 -20211 -3331 -20847 -17295 -913
11062 -913 8123 -9941 -4378 -7608 -8315 -12503 -10992 -14445 -9853 -6351 -13645 -27672 -26817 -27003 -23804
11047 -23804 -19899 -26499 -37203 -20433 -23499 -21872 -9824 11046 25089 21564 17208 795 -12387
11034 -12387 -10742 1782 -5742 -14967 109 -2009 -16343 -16624 -1715 10912 12999 -3632 -24696
11021 -24696 -27751 -15616 -7075 -7908 -2622 -4389 -18274 -27966 -30732 -30278 -21252 -14693 -13093 3940
11007 3940 -13996 -30413 -39106 -29408 -13838 -8837 -2345 5220 16421 3460 -7296 191 -6055
10994 -6055 -9360 -12062 -14046 -185 -5093 -2629 -12848 -28972 -16033 -19958 -21479 -21117 -31510 -36249
10980 -36249 -48018 -36523 -27129 -40645 -39806 -33230 -21098 -8309 -20193 279 15350 8503 10403
10967 10403 -3819 -16693 -10853 -20306 -32779 -25214 -12746 -1530 4741 4720 12950 9982 -2546
10954 -2546 5995 8959 6624 9765 10749 23168 16164 14861 15525 12183 6707 -7105 -11289 -15874 -6011
10939 -6011 19695 16166 17306 26443 16599 -9576 2493 1998 -2981 -14528 -20989 -12669 -8767 -11645
10925 -11645 -6449 -2245 8629 18773 19814 3308 -15085 -11385 -14639 -31823 -38732 -34286 -20773
10912 -20773 -14893 -28731 -27100 -10610 2034 8227 13596 -3810 -16097 -13289 -16419 -20537 -8255
10899 -8255 -243 1848 2476 4670 22639 28637 13916 15705 18638 7260 4368 149 16363 11277
10885 11277 21626 26692 23407 25570 17307 3182 2258 -12271 -4413 19286 30944 19183 8191
10872 8191 -12227 -20164 4846 19204 23341 22470 22939 37561 30527 18962 6285 9915 4033 3919
10858 3919 -7529 -12212 -3245 19883 13262 12049 20093 18393 22742 26150 31189 28856 4054 3011
10844 3011 -2879 -3610 -6088 -3253 4589 -1033 -12673 -4105 -3897 9382 6051 11932 10522 -933
10830 -933 -22775 -22742 -17964 -11872 2003 -1949 -5970 -8132 -10753 -11943 -4137 -9772 -5018 -9066 -6288
10815 -6288 3975 8187 -1681 -10688 -1388 -3128 7563 8377 10223 -151 -2796 750 -3530 -14713
10801 -14713 -10902 -6631 -15372 11404 36409 28074 15612 22357 27729 24952 3994 -2127 -3782
10788 -3782 14211 38574 34765 12862 -10950 -8688 -4047 -19363 -7182 23237 17522 5719 7377
10775 7377 9468 12057 -3918 -9925 3181 -16093 -21316 -14176 -782 -5991 -155 11364 7951
10762 7951 16369 207 -6243 8107 16392 11187 4921 2759 11640 25156 27006 27899 29179 5673
10748 5673 -1269 709 -5376 -11397 -5494 2655 4763 6299 16153 7031 -4546 -12090 -20395 -4233
10734 -4233 -11582 -5293 7612 3360 2717 -2116 11870 29102 34685 11929 1145 -1817 12962
10721 12962 17977 7421 15956 16077 8544 -3907 -15774 -5098 8412 6410 2285 15808 7534
10708 7534 11933 22170 19225 9404 18826 34720 48849 71824 83311 110366 107156 120952 159612
10695 159612 225186 294883 357236 402174 412701 412426 416145 390763 379236 338773 264967 204123
10683 204123 150521 102264 84267 77896 59297 46411 28892 33417 31851 19947 21228 43087
10671 43087 66809 54479 60008 77128 79007 65409 57555 60851 56358 65265 90287 122773 167987
10658 167987 225660 292496 374194 460192 515604 515890 485967 416439 329856 251814 193106 159454
10646 159454 119889 104958 86662 50692 39685 50768 55197 44520 24505 -9714 -6573 9834
10634 9834 43434 41652 20737 19052 21725 26367 33085 38147 26117 20815 29702 33150 28897 18446
10620 18446 5490 10785 13743 13645 11044 17379 7716 -15126 -9165 4854 10027 25576 18392 10184
10606 10184 23145 33359 22328 13259 15663 18838 19558 13016 19320 27009 27835 30881 14112 18097
10592 18097 30128 24435 25065 32714 39893 47987 52652 57426 51577 54029 38489 24748 2402 -8240
10578 -8240 -8541 9644 15020 19413 17226 8128 13463 21416 12561 -6691 -5799 -5293 6306 11363 9342
10563 9342 8219 12671 10456 16171 17413 10081 13513 33635 56619 46707 31734 39598 41987 10692
10549 10692 9105 18786 25278 32642 39897 42381 57752 78396 81664 92641 95526 96396 83993 74726
10535 74726 74150 75395 57107 44429 28326 11229 13680 17016 16023 4830 -5154 7811 12642
10522 12642 15103 28477 35067 44735 45701 56305 42868 40530 48522 62246 62699 59555 83815 98745
10508 98745 94610 85105 70469 68395 60374 58858 44885 25986 19755 23140 20643 30276 43579
10495 43579 52688 46454 45384 39860 29899 37538 35493 43448 72890 93800 119113 128494 125277 130682
10481 130682 128225 122315 129462 128733 124004 145006 162968 164185 171330 174285 179146 201442 207433 199408
10467 199408 185931 164695 167520 161951 137174 116832 112835 109996 104017 84951 72399 69357 59949
10454 59949 50956 39994 38924 46281 43761 41817 54025 48426 48176 54734 58579 70256 101959 130729
10440 130729 147702 177166 177275 178301 180528 180379 181245 165738 156630 127047 96463 85147 97682
10427 97682 109064 112819 118085 107662 90726 79254 86511 82863 89747 106271 105430 87530 72859
10414 72859 67433 74312 86834 93988 108826 115593 124383 138499 138903 146693 140157 135086 140481 127832
10400 127832 121227 109287 111292 124487 123150 115306 118628 114795 119391 109315 91425 96032 109048
10387 109048 111844 113660 124169 138352 140624 134907 130892 120280 119070 131013 140150 136560 132764
10374 132764 136366 126008 111489 124917 134737 135288 127736 137559 147086 138631 143553 149065 147561 140292
10360 140292 153239 169726 188802 211271 212814 201346 221714 226066 231106 247287 252211 245337
10348 245337 254096 259618 260199 257720 262049 249487 251457 260687 270242 269980 284089 310144 323621 336674
10334 336674 361539 385412 397547 405150 399893 415037 426276 447182 460811 484172 509730 549910
10322 549910 563972 589090 651028 694032 734077 788831 854148 912649 975255 1055659 1167501
10311 1167501 1318314 1501062 1713012 1954509 2190610 2441047 2752408 3099444 3514727
10302 3514727 4005500 4572117 5224574 5971774 6872535 7944954 9239488 10889023 13086765
10293 13086765 16135376 20528993 27027190 36363998 48230031 60203288 68774053 72431205
10285 72431205 72983388 73015545 72397767 68680416 60302396 48685616 36870281 27275510
10277 27275510 20636452 16374134 13631799 11788915 10527189 9679381 9119071 8828393
10269 8828393 8803495 9063193 9592987 10382545 11386387 12640928 14257517 16480197 19656482
10260 19656482 24396286 31634928 42311691 56420478 71796130 84721861 92007463
10253 92007463 91784309 83786709 70047408 54261271 39895673 28884924 21374056 16473793
10245 16473793 13209459 10893297 9173635 7808146 6682781 5757174 4993698 4385978
10237 4385978 3894601 3518582 3237424 3031582 2869015 2690624 2479683 2272689 2066582
10228 2066582 1851804 1662988 1528498 1399288 1281093 1186736 1104535 1029408 959873 893698
10218 893698 844553 801409 753990 709917 684557 640198 598993 572230 553593 522172 495903
10207 495903 467822 454442 433361 420942 412214 396812 376993 365645 357533 357224 355669 338453
10195 338453 320802 304806 293376 294949 288841 281975 266300 267097 275046 264045 244249 224241 219887
10182 219887 235294 249072 240464 225373 232758 226353 218961 211101 185033 188999 187890 183740 174668
10169 174668 181815 196834 193253 185271 194162 185985 179554 169011 167836 176636 171505 166305 152979
10156 152979 145277 148172 157026 163762 155072 150098 155847 168821 164891 154680 146734 142972 125769
10143 125769 110755 101303 95923 101376 87300 83832 85475 95696 98301 98605 108880 113700 114197 126553
10129 126553 119508 101171 110733 120847 117601 116610 134173 119571 116918 116332 98532 77595 60428
10116 60428 46835 59489 50775 42248 41988 53028 65973 66763 65245 75843 77293 68652 64658 73789
10102 73789 69357 65528 68139 77272 87392 87958 87325 96782 89611 94766 96168 109225 101747 84774
10088 84774 93403 110445 101203 80577 77923 68862 66952 72401 54393 41441 59567 61109 57992
10075 57992 55636 36627 34641 61268 79806 72090 71923 59702 39154 26865 29668 37793 59282
10062 59282 57997 55669 50135 39794 35840 35081 44507 53721 55573 52200 43029 37437 20220 25549
10048 25549 42112 56079 52119 38351 32261 34604 27027 45726 54914 57869 49240 45745 47130
10035 47130 46942 60522 60075 62748 64330 70292 51489 37132 24807 23852 34949 51059 39434
10022 39434 46825 55549 66857 57603 34512 40101 28216 17398 11329 35667 48378 39836 17236
10009 17236 16804 25775 16203 10616 7669 15272 20728 23065 26398 20409 25047 31212 40769 41114 27558
9994 27558 30605 31425 15257 12571 22853 17511 13907 5528 11058 20631 17179 22844 19377 9916
9980 9916 1916 17226 30813 35367 51621 51322 45027 24384 17392 25626 23653 23853 36499 26295
9966 26295 14400 14804 15377 20922 25423 45992 52207 47622 30950 20799 28608 30289 35997 27421
9952 27421 10107 6409 22831 13479 22914 32742 39264 51682 45621 48868 45760 46742 40976 34948
9938 34948 26223 18868 29793 27738 30440 25850 17266 19203 30703 33314 22879 7439 3637 17448
9924 17448 14882 26404 21428 27607 41380 35787 32393 43666 50383 40450 40766 38103 40495 32805
9910 32805 46260 63258 68439 60528 64083 77776 82887 94921 98330 107617 125132 146779 148316
9897 148316 144384 138959 138772 144197 137272 123358 108710 92150 98296 89053 76064 85984 98783
9884 98783 91902 104595 125157 156684 200763 265911 326076 395900 441160 434990 423304 412663
9872 412663 400395 356548 309669 244246 205649 165272 134974 126033 111414 81430 58758 61388
9860 61388 65766 67244 90175 105945 128553 161290 213631 253583 320813 392948 464670 508805
9848 508805 514970 478063 428147 358313 293182 223459 177096 128481 95142 70234 71872 73244
9836 73244 58937 57489 51953 32216 14848 26950 50914 60389 47926 31062 30248 26058 33602
9823 33602 44979 56132 62259 59079 46736 32280 14307 10091 16275 26077 15005 18416 30025
9810 30025 28466 36464 30985 10962 -532 15670 29069 39825 29029 31669 25001 33066 45083
9797 45083 50308 41746 27576 15166 30434 27488 30322 27744 33929 38123 45738 45520 44846 43474
9783 43474 30102 19775 17561 13467 15452 33089 30671 23547 18678 19415 21675 32186 37749 37831
9769 37831 41544 49832 53751 48763 40431 17365 -514 14443 35919 31331 35104 42275 15578
9756 15578 -1367 -6821 -17440 -10121 5229 15106 11493 -3897 -17324 -9410 -5223 5973 17270
9743 17270 33653 35587 25403 33277 36922 30022 26976 29149 17446 13664 6645 3540 18253 27365
9729 27365 17213 -5006 -8386 4404 356 -7103 -7163 7300 -579 -7079 16098 51564 48447 31014
9715 31014 13658 -6096 -12991 -6375 -5983 -212 -6502 -4458 21786 36024 41322 49379 44437 35002
9701 35002 22815 7873 -6152 14049 37702 29893 21370 14084 15404 14637 18053 17346 25504 38778
9687 38778 42977 48163 44706 33003 29253 33166 25928 11133 16781 23418 15029 8709 26296 35593
9673 35593 38266 45963 39508 39281 34977 15307 -3179 17293 36621 55732 53925 40046 24100
9660 24100 35495 44260 40218 17829 8521 9887 12593 15569 24262 18132 3964 -9040 20795
9647 20795 35066 48081 43059 36482 27994 26234 42728 41717 47098 38719 14931 8441 9972 11825
9633 11825 17951 16884 18829 18865 25377 33772 48727 51005 28587 26901 44768 54052 62905 67208
9619 67208 41310 24270 34857 29976 28698 31688 37816 43635 40724 12296 -1034 5367 10270
9606 10270 12732 18569 30837 22428 1980 -8396 3563 10893 27084 22879 31683 54982 40551
9593 40551 43637 38704 46965 36149 40599 37871 19207 9876 15008 5632 7873 15697 14947 637
9579 637 -8947 -15211 -16706 2579 20897 16263 2617 -2847 20725 31448 28442 19236 20438 28979
9565 28979 40347 26884 11880 -6822 -5427 2062 3023 -3506 -9512 6142 24389 23180 14167
9552 14167 25715 35773 35058 19145 14127 10081 23095 27035 14590 -5958 -24236 -16413 1526
9539 1526 27007 22626 14128 8277 21931 38275 40524 33946 43254 41013 39900 24433 10398 11626
9525 11626 18976 28505 25002 35765 29559 21592 29115 21425 27425 32253 28554 23034 9047 3835
9511 3835 13705 21586 15476 18376 27495 27098 33567 34029 17118 20530 22016 12127 9801 17725 30248
9496 30248 38362 47344 31582 16264 14328 29758 29142 35377 47726 45333 45545 33040 41558 69693
9482 69693 56897 42419 33357 10604 9495 16413 29423 33573 27471 16930 28906 28749 24292
9469 24292 20344 14899 18134 28908 38599 29473 25242 38642 42340 38466 35386 19869 22418 23268
9455 23268 35770 40002 32772 36684 30769 24727 35339 37400 34509 31658 30276 55265 54427 42554
9441 42554 47652 51866 38951 35688 22339 37920 54430 49514 48792 48975 48742 45194 37776 11723
9427 11723 7959 30395 46677 30464 21690 27615 21220 26504 35287 29132 17696 23082 30935 37737
9413 37737 32601 26320 6491 10085 23337 8652 -401 5324 23441 36407 34444 23069 31559
9400 31559 59295 64724 47661 45309 38258 47352 42964 34132 42037 47748 62575 59474 51036 47825
9386 47825 52967 48395 35887 32429 43574 50314 40726 56186 64351 70460 67452 82445 79045 73081
9372 73081 75808 51041 30491 25318 21090 33510 50187 42976 49017 31013 9817 32683 53951
9359 53951 54948 47454 37090 26310 26961 36927 35733 44830 60791 73602 71097 64654 78476 93128
9345 93128 82550 87558 86134 88979 79889 70941 85396 81311 78395 82335 74134 64589 68902 79917
9331 79917 80043 81143 73030 83616 72809 64444 77997 77004 64993 54616 67348 65167 69242 90831
9317 90831 93412 91541 76021 68491 71792 80641 82629 80752 92371 103297 92213 107172 117140
9304 117140 98252 82352 88942 88047 77034 77364 82026 93153 98207 101866 113758 122340 126863 114738
9290 114738 98809 97325 110125 117320 117026 122216 121534 117360 127160 136499 147572 124859 128490 130919
9276 130919 138068 140313 124539 127741 142452 147972 156891 173879 178709 150028 130953 127727 134238
9263 134238 152060 150720 161359 177751 180960 178756 176574 157758 168476 181324 175954 177978 177457
9250 177457 177005 177245 199366 206545 203676 225960 247990 259092 259995 251860 246214 257709 271099 278597
9236 278597 295990 309331 293358 297896 302940 309536 321472 335017 341827 364615 388796 387629 383660
9223 383660 394116 417711 456750 488410 512315 547189 579219 601118 605411 638927 691266 743757
9211 743757 792442 820517 860820 907089 950821 1004782 1070867 1142658 1203338 1259659 1333253 1404949
9199 1404949 1455389 1509397 1578241 1639291 1706237 1761529 1787420 1828057 1862355 1888955 1898836 1889123
9187 1889123 1900381 1903084 1888017 1856372 1811389 1782535 1751088 1714763 1674629 1622110 1558628 1527044
9175 1527044 1516433 1482000 1457380 1453191 1433506 1444864 1496876 1556595 1644800 1728622 1820050 1906388
9163 1906388 1981340 1998252 1951566 1837699 1700425 1563140 1411818 1246106 1091840 957056
9153 957056 855150 767069 698932 649559 589472 550250 516414 490817 452815 434434 403874
9142 403874 379918 355865 339305 344333 347622 344511 330586 319316 305850 304643 300753 291954 268840
9129 268840 257923 248471 260597 271934 259690 254073 233318 231962 235952 224342 226958 229291 224984
9116 224984 204272 193783 186772 186581 206065 202418 172548 164772 146108 140606 149974 154429 144857
9103 144857 144744 139691 143001 151111 164313 181758 187920 171909 173037 173596 175242 161582 149361 151822
9089 151822 150888 156966 142159 133436 137253 121230 121846 112380 109410 111923 113640 122407 129555 141739
9075 141739 132403 121853 124026 108900 112668 104769 126514 158704 187569 212846 205537 172434 157616
9062 157616 153462 146919 145904 152185 169356 165156 156424 143528 137899 146015 143208 140239 142594 139508
9048 139508 138164 149965 146454 136442 127941 118367 115426 115750 121515 122350 131341 118763 105982 128195
9034 128195 154456 160971 167958 168301 170088 169785 179035 175528 183830 195367 202610 218088 254538 287422
9020 287422 333576 370875 380210 349869 309978 265575 218453 178546 162942 159371 143108 132313
9008 132313 136600 146267 145843 149036 136453 144435 125264 123701 122480 112181 119583 154472 144797 112641
8994 112641 119673 120638 131527 135357 137404 131368 117618 109905 95525 91944 112518 120576 116668 111524
8980 111524 98093 92657 87430 95486 108332 129475 127410 131374 111367 99831 125723 137109 148170
8967 148170 153193 160780 161667 152280 123170 109503 96946 106014 118733 131800 111678 91537 104170
8954 104170 112788 101100 110085 135816 150118 146833 166962 171830 171011 152443 133071 127003 128478
8941 128478 125565 144045 157759 165251 166987 159683 135397 134133 144950 145991 139438 126427 123496
8928 123496 118427 103998 86521 88966 81698 71869 93999 119641 159775 188628 192950 191502 214912
8915 214912 229852 236099 251035 248424 257828 250424 267991 275167 262000 260328 263330 280272 285791
8902 285791 279268 279353 275980 291497 297059 284334 285450 300589 304641 299565 272117 274310 287187 293866
8888 293866 279420 270378 272368 280562 280278 294437 284982 263924 263260 279568 271721 270650 282005 288782
8874 288782 300502 320307 325892 319099 316102 323838 322023 316217 320854 334591 355155 365093 383366
8861 383366 397916 404065 392408 384112 382366 383815 386436 401144 436837 449792 444249 456512 487504
8848 487504 509472 522325 517375 513973 534759 561708 582433 609598 645805 669865 693743 704834
8836 704834 719342 743234 774615 805905 819910 820056 843735 868278 889365 903400 928289 944846
8824 944846 967514 993186 1029689 1080512 1134036 1171596 1220679 1260846 1332797 1403406 1487953 1550380
8812 1550380 1593668 1655629 1722399 1798313 1881872 1968837 2031940 2127616 2239008 2334052 2446434
8801 2446434 2577320 2752761 2941879 3131929 3356888 3589440 3842374 4159606 4513875 4908436
8791 4908436 5358153 5880256 6473858 7179053 8001789 8967954 10133009 11513527 13174048
8782 13174048 15182473 17601676 20503388 24000064 28101903 32746172 37821135 43318337
8774 43318337 49433125 56762928 66277455 79327979 97830357 124540953 163130141 216849682
8766 216849682 282969426 343446776 369222461 347731675 292387828 225649669 167260132
8759 167260132 124836224 95979854 76274375 62427388 52372794 44793719 38852437
8752 38852437 34033996 29996916 26508980 23366183 20509006 17958059 15725136 13863645
8744 13863645 12353603 11110588 10045909 9114004 8323665 7633625 7025682 6477303 5980936
8735 5980936 5563957 5176983 4792608 4466003 4169300 3916633 3698349 3508354 3307161 3109042
8725 3109042 2930087 2757873 2601111 2462726 2332031 2201527 2083709 1964685 1863836 1771330
8715 1771330 1694577 1640399 1596190 1564918 1533854 1466565 1419859 1386633 1343363 1295570 1255213
8704 1255213 1226953 1192390 1159624 1134170 1105555 1093126 1075613 1033233 1006719 1029831 1043365
8693 1043365 1052347 1043163 1044863 1045354 1009795 965347 940865 910666 859723 824659 791918 759720
8681 759720 742122 728298 694669 674235 650655 646078 650763 651415 632021 614578 599265 577916
8669 577916 544612 525256 522356 503717 514489 529190 528892 535197 536878 534148 521638 506852 518531
8656 518531 512976 515046 508097 485516 474477 474796 457822 443816 457412 461702 472495 481192 477009
8643 477009 481437 488922 478269 481472 481794 448235 405908 386587 392958 389838 376554 365947 365527
8630 365527 355236 334453 318917 320023 333618 348630 362079 379191 390931 416076 479246 591048
8618 591048 751973 873272 863770 739719 596842 476986 425859 436766 456326 474179 506946
8607 506946 536480 534048 509953 482630 447699 411411 396218 370106 381460 398857 398734 400420
8595 400420 387599 378270 367523 363954 335449 312631 295016 284363 282965 284247 275630 262368 260328
8582 260328 245819 252378 298501 353691 410707 486187 611270 804146 1103381 1411424 1512572
8571 1512572 1357542 1074065 785945 605702 482043 398616 329820 289935 253364 210678
8561 210678 188604 193535 178660 168593 157934 160682 182113 188534 181428 176710 173035 178638 186190
8548 186190 181227 176619 176850 178491 187225 192134 182826 161356 174101 187673 196006 196383 195811 199221
8534 199221 222211 254584 285988 339490 452558 599705 708462 705257 591107 439517 317068
8523 317068 264762 218471 180892 155956 138716 137229 111752 116505 147113 174032 164719 141975
8511 141975 135874 138406 144248 139502 127714 120630 120596 107789 113562 118354 104772 96593 102299 106966
8497 106966 101293 90337 81220 77398 81140 107284 117516 117151 115625 118597 111440 104342 96340 79845
8483 79845 68432 73694 79026 91855 93886 89781 75771 70204 74380 80383 60790 56572 55158 50026
8469 50026 59973 50718 21108 11022 4897 9417 20610 19316 29279 49482 69393 90226 97626
8456 97626 94019 92296 84993 69404 55855 51451 65282 83060 86508 77898 79506 82153 90249 86075
8442 86075 67030 48097 54120 80996 81059 75001 70612 53092 44194 48777 71315 83143 81881 93856
8428 93856 83099 68037 55900 55990 65629 70553 70560 70340 65222 52508 56689 66977 83322 81097 77463
8413 77463 72866 66667 54329 65326 87261 95344 85293 64744 72164 73188 54143 62536 65068
8400 65068 64909 63243 67020 70149 67267 68141 71705 62781 68289 86459 88121 94557 96723 88065 98024
8385 98024 114934 122636 120112 123018 141116 149041 159496 181034 205848 206030 208104 225915 273268
8372 273268 317041 344652 391053 461641 553934 655579 777639 913164 1056402 1194330 1307292
8361 1307292 1372065 1379819 1331969 1238626 1085577 931925 794242 686345 585380 478034
8351 478034 405134 341786 291802 249396 215056 196230 178235 170379 168003 150004 118067 99616
8339 99616 107951 91459 81239 69925 68376 65694 53976 49242 40502 56109 55816 55456 41431 41691
8325 41691 65879 80582 74707 89313 81608 72761 76861 80690 71822 60734 58491 62215 57989 55388
8311 55388 56144 80963 91025 92640 84924 74228 59672 65093 89984 94801 79790 63191 60401
8298 60401 53496 35106 24226 24109 36730 49427 64432 50284 48819 35729 32355 47319 46634
8285 46634 34837 37851 30136 29446 33105 48472 48650 50957 38067 16055 10000 17429 38435 49540
8271 49540 51255 50311 46329 55536 54788 37732 34811 57946 74059 63852 54338 37131 33046 40010
8257 40010 64086 67469 54980 39222 40934 42922 38834 37634 39592 23754 14875 15996 34139
8244 34139 30205 17239 25445 32201 22814 25653 30560 20500 9813 8244 14972 24070 32766 30218
8230 30218 28032 25249 9514 -9666 -5782 24166 17643 4179 6444 15514 29749 25144 26161
8217 26161 11524 12859 33097 32597 16331 4456 13417 32519 22097 5068 9855 25718 26230
8204 26230 37231 40705 20351 16877 17865 12864 17522 12098 3210 17358 31612 27374 33429 38203
8190 38203 26256 22050 35785 28251 19929 33782 23311 6958 12440 5249 -1089 19846 27950
8177 27950 27379 18347 29984 33168 28027 22245 14068 3458 -9647 -3001 12159 21123 19432 26600
8163 26600 6356 -2593 -6985 6095 15430 30600 26672 31884 30309 26316 10934 -248 12728
8150 12728 8702 8053 16707 15104 14465 19638 25808 28353 21176 17834 -4565 -10702 4636 8980 18141
8135 18141 7589 6110 -4505 -3483 -5750 4781 25421 29833 23954 23599 30051 43126 43948 37158
8121 37158 17701 2619 22657 31839 29784 16151 15676 23578 4933 6428 24255 27954 23427
8108 23427 31079 24159 33103 36833 17354 31764 39872 18257 -14993 -28184 -19795 -10090 -4289
8095 -4289 9777 16874 23900 27239 15952 26168 33997 23439 33745 42466 35629 23913 23616 24361
8081 24361 28415 35875 42452 41133 46351 50339 42279 13743 -3563 -2816 25541 37107 38846 40132
8067 40132 37333 22465 21310 33298 32627 22890 28113 17030 17910 26223 31310 17746 7052 25538
8053 25538 14800 16638 22769 5238 915 17113 19834 9932 19346 30698 35310 14495 9006
8040 9006 -3683 2955 2572 2666 13433 29527 47790 48814 47306 54303 34530 27733 24047 20811
8026 20811 22266 16267 2070 11603 14812 6936 9916 16114 26737 34278 31354 28678 5245 -13456
8012 -13456 -5905 -689 -19066 -24429 4427 16909 -1135 1581 14775 13977 18410 38446 56221
7999 56221 51162 30017 14059 21947 17703 12998 2570 7348 15880 11361 14653 29919 27658 38532
7985 38532 45273 41931 36511 20251 25231 17012 27427 31086 12203 26716 27095 13598 14435 17486
7971 17486 16120 11500 21391 27418 23126 18509 23068 21237 14444 15415 13579 21504 41424 48305 44809
7956 44809 45968 38243 30447 1941 3625 15508 27545 28463 39432 28185 11665 3727 4866
7943 4866 18708 19271 30921 42068 37529 20293 14775 21152 28741 30576 13244 356 11293
7930 11293 20179 11497 -1259 -6351 -20726 -17049 -6330 7550 18918 18659 25042 4232 -15576
7917 -15576 -2724 13553 -4655 228 7246 23368 29339 17032 9997 752 439 13664 29820
7904 29820 22616 16305 20562 9449 -13687 -8790 -19979 -23476 -7906 -9900 -25339 -12471 -198
7891 -198 7758 26903 35124 42931 43225 37340 37179 32803 32058 28449 11367 5556 1199 12422 17227
7876 17227 25173 29893 19041 10532 21601 20102 23828 10606 -6439 -2229 959 -6354 -12739 -6973
7862 -6973 -11597 -18024 -9285 3576 14138 11398 616 13014 18060 5201 3126 5895 17923
7849 17923 30427 31114 12222 -11048 -17876 -14672 -4356 4852 23614 28858 22316 16769 20707 4135
7835 4135 -12045 -2785 5526 11445 20999 6826 5829 10730 5669 13401 11262 11759 25567 31101 20989
7820 20989 16816 47665 19028 -14241 -24904 -20460 -7341 2676 -2605 -8059 -7444 -10674 -19847
7807 -19847 -4953 841 -4861 -7720 2228 990 7511 -1843 -11338 -25239 -32087 -28656 -11239 674
7793 674 11038 9043 -4241 -19142 -19595 -12925 -194 16585 8720 -2524 -5820 -13390 -21378 -16494
7779 -16494 -27185 -19346 -1982 8958 16148 9018 2331 7728 7694 401 -14090 -19225 -14368 -11215
7765 -11215 -14463 -16865 53 9198 10765 7688 2290 4083 11404 9839 2707 249 -430 10043
7751 10043 18262 20738 23842 20988 16079 13641 11664 2038 -4591 3709 6142 6866 4119 7558 10227
7736 10227 14829 5068 13468 20674 24189 6853 -4054 4099 21395 33695 37629 15787 -2621
7723 -2621 5207 -940 150 11436 19592 28457 22371 2019 5169 3727 -3109 -5082 -20798 -25112
7709 -25112 -9850 -488 -2923 9110 -3761 -27359 -7248 6066 -2895 -10033 3641 -8987 -9572
7696 -9572 43 -1552 -671 -2201 6675 21182 8665 2076 5420 -2976 8265 18643 17054 4896
7682 4896 9217 2108 -4134 -9250 -10811 -8223 2869 1237 26178 27869 13450 9176 8059 11673
7668 11673 7549 -5843 11476 12273 -8703 -11626 -8990 5826 13045 13187 10000 14215 -308 -5216
7654 -5216 -226 16050 11944 29538 25975 14500 22696 27253 38594 42519 25438 15035 -12801
7641 -12801 -17989 -8232 3792 9828 -307 6962 13283 5992 8272 25104 21141 10346 8590 12076
7627 12076 26306 22102 30825 35550 31097 14334 24001 35657 35965 20917 10366 3102 -1806 6763
7613 6763 7952 15996 14423 11754 16697 4516 1970 13546 -12286 -24939 -27285 -10567 4541
7600 4541 7066 3134 5271 2372 -15433 -4255 1653 10638 31561 32594 17143 5935 -4953
7587 -4953 -10321 -7984 10675 7637 14614 25239 19588 9753 14198 15673 3781 -7544 612 -5378
7573 -5378 -2809 17350 29915 4095 -13154 -1882 -3847 1329 16923 27137 11754 -10772 -19547
7560 -19547 -7405 10891 21960 18691 17373 20079 2806 -12045 -7710 -18418 -24101 -7302 -6177
7547 -6177 -3491 25887 39027 26609 1124 -16420 -21474 -24881 -1937 12085 15730 24498 26634
7534 26634 23473 37249 39539 9806 1999 -11893 -13142 1352 -9045 -2397 3311 5688 11214
7521 11214 10713 -5079 -10513 -7048 1602 1231 1001 10050 1317 -274 19587 38513 36209 24123
7507 24123 20048 14712 6273 18238 18694 1953 -15236 2549 17205 23512 23042 14250 22455 31064
7493 31064 4730 -18073 -17951 -4110 -16281 -20673 -8534 12037 19149 15879 9574 -2316 -5194
7480 -5194 -10028 -6407 -9799 -12809 7432 9253 5639 -9258 -14119 -10714 -11131 -2475 -2650 -2346 -5897
7465 -5897 3685 14258 22675 29891 10803 14209 32200 33544 22198 11905 -309 16340 16194
7452 16194 14113 16052 2654 8072 10618 19828 22876 573 -20082 -10673 -18564 -24434 -16319 -7762
7438 -7762 1910 13854 9737 49 5924 -539 -4496 13995 16290 -3495 -8052 -1024 7599 3946
7424 3946 7693 29249 33523 27251 10929 -2845 -11688 -25806 -23409 -25372 -28393 -13266 1815
7411 1815 -274 3578 14428 6261 1729 4510 2396 -5893 -16724 -15004 -6398 813 15700 15166
7397 15166 -584 -1033 5522 7645 3885 5089 -3192 4097 26719 12708 5782 15006 39557 34579
7383 34579 31302 36241 29038 17057 7977 4046 6037 4597 -5675 -19791 -9960 -12174 587 20661
7369 20661 24662 17638 15641 6438 10583 -1602 -12337 -14877 1525 11914 9420 1534 -1824 -1041
7355 -1041 13490 24577 17796 32261 19552 -705 9086 13637 -113 4538 -2133 1404 13992
7342 13992 13429 -1489 3388 -2261 -11958 1573 8315 4071 6034 17715 20827 8946 -5018 -7346
7328 -7346 -27160 -20843 -11364 -5935 -8972 5935 -18335 -18264 -1625 -7384 -11572 -188 13833 26978
7314 26978 21570 8044 -7497 -11310 -3696 -6213 16870 35174 41538 44165 31646 18196 8049
7301 8049 -7786 -20275 -6290 -2040 -3173 -312 -3602 -5373 -5632 4064 21296 41062 37174 32068
7287 32068 28422 26186 21425 12189 11073 6347 -24347 -37424 -22563 -691 14853 22631 31585
7274 31585 34582 9076 11902 12429 10011 5727 14232 23202 11125 11930 14893 31194 25058 8820
7260 8820 -156 8540 24150 13357 10133 6649 3365 8398 4314 8548 -1357 -3306 16855 22183
7246 22183 26636 31965 28363 4031 -22469 -7774 2029 -20732 -29193 -20506 -14069 -4469 8343
7233 8343 15596 -1261 -8955 4026 2642 2081 19963 14477 1644 11151 7676 -6773 -9444 -19540
7219 -19540 -43000 -35052 -27454 -24698 -19347 -5601 -4887 8671 -4345 -529 -8558 -18509 -10785 -1148
7205 -1148 -6628 -5570 -154 -10720 -21081 3284 15381 5495 -9815 -11057 -7708 -2830 1403 13208
7191 13208 5759 10922 5932 -2379 -12290 -19201 -30296 -30605 -19633 -8463 8368 9228 9261 -2679
7177 -2679 -10367 -31591 -31544 -15472 -2711 5454 9084 -660 2084 -11560 -9255 -3242 -14774 -21496
7163 -21496 -19854 -30900 -43179 -21244 -8259 -3552 4211 7330 -3737 -24073 -21890 -21071 -24592
7150 -24592 -21205 -9623 -11687 -14602 -15001 -8663 -2855 -542 -15275 -12163 603 5083 -2372 -16952
7136 -16952 -10696 15066 22167 28600 32543 39475 28475 6739 -90 3754 9495 11742 7773 6332
7122 6332 16507 5964 -361 277 11396 21936 14379 -11230 -16360 -8123 10496 9560 -204 5000
7108 5000 13686 -8189 -17897 -20913 -15387 -23431 -26857 -18762 -3392 -6813 -16696 -12866 -7926 4712
7094 4712 11709 8083 -2434 -5776 12794 28741 17613 7620 831 -12017 -16642 1456 25779
7081 25779 32122 16046 -7713 -10722 -18957 -24299 -19733 -24144 -24990 -16769 -17900 -30541 -28824 -27410
7067 -27410 -34956 -36916 -33244 -28607 -20947 -1668 7994 -38 -10285 -6702 -16345 -30507 -13745 2214
7053 2214 -375 4240 12827 -4286 -6242 6085 23130 22277 23452 23262 10254 2340 7222 10082
7039 10082 18716 10876 4928 9441 -6865 -10229 10023 8555 13446 20070 11581 3617 7394 7942
7025 7942 14167 15368 8989 3316 -3461 6457 2525 -1900 -9886 -14281 -5833 6402 16484 26493
7011 26493 21397 6682 -5634 -7988 2975 1721 -715 6794 -1125 74 5931 12988 4085 -1672
6997 -1672 -8885 -19246 -39233 -41136 -14638 17617 8800 3769 15083 -1159 -9324 -2495 -1114
6984 -1114 -11974 -10775 3229 4678 -7403 -14437 -6738 10461 15477 10714 6137 10481 -1690 587
6970 587 17309 21119 11123 2429 -3325 -19299 -20280 -13643 -8192 -9090 5097 10090 6206 -12510 -28527
6955 -28527 -21130 -4996 5306 14882 10778 -5520 -19253 -28568 -25838 -33769 -10621 -10777 -5807 -10605
6941 -10605 -9704 -8852 460 4785 -8084 -9704 -2414 6153 -1417 -10781 -1781 -10752 -25056 1613
6927 1613 25582 7472 -6303 -19086 -4657 11395 9760 9288 5636 9514 7469 24293 38364
6914 38364 34978 22166 14801 19443 13269 13581 18493 8515 263 31664 33030 24375 14347 13178
6900 13178 1311 -3663 225 12769 20076 -1659 -16035 -9198 -22724 -28949 -27030 -13016 -15328
6887 -15328 -21037 -32324 -25584 -19000 -9718 -16577 -29403 -20508 -9495 -2089 13389 8366 -8916
6874 -8916 -12786 -13712 9399 17867 -4472 -14485 -16256 -17738 -30345 -26094 -19527 -8852 2219 -1037
6860 -1037 -13397 -19212 -24209 -8979 -3172 -1164 -3641 473 -3673 -1502 4182 6758 19796 16932
6846 16932 17744 21412 23889 8764 6627 -3938 -18394 -9046 -7034 -24927 -32214 -23668 -28952 -14004
6832 -14004 4511 16325 9604 1502 -11162 -9984 -14600 -22250 -11419 1746 3202 6223 13448
6819 13448 17312 -2202 -9900 -6985 -3194 -9802 -1515 -9141 -17884 -5059 413 -5255 7720 -13013
6805 -13013 -27736 -32565 -23903 -10890 -2713 6973 4703 -4974 1037 -1025 -5026 -6528 7090 4706
6791 4706 8837 -7910 -9654 -2243 -28547 -31761 -21691 -28026 -31100 -15110 -6902 -11345 -1974 -13368
6777 -13368 -27466 -12471 9951 1080 -2125 2565 -14331 -27117 -18549 -11329 -20658 -20962 -27272 -16047
6763 -16047 1440 6089 2978 12178 12288 5684 2067 8771 16303 20224 21777 19091 4960 554
6749 554 -336 1768 14381 16541 13282 13619 16699 8768 4728 -934 -3747 -2735 -5009 1986 -1761
6734 -1761 -9866 4240 11254 18408 17471 11476 29475 34186 22501 38219 51361 76469 107614
6721 107614 113381 94212 68156 47020 34350 39489 27407 17680 1476 1943 8664 11607 4329
6708 4329 -10593 -14533 -16457 -10778 -14132 -11650 -13972 -15245 -12529 -7220 -11598 -9296 -16141 -7816 -2013
6693 -2013 -9553 -16732 -27074 -31447 -19470 6537 16919 3870 -8952 -941 -15553 -8691 17163
6680 17163 10413 -6837 6407 2070 5747 10576 5644 6710 15232 -428 4811 -9593 -10008 -4024
6666 -4024 -2329 3014 5134 1226 8028 5466 2364 7648 19217 27229 26996 20200 12335 26524 29567
6651 29567 18201 -6909 -6292 -2924 -11702 -5949 -2755 -9447 -12141 -3563 -298 -5932 3783 17374
6637 17374 24404 26948 25055 7306 8607 10942 -1292 -1642 3949 10933 13793 -1246 -4643 -1183
6623 -1183 -3380 -5109 5861 11284 5010 -2412 -16354 -24770 -17029 -3276 9493 15815 3823 8543
6609 8543 17674 22841 6286 -12869 -9205 -7310 -6006 -10234 -1273 1917 -10809 -9770 -6755 -17977
6595 -17977 -22652 -9045 -16613 -22973 -22801 -7300 22663 12965 -256 -9227 -12933 -4046 -15878 -15583
6581 -15583 -17492 -9676 -4405 4001 1049 -3415 -7742 -25240 -32583 -27058 -20492 -19266 5121 20670
6567 20670 27671 22979 6308 -5772 -23341 -23163 -4183 -2168 8361 14506 15390 16423 5455 -4383
6553 -4383 -10429 -13577 -14659 -14108 -8475 10322 3439 3415 13918 -1221 -8688 -9128 -3031 12261 9298
6538 9298 2731 -777 -10129 -7167 -279 17772 25207 9728 -4914 -19463 -29725 -31070 -15372
6525 -15372 -2460 4661 15295 18402 18795 16480 12377 17086 8813 -9369 -11190 -14453 -9873 -14352
6511 -14352 -17830 -17771 -13497 1694 4467 1641 -1563 1766 2506 6811 1416 2725 10007 4197 -12843
6496 -12843 -31491 -31846 -16039 -27133 -24455 -20294 -1908 10453 24817 15515 12149 13153 4593
6483 4593 -6288 -4546 -2162 -12037 -10910 -4748 -11044 -13215 -5588 -6802 11036 3204 2293 5073 3521
6468 3521 5459 23831 19827 15852 8372 -3081 720 12127 38161 35451 35113 26138 6875 10322
6454 10322 13091 -5152 -6604 -9926 -19882 -27225 -14549 4423 287 -16846 -12728 -4150 1347 4322
6440 4322 3313 -15293 -24504 -22113 -6138 11108 10080 -6689 -15983 -27057 -12093 -479 -14839
6427 -14839 -20802 -29036 -26501 -6611 -6632 -9741 -2655 -9195 -9176 -7097 5648 5917 9062 5838 -13397
6412 -13397 -25893 -13645 -15918 -20148 -21557 8199 29430 33489 30151 12210 5201 10764 1564
6399 1564 -1177 5873 -7462 -25107 -8711 15918 9236 -3352 -2525 1489 -7089 -19294 -21957 -16247
6385 -16247 -2815 -10868 -12829 -6888 -11514 -8587 2134 -1332 -5992 -9266 -1298 -2509 -5884 -615
6371 -615 6189 6586 -7391 -13696 -16442 -13244 -15342 -16366 -8876 -14969 -8528 -6506 -4537 4918 22754
6356 22754 28269 11247 7080 4532 15070 20778 12530 5596 -8060 -9841 -8972 -2766 1888 -19146
6342 -19146 -17338 2118 14284 21132 19132 12467 -2924 -11195 -16074 -16930 -27221 -45811 -38942 -32861
6328 -32861 -33834 -19629 -16346 -3678 201 -12681 -10086 -13668 -7019 6433 7013 2117 15087 7925
6314 7925 -11106 -34313 -15526 -315 -8233 -723 -457 678 -16163 -13293 -9078 -3053 10144 5360
6300 5360 -6753 -678 -1192 -7609 -16293 10235 17123 16056 -3492 -17513 -3803 -10315 -13375 -28479
6286 -28479 -26139 -5531 4220 -3652 -1283 9655 31769 38703 27692 10125 -2736 -5522 -24056
6273 -24056 -25336 -23396 -18640 -9967 7870 10357 9365 17334 15801 -1509 -19318 -12855 2898 15334
6259 15334 24414 20711 10817 -1753 3074 3817 6606 14547 -576 4493 13559 7383 10877 19877
6245 19877 19173 17895 3403 -10689 -12645 -24500 -28232 -6595 8504 12372 1480 -11683 -8449
6232 -8449 -9693 -1694 14684 24596 9132 4665 20490 32056 24341 12974 11622 -251 -50 352
6218 352 -11175 -12713 -317 -7589 1421 7519 5842 8769 7972 416 3396 746 8470 2485 5590
6203 5590 -834 21469 35117 17783 -17595 -11129 6441 11865 229 -17773 -23158 -16968 1601
6190 1601 15579 8516 8561 -15732 -9948 7282 -163 -22305 -9775 23990 35203 34200 22591
6177 22591 17289 14889 991 869 484 4970 -294 -7374 -19808 -25209 -20496 -26945 -24094 -22441 -13747
6162 -13747 -2393 -1834 -10436 -15003 -19969 -15469 -10242 -1490 10165 15864 3394 -2482 -8392 2900
6148 2900 10537 8724 -9910 7933 11865 349 3043 -9217 -15073 511 15060 9358 4048
6135 4048 771 -5473 -9003 2491 12691 3301 4345 -3807 -8497 -14939 -19676 -14005 -10620 11855
6121 11855 25032 18100 18110 21065 19391 14591 483 6132 8629 -757 -1827 -2769 -3589 -8100 -6300
6106 -6300 -15700 -19095 -34488 -37320 -35291 -25387 -25097 -32613 -17688 -4977 13504 2979 -6557 -28863
6092 -28863 -33358 -20526 -16917 -3876 1158 2844 -6159 -2821 -2100 -14924 -22072 -28120 -10166 14695
6078 14695 24490 30376 28300 27674 21075 23174 39773 24346 -2611 -11047 -3868 3313 22380 24558
6064 24558 13146 19056 12169 5681 -3768 -9371 -10090 -14110 -19366 -13774 3746 24804 25757 17446
6050 17446 8110 2675 -13983 -18012 -937 22060 25348 14413 8994 7819 15334 23104 21561 15213
6036 15213 21764 21957 -7942 -20921 -20668 -21761 -9557 -4779 -6679 -6211 -2075 13186 8705 3304
6022 3304 5166 7445 -2254 3156 5478 -3058 -5588 -18095 -26704 -15684 -2899 -9117 -18625 -17081
6008 -17081 -271 575 -4640 -4873 11917 18282 9811 18559 23930 23170 14399 14971 8600 -6231 2403
5993 2403 -12595 -21305 -26547 -28907 -25122 -22664 -26368 -20226 -28096 -25969 -11116 -908 -2922 8739
5979 8739 2895 -11834 -28249 -46743 -44236 -45092 -43564 -29817 -3640 4718 7079 5865 22663 28824
5965 28824 22098 15002 19434 17333 3526 1638 -7196 -4453 -19833 -42852 -45624 -49114 -28200 -12922
5951 -12922 -7717 -6421 1623 8091 15651 11469 1004 -10109 -14747 -12902 -13739 -17903 -5833 11780
5937 11780 9286 -828 10935 14002 775 -9341 -3081 -2824 -7168 -8387 -13910 -2577 17866
5924 17866 29442 30595 29553 10627 -6468 -9428 -7821 -12594 -2410 2384 -8426 -21727 -13746
5911 -13746 -17621 -25654 -6681 12125 5089 -12811 -15671 -15787 -10353 -3834 -2794 -1957 -4067 -4876 -1164
5896 -1164 5997 13213 2828 -7227 3604 1859 -1963 2499 -4420 -6715 -1656 8202 -2349 -14697
5882 -14697 -18740 -18242 2611 1897 2907 -14530 -18594 -9261 -6630 -5519 -377 1539 3585 10393 2271
5867 2271 1376 -8137 -11468 -5768 4895 -3793 -6270 -8378 -16417 -20040 -27242 -16912 -25196 -11913
5853 -11913 -15992 -26859 -14103 1385 11599 8563 9566 2579 507 -27442 -24201 5682 13435
5840 13435 24996 28008 9889 16086 18832 14948 13406 5281 -5886 -16912 -2131 -884 -2582
5827 -2582 8021 -2777 -25482 -27045 -7413 2264 -7418 -13526 -21378 -27907 -36996 -39423 -29094 -21238
5813 -21238 -20578 -18136 -7531 -379 -2802 -13332 -18673 -5985 6793 23361 19720 21319 23899 10646
5799 10646 12639 16021 20157 13075 -736 -11087 -1510 -2318 385 -458 -5729 -22937 -26765 -7182
5785 -7182 -8987 -8879 -10139 -11245 -9097 -5053 -9036 -28298 -23424 -8871 -17568 -8374 -7818 -22618 -14151
5770 -14151 -6330 -8489 -17973 -3077 10559 11593 -12657 -36711 -27418 -31344 -17928 -5818 -7302
5757 -7302 -17609 -23616 -30589 -28814 -33759 -43273 -30243 -10004 -2930 -8326 -1706 6238 -5658 9147
5743 9147 20906 8335 -1171 824 1783 6573 11087 14873 -1596 -2798 9077 887 -2267 -5701
5729 -5701 -14670 2754 14089 12211 7495 -37 -5987 -19981 -29056 -20801 -1154 -1667 11637 20916
5715 20916 15257 18208 11977 14038 3779 -9257 -10273 -6494 9822 -45 786 -5172 -3681 10557
5701 10557 18761 976 -19200 -22707 -22201 -14032 -8802 -1498 -1936 17372 18579 28304 32328 16069
5687 16069 -4898 -20086 -16008 10091 3109 4400 19539 -206 -6540 -3854 -8992 -8102 1918
5674 1918 -6273 -12884 -17527 -8132 -6427 -1813 7704 -11920 -23776 -30536 -26077 -28876 -13609 -14918
5660 -14918 -8845 -22208 -34985 -28460 -16718 -27342 -21900 -13556 -11710 -4857 -11495 -18891 -35009
5647 -35009 -31536 -22315 -10288 -13441 -3265 -12924 -13457 -8880 -5594 -5332 -5123 4061 4566 -10149 -28580
5632 -28580 -20499 -9936 -4748 -12510 -10181 -23429 -20957 -8653 4737 2736 -11599 -4983 6904
5619 6904 7403 3390 12821 37088 39593 14728 8057 34210 35287 19923 -1905 6234 18111 14124
5605 14124 6492 4304 6751 -6780 -19730 -16335 -12414 -17609 -23308 -19144 -8994 -3771 -2655 -285
5591 -285 -7258 -25764 -35473 -31129 -26698 -12987 500 353 -8642 -18884 -12042 175 1665 13067
5577 13067 36567 29396 578 -8061 -22071 -17117 -5892 -12444 -9343 1187 -10488 -33446 -22092
5564 -22092 -1100 -5552 -10818 -5221 -21632 -40116 -35669 -15289 -13419 -692 -6446 -12759 -16140
5551 -16140 -9377 2607 -3088 -4767 8377 18343 18528 3082 -30139 -30266 -25261 -20215 -14472 -10542
5537 -10542 2540 -2119 -8420 -10855 -7071 -1346 -15669 -9130 -4673 5890 1529 -6001 -18156 -18915
5523 -18915 -22922 -21894 -4292 9887 12347 16713 9662 690 -5198 -20763 203 11854 24006
5510 24006 25617 15224 -4947 -27570 -23092 -2486 3938 -13091 -9615 13783 8269 7457 23287
5497 23287 3496 -3173 2894 12618 20768 12168 7768 10250 749 -19135 -10525 -7082 -7047 -8506 -20125
5482 -20125 -28060 -19215 -28960 -27480 -11668 -7810 -5847 -4225 -10482 -11367 -11550 -8983 -16878 -21277 -32129
5467 -32129 -37230 -42234 -38898 -23801 -6884 -4503 -24382 -25483 -12524 -9119 3679 8138 -1858
5454 -1858 4538 8272 11873 8868 6215 -2485 849 -3925 1733 4037 -3459 5175 11623 -7461 -2017
5439 -2017 7828 -1220 -17009 -17127 -5900 -18049 -19616 -13638 -19183 -26335 -24089 -20288 -1008 9866
5425 9866 8884 4320 2397 -170 3369 3261 2062 -636 5573 637 -11532 -16040 -23090 -28266 -22826
5410 -22826 -24866 -30640 -22951 -2775 2691 13548 4453 6489 -2304 -11066 -7812 -7194 -9800 -5530
5396 -5530 2401 1469 9181 18560 11691 -8304 -18133 -20182 -23981 -21290 -11267 6417 12181 1412
5382 1412 -22391 -28463 -23066 -12136 -3118 -25339 -30567 -20104 -3974 12892 -7841 -10893 -1166
5369 -1166 -8175 -7304 -3508 -5172 -5832 3286 7120 6919 -8336 -19669 -19958 -16055 -2256 3570 -1064
5354 -1064 5100 4378 14196 18432 15901 21124 24927 23371 14547 22332 7812 8163 3681 -5065 -935
5339 -935 -6106 -9170 -3328 3958 12266 -7115 -18111 -23428 -24814 -5164 4639 -6007 -22186 -21171
5325 -21171 -7987 -3339 -14635 -13712 -17335 -16521 -13182 -8558 -9384 -9195 9082 22114 10242 -3622
5311 -3622 1765 20222 31925 7319 5952 6506 4951 2074 8562 19048 16322 14008 5723 -10612
5297 -10612 -13928 -7430 -8201 -11664 -11366 -18371 -14512 -29041 -28724 -21370 -8886 2652 8038 -1433 364
5282 364 -13200 -374 503 -8715 11168 31428 29508 23961 -818 -4823 -2528 4490 5502 1816
5268 1816 380 -9111 -24298 -28468 -13958 3236 -982 6874 4923 -13908 -8366 -13934 -19942 381
5254 381 9161 -5590 -33743 -42196 -19007 -4964 -80 -7558 -5985 -8494 -6909 -1893 16880 24160
5240 24160 14949 14091 -6636 2190 -1263 -9769 -7229 2107 34751 32966 15196 2700 -6416 -21309
5226 -21309 -32069 -18963 -1996 3292 658 -4803 1561 6236 10219 -1447 -5335 322 11355
5213 11355 8447 6645 -2842 9258 3011 6115 3867 11329 25462 8682 -7059 -3253 -1944 17443
5199 17443 13060 -3021 -6619 7503 -1221 -1971 -578 1423 17294 7141 3929 7571 9565 2295
5185 2295 -10934 -21193 -9805 -364 -14973 -12860 -23711 -20947 -30499 -21961 1537 14568 26547
5172 26547 18144 2750 -359 5520 -1101 -5676 -783 -5012 -5017 -958 -12100 -5930 7656 -6847
5158 -6847 -21492 -21956 -14164 -1127 16760 15696 23035 20585 10521 -8708 -20453 -10201 870
5145 870 3781 -1906 -5223 -8010 -9113 -14770 -7136 -7645 -2570 -5941 -24274 -33097 -13737 9219 15331
5130 15331 15697 11301 18384 16100 16333 5337 -584 -9475 -6797 -5431 -1361 6318 8487 7774 11238
5115 11238 22283 21798 26771 27578 14591 27696 15358 -1303 -755 -9212 -3181 -135 910 12548
5101 12548 12208 2489 -4477 -8872 2090 -1311 -20820 -27502 -24069 -19023 -3497 -329 12685 7228
5087 7228 2517 -665 1836 19306 15244 13590 9986 -167 4911 22060 3545 -14436 -22019 -20972
5073 -20972 -17236 -51 6559 4374 -9328 -18331 -15454 -5177 9957 13991 12120 -7275 -20008
5060 -20008 -24366 -4506 7801 5991 -1229 1097 2319 3032 -11795 -14259 2355 -12168 -7432 -9244
5046 -9244 -5626 -24642 -15002 -2547 2264 8132 7600 -3780 -14927 -2880 1560 11849 -8158
5033 -8158 -8707 -6097 8495 5013 -2035 2265 11499 -1164 -21543 -28289 -16882 -4429 -2085 4544
5019 4544 11099 29704 21568 -14527 -32706 -15134 -4447 -7759 -1241 -4076 -14897 -27953 -25287
5006 -25287 -13911 -19947 -5557 9826 18422 25959 24677 16745 4399 25615 24746 5814 618
4993 618 -13137 -850 15727 19458 10135 823 -2398 -8822 -12882 -8726 -6134 752 4248 -9385
4979 -9385 -7369 527 7146 -9084 -12571 1230 180 448 -10816 -23846 -27221 -8981 3443 6648
4965 6648 14376 18586 -966 -1840 -1171 -7686 -9041 14308 8874 12206 25496 26893 12663 9401
4951 9401 7738 3339 -14853 -4755 21552 12948 13063 5614 -12330 -6237 4402 4509 8189 15565
4937 15565 10958 564 -7334 9921 7940 -8245 -7508 -4043 -5334 2142 -139 -13238 -6495 -4496
4923 -4496 -17211 -5172 16897 9754 -6492 -5331 -3468 16240 29902 28622 18153 2907 -8127
4910 -8127 7396 15802 6590 -1322 -12614 -22763 -38202 -41266 -21208 10337 747 -8314 -7182
4897 -7182 -17985 -29964 -32476 -21388 -12795 -10882 -12014 -16150 -3421 4601 -12607 -23574 -20142
4884 -20142 10435 34802 26958 32134 16798 10142 14338 6708 -3791 685 -1720 1798 15959
4871 15959 13817 15631 24439 9802 -2770 -12289 -28883 -28312 -7920 6239 8030 9276 6425 8552
4857 8552 4484 -7031 -4500 8020 3810 2363 8308 -4509 -17249 -14748 1957 22741 10056
4844 10056 -12223 -14010 127 7692 9105 2886 -1018 8328 -371 -11186 -19170 -21811 -13786 -3379
4830 -3379 2051 -6431 -3040 6486 -14379 -20771 -24778 -32089 -17386 -1655 2804 9414 21550 21881
4816 21881 16169 17340 3618 359 9822 6955 -2117 6528 14480 3164 -21107 -28020 -16453 -8897
4802 -8897 -4412 -7712 -13356 12016 10253 -9530 -290 -3507 -25099 -30927 -17342 -17329 -16210 -212
4788 -212 2332 -16306 -27669 -21736 -4719 14094 1240 -12011 -15248 -2254 12486 2706 -16010
4775 -16010 -11816 -2021 9451 14429 17106 21152 14990 12494 14304 15198 2903 -2955 -13145 -10518
4761 -10518 -19264 -20420 -16398 671 9281 6994 2444 -5298 -6969 -10580 4967 21985 26747 30676
4747 30676 16565 -6466 -12441 -5269 8239 6091 5561 -1901 11995 20854 16768 25636 32454 32142
4733 32142 14819 5282 -1456 7582 10113 16773 14130 -251 -18765 -38329 -52575 -46296 -26288
4720 -26288 -10105 -14854 -15070 -6689 -9238 -7315 -21772 -25136 -19204 -12168 -15179 -13274 -8428 -824
4706 -824 5484 7888 27147 26876 453 -30141 -16306 -5440 -2150 7027 5681 3154 10519 7517
4692 7517 2067 18004 19288 10185 979 -12257 -23735 -9582 -4958 -12431 -5497 -4307 -8701 -4925
4678 -4925 -5185 -13743 -17117 -34126 -10879 15551 32841 28551 18513 16011 24280 29686 33303 51941
4664 51941 35288 28522 13032 7806 -3886 -4691 -9910 -11960 -1189 14147 16872 10757 -739
4651 -739 -7247 -7303 -1836 -7857 -17161 -19219 -30574 -23923 -6049 -12659 -12091 -11684 -13813 5904 13858
4636 13858 24010 24164 21372 1083 6463 11656 -2865 -22148 -17517 -22287 -10866 1876 -5466
4623 -5466 -9113 -20206 -13485 -10649 -12734 -18788 -15238 -14542 -4769 -4882 8487 10875 6748 21004 20668
4608 20668 -8775 -7575 -7750 5251 7139 4306 928 1112 -964 -7900 -28475 -22806 -25380 -17973
4594 -17973 -4480 -1383 -10399 -16476 -15651 -18437 -17287 -12544 -6297 21524 33357 36730 16854 21338
4580 21338 21887 7808 -3642 -1757 5447 -4638 -10289 -10122 9709 25000 30756 3589 2383 -6420
4566 -6420 -4900 -5551 -10540 11638 25445 10114 -3349 -11507 3759 -3826 -11096 -3756 560 -793
4552 -793 -15404 -4887 3503 -7380 -25150 -27424 -12419 10989 12099 4132 11402 10714 9176 5932
4538 5932 4999 2532 7094 3898 -4358 -65 7426 8133 4518 -8164 -4444 4756 32934 43591 21015
4523 21015 21276 10582 6251 -2862 -1492 8452 11250 20480 22463 14756 -1870 -5752 2644 -8161
4509 -8161 -22997 -19328 -12408 -72 2934 17158 22867 15245 25397 7820 -3658 -8268 6434
4496 6434 7880 15293 26077 9934 -8467 -10440 -178 9157 9444 -658 -161 -8894 -4768 5896
4482 5896 10025 -6925 -9867 -12862 -24808 -30505 -13879 -10864 -15784 -2802 -1116 -12838 -28780
4469 -28780 -27810 -21144 -18500 -24990 -6477 4148 -7214 -16086 -19841 -18771 -8852 2067 5530 17183
4455 17183 12882 14936 11002 16347 17591 4185 -3855 4278 7886 -548 -20236 -13264 -2900 -3622
4441 -3622 937 6698 22241 22701 7209 10536 19866 21409 17977 16423 -1331 -13148 -1024 11645
4427 11645 6462 -7845 -533 9720 14029 12222 8983 13156 16742 27131 21225 2198 2013 7781
4413 7781 11144 9191 6454 900 1482 -144 -10404 -28428 -32530 -33117 -27730 -26501 -29094 -16826 4450
4398 4450 3711 -11568 -17979 -12997 -7179 -14476 -26432 -26758 -23469 -20819 -1387 -2240 -6526 -39414 -47977
4383 -47977 -32189 -26028 -24648 -5662 14129 30623 42648 30800 40759 35697 27611 24121 5471
4370 5471 -3570 -17754 -15941 -13911 -23996 -28614 -22940 -12487 -270 -5496 921 -5114 -18529 -26658
4356 -26658 -22200 -9817 14297 24276 13623 11807 15178 20317 5190 -8575 2802 1023 636
4343 636 466 7760 20231 25502 13311 -2148 -5587 -5323 -16612 -21390 -27623 -46820 -46653 -27018
4329 -27018 -14308 -21898 -17044 -12129 -7540 -16948 -21810 -17292 -8292 -8898 -5470 -5260 -5758 -21665 -22413
4314 -22413 -19127 -13045 -7070 -15598 -28163 -25844 -15900 -6934 -21854 -34512 -31507 -27762 -14610 3424
4300 3424 11913 -1752 1600 -3196 -6826 -325 8840 -14957 -28140 -20237 -18506 -37939 -37088 -46417
4286 -46417 -40308 -28129 -17604 -2048 -3136 -5792 6561 17712 10010 14768 18739 11358 568
4273 568 -2300 11989 22628 11766 12614 -45 -4240 -6785 -16173 -23612 -2931 -2272 -4392 -9060
4259 -9060 6983 20345 10961 2965 6063 363 36 34 -17113 -10261 22230 22958 14937 24042 19403
4244 19403 4106 1953 -4909 -16976 -18966 -18784 -13036 -11411 -5290 -6146 -4202 -5901 -12073 -17991 -18882
4229 -18882 -11324 -14919 -3685 -15270 -13397 -29766 -31520 -22381 -16810 -25699 -13440 -15774 -7195 -7370
4215 -7370 -12844 -3406 -1183 12127 16359 10089 19552 12819 7607 -1436 -11350 -7405 -429 -2497 8769
4200 8769 6319 7504 7271 -17194 -15456 -14303 14077 30324 40434 38937 28534 12438 8057 3190
4186 3190 10837 17080 4526 14259 1914 -7803 -5241 -6643 -19148 -38186 -35597 -43437 -54425 -53412
4172 -53412 -46716 -33813 -16103 -9043 -13303 -9118 -9619 1800 24275 40477 34044 17691 -6228
4159 -6228 -12232 -10531 -3376 -204 -163 -8600 -8444 -7519 -11747 -24385 -25859 -17509 -21440 -23450 -21071 -26756
4143 -26756 -28712 -32264 -24133 -6342 -4958 -3126 15119 15741 17342 8714 -7916 -14235 -7684 1740
4129 1740 7649 -2705 -6527 -3686 -15248 -32480 -22902 -22384 -25839 -25814 -8084 3453 3048 -7980
4115 -7980 -15832 -5658 -10029 2198 11544 2941 8186 14906 -612 -10121 -25470 -15717 9667 22782
4101 22782 16141 4598 -10902 -16599 -11688 -5796 1280 -11109 -11306 4739 15005 12268 20181 26298
4087 26298 14562 -1700 -3868 -15029 -17382 -12860 -5204 -11680 -16087 -12108 -1488 -9072 -14375 -7376
4073 -7376 402 10485 11790 19506 17214 19965 18841 -4823 -26274 -15935 -4473 4654 9749 6577
4059 6577 14172 7103 7777 925 1966 -3349 -237 1682 4959 1209 -1157 -6462 -3202 2290 -4675
4044 -4675 -4591 2394 8535 -4412 -14147 -6757 -4374 1567 -10701 -6580 -1929 -2266 -5863 8420 26429
4029 26429 33400 30483 8627 4548 16501 8355 -21717 -38741 -30887 -24978 -19646 -13020 -14139 -3363
4015 -3363 -11940 -1776 1038 1345 3645 -3399 -3807 -7194 -11574 -16151 -16532 -23416 -1646 14600 3618
4000 3618 9270 11256 -12665 -7837 4344 5876 7256 6913 12823 21340 19161 8819 1771 7699
3986 7699 13565 11504 1783 -8694 2949 18533 16869 1337 8233 12763 23172 11748 -6556
3973 -6556 -14823 -9681 -16061 -14130 -16050 -11479 -1780 2168 2082 8029 633 -7331 10868 32955 32050
3958 32050 29375 19052 154 3091 3451 12233 3867 -9549 4247 -3620 -8735 3499 -2400 -29986
3944 -29986 -36428 -41162 -34065 -14027 -4755 -3368 10973 26455 22096 23696 27822 29708 20521 6506
3930 6506 11547 28626 28629 10233 23048 18182 847 8464 19344 19985 21649 1572 1241 -9893
3916 -9893 -8198 -10693 -12829 -13868 -18054 -17744 -12075 -8184 480 -6186 -13470 -5955 14393 13661 3372
3901 3372 -3973 -8697 1156 11983 9486 -5166 -17844 -20359 -14762 -456 12273 17163 13181 12185
3887 12185 -3948 1306 9343 4914 15704 16652 16726 17178 6504 17239 5231 -5525 -9438 -15995
3873 -15995 -1295 -6030 -19814 -11813 -6071 -16759 -17115 -4289 5169 15400 20956 7259 -11497
3860 -11497 -14707 -11335 -8547 911 15185 -1881 -14574 -15114 -11474 -10649 -5095 1910 12829 9484
3846 9484 4324 25263 33165 22329 9059 -936 -5174 -19415 -11689 -12793 -23270 -30841 -18448
3833 -18448 -7616 -14192 -13328 1310 -2730 -12497 -1650 6780 20533 7175 -11607 -20958 -19807
3820 -19807 -22496 -4659 -6449 -13322 -8436 1534 -3186 -1034 11757 12398 11582 7683 2225 8849 33729
3805 33729 30237 7576 -2860 -11179 -14395 -10077 -2267 -11918 -8416 -5095 -11239 964 1152 -7752
3791 -7752 -15274 -14925 -26248 -29007 -25603 -7549 3161 -3513 -5678 1975 5269 12222 15049 16241
3777 16241 19073 -7744 -4412 -1635 -9527 1204 1421 13243 5195 -10190 -1761 -9000 -22053 -7808
3763 -7808 1430 1742 14296 6577 3020 14305 20389 12982 -6112 -12804 -8927 -2768 -2669 -14107 9791
3748 9791 8829 -5771 1793 19213 19083 6263 512 1127 2154 76 -6598 -14184 -9114 2787 -4130
3733 -4130 -22242 -10637 -22640 -21452 -13971 -24024 -22788 -25438 -10005 2443 4171 7228 10485
3720 10485 8680 8843 17668 21382 30411 22619 -1327 -1118 6930 19904 41243 38365 25973 4665
3706 4665 322 6075 -12687 -9910 9392 -369 8431 104 -22733 -12849 5351 2474 17453 31089
3692 31089 32710 20189 6631 1689 2727 1929 8911 16450 9050 6870 10335 10357 683 -17802 -2807
3677 -2807 15812 26899 17867 -3027 2149 1267 6498 11547 14759 19896 11818 6753 -729 598
3663 598 -3617 -8705 2919 3000 4939 14136 -1806 -3885 11027 21142 23266 4663 -8180 -22089
3649 -22089 -22226 -15987 -10253 -3849 4483 -6947 -5578 -15635 -12460 1216 -5535 -6759 1441 -4759
3635 -4759 -2073 -15280 -20458 -14483 -4375 -545 3433 1096 -2075 -4555 -626 -2851 7472 10026
3621 10026 2996 164 5392 -5542 -5123 6379 3793 -6583 -7459 -2877 -8458 -13870 -19465 -4171
3607 -4171 12234 -1933 1551 2246 633 -4855 6587 5337 2840 -10337 -12106 -227 -2042 -8592
3593 -8592 -9584 490 1144 14844 21181 28756 34378 33493 37411 39848 28566 18448 18732 3457 -1382
3578 -1382 -1580 4766 15869 25742 11383 -8167 -8451 -11926 -9536 -15023 -26434 -28161 -21291 -16713
3564 -16713 -4515 -3025 9950 -1923 9189 22544 20887 1189 -4842 -5619 -7367 -68 6158
3551 6158 -8744 -4060 6352 -13304 -18922 -14537 -20073 -22329 -10652 11225 22212 6597 2066
3538 2066 -3265 -8227 -8498 -22673 -40970 -47031 -35914 -22845 -26098 2717 7278 14161 12411 2097
3524 2097 12221 9596 -3344 8225 16013 14222 16255 17188 16093 13307 625 6856 5402 2650
3510 2650 717 -3444 -2668 -28600 -36272 -21344 4053 12700 4327 -1483 6365 -2322 -7490 3580
3496 3580 -2719 -2118 3276 4591 10060 10533 -12660 -16894 -5312 5399 -2994 -5710 -113 -4783 -11092
3481 -11092 -2042 -3407 -3393 -12886 -11118 -12374 -34487 -36285 -32285 -32307 -14087 3058 9202 15065 9531
3466 9531 -13165 -1454 4457 -4159 -3131 -4481 -16131 -29810 -16168 -12125 -32139 -22211 -16120
3453 -16120 -3844 -4935 -8738 -4600 -6998 -7639 -1976 9530 2619 -5219 1191 10713 -3607 -14284
3439 -14284 -14830 -8749 -7403 -31728 -35141 -7441 3160 -16702 -11592 -8850 -2837 -9662 -9248 -6341
3425 -6341 -6590 -7727 272 -1832 -4707 -5908 -7224 -74 8161 -6564 -4967 5091 4770 -13208 -34039
3410 -34039 -14028 -20005 -34379 -16030 -10578 -14603 -17149 -17186 -13485 -21738 -28383 -35857 -33605 -5144
3396 -5144 7637 -2659 -703 10817 16739 2318 -8110 5428 -3373 -12210 -6204 -5289 -7045 -5632
3382 -5632 -21232 -16817 -25479 -29051 -20050 -29693 -26055 -10022 -10251 356 398 -4481 -12976 -18556 -12056
3367 -12056 -20240 -26935 -17051 3504 10759 15605 3967 -14032 -16710 -16238 -23165 3911 2881 -7204
3353 -7204 -14078 -23444 -40101 -26974 -27901 -38320 -39817 -33052 -25805 -13209 -11101 -11035 -4770 -3560 4154
3338 4154 511 -22205 -19017 3006 14826 16434 22763 10893 -6682 -22026 -26498 -3899 4545
3325 4545 19374 9815 -5418 -3184 -7369 5886 11414 -2910 17757 23446 9428 10799 24101
3312 24101 21507 11665 16854 24734 22934 16976 11851 9797 7144 13584 -1305 -6711 -18563 -25878
3298 -25878 -16883 7175 3843 -2240 -5738 -11250 -1546 3052 -15602 -24825 -23829 -24617 -15928 -21852 -30260
3283 -30260 -31119 -27758 -12323 10980 21151 4859 -4233 -155 385 7381 22427 16968 12144 20109
3269 20109 22542 24152 20523 -4208 -15755 -13413 -4842 5941 3552 4691 24474 35903 13333
3256 13333 10210 6963 -11870 -11789 -14460 -10188 -1578 7007 -2237 -18849 -15847 -11075 -12543 -22290 -13650
3241 -13650 901 2202 3859 6796 15369 8932 7421 12475 16950 15925 5685 1927 10227 2284
3227 2284 5159 2454 -7130 -16185 -32037 3111 12273 1699 -10831 -15454 -363 25900 22186
3214 22186 19082 11094 -2156 -8117 -16905 -216 16118 16740 8148 9376 914 3669 20795 17002
3200 17002 2544 5621 754 -23412 -33036 -33435 -9433 -3904 -11202 -11299 6709 16987 22852 24466
3186 24466 27835 10548 -513 1810 -7685 -21790 -19048 -1699 -3467 -19765 -12713 -12060 -9963 -19621
3172 -19621 -13298 -9847 -7870 -11551 -15857 -16461 -27332 -18906 -13033 -15465 -14211 -23912 -21799 -8393
3158 -8393 -243 6619 -14145 -13317 15390 14350 -10938 -25812 -21747 -39038 -36788 -34400 -28127 -24960
3144 -24960 -30511 -5919 1960 -326 1644 6230 7062 -6336 -7978 2586 -5447 -9395 -5752 10820
3130 10820 -5665 -18094 -12037 -5376 2598 -10020 -4961 7186 15542 11954 5760 -709 -618 -26505
3116 -26505 -34807 -37648 -40166 -29911 -20024 -18960 -32523 -16924 -419 603 -2525 3788 14686
3103 14686 9704 -20477 -35102 -33645 -33499 -27675 -26035 -23535 -11569 -20895 -27007 -13719 -18676 -26682
3089 -26682 -24182 -21913 -37452 -24240 -4551 -10286 -2288 -20102 -36217 -23577 -15357 -3347 5177
3076 5177 14002 11241 -1993 -18894 -18317 -21951 -2642 11223 -3620 -15462 -21649 -25436 -24628 -32093
3062 -32093 -30729 -14542 -11932 -3810 -4478 323 7264 136 3363 4432 13524 2023 -8459 -4039
3048 -4039 -12941 -8082 12497 14539 24497 4206 -2873 -6203 -5749 8460 29415 17728 15079 332
3034 332 -11999 -5259 4003 2635 598 -22797 -18751 -22108 -20613 -21104 -18378 -12664 -5227 -11808 -10057
3019 -10057 -7255 -5530 -2187 -5600 -11063 -18353 -14466 -4452 -5984 726 -8023 -31083 -21367 145
3005 145 4293 9971 18328 10184 -10901 -18242 -10769 -12442 -6492 -13760 -21164 -9761 -5330 -7632 -6475
2990 -6475 -13497 -31515 -28531 -14006 -11786 4912 20954 13824 -6040 -4225 -5605 569 1637 21582
2976 21582 11173 -4681 -16807 -23063 -28326 -18222 -6209 26095 36699 40313 34462 25055 -616
2963 -616 -1796 -2946 -11576 -8963 -14568 -15363 -6222 -5142 -21257 -16534 -2342 3943 -11101 -19655 -13198
2948 -13198 -13173 -3294 10061 10691 -3568 -22190 -17445 -1630 10989 12132 18065 16233 12112 11703
2934 11703 9462 3280 -1795 -3148 -3237 20655 20590 -4378 -13383 -1052 13534 23185 29004 17324
2920 17324 9416 6659 -10061 -8248 5841 8158 -578 9086 22160 21393 26585 29729 32416 28031
2906 28031 11758 21933 9499 14465 26072 -2137 -22473 -14661 5706 6937 -324 -13807 -13882
2893 -13882 305 18057 15761 3638 -1165 -3705 14833 24637 11616 5773 10160 9744 -4688
2880 -4688 -21915 -27733 -19654 -22519 -12927 -3259 -4415 -3175 -3148 8112 13537 19187 7967 -8992
2866 -8992 -13419 -18971 -12893 -3429 14426 28896 35490 36470 31118 23477 10520 16377 3547 1357
2852 1357 5679 -385 -9733 -382 166 -12598 -3913 -272 -3732 1749 5605 -2891 -4437 -11237 -19609
2837 -19609 -32657 -12114 8938 17038 18911 13977 1004 6264 -4492 7907 23938 4578 -17413
2824 -17413 -16417 -15068 -21204 -26982 -1648 4238 2408 390 -20440 -25096 -19772 -1766 -7962 -6420
2810 -6420 -16719 -18682 -12200 -18326 -21617 -23597 -9659 -9427 -14008 -19820 -15304 -790 992 -7464
2796 -7464 -8550 6616 5682 4430 4240 17988 18141 10959 13109 6841 -1804 -1088 -11862 -26763 -1436
2781 -1436 6601 14965 5285 5668 2929 -11318 -6439 -13923 -3700 -2099 -8526 -11218 -10749 -5453 -7261
2766 -7261 -7319 645 2084 15682 4667 737 2062 2790 -12264 -19806 -15048 -19085 -13365 -1549 -3997
2751 -3997 -31089 -31865 -16316 -29306 -12491 -2084 890 3429 10449 7572 -3462 -14596 -8463
2738 -8463 -5532 14060 29799 8568 -12352 -17378 -9493 6388 14659 5800 -43 -9234 -23027
2725 -23027 -16038 -2800 6566 14068 17024 -5401 -11393 8128 14593 21151 41427 18648 12187
2712 12187 7946 13596 3815 3163 10317 6840 -5218 -5257 -9230 -5061 -5179 -3082 -14362 1065 6829
2697 6829 13561 12057 -2651 -571 8995 -2872 -6344 411 -1269 866 -3994 -3649 -15235 -12593
2683 -12593 -204 4101 3957 4557 11442 22845 7802 -7042 -14539 -12432 74 7489 16404 27031
2669 27031 16537 -2662 631 7640 -7914 -3066 7458 15558 3357 466 4671 -190 -8813
2656 -8813 -22659 -9576 7841 1997 -15888 3144 17397 21523 24768 31945 26633 20331 26422
2643 26422 11435 11358 6070 17572 9253 2373 1603 9880 -2689 6462 20346 14849 1651 -4450
2629 -4450 -6764 -16668 -17684 -7860 342 1250 -3668 -7766 -15031 -18310 -9623 -19196 -15907 -4097 -5919
2614 -5919 -12612 -18259 -13524 -29840 -47638 -51430 -33119 -18905 -14714 -31519 -28407 -10692 -9161
2601 -9161 -15746 -13129 -7516 -13653 -6577 -8086 -8895 -8583 -12240 -22703 -12769 4568 -1441 -9950 -15210
2586 -15210 -25954 -25429 -13068 11370 30085 39224 25086 19609 21396 15603 14300 37586 36683 16109
2572 16109 7194 14004 19885 23216 13097 11816 22236 25340 12415 509 -9429 -13404 -16862 -8163
2558 -8163 3480 13650 9883 -1399 -4549 -15417 -13518 292 5286 1082 2188 -10724 -16617
2545 -16617 347 9540 8904 10915 30075 32123 11625 -3704 -10876 -15555 -14624 4064 10897 8975
2531 8975 15657 12222 9141 835 -6700 -99 -952 4534 9168 -1977 -3653 10378 17662 13554 3383
2516 3383 4050 -9625 3215 8527 -6266 -13033 -17887 -25026 -19728 -14076 -14649 -6265 7147 3800
2502 3800 -7289 -8771 866 -2056 6483 14983 22430 19321 24946 24878 29640 7624 -933 17140 30675
2487 30675 25900 1712 -4809 -8946 -6159 -7070 1463 1971 -1050 7793 22008 13502 307 -16382
2473 -16382 -20375 -8649 8640 24296 6567 -23121 -22234 -9927 685 505 2651 403 -5468
2460 -5468 -9484 -5338 -3601 5552 -2164 -1085 8650 7941 1603 -613 6939 4087 -4421 -10574 -4956
2445 -4956 10782 10965 7882 102 -503 18584 20164 5153 2357 10868 2784 -17930 -34582 -27441
2431 -27441 -21450 -21689 -35951 -16317 4895 4663 -8493 -15923 -4389 -1099 10998 20956 31340
2418 31340 11001 8723 18462 4796 1970 -277 -13868 -33041 -20423 -5150 -12705 -7700 -10260
2405 -10260 -12240 3396 -8211 -2824 360 -15592 -1860 10974 19034 17336 12675 6186 17585
2392 17585 18130 18080 42608 50317 36140 27344 37611 25722 3835 11658 10508 1887 -4503 -10295
2378 -10295 -8189 -7773 -7091 -14396 -20436 -23054 -27483 -21045 -18967 -15419 -9443 -13850 -22951 -26430 -16316
2363 -16316 -18229 -6505 2471 6925 11580 10544 -1426 -4723 2620 -1430 -14438 552 28667
2350 28667 37901 39424 29227 17597 17469 23814 24143 18281 -2602 -21647 -12663 -8536 -12675 -19253
2336 -19253 -9557 -1054 6153 3198 9512 6166 22139 28666 17506 4968 -11872 -14437 808
2323 808 12724 8391 10554 13949 1634 -5827 -4453 462 -11964 -10160 -13748 -20148 -16025 -9138
2309 -9138 4291 16010 15872 4510 590 5754 3326 -2243 -2491 -6733 -10458 -3943 -8162 -9153 5924
2294 5924 10850 5398 -2577 -21230 -26788 -16286 4633 31537 36737 32055 31613 32504 24148 25146 18920
2279 18920 3446 2824 5441 5100 3044 -10021 -18093 -12649 -5916 -408 1328 7066 3398 199 10334
2264 10334 4024 -3753 -6012 18902 20151 16365 14946 14863 15508 18937 35439 27997 14735 -1320
2250 -1320 -1037 -3407 -18648 -6635 11271 27323 18858 4436 8133 9134 17374 26721 26506 12499
2236 12499 8134 -6528 474 684 -10082 -11943 2316 -4498 -18061 -16469 -11863 -12999 -7997 -3145
2222 -3145 6992 -969 -11691 -14121 -4924 3503 -11624 -9058 4436 29934 28871 -3171 -4913
2209 -4913 -2922 -803 6264 29184 33647 21815 5321 -15075 -31615 -31431 -9040 3665 -14858
2196 -14858 -21425 238 22012 3855 -4725 3419 5153 1048 1226 2911 -9402 -31971 -30008 -22670
2182 -22670 -14866 -13603 -27247 -26541 -3124 -3499 -6407 -2483 -502 -15601 -14156 -12644 -18913 -26666
2168 -26666 -22364 -5166 -2166 -8498 -2864 8902 16764 10644 7181 -6512 861 20827 37285
2155 37285 44621 26823 20205 9634 -1797 -2385 -4859 -12445 -7325 -3715 9840 26271 30708 4457
2141 4457 2535 6866 1656 2507 -2116 -5387 -5731 -7443 -18438 -9795 16329 27271 19589 11278 28827
2126 28827 27337 10164 2556 1442 22609 11999 11187 15230 21301 19684 11907 8176 -409 -9341
2112 -9341 -12854 -7148 -5617 -15554 -9593 -8121 -5222 7101 4623 1503 -5070 -979 5920 8383 10187
2097 10187 15298 3406 -508 -3103 -5014 -17076 -18480 -16623 -21296 -11296 -3729 1228 6878 9063
2083 9063 13880 15933 13355 6374 11934 18567 18183 -520 14417 6707 -3749 -5793 5440 15565
2069 15565 1242 -267 -1149 347 -4430 13312 16224 -3466 -22714 -11030 6760 21889 26268
2056 26268 38847 34414 28018 10765 -12015 -13359 -12680 -9259 -11772 -5086 12340 23704 19157 16928
2042 16928 24882 22785 10945 11080 -454 -8898 -9624 8023 15705 4835 6272 3201 -12555 -22750
2028 -22750 -3671 4146 3123 2376 -2082 -9654 -6395 -2039 -9246 -1155 -8188 -24838 -34036 -29045
2014 -29045 -10183 -8179 -21147 -7604 3517 8445 -3637 -5145 5555 -3858 -12963 226 -2157
2001 -2157 8154 8946 17135 27139 10287 -5357 1962 2785 9588 6395 6570 20468 8297 6100
1987 6100 -4920 -10881 -395 10794 5989 4674 -861 -1190 -5594 -4646 8403 16700 26309 22270
1973 22270 16110 6871 2359 6043 8210 30366 44990 36752 40465 10283 -10725 8249 24614
1960 24614 23358 10580 -2750 2983 9688 2389 3952 6750 22780 27399 22452 3179 -1509 8962
1946 8962 17820 5322 2131 -1071 12211 22054 10830 15494 14381 6528 4196 16739 -543 -8406
1932 -8406 17406 29203 30133 35789 29868 19532 17187 9781 -356 -14790 -22316 -9731 6871
1919 6871 21021 9144 -10027 -2904 -1159 -3971 10803 704 -5221 -18894 -8846 -4344 -6954
1906 -6954 1824 -8333 -5938 -5532 193 -494 -11602 -22083 -15670 -9486 -1732 -12628 -23181 -18724
1892 -18724 6174 12649 16589 13506 4534 -365 -1085 -6922 -1205 -3293 -7012 -2434 16504 13741
1878 13741 9439 5246 -4488 -23925 -23415 -31611 -25895 -10193 8299 5033 3315 1878 -13293 -17385
1864 -17385 -30588 -25572 -10068 7606 20089 6860 5566 -1411 -13665 -26042 -26429 -19196 -11002
1851 -11002 1840 -4534 -3190 11703 4445 -7185 -14563 -11401 -2260 389 9067 9774 10356 18495
1837 18495 22870 16465 -619 -22966 -30565 -21524 -10273 -1432 -4186 525 1001 12662 17104 19661
1823 19661 1565 11324 20438 5052 5736 11849 -1911 -8903 -6974 -16906 -22022 -4942 1409 -8506
1809 -8506 -12660 -1148 14466 18436 9338 -15319 -18437 -284 1216 2184 1763 -7691 -1026 -509 -12883
1794 -12883 -10024 -3311 -152 -13423 -1074 -5992 -10902 -7783 -2966 8272 -1042 -5277 -219 4712
1780 4712 -7027 -25552 -47841 -40527 -28098 -9005 4655 5147 4125 13682 11570 -10035 6230
1767 6230 23377 12641 11858 4172 12283 22027 28090 21260 5633 1724 7392 15061 10606 6888
1753 6888 12749 3026 7437 3460 2247 16671 12527 15156 7272 5519 9267 1848 -534 -8034 7548
1738 7548 19592 21371 -1605 -10797 4604 13052 12221 13865 9750 -3368 2954 31801 24785 17391
1724 17391 13302 -4467 2173 -8643 -11295 -19705 -27363 -25125 -9329 1202 3377 738 4268 6293
1710 6293 -450 7644 -1111 -3060 4703 -14914 -33604 -32464 -25593 -13206 -15381 -12194 10460 23965
1696 23965 16171 -6368 -6914 -619 -9765 -12750 -16872 -20181 -29704 -56500 -55497 -22362 -5465 -5429
1682 -5429 -8057 -20395 -7420 -2371 4626 12517 14855 4423 -13989 8759 7906 -5010 -7960 -666
1668 -666 4184 4838 5966 6188 -17259 -10627 9193 23250 1440 -225 21911 32621 15727 9384
1654 9384 8284 3920 12060 15355 1729 -14411 -25913 -20733 -28236 -14631 5492 7257 1212 -8808
1640 -8808 -23611 -18969 -13930 -17940 -21738 -25825 -41249 -7466 27465 18681 1943 11421 6770 8717
1626 8717 6914 6960 12167 23234 3945 -20981 -8736 -1190 -1921 -8263 -4821 -6256 5253 15663
1612 15663 31191 32202 5429 -14421 -6703 10089 14017 18249 12753 -1613 5982 15186 12289
1599 12289 4801 -4691 -7781 -15737 -22631 -10732 -19198 -38777 -31624 -17493 -14831 -756 402 10161
1585 10161 12788 -7330 -28117 -25809 -30049 -11118 12796 22160 11460 222 715 16511 4864
1572 4864 7883 25276 31512 8498 -6954 8162 16700 9787 -232 -1685 9299 9225 13061 7317
1558 7317 -7579 -23486 -31858 -20706 -18052 -7903 8465 9288 12803 7065 17829 13783 7568 -8320
1544 -8320 -8402 6724 13263 11798 9910 9780 21662 25647 29542 35022 31909 17480 -9388 -21595
1530 -21595 -23481 -25167 -10335 15034 4983 -5905 1612 16565 26359 17810 497 -14413 -6313
1517 -6313 6713 8747 11769 1572 -11265 -11940 -9442 -10144 1181 6419 4962 -1580 10356 22261
1503 22261 30669 28407 30282 10614 -1237 12883 23150 -2983 -23888 -32810 -16918 -6324 -10757
1490 -10757 -14775 -4430 10178 5286 -17856 -22320 -13339 -5367 -8189 4346 14450 7176 -4773
1477 -4773 -7691 11258 18000 4198 2756 18875 26318 29400 17211 22532 29547 28403 8683 -9636
1463 -9636 -30666 -15120 -4184 3032 30 15694 10137 3826 3506 1401 -10887 653 3723 14150
1449 14150 18320 20930 25780 19438 2135 -3881 -139 6918 9621 8180 -1471 -14040 -9733 1356
1435 1356 10700 4050 -4482 -5385 -10151 -17225 -5688 7994 -110 -4422 -9315 -15663 -4234 -1865
1421 -1865 -2336 1111 8120 -8917 -4982 -451 16915 31955 22784 4347 7175 14584 5852 13916
1407 13916 24083 4396 2160 30483 29728 18430 21920 28492 18596 6696 21421 30853 10371
1394 10371 1565 10747 1777 -5710 -17651 -9193 591 -7840 -14535 -1930 -5820 -14776 -12958 -6464
1380 -6464 776 -10602 -302 7254 6533 3515 -10297 -12292 -16502 -22079 -17172 -2070 10021 13775
1366 13775 7444 -17016 -15727 -953 14497 13375 -4372 -2552 17905 29072 15264 15520 22955
1353 22955 6111 -12313 -13631 -2140 10367 4572 -3376 -6349 -4269 -16507 -29238 -34108 -29810
1340 -29810 -22006 -10968 -3190 -2775 747 12205 13239 13350 18545 32062 33713 22027 5565 -9427
1326 -9427 -20080 -9590 -4195 34 18741 24986 1995 -6174 5582 13158 15419 4382 -7108
1313 -7108 -2511 3719 6074 -1059 17310 5613 -3067 -8228 -1721 -1016 -5798 -13570 -31260 -28365
1299 -28365 -7911 -433 2722 20614 22963 23118 17198 15032 17123 18380 11773 1697 10204 21229
1285 21229 9547 327 -14830 -6086 -1438 -4615 5794 20671 32113 18833 -4416 -21638 3582
1272 3582 -8589 -15818 -10379 -4973 2733 -8244 4651 -194 -2734 -9811 -11548 -19906 -27788 -12357
1258 -12357 -8040 -24828 -38769 -36558 -24727 -23507 -34450 -38485 -27308 -25590 -21599 -23055 -20929
1245 -20929 -8968 11464 22704 19325 7453 10029 31174 22124 20668 21790 -4531 -13088 -5889
1232 -5889 19057 22231 15697 21227 26016 21144 15658 3976 1139 -2604 16895 24718 15384 13963
1218 13963 13783 90 3027 -4712 4198 20700 21882 4077 7670 17975 23283 37291 31779 9424
1204 9424 -770 -10176 -18807 -12753 -8665 -589 -14065 -17824 -18889 -11157 3961 706 -8123 -6636
1190 -6636 -16001 -29045 -24780 -1971 695 -13790 -21222 -25251 -16661 -18506 -19813 -25421 -31571 -25314
1176 -25314 -12769 -17339 -23252 -22198 -15370 5211 20377 24987 22029 17342 7296 5542 3347 5678
1162 5678 9829 -729 -4677 -2792 12528 11257 14332 9334 2448 -5644 -1766 -248 -5317 -14134
1148 -14134 -3257 12750 9387 1159 -5745 -1358 9016 851 -7025 -2906 -13420 -18750 -10935 4546
1134 4546 16270 27691 21667 10486 18843 25378 28195 12626 4460 -6416 -6964 -2570 10059 27423
1120 27423 23271 27762 22281 24777 24895 19530 9570 4669 9818 2593 -501 -2612 7703 20654
1106 20654 23598 11585 22063 20789 5838 4208 7832 1235 5231 -4758 -15963 -19398 -5761
1093 -5761 4481 -2849 -10915 -8672 -5218 1556 -9452 -34629 -31708 -11032 -4282 7386 1848 -5699
1079 -5699 -10075 205 3348 -1110 -1954 4940 6666 12423 9709 -5922 -18208 -12530 12171 18818
1065 18818 12975 11629 15594 34747 33959 10377 6922 17812 9216 14170 30102 35653 33670 25889
1051 25889 24584 19439 -1706 -7795 -15784 4671 15022 13859 38529 27094 10851 19088 17670
1038 17670 -567 3149 -2176 -15499 -6587 -4685 -14577 1058 2318 1833 -3417 -13341 -9237 -22602
1024 -22602 -26295 -14196 1499 -1928 3939 19462 26646 20685 11273 10083 21156 26866 26881 12034
1010 12034 -3946 -8176 -11026 7172 24424 13652 9124 5679 26238 32071 25231 27357 14051
997 14051 17677 -3790 -4109 -9580 -4263 -9731 -11316 -12051 -28626 -13751 -182 70 2186 4768 -4364
982 -4364 6528 13649 20581 24767 20711 7931 6524 19203 -10065 -9987 -14473 -9595 -2047 12156
968 12156 14319 11060 6027 1580 275 -4381 -9189 -7509 -5283 -2892 -5519 3958 16195 442
954 442 562 3539 3346 -526 6773 2356 4538 3000 -7496 -3053 3112 -2285 -27884 -30021 -15651
939 -15651 -16263 -19064 -5623 5291 8222 6920 -2980 5847 3860 -4758 -5732 -9799 8418 19594
925 19594 25152 13048 -1697 -13049 -16578 -15380 -5570 -2336 1203 8314 7980 3998 -1294 -7424
911 -7424 -19468 -10245 -3397 3357 -3728 2397 10138 25406 34357 26229 25259 17162 14664 4030 212
896 212 8296 -4315 -15510 -14624 -8312 -20316 -1017 14614 13014 2376 -831 5442 16043 22102
882 22102 29612 40992 25358 20532 9739 7826 16866 29467 20058 3278 -5561 649 7815 4579
868 4579 11262 12341 13885 12355 -11189 -16125 -5011 4622 7439 11927 16172 1909 -13140 -23795
854 -23795 -22727 -7247 20063 31358 32790 8745 -12759 -15589 -16443 240 8056 -3683 -17548
841 -17548 -13865 -13820 -4266 -17460 -28808 -37999 -38463 -29472 -17334 -7766 3393 5491 7051 15294 27803
826 27803 27335 24836 8658 13571 -1324 -1125 6040 -5224 -17213 -18338 -21363 -9643 2504 -2407
812 -2407 3145 -8853 -14713 1306 2717 14892 19343 12469 14422 7787 616 2953 -4320 -19263
798 -19263 -15820 -6045 -20824 -19117 7458 3636 -9902 25 12741 12702 29582 27331 1320 -8415
784 -8415 -11889 -12534 -446 -14892 559 1040 -6582 -6631 -495 -3904 -15276 -20048 2422 16895 6565
769 6565 8096 5189 -2603 -12806 -25611 -3174 2995 1939 -3034 2669 4543 12020 8532 -3470
755 -3470 -2915 5697 18388 10420 9292 19502 3392 -11728 -21618 -20103 -23248 -17940 -12233 -5251
741 -5251 -5040 -4181 -18827 -12924 3599 12566 16971 25506 31315 14072 -3696 -3368 -1960 -14013 -10326
726 -10326 -238 -7792 -16231 -14325 -6009 1001 6225 9208 2449 7894 12497 11580 11924 -1816 -12974
711 -12974 -14906 -19737 -21630 -14034 -13020 3035 8219 4152 -5521 -2139 -1773 18561 30357 13836
697 13836 -1217 -10992 -17307 -19065 -2012 12479 7790 -8687 -21983 -10859 -8958 -8230 2570
684 2570 -10408 -18338 -16766 -4819 -8323 -7912 -8287 -17507 -25784 -2170 7749 11557 -9319 -5591 -2131
669 -2131 -4917 -1900 -4316 -1073 -5863 -15274 -29584 -12686 -2451 -11398 -1292 -4067 -9947 -5033
655 -5033 -10747 -21591 -16611 6276 -697 -7630 -17682 -14509 -13745 -12239 -2706 -6817 1082 10907 11555
640 11555 6600 7444 4941 5672 8221 12143 1756 2338 5504 13148 16235 11258 20157 11526 -5694
625 -5694 -10478 -2847 -2964 -1533 -1495 884 3929 15234 2761 6754 22144 7577 1006 2844 1356
610 1356 -13255 -14976 -1070 -2456 -19646 -43835 -48412 -34980 -15043 -9669 -11453 10162 14821
597 14821 19383 17654 6272 -3070 16057 28030 22460 14643 3358 100 17594 32671 26602
584 26602 8262 1535 12668 6033 1463 6006 13609 3734 27 -7707 -22258 -24779 -20174 -1277
570 -1277 517 -12621 -32809 -24653 10597 11785 5844 19499 9987 -4690 -7054 -1790 4729 22106
556 22106 35333 39816 45096 40410 41353 32785 16912 14572 10673 371 11169 6520 -1994 -6713
542 -6713 -20638 -21009 -25009 -20758 10914 19679 -3341 -28602 -28119 -18837 -13282 -12929 -29908 -21916 -18540
527 -18540 -24998 -20365 -10407 -12109 595 4040 7816 -2145 -3655 3666 1792 18783 25638 22710
513 22710 28876 38515 47871 40234 11035 -9937 -12407 -25282 -33655 -13137 5550 -7516 -5315
500 -5315 15526 9159 7764 12743 6998 -3801 -16051 -17795 -10492 -595 -7843 -4663 11466 95
486 95 -23279 -47961 -38134 -33992 -15455 -17910 -12545 -6604 -9545 -8525 -10925 -6655 17063 2604
472 2604 -1967 11960 8844 17613 -9035 -26260 -13475 -2641 -7490 -8806 2427 -8476 -13035
459 -13035 -6388 -5968 -11497 -14494 -17360 -15118 -13867 -17235 -14804 -10227 -796 -3500 -2875 -13384 -19627
444 -19627 -17971 4292 7651 -13705 -20982 798 683 921 4285 1575 8045 -2464 -7018 -26717
430 -26717 -23661 -16584 -3687 15013 24266 15824 9518 -4588 -8635 2115 6349 7964 -1870 -22059
416 -22059 -15696 -10660 -18984 -15682 -11152 -546 11882 17123 15807 5769 2156 -9669 -9851 6311
402 6311 13410 7311 -4710 -18799 -28136 -23151 -9202 -3516 -11499 -12856 -24128 -24881 -7749 -1603
388 -1603 3881 6386 13767 -448 -5034 -13871 -10992 -7037 -503 -1233 2139 -4172 -9126 -9091 -6051 -8221
372 -8221 -7807 -11510 -8329 -11529 -8777 -15100 -24611 -30577 -21893 -1203 9552 12809 6727 12633 11855
357 11855 18932 23132 13103 5267 5733 -1383 -10210 -9580 -2154 17222 23334 11253 9783 15776 8241
342 8241 6284 15097 11281 -1214 -2288 -8532 -6463 6328 13377 11826 10224 11528 473 -7886
328 -7886 -4092 -5143 -1931 12697 23638 14917 6188 2755 3456 11529 4373 -4694 -3480 -1364 968
313 968 8378 17463 16072 5982 415 -5344 -245 8147 6899 753 10554 5272 -9791 1556 15306
298 15306 12080 935 4333 12757 14258 23751 37611 17529 -3253 -2599 6612 11507 8409 13012
284 13012 4290 -10903 -2139 9353 9314 -1573 1757 13817 5713 -4466 -3126 -12561 -11170 -15753
270 -15753 -14865 2235 7285 7296 4565 5188 -786 -2395 -9411 6062 12788 11420 -2618 6271 19720
255 19720 11567 10168 -406 -5959 -7882 3805 5316 6276 14301 12970 -4350 -11557 -8426 -10539
241 -10539 -14268 -21909 -21954 -25411 -16638 -9655 -10249 -17402 -18083 -14542 -13089 -7858 -13595 -2734 11267
226 11267 7881 -752 -9401 -14720 -16654 -20842 -17389 -17099 -19918 -11381 -3959 -9177 -16183 -9561 -5138
211 -5138 -14582 -8883 1522 8914 20394 6718 -13467 -15980 -11839 -9926 286 7139 11446 10218
197 10218 407 7634 11143 3783 1483 10097 15248 23076 16119 11180 8794 9193 -2447 -11989 -6434
182 -6434 11874 19624 5439 -14040 -17140 -9325 5639 7194 9620 -101 -14875 -26749 -27791 -14754
168 -14754 -3570 -738 -4939 2520 10192 9863 -1202 -9757 -3590 -5796 -3462 -2622 -3521 -2448 2955
153 2955 8894 -2561 -1419 6706 9237 6868 -1698 -2333 -14805 -26952 -12126 -10158 -1755 1992
139 1992 11933 25579 12167 -1360 512 1512 -12200 -16767 -15491 -17273 -15809 -6484 -647 155
125 155 4084 12927 5934 -10560 -14428 -11669 -11069 -7814 2628 8917 9887 548 -9301 -16719 -10115
110 -10115 -6175 -11841 -6565 -129 -1347 -5879 -4502 -14940 -8122 355 -6327 -13798 -8884 -3814 -1993
95 -1993 -6133 -9624 -8203 -8616 -4728 -6257 -12406 -11577 -3903 12135 23363 17196 3571 1262 5277
80 5277 -2379 4660 2286 -4941 -2118 7544 5006 -3890 -2565 4737 -259 -4160 -7247 -4019 2380
65 2380 -8325 -3727 8893 1847 -882 -624 2588 -502 -9283 -7421 5496 11288 9939 759 -733
50 -733 3776 7890 20532 30041 20662 6894 2879 4851 8809 -2822 502 -129 9112 12476 7091
35 7091 4080 8504 8121 3100 -644 -441 -5148 -1620 -14901 -19310 -5458 10181 9109 8651 -1205
20 -1205 686 -4077 -9117 -7196 -4917 -922 5052 12849 11420 827 -14924 -20186 -15498 -15010 -11291
5 -11291 -11238 -1803 -3538 3502 2454
0 2454
$$ Imaginary data points
##PAGE= N=2
##DATA TABLE= (X++(I..I)), XYDATA
32767 15816 20649 20040 26391 24353 17241 24454 25922 11533 13580 29589 24222 21728 24742 26211
32753 26211 33475 34018 33633 40378 33922 37928 39866 34873 34125 37264 46586 46378 28212 20518 13036
32738 13036 9773 10623 17675 15544 18263 19177 30901 39287 31458 37219 46334 48869 47378 30480
32724 30480 28275 35650 50947 54019 42535 27373 20737 24088 31834 38761 46119 51467 48441 53382
32710 53382 56990 65556 64754 66359 53188 48894 64563 62990 58472 55108 54409 54786 67690 65085
32696 65085 67743 60529 57963 60645 71891 80525 63967 54364 53864 47736 45794 48914 45966 47159
32682 47159 55888 62776 68564 62693 68069 70057 55132 45283 47582 55706 59078 75628 81379 71888
32668 71888 61747 70519 76632 70289 60991 65398 67457 70310 78556 72492 59677 47767 41405 43439
32654 43439 48929 52700 53891 60025 60388 70005 76699 69533 71493 83144 91512 92080 91870 71054 57240
32639 57240 57214 48530 53071 74268 68243 69205 68605 57137 43394 45922 39122 63312 90225 99660
32625 99660 89583 96056 79817 70683 66627 69700 77080 71180 67627 75813 76371 90115 86010 78170
32611 78170 88075 92721 90812 82448 75958 70968 72376 94535 93971 83959 85684 88037 99637 104457
32597 104457 103356 97297 94829 87470 84651 84608 92015 84900 81524 84620 83432 85710 96891 87720
32583 87720 91518 97714 91837 81659 80875 83636 90765 97827 95233 85218 80545 83535 91772 102330
32569 102330 88157 77870 79669 87872 75630 77170 86744 81504 86320 95578 101075 95878 92455
32556 92455 98608 106444 100662 103874 112799 127625 129825 123265 113588 109036 101865 95868 94790 96522
32542 96522 104124 118691 126874 128153 119119 112882 108223 101185 102213 110232 112632 110072 122428 119269
32528 119269 111685 121532 127314 137733 135960 125655 125257 110883 110963 119902 125694 131906 146182 140978
32514 140978 130284 129238 142216 133581 119394 115453 116996 115716 104504 98109 92760 91172 96106
32501 96106 101124 104670 110680 112028 116762 132431 118780 109011 99545 100175 108102 101988 103294 98757
32487 98757 92890 98699 107772 113495 118599 107068 98984 100520 96710 106808 116280 124285 148861 143147
32473 143147 118594 109759 114281 135214 140437 134920 140184 148938 148758 160090 152109 134031 125613
32460 125613 134306 121496 114337 129621 133611 124923 130257 123598 115844 111938 109002 116534 121587 129174
32446 129174 123501 112127 118826 132685 139483 128249 117232 103591 105060 119055 118817 124190 128254
32433 128254 130067 124958 123070 133737 133690 141814 132956 127882 132357 127507 129063 141557 147591 159656
32419 159656 167258 179064 163377 148566 139570 140395 145888 140263 141226 146731 143988 132007 132293 135810
32405 135810 128109 103578 98421 113107 119739 129899 131479 122490 113699 114041 120144 134465 139017
32392 139017 131859 126179 137530 144800 143381 132852 151399 142339 138306 147868 159172 163544 169466
32379 169466 171213 167706 161596 163575 169180 168156 169183 161754 157617 168242 151481 132013 136126
32366 136126 140641 141746 143104 129157 122150 133735 145178 146116 147427 155477 136493 128690 137502
32353 137502 145507 149105 150047 144179 133794 139144 148171 148321 140299 137441 144777 147144 140819 135916
32339 135916 152996 159679 156857 151857 155486 183343 183948 173743 161965 166463 182868 167734 150813
32326 150813 149270 145988 142322 147698 181307 181561 178185 158608 145557 149334 154056 158760 159587 144056
32312 144056 160397 161466 159471 159921 137856 141008 137239 139518 141591 151045 161475 158948 160056 162691
32298 162691 159835 168099 160170 145769 157761 149475 133033 143732 140169 143511 159026 154301 155898
32285 155898 155656 147401 137008 140762 146168 157412 176791 168565 142549 140806 138578 139296 151010
32272 151010 173519 180506 180600 153924 137755 145455 142831 129294 135944 144812 138891 146157 158466
32259 158466 171551 176946 191859 190910 192513 193089 179245 167719 164424 164029 163482 153543 155714 157033
32245 157033 147877 140789 143264 144814 159289 172694 192921 186865 185522 172006 155457 151742 162231
32232 162231 169216 179705 174948 176975 161256 141809 141829 161231 157652 162625 170598 175992 174857 164467
32218 164467 168012 170488 159314 150352 160192 163093 158452 153775 168451 158059 155047 145089 138032
32205 138032 135305 135981 158664 163859 154771 149608 144399 155559 163317 169742 156654 144401 149569
32192 149569 162403 156543 153393 153028 159204 178782 175635 154651 146717 142541 149458 151659 137807
32179 137807 124522 128247 143475 152765 154964 161313 167330 179633 167888 181931 180338 181142 183695
32166 183695 184529 161453 160912 170411 166705 175722 188678 169814 164726 170165 181387 160976 160221 163544
32152 163544 159641 146516 149532 154048 142435 154267 157800 164935 179206 173977 170420 170395 168278 156706
32138 156706 162141 167185 178509 186024 186529 176263 170898 164349 176899 175299 164123 149930 173977
32125 173977 189828 175367 165883 170640 157327 151310 151640 157329 161158 187020 194122 176107 167864
32112 167864 163732 155152 153657 141761 147872 146535 147028 159391 146055 145292 159089 176089 179801
32099 179801 168997 153870 143782 135946 141010 146274 169550 167737 182912 199826 185446 185941 166957
32086 166957 148465 161416 173432 163620 158575 151558 154398 162026 165953 177698 180167 163430 145949
32073 145949 149031 158650 181932 189656 180442 173723 168104 172838 170772 158547 151405 151615 170535 171918
32059 171918 167876 164433 142782 131321 132365 146817 150015 157726 159660 171449 180841 188163 177695
32046 177695 161702 157514 165539 180213 188691 191564 180969 156465 148838 149048 153299 143991 141007
32033 141007 151675 146504 140759 149122 152080 154607 164823 179457 197965 205304 194400 173753 175548
32020 175548 177784 184952 182686 174457 173182 173923 178223 181395 180113 171529 165546 147851 138551 132786
32006 132786 125391 133049 130723 134678 162950 176019 180315 173601 175201 169283 160537 153857 140783
31993 140783 158743 164449 150873 159676 164778 162012 153511 153537 158109 154267 162099 171795 178273 163100
31979 163100 152328 151923 169314 170701 145819 145429 147334 146057 145234 162837 155861 148125 147125 161638
31965 161638 172523 163805 160020 150985 158738 178147 199208 198565 180431 159416 149575 154672 165575
31952 165575 160846 148476 147788 149316 157958 175253 168173 156273 149249 150129 180010 192130 185034
31939 185034 172050 163874 171342 170828 167459 170166 185588 175134 161712 149986 157066 150793 147200
31926 147200 157137 147513 149777 163451 147506 112227 115736 148159 158924 153635 170581 162743 145192
31913 145192 158347 155448 159262 154961 149443 150312 143661 142251 138518 125887 132687 138805 137583 138559
31899 138559 147774 145246 138223 154571 164094 163404 145319 143314 150566 172005 167360 177548 183328
31886 183328 188177 179423 171319 159376 178002 178969 159958 148521 154936 153824 167700 166001 170285
31873 170285 170283 155607 170925 181806 175443 161978 169410 153860 143137 142114 150830 165997 170069
31860 170069 168842 159513 166540 162298 151581 156867 173789 185348 184042 169779 169305 184617 188640
31847 188640 183674 162035 155512 173793 168757 153612 161999 162959 172431 185710 183716 166283 165014
31834 165014 177138 186521 182130 180467 171236 178315 196340 186654 169394 161051 141684 138347 155520
31821 155520 168497 165029 158875 160889 171411 164135 173310 180674 178706 164655 163920 161057 146320
31808 146320 138344 128472 132602 138358 149545 171223 168671 168463 177180 173652 154749 151668 158914 162601
31794 162601 167365 160618 160945 166419 154435 158596 168532 158569 162468 178623 168459 151726 151168 156504
31780 156504 160886 165118 171277 171608 179327 190140 190355 186986 182420 180174 177332 166854 160198 176713
31766 176713 181485 174817 186918 199749 201148 197645 185872 178125 175457 168875 150792 150994 161925
31753 161925 181702 178561 173605 173485 201469 204742 196925 181573 160444 152712 148474 152307 166596
31740 166596 186025 175763 163247 157943 182296 188370 182500 175670 148968 133666 139270 141192 145080
31727 145080 155325 156875 152339 142825 140493 133900 148334 155323 162985 163609 154108 155357 153655 155363
31713 155363 159931 176605 180170 168037 140628 116824 109636 127978 140984 153277 159139 163844
31701 163844 163981 160137 141765 132838 137203 148182 138527 141668 152568 150118 139157 149892 165071
31688 165071 174571 178014 177363 173365 165042 165642 163803 184973 204544 196013 177480 156357 154657 150846
31674 150846 151954 166822 172162 170645 156682 139670 137825 133198 126482 130101 136576 136247 137650 142863
31660 142863 163922 175300 167330 167473 167463 183061 188936 196968 187533 187905 188147 191375 181128 180450 179555
31645 179555 174534 170432 164880 160490 141105 154500 172341 162742 163925 153576 149721 164982 165190
31632 165190 162658 165213 175450 179030 179555 171965 173458 162130 148173 156418 158773 180000 195437
31619 195437 196087 199572 186629 175390 154645 150907 157365 167217 158599 152545 152556 172525 182782 175043
31605 175043 163068 165698 164666 170127 168068 164383 153078 164053 156876 153558 154588 166382 164737
31592 164737 157091 178812 195102 195621 193640 182429 177943 182271 171211 165264 168894 174455 172023
31579 172023 172555 177063 184780 188796 186248 178447 172009 167894 164021 171724 185182 179284 178830 168567
31565 168567 164080 162403 166915 170644 176894 156349 138808 156278 170131 167043 165994 170792 166924
31552 166924 156245 160563 172143 174012 179836 177771 163933 172950 187476 189279 174343 161327 157719
31539 157719 173551 181357 172634 156356 149847 163974 172874 179041 188627 190743 205816 198945 160297
31526 160297 130680 140506 163852 170107 175723 180678 176396 183903 191143 177807 152996 165204 167417
31513 167417 149553 157819 185348 184372 189533 197630 193145 193838 183302 184704 201454 183049 154390
31500 154390 153994 162626 160600 160184 158401 166869 155591 149526 141625 145946 156015 146469 140332 149528
31486 149528 152480 161896 166299 157692 171218 185520 192844 182081 165412 168574 163379 163056 169436
31473 169436 150170 163056 172132 165856 161804 158385 155948 155704 158474 172501 185267 190157 169072
31460 169072 154863 155350 149211 146474 161652 161024 157175 162977 154143 166513 168386 174174 177903 189519
31446 189519 196746 188050 174406 162541 162462 158405 154224 157558 155346 149144 146060 144880 143695 159238
31432 159238 175487 162585 137296 138095 126612 142698 148277 136587 141379 158011 167808 170578 161250
31419 161250 171762 184059 188622 184857 177369 170964 161313 172103 184582 189566 173682 163771 166470
31406 166470 171948 161178 173166 176900 168558 174880 175107 189701 187519 168243 163684 158863 178637
31393 178637 178081 168618 145138 151180 155612 159236 160538 155837 170465 169138 177650 191026 198160 185835
31379 185835 164821 151514 146474 141668 151530 168465 176970 165379 170852 168618 170955 170371 168504
31366 168504 160380 145898 146847 153293 139333 127842 132146 156964 165883 172446 171753 167832 158091 173009
31352 173009 166411 172476 184679 202245 190788 168954 168452 178915 179519 169540 168558 171796 170723 165154
31338 165154 167436 164151 161096 176149 171829 170906 189407 192985 208525 199026 166792 153074 147515
31325 147515 159705 166340 165653 172431 179254 181450 173498 159221 138183 135828 137267 132438 137568 142202
31311 142202 144273 153263 157376 163234 179854 170298 164891 160961 161238 157932 151962 149493 156750 159549
31297 159549 161429 169475 168931 160573 152538 146457 171344 191846 197726 179324 166159 160650 155975
31284 155975 150259 159436 152609 145802 154143 167388 190957 187328 165360 156697 169369 171467 168217
31271 168217 159869 167960 164794 166842 171346 167228 164594 182430 186032 180395 189603 185490 169836 170780
31257 170780 173524 161823 156871 158202 163838 161937 173874 171300 148983 134210 146683 155782 159792
31244 159792 166979 163506 161521 165318 166287 154933 154051 149917 156549 166852 159505 150506 149676 154958
31230 154958 159606 161699 169887 192007 204236 202414 194641 183230 177336 205102 204692 199785 200039 192557
31216 192557 196790 200327 186671 176082 168419 175414 176283 168442 156217 162890 154565 159412 141921
31203 141921 137142 148847 172940 179199 159848 142215 144019 173251 178643 177318 175425 167545 166411
31190 166411 165792 152415 144189 142951 162591 159644 141788 139714 134605 134273 145331 154323 153796 147543
31176 147543 165357 167384 156824 144415 135611 138770 149825 152250 174972 176495 181774 178863 169566
31163 169566 169809 168043 179959 186654 181427 169694 162854 164711 175560 180658 172745 157724 156292
31150 156292 152995 161833 178021 203059 195472 176253 167363 174017 190503 194047 182316 156042 149978
31137 149978 159688 161382 158218 159833 163474 170765 166658 168810 174449 162993 153674 158867 165633 173814
31123 173814 175338 181993 198543 198116 186328 181241 166867 172537 173396 176473 185281 192946 192558 194582
31109 194582 195696 196759 177666 162988 171105 172257 164788 161993 176411 181956 175335 169014 171688
31096 171688 184002 200800 200262 177131 170789 178489 176242 175927 174038 185932 183965 182156 196865
31083 196865 197332 190284 177965 168638 163210 173794 169728 149047 153453 178260 198091 175734 152771
31070 152771 148087 160937 164639 161060 156269 149776 165414 185391 196545 182426 177424 176805 162221
31057 162221 157661 183971 190813 176053 170913 155141 148204 150690 132017 143318 161452 176745
31045 176745 184065 182523 176414 173980 169119 156760 149696 151098 171327 175179 172984 176379 187714
31032 187714 195381 183020 179902 162885 158026 169159 182740 190855 190013 172436 157655 153530 156811
31019 156811 149046 143882 157862 163880 160897 168301 184948 182953 174939 168449 158508 155592 153692 147916
31005 147916 144726 155779 186479 181945 178020 157004 151330 142774 145377 156120 161412 159062 166847
30992 166847 182874 186196 180838 181714 194835 199642 192269 191729 189491 183292 186573 182566 184065 196224
30978 196224 185223 173897 171013 179386 186890 186252 182263 165238 161302 165790 167146 179436 193744
30965 193744 190461 173732 171392 184981 187958 172588 165087 154887 155307 156324 164240 172875 176382
30952 176382 180937 193486 196558 185427 182791 171686 174574 181094 160758 160392 177684 162981 154324
30939 154324 154592 142976 145285 152556 163893 174843 176243 170971 161469 161606 170746 159632 142942
30926 142942 147274 150063 157819 149612 150647 154018 158062 147664 161661 180459 177969 178773 168757
30913 168757 164876 147991 158638 179374 182351 178610 170766 166734 172741 179134 177875 193514 188470
30900 188470 183188 183347 180581 180149 172358 181197 176866 180435 167692 157676 155125 157657 139442 142730
30886 142730 161808 174184 166535 161133 160544 154722 164721 166667 157437 155546 175172 172633 183490
30873 183490 185111 193057 185879 195735 205236 190191 178036 180654 175764 170201 172700 170117 176431 188644
30859 188644 200927 194795 179545 181571 190031 183455 171173 174719 186316 196433 197330 192778 185057
30846 185057 181344 171012 158851 145966 145611 149857 152680 149405 158152 179420 184498 167082 148285
30833 148285 136607 142078 168518 182055 180393 182662 177328 187653 204048 203328 198595 181431 156213
30820 156213 152594 163631 166629 163430 163420 153316 157339 155838 169438 176510 189606 182410 163694
30807 163694 138025 120985 134458 153478 153033 145074 166048 172107 170351 166924 163670 172907 177715
30794 177715 188296 195002 189032 197193 187780 192042 177971 178731 177515 166267 154171 150833 149570
30781 149570 154659 163346 169516 176666 187958 190757 186981 189375 171797 167948 176351 182241 191124 183683
30767 183683 189131 194683 194800 184799 182321 181222 191451 194134 180658 176037 194912 193240 182183
30754 182183 160156 153609 140082 145158 170099 185478 175832 176063 185207 187010 182037 181893 190403 173454
30740 173454 142536 144799 154692 153417 147012 163707 174264 178149 180472 189532 196453 185642 182217
30727 182217 174991 183668 177095 177324 176117 155917 155129 170776 167132 164277 161780 169744 174773 182306
30713 182306 184573 195250 208293 190486 174256 180325 181474 163611 147826 153061 171100 176403
30701 176403 175732 168396 171463 163568 172806 184393 189746 187027 163962 154886 157188 154212 160080 159920
30687 159920 142109 147435 177306 170375 164338 171914 174984 165922 172545 162762 154481 168680 191659
30674 191659 207426 187068 157787 167823 183446 195865 197437 169551 161885 165467 176375 163224
30662 163224 153423 167925 167856 160648 156172 162458 156413 150131 144100 167701 183339 177652 172842 177249
30648 177249 173371 186052 195971 204871 205609 201234 194086 178412 177562 186587 204578 206834 187465 193447
30634 193447 195069 194256 164027 169468 193879 193000 185882 192656 167897 161035 181752 176072 153402
30621 153402 159295 176127 184732 181386 183815 180162 204183 201196 182971 174637 173583 171240 164903
30608 164903 157186 170592 170443 170857 176690 168491 162593 171880 178392 179741 187727 173390 166885 175274
30594 175274 188628 197567 186629 170121 172568 186584 171378 160082 154864 174785 173488 165259
30582 165259 178578 189633 195077 195225 184724 172497 165346 158619 164454 178199 186438 174010 162744
30569 162744 150938 143844 165496 172703 187099 164569 153145 155679 171353 178372 174688 167811 161418
30556 161418 151034 163889 174172 186704 175320 164355 163024 175746 185489 178807 168456 163338
30544 163338 164695 167224 166862 171401 182283 168275 158044 167228 162519 171930 186146 199727 187018
30531 187018 171505 162050 162218 171306 154649 160853 150791 149634 154770 166350 185292 174171 165804
30518 165804 175674 170921 166282 167636 157270 163561 171232 181995 179618 174872 179867 189051 176392
30505 176392 182531 178363 173222 168952 180545 175133 170342 157903 160722 176878 196445 195337 184195
30492 184195 181266 195133 189020 184425 169821 159049 160865 170308 175512 177058 168717 162000 168898
$$ [...]
##END NTUPLES=NMR SPECTRUM
##END=
