##TITLE=Analysis number 330434
Compound Code cc 68401
Book Reference 437/110
Project Code adrs
Chemist Name wendyb
##JCAMPDX= 6.0         $$ Bruker NMR JCAMP-DX V2.0
##DATA TYPE= NMR SPECTRUM
##DATA CLASS= NTUPLES
##ORIGIN= Bruker BioSpin GmbH
##OWNER= nmr
$$ XWIN-NMR		Version 3.5
$$ Fri Nov 23 13:01:06 2007 GMT Standard Time (UT+0h)  MAYBRIDGE\nmr@NMR_250MHZ
##.OBSERVE FREQUENCY= 250.131544655141
##.OBSERVE NUCLEUS= ^1H
##.ACQUISITION MODE= SIMULTANEOUS (DQD)
##.ACQUISITION SCHEME= undefined
##.AVERAGES= 16
##.DIGITISER RES= 18
##SPECTROMETER/DATA SYSTEM= dpx250
##.PULSE SEQUENCE= zg30
##.SOLVENT NAME= DMSO
##.SHIFT REFERENCE= (INTERNAL, DMSO, 0, 16.522)
##AUDIT TRAIL= $$ (NUMBER, WHEN, WHO, WHERE, WHAT)
$$ ##TITLE= Audit trail, XWIN-NMR		Version 3.5
$$ ##JCAMPDX= 5.01
$$ ##ORIGIN= Bruker BioSpin GmbH
$$ ##OWNER= nmr
$$ C:\u/data/dgb/nmr/ADRS/2210/pdata/1/auditp.txt
$$ ##AUDIT TRAIL=  $$ (NUMBER, WHEN, WHO, WHERE, WHAT)
(   1,<2007-11-23 13:00:36.26 +000>,<MAYBRIDGE\nmr>,<NMR_250MHZ>,
      <created by zg, POWCHK disabled, PULCHK disabled
       configuration hash MD5:
       76 6E 9A 78 1E 09 19 81 EC 84 63 8F B0 6A 59 2D
       data hash MD5: 64K
       43 BF 1D 04 C5 32 C3 E9 55 7E B1 81 2A 79 85 AB>)
(   2,<2007-11-23 13:00:52.93 +000>,<MAYBRIDGE\nmr>,<NMR_250MHZ>,
      <Start of raw data processing
       ef LB = 0.3 FT_mod = 6 PKNL = 1 SI = 32K 
       data hash MD5: 32K
       77 64 CD 8D EB 82 B4 6E BB 63 58 27 94 1B A4 E6>)
(   3,<2007-11-23 13:00:54.44 +000>,<MAYBRIDGE\nmr>,<NMR_250MHZ>,
      <apk 
       data hash MD5: 32K
       B0 23 0C 56 B9 9B DF 03 AB 17 84 0D CB 78 FD 07>)
(   4,<2007-11-23 13:00:55.30 +000>,<MAYBRIDGE\nmr>,<NMR_250MHZ>,
      <abs ABSG = 5 
       data hash MD5: 32K
       B9 B6 4D A7 2E E4 54 33 6D B5 B3 1C 82 C7 A3 34>)
$$ ##END=
$$ 
$$ hash MD5
$$ 56 CC 40 D1 36 D7 C7 AB 92 A7 23 41 F1 3D C5 61
##$RELAX= 
##$RELAX= 
##$RELAX= 
##$RELAX= 
##$RELAX= 
##$RELAX= 
##$RELAX= 
$$ Bruker specific parameters
$$ --------------------------
##$DU= <C:\u>
##$EXPNO= 2210
##$NAME= <ADRS>
##$PROCNO= 1
##$TYPE= <nmr>
##$USER= <dgb>
##$AMP= (0..31)
100 100 100 100 100 100 100 100 100 100 100 100 100 100 100 100 100 100 
100 100 100 100 100 100 100 100 100 100 100 100 100 100 
##$AQSEQ= 0
##$AQ_mod= 3
##$AUNM= <au_zg>
##$AUTOPOS= <16 >
##$BF1= 250.13
##$BF2= 250.13
##$BF3= 250.13
##$BF4= 250.13
##$BF5= 500.13
##$BF6= 500.13
##$BF7= 500.13
##$BF8= 500.13
##$BYTORDA= 1
##$CFDGTYP= 0
##$CFRGTYP= 5
##$CHEMSTR= <none>
##$CNST= (0..31)
1 1 145 1 1 1 1 1 1 1 1 1 1 1 1 1 1 1 1 1 1 1 1 1 1 1 1 1 1 1 1 1 
##$CPDPRG= <>
##$CPDPRG1= <>
##$CPDPRG2= <>
##$CPDPRG3= <>
##$CPDPRG4= <mlev>
##$CPDPRG5= <mlev>
##$CPDPRG6= <mlev>
##$CPDPRG7= <mlev>
##$CPDPRG8= <mlev>
##$CPDPRGB= <>
##$CPDPRGT= <>
##$D= (0..31)
0 1 0 0 0 0 0 0 0 0.06 0 0 0 0 0 0 0.0002 0 0 0 0 0 0 0 0 0 0 0 0 0 0 
0 
##$DATE= 1195822834
##$DBL= (0..7)
120 120 120 120 120 120 120 120 
##$DBP= (0..7)
150 150 150 150 150 150 150 150 
##$DBP07= 0
##$DBPNAM0= <>
##$DBPNAM1= <>
$$ [...]
##$SUBNAM7= <"">
##$SUBNAM8= <"">
##$SUBNAM9= <"">
##$SW= 20.6930455092707
##$SWIBOX= (0..15)
0 0 3 0 0 0 0 0 0 0 0 0 0 0 0 0 
##$SW_h= 5175.983436853
##$TD= 65536
##$TD0= 1
##$TE= 295.16
##$TE2= 300
##$TE3= 300
##$TEG= 300
##$TL= (0..7)
0 120 120 120 120 120 120 120 
##$TP= (0..7)
150 150 150 150 150 150 150 150 
##$TP07= 0
##$TPNAME0= <>
##$TPNAME1= <>
##$TPNAME2= <>
##$TPNAME3= <>
##$TPNAME4= <>
##$TPNAME5= <>
##$TPNAME6= <>
##$TPNAME7= <>
##$TPOAL= (0..7)
0.5 0.5 0.5 0.5 0.5 0.5 0.5 0.5 
##$TPOFFS= (0..7)
0 0 0 0 0 0 0 0 
##$TUNHIN= 0
##$TUNHOUT= 0
##$TUNXOUT= 0
##$USERA1= <user>
##$USERA2= <user>
##$USERA3= <user>
##$USERA4= <user>
##$USERA5= <user>
##$V9= 5
##$VALIST= <valist>
##$VCLIST= <CCCCCCCCCCCCCCC>
##$VD= 0
##$VDLIST= <DDDDDDDDDDDDDDD>
##$VPLIST= <PPPPPPPPPPPPPPP>
##$VTLIST= <TTTTTTTTTTTTTTT>
##$WBST= 1024
##$WBSW= 4
##$XGAIN= (0..3)
0 0 0 0 
##$XL= 0
##$YL= 0
##$YMAX_a= 344141
##$YMIN_a= -408053
##$ZGOPTNS= <>
##$ZL1= 120
##$ZL2= 120
##$ZL3= 120
##$ZL4= 120
##$ABSF1= 16.522
##$ABSF2= -4.171173
##$ABSG= 5
##$ABSL= 3
##$ALPHA= 0
##$AQORDER= 0
##$ASSFAC= 0
##$ASSFACI= 0
##$ASSFACX= 0
##$ASSWID= 0
##$AUNMP= <proc_1d>
##$AZFE= 0.1
##$AZFW= 0.1
##$BCFW= 0
##$BC_mod= 0
##$BYTORDP= 0
##$COROFFS= 0
##$CY= 12.5
##$DATMOD= 1
##$DC= 0
##$DFILT= <>
##$DTYPP= 0
##$F1P= 14.0000005364418
##$F2P= -0.99999901652339
##$FCOR= 0.5
##$FTSIZE= 32768
##$FT_mod= 6
##$GAMMA= 0
##$GB= 0
##$INTBC= 1
##$INTSCL= 1
##$ISEN= 128
##$LB= 0.3
##$LEV0= 0
##$LPBIN= 0
##$MAXI= 10000
##$MC2= 0
##$MEAN= 0
##$ME_mod= 0
##$MI= 0
##$NCOEF= 0
##$NC_proc= -3
##$NLEV= 6
##$NOISF1= 0
##$NOISF2= 0
##$NSP= 0
##$NTH_PI= 0
##$NZP= 0
##$OFFSET= 16.522
##$PC= 1
##$PHC0= 166.3765
##$PHC1= 7.801038
##$PH_mod= 1
##$PKNL= yes
##$PPARMOD= 0
##$PSCAL= 4
##$PSIGN= 0
##$REVERSE= no
##$SF= 250.13
##$SI= 32768
##$SIGF1= 0
##$SIGF2= 0
##$SINO= 400
##$SIOLD= 32768
##$SREGLST= <1H.DMSO>
##$SSB= 0
##$STSI= 32768
##$STSR= 0
##$SW_p= 5175.98343685301
##$SYMM= 0
##$S_DEV= 0
##$TDeff= 65536
##$TDoff= 0
##$TI= <Analysis number 999999
Compound Code 99
Book Reference 9
Project Code 9>
##$TILT= no
##$TM1= 0
##$TM2= 0
##$TOPLEV= 0
##$USERP1= <user>
##$USERP2= <user>
##$USERP3= <user>
##$USERP4= <user>
##$USERP5= <user>
##$WDW= 1
##$XDIM= 32768
##$YMAX_p= 333039555
##$YMIN_p= -411292
$$ End of Bruker specific parameters
$$ ---------------------------------
##NTUPLES= NMR SPECTRUM
##VAR_NAME=  FREQUENCY,     SPECTRUM/REAL,   SPECTRUM/IMAG
##SYMBOL=    X,             R,               I
##VAR_TYPE=  INDEPENDENT,   DEPENDENT,       DEPENDENT
##VAR_FORM=  AFFN,          ASDF,            ASDF
##VAR_DIM=   32768,         32768,           32768
##UNITS=     HZ,            ARBITRARY UNITS, ARBITRARY UNITS
##FACTOR=    0.157963299565203, 1,           1
##FIRST=     4132.6476996994, 0,             0
##LAST=      -1043.33573715361, 0,           0
##MIN=       -1043.33573715361, -411292,     0
##MAX=       4132.6476996994, 333039555,     0
$$ Real data points
##PAGE= N=1
##DATA TABLE= (X++(R..R)), XYDATA
$$ [...]
16647c9169l9400J8143P8837J4693j705l5334J0672J0860k559J4414j0777j912
$$ -39169 -78569 -60426 18411 33104 31399 -3935 6737 17597 15038 29452 18675 16763
16635A6763m5698O972k1687n5081q237n880O8293K1207P344K4083L753J8446l5783
$$ 16763 -28935 -21963 -43650 -98731 -106968 -112848 -44555 -23348 -16004 8079 11832 30278 -5505
16622e505o104j5573j9414J4838K3914J8916Q171J301m8161n0010m796o817k1197
$$ -5505 -11609 -27182 -46596 -31758 -7844 11072 19243 20544 -27617 -77627 -82423 -89240 -110437
16609a10437M2061K7075k9997J8221m1907j962j1476J5771J3557K7646k7711M5153
$$ -110437 -68376 -41301 -71298 -53077 -94984 -96946 -108422 -92651 -79094 -51448 -79159 -34006
16597c4006J7653L34L0450k698K1307K1690K195k1224m2138k5992K45j6240l548
$$ -34006 -16353 -16019 14431 11733 33040 54730 56925 35701 -6437 -32429 -32184 -48424 -51972
16584e1972L9755k0563P377L4235M296O2266L6838k7340m2804o4040k5310O614
$$ -51972 -12217 -32780 -25403 8832 13128 75394 112232 84892 42088 -21952 -47262 -40648
16572d0648k5292J3744j9593K5124L8166m1109l7401J3180k2935L9785k732R100
$$ -40648 -65940 -52196 -71789 -46665 -8499 -49608 -87009 -73829 -96764 -56979 -59711 -50611
16560e0611K1276p148j0074n0747j5359Q4466P7857l5412k0223k3419l429m292
$$ -50611 -29335 -36483 -46557 -97304 -112663 -28197 49660 14248 -5975 -29394 -32823 -37115
16548c7115K0418J1217m3283L1430M230M913j722n4229J5374K0153L3254K7540
$$ -37115 -16697 -5480 -48763 -17333 -13103 -8190 -9912 -64141 -48767 -28614 4640 32180
16536C2180L31n2441K4105m0848l221L4647L588j824l511J065L261K9115J9852
$$ 32180 32511 -19930 4175 -36673 -39894 -5247 -1659 -3483 -6994 -5929 -2668 26447 46299
16523D6299n8617r558q765k799j1841j5715o1041j1101J735K6238J6386l5841
$$ 46299 -12318 -21876 -30641 -33440 -45281 -60996 -122037 -133138 -131403 -105165 -88779 -124620
16511a24620K2465J1860J6672J2367M8640O677K326J4833R38n906L5195M3185
$$ -124620 -102155 -90295 -73623 -61256 -12616 -5939 -3613 11220 12158 6252 41447 84632
16499H4632K4292k8901p4899p5475J1730R258P9553N4461k0462m9589l9803M2822
$$ 84632 108924 80023 5124 -70351 -58621 -49363 30190 84651 64189 14600 -25203 17619
16487A7619J3371j8372K4484J0853j1756o7249O538O92L225K9506m4816j8320
$$ 17619 30990 12618 37102 47955 36199 -31050 -24512 -23820 -20595 8911 -35905 -54225
16475e4225J0008N104P965l8312j6256O9368J6350o900q0513r547J8580l6228
$$ -54225 -44217 -39113 -31148 -69460 -85716 -16348 2 -6898 -87411 -96958 -78378 -114606
16463a14606n731l217k2044Q747M1041n873J0424L1314J6332M2951L1720j9757
$$ -114606 -120337 -123554 -145598 -136851 -95810 -101683 -91259 -59945 -43613 -662 31058 11301
16451A1301o670M330n4472k6135M8229k639K747J8340k7081m1313L9666J5782
$$ 11301 4631 8961 -45511 -71646 -23417 -26056 -23309 -4969 -32050 -73363 -33697 -17915
16439a7915M216k5148K7817O343k492m6529j4524K5365k7712K0M6123k89j2987
$$ -17915 -13699 -38847 -11030 -4687 -7179 -53708 -68232 -42867 -70579 -70559 -24436 -24725 -37712
16426c7712J4154l2908O825K2995J5920m0458m8511o094M8722K0633N0187L246
$$ -37712 -23558 -56466 -49641 -26646 -10726 -51184 -99695 -105789 -57067 -36434 13753 16999
16414A6999m1839L0003L002k2351j7471k2391O7579L5945K2196k8676l8260j4651
$$ 16999 -24840 5163 8165 -14186 -31657 -54048 13531 49476 71672 42996 4736 -9915
16402i915j0330N572j441Q531n18j9000l754m7666O068m878K2064M2573j7779
$$ -9915 -20245 -14673 -16114 -7583 -8101 -27101 -30855 -78521 -72453 -77331 -55267 -12694 -30473
16389c0473m158N4316K3674J9024J0978k3882K7087l8290n9545l3578J982j2003
$$ -30473 -34631 19685 43359 62383 73361 49479 76566 38276 -21269 -54847 -52865 -64868
16377f4868K7155L2745l603k4061m1788o535L3251K7290L5554J7716j8362j9516
$$ -64868 -37713 -4968 -8571 -32632 -74420 -80955 -47704 -20414 15140 32856 14494 -5022
16365e022j2668K7333J3469j0518r072j9250j6831k6725N912O145J5317J718j3973
$$ -5022 -17690 9643 23112 12594 3522 -15728 -32559 -59284 -53372 -47227 -31910 -30192 -44165
16352d4165k0023K9205L2613l0409J7126M856M893l2472QO0342L6536m0480r5613
$$ -44165 -64188 -34983 -2370 -32779 -15653 -10797 -5904 -38376 -38368 21974 58510 18030 -77583
16339g7583J8970K1969j7341L6924O297k8692J8195J6502K3172j6833l0518o5759
$$ -77583 -58613 -36644 -53985 -17061 -10764 -39456 -21261 -4759 18413 1580 -28938 -94697
16327i4697K9375L3379J6937m9045n2670L4368L1560j9516l3121J0260L8287L675
$$ -94697 -65322 -31943 -15006 -64051 -116721 -82353 -50793 -70309 -103430 -93170 -54883 -51208
16315e1208N114J6684N3097M8065q874j1068k1703l2677k049k8468o2011J2163
$$ -51208 -46094 -29410 23687 71752 62878 51810 30107 -2570 -4619 -33087 -95098 -82935
16303h2935R128k2823j0564N4625K5251k4392p560Q184M6425L6902O923K0446
$$ -82935 -73807 -96630 -107194 -52569 -27318 -51710 -59270 -51086 -4661 32241 39164 59610
16291E9610q2461j4234J7995l1952j222K6201j5533r665j580k3152j1879J0300
$$ 59610 -22851 -37085 -19090 -51042 -52264 -26063 -41596 -51261 -52841 -75993 -87872 -77572
16279g7572k900N1673K6220K0088k0631J661l9397m1807J7754K1640l4042J2201
$$ -77572 -80472 -28799 -2579 17509 -3122 -1461 -40858 -82665 -64911 -43271 -77313 -65112
16267f5112N34K2898J3404P5895o735J3796L1362m3265n0582n970J6194J481K1394
$$ -65112 -64578 -41680 -28276 47619 40884 54680 86042 42777 -7805 -13775 2419 3900 25294
16254B5294M3186j2840k3633M2641l3940m5360L4764q895l7431j7663j0085j0007
$$ 25294 68480 55640 32007 74648 40708 -4652 30112 21217 -16214 -33877 -43962 -53969
16242e3969J8712K1616J452k475J5249R790p248j5875k0605K2847K2773J5094
$$ -53969 -35257 -13641 -12189 -14664 585 10375 3127 -12748 -33353 -10506 12267 27361
16230B7361o186P15l2750p420k455j2816j585m528j2940L6684M806k2174J9759
$$ 27361 21175 21890 -10860 -18280 -20735 -33551 -35136 -39664 -52604 -15920 -11114 -33288 -13529
16217a3529J226L4492J1669j1517j9359M0854o267l0412K3830j2131q7432J3599
$$ -13529 -12303 22189 33858 22341 2982 43836 37569 7157 30987 18856 -68576 -54977
16205e4977P3152r300j7200J5988j8500L492R668L8692j7852k3329k6159j786
$$ -54977 18175 8875 -8325 7663 -10837 -7345 2323 41015 23163 -166 -26325 -28111
16193b8111J0756L648N3462O2187j3310l4315J2860K8551m9999n5715K6296l4745
$$ -28111 -17355 -13707 39755 101942 88632 54317 67177 95728 45729 -9986 16310 -18435
16181a8435l2336K5237J0441l3815j8086L9407L9807J4897K2094j905L453n1067
$$ -18435 -50771 -25534 -15093 -48908 -66994 -27587 12220 27117 49211 47306 50759 -308
16169c08N845R680K1430j2736r446l3529j7946P455L3959k4686j292l2461m5038
$$ -308 5537 15217 36647 23911 14465 -19064 -37010 -29555 4404 -20282 -21574 -54035 -99073
16156i9073M6657P1350O4028m8561l6888l143J3901K8769j7188p393m9388p613
$$ -99073 -52416 18934 82962 34401 -2487 -5630 8271 37040 19852 12459 -36929 -44542
16144d4542K4879k015j2153j7085L4370l7920o3150K8945R7001O611l7422J8637
$$ -44542 -19663 -21678 -33831 -50916 -16546 -54466 -117616 -88671 8330 14941 -22481 -3844
16132c844l5747K7175K7874P947M794m8327j9012L8286L598K4377K0300r504j5318
$$ -3844 -39591 -12416 15458 23405 28199 -20128 -39140 -854 2744 27121 47421 37917 22599
16119B2599J1209l834J0445l299k1700M8741k6308p2876k971J155K9021L294J0525
$$ 22599 33808 29974 40419 37120 15420 64161 37853 -35023 -37994 -36839 -7818 -4524 6001
16106F001K4044k1412m1708j7918k8039K4780O789M3199K8663m6471l0332k5788
$$ 6001 30045 8633 -33075 -50993 -79032 -54252 -47463 -4264 24399 -22072 -52404 -78192
16094g8192J3422M7661K7657L069n602R566j5374L02j0116K4665K6417k9326j2083
$$ -78192 -64770 -17109 10548 13617 8015 17581 2207 2509 -7607 17058 43475 14149 2066
16081B066o403m9797L4492J3753r151q567l9566P236K448L0961K5735J8096k9526
$$ 2066 -4337 -54134 -19642 -5889 -15040 -23607 -63173 -55937 -53489 -22528 3207 21303 -8223
16068h223k1605K4011j5753L1757J267k4459R132O453M285m2258l64q959N3915
$$ -8223 -29828 -5817 -21570 10187 11454 -13005 -3873 2580 6865 -35393 -35757 -44716 9199
16055I199L9507J5827p323j3374R409k4093k8326K6145L1775J4045j2673k9395
$$ 9199 48706 64533 57210 43836 53245 29152 826 26971 58746 72791 60118 30723
16043C0723j4421K1372J3919j1324m1063l0906m148L3626K5670k0564k6136m8878
$$ 30723 16302 37674 51593 40269 -794 -31700 -35848 -2222 23448 2884 -23252 -72130
16031g2130J4954N1371L5942L1657k7067l8281K6979L0293m300N377k7002k7331
$$ -72130 -57176 -5805 30137 61794 34727 -3554 23425 53718 49418 54795 27793 462
16019D62l714J2225J1316k6297J3032M2922m245l9866K5799k2408l057l0459j6835
$$ 462 -3252 8973 20289 -6008 7024 49946 45701 5835 31634 9226 6169 -24290 -41125
16006d1125P076k1679o2970k0609N106J6022J9097O8797M2387m3J4159r372l4312
$$ -41125 -34049 -55728 -118698 -139307 -134201 -118179 -99082 -30285 12102 12059 26218 16846 -17466
15993a7466o2568o542L582J835L4485K4027K3112J2658m8969k8952K9284N6389
$$ -17466 -80034 -86576 -82994 -81159 -46674 -22647 465 13123 -35846 -64798 -35514 20875
15981B0875J004o9434n7445n805P4070J0127n8203R812r441l22l428O0161M4617
$$ 20875 21879 -47555 -105000 -110805 -36735 -26608 -84811 -74999 -84440 -84762 -88190 -28029 16588
15968A6588n0408M285J1416J729k9523R351K4840L1078l5010k4108j2659j1173
$$ 16588 -33820 -29535 -18119 -16390 -45913 -36562 -11722 19356 -15654 -39762 -52421 -63594
15956f3594j1463j113K7836K1550L0612K1225k4231J2445n892l555J5792k0857
$$ -63594 -75057 -76170 -48334 -26784 3828 25053 822 13267 7375 3820 19612 -1245
15944a245l6400k5438K3147M4824M0535l6449m7445J1201K562K6436l304k4337
$$ -1245 -37645 -63083 -39936 4888 45423 8974 -38471 -27270 -24708 1728 -1576 -25913
15932b5913Q166Q767K276j9089L386L6561J4445N590J9609k4902j1616L2071l7844
$$ -25913 -17747 -8980 -6704 -25793 -22407 14154 28599 34189 53798 28896 17280 49351 11507
15919A1507l6369r478N125k5471L8107K785J4672n1053l5870J4163L1186J6569
$$ 11507 -24862 -34340 -29215 -54686 -16579 -13794 878 -50175 -86045 -71882 -40696 -24127
15907b4127J0500j5876K5843K4777M4802J5210k9606M078k6076n0469n3032o961
$$ -24127 -13627 -29503 -3660 21117 65919 81129 51523 55601 29525 -20944 -73976 -80937
15895h0937P1935L2578l3896m1265O893j5512m2162J6601M4567R248J1446l1159
$$ -80937 -9002 23576 -10320 -51585 -44692 -60204 -102366 -85765 -41198 -31950 -20504 -51663
15883e1663N269O7296k0324j4610j9551M890L9148k499N101Q683P14k22m326K472
$$ -51663 -46394 20902 578 -14032 -33583 -28693 10455 7956 13057 21740 22454 22232 17906 20378
15869B0378l1862J8513j4219k1135Q692J4772L78k8501K6586Q624n370j4734R171
$$ 20378 -11484 7029 -7190 -28325 -19633 -4861 -4483 -32984 -6398 2226 -3144 -17878 -8707
15856h707M78q938k4414l268m907l0432J3891l7291J4194Q5185N4532l450j4225
$$ -8707 -8229 -17167 -41581 -44849 -49756 -80188 -66297 -103588 -89394 -4209 50323 46873 32648
15843C2648m8337L4111K1507j8392l0851n0571k2764P396N2278q485n0593J6443
$$ 32648 -15689 18422 39929 21537 -9314 -59885 -82649 -75253 -22975 -31460 -82053 -65610
15831f5610O2562j8471k6018j7424J9127J8837l6982J2879L7156L1923k4426l9196
$$ -65610 -3048 -21519 -47537 -64961 -45834 -26997 -63979 -51100 -13944 17979 -6447 -45643
15819d5643J0631L1555l8252l7047M0698K0833j7305J5484K6904K379J6101l1610
$$ -45643 -35012 -3457 -41709 -78756 -38058 -17225 -34530 -19046 7858 10237 26338 -5272
15807e272j8747J503N4353J5374j5300k0379l5362J5107J4883k1831N0792J45
$$ -5272 -24019 -22516 31837 47211 31911 11532 -23830 -8723 6160 -15671 35121 35266
15795C5266l402j730n7402p8015L0674M5960K5604Q77q265k7338J8127M6117L8680
$$ 35266 31864 30134 -27268 -105283 -74609 -28649 -3045 -2168 -10433 -37771 -19644 26473 65153
15782F5153j3185j3011r497J2480n956k1518J9259J0050l0538L3921k6691o2762
$$ 65153 51968 38957 29460 41940 35984 14466 33725 43775 13237 47158 20467 -42295
15770d2295o9097K8081M8022M9245L7162L0672p684j8191m9948k1175K6325m6338
$$ -42295 -111392 -83311 -35289 13956 51118 81790 74106 55915 5967 -15208 11117 -35221
15758c5221k1085Q1353K2658n9027R785N3220k924l7399l5116J1812J586k9979
$$ -35221 -56306 25047 47705 -11322 -1537 51683 48759 11360 -23756 -11944 -10358 -40337
15746d0337p031k7324k949O8489P7994k1392k1001l8641l235N259J1575j7813
$$ -40337 -47368 -74692 -77641 -9152 68842 47450 26449 -12192 -15427 -10168 1407 -16406
15734a6406j5324n6763K3367N7705k287j8111m2176K3133J9851O17j2386N8421
$$ -16406 -31730 -88493 -65126 -7421 -9708 -27819 -69995 -46862 -27011 -26394 -38780 19641
15722A9641K1995P087q433o4334k4628J7198K0717N949n337j2370j7136J414l9737
$$ 19641 41636 48723 40290 -24044 -48672 -31474 -10757 -4808 -10145 -22515 -39651 -38237 -77974
15709g7974J5221j8259R952M8525M1564l0355k0752m6928Q618P015P8823K8132
$$ -77974 -62753 -81012 -71060 -22535 19029 -11326 -32078 -79006 -70388 -63373 15450 43582
15697D3582j2651j4244J7729J5659m7581J6222Q3123l1349m6478l3386p8157L4083
$$ 43582 30931 16687 34416 50075 2494 18716 101839 70490 24012 -9374 -87531 -53448
15685e3448K770m164N979J1033J183l1883m0615J6762O4697J9342j9591O3681
$$ -53448 -50678 -54842 -48863 -37830 -36647 -68530 -109145 -92383 -27686 -8344 -27935 35746
15673C5746L0462j2411m5897J0326m089K783L0391j0892l6821p0380L86J2877
$$ 35746 66208 53797 7900 18226 14137 16920 47311 36419 -402 -70782 -70396 -57519
15661e7519K1956M7424o644k1026k4448j1818L1743K3130Q045K9284l30m5549
$$ -57519 -35563 11861 5217 -15809 -40257 -52075 -20332 2798 10843 40127 39797 -5752
15649e752k0102L9096J3032j3439m441k524k950j2239K0866j1453m4827j5243
$$ -5752 -25854 13242 26274 12835 8394 5870 2920 -9319 11547 94 -44733 -59976
15637e9976K8961k4085m0348M6065J6370p6974l668M7669L9305J5053J5496N656
$$ -59976 -31015 -55100 -95448 -49383 -33013 -109987 -113655 -65986 -26681 -11628 3868 9524
15625I524l0012O068M7167M3922K0364m1189n1299l8103L583J1033J9872N818
$$ 9524 -20488 -14420 32747 76669 97033 55844 4545 -33558 -29975 -18942 930 6748
15613F748J8903k9910k2239l0277j3996J300K934p559L4169L6522L9650L5592
$$ 6748 25651 -4259 -26498 -56775 -70771 -69471 -66537 -74096 -39927 -3405 36245 71837
15601G1837M3568K0971k6144j13235n8908K0998j0654J2717N324k098J3043J0386
$$ 71837 115405 136376 110232 -3003 -61911 -40913 -51567 -38850 -33526 -35624 -22581 -12195
15589a2195j4580J3123J4075J5532J0800n4471J4779P224m6333j370P811L0442
$$ -12195 -26775 -13652 423 15955 26755 -27716 -12937 -5713 -52046 -53416 -45605 -15163
15577a5163K729L376o9745J5297L9784p79l6273K6915R896o7651J0813L5755n682
$$ -15163 -12434 -9058 -78803 -63506 -23722 -24501 -60774 -33859 -23963 -91614 -80801 -45046 -50728
15564e0728o9735j5182N4958K6859k8970J7186m933r154K134L8160P889n456l3863
$$ -50728 -120463 -135645 -80687 -53828 -82798 -65612 -70545 -79699 -77565 -39405 -31516 -36972 -70835
15551g0835R489L2625p635o082l2526l3702R300Q3783L8725q5574j2593K3070
$$ -70835 -61346 -28721 -36356 -42438 -74964 -108666 -99366 -15583 23142 -62432 -75025 -51955
15539e1955K4590N810q0k6555l3717l3020O87K2399K5267J4574n19K9672M2112
$$ -51955 -27365 -21555 -21635 -48190 -81907 -114927 -114240 -91841 -66574 -52000 -52519 -22847 19265
15526A9265K285K1618m2880p3258j4009q478J1774O5373K9893K1644l8979p0750
$$ 19265 21550 43168 288 -72970 -86979 -95457 -83683 -18310 11583 33227 -5752 -76502
15514g6502n2111J6191L7274K3956N621K9032K2605k6002j2206l1364J4678o662
$$ -76502 -128613 -112422 -75148 -51192 -45571 -16539 6066 -19936 -32142 -63506 -48828 -55490
15502e5490k0903j9999O9421l83l4966n272k6788n0654K2103J2859K1825M0879
$$ -55490 -76393 -96392 -26971 -27354 -62320 -67592 -94380 -145034 -122931 -110072 -88247 -47368
15490d7368O5786M729n4883o2452L7885L6062Q18k4352K5167J7524J1258K8152
$$ -47368 18418 23147 -31736 -94188 -56303 -20241 -19423 -43775 -18608 -1084 10174 38326
15478C8326J0718M239l0194j0834K9645j3244j4243l3906p8123j9532M6645M6940
$$ 38326 49044 53283 23089 12255 41900 28656 14413 -19493 -97616 -117148 -70503 -23563
15466b3563J5002k5154l2432M2909N1185L6956l6017K518P631m6562k6578J0933
$$ -23563 -8561 -33715 -66147 -23238 27947 64903 28886 31404 39035 -7527 -34105 -23172
15454b3172K5337r283k7363k8149j078N3812K0380j0889j0025K97K6945m203j3673
$$ -23172 2165 -7118 -34481 -62630 -63708 -9896 10484 -405 -10430 -10133 16812 12609 -1064
15441a064Q426j0527r693q685J2987j34J4679m061n4851n432L2103Q208n980J3385
$$ -1064 7362 -3165 -12858 -21543 -8556 -8690 5989 1928 -52923 -58355 -26252 -18044 -24024 -10639
15427a0639J9894K7461L2857k2616o226p5347l4584o216p833O6821K0390j2411
$$ -10639 9255 36716 69573 46957 40731 -34616 -69200 -75416 -83249 -16428 3962 -8449
15415h449L0221P871j3491J8948j1218k9345J2937N6627k3801o0635j8198O508
$$ -8449 21772 29643 16152 35100 23882 -5463 7474 64101 40300 -20335 -38533 -32025
15403c2025k108k6693m0005M347L1764L622N4835L8172k8923o4938k7058O535
$$ -32025 -34133 -60826 -100831 -96484 -64720 -61098 -6263 31909 2986 -61952 -89010 -82475
15391h2475j3377m7679r525N3266m806L499L4779M8221j5221J4484j8487l5009
$$ -82475 -95852 -143531 -153056 -99790 -104596 -101097 -66318 -18097 -33318 -18834 -37321 -72330
15379g2330l9926L0897N4540k9656j3041O784Q2004J6482m923J524J304N3993
$$ -72330 -112256 -81359 -26819 -56475 -69516 -62732 19272 35754 30831 32355 33659 87652
15367H7652k8921p4986k4988N490j82O4586j9085l9302l2429P1108O7161m203
$$ 87652 58731 -16255 -41243 -35753 -35935 28651 9566 -29736 -62165 8943 76104 71901
15355G1901P767o341p4733N810J1239l5353J945K4121K9843l991l1870l1144J0795
$$ 71901 79668 73327 -1406 4404 15643 -19710 -17765 6356 36199 32208 338 -30806 -20011
15342b0011J9282k0060m9823K0295N0693J9459o7951m3366M6596J5755N4509K0609
$$ -20011 -729 -20789 -70612 -50317 376 19835 -48116 -91482 -44886 -29131 25378 45987
15330D5987m123k0604l0761r787M4929j0505K850k6275j7161l395j8641O4502
$$ 45987 41864 21260 -9501 -19288 25641 15136 17986 -8289 -25450 -28845 -47486 17016
15318A7016K3120K7681K4051m2138m8202j995n640k5037j2207m275R166O6978
$$ 17016 40136 67817 91868 49730 1528 -467 -6107 -31144 -43351 -47626 -38460 28518
15306B8518Q89k6532k0376j2596M511l862j9723n156L273l4688J8068K997N3588
$$ 28518 29407 2875 -17501 -30097 -25586 -29448 -49171 -54327 -51054 -85742 -67674 -64677 -11089
15293a1089K9098n2809j8740n4241j1574O9883L7147K0524m1850n2648M6971K3164
$$ -11089 18009 -34800 -53540 -107781 -119355 -49472 -12325 8199 -33651 -86299 -39328 -16164
15281a6164O7162l0162o823o762n7950j9715q93n248O1630M3190k5248o177L8027
$$ -16164 50998 20836 14013 7251 -50699 -70414 -71307 -76555 -14925 28265 3017 -3160 34867
15268C4867J2788j4591l4237P378j0409n1324n509K1338J0013p6079l1392L3207
$$ 34867 47655 33064 -1173 6205 -4204 -55528 -61037 -39699 -29686 -105765 -137157 -103950
15256a03950K3124L2993J7672J6041J7528L0943L5870J1842l9116k7189n4004
$$ -103950 -80826 -47833 -30161 -14120 3408 34351 70221 82063 42947 15758 -38246
15245c8246m0508l0123J1852J8700o1658J8644Q2694O4323J7762n4774L2176J3920
$$ -38246 -78754 -108877 -97025 -78325 -139983 -121339 -38645 25678 43440 -11334 20842 34762
15233C4762k6330Q690l8021L0772K4115J6942j9526m3202m3790k7305L365j2686
$$ 34762 8432 17122 -20899 9873 33988 50930 31404 -11798 -55588 -82893 -79528 -92214
15221i2214j6459M3694K0514J2062J5792K9923M4647l6145j033J6227m4330r5418
$$ -92214 -108673 -64979 -44465 -32403 -16611 13312 57959 21814 20781 37008 -7322 -102740
15209a02740L1656M5407m8891K3357L5985K8758l2922j99J8943k7723l1879M1346
$$ -102740 -71084 -25677 -74568 -51211 -15226 13532 -19390 -19589 -646 -28369 -60248 -18902
15197a8902n293m2411K6858L2163O3011M7084n0857m0095p215J674m3807P63K5217
$$ -18902 -24195 -66606 -39748 -7585 55426 102510 51653 11558 4343 6017 -37790 -37027 -11810
15184a1810L6650k2134j45p656J1672P488l6009k2088M381M141K463M6957L5903
$$ -11810 24840 2706 2561 -5095 6577 14065 -21944 -44032 -39651 -35510 -33047 13910 49813
15171D9813l9223l4112j2793o5793n461M2958J5816R843j1081j6592p846j5346
$$ 49813 10590 -23522 -36315 -102108 -107569 -64611 -48795 -38952 -50033 -66625 -74471 -89817
15159h9817O837L226J4056L3573k5055l134r462m430L4275K720n0860L61j0915
$$ -89817 -82980 -79754 -65698 -32125 -57180 -60314 -69776 -74206 -39931 -37211 -88071 -87710 -98625
15146i8625K5004O1428J6586l9811k0021L4354j3733k3637J542K1357L3652L4631
$$ -98625 -73621 -12193 4393 -35418 -55439 -21085 -34818 -58455 -56913 -35556 -1904 32727
15134C2727Q9279n0282j8987K7502K936l1703l5908o782k0740M617n2679j1826
$$ 32727 122006 71724 52737 80239 83175 51472 15564 8782 -11958 -7341 -60020 -71846
15122g1846o30K0191m480N8134p894J8229K1398l205k2244O0329l3663o8576L690
$$ -71846 -72476 -52285 -56765 1369 -6525 11704 33102 29897 7653 67982 34319 -34257 -30567
15109c0567K9314N510l424J1879l904K1450L9149j8606M439m6142l4114J2339
$$ -30567 -1253 4257 833 12712 8808 30258 69407 50801 55240 9098 -25016 -12677
15097a2677l2993L764Q322M8295O589p4526M76k1026m70M0020L7185K3304K0744
$$ -12677 -45670 -41906 -33584 14711 21300 -53226 -52750 -73776 -74246 -34226 2959 26263 47007
15084D7007q660p1636m0181j8154j769l1064N0196L1399K1752K3889O826q010
$$ 47007 38347 -33289 -73470 -91624 -93393 -124457 -74261 -42862 -21110 2779 9605 1595
15072A595l9550j8693M764L2313O572J2472k7635q56J3969N5020L2558K9265L104
$$ 1595 -37955 -56648 -51884 -19571 -12999 -527 -28162 -29018 -15049 39971 72529 101794 104898
15059A04898k1608o4813l5003n6679j6590K6506K2160M8405O873Q201J1055n790
$$ 104898 83290 18477 -16526 -73205 -89795 -63289 -41129 7276 14149 22350 33405 27615
15047B7615k613r77j7340J9631L2314J0012l3951k656J7370K6624P765K182l4470
$$ 27615 25002 24025 6685 26316 58630 68642 34691 32035 49405 76029 83794 85976 51506
15034E1506l0982k000j0531o0847M5727L8810J5563k3484k8804l8569J0834R806
$$ 51506 20524 18524 7993 -52854 -7127 31683 47246 23762 -5042 -43611 -32777 -22971
15022b2971j1958K660K0157J9639j1645J0859N8558K2810K9163k5957k4118m7539
$$ -22971 -34929 -32269 -12112 7527 -4118 6741 65299 88109 117272 91315 67197 19658
15010A9658m927K816q060k9820L5123K2761K814J6571l0992o1437n1139q424P2765
$$ 19658 14731 17547 9487 -20333 14790 37551 40365 56936 25944 -35493 -86632 -95056 -22291
14997b2291L4875k1990j6067L9758M1325k1927j72L3725l7265l3041k9037K434
$$ -22291 12584 -9406 -25473 14285 55610 33683 33511 67236 29971 -3070 -32107 -29673
14985b9673N829J0510J50R727j2620j9032M7956K3961k4889l0757L118M6344J489
$$ -29673 -23844 -13334 -13184 -3457 -16077 -35109 12847 36808 11919 -18838 -15720 30624 32113
14972C2113l5333J910K4578J4350J4065k3639o0813N7941M5877n0661l2746M7132
$$ 32113 -3220 -1310 23268 37618 51683 28044 -32769 25172 71049 20388 -12358 34774
14960C4774J5951L0841p493l5097k6294k0742l8717m680r211j8834M0836M7730
$$ 34774 50725 81566 74073 38976 12682 -8060 -46777 -51457 -60668 -79502 -38666 9064
14948I064M9118m2216k6482l491J1973K0736J5178l6953l2882L8140J9525j6631
$$ 9064 58182 15966 -10516 -14007 -2034 18702 33880 -3073 -35955 2185 21710 5079
14936E079j6457K555O699L5275J7059j261J7754k879R875m8996m2465m9231N3753
$$ 5079 -11378 -8823 -2124 33151 50210 48949 66703 63824 73699 24703 -17762 -66993 -13240
14923a3240J9448k9317o335J340k5630m143M8837j3663m5554q7708L7840M6690
$$ -13240 6208 -23109 -29444 -28104 -53734 -57877 -9040 -22703 -68257 -155965 -118125 -71435
14911g1435N7879r680P304J713m3410j2738j1769k3821K6815K8933M5497K5293
$$ -71435 -13556 -23236 -15932 -14219 -57629 -70367 -82136 -105957 -79142 -50209 -4712 20581
14899B0581K441j8312j7143j1555Q209J6064M5245M1399m9358k0069P9682J1140
$$ 20581 23022 4710 -12433 -23988 -15779 285 45530 86929 37571 17502 97184 108324
14887A08324n6375k1549K8675k4535O742l00n55r950r713Q112m9337J6257M0043
$$ 108324 51949 30400 59075 34540 41282 40982 40427 30477 20764 28876 -20461 -4204 35839
14874C5839l7401j895n4323k8920Q798L8726m324q104J7892k0347J3990K0018
$$ 35839 -1562 -3457 -57780 -86700 -77902 -39176 -43500 -51604 -33712 -54059 -40069 -20051
14862b0051p085j1860p320j9057N1608J9571P864m4768l501K7150K5905j8465
$$ -20051 -27136 -38996 -46316 -65373 -13765 5806 13670 -31098 -34599 -7449 18456 -9
14850iJ9530j4932l6491K3532l481J7431K2755j3921K3394L2407K3848j4315j6584
$$ -9 19521 4589 -31902 -8370 -11851 5580 28335 14414 37808 70215 94063 79748 63164
14837F3164J29j5168j3463n1151j6775K1066N043l271k2454P605K7984j8858J5276
$$ 63164 63293 48125 34662 -16489 -33264 -12198 -7155 -10426 -32880 -25275 2709 -16149 -873
14824h73r891l0575k1938j8732M4345N8630P978n8193m825J5981K946J1490k7106
$$ -873 -10764 -41339 -63277 -82009 -37664 20966 28944 -29249 -34074 -18093 -15147 -3657 -30763
14811c0763l5763q591K4282k7227J017j5913M465M8312N060l5789K0896O140j0627
$$ -30763 -66526 -75117 -50835 -78062 -77045 -92958 -88493 -40181 -35121 -70910 -50014 -43874 -54501
14798e4501K4563L2831o4022p8393R0688K4998m6968q718j7640k2593Q1557N0763
$$ -54501 -29938 2893 -61129 -139522 -48834 -23836 -70804 -79522 -97162 -119755 -38198 12565
14786A2565P16J5273m3403N725k6097l7205M43M1631M9754M7827r430n7432o8418
$$ 12565 13281 28554 -14849 -9124 -35221 -72426 -71983 -30352 19402 67229 57799 367 -68051
14773f8051M4417M6028K2047j06809m0980L5998M5748J4054M133q068m8152m9795
$$ -68051 -23634 22394 44441 -62368 -103348 -67350 -21602 -7548 -3415 -11483 -59635 -109430
14761a09430K964O327M5582M4047M8061k2640m7843l5453J7413N9869K7537M98
$$ -109430 -106466 -100139 -54557 -10510 37551 14911 -32932 -68385 -50972 8897 36434 36932
14749C6932m4272k4415j398L4363K0662j104k4419o833K3657k2547J197k0260
$$ 36932 -7340 -31755 -33153 1210 21872 20768 -3651 -10484 13173 -9374 -8177 -28437
14737b8437K1369K9821o988P6356N042J1118M450k6504j685M3065o869n8222r1110
$$ -28437 -7068 22753 15765 92121 97163 108281 112731 86227 84542 127607 120738 62516 -28594
14724b8594J8085J3251J2966p1069m4647O453J0899M7732L3813n3793o600K4533
$$ -28594 -10509 2742 15708 -55361 -100008 -93555 -82656 -34924 -1111 -54904 -61504 -36971
14712c6971j2560M9988L8058J8540K2971m4207l9831k033j3202m770J5726M7160
$$ -36971 -49531 457 38515 57055 80026 35819 -4012 -6045 -19247 -24017 -8291 38869
14700C8869k898J2228J8221l4275l5883r753M0103O589K2178l6640l7095J1525
$$ 38869 35971 48199 66420 32145 -3738 -13491 26612 33201 55379 18739 -18356 -6831
14688f831j4104R071M4513k1306k3662k3054m0098O578K5238K9709M5698N143
$$ -6831 -20935 -11864 32649 11343 -12319 -35373 -75471 -68893 -43655 -13946 31752 36895
14676C6895Q9515j7591j0220o3530j4828J7516o5306k6894P828N151K0503K2232
$$ 36895 126410 108819 98599 35069 20241 37757 -27549 -54443 -46615 -41464 -20961 1271
14664A271O040O516k9342O673j1024r734L7608K889J5624K969n1333n252L0942
$$ 1271 7311 13827 -15515 -8842 -19866 -29600 8008 10897 26521 29490 -21843 -27095 3847
14651C847R928q3312L731K8451j6807k4020J1658O2171J6077l8279p585J7825
$$ 3847 13775 -69537 -65806 -37355 -54162 -78182 -66524 -4353 11724 -26555 -34140 -16315
14639a6315J0529L8856j1451q480L3020L2856K058l135m0779o1198J0754M9483
$$ -16315 -5786 33070 21619 13139 46159 79015 81073 77938 37159 -24039 -13285 36198
14627C6198l266l6470k1236j7338J7233L509k5609o966J9592L3828l6946O896
$$ 36198 32932 -3538 -24774 -42112 -24879 -21370 -46979 -53945 -34353 -525 -37471 -30575
14615c0575K6854K8193M0978n6002q4323n345M8534J7246m8151R580M8873K5522
$$ -30575 -3721 24472 65450 9448 -74875 -80220 -31686 -14440 -62591 -53011 -4138 21384
14603B1384l6133M0470j2264k5606J475P75n098R549M7617n456M797n138m7548
$$ 21384 -14749 25721 13457 -12149 -10674 -9899 -14997 -5448 42169 36713 41510 36372 -11176
14590a1176k2602K7904N8168R371j1955O397j4743k2518K7580k7984o8443L670
$$ -11176 -33778 -5874 52294 61665 49710 56107 41364 18846 46426 18442 -50001 -46331
14578d6331K8173J5510L9258j5526n0480j9431N1440M3760L6524m0639n6692l5326
$$ -46331 -18158 -2648 36610 21084 -29396 -48827 2613 46373 82897 42258 -14434 -49760
14566d9760K1507j1342Q296j7574o741k1804k9072N5322O650M0254K1422J9245
$$ -49760 -28253 -39595 -31299 -48873 -55614 -77418 -106490 -51168 -44518 -4264 17158 36403
14554C6403L075J3200L1195J357l0108o617n6917l4289L6840j2985M2802Q765
$$ 36403 39478 52678 83873 85230 55122 48505 -8412 -42701 -5861 -18846 23956 32721
14542C2721m4413L56k3792m0587L8386N4434m410r311k4420l2503J3743J285K1263
$$ 32721 -11692 -11336 -35128 -75715 -37329 17105 12695 3384 -21036 -53539 -39796 -38511 -17248
14529a7248J8133j2370q0216o410Q8624K8051n4267j3478M4325O1553J4503n8965
$$ -17248 885 -11485 -91701 -98111 -9487 18564 -35703 -49181 -4856 56697 71200 12235
14517A2235k9010K6822k5786k8713l8895n216K0849M345l3132J62L9109J4015
$$ 12235 -16775 10047 -15739 -44452 -83347 -88563 -67714 -63369 -96501 -96339 -57230 -43215
14505d3215K0286L7269K0796q560M1098m2607l4597r382j1017j8231L3595L963
$$ -43215 -22929 14340 35136 26576 67674 25067 -9530 -18912 -29929 -48160 -14565 -10602
14493a0602M1792j8507J3827j0734j4575l2926j5443R8071K1230k5969N508k4309
$$ -10602 31190 12683 26510 15776 1201 -31725 -47168 50903 72133 46164 51672 27363
14481B7363k2985j1616K1026k6849j7933K1891k2163k0581L3698j5379k7170K931
$$ 27363 4378 -7238 13788 -13061 -30994 -9103 -31266 -51847 -18149 -33528 -60698 -57767
14469e7767k4684N648K9482K55L134R670K631j742K8847k3939n1817j2883r041
$$ -57767 -82451 -76803 -47321 -47066 -43932 -34262 -31631 -33373 -4526 -28465 -80282 -93165 -102206
14456a02206j7666j1222J1733M7022K6702J4115L1561m935J4833m7044m4979J6605
$$ -102206 -119872 -131094 -119361 -72339 -45637 -31522 39 -4896 9937 -37107 -82086 -65481
14444f5481O0829K5545P6032q561o0218j6329l5197k419O146L4713J15r715j3110
$$ -65481 -4652 20893 96925 88364 28146 11817 -23380 -25799 -19653 15060 15175 5460 -7650
14431g650k1231N0986Q329J7655K623m2760o9152k6184P4192P443j7794q874l1490
$$ -7650 -28881 22105 30434 48089 50712 7952 -61200 -87384 -13192 -5749 -23543 -32417 -63907
14418f3907n976L0424K2642j8870O3596l344l0921O4071J6213L0177J9295m4614
$$ -63907 -69883 -39459 -16817 -35687 27909 24565 -6356 57715 73928 104105 123400 78786
14406G8786k3758O6685J8920L794l8881m8366J3860k4534L8600l2935L317K776
$$ 78786 55028 121713 140633 144427 105546 57180 71040 46506 85106 52171 55488 58264
14394E8264k6386o67m5189M7206j4838n189K586k2675n5273J4067J1118k1049
$$ 58264 31878 31211 -13978 33228 18390 13201 15787 -6888 -62161 -48094 -36976 -58025
14382e8025N4763M003k4505J1781K2045l6699M2706j2561p3562j0052L5591O3477
$$ -58025 -3262 741 -23764 -11983 10062 -26637 16069 3508 -70054 -80106 -44515 18962
14370A8962j2535n0457P139L5420j7003L0966N430m937j9945M800k2589k8682
$$ 18962 6427 -44030 -36891 -1471 -18474 12492 17922 12985 -6960 -2160 -24749 -53431
14358e3431J4632Q621J4273j3947l7671K1518K3883l2786j4399r258l0629n93
$$ -53431 -38799 -30178 -15905 -29852 -67523 -46005 -22122 -54908 -69307 -78565 -109194 -109787
14346a09787N2429J4317L8327J6210L7781o68n4181o7605P57J8798N2478l5382
$$ -109787 -57358 -43041 -4714 11496 49277 48609 -5572 -73177 -72420 -53622 -1144 -36526
14334c6526k8572R983k6245o391K5229L2036L438o603L155J4938L8308O1775J997
$$ -36526 -65098 -55115 -81360 -87751 -62522 -30486 -27048 -33651 -30496 -15558 22750 84525 86522
14321H6522n5213j7956L1672o57l5425L9175j9697k1568k3128O55q324k3682M353
$$ 86522 31309 13353 45025 44368 8943 48118 28421 6853 -16275 -15620 -23944 -47626 -43273
14308d3273N5582l1493j9952N2273K6727O6625j063l5981K015k6273j00622M3845
$$ -43273 12309 -19184 -39136 13137 39864 106489 105426 69445 71460 45187 -55435 -11590
14296a1590M5299r6473n0538P6825L2280J8297m9105m5733k3618l251J6195L9700
$$ -11590 33709 -62764 -113302 -36477 -4197 14100 -35005 -80738 -104356 -107607 -91412 -51712
14284e1712J8979J5621n123K5697J1204P91m9267p3254J4404O3096O842K7678
$$ -51712 -32733 -17112 -22235 3462 14666 15457 -33810 -107064 -92660 -29564 -22722 4956
14272D956n3792k1621q585K9732N2026m8992M05Q462J4863M0726l1292k1791j6227
$$ 4956 -48836 -70457 -79042 -49310 2716 -46276 -45871 -37409 -22546 18180 -13112 -34903 -51130
14259e1130R631K1403M009q380m2103N675j0153r94N3941L0961l447o4112l6239
$$ -51130 -41499 -20096 -16087 -24467 -66570 -60895 -71048 -72042 -18101 12860 9413 -54699 -90938
14246i0938O3807K7515K5678m629l4190j1258m318N166M0303N292m6575k855K3190
$$ -90938 -27131 384 26062 21433 -12757 -24015 -28333 -23167 17136 22428 -24147 -27002 -3812
14233c812L4344l3006m4827K8305J5517n0243m8812Q967R3840L9829j8689o1004
$$ -3812 30532 -2474 -47301 -18996 -3479 -53722 -102534 -93567 273 40102 21413 -39591
14221c9591m1395M9778O6898j1398k0866J2195K3628J193q086p595n9941l6520
$$ -39591 -80986 -31208 35690 24292 3426 15621 39249 40442 32356 24761 -35180 -71700
14209g1700J1178L786K322M3424M4729m68m0846l5546j2615K9265l0703J244J6748
$$ -71700 -60522 -56736 -54414 -10990 33739 33271 -7575 -43121 -55736 -26471 -57174 -55930 -39182
14196c9182J6896L7278l6853r003K8868m141N767k72k926R641r162k2315j5163
$$ -39182 -22286 14992 -21861 -30864 -1996 -6137 -370 -642 -3568 6073 -3089 -25404 -40567
14183d0567l2631J9375j746M1442o311K2471J66K6561J5230j3501m0858J3928
$$ -40567 -73198 -53823 -55569 -14127 -20438 2033 2199 28760 43990 30489 -10369 3559
14171C559j3078L6498J9931Q97J5814K4735m8862k5665o997m8956K4026P5518
$$ 3559 -9519 26979 46910 47807 63621 88356 39494 13829 6832 -42124 -18098 57420
14159E7420k1152o1532j6209N6693m4574l8104L9765j9983k7910L2667J00160
$$ 57420 36268 -25264 -41473 15220 -29354 -67458 -27693 -47676 -75586 -42919 57241
14148E7241J7853m5284k6195O228k5775K8556r6l8883n301K0979J9600l7870L4170
$$ 57241 75094 29810 3615 9843 -15932 12624 12528 -26355 -31656 -10677 8923 -28947 5223
14135E223J1952k52J4930n166n694q842m545K0573l675K813j7239j8293R965j0440
$$ 5223 17175 16923 31853 26687 20993 12151 7606 28179 24504 27317 10078 -8215 1750 -8690
14121h690J8966q200k035l9716m4137j6015L0952m5044n0839L9886J2634j6943
$$ -8690 10276 2076 41 -39675 -83812 -99827 -68875 -113919 -164758 -124872 -112238 -129181
14109a29181K0843M6983K7547K8593L9461j7008l4891j5073L5888L6795N2398
$$ -129181 -108338 -61355 -33808 -5215 34246 17238 -17653 -32726 3162 39957 92355
14098I2355J9659l3215p0039M567N1510k3583K4336k2703l0975l7026K7924K7797
$$ 92355 112014 78799 8760 13327 64837 41254 65590 42887 11912 -25114 2810 30607
14086C0607q632l6766N805j3069K9240L0287L6795J9565j0025j9273l943j4059
$$ 30607 21975 -14791 -8986 -22055 7185 37472 74267 93832 83807 64534 60591 46532
14074D6532l4407m3481j692L6583L5631k1767m852L549P686k9456n8449j8279
$$ 46532 12125 -31356 -33048 3535 39166 17399 12547 16096 23782 -5674 -64123 -82402
14062h2402M757J5038J1160n0755K2871K3410J5870k8059j298M0321k4882R788
$$ -82402 -77645 -62607 -51447 -102202 -79331 -55921 -40051 -68110 -69408 -29087 -53969 -44181
14050d4181J1434J6533J703K708J6635J3121Q999l0745m1041r189j2379k4364
$$ -44181 -32747 -16214 -14511 -11803 4832 17953 26952 -3793 -44834 -54023 -66402 -90766
14038i0766k7904L7425M3203L415P226K1771n0845K1200L0974P722o33m4598J3691
$$ -90766 -118670 -81245 -38042 -34627 -27401 -5630 -56475 -35275 -4301 3421 2788 -41810 -28119
14025b8119L0293K4779J1616p32J4894m429j2133l2456R242K590o803j318j6067
$$ -28119 2174 26953 38569 37837 52731 48302 36169 3713 12955 15545 8742 7424 -8643
14012h643j4938N742M7895P3764p968n5650n8484n0299l449m648k1035L3872M3146
$$ -8643 -23581 -17839 30056 103820 95852 40202 -18282 -68581 -72030 -76678 -97713 -63841 -20695
13999b0695L0439J9199m4466n1404j8283J4554M2935M2012L0612k3801n9619J7367
$$ -20695 9744 28943 -15523 -66927 -85210 -70656 -27721 14291 44903 21102 -38517 -21150
13987b1150K3589L0851n8126j5007l826m787J7125R730J3400m7684j428J8161
$$ -21150 2439 33290 -24836 -39843 -43669 -48456 -31331 -21601 -8201 -55885 -57313 -39152
13975c9152J4068o241q751P424K24L516J3532r081j0599J0424J866J2317k5647
$$ -39152 -25084 -31325 -40076 -32652 -32428 -28912 -15380 -24461 -35060 -24636 -22770 -10453 -36100
13962c6100n003k260j8466N848K3117J6675k2937k5699K4547M7167O1377k2643
$$ -36100 -41103 -43363 -61829 -55981 -32864 -16189 -39126 -64825 -40278 6889 68266 45623
13950D5623j8040n9j2798N0758j0895l1627j8992k621K8036R94o427k8482J2005
$$ 45623 27583 27524 14726 65484 54589 22962 3970 1349 29385 30379 23952 -4530 7475
13937G475p744k7862j2771K4095N0038Q332n8076l6498m088J1734L4941K7116
$$ 7475 -269 -28131 -40902 -16807 33231 41563 -16513 -53011 -57099 -45365 -10424 16692
13925A6692J2107j787l5673N014m5087k0263j2725O4443j0664k8311N8081K7810
$$ 16692 28799 27012 -8661 -3647 -48734 -68997 -81722 -17279 -27943 -56254 1827 29637
13913B9637r102m330L494j3907K6208J2320m5681k7308K4483L5698k4782L49r657
$$ 29637 20535 16205 19699 5792 32000 44320 -1361 -28669 -4186 31512 6730 7079 -2578
13900b578J9745N6947K4328m656l7746J665N658J0721L9180q453k8188k5604j9033
$$ -2578 17167 74114 98442 93786 56040 57705 63363 74084 113264 104811 76623 51019 31986
13887C1986o1881J0637K6235p216O2822J0419j4888J4655p865l5678l0211L601
$$ 31986 -29895 -19258 6977 -239 62583 73002 58114 72769 64904 29226 -985 2616
13875B616l8371l8013q487J2972K2002J5780M3019O3363J672q0706j2877n0070
$$ 2616 -35755 -73768 -82255 -69283 -47281 -31501 11518 74881 76553 -4153 -17030 -67100
13863f7100K87J3209N5042l9491l7533L8129J736J4095j4297l0462P00j6173J6883
$$ -67100 -66813 -53604 1438 -38053 -75586 -37457 -35721 -21626 -35923 -66385 -65685 -81858 -64975
13850f4975J099L6340R73K4378K2088l6937q140p306M3385N2624J7850l1488j0673
$$ -64975 -63876 -27536 -26563 -2185 19903 -17034 -25174 -32480 10905 63529 81379 49891 39218
13837C9218J6539J2481j6588n5510j8702N649M2939K8428k6714j6460k0409L7817
$$ 39218 55757 68238 51650 -3860 -22562 -16913 26026 54454 27740 11280 -9129 28688
13825B8688J0375Q735M517J0076K8768m415j5569o879n0420j5055J9277J00l4887
$$ 28688 39063 47798 52315 62391 91159 86744 71175 64296 13876 -1179 18098 18198 -16689
13812a6689o309L1603p043l292l452L3577j8806j6483K5692q9527p67K5734M3560
$$ -16689 -22998 8605 1562 -1730 -5182 28395 9589 -6894 18798 -70729 -71496 -45762 -2202
13799b202M0484L1521l7956j09485j6342K5187R215P0914l2874J6033M0308M5487
$$ -2202 38282 69803 31847 -77638 -93980 -68793 -59578 11336 -21538 -5505 34803 80290
13787H0290P740p3233n3788J4447L5407J2843J2108L238k102r522l9741m4809
$$ 80290 88030 14797 -38991 -24544 10863 23706 35814 39052 36950 27428 -12313 -57122
13775e7122L659J6534L270J1030J629M4058j2058n8738M3246J6319q79K2212J2414
$$ -57122 -53463 -36929 -33659 -22629 -21000 23058 11000 -47738 -4492 11827 10948 33160 45574
13762D5574j2566j278q985m117m7000m6839j2790K7811j941L653J9648j8146P450
$$ 45574 33008 31730 22745 18628 -28372 -75211 -88001 -60190 -62131 -58478 -38830 -56976 -49526
13749d9526J9905J6058m7127Q86Q6871k6807m8341l576O4227R448J2622O2924
$$ -49526 -29621 -13563 -60690 -59804 27067 260 -48081 -51657 12570 22018 34640 97564
13737I7564j9379o2298K7797M2613K0576n8760m8203m4626O8839O0921J0986p214
$$ 97564 78185 15887 43684 86297 106873 48113 -90 -44716 24123 85044 96030 88816
13725H8816L2126o6664l1508l0395q141P2022j3733j1837Q043k5714m17L1925
$$ 88816 120942 54278 22770 -7625 -15766 56256 42523 30686 38729 13015 12598 44523
13713D4523K4616J2321k4621k6672j9519q400j4001l5399k5608M0341O7157M6172
$$ 44523 69139 81460 56839 30167 10648 2248 -11753 -47152 -72760 -32419 34738 80910
13701H0910j0244m3731k132n56J1161k720l2474L1014Q564l0715k8535k8276k5091
$$ 80910 70666 26935 24803 24247 35408 32688 214 31228 39792 9077 -19458 -47734 -72825
13688g2825L2872j2579J934M4298K0886L5237J9757o1183k7784p349J7425l6871
$$ -72825 -39953 -52532 -50598 -6300 14586 49823 69580 8397 -19387 -26736 -9311 -46182
13676d6182K6559L5393n6307K6084j4445L0476K8715J8906j319o4319k1385j8073
$$ -46182 -19623 15770 -40537 -14453 -28898 1578 30293 49199 47880 -16439 -37824 -55897
13664e5897K9048K6824Q5623k9209o9240p3819l5055M7855j7424p796M0941O3318
$$ -55897 -26849 -25 85598 56389 -12851 -86670 -121725 -73870 -91294 -99090 -58149 5169
13652E169J6023K1893n37k2838L3612J3744l1417k7794R811K8996J8520l7894
$$ 5169 21192 43085 42548 19710 53322 67066 35649 7855 17666 46662 65182 27288
13640B7288P923j4285K7917j5702m0545K974j339K1953m447q00j7166m2254k2201
$$ 27288 35211 20926 48843 33141 -7404 -4430 -5769 16184 11737 10937 -6229 -48483 -70684
13627g0684l1822l740N3051K8907m1955L1579K957K8879K5044J6800J4359m4975
$$ -70684 -102506 -106246 -53195 -24288 -66243 -34664 -31707 -2828 22216 39016 53375 8400
13615H400o028q99J4873K5928n0668j0173J4858l7403l0474l716l823J5611J8749
$$ 8400 2372 1473 16346 42274 -8394 -18567 -3709 -41112 -71586 -75302 -79125 -63514 -44765
13602d4765M1286L0068L6143l154J776l1857j2392r224j308k4849j3998j0701
$$ -44765 -3479 26589 62732 59578 61354 29497 17105 7881 6573 -18276 -32274 -42975
13590d2975Q290J6973k2525K6878N9622j8736k2262J809l5901j2067o678N9260
$$ -42975 -34685 -17712 -40237 -13359 46263 27527 5265 7074 -28827 -40894 -47572 11688
13578A1688J6611N29J5683P8931k6313m8308j9160o8286m9933j7512o383P7567
$$ 11688 28299 28828 44511 123442 97129 48821 29661 -38625 -88558 -106070 -112453 -34886
13566c4886K4799K1413l7484j3121O313L88L6560n008k8284p097N8273Q4466R982
$$ -34886 -10087 11326 -26158 -39279 -32966 -32578 3982 -1026 -29310 -36407 21866 106332 116314
13553A16314p3168m5076j1442K1662p074l8540m901O567r380M0538k5871p820
$$ 116314 43146 -1930 -13372 8290 1216 -37324 -42225 -35658 -45038 -4500 -30371 -38191
13541c8191J9620m9700k1473q702m345L1284K1249O0907n875n889Q611N1696K2179
$$ -38191 -18571 -68271 -89744 -98446 -102791 -71507 -50258 10649 4774 -1115 7496 59192 81371
13528H1371l9447k4246j5695O866j7374N700J7816k119k4586K6957J7660k6395
$$ 81371 41924 17678 1983 8849 -8525 -2825 14991 12872 -11714 15243 32903 6508
13516F508p996L4097j9942P918J2653J7696n1235k4547K8659J5965J6582K24L1546
$$ 6508 -1488 32609 12667 20585 33238 50934 -301 -24848 3811 19776 36358 36582 68128
13503F8128n4402m0344L2242l0865M9670R5567m889j6484j4208J5964K9644l6791
$$ 68128 13726 -26618 5624 -25241 24429 119996 115107 98623 84415 100379 130023 93232
13491I3232n4160l0034M2535M8081k3800j9433K5595l6570o3566L285L6008M1673
$$ 93232 39072 9038 51573 99654 75854 56421 82016 45446 -18120 -14835 21173 62846
13479F2846r29j3520O339L2836j775L980N485n93L110o9420J3193k567p6708k3580
$$ 62846 61917 48397 54736 87572 85797 89777 95262 94669 97779 28359 41552 38985 -37723 -61303
13465f1303M1827M6271M9678K9226J510o2142k08L884Q116m8316j3445N687J5304
$$ -61303 -19476 26795 76473 105699 107209 45067 44859 48743 56859 8543 -4902 785 16089
13452A6089q999K9701M343n695L1675l0731l408o059J0087R579q225l9749L5263
$$ 16089 7090 36791 41134 35439 67114 36383 32975 26916 37003 46582 38357 -1392 33871
13439C3871L5204k2509j0317N2640m995j3519k1788J0429j7183m0762n1609J6815
$$ 33871 69075 46566 36249 88889 83894 70375 48587 59016 41833 1071 -50538 -33723
13427c3723J7644k1240k6143K5540k4489l0490M3024L3132l1096o0107l3417M7381
$$ -33723 -16079 -37319 -63462 -37922 -62411 -92901 -49877 -16745 -47841 -107948 -141365 -93984
13415i3984K0510M7198P174J7608K8165M7422J2142p943k8368j4219M555M662
$$ -93984 -73474 -26276 -19102 -1494 26671 74093 86235 78292 49924 35705 40260 44922
13403D4922j9624j1611l8995P023o012J5115o239L741p368j9316P383N911m4938
$$ 44922 25298 13687 -25308 -18285 -24297 -9182 -15421 -11680 -19048 -38364 -30981 -25070 -70008
13390g0008J528N5572L1116m8613K8269J5881k523J5670j7525l2421M6109j1658
$$ -70008 -68480 -12908 18208 -30405 -2136 13745 11222 26892 9367 -23054 23055 11397
13378A1397P71j5279J9539O592m661l440l9702Q089O1824K0180J6452J9547k0702
$$ 11397 12168 -3111 16428 23020 18359 14919 -24783 -16694 45130 65310 81762 101309 80607
13365H0607j4590l5174J7874k1457k8015P254m891o992m1767L5029M2603k4847
$$ 80607 66017 30843 48717 27260 -755 6499 1608 -5384 -47151 -12122 30481 5634
13353E634n545L5297L6698O98o5472q4465j6494L2846L2383j9502J2928q184J1808
$$ 5634 89 35386 72084 72782 7310 -77155 -93649 -60803 -28420 -47922 -34994 -43178 -31370
13340c1370O704m2173j6207J9849K3943J8183J8073j7490k3127n853J7771k736
$$ -31370 -24666 -66839 -83046 -63197 -39254 -21071 -2998 -20488 -43615 -49468 -31697 -34433
13328c4433J9797K4463M3763M2188l4174l1668m8095j7594J4535K5130K5591R190
$$ -34433 -14636 9827 53590 95778 61604 29936 -18159 -35753 -21218 3912 29503 38693
13316C8693J2996l2442n1603O3229k7690k9414L7846m6888o1152K252L1514O2474
$$ 38693 51689 19247 -32356 30873 3183 -26231 11615 -35273 -96425 -94173 -62659 -185
13304a85L0515j6831O506j5865l0908L7530m462l3024O1159M2921j0046k1228
$$ -185 30330 13499 20005 4140 -26768 10762 6300 -26724 34435 77356 67310 46082
13292D6082K771l6863N971k4325k338L298K3775J9516l4035m2917k7580R3725
$$ 46082 48853 11990 17961 -6364 -8702 -5404 18371 37887 3852 -39065 -66645 27080
13280B7080M896k7595p0374N8083Q5919p540m3305m9039j9113K9963P544J2351
$$ 27080 31976 4381 -65993 -7910 78009 70469 27164 -21875 -40988 -11025 -3481 8870
13268H870P987k7783k9795k5173J8603L4021l9861n7035j0240L2331L8946J7184
$$ 8870 16857 -10926 -40721 -65894 -47291 -13270 -53131 -110166 -120406 -88075 -49129 -31945
13256c1945M8985J8785o3309J0516j1085l7634K203L1398L914k4607k9724L3303
$$ -31945 17040 35825 -27484 -16968 -28053 -65687 -63484 -32086 -28172 -52779 -82503 -49200
13244d9200K2655N7355l1187j8000j3603J9386N5410R642k7484l449J1172j4438
$$ -49200 -26545 30810 -377 -18377 -31980 -12594 42816 52458 24974 21525 32697 18259
13232A8259L8476J2997o7889j0463R051J882k9417L7269L1807M2981m5479k6480
$$ 18259 56735 69732 1843 -8620 431 2313 -27104 10165 41972 84953 39474 12994
13220A2994r792j8111n8252k1961L159R381L3230J6750M5261j06J7849l752j9119
$$ 12994 3202 -14909 -73161 -95122 -91963 -82582 -49352 -32602 12659 12553 30402 26650 7531
13207G531k3422R046L39l1567o464J0381J0137J5818J5631r161l2576k1025k5127
$$ 7531 -15891 -6845 -6506 -38073 -44537 -34156 -24019 -8201 7430 -1731 -34307 -55332 -80459
13194h0459J9178N1655O4399K8957n617p143l5720q998j0921K0424L5308n4001
$$ -80459 -61281 -9626 54773 83730 78113 70970 35250 26252 15331 35755 71063 17062
13182A7062p1134l7659K3620M4929M412P3904L2536l3093m4234l1629L0512p412
$$ 17062 -54072 -91731 -68111 -23182 -18770 55134 87670 54577 10343 -21286 9226 1814
13170A814L673k4716K0689L2753J7163n273q916K1104l3552k2738M4857L7852
$$ 1814 5487 -19229 1460 34213 51376 46103 37187 58291 24739 2001 46858 84710
13158H4710j6628n2255O751K0142j5967m9553L470K1838l1552M902R723J0817
$$ 84710 68082 15827 22578 42720 26753 -22800 -19330 2508 -29044 -24142 -14419 -3602
13146c602L7846j7065k1862j6065j9973R053j2705k6353K0201J5727K7548N8599
$$ -3602 34244 17179 -4683 -20748 -40721 -31668 -44373 -70726 -50525 -34798 -7250 51349
13134E1349R367m5590l6463m0744l6550n41P3622K6840j7999l0084Q442K7211
$$ 51349 60716 15126 -21337 -62081 -98631 -99172 -25550 1290 -16709 -46793 -38351 -11140
13122a1140L8732L9177j5768q4427J1051N5265L5499o1970n2651j8559L2940J5984
$$ -11140 27592 66769 51001 -33426 -22375 32890 68389 6419 -46232 -64791 -31851 -15867
13110a5867k7401l857K6520O595J5491q15r122o064N834j6484J069J7705j5562
$$ -15867 -43268 -47125 -20605 -14010 1481 666 -8456 -14520 -8686 -25170 -24101 -6396 -21958
13097b1958l5119L6818K7359k0114R65Q083o9036P152R773K0339r920m4229J546
$$ -21958 -57077 -20259 7100 -13014 -12049 -3966 -73002 -65850 -56077 -35738 -45658 -89887 -88341
13084h8341K1614N3616M0081k3440j3635l5789o3018m8700k8098N6059Q3036N0543
$$ -88341 -66727 -13111 26970 3530 -10105 -45894 -108912 -157612 -185710 -129651 -46615 3928
13072C928K160L2989K0721m2856j17351l7956M3505M9950M4335J103k5088K436
$$ 3928 6088 39077 59798 16942 -100409 -138365 -94860 -44910 -575 528 -24560 -22124
13060b2124j1323k0244R144M660m4957K64J5131M9334q604l7202j315N7347K9885
$$ -22124 -33447 -53691 -44547 -39887 -84844 -84580 -69449 -20115 -28719 -65921 -67236 -9889 19996
13047A9996J2350R870j743P952k8465q979L1179J4771m4741p7491r515M5401J06039
$$ 19996 32346 42216 40473 48425 19960 10981 42160 56931 12190 -65301 -74816 -29415 76624
13034G6624P841m8561J3511k9970m0956M2525M1217n0831k5576j9206k3665k5846
$$ 76624 84465 35904 49415 19445 -21511 21014 62231 11400 -14176 -33382 -57047 -82893
13022h2893L1374P158K6524m1777r258J2246P622K1611L7582n182M1992l0411
$$ -82893 -51519 -44361 -17837 -59614 -68872 -56626 -49004 -27393 10189 5007 46999 16588
13010A6588l1090j9069q676n573j9646j083Q363J5113L1682O3819m679l3627J6750
$$ 16588 -14502 -33571 -42247 -47820 -67466 -68549 -60186 -45073 -13391 50428 45749 12122 28872
12997B8872j5590k3617l3672k89K0439L2142r347p237L1151M8633j2263K607L2395
$$ 28872 13282 -10335 -44007 -44296 -23857 8285 -1062 -8299 22852 71485 59222 61829 94224
12984I4224k1527o9180n1101j2082K0876M1335J6672j2466L2285m3457k7208L5206
$$ 94224 72697 3517 -47584 -59666 -38790 2545 19217 6751 39036 -4421 -31629 3577
12972C577M2311K4625j8234J0416K7655J16j056n0221k8247m098K587K690Q421
$$ 3577 45888 70513 52279 62695 90350 90466 89410 39189 10942 6844 9431 12121 20542
12959B0542j5377j4297J0878M957l5352J1440L3651M523M2k5256K5484L4974L19
$$ 20542 5165 -9132 1746 6703 -28649 -17209 16442 20965 21007 -4249 21235 56209 56528
12946E6528J1929k3137k4708j905J9847j5697N097R259j8499k144l2240n2980
$$ 56528 68457 45320 20612 18707 38554 22857 27954 37213 18714 16570 -15670 -68650
12934f8650J9309M5484L6120L7936l3870l6757k0090k6976q506J260R909L2630
$$ -68650 -49341 -3857 32263 70199 36329 -428 -20518 -47494 -56000 -54740 -44831 -12201
12922a2201O2943J5603J3939L5661p396l3847l3176l1800k42l6750J4650j0212
$$ -12201 50742 66345 80284 115945 108549 74702 41526 9726 9484 -27266 -12616 -22828
12910b2828j3281K3588K0683K7595K3318L723j2970J1999m621o596l7346p290
$$ -22828 -36109 -12521 8162 35757 59075 62798 49828 61827 57206 50610 13264 5974
12898E974j3861k7375m629m8738J4049M8323L0239N7905L6467l9311k9898q642
$$ 5974 -7887 -35262 -39891 -88629 -74580 -26257 3982 61887 98354 59043 29145 20503
12886B0503L6273n488n4090n0074J9957N6818L7919K0971n5665p955k3473l7476
$$ 20503 56776 51288 -2802 -52876 -32919 23899 61818 82789 27124 19169 -4304 -41780
12874d1780j7649J209r274N714j0022K7753O0661p135J0094l234n5107K1529K7502
$$ -41780 -59429 -58220 -67494 -61780 -71802 -44049 16612 9477 19571 16337 -38770 -17241 10261
12861A0261J9382J8967J0530j5550m308n905o1803K1328K3030p1452p5380M6708
$$ 10261 29643 48610 59140 43590 39282 33377 -28426 -7098 15932 -55520 -130900 -84192
12849h4192N4241O524L7680M8246k0039k7675l6791J7477J5544p011L5816J9249
$$ -84192 -29951 -23427 14253 62499 42460 14785 -22006 -4529 11015 4004 39820 59069
12837E9069K0898M1777J365n1969o5733j1932j1081j6494k2607K4653J0864p95
$$ 59069 79967 121744 123109 71140 5407 -6525 -17606 -34100 -56707 -32054 -21190 -21985
12825b1985n339L0298j4343M7649R706q132K7421n9706l2280J5110l270k7773
$$ -21985 -27324 2974 -11369 36280 45986 37854 65275 5569 -26711 -11601 -14871 -42644
12813d2644p360m0207k2470K5456K2461j3317K5484J3822Q3789L7445N3247K0211
$$ -42644 -50004 -90211 -112681 -87225 -64764 -78081 -52597 -38775 45014 82459 135706 155917
12801A55917n6000m4638K1877j6646m6710l7691O097k425O0747K3591j9248M447
$$ 155917 99917 55279 77156 60510 13800 -23891 -17794 -20219 40528 64119 44871 49318
12789D9318r693N674j1820n922k3870K4802L0069r304l1031p340l2756L623L4897
$$ 49318 39625 45299 33479 27557 3687 28489 58558 49254 18223 10883 -21873 -18250 16647
12776A6647l4457K2232K65j6164J2756M5864j6968j5508R850J1375P211j6653
$$ 16647 -17810 4422 4687 -11477 1279 47143 30175 14667 24517 35892 43103 26450
12764B6450l79m3667n4790L8410M4941k1103j2379K1769L965j7707j7029k7084
$$ 26450 26071 -17596 -72386 -33976 10965 -10138 -22517 -748 3217 -14490 -31519 -58603
12752e8603L3601P1456P958J0879j1856n9926o1013n169L8081N0555n207J2053
$$ -58603 -25002 46454 54412 65291 53435 -6491 -67504 -72673 -34592 15963 10756 22809
12740B2809P9841K0061o2548n0966k4918n8282P0116P4484q903N5868m6948n9812
$$ 22809 102650 122711 60163 9197 -15721 -74003 -3887 70597 61694 117562 70614 10802
12728A0802j8439L0703K4260j837l3460p5430o513L9252p008j4542L9998M0108
$$ 10802 -7637 23066 47326 45489 12029 -63401 -69914 -30662 -37670 -52212 -12214 27894
12716B7894K5501O402m3368K1145K5775j7479o2483K4278O3395j04O825j6643
$$ 27894 53395 59797 16429 37574 63349 45870 -16613 7665 71060 70956 77781 61138
12704F1138k0728k1716j3813K1052M4941j4894k9629J6262K8250j7641k5590l9118
$$ 61138 40410 18694 4881 25933 70874 55980 26351 42613 70863 53222 27632 -11486
12692a1486j0952L8516Q377n746M6658L8886k0253j7547J7218k0287p658q692
$$ -11486 -22438 16078 24455 18709 65367 104253 84000 66453 83671 63384 55726 47034
12680D7034l2854k9939l9256L493j120k4466L4590M1675L5371k3159l2357J8375
$$ 47034 14180 -15759 -55015 -51522 -52642 -77108 -42518 -843 34528 11369 -20988 -2613
12668b613M3181l1921k653P39J7369O70l7370o5110J0744M8687M6722K2255l8008
$$ -2613 40568 8647 5994 6733 24102 24772 -12598 -77708 -66964 -18277 28445 50700 12692
12655A2692p7810j6806N0461N0619M4468J1219K7280L0542q922l4617n7244n671
$$ 12692 -65118 -81924 -31463 19156 63624 74843 102123 132665 123743 89126 31882 26211
12643B6211J040k4473J7326L1586j42j6418j4280p059P200M6582L6785N034q2329
$$ 26211 27251 2778 20104 51690 51548 35130 20850 13791 20991 67573 104358 109392 27063
12630B7063j9367K1448N80p326J329n2304P22m4868J7299j717J6111L4277P4227
$$ 27063 7696 29144 29724 22398 23727 -28577 -27855 -72723 -55424 -57141 -41030 -6753 67474
12617F7474K3644L3500p652k6581n7175j6232P3194K1226m7851k0091M7879k5372
$$ 67474 91118 124618 116966 90385 33210 16978 90172 111398 63547 43456 91335 65963
12605F5963j130r220K4977O860J1718O869l5998l9997n406L733j788M8257j261
$$ 65963 64833 55613 80590 87450 99168 106037 70039 30042 24636 28369 26581 74838 73577
12592G3577m2127l9129k6368L0603N8908j8746O185j0179m0573p30K0604k7120
$$ 73577 31450 -7679 -34047 -3444 55464 36718 42903 32724 -7849 -8579 12025 -15095
12580a5095M594P532M3453L3840p286k0124O355K5123q08m2480l7956M2332Q340
$$ -15095 -10501 -2969 40484 74324 67038 46914 53269 78392 77584 35104 -2852 39480 47820
12567D7820K9717R935L5992l0714j5111j9886J751pJ9063l2034l5130q784L2887
$$ 47820 77537 87472 123464 92750 77639 57753 59504 59497 78560 46526 11396 2612 35499
12554C5499l7392L3908N974n5691j1316L0777M4729l749j1810Q353M3152J9714
$$ 35499 -1893 32015 37989 -17702 -29018 1759 46488 42739 30929 39282 82434 102148
12542A02148m5230l3608Q624K618k4754Q301L7821L4608L0849J2816m2063l5595
$$ 102148 56918 23310 31934 34552 9798 18099 55920 90528 121377 134193 92130 56535
12530E6535J2328J9412K1384m7981J0293r218p043J5760R953M720j1210l339K6045
$$ 56535 68863 88275 109659 61678 71971 62753 55710 71470 81423 86143 74933 71594 97639
12517I7639L358j8359m6321n8768m421P1378j5318J7222R131K3284J6522j037
$$ 97639 100997 82638 36317 -22451 -26872 44506 29188 46410 55541 78825 95347 94310
12505I4310m1609L848P2100p574J2687j9632l6204J0269k4946n2272j2195L5139
$$ 94310 52701 56549 128649 121075 133762 114130 77926 88195 63249 10977 -1218 33921
12493C3921j1763J1971Q306K2318J269m177L6076l1225m1753k1384L346m5210
$$ 33921 22158 34129 42435 64753 66022 61845 97921 66696 24943 3559 6905 -38305
12481c8305k7316N5035M8747Q3067K3467k6467l5404O778J1305k9123o87k2333
$$ -38305 -65621 -10586 38161 121228 144695 118228 82824 89602 100907 71784 71097 48764
12469D8764K8492P2879L957O959l6011k3241n7824o8496n055N2420K0345k1429
$$ 48764 77256 150135 154092 161051 125040 101799 43975 -24521 -29576 22844 43189 21760
12457B1760l0918m688N6937m700L22j1211m2441J0342K405K3276K7646J514K6848
$$ 21760 -9158 -13846 43091 38391 38713 27502 -14939 -4597 -2192 21084 48730 50244 77092
12444G7092J9404N896k2695l6306k5040j0611J6865M0252L5443p88l0274l8630
$$ 77092 96496 102392 79697 43391 18351 7740 24605 64857 100300 99512 69238 30608
12432C0608l2310l9154O2704O3357m1273p229L5646R53l5823Q162K3511l007J727
$$ 30608 -1702 -40856 21848 85205 43932 36703 72349 73302 37479 45641 69152 66145 67872
12419F7872J5040O632K1487J4875r294m2840K1976k8097j0106n2894K6295K7924
$$ 67872 82912 89544 111031 125906 116612 73772 95748 67651 57545 4651 30946 58870
12407E8870q860k5187J1819N4290l9467P348M838J7029j1182M5493p08l4720k607
$$ 58870 50010 24823 36642 90932 51465 58813 63651 80680 69498 114991 114283 79563 76956
12394G6956J4605K0803j7221n0822l4036m301K2697j55J7470J4795Q346K3563
$$ 76956 91561 112364 95143 44321 10285 5984 28681 28526 45996 60791 69137 92700
12382I2700N077j7643P485N388M0827M3409j0109m0466j5308j5093K656K7954
$$ 92700 97777 80134 87619 93007 133834 177243 167134 126668 111360 96267 98923 126877
12370A26877k5198n024J8999q581k5286k212N9063M1499l0773o2382j900N5541
$$ 126877 101679 96655 115654 107073 81787 79575 138638 180137 149364 86982 85082 140623
12358A40623L0901j5721J3019J1272p073k4321J3387P32j3522o7163k6250q271
$$ 140623 171524 155803 168822 180094 173021 148700 162087 162819 149297 82134 55884 47613
12346D7613J4653N7927N7839J3124q041j620j3821n3323K0413K505J737k4742
$$ 47613 62266 120193 178032 191156 183115 181495 167674 114351 134764 137269 139006 114264
12334A14264j8990j0313k1277N1513J0167m5764m9920K9319K3972K1357n0264
$$ 114264 95274 84961 63684 115197 125364 79600 29680 58999 82971 104328 54064
12323E4064n3525P595N2281L1606k7557k6172j4655M2727L6450M2601j5396o886
$$ 54064 539 8134 60415 92021 64464 38292 23637 66364 102814 145415 130019 123133
12311A23133m272k6836K7189l5686K6409N8538Q117n498J995O612K8838O0252
$$ 123133 118861 92025 119214 83528 109937 168475 176592 171094 173089 179701 208539 268791
12299B68791p925l8894m9095J3867K8461m4158k3168l75J9206J1096m8617r108
$$ 268791 260866 221972 172877 186744 215205 171047 147879 147504 166710 177806 129189 120081
12287A20081L3575K7329l4980l7821M3010K4746j66m1898R012l705k3996L246
$$ 120081 153656 180985 146005 108184 151194 175940 175774 133876 142888 139183 115187 118433
12275A18433K1361j4111M9400J2597j0170N669M779n3922k0896J1523j842O3750
$$ 118433 139794 125683 175083 187680 177510 183179 187958 134036 113140 124663 122821 186571
12263A86571Q772o5521l6352k3086j2261K0517K5321M2927L1685j6750j6520l0789
$$ 186571 195343 129822 93470 70384 58123 78640 103961 146888 178573 161823 145303 114514
12251A14514K5039Q7107O1561j5703l8259p0351p617J885j0881O319L1575J0642
$$ 114514 139553 226660 288221 272518 234259 163908 156291 158176 147295 153614 185189 195831
12239A95831m391j1787R495J0580P415j7873K2647J9042P201L0262M463J5577
$$ 195831 191440 179653 189148 199728 207143 189270 211917 230959 238160 268422 272885 288462
12227B88462J2356j1670j4933j838L5366M406P438K027o025l0721j8098J0161
$$ 288462 300818 289148 274215 272377 307743 312149 319587 321614 315589 284868 266770 276931
12215B76931j2495l5251j3892M5719l419r952K2862M4500M5151l4232l7375L6857
$$ 276931 264436 229185 215293 261012 257593 247641 270503 315003 360154 325922 288547 325404
12203C25404J5036J6926j9963o0430K0505L8001J5931n0469L3426K1460n204J2284
$$ 325404 340440 357366 337403 276973 297478 335479 351410 300941 334367 355827 350623 362907
12191C62907l634N237K5368J6217N398P012J3835K9534k0804n808K0551m334l7269
$$ 362907 359273 364510 389878 406095 411493 418505 432340 461874 441070 435262 455813 451479 414210
12178D14210l0719P355l1142m0904r508M288M3945P365L4509j3705j3228Q0973
$$ 414210 383491 390846 359704 318800 309292 313580 357525 364890 399399 385694 372466 453439
12166D53439J1602m1197m7051l0351J7110M4970K7988J7424k5793m2893j4535
$$ 453439 465041 423844 376793 346442 363552 408522 436510 453934 428141 385248 370713
12155C70713K6918J7932k4724M160O3492K7764l3044O546L713Q124L5641j4879
$$ 370713 397631 415563 390839 394999 458491 486255 453211 459757 463470 471594 507235 492356
12143D92356o4597m2870j2153M3517L8602K2403K5692j4512o167j247R102P213
$$ 492356 427759 384889 372736 416253 454855 477258 502950 488438 482271 481024 490126 497339
12131D97339L8790J6354k6702M1618M8571p507k563m561n2124O030M9460Q42l9727
$$ 497339 536129 552483 525781 567399 615970 608463 605900 601339 549215 555245 604705 605547 565820
12118E65820N059l0281L957q606j4665N4771N5545L2159j5360R710J4223K1951
$$ 565820 570879 540598 544555 535949 521284 576055 631600 663759 648399 658109 672332 694283
12106F94283L9469m601K5702j6083l7427k040M121K4419M706l932L6439L5495
$$ 694283 733752 729151 754853 738770 701343 699303 703424 727843 732549 728617 765056 800551
12094H00551m9246k911L3242K0059m5250m1808K9615N1087O5204M2738j2387J7772
$$ 800551 751305 748394 781636 801695 756445 714637 744252 795339 860543 903281 890894 908666
12082I08666j4831L2764N3323o988k2947j4202L1913k759L2376k439j5835L305
$$ 908666 893835 926599 979922 972934 949987 935785 967698 964939 997315 994876 979041 982346
12070I82346K2292L0399N2700M4462L3825j118n3952K6040N1008J3488J5011J1093
$$ 982346 1004638 1035037 1087737 1132199 1166024 1164906 1110954 1136994 1188002 1201490 1216501 1227594
12058A227594K5916O1944J9313o105J6749R117l0195M4847N1191k8988M3463L4530
$$ 1227594 1253510 1315454 1334767 1328662 1345411 1354528 1324333 1369180 1420371 1391383 1434846 1469376
12046A469376l5429l9426J7631N2845N8182P929r728j2248L2175K1367K956M2019
$$ 1469376 1433947 1394521 1412152 1464997 1523179 1531108 1521380 1509132 1541307 1562674 1565630 1607649
12034A607649O6083P998L7387R1198L509m0822L8154R5583L9288L5802K92K2379
$$ 1607649 1673732 1681730 1719117 1810315 1813824 1773002 1811156 1906739 1946027 1981829 1982121 2004500
12022B004500M7749Q8993P9910N5922K8699j378M2735M6829L4327K5501O4111
$$ 2004500 2052249 2141242 2221152 2277074 2305773 2304395 2347130 2393959 2428286 2453787 2517898
12011B517898J14484O7859M4695Q8697J9188K3691O6700Q8652P8373K2221M7191
$$ 2517898 2632382 2700241 2744936 2833633 2852821 2876512 2943212 3031864 3110237 3132458 3179649
12000C179649Q7026N4231N7604J18973J56134R0382L3058P2026J11327J33274
$$ 3179649 3266675 3320906 3378510 3497483 3653617 3743999 3777057 3849083 3960410 4093684
11990D093684Q7253P7634J05625J29728J33116J27901J31154J08010R8732J66063
$$ 4093684 4180937 4258571 4364196 4493924 4627040 4754941 4886095 4994105 5092837 5258900
11980E258900J75389J45320J68011J90703J63452J92364K26676J63904J88294
$$ 5258900 5434289 5579609 5747620 5938323 6101775 6294139 6520815 6684719 6873013
11971F873013K04647K58235K08660K44202K49016K16534K28085L41285L32677
$$ 6873013 7077660 7335895 7544555 7788757 8037773 8254307 8482392 8823677 9156354
11962I156354K83915K50570K89549L17935L10262L66052L61916M02749M19115
$$ 9156354 9440269 9690839 9980388 10298323 10608585 10974637 11336553 11739302 12158417
11953A2158417M13966M10533M47367M33119M43027M39190N08967N41616N53280
$$ 12158417 12572383 12982916 13430283 13863402 14306429 14745619 15254586 15796202 16349482
11944A6349482M99368M99525N58438N48891N04947N66242N35685N12471N80642
$$ 16349482 16848850 17348375 17906813 18455704 18960651 19526893 20062578 20575049 21155691
11935B1155691N41094N39115M65912M64938M07561M47544M24777L32404K98765
$$ 21155691 21696785 22235900 22701812 23166750 23574311 24021855 24446632 24779036 25077801
11926B5077801K81575K11972J47213Q5613Q6078m212n6291j32117j53328j98274
$$ 25077801 25359376 25571348 25718561 25804174 25890252 25886040 25829749 25697632 25544304 25346030
11916B5346030k99590l02572l51040m25003m20954m07373m37157m45530n17797
$$ 25346030 25046440 24743868 24392828 23967825 23546871 23139498 22702341 22256811 21739014
11907B1739014n28728n15148n36402n51981n55595n19603n21600n18884n38424
$$ 21739014 21210286 20695138 20158736 19606755 19051160 18531557 18009957 17491073 16952649
11898A6952649n21806m62312m93916n13351m69289m83470m10052m36036m08971
$$ 16952649 16430843 15968531 15474615 14961264 14491975 14008505 13598453 13162417 12753446
11889A2753446l92123l73238l58442l61952l46542l55887l58050l17009l17847
$$ 12753446 12361323 11988085 11629643 11267691 10921149 10565262 10207212 9890203 9572356
11880I572356k82446k72788k97478k55992k15466k13880k50264j98200j45240
$$ 9572356 9289910 9017122 8719644 8463652 8248186 8034306 7784042 7585842 7440602
11871G440602k27103k09252k25875j77109j75938j78950j71067j63931j64847
$$ 7440602 7213499 7004247 6778372 6601263 6425325 6246375 6075308 5911377 5746530
11862E746530j62323j29102j05437r5700j93135j62273q2368j02322j20675j65198
$$ 5746530 5584207 5455105 5349668 5253968 5060833 4898560 4816192 4713870 4593195 4427997
11852D427997j60169j17727m4621r0501j29717n8393m7016j20942l6955j03004
$$ 4427997 4267828 4150101 4105480 4014979 3885262 3826869 3779853 3658911 3621956 3518952
11842C518952l6542o7498p9289j16194n3724q0686k170j265o1044m8463o1039
$$ 3518952 3482410 3414912 3335623 3219429 3165705 3085019 3082849 3081584 3020540 2972077 2911038
11831B911038j10323n6520j6806l2805l1823q6415j02442m9615p1656n9494R610
$$ 2911038 2800715 2744195 2727389 2694584 2662761 2576346 2473904 2424289 2352633 2293139 2302749
11820B302749K328n6361k3508n3870n7668n4612l8578l8095m9879l2188k4833
$$ 2302749 2305077 2248716 2225208 2171338 2113670 2059058 2020480 1982385 1932506 1900318 1875485
11809A875485k2520m2286j5077j3790n0317l5256k1984L5853P335l4747m4583
$$ 1875485 1852965 1810679 1795602 1781812 1731495 1696239 1674255 1710108 1717443 1682696 1638113
11798A638113l6892l4619j0278j3772J613j7413k269j3266j01302n0261m0077
$$ 1638113 1601221 1566602 1556324 1542552 1544165 1526752 1524483 1511217 1409915 1359654 1319577
11787A319577K3770K8895L2486l2017n1036m4522k1484k2352q3533q8782M4754
$$ 1319577 1343347 1372242 1404728 1372711 1321675 1277153 1255669 1233317 1149784 1061002 1105756
11776A105756n602l4471K5645N4341k423p278k3973n9172J1804J6648m9971J4110
$$ 1105756 1100154 1065683 1091328 1145669 1143246 1135968 1111995 1052823 1064627 1081275 1031304 1045414
11764A045414n371q4371k3706l1138J5101N7904P377o2048j9649k5040n0724o3768
$$ 1045414 1040043 955672 931966 900828 915929 973833 981210 919162 899513 874473 823749 759981
11752G59981k3129K4745R850J5726K5863l0150j018K130K3783k9831r1727J2912
$$ 759981 736852 761597 771447 787173 813036 782886 781868 783998 807781 777950 686223 699135
11740F99135J1575J4466M980j7402j162K988R701m6923m4251j7114K44m367N5096
$$ 699135 710710 725176 730156 712754 711592 714580 724281 677358 633107 615993 616237 611870 666966
11727F66966N0676N299J8396k0537o7401l1185m6845m9655J1402K5190M6242l6967
$$ 666966 717642 722941 741337 720800 653399 622214 575369 525714 537116 562306 608548 571581
11715E71581j7805Q200j333k452J4417p986J0123L2701L328m9207l5923j0061
$$ 571581 553776 561976 560643 558191 572608 564622 574745 607446 610774 561567 525644 515583
11703E15583K1858K3476o102l8708j2292M763o2682n7339L4561L3400j3784p682
$$ 515583 537441 560917 554815 516107 503815 508578 445896 388557 423118 456518 442734 435052
11691D35052J065N220J9223q334J3935k2262j5316j3907j136K86n340k1314o5397
$$ 435052 436117 441337 460560 452226 466161 443899 428583 414676 413540 413826 408486 387172 321775
11678C21775k5226J7290P3816N3282P284M6661r255j9405J7407j4946m9255k6122
$$ 321775 296549 313839 387655 440937 448221 494882 485627 466222 483629 468683 419428 393306
11666C93306R763J8912k5172K881l0378k0145m6700n2352J0367J2173L669j2747
$$ 393306 403069 421981 396809 399690 369312 349167 302467 250115 260482 272655 276324 263577
11654B63577L3523L8753O2071j3970m1292j0150k0218j0093k7828k8586N040M2471
$$ 263577 297100 335853 397924 383954 342662 332512 312294 302201 274373 245787 250827 293298
11642B93298N8487k7106l9686n2675l2261N1898L8954P892m0964k5922K3969O7913
$$ 293298 351785 324679 284993 232318 200057 251955 290909 298801 257837 231915 255884 323797
11630C23797J5124n0246q761k6285k4154j5014o907O1818j3648K7285J4881L290
$$ 323797 338921 288675 279914 253629 229475 214461 207554 269372 255724 283009 297890 301180
11618C01180l0502k2589L3726M1579K2896l1337m2000K0721k9363k5952L4396
$$ 301180 270678 248089 281815 323394 346290 314953 272953 293674 264311 238359 272755
11607B72755K0948N273m2124k8004l966M6952M0782k0765m5221l9824J586K1898
$$ 272755 293703 298976 256852 228848 224882 271834 312616 291851 246630 206806 208392 230290
11595B30290M4500k3557k2921j7798l7919K8724M6456K7492R014l5557l2880k1166
$$ 230290 274790 251233 228312 210514 172595 201319 247775 275267 284281 248724 215844 194678
11583A94678J3520J9840k3986k0764l822O467k2633N339L0536P460j2108K1625
$$ 194678 208198 228038 204052 183288 179466 185933 163300 168639 199175 206635 194527 216152
11571B16152j9992R647j6232L2123l3339l6602m3051L0503J6036K0887l841j7813
$$ 216152 196160 205807 189575 221698 188359 151757 108706 139209 155245 176132 172291 154478
11559A54478j1225o9052j1012L4022K3556O565j5475K640K9668J0527o401o7498
$$ 154478 143253 74201 63189 97211 120767 127332 111857 114497 144165 154692 148291 80793
11547H0793l8943O431O1694M1469n836L820l0237J785L1360J8878n8086q538N035
$$ 80793 41850 48281 109975 151444 145608 149428 119191 120976 152336 171214 113128 104590 109625
11534A09625P873M4171m861m2197k6107J8853k2151J972N1791O0242k6394l5279
$$ 109625 117498 161669 156808 114611 88504 107357 85206 87178 138969 199211 172817 137538
11522A37538j5916R680O365J7739M4256K423j1435l0443n2254M0310k7689k4325
$$ 137538 121622 131302 137667 155406 199662 202085 190650 160207 107953 148263 120574 96249
11510I6249m3495m7130J4929L274L3026L2611L1836K6988P981n0160J6734N4856
$$ 96249 52754 5624 20553 23827 56853 89464 121300 148288 156269 106109 122843 177699
11498A77699J0348n4115j5888j6160L5608J3673l6108k694m8436n269L3300N4964
$$ 177699 188047 133932 118044 101884 137492 151165 115057 112363 63927 58658 91958 146922
11486A46922K8224m8258j4872J6665k901j8688k4567m0817L223l3392R196L8689
$$ 146922 175146 126888 112016 128681 125780 107092 82525 41708 44931 11539 20735 59424
11474E9424L8007L5165L5646q174n3049o863j0088k6128r132M73N1870j5374l2478
$$ 59424 97431 132596 168242 160068 107019 100156 90068 63940 54808 55281 107151 91777 59299
11461E9299L4326L6731p7134l1920K649Q1399R609m1732Q2139N1639k0397j1601
$$ 59299 93625 130356 53222 21302 23951 105350 114959 73227 155366 207005 186608 175007
11449A75007l6563m1421k152p180m4261j2431J8108K1673N2193j9916J7942J0391
$$ 175007 138444 97023 94871 87691 43430 30999 49107 70780 122973 103057 120999 131390
11437A31390k8742j9543j2920l0868K2282p693N1421K4227N5022P892o6721l188
$$ 131390 102648 83105 70185 39317 61599 53906 105327 129554 184576 192468 125747 122559
11425A22559k4610l0868j1311P0333K3383l9959o4296m199J845r765l1540M6M2835
$$ 122559 97949 67081 55770 126103 149486 109527 45231 41032 42877 33112 1572 1618 44453
11412D4453K5515j2102m9072J7929K0215j2641K8718L3227N859J571l1437K8164
$$ 44453 69968 57866 8794 26723 46938 34297 63015 96242 102101 103672 72235 100399
11400A00399L7733j6533m4582j2966L064L6939k7112q4701N897L0562Q22J7347
$$ 100399 138132 121599 77017 64051 67115 104054 76942 -7759 -1862 28700 29522 46869
11388D6869K3318M5831m086m4032k6768J1627j2689j1418j3013J5882N9954l889
$$ 46869 70187 116018 111932 67900 41132 52759 40070 28652 15639 31521 91475 87586
11376H7586m1649K5227J5318L9396L245P18J4821m2150m5408L1210O3778j0637
$$ 87586 45937 71164 86482 125878 129123 129841 144662 102512 57104 88314 152092 141455
11364A41455o4562m4112M44K8642M2475o573m9316k7296M09N552j1308m257J7199
$$ 141455 76893 32781 33225 61867 104342 97769 48453 21157 21566 27118 15810 11553 28752
11351B8752P60M340K050k0019j0860k4157J7857Q168m4139l7038m038P0338P7447
$$ 28752 29512 33852 35902 15883 5023 -19134 -1277 6891 -37248 -74286 -78324 -7986 69461
11338F9461n2737n3584J9869L6417j2099M885R306n7720J2968O0405N0825j9652
$$ 69461 16724 -36860 -16991 19426 7327 12212 21518 -36202 -23234 37171 87996 68344
11326F8344p1368j7828P757K9571J8987l0581J4525k5605R97J8940j2975M591
$$ 68344 -3024 -20852 -13095 16476 35463 4882 19407 -6198 -5201 13739 764 5355
11314E355j5216K6046K3999J8024l7584k0569l5601l0751L9153M1712J0854R932
$$ 5355 -9861 16185 40184 58208 20624 55 -35546 -66297 -27144 14568 25422 35354
11302C5354K4259K0862J1251J0371K0536J607k8171j1025M2985j9684M101n329
$$ 35354 59613 80475 91726 102097 122633 124240 96069 85044 128029 108345 112446 107117
11290A07117p6086p1963M6823O5060P796J4471j6364N103l1688n4105n948M7710
$$ 107117 31031 -40932 5891 70951 78747 93218 76854 81957 50269 -3836 -9784 37926
11278C7926L9211n819m5540k6697N5099O7806N019k5729J7923j0742P3644J04863
$$ 37926 77137 71318 25778 -919 54180 121986 127005 101276 119199 108457 182101 286964
11266B86964K9355L5175J04109J64949K05105L53175L58935K00521j32617l17820
$$ 286964 316319 351494 455603 620552 825657 1178832 1537767 1738288 1605671 1287851
11256A287851k77009k18457j87418j94604j42731j4988K7061m2179m1848k7391
$$ 1287851 1010842 792385 604967 410363 267632 252644 279705 237526 195678 168287
11246A68287k1519m4214J713m3016n575k3936J8780N535J5679O6067k344o2708
$$ 168287 146768 102554 104267 61251 55676 31740 50520 56055 71734 137801 135457 72749
11234G2749k2977J6332L7050M028k2361j1516j0619J619L8947k0104o0096k3961
$$ 72749 49772 66104 103154 107182 84821 73305 62686 64305 103252 83148 23052 -909
11222i09R674O8218J4659k5727J966l320L7999m2789l3612K9346j0954j1409N6033
$$ -909 8765 76983 91642 65915 67881 64561 102560 59771 26159 55505 44551 33142 89175
11209H9175o3063o3105N0577N3628J0611l036j1938k6006j4684M841L1861l6670
$$ 89175 26112 -36993 13584 67212 77823 74787 62849 36843 22159 27000 58861 22191
11197B2191J2950j3786O9829N6270n2847r9601k7693J5398N1225L776n62l856
$$ 22191 35141 21355 91184 147454 94607 -4994 -32687 -17289 33936 37712 37150 33294
11185C3294J1773J1864L6071j1836r1884j2962J3842L4658j9008L160K7464L1214
$$ 33294 45067 56931 93002 81166 -10718 -23680 -9838 24820 5812 8972 36436 67650
11173F7650r263l0374K2937k2375l1657K2225K2437l441n7739j8458q451j059
$$ 67650 58387 28013 50950 28575 -3082 19143 41580 38139 -19600 -38058 -46509 -47568
11161d7568K1737J5121j3875j9018j1211R146k0251J9786J3515l3932n2023J917
$$ -47568 -25831 -10710 -24585 -43603 -54814 -45668 -65919 -46133 -32618 -66550 -118573 -116656
11149a16656N113N158P787N7364J0807K1214n2367p052K4133J4232L565o854L5987
$$ -116656 -111543 -106385 -98598 -41234 -30427 -9213 -61580 -68632 -44499 -30267 -26702 -33556 2431
11136B431K1425K077j538Q063J751k4619J7879N6192j9105j4331k2680L5314M2112
$$ 2431 23856 25933 24395 32458 34209 9590 27469 83661 64556 50225 27545 62859 104971
11123A04971Q849l3194l6750o5184m3582M4536K7417J8037K604k573J2311N1461
$$ 104971 113820 80626 43876 -21308 -64890 -20354 7063 25100 27704 25131 37442 88903
11111H8903R9849J8130m6882l8991K6801K5769K8171K7644q72n2963l2021l0367
$$ 88903 188752 206882 160000 121009 147810 173579 201750 229394 228522 175559 143538 113171
11099A13171M4897q14o0947q83q2359k1705P8910J4594p329o6818k9023K6018
$$ 113171 158068 157254 96307 95424 13065 -8640 70270 84864 77535 10717 -18306 7712
11087G712j4160l4949L0577k6856n4544k2388J0818L5114k6721Q3823O3112L25
$$ 7712 -6448 -41397 -10820 -37676 -92220 -114608 -103790 -68676 -95397 -11574 51538 51863
11075E1863j9607M871P467l2993m7418N289N7044J2417M6744j9472o8984L400
$$ 51863 32256 37127 44594 11601 -35817 -30528 26516 38933 85677 66205 -2779 621
11063F21J1927J1336l217L4740J2267k7677j5634N5814j636O358K4878K1626M5327
$$ 621 12548 23884 20667 55407 67674 39997 24363 80177 78541 84899 109777 131403 176730
11050A76730M40J3776J6478N1434l0216n3973J4498N7437L8496K6834O9876K7960
$$ 176730 177170 190946 207424 258858 228642 174669 189167 246604 285100 311934 381810 409770
11038D09770j7523q076J2078J6282K5607M5433O2902M159p9033n3056L0688M7752
$$ 409770 392247 384171 396249 412531 438138 483571 546473 550632 471599 418543 449231 496983
11026D96983M3612P0693J14701J9661m8128j05279o7697k7382l3112p2183o1606
$$ 496983 540595 611288 725989 745650 697522 592243 524546 497164 464052 391869 330263
11015C30263j7859O0048P4753N56O8841k993r5218q4083k0544l2772o5055k771
$$ 330263 312404 372452 447205 447761 516602 513609 418391 334308 313764 280992 215937 213166
11003B13166M3825M5155m1652o116j167n4860m5493j3488P180O13j1015J5908
$$ 213166 256991 302146 260494 254378 253211 198351 152858 139370 146550 147163 136148 152056
10991A52056J2444j231j5546L5592L4381O0392L564K5856L3920M0460M5257P6381
$$ 152056 164500 163269 147723 183315 217696 278088 281652 307508 341428 381888 427145 503526
10979E03526J890j49889l82132k33761j15116l5810Q7169L0030j0014O1408Q4395
$$ 503526 505416 355527 -26605 -260366 -375482 -411292 -324123 -294093 -304107 -242699 -158304
10968a58304L8222J5913j1125j7186N5991O8911j20j2355o7711j1387k8366j6101
$$ -158304 -120082 -104169 -115294 -132480 -76489 -7578 -7698 -20053 -87764 -99151 -127517 -143618
10956a43618P828K4035K368J2976P915j6733m8258j408O2964L8372M932j612j7635
$$ -143618 -135790 -111755 -109387 -96411 -88496 -105229 -153487 -154895 -91931 -53559 -48627 -50239 -67874
10943f7874L4774J5997q270J3079K6240j5019Q782M0041O0329J9012M49l5099
$$ -67874 -33100 -17103 -25373 -12294 13946 -1073 7709 47750 108079 127091 127540 92441
10931I2441k8019j2079n822N9000K5705L1365n6014O243J4730K0060q908m0143
$$ 92441 64422 52343 46521 105521 131226 162591 106577 112820 127550 147610 138702 98559
10919I8559J5023p152L8481k1071k174M1352L6770j2254L0139o501m594j1589
$$ 98559 113582 106430 144911 123840 121666 163018 199788 187534 217673 211172 206578 194989
10907A94989O0033P6592N6584Q306n6314M309L8559P6970P5733N0145k0441J1472
$$ 194989 255022 331614 388198 396504 340190 344499 383058 460028 535761 585906 565465 576937
10895E76937J7192R1410J20888J81548K59539K69957L17462N38497Q70867J140667
$$ 576937 594129 685539 806427 987975 1247514 1517471 1834933 2373430 3244297 4384964
10885D384964J326041R89075j49338q28435q32875p49430n36533k59381j98K43422
$$ 4384964 5711005 6700080 6550742 5722307 4889432 4140002 3603469 3344088 3343890 3587312
10875C587312M79137N18252K22162J1101M5306J11650K55929M46651N98332Q18090
$$ 3587312 4066449 4584701 4806863 4817964 4863270 4974920 5230849 5677500 6275832 7093922
10865G093922J015951J322875J709023K257065L003600M086956N669959Q235278
$$ 7093922 8109873 9432748 11141771 13398836 16402436 20489392 26159351 34394629
10857C4394629J2700400K0132628L1749974M8226042O8202519P7488579M0144784
$$ 34394629 47095029 67227657 98977631 147203673 215406192 292894771 333039555
10850C33039555k9923229n9434842n9507455n0960015l8132132k6478520j7810542
$$ 333039555 303116326 243681484 184174029 133214014 95081882 68603362 50792820
10843E0792820j1971675q252830n967630m441529l377885k574444k016399j568009
$$ 50792820 38821145 30568315 24600685 20159156 16781271 14206827 12190428 10622419
10835A0622419j223993r98499q38733o47891m61591k84981n3588P5443m8156l72584
$$ 10622419 9398426 8399927 7561194 6913303 6451712 6166731 6113143 6188586 6140430 5767846
10825E767846o53737o55121n03924m56068l72193k67516j87179j07956j17501
$$ 5767846 5114109 4458988 3955064 3498996 3126803 2859287 2672108 2564152 2446651
10816B446651j41114j19267q9887p5825l7474q3673j05719r4224n6951l7433m4156
$$ 2446651 2305537 2186270 2096383 2020558 1983084 1899411 1793692 1699468 1642517 1605084 1560928
10805A560928l1346q7236n8874k6871n8782q4985m6944J1935K3983L78k8274o9411
$$ 1560928 1529582 1442346 1383472 1356601 1297819 1212834 1165890 1177825 1201808 1202186 1173912 1104501
10793A104501o1566o5207l5763m2804m8968k2145J9297p271k5131m608L7929l7302
$$ 1104501 1042935 977728 941965 899161 850193 828048 847345 840074 814943 810335 848264 810962
10781H10962p7183j1396J4122Q161J4000K204K074m4276o1975j1961q803k1567
$$ 810962 733779 722383 736505 744666 758666 760870 762944 718668 656693 644732 635929 614362
10769F14362j6011l1587q397p466J681j1638M7556j5082o0733o6917m7484J4994
$$ 614362 598351 566764 558367 550901 552582 540944 588500 573418 512685 445768 398284 413278
10757D13278K2134k3443Q819J3706M0564M5300J7315l6021m6528j1768J9039O4636
$$ 413278 435412 411969 420788 434494 475058 520358 537673 501652 455124 443356 462395 527031
10745E27031J0037K9181l4365p1217j0792j2767K5331Q310j1994K8011J7508n6566
$$ 527031 537068 566249 531884 460667 449875 437108 462439 470749 458755 486766 504274 447708
10733D47708q847O5462L5092K2480M2906L6162L9963O4360p2001k03575k03579
$$ 447708 438861 504323 539415 561895 604801 640963 680926 745286 673285 469710 266131
10722B66131j48436r0967n2622M4888k5827o7290k9985J5418R0322K9302J3542
$$ 266131 117695 26728 -25894 18994 -6833 -74123 -104108 -88690 1632 30934 44476
10711D4476j2779k4386K2251L7503N60l6766o3795j7331J7828L2936l0800n1698
$$ 44476 31697 7311 29562 67065 67625 30859 -32936 -50267 -32439 497 -30303 -82001
10699h2001L4058L0163j1042l8070r660k6100m4129n473L1151K2745J2870M9419
$$ -82001 -47943 -17780 -28822 -66892 -76552 -102652 -146781 -152254 -121103 -98358 -85488 -36069
10687c6069L9644j1017j4625K0878M6479k3836j8002r263K8930J0391k0092k5337
$$ -36069 3575 -7442 -22067 -1189 45290 21454 3452 -5811 23119 33510 13418 -11919
10675a1919K4502O3684O776l3976K4096l8736m8829p058L5457J9530j0745j6015
$$ -11919 12583 76267 83043 49067 73163 34427 -14402 -21460 13997 33527 22782 6767
10663F767n840J2702n84J117M3279M5826K4164O2389J5444m6846j6869l7030K3625
$$ 6767 927 13629 13045 14162 57441 103267 127431 189820 205264 158418 141549 104519 128144
10650A28144j577k2404L45L1358P0455R1240R0793K0327J8238K0129M4214N7605
$$ 128144 126567 104163 104508 135866 206321 297561 388354 408681 426919 447048 491262 548867
10638E48867J10142J44772J66154J75449K32848J81950J85618J97976J77559K18513
$$ 548867 659009 803781 969935 1145384 1378232 1560182 1745800 1943776 2121335 2339848
10628B339848L24165M26576O77468R23888J288256J772858K389005L186670M220900
$$ 2339848 2664013 3090589 3768057 4691945 5980201 7753059 10142064 13328734 17549634
10619A7549634N242548N497225M563504K443712J12006j253136j537893q24091
$$ 17549634 22792182 28289407 32852911 35296623 35408629 34155493 32617600 31793509
10611C1793509O53579K609121N064284P818421J0291037J1019695Q141131K354700
$$ 31793509 32447088 35056209 40120493 47938914 58229951 69249646 77390777 79745477
10603G9745477l192907o099414o205868m422888j543798K035568O102125J0185008
$$ 79745477 76552570 70453156 64247288 59824400 58280602 60316170 66418295 76603303
10595G6603303J3349935J3354667Q271973p53101q580861j2113938j1936883r643179
$$ 76603303 89953238 103307905 111579878 110826777 102245916 90131978 78195095 68551916
10587F8551916o230382k445306J246190M611291O841510O546582K680006l428119
$$ 68551916 62321534 59876228 61122418 65733709 72575219 79121801 81801807 78373688
10579G8373688q304777j0085938r456356p604090n180439k826832p73563Q08539
$$ 78373688 70068911 59982973 50526617 42922527 37742088 34915256 34141693 34950232
10571C4950232J676710J326334m45433k776243m567038n231937m949569m156868
$$ 34950232 36626942 37953276 37507843 34731600 30164562 24932625 19983056 15826188
10563A5826188l317283k497894j853613j394588j050046p49931o12593m85106
$$ 15826188 12508905 10011011 8157398 6762810 5712764 4962833 4350240 3865134
10555C865134m25724l12771k44960k32721k04547j18986j67470j54918j02385
$$ 3865134 3439410 3126639 2881679 2648958 2444411 2325425 2157955 2003037 1900652
10546A900652r6641j30561j48653q2101j9714j051p6721o4443J075k9579n4984
$$ 1900652 1804011 1673450 1524797 1442696 1422982 1421931 1345210 1280767 1281842 1252263 1197279
10535A197279m3820m7772m2575n0412p975K5254m9025o8172l4274P550m2053n3999
$$ 1197279 1153459 1105687 1063112 1012700 1004725 1029979 980954 912782 878508 886058 844005 790006
10523G90006N1562M2915o0997p6905j5887K36m9079K7271J0077k0668l7538l6132
$$ 790006 841568 884483 823486 746581 730694 730930 681851 709122 719199 698531 660993 624861
10511F24861o359k5844j2990j4367l3957k1590j7170N0500q051l8324j0459K8917
$$ 624861 618502 592658 579668 565301 531344 509754 492584 543084 535033 496709 486250 515167
10499E15167m78L765K2128K5280N368j4790j0513k1947m9668N743L2921N975l8497
$$ 515167 514689 518454 540582 565862 571230 556440 545927 523980 474312 480055 512976 518951 480454
10486D80454k5182J6072L9219l518m9649J1873L6495P357o3630M541L1462l5037
$$ 480454 455272 471344 510563 507045 457396 469269 505764 513121 449491 454032 485494 450457
10474D50457j7287n7117l9255O0203J264K229O5292K3370l2289q0225n9515m3181
$$ 450457 433170 376053 336798 397001 398265 400494 465786 489156 456867 376642 317127 273946
10462B73946k6470L445L8710Q493n665N3263j9087m6846k0797r293k7407l1391
$$ 273946 247476 250921 289631 298124 292459 345722 326635 279789 258992 249699 222292 190901
10450A90901n2735k3386P0162J05770L9499R171O1243R6547J38129J47973K96689
$$ 190901 138166 114780 184942 290712 330211 339382 400625 497172 635301 783274 1079963
10439A079963L53438K74140K6219k27288k74115k89909k01320k14339j46810n5851
$$ 1079963 1433401 1707541 1733760 1506472 1232357 942448 741128 526789 379979 324128
10429C24128n6614l9658k3221Q74r904K6684q2106j5695R1181O2438m5196o7820
$$ 324128 267514 227856 204635 205509 195605 222289 140183 124488 215669 278107 232911 165091
10417A65091o5165l5393j8758J8484K3413K2541K5383p578n5080r965l9644r234
$$ 165091 99926 64533 45775 64259 87672 110213 135596 128018 72938 62973 23329 14095
10405A4095N4786L8478Q684K959R606j2921J4312O499K6775n668j2333j9709k3896
$$ 14095 68881 107359 116043 119002 128608 115687 129999 136498 163273 157605 145272 125563 101667
10392A01667l38r455p543J2999K4004K0988R964N3841k9978l3313k7940l3974
$$ 101667 101329 91874 84331 97330 121334 142322 152286 206127 176149 142836 114896 80922
10380H0922N478K1348l213p880m477j24J376K4514j2465M920J6619J5669Q270
$$ 80922 86400 107748 104535 96655 92178 92054 93430 117944 105479 110399 127018 142687 150957
10367A50957m9730n2682m8589j4296N2275n191J9650L0558L1044J6398K4244k5939
$$ 150957 101227 48545 -44 -14340 37935 32744 52394 82952 113996 130394 154638 128699
10355A28699n584o9157l2863N7109J9148P564N746l7766l042K2789l3146j5153
$$ 128699 123115 53958 21095 78204 97352 104916 110662 72896 69854 92643 59497 44344
10343D4344M8138L8978j8649o2455j394L2628L6517L3690k8663k6982N198L7393
$$ 44344 92482 131460 112811 50356 48962 81590 118107 151797 123134 96152 101350 138743
10331A38743k160J2146j500k4433m6443J8480J459R096J8939O737L4922n5442
$$ 138743 136583 148729 147229 122796 76353 94833 96292 105388 124327 131064 165986 110544
10319A10544o3810l1367L256L4263J312L188M6010M6230K7397k4892l9031j8301
$$ 110544 46734 15367 18623 52886 54198 57386 103396 149626 177023 152131 113100 94799
10307I4799M1826k2242J7566k3774m6217m5152L7452K4699L5918L9573j3537k6582
$$ 94799 136625 114383 131949 108175 61958 16806 54258 78957 114875 154448 140911 114329
10295A14329k1827l307k4580k9902r476L0333O019l8747M6573O7175l1517J3286
$$ 114329 92502 89195 64615 34713 25237 55570 61589 22842 69415 136590 105073 118359
10283A18359J1116K5835j5602o92m3632l9145m8056L6295J466j7874Q981O1597
$$ 118359 129475 155310 139708 139016 95384 56239 8183 44478 45944 28070 37051 98648
10271I8648J4189l3471k7830m7652J8137J8002j6282K0299M7320J5319K7070k227
$$ 98648 112837 79366 51536 3884 22021 40023 23741 44040 91360 106679 133749 131522
10259A31522o2605l2953m4288R113J1558j2210J1959J0934J3947r838k3521N753
$$ 131522 68917 35964 -8324 789 12347 137 12096 23030 36977 27139 3618 9371
10247I371J3978J6563Q78k4866j0172k4625m1351L1659L7049l2996O171K437j057
$$ 9371 23349 39912 40790 15924 5752 -18873 -60224 -28565 8484 -24512 -18341 -15904 -16961
10234a6961N7660L8650l6700M4076J6300l1886k0896j5388M0766m2369r6J3098
$$ -16961 40699 79349 42649 86725 103025 71139 50243 34855 75621 33252 33156 46254
10222D6254P193k6122j5641L454m6791j3832P2974M4497M1168q558n1163j9597
$$ 46254 53447 27325 11684 15138 -31653 -45485 27489 71986 113154 104596 53433 33836
10210C3836P391Q060L8559L5528n0403l1198k0561M2978M977j2754j9628k9898
$$ 33836 41227 49287 87846 123374 72971 41773 21212 64190 69167 56413 36785 6887
10198F887j1507K6131J3088M063N0032J6837M5398n3305P834j7474j6958p514
$$ 6887 -4620 21511 34599 38662 88694 105531 150929 97624 105458 87984 71026 63512
10186F3512P8086P5430n7073l8039J6698L8739Q3550L9709l0074k7173l9617j2672
$$ 63512 141598 217028 159955 121916 138614 177353 260903 300612 270538 243365 203748 191076
10174A91076J804L959M5430M9220J16152R4863K5134p835l9353m5614m588n3425
$$ 191076 192880 196839 242269 291489 407641 502504 527638 519803 480450 434836 430248 376823
10162C76823l6643L4176L2866K8019J34108J37663N7868p3582j04664l8300n7268
$$ 376823 340180 374356 407222 435241 569349 707012 764880 691298 586634 548334 491066
10151D91066q5828m8512l2315o819M0803O9855P4142n363l2426o1802j2741p8958
$$ 491066 405238 356726 324411 317592 358395 428250 502392 497029 464603 402801 390060 311102
10139C11102p8461l8323O224K6486N3862K3700q0o9859l5272n5071m5149M5407
$$ 311102 232641 194318 200542 227028 280890 304590 304510 234651 199379 144308 99159 144566
10127A44566K3031J9169n6241J5408J5315k5962m2893k7710j427K6906l9165J2999
$$ 144566 167597 186766 130525 145933 161248 135286 92393 64683 63256 90162 50997 63996
10115F3996J1188j3762J0507N948k1722k8854J5082k2014j428O371R486N4288
$$ 63996 75184 61422 71929 77877 56155 27301 42383 20369 18941 25312 34798 89086
10103H9086K9078k1372k2785N783J2233r948l7082P660J2222R987o496J9455K2548
$$ 89086 118164 96792 74007 79790 92023 82075 44993 52653 64875 74862 68366 87821 110369
10090A10369J4504o403j8684j8555N145J1751n5000n80j8698n713j4426M5161
$$ 110369 124873 118470 99786 81231 86376 98127 43127 42547 23849 18136 3710 48871
10078D8871M2985m2558K322K5205R945k0702q829l6867k5809L8986N0505j5274
$$ 48871 91856 49298 51620 76825 86770 66068 57239 20372 -5437 33549 84054 68780
10066F8780l6873K0271K3384m802K1920P883m942O143m0645J3961M6605k4338
$$ 68780 31907 52178 75562 70760 92680 100563 95621 101764 61119 75080 121685 97347
10054I7347m7016k3716K4636L690j660k5075n3009J6975K3397J2586L9390j3228
$$ 97347 50331 26615 51251 54941 53281 28206 -24803 -7828 15569 28155 67545 54317
10042E4317m5031J1717o692l0212k3388l2451M3942J062Q740P5161K2061j4863
$$ 54317 9286 21003 14311 -15901 -39289 -71740 -27798 -26736 -17996 57165 79226 64363
10030F4363j6737K851l7136l8373O4358K8785j3010k755J703j6395J1082M4014
$$ 64363 47626 50477 13341 -25032 39326 68111 55101 52346 54049 37654 48736 92750
10018I2750N980P624J0906l5352O972J4433n0030m5728N007M4231J7386k5008
$$ 92750 98730 106354 117260 81908 88880 103313 53283 7555 12562 56793 74179 49171
10006D9171k3668M60l3436l1171m9581l9832J2545J0076P8094M0577J8125r271
$$ 49171 25503 25963 -7473 -38644 -88225 -128057 -115512 -105436 -27342 13235 31360 22089
9994B2089j0300J741O0261n206k8791J5481J4138l3827J6273O393o6563m0043
$$ 22089 11789 13530 73791 68585 39794 55275 69413 35586 51859 58252 -8311 -48354
9982d8354O094N5435J5680k2340j2639N4583q837m7882l1089k1760m763N9218
$$ -48354 -42260 13175 28855 6515 -6124 48459 39622 -8260 -39349 -61109 -65872 -6654
9970f654L9046J0315m1888k2031O2398J661o3817L4103M977M007P788M2338J271
$$ -6654 32392 42707 819 -21212 41186 42847 -20970 13133 18110 22117 29905 72243 73514
9957G3514k8487o612O5507J481l6769j1257L0258j0434n1529o784J7356N184k9498
$$ 73514 45027 38415 103922 105403 68634 57377 87635 77201 25672 18888 36244 41428 11930
9944A1930k619L6700n721N5112L5742l9234l852J4966J3989k3366l3416o903o2104
$$ 11930 9311 46011 40290 95402 131144 91910 88058 103024 117013 93647 60231 53328 -8776
9931h776l9261J8925K0453p619M0843K1398N940M9115j34r643J115k6353l7283
$$ -8776 -48037 -29112 -8659 -16278 24565 45963 51903 101018 100884 91241 92356 66003 28720
9918B8720K3881n839r537R942l2485M7127J0375L5110l1515p9870n92K2588L9360
$$ 28720 52601 46762 37225 47167 14682 61809 72184 107294 75779 -4091 -4683 17905 57265
9905E7265M1622l384n0691K4576K0157q177J3035L4663M896j185P295j0370o3670
$$ 57265 98887 95503 44812 69388 89545 81368 94403 129066 133962 132777 140072 129702 66032
9892F6032j9973L1377k5572n9592l217K0186m4893k7685N4004K0039j5821K6323
$$ 66032 46059 77436 51864 -7728 -10945 9241 -35652 -63337 -9333 10706 -5115 21208
9880B1208l1457o496n8289k2039M9590M4365J5804K8738j7468j102O876k1021
$$ 21208 -10249 -16745 -75034 -97073 -47483 -3118 12686 41424 23956 22854 29730 8709
9868H709k6828L8383J4595n7882L0534M7105J953k821J7384j860q497l290K2968
$$ 8709 -18119 20264 34859 -23023 7511 54616 56569 53748 71132 69272 60775 57485 80453
9855H0453N910Q079l3900p293k1608j2358N192l776m2533m6780k6806L7317L0414
$$ 80453 86363 94442 60542 53249 31641 19283 24475 20699 -21834 -68614 -95420 -58103 -27689
9842b7689L3723P2843L2301K366n7679k658j9620k705J4155l5617m836N2711J3989
$$ -27689 6034 78877 111178 113544 55865 53207 33587 30882 45037 9420 4584 57295 71284
9829G1284m1510o92k8448l4938K4658N0501L106J0256J3375k277j8162j9673J2791
$$ 71284 29774 29082 634 -34304 -9646 40855 43961 54217 67592 65315 47153 27480 40271
9816D0271l0654j6250L6857k1460k7636p03j185J8960J566K3097J6738K898M0687
$$ 40271 9617 -6633 30224 8764 -18872 -19575 -20760 -1800 -234 22863 39601 42499 83186
9803H3186j6869o2263n2137k3933L4249P239M084N436P4593k862k3521J9960J8032
$$ 83186 66317 4054 -48083 -72016 -37767 -30528 -26444 -21008 53585 50723 27202 47162 65194
9790F5194N3052J258p0862j6379k3063j3072j9001K3320M1006K8291O496j0655
$$ 65194 118246 119504 48642 32263 9200 -3872 -22873 447 41453 69744 76240 65585
9778F5585k7573L1981N0301L940k8219q6515o9827N3337N8856K534j6410l937
$$ 65585 38012 69993 120294 124234 96015 9500 -60327 -6990 51866 54400 37990 34053
9766C4053J4932L366j7577k144p118k9137J0336M223L3505j291l9752M616L0822
$$ 34053 48985 52351 34774 32630 25512 -3625 6711 10934 44439 43148 3396 8012 38834
9753C8834J400Q440M674r377P858k5532j587j6680L883J0200j4354j4339j8408
$$ 38834 40234 48674 53348 43971 51829 26297 24710 8030 11913 22113 7759 -6580 -24988
9740b4988Q656O771N520k6241k4400j9988J1788Q5976J2896K1108n919O56J4054
$$ -24988 -16332 -9561 -4041 -30282 -54682 -74670 -62882 23094 35990 57098 51179 51835 65889
9727F5889M907j4175J9324j3132k5938N4336K5944K1058L164O340k2090o4888
$$ 65889 70796 56621 75945 62813 36875 91211 117155 138213 141377 147717 125627 60739
9715F0739m2644n2831m1953M8375N3943j6359J6046K8023l2546n2327J5516k0340
$$ 60739 18095 -34736 -76689 -28314 25629 9270 25316 53339 20793 -31534 -16018 -36358
9703c6358M4119M4844j4183p9659p8644N568M8493R3728K5618j0696J9665m7932
$$ -36358 7761 52605 38422 -41237 -119881 -114313 -65820 27908 53526 42830 62495 14563
9691A4563k9217l3058J4196K0013n930l356l17j3588N3010L7981m3849k9108L2661
$$ 14563 -14654 -47712 -33516 -13503 -19433 -22789 -23106 -36694 16316 54297 10448 -18660 14001
9678A4001M2413M2645j6457k4753m3338m3086m7277k6976M2267L7164K4416K4844
$$ 14001 56414 99059 82602 57849 14511 -28575 -75852 -102828 -60561 -23397 1019 25863
9666B5863j8789q612p3939J0209O3391J8352o333J1606N6355J08660J03969P6997
$$ 25863 7074 -1538 -75477 -65268 -1877 16475 10142 21748 78103 186763 290732 367729
9654C67729n1615r2046o5705q6598p664K3769P576m1601j5545L2935k4700j4392
$$ 367729 316114 224068 158363 71765 64101 87870 95446 53845 38300 71235 46535 32143
9642C2143p965J3248k134L229r573k2271K3319J1374K63o3322q139M3329k3915
$$ 32143 24178 37426 35292 38521 28948 6677 29996 41370 41633 -21689 -29828 13501 -10414
9629a0414J666j171k5710p061j6391k4073N0655J0967m6335K9617Q6186N9824
$$ -10414 -8748 -9919 -35629 -42690 -59081 -83154 -32499 -21532 -67867 -38250 47936 107760
9617A07760J5582k0729n4879k2793M8224n1854k0588J1343k3386N739L1021n422
$$ 107760 123342 102613 47734 24941 73165 21311 723 12066 -11320 -5581 25440 20018
9605B0018K3508j120k2529l0704J3966M4784J7763k1693k5711l8494O5008L2677
$$ 20018 43526 42406 19877 -10827 3139 47923 65686 43993 18282 -20212 44796 77473
9593G7473k4571L9113j791j0198l6499m8055n5152K8896K2064L211N9711M3113
$$ 77473 52902 92015 90224 80026 43527 -4528 -59680 -30784 -8720 -5509 54202 97315
9581I7315k4644o9542j7118l0087R308L7998K8613J106l606r848J4170M0585K3392
$$ 97315 72671 3129 -13989 -44076 -34768 3230 31843 32949 29343 19495 33665 74250 97642
9568I7642m49K2427K2230k0890o9207l5004K5n4020p502N4511M5054j2866k2298
$$ 97642 97193 119620 141850 120960 51753 16749 16774 -37246 -44748 9763 54817 41951 19653
9555A9653j7337M640L452J5179N8774j1411k1670m6322m213N2086J4207J4847
$$ 19653 2316 6956 10408 25587 84361 72950 51280 4958 745 52831 67038 81885
9543H1885J863l6304j26J0060l4435m2759k850N0102J3575j8590m8804M345K6821
$$ 81885 83748 47444 47318 57378 22943 -19816 -22666 27436 41011 22421 -26383 -22038 4783
9530D783j8631k030M8967N7865j410j0885k7208m3399j4049o998K6174R747j770
$$ 4783 -13848 -15878 33089 90954 89544 78659 51451 8052 -5997 -12995 13179 22926 21156
9517B1156k7728l2048K7516K0038p68J6583K3111m7376l0546N011J3071K5336
$$ 21156 -6572 -38620 -11104 8934 8166 24749 47860 484 -30062 -25051 -11980 13356
9505A3356O5729M3956l8565j8351J542L2953J9410p673k4827m4499o7475n560
$$ 13356 79085 123041 84476 66125 67667 100620 120030 112357 87530 43031 -24444 -30004
9493c0004p236N417J3278K4023l3817j1737L4547L2187l2714O8748O1498l7065
$$ -30004 -37240 -31823 -18545 5478 -28339 -40076 -5529 26658 -6056 62692 124190 87125
9481H7125k0120j4320k17l9120m039O3802k2836m5790j0924k7360k7865L435J3134
$$ 87125 67005 52685 52468 13348 9309 73111 50275 4485 -6439 -33799 -61664 -58229 -45095
9468d5095p84K831j2441L0964J01523L6223r540m8004l2050l1780m5366j8082
$$ -45095 -45879 -43048 -55489 -24525 76998 113221 103681 55677 23627 -8153 -53519 -71601
9456g1601m2207J6920O0831k9365k0434K2590J6168m6708j10K3699J1889k071
$$ -71601 -113808 -96888 -36057 -65422 -85856 -63266 -47098 -93806 -93916 -70217 -58328 -60399
9444f0399O2673J4977o89m876O320N1611O893j0192Q146R271k0629k3039l4116
$$ -60399 2274 17251 16562 11686 18006 69617 76510 66318 74464 83735 63106 40067 5951
9431E951k2972R84k2406N7412M5747k4753J318J7264k0658l7614m194Q988j1238
$$ 5951 -17021 -16037 -38443 18969 64716 39963 41281 58545 37887 273 -3921 5067 -6171
9418f171n5601K9077L6782j351n010L9990k0300M3134l5575l2339M0736Q912m6044
$$ -6171 -61772 -32695 4087 2736 -2274 37716 17416 60550 24975 -7364 33372 42284 -3760
9405c760N519O614l4327m1397m6494O4432M5969K0342q0l5302L3969P4384M2738
$$ -3760 1759 8373 -25954 -67351 -113845 -49413 -3444 16898 16818 -18484 15485 89869 132607
9392A32607K5679k5963o2335n8660P761O888R437Q448m635N899L3633j402j0627
$$ 132607 158286 132323 69988 11328 19089 25977 35414 43862 39227 45126 78759 77357 66730
9379F6730M749K040j3018l2122j8007J5398k6111M2295K3914n4439k7347O408
$$ 66730 71479 73519 60501 28379 10372 25770 -341 41954 65868 11429 -15918 -9510
9367i510n6610m1857J1654P9800m210J3752m3339K2689L5222k2864l5912k200
$$ -9510 -66120 -107977 -96323 -16523 -20733 -6981 -50320 -27631 7591 -15273 -51185 -53385
9355e3385p642j2432l6276l1546L7729N1899K8148j7096l8364k3683O108N0564
$$ -53385 -61027 -73459 -109735 -141281 -103552 -51653 -23505 -40601 -78965 -102648 -96540 -45976
9343d5976O8232O4891M548n1498n0023m891L3522l103k9855o0053N6748P4265
$$ -45976 22256 87147 91695 40197 -9826 -14717 18805 15702 -14153 -74206 -17458 56807
9331E6807j2939m8706J759K9860M032r356K914O989l5685j2411M259K4838K4413
$$ 56807 43868 -4838 -3079 26781 30813 21457 24371 31360 -4325 -16736 -12477 12361 36774
9318C6774K3059K6368M154j4005k8860j0652j9185j7316m7924J0499L6055L587
$$ 36774 59833 86201 90355 76350 47490 36838 17653 337 -47587 -37088 -1033 2554
9306B554k9777L4358M5345M4777l9017p1275J1136L118j307l6623L012M4434L8223
$$ 2554 -27223 7135 52480 97257 58240 -13035 -1899 1219 -88 -36711 -33699 10735 48958
9293D8958o209m8367m3544j6582M4001L7299L3010J8879l8874J3177Q947M650
$$ 48958 42749 -5618 -49162 -65744 -21743 15556 48566 67445 28571 41748 50695 55345
9281E5345M9101k1223k8664k3595j9263K1102L3173L9769j8206k4338L98l3442
$$ 55345 104446 83223 54559 30964 11701 32803 65976 105745 87539 63201 63599 30157
9269C0157m44o23M363K9342p752m3495m1484Q181r853m449K9335J5807p652J8220
$$ 30157 29713 29090 33453 62795 55043 11548 -29936 -21755 -31608 -36057 -6722 9085 1433 19653
9255A9653J3537M812K0171m2671o5770l545L5730N3693K5087K637k042k1359J3
$$ 19653 33190 38002 58173 15502 -50268 -53813 -18083 35610 60697 63334 61292 39933 39946
9242C9946m3037l9534R661j5339J4283L1039L0100k403L807L5901k63j5016j1530
$$ 39946 -3091 -42625 -32964 -48303 -34020 -2981 27119 24716 28523 64424 64161 49145 37615
9229C7615K4301L963m4772p0629l3906j8987K5725K7813K7027J086k1925K7448
$$ 37615 61916 65879 21107 -49522 -83428 -102415 -76690 -48877 -21850 -20764 -42689 -15241
9217a5241L1140K4112k0227j02N5883j1846r305k3939k7657L5124R166q5289p4661
$$ -15241 15899 40011 19784 19682 75565 63719 54414 30475 2818 37942 47108 -38181 -112842
9204a12842m645R2958K8041n6014k9034L7745M2098j0022j6302N6886M4279k5832
$$ -112842 -117487 -24529 3512 -52502 -81536 -43791 -1693 -11715 -28017 28869 73148 47316
9192D7316n3007j7991L6896M3327M20K4079l5203k2314K5601L845k3192K671J1758
$$ 47316 -5691 -23682 13214 56541 56961 81040 45837 23523 49124 52969 29777 32448 44206
9179D4206K4690l7057j8749M715j090J5000L67J9314m608k0380m596K554j3900
$$ 44206 68896 31839 13090 17805 16715 31715 32082 51396 46788 26408 21812 24366 10466
9166A0466J4612Q731j6814k84L2726p052l2512j610J4490q778n5961m23L7755
$$ 10466 25078 33809 16995 16711 49437 42385 9873 8263 22753 13975 -41986 -42409 -4654
9153d654j5443K6362m959r995O255M9565M9232j9102j1573N54q187l5546p909
$$ -4654 -20097 6265 1306 -8689 -2434 47131 96363 77261 65688 66242 58055 22509 14600
9140A4600n272k6134Q444K2856K0175J1125l6217J6166j8227j3095K2427k043
$$ 14600 9328 -16806 -8362 14494 34669 45794 9577 25743 7516 -5579 16848 14805
9128A4805j0760l4686J8208J7568K3259M15K879O359l1562L1100o092N424j7231
$$ 14805 4045 -30641 -12433 5135 28394 28809 31688 38047 6485 37585 31493 36917 19686
9115A9686j8677k2060j9107J2721J9952p81j0947j9194k7974O0445M4802l2981
$$ 19686 1009 -21051 -40158 -27437 -7485 -8266 -19213 -38407 -66381 -5936 38866 5885
9103E885k2281J0010L0098L4294j7529n9743k2236L021M4960M2462r293j6832
$$ 5885 -16396 -6386 23712 58006 40477 -19266 -41502 -38481 6479 48941 39648 22816
9091B2816l0904Q300O082j940N2153J2689J8009Q053j4145j4443n3540j9790L2556
$$ 22816 -8088 212 6294 4354 56507 69196 87205 95258 81113 66670 13130 -6660 25896
9078B5896n928j1312l966J6522J8530k3969k5385J3648k0008j2458N278k2157
$$ 25896 19968 8656 4690 21212 39742 15773 -9612 4036 -15972 -28430 -23152 -45309
9066d5309J0906J6477l7541l4763j2609L9882L913J3628L8857M4306j7514k2380
$$ -45309 -34403 -17926 -55467 -90230 -102839 -62957 -59044 -45416 -6559 37747 20233 -2147
9054b147N8981L6317l5353p9971l2422K3002o857J7258N7631K217m004l7227k5895
$$ -2147 56834 93151 57798 -22173 -54595 -31593 -38450 -21192 36439 38656 34652 -2575 -28470
9041b8470M627J3514l8334Q265k1687M647Q59J8553L0819L854K322K5923O713
$$ -28470 -23843 -10329 -48663 -40398 -62085 -57438 -56579 -38026 -7207 -3353 -1031 24892 31605
9028C1605k1978m8857L3970J0663n2815p0689Q5674J726k5286Q1622L2628K5279
$$ 31605 9627 -39230 -5260 5403 -47412 -118101 -32427 -30701 -55987 25635 58263 83542
9016H3542m9321K5888K6368m768n0081l4667m5483Q838j5506l1412J9720R091
$$ 83542 34221 60109 86477 81709 31628 -3039 -48522 -39684 -55190 -86602 -66882 -57791
9004e7791K0711k5137J0989J4458J0900L7961M2303m9086m2997P488J8284P6960
$$ -57791 -37080 -62217 -51228 -36770 -25870 12091 54394 5308 -37689 -30201 -11917 65043
8992F5043p6o3285j625k085k0648j5467J0277J7103M6327n896J5097k8302m4625
$$ 65043 64967 1682 57 -2028 -22676 -38143 -27866 -10763 35564 29668 44765 16463 -28162
8979b8162K3487r540J9818j809j9077K0435j042j2988j5490L2908k2350m1123
$$ -28162 -4675 -14215 5603 3794 -15283 5152 4110 -8878 -24368 8540 -13810 -54933
8967e4933O635N4563L5844k4920O747P117O4369j9009o2383k8956K5406M2139
$$ -54933 -48298 6265 42109 17189 23936 31053 95422 76413 14030 -14926 10480 52619
8955E2619j9147J1811J0957k9037J0330M7912K2554k1489n143O484m0071j9513
$$ 52619 33472 45283 56240 27203 37533 85445 107999 86510 81367 87851 47780 28267
8943B8267o871l4061K1990K8556r836o5970n9329J699J1208l0764N207L9420j7248
$$ 28267 21396 -12665 9325 37881 28045 -37925 -97254 -95555 -84347 -115111 -109904 -70484 -87732
8930h7732N1152N4435o37p7166n9932M273K7344M4242M6041O1349K1805K1818
$$ -87732 -36580 17855 17218 -59948 -119880 -115607 -88263 -44021 2020 63369 85174 106992
8918A06992j2284m3466k6096K0681K6491J4125k6899L7092K9967j8m4987P084
$$ 106992 94708 51242 25146 45827 72318 86443 59544 96636 126603 126585 81598 88682
8906H8682j4252j4739j3390j1721j0482M96O484K2167j304m8946k6979l2602j0540
$$ 88682 74430 59691 46301 34580 24098 24594 31078 53245 51941 2995 -23984 -56586 -67126
8893f7126P917L6886o164q172L001j4669J8834M6381l8679k4229J4867q408l634
$$ -67126 -59209 -22323 -28487 -36659 -33658 -48327 -29493 16888 -21791 -46020 -31153 -39561 -43195
8880d3195l29j1823L675K1239K1547L5646M9044K2000j4128p33P217L654m4961
$$ -43195 -43524 -55347 -51672 -30433 -8886 26760 75804 97804 83676 82943 90160 93814 48853
8867D8853o8897k5536L5497K7264j0197l1883l6580K3055m0585p349J2441L7995
$$ 48853 -20044 -45580 -10083 17181 6984 -24899 -61479 -38424 -79009 -86358 -73917 -35922
8855c5922M5892L8317l864Q931K8793j5146l6631j872O97l0113P512J9079o138
$$ -35922 9970 48287 44423 53354 82147 67001 30370 28498 29195 -918 6594 25673 19535
8842A9535L841Q080j0545m806K827J5072K4K1196P961J1461m1785K6403J4589
$$ 19535 23376 31456 20911 16105 18932 34004 34028 55224 63185 74646 32861 59264 73853
8829G3853q978n1968K3247l3629k2689L9194M9523L2320k6238n369l2703l6218
$$ 73853 64875 12907 36154 2525 -20164 19030 68553 100873 74635 69266 36563 345
8817C45l8462m4838J9797N0280L7753k4391j9609j9999m9565l0683j9795k3147
$$ 345 -38117 -82955 -63158 -12878 24875 484 -19125 -39124 -88689 -119372 -139167 -162314
8805a62314k1083L5199K4439N4801O0129j7119n379r083J3076M2169L6532j5921
$$ -162314 -183397 -148198 -123759 -68958 -8829 -25948 -31327 -40410 -27334 14835 51367 35446
8793C5446M976j665j5077K1317O241j4639L2453k3830j811k3147K8469J2622m0457
$$ 35446 40422 38757 23680 44997 51238 36599 69052 45222 43411 20264 48733 61355 20898
8780B0898J160J3791m9460l991J8144J1234J9394n540k4674J9066L5333l2071
$$ 20898 22058 35849 -13611 -17602 542 11776 31170 25630 956 20022 55355 23284
8768B3284j08712J0987P0925N1035l3080n911L205K6513J7344r758k6179j251
$$ 23284 -85428 -74441 -3516 47519 14439 8528 11733 38246 55590 45832 19653 18402
8756A8402O6425K5432j884k0642j3159j5509k4425j1637j0486k3280K0479J2144
$$ 18402 84827 110259 108375 87733 74574 59065 34640 23003 12517 -10763 9716 21860
8744B1860k2969J2756l7771J854M3966J3569j5990j2264j7898j1683L0693O1165
$$ 21860 -1109 11647 -26124 -24270 19696 33265 17275 5011 -12887 -24570 6123 67288
8732F7288r951o2655n3711m1475j604L1158M7417J1973k478O0884k0315p2974
$$ 67288 57337 -5318 -59029 -100504 -102108 -70950 -23533 -11560 -14038 46846 26531 -46443
8720d6443j7281L4295K5580P4272L1925j4524l3180k2269J937k0961K1696M6767
$$ -46443 -63724 -29429 -3849 70423 102348 87824 54644 32375 34312 13351 35047 81814
8708H1814j0917l3764l048P133K3280l9177n0478j1001J3907j3258L6968K0222
$$ 81814 70897 37133 34085 41218 64498 25321 -25157 -36158 -22251 -35509 1459 21681
8696B1681L1079J5871k5311O2677k4246q235k3700K0247J6198k8339l9356j4253
$$ 21681 52760 68631 43320 105997 81751 73516 49816 70063 86261 57922 18566 4313
8684D313J3805k2584J5040K9676r452m3295j0667J3678K6874k2096k4145R4889
$$ 4313 18118 -4466 10574 40250 30798 -12497 -23164 -9486 17388 -4708 -28853 66036
8672F6036K4036l3386J5649J2059k8783j0462M080l1724m4053l9711O819Q1005
$$ 66036 90072 56686 72335 84394 55611 45149 49229 17505 -26548 -66259 -59440 21565
8660B1565O144J1196o6903L1459J5127J4962K0915K366M012p3994o3173M6101
$$ 21565 27709 38905 -27998 3461 18588 33550 54465 56831 60843 -13151 -76324 -30223
8648c0223O8389q556K5518J7066r149P029j4912k015k4670L035o31m631K7775
$$ -30223 38166 29610 55128 72194 63045 70074 55162 53147 28477 31512 30881 26250 54025
8635E4025J984l6115K9040J4682J4770J1403l7141o5122j9278J5878Q905k2182
$$ 54025 56009 19894 48934 63616 78386 89789 52648 -12474 -31752 -15874 -6969 -29151
8623b9151O1318K4644J0068J97m8683J1157K5603J0733k1486l5666j6500J3912
$$ -29151 32167 56811 66879 67076 18393 29550 55153 65886 44400 8734 -7766 6146
8611F146Q497J0893k907J2057l319n799J3149K6560k0104n540J4065r288L9028
$$ 6146 14643 25536 22629 34686 31367 25568 38717 65277 45173 39633 53698 44410 83438
8598H3438J37N374J324l5395q472k896l6442q394Q126m6609L289O8743M8448M6658
$$ 83438 83575 88949 90273 54878 46406 43510 7068 -1326 6800 -39809 -36520 32223 80671 127329
8584A27329O50J085K1895j9061k7598l7406K5763J869J6561L5765J742n1531n7037
$$ 127329 127979 129064 150959 131898 104300 66894 92657 94526 111087 146852 148594 97063 40026
8571D0026K2562K4615m429k2706l6495k5857l6340j1531n781K0823L3337J6283
$$ 40026 62588 87203 82774 60068 23573 -2284 -38624 -50155 -55936 -35113 -1776 14507
8559A4507L2352n865k9190K0532N5668L0040o8513p7538K2116M72j5651L5905
$$ 14507 46859 40994 11804 32336 88004 118044 49531 -28007 -5891 -5419 -21070 14835
8547A4835P7143n355o5893o2958n9311O5740L8727R739J1425N516k6265k3254
$$ 14835 91978 86623 20730 -42228 -101539 -35799 2928 12667 24092 29608 3343 -19911
8535a9911M4302K6335m116j2143J8807J7641Q38j9574j8804K170q015L8363L9942
$$ -19911 24391 50726 46610 34467 53274 70915 71753 52179 33375 35545 27530 65893 105835
8522A05835R028j4039q115l7188j211l6260j3131N2770q374P25J3780K2953J3519
$$ 105835 114863 100824 92709 55521 54310 18050 4919 57689 49315 50040 63820 86773 100292
8509A00292q17O196o299j2479r671m4047j18103j4728N8766L2227P0684l2337
$$ 100292 99475 105671 99372 86893 77222 33175 -84928 -99656 -40890 -8663 62021 29684
8497B9684L5397m3509k7945N599j8711j7109k0835J0516N8146K2179J7694L0868
$$ 29684 65081 21572 -6373 -774 -19485 -36594 -57429 -46913 11233 33412 51106 81974
8485H1974l3613l0661K2726K4515o957n8871N058j2716q892j1834M5761L3323
$$ 81974 48361 17700 40426 64941 57984 -887 4171 -8545 -17437 -29271 16490 49813
8473D9813J5416P479J3984m8338k4380L6303Q366k7517K713n529M300M019J0468
$$ 49813 65229 72708 86692 38354 13974 50277 58643 31126 33839 28310 32610 36629 47097
8460D7097M342J9977n032m9129m7166J6233K8803M3754K9914J386n1278m3666
$$ 47097 51439 71416 66384 17255 -29911 -13678 15125 58879 88793 90179 38901 -4765
8448d765N7174L4532k1661J8373M6246j4027o7516j3827P9196m8172k6411K4767
$$ -4765 52409 86941 65280 83653 129899 115872 48356 34529 113725 65553 39142 63909
8436F3909O8737N1753m9934q0320L2748k3029l9725O5939J9553j8910L5043m9656
$$ 63909 132646 184399 134465 54145 86893 63864 24139 90078 109631 90721 125764 76108
8424G6108k7552K0890j5750k9845j0139O0812L9030k881n7807r229L0365M5471
$$ 76108 48556 69446 53696 23851 13712 74524 113554 110673 52866 43637 74002 119473
8412A19473K4330n4668r043q295l167r234R382M91p095L6223N2278m1415l2992
$$ 119473 143803 89135 80092 71797 68630 59396 68778 69269 62174 98397 150675 109260 76268
8399G6268l4841p456J6594j025N8407l0457l0522j3028j4244J7479p52N4733j4213
$$ 76268 41427 33971 50565 49540 107947 77490 46968 33940 19696 37175 36423 91156 76943
8386G6943l7899J5490L5990k3647m1543J6342j2779k1614J0693J4215J5542Q656
$$ 76943 39044 54534 90524 66877 25334 41676 28897 7283 17976 32191 47733 56389
8374E6389J1799j1177L5895K9760k1601o528j6985k2489l555p797L3626L1916
$$ 56389 68188 57011 92906 122666 101065 94537 77552 55063 51508 43711 77337 109253
8362A09253R655O788L8906R0826N5284L3331l6801j7198j01175n3606L2003o8651
$$ 109253 118908 125696 164602 255428 310712 344043 307242 290044 188869 135263 167266 98615
8350I8615p8718j8638M6455J1687L2519J2009j7188N8811p769k2798J7178r741
$$ 98615 19897 1259 47714 59401 91920 103929 86741 145552 137783 114985 132163 122422
8338A22422p015K1445L0012n4860o4165j6967O533J5863O18j1931J3699k435M4764
$$ 122422 115407 136852 166864 112004 47839 30872 37405 53268 53886 41955 55654 53219 97983
8325I7983P7449K0947J0773m9645N796o902N820j6003j9299m1338M5560N8010
$$ 97983 175432 196379 207152 157507 163303 156401 162221 146218 126919 85581 131141 189151
8313A89151J6570J772o1794L3251J0668l1048l4697J881J2568k307k3336m1380
$$ 189151 205721 207493 145699 178950 189618 158570 123873 125754 138322 136015 112679 71299
8301G1299j6578K6496Q322m7875P027P802J4935J8048o2169o5335K2694J6413
$$ 71299 54721 81217 89539 41664 48691 56493 71428 89476 27307 -38028 -15334 1079
8289A079K1915J1660N0800O5200M8187k5941m6219r2270L2596M1334n9328k8258
$$ 1079 22994 34654 85454 150654 198841 172900 126681 34411 67007 108341 49013 20755
8277B0755J7765K0879k7479j9715L12L2771J3461K7375K7988l675K3364L7447
$$ 20755 38520 59399 31920 12205 12517 45288 58749 86124 114112 110437 133801 171248
8265A71248m0102l3015K8094M3436k7484l0122j1905L520M266R352J4096R823
$$ 171248 131146 98131 126225 169661 142177 112055 100150 103670 107936 117288 131384 141207
8253A41207J9291J4411m2202k84Q406k899j4514l8844m037N5202L6140M946l4101
$$ 141207 160498 174909 132707 132423 140829 137930 123416 84572 80535 135737 171877 176823 142722
8240A42722k7403m9569l6697j4867L4573Q7928k0786k3060k470k1675m3723r334
$$ 142722 115319 65750 29053 14186 48759 136687 115901 92841 90371 68696 24973 15639
8228A5639J9792K1259P4226l176o2281k8571M1749K7196J1756j5689j5353N4113
$$ 15639 35431 56690 130916 127740 65459 36888 78637 105833 117589 101900 86547 140660
8216A40660N434k4901k4911l4957m2461O036L5032l838M3705L4215M49n9424l9703
$$ 140660 146094 121193 96282 61325 18864 24900 59932 56094 99799 134014 134463 75039 35336
8203C5336N0175l2196K2343M35k0255L8801K562K8174K4593K4439k014L0085o1511
$$ 35336 85511 53315 75658 76093 55838 94639 97201 125375 149968 174407 172393 202478 140967
8190A40967l1459K0313o635k4808o1221K5656O9992p857m3697p644L67k3514N5767
$$ 140967 109508 129821 123186 98378 37157 62813 132805 124948 81251 73607 73974 50460 106227
8177A06227R960J649K3708P584L5839L392o1694l4495k2421j0374K4860J1431
$$ 106227 116187 117836 141544 149128 184967 188359 126665 92170 69749 59375 84235 95666
8165I5666p163n6282O541L7357M1345m2443q3092m47L2608L4267J030n5800j8629
$$ 95666 88503 32221 38762 76119 117464 75021 -8071 -8518 24090 58357 59387 3587 -15042
8152a5042N8k1953Q661K7553L774R65J0146L1470K6022K802l6406p773l1697k6422
$$ -15042 -14984 -36937 -28276 -723 3051 4016 14162 45632 71654 74456 38050 30277 -1420 -27842
8138b7842K0906k749L9643N0256k0089k9227j7105k3399j1513n7127L9336K6839
$$ -27842 -6936 -9685 29958 80214 60125 30898 13793 -9606 -21119 -78246 -38910 -12071
8126a2071j6058l5962P103R4507O5469R146Q168J9066m3033n5180k0145J5258
$$ -12071 -28129 -64091 -56988 37519 102988 112134 120302 139368 96335 41155 21010 36268
8114C6268J8988k6137m0800J4082K3298L4312J910o0866j6980R666j0907M136
$$ 36268 55256 29119 -11681 2401 25699 60011 61921 1055 -15925 -6259 -17166 -13030
8102a3030N5770M4269n5792l3374l8802K9768L8336m9174P397J5856n912N1832
$$ -13030 42740 87009 31217 -2157 -40959 -11191 27145 -22029 -14632 1224 -4688 47144
8090D7144J9087m0762j0848M4199O4675L288n7729q371R829N68j5709K977M7430
$$ 47144 66231 25469 14621 58820 123495 126783 69054 60683 70512 71080 55371 58348 105778
8077A05778k4160o2709l270M6792J1836R884m593j5995m6850l4718o4499K3460
$$ 105778 81618 18909 15639 62431 74267 84151 79558 63563 16713 -18005 -82504 -59044
8065e9044O8449J2384j3505j9340k8692L0573N9042n0330p3407j9024J881K0892
$$ -59044 9405 21789 8284 -11056 -39748 -9175 49867 -463 -73870 -92894 -91013 -70121
8053g0121L7073J7019j7954M2364l2749k8319J5753M8953J7101J3122K050j0133
$$ -70121 -33048 -16029 -33983 8381 -24368 -52687 -36934 12019 29120 42242 44292 34159
8041C4159l530l0012n3774p688J6464K9661L9710K6292k5577k6261Q146k6561
$$ 34159 30629 617 -53157 -60845 -44381 -14720 24990 51282 25705 -556 7590 -18971
8029a8971l428M9215M0552J5536l0670n1290J0232N1055l4058l0105K1262M576
$$ -18971 -22399 26816 67368 82904 52234 944 11176 62231 28173 -1932 19330 23906
8017B3906k5832j8677M8940J031K1824K3352j9668k3656N1258l7711k9760L4189
$$ 23906 -1926 -20603 28337 29368 51192 74544 54876 31220 82478 44767 15007 49196
8005D9196l4912p430J883n113p907P0261k2316o7790J8382M0028j2807J1398p765
$$ 49196 14284 6854 8737 3624 -4283 65978 43662 -24128 -5746 34282 21475 32873 25108
7992B5108k8350J7910O247J9782o719J0892Q971n2910n1005j1712N3679l0631
$$ 25108 -3242 14668 20915 40697 33978 44870 53841 931 -50074 -61786 -8107 -38738
7980c8738p7295l647M8354M3556m2484J3721k7876J9486J6130N1607K3534l7142
$$ -38738 -116033 -119680 -71326 -27770 -70254 -56533 -84409 -64923 -48793 2814 26348 -10794
7968a0794j2444K3358J4184J5387J5120L0145K1791j2255O527r569q075m7281
$$ -10794 -23238 120 14304 29691 44811 74956 96747 84492 91019 81450 73375 26094
7956B6094m2901k2236j3410Q67K6108K7644L2341j8867o2183k3786O655L8579
$$ 26094 -16807 -39043 -52453 -51586 -25478 2166 34507 15640 -46543 -70329 -63674 -25095
7944b5095O0615J9339l5767N7667Q7082l4141o9588k3016m490R445N989j4903
$$ -25095 35520 54859 19092 76759 163841 129700 60112 37096 32606 42051 48040 33137
7932C3137k2770l9514j5627M224j1993L7631K7774l3521j0659p263N091J8169
$$ 33137 10367 -29147 -44774 -40550 -52543 -14912 12862 -20659 -31318 -38581 -33490 -15321
7920a5321K0659l748K2663M2228r043N508M7985l0372o4816k4367l3719J5541
$$ -15321 5338 1590 24253 66481 57438 62946 110931 80559 15743 -8624 -42343 -26802
7908b6802j6611j2901P129L2030L1635L2736M182j5773l3971J4385j5245M0128
$$ -26802 -43413 -56314 -49185 -17155 14480 47216 51398 35625 1654 16039 794 40922
7896D0922O2911L312l455k0548j4654P301J5168j7838p5064k0442J4213l800K9486
$$ 40922 103833 107145 103690 83142 68488 75789 90957 73119 -1945 -22387 -8174 -11974 17512
7883A7512k6105n2324p209N5209N7992R066l8348l5525K6804J2870k2286K336
$$ 17512 -8593 -60917 -68126 -12917 45075 54141 15793 -19732 7072 19942 -2344 -8
7871hK2117j8555L542K5566O988n7957m2449K3547K8177K4246L7018N8976j4114
$$ -8 22109 3554 7096 32662 39650 -18307 -60756 -37209 -9032 15214 52232 111208 97094
7858I7094m4500m1805m77M1411K5424L7256k3530k7698l6311p3092j4354k4760
$$ 97094 52594 10789 10312 51723 77147 114403 90873 63175 26864 -46228 -60582 -85342
7846h5342k763N1229P3107K6062l1833J4199M781l6765m7275q063N1611j8221
$$ -85342 -88105 -36876 36231 62293 30460 44659 49440 12675 -34600 -42663 8948 -9273
7834i273o706O711K7592N364J4298L966n144j4352K3962J1985l1525L4165M568
$$ -9273 -15979 -9268 18324 23688 37986 41952 36808 22456 46418 58403 26878 61043 65611
7821F5611m4542k8098J2591q856R004K399N8223L2907o1456m7252R805K3540l9746
$$ 65611 21069 -7029 5562 -3294 5710 8109 66332 99239 37783 -9469 336 23876 -15870
7808a5870m1835k4807L8221N9354R619n424p344N266M819n744n1340j3263j36
$$ -15870 -57705 -82512 -44291 15063 24682 19258 11914 17180 21999 16255 -35085 -48348 -48484
7795d8484p177J7413j193k1599J2517J7657L306l1512j1613K5203N6345j6924
$$ -48484 -55661 -38248 -39441 -61040 -48523 -30866 -27560 -59072 -70685 -45482 10863 -6061
7783f061j6058K3550J5701R293l6235m0705K8663L4388l2283K7104L7320l7169
$$ -6061 -22119 1431 17132 26425 -9810 -50515 -21852 12536 -19747 7357 44677 7508
7771G508l6625N4016J967k4992j4502j8953J1768R833o208M2969k4331L8200L0586
$$ 7508 -29117 24899 26866 1874 -12628 -31581 -19813 -9980 -16188 26781 2450 40650 71236
7758G1236p760o5944m3318N929N378M1973j0776q32n137J8707M3739K1517l4674
$$ 71236 63476 -2468 -45786 -39857 -34479 7494 -3282 -4114 -9251 9456 53195 74712 40038
7745D0038n3591j7819J2127M5872M0044m5314p3523K8780K6691l1130L3858K1758
$$ 40038 -13553 -31372 -19245 26627 66671 21357 -52166 -23386 3305 -27825 6033 27791
7733B7791k237J589j6321L5461j372j1111m9741l835R65M2886O8482K1726k9094
$$ 27791 25554 27143 10822 46283 44911 33800 -15941 -19776 -18811 24075 92557 114283 85189
7720H5189l1978m5161K9645L033n5512k245m8210M5801M9550J2386N013m7467
$$ 85189 53211 8050 37695 40728 -14784 -17029 -65239 -19438 30112 42498 47511 44
7708D4m928K6929p343n836R38o898k4255K0025L5232j6168L2724k7748k2146K943
$$ 44 -4884 22045 14702 8866 9804 2906 -21349 -1324 33908 17740 50464 22716 570 3513
7694C513L8347J0230r895j090l9300m9905m1595L8171M6718p979k2335J4460p914
$$ 3513 41860 52090 42195 41105 1805 -48100 -89695 -51524 -4806 -12785 -35120 -20660 -28574
7681b8574j043K4826K9781J9083J2013l2091K4713l6825r766m437p95L1246N1347
$$ -28574 -29617 -4791 24990 44073 56086 23995 48708 11883 2117 -2320 -3115 28131 79478
7668G9478J1572J490l8498J2049o435l7119p11n042J4389J5694n2759n3659L4950
$$ 79478 91050 92540 54042 66091 59656 22537 21826 16784 31173 46867 -5892 -59551 -24601
7655b4601J06703K7562q629J4786P415k3978J000m6864m1808R105J2896K2424
$$ -24601 82102 109664 101035 115821 123236 99258 100258 53394 11586 20691 33587 56011
7643E6011l2141j080J8532l4122k321k6788J1711M4876L7701k1570j8367q490
$$ 56011 23870 22790 41322 7200 4879 -21909 -10198 34678 72379 50809 32442 23952
7631B3952K9055J4497k9335j4825J0680l262J0004K5458j7567m6375k6445M4717
$$ 23952 53007 67504 38169 23344 34024 30762 40766 66224 48657 2282 -24163 20554
7619B0554r0n5874j3794j0074Q032K8630J7737K6211K6517L4819j9241k0496M9738
$$ 20554 20464 -35410 -49204 -59278 -51246 -22616 -4879 21332 47849 82668 63427 42931 92669
7606I2669M1751p2011k1501P4653o3445j13028R412M4915K0757J5994n394k5347
$$ 92669 134420 62409 40908 115561 52116 -60912 -51500 -6585 14172 30166 24772 -575
7594e75l4817m5079P833P1334L8605j6792l6231L1915j7371K244O533M0299M7728
$$ -575 -35392 -80471 -72638 -1304 37301 20509 -15722 16193 -1178 1066 7599 47898 95626
7581I5626p1846l6783j1367l2605K1696R991K7041P8576P5706l1479k9599n5456
$$ 95626 23780 -13003 -24370 -56975 -35279 -25288 1753 80329 156035 124556 94957 39501
7569C9501m8477j4156K7047k1969j8292J2157K946L7620Q328J4282j3341j885
$$ 39501 -8976 -23132 3915 -18054 -36346 -24189 -21243 16377 24705 38987 25646 23761
7557B3761M9645l1250r238l9758J7885j6820k0836k3087o7915q941P0214Q3021
$$ 23761 73406 42156 32918 -6840 11045 -5775 -26611 -49698 -117613 -126554 -56340 26681
7545B6681q841l4357J8581j4057k4639K1546P69J9115m8947m0677K114J4411p727
$$ 26681 17840 -16517 2064 -11993 -36632 -15086 -14317 4798 -44149 -84826 -82712 -68301 -76028
7532g6028J3318L5849K4864n9374j8697M5671O5658J2591k4584J1919K3815l3043
$$ -76028 -62710 -26861 -1997 -61371 -80068 -34397 31261 43852 19268 31187 55002 21959
7520B1959n6552k0983k8509J9904J0181J7947k5887k226j963M2460k5891l5478
$$ 21959 -34593 -55576 -84085 -64181 -54000 -36053 -61940 -64166 -66129 -23669 -49560 -85038
7508h5038J1376L15J3294M2823J5467J0691K283m3414N998J1775K3830k2234l9030
$$ -85038 -73662 -73347 -60053 -17230 -1763 8928 11211 -32203 -26205 -14430 9400 -12834 -51864
7495e1864J1947M0176j9441k367J9958M433J5375M5727J7855n4370p3801p848
$$ -51864 -39917 259 -19182 -21549 -1591 2842 18217 63944 81799 27429 -46372 -54220
7483e4220L5898O5458j5512M1482M1766P484m6239L529O829l8635l4839k3290
$$ -54220 -18322 47136 31624 73106 114872 122356 76117 79646 86475 47840 13001 -10289
7471a0289Q392P365J0897Q543j0302j5190m3402M308l5552j0207O4341L9778L4193
$$ -10289 -1897 5468 16365 24908 14606 -584 -43986 -39678 -75230 -85437 -21096 18682 52875
7458E2875K443l5939J4985J1568M1219m110k5812o4800n279l6583l8221L343J5328
$$ 52875 55318 19379 34364 45932 87151 83041 57229 -7571 -12850 -49433 -87654 -84311 -68983
7445f8983j0360P578j1671K7264L2808j3491K3450k6197L9307M4417J9933l302
$$ -68983 -79343 -71765 -83436 -56172 -23364 -36855 -13405 -39602 -295 44122 64055 60753
7433F0753m8132k6540M92J5281O859k7186J7984L6360J3981n9090m4440K8215
$$ 60753 12621 -13919 -13427 1854 8713 -18473 -489 35871 49852 -9238 -53678 -25463
7421b5463p662K7726n096j9718p924K4829O0750L4079k3882r7385n7155L3462
$$ -25463 -33125 -5399 -10495 -30213 -38137 -13308 47442 81521 57639 -39746 -96901 -63439
7409f3439M4348N3524R99Q954J8958j4157n7987l8234k2231k0710O058K2616J8178
$$ -63439 -19091 34433 35432 44386 63344 49187 -8800 -47034 -69265 -89975 -83917 -61301 -43123
7396d3123n7584j3997J5168J0194L0300R2513k985l6717m429p691p488j2737J2984
$$ -43123 -100707 -114704 -99536 -89342 -59042 33471 30486 -6231 -10660 -18351 -25839 -38576 -25592
7383b5592L5927N903l1661K3387J4248K5294j3129m6421j5658K9101P563n4988
$$ -25592 10335 16238 -15423 7964 22212 47506 34377 -12044 -27702 1399 8962 -46026
7371d6026m2807k5508R232O6858j0787l1406J5032M1510l9325K2525j8723M997
$$ -46026 -88833 -114341 -105109 -38251 -49038 -80444 -65412 -23902 -63227 -40702 -59425 -54428
7359e4428J8386J5229m093J6216L162j280R434K26j2493K60N193k156o6031J7786
$$ -54428 -36042 -20813 -24906 -8690 -5528 -6808 2626 2852 -9641 -9381 -4188 -6344 -72375 -54589
7345e4589m703m3857l4767K7662K6907L3058J4047j0054j1909J8837N2104J0395
$$ -54589 -59292 -103149 -137916 -110254 -83347 -50289 -36242 -46296 -58205 -39368 12736 23131
7333B3131M5025M5k5564J0976k778k259j3795l9373n756k9233k7998K4148K7669
$$ 23131 68156 68201 42637 53613 50835 48576 34781 -4592 -10348 -39581 -67579 -43431 -15762
7320a5762K7625N1495l4737j271m59l0753k2067l0309j9200M6251L0978J8706
$$ -15762 11863 63358 28621 27350 26891 -3862 -25929 -56238 -75438 -29187 1791 20497
7308B0497m3493k1838N243K7108l1264l5332R313L4488M8905K0210m1867j0418
$$ 20497 -22996 -44834 -39591 -12483 -43747 -79079 -69766 -35278 13627 33837 -8030 -18448
7296a8448l029l8272j1303L7577M9715k214K3993J9328M773K0343m5016j87j9989
$$ -18448 -21477 -59749 -71052 -33475 16240 14026 38019 57347 62120 82463 37447 37260 17271
7283A7271k8042p664r87m11k7565M8380L6565K1479l3033l9430l5712l218K8744
$$ 17271 -10771 -18435 -19422 -19833 -47398 982 37547 59026 25993 -13437 -49149 -52367 -23623
7270b3623k6523K3232q114K7638M574M7724O2309m0751n7719L4263N332l6681
$$ -23623 -50146 -26914 -35028 -7390 -2816 44908 107217 66466 8747 43010 48342 11661
7258A1661j1744J2799K2987l6690k140J700K2808r746K8915k6176o317K1029k5437
$$ 11661 -83 12716 35703 -987 -3127 -1427 21381 11635 40550 14374 8057 29086 3649
7245C649k8866K5594J2001k1154m9740K1337N0770k5516m806j2250N538m6316
$$ 3649 -25217 377 12378 -8776 -58516 -37179 13591 -11925 -16731 -28981 -23443 -69759
7233f9759L0187M8996l0811j4428N6058R980k6032J0409j1423n6501m8668J3648
$$ -69759 -39572 9424 -21387 -35815 20243 30223 4191 14600 3177 -53324 -101992 -88344
7221h8344P5473O3076k9296k1965o211n0705j5559O3452L7170j647l3415k8089
$$ -88344 -12871 50205 20909 -1056 -7267 -57972 -73531 -10079 27091 25444 -7971 -36060
7209c6060M665K5602k3921o0785l7310N2510M2629p567J3405l051K7034J6773
$$ -36060 -31395 -5793 -29714 -90499 -127809 -75299 -32670 -40237 -26832 -29883 -2849 13924
7197A3924k5196k8675N9793K7348m0554L1911N900J5757K4605J3032L4110n9052
$$ 13924 -11272 -39947 19846 47194 6640 38551 44451 60208 84813 97845 131955 72903
7185G2903l3607L0322J2397k3647j1878q471P448q152k1194j1075j1878k2883
$$ 72903 39296 69618 82015 58368 46490 38019 45467 37315 16121 5046 -6832 -29715
7173b9715j9890k1339J6006L0830K9626p022l9981n5969j9910J6300O051l7N3513
$$ -29715 -49605 -70944 -54938 -24108 5518 -1504 -41485 -97454 -117364 -101064 -95013 -95050 -41537
7160d1537M7003M1715J1413l1991J97o7757k1019L8395Q450L6489J0969P356j4184
$$ -41537 5466 47181 58594 26603 26800 -40957 -61976 -23581 -15131 21358 32327 39683 25499
7147B5499k0696l2096k4637j0840O311J6651j9655L1947J0797L2221K6930k8207
$$ 25499 4803 -27293 -51930 -62770 -56459 -39808 -59463 -27516 -16719 15502 42432 14225
7135A4225n986l840J7560J1593l1761m6431l4593m419N5092K3430N7744l6903
$$ 14225 8239 4399 21959 33552 1791 -44640 -79233 -83652 -28560 -5130 52614 15711
7123A5711k0573J2187j9381m3584k8536Q584O1133m751J321J9909K6491k1342
$$ 15711 -4862 7325 -12056 -55640 -84176 -75592 -14459 -19210 -17889 2020 28511 7169
7111G169k3890Q204J9683p950J1707L7022n800K564L1164J5780r828j7254k1293
$$ 7169 -16721 -8517 11166 3216 14923 51945 46145 48709 79873 95653 85825 68571 47278
7098D7278k7314l9288m1403l0342M9204M5281R745m6566j1374k8753r708l3128
$$ 47278 19964 -19324 -60727 -91069 -41865 3416 13161 -33405 -44779 -73532 -83240 -116368
7086a16368L212M1118O417j5128j1740J8349N9752R1955k2790n2280K218J0044
$$ -116368 -113156 -72038 -65621 -80749 -92489 -74140 -14388 77567 54777 2497 4715 14759
7074A4759j5116k9101k198j2671L220q888R58n1878k7302R6914O8431M1053l3588
$$ 14759 -357 -29458 -31656 -44327 -41107 -49995 -49037 -100915 -128217 -31303 37128 78181 44593
7061D4593o5321M7538J5957l7452j098J8133o981L599j6444k3106m5437K4648
$$ 44593 -20728 26810 42767 5315 4217 22350 15369 18968 2524 -20582 -66019 -41371
7049d1371k2870k8449j2284q903K1755M1354R1134j3817m5165K2667l4319J3598
$$ -41371 -64241 -92690 -104974 -113877 -92122 -50768 40366 26549 -18616 4051 -30268 -16670
7037a6670K1920j7194K4332N7891l6925m7886k6943K1771K2166J2914L409k813
$$ -16670 5250 -11944 12388 70279 33354 -14532 -41475 -19704 2462 15376 18785 15972
7025A5972n2978o591L1474J1964L0625j5665L3453J2552j4535k8299o2715j2756
$$ 15972 -37006 -43597 -12123 -159 30466 14801 48254 60806 46271 17972 -44743 -57499
7013e7499K0940O110M2406J5081J6084n634m765J7065j1167q2859l6382K1446
$$ -57499 -36559 -30449 11957 27038 43122 37488 32723 49788 38621 -44238 -80620 -59174
7001e9174J8907J7063j3670k2041J4861P951N189p656k4752K2914o195J8078L828
$$ -59174 -40267 -23204 -36874 -58915 -44054 -36103 -30914 -38570 -63322 -40408 -46603 -28525 -24697
6988b4697p6398k25M5006j6997l9984J0830J3342N0573L4356Q665K8077l0305
$$ -24697 -101095 -101320 -56314 -73311 -113295 -102465 -89123 -38550 -4194 4471 32548 2243
6976B243k5688L125M6009L8069L0995j6023j8958k2755j8778k9077l4902j2838
$$ 2243 -23445 -20320 25689 63758 94753 78730 59772 37017 18239 -10838 -45740 -58578
6964e8578P750Q296J3731k0380n0302Q300q412O1289K1128l1600L308K6531K3692
$$ -58578 -50828 -42532 -28801 -49181 -99483 -91183 -99595 -38306 -17178 -48778 -45470 -18939 4753
6951D753k1548j3787j5711L8945O6018m2330p2077r833J8442M8762j1628J318
$$ 4753 -16795 -30582 -46293 -7348 58670 16340 -55737 -65570 -47128 1634 -9994 -8676
6939h676l152l9316l7694O440j890j1332J0863K8535M4694j035q197J6232l3250
$$ -8676 -11828 -51144 -88838 -82398 -84288 -95620 -84757 -56222 -11528 -12563 -20760 -4528 -37778
6926c7778l5240l5947L1888K8722r832k9727J2892J8496k931N0952J1205M211
$$ -37778 -73018 -108965 -77077 -48355 -58187 -87914 -75022 -56526 -59457 -8505 2700 6911
6914F911j7369l7581J8715K0513K263n709L3724R819J6851N61l8503j2196j754
$$ 6911 -10458 -48039 -29324 -8811 -6548 -12257 21467 31286 48137 48698 10195 -2001 -3755
6901c755L6417K8668N3138m1349n7368l4064J4172k4166K7124L2287l0884j5933
$$ -3755 32662 61330 114468 73119 15751 -18313 -4141 -28307 -1183 31104 220 -15713
6889a5713n0270l757K7930k7848N1033M4169k0417o1989K763O193M5912m695M4260
$$ -15713 -65983 -69740 -41810 -69658 -18625 25544 5127 -56862 -54099 -47906 -1994 -6689 37571
6876C7571K067l2658J3889k3709m5057l224L7486L0496J6046L1k4557O550K0258
$$ 37571 39638 6980 20869 -2840 -47897 -51121 -13635 16861 32907 32938 8381 14931 35189
6863C5189k6853J2864K5894n7450j9486k4157k8248K7552K5301M8032k3895L6369
$$ 35189 8336 21200 47094 -10356 -29842 -53999 -82247 -54695 -29394 18638 -5257 31112
6851C1112K5825n4848m5519L7579M0823K3547l2754k5321J1545K0143K4663O71
$$ 31112 56937 2089 -43430 -5851 34972 58519 25765 444 11989 32132 56795 57466
6839E7466K4832K0583m2476n6078o9519J5927M7685p295k7298m1650k910L15R092
$$ 57466 82298 102881 60405 4327 -65192 -49265 -1580 -8875 -36173 -77823 -80733 -80418 -71326
6826g1326K0676J5029k0080n852j9567j9492O2601J7277r742m356K8980P2803
$$ -71326 -50650 -35621 -55701 -61553 -81120 -100612 -38011 -20734 -30476 -34832 -5852 66951
6814F6951K5385J635k1516o8015j9421p311l1688j2286J4239L969k3780l3187
$$ 66951 92336 93971 72455 4440 -14981 -22292 -53980 -66266 -52027 -48058 -71838 -105025
6802a05025K5735M9765k301m7719J0135K1236j3754n284K3296O0104R231p3160
$$ -105025 -79290 -29525 -31826 -79545 -69410 -48174 -61928 -67212 -43916 16188 25419 -47741
6790d7741j7014J3775N5238M3247p2532l3070K9734l001J5164L9543j1422k4009
$$ -47741 -64755 -50980 4258 47505 -25027 -58097 -28363 -31364 -16200 23343 11921 -12088
6778a2088j8537K7298L8586K0468J1778K560m2133l3070J6004K3474k7025j9603
$$ -12088 -30625 -3327 35259 55727 67505 70065 27932 -5138 10866 34340 7315 -12288
6766a2288p231m3603N5208O7883j4749l7733K0051l600j9329J6338m4411j5016
$$ -12288 -19519 -63122 -7914 59969 45220 7487 27538 23938 4609 20947 -23464 -38480
6754c8480l9852j9008L7665L1335L339K0861m4252j190O6844J1783k7409J2570
$$ -38480 -78332 -97340 -59675 -28340 -25001 -4140 -48392 -49582 17262 29045 1636 14206
6742A4206l099m1848k0202L2188M723L6734O2270k1655l3188o155m2792l9375
$$ 14206 11107 -30741 -50943 -18755 -14032 22702 84972 63317 30129 23974 -18818 -58193
6730e8193j2177n8075O073r82n172J6397K8467J7545N241m758N4383K7538R430
$$ -58193 -70370 -128445 -122372 -123354 -128526 -112129 -83662 -66117 -60876 -65634 -11251 16287 25717
6717B5717l4664J141J555K6321K1708j7115p896k0409j3112k4522m4021k5064
$$ 25717 -8947 -7806 -6251 20070 41778 24663 16767 -3642 -16754 -41276 -85297 -110361
6705a10361L490L6674J3134Q339L4401N2719l9961l7309K3944J868N714K0991
$$ -110361 -106871 -70197 -57063 -48724 -14323 38396 -1565 -38874 -14930 -13062 -7348 13643
6693A3643r597l536J2937K8450o510l3979n0713l6618j5814K3662L2692j8257
$$ 13643 4046 510 13447 41897 35387 1408 -49305 -85923 -101737 -78075 -45383 -63640
6681f3640M5856j0738l112R73N240J5447k2783j1679k3339L4021M8472q363p7921
$$ -63640 -17784 -28522 -31634 -30661 -25421 -9974 -32757 -44436 -67775 -33754 14718 6355 -71566
6668g1566m7713N9535L717j5657M6101K3630k9749j3446M8003L1973o6813k8468
$$ -71566 -119279 -59744 -56027 -71684 -25583 -1953 -31702 -45148 2855 34828 -31985 -60453
6656f0453K7756N198k0065k1382L8512M4625O550o7759k3372N0519K7477L1438
$$ -60453 -32697 -27499 -47564 -68946 -30434 14191 20741 -47018 -70390 -19871 7606 39044
6644C9044k8812q0919N163o01M9144K8390q078K666j4918j7810J6974L2748j8513
$$ 39044 10232 -70687 -65524 -66125 -16981 11409 3331 5997 -8921 -26731 -9757 22991 4478
6631D478J0140l9031k1654K947j131J4363j1054L520L3862l9830o7104J3058Q884
$$ 4478 14618 -24413 -46067 -43120 -44251 -29888 -40942 -37422 -3560 -43390 -110494 -97436 -88552
6618h8552k0883j3840L2482M1737J5013k8592r818K0345j9378p527j0554J3687
$$ -88552 -109435 -123275 -90793 -49056 -34043 -62635 -72453 -52108 -71486 -79013 -89567 -75880
6606g5880N826j6656L8077r830K0272R3886J9720r2176j7957J9790L2705J3667
$$ -75880 -70054 -86710 -48633 -58463 -38191 55695 75415 -16761 -34718 -14928 17777 31444
6594C1444j1266j4618k2048m2044J3504M9675L51k7709L3765O4484m809J1936
$$ 31444 20178 5560 -16488 -58532 -45028 4647 4998 -22711 11054 75538 70729 82665
6582H2665k6140l7300L8219J9128o0112m3009K407r825L993K4991j2484l5509
$$ 82665 56525 19225 57444 76572 16460 -26549 -24142 -33967 -29974 -4983 -17467 -52976
6570e2976p0009J1567J8358K874N0304P96l213J3241l5180N703J2260j6478o938
$$ -52976 -122985 -111418 -93060 -90186 -39882 -39086 -42299 -29058 -64238 -58535 -46275 -62753 -69691
6557f9691P2180L5369l658J3886n5113k5929J7604j2566j1156O418j3440L6653
$$ -69691 2489 37858 34200 48086 -7027 -32956 -15352 -27918 -39074 -32656 -46096 -9443
6545i443N3829k750j7657J1068k9101k7828k6413J4251l2324p4938K9598K0509
$$ -9443 44386 41636 23979 35047 5946 -21882 -48295 -34044 -66368 -141306 -111708 -91199
6533i1199L4915L8460m3030m6085J3882L1294L2767L6736l3942l935L5042J971
$$ -91199 -56284 -17824 -60854 -106939 -93057 -61763 -28996 7740 -26202 -30137 4905 6876
6521F876l1198K545l597k195p214j5626m688Q504l122M3702P5844l6554n8443
$$ 6876 -24322 -21777 -25374 -27569 -34783 -50409 -55097 -46593 -49715 -6013 69831 33277 -25166
6508b5166k0284K1444j9646K0112K87m0669K859J4993j2968j9417J5899L3969
$$ -25166 -45450 -24006 -43652 -23540 -23253 -63922 -61063 -46070 -59038 -78455 -62556 -28587
6496b8587L927J1683K9547J5647j2045o50J6802J561n384l2967o4218M6934J14066
$$ -28587 -24660 -12977 16570 32217 20172 19522 36324 37885 32501 -466 -64684 -17750 96316
6483I6316K6739l4848q934m5932l7303l0970L3005K1631J9601k8869m2643n836
$$ 96316 123055 88207 79273 33341 -3962 -34932 -1927 19704 39305 10436 -32207 -38043
6471c8043K6371M9906l9450k4218K3107J7887M646l799J1256J0822j233J2095
$$ -38043 -11672 38234 -1216 -25434 -2327 15560 20206 16407 27663 38485 37252 49347
6459D9347k3462l7928m5195l9522Q093m726M6124J6097J121k3544M538M6668N098
$$ 49347 25885 -12043 -57238 -96760 -88667 -93393 -47269 -31172 -30051 -53595 -49057 -2389 2709
6446B709l0777O594K8982j6881K843J0023j9804j8396P78K4252J2055l9428j9655
$$ 2709 -28068 -21474 7508 -9373 -6530 3493 -16311 -34707 -33929 -9677 2378 -37050 -56705
6433e6705K036K0351K3355o0679o866K9662L5159J8534k7052l9772K7153r913
$$ -56705 -54669 -34318 -10963 -71642 -78508 -48846 -13687 4847 -22205 -61977 -34824 -44737
6421d4737J0286M7321J4411m2585n7401n1757M2832M9363M8024M6816o2491j7684
$$ -44737 -34451 12870 27281 -15304 -72705 -124462 -81630 -32267 15757 62573 82 -17602
6409a7602l9783m3800j0542J2149J4435M7194K9416k1458m1153J4096N7406J0797
$$ -17602 -57385 -101185 -111727 -99578 -85143 -37949 -8533 -29991 -71144 -57048 358 11155
6397A1155R27n2636p5739j4216K1224k827k1401O9332Q4355k997L758r54K3020
$$ 11155 12082 -40554 -116293 -130509 -109285 -112112 -133513 -64181 20174 17177 20935 19981 43001
6384D3001n3488p1491J2697O8659q167l7869o54Q392k5510Q391J1660K4219k9801
$$ 43001 -10487 -81978 -69281 -622 -8789 -46658 -47312 -38920 -64430 -56039 -44379 -20160 -49961
6371d9961K2834k6498J2577j248M491k1599j5030k8616l273K8688J6392o4369
$$ -49961 -27127 -53625 -41048 -42296 -37805 -59404 -74434 -103050 -106323 -77635 -61243 -125612
6359a25612M2211P8950M699k9789j8782J9230j3964o068k7870l059M7240L6370
$$ -125612 -83401 -4451 248 -29541 -48323 -29093 -43057 -49125 -76995 -80054 -32814 3556
6347C556j1773R404j8974j6457L3668j2670j4230r845P926j1588j4716j8696L056
$$ 3556 -8217 1187 -17787 -34244 -576 -13246 -27476 -37321 -29395 -40983 -55699 -74395 -71339
6334g1339L6339j156m829j7275j0145J0551k2340L8749R9242k8757l1812O925
$$ -71339 -35000 -36156 -40985 -58260 -68405 -57854 -80194 -41445 57797 29040 -2772 4153
6322D153P960R126j6782r167K2376k0192l0845k2423n070K2943l6076L331o814
$$ 4153 12113 21239 4457 -4710 17666 -2526 -33371 -55794 -60864 -37921 -73997 -70666 -77480
6309g7480l854O793K2231r328J0222Q884K9848J0982l7202j8910r960l8107Q480
$$ -77480 -81334 -74541 -52310 -61638 -51416 -42532 -12684 -1702 -38904 -57814 -67774 -105881 -97401
6296i7401K0526L3890m5460l6538K8785K4872L724n582j8850J1946P0764M9572
$$ -97401 -76875 -42985 -88445 -124983 -96198 -71326 -67602 -73184 -92034 -80088 -9324 40248
6284D0248o5259k877L0005K1739K2246K293l6028p800k3734K2202n326m8033k0394
$$ 40248 -25011 -27888 2117 23856 46102 48395 12367 4567 -19167 3035 -2291 -50324 -70718
6271g0718K6465p590K19M4645J6313p157n5609l0573K8324N0205P800n1990l3946
$$ -70718 -44253 -51843 -51624 -6979 9334 2177 -53432 -84005 -55681 -5476 2324 -49666 -83612
6258h3612K5216J8150K2293n217j6362m7308r193P2877m3071m282L9725q338n0855
$$ -83612 -58396 -40246 -17953 -23170 -39532 -86840 -96033 -23156 -66227 -70509 -30784 -39122 -89977
6245h9977N5254M4858j1644p035O120J0545n908o4642J376M1549P1389l0253j5183
$$ -89977 -34723 10135 -1509 -8544 -2424 8121 2213 -62429 -61053 -19504 51885 21632 6449
6232F449J7544k1249o781m1465j3933l4604q8764R1232J32578J0183o3414m7604
$$ 6449 23993 2744 -4037 -45502 -59435 -94039 -182803 -91571 41007 51190 -12224 -59828
6220e9828k889J2956J6053K0718j4071j858M0782J3040j7941l8791Q776q04l49
$$ -59828 -62717 -49761 -33708 -12990 -27061 -28919 11863 24903 6962 -31829 -23053 -23857 -24206
6207b4206L9103N8130J3325n2295n4240p207K0480k0747r129J5560K456M7752
$$ -24206 14897 73027 86352 34057 -20183 -27390 -6910 -27657 -36786 -21226 -18770 28982
6195B8982m665k6966J142J0884L4529L6140k0486r393M3539l301n2432o3839j7995
$$ 28982 24317 -2649 -1507 9377 43906 80046 59560 50167 93706 90405 37973 -25866 -43861
6182d3861l829n0306k0474L0478N5339L7625L7203k164n2636L619M0681o2840
$$ -43861 -47690 -97996 -118470 -87992 -32653 4972 42175 40011 -12625 -9006 31675 -31165
6170c1165n4159j7679j9143M5558J7145J8594l185J8991L4274O659P402N2747
$$ -31165 -85324 -103003 -122146 -76588 -59443 -40849 -44034 -25043 9231 15890 23292 76039
6158G6039l2995j5261J9929o7196j9613M9265n478k4200k7083k7756k1431o852
$$ 76039 43044 27783 47712 -19484 -39097 10168 4690 -19510 -46593 -74349 -95780 -102632
6146a02632O6206K9509N5297k273p2850q6472k615O0462Q6459j4734j8291M7028
$$ -102632 -36426 -6917 48380 46107 -26743 -113215 -115830 -55368 31091 16357 -1934 45094
6134D5094k3445j195K3374L3398l1009k4079p0744k2539K7904L383j2959j8158
$$ 45094 21649 20454 43828 77226 46217 22138 -48606 -71145 -43241 -39858 -52817 -70975
6122g0975L9410J6909J4870M2503k4606o478O0313M573l7240q121J1448m2325
$$ -70975 -31565 -14656 214 42717 18111 11633 71946 76519 39279 31158 42606 281
6110B81j7239j6105J6853M6209J1406N5786Q387m7531o8744p441L5555m0761k9432
$$ 281 -16958 -33063 -16210 29999 41405 97191 105578 58047 -10697 -18138 17417 -23344 -52776
6097e2776K7281j0736J0397L4169K0018P8224N4714n1660j10809m8111k021p488
$$ -52776 -25495 -36231 -25834 8335 28353 106577 161291 109631 -1178 -49289 -51310 -58798
6085e8798j8456K5714j508r907k1112L4293J6743L3479J0252l8117k3953m1533
$$ -58798 -77254 -51540 -53048 -62955 -84067 -49774 -33031 448 10700 -27417 -51370 -92903
6073i2903O586K7783j5498j3340J7330K9490K6290L2921M9075o5092n1720l3569
$$ -92903 -86317 -58534 -74032 -87372 -70042 -40552 -14262 18659 67734 2642 -49078 -82647
6061h2647j276L806L6622M2310m4746q934M0376k3911L5917K5555N98k4417j8931
$$ -82647 -83923 -80117 -43495 -1185 -45931 -54865 -14489 -38400 -2483 23072 23670 -747 -19678
6048a9678K8790O172r105N707K2144L229l2241j9439n959j0443O382K5585M3129
$$ -19678 9112 15284 6179 11886 34030 37259 5018 -14421 -20380 -30823 -24441 1144 44273
6035D4273k1471p7888K2282k2681Q224o084M0441o648m8427K72K1770j2444J6438
$$ 44273 22802 -55086 -32804 -55485 -47261 -53345 -12904 -19552 -67979 -67707 -45937 -58381 -41943
6022d1943Q582J8854j170K3803K3287Q524l9310n4209K628M0877O15o787L70K8305
$$ -41943 -33361 -14507 -15677 8126 31413 39937 627 -53582 -50954 -10077 -9462 -16249 -15879 12426
6008A2426J501k706m4701k2062M8151K7662J2936N61K6152l3771k8253k520K2005
$$ 12426 13927 11221 -33480 -55542 -7391 20271 33207 33768 59920 26149 -2104 -4624 17381
5995A7381m548m0171p9223J3119Q9933K2159j5149L1658l809m1340m6182L1474
$$ 17381 12833 -27338 -106561 -93442 -3509 18650 3501 35159 31350 -9990 -56172 -24698
5983b4698N3311L4579J99R253q748m0960L684L7132m7360q4257L2620K2999m8854
$$ -24698 28613 63192 63391 72644 63896 22936 26620 63752 16392 -67865 -35245 -12246 -61100
5970f1100k4845M4169N5634k4635k2693J7674l5117M9300J7669K7549K0397n2463
$$ -61100 -85945 -41776 13858 -10777 -33470 -15796 -50913 -1613 16056 43605 64002 11539
5958A1539j7189M0077r739l0263k3957J5503K2817K8509K3914Q717m008K868l5573
$$ 11539 -5650 34427 24688 -5575 -29532 -14029 8788 37297 61211 69928 65920 68788 33215
5945C3215m4583K056o126j6513J2563J3359l498k4378n6896P017J1425l3060J3282
$$ 33215 -11368 -9312 -15438 -31951 -19388 -6029 -9527 -33905 -90801 -83784 -72359 -105419 -92137
5932i2137L6874L3441l38j3851L6808M2715k9772j1193q6903l645N5546j0182
$$ -92137 -55263 -21822 -22160 -36011 797 43512 13740 2547 -84356 -88001 -32455 -42637
5920d2637k9715K5398J5698k6863m5350p408k2504K6843M2961O9M6367N5670j3066
$$ -42637 -72352 -46954 -31256 -58119 -103469 -110877 -133381 -106538 -63577 -63508 -17141 38529 25463
5907B5463o2186Q624K1675l1056J092K798k439J9354K1597M4124L4768l9440o7906
$$ 25463 -36723 -28099 -6424 -37480 -36388 -33590 -36029 -16675 4922 49046 83814 44374 -23532
5894b3532r112r21K2473j0868J0779l4361J8905K7170l2904k0847K4016M4448
$$ -23532 -32644 -33565 -11092 -21960 -11181 -45542 -26637 533 -32371 -53218 -29202 15246
5882A5246q046k3265K0530k2103K7950J6323P924M640J1209j2092k6860n6775
$$ 15246 7200 -16065 4465 -17638 10312 26635 34559 39199 50408 38316 11456 -45319
5870d5319j664j4783L266M4909M8826l4705q447J2255o478j668J4485p746O658
$$ -45319 -46983 -61766 -58500 -13591 35235 530 -7917 4338 -2140 -3808 10677 2931 9589
5857I589K1468j1483k8175m0675p1888l5812L6154L8723K6068L3028j4591l835
$$ 9589 31057 19574 -8601 -49276 -121164 -156976 -120822 -82099 -56031 -23003 -37594 -41429
5845d1429J2154j9675k1888K8338p469l5577j5687K9361L8068j7877q212l7541
$$ -41429 -29275 -48950 -70838 -42500 -49969 -85546 -101233 -71872 -33804 -51681 -59893 -97434
5833i7434j7792M2628J7756j3537K7084M2213J787J1345o333k3517K4707k3698
$$ -97434 -115226 -72598 -54842 -68379 -41295 918 2705 14050 7717 -15800 8907 -14791
5821a4791l4286k3112k5959L4293M2949K341l9751r369Q1467n04k4116L000K9126
$$ -14791 -49077 -72189 -98148 -63855 -20906 -18565 -58316 -67685 13782 13278 -10838 -7838 21288
5808B1288K3276q56L6425q269L839R202j3150n5511J9529k2632m7408R648j4716
$$ 21288 44564 43708 80133 71864 75703 84905 71755 16244 35773 13141 -34267 -24619 -39335
5795c9335J9148j761k9880l2557K769J1088k4380L4568J5492k0030O507l4852
$$ -39335 -20187 -21948 -51828 -84385 -81616 -70528 -94908 -60340 -44848 -64878 -58371 -93223
5783i3223j2266O7945R2863N0111q708m6526j8625l9095n425K0619l6154m7013
$$ -93223 -105489 -37544 55319 105430 96722 50196 31571 -7524 -12949 7670 -28484 -75497
5771g5497L5420N7658K8023J5404J5530q553l2295o6952J3714L0632j2985n9445
$$ -75497 -40077 17581 45604 61008 76538 67985 35690 -31262 -17548 13084 99 -59346
5759e9346k3786K7940k0813m6246Q345L0475k0605N934M0488J7606L759L4475
$$ -59346 -83132 -55192 -76005 -122251 -113906 -83431 -104036 -98102 -57614 -40008 -36249 -1774
5747a774n541K7143k4944Q506M4004q883J2567m4655l2382M2686O0454m224l4579
$$ -1774 -7315 19828 -5116 3390 47394 38511 51078 6423 -25959 16727 77181 72957 38378
5734C8378k9004j0606l9648J2062L1034K9213j7074l3907L7717L6615o3800l1955
$$ 38378 9374 -1232 -40880 -28818 2216 31429 14355 -19552 18165 54780 -9020 -40975
5722d0975l163p933J5377K3464m1439r734K0006K3193M9881n094J2616l8784j4651
$$ -40975 -44138 -52071 -36694 -13230 -54669 -64403 -44397 -21204 28677 23583 36199 -2585 -17236
5709a7236j1375j0528K3855l350n181n674J5257J928j440j2720j8471J291r763
$$ -17236 -28611 -39139 -15284 -18634 -23815 -29489 -14232 -12304 -13744 -26464 -44935 -43644 -53407
5696e3407k3551N2074P086K468L7887j0654l1706J474l784j4901K6775L2103k4798
$$ -53407 -76958 -24884 -17798 -15330 22557 11903 -19803 -18329 -22113 -37014 -10239 21864 -2934
5683b934o816L3249j3829j5175j4995k8413k9144J9200J222j9956L0256L0213
$$ -2934 -9750 23499 9670 -5505 -20500 -48913 -78057 -58857 -57635 -77591 -47335 -17122
5671a7122n2511q870M9671K4387J5804o547P622n9860k0032Q203m558K908L6226
$$ -17122 -69633 -78503 -28832 -4445 11359 4812 12434 -47426 -67458 -59255 -63813 -60905 -24679
5658b4679K9860j6043k281k1127j5775j9095L5493L8733k7599o1123k9373p647
$$ -24679 5181 -10862 -13143 -34270 -50045 -69140 -33647 5086 -22513 -83636 -113009 -120656
5646a20656L5354N3675j742P462J0593L4880K5309j29l3004q0913j0214Q757J8966
$$ -120656 -85302 -31627 -33369 -25907 -15314 19566 44875 44746 11742 -69171 -79385 -70628 -51662
5633e1662K6102l6763k6937m2514K7624K3804K6696K0808p168O486K2134j8729
$$ -51662 -25560 -62323 -89260 -131774 -104150 -80346 -53650 -32842 -40010 -33524 -11390 -30119
5621c0119l5895k2696P978m646n507K2196p504j447J7916L5713l4070J8687M2813
$$ -30119 -66014 -88710 -80732 -85378 -90885 -68689 -76193 -77640 -59724 -24011 -58081 -39394 3419
5608C419Q731j028Q401K6218j6596M553o6366L0067M553j6617m2727j5341k1855
$$ 3419 12150 11122 19523 45741 29145 33698 -32668 -2601 1952 -14665 -57392 -72733 -94588
5595i4588k4237K3067N1391O8625m884j2666j5921k7722Q002o696O99P2245N6508
$$ -94588 -118825 -95758 -44367 24258 19374 6708 -9213 -36935 -28933 -35629 -34930 37315 93823
5582I3823l1323j15p600P155k3596j2368m0069j7381l0696m2679J0049J1472j3220
$$ 93823 62500 62385 54785 61940 38344 25976 -14093 -31474 -62170 -104849 -94800 -83328 -96548
5569i6548O5641R591m512j6399n074P3576J563n7153M084n157j811j9860O697
$$ -96548 -30907 -21316 -25828 -42227 -47301 26275 27838 -29315 -25231 -30388 -32199 -52059 -45362
5556d5362p441l7755j9736K7904k4741j9162P4672M6095L6844j0137l6689K1350
$$ -45362 -52803 -90558 -110294 -82390 -107131 -126293 -51621 -5526 31318 21181 -15508 5842
5544E842n4896o1952L1890M1987L9821M6623j3106m0891j6279j4137l6158k116
$$ 5842 -49054 -111006 -79116 -37129 2692 49315 36209 -4682 -20961 -35098 -71256 -73372
5532g3372N046K820J0676k189Q274N719K6476l131O703J2196l6606l1610K0791
$$ -73372 -68326 -65506 -54830 -57019 -48745 -43026 -16550 -19681 -12978 -782 -37388 -68998 -48207
5519d8207K4835L7317l0331o319J2878o2045N504K1640M1845J3432m9929p0369
$$ -48207 -23372 13945 -16386 -22705 -9827 -71872 -66368 -44728 -2883 10549 -39380 -109749
5507a09749o598O3166P593m0430j0620J4230P397L3640Q864K9537R385l2608l7244
$$ -109749 -116347 -53181 -45588 -86018 -96638 -82408 -75011 -41371 -32507 -2970 6415 -26193 -63437
5494f3437L2618L9155o218N367L6618J900j0591l1542q7502j9809J4161m6641
$$ -63437 -30819 8336 2118 7485 44103 46003 35412 3870 -83632 -103441 -89280 -135921
5482a35921K7928O1581l5792j4179j7097j0689j7656K8995M2864K1786L1042L051
$$ -135921 -107993 -46412 -82204 -96383 -113480 -124169 -141825 -112830 -69966 -48180 -17138 -14087
5470a4087p53J4890j7254j6136j0911K8434j5737O961O8201k0015l656k7938K7436
$$ -14087 -14840 50 -17204 -33340 -44251 -15817 -31554 -24593 43608 23593 19937 -8001 19435
5457A9435K7175l8112J4368M519p577o2933m3149J7456J9439M1761O4733k0020
$$ 19435 46610 8498 22866 27385 19808 -43125 -86274 -68818 -49379 -7618 57115 37095
5445C7095p9640p7901J4009N3295M85J3075L4977L018j8136K027J220J683L91
$$ 37095 -42545 -120446 -106437 -53142 -52657 -39582 -4605 -1587 -19723 -17696 -16476 -14793 -14402
5432a4402l4897J6791K1363L9372r167n314j111J1259N706j1184q550L5245N994
$$ -14402 -49299 -32508 -11145 28227 19060 13746 12635 23894 29600 18416 9866 45111 51105
5419E1105l6272m9549L2616J8536j4036J2343r754p280J9941R338J3337j8628
$$ 51105 14833 -34716 -2100 16436 2400 14743 4989 -2291 17650 26988 40325 21697
5407B1697m6641K9524j47M211j0001m840J2669M0451m7118l7112L3014m5544P623
$$ 21697 -24944 4580 4433 8644 -1357 -6197 6472 46923 -195 -37307 -4293 -49837 -42214
5394d2214m739k0462k1749j7043N822O1225N0457M1275l9052n4124l679K8068
$$ -42214 -46953 -67415 -89164 -106207 -100385 -39160 11297 52572 13520 -40604 -44283 -16215
5382a6215J4720N4466K256o1857k3721j6087J9282J0654N242k1806J735R547N5894
$$ -16215 -1495 52971 55227 -6630 -30351 -46438 -27156 -16502 -11260 -33066 -31331 -21784 34110
5369C4110m1038m8730j6185J3792J2744K7558Q564j8511J4224K8875R395m1662
$$ 34110 -6928 -55658 -71843 -58051 -45307 -17749 -9185 -27696 -13472 15403 24798 -16864
5357a6864J3264j6442p025M1541Q864o9547J9161J7149j2683K3980j1642j7609
$$ -16864 -3600 -20042 -27067 14474 23338 -46209 -27048 -9899 -22582 1398 -10244 -27853
5345b7853l4841M780K1741M1005K984j5962n875n5549m5592M2965O7666J0241
$$ -27853 -62694 -57914 -36173 4832 7816 -8146 -14021 -69570 -115162 -72197 -4531 5710
5333E710j49N105J4362M492k5714m6040j8859L2409l7897j4634j3601M6844J1495
$$ 5710 5561 10666 25028 29520 3806 -42234 -61093 -28684 -66581 -81215 -94816 -47972 -36477
5320c6477j7903j6700O089P1083N1151L081m3896p6548L0796J7396k4603M41J172
$$ -36477 -54380 -71080 -64991 6092 57243 60324 16428 -60120 -29324 -11928 -36531 -36090 -34918
5307c4918q316L9219N607m4696l8494p578o886M9267j9139L3240J7908l85k2675
$$ -34918 -43234 -4015 1592 -43104 -81598 -89176 -96062 -46795 -65934 -32694 -14786 -15171 -37846
5294c7846J5358q848l5847Q457o619l7182P249l730M7255N2132k513m6023k6893
$$ -37846 -22488 -31336 -67183 -58726 -65345 -102527 -95278 -99008 -51753 379 -2134 -48157 -75050
5281g5050M5087K7466o898k8320m8724L3853P8910L2684o146p8894j9294j0926
$$ -75050 -29963 -2497 -9395 -37715 -86439 -52586 26324 59008 52862 -26032 -45326 -56252
5269e6252J2942k0451m7673j2261O2551M9561l0538q246j9560J8987K2052L2610
$$ -56252 -43310 -63761 -111434 -123695 -61144 -11583 -42121 -50367 -69927 -50940 -28888 3722
5257C722k2936N7564K9015k4282l0452l8649L6494P6349r186k5678o241n8572
$$ 3722 -19214 38350 67365 43083 12631 -26018 10476 86825 77639 51961 45720 -12852
5245a2852l9415l6321N9006k3235k846J917J6480l9228l708J3931J2657M6465
$$ -12852 -52267 -88588 -29582 -52817 -55663 -53746 -37266 -76494 -80202 -66271 -53614 -7149
5233g149L3526J7282L90j1036l656j4150o2564k1013J1373O7640p78K8500J5682
$$ -7149 26377 43659 44049 33013 29357 15207 -47357 -68370 -56997 10643 9865 38365 54047
5220E4047K2377l9085n0127l6494K4573J1114J537l1641J7578K8450L1176n248
$$ 54047 76424 37339 -12788 -49282 -24709 -13595 -12058 -43699 -26121 2329 33505 28257
5208B8257k9601n1476M040J8265l41L9672k0902N3808j9752m1110M0801K5335
$$ 28257 -1344 -52820 -48780 -30515 -30856 8816 -12086 41722 21970 -19140 21661 46996
5196D6996n957j5361L3051l954j9022n0016m3738K3214L6869M6163O462q1883
$$ 46996 41039 25678 58729 54775 35753 -14263 -58001 -34787 2082 48245 54707 -27176
5184b7176o7185q958M8691L0422J6533K1755P811l3396l1809p248N643Q299l770
$$ -27176 -94361 -103319 -54628 -24206 -7673 14082 21893 -11503 -43312 -50560 -44917 -36618 -40388
5171d0388l1547M3403O2006l3555n0833m2242n0989j6837O3486N4321L2763k1494
$$ -40388 -71935 -28532 33474 -81 -50914 -93156 -144145 -160982 -97496 -43175 -10412 -31906
5159c1906J2692J6992m0097l0936K5935L5743r983r511k3014l575K4477l6570
$$ -31906 -19214 -2222 -42319 -73255 -47320 -11577 -21560 -31071 -54085 -57660 -33183 -69753
5147f9753j1661J1507K3729M6011P674P897J7760j610M4554l757l6526l8218p043
$$ -69753 -81414 -69907 -46178 -167 7507 15404 33164 31554 76108 72351 35825 -2393 -9436
5134i436L4723o898l4083j3040o89J166M3375k6957j8835m6044L2133Q114j7421
$$ -9436 25287 18389 -15694 -28734 -29423 -28257 15118 -11839 -30674 -76718 -44585 -36471 -53892
5121e3892J8490J9276J0086O1069m1026l6006M524J0205L6821L0458n1692j4636
$$ -53892 -35402 -16126 -6040 55029 14003 -22003 -17479 -7274 29547 60005 8313 -6323
5109f323P90k9571P740J609M643L324k2284j2383K8569L9817N520m0514j9883
$$ -6323 -5533 -35104 -27364 -25755 -21112 -17788 -40072 -52455 -23886 15931 21451 -19063 -38946
5096c8946r793k2345L0560M5906j5091l6266O132J8025Q378R668j0214L7660l3955
$$ -38946 -48739 -71084 -40524 5382 -9709 -45975 -39843 -21818 -13440 -3772 -13986 23674 -10281
5083a0281K152J2139K0689N0006M83J301k6515m9928k4988K1940N9912J9105j9523
$$ -10281 -8129 4010 24699 74705 75188 76489 49974 46 -24942 -3002 56910 76015 56492
5070E6492k661j2342k2666p3761j8244K8210J7487l74O569j3338J2017n053L6651
$$ 56492 53831 41489 18823 -54938 -73182 -44972 -27485 -27859 -21290 -34628 -22611 -27664 8987
5057H987J1301l7683K4312j6489m8250M1011J3097j0787L9633l4457m3328m3480
$$ 8987 20288 -17395 6917 -9572 -57822 -16811 -3714 -14501 25132 -9325 -52653 -96133
5045i6133n497M6705j1626M0673M8904q520l5171o8093o369J0216L956k8643L3764
$$ -96133 -101630 -54925 -66551 -25878 23026 14506 -20665 -88758 -95127 -84911 -80955 -109598 -75834
5032g5834O551K9377J3201K7173J8250J7207m182n665k7435J5978O205m848l1937
$$ -75834 -69283 -39906 -26705 468 18718 35925 31743 26078 -1357 14621 20826 15978 -15959
5019a5959p265Q073k472J2574J7604Q934k3834n8304k0394K7623R093q5308l9566
$$ -15959 -23224 -15151 -17623 -5049 12555 21489 -2345 -60649 -81043 -53420 -44327 -129635 -169201
5006a69201L5438N0718J2455r8N2857K2917m9693l3494l869P4602j4276p7751
$$ -169201 -133763 -83045 -70590 -70688 -17831 5086 -44607 -78101 -81970 -7368 -21644 -99395
4994i9395L0371P5966l974Q167M142N347m0740l2123r3718k2215M5784O1875O6035
$$ -99395 -69024 6942 2968 11135 15277 20624 -20116 -52239 -145957 -168172 -122388 -60513 5522
4981E522j8635P0M5955J671j7476k8534k0359o2834K3559J7216p670k85j5165
$$ 5522 -13113 -13043 32912 34583 17107 -11427 -31786 -94620 -71061 -53845 -61515 -61800 -76965
$$ [...]
##END NTUPLES=NMR SPECTRUM
##END=
