##TITLE=Analysis number 330279
Compound Code cc 68410
Book Reference 437/102
Project Code adrs
Chemist Name wendyb
##JCAMPDX= 6.0         $$ Bruker NMR JCAMP-DX V2.0
##DATA TYPE= NMR SPECTRUM
##DATA CLASS= NTUPLES
##ORIGIN= Bruker BioSpin GmbH
##OWNER= nmr
$$ XWIN-NMR		Version 3.5
$$ Tue Nov 13 09:37:11 2007 GMT Standard Time (UT+0h)  MAYBRIDGE\nmr@NMR_250MHZ
##.OBSERVE FREQUENCY= 250.131544655141
##.OBSERVE NUCLEUS= ^1H
##.ACQUISITION MODE= SIMULTANEOUS (DQD)
##.ACQUISITION SCHEME= undefined
##.AVERAGES= 16
##.DIGITISER RES= 18
##SPECTROMETER/DATA SYSTEM= dpx250
##.PULSE SEQUENCE= zg30
##.SOLVENT NAME= CDCl3
##.SHIFT REFERENCE= (INTERNAL, CDCl3, 0, 16.522)
##AUDIT TRAIL= $$ (NUMBER, WHEN, WHO, WHERE, WHAT)
$$ ##TITLE= Audit trail, XWIN-NMR		Version 3.5
$$ ##JCAMPDX= 5.01
$$ ##ORIGIN= Bruker BioSpin GmbH
$$ ##OWNER= nmr
$$ C:\u/data/dgb/nmr/ADRS/560/pdata/1/auditp.txt
$$ ##AUDIT TRAIL=  $$ (NUMBER, WHEN, WHO, WHERE, WHAT)
(   1,<2007-11-13 09:36:42.87 +000>,<MAYBRIDGE\nmr>,<NMR_250MHZ>,
      <created by zg, POWCHK disabled, PULCHK disabled
       configuration hash MD5:
       76 6E 9A 78 1E 09 19 81 EC 84 63 8F B0 6A 59 2D
       data hash MD5: 64K
       E8 9E 18 0C E5 1E 88 E8 77 29 F4 46 EE ED E1 6A>)
(   2,<2007-11-13 09:36:58.68 +000>,<MAYBRIDGE\nmr>,<NMR_250MHZ>,
      <Start of raw data processing
       ef LB = 0.3 FT_mod = 6 PKNL = 1 SI = 32K 
       data hash MD5: 32K
       8D 8B 72 DB BA CF 06 F3 B3 B5 8D 8A EF EA 26 A4>)
(   3,<2007-11-13 09:37:00.23 +000>,<MAYBRIDGE\nmr>,<NMR_250MHZ>,
      <apk 
       data hash MD5: 32K
       B1 88 27 72 C9 19 F2 0F CA 9C 53 35 1A B8 1F 1C>)
(   4,<2007-11-13 09:37:00.96 +000>,<MAYBRIDGE\nmr>,<NMR_250MHZ>,
      <abs ABSG = 5 
       data hash MD5: 32K
       95 55 A1 96 AD F4 0A 6E 9B ED 28 E5 E3 7D 9A C2>)
$$ ##END=
$$ 
$$ hash MD5
$$ DE 68 DC E2 82 9A 80 C9 CD 37 4E 32 4F A6 10 B3
##$RELAX= 
##$RELAX= 
##$RELAX= 
##$RELAX= 
##$RELAX= 
##$RELAX= 
##$RELAX= 
$$ Bruker specific parameters
$$ --------------------------
##$DU= <C:\u>
##$EXPNO= 560
##$NAME= <ADRS>
##$PROCNO= 1
##$TYPE= <nmr>
##$USER= <dgb>
##$AMP= (0..31)
100 100 100 100 100 100 100 100 100 100 100 100 100 100 100 100 100 100 
100 100 100 100 100 100 100 100 100 100 100 100 100 100 
##$AQSEQ= 0
##$AQ_mod= 3
##$AUNM= <au_zg>
##$AUTOPOS= <2 >
##$BF1= 250.13
##$BF2= 250.13
##$BF3= 250.13
##$BF4= 250.13
##$BF5= 500.13
##$BF6= 500.13
##$BF7= 500.13
##$BF8= 500.13
##$BYTORDA= 1
##$CFDGTYP= 0
##$CFRGTYP= 5
##$CHEMSTR= <none>
##$CNST= (0..31)
1 1 145 1 1 1 1 1 1 1 1 1 1 1 1 1 1 1 1 1 1 1 1 1 1 1 1 1 1 1 1 1 
##$CPDPRG= <>
##$CPDPRG1= <>
##$CPDPRG2= <>
##$CPDPRG3= <>
##$CPDPRG4= <mlev>
##$CPDPRG5= <mlev>
##$CPDPRG6= <mlev>
##$CPDPRG7= <mlev>
##$CPDPRG8= <mlev>
##$CPDPRGB= <>
##$CPDPRGT= <>
##$D= (0..31)
0 1 0 0 0 0 0 0 0 0.06 0 0 0 0 0 0 0.0002 0 0 0 0 0 0 0 0 0 0 0 0 0 0 
0 
##$DATE= 1194946601
##$DBL= (0..7)
120 120 120 120 120 120 120 120 
##$DBP= (0..7)
150 150 150 150 150 150 150 150 
##$DBP07= 0
##$DBPNAM0= <>
##$DBPNAM1= <>
$$ [...]
##$SUBNAM7= <"">
##$SUBNAM8= <"">
##$SUBNAM9= <"">
##$SW= 20.6930455092707
##$SWIBOX= (0..15)
0 0 3 0 0 0 0 0 0 0 0 0 0 0 0 0 
##$SW_h= 5175.983436853
##$TD= 65536
##$TD0= 1
##$TE= 295.16
##$TE2= 300
##$TE3= 300
##$TEG= 300
##$TL= (0..7)
0 120 120 120 120 120 120 120 
##$TP= (0..7)
150 150 150 150 150 150 150 150 
##$TP07= 0
##$TPNAME0= <>
##$TPNAME1= <>
##$TPNAME2= <>
##$TPNAME3= <>
##$TPNAME4= <>
##$TPNAME5= <>
##$TPNAME6= <>
##$TPNAME7= <>
##$TPOAL= (0..7)
0.5 0.5 0.5 0.5 0.5 0.5 0.5 0.5 
##$TPOFFS= (0..7)
0 0 0 0 0 0 0 0 
##$TUNHIN= 0
##$TUNHOUT= 0
##$TUNXOUT= 0
##$USERA1= <user>
##$USERA2= <user>
##$USERA3= <user>
##$USERA4= <user>
##$USERA5= <user>
##$V9= 5
##$VALIST= <valist>
##$VCLIST= <CCCCCCCCCCCCCCC>
##$VD= 0
##$VDLIST= <DDDDDDDDDDDDDDD>
##$VPLIST= <PPPPPPPPPPPPPPP>
##$VTLIST= <TTTTTTTTTTTTTTT>
##$WBST= 1024
##$WBSW= 4
##$XGAIN= (0..3)
0 0 0 0 
##$XL= 0
##$YL= 0
##$YMAX_a= 186587
##$YMIN_a= -279587
##$ZGOPTNS= <>
##$ZL1= 120
##$ZL2= 120
##$ZL3= 120
##$ZL4= 120
##$ABSF1= 16.522
##$ABSF2= -4.171173
##$ABSG= 5
##$ABSL= 3
##$ALPHA= 0
##$AQORDER= 0
##$ASSFAC= 0
##$ASSFACI= 0
##$ASSFACX= 0
##$ASSWID= 0
##$AUNMP= <proc_1d>
##$AZFE= 0.1
##$AZFW= 0.1
##$BCFW= 0
##$BC_mod= 0
##$BYTORDP= 0
##$COROFFS= 0
##$CY= 12.5
##$DATMOD= 1
##$DC= 0
##$DFILT= <>
##$DTYPP= 0
##$F1P= 14.0000005364418
##$F2P= -0.99999901652339
##$FCOR= 0.5
##$FTSIZE= 32768
##$FT_mod= 6
##$GAMMA= 0
##$GB= 0
##$INTBC= 1
##$INTSCL= 1
##$ISEN= 128
##$LB= 0.3
##$LEV0= 0
##$LPBIN= 0
##$MAXI= 10000
##$MC2= 0
##$MEAN= 0
##$ME_mod= 0
##$MI= 0
##$NCOEF= 0
##$NC_proc= -3
##$NLEV= 6
##$NOISF1= 0
##$NOISF2= 0
##$NSP= 0
##$NTH_PI= 0
##$NZP= 0
##$OFFSET= 16.522
##$PC= 1
##$PHC0= 175.4761
##$PHC1= 5.747771
##$PH_mod= 1
##$PKNL= yes
##$PPARMOD= 0
##$PSCAL= 4
##$PSIGN= 0
##$REVERSE= no
##$SF= 250.13
##$SI= 32768
##$SIGF1= 0
##$SIGF2= 0
##$SINO= 400
##$SIOLD= 32768
##$SREGLST= <1H.CDCl3>
##$SSB= 0
##$STSI= 32768
##$STSR= 0
##$SW_p= 5175.98343685301
##$SYMM= 0
##$S_DEV= 0
##$TDeff= 65536
##$TDoff= 0
##$TI= <Analysis number 999999
Compound Code 99
Book Reference 9
Project Code 9>
##$TILT= no
##$TM1= 0
##$TM2= 0
##$TOPLEV= 0
##$USERP1= <user>
##$USERP2= <user>
##$USERP3= <user>
##$USERP4= <user>
##$USERP5= <user>
##$WDW= 1
##$XDIM= 32768
##$YMAX_p= 443429088
##$YMIN_p= -455458
$$ End of Bruker specific parameters
$$ ---------------------------------
##NTUPLES= NMR SPECTRUM
##VAR_NAME=  FREQUENCY,     SPECTRUM/REAL,   SPECTRUM/IMAG
##SYMBOL=    X,             R,               I
##VAR_TYPE=  INDEPENDENT,   DEPENDENT,       DEPENDENT
##VAR_FORM=  AFFN,          ASDF,            ASDF
##VAR_DIM=   32768,         32768,           32768
##UNITS=     HZ,            ARBITRARY UNITS, ARBITRARY UNITS
##FACTOR=    0.157963299565203, 1,           1
##FIRST=     4132.6476996994, 0,             0
##LAST=      -1043.33573715361, 0,           0
##MIN=       -1043.33573715361, -455458,     0
##MAX=       4132.6476996994, 443429088,     0
$$ Real data points
##PAGE= N=1
##DATA TABLE= (X++(R..R)), XYDATA
$$ [...]
$$ plain form
16961 -35995 -21286 12073 43519 40696 3808 5308 17221 26853 11215 -28973 -69769 -68207
16949 -68207 -44674 -12936 9452 25068 27211 21636 31643 23471 994 16390 -6317 -14751
16937 -14751 -10822 7665 74097 70307 51719 25093 4144 -61500 -112392 -93304 -85430 -100055
16925 -100055 -41393 9136 47638 58286 31176 11169 -12732 -45277 -71116 -60328 -63794 -57521
16913 -57521 -18988 -5651 1559 -10753 -48845 -64984 -32717 -40754 -82176 -103472 -97883 -98583 -95553
16900 -95553 -81155 -68704 -40371 -35389 -26872 -50671 -64696 -57972 -35021 -34387 -64761 -28363 -8027
16887 -8027 -11650 -3174 47625 16572 42398 44098 -2501 -15622 -7881 1891 11510 5278 7609
16874 7609 29136 40903 -4694 -12553 -30374 -68245 -111724 -98893 -6179 -18816 -42623 -53888
$$ packed form
16961c5995J4709L3359L1446k823l6888J500J1913R632j5638m0188m0796J562
16949f8207K3533L1738K2388J5616K143n575J0007q172k2477J5396k2707q434
16937a4751L929J8487O6432l790j8588k6626k0949o5644n0892J9088P874j4625
16925a00055N8662N0529L8502J0648k7110k0007k3901l2545k5839J0788l466O273
16913e7521L8533J3337P210j2312l8092j6139L2267q037m1422k1296N589p00L030
16900i5553J4398J2451K8333M982Q517k3799j4025O724K2951O34l0374L6398K0336
16887h027l623Q476N0799l1053K5826J700m6599j3121P741R772R619o232K331
16874G609K1527J1767m5597p859j7821l7871m3479J2831R2714j2637k3807j1265
$$ plain form
16862 -53888 -59589 -48982 -7284 29175 940 34072 45830 41246 77952 35503 -10277 -25313
16850 -25313 -6309 -14271 -54093 -91163 -39328 -34774 -36576 43142 124475 97151 46873 32883
16838 32883 2558 22133 36343 15373 8639 -17741 -25278 -58057 -37752 -36000 -36851 -43922 -15580
16825 -15580 5614 50588 28892 -7868 7900 32266 49399 37108 -4090 -6116 19609 37981
16813 37981 41079 35863 22060 19046 19135 -4556 -50456 -19440 -10189 -30889 -21468 15984 11437
16800 11437 -7572 30361 23661 23183 16766 3450 13045 -6125 5006 10110 -2455 20692 9742
16787 9742 -12828 -23694 -42999 -48772 -74332 -63861 -52638 -38014 -7085 8441 25619 36091
16775 36091 10768 -4272 -11910 -50225 -23566 -1359 7807 3637 17875 11426 5530 -9304 -32944
$$ packed form
16862e3888n701J0607M1698L6459k8235L3132J1758m584L6706m2449m5780j5036
16850b5313J9004p962l9822l7070N1835M554j802P9718Q1333k7324n0278j3990
16838C2883l0325J9575J4210k0970o734k6380p537l2779K0305J752q51p071K8342
16825a5580K1194M4974k1696l6760J5768K4366J7133j2291m1198k026K5725J8372
16813C7981L098n216j3803l014Q9k3691m5900L1016R251k0700R421L7452m547
16800A1437j9009L7933o700m78o417j3316R595j9170J1131N104j2565K3147j0950
16787I742k2570j0866j9305n773k5560J0471J1223J4624L0929J5526J7178J0472
16775C6091k5323j5040p638l8315K6659K2207R166m170J4238o449n896j4834k3640
$$ plain form
16762 -32944 -127 22826 -2682 -16580 -21349 -38070 -42895 -16649 -2429 -39037 -39931 -12874
16750 -12874 -36525 -374 -33659 -49582 -39570 -58889 -62078 -25533 -15357 -27521 -33953 -50519
16738 -50519 -62672 -27152 -49910 -70927 -51098 -22297 -56308 -79928 -16647 1422 4884 18441
16726 18441 -16645 -36227 -72626 -82899 -67154 -96190 -88299 -100072 -72495 -9196 30477 76342
16714 76342 65846 35767 42835 54168 9019 -32093 9837 28734 1535 -2661 -4744 -514
16702 -514 -21663 -21862 -31327 46052 53818 53534 40868 47404 2227 -77633 -98458 -46049 -23311
16689 -23311 -63410 -48347 -29110 -41372 -2378 -2959 53957 59331 53067 15355 -18400 -21588 -5789
16676 -5789 16575 -766 -33578 -14886 10404 26385 28815 55957 48258 51203 23615 -19262
$$ packed form
16762c2944L2817K2953k5508j3898m769j6721m825K6246J4220l6608q94K7057
16750a2874k3651L6151l3285j5923J0012j9319l189L6545J0176j2164o432j6566
16738e0519j2153L5520k2758k1017J9829K8801l4011k3620O3281J8069L462J3557
16726A8441l5086j9582l6399j0273J5745k9036P891j1773K7577O3299L9673M5865
16714G6342j0496l0079P068J1333m5149m1112M1930J8897k7199m196k083M230
16702e14k1149j99r465P7379P766k84j2666O536m5177p9860k0825N2409K2738
16689b3311m0099J5063J9237j2262L8994n81N6916N374o264l7712l3755l188J5799
16676e789K2364j7341l2812J8692K5290J5981K430K7142p699K945k7588m2877
$$ plain form
16664 -19262 -7860 15821 -5579 -35180 -40180 -19497 -24654 -49103 -27331 -17768 -37800 -39894
16652 -39894 -59184 -55682 1038 10553 -2736 38181 49899 19104 21443 49827 19584 11604
16640 11604 469 -15517 -18459 -27488 -17564 -46284 -59858 25333 42143 33538 19794 27826 5374
16627 5374 23417 35665 48598 69510 56596 31950 47294 6253 17821 36119 28927 -6444
16615 -6444 -26341 -64823 -87704 -87558 -97202 -78356 -62805 -69569 -60343 -29479 -54313 -67053 -43560
16602 -43560 7151 14291 8623 25911 38493 21441 -6144 25901 17112 27759 21341 -15914
16590 -15914 -48304 -53979 -53585 -52086 -43264 -11656 -45297 -57222 -36792 -48102 -69446 -40568 11305
16577 11305 17648 -13580 -17894 -16019 -40917 -47742 -9457 56915 58487 43234 57000 17883 -39017
$$ packed form
16664a9262J1402K3681k1400k9601n000K0683n157k4449K1772R563k0032k094
16652c9894j9290L502N6720R515j3289M0917J1718l0795K339K8384l0243p980
16640A1604j1135j5986k942r029R924k8720j3574Q5191J6810q605j3744Q032k2452
16627E374J8043J2248J2933K0912j2914k4646J5344m1041J1568J8298p192l5371
16615f444j9897l8482k2881J46r644J8846J5551o764R226L0864k4834j2740K3493
16602d3560N0711P140n668J7288J2582j7052k7585L2045q789J0647o418l7255
16590a5914l2390n675L94J499Q822L1608l3641j1925K0430j1310k1344K8878N1873
16577A1305O343l1228m314J875k4898o825L8285O6372J572j5253J3766l9117n6900
$$ plain form
16564 -39017 -60918 -69805 -67684 -49540 -29794 -21887 24166 35551 11059 -4093 -9169 -21662
16552 -21662 -20217 -70356 -41719 -2362 28923 48891 76229 79848 78394 50537 21116 39985
16540 39985 11671 -22362 -18904 18396 40773 62505 72960 46020 30494 58016 37414 42732
16528 42732 68191 65685 44378 41564 24794 -30042 -52294 3943 46268 32846 18602 -30198
16516 -30198 -61643 -56107 -52930 -29717 -63602 -95868 -58571 -21100 -4065 11442 12786 4517
16504 4517 -5331 -32064 -32166 -62232 -93900 -54358 3487 -13906 -9284 -19176 -20012 5658 64885
16491 64885 49401 45297 62094 17127 26022 75382 99199 24489 -14136 -13832 2889 -8488
16479 -8488 -10847 -21909 -39501 -38747 -24438 -29720 -24061 -36588 -4522 23636 5865 -1811 1455
$$ packed form
16564c9017k1901q887K121J8144J9746P907M6053J1385k4492j5152n076j2493
16552b1662J445n0139K8637L9357L1285J9968K7338L619j454k7857k9421J8869
16540C9985k8314l4033L458L7300K2377K1732J0455k6940j5526K7522k0602N318
16528D2732K5459k506k1307k814j6770n4836k2252N6237M2325j3422j4244m8800
16516c0198l1445N536L177K3213l3885l2266L7297L7471J7035J5507J344q269
16504D517r848k6733j02l0066l1668L9542N7845j7393M622r892q36K5670N9227
16491F4885j5484m104J6797m4967Q895M9360K3817p4710l8625L04J6721j1377
16479h488k359j1062j7592P54J4309n282N659j2527L2066K8158j7771p676L266
$$ plain form
16466 1455 -24414 -21860 -11410 14280 -18788 -3776 12276 16744 -21320 -15772 -20028 -34487 -5406
16453 -5406 20542 9745 41334 30159 -12661 -27627 35190 59678 70115 59035 43390 20942
16441 20942 -10513 21511 -7709 -30164 -54181 -57316 -50831 -45714 -31995 -29793 24297 30214 15457
16428 15457 -24267 -26579 -14430 14960 19530 52671 46898 15451 10460 39070 19166 9448 50835
16415 50835 66876 34975 23625 38637 7867 5998 11104 15185 35946 17907 -17558 11281
16403 11281 70878 65455 -4019 -27967 -42886 -98178 -96857 -66102 -23784 -30306 -17063 -26381
16391 -26381 -10017 20668 55471 81950 44120 5579 16569 40070 15320 -12212 -29191 -33810
16379 -33810 -6522 -12201 -24950 7381 -11329 -7006 -2861 5625 -1280 -44632 -28450 -9598 23423
$$ packed form
16466A455k5869K554J0450K5690l3068J5012J6052M468l8064N548m256j4459K9081
16453e406K5948j0797L1589j1175m2820j4966O2817K4488J0437j1080j5645k2448
16441B0942l1455L2024k9220k2455k4017l135O485N117J3719K202N4090N917j4757
16428A5457l9724k312J2149K9390M570L3141n773l1447m991K8610j9904r718M1387
16415E0835J6041l1901j1350J5012l0770j869N106M081K0761j8039l5465K8839
16403A1281N9597n423o9474k3948j4919n5292J321L0755M2318o522J3243r318
16391b6381J6364L0685L4803K6479l7830l8541J0990K3501k4750k7532j6979m619
16379c3810K7288n679j2749L2331j8710M323M145Q486o905m3352J6182J8852L3021
$$ plain form
16366 23423 3958 4260 12436 20736 3430 -42867 -47508 -33419 -52543 -83392 -69173 -11884 36900
16353 36900 26490 13262 22779 31790 -308 -15701 -7103 -911 10876 16511 19600 30233 28536
16340 28536 15330 17256 31429 45693 30891 21195 52762 24175 -31575 -75210 -106594 -66723
16328 -66723 -43503 -49170 -45380 -36551 8187 -10028 -18482 -53541 -94026 -83802 -29480 -17888
16316 -17888 -34881 -52033 -60229 -77952 -41454 -20477 -63206 -59376 -9194 19102 44797 46686
16304 46686 8542 23539 2716 -41071 -12794 4823 28049 43617 39881 4440 -56073 -27176
16292 -27176 21244 68984 70989 -916 -25433 -11839 15545 30609 21871 18794 25809 8308
16280 8308 -10779 -16735 40672 69073 48222 49024 33792 -3204 -27973 -37691 -45704 -43850 -53401
$$ packed form
16366B3423j9465L02Q176Q300j7306m6297m641J4089j9124l0849J4219N7289M8784
16353C6900j0410j3228R517R011l2098j5393Q598O192J1787N635L089J0633j697
16340B8536j3206J926J4173J4264j4802r696L1567k8587n5750m3635l1384L9871
16328f6723K3220n667L790Q829M4738j8215q454l5059m0485J0224N4322J1592
16316a7888j6993j7152q196j7723L6498K0977m2729L830N0182K8296K5695J889
16304D6686l8144J4997k0823m3787K8277J7617K3226J5568l736l5441o0513K8897
16292b7176M8420M7740K005p1905k4517J3594K7384J5064q738l077P015j7501
16280H308j9087n956N7407K8401k0851Q02j5232l6996k4769r718q013J854r551
$$ plain form
16267 -53401 -57865 -72728 -52917 -52063 -34922 -29962 -47689 -53077 -46766 -17223 -28810 -88206 -116824
16254 -116824 -57257 -128 -17458 -18602 -4956 -23132 -4539 -257 -11578 -44881 -73856 -68461
16242 -68461 -63493 -66082 -60074 -22020 -33679 24373 49061 62445 12459 -28640 -39987 -73828
16230 -73828 -117594 -79758 -31622 -24264 -55620 -77397 -7932 46446 51033 28091 37241 15631
16218 15631 -26948 -17620 -12539 -3334 18112 38207 11261 22707 15519 19580 30099 32532 53413
16205 53413 20794 -13294 -8289 -9073 7495 38950 20049 -16215 -47189 -56196 -35351 -24708
16193 -24708 -35139 -64074 -70414 -47749 -40738 8983 40385 -22534 -78585 -59655 -71980 -62609
16181 -62609 -35346 -19203 19474 53089 30764 24529 -11186 -24725 -54336 -78477 -99291 -77088
$$ packed form
16267e3401m464j4863J9811Q54J7141M960j7727n388O311K9543j1587n9396k8618
16254a16824N9567N7129j7330j144J3646j8176J8593M282j1321l3303k8975N395
16242f8461M968k589O008L8054j1659N8052K4688J3384m9986m1099j1347l3841
16230g3828m3766L7836M8136P358l1356k1777O9465N4378M587k2942R150k1610
16218A5631m2579R328N081R205K1446K0095k6946J1446p188M061J0519K433K0881
16205E3413l2619l4088N005p84J6568L1455j8901l6264l0974r007K0845J0643
16193b4708j0431k8935o340K2665P011M9721L1402o2919n6051J8930j2325R371
16181f2609K7263J6143L8677L3615k2325o235l5715j3539k9611k4141k0814K2203
$$ plain form
16169 -77088 -53069 -25365 -39008 -5686 8175 10350 -9781 -23753 4084 10001 -23642 -1601
16157 -1601 21187 6456 -11335 13674 15273 18006 15630 -16994 -10384 -19868 13470 8113 -9207
16144 -9207 -20580 -13297 -23235 -23524 -17995 -46894 -56015 -48884 -11972 -41011 -36063 -28986 -4688 -33223
16130 -33223 1463 35136 22498 2496 29961 52522 86227 75577 70666 49684 12133 -17045
16118 -17045 -30912 -22406 -6707 24810 35932 43377 46297 6894 -46836 -45922 -41146 -35267 -62121
16105 -62121 -51269 -31142 -11465 7514 52801 47340 -5340 -8795 -17255 -39160 -52626 -48413
16093 -48413 -96161 -127138 -93474 -78097 -23305 -9556 -46499 -44987 -39860 -35833 -28956 -17119
16081 -17119 -7467 -39489 -53263 -22339 -2841 24559 -9206 -37242 -52438 -20382 33341 16079
$$ packed form
16169g7088K4019K7704j3643L3322J3861K175k0131j3972K7837N917l3643K2041
16157a601K2788j4731j7791K5009J599K733k376l2624O610r484L3338n357j7320
16144i207j1373P283r938k89N529k8899r121P131L6912k9039M948P077K4298k8535
16130c3223L4686L3673j2638k0002K7465K2561L3705j0650m911k0982l7551k9178
16118a7045j3867Q506J5699L1517J1122P445K920l9403n3730R14M776N879k6854
16105f2121J0852K0127J9677J8979M5287n461n2680l455q460k1905j3466M213
16093d8413m7748l0977L3664J5377N4792J3749l6943J512N127M027O877J1837
16081a7119R652l2022j3774L0924J9498K7400l3765k8036j5196L2056N3723j7262
$$ plain form
16069 16079 -27830 -42937 -24493 -33755 -38586 -18605 -29290 -5587 9202 -42077 -84262 -100098
16057 -100098 -124474 -104392 -55702 -1225 -26178 -69249 -42717 983 3234 5471 11215 -7648
16045 -7648 -40918 -33351 -45140 -46462 -30348 -21270 -20862 -9196 -30443 -39681 -35487 -28178 -67017
16032 -67017 -87873 -27500 12172 68100 47293 42399 44246 55267 15973 5049 21424 5892
16020 5892 11367 -4020 -18159 13892 5890 -29483 -33101 -31437 17951 -6761 -33093 -19077 -45303
16007 -45303 -45239 -19378 28769 20951 35033 18957 -14059 -44282 -17728 -8151 -11030 5489 -5561
15994 -5561 4184 4455 21571 52125 26897 10162 8058 7100 4286 21858 22933 10273 -5679
15981 -5679 -15515 -10512 -3216 -414 -12108 21036 53127 21980 1242 13497 4315 -620 4864
$$ packed form
16069A6079m3909j5107J8444r262m831J9981j0685K3703J4789n1279m2185j5836
16057a00098k4376K0082M8690N4477k4953m3071K6532M3700K251K237N744j8863
16045g648l3270P567j1789j322J6114R078M08J1666k1247r238M194P309l8839
16032f7017k0856O0373L9672N5928k0807m894J847J1021l9294j0924J6375j5532
16020E892N475j5387j4139L2051q002l5373l618J664M9388k4712k6332J4016k6226
16007d5303O4K5861M8147p818J4082j6076l3016l0223K6554R577k879J6519j1050
15994e561R745K71J7116L0554k5228j6735k104r58k814J7572J075j2660j5952
15981e679r836N003P296K802j1694L3144L2091l1147k0738J2255r182m935N484
$$ plain form
15968 4864 -9870 -44060 -43068 -45779 -81225 -94532 -37316 -28717 -79671 -57460 -16174 29201 72698
15955 72698 87028 70612 33004 15765 3448 25703 59979 52106 33855 10309 16986 25450
15943 25450 29822 46351 24572 19259 44283 16434 -19845 -42336 -10094 12578 -3168 19289
15931 19289 43263 39046 -4331 -55976 -66745 -41646 -1531 -16301 10233 -14226 -21083 -20959
15919 -20959 10901 8218 -45121 -40265 -29339 -49966 -17228 11067 -24496 -63620 -48555 -6378
15907 -6378 -2287 18547 20685 5230 -11171 -18419 -24414 -68414 -89921 -94764 -42872 15396 32992
15894 32992 38209 18745 2133 1065 -27661 -16495 -10181 -23000 -46940 -17251 -30530 -37404
15882 -37404 5078 40094 74557 71848 70579 90938 68233 25790 33765 -16763 -8498 -11230 -41336
$$ packed form
15968D864j4734l4190R92k711l5446j3307N7216Q599n0954K2211M1286M5375M3497
15955G2698J4330j6416l7608j7239j2317K2255L4276p873j8251k3546O677Q464
15943B5450M372J6529k1779n313K5024k7849l6279k2491L2242K2672j5746K2457
15931A9289K3974m217m3377n1645j0769K5099M0115j4770K6534k4459o857J24
15919b0959L1860k683n3339M856J0926k0627L2738K8295l5563l9124J5065M2177
15907f378M091K0834K138j5455j6401p248n995m4000k1507m843N1892N8268J7596
15894C2992N217j9464j6612j068k8726J1166O314j2819k3940K9689j3279o874
15882c7404M2482L5016L4463k709j269K0359k2705m2443P975n0528Q265k732l0106
$$ plain form
15869 -41336 -43405 -31321 -25977 -3447 24063 25879 41929 25992 2090 19037 39785 20623
15857 20623 14880 -5160 -31905 -3534 23403 10988 -3803 38685 73289 43225 -8867 -7405
15845 -7405 -38713 -52915 -46315 -32343 4875 15055 3962 -13 5711 22294 36326 21229
15833 21229 25529 12205 -46538 -42738 -4604 39477 51382 34326 8993 -13561 4135 23782
15821 23782 -1164 -96379 -101490 -60326 -65023 -39259 -5639 -7659 -14857 -25794 -14075 -4303 7681
15808 7681 15604 40112 37102 32184 28540 35948 22275 35235 33927 26204 37274 42094 49977 9491
15794 9491 -17643 -5324 -21951 -50069 -39394 -37189 -29911 -51292 -86727 -84409 -39536 4647
15782 4647 46935 80935 39429 22327 9690 -79113 -88053 -109331 -90021 -11533 2857 -5981
$$ packed form
15869d1336k069J2084N344K2530K7510J816J6050j5937k3902J6947K0748j9162
15857B0623n743k0040k6745K8371K6937j2415j4791M2488L4604l0064n2092J462
15845g405l1308j4202O600J3972L7218J0180j1093l975N724J6583J4032j5097
15833B1229M300j3324n8743L800L8134M4081J1905j7056k5333k2554J7696J9647
15821B3782k4946r5215n111M1164m697K5764L3620k020p198j0937J1719R772J1984
15808G681P923K4508l010m918l644P408j3673J2960j308p723J1070M820P883m0486
15794I491k7134J2319j6627k8118J0675K205P278k1381l5435K318M4873M4183
15782D647M2288L4000m1506j7102j2637q8803q940k1278J9310P8488J4390q838
$$ plain form
15770 -5981 -539 936 -10740 -28349 -12904 20866 -3348 -42471 -44883 -44938 -60739 -58100 17121
15757 17121 51440 43963 -10075 -53825 -31647 -11754 -18956 -106881 -139443 -69517 -44884 -31420
15745 -31420 -22343 7942 49134 166 -20783 -28543 -38970 -40054 -30235 -578 13627 12570 -6009
15732 -6009 -31794 -53678 -73427 -108480 -144721 -143168 -149421 -136885 -79227 -34735 11104 43273
15720 43273 58756 62529 38353 24132 4146 -18729 -21372 -10689 -27871 -62042 -47332 -40944
15708 -40944 -8976 -8212 -21707 20748 9722 -32009 -44483 -15250 3246 -17096 -24615 28667
15696 28667 35176 3603 10589 29326 35982 2871 -16699 -1712 28026 11702 -16710 -13666
15684 -13666 18625 -19408 -59260 -38704 -6138 197 23866 -40 -5033 -55287 -58702 -14901
$$ packed form
15770e981N442J475j1676j7609J5445L3770k4214l9123k412n5j5801K639P5221
15757A7121L4319p477n4038m3750K2178J9893p202q7925l2562O9926K4633J3464
15745c1420R077L0285M1192m8968k0949p760j0427j084R819K9657J4205j057j8579
15732f009k5785k1884j9749l5053l6241J553o253J2536N7658M4492M5839L2169
15720D3273J5483L773k4176j4221j9986k2875k643J0683j7182l4171J4710O388
15708d0944L1968P64j3495M2455j1026m1731j2474K9233J8496k0342p519N3282
15696B8667O509l1573O986J8737O656l3111j9570J4987K9738j6324k8412L044
15684a3666L2291l8033l9852K0556L2566O335K3669k3906m993n0254l415M3801
$$ plain form
15672 -14901 13543 -20873 -7672 20943 7801 -2900 10216 -23430 -44228 9701 52628 51153
15660 51153 26275 9825 -29589 -69695 -28960 7794 3452 -17793 -69601 -64864 -5585 25210
15648 25210 38628 47548 14784 -2547 4021 11629 30230 38617 15717 5880 2842 -3329 4275
15635 4275 -29977 -30807 -35724 -46919 -52879 -828 -6061 -37112 -67311 -70499 -73370 -78892 -49637
15622 -49637 -12096 -10805 27116 6366 10404 49754 86465 49402 -268 2879 10419 29611
15610 29611 -5974 -9450 31320 -40174 -58086 -17842 -7394 -981 -24982 -56713 -64877 -75811
15598 -75811 -29528 -15041 -10246 2259 -26795 -65660 -45564 -36003 -19359 1087 31276 49178
15586 49178 14165 178 39247 80979 68720 10219 47400 13796 -24949 -5717 1230 16718
$$ packed form
15672a4901K8444l4416J3201K8615j3142j0701J3116l3646k0798N3929M2927j475
15660E1153k4878j6450l9414m0106M0735L6754m342k1245n1808M737N9279L0795
15648B5210J3418Q920l2764j7331O568P608J8601Q387k2900r837l038o171P604
15635D275l4252q30m917j1195n960N2051n233l1051l0199l188k871n522K9255
15622d9637L7541J291L7921k0750M038L9350L6711l7063m9670L147P540J9192
15610B9611l5585l476M0770p1494j7912M0244J0448O413k4001l1731q164j0934
15598g5811M6283J4487M795J2505k9054l8865K0096R561J6644K0446L0189J7902
15586D9178l5013j3987L9069M1732j2259n8501L7181l3604l8745J9232O947J5488
$$ plain form
15574 16718 43769 52783 36192 -11836 -54206 -26605 3137 13610 41058 100148 137294 106384
15562 106384 82018 57675 23098 21886 26278 31662 23721 28142 52656 52252 -15297 -24103 -5156
15549 -5156 -31604 -69164 -77991 -84267 -111856 -50559 34317 52400 9131 -4425 -1604 40241
15537 40241 39899 58868 -10971 -43654 -40838 -37548 284 31826 24572 -16583 -51075 -58725 -64421
15524 -64421 -18514 -3924 -3898 13211 45180 63452 52381 16926 -13333 25477 41300 42650
15512 42650 77291 75809 62736 37096 38434 1560 23039 55038 71484 79443 93689 56873
15500 56873 -6399 -40545 -32074 -39633 -28508 -42034 -35179 -5763 9251 16628 5623 -35583
15488 -35583 -37561 -19580 9476 39099 47994 30843 -14882 10084 35815 12223 14245 6610
$$ packed form
15574A6718K7051R014j6591m8028m2370K7601K9742J0473K7448N9090L7146l0910
15562A06384k4366k4343l4577j212M392N384p941M421K4514m04o7549q806J8947
15549e156k6448l7560q827o276k7589O1297Q4876J8083m3269j3556K821M1845
15537D0241l42J8969o9839l2683K816L290L7832L1542p254m1155l4492p650n696
15524f4421M5907J4590K6J7109L1969J8272j1071l5455l0259L8810J5823J350
15512D2650L4641j482j3073k5640J338l6874K1479L1999J6446P959J4246l6816
15500E6873o3272l4146Q471p559J1125j3526O855K9416J5014P377j1005m1206
15488c5583j978J7981K9056K9623Q895j7151m5725K4966K5731k3592K022p635
$$ plain form
15476 6610 14176 59892 44251 29390 42299 -23768 -8262 2957 -39033 -109799 -122519 -81270
15464 -81270 -65106 -63269 -72482 -62622 -24399 25564 40379 -1871 -39516 -34704 -7583 22312
15452 22312 35604 -1444 -6972 -9879 -38699 -57659 -29975 3413 7462 -11532 28854 59541
15440 59541 109575 106502 91274 57998 29388 -30610 -70087 -48481 -20094 -38998 -38732 13761
15428 13761 31749 42979 53384 -2479 -27690 23994 57075 76623 94938 72522 65350 48773
15416 48773 17528 22648 25839 -2799 -22120 -49506 -64129 -47467 3983 24734 9448 36473
15404 36473 35370 63284 50477 -9642 -15228 14763 18214 14942 -5961 27535 85215 92652 53878
15391 53878 87842 122630 98335 71129 61119 30093 10839 -6260 -8899 -12288 -21523 -54423
$$ packed form
15476F610P566M5716j5641j4861J2909o6067J5506J1219m1990p0766j2720M1249
15464h1270J6164J837r213R860L8223M9963J4815m2250l7645M812K7121K9895
15452B2312J3292l7048n528k907k8820j8960K7684L3388M049j8994M0386L0687
15440E9541N0034l073j5228l3276k8610n9998l9477K1606K8387j8904K66N2493
15428A3761J7988J1230J0405n5863k5211N1684L3081J9548J8315k2416p172j6577
15416D8773l1245N120L191k8638j9321k7386j4623J6662N1450K0751j5286K7025
15404C6473j103K7914j2807o0119n586K9991L451l272k0903L3496N7680P437l8774
15391E3878L3964L4788k4295k7206j0010l1026j9254j7099k639l389r235l2900
$$ plain form
15379 -54423 -61041 -16903 19789 37196 35441 22959 2371 18769 29794 28335 44434 26207
15367 26207 25523 69016 74181 61251 27023 5802 6015 8548 14645 28372 -1349 7004 26875
15354 26875 55668 34408 26753 41887 47620 59126 36211 -6486 -35647 -45698 -2120 43370
15342 43370 67720 72660 60933 35456 6956 13366 29192 51951 48278 51491 53816 12935 -36966
15329 -36966 -40949 -42505 -60335 -21987 33374 42795 27529 -9710 -13990 -22228 2113 -9881 -29592
15316 -29592 -41611 -9808 33771 37472 10261 27317 53322 62815 19213 -17504 -22247 -14039
15304 -14039 1487 -19564 -10956 -1353 33635 38985 4885 -13832 13622 18322 27303 51364 19059
15291 19059 -13161 -25227 -668 -12859 -34356 14629 7143 29022 76912 71182 12458 -29489
$$ packed form
15379e4423o618M4138L6692J7407j755j2482k0588J6398J1025j459J6099j8227
15367B6207o84M3493N165j2930l4228k1221K13K533O097J3727k9721Q353J9871
15354B6875K8793k1260p655J5134N733J1506k2915m2697k9161j0051M3578M5490
15342D3370K4350M940j1727k5477k8500O410J5826K2759l673L213K325m0881m9901
15329c6966l983j556j7830L8348N5361R421j5266l7239m280q238K4341j1994j9711
15316b9592j2019L1803M3579L701k7211J7056K6005R493m3602l6717m743Q208
15304a4039J5526k1051Q608R603L4988N350l4100j8717K7454M700Q981K4061l2305
15291A9059l2220j2066K4559j2191k1497M8985p486K1879M7890n730n8724m1947
$$ plain form
15279 -29489 -24551 19466 33904 28747 24478 31329 28442 2150 -715 -6945 -15056 -43528 -55919
15266 -55919 -20213 74034 105260 70355 -17265 -12252 2129 40057 56926 10356 -35609 -50798
15254 -50798 -73412 -91970 -83060 -87428 -54379 -26448 -22497 2920 -6056 -39097 -28659 -44951
15242 -44951 -35728 -71221 -70372 -88638 -98630 -88379 -96136 -53807 -35823 -30788 -36127 -39270 -44788
15229 -44788 -73612 -58184 -11567 -10275 14206 60555 60426 68525 8635 -22072 10228 -22144
15217 -22144 -25653 -20844 16981 22020 28708 47852 43954 55444 77086 65902 44340 18971 45295
15204 45295 50023 33228 43297 53525 16757 1021 1706 -2506 -25279 -50128 -49845 -95489 -77194
15191 -77194 -66408 -69093 -24122 32419 32438 37682 53432 44569 45753 55706 4788 -16968 40084
$$ packed form
15279b9489M938M4017J4438n157m269O851k887k6292k865o230q111k8472j2391
15266e5919L5706R4247L1226l4905q7620N013J4381L7928J6869m6570m5965j5189
15254e0798k2614j8558Q910m368L3049K7931L951K5417q976l3041J0438j6292
15242d4951R223l5493Q49j8266r992J0251p757M2329J7984N035n339l143n518
15229d4788k8824J5428M6617J292K4481M6349j29Q099n9890l0707L2300l2372
15217b2144l509M809L7825N039O688J9144l898J1490K1642j1184k1562k5369K6324
15204D5295M728j6795J0069J0228l6768j5736O85m212k2773k4849K83m5644J8295
15191g7194J0786k685M4971N6541J9N244J5750q863J184R953n0918k1756N7052
$$ plain form
15178 40084 65008 54422 8484 -1281 -17747 -28721 -21978 -4793 32222 53811 65180 26716
15166 26716 30909 16507 8092 -16504 -4237 -2222 17895 48686 49571 17178 31803 27219 11441
15153 11441 -19792 -53405 -72908 -22258 -7072 -9273 -30155 -35726 -38219 -55602 -48360 -25839
15141 -25839 -11332 23620 48856 34658 11518 -8573 -14498 -4858 15772 31138 44569 35045
15129 35045 -14810 -26247 -64563 -8695 48363 63546 21443 3310 -22289 -64457 -44494 -50473
15117 -50473 -48905 -54333 -100768 -71195 -28352 -11255 -42574 -47077 -54425 -42820 -15304 -41609
15105 -41609 -39532 -48455 -44474 -20245 -19693 9596 11363 -11475 -75808 -69821 -33073 -40042 -67275
15092 -67275 -85641 -70924 -33886 -45658 -50778 -18551 6176 46084 55867 22627 -1396 -33001
$$ packed form
15178D0084K4924j0586m5938r765j6466j0974O743J7185L7015K1589J1369l8464
15166B6716M193j4402q415k4596J2267K015K0117L0791Q85l2393J4625m584j5778
15153A1441l1233l3613j9503N0650J5186k201k0882n571k493j7383P242K2521
15141b5839J4507L4952K5236j4198k3140k0091n925R640K0630J5366J3431r524
15129C5045m9855j1437l8316N5868N7058J5183m2103j8133k5599m2168J9963n979
15117e0473J568n428m6435K9573M2843J7097l1319m503p348J1605K7516k6305
15105d1609K077q923L981K4229N52K9289J767k2838o4333N987L6748o969k7233
15092f7275j8366J4717L7038j1772n120L2227K4727L9908R783l3240k4023l1605
$$ plain form
15080 -33001 -35563 -1793 969 -24055 -30484 -15061 15525 29866 3760 -162 -12072 -28491
15068 -28491 -38821 2925 -8117 -44104 -40364 7824 -12460 -34163 -43404 -53301 -68022 -75351
15056 -75351 -45935 -21769 -25594 -39768 -24081 257 -14042 -7114 11885 -46847 -102087 -106563
15044 -106563 -20278 25787 18540 20881 -14381 -53002 -44658 -35189 -32363 -15813 -44817 -33476
15032 -33476 20332 -13156 -26890 -18363 -57229 -48327 -31102 -34299 -14985 10741 5323 -52589
15020 -52589 -84541 -11696 17561 -9260 -17620 -9489 1674 -67866 -125147 -70111 13836 28108
15008 28108 2071 5722 35367 35282 24484 29053 12134 -14046 -28875 30897 23590 24662 -37962
14995 -37962 -57366 -9779 15862 -14470 -48336 -25667 3427 15901 -27310 -40646 -14615 53508
$$ packed form
15080c3001k562L3770K762k5024o429J5423L0586J4341k6106l922j1910j6419
15068b8491j0330M1746j1042l5987L740M8188k0284k1703r241r897j4721p329
15056g5351K9416K4166l825j4174J5687K4338j4299O928J8999n8732n5240m476
15044a06563Q6285M6065p247K341l5262l8621Q344R469K826J6550k9004J1341
15032c3476N3808l3488j3734Q527l8866Q902J7225l197J9314K5726n418n7912
15020e2589l1952P2845K9257k6821q360Q131J1163o9540n7281N5036Q3947J4272
15008B8108k6037L651K9645q5j0798M569j6919k6180j4829N9772p307J072o2624
14995c7962j9404M7587K5641l0332l3866K2669K9094J2474m3211j3336K6031O8123
$$ plain form
14983 53508 31183 34923 3715 -32585 -61200 -40129 -73055 -94909 -60745 -33995 -32530 1800
14971 1800 22991 -20912 -59247 -59711 -46620 -70470 -68985 -80178 -76545 -76396 -90408 -97005 -72199
14958 -72199 -40677 -45074 -51925 -35917 -41396 -54941 -9597 -10787 -41295 -20514 -12639 -26765 -28262
14945 -28262 -7442 31049 5003 -42858 -78229 -95784 -29558 41947 22235 -25070 -12306 14445
14933 14445 13783 -30707 -51339 -22336 41661 68884 50345 10320 -19228 14663 25814 34360
14921 34360 13300 12331 14980 32409 10308 -12862 -21623 12361 64285 74993 54660 42247
14909 42247 26371 10238 -35986 -75320 -43579 -14945 -29244 -14005 36989 64744 46663 64314
14897 64314 29873 19282 9439 -4920 -15075 -17925 6910 3488 -27295 -25858 4275 -7415
$$ packed form
14983E3508k2325L740l1208l6300k8615K1071l2926k1854L4164K6750J465L4330
14971A800K1191m3903l8335m64J3091k3850J485j1193L633J49j4012o597K4806
14958g2199L1522m397o851J6008n479j3545M5344j190l0508K0781P875j4126j497
14945b8262K0820L8491k6046m7861l5371j7555O6226P1505j9712m7305J2764K6751
14933A4445o62m4490k0632K9003O3997K7223j8539m0025k9548L3891J1151Q546
14921C4360k1060r69K649J7429k2101k3170q761L3984N1924J0708k0333j2413
14909D2247j5876j6133m6224l9334L1741K8634j4299J5239N0994K7755j8081J7651
14897F4314l4441j0591r843j4359j0155k850K4835l422l0783J437L0133j1690
$$ plain form
14885 -7415 -60832 -64495 -20369 38532 15433 17913 78748 100782 10289 -37875 -43997 -50884 -2074
14872 -2074 2797 8280 20812 -20036 -33539 -60622 -68212 -22945 -21256 1862 32044 26915 814
14859 814 -46952 -53250 -37182 -46479 -5177 20555 31065 21669 30261 24427 52119 27763 486
14846 486 -6799 17293 28958 24590 30255 6524 -8116 -24953 -12095 -12483 -26426 -5999 6286
14833 6286 19325 -5631 -4040 26270 21805 -27730 -35860 9642 -34029 -36007 13827 42968 35552
14820 35552 46021 39843 -9370 -50083 -33312 -12343 10343 31199 33530 16726 1724 -24585
14808 -24585 -31740 -40585 -43013 -33331 -63434 -79858 -97031 -98230 -30398 -7473 7666 -11120 -20370
14795 -20370 1130 -9758 -75 3858 28686 40437 15846 31288 5708 -24686 -58491 2680
$$ packed form
14885g415n3417l663M4126N8901k3099K480O0835K2034r0493m8164o122o887M8810
14872b074M871N483J2532m0848j3503k7083p590M5267J689K3118L0182n129k6101
14859H14m7766o298J6068r297M1302K5732J0510r396Q592n834K7692k4356k7277
14846D86p285K4092J1665m368N665k3731j4640j6837J2858l88j3943K0427J2285
14833F286J3039k4956J591L0310m465m9535q130M5502m3671j978M9834K9141p416
14820C5552J0469o178m9213m0713J6771K0969K2686K0856K331j6804j5002k6309
14808b4585p155q845k428R682l0103j6424j7173j199O7832K2925J5139j8786r250
14795b0370K1500j0888R683L933K4828J1751k4591J5442k5580l0394l3805O1171
$$ plain form
14783 2680 38557 -6645 -2952 21149 12226 29733 8568 17290 28634 -1960 -1280 -14827 -40181
14770 -40181 -21716 -28023 -24074 -10148 -18913 -513 483 20059 14194 34397 26155 58400 15101
14757 15101 -14459 26243 85934 89664 35410 18898 8636 38558 42168 56029 65954 36781
14745 36781 33771 15207 -4130 23187 1953 21516 44445 57163 31292 -36571 -56970 -56544
14733 -56544 -65989 -59896 16387 17252 25861 43435 67221 67074 38527 3693 7303 21874 21394 6898
14719 6898 -12253 4825 24074 54803 46497 34690 -10201 -25240 18227 43670 1047 -6536
14707 -6536 37412 80169 39206 16624 -7991 -5855 41498 76830 60603 27690 5969 -21636
14695 -21636 5587 37799 13625 4394 -13094 -28629 -16015 3337 32817 31354 9459 6801
$$ packed form
14783B680L5877m5202L693K4101q923J7507k1165Q722J1344l0594O80j3547k5354
14770d0181J8465o307L949J3926q765J8400R96J9576n865K0203q242L2245m3299
14757A5101k9560M0702N9691L730n4254j6512j0262K9922L610J3861R925k9173
14745C6781l010j8564j9337K7317k1234J9563K2929J2718k5871o7863k0399M26
14733e6544r445O093P6283Q65Q609J7574K3786j47k8547l4834L610J4571m80j4496
14719F898j9151J7078J9249L0729q306j1807m4891j5039M3467K5443m2623p583
14707f536M3948M2757m0963k2582k4615K136M7353L5332j6227l2913k1721k7605
14695b1636K7223L2212k4174r231j7488j5535J2614J9352K9480j463k1895k658
$$ plain form
14683 6801 6091 -9402 -30112 -47084 4640 9493 18450 11411 -3822 -3536 -9460 6172 45820
14670 45820 46289 2382 -36562 -23804 2947 -20711 -45925 -31568 1454 5062 11417 2388 -11812
14657 -11812 17168 64669 57882 34215 40160 60369 53071 29467 -13665 -19038 7532 86002
14645 86002 65725 50857 77436 72185 12943 -14872 -22640 -15160 -16558 14693 22714 3005 27849
14632 27849 19430 20700 9632 -3504 4120 10410 -8205 16519 8739 18613 34594 35911 -3934
14619 -3934 -17031 18142 12649 -49829 -58305 4484 27555 -24056 -27618 -26848 -46825 -35277 -4939
14606 -4939 -9128 19598 36874 23376 -16660 -18173 17581 54486 45529 44169 43796 47815 71436
14593 71436 78735 56050 23461 -13791 -9394 -30649 -6037 -7123 -3359 -12793 -6274 22404 31156
$$ packed form
14683F801p10j5493k0710j6972N1724M853Q957p039j5233K86n924J5632L9648
14670D5820M69m3907l8944J2758K6751k3658k5214J4357L3022L608O355r029j4200
14657a1812K8980M7501o787k3667N945K0209p298k3604m3132n373K6570P8470
14645H6002k0277j4868K6579n251n9242k7815p768P480j398L1251Q021j9709K4844
14632B7849q419J270j1068j3136P624O290j8615K4724p780R874J5981J317l9845
14619c934j3097L5173n493o2478q476O2789K3071n1611l562P70j9977J1548L0338
14606d939m189K8726J7276j3498m0036j513L5754L6905q957j360l73M019K3621
14593G1436P299k2685l2589l7252M397k1255K4612j086L764r434O519K8678Q752
$$ plain form
14580 31156 41505 17374 7921 7610 4743 7919 -7013 44025 35179 -36148 -77907 -71656 -56212
14567 -56212 -60294 -36194 -14417 -32167 -2877 -5970 -42048 -21281 -10231 -7540 -12823 -56937
14555 -56937 -67416 -29656 -11672 -28206 -45280 -31229 -42695 -38443 -49291 -2288 25648 36940
14543 36940 2745 18506 37376 60496 59633 39780 48652 39378 39261 21649 59285 81175 97611
14530 97611 64823 32092 15034 117 -6841 19808 45521 39628 44414 38852 23035 -3420
14518 -3420 -62813 -38234 15793 45237 19552 28731 18231 42964 45588 -15190 -3070 65783
14506 65783 78789 48210 27784 27745 46503 18936 -24443 -9675 -3052 -28948 -34268 -26605 -19343
14493 -19343 5432 -6866 -14430 -37039 -11427 12993 11506 9877 29097 -13836 -66863 -81539
$$ packed form
14580C1156J0349k4131r453l11k867L176j4932N1038q846p1327m1759O251J5444
14567e6212m082K4100K1777j7750K9290l093l6078K0767J1050K691n283m4114
14555e6937j0479L7760J7984j6534j7074J4051j1466M252j0848M7003K7936J1292
14543C6940l4195J5761J8870K3120q63j9853Q872r274j17j7612L7636K1890J6436
14530I7611l2788l2731j7058j4917o958K6649K5713n893M786n562j5817k6455
14518c420n9393K4579N4027K9444k5685R179j0500K4733K624o0778J2120O8853
14506F5783J3006l0579k0426l9J8758k7567m3379J4768O623k5896n320P663P262
14493a9343K4775j2298p564k2609K5612K4420j487j629J9220m2933n3027j4676
$$ plain form
14481 -81539 -45307 -8968 -15712 -44454 -75140 -89047 -94070 -68308 -64291 -17050 50098 45935
14469 45935 -11400 12266 2935 -46367 -33085 -10422 -56118 -90006 -77423 -61265 -36654 -14142
14457 -14142 -51407 -81771 -37917 11181 15467 -35680 -49718 -69304 -70858 -65152 -32452 4077
14445 4077 -14656 4653 -16628 -19037 22538 16189 4790 -14560 -16265 -11186 -32827 -22252 -22389
14432 -22389 -36437 -12033 -5485 16406 54964 97214 89918 80317 49937 44676 47965 31774 32476
14419 32476 51800 -9918 -43945 -39782 -15230 38231 53513 52443 67692 58522 3248 -22983
14407 -22983 -21350 35166 91279 83932 58977 29323 33857 58473 55219 62609 80347 38519 18341
14394 18341 40946 76557 52528 31719 2734 3679 38976 82022 74444 42579 52868 54680
$$ packed form
14481h1539L6232L6339o744k8742l0686j3907n023K5762M017M7241O7148m163
14469D5935n7335K3666r331m9302J3282K2663m5696l3888J2583J6158K4611K2512
14457a4142l7265l0364M3854M9098M286n1147j4038j9586j554N706L2700L6529
14445D077j8733J9309k1281k409M1575o349j1399j9350j705N079k1641J0575j37
14432b2389j4048K4404O548K1891L8558M2250p296r601l0380n261L289j6191P02
14419C2476J9324o1718l4027M163K4552N3461J5282j070J5249r170n5274k6231
14407b2983J633N6516N6113p347k4955k9654M534K4616l254P390J7738m1828k0178
14394A8341K2605L5611k4029k0809k8985R45L5297M3046p578l1865J0289J812
$$ plain form
14382 54680 25088 -37364 -75303 -80654 -35655 -37782 -69460 -51891 -7807 55570 37274 58422
14370 58422 63665 7258 23771 32386 27432 11675 -10783 5306 34399 58881 -1830 -16555
14358 -16555 34392 31007 13941 -18020 13541 18953 6232 -28352 -31732 -18879 -6610 -11958
14346 -11958 5438 9455 36978 63586 59915 54708 41249 1525 -36431 -11621 21875 -14175
14334 -14175 11838 11932 -18704 -31053 -38252 6017 43543 60687 61635 89792 102251 66688 46605
14321 46605 22823 2329 -12606 -33005 -70459 -103424 -83530 -25395 -44257 -50459 13779 73375
14309 73375 84369 122857 112143 25617 -14091 -7363 -7538 4241 8064 -12457 -49954 -67834
14297 -67834 -22692 -3016 13789 -7311 10885 59163 41386 16238 19222 31852 59052 43651
$$ packed form
14382E4680k9592o2452l7939n351M4999k127l1678J7569M4084O3377j8296K1148
14370E8422N243n6407J6513Q615m954j5757k2458J6089K9093K4482o0711j4725
14358a6555N0947l385j7066l1961L1561N412j2721l4584l380J2853J2269n348
14346a1958J7396M017K7523K6608l671n207j3459l9724l7956K4810L3496l6050
14334a4175K6013R4l0636j2349p199M4269L7526J7144R48K8157J2459l5563k0083
14321D6605k3782k0494j4935k0399l7454l2965J9894N8135j8862o202O4238N9596
14309G3375J0994L8488j0714q6526l9708O728j75J1779L823k0521l7497j7880
14297f7834M5142J9676J6805k1100J8196M8278j7777k5148K984J2630K7200j5401
$$ plain form
14285 43651 22703 60092 23355 -22611 -34838 -17338 -3211 -36318 -41965 -60206 -27332 4310
14273 4310 15949 30029 -8688 -40843 -41329 -15013 -22502 -25875 -13335 45234 63690 10051 -34005
14260 -34005 -348 1900 16353 -3254 3501 19135 -22266 -12569 46687 80977 59378 49812
14248 49812 51837 25147 323 3085 -2844 44081 30915 2898 628 19881 37381 11334
14236 11334 13851 37992 -10579 -49312 -69717 -92806 -106298 -95902 -66724 -3751 35615 23818
14224 23818 51678 58064 36282 49571 56995 32726 51664 47188 20277 46109 83456 54993
14212 54993 4981 -6639 -26303 -2173 11732 5474 3524 -9226 24519 48766 -17694 -58534
14200 -58534 -64070 -88515 -74652 -23524 -12307 -31222 -17311 -4840 -26987 -65391 -38603 -28848
$$ packed form
14285D3651k0948L7389l6737m5966j2227J7500J4127l3107n647j8241L2874L1642
14273D310J1639J4080l8717l2155m86K6316p489l373J2540N8569J8456n3639m4056
14260c4005L3657K248J4453j9607O755J5634m1401R697N9256L4290k1599r566
14248D9812K025k6690k4824K762n929M6925j3166k8017k270J9253J7500k6047
14236A1334K517K4141m8571l8733k0405k3089j3492J0396K9178O2973L9366j1797
14224B3818K7860O386k1782J3289P424k4269J8938m476k6911K5832L7347k8463
14212E4993n0012j1620j9664K4130J3905o258j950j2750L3745K4247o6460m0840
14200e8534n536k4445J3863N1128J1217j8915J3911J2471k2147l8404K6788R755
$$ plain form
14188 -28848 -56328 -29947 -51990 4687 43969 59157 69774 56990 39674 14541 -21832 -4127
14176 -4127 11181 13031 12430 20173 -2780 -25697 -45852 -58808 -77287 -101887 -93982 -37728 -4957
14163 -4957 -28749 -21513 -31163 -38856 -15637 -23998 -11555 -21493 -28997 -26672 -43536 -40075 -10868
14150 -10868 -17856 -13718 23765 -1703 39456 58569 59337 34250 -31919 4736 20044 -16028
14138 -16028 -24016 -21965 16790 16449 -1809 -11111 -49574 -52319 -41190 8559 22948 -45151 -36400
14125 -36400 -4272 -7718 23754 30171 29893 21674 21244 14793 12015 27686 27790 26807 3922 19492
14111 19492 20747 -2756 -10873 41785 29657 21359 50433 16198 -27289 -46798 -27531 30119
14099 30119 32494 14212 4 2325 -12018 -19513 -30252 -9729 28441 -21217 -51079 -56655
$$ packed form
14188b8848k7480K6381k2043N6677L9282J5188J0617j2784j7316k5133l6373J7705
14176d127J5308J850o01P743k2953k2917k0155j2956j8479k4600P905N6254L2771
14163d957k3792P236r650p693K3219q361J2443r938p504K325j6864L461K9207
14150a0868o988M138L7483k5468M1159J9113P68k5087o6169L6655J5308l6072
14138a6028p988K051L8755l41j8258r302l8463k745J1129M9749J4389o8099Q751
14125c6400L2128l446L1472O417k78q219m30o451k778J5671J04r83k2885J5570
14111A9492J255k3503q117N2658j2128q298K9074l4235m3487j9509J9267N7650
14099C0119K375j8282j4208K321j4343p495j0739K0523L8170m9658k9862n576
$$ plain form
14087 -56655 -73247 -45802 -37680 8490 58808 23908 28218 39331 32221 3553 -23133 -22313 -25403
14074 -25403 -58131 -16842 56796 61226 113798 99754 11961 24952 68881 51923 -708 -6955
14062 -6955 -19849 6822 62151 88239 101238 87743 71976 72980 40768 385 5864 4786
14050 4786 20220 11457 -39258 -51712 -7318 30041 40447 48659 60789 53359 46144 46113 46281 18700
14036 18700 22924 58176 53610 6170 58075 64715 31406 10662 15327 -16609 -63045 -23954
14024 -23954 4285 37368 4243 14753 14570 4859 52168 37882 -24564 -37243 -11754 -25874
14012 -25874 -11115 49030 49098 33143 24801 2166 34221 33529 46639 22791 -40088 -89906 -119817
13999 -119817 -111263 -10324 38142 33563 48818 63870 60705 46753 21626 -1454 -12591 -36012
$$ packed form
14087e6655j6592K7445Q122M6170N0318l4900M310J1113p110k8668k6686Q20l090
14074b5403l2728M1289P3638M430N2572j4044q7793J2991M3929j6958n2631o247
14062f955j2894K6671N5329K6088J2999j3495j5767J004l2212m0383N479j078
14050D786J5434q763n0715j2454M4394L7359J0406Q212J2130p430p215l1J68k7581
14036A8700M224L5252m566m7440N1905O640l3309k0744M665l1936m6436L9091
14024b3954K8239L3083l3125J0510j83r711M7309j4286o2446j2679K5489j4120
14012b5874J4759O0145O8j5955q342k2635L2055o92J3110k3848o2879m9818k9911
13999a19817Q554J00939M8466m579J5255J5052l165j3952k5127k3080j1137k3421
$$ plain form
13987 -36012 -61587 -67674 -54154 -58562 -53832 -1333 16561 29349 -639 -38541 -61076 -70931
13975 -70931 -44364 11182 24701 -7945 17858 12153 1623 -19433 -1142 -3236 -13684 -38779
13963 -38779 -20647 439 -19830 -14376 -19049 -56031 -37475 -32492 -11458 -32547 -49620 -28879
13951 -28879 -53827 -53586 -22383 -6167 16910 40147 47336 81173 73236 50236 77081 65991
13939 65991 39591 8811 -22612 -43030 -55510 -46636 -5931 -18068 -5693 -6216 -6526 -38333 -14579
13926 -14579 722 4700 33823 30284 -18283 -6308 12752 40009 63415 59925 -9561 -41500
13914 -41500 -12452 16288 -6616 -19828 -25979 -41711 -68207 -100603 -77682 -7338 51399 54072
13902 54072 43034 15985 34643 37070 -10049 -19416 -53053 -59345 -59170 -63737 -37009 -21159 -53855
$$ packed form
13987c6012k5575o087J3520m408M730N2499J7894J2788k9988l7902k2535r855
13975g0931K6567N5546J3519l2646K5803n705j0530k1056J8291k094j0448k5095
13963c8779J8132K1086k0269N454m673l6982J8556M983K1034k1089j7073K0741
13951b8879k4948K41L1203J6216K3077K3237P189L3837p937k3000K6845j1090
13939F5991k6400l0780l1423k0418j2480Q874M0705j2137J2375n23l10l1807K3754
13926a4579J5301L978K9123l539m8567J1975J9060K7257K3406l490o9486l1939
13914d1500K9048K8740k2904j3212o151j5732k6496l2396K2921P0344N8737K673
13902E4072j1038k7049J8658K427m7119r367l3637o292J75m567K6728J5850l2696
$$ plain form
13889 -53855 -28422 -2925 5453 -26847 -44094 -54296 -46866 4888 11808 13225 51097 46235 31902
13876 31902 21496 50628 33858 370 -39334 -62528 -55574 -55894 -46406 -14987 -18730 -31148 -31351
13863 -31351 -26886 -37703 -44837 -54757 -39607 -37013 -49215 4488 15612 5519 5264 -54664 -56158
13850 -56158 -22700 -27634 -33983 -2305 -3283 25692 -21555 -55846 -38879 -11957 -7416 -20686 -40063
13837 -40063 1105 63117 51650 12744 -28937 -32592 -32681 -10076 28471 54047 61203 57460 70706
13824 70706 49585 59948 52274 23596 20274 39540 32592 53689 85974 79990 77155 63973 -11456
13811 -11456 -10163 11833 1874 10425 14442 33726 49917 14838 -28901 -29612 -32154 -7256 44621
13798 44621 37506 42117 28220 -33082 -39207 -38054 -37710 -45794 -36910 -1600 609 -22378 -17995 3163
$$ packed form
13889e3855K5433K5497Q378l2300j7247j0202P430N1754O920J417L7872m862j4333
13876C1902j0406K9132j6770l3488l9704k3194O954l20R488L1419l743j2418k03
13863c1351M465j0817p134r920J5150K594j2202N3703J1124j0093k55n9928j494
13850e6158L3458m934o349L1678r78K8975m7247l4291J6967K6922M541j3270j9377
13837d0063M1168O2012j1467l8906m1681l655q9K2605L8547K5576P156l743J3246
13824G0706k1121J0363p674k8678l322J9266o948K1097L2285n984k835j3182p5429
13811a1456J293K1996r959Q551M017J9284J6191l5079m3739p11k542K4898N1877
13798D4621p115M611j3897o1302o125J153L44q084Q884L5310K209k2987M383K1158
$$ plain form
13784 3163 -25233 -58652 -45881 -66563 -57697 -6703 1362 32902 39339 -6537 -23690 -42960
13772 -42960 -36749 14167 66512 58839 56490 88836 37938 3769 4231 -24335 -37144 -16769 -580
13759 -580 14475 17067 24627 39790 4743 -50166 -65615 -66959 -38347 1524 7295 -17029 -23869
13746 -23869 -30255 -48804 -19015 29792 13325 35514 28402 56172 53987 20205 -8960 31477
13734 31477 16702 -6465 -16218 1062 -33396 -8232 -12597 -43412 -70204 -67710 -47672 -35277
13722 -35277 -35427 2430 32554 24834 -16302 25472 70421 55096 22875 -8284 -6545 19694
13710 19694 48264 16842 -26600 -23616 -43493 -2239 -3650 -11534 40843 51444 26401 11725
13698 11725 31742 40755 28161 -17212 -11171 10118 46117 23497 54118 77626 74259 84281
$$ packed form
13784C163k8396l3419J2771k0682Q866N0994Q065L1540O437m5876j7153j9270
13772d2960O211N0916N2345p673k349L2346n0898l4169M62k8566j2809K0375J6189
13759e80J5055K592P560J5163l5047n4909j5449j344K8612L9871N771k4324o840
13746b3869o386j8549K9789M8807j6467K2189p112K7770k185l3782k9165M0437
13734C1477j4775k3167r753J7280l4458K5164m365l0815k6792K494K0038J2395
13722c5277j50L7857L0124p720m1136M1774M4949j5325l2221l1159J739K6239
13710A9694K8570l1422m3442K984j9877M1254j411p884N2377J0601k5043j4676
13698A1725K0017R013j2594m5373O041K1289L5999k2620L0621K3508l367J0022
$$ plain form
13686 84281 39736 30549 42534 30097 26502 15022 17559 -52421 -57499 -65320 -52597 -56871 -71458
13673 -71458 -90378 -69933 -83460 -90568 -36151 -22248 -26974 -40939 -66085 -55354 -7288 -7928
13661 -7928 18986 67266 53240 60007 102678 60693 26322 -28299 -51736 -10853 -16497 27818
13649 27818 84502 46375 35820 66763 66845 59604 54356 48652 43797 69103 74585 40926 44394
13636 44394 25799 20696 6830 -13326 -28130 -16770 -47911 -31717 20702 22700 -736 -20290
13624 -20290 -30748 -35206 24404 64005 81116 66841 38717 22107 33809 65929 98661 84905
13612 84905 71892 28600 -9768 -21137 -10884 -13973 -20590 3777 13212 26660 13840 8525
13600 8525 -15034 -16554 20915 38973 -1330 1982 7432 -36640 -29850 10592 -4611 -22313 -8914
$$ packed form
13686H4281m4545r187J1985j2437l595j1480K537o9980n078p821J2723m274j4587
13673g1458j8920K0445j3527p108N4417J3903m726j3965k5146J0731M8066o40
13661g928K6914M8280j4026O767M2671m1985l4371n4621k3437M0883n644M4315
13649B7818N6684l8127j0555L0943Q2p241n248n704m855K5306N482l3659L468
13636D4394j8595n103j3866k0156j4804J1360l1141J6194N2419J998k3436j9554
13624b0290j0458m458N9610L9601J7111j4275k8124j6610J1702L2120L2732j3756
13612H4905j3013m3292l8368j1369J0253l089o617K4367R435J3448j2820n315
13600H525k3559j520L7469J8058m0303L312N450m4072O790M0442j5203j7702J3399
$$ plain form
13587 -8914 -14987 -21895 -7808 -22856 -46024 -13354 -8780 -30626 -19790 -22631 -7904 -16891 -13462
13574 -13462 -17512 -47563 -31628 -6142 -35793 -64815 -80657 -57814 -7099 28038 34507 34492 15169
13561 15169 -37168 -26371 40435 60288 6607 -2735 26636 24182 7338 -39351 -45786 -37465
13549 -37465 -10917 -5786 4435 37613 23061 13107 31667 -8944 -37621 3871 -3340 31851
13537 31851 -78 27842 49418 -16078 -50350 -42997 -51202 -62033 -54853 -60226 -35707 20948
13525 20948 74346 73770 53160 35024 25810 -9913 -40770 -39698 -1322 -2426 -33192 -55329 -52407
13512 -52407 -13864 19178 3236 51941 68658 14457 -2187 -43329 -38275 -39357 -30713 -4096
13500 -4096 -15178 -63621 -71375 -40457 -36427 -47047 -29835 -5225 10930 -10139 -28683 -26406
$$ packed form
13587h914o073o908J4087j5048k3168L2670M574k1846J0836k841J4727q987L429
13574a3462m050l0051J5935K5486k9651k9022j5842K2843N0715L5137O469j5j9323
13561A5169n2337J0797O6806J9853n3681r342K9371k454j6844m6689o435Q321
13549c7465K6548N131J0221L3178j4552r954J8560m0611k8677M1492p211L5191
13537C1851l1929K7920K1576o5496l4272P353q205j0831P180n373K4519N6655
13525B0948N3398n76k0610j8136r214l5723l0857J072L8376j104l0766k2137K922
13512e2407L8543L3042j5942M8705J6717n4201j6644m1142N054j082Q644K6617
13500d096j1082m8443p754L0918M030j0620J7212K4610J6155k1069j8544K277
$$ plain form
13488 -26406 -20107 1562 8188 4342 18694 35748 19353 45330 21573 14711 14291 6364 18978
13475 18978 15922 5142 -14762 -14651 -2399 -9639 14649 8755 16028 36989 47392 19389 6173
13462 6173 37760 42872 36678 31806 -3503 1839 24350 -28669 -26603 11988 4876 -4804 3564
13449 3564 50490 32200 -29083 -19330 -9596 -11394 -23112 -94073 -61658 -42421 -18957 2489
13437 2489 -3154 -39580 -15584 15798 30104 75466 125068 122307 77060 84781 100590 104105 76697
13424 76697 52417 46836 12495 -13963 -10176 3106 37548 65621 20032 -13913 -14899 -27308
13412 -27308 -57643 -67686 -66782 -60676 -42686 -18183 3565 -14541 -4594 4864 -159 -6603 -9981
13399 -9981 -15319 359 12696 45210 34333 -3173 -23419 -44375 -26213 -2592 -18710 -36756
$$ packed form
13488b6406O299K1669O626l846J4352J7054j6395K5977k3757o862m20p927J2614
13475A8978l056j0780j9904J11J2252p240K4288n894P273K0961J0403k8003j3216
13462F173L1587N112o194m872l5309N342K2511n3019K066L8591p112r680Q368
13449C564M6926j8290o1283R753R734j798j1718p0961L2415J9237K3464K1446
13437B489n643l6426K3996L1382J4306M5362M9602k761m5247P721J5809L515k7408
13424G6697k4280n581l4341k6458L787J3282L4442K8073m5589l3945r86j2409
13412b7308l0335j0043R04O106J7990K4503K1748j8106R947R458n023o444l378
13399i981n338J5678J2337L2514j0877l7506k0246k0956J8162K3621j6118j8046
$$ plain form
13387 -36756 -2687 1423 -8369 -18439 10414 50572 33441 9723 15558 50021 57864 71599
13375 71599 81934 71362 54964 48557 58667 47846 -6775 -47163 -7521 14960 -22152 -50461
13363 -50461 -30474 -35470 -13416 -27510 -36018 -27944 -15142 -3515 5218 730 -19532 4850 45461
13350 45461 38974 -761 -16260 -17784 -49232 -52100 -58919 -61022 -79373 -124443 -114703 -58671 -44096
13337 -44096 -33707 -24980 -33857 -44878 -34804 -8846 18125 -6379 -13887 -15298 -66006 -75065 -56309
13324 -56309 -29643 -32332 -34575 -65281 -40239 -24554 -9994 3035 33704 62597 34920 6592
13312 6592 14319 -6001 -20781 -32035 -24083 -44985 -48457 -21456 -20483 -45207 -66396 -58583 -6556
13299 -6556 -9326 6282 35807 65110 89349 91152 121767 104165 73412 55307 18779 738
$$ packed form
13387c6756L4069M110r792j0070K8853M0158j7131k3718N835L4463P843J3735
13375G1599J0335j0572j6398o407J0110j0821n4621m0388L9642K2481l7112k8309
13363e0461J9987m996K2054j4094q508Q074J2802J1627Q733m488k0262K4382M0611
13350D5461o487l9735j5499j524l1448k868o819k103j8351m5070R740N6032J4575
13337d4096J0389Q727q877j1021J0074K5958K6971k4504p508j411n0708r059J8756
13324e6309K6666k689k243l0706K5042J5685J4560J3029L0669K8893k7677k8328
13312F592P727k0320j4780j1254P952k0902l472K7001R73k4724k1189P813N2027
13299f556k770J5608K9525K9303K4239J803L0615j7602l0753j8105l6528j8041
$$ plain form
13287 738 -24434 -30020 -5353 41760 -1143 -4553 2984 400 19622 26001 82903 119271 150665
13274 150665 154919 177133 152900 101284 46157 32348 36291 20977 38688 60726 46981 45097
13262 45097 54559 85162 146297 147212 93228 24065 4585 13926 23907 26749 30807 39573 13805
13249 13805 9974 -13616 -13709 48464 35266 21897 30254 -3701 -43333 -78944 -57044 -10296 -27665
13236 -27665 -25533 -37296 -56278 -75412 -50397 5553 44013 62655 60487 12546 -3418 22498
13224 22498 51597 28334 41464 36616 19884 4261 12674 20476 28147 49290 58197 55194 25912
13211 25912 5716 -4762 -22838 -4873 63902 116480 106816 82585 73593 59717 52882 85569
13199 85569 85661 116278 89137 69487 90645 106131 97795 52416 58107 77389 15895 -6489 -34251
$$ packed form
13287G38k5172n586K4667M7113m2903l410P537k584J9222O379N6902L6368L1394
13274A50665M254K2214k4233n1616n5127j3809L943j5314J7711K2038j3745j884
13262D5097R462L0603O1135R15n3984o9163j9480R341R981K842M058Q766k5768
13249A3805l831k3590r3O2173j3198j3369Q357l3955l9632l5611K1900M6748j7369
13236b7665K132j1763j8982j9134K5015N5950L8460J8642k168m7941j5964K5916
13224B2498K9099k3263J3130m848j6732j5623Q413P802P671K1143Q907l003k9282
13211B5912k0196j0478j8076J7965O8775N2578r664k4231q992j3876o835L2687
13199H5569R2L0617k7141j9650K1158J5486q336m5379N691J9282o1494k2384k7762
$$ plain form
13186 -34251 -33435 21430 34115 -4391 -32531 -1366 2575 -17907 2244 38815 18993 60398
13174 60398 86161 80209 63047 29127 -8344 -22928 -18579 -33255 -41386 18139 49653 126012
13162 126012 157933 162463 152965 145395 148883 147315 94362 48668 42187 75412 71502 -8591 -49659
13149 -49659 -53710 -47233 -18632 43322 73244 83077 68218 47311 76002 143045 257270 425557
13137 425557 586304 607677 526376 429107 339664 252334 146665 85003 57500 24444 44688
13126 44688 58416 43283 35232 47438 60513 43871 31789 94398 180620 274964 324995 314826
13114 314826 275863 221908 147311 29030 41937 80284 65826 28863 -20740 -44995 -36472
13103 -36472 -16182 16460 55349 50240 34202 20684 -17316 -37283 -30787 -3407 -19313 -19719
$$ packed form
13186c4251Q16N4865J2685l8506k8140L1165L941k0482K0151L6571j9822M1405
13174F0398K5763n952j7162l3920l7471j4584M349j4676q131N9525L1514P6359
13162A26012L1921M530r498p570L488j568n2953m5694o481L3225l910q0093m1068
13149d9659m051O477K8601O1954K9922R833j4859k0907K8691O7043J14225J68287
13137D25557J60747K1373q1301r7269q9443q7330j05669o1662k7503l3056K0244
13126D4688J3728j5133q051J2206J3075j6642j2082O2609Q6222R4344N0031j0169
13114C14826l8963n3955p4597j18281J2907L8347j4458l6963m9603k4255Q523
13103c6472K0290L2642L8889n109j6038j3518l8000j9967O496K7380j5906m06
$$ plain form
13091 -19719 -4420 12770 20485 -10756 -34856 -69105 -84488 -62774 -24761 3481 5257 15454
13079 15454 5524 50755 73564 68697 61663 22617 78940 135384 114947 96856 80739 81798
13067 81798 63720 34530 20527 16255 17037 3974 -6016 30539 82730 76231 92964 102941 88067
13054 88067 77240 59285 101486 175661 241418 251571 346906 552846 954412 1393015 1520658
13043 1520658 1356757 1061897 800163 595339 439340 304213 233753 182232 127534 102986
13033 102986 88451 110848 94268 45665 14479 28564 61650 91940 85517 60225 5503 -1330
13021 -1330 27804 -5491 -8218 32955 24485 13841 23222 46749 85509 86146 -83 -57479 -11905
13008 -11905 -17366 10404 35075 24119 14021 -18887 7258 27180 45625 39219 37472 21766
$$ packed form
13091a9719J5299J7190P715l1241k4100l4249j5383K1714L8013K8242J776J0197
13079A5454r930M5231K2809m867p034l9046N6323N6444k0437j8091j6117J059
13067H1798j8078k9190j4003m272P82j3063r990L6555N2191o499J6733R977j4874
13054H8067j0827j7955M2201P4175O5757J0153R5335K05940M01566M38603J27643
13043A520658j63901k94860k61734k04824j55999j35127p0460n1521n4698k4548
13033A02986j4535K2397j6580m8603l1186J4085L3086L0290o423k5292n4722o833
13021a330K9134l3295k727M1173q470j0644R381K3527L8760O37q6229n7396M5574
13008a1905n461K7770K4671j0956j0098l2908K6145J9922J8445o406j747j5706
$$ plain form
12996 21766 -26818 3071 13623 -33683 -33279 -26880 -15862 6107 17486 9956 10320 22303 8443
12983 8443 -8383 32092 24855 -33049 -58802 -47040 -57837 -103197 -85374 -43098 -9906 5846
12971 5846 3419 -54910 -62320 -37324 22490 29587 17455 -30166 -4108 17306 -7531 -21621
12959 -21621 -13261 -11156 -23667 -33213 -12467 30081 70044 89274 61464 35494 8932 1611
12947 1611 -15408 -4479 -2671 5153 -13041 9428 -3751 -16288 -3283 11779 17203 -24816
12935 -24816 -17726 -20770 39706 64488 41920 18810 9343 33511 44853 75088 63636 10495
12923 10495 146 -2636 -6307 -3695 21834 1855 3203 22784 33898 34952 42726 15319 -36143
12910 -36143 -68740 -78847 -66911 -69250 -56221 766 -17574 -14360 18673 -25910 -25579 18301
$$ packed form
12996B1766m8584K9889J0552m7306M04O399J1018K1969J1379p530L64J1983j3860
12983H443j6826M0475p237n7904k5753J1762j0797m5360J7823M2276L3192J5752
12971E846k427n8329p410K4996N9814P097j2132m7621K6058K1414k4837j4090
12959b1621Q360K105j2511r546K0746M2548L9963J9230k7810k5970k6562p321
12947A611j7019J0929J808P824j8194K2469j3179j2537J3005J5062N424m2019
12935b4816P090l044O0476K4782k2568k3110r467K4168J1342L0235j1452n3141
12923A0495j0349k782l671K612K5529j9979J348J9581J1114J054P774k7407n1462
12910c6143l2597j0107J1936k339J3029N6987j8340L214L3033m4583L31M3880
$$ plain form
12898 18301 52902 -9566 -63428 -71112 -72282 -93479 -78162 -37242 -45350 -49179 -33245 -39340 -26456
12885 -26456 -28092 -37237 -36485 -78082 -72879 -24879 -34084 -48743 -54357 -54925 -50356 -13396 52230 72078
12871 72078 57162 34344 49193 -16656 -51122 -15721 56128 73395 38166 13816 -15271 -54358
12859 -54358 -40449 -4927 -20340 -39440 -33504 -35853 -28945 -45652 -43137 -16531 -15206 -19081 12073
12846 12073 53135 65207 42628 -6425 -12096 -75197 -67668 -50811 -79078 -60422 -27892 -10250
12834 -10250 25295 44990 41136 50992 60602 52421 1921 -27421 -16157 11510 -8626 -23149
12822 -23149 -32128 -67120 -76353 -53843 -20216 -24599 -17055 17915 -125 -15490 -3464 -13902
12810 -13902 -11080 24138 64345 76628 65647 31231 27858 49297 35339 -23735 -45817 5140
$$ packed form
12898A8301L4601o2468n3862p684j170k1197J5317M0920q108l829J5934o095J2884
12885b6456j636r145P52m1597N203M8000r205j4659n614n68M569L6960O5626J9848
12871G2078j4916k2818J4849o5849l4466L5401P1849J7267l5229k4350k9087l9087
12859e4358J3909L5522j5413j9100N936k349O908j6707K515K6606J325l875L1154
12846A2073M1062J2072k2579m9053n671o3101P529J6857k8267J8656L2530J7642
12834a0250L5545J9695l854R856R610q181n0500k9342J1264K7667k0136j4523
12822b3149q979l4992r233K2510L3627m383P544L4970j8040j5365J2026j0438
12810a3902K822L5218M0207J2283j0981l4416l373K1439j3958n9074k2082N0957
$$ plain form
12798 5140 50161 88768 78049 45253 -259 -18048 -21435 -2401 13776 7850 -14065 -17229
12786 -17229 -35773 -75382 -104582 -82415 -65473 -20014 -5815 193 28432 21640 32951 57130
12774 57130 88209 94233 38926 -5498 14658 35169 26924 25034 14138 -6845 20439 60588
12762 60588 56764 51807 -5319 -56231 -22798 31633 30494 9144 -12569 -39312 -37795 -5856
12750 -5856 40160 60403 68297 54698 67871 -2658 -30185 -28635 -27000 -13618 4852 13320 -2619
12737 -2619 -12548 -33514 -40338 -59960 -20819 -12858 20506 27934 12748 12519 -13778 -33423 -35712
12724 -35712 -28536 -34452 2681 50328 68565 49609 29914 -14439 -62340 -30726 -2581 -23582
12712 -23582 -47676 -23639 10930 -4776 -16098 5422 -24718 -49213 -50158 -17296 -44671 -32574
$$ packed form
12798E140M5021L8607j0719l2796m5512j7789l387J9034J6177n926k1915l164
12786a7229j8544l9609k9200K2167J6942M5459J4199O008K8239o792J1311K4179
12774E7130L1079O024n5307m4424K0156K0511q245j890j0896k0983K7284M0149
12762F0588l824m957n7126n0912L3433N4431j139k1350k1713k6743J517L1939
12750e856M6016K0243P894j3599J3173p0529k7527J550J635J3382J8470Q468j5939
12737b619r929k0966o824j9622L9141P961L3364P428j5186k29k6297j9645k289
12724c5712P176n916L7133M7647J8237j8956j9695m4353m7901L1614K8145k1001
12712b3582k4094K4037L4569j5706j1322K1520l0140k4495r45L2862k7375J2097
$$ plain form
12700 -32574 12083 39483 29186 9069 -21560 -61790 -38920 -28704 -55243 -42651 -34704 -3979
12688 -3979 16150 25216 5367 -16546 -6721 -10353 -22541 -14549 -626 22893 59142 66115 53762
12675 53762 49843 57006 25647 -11888 -699 -9220 -43795 -53351 -71837 -62655 -33665 4363 -22947
12662 -22947 -4267 -18140 -92367 -120787 -83722 -55473 -27907 -2923 9005 65552 40835 -6193
12650 -6193 -3714 34655 64690 57299 507 26844 30490 9348 3257 -65587 -63882 -29088 14136
12637 14136 14754 -31338 -26854 1852 12090 20393 50918 64108 48453 43600 20579 482 -2289
12624 -2289 24034 80544 79718 34466 3220 -3012 20798 22468 -5962 -30653 -26153 8654 46869
12611 46869 47501 7509 -10318 -45250 -62505 -30932 -69615 -48208 -15384 -39883 -28787 38634
$$ packed form
12700c2574M4657K7400j0297k0117l0629m0230K2870J0216k6539J2592P947L0725
12688c979K0129R066j9849k1913R825l632j2188P992J3923K3519L6249O973j2353
12675E3762l919P163l1359l7535J1189q521l4575r556j8486R182K8990L8028k7310
12662b2947J8680j3873p4227k8420L7065K8249K7566K4984J1928N6547k4717m7028
12650f193K479L8369L0035p391n6792K6337L646k1142o091o8844J705L4794M3224
12637A4136O18m6092M484K8706J0238Q303L0525J3190j5655m853k3021k0097k771
12624b289K6323N6510q26m5252l1246o232K3810J670k8430k4691M500L4807L8215
12611D6869O32l9992j7827l4932j7255L1573l8683K1407L2824k4499J1096O7421
$$ plain form
12599 38634 51235 19950 -19009 -16950 -13056 -14699 -56115 -48515 -4379 21778 24240 7177 -44633
12586 -44633 -49103 8289 21645 21561 11745 -6687 -46163 -44171 2331 15218 -2029 -22931 20132
12573 20132 44784 -3164 -7414 -6513 -10544 -11421 8082 23452 30241 2097 15781 10818 2361
12560 2361 24019 66539 57749 25399 24132 27183 33874 15714 -23223 -19318 -11854 -25139 -32880
12547 -32880 -53263 -22474 16196 20143 28001 12154 -8336 -1081 777 -40359 -67911 -6713
12535 -6713 -29575 -47820 -56178 -87058 -90244 -65988 -50921 -23292 -11201 20539 -2443 -55067
12523 -55067 -39212 -11954 29727 53742 53148 -23206 -81730 -65724 -57273 -48306 -21549 -10014
12511 -10014 -18804 -26219 -15767 -17415 -32989 -59112 -74589 -90697 -70561 -20530 21480 25777
$$ packed form
12599C8634J2601l1285l8959K059L894j643m1416P600M4136K6157K462j7063n1810
12586d4633m470N7392J3356q4r816j8432l9476J992M6502J2887j7247k0902M3063
12573B0132K4652m7948m250R01m031q77J9503J5370O789k8144J3684m963q457
12560B361K1658M2520q790l2350j267L051O691j8160l8937L905P464j3285p741
12547c2880k0383L0789L8670L947P858j5847k0490P255J858m1136k7552O1198
12535f713k2862j8245q358l0880l186K4256J5067K7629J2091L1740k2982n2624
12523e5067J5855K7258M1681K4015n94p6354n8524J6006Q451Q967K6757J1535
12511a0014q790p415J0452j648j5574k6123j5477j6108K0136N0031M2010M297
$$ plain form
12499 25777 -388 3885 -46076 -43301 23839 32687 11136 -1289 -4296 -12980 -44621 -53063 -42685
12486 -42685 9126 22369 1054 35230 58359 18013 -27678 -29236 -32728 -22862 12852 18846
12474 18846 31961 40316 6188 -26952 -40700 -25823 9739 40627 -2723 -24004 -12543 12578
12462 12578 7423 -21851 -75774 -77355 -29114 -11204 91 -7154 28698 28511 6170 1657 33054
12449 33054 44641 46872 2985 4265 25074 16954 -50473 -66545 -25725 -7352 -18792 -29211
12437 -29211 -20070 -4090 -34595 -59632 -30433 -13262 -11264 -11171 10437 24170 16693 -51494 -49651
12424 -49651 -25511 11212 15741 -13875 -10188 3476 20902 27205 24754 57452 63677 20328 -11314
12411 -11314 -45957 -45061 -37853 -14533 -1906 -15783 -15926 13935 6505 1261 -6478 -21255 -32112
$$ packed form
12499B5777k6165M273m9961K775O7140Q848k1551j2425l007q684l1641q442J0378
12486d2685N1811J3243k1315L4176K3129m0346m5691j558l492R866L5714N994
12474A8846J3115Q355l4128l3140j3748J4877L5562L0888m3350k1281J1461K5121
12462A2578n155k9274n3923j581M8241J7910J1295p245L5852j87k2341m513L1397
12449C3054J1587K231m3887J280K0809q120o7427j6072M0820J8373j1440j0419
12437b9211R141J5980l0505k5037K9199J7171J998R3K1608J3733p477o8187J843
12424d9651K4140L6723M529k9616L687J3664J7426O303k451L2698O225m3349l1642
12411a1314l4643Q96P208K3320J2627j3877j43K9861p430n244p739j4777j0857
$$ plain form
12398 -32112 -8399 15048 24475 32531 24227 -146 -2578 -1335 -14559 -4711 2441 -4803 1653
12385 1653 1243 -17222 -10184 13002 -38626 -57136 -61315 137 21894 40112 59424 47380 12367
12372 12367 6817 18200 -4340 -4154 -65863 -35417 27499 7923 -14678 -14691 -46715 -67659 -76341
12359 -76341 -55309 -34571 15195 23342 27046 52232 10019 -18354 -2185 53232 68769 53793
12347 53793 24665 51774 88019 66192 60132 29870 15060 23841 -14298 -38818 -24174 8352
12335 8352 29116 12106 -19859 17762 25531 28771 7566 -37491 -49467 -15059 30948 18801
12323 18801 -8058 19895 5136 -61500 -80190 -94482 -74102 -58564 -81140 -68867 -48071 -31730
12311 -31730 -31915 -36106 -17452 26414 1267 -51459 -43041 -26092 -48599 -86854 -94760 -51864 -44976
$$ packed form
12398c2112K3713K3447R427Q056q304k4373k432J243j3224R848P152p244O456
12385A653m10j8465P038K3186n1628j8510m179O1452K1757J8218J9312j2044l5013
12372A2367n550J1383k2540J86o1709L0446O2916j9576k2601j3l2024k0944q682
12359g6341K1032K0738M9766Q147L704K5186m2213k8373J6169N5417J5537j4976
12347E3793k9128K7109L6245k1827o060l0262j4810Q781l8139k4520J4644L2526
12335H352K0764j7010l1965L7621P769L240k1205m5057j1976L4408M6007j2147
12323A8801k6859K7953j4759o6636j8690j4292K0380J5538k2576J2273K0796J6341
12311c1730j85m191J8654M3866k5147n2726Q418J6949k2507l8255p906M2896O888
$$ plain form
12298 -44976 -35042 -5126 5852 -27158 17272 62604 45472 4028 -25455 -12306 16439 -755
12286 -755 -11368 -4001 -10507 -31412 17900 36223 5618 15409 17806 -13647 929 -36486 -55681
12273 -55681 -26357 -53520 -25048 15503 24579 24901 22475 18227 67751 90795 50820 13829 -3109
12260 -3109 -26992 -12520 12477 -28106 -33026 -29934 -71305 -46412 -16737 -7600 12781 20181 34404
12247 34404 40962 23423 -3281 19889 51537 -7607 -2755 34926 -16814 -7762 -27301 -36311
12235 -36311 14783 41801 35050 -18472 -4611 -9098 -67197 -60532 -25908 10883 38285 85348
12223 85348 113197 69152 66847 97658 55932 38823 4781 -54314 -88338 -66205 7882 36743
12211 36743 62031 54663 24861 14261 35187 87995 77736 35673 -2937 -23206 45250 51694
$$ packed form
12298d4976R934K9916J0978l3010M4430M5332j7132m1444k9483J3149K8745j7194
12286g55j0613P367o506k0905M9312J8323l0605R791K397l1453J4576l7415j9195
12273e5681K9324k7163K8472M0551R076L22k426m248M9524K3044l9975l6991j6938
12260c109k3883J4472K4997m0583m920L092m1371K4893K9675R137K0381P400J4223
12247C4404O558j7539k6704K3170L1648n9144M852L7681n1740R052j9539r010
12235c6311N1094K7018o751n3522J3861m487n8099O665L4624L6791K7402M7063
12223H5348K7849m4045k305L0811m1726j7109l4042n9095l4024K2133P4087K8861
12211C6743K5288p368k9802j0600K0926N2808j0259m2063l8610k0269O8456O444
$$ plain form
12199 51694 19179 420 -21143 345 -2470 -6122 28053 25723 -13810 -4695 -3354 -11786 25734
12186 25734 10728 -36294 -79775 -65638 -17866 -37009 -20217 -36727 -37460 -41230 -44424 -15066
12174 -15066 5448 2599 -18111 -41157 -43147 -21646 -24001 -44804 -78968 -30451 -16632 -44090
12162 -44090 -81205 -51764 -6377 -30383 -14674 -9375 -13032 -7996 -3989 10417 22796 1500
12150 1500 5613 -15015 -59092 -91618 -83277 -14421 4720 297 -36550 -43508 -13932 -22478 -45606
12137 -45606 -21656 15544 -653 -3206 7127 18839 46956 27968 -13980 14282 66098 7150
12125 7150 7237 19731 9528 -27214 -39225 -47831 -51715 -20611 -41615 -41246 15947 42233 16552
12112 16552 3139 1889 -31907 -43990 -43913 -26079 -39338 -53753 -69821 -39001 22733 12461
$$ packed form
12199E1694l2515j8759k1563K1488k815l652L4175k330l9533R115J341q432L7520
12186B5734j5006m7022m3481J4137M7772j9143J6792j6510p33l770l194K9358
12174a5066K0514k849k0710k3046j990K1501k355k0803l4164M8517J3819k7458
12162d4090l7115K9441M5387k4006J5709N299l657N036M007J4406J2379k1296
12150A500M113k0628m4077l2526Q341O8856J9141m423l6847o958K9576q546k3128
12137d5606K3950L7200j6197k553J0333J1712K8117j8988m1948K8262N1816n8948
12125G150Q7J2494j0203l6742j2011q606l884L1104k1004L69N7193K6286k5681
12112A6552j3413j250l3796j2083P7J7834j3259j4415j6068L0820O1734j0272
$$ plain form
12100 12461 3961 -35793 -78742 -77429 -42931 -17099 -31822 -46251 -73242 -69887 -38707 -37946 -21518
12087 -21518 -12480 -27391 -33038 -24342 30639 57046 63356 35379 32228 38165 54909 13356 2724
12074 2724 9369 3009 -24187 2329 22829 18849 30382 71971 97177 72277 17767 78158
12062 78158 107117 59545 11771 26841 11811 -6141 -16245 -25261 4675 22860 -1036 18498
12050 18498 17836 6781 -8851 -53911 -64084 -22878 15323 47731 64242 52550 -4725 -2067
12038 -2067 -16724 12822 38661 27504 -85 -39120 -55367 -52949 -47031 -47924 -29668 -8167 11533
12025 11533 -4955 -33948 -48538 -41709 -40623 -46540 -25788 3204 16510 3513 -12062 -11579 10723
12012 10723 -7900 -13348 10466 2906 -3207 -15010 -22387 -25829 -17529 11790 4309 -23716 -37702
$$ packed form
12100A2461q500l9754m2949J313L4498K5832j4723j4429k6991L355L1180P61J6428
12087b1518R038j4911n647Q696N4981K6407O310k7977l151N937J6744m1553j0632
12074B724O645o360k7196K6516K0500l980J1533M1589K5206k4900n4510O0391
12062G8158K8959m7572m7774J5070j5030j7952j0104r016K9936J8185k3896J9534
12050A8498o62j1055j5632m5060j0173M1206L8201L2408J6511j1692n7275K658
12038b067j4657K9546K5839j1157k7589l9035j6247K418N918q93J8256K1501J9700
12025A1533j6488k8993j4590O829J086n917K0752K8992J3306j2997j5575M83K2302
12012A0723j8623n448K3814p560o113j1803p377l442Q300K9319p481k8025j3986
$$ plain form
11999 -37702 -14593 11696 21740 21188 15376 35206 20556 11480 26325 3235 -27269 -67150
11987 -67150 -58001 -50030 -73123 -54745 -72960 -93814 -50954 22337 3585 -51132 -63909 -49495
11975 -49495 -10547 15898 34524 25726 -5037 -20316 -20006 4647 -17321 -6812 -5649 15347
11963 15347 7158 -25776 -79675 -74821 -28537 19351 20851 -22012 -41261 -15704 23133 20902
11951 20902 19440 -15548 -28072 -40342 -20015 -47095 -67753 -43020 -9157 31491 86802 103685
11939 103685 61184 65487 37723 1303 -2855 -1390 1126 -31208 -64877 -187 52221 58532
11927 58532 29724 49133 6334 24401 16359 -10766 -50617 -59065 -38275 -36680 -33417 -61167
11915 -61167 -43541 -12596 4429 38906 6622 -43612 -85234 -59489 -4379 32963 27738 16804
$$ packed form
11999c7702K3109K6289J0044n52n812J9830j4650r076J4845k3090l0504l9881
11987f7150R149P971k3093J8378j8215k0854M2860P3291j8752n4717j2777J4414
11975d9495L8948K6445J8626q798l0763j5279L10K4653k1968J0509J163K0996
11963A5347q189l2934n3899M854M6284M7888J500m2863j9249K5557L8837k231
11951B0902j462l4988j2524j2270K0327k7080k0658K4733L3863M0648N5311J6883
11939A03685m2501M303k7764l6420m158J465K516l2334l3669O4690N2408O311
11927E8532k8808J9409m2799J8067q042k7125l9851q448K0790J595L263k7750
11915f1167J7626L0945J7025L4477l2284n0234m1622K5745N5110L7342n225j0934
$$ plain form
11903 16804 -10819 -46051 -58740 -41581 -43411 -15115 11327 -8646 -39413 6007 6550 30313
11891 30313 49706 36449 31878 36121 34185 -31075 -30955 -16575 -18060 45202 63541 59862 52300
11878 52300 67320 81002 93767 82436 39902 57178 29294 -23866 -52574 -63489 -74225 -79507
11866 -79507 -98343 -93342 -72833 -46851 -23006 -39529 -33683 -33078 -72656 -84657 -31272 26501
11854 26501 -38323 -89118 -78586 -16484 14767 8019 40887 58980 56754 58938 42013 7197
11842 7197 10990 -11546 -55370 -48383 -25061 -34109 -46598 -53054 -26361 -22822 -41150 -36502 -25245
11829 -25245 -32611 -59446 -19574 3120 -2507 -29959 -33600 -46353 -35438 -25749 -264 -15565
11817 -15565 -10290 -1129 -28322 -12043 6512 -5478 -47419 -35002 -946 25748 6665 -10976
$$ packed form
11903A6804k7623l5232j2689J7159j830K8296K6442j9973l0767M5420N43K3763
11891C0313J9393j3257m571M243j936o5260J20J4380j485O3262J8339l679p562
11878E2300J5020J3682J2765j1331m2534J7276k7884n3160k8708j0915j0736n282
11866g9507j8836N001K0509K5982K3845j6523N846O05l9578j2001N3385N7773
11854B6501o4824n0795J0532O2102L1251o748L2868J8093k226K184j6925l4816
11842G197L793k2536m3824O987K3322r048j2489o456K6693L539j8328M648J1257
11829b5245p366k6835L9872K2694n627k7452l641j2753J0915R689K5485j5301
11817a5565N275R161k7193J6279J8555j1990m1941J2417L4056K6694j9083j7641
$$ plain form
11805 -10976 22570 32945 28505 11305 -432 22874 41325 47204 34588 -11112 -43087 -32326
11793 -32326 -33819 -3442 17687 -3070 6761 7927 1438 -11778 -30476 -29331 -52497 -68897 -77259
11780 -77259 -39074 -13102 9580 24296 -24724 -2284 63641 26108 8376 -29867 -42560 -65830
11768 -65830 -43176 29912 70258 75753 35341 11192 36555 92029 72463 33616 13819 16258
11756 16258 31493 52382 60948 -381 -53185 -78424 -82241 -84882 -86750 -50377 2974 46868
11744 46868 22327 55220 75033 52612 74452 53216 -21945 -37119 -40178 -4297 38471 80078
11732 80078 79898 93018 59977 13680 42458 53864 45910 62410 63608 18301 -18370 -1365
11720 -1365 -11802 -5807 -6571 -1699 -25509 -67792 -21260 2575 3015 -8296 -16219 29282 49997
$$ packed form
11805a0976L3546J0375m440j7200j1737K3306J8451N879j2616m5700l1975J0761
11793c2326j493L0377K1129k0757R831J166o489j3216j8698J145k3166j6400q362
11780g7259L8185K5972K2682J4716m9020K2440O5925l7533j7732l8243j2693k3270
11768f5830K2654P3088M0346N495m0412k4149K5363N5474j9566l8847j9797K439
11756A6258J5235K0889Q566o1329n2804k5239l817k641j868L6373N3351M3894
11744D6868k4541L2893J9813k2421K1840k1236p5161j5174l059L5881M2768M1607
11732H0078j80J3120l3041m6297K8778J1406p954J6500J198m5307l6671J7005
11720a365j0437N995p64M872k3810m2283M6532K3835M40j1311p923M5501K0715
$$ plain form
11707 49997 32673 15405 -23168 -48186 -27948 -31104 24742 43668 53545 49734 43287 20956
11695 20956 -20952 -39123 -7158 10732 22277 -16736 -44271 -49684 -16596 -36237 -19333 15680
11683 15680 24300 42547 38695 16849 2155 -52108 -50543 -21158 -6300 -1160 2239 677 26307
11670 26307 36592 26467 48970 56677 20327 -1336 -3077 -22677 -18798 -42409 -23838 41635
11658 41635 43133 24437 22518 41862 55101 28637 25764 -13040 -21968 -6725 -33 -4537 -255
11645 -255 16710 39389 64874 37058 21183 3779 -2918 25852 51426 84918 14261 -8767
11633 -8767 4051 36366 45618 44367 -10969 -26285 -25492 -24681 -44567 -58940 -77426 -56107 9977
11620 9977 -27591 -65538 870 69457 42392 17409 9776 -31194 -17240 -8409 26417 4195
$$ packed form
11707D9997j7324j7268l8573k5018K0238l156N5846J8926R877l811o447k2331
11695B0956m1908j8171L1965J7890J1545l9013k7535n413L3088j9641J6904L5013
11683A5680Q620J8247l852k1846j4694n4263J565K9385J4858N140L399j562K5630
11670B6307J0285j0125K2503P707l6350k1663j741j9600L879k3611J8571O5473
11658D1635J498j8696j919J9344J3239k6464k873l8804q928J5243O692m504M282
11645b55J6965K2679K5485k7816j5875j7404o697K8770K5574L3492p0657k3028
11633h767J2818L2315R252j251n5336j5316P93Q11j9886j4373j8486K1319O6084
11620I977l7568l7947O6408O8587k7065k4983p633m0970J3954Q831L4826k2222
$$ plain form
11608 4195 -25536 34527 84309 70610 67374 83271 89538 76208 43338 44431 27344 1648
11596 1648 34641 53225 68149 59403 40828 39638 21214 18760 -12388 -30049 -44113 -36865 -11636
11583 -11636 13566 13927 27858 -7946 -36355 -76793 -67334 -74947 -54965 -45245 -28738 -15866 -26435
11570 -26435 -56206 -40483 -7509 -44311 -53854 -32858 -42028 -57910 -89808 -75182 -61726 -61264
11558 -61264 -76301 -47218 -24909 -5193 8055 -19246 -7985 52586 35619 4406 20760 5817
11546 5817 -15789 -27638 -31481 -97042 -118684 -59486 -28615 -2400 6472 -5160 -8673 -31845
11534 -31845 -17162 -14942 -647 3459 14368 3836 13720 65209 79994 40417 9956 9471 27168
11521 27168 60974 78745 47753 12848 8567 34193 28326 -9930 -55469 -39926 -4294 -11689
$$ packed form
11608D195k9731O0063M9782j3699l236J5897O267j3330l2870J093j7087k5696
11596A648L2993J8584J4924q746j8575j190j8424k454l1148j7661j4064P248K5229
11583a1636K5202L61J3931l5804k8409m0438R459p613J9982R720J6507J2872j0569
11570b6435k9771J5723L2974l6802r543K0996r170j5882l1898J4626J3456M62
11558f1264j5037K9083K2309J9716J3248k7301J1261O0571j6967l1213J6354j4943
11546E817k1606j1849l843o5561k1642N9198L0871K6215Q872j1632l513k3172
11534c1845J4683K220J4295M106J0909j0532R884N1489J4785l9577l0461m85J7697
11521B7168L3806J7771l0992l4905m281K5626n867l8256m5539J5543L5632p395
$$ plain form
11509 -11689 -54441 -3886 48019 41921 62797 66230 36107 15166 -1334 4515 -23793 -27917
11497 -27917 4833 22255 22262 45481 75993 75601 17334 25499 62764 84038 40191 40048 23439
11484 23439 -12177 -8577 -2572 3290 20953 37479 -5366 -14804 -45919 -13168 -16906 -32259 -28682
11471 -28682 28209 -492 -29615 542 -4730 -7883 1075 34836 13763 -39299 -42365 -9471
11459 -9471 30493 26121 -14991 -3535 30740 61215 29493 25608 39105 23268 26199 71481
11447 71481 52860 11811 -3797 -17848 26810 37092 62385 38502 15477 -927 7020 20268
11435 20268 4387 -23602 31681 90052 100435 91240 118590 157306 242182 373017 540529
11424 540529 802058 1328594 2092763 2345103 2027512 1551084 1100792 747940 506397 363394
$$ packed form
11509a1689m2752N0555N1905o098K0876L433l0123k0941j6500N849k8308m124
11497b7917L2750J7422PK3219L0512l92n8267Q165L7265K1274m3847j43j6609
11484B3439l5616L600O005N862J7663J6526m2845r438l1115L2751l738j5353L577
11471b8682N6891k8701k9123L0157n272l153Q958L3761k1073n3062l066L2894
11459i471L9964m372m1112J1456L4275L0475l1722l885J3497j5837K931M5282
11447G1481j8621m1049j5608j4051M4658J0282K5293k3883k3025j6404P947J3248
11435B0268j5881k7989N5283N8371J0383r195K7350L8716Q4876J30835J67512
11424E40529K61529N26536P64169K52340l17591m76428m50292l52852k41543j43003
$$ plain form
11414 363394 294726 238207 193049 144633 127105 80499 32012 -3765 6077 33386 39650 61536
11402 61536 30890 -7913 -4913 -34939 -28655 13651 48195 39367 49391 54341 32616 17565
11390 17565 -14500 -795 30607 3190 -38431 -29645 -12410 -19333 -17698 -13453 -6840 -29971 -32413
11377 -32413 -20299 518 -20487 -39875 33408 50732 62811 92933 100670 40149 5115 -21321
11365 -21321 -45101 -19586 -25491 -31407 -43276 -32433 5417 18452 27025 8728 51031 41446
11353 41446 -3495 -36211 -38737 -6886 32814 33416 -1078 -21592 -19872 15729 35181 6152
11341 6152 -16247 -55594 -62724 -18827 7210 27985 22016 7931 -18166 -34467 -38960 -52190
11329 -52190 -31265 -15314 28156 35540 -9919 -30613 -20552 922 -23379 -20650 -25386 -4246
$$ packed form
11414C63394o8668n6519m5158m8416j7528m6606m8487l5777R842K7309O264K1886
11402F1536l0646l8803L000l0026O284M2306L4544q828J0024M950k1725j5051
11390A7565l2065J3705L1402k7417m1621Q786J7235o923J635M245O613k3131k442
11377c2413J2114K0817k1005j9388P3283J7324J2079L0122P737o0521l5034k6436
11365b1321k3780K5515n905n916j1869J0843L7850J3035Q573j8297M2303r585
11353D1446m4941l2716k526L1851L9700O02l4494k0514J720L5601J9452k9029
11341F152k2399l9347p130M3897K6037K0775n969j4085k6097j6301m493j3230
11329e2190K0925J5951M3470P384m5459k0694J0061K1474k4301K729m736K1140
$$ plain form
11317 -4246 -2931 15202 34920 80078 64631 51807 31662 42208 44765 48751 46688 39786 15586
11304 15586 64451 71001 79776 20831 -11121 69121 61683 51547 85442 93706 96733 87404 75125
11291 75125 43889 51740 68212 56228 31840 -19989 8276 41887 53064 70741 34522 -11572
11279 -11572 -28283 -260 12063 23131 30708 21856 27539 30119 73578 138861 157701 200207
11267 200207 266301 303127 305516 256748 170785 123377 116661 165191 151403 121832 135466 146141
11255 146141 150969 74630 33668 36749 59072 93886 95873 40273 28098 18161 29258 23928
11243 23928 -360 -1854 -1143 44659 82114 46136 75517 105250 102996 63664 23487 48069
11231 48069 21423 -18449 -19605 -4684 31529 74804 85891 100858 92311 103722 123274 119318
$$ packed form
11317d246J315J8133J9718M5158j5447j2824k0145J0546K557L986k063o902k4200
11304A5586M8865O550Q775n8945l1952Q0242p438j0136L3895Q264L027r329j2279
11291G5125l1236P851J6472j1984k4388n1829K8265L3611J1177J7677l6219m6094
11279a1572j6711K8023J2323J1068P577q852N683K580M3459O5283J8840M2506
11267B00207O6094L6826K389m8768q5963m7408o716M8530j3788k9571J3634J0675
11255A46141M828p6339m0962L081K2323L4814J987n5600j2175r937J1097n330
11243B3928k4288j494P11M5802L7455l5978K9381K9733k254l9332m0177K4582
11231D8069k6646l9872j156J4921L6213M3275J1087J4967q547J1411J9552l956
$$ plain form
11219 119318 101242 76667 49637 34444 20853 9725 -40520 -53923 -73858 -68732 -34754 -18232
11207 -18232 -11437 32460 70291 59022 14111 -17164 -12270 9669 39102 13601 -6235 -35207
11195 -35207 -27979 15240 13157 26908 24950 20684 33339 64747 96882 100669 114215 107084 43143
11182 43143 45932 61466 48851 48146 29153 3517 15671 5109 -17889 -17348 -2345 23636 32704
11169 32704 14559 39353 67009 80799 91625 129011 92027 35652 49648 53703 92252 159370
11157 159370 146153 111998 90621 98202 131542 162154 221890 250783 186044 159299 146185 165668
11145 165668 142558 156911 182186 123634 -38125 -336548 -455458 -322166 -226956 -197843 -136709
11134 -136709 -77260 -1861 51878 20096 10479 44632 57952 37716 60878 11801 20940 59827
$$ packed form
11219A19318j8076k4575k7030j5193j3591j1128n0245j3403j9935N126L3978J6522
11207a8232O795M3897L7831j1269m4911l1275M894K1939K9433k5501j9836k8972
11195c5207P228M3219k083J3751j958m266J2655L1408L2135L787J3546p131o3941
11182D3143K789J5534j2615p05j8993k5636J2154j0562k2998N41J5003K5981R068
11169C2704j8145K4794K7656J3790J0826L7386l6984n6375J3996M055L8549O7118
11157A59370j3217l4155k1377P581L3340L0612N9736K8893o4739k6745j3114J9483
11145A65668k3110J4353K5275n8552j61759k98423j18910J33292R5210K9113O1134
11134a36709N9449P5399N3739l1782r617L4153J3320k0236K3162m9077R139L8887
$$ plain form
11122 59827 78329 54509 69441 100837 40201 22586 59572 85772 110005 104718 67051 2463
11110 2463 54170 63473 65268 71243 46019 42590 63298 114960 156789 154992 129105 65127 73237
11097 73237 154071 195498 222404 196668 139560 125916 75390 27238 34116 97523 125181 143903
11085 143903 195653 223291 185014 127074 125882 181119 230346 276660 341634 352823 328464 273633
11073 273633 267861 288408 254422 255553 291068 309643 339417 389850 403773 401294 411856 427329
11061 427329 437311 422644 445465 411958 421067 531051 655063 725525 722421 803005 818621 849280
11049 849280 893432 965729 1027964 1173748 1319188 1474220 1636233 1722092 1857702 1967591
11039 1967591 2183218 2601504 3389494 4375111 4909275 4947407 4828409 4793001 4828032 5088352
$$ packed form
11122E9827J8502k3820J4932L1396o0636j7615L6986K6200K4233n287l7667o4588
11110B463N1707R303J795N975k5224l429K0708N1662M1829j797k5887o3978Q110
11097G3237Q0834M1427K6906k5736n7108j3644n0526m8152O878O3407K7658J8722
11085A43903N1750K7638l8277n7940j192N5237M9227M6314O4974J1189k4359n4831
11073B73633n772K0547l3986J131L5515J8575K9774N0433J3923k479J0562J5473
11061D27329R982j4667K2821l3507R109J09984J24012P0462l104Q0584J5616L0659
11049H49280M4152P2297O2235J45784J45440J55032J62013Q5859J35610J09889
11039A967591K15627M18286P87990R85617N34164L8132j18998l5408L5031K60320
$$ plain form
11029 5088352 5640661 6345246 7194029 8399843 9996648 12005751 14533019 18040193 22826206
11020 22826206 29516558 39184732 53813747 78398252 122721093 208251362 351274099
11013 351274099 443429088 407848541 323383399 242313313 170769533 116178479 80400556
11006 80400556 58873996 45844152 37156083 30536939 25256333 21065577 17724692 15018387
10998 15018387 12920408 11282329 9948328 8786323 7763708 6977864 6491815 6363363
10990 6363363 6588824 6854753 6438056 5653429 4838753 4098858 3476209 3011286 2654027
10981 2654027 2378853 2162649 2055748 1930787 1838841 1731938 1594871 1493800 1407625 1290768
10971 1290768 1228622 1257373 1235309 1178323 1148431 1097477 1036588 1010339 931060 874321 836933
$$ packed form
11029E088352N52309P04585Q48783J205814J596805K009103K527268L507174M786013
11020B2826206O690352R668174J4629015K4584505M4322841Q5530269J43022737
11013C51274099R2154989l5580547q4465142q1070086p1543780n4591054l5777923
11006H0400556k1526560j3029844q688069o619144n280606m190756l340885k706305
10998A5018387k097979j638079j334001j162005j022615p85844m86049j28452
10990F363363K25461K65929m16697p84627q14676p39895o22649m64923l57259
10981B654027k75174k16204j06901j24961r1946j06903j37067j01071q6175j16857
10971A290768o2146K8751k2064n6986k9892n0954o0889k6249p9279n6739l7388
$$ plain form
10960 836933 788160 769111 764321 741404 765465 771777 764252 717105 627324 547616 531390 520937
10948 520937 487275 500753 579921 674781 735441 691118 654710 644938 589207 536251 497085 475008
10936 475008 513927 474200 446462 413083 348306 286546 292247 357464 368218 358849 369261 370059
10924 370059 314057 327714 297576 266551 301275 286135 284502 285064 303621 311136 337708 310834
10912 310834 317113 326996 324767 297119 250437 225435 206908 211900 218265 205742 189300 186414 162893
10899 162893 188521 176630 164175 163372 170334 203556 250614 292124 351360 403577 493587 669865
10887 669865 842191 753106 572801 433258 337032 232746 138979 70835 97847 109098 76295
10876 76295 55650 38219 -6920 -12509 -13199 5867 16819 5470 13265 41534 24108 6452
$$ packed form
10960H36933m8773j9049m790k2917K4061O312p525m7147q9781p9708j6226j0453
10948E20937l3662J3478P9168R4860O0660m4323l6408r772n5731n2956l9166k2077
10936D75008L8919l9727k7738l3379o4777o1760N701O5217J0754r369J0412P98
10924C70059n6002J3657l0138l1025L4724j5140j633N62J8557P515K6572k6874
10912C10834O279R883k229k7648m6682k5002j8527M992O365j2523j6442k886k3521
10899A62893K5628j1891j2455q03O962L3222M7058M1510N9236N2217R0010J76278
10887F69865J72326q9085j80305j39543r6226j04286r3767o8144K7012J1251l2803
10876G6295k0645j7431m5139n589o90J9066J0952j1349P795K8269j7426j7656
$$ plain form
10864 6452 24770 42074 55610 59256 44555 68033 75890 93854 84695 94448 147838 151128 151771
10851 151771 127364 99841 78116 51865 71331 122678 125226 111735 121677 107987 81204 106804
10839 106804 104003 93801 98235 64825 80312 98007 59833 66550 83517 109110 90491 51881
10827 51881 38218 49825 41995 40142 94621 54695 25417 40730 67635 119199 128667 148316
10815 148316 163670 163950 190111 143338 117596 111792 118726 99862 23592 52052 61099 29486
10803 29486 20652 -7019 -51121 -48051 -33198 -18310 -16627 21984 -6170 -56312 -56089 -7447 7753
10790 7753 -1840 -38101 -56835 -58343 -12108 48603 40907 37538 38040 41505 35952 51561 38530
10777 38530 -4012 15561 381 3474 21411 23313 -40985 -45321 12059 2487 -4907 36083 68707
$$ packed form
10864F452J8318J7304J3536L646j4701K3478P857J7964r159R753N3390L290O43
10851A51771k4407k7523k1725k6251J9466N1347K548j3491R942j3690k6783K5600
10839A06804k801j0202M434l3410J5487J7695l8174O717J6967K5593j8619l8610
10827E1881j3663J1607p830j853N4479l9926k9278J5313K6905N1564R468J9649
10815A48316J5354K80K6161m6773k5742n804O934j8864p6270K8460R047l1613
10803B9486q834k7671m4102L070J4853J4888J683L8611k8154n0142K23M8642J5200
10790G753r593l6261j8734j508M6235O0711p696l369N02L465n553J5609j3031
10777C8530m2542J9573j5180L093J7937J902o4298m336N7380r572p394M0990L2624
$$ plain form
10764 68707 77322 61552 74750 93906 96558 119379 140906 108825 68552 32780 60818 81753
10752 81753 59163 7984 39453 77176 78299 80664 31520 32291 51593 37328 15370 -21025
10740 -21025 -40901 -65809 -30338 30385 20047 11666 13602 -31850 -72741 -38555 -31891 -9187
10728 -9187 -203 -1739 26990 82582 65746 19796 -38881 -38558 -10294 -44790 -56970 -46778 -55288
10715 -55288 -56304 -25814 -17791 -40877 -13320 -32890 -31876 -2898 31854 44557 69504 113229
10703 113229 128589 91676 50876 19680 -3309 53598 62430 49567 38538 9120 -20003 -33797
10691 -33797 -1685 37908 37635 28040 36169 99868 146141 120966 92674 74930 71551 53006 40337
10678 40337 20592 22590 -17511 -26641 -14943 4605 20378 91202 120145 205901 215721 209558
$$ packed form
10764F8707Q615j5770J3198J9156K652K2821K1527l2081m0273l5772K8038K0935
10752H1753k2590n1179L1469L7723J123K365m9144P71J9302j4265k1958l6395
10740b1025j9876k4908L5471O0723j0338q381J936m5452m0891L4186O664K2704
10728i187Q984j536K8729N5592j6836m5950n8677L23K8264l4496j2180J0192q510
10715e5288j016L0490Q023k3086K7557j9570J014K8978L4752J2703K4947M3725
10703A13229J5360l6913m0800l1196k2989N6907Q832j2863j1029k9418k9123j3794
10691c3797L2112L9593k73r595Q129O3699M6273k5175k8292j7744l379j8545j2669
10678D0337j9745J998m0101r130J1698J9548J5773P0824K8943Q5756R820o163
$$ plain form
10666 209558 169457 101151 106928 85446 72737 90564 56223 18269 56052 85810 56006 40061
10654 40061 59394 99559 125934 108800 26384 -18433 -68050 -70316 -37440 -39827 -52252 -26849
10642 -26849 -27296 -7106 -5951 7520 -9227 -11074 3464 9601 24586 10619 -4592 -1067 30129
10629 30129 16564 639 -12660 3742 740 -5078 14319 43423 60420 38619 30926 56701
10617 56701 63909 89438 79375 65904 88924 104090 69995 77504 54212 86373 140706 206410
10605 206410 249273 352508 507956 739754 1131599 1856875 2320447 2171894 1750042 1345215
10595 1345215 1006915 706441 519902 404431 316626 253185 180136 135596 79847 58819
10585 58819 41458 18596 18123 40604 53522 60741 50380 45059 46347 31150 24352 12184 18638
$$ packed form
10666B09558m0101o8306N777k1482j2709J7827l4341l7954L7783K9758k9804j5945
10654D0061J9333M0165K6375j7134q2416m4817m9617k266L2876k387j2425K5403
10642b6849m47K0190J155J3471j6747j847J4538O137J4985j3967j5211L525L1196
10629C0129j3565j5925j3299J6402l002n818J9397K9104J6997k1801p693K5775
10617E6701P208K5529j0063j3471K3020J5166l4095P509k3292L2161N4333O5704
10605B06410M2863J03235J55448K31798L91845P25276M63572j48553m21852m04827
10595A345215l38300l00474j86539j15471q7805o3441p3049m4540n5749k1028
10585E8819j7361k2862m73K2481J2918P219j0361n321J288j5197o798j2168O454
$$ plain form
10572 18638 30099 34440 36786 44150 41670 41267 37295 3793 -1841 21042 32134 8533 -1511
10559 -1511 -14587 -9421 21684 44496 25354 22246 55554 4809 -19906 4768 11902 34693
10547 34693 13276 27589 20978 -37024 -37065 -74162 -72827 -40696 -13317 29484 43332 12367 -12753
10534 -12753 18433 64680 60578 44851 22440 25281 -20680 -81468 -9184 27282 50070 81301
10522 81301 83205 60753 47494 49705 23116 10590 -17653 -25824 -22957 -13184 6472 10068 -47645
10509 -47645 -72772 -48387 -46489 -54137 -33638 -9895 -29172 38534 69247 8691 -6604 -15458
10497 -15458 -45874 -39106 -298 -842 -47384 -45561 -36925 -29051 14533 53195 25539 25279 6178
10484 6178 2112 704 -23024 -45011 -57322 -48228 -26065 -4331 19635 45483 7769 -46538
$$ packed form
10572A8638J1461M341K346P364k480m03l972l3502n634K2883J1092k3601j0044
10559a511j3076N166L1105K2812j9142l108L3308n0745k4715K4674P134K2791
10547C4693k1417J4313o611n8002m1l7097J335L2131K7379M2801J3848l0965k5120
10534a2753L1186M6247m102j5727k2411K841m5961o0788P2284L6466K2788L1231
10522H1301J904k2452j3259K211k6589j2526k8243q171K867R773J9656L596n7713
10509d7645k5127K4385J898p648K0499K3743j9277O7706L0713o0556j5295q854
10497a5458l0416O768L8808n44m6542J823Q636P874M3584L8662k7656k60j9101
10484F178m066j408k3728k1987j2311R094K2163K1734K3966K5848l7714n4307
$$ plain form
10472 -46538 -21286 -24613 16772 2816 -25877 -51605 -51323 -52222 -39732 -480 33045 570 -36102
10459 -36102 -24598 32322 14445 3548 -28691 -21704 -24598 -48034 -53989 -4692 6296 -44057
10447 -44057 -4524 26662 56129 64729 34012 10134 -27391 -47339 -51171 -61031 -40157 -26179
10435 -26179 -30659 -70779 -19822 -8041 -26390 -23854 -34386 -33149 -874 25033 27801 41593
10423 41593 22319 -10000 -26253 -73611 -59786 15772 48545 -9810 25611 14027 13882 57683
10411 57683 58473 5064 -13472 -12583 21519 43016 27945 35961 18529 11240 9910 20003 24500
10398 24500 30722 17506 3796 -21564 -2739 -28354 -57211 -28712 -6148 -18314 -42116 -68857
10386 -68857 -101504 -92284 -21393 20683 43971 4929 -46210 -66294 -78416 -67977 -48416 -18860
$$ packed form
10472d6538K5252l327M1385j3956k8693k5728K82q99J2490L9252L3525l2475l6672
10459c6102J1504N6920j7877j0897l2239O987k894k3436n955M9297J0988n0353
10447d4057L9533L1186K9467Q600l0717k3878l7525j9948l832r860K0874J3978
10435b6179m480m0120N0957J1781j8349K536j0532J237L2275K5907K768J3792
10423D1593j9274l2319j6253m7358J3825P5558L2773n8355L5421j1584j45M3801
10411E7683P90n3409j8536Q89L4102K1497j5071Q016j7432p289j330J0093M497
10398B4500O222j3216j3710k5360J8825k5615k8857K8499K2564j2166k3802k6741
10386f8857l2647R220P0891M2076K3288l9042n1139k0084j2122J0439J9561K9556
$$ plain form
10374 -18860 -1729 -9545 3825 6373 8371 -11470 -46913 -82140 -100759 -79585 -26933 -33741
10362 -33741 -18835 -19914 -30668 18 26537 1786 14020 40097 36155 -7329 -31181 -18471
10350 -18471 -27231 -48010 -44704 29225 73790 47093 49032 27017 2548 -3822 -23951 -19123 -32607
10337 -32607 -39369 2678 43630 36832 -13511 -22784 25709 27887 14665 78460 90943 117958
10325 117958 112841 133593 103513 89347 80619 78514 75302 73244 54240 43814 20365 -44468
10313 -44468 -26807 -19749 -29383 -43646 -60885 -73333 -76733 -97924 -95275 7434 24852 -3746
10301 -3746 2613 -7406 -24785 -7515 26751 51602 47890 89884 102208 73133 58753 56805
10289 56805 42752 37079 42129 25656 7368 -8266 -10901 29245 -5901 -22423 -29104 5479
$$ packed form
10374a8860J7131p816J3370K548J998j9841l5443l5227j8619K1174N2652o808
10362c3741J4906j079j0754L0686K6519k4751J2234K6077l942m3484k3852J2710
10350a8471q760k0779L306P3929M4565k6697J939k2015k4469o370k0129M828j3484
10337c2607o762M2047M0952o798n0343r273M8493K178j3222O3795J2483K7015
10325A17958n117K0752l0080j4166q728k105l212k058j9004j0426k3449o4833
10313d4468J7661P058r634j4263j7239j2448l400k1191K649J02709J7418k8598
10301c746O359j0019j7379J7270L4266K4851l712M1994J2324k9075j4380j948
10289E6805j4053n673N050j6473j8288j5634k635M0146l5146j6522o681L4583
$$ plain form
10277 5479 25375 12363 432 -27957 -68458 -73976 -54315 -28686 -28542 -23258 1437 3973 -15177
10264 -15177 -34124 -10321 8004 6745 8560 -25182 -39956 6948 -9516 -45881 -38353 -28435
10252 -28435 -3527 14644 31921 10106 -17471 -18356 -12199 -29959 -535 70497 35159 2953
10240 2953 16779 35774 24994 46386 -8595 -48004 -6410 12158 7336 -12276 -45402 -34666
10228 -34666 -7860 -15941 -22992 -10606 17133 38472 -16071 2567 32327 25178 5727 14977
10216 14977 22725 -14783 24013 51136 63526 47146 49164 42782 28974 1074 -12266 -32443
10204 -32443 -23962 -884 31763 18420 -633 -21903 -10070 -731 -26310 -648 10352 16855
10192 16855 26834 9026 14098 48675 54355 43494 17889 -32967 -31441 -23092 -38912 -39113 -56940
$$ packed form
10277E479J9896j3012j1931k8389m0501n518J9661K5629J44N284K4695K536j9150
10264a5177j8947K3803J8325j259J815l3742j4774M6904j6464l6365P528R918
10252b8435K4908J8171J7277k1815k7577q85O157j7760K9424P1032l5338l2206
10240B953J3826J8995j0780K1392n4981l9409M1594J8568m822j9612l3126J0736
10228c4666K6806q081p051J2386K7739K1339n4543J8638K9760p149j9451R250
10216A4977P748l7508L8796K7123J2390j6380K018o382j3808k7900j3340k0177
10204c2443Q481K3078L2647j3343j9053k1270J1833R339k5579K5662J1000O503
10192A6855R979j7808N072L4577N680j0861k5605n0856J526Q349j5820k01j7827
$$ plain form
10179 -56940 -55680 -14372 -42197 -73793 -76860 -88867 -108868 -125458 -71924 -17581 -5849 -16463
10167 -16463 -31112 -68662 -81474 -31803 45721 56279 39645 19118 -11818 -27688 -36545 18721
10155 18721 -4088 -18982 -5140 -2184 16654 11388 37522 74531 70773 91006 70010 2340
10143 2340 -17152 31935 57725 56183 40755 -5803 -28450 -27819 -46159 -24541 38176 88702
10131 88702 77890 92493 62667 60721 82006 99790 56299 21813 12721 -25594 -23672 -41057
10119 -41057 -44810 -15508 -2386 -17926 15563 41924 26622 8951 28009 52726 53867 20535
10107 20535 -39611 -31906 -18079 -11132 -34510 21413 57768 1921 -60655 -23093 23242 26287
10095 26287 2683 -43357 -55907 4332 49890 32392 40484 44324 4699 -12486 3923 26755
$$ packed form
10179e6940J260M1308k7825l1596l067j2007k0001j6590N3534N4343J1732j0614
10167a6463j4649l7550j2812M9671P7524J0558j6634k0527l0936j5870q857N5266
10155A8721k2809j4894J3842K956J8838n266K6134L7009l758K0233k0996o7670
10143B340j9492M9087K5790j542j5428m6558k2647O31j8340K1618O2717N0526
10131H8702j0812J4603k9826j946K1285J7784m3491l4486r092l8315J922j7385
10119d1057l753K9302J3122j5540L3489K6361j5302j7671J9058K4717J141l3332
10107B0535o0146P705J3827O947k3378N5923L6355n5847o2576L7562M6335L045
10095B6287k3604m6040j2550O0239M5558j7498Q092L840l9625j7185J6409K2832
$$ plain form
10083 26755 10335 2473 -7550 12551 6174 -5047 35675 57425 29057 21433 -8469 7744
10071 7744 -1918 -6950 -2143 -19329 -24632 -31865 -25784 -15282 -6725 7129 -6734 -9688 -7679 -20701
10057 -20701 -9820 -15428 22667 58365 88322 155864 120755 105834 108481 98930 71301 36250
10045 36250 75912 63636 83910 63649 62570 35361 18075 -18185 -53244 -44579 7074 14074
10033 14074 13683 20930 28177 -9418 -13677 -11065 -9466 -6485 37611 88000 67201 21251 -11398
10020 -11398 -33592 -51684 -70930 -55213 -62888 -20641 58545 53143 10407 -17747 -44987 -41139
10008 -41139 18238 -2592 -41023 109 -7808 -66412 -78959 -41731 -26486 -54711 -37568 -18753
9996 -18753 24900 61335 60278 41352 -2620 11711 25886 45040 36917 -2926 -1401 -27838
$$ packed form
10083B6755j6420p862j0023K0101o377j1221M0722K1750k8368p624k9902J6213
10071G744r662n032M807j7186n303p233O081J0502Q557J3854j3863k954K009j3022
10057b0701J0881n608L8095L5698K9957O7542l5109j4921K647r551k7629l5051
10045C6250L9662j2276K0274k0261j079k7209j7286l6260l5059Q665N1653P000
10033A4074l91P247P247l7595m259K612J599K981M4096N0389k0799m5950l2649
10020a1398k2194j8092j9246J5717p675M2247P9186n402m2736k8154k7240L848
10008d1139N9377k0830l8431M1132p917n8604j2547L7228J5245k8225J7143J8815
9996a8753M3653L6435j057j8926m3972J4331J4175J9154q123l9843J525k6437
$$ plain form
9984 -27838 -61942 -49342 3184 51787 57528 45556 -6869 -48756 -54731 -26137 18458 22146
9972 22146 -4089 3177 26499 35397 29910 4835 -6641 -3462 -1547 -20021 13182 -19984 -49178
9959 -49178 -56886 -24138 264 19316 42227 51223 42484 26497 6375 -20097 3275 -214 -1975
9946 -1975 -4417 -1925 40293 50752 41998 31908 63519 38547 15658 15051 11725 -48294 -111908
9933 -111908 -80676 -57356 -25141 -21773 -15774 -11624 9193 36248 -14681 -40937 -33836 -39688 -35791
9920 -35791 -4568 -5446 -27865 -32800 -2716 -21707 -31353 -28360 -58528 -180 60936 52826 98757
9907 98757 120937 104808 72523 78170 22416 26175 55489 104395 137306 165545 211128 235527
9895 235527 279126 368767 471594 701596 1206548 1884338 1927367 1596817 1197531 805671
$$ packed form
9984b7838l4104J2600N2526M8603N741j1972n2425m1887n975K8594M4595L688
9972B2146k6235P266K3322Q898n487k5075j1476L179J915j8474L3203l3166k9194
9959d9178p708L2748K4402J9052K2911Q996q739j5987k0122k6472K3372l489j761
9946a975k442K492M2218J0459q754j0090L1611k4972k2889o07l326o0019o3614
9933a11908L1232K3320L2215L368N999M150K0817K7055n0929k6256P101n852L897
9920c5791L1223q78k2419m935L0084j8991r646K993l0168N8348O1116q110M5931
9907I8757K2180j6129l2285N647n5754L759K9314M8906L2911K8239M5583K4399
9895B35527M3599Q9641J02827K30002N04952O77790M3029l30550l99286l91860
$$ plain form
9885 805671 547514 376347 287342 218708 170068 105593 56546 58363 64199 59078 69678 31556
9873 31556 25764 14312 47236 81624 94329 84132 115719 106056 42464 23605 22025 533
9861 533 52095 54775 173591 244426 222791 263399 490822 874715 1264046 1422096 1289351
9850 1289351 1006325 749732 524665 336772 197266 118148 102321 127435 87423 93812 99782
9839 99782 93459 100434 58565 40880 83717 107589 72611 71145 29178 -36635 -43574 11558 36639
9826 36639 35281 17684 -2732 -5893 50295 54111 77569 40952 -2676 27546 47954 41256 20031
9813 20031 -9426 16281 20038 9765 -770 -31318 -2753 19191 7100 -32056 -33775 -10112
9801 -10112 25190 24322 41868 61405 81019 71553 72223 101894 31826 -8298 14895 2813 54915
$$ packed form
9885H05671k58157j71167q9005o8634m8640o4475m9047J817N836n121J0600l8122
9873C1556n792j1452L2924L4388J2705j0197L1587r663o3592j8859j580k1492
9861E33N1562K680J18816P0835k1635M0608K27423L83893L89331J58050j32745
9850A289351k83026k56593k25067j87893j39506p9118j5827K5114m0012O389N970
9839I9782o323O975m1869j7685M2837K3872l4978j466m1967o5813o939N5132K5081
9826C6639j358j7597k0416l161N6188L816K3458l6617m3628L0222K0408o698k1225
9813B0031k9457K5707L757j0273j0535l0548K8565K1944j2091l9156j719K3663
9801a0112L5302q68J7546J9537J9614r466O70K9671p0068m0124K3193j2082N2102
$$ plain form
9788 54915 86527 85427 58934 42723 17664 8720 -9614 -5948 -17025 -15223 15746 -43241 -4782
9775 -4782 27612 50171 52993 36663 -866 -14140 -22783 -40071 -7786 -11735 -15490 -26463 -19603
9762 -19603 1242 24637 -44612 -90099 -85019 -75253 -47654 -34461 -3287 29053 43351 57164
9750 57164 82916 94101 106155 95320 50991 56316 41017 19466 20221 48740 65479 34559
9738 34559 43219 45903 29805 40330 53828 84413 84382 60726 13569 -12956 22152 7420 -17775
9725 -17775 -7676 17357 28879 36620 36084 13712 -34606 -21819 -14083 11672 -444 -21604 -8011
9712 -8011 32375 30873 41263 29019 18562 1960 -7312 -11297 -17613 -20179 -50172 -7659 12035
9699 12035 11076 -22172 -12503 -21463 -56387 -29681 -2674 12355 40954 44795 364 -6088 -21016
$$ packed form
9788E4915L1612j100k6493j6211k5059q944j8334L666j1077J802L0969n8987L8459
9775d782L2394K2559K822j6330l7529j3274q643j7288L2285l949l755j0973O860
9762a9603K0845K3395o9249m5487N080R766K7599J3193L1174L2340J4298J3813
9750E7164K5752J1185J2054j0835m4329N325j5299k1551P55K8519J6739l0920
9738C4559Q660K684j6098J0525J3498L0585l1k3656m7157k6525L5108j4732k5195
9725a7775J0099K5033J1522P741n36k2372m8318J2787P736K5755j2116k1160J3593
9712h011M0386j502J0390j2244j0457j6602r272l985o316k566k9993M2513J9694
9699A2035r59l3248R669q960l4924K6706K7007J5029K8599L841m4431o452j4928
$$ plain form
9686 -21016 8804 15518 32873 55293 13940 -14014 -44935 -85873 -92184 -73970 -72447 -56176
9674 -56176 -5103 -22284 5127 33658 54840 51825 -31272 -52821 -31871 -24612 -10450 19296
9662 19296 44533 56141 42682 13526 -3039 -6585 10434 24845 23240 64235 86626 67697
9650 67697 39202 -9344 -28426 -18906 22264 73342 88545 67444 44713 46725 6006 -1845
9638 -1845 31302 32596 10679 8630 -27868 -26202 1343 -13335 -12968 3639 -6833 556 1301 -9120
9624 -9120 -28676 -48673 18575 53235 23729 -15917 -23313 -40482 -29120 1840 8386 -11782
9612 -11782 -40994 -38717 -76559 -97306 -71359 -20565 6068 15603 -18746 8253 23700 -10665
9600 -10665 -20980 7065 42243 31675 27975 7540 21841 44415 38714 43327 41729 6332 -4172
$$ packed form
9686b1016K9820O714J7355K2420m1353k7954l0921m0938o311J8214J523J6271
9674e6176N1073j7181K7411K8531K1182l015q3097k1549K0950P259J4162K9746
9662A9296K5237J1608j3459k9156j6565l546J7019J4411j605M0995K2391j8929
9650F7697k8495m8546j9082R520M1170N1078J5203k1101k2731K012m0719p851
9638a845L3147J294k1917k049l6498J666K7545j4678L67J6607j0472P389P45j0421
9624i120j9556j9997O7248L4660k9506l9646p396j7169J1362L0960O546k0168
9612a1782k9212K277l7842k0747K5947N0794K6633R535l4349K6999J5447l4365
9600a0665j0315K8045L5178j0568l700k0435J4301K2574n701M613j598l5397j0504
$$ plain form
9587 -4172 13907 42863 22954 -6533 12939 27392 37627 60021 50757 44353 23648 9043
9575 9043 20436 38282 32711 15321 35292 39000 33951 -3239 28574 54429 61965 24304 9255
9562 9255 -518 -27697 -55684 -16277 12357 54771 46243 30452 6846 26967 48254 34140
9550 34140 14863 17759 20295 15439 22371 33216 46799 31302 20045 2969 -24875 -26914 22286
9537 22286 29054 16466 47465 40921 14463 12705 65992 44796 22366 46427 32453 46376
9525 46376 27346 -8815 -12727 30611 26586 24128 -3957 11456 23089 16988 24627 61011 59773
9512 59773 23035 3492 12331 33812 40430 32098 8475 25410 6847 -22021 143 58762
9500 58762 73582 72032 69260 33921 21195 50167 77169 82316 60909 65918 67612 38322 23900
$$ packed form
9587d172J8079K8956j9909k9487J9472J4453J0235K2394r264o404k0705j4605
9575I043J1393J7846n571j7390J9971L708n049l7190L1813K5855P536l7661j5049
9562I255r773k7179k7987L9407K8634M2414q528j5791k3606K0121K1287j4114
9550C4140j9277K896K536m856O932J0845J3583j5497j1257j7076k7844k039M9200
9537B2286O768j2588L0999o544k6458j758N3287k1196k2430K4061j3974J3923
9525D6376j9030l6161l912M3338m025k458k8085J5413J1633o101P639L6384j238
9512E9773l6738j9543Q839K1481O618q332k3623J6935j8563k8868K2164N8619
9500E8762J4820j550k772l5339j2726K8972K7002N147k1407N009J694k9290j4422
$$ plain form
9487 23900 -24269 -25674 1028 27392 -26161 -31939 -34637 -47850 -51562 20666 102529 107396 88849
9474 88849 86524 43766 39988 17111 48913 64840 44702 43882 45596 25394 32182 51213 44430
9461 44430 23017 19153 17967 21016 52289 88105 81872 83926 63406 6627 -9504 -7137 3081
9448 3081 29767 26352 21630 1107 -21979 20770 58638 -15237 -1245 37110 78121 47182
9436 47182 30910 40693 75106 60107 59660 53398 19261 32059 61879 51901 21227 4145 34651
9423 34651 49940 27308 49873 60635 21208 28424 34508 14856 13170 43515 60486 63852 69705
9410 69705 68372 10709 -4482 24418 42645 24863 20069 51485 80435 103514 107955 88483
9398 88483 88311 80156 89852 111089 70741 14169 50332 71080 71675 38641 10751 26316 63294
$$ packed form
9487B3900m8169j405K6702K6364n3553n778k698j3213l712P2228Q1863M867j8547
9474H8849k325m2758l778k2877L1802J5927k0138q20J714k0202O788J9031o783
9461D4430k1413l864j186L049L1273L5816o233K054k0520n6779j6131K367J0218
9448C081K6686l415m722k0523k3086M2749L7868p3875J3992L8355M1011l0939
9436D7182j6272R783L4413j4999m47o262l4137J2798K9820r978l0674j7082L0506
9423C4651J5289k2632K2565J0762l9427P216O084j9652j686L0345J6971L366N853
9410F9705j333n7663j5191K8900J8227j7782m794L1416K8950K3079M441j9472
9398H8483j72q155R696K1237m0348n6572L6163K0748N95l3034k7890J5565L6978
$$ plain form
9385 63294 64679 29485 17107 17533 37047 60245 68238 71560 66367 43672 25006 23118 5498
9372 5498 17998 37858 76212 87580 89598 109485 102779 131500 135151 133211 84994 104798 122246
9359 122246 59424 18829 29473 30712 -6238 25201 56448 97624 88842 59468 46675 34830
9347 34830 34531 28425 33069 85857 85389 69846 10634 9933 19933 1462 -24504 31760 49293
9334 49293 47546 33717 8142 25843 18395 38690 61049 40798 47757 64343 44838 33882
9322 33882 32234 73119 22479 -23513 -27106 -23657 -78412 -75879 -34757 16024 56108 57873 84455
9309 84455 29147 27160 76754 75674 60072 70710 44749 86080 167956 137527 110810 102857
9297 102857 75326 63828 72493 72834 56976 36065 44803 50362 64179 113751 111502 108687 96763
$$ packed form
9385F3294J385l5194j2378M26J9514K3198P993L322n193k2695j8666j888j7620
9372E498J2500J9860L8354J1368K018J9887o706K8721L651j940m8217J9804J7448
9359A22246o2822m0595J0644J239l6950L1439L1247M1176q782k9374j2793j1845
9347C4830k99o106M644N2788m68j5543n9212p01J0000j8471k5966N6264J7533
9334D9293j747j3829k5575J7701p448K0295K2359k0251O959J6586j9505j0956
9322C3882j648M0885n0640m5992l593L449n4755K533M1122N0781M0084J765K6582
9309H4455n5308j987M9594j080j5602J0638k5961M1331Q1876l0429k6717p953
9297A02857k7531j1498Q665L41j5858k0911Q738N559J3817M9572k249k815j1924
$$ plain form
9284 96763 54434 21592 16987 58921 56650 41082 55767 74801 98350 90670 47721 39680 55852
9271 55852 51256 36822 39337 32854 41639 39489 65659 123059 124505 102290 44673 80635 99940
9258 99940 90961 121377 110030 80138 121403 136140 123936 80242 95827 131364 157331 149744
9246 149744 145369 153816 120414 103056 110415 117770 115868 110602 133019 149042 178952 136072 110955
9233 110955 124366 150098 179920 211692 238140 213266 201443 182878 178300 193963 179453 156460
9221 156460 139931 127284 121465 182514 221747 237567 256823 222212 230377 231531 237288 279316
9209 279316 281931 254412 240450 284764 254239 236358 268395 275638 287788 355820 411228 381156
9197 381156 359388 390270 394595 450943 500276 527785 502663 514413 522307 542835 596768 635151
$$ packed form
9284I6763m2329l2842m605M1934k271j5568J4685J9034K3549p680m2949q041J6172
9271E5852m596j4434K515o483Q785k150K6170N7400J446k2215n7617L5962J9305
9258I9940q979L0416j1347k9892M1265J4737j2204m3694J5585L5537K5967p587
9246A49744m375Q447l3402j7358P359P355j902n266K2417J6023K9910m2880k5117
9233A10955J3411K5732K9822L1772K6448k4874j1823j8565m578J5663j4510k2993
9221A56460j6529j2647n819O1049L9233J5820J9256l4611Q165J154N757M2028
9209B79316K615k7519j3962M4314l0525j7881L2037P243J2150O8032N5408l0072
9197C81156k1768L0882M325N6348M9333K7509k5122J1750P894K0528N3933L8383
$$ plain form
9185 635151 674396 701541 717200 742264 787805 817367 865525 910285 950239 988042 1055993 1136074
9173 1136074 1258858 1380318 1465094 1539410 1660855 1799846 1928921 2125913 2357566 2585181
9163 2585181 2832521 3073318 3336629 3616496 3916094 4237101 4537516 4827586 5098173 5337941
9153 5337941 5544772 5707123 5795067 5774397 5639326 5463058 5270183 5022159 4722626 4424010
9143 4424010 4141123 3871865 3657042 3402637 3073778 2791878 2546784 2296766 2157962 2064928
9133 2064928 1960396 1813391 1688903 1562973 1425729 1358289 1278299 1196979 1136881 1068316
9123 1068316 1004500 963143 964045 877403 770583 714594 708381 698733 674543 620922 601039 584861
9111 584861 556048 546855 551230 514115 444541 407025 391071 395680 423461 436760 405616 345498
$$ packed form
9185F35151L9245K7145J5659K5064M5541K9562M8158M4760L9954L7803O7951Q0081
9173A136074J22784J21460Q4776P4316J21445J38991J29075J96992K31653K27615
9163B585181K47340K40797K63311K79867K99598L21007L00415K90070K70587K39768
9153E337941K06831J62351Q7944k0670j35071j76268j92875k48024k99533k98616
9143D424010k82887k69258k14823k54405l28859k81900k45094k50018j38804r3034
9133B064928j04532j47005j24488j25930j37244o7440p9990q1320o0098o8565
9123A068316o3816m1357R02q6642j06820n5989o213r648k4190n3621j9883j6178
9111E84861k8813r193M375l7115o9574l7516j5954M609K7781J3299l1144o0118
$$ plain form
9099 345498 345079 366455 341806 335066 282718 258327 266876 326967 364077 372194 349208 322252 317553
9086 317553 307920 301682 282336 306704 308502 327141 338679 329033 278821 288786 264773 249959 248817
9073 248817 248462 270563 265063 219733 171960 166154 137887 141045 116795 96975 96854 116310 135357
9060 135357 120927 130375 150778 155176 131545 112144 130347 149477 174343 194293 172503 157937
9048 157937 158583 142329 144793 139133 109337 102801 132175 146448 131825 99587 84399 97537 103455
9035 103455 103544 100271 116320 113733 107158 132577 164626 144287 118646 108109 102947 123238 148004
9022 148004 116754 106440 138896 138757 127887 105766 94616 117186 166628 209872 185230 148078
9010 148078 96133 88827 104834 118959 138522 178793 169139 116329 86004 69385 42965 50113
$$ packed form
9099C45498m19K1376k4649o740n2348k4391Q549O0091L7110Q117k2986k6956m699
9086C17553r633o238j9346K4368J798J8639J1538r646n0212R965k4013j4814j142
9073B48817l55K2101n500m5330m7773n806k8267L158k4250j9820j21J9456J9047
9060A35357j4430R448K0403M398k3631j9401J8203J9130K4866J9950k1790j4566
9048A57937O46j6254K464n660k9796o536K9374J4273j4623l2238j5188J3138N918
9035A03455Q9l273J6049k587o575K5419L2049k0339k5641j0537n162K0291K4766
9022A48004l1250j0314L2456j39j0870k2121j1150K2570M9442M3244k4642l7152
9010A48078n1945p306J6007J4125J9563M0271r654n2810l0325j6619k6420P148
$$ plain form
8998 50113 99263 118906 134972 99938 48857 15943 1493 19511 63787 113882 149052 143121
8986 143121 155485 145288 112034 59924 40371 54402 96367 127650 150429 151814 108642 64606
8974 64606 71092 73884 91954 80906 94131 91824 89222 81728 90225 89036 128380 129121 114342 79404
8960 79404 87336 74315 82063 69538 46181 59657 64322 81871 82243 70958 108616 104646 99173
8947 99173 111917 115534 86874 104235 83695 89426 145293 167444 129599 97461 79990 67030
8935 67030 89051 131506 164866 106371 61150 86241 57366 44294 47538 67124 46864 22369
8923 22369 2828 27119 39345 44554 79862 51484 -28593 -43748 16059 33192 53962 41908
8911 41908 42930 49400 31486 546 -27066 10091 40862 45682 53980 44336 46161 52105 88863
$$ packed form
8998E0113M9150J9643J6066l5034n1081l2914j4450J8018M4276N0095L5170n931
8986A43121J2364j0197l3254n2110j9553J4031M1965L1283K2779J385m3172m4036
8974F4606O486K792J8070j1048J3225k307k602p494Q497j189L9344P41j4779l4938
8960G9404P932j3021P748j2525k3357J3476M665J7549L72j1285L7658l970n473
8947I9173J2744L617k8660J7361k0540N731N5867K2151l7845l2138j7471j2960
8935F7030K2021M2455L3360n8495m5221K5091k8875j3072L244J9586k0260k4495
8923B2369j9541K4291J2226N209L5308k8378q0077j5155N9807J7133K0770j2054
8911D1908J022O470j7914l0940k7612L7157L0771M820Q298r644J825N944L6758
$$ plain form
8898 88863 104728 75109 79896 103971 130182 80420 75059 84761 35816 9154 -4253 -14122 39059
8885 39059 65400 49149 63288 60944 57249 55217 60921 42194 -9709 -19035 23912 65963 53535
8872 53535 -271 -47755 -42288 -10339 23927 4988 16590 14190 -22086 -33018 -3783 37398
8860 37398 97177 77637 38149 68836 53436 32878 48890 39648 24917 20910 34607 83922
8848 83922 57555 29876 737 5175 28662 -448 10008 12206 25366 41575 38007 39776 33143
8835 33143 22856 8654 -8047 -4358 9453 2111 46915 56289 -2059 -6596 24525 19839 -8724
8822 -8724 3179 4611 33625 53270 106586 95586 38421 44918 81136 69206 27393 -24488
8810 -24488 -47452 2713 26937 59249 73956 47404 82891 97226 78611 5211 27005 12749
$$ packed form
8898H8863J5865k9619M787K4075K6211m9762n361R702m8945k6662j3407r869N3181
8885C9059K6341j6251J4139k344l695k032N704j8727n1903r326M2947M2051j2428
8872E3535n3806m7484N467L1949L4266j8939J1602k400l6276j0932K9235M1181
8860C7398N9779j9540l9488L0687j5400k0558J6012r242j4731m007J3697M9315
8848H3922k6367k7679k9139M438K3487k9110J0456K198J3160J6209l568J769o633
8835C3143j0287j4202j6701L689J3811p342M4804R374n8348m537L1121m686k8563
8822h724J1903J432K9014J9645N3316j1000n7165O497L6218j1930m1813n1881
8810b4488k2964N0165K4224L2312J4707k6552L5487J4335j8615p3400K1794j4256
$$ plain form
8798 12749 -48129 -64775 -35211 -39725 -28000 -2102 12319 28580 57987 52568 -5666 -20127
8786 -20127 7055 1783 22588 75538 100629 80582 59388 40560 48478 94251 100335 73717
8774 73717 59169 23855 25186 20406 -3429 -21053 -11087 46545 7959 16935 16615 22978 34037
8761 34037 50554 34210 -7949 45824 94875 61285 32276 -9711 -12212 19585 -3982 16322
8749 16322 33020 61126 38444 28842 33764 63805 120641 128328 135480 110126 56418 28490 19975
8736 19975 27061 25761 24396 15239 8081 30330 36650 21307 54630 75348 96047 132267 107657
8723 107657 94567 71620 83388 106131 134785 134181 103701 33389 18650 51341 74339 104204
8711 104204 96835 80002 55649 31044 21786 831 18626 55450 83014 99073 94613 83617
$$ packed form
8798A2749o0878j6646K9564m514J1725K5898J4421J6261K9407n419n8234j4461
8786b0127K7182n272K0805N2950K5091k0047k1194j8828P918M5773O084k6618
8774G3717j4548l5314J331m780k3835j7624R966N7632l8586Q976l20O363J1059
8761C4037J6517j6344m2159N3773M9051l3590k9009m1987k501L1797k3567K0304
8749A6322J6698K8106k2682r602M922L0041N6836P687P152k5354n3708k7928q515
8736A9975P086j300j365r157p158K2249O320j5343L3323K0718K0699L6220k4610
8723A07657j3090k2947J1768K2743K8654o04l0480p0312j4739L2691K2998K9865
8711A04204p369j6833k4353k4605r258k0955J7795L6824K7564J6059m460j0996
$$ plain form
8699 83617 49892 4111 -21994 -42808 -29181 24015 90705 50056 32975 42573 16915 -2618
8687 -2618 -259 23427 -16662 -42404 -29299 66718 114528 91198 37423 22603 -2638 -8159
8675 -8159 18232 43608 57346 65286 74671 65800 53650 58474 67704 50316 54449 73855 90078
8662 90078 58608 97103 121972 117070 104656 87027 102495 147687 167496 210825 328139 419326
8650 419326 428467 360422 279990 230108 201329 185444 187532 177840 120437 70770 36907 64387
8638 64387 74572 90661 85108 72618 60871 53178 40387 58042 83922 131982 141648 111478
8626 111478 86336 52459 55317 70499 80576 64095 50662 71747 88606 137738 184231 227835
8614 227835 236203 223736 200033 186254 219754 294827 389286 615117 787382 748158 636369
$$ packed form
8699H3617l3725m5781k6105k0814J3627N3196O6690m0649j7081R598k5658j9533
8687b618K359K3686m0089k5742J3105R6017M7810k3330n3775j4820k5241n521
8675h159K6391K5376J3738P940R385q871j2150M824R230j7388M133J9406J6223
8662I0078l1470L8495K4869m902j2414j7629J5468M5192J9809M3329J17314R1187
8650D19326R141o8045q0432m9882k8779j5885K088r692n7403m9667l3863K7480
8638F4387J0185J6089n553j2490j1747p693j2791J7655K5880M8060R666l0170
8626A11478k5142l3877K858J5182J0077j6481j3433K1085J6859M9132M6493M3604
8614B27835Q368j2467k3703j3779L3500P5073R4459K25831J72265l9224j11789
$$ plain form
8603 636369 536187 377009 316901 338443 334600 297972 260668 272963 261823 182807 201588
8592 201588 194724 182600 194179 164816 152094 173899 166559 165700 132169 125534 94838 74631 59166
8579 59166 43114 8978 -8745 34417 69193 24400 -25472 -9593 -264 15561 62614 89486
8567 89486 79952 109743 139848 173184 232546 305372 372101 368922 309200 238500 173881 154670
8555 154670 125112 78388 64045 58544 52104 35213 62080 71571 76207 50270 79856 77855 19738
8542 19738 16784 45337 68905 56679 25061 58797 59705 12287 20549 53911 25404 -20626 -61440
8529 -61440 -38476 3941 -34434 -13627 405 16864 -29283 -37226 16517 39248 -4160 -29452
8517 -29452 25222 70631 45715 16310 44112 68584 56921 76921 80105 60408 39564 42767
$$ packed form
8603F36369j00182j59178o0108K1542l843l6628l7304J2295j1140p9016J8781
8592B01588o864j2124J1579k9363j2722K1805p340q59l3531o635l0696k0207j5465
8579E9166j6052l4136j7723M3162L4776m4793m9872J5879R329J5825M7053K6872
8567H9486r534K9791L0105L3336N9362P2826O6729l179n9722p0700o4619j9211
8555A54670k9558m6724j4343n501o440j6891K6867R491M636k5937K9586k001n8117
8542A9738k954K8553K3568j2226l1618L3736R08m7418Q262L3362k8507m6030m0814
8529f1440K2964M2417l8375K0807J4032J6459m6147p943N3743K2731m3408k5292
8517b9452N4674M5409k4916k9405K7802K4472j1663K0000L184j9697k0844L203
$$ plain form
8505 42767 69940 98645 81514 51664 34171 59868 31087 26093 31520 37816 11171 10893 27585
8492 27585 -1739 15577 40898 34304 23309 13153 11319 31459 61193 61864 14631 -10073 -13684
8479 -13684 -53675 -50389 -23201 23673 67458 32026 -5840 -15203 -5015 5430 1677 -26800
8467 -26800 -11479 55317 71246 55812 -12107 -19994 -24467 -17476 -36472 155 40544 51244
8455 51244 -23665 -44190 -11047 -22768 -52664 -67774 -42723 28172 41061 28729 11545 -11333
8443 -11333 -18825 -14260 -41234 -36076 9464 2284 12716 75560 91350 43950 8811 8828 68530
8430 68530 70957 54415 44022 54213 42487 24710 40149 35737 40880 51041 38511 4341
8418 4341 33728 49657 26683 31464 46483 35932 28457 51446 51301 18753 51079 75332 50438
$$ packed form
8505D2767K7173K8705j7131k9850j7493K5697k8781m994N427O296k6645k78J6692
8492B7585k9324J7316K5321o594j0995j0156j834K0140K9734O71m7233k4704l611
8479a3684l9991L286K7188M6874M3785l5432l7866r363J0188J0445l753k8477
8467b6800J5321O6796J5929j5434o7919p887m473O991j8996L6627M0389J0700
8455E1244p4909k0525L3143j1721k9896j5110K5051P0895J2889j2332j7184k2878
8443a1333p492M565k6974N158M5540p180J0432O2844J5790m7400l5139J7N9702
8430F8530K427j6542j0393J0191j1726j7777J5439m412N143J0161j2530l4170
8418D341K9387J5929k2974M781J5019j0551p475K2989j45l2548L2326K4253k4894
$$ plain form
8405 50438 -3435 8606 37594 46714 49636 64969 65043 27085 39704 8016 -31818 -20735 -380
8392 -380 12431 22005 55194 51174 26829 64185 83389 69333 38339 31608 26457 17394 20079
8379 20079 13388 37275 9170 -51012 -71317 -4199 57692 69387 67142 59981 19957 21382 38371
8366 38371 1869 -20423 -10678 -24444 -42817 -36880 -34458 -51442 -41598 21100 6032 -36626 -12384
8353 -12384 47822 8960 -66998 -102891 -34918 35704 73590 45796 36806 -60 9764 -1040
8341 -1040 15937 13348 32166 51094 56647 54997 56704 44253 61918 71073 81756 35817 27907
8328 27907 39770 25337 4041 47129 85598 97090 96204 113980 95537 33296 -17078 -31696
8316 -31696 -22727 -9293 10013 34318 27422 19168 33880 40329 -3630 -22413 -19071 -6204 10266
$$ packed form
8405E0438n3873J2041K8988R120K922J5333P4l7958J2619l1688l9834J1083K0355
8392c80J2811R574L3189m020k4345L7356J9204j4056l0994o731n151r063K685
8379B0079o691K3887k8105o0182k0305O7118O1891J1695k245p161m0024J425J6989
8366C8371l6502k2292R745j3766j8373N937K422j6984R844O2698j5068m2658K4242
8353a2384O0206l8862p5958l5893O7973P0622L7886k7794q990l6866R824j0804
8341a040J6977k589J8818J8928N553j650J707j2451J7665R155J0683m5939p910
8328B7907J1863j4433k1296M3088L8469J1492q86J7776j8443o2241n0374j4618
8316c1696Q969J3434J9306K4305o896q254J4712O449m3959j8783L342J2867J6470
$$ plain form
8303 10266 -18926 -17613 -2516 20529 32286 26102 -17368 -15115 21493 26792 -15135 1026 18139
8290 18139 13444 -11670 -6157 -16859 -12284 -36933 5449 19590 5542 -43733 -108914 -95812
8278 -95812 -122389 -115901 -76035 -39603 -31443 -29701 -15314 8675 28553 18807 1284 1166 15540
8265 15540 16086 15341 4244 46502 49919 8583 -11595 -27916 -61923 -75110 -18434 6137 -35845
8252 -35845 -78094 -54896 -47692 -6236 16268 35813 29218 742 -19906 -7208 31228 16158
8240 16158 -15742 15079 22833 20811 2351 -10503 -2139 -13125 -31617 -15294 -13272 -30584 -4016
8227 -4016 14658 27961 17586 -13184 -29997 -7830 11740 16542 25941 -5569 -8274 40086 28880
8214 28880 11302 24460 13196 8617 14267 -908 -2343 1349 430 31413 50353 46809 15591
$$ packed form
8303A0266k9192J313J5097K3045J1757o184m3470K253L6608N299m1927J6161J7113
8290A8139m695k5114N513j0702M575k4649M2382J4141j4048m9275o5181J3102
8278i5812k6577O488L9866L6432Q160J742J4387K3989J9878r746j7523j18J4374
8265A5540N46p45j1097M2258L417m1336k0178j6321l4007j3187N6676K4571m1982
8252c5845m2249K3198P204M1456K2504J9545o595k8476k0648J2698L8436j5070
8240A6158l1900L0821P754k022j8460j2854Q364j0986j8492J6323K022j7312K6568
8227d016J8674J3303j0375l0770j6813K2167J9570M802R399l1510k705M8360j1206
8214B8880j7578J3158j1264m579N650j5175j435L692r19L0983J8940l544l1218
$$ plain form
8201 15591 -4862 -19867 -8505 -21884 -24439 -61387 -74806 -28872 -19052 -17157 -443 25706
8189 25706 27615 5132 1624 -39478 -78991 -59042 -40900 -22992 14907 57311 57695 33639 8228
8176 8228 -2766 -27929 -36704 -21838 -13209 17254 26125 -7750 7020 45795 42680 44640 63628
8163 63628 15079 -16589 -6382 -9846 -12051 2556 -16704 -14426 6148 -26445 -56452 -90364
8151 -90364 -75659 3417 44514 -30569 -82408 -64124 -84953 -64686 762 -8751 15247 65117
8139 65117 88083 96150 89408 34213 1151 -14441 9082 9019 -21103 7604 11343 41901 73297
8126 73297 61854 -6494 -6795 20283 21064 36918 59407 39848 2829 -21476 7623 3874 23217
8113 23217 724 8218 11713 971 14013 50095 25166 -161 4774 -11602 -11409 10163 22987
$$ packed form
8201A5591k0453j5005J1362j3379k555l6948j3419M5934R820J895J6714K6149
8189B5706J909k2483l508m1102l9513J9949J8142J7908L7899M2404L84k4056k5411
8176H228j0994k5163q775J4866Q629L0463Q871l3875J4770L8775l115J960J8988
8163F3628m8549l1668J0207l464k205J4607j9260K278K0574l2593l0007l3912
8151i0364J4705P9076M1097p5083n1839J8284k0829K0267O5448r513K3998M9870
8139F5117K2966Q067o742n5195l3062j5592K3523o3l0122K8707L739L0558L1396
8126G3297j1443o8348l01K7078P81J5854K2489j9559l7019k4305K9099l749J9343
8113B3217k2493P494L495j0742J3042L6082k4929k5327M935j6376J93K1572J2824
$$ plain form
8100 22987 48944 29579 3149 5764 18350 28832 -284 -30577 -33766 -64845 -73209 -62173
8088 -62173 -64022 -38265 -16921 -20510 4382 11671 -56786 -79795 -56821 420 2625 2016 -6401
8075 -6401 -8089 -35265 -10256 17956 29627 26720 -51285 -42581 6141 7064 43825 70135 48029
8062 48029 -18181 -39308 -53689 -82630 -47510 -8920 8068 43649 14905 -13998 -14661 -50838
8050 -50838 -53212 -79783 -37800 35338 8316 5464 15476 30702 25664 -6300 24286 25089 -4818
8037 -4818 -53046 -87935 -86905 -95702 -46118 -26994 16961 19527 22243 2212 -36088 -27761 14783
8024 14783 74228 57167 55101 51607 55647 64751 90225 100922 63621 46017 -1245 -17161 2282
8011 2282 17492 26306 63965 54755 13145 -29756 -24258 26734 23679 45418 74064 26064 -23339
$$ packed form
8100B2987K5957j9365k6430K615J2586J0482k9116l0293l189l1079q364J1036
8088f2173j849K5757K1344l589K4892P289o8457k3009K2974N7241K205o09q417
8075f401j688k7176K5009K8212J1671k907p8005Q704M8722R23L6761K6310k2106
8062D8029o6210k1127j4381k8941L5120L8590J6988L5581k8744k8903o63l6177
8050e0838k374k6571M1983P3138k7022k852J0012J5226n038l1964L0586Q03k9907
8037d818m8228l4889J030q797M9584J9124M3955K566K716k0031l8300Q327M2544
8024A4783N9445j7061k066l494M040R104K5474J0697l7301j7604m7262j5916J9443
8011B282J5210Q814L7659r210m1610m2901N498N0992l055K1739K8646m8000m9403
$$ plain form
7998 -23339 -58382 -30461 873 -15601 -35028 -32793 -21169 -31143 -21957 -17087 -23557 -26149 -25430
7985 -25430 2891 16205 28544 35165 39117 77863 87482 63651 63015 25687 18556 44285 51030
7972 51030 43685 39737 43288 78379 113003 111167 96100 47539 18761 -2483 7464 13664 -22308
7959 -22308 -12592 4922 -11037 -14175 31873 45764 36913 57698 66828 31909 7160 37763 56348
7946 56348 59630 31712 39398 61985 56947 29395 16222 32703 51099 53737 48944 39551 24840
7933 24840 17937 49660 54062 30080 44115 63018 74431 58947 60711 71106 89058 99668
7921 99668 50639 49036 38837 45638 73797 68571 79059 55131 54100 614 -19602 -25692 -227
7908 -227 46153 47416 54881 74317 54265 -10598 -53405 -45731 13021 16885 33758 78070 96245
$$ packed form
7998b3339l5043K7921L1334j6474j9427K235J1624r974R186M870o470k592P19
7985b5430K8321J3314J2339O621L952L8746R619k3831o36l7328p131K5729O745
7972E1030p345l948L551L5091L4624j836j5067m8561k8778k1244R947O200l5972
7959b2308R716J7514j5959l138M6048J3891q851K0785R130l4919k4749L0603J8585
7946E6348L282k7918P686K2587n038k7552j3173J6481J8396K638m793r393j4711
7933B4840o903L1723M402k3982J4035J8903J1413j5484J764J0395J7952J0610
7921I9668m9029j603j0199O801K8159n226J0488k3928j031n3486k0216o090K5465
7908b27M6380J263P465J9436k0052o4863m2807P674N8752L864J6873M4312J8175
$$ plain form
7895 96245 96790 64883 40824 43464 54499 -4080 -31212 -7725 25382 75498 99842 77069
7883 77069 54351 22779 25745 14367 2051 3937 40551 18731 3058 33101 21956 611
7871 611 15463 34347 7005 8308 3154 3974 40704 53357 42290 74440 49352 62540 102422
7858 102422 93801 123466 120081 49164 37619 54126 69438 82282 112751 98554 50888 33313
7846 33313 10044 -10894 30829 25489 -15300 -23606 -5664 12563 13048 -7591 7371 1689 -29045
7833 -29045 -41385 -52134 -54718 8758 24093 7260 28601 41279 63376 42795 39918 28628
7821 28628 -311 -24386 15124 -10792 -4333 -10008 -23367 -58768 -70451 -51072 -16456 -18783
7809 -18783 -17446 -22648 -53914 -52683 -13474 -18608 -38583 -4816 14556 -6614 -15899 -37954 -24992
$$ packed form
7895I6245N45l1907k4059K640J1035n8579k7132K3487L3107N0116K4344k2773
7883G7069k2718l1572K966j1378j2316J886L6614k1820j5673L0043j1145k1345
7871F11J4852J8884k7342J303n154Q20L6730J2653j1067L2150k5088J3188L9882
7858A02422q621K9665l385p0917j1545J6507J5312J2844L0469j4197m7666j7575
7846C3313k3269k0938M1723n340m0789q306J7942J8227M85k0639J4962n682l0734
7833b9045j2340j0749k584O3476J5335j6833K1341J2678K2097k0581k877j1290
7821B8628k8939k4075L9510k5916O459n675j3359l5401j1683J9379L4616k327
7809a8783J337n202l1266J231L9209n134j9975L3767J9372k1170r285k2055J2962
$$ plain form
7796 -24992 -6752 12044 49321 32051 6904 -14018 -12162 9260 -25266 -64466 -25538 16814
7784 16814 25179 5185 -18073 -3596 50030 77364 38420 8198 -13560 -47355 -93775 -112664
7772 -112664 -97621 -47419 -47145 -34519 -55020 -22561 4860 -4869 -46799 -44968 -15258 -20356 -12995
7759 -12995 -26892 -13087 3543 19948 1398 301 31349 -4113 -32443 -50249 -44732 -43963 -6424
7746 -6424 18307 22047 42662 25225 27864 27812 18200 3686 -41060 -76104 -42877 -48366 -20389
7733 -20389 -10518 25016 43631 37586 -5629 -23754 -61428 -55766 -20382 -11345 9690 27242 20483
7720 20483 15951 6099 8327 13402 38573 35628 44400 32735 4558 -27917 -36682 -43940 -44393 -56798
7706 -56798 -47568 -37313 -27394 -35864 -50805 -70503 -25761 19379 18450 27621 -13603 -41057 -41969
$$ packed form
7796b4992J8240J8796L7277j7270k5147k0922J856K1422l4526l9200L8928M2352
7784A6814Q365j9994k3258J4477N3626K7334l8944l0222k1758l3795m6420j8889
7772a12664J5043N0202K74J2626k0501L2459K7421r729m1930J831K9710n098P361
7759a2995j3897J3805J6630J6405j8550j097L1048l5462k8330j7806N517P69L7539
7746f424K4731L740K0615j7437K639n2r612j4514m4746l5044L3227n489K7977
7733b0389R871L5534J8615o045m3215j8125l7674N662L5384R037K1035J7552o759
7720B0483m532r852K228N075K5171k945Q772j1665k8177l2475q765p258m53j2405
7706e6798R230J0255R919q470j4941j9698M4742M5140r29R171m1224k7454r12
$$ plain form
7693 -41969 4772 43976 38628 62494 92250 120442 62330 8793 -34921 -25368 -4775 -26186
7681 -26186 -37509 -79625 -99987 -88999 -76568 -107193 -98735 -89633 -88570 -67639 -40880 -17364
7669 -17364 -9690 8555 15753 40890 -2139 -51315 -60225 -58252 -38565 -2055 13639 -53674 -43043
7656 -43043 -1503 64020 95498 86763 -2347 -26743 3935 45699 85075 42800 6810 -25650
7644 -25650 -52230 -74629 -58654 -63533 -14170 -2367 -38985 -42935 -58052 -88551 -96605 -78703
7632 -78703 -27760 -8141 -24778 21009 -24124 -66221 -42524 -30469 -32076 -23652 26364 30444
7620 30444 21897 19184 12340 -1077 29491 63317 47737 25035 -2290 -31365 -26506 -49226 -120036
7607 -120036 -140966 -118275 -84538 -44922 -49658 -62018 -50649 -29111 7615 -38069 -83104 -16398
$$ packed form
7693d1969M6741L9204n348K3866K9756K8192n8112n3537m3714R553K0593k1411
7681b6186j1323m2116k0362J0988J2431l0625Q458R102J063K0931K6759K3516
7669a7364P674J8245P198K5137m3029m9176q910J973J9687L6510J5694o7313J0631
7656d3043M1540O5523L1478q735q9110k4396L0678M1764L9376m2275l5990l2460
7644b5650k6580k2399J5975m879M9363J1803l6618l950j5117l0499q054J7902
7632g8703N0943J9619j6637M5787m5133m2097K3697J2055j607Q424N0016M080
7620C0444q547k713o844j3417L0568L3826j5580k2702k7325k9075M859k2720p0810
7607a20036k0930K2691L3737L9616m736j2360J1369K1538L6726m5684m5035O6706
$$ plain form
7595 -16398 33525 14777 15204 -6480 -24602 -13705 -8926 -14817 -39163 -6337 -3935 -32261 -17167
7582 -17167 -24186 2491 46797 39099 8061 10595 2410 -52034 -31898 -25490 24440 27684 11157
7569 11157 11103 16594 5831 29266 37894 8063 7239 17746 46920 61791 37126 26072 39946
7556 39946 53401 44067 32193 21192 19003 12378 -12085 -24422 -52099 -70281 -57800 1355
7544 1355 11447 17789 14006 49862 47593 48378 -11342 302 -9764 -10754 105 20162 9878
7531 9878 -32132 -63923 -34383 -29459 -34377 -16488 2501 18428 -25841 -35113 -29573 39966 62706
7518 62706 51859 48661 44011 58166 57427 22962 7627 -20114 -78211 -88178 -35741 790 10092
7505 10092 -2820 -17461 -60557 -83002 -71817 -62417 -49919 -49121 9425 11338 -4990 -23936 -20427
$$ packed form
7595a6398M9923j8748M27k1684j8122J0897M779n891k4346L2826K402k8326J5094
7582a7167p019K6677M4306p698l1038K534q185n4444K0136O408M9930L244j6527
7569A1157n4N491j0763K3435Q628k9831q24J0507K9174J4871k4665j1054J3874
7556C9946J3455r334j1874j1001k189o625k4463j2337k7677j8182J2481N9155
7544A355J0092O342l783L5856k269P85n9720J1644j0066r90J0859K0057j0284
7531I878m2010l1791K9540M924m918J7889J8989J5927m4269r272N540O9539K2740
7518F2706j0847l198m650J4155p39l4465j5335k7741n8097r967N2437L6531R302
7505A0092j2912j4641m3096k2445J1185R400J2498P98N8546J913j6328j8946L509
$$ plain form
7492 -20427 -13621 -63536 -92799 -114215 -49017 -25435 -40968 -43739 -33046 -51189 -52505 -13274
7480 -13274 22234 1836 -17829 -32543 -26981 -19001 8428 43420 54766 21385 -7613 -4553
7468 -4553 3251 -19998 6767 40772 7284 -20212 3079 25710 38883 39025 17566 -1114 38356
7455 38356 21512 -38160 -48466 -47680 -45632 -40125 -10227 -25374 -41183 -70166 -49365 -41193 -28346
7442 -28346 -29130 -20722 -10088 -10131 24258 25952 17129 -26813 -48888 -47760 -44187 -27987 18516 18442
7428 18442 10021 47072 28750 20952 28980 11738 2660 -2303 -6109 12729 31900 43503 37902
7415 37902 -1050 -51412 -63152 -78744 -56473 9449 37889 -14930 2158 22038 5868 6116
7403 6116 3923 -62983 -63989 -43458 -48192 -79714 -81730 -52578 -43882 -23514 28847 37115 16118
$$ packed form
7492b0427O806m9915k9263k1416O5198K3582j5533k771J0693j8143j316L9231
7480a3274L5508k0398j9665j4714N562P980K7429L4992J1346l3381k8998L060
7468d553P804k3249K6765L4005l3488k7496K3291K2631J3173J42k1459j8680L9470
7455C8356j6844n9672j0306P86K048N507K9898j5147j5809k8983K0801Q172J2847
7442b8346p84Q408J0634m3L4389J694q823m3942k2075J128L573J6200M6503p4
7428A8442q421L7051j8322p798Q028j7242r078m963l806J8838J9171J1603n601
7415C7902l8952n0362j1740j5592K2271O5922K8440n2819J7088J9880j6170K48
7403F116k193o6906j006K0531m734l1522k016K9152Q696K0368N2361Q268k0997
$$ plain form
7390 16118 22638 24030 -1033 -9873 -14859 -14825 26096 59231 34622 642 -23108 -21018 -16868 -4208
7376 -4208 -7416 -30431 -41783 -55831 -20274 -3341 -30057 -61802 1274 16676 -13912 13782
7364 13782 -10947 -30795 -29789 -45303 -79451 -35996 2156 18773 41911 23239 -27469 22602
7352 22602 49020 42005 4344 3733 30655 27016 41416 47640 19442 27670 11378 -32428 -28438
7339 -28438 6521 13677 -8431 1521 12504 -1274 -23021 -47160 -25709 25449 31651 -31095
7327 -31095 -43084 13997 41988 22601 -5909 -5884 -13121 -29089 -47461 -45531 -34215 -30783 -10332
7314 -10332 -16561 229 20194 4558 -45689 -57748 -32527 -27154 -59262 -66531 -82567 -56180
7302 -56180 13382 35628 30479 20768 29219 31982 37796 30635 -18010 -28402 -12728 9621 44393
$$ packed form
7390A6118O520J392k5063q840m986L4M0921L3135k4609l3980k3750K090M150J2660
7376d208l208k3015j1352j4048L5557J6933k6716l1745O3076J5402l0588K7694
7364A3782k4729j9848J006j5514l4148M3455L8152J6617K3138j8672n0708N0071
7352B2602K6418p015l7661o11K6922l639J4400O224k8198Q228j6292m3806L990
7339b8438L4959P156k2108R952J0983j3778k1747k4139K1451N1158O202o2746
7327c1095j1989N7081K7991j9387k8510K5p237j5968j8372J930J1316L432K0451
7314a0332o229J6790J9965j5636n0247j2059K5221N373l2108p269j6036K6387
7302e6180O9562K2246n149r711Q451K763N814p161m8645j0392J5674K2349L4772
$$ plain form
7289 44393 -1995 -54096 -9900 20405 2494 -15863 -29863 -44003 -7306 50800 37140 18540
7277 18540 40985 60297 17298 -9993 -27833 -18849 -3819 -49165 -42659 -31658 -33942 -39083 -13705
7264 -13705 5898 33450 5995 -5509 -60952 -75748 -64581 -36469 -40543 -89625 -92006 -61902
7252 -61902 -49741 -45509 -32478 -19867 -39016 -58326 -48688 -22472 2926 45855 1749 -34868
7240 -34868 -33150 -27591 -13237 -10107 -27366 -39021 -41097 -31811 -25559 -21383 -21009 821 28156 36821
7226 36821 -5445 -24350 -41086 -15543 8743 35513 50753 34868 44374 39893 100835 77988
7214 77988 17821 4245 8074 14390 1925 36837 49678 30529 41269 38480 16255 45896
7202 45896 40064 35946 58709 82764 50759 -22756 -32102 -52574 -25469 31133 37845 7005 37383
$$ packed form
7289D4393m6388n2101M4196L0305j7911j8357j4000j4140L6697N8106j3660j8600
7277A8540K2445J9312m2999k7291j7840Q984J5030m5346O506J1001k284n141K5378
7264a3705J9603K7552k7455j1504n5443j4796J1167K8112m074m9082k381L0104
7252f1902J2161M232J3031J2611j9149j9310R638K6216K5398M2929m4106l6617
7240c4868J718N559J4354L130j7259j1655k076R286O252M176L74K1830K7335Q665
7226C6821m2266j8905j6736K5543K4286K6770J5240j5885R506m481O0942k2847
7214G7988o0167j3576L829O316j2465L4912J2841j9149J0740k789k2225K9641
7202D5896n832m118K2763K4055l2005p3515r346k0472K7105N6602O712l0840L0378
$$ plain form
7189 37383 11011 17503 4247 -38566 -35729 -42560 -78503 -74143 -12907 17310 51306 29479 -2262
7176 -2262 12313 38400 37546 14076 -31064 -26850 -48181 -37226 -47465 -48319 -351 -12753 -21922
7163 -21922 12415 -18738 -55343 -80440 -62957 -68276 -77130 -37879 5345 31238 41936 50758
7151 50758 9863 -58284 -62855 -28828 19011 28661 14652 15652 21245 -22057 -40581 -59140 -65870
7138 -65870 -45092 -44766 -44415 -21955 17242 44662 37286 18628 1000 -26649 -27481 -12549 -23511
7125 -23511 -21116 -48161 -75335 -54529 -29415 -49988 -120974 -79390 -46069 -92908 -122345 -74439
7113 -74439 -37607 -52627 -35219 -11497 26246 -10922 -33452 -48620 -34517 -39651 -61992 -122968
7101 -122968 -106517 -66583 -24427 30451 50121 83019 74654 31784 23570 29084 18077 20107
$$ packed form
7189C7383k6372O492j3256m2813K837o831l5943M360O1236L0217L3996k1827l1741
7176b262J4575K6087q54k3470m5140M214k1331J0955j0239q54M7968j2402r169
7163b1922L4337l1153l6605k5097J7483n319q854L9251M3224K5893J0698Q822
7151E0758m0895o8147m571L4027M7839R650j4009J000N593m3302j8524j8559o730
7138f5870K0778L26L51K2460L9197K7420p376j8658j7628k7649q32J4932j0962
7125b3511K395k7045k7174K0806K5114k0573p0986M1584L3321m6839k9437M7906
7113g4439L6832j5020J7408K3722L7743l7168k2530j5168J4103n134k2341o0976
7101a22968J6451L9934M2156N4878J9670L2898q365m2870q214N514j1007K030
$$ plain form
7089 20107 7611 -23904 -8270 -18912 -25594 -36227 -22955 -26641 -21804 4088 37349 39364 52475
7076 52475 16214 -11689 -37931 -55903 -14773 41579 24838 -172 -10395 -22406 -9904 -6273
7064 -6273 -503 9108 52714 44550 22365 30365 33477 7265 -27866 -55556 -25033 16302 33381
7051 33381 22521 -10309 -84981 -77267 -54393 -42593 -46162 -80017 -58555 -46755 -66889 -18028
7039 -18028 18125 48536 70439 47680 22488 10077 -3501 -23045 -17476 -16239 -28866 -31548
7027 -31548 -45423 -97948 -128373 -74916 -48851 -47144 -24890 -50296 -55224 -53970 -57650 -44507 -39183
7014 -39183 -43882 -13327 2276 24776 28089 19150 1646 -27881 -283 22482 34680 22494
7002 22494 15252 -17455 -3460 -793 -21034 8255 -2541 -45577 2383 -34859 -61345 -61057 -23130
$$ packed form
7089B0107j2496l1515J5634j0642o682j0633J3272l686M837K5892L3261K015J3111
7076E2475l6261k7903k6242j7972M1130N6352j6741k5010j0223j2011J2502L631
7064f273N770R611M3606q164k2185Q000L112k6212l5131k7690L0523M1335J7079
7051C3381j0860l2830p4672P714K2874J1800l569l3855K1462J1800k0134M8861
7039a8028L6153L0411K1903k2759k5192j2411j3578j9544N569J237j2627k682
7027c1548j3875n2525l0425N3457K6065J707K2254k5406m928J254l680J3143N324
7014c9183m699L0555J5603K2500L313q939j7504k9527K7598K2765J2198j2186
7002B2494p242l2707J3995K667k0241K9289j0796m3036M7960l7242k6486K88L7927
$$ plain form
6989 -23130 -16907 7150 3884 -19801 -85647 -102673 -66947 -33921 -25505 36156 13821 -13828
6977 -13828 19605 21430 9998 5328 33800 35473 28367 55163 20913 6508 5442 5150 1493
6964 1493 -59016 -76343 -72645 -40496 -23331 -34763 -16012 21403 4840 29008 63859 70613
6952 70613 53318 21172 26600 24500 14387 -3034 -25067 -35417 2818 19910 -33220 -44175
6940 -44175 -28109 18213 36655 13705 29503 -10884 -45718 -24523 7917 -21813 -75728 -105548
6928 -105548 -81189 -33109 -30010 -55167 -74845 -70429 -38130 14103 46207 18216 -9679 26053
6916 26053 60436 65770 19281 -12581 -4890 10239 -309 10001 8028 15491 -23102 -13989 4128
6903 4128 -1026 -14451 -2376 -23847 -48620 -44797 -26836 9090 2989 -17594 -17989 -79956 -103995
$$ packed form
6989b3130O223K4057l266k3685o5846j7026L5726L3026Q416O1661k2335k7649
6977a3828L3433J825j1432m670K8472J673p106K6796l4250j4405j066k92l657
6964A493o0509j7327L698L2149J7165j1432J8751L7415j6563K4168L4851O754
6952G0613j7295l2146N428k100j0113j7421k2033j0350L8235J7092n3130j0955
6940d4175J6066M6322J8442k2950J5798m0387l4834K1195L2440k9730n3915k9820
6928a05548K4359M8080L099k5157j9678M416L2299N2233L2104k7991k7895L5732
6916B6053L4383N334m6489l1862P691J5129j0548J0310j973P463l8593R113J8117
6903D128n154j3425J2075k1471k4773L823J7961L5926o101k0583l95o1967k4039
$$ plain form
6890 -103995 -52934 -2041 -3302 -12274 -11045 15368 21710 17973 -20630 -78454 -74142 -58239 -55713
6877 -55713 -53593 -25348 -49281 -46282 -39481 -7312 5658 -11338 -36258 -27557 -18420 -3274 4521
6864 4521 9350 -17803 -42127 -42668 -20666 -18114 -7013 -17756 -11048 -8104 -12788 -24135 -5128
6851 -5128 -11600 -30908 -18696 -5108 -88046 -83736 -76916 -66983 -63956 -39157 -9230 -43951 -39799
6838 -39799 -10866 -13705 -18259 -20056 -24414 -42600 -52552 -47452 -3800 -10994 -70969 -43590 -46559
6825 -46559 -59115 -31600 -19586 24302 17318 374 -28787 -35354 -39748 -6970 41695 46436 64408
6812 64408 24973 -61195 -64623 -27239 8353 4704 16180 30353 23633 -5820 -55275 -51775 -16440
6799 -16440 19526 10152 -6911 12891 52737 43600 19364 19824 15449 20209 34616 8410 27713
$$ packed form
6890a03995N1061N0893j261q972J229K6413O342l737l8603n7824M312J5903K526
6877e5713K120K8245k3933K999O801L2169J2970j6996k4920Q701R137J5146P795
6864D521M829k7153k4324n41K2002K552J1101j0743O708K944m684j1347J9007
6851e128o472j9308J2212J3588q2938M310O820R933L027K4799K9927l4721M152
6838c9799K8933k839m554j797m358j8186r952N100M3652p194n9975K7379k969
6825d6559j2556K7515J2014M3888o984j6944k9161o567m394L2778M8665M741J7972
6812F4408l9435q6168l428L7384L5592l649J1476J4173o720k9453m9455L500L5335
6799a6440L5966r374j7063J9802L9846r137k4236M60m375M760J4407k6206J9303
$$ plain form
6786 27713 39439 -2823 -29745 -34300 -53741 -60540 -70071 -67471 -101122 -132041 -85237 -43740 -49804
6773 -49804 -72366 -73209 -67064 -57575 -62649 -40671 -58377 -56855 32358 68875 95824 82412 60785
6760 60785 45659 33047 25252 27555 -11201 -44262 -33219 13388 15752 -26489 -71092 -34733
6748 -34733 12929 -24434 -60370 -93491 -82404 -89574 -69171 -42474 -34976 -19899 -9532 -140
6736 -140 -21247 -40125 -50136 -41605 -15187 8949 9943 61720 48982 -13211 -43932 -38653 4793
6723 4793 -61600 -76277 -25308 -8923 27825 54536 58134 51451 65617 8998 -34483 -7274
6711 -7274 12807 10504 -6127 -12760 5154 -15191 -16950 23100 23816 16746 -11537 -31213 -49302
6698 -49302 -55738 -84764 -100599 -87114 -31275 -14095 -12730 27557 53860 22965 35971 24970
$$ packed form
6786B7713J1726m2262k6922m555j9441o799r531K600l3651l0919M6804M1497o064
6773d9804k2562q43O145R489n074K1978j7706J522Q9213L6517K6949j3412k1627
6760F0785j5126j2612p795K303l8756l3061J1043M6607K364m2241m4603L6359
6748c4733M7662l7363l5936l3121J1087p170K0403K6697P498J5077J0367R392
6736a40k1107j8878j0011Q531K6418K4136R94N1777j2738o2193l0721N279M3446
6723D793o6393j4677N0969J6385L6748K6711L598o683J4166n6619m3481K7209
6711g274K0081k303j6631o633J7914k0345j759M0050P16p070k8283j9676j8089
6698d9302o436k9026j5835J3485N5839J7180J365M0287K6303l0895J3006j1001
$$ plain form
6686 24970 45905 13246 -19055 7649 26895 4297 17894 17581 2875 -8870 -32551 -48199
6674 -48199 -53137 -34089 11228 -3545 12231 47864 1934 -12992 787 13208 20710 11471
6662 11471 646 27685 27545 11721 695 13231 26650 -7175 -60977 -72204 -90588 -90217 -93233
6649 -93233 -57786 -14258 -17031 1211 9272 -8650 -29640 -41921 11802 31998 8271 -22309
6637 -22309 -32410 -65156 -58622 -21625 10606 14184 47823 7793 23400 15352 -9838 -7611 16975
6624 16975 18621 24089 8371 11124 12748 39194 75086 36226 -6567 -22950 5942 63811 67658
6611 67658 73287 84770 102265 67553 -16391 -38279 -69738 -61452 -52501 -43131 884 23098 13747
6598 13747 30538 29106 -11044 -30372 -13281 3366 10711 -29147 -66813 -104720 -89687 -63383
$$ packed form
6686B4970K0935l2659l2301K6704J9246k2598J3597l13j4706j1745k3681j5648
6674d8199m938J9048M5317j4773J5776L5633m5930j4926J3779J2421P502r239
6662A1471j0825K7039j40j5824j1026J2536J3419l3825n3802j1227j8384L71l016
6649i3233L5447M3528k773J8242Q061j7922k0990j2281N3723K0196k3727l0580
6637b2309j0101l2746O534L6997L2231L578L3639m0030J5607q048k5190K227K4586
6624A6975J646N468j5718K753J624K6446L5892l8860m2793j6383K8892N7869L847
6611F7658N629J1483J7495l4712q3944k1888l1459Q286Q951R370M4015K2214r351
6598A3747J6791j432m0150j9328J7091J6647P345l9858l7666l7907J5033K6304
$$ plain form
6586 -63383 -87514 -76403 -92967 -121584 -130100 -109500 -63884 -41413 -19991 -14764 -13757 9210
6574 9210 -18432 -48038 -54209 -18185 2950 2637 6551 -67228 -53401 -18397 -27434 -4141 3296
6561 3296 45079 68063 37638 4798 8942 -59050 -66778 -37844 -35865 -25888 -65925 -98921 -95481
6548 -95481 -102699 -51951 -47650 -19522 -21764 -28254 -10263 10692 8176 71416 62909 19508 -14607
6535 -14607 -21288 -25631 -16140 14299 13247 -14540 -70755 -96568 -41172 -26254 -44683 -36345 -20228
6522 -20228 -36070 -33962 -43994 -13722 -15236 -1386 21766 -7006 -33290 13787 26989 36084
6510 36084 67853 79122 68996 57489 46460 53666 51853 23378 -11111 -34458 -8118 -22520
6498 -22520 -58336 -38179 -24877 -15647 15755 36376 40789 32753 28654 3062 25831 54171 13228
$$ packed form
6586f3383k4131J1111j6564k8617q516K0600M5616K2471K1422N227J007K2967
6574I210k7642k9606o171L6024K1135l13L914p3779J3827L5004r037K3293P437
6561C296M1783K2984l0425l2840M144o7992p728K8934J979R977m0037l2996L440
6548i5481p218N0748M301K8128k242o490J7991K0955k516O3240q507m3401l4115
6535a4607o681m343R491L0439j052k7787n6215k5813N5396J4918j8429Q338J6117
6522b0228j5842K108j0032L0272j514J3850K3152k8772k6284M7077J3202R095
6510C6084L1769J1269j0126j1507j1029P206j813k8475l4489k3347K6340j4402
6498b2520l5816K0157J3302R230L1402K0621M413q036m099k5592K2769K8340m0943
$$ plain form
6485 13228 -35340 -37983 7308 16736 11312 17722 20581 38135 56866 37088 -30374 -65707 -47839
6472 -47839 -14783 32168 76437 126901 102375 52703 48090 41588 -5155 -57560 -22040 13694
6460 13694 9648 3560 9473 9392 5109 -29529 -33727 -27208 -45531 -23589 -44139 -58418 -63020 -32226
6446 -32226 -38732 -76216 -86839 -57544 -37966 -80821 -64248 3495 47282 27995 -19871 -42628
6434 -42628 -37281 -16952 21077 8491 -7580 -27744 -72881 -77874 -81170 -86802 -30742 -21980 -4121
6421 -4121 -11412 -25836 -38515 -46323 1083 28536 -32661 -40797 -8055 1659 8512 19867 36503
6408 36503 11391 20619 48795 33918 7802 -46929 -35863 15827 30459 6037 -1824 13518
6396 13518 27119 30122 9119 -9932 10592 8821 21950 27337 1843 20866 29250 -16088 -26188
$$ packed form
6485A3228m8568k643M5291R428n424O410K859J7554J8731j9778o7462l5333J7868
6472d7839L3056M6951M4269N0464k4526m9672m613o502m6743n2405L5520L5734
6460A3694m046o088N913q1m283l4638m198O519j8323K1942k0550j4279m602L0794
6446c2226o506l7484j0623K9295J9578m2855J6573O7743M3787j9287m7866k2757
6434d2628N347K0329L8029j2586j6071k0164m5137m993l296n632N6060Q762J7859
6421d121p291j4424j2679p808M7406K7453o1197q136L2742R714O853J1355J6636
6408C6503k5112R228K8176j4877k6116n4731J1066N1690J4632k4422p861J5342
6396A3518J3601L003k1003j9051K0524j771J3129N387k5494J9023Q384m5338j0100
$$ plain form
6383 -26188 -36141 -30768 3642 40228 43527 -10394 -23396 16837 12232 -14725 21531 20275 39495
6370 39495 38892 -37243 -72959 -47632 -55107 -31482 -6562 -33129 3609 -16787 -34485 -24898 -222
6357 -222 -4258 -13851 -23573 26638 32132 20075 18622 46711 7845 -17690 2113 7679 28461
6344 28461 13095 6236 13788 30042 28393 32907 46629 -1128 -50612 -48128 -31978 -47936 -13785
6331 -13785 50325 49546 17563 9872 11942 -5059 -64004 -56227 -10034 41735 27988 -22126 -22533
6318 -22533 -51304 -66005 -53030 -25528 8737 42171 13279 -7627 21599 81543 112999 114690
6306 114690 71785 33629 32614 -23130 -70002 -42534 -38617 -15445 3612 -334 7565 -17038
6294 -17038 -59515 -31418 -29221 -47604 -60658 -117413 -153410 -101466 -57970 -14727 5655 45213
$$ packed form
6383b6188r953N373L4410L6586L299n3921j3002M0233m605k6957L6256j256J9220
6370C9495o03p6135l5716K5327p475K3625K4920k6567L6738k0396j7698R587K4676
6357b22m036r593r722N0211N494j2057j453K8089l8866k5535J9803N566K0782
6344B8461j5366o859P552J6254j649M514J3722m7757m9484K484J6150j5958L4151
6331a3785O4110p79l1983p691K070j7001n8945P777M6193N1769j3747n0114m07
6318b2533k8771j4701J2975K7502L4265L3434k8892k0906K9226N9944L1456J691
6306A14690m2905l8156j015n5744m6872K7468L917K3172J9057l946P899k4603
6294a7038m2477K8097K197j8383j3054n6755l5997N1944M3496M3243K0382L9558
$$ plain form
6282 45213 46317 18191 3951 -15154 -38911 -33327 -905 36175 14379 -35311 -17950 -30738
6270 -30738 -38674 -37715 -34770 -50442 -35493 -44651 -60897 -38221 9144 12701 -25541 -21332 -1687
6257 -1687 5303 7081 13734 31799 26543 19164 -22257 -9229 34702 80055 25181 3891 -13393
6244 -13393 -36270 -21752 -12200 -11906 -13524 -9233 47413 64499 47173 19405 -7388 -38103 -29926
6231 -29926 -22493 -55498 -15033 -11385 -20423 -18524 518 -702 -7731 -24932 6992 42650 43378
6218 43378 60337 43856 -5594 -44129 -71532 -31731 -10829 -31773 -52794 -44425 -25935 11559
6206 11559 42828 -19226 -40605 -13763 -2414 4862 -34239 -29250 -21149 -68522 -91019 -97845 -101001
6193 -101001 -56408 -28664 -7115 6083 -11928 29486 29452 -8736 2811 -35126 -25784 -10466
$$ packed form
6282D5213J104k8126j4240j9105k3757N584L2422L7080k1796m9690J7361j2788
6270c0738p936R59K945j5672J4949r158j6246K2676M7365L557l8242M209J9645
6257a687O990J778O653J8065n256p379m1421J3028M3931M5353n4874k1290j7284
6244a3393k2877J4518R552K94j618M291N6646J7086j7326k7768k6793l0715Q177
6231b9926P433l3005M0465L648r038J899J9042j220p029j7201L1924L5658P28
6218D3378J6959j6481m9450l8535k7403L9801K0902k0944k1021Q369J8490L7494
6206A1559L1269o2054k1379K6842J1349P276l9101M989Q101m7373k2497o826l156
6193a01001M4593K7744K1549J3198j8011M1414l4l8188J1547l7937R342J5318
$$ plain form
6181 -10466 19502 23654 25729 25845 24150 33307 34474 6424 1482 -43028 -92304 -72529 -59785
6168 -59785 -88961 -48107 -7350 -4162 16139 15860 29525 17226 10976 7682 -818 4111 -17244
6155 -17244 -46767 -49382 -45570 -56038 -48872 -39176 -50579 -31296 -33089 2712 19903 18671 -3701
6142 -3701 -56911 -62080 -61482 -36946 -9847 570 -8916 -30580 -28086 -108297 -111392 -26681 3073
6129 3073 -3077 -17549 -25277 -49310 -51550 -33785 -29629 -38674 -49404 -30038 -26029 -29724 -50331
6116 -50331 -49243 -39778 -35583 -6706 -3190 -928 -31457 -78185 -45402 2415 15748 16425 25126
6103 25126 46865 29201 19849 21468 47044 35987 44500 492 -50541 -55546 -36670 -37425 -48726
6090 -48726 -27265 -5526 3711 -49901 -61956 -9921 -36539 -42668 -8539 -4966 -8233 7624 9790
$$ packed form
6181a0466K9968M152K075J16j695R157J167k8050m942m4510m9276J9775J2744
6168e9785k9176M0854M0757L188K0301k79J3665j2299o250l294q500M929k1355
6155a7244k9523k615L812j0468P166R696j1403J9283j793L5801J7191j232k2372
6142c701n3210n169N98K4536K7099J0417r486k1664K494q0211l095Q4711K9754
6129C073o150j4472p728k4033k240J7765M156r045j0730J9366M009l695k0607
6116e0331J088R465M195K8877L516K262l0529m6728L2783M7817J3333O77Q701
6103B5126K1739j7664r352J619K5576j1057Q513m4008n1033n005J8876p55j1301
6090d8726K1461K1739R237n3612j2055N2035k6618o129L4129L573l267J5857K166
$$ plain form
6077 9790 683 -9360 -38488 -34011 -34289 -24309 -34158 -87482 -96404 -42545 -37814 -44643 -25903 -32205
6063 -32205 -43382 -47620 -66941 -51508 -47069 -32637 -53662 -42116 -29896 -21235 -42734 -51310 -36508
6050 -36508 -44631 -40151 19434 8509 35320 31516 48986 44534 39980 64531 98220 61606 23673
6037 23673 41151 41800 38432 32994 47681 57409 28330 -4628 8923 -9031 -59733 -60267 -14781
6024 -14781 -10661 11973 23317 34124 -21028 -47026 -32292 -24806 -23245 25775 14182 -17008
6012 -17008 -19573 -16679 16096 48511 82610 85207 21160 -37847 -68981 -39513 -3536 11023
6000 11023 -13535 -30074 -38006 -32805 -26622 -19366 -19931 -24420 -51040 -58166 -34797 -14131 -51226
5987 -51226 -72274 -61833 -20772 -22094 -39582 -23350 -54827 -46800 -15172 -309 39496 49673
$$ packed form
6077I790r107j0043k9128M477k78R980r849n3324q922N3859M731o829J8740o302
6063c2205j1177m238j9321J5433M439J4432k1025J1546J2220Q661k1499q576J4802
6050c6508q123M480N9585j0925K6811l804J7470m452m554K4551L3689l6614l7933
6037B3673J7478O49l368n438J4687R728k9079l2958J3551j7954n0702n34M5486
6024a4781M120K2634J1344J0807n5152k5998J4734P486J561M9020j1593l1190
6012a7008k565K894L2775L2415L4099K597o4047n9007l1134K9468L5977J4559
6000A1023k4558j6539p932N201O183P256n65m489k6620p126K3369K0666l7095
5987e1226k1048J0441M1061j322j7488J6232l1477Q027L1628J4863L9805J0177
$$ plain form
5975 49673 26251 37827 26162 3388 13047 17214 -3287 -8695 -19003 23129 27643 34237 71050
5962 71050 40610 -12994 -26041 -38330 -66941 -74333 -23588 -10395 -1015 37347 51422 23570
5950 23570 -22195 -31797 -18217 -36108 -24811 -55431 -9336 -5581 -21188 9753 12150 6058 25800
5937 25800 30257 -41551 -9732 10625 -10003 -1479 -14586 -63165 -91356 -65530 -37242 -29584
5925 -29584 -24958 6506 67406 84488 21717 -33451 -11563 16608 4920 -16080 -36834 -33050
5913 -33050 -57109 -73260 -89109 -42150 -19363 -12756 3829 58263 51003 21571 31617 63285
5901 63285 41734 27477 14831 -5740 -5404 -47958 -29381 -13761 -39274 -61178 -67444 -66260 -39238
5888 -39238 -55602 -42914 -30434 -49516 -51976 -37115 -33116 -69864 -97281 -104749 -62391 -19080
$$ packed form
5975D9673k3422J1576j1665k2774R659M167k0501n408j0308M2132M514O594L6813
5962G1050l0440n3604j3047j2289k8611p392N0745J3193R380L8362J4075k7852
5950B3570m5765r602J3580j7891J1297l0620M6095L755j5607L0941K397o092J9742
5937B5800M457p1808L1819K0357k0628Q524j3107m8579k8191K5826K8288P658
5925b9584M626L1464O0900J7082o2771n5168K1888K8171j1688k1000k0754L784
5913c3050k4059j6151j5849M6959K2787O607J6585N4434p260k9432J0046L1668
5901F3285k1551j4257j2646k0571L36m2554J8577J5620k5513k1904o266J184K7022
5888c9238j6364J2688J2480j9082k460J4861L999l6748k7417p468M2358M3311
$$ plain form
5876 -19080 11087 33719 -39840 -87057 -72904 -39171 7631 18038 15126 -20663 -40353 -2903
5864 -2903 31552 -1201 -61711 -45734 13717 22822 17170 18278 2955 -20361 7592 41567 22038
5851 22038 -1698 -7225 -21245 -25278 25793 76258 69700 65495 45274 -6755 -15598 -14541 19382
5838 19382 44016 39191 44109 29669 -33629 -64985 -35769 -8378 -6245 -27520 -5583 -19038
5826 -19038 -26777 -20992 -21963 -43678 -63156 -34635 -38208 -78216 -87526 -91953 -106667 -75705 -48136
5813 -48136 -41074 -19912 22661 37424 -19998 -58987 -31029 22064 18907 -19735 -53041 -48540
5801 -48540 -18313 -15521 -13960 17305 27122 64352 22693 -838 22508 536 23158 4430
5789 4430 6308 -3870 -33893 -54586 -25726 -25379 -62985 -85782 -101290 -86940 -18135 -6680 -29764
$$ packed form
5876a9080L0167K2632p3559m7217J4153L3733M6802J0407k912l5789j9690L7450
5864b903L4455l2753o0510J5977N9451R105n652J108j5323k3316K7953L3975j9529
5851B2038k3736n527j4020m033N1071N0465o558m205k0221n2029q843J057L3923
5838A9382K4634m825M918j4440o3298l1356K9216K7391K133k1275K1937j3455
5826a9038p739N785r71k1715j9478K8521l573m0008r310m427j4714L0962K7569
5813d8136P062K1162M2573J4763n7422l8989K7958N3093l157l8642l3306M501
5801d8540L0227K792J561L1265R817L7230m1659k3531K3346k1972K2622j8728
5789D430J878j0178l0023k0693K8860L47l7606k2797j5508J4350O8805J1455k3084
$$ plain form
5776 -29764 -43328 -36208 -48114 -45746 -42917 -53756 -26475 -10711 15636 20018 -16740 -12305 27387
5763 27387 -12631 -42079 -34451 -57111 -94546 -96745 -96401 -65432 -19973 -14523 2897 -17789 7682
5750 7682 25114 -16981 -16458 1230 -26928 -23085 -3140 -42523 -55399 -50965 -34840 -48424 -76870
5737 -76870 -64872 -38280 -45202 -87557 -62986 -31838 -47691 -50093 28473 73917 15846 -35983
5725 -35983 -42169 -56451 -41089 -24025 -31693 -8385 -18771 -23588 -50122 -44124 -13677 -38242 -15976
5712 -15976 47773 33951 24917 -25713 -41700 3449 -44503 -88403 -72138 -26644 21944 20977
5700 20977 44294 20370 6465 -4169 -49331 -95830 -119461 -96855 -73067 -49858 -27207 -46978
5688 -46978 -81003 -59411 -29062 -52480 -79823 -72722 -64030 -51314 -44499 -25154 -45706 -56920
$$ packed form
5776b9764j3564P120j1906K368K829j0839K7281J5764K6347M382l6758M435L9692
5763B7387m0018k9448P628k2660l7435k199L44L0969M5459N450J7420k0686K5471
5750G682J7432m2095N23J7688k8158L843J9945l9383j2876M434J6125j3584k8446
5737g6870J1998K6592o922m2355K4571L1148j5853k402P8566M5444n8071n1829
5725c5983o186j4282J5362J7064p668K3308j0386m817k6534N998L0447k4565K2266
5712a5976O3749j3822r034n0630j5987M5149m7952m3900J6265M5494M8588r67
5700B0977K3317k3924j3905j0634m5162m6499k3631K2606K3788K3209K2651j9771
5688d6978l4025K1592L0349k3418k7343P101Q692J2716O815J9345k0552j1214
$$ plain form
5676 -56920 -37589 -29491 -30561 -44335 -50150 -25570 26857 9773 7913 48636 50269 17274 12929
5663 12929 -39166 -48820 -74677 -114264 -89848 -39967 -37297 -54672 -74456 -50585 -24617 -40502
5651 -40502 -16702 41661 44347 10319 26349 46050 1299 -44743 -13393 22381 18397 52218
5639 52218 63593 74508 61442 24317 -3767 -9856 27364 37873 12383 7893 -23351 -51226
5627 -51226 -60487 -92870 -93781 -39055 -36215 -48124 5635 18122 118 -7241 9517 11544 -11749
5614 -11749 -31814 -6733 10236 11626 1438 -16822 -16383 -6294 -34796 -39981 15084 21285 14132
5601 14132 -3054 13408 39672 76515 95506 49832 8370 19627 -39515 -91948 -84352 -15142
5589 -15142 17952 4453 -5027 -22903 -29762 -45508 -53171 -56305 -70884 -115984 -84471 -32018 -28965
$$ packed form
5676e6920J9331Q098j070j3774n815K4580N2427j7084j860M0723J633l2995m345
5663A2929n2095r654k5857l9587K4416M9881K670j7375j9784K3871K5968j5885
5651d0502K3800N8363K686l4028J6030J9701m4751m6042L1350L5774l984L3821
5639E2218J1375J0915j3066l7125k8084o089L7220J0509k5490m490l1244k7875
5627e1226r261l2383r11N4726K840j1909N3759J2487j8004p359J6758K027k3293
5614a1749k0065K5081J6969J390j0188j8260M39J0089k8502n185N5065O201p153
5601A4132j7186J6462K6264L6843J8991m5674m1462J1257n9142n2433P596O9210
5589a5142L3094j3499r480j7876o859j5746p663l134j4579m5100L1513N2453L053
$$ plain form
5576 -28965 -51094 -55676 -29362 -13902 -2671 -9942 2970 -8567 -9270 30595 70318 87626 62650
5563 62650 21378 49208 57917 26377 -27851 -54636 -80066 -36123 15732 26043 63252 69463
5551 69463 53667 35439 11945 24941 46586 47119 16975 10440 -42094 -68245 -28451 4912
5539 4912 30748 79214 90270 20850 -5672 4695 -2316 6970 28785 32175 2813 -20056 -33747
5526 -33747 -46331 -43879 -70209 -41073 13163 24925 27061 44373 43136 6957 -33351 -14004
5514 -14004 24962 34574 8214 -52925 -102260 -102467 -78184 -100541 -81585 -50322 -35507 -58595
5502 -58595 -94074 -58115 -68321 -79286 -49538 -23115 -17460 -30320 -54398 -62404 -56043 -31576
5490 -31576 25948 67010 72441 37459 -571 -9622 9733 50515 50773 48226 35176 1944 -23862
$$ packed form
5576b8965k2129m582K6314J5460J1231p271J2912j1537p03L9865L9723J7308k4976
5563F2650m1272K7830Q709l1540n4228k6785k5430M3943N1855J0311L7209O211
5551F9463j5796j8228k3494J2996K1645N33l0144o535n2534k6151L9794L3363
5539D912K5836M8466J1056o9420k6522J0367p011R286K1815L390k9362k2869j3691
5526c3747j2584K452k6330K9136N4236J1762K136J7312j237l6179m0308J9347
5514a4004L8966R612k6360o1139m9335k07K4283k2357J8956L1263J4815k3088
5502e8595l5479L5959j0206j0965K9748K6423N655j2860k4078q006O361K4467
5490c1576N7524M1062N431l4982l8030r051J9355M0782K58k547j3050l3232k5806
$$ plain form
5477 -23862 -58186 -39788 14164 9141 9954 6335 639 -18849 -18302 19662 -9980 -37064 -43560
5464 -43560 -25990 -12538 7797 27866 3205 -9757 8561 5892 -44325 -45515 -7859 30224
5452 30224 34572 -4108 -9122 15890 46268 51351 23342 7787 -1680 -12379 4177 60183 104398
5439 104398 70465 20963 13520 56415 28087 4373 28583 14001 7641 50497 37034 37943
5427 37943 56026 49039 40144 18047 -27526 -36217 -45839 -33874 -36174 -2217 -449 19130 60872
5414 60872 33823 -1519 11928 69471 57182 70873 126370 123732 71443 44498 14349 -5361
5402 -5361 -24570 -20079 -9973 29462 27529 26590 7438 23439 29658 23964 37879 43886 30359
5389 30359 10563 8603 7014 19034 39179 40525 10077 12577 6422 -4930 1140 19135 33491
$$ packed form
5477b3862l4324J8398N3952n023Q13l619n696j9488N47L7964k9642k7084o496
5464d3560J7570J3452K0335K0069k4661j2962J8318k669n0217j190L7656L8083
5452C0224M348l8680n014K5012L0378N083k8009j5555r467j0699J6556N6006M4215
5439A04398l3933m9502p443M2895k8328k3714K4210j4582o360M2856j3463R09
5427C7943J8083o987q895k2097m5573q691r622J1965k300L3957J768J9579M1742
5414F0872k7049l5342J3447N7543j2289J3691N5497k638n2289k6945l0149j9710
5402e361j9209M491J0106L9435j933r39j9152J6001O219n694J3915O007j3527
5389C0359j9796j960j589J2020K0145J346l0448K500o155j1352O070J7995J4356
$$ plain form
5376 33491 44839 43041 45570 24244 34903 80338 79652 24597 30592 38602 11166 19085 29132
5363 29132 10013 -14502 -42600 -40469 -42570 -32392 -21452 -7901 -21248 -36026 -34507 -13431
5351 -13431 10244 20298 -21988 -11810 2922 -8967 -43915 -91910 -51422 33808 53255 36680
5339 36680 -8094 655 62985 56722 -4680 9268 27134 -5193 -48084 -17554 16490 46795
5327 46795 50037 10766 1921 -15280 -12068 15224 30007 7928 -10279 -29319 -11824 -15116 3232
5314 3232 -3258 -7117 20449 22813 37587 31893 -31461 -82796 -70799 -50712 -59580 -79307 -72779
5301 -72779 -48315 -46385 -42491 -53946 -6021 13898 -8512 -26928 -34735 -32419 -61666 -49177 2699
5288 2699 45794 44415 19488 7423 19355 41290 62661 47034 34328 -4073 14545 60011
$$ packed form
5376C3491J1348j798K529k1326J0659M5435o86n5055N995Q010k7436P919J0047
5363B9132j9119k4515k8098K131k101J0178J0940J3551j3347j4778J519K1076
5351a3431K3675J0054m2286J0178J4732j1889l4948m7995M0488Q5230J9447j6575
5339C6680m4774Q749O2330o263o1402J3948J7866l2327m2891L0530L4044L0305
5327D6795L242l9271q845j7201L212K7292J4783k2079j8207j9040J7495l292J8348
5314C232o490l859K7566K364J4774n694o3354n1335J1997K0087q868j9727O528
5301g2779K4464J930L894j1455M7925J9919k2410j8416p807K316k9247J2489N1876
5288B699M3095j379k4927j2065J1932K1935K1371j5627j2706l8401J8618M5466
$$ plain form
5276 60011 34211 -2547 1715 51976 57658 67684 73053 82767 39646 58128 50712 23694 43477
5263 43477 101422 85459 66999 64866 14013 1304 20346 44933 84932 92125 59377 41334
5251 41334 10776 11136 33469 27515 64681 69223 77359 95031 117322 37255 -8627 -15465 -31351
5238 -31351 -63791 -109102 -129179 -131475 -123582 -104466 -72194 -78270 -86965 -98173 -98116 -21502 8200
5225 8200 -13335 -45615 -35772 -62207 -59187 -46713 -62100 -49453 -52289 -66037 -52745 -36409 -47330
5212 -47330 -102194 -86211 -26160 -5404 -8182 -13634 12552 27147 21365 7359 -19654 -25106 -44573
5199 -44573 -38073 -41579 -67159 -44656 -22856 -24217 -30536 -32194 -49028 -57565 -61890 -26574 -10644
5186 -10644 -32945 -5559 4221 -6269 -34229 -17594 -22334 -56600 -2619 26592 36760 -3902
$$ packed form
5276F0011k5800l6758M262N0261N682J0026N369R714m3121J8482p416k7018J9783
5263D3477N7945j5963j8460k133n0853j2709J9042K4587L9999P193l2748j8043
5251D1334l0558L60K2333n954L7166M542Q136J7672K2291q0067m5882o838j5886
5238c1351l2440m5311k0077k296P893J9116L2272o076q695j1208N7P6614K9702
5225H200k1535l2280R843k6435L020J2474j5387J2647k836j3748J3292J6336j0921
5212d7330n4864J5983O0051K0756k778n452K6186J4595n782j4006k7013n452j9467
5199d4573O500l506k5580K2503K1800j361o319j658j6834q537m325L5316J5930
5186a0644k2301K7386R780j0490k7960J6635m740l4266N3981K9211J0168m0662
$$ plain form
5174 -3902 -49777 -49628 -25712 21676 50511 39777 41108 45130 7602 -7780 6985 21736 40270
5161 40270 26385 -7782 -27996 -6410 -2006 16616 52193 20029 15559 -6074 -34031 -24106
5149 -24106 -18073 -17219 -13839 -35972 -34487 5646 15645 12859 -1323 -41966 -68549 -36772 14427
5136 14427 -14785 -27561 -17276 -9952 -41784 -39587 -19826 -20176 -39652 -74002 -91833 -60417 -40374
5123 -40374 -10015 13564 -32085 -37825 -370 15557 31077 51898 35817 42761 55888 26043
5111 26043 -9066 1532 28860 19565 -9949 -7973 15581 -5505 -21279 10045 -6013 8279
5099 8279 41956 38110 24599 -3051 -15094 -24918 -27968 -24898 -21648 -49332 -42928 -11992 -31784
5086 -31784 -38072 -27277 -24170 -25307 -25586 4536 25619 25065 51587 42007 34580 23643 37857 21054
$$ packed form
5174c902m5875J49K3916M7388K8835j0734J331M022l7528j5382J4765J4751J8534
5161D0270j3885l4167k0214K1586M404J8622L5577l2164m470k1633k7957R925
5149b4106O033Q54L380k2133J485M0133R999k786j4182m0643k6583L1777N1199
5136A4427k9212j2776J0285P324l1832K197J9761l50j9476l4350j7831L1416K0043
5123d0374L0359K3579m5649n740L7455J5927J5520K0821j6081O944J3127k9845
5111B6043l5109J0598K7328r295k9514J976K3554k1086j5774L1324j6058J4292
5099H279L3677l846j3511k7650j2043r824l050L070L250k7684O404L0936j9792
5086c1784o288J0795L107j137k79L0122K1083n54K6522r580p427j0937J4214j6803
$$ plain form
5072 21054 -1556 -9521 -39523 -53757 -60415 -46879 10375 46467 21499 -18093 -69738 -72757
5060 -72757 -65495 -96383 -74349 -42918 -22990 20142 32123 17150 7810 -38313 -50031 -67784
5048 -67784 -75538 -56289 -31220 -58614 -65063 -54916 -56724 -36042 -58160 -91289 -94994 -61940 -34390
5035 -34390 8721 67877 56299 30870 34233 64391 63918 45912 49964 37492 -17048 -26196 -21620
5022 -21620 -6921 -7854 8823 8212 16253 18137 38405 13260 -23068 -23755 -38374 -21940 -22076 -21973
$$ packed form
5072B1054k2610p965l0002j4234o658J3536N7254L6092k4968l9592n1645l019
5060g2757P262l0888K2034L1431J9928M3132J1981j4973r340m6123j1718j7753
5048f7784p754J9249K5069k7394o449J0147j808K0682k2118l3129l705L3054K7550
5035c4390M3111N9156j1578k5429L363L0158m73j8006M052j2472n4540r148M576
5022b1620J4699r33J6677o11Q041J884K0268k5145l6328o87j4619J6434j36J03
$$ [...]
##END NTUPLES=NMR SPECTRUM
##END=
