##TITLE=Analysis number 330295
Compound Code cc 68509
Book Reference 528/72
Project Code adrs
Chemist Name davee
##JCAMPDX= 6.0         $$ Bruker NMR JCAMP-DX V2.0
##DATA TYPE= NMR SPECTRUM
##DATA CLASS= NTUPLES
##ORIGIN= Bruker BioSpin GmbH
##OWNER= nmr
$$ XWIN-NMR		Version 3.5
$$ Wed Nov 14 11:18:16 2007 GMT Standard Time (UT+0h)  MAYBRIDGE\nmr@NMR_250MHZ
##.OBSERVE FREQUENCY= 250.131544655141
##.OBSERVE NUCLEUS= ^1H
##.ACQUISITION MODE= SIMULTANEOUS (DQD)
##.ACQUISITION SCHEME= undefined
##.AVERAGES= 16
##.DIGITISER RES= 18
##SPECTROMETER/DATA SYSTEM= dpx250
##.PULSE SEQUENCE= zg30
##.SOLVENT NAME= CDCl3
##.SHIFT REFERENCE= (INTERNAL, CDCl3, 0, 16.522)
##AUDIT TRAIL= $$ (NUMBER, WHEN, WHO, WHERE, WHAT)
$$ ##TITLE= Audit trail, XWIN-NMR		Version 3.5
$$ ##JCAMPDX= 5.01
$$ ##ORIGIN= Bruker BioSpin GmbH
$$ ##OWNER= nmr
$$ C:\u/data/dgb/nmr/ADRS/670/pdata/1/auditp.txt
$$ ##AUDIT TRAIL=  $$ (NUMBER, WHEN, WHO, WHERE, WHAT)
(   1,<2007-11-14 11:17:51.99 +000>,<MAYBRIDGE\nmr>,<NMR_250MHZ>,
      <created by zg, POWCHK disabled, PULCHK disabled
       configuration hash MD5:
       76 6E 9A 78 1E 09 19 81 EC 84 63 8F B0 6A 59 2D
       data hash MD5: 64K
       92 80 A3 91 BC FA E1 A4 6B F5 20 F7 AA 9D A2 CE>)
(   2,<2007-11-14 11:18:06.26 +000>,<MAYBRIDGE\nmr>,<NMR_250MHZ>,
      <Start of raw data processing
       ef LB = 0.3 FT_mod = 6 PKNL = 1 SI = 32K 
       data hash MD5: 32K
       F2 0D A1 8D FB FB 79 72 B2 1E C7 6F 89 76 F7 CC>)
(   3,<2007-11-14 11:18:07.90 +000>,<MAYBRIDGE\nmr>,<NMR_250MHZ>,
      <apk 
       data hash MD5: 32K
       7B 30 2F 1F 64 43 24 29 D6 CC 84 0F C3 CA 18 67>)
(   4,<2007-11-14 11:18:08.71 +000>,<MAYBRIDGE\nmr>,<NMR_250MHZ>,
      <abs ABSG = 5 
       data hash MD5: 32K
       5C 05 24 59 8E 7A 2A 94 56 BA FA 10 1A BB 81 A5>)
$$ ##END=
$$ 
$$ hash MD5
$$ 39 44 F7 9A E9 88 33 7B 48 C9 4A 60 8A 9A D6 29
##$RELAX= 
##$RELAX= 
##$RELAX= 
##$RELAX= 
##$RELAX= 
##$RELAX= 
##$RELAX= 
$$ Bruker specific parameters
$$ --------------------------
##$DU= <C:\u>
##$EXPNO= 670
##$NAME= <ADRS>
##$PROCNO= 1
##$TYPE= <nmr>
##$USER= <dgb>
##$AMP= (0..31)
100 100 100 100 100 100 100 100 100 100 100 100 100 100 100 100 100 100 
100 100 100 100 100 100 100 100 100 100 100 100 100 100 
##$AQSEQ= 0
##$AQ_mod= 3
##$AUNM= <au_zg>
##$AUTOPOS= <14 >
##$BF1= 250.13
##$BF2= 250.13
##$BF3= 250.13
##$BF4= 250.13
##$BF5= 500.13
##$BF6= 500.13
##$BF7= 500.13
##$BF8= 500.13
##$BYTORDA= 1
##$CFDGTYP= 0
##$CFRGTYP= 5
##$CHEMSTR= <none>
##$CNST= (0..31)
1 1 145 1 1 1 1 1 1 1 1 1 1 1 1 1 1 1 1 1 1 1 1 1 1 1 1 1 1 1 1 1 
##$CPDPRG= <>
##$CPDPRG1= <>
##$CPDPRG2= <>
##$CPDPRG3= <>
##$CPDPRG4= <mlev>
##$CPDPRG5= <mlev>
##$CPDPRG6= <mlev>
##$CPDPRG7= <mlev>
##$CPDPRG8= <mlev>
##$CPDPRGB= <>
##$CPDPRGT= <>
##$D= (0..31)
0 1 0 0 0 0 0 0 0 0.06 0 0 0 0 0 0 0.0002 0 0 0 0 0 0 0 0 0 0 0 0 0 0 
0 
##$DATE= 1195039070
##$DBL= (0..7)
120 120 120 120 120 120 120 120 
##$DBP= (0..7)
150 150 150 150 150 150 150 150 
##$DBP07= 0
##$DBPNAM0= <>
##$DBPNAM1= <>
$$ [...]
##$SUBNAM7= <"">
##$SUBNAM8= <"">
##$SUBNAM9= <"">
##$SW= 20.6930455092707
##$SWIBOX= (0..15)
0 0 3 0 0 0 0 0 0 0 0 0 0 0 0 0 
##$SW_h= 5175.983436853
##$TD= 65536
##$TD0= 1
##$TE= 295.16
##$TE2= 300
##$TE3= 300
##$TEG= 300
##$TL= (0..7)
0 120 120 120 120 120 120 120 
##$TP= (0..7)
150 150 150 150 150 150 150 150 
##$TP07= 0
##$TPNAME0= <>
##$TPNAME1= <>
##$TPNAME2= <>
##$TPNAME3= <>
##$TPNAME4= <>
##$TPNAME5= <>
##$TPNAME6= <>
##$TPNAME7= <>
##$TPOAL= (0..7)
0.5 0.5 0.5 0.5 0.5 0.5 0.5 0.5 
##$TPOFFS= (0..7)
0 0 0 0 0 0 0 0 
##$TUNHIN= 0
##$TUNHOUT= 0
##$TUNXOUT= 0
##$USERA1= <user>
##$USERA2= <user>
##$USERA3= <user>
##$USERA4= <user>
##$USERA5= <user>
##$V9= 5
##$VALIST= <valist>
##$VCLIST= <CCCCCCCCCCCCCCC>
##$VD= 0
##$VDLIST= <DDDDDDDDDDDDDDD>
##$VPLIST= <PPPPPPPPPPPPPPP>
##$VTLIST= <TTTTTTTTTTTTTTT>
##$WBST= 1024
##$WBSW= 4
##$XGAIN= (0..3)
0 0 0 0 
##$XL= 0
##$YL= 0
##$YMAX_a= 345244
##$YMIN_a= -506714
##$ZGOPTNS= <>
##$ZL1= 120
##$ZL2= 120
##$ZL3= 120
##$ZL4= 120
##$ABSF1= 16.522
##$ABSF2= -4.171173
##$ABSG= 5
##$ABSL= 3
##$ALPHA= 0
##$AQORDER= 0
##$ASSFAC= 0
##$ASSFACI= 0
##$ASSFACX= 0
##$ASSWID= 0
##$AUNMP= <proc_1d>
##$AZFE= 0.1
##$AZFW= 0.1
##$BCFW= 0
##$BC_mod= 0
##$BYTORDP= 0
##$COROFFS= 0
##$CY= 12.5
##$DATMOD= 1
##$DC= 0
##$DFILT= <>
##$DTYPP= 0
##$F1P= 14.0000005364418
##$F2P= -0.99999901652339
##$FCOR= 0.5
##$FTSIZE= 32768
##$FT_mod= 6
##$GAMMA= 0
##$GB= 0
##$INTBC= 1
##$INTSCL= 1
##$ISEN= 128
##$LB= 0.3
##$LEV0= 0
##$LPBIN= 0
##$MAXI= 10000
##$MC2= 0
##$MEAN= 0
##$ME_mod= 0
##$MI= 0
##$NCOEF= 0
##$NC_proc= -4
##$NLEV= 6
##$NOISF1= 0
##$NOISF2= 0
##$NSP= 0
##$NTH_PI= 0
##$NZP= 0
##$OFFSET= 16.522
##$PC= 1
##$PHC0= 167.2537
##$PHC1= 12.70098
##$PH_mod= 1
##$PKNL= yes
##$PPARMOD= 0
##$PSCAL= 4
##$PSIGN= 0
##$REVERSE= no
##$SF= 250.13
##$SI= 32768
##$SIGF1= 0
##$SIGF2= 0
##$SINO= 400
##$SIOLD= 32768
##$SREGLST= <1H.CDCl3>
##$SSB= 0
##$STSI= 32768
##$STSR= 0
##$SW_p= 5175.98343685301
##$SYMM= 0
##$S_DEV= 0
##$TDeff= 65536
##$TDoff= 0
##$TI= <Analysis number 999999
Compound Code 99
Book Reference 9
Project Code 9>
##$TILT= no
##$TM1= 0
##$TM2= 0
##$TOPLEV= 0
##$USERP1= <user>
##$USERP2= <user>
##$USERP3= <user>
##$USERP4= <user>
##$USERP5= <user>
##$WDW= 1
##$XDIM= 32768
##$YMAX_p= 313854909
##$YMIN_p= -368243
$$ End of Bruker specific parameters
$$ ---------------------------------
##NTUPLES= NMR SPECTRUM
##VAR_NAME=  FREQUENCY,     SPECTRUM/REAL,   SPECTRUM/IMAG
##SYMBOL=    X,             R,               I
##VAR_TYPE=  INDEPENDENT,   DEPENDENT,       DEPENDENT
##VAR_FORM=  AFFN,          ASDF,            ASDF
##VAR_DIM=   32768,         32768,           32768
##UNITS=     HZ,            ARBITRARY UNITS, ARBITRARY UNITS
##FACTOR=    0.157963299565203, 1,           1
##FIRST=     4132.6476996994, 0,             0
##LAST=      -1043.33573715361, 0,           0
##MIN=       -1043.33573715361, -368243,     0
##MAX=       4132.6476996994, 313854909,     0
$$ Real data points
##PAGE= N=1
##DATA TABLE= (X++(R..R)), XYDATA
$$ [...]
17829a4256l8054L4306K4471k1973l6928K9605j1761k1226M2171J5971P261Q379
17817A7966l5151j0184o6526j9245N035K0672N7316M0704l8069m182K7370Q025
17805C731n79r764q861K0869K0278o196n5425k0395k760L3975j8486k3686k9255
17792i6554k85K9764M7038j0879R202J2485M6123k3791j1640J3913O887M4539
17780F6802m9889n5132L483k696k9614M2508K8919N8557J1371k0531p7294l0745
17768e4261L9657k7040n5046p118k416K1590M8336M3211J8218m5476j8309k6165
17756f4819L4113M4010p9074n4762j3174J6970r966L6353M5646M1722m2182J278
17744d3885O2051N3728q3444k3604K0986m0888q908J8323k5111K2132L0914l158
$$ plain form
17829 -14256 -52310 -18004 6467 -15506 -52434 -22829 -34590 -55816 -13645 2326 9587 17966
17817 17966 -17185 -27369 -93895 -113140 -108105 -87433 -30117 10587 -27482 -31664 -4294 3731
17805 3731 3152 -6612 -15473 5396 25674 19478 -35947 -56342 -59102 -25127 -43613 -67299 -96554
17792 -96554 -96839 -67075 -20037 -30916 -21714 -9229 36894 13103 1463 15376 22263 66802
17780 66802 16913 -38219 -34736 -37432 -67046 -24538 4381 62938 74309 53778 -23516 -54261
17768 -54261 -14604 -41644 -96690 -103808 -106224 -84634 -36298 6913 25131 -20345 -38654 -64819
17756 -64819 -30706 13304 -65770 -120532 -133706 -116736 -126702 -90349 -44703 -2981 -45163 -43885
17744 -43885 18166 71894 -11550 -35154 -14168 -55056 -63964 -45641 -70752 -48620 -17706 -20864
17732b0864k0191l6607N89m8870l8442J7890O244m382O4287M059K3451K0694L0405
17719a737M032m4104J8027K414j8688j8335M6496K6989N1330j4078J2305o0210
17707D441k5322J8391o0891l5029M5006l6867m5851K0622K3412L3478j2689l0554
17695a01853j1627N3082K4013N111l889P3642L3177m9848j4030K403j4570j5365
17683a9754j1449O512J66K4517k244M3326M2509J9139o2412P077J3544M2888k4101
17670G9718m3789N5958J31591J40778O8366J8445J63509J49573J13371J34679
17660A012199J27770J9734Q2370P1925K0259R951l9642n4754o7261j16899j70072
17649H95580j15409l2207k7380j28594j24363j05613q554j6989K5066L7285J1138
$$ plain form
17732 -20864 -41055 -77662 -77073 -125943 -164385 -146495 -140251 -144633 -80346 -76287 -52836 -32142 -1737
17719 -1737 2295 -41809 -23782 -21368 -40056 -58391 -11895 15094 66424 52346 64651 4441
17707 4441 -20881 -2490 -63381 -98410 -53404 -90271 -136122 -115500 -92088 -58610 -71299 -101853
17695 -101853 -113480 -60398 -36385 -31274 -35163 38479 71656 21808 7778 10181 -4389 -19754
17683 -19754 -31203 -24691 -24525 -8 -2252 41074 83583 102722 40310 47387 60931 103819 79718
17670 79718 35929 91887 223478 364256 432622 451067 614576 764149 877520 1012199
17660 1012199 1139969 1159703 1242073 1313998 1334257 1344208 1304566 1249812 1182551 1065652 895580
17649 895580 780171 747964 720584 591990 467627 362014 353460 336471 361537 398822 409960
17638D09960j0703n0196k3805L0997M0681k9601n3754j00385p6127l8016n4635
17627D4416k842l7618j0002K712K1251k133p0373K7880j6125L1597O006k5448
17615c0679L1915K4354N1114R33q9776j3313M8783L9264m8797m6280l0140M2017
17603b0605K1845M2970J595j9616p000J5435l7709k862l7435J7097j2202q726
17591d7213Q591L6083J3486J1072l4364r2077o736Q1542K1979K2729k374J8478
17579C1196m4907l0428K3737L1473j3533k500k9465n5024L8293M8811n7472m0502
17567a00321M792P8018O4538L4527J3024l6931k7047l6690j9420K5225k1144k985
17555b4414l2446l8191K8197N6336L0045l462k1715J4922j3182j8456O999k9048
$$ plain form
17638 409960 399257 349061 325256 356253 396934 367333 313579 213194 137067 99051 44416
17627 44416 41574 3956 -6046 -3334 17917 15784 -54589 -26709 -42834 -11237 -5231 -30679
17615 -30679 1236 25590 76704 77637 -12139 -25452 23331 62595 13798 -32482 -62622 -20605
17603 -20605 1240 44210 45805 26189 19189 34624 -3085 -5947 -43382 -26285 -38487 -47213
17591 -47213 -38622 -2539 10947 22019 -12345 -104422 -111158 -29616 -7637 15092 12718 31196
17579 31196 -13711 -44139 -20402 11071 -2462 -4962 -34427 -89451 -51158 -2347 -59819 -100321
17567 -100321 -95529 -17511 47027 81554 94578 57647 30600 -6090 -25510 -285 -21429 -24414
17555 -24414 -56860 -95051 -66854 -10518 19527 16065 -5650 9272 -3910 -22366 -15367 -44415
17543d4415L9303M691k3022J8477M9999l7135J873K1012j7469m8219q742n073
17531d8720k4310J6520k2327J565m3622l4530K8689Q2688K656l4581M861L6167
17519c4944K0238K4657J6230J0063n7949o6268k8538J0169K6563M7040o860Q784
17507c0815N0074K4464j5839J4344j6785j220k2291k2546L0377j0797j1197j8296
17495c0527k3695j161j6180n6256N0274L6278K274J804L7794J4669n4346r0116
17483a29188j2758N0116M9823k3905j4178R894j1266q363J1121j0279l6396l7902
17471a63281N779n097P501K4621q448M8379Q501O395P3823J1964m0690J4796L5707
17458A9950K7064J4850M1194k1419n8936j4637J7551o174k5312K6078N9166L4924
$$ plain form
17543 -44415 -5112 -421 -23443 -4966 45033 7898 9771 30783 13314 -34905 -43647 -48720
17531 -48720 -73030 -56510 -78837 -77272 -120894 -155424 -126735 -44047 -41391 -75972 -71111 -34944
17519 -34944 -14706 9951 26181 36244 -21705 -87973 -116511 -106342 -79779 -32739 -39599 -30815
17507 -30815 19259 43723 27884 42228 25443 24223 1932 -20614 9763 -1034 -12231 -30527
17495 -30527 -54222 -55383 -71563 -127819 -77545 -41267 -38993 -37189 605 15274 -39072 -129188
17483 -129188 -141946 -91830 -42007 -65912 -80090 -70196 -81462 -89825 -78704 -88983 -125379 -163281
17471 -163281 -157502 -162599 -155098 -130477 -138925 -90546 -82045 -75650 -1827 10137 -30553 -15757 19950
17458 19950 47014 61864 103058 81639 22703 8066 25617 19443 -5869 20209 79375 114299
17446A14299R4831P3577J79478J97410q980j55056j46566j21331p4244j5676k0754
17435A16988k5196o535m4569o8207k3308K5798k5701J3265K2646N1905M501k342
17423C9245L4585l6554k1951O9446N8661j0058o2085p6348n6852l1520l571N3358
17411d3644M8211j4727j4474o5042J3278O5335L6573K4759j5817o1305k1741n0143
17399i8737N352R801L9174l3128M8148P3532L8074J3281k1326m3454o316L2513
17387E6914M9375N1407j3509o1417k1185o900j9087q7830q8536K8560M1916m6237
17375a16529p22Q9811K1604k074O9315O7800J4844m9930n0517j9270L3120l3113
17363B4339J8543n1014m1078k0965l9593L3122P5328J6483N553j8697j112M6099
$$ plain form
17446 114299 209130 282707 462185 659595 650615 495559 348993 227662 153418 137742 116988
17435 116988 91792 85257 40688 -27519 -50827 -25029 -50730 -37465 -14819 37086 41587 39245
17423 39245 73830 37276 15325 84771 143432 133374 71289 -5059 -61911 -93431 -97002 -43644
17411 -43644 4567 -10160 -24634 -89676 -76398 -11063 25510 50269 34452 -26853 -48594 -98737
17399 -98737 -93385 -83584 -44410 -77538 -29390 44142 82216 95497 74171 30717 24401 56914
17387 56914 106289 157696 144187 82770 61585 54685 35598 -52232 -140768 -112208 -70292 -116529
17375 -116529 -117251 -27440 -5836 -7910 61405 129205 144049 94119 43602 24332 57452 24339
17363 24339 42882 -8132 -49210 -70175 -109768 -76646 -1318 15165 20718 2021 909 47008
17351D7008j8985k3166M3196k0555M759M4452p701R637N686m7463m2365p169j5948
17338b8614m4726j0140P3702k724k7978R464J603j8259M131k0706p930L9920k7025
17325e9282L9333K4619K9277J2868k3851M1812l5243j8338q2542l7111j2636k1484
17313a42578N6736J23012P480k4104J3787q0713p5915J0044N2109J75j6010N3923
17301b2054L9058n850K6424K696L2947j7195J0197K9397k8483o3127k845N0222
17289E1387K8509l0577k8109L514l198N584K8809m1648k2604L3897p722p2618
17277e4776j2016J6783M8682M490j9589j0724l4281K7400O9840J7688j0091K2919
17265F6325M0812m6937j37051j74L3016k473j2999J9466N1461K2861M890l6613
$$ plain form
17351 47008 28023 4857 48053 27498 32257 76709 69008 78645 84331 36868 -5497 -12666 -28614
17338 -28614 -73340 -83480 -9778 -12502 -40480 -31016 -29413 -47672 -43541 -64247 -72177 -32257 -59282
17325 -59282 -19949 4670 33947 46815 22964 64776 29533 11195 -71347 -108458 -121094 -142578
17313 -142578 -85842 37170 44650 20546 34333 -46380 -122295 -112251 -60142 -59967 -75977 -22054
17301 -22054 17004 11154 37578 40274 73221 56026 66223 95620 67137 4010 1165 51387
17289 51387 79896 49319 21210 24724 21526 27110 55919 14271 -8333 25564 17842 -54776
17277 -54776 -66792 -50009 -1327 3163 -16426 -27150 -61431 -34031 35809 53497 43406 66325
17265 66325 107137 60200 -76851 -77025 -44009 -46482 -59481 -40015 11446 34307 39197 2584
17253B584j8623p91l5917L3338K5454k9481k3594j161k8720L1837J0565M0666
17241F157J1364J5457J0983j746r8468k6219M3594J7740Q738L6694Q941o12l0706
17228A917K2249j5140Q833k4107k3151P062L1081j5094K2017P2907j5580j6590
17216E6404l5929k5062O85K5718K6749j8678k2650l6635l3578M687l2407J2265
17204g8431j16j6902K3624j0691m2895l7104K4585M0711K7797J9227j0925m3144
17192a04264J975K6158M4006J5767K3251l223m7895j6029O7092J0123M5970m249
17180E8682L947k5523k9598P2N5806K7412L4737L60p69k9859m3523Q471O6698
17167A26913Q0121N5230j3764M9327K1948j8454j19264p1583j2424K2205N4874
$$ plain form
17253 2584 -16039 -16830 -52747 -19409 6045 -23436 -47030 -48191 -76911 -45074 -34509 6157
17241 6157 17521 32978 43961 42215 -56253 -82472 -38878 -21138 -12400 24294 33235 32623 1917
17228 1917 24166 9026 17859 -6248 -29399 -22337 8744 -6350 15667 88574 72994 56404
17216 56404 20475 -4587 -3902 21816 48565 29887 7237 -29398 -62976 -58289 -90696 -78431
17204 -78431 -78547 -95449 -71825 -82516 -125411 -162515 -137930 -97219 -69422 -50195 -61120 -104264
17192 -104264 -102289 -76131 -32125 -16358 6893 3670 -44225 -60254 6838 16961 62931 58682
17180 58682 62629 37106 7508 7580 63386 90798 125535 125895 125126 95267 51744 60215 126913
17167 126913 207034 262264 248500 297827 319775 301321 182057 110474 98050 120255 175129
17156A75129M7985O1032L7346J5811k6429k3208j6251r365O4518J9196l139M3315
17144C85940p2398j07079m5525K3181p2310q5834j0336O3703J7652O9454J46601
17133C13049N9351L0927l1105j05689r3094m8062n9316k2711M1867k6211j6199
17122D2807m2118K4619M3556J1694l8528j14631l7654N6769N3816J2395n8603
17111d5878k7924K4056K2915K5680n608J0778J388N757K3531K3532P724n3491
17099A2460q0095r500q3339N8114O9291P5241k9154o6618l8508K3556M5620J2391
17087a0541L2574K0727j4437P874J1414J1984J1992k7885m2709m0586M3965n173
17075h01j4344N1620M6151K113J0869n2421o0125J5757K4605K8948L9525k7020
$$ plain form
17156 175129 223114 284146 321492 337303 310874 287666 271415 262050 326568 345764 342625 385940
17144 385940 313542 206463 160938 184119 111809 25975 15639 79342 96994 166448 313049
17133 313049 372400 403327 372222 266533 173439 125377 66061 43350 85217 59006 42807
17122 42807 689 25308 68864 80558 42030 -72601 -110255 -53486 330 12725 -45878
17111 -45878 -73802 -49746 -26831 -1151 -6759 4019 5407 11164 34695 58227 65951 12460
17099 12460 -67635 -77135 -160474 -102360 -33069 42172 13018 -53600 -92108 -68552 -22932 -10541
17087 -10541 22033 42760 28323 36197 47611 59595 71587 43702 993 -39593 4372 -801
17075 -801 -15145 36475 82626 84739 95608 43187 -16938 -1181 23424 52372 91897 64877
17063F4877l1731p429K5147k5092n4425L5062J4215J5637j1680n8734j1763J8121
17051b7795N4375M9150l0433o0054r302N2295N6962j3326m7766l2761n4396K3402
17039c9649O6839K3504n1479J7123j5603o7726j0412M7794O9772o613j4145J1453
17027C0858l93m628R1452O8264j1361k2912L0973j2369N035l5373l6928m6920
17015E5698p0001M636Q1282j330R013K5994L9892k9022k615l5728j0371K073K6371
17002I5892M6455K5499k7811k3711k5065m3635l1616k323K5726L1991o6579p2417
16990f7594k5450K993N7038Q7264m929m141O8363R0600k5603r2484k6774J2915
16978G2198m4729N564J8704o3864J2296O1806o672L5907L1407j5934N2943M2937
$$ plain form
17063 64877 33146 25717 50864 25772 -28653 6409 20624 36261 24581 -34153 -45916 -27795
17051 -27795 26580 75730 45297 -14757 -24059 28236 85198 71872 24106 -8655 -63051 -39649
17039 -39649 27190 50694 -785 16338 735 -66991 -77403 -29609 40163 33550 19405 30858
17027 30858 30465 25837 117289 185553 174192 151280 182253 169884 174919 139546 102618 55698
17015 55698 -14303 -9667 71615 70285 79298 105292 145184 116162 113547 77819 67448 69521 95892
17002 95892 142347 167846 140035 116324 91259 47624 16008 13685 39411 71402 4823 -67594
16990 -67594 -93044 -90051 -33013 54251 49322 45181 113544 204144 178541 86057 59283 72198
16978 72198 27469 33033 51737 -12127 169 61975 55303 91210 122617 106683 159626 202563
16966B02563M0327J01568L9767M0345m4144l5089N071q408p5086p2264l1095L3892
16954A97447l05r735j9613j4638L4485M3809K1960N9701J5279N4920N5064K6300
16942D64674K4879J4044p614l8440j04204r0697p5388L8699l3252j06938r792
16931G5971J4021k1446j1355J9144N553K0940j8866n4335m7774K5473j3409n4782
16919f0865L6833j0821K9066L7883K6886q706q6061m3748L1460M9020j6814l385
16907a9252R8549J0980m7016l1370L4667k525l370K9776n1111n0313K064N4701
16895B5780k2773j0919P9217O5335Q030R891p4431j8544J4617m3083J6679m409
16883D5390K3244M1596J2947J8405m8791k6247P1778J2510m2308j8823k334K336
$$ plain form
16966 202563 242890 344458 384225 424570 380426 345337 350408 342000 266914 194650 163555 197447
16954 197447 197142 187407 167794 153156 187641 231450 253410 313111 328390 383310 438374 464674
16942 464674 489553 503597 495983 457543 353339 262642 187254 225953 192701 85763 75971
16931 75971 89992 68546 57191 76335 81888 102828 83962 29627 -18147 7326 -6083 -60865
16919 -60865 -24032 -34853 -5787 32096 58982 50276 -35785 -79533 -48073 947 -15867 -19252
16907 -19252 79297 90277 43261 11891 46558 44033 40663 70439 19328 -30985 -28921 25780
16895 25780 3007 -7912 71305 136640 144670 154561 80130 61586 76203 33120 49799 45390
16883 45390 68634 110230 123177 141582 92791 66544 138322 150832 108524 89701 87367 89703
16871H9703j898K7662o3421m7233L5327l363o8448o5389K85Q7126K3212K551l1310
16858a5196l2754J6653L5594K2096L5709M8500M2967N0400j4583l4253l8529o4170
16846E2434J2888m6028J1939M0617K7293R426j4859m780M441j0167M0553k2860
16834A00897r3381p9074M2618R51k4188N34L7297O9311K8111n615o6703m0250
16822b9492J4115j7228K1164M1359K736K9621K3851K906K7054m4390l2817K839
16810D1718K6408M496M905M331J1052k1359j5359l475J1830l1715K9383k389K066
16797F1892l1961l2710k3628O3458Q76k4995j8380N8697J05486j5958k5709k6003
16785I1065o8113j8886M8217m73o065L8201J9303j6268j0138L3652J0678m5783
$$ plain form
16871 89703 87805 115467 52046 4813 40140 36777 -31671 -97060 -96775 -9649 13563 16114 -15196
16858 -15196 -47950 -31297 4297 26393 62102 110602 153569 203969 189386 155133 116604 52434
16846 52434 65322 19294 31233 71850 99143 108569 93710 88930 93371 83204 123757 100897
16834 100897 7516 -71558 -28940 -27989 -52177 -51643 -14346 54965 83076 77461 10758 -29492
16822 -29492 -15377 -32605 -11441 29918 32654 62275 86126 89032 116086 71696 38879 41718
16810 41718 68126 72622 77527 81858 92910 71551 56192 52717 64547 32832 62215 59826 61892
16797 61892 29931 -2779 -26407 37051 37927 12932 -5448 53249 158735 142777 117068 91065
16785 91065 22952 4066 52283 51810 45745 83946 103249 86981 76843 110495 121173 75390
16773G5390j4965p205k2446N8456J4854J199o057J0292K557l5483l336K7022j033
16760I9245J2116j5169L5382Q587J0489L3648K9238l6796j0826J3751J9402q975
16748A90092k439K067J5333l4936O936Q581o5214n7485l3772k0015l8409J5813
16736a3448Q9926L8262J3435R816m6919L5345L642m7995p723K0763J7976P0411
16724A83491m447k3371k1967k448m3002j8681K2901P4642K6841m989j1164l9771
16712A38035L5333L0075m5655J1083j8492k0823o7518J6827Q093M1511k5085p229
16700I6155N0605N6620l6628m7271K1189j1127n1484K0642M5860P638N1095j976
16688B01318N8168j3131p3524n2176M724Q6489N8297m3623Q798L9753K8789L5972
$$ plain form
16773 75390 60425 53220 30774 89230 104084 105283 99226 109518 112075 76592 73256 100278 99245
16760 99245 111361 96192 131574 140161 150650 184298 213536 176740 165914 179665 199067 190092
16748 190092 187653 189720 205053 170117 177053 185634 120420 62935 29163 9148 -29261 -13448
16736 -13448 76478 114740 128175 137991 91072 126417 130059 82064 74341 95104 113080 183491
16724 183491 179044 155673 133706 131258 88256 69575 92476 167118 193959 188970 177806 138035
16712 138035 173368 203443 157788 168871 150379 129556 62038 78865 86958 128469 103384 96155
16700 96155 146760 203380 166752 119481 140670 129543 78059 98701 144561 152199 203294 201318
16688 201318 259486 246355 172831 120655 125379 211868 270165 226542 235340 275093 303882 339854
16676C39854J227n3894l918K5617L354P3627l732l4469L1318K4914l4561l1664
16664C37673N5481K0635p711K8409j7755l3019J1511N2764J4940J2577J9380J7396
16652E12281O9892K9312O7139P5162J69133L0512L571K3412j5022K1416Q7001
16641A073809J06481R8386J30037J15619R1029k6489N23P9436J46855J37434K73686
16630B226806L47350L43875L61223M32320N44365P62964J156680J891162L182349
16621A1249094N262381P744534R229512R444081N986293k53810m922925p674197
16613C6064963p552239n388047k493977N69766L869851O996535Q569991Q524229
16605D9161072M476589q91773m293606m935379k067609K747076O595268Q387159
$$ plain form
16676 339854 341081 287187 283269 308886 312240 385867 382135 347666 378984 403898 369337 337673
16664 337673 393154 413789 406078 434487 416732 383713 395224 447988 462928 475505 494885 512281
16652 512281 582173 611485 678624 753786 922919 953431 957002 980414 965392 986808 1073809
16641 1073809 1180290 1278676 1408713 1524332 1615361 1588872 1589395 1668831 1815686 1953120 2226806
16630 2226806 2574156 2918031 3279254 3711574 4255939 5018903 6175583 8066745 11249094
16621 11249094 16511475 24256009 33485521 42929602 48915895 48662085 43739160 36064963
16613 36064963 28512724 23124677 20630700 21200466 25070317 32066852 40636843 49161072
16605 49161072 53637661 52745888 48452282 43516903 41449294 44196370 50791638 59178797
16597E9178797N350354j567713o838012r869592r674755p139499l810976q9823
16589B5538781M023887P811252R656390R495999M357054l008458q136982j0841557
16581C8896366j0471531q174760n691717l684288k299169j496022r75444p95270
16573E308165o42089n74811m80061m62594m19969k68101k32040j30755n7008o7713
16563A973024n6500r2643q2647j81230j79197j50135j58120j45739j33108r3351
16553G00354n0283m007O0503K1004K0452J1590l7396r8068n7818j07986j07134
16542C51211J3921k7723N9382j2626q9368m8005L0624l2453n5253P8155J1397
16531B79262l274l3893M5353p100N231L958k3031K8773m9756l1648o3887m0789
$$ plain form
16597 59178797 64529151 62961438 56123426 46253834 36579079 29439580 25628604 25538781
16589 25538781 29562668 37373920 47030310 56526309 60883363 57874905 49737923 38896366
16581 38896366 28424835 20250075 14558358 10874070 8574901 7078879 6103435 5308165
16573 5308165 4666076 4091265 3611204 3148610 2728641 2460540 2228500 2097745 2040737 1973024
16563 1973024 1916524 1823881 1741234 1560004 1380807 1230672 1072552 926813 793705 700354
16553 700354 650071 646064 706567 727571 748023 759613 722217 624149 566331 458345 351211
16542 351211 365132 337409 396791 384165 294797 246792 277416 244963 189710 267865 279262
16531 279262 275988 242095 287448 280348 285579 289537 266506 295279 245523 213875 149988 109199
16519A09199L8498J7089j1252j2752K5630J9424M7559P8513n5639q4597L4735
16508B06407J5466J5298Q3234L9199j31378o0244k3086J6812q166J0662M4282
16497B08486J862M3840K651l1984j5342j3874J1632J9523N7499M2968n5757l8856
16485B32648n9368n2055J7596P183l500Q4971Q7472J7000l4452j7004m2813p933
16473B29745N392N9081L1361l7212m5282N2104O3854J9590l7921K111K2655K4837
16461C90315K9877k6152L3423J8649j4553J8100J06383Q1717J32404Q2330O348
16450H58841R8395J27758J00880O5268J09525P4344O0266O5594Q0533R6081M9943
16439A787428N8881P3870J22220J85024J31613J70513K49062L41130M09159N05441
$$ plain form
16519 109199 147697 164786 153534 140782 166412 185836 233395 311908 256269 171672 206407
16508 206407 221873 237171 320405 359604 228226 167982 144896 161708 153542 164204 208486
16497 208486 210348 254188 256839 224855 209513 195639 207271 226794 284293 327261 271504 232648
16485 232648 173280 121225 138821 146004 142504 227475 314947 331947 297495 280491 237678 229745
16473 229745 235137 294218 325579 288367 243085 295189 359043 378633 340712 342823 365478 390315
16461 390315 420192 394040 427463 446112 431559 449659 556042 637759 770163 852493 858841
16450 858841 957236 1084994 1185874 1251142 1360667 1435011 1495277 1560871 1641404 1737485 1787428
16439 1787428 1846309 1920179 2042399 2227423 2359036 2529549 2778611 3119741 3528900 4034341
16429D034341P16186J041367J507527K184791L393540N213553O733787O578648
16421C1403740O679640R013179J0248609O659708K942533J159956J139015J181233
16413G0427613k281604p046648q024951o787037o722991o844018n699872l631781
16405B3388711j267531J410578L567652M029523M435532O479465P923907M972912
16397E4940749J914313M99123N43974M74341k236318o142584p004014o091733
16389C6897851o030558o315241n752680m528646l277687k319593j675958j191044
16381E806444q35317o34506m28988l42203l40134k76577k54635k75241k19863
16372B198980j91970j39651j44740j30843k02372j46284n3127M7112j16822j85722
$$ plain form
16429 4034341 4750527 5791894 7299421 9484212 12877752 18091305 24825092 31403740
16421 31403740 38083380 47096559 57345168 64004876 66947409 68107365 69246380 70427613
16413 70427613 68146009 61099361 53074410 46287373 39564382 32720364 27020492 23388711
16405 23388711 22121180 23531758 27099410 31128933 35564465 42043930 49967837 54940749
16397 54940749 56855062 57354185 57898159 58372500 56136182 49993598 42989584 36897851
16389 36897851 30867293 24552052 18799372 14270726 10993039 8673446 6997488 5806444
16381 5806444 4971127 4336621 3907633 3565430 3225296 2948719 2694084 2418843 2198980
16372 2198980 2007010 1867359 1722619 1591776 1389404 1243120 1189993 1237105 1120283 934561
16362I34561q8337K0033l4744p5503m3734r5029j08750r4992q1031j12619J0557
16351B30412q014j2538j6442j0387K4827k2611J5676n0506l9252M4160N901k735
16339A58491m9724k75L2395M059k2318p9644l002J4622o4305n9841M2492O9929
16327D2879K7392j6746J2966J633m8134M2186L0153m0085n6864M5316K8784J8750
16315H8230l6690n673l3414J7632J7199j6293j2667L4221k6010J2715L2889k4862
16303D7277n892j0270J3200P4594J4102L1747Q635p9275M008l8034j02924M0163
16291b669M24n8955n304O7393M5550k4878o3415n7825k672O4264K5987r422M6555
16278B5033n13j2641l6608k878K7298k7172J6016O820K1789l6993O8971j7303
$$ plain form
16362 934561 846224 866257 831513 756010 712276 617247 508497 413505 332474 219855 230412
16351 230412 222398 209860 193418 183031 207858 185247 200923 150417 111165 155325 161226 158491
16339 158491 108767 108492 140887 144946 122628 42984 39982 54604 -9701 -69542 -27050 42879
16327 42879 70271 53525 66491 68124 19990 62176 92329 52244 -4620 40696 69480 88230
16315 88230 51540 45867 12453 30085 47284 30991 18324 52545 26535 39250 72139 47277
16303 47277 41385 31115 44315 118909 133011 164758 173393 94118 98126 60092 -42832 -2669
16291 -2669 -2245 -61200 -66504 889 46439 21561 -41854 -99679 -102351 -38087 -12100 -21522 25033
16278 25033 24520 11879 -24729 -27607 -309 -27481 -11465 -4645 17144 -19849 49122 31819
16266C1819o4028l4130m7207k7283M7096K2582k1512M2851Q5169n3479m2596M3585
16254a7133q386l8518r236j4195l9369M3392K7952L2495l2876j5139Q3886O3744
16242G6617M0114p2971j04586j2061N8374K1344K5131k3719N259K6342O070k3249
16230B2665J994l1010l2302k4444K6257K3881j3554l5900K7013K5793J7671j5487
16218g423J2555k1478n3127l6763J7610L3762N4258Q767k7156J5607K8959k6148
16206e77l2255O2307Q1902K7039o3892o8813l440M818K464j5366j5820K295K785
16193a6553O586N6209L7861N1440j4268q059J2996P825j7780J3701L4757m7678
16181A17037m7599M582j0039j00042N929k1643Q452m5673L1125k4899k4914j7001
$$ plain form
16266 31819 -32209 -66339 -113546 -140829 -93733 -71151 -92663 -49812 35357 -18122 -60718 -17133
16254 -17133 -25519 -64037 -73273 -87468 -126837 -83445 -55493 -22998 -55874 -71013 12873 76617
16242 76617 116731 43760 -60826 -72887 -14513 6831 31962 8243 13502 39844 45914 22665
16230 22665 24659 -6351 -38653 -63097 -36840 -12959 -26513 -62413 -35400 -9607 8064 -7423
16218 -7423 5132 -16346 -69473 -106236 -88626 -54864 -606 8161 -18995 -3388 25571 -577
16206 -577 -32832 29475 111377 138416 74524 5711 2271 7089 9553 -5813 -21633 -19338 -16553
16193 -16553 -9967 46242 84103 135543 121275 113216 126212 134037 116257 129958 164715 117037
16181 117037 69438 74020 63981 -36061 -30132 -51775 -43323 -88996 -57871 -82770 -107684 -124685
16169a24685k953N6723P8902l2410m2717L174k7310j7609l5911N9965Q0332m0673
16157d5172j5693l1162n243J2161K3231n81q173m2152J8034J7131L1759j3919
16145e9779m7559J4947n103l8217M6331M4624J9547m1128j8063j4291O8090K6371
16133d230j3210l9116J1423q873k7021J3866P5985l255l7566N642p002n4996r488
16120i7841M2939l0080J1460K1120N6465P5414p58p8818l5736J5173O040L0675
16108A6053k5284n8857M3526K2667l5418j6945m48j6699l7846O6954m3319n3349
16096a38965N4140M1364k1262m1842l5127P324J9096K1539M6471j73r587k3095
16084h0117J0163K7193J7700J5611p634J9998m9088l6855K4158L7168L8300J0984
$$ plain form
16169 -124685 -127638 -70915 7987 -24423 -67140 -63966 -91276 -108885 -144796 -84831 -4499 -45172
16157 -45172 -60865 -92027 -97270 -85109 -61878 -62459 -70632 -112784 -94750 -77619 -45860 -59779
16145 -59779 -107338 -92391 -97494 -135711 -89380 -44756 -25209 -66337 -84400 -98691 -30601 -4230
16133 -4230 -17440 -56556 -45133 -54006 -81027 -67161 8824 5569 -31997 -26355 -33357 -88353 -97841
16120 -97841 -54902 -84982 -73522 -52402 4063 79477 78719 -99 -35835 -20662 -14622 16053
16108 16053 -9231 -68088 -24562 -1895 -37313 -54258 -54706 -71405 -109251 -42297 -85616 -138965
16096 -138965 -84825 -43461 -64723 -106565 -141692 -134368 -115272 -93733 -47262 -47435 -57022 -80117
16084 -80117 -69954 -42761 -25061 -9450 -17084 2914 -46174 -83029 -58871 -21703 16597 27581
16072B7581n5814J4165J9759r371l5312L5810j8974J9841L8562J0941O4302N8240
16060A69730O9217O407p8449r3116l7501N876R3838P9474Q038L6886N0074N1275
16048C61749j227n5780q5840m2457j2081K7359m914P4290J6356p8965p3824j3266
16036A11400K7028k5902P724K4547J780k23P2103l508o1544J0660j1774n6585
16024I5706K8921J5175J227o7570J809M2180K2838l7993o5422p75J847l6039l8551
16011c6647M069J5137J0454k5608n8205m585M2041k2839L0138Q7466l5000m2423
15999c6002O169N973j7236K0002N1493M1807O481k7200L434o1689n2424K036J3240
15986d3916l5070l9247o6845K3795J11737P6438l5314n2167N4484J9105j4159
$$ plain form
16072 27581 -28233 -14068 5691 -3680 -38992 -3182 -22156 -2315 36247 47188 111490 169730
16060 169730 238947 245354 166905 73789 36288 42164 136002 215476 223514 260400 310474 361749
16048 361749 360522 304742 218902 176445 164364 191723 186809 261099 277455 198490 124666 111400
16036 111400 138428 112526 120250 144797 146577 146354 218457 214949 153405 164065 152291 95706
16024 95706 124627 139802 141029 73459 75268 117448 140286 102293 36871 36096 37943 1904 -36647
16011 -36647 -32578 -17441 -6987 -32595 -90800 -95385 -53344 -76183 -46045 41421 6421 -36002
15999 -36002 -29833 -23860 -41096 -21094 30399 72206 78687 51487 54921 -6768 -59192 -57156 -43916
15986 -43916 -78986 -118233 -185078 -161283 -49546 26892 -8422 -60589 -6105 13000 -1159
15975a159n8214r713L9787M0714Q089j2254q034M4658O003l4842L5235r650n3842
15962a3222M18L0053l6773K0571L9629K1278m688l0829k4808k0647p073o1678
15950h7769N557L4235L4759J108M038j8529r952O3665J8715m7944k9558N190O2558
15937C6073j5406o7944J5688M0514N462K5129M1611L7507m9899j6622l438j3613
15925C5062l9089o5442L0808L0297K8110N1904L6105M671p6268l3486J4063N4194
15913G0929L8884M9328Q155l8444o6893m641L0509l20n2886k6035R237Q238Q9405
15900A15466M6491J309n9096k8711m4691m6087j8665q4086l2240O5124J07664
15889B2478J7766m3005J598J5755l7006l334l9047L0285n3432l5733L5478L2805
$$ plain form
15975 -1159 -59373 -69086 -29299 11415 19504 7250 -784 43874 49877 15035 50270 40620 -13222
15962 -13222 -12804 17249 -19524 1047 40676 61954 57266 26437 1629 -19018 -26091 -87769
15950 -87769 -82212 -47977 -13218 -12110 -8072 -26601 -36553 27112 45827 -2117 -31675 -26485 36073
15937 36073 20667 -47277 -31589 8925 14387 39516 81127 118634 68735 52113 48675 35062
15925 35062 -4027 -69469 -38661 -8364 19746 71650 107755 112426 36158 2672 16735 70929
15913 70929 109813 159141 167296 128852 61959 57318 87827 87507 34621 8586 17823 26061 115466
15900 115466 161957 163266 104170 75459 30768 -15319 -33984 -118070 -150310 -85186 22478
15889 22478 40244 -2761 -1163 14592 -22414 -25748 -64795 -34510 -87942 -123675 -88197 -55392
15877e5392Q31K3992j2983L436K8331N0223K1247R1972M5794L4094j0252P7664
15865B98957Q5135q3174m9909j2292N6333q013r7874O137j6530o9168o2834k0472
15853B6296N0616L9882J0857L0777k924J5544l173j7859Q2166N1068p534L4297
15841C10013M395p5731k4547n2326k7156j15880M7567R1095l3509k5718o9409
15830B8794r2669K0586L3085J6648N049m4900M7728j498l9826N5926J3967n7090
15818a4200L850K9541j6078L2566j9968o463M972j3629j8054L6595L537J7136
15806C9805k8245j3861m8315m3497j0358J4891P5511M0836J8174j0301J3767l1654
15794A6753p1197m3763l6198M2215O1839p7628n2384J8578P7453L6862L1833M1965
$$ plain form
15877 -55392 -54561 -30569 -43552 -40116 -11785 38438 59685 151657 197451 231545 221293 298957
15865 298957 384092 300918 251009 238717 295050 287037 189163 195300 178770 109602 46768 26296
15853 26296 76912 116794 127651 158428 155504 171048 167875 150016 232182 283250 275716 310013
15841 310013 314408 238677 214130 161804 134648 18768 66335 157430 123921 98203 28794
15830 28794 -63875 -43289 -10204 6444 11493 -33407 14321 12823 -27003 28923 42890 -14200
15818 -14200 -10350 19191 3113 35679 15711 9248 14220 591 -17463 19132 22669 39805
15806 39805 11560 -2301 -50616 -94113 -104471 -89580 -14069 26767 44941 34640 48407 16753
15794 16753 -54444 -98207 -134405 -92190 -30351 -107979 -160363 -141785 -64332 -27470 4363 46328
15782D6328J0363n1197l3563L6016J9955r259K98j3520Q280m7495l7620M70J3714
15769e7230j0485j8591k409p315Q4416K8143m5905m338J7254j9293j891J0989
15757b6655R632P290m0827l1607L2399J03138j6850j5114m1401m7802L6727K7913
15745c157o107n3419O0535P8886n8490l5686J0555p96j1878N9122M3756m4229
15733C9092j1211o7120n1234N1760M1745R671L5859J7595o5830R744K1665o9128
15721c7392K7654M3799n4119r258o684k8845j6908R0115M7882K1007p3425m5002
15709d1176O193j078K596N8508L6446j1520N0463n7663o1899j7548J0522j8505
15697d4661K1670k7120k4394L5596l0883j2318J05124j703J2438K3747k0255m450
$$ plain form
15782 46328 56691 5494 -28069 7947 27902 18643 18941 5421 13701 -33794 -71414 -70944 -57230
15769 -57230 -67715 -86306 -88715 -96030 -11614 16529 -29376 -33714 -16460 -35753 -37644 -26655
15757 -26655 -17023 -9733 -50560 -82167 -49768 53370 36520 21406 -19995 -67797 -31070 -3157
15745 -3157 -9264 -62683 -2148 76738 18248 -17438 -6883 -7679 -19557 39565 83321 39092
15733 39092 27881 -39239 -90473 -38713 3032 12703 48562 66157 327 10071 31736 -37392
15721 -37392 -9738 34061 -20058 -29316 -36000 -64845 -81753 8362 56244 77251 3826 -41176
15709 -41176 -34983 -36061 -33465 25043 61489 49969 100432 42769 -19130 -36678 -26156 -44661
15697 -44661 -22991 -50111 -74505 -38909 -69792 -82110 23014 21311 33749 57496 37241 32791
15685C2791k6271p6841l4163K7305L3920L101Q315K6476k4123m5411K2062Q960
15673d3879K1009K7973j727l0876j8622n4800L7853O474j9962j01K9090M8786
15661A218L3848k9754o0131J721J0917K0399P5722m3742n4443j1891K5276M7757
15649A6897j0941k4219o594p826k2780J801J2713l344l9406J5876j7001o8615
15637a53439O977N7948K9904Q951K6851L6538l4202k0047l0636K7603N4970N4079
15625F5497L1952n5829m9336J9454Q562J493J0052N2830m474m1961k2132K325
15613A8433J5238P78j1989k0176p9407M4308J6939n8598l2604m3855L9179M2262
15601f9492N9466j5676M5562L2787m9425n8939M5770O5893m5125l0498K9550J9654
$$ plain form
15685 32791 6520 -70321 -104484 -77179 -43259 -40158 -31843 -5367 -29490 -74901 -52839 -43879
15673 -43879 -22870 5103 3376 -27500 -46122 -100922 -63069 -56595 -76557 -76658 -47568 1218
15661 1218 35066 5312 -54819 -53098 -42181 -21782 53940 10198 -44245 -56136 -30860 16897
15649 16897 5956 -18263 -24857 -32683 -55463 -53662 -40949 -44293 -83699 -67823 -84824 -153439
15637 -153439 -146462 -88514 -58610 -49659 -22808 13730 -20472 -40519 -71155 -43552 11418 65497
15625 65497 97449 41620 -7716 11738 20300 21793 31845 84675 80201 38240 16108 18433
15613 18433 33671 34449 22460 2284 -77123 -32815 -15876 -74474 -107078 -150933 -111754 -69492
15601 -69492 -10026 -25702 19860 52647 3222 -55717 -9947 55946 10821 -19677 9873 29527
15589B9527q700q1599J136L5708o0267p321R0259L5078r84j3815k5626J1846k1909
15576a6667k5581j966P433K5362J2310m3961o7426j8040K0357O047J1428m3019
15564a33723K5071L9989L5630M3259n228l5660j5664N2941k741L030m208l578
15552h82Q467p2299m5022L2207N6555k0035l9344J3600K7172k1001k6705q7569
15540a74856K278L6959K5774O3565q315m9067o7252L1656N9348P0053L1031n5006
15528c3832l2194n343j4808J7267K1096K3699n6240O1108N4499O955L5847K4260
15516A02314l7257l4676O612q788l1945l4566K0129M341K6828l679n4137m9782
15504i4606k255L1020K6080K6089N4970j8541k2306o706j5881o174q380l0651
$$ plain form
15589 29527 20827 -60772 -59636 -23928 -84195 -91516 -1257 33821 32837 19022 -6604 5242 -16667
15576 -16667 -42248 -44214 -36781 -11419 891 -43070 -110496 -128536 -108179 -102132 -90704 -133723
15564 -133723 -108652 -68663 -33033 10226 4998 -30662 -46326 6615 3874 6904 2696 -882
15552 -882 7585 -64714 -109736 -77529 -20974 -41009 -80353 -66753 -39581 -60582 -87287 -174856
15540 -174856 -172578 -135619 -109845 -46280 -54595 -103662 -170914 -139258 -79910 -9857 21174 -33832
15528 -33832 -66026 -71369 -86177 -68910 -47814 -24115 -80355 -19247 35252 42207 78054 102314
15516 102314 65057 30381 36993 28205 -3740 -38306 -18177 -13836 12992 9313 -44824 -94606
15504 -94606 -96861 -65841 -39761 -13672 41298 22757 451 -6255 -22136 -28310 -36690 -67341
15492f7341J9950K8521j1344K355K8496L7378j6466K0069K0120K5401M4821l0012
15480A01948l2210j1412K207q310n9863o4079k1201P897L8219j089n1982L927
15468i5948j2058R953P0824n7534o9853R063P8590O0722k5296j00039P496L5214
15456h8866M6838P4651L2691r989m5121j5263L1148l0517k2364k3449k5268P9720
15444D211J9300j6426J276K183o736P44j0913n8605J9375J8069j2512l7816k0007
15431i7857j5632j6463P8725N0726r319r509o6482k9724J7933M6183K2826K7753
15419h40Q8524K8893j34994n5825Q4164l145q74l0836K2278P1330l9645L7799
15407F6829l983R279l0728l1946j8283J2605o371m1061J5194j133K2182k2544
$$ plain form
15492 -67341 -47391 -18870 -30214 -27859 637 38015 21549 41618 61738 87139 131960 101948
15480 101948 69738 58326 60533 52223 -7640 -71719 -92920 -85023 -46804 -47893 -99875 -95948
15468 -95948 -108006 -98053 -27229 -84763 -154616 -145553 -66963 -6241 -31537 -131576 -124080 -88866
15456 -88866 -42028 32623 65314 55325 10204 -5059 26089 -4428 -26792 -50241 -75509 4211
15444 4211 23511 7085 8361 10544 3808 4552 -6361 -64966 -45591 -27522 -40034 -77850 -97857
15431 -97857 -113489 -129952 -51227 -501 -9820 -19329 -85811 -115535 -97602 -51419 -28593 -840
15419 -840 87684 116577 -18417 -74242 9922 6777 5903 -24933 -2655 68675 29030 66829
15407 66829 62846 72125 41397 9451 -8832 3773 -2598 -43659 -28465 -29598 -7416 -29960
15395b9960k0902j9841k6969j8734M0481j4881l545K3098k8313o6756L6070O2379
15383f7873K4946M755K1909o0394j1756K2834N1703Q2213k0181Q375r979n3737
15371g185j2377K0148K5273R868k2835m3775k6201k1491K6429N3531L8413K8609
15359F8407j8700q0721n1035j4440P1380J6530m104q503K04m6865K6616R0362
15347D9131j9501o1842q30J7377k6605j8460m9277j266K368q891k8143J6857O5342
15334f3740N4550J0253J4006n5318j8492K9782J4841P598L0498j7431n0304n2819
15322i6576o0K2459N5984K8702o3332l1596M4765N537n811o5306j0421N0261J5440
15309d9954k3782J0621j4294k766K3920J2826k4551j6464j4049N2367O1123j9036
$$ plain form
15395 -29960 -50862 -70703 -97672 -116406 -75925 -90806 -94351 -71253 -99566 -166322 -130252 -67873
15383 -67873 -42927 -38172 -16263 -76657 -88413 -65579 -13876 68337 48156 56531 46552 -7185
15371 -7185 -19562 586 25859 35727 12892 -30883 -57084 -78575 -52146 1385 39798 68407
15359 68407 49707 -31014 -82049 -96489 -25109 -8579 -12683 -21186 -20982 -67847 -41231 49131
15347 49131 29630 -32212 -33042 -15665 -42270 -60730 -110007 -111273 -108905 -117796 -145939 -129082 -63740
15334 -63740 -9190 1063 15069 -40249 -58741 -28959 -14118 -6520 23978 6547 -43757 -96576
15322 -96576 -96636 -74177 -18193 10509 -52823 -84419 -39654 -34117 -39928 -105234 -115655 -65394 -49954
15309 -49954 -73736 -63115 -77409 -80175 -56255 -43429 -67980 -84444 -98493 -46126 14997 -4039
15297d039m3631k4776N5996L9970P564n2712l6770n0622K8936M9618O878O1162
15285C7574m339O984L9780r6633o8468J1860M0427L4614k947r218L186K2724k8549
15272a3005n6317l8550N395K2295J3648M561j8920L3252K0523p798l4586j717
15260g1219l6463J7203K3616j9860P68M2470J7521j5496L1167j2855l4549K2472
15248c5225j9647K8109L7284m4984j9165l3127l2125M3671J6179J3274J6665J5188
15236a3903M4484j0664j6044l9350P091K2157p505J531l5238m1467M2107Q7055
15224D0254N2997q1744p3241K9132M9939L8943j7618m6950m9967q528k1336j0435
15212i8554m0739m059N5374J05532M8757L4010k3949o0785q0383K9568P1976J1928
$$ plain form
15297 -4039 -47670 -72446 -16450 23520 31084 -21628 -58398 -109020 -80084 -30466 -23588 37574
15285 37574 33235 40219 79999 -16634 -85102 -73242 -32815 1799 -1148 -10366 -7180 15544 -13005
15272 -13005 -69322 -107872 -102477 -80182 -66534 -61973 -80893 -47641 -27118 -34916 -69502 -71219
15260 -71219 -107682 -90479 -66863 -86723 -85955 -43485 -25964 -41460 -10293 -23148 -57697 -35225
15248 -35225 -54872 -26763 10521 -34463 -53628 -86755 -118880 -75209 -59030 -45756 -29091 -13903
15236 -13903 30581 19917 3873 -35477 -28386 -6229 -13734 -12203 -47441 -88908 -46801 40254
15224 40254 93251 11507 -61734 -32602 17337 56280 38662 -8288 -58255 -66783 -88119 -98554
15212 -98554 -139293 -143352 -87978 17554 66311 100321 76372 15587 -64796 -35228 36748 48676
15200D8676k841o3123l2151j799M7139K6525o6295j3847m8222J5138O9041L089
15188a8670l9964k0947K5298L206P447M4857K4819J2265o0785m2911K3625L4919
15176f841J6155l6120m0545n0557l9684K9105L7295J8064R343L0785M645k4657
15164e3012K4926K0350m4739K4086M8304J7811L1506K9051p488m7306k5091L4519
15152E2917N1384j9534Q481k1936r5322m1238j664L235K6777J7091n3588j0011
15140h3408M3772N71J2647K3054q8129m3j2616L6097j1469N531J9943K8495m1135
15127f6690M9615m8238n7686J1744k4246M7022p636K5337j6710N2567N4197k9594
15115a0318j223K8745J4342j73n2783k0172k7083m4724L3711O3929m4151J9997
$$ plain form
15200 48676 45835 -17288 -49439 -51238 -4099 22426 -43869 -57716 -105938 -90800 -21759 -18670
15188 -18670 -58634 -79581 -54283 -51077 -43630 1227 26046 38311 -22474 -65385 -41760 -6841
15176 -6841 9314 -26806 -67351 -117908 -157592 -128487 -91192 -73128 -63785 -33000 -28355 -53012
15164 -53012 -28086 -7736 -52475 -28389 19915 37726 69232 98283 90795 43489 18398 52917
15152 52917 104301 84767 93248 71312 -24010 -65248 -66912 -63677 -36900 -19809 -73397 -83408
15140 -83408 -39636 -39065 -26418 -3364 -91493 -91536 -104152 -68055 -79524 -73993 -54050 -25555 -66690
15127 -66690 -17075 -65313 -122999 -111255 -135501 -88479 -96115 -70778 -87488 -34921 19276 -10318
15115 -10318 -11541 17204 31546 31373 -21410 -41582 -68665 -113389 -79678 -15749 -59900 -39903
15103c9903J4939k5533K9726J6085K2391J8815o659p3321j7724n5237n800P2590
15091d9631K4477l4343k2581J176L2629J9197K6531j2474m6512p052L246l9960
15079a05297n8945L0269N2919k5112J393L8864k4317J1258L4221N8719K1708k2209
15067A3471l9660q836j0690j7974K0365K2585J712k0481K4587L2137M4994m9020
15055A3190n033J2446k1490q376M843N5613K8378k5603n9437m4126l4005p867
15043i1467J600L4829M8734p893j8478O0297l5495k5188j6817M0136K1832J6300
15031B8390n2265m3587L195m685r677n7229j510Q5626L1966M8008k218r3345J457
15018f5874J3133N998j5075l1030l527N444J0698O8380N3623o546j135K4087j4125
$$ plain form
15103 -39903 -24964 -50497 -20771 -4686 17705 36520 29861 -43460 -61184 -116421 -122221 -49631
15091 -49631 -25154 -59497 -82078 -80902 -48273 -29076 -2545 -15019 -61531 -68583 -65337 -105297
15079 -105297 -164242 -133973 -81054 -106166 -104773 -65909 -90226 -78968 -44747 13972 35680 13471
15067 13471 -26189 -35025 -45715 -63689 -43324 -20739 -19027 -39508 -14921 17216 62210 13190
15055 13190 8157 20603 -887 -9263 -4420 51193 79571 53968 -5469 -49595 -83600 -91467
15043 -91467 -89867 -55038 -6304 -14197 -32675 27622 -7873 -33061 -49878 -9742 12090 28390
15031 28390 -23875 -67462 -64267 -68952 -78629 -135858 -137368 -51742 -19776 28232 26014 -67331 -65874
15018 -65874 -52741 -46743 -61818 -92848 -96375 -90931 -80233 -11853 41770 35224 34089 58176 44051
15005D4051K1405J727K5252J2844K7388o6454k1883O6876J7004K244j4814j3793
14993A01847k2251r5922m3171j4312j0228K743r236J73K7591P9193L7371l4026
14981A9772p639j7162o6480j4800j7044R948M9303J8006j0480M217M2038L3178
14969D2857l3272n014K5540N5077l1882k8562O2407k0105j00886j10217L0770
14958a13287J35978N4700k6543k6840J9437p815k3694N499J2798M676k0339l376
14946A1194M1477M6743j4912r9892p4532k020N1305K0680N15k9067K527P649J7097
14933b1236o689J7340K7528l5059j7200k2056Q698K0767j8758L3647J3811k7738
14921b6945J8586m955j8731N6855J9575R973l8121n1266j0078R293n109n1759
$$ plain form
15005 44051 65456 67183 92435 105279 132667 66213 44330 111206 128210 130454 115640 101847
14993 101847 79596 -16326 -59497 -73809 -84037 -81294 -90530 -90357 -62766 16427 53798 19772
14981 19772 12133 -5029 -71509 -86309 -103353 -93405 -44102 -26096 -36576 -32359 9679 42857
14969 42857 9585 4571 30111 85188 53306 24744 87151 67046 -33840 -144057 -113287
14958 -113287 22691 77391 50848 24008 43445 35630 11936 17435 30233 34909 14570 11194
14946 11194 52671 99414 84502 -15390 -89922 -91942 -40637 -19957 -19442 -48509 -45982 -38333 -21236
14933 -21236 -27925 -10585 16943 -18116 -35316 -57372 -48674 -27907 -46665 -13018 793 -26945
14921 -26945 -8359 -13314 -32045 24810 44385 54358 16237 -35029 -45107 -35814 -40923 -92682
14909i2682J6479N0640m575L6954J368r247j6680j4912j107M42L3865m2898l7448
14896g9801R389J415O5385N0049q64n1250N028R564Q796j088m3906L3176k4259
14883a8366o3964J7476J0915M5146l4542j0812l075k1076L367r342j2526j4434
14871a11233j5956K682M3789O5475q438N2717p1081k3910j4785q625m8879O484
14859a31760J6688M6514m1289M2041N1057Q3908l5273o254J5007L6876M971m7271
14847C5215l8878P350J4550O9469j2230p3917o4784k2104l3203l8597O2490M0672
14835e3967j7210j0761M5573L7302j8813J7240N8726m6680N2850p405o1266k0849
14823b5260L1809n367L964L3872O045m4906n8444k2580O993J37M541K5206N2784
$$ plain form
14909 -92682 -76203 -25563 -30138 6816 8184 -1063 -17743 -32655 -33762 -33320 545 -42353 -79801
14896 -79801 -70412 -68997 -3612 46437 45573 -5677 -649 8915 17711 16623 -27283 5893 -18366
14883 -18366 -82330 -64854 -53939 -8793 -43335 -54147 -57222 -78298 -74931 -84273 -96799 -111233
14871 -111233 -127189 -124507 -80718 -15243 -23681 29036 -42045 -65955 -80740 -89365 -138244 -131760
14859 -131760 -115072 -68558 -109847 -67806 -16749 67159 31886 25632 40639 77515 82486 35215
14847 35215 -3663 3687 18237 87706 75476 1559 -63225 -85329 -118532 -157129 -94639 -53967
14835 -53967 -71177 -81938 -36365 937 -17876 -636 58090 11410 64260 56855 -4411 -25260
14823 -25260 6549 1182 5146 39018 45063 157 -58287 -80867 -73874 -73737 -69196 -43990 8794
14810H794j0989m5936K6335P9287n2772l6635K3705M2446K0072o00l2425k9350
14798h068j9272m4813O724N0996K1086k9788m1595k67J7205L8246M0639j4363
14786A6730j1530l689m0423n7825p498r256P7667P5480Q715L320j7288p808J6653
14773D3248o0591K0804Q1341m6038r1819m5698k5152N2701J5423R5524O74k3843
14761A6574J1757o679m8676K2452N1467K111J3849o9220n7678K5469j6480r79
14749e6033J2636j334M5723J9719K8121k3248j7324J9372J6963k7853k0120J4302
14737A0924J7394l7392K2149n1404j7173J959o499K2245J1279j4470L018k5024
14725f2994R445p954j302l6993N3921K5189N0422R440m9025J573j9970J9208M6173
$$ plain form
14810 8794 -2195 -48131 -21796 57491 4719 -31916 -8211 34235 54307 53707 21282 -8068
14798 -8068 -27340 -72153 -65429 -14433 6653 -23135 -64730 -64997 -47792 -9546 31093 16730
14786 16730 5200 1511 -38912 -96737 -104235 -113491 -35824 39656 48371 51691 34403 26595 43248
14773 43248 -17343 3461 84802 38764 -53055 -98753 -123905 -71204 -55781 39743 40417 16574
14761 16574 28331 21652 -27024 -4572 46895 49006 62855 -6365 -64043 -38574 -55054 -56033
14749 -56033 -43397 -44731 992 20711 48832 25584 8260 27632 44595 16742 -3378 10924
14737 10924 28318 -9074 13075 -38329 -55502 -53543 -60042 -37797 -26518 -40988 -37970 -62994
14725 -62994 -53549 -61503 -62805 -99798 -45877 -20688 29734 39174 -9851 -8278 -28248 -9040 37133
14712C7133N344l9995J0385L3269q20J7184n7250n1484m0479O1854k4895L480
14700d6274J6394r3149j892R0279K5933j2347N578N254J2626Q967j9039M2752
14688C5082J1198m4041J1184k5979M2914M0550l2424j4423l8293p5929N787L3440
14676e0934K1118M3074o3384m0821n6083j2346N5791J2420k5925n7185O4540O3119
14664d6616J5194l5628J1422J9715J4060K1684R15k2488k6322j5181K8532J2575
14652b2138k0271m326l5878K2729N9746n409l6445q6597K078P8296L0639k352
14640a9928j7403m3375L5150M9674Q248l0992j681j1844L6362K0310l3236m4189
14628e2904j2769l9442M527O2895N6578p738J2829o744m7330J2390K8292K7667
$$ plain form
14712 37133 42477 2482 12867 46136 45316 62500 5250 -46234 -86713 -24859 -49754 -46274
14700 -46274 -29880 -123029 -124921 -34642 -8709 -21056 -15478 -10224 2402 11369 -7670 35082
14688 35082 46280 2239 13423 -12556 30358 70908 38484 24061 -14232 -90161 -84374 -50934
14676 -50934 -29816 13258 -50126 -90947 -147030 -159376 -103585 -91165 -117090 -174275 -109735 -46616
14664 -46616 -31422 -67050 -55628 -35913 -21853 -169 746 -21742 -48064 -63245 -34713 -22138
14652 -22138 -42409 -46735 -82613 -59884 -138 -5547 -41992 -128589 -126511 -48215 -17576 -19928
14640 -19928 -37331 -80706 -45556 4118 12366 -18626 -20307 -32151 4211 24521 -8715 -52904
14628 -52904 -65673 -105115 -100588 -37693 18885 11147 23976 17232 -30098 -17708 10584 38251
14616C8251l1558k839K9116m1192o3136l7273M0528q948J2786O543p6540k9788
14604a64050K6864j3739K1982J8262L4325J9305J3010k7057k673M9024J0495k9097
14592d3349K1111k3749j9102M775M9187J09540Q861p3027o2892l3132l1984j8252
14580a12013O3009M359N0108N2912j6571Q215J4522L9412l1479l2537K3248l8882
14568B4303p376L110O2454J4938j9741j608N1975N82o7403l6514j961J7206N6824
14555I6789R074K6002M8537J09308J16099J28535J57069O9548O9249m5084o0756
14544G24370q9975j20195j15691l0568l9802k0800L198o2926m3734p036j9676
14533A77165l1110j06027j00724N817J8351K0453M8411m8612Q3258J5016k6661
$$ plain form
14616 38251 6693 3854 32970 -8222 -71358 -108631 -68103 -77051 -64265 -57722 -134262 -164050
14604 -164050 -137186 -150925 -128943 -110681 -76356 -57051 -44041 -71098 -73771 -24747 -14252 -43349
14592 -43349 -22238 -45987 -65089 -60314 -11127 98413 107274 34247 -28645 -61777 -93761 -112013
14580 -112013 -49004 -44645 5463 58375 41804 50019 64541 103953 72474 39937 63185 24303
14568 24303 16927 20037 82491 97429 77688 76080 128055 128637 61234 24720 22759 39965 96789
14555 96789 105863 131865 180402 289710 405809 534344 691413 760961 830210 785126 724370
14544 724370 634395 514200 398509 367941 328139 307339 310537 247611 203877 196841 177165
14533 177165 146055 40028 -60696 -54879 -36528 -16075 32336 -16276 66982 81998 55337
14522E5337m1900J1916l3788p0727K752J3724O9403K590j5566N8681P4302k5089
14510A01635J2199o456p8975Q878j1203j7012K1944j4694n5512J577J7738J1718
14498h163m65L9391K4504m5509J3377n746o5653J3525L5504J0903l692m634L5696
14485C9038K3013r0945l6745r343Q385J2958M8140K5659N795N305p651j8640j7243
14472a2274n623n657j8419K1363M7399L6387o0636l7161Q0963M1228K6123p564
14460A06129n109p086l6126k1309j3552J4100j6959j1625K3991L220k8646R116
14448A6144L8797k7788m2475k5224n956O981J3587k6386J3807L5532P7729p351
14436F7397m3978o7399p598L8218K5159J0404l5764N495m0127L0561R3568O037
$$ plain form
14522 55337 13437 25353 -8435 -79162 -76410 -62686 6717 9307 -6259 52422 126724 101635
14510 101635 113834 107378 28403 37281 26078 9066 31010 16316 -39196 -37619 -19881 -8163
14498 -8163 -8628 30763 55267 9758 23135 17389 -48264 -34739 765 11668 7976 3342 39038
14485 39038 62051 -28894 -65639 -74982 -66597 -53639 -5499 20160 25955 31260 23609 4969 -12274
14472 -12274 -17897 -23554 -41973 -20610 26789 63176 2540 -34621 46342 87570 113693 106129
14460 106129 101020 93934 57808 36499 22947 37047 20088 8463 32454 35674 7028 16144
14448 16144 54941 27153 -15322 -40546 -46502 -39521 -25934 -52320 -38513 -2981 74748 67397
14436 67397 23419 -43980 -51578 -13360 11799 22203 -13561 -8066 -48193 -17632 75936 81973
14424H1973j2952o3659n8271R544N0074j5245M5182L6351p653p4529P337K4916
14412B3068o8078l3474l658K4131L1911Q7278P3584q6864p5257j3624N1695M5863
14400E6575l6708J8538o040j1803m5030k1151Q596K0455k2277j951N3594K6799
14388C9597n4984r5789K5513M714J1235j1037M254N3022L610j813j5261k8238
14376f5177L0997N2831l2679K0763N0560l4809n9803J3974L3057j4557m57j8286
14364b3586j9828m2734R666M4589l3719k9914N2570K2499K090r82J6008m1001
14352d4342l426K1017k1867n0231J3797J452l5389N5927K884O736L154K2906L4199
14339F817r709M6087n5887m3983l390J2428J808k3509L6382p538L6654J5169k3234
$$ plain form
14424 81973 69021 5362 -52909 -43365 6709 -8536 36646 72997 65344 -9185 -1848 23068
14412 23068 -45010 -78484 -82142 -58011 -26100 61178 134762 47898 -27359 -40983 10712 56575
14400 56575 19867 38405 32365 20562 -24468 -45619 -37023 -16568 -38845 -40796 12798 39597
14388 39597 -15387 -111176 -85663 -80949 -69714 -80751 -76497 -23475 -19865 -21678 -36939 -65177
14376 -65177 -34180 18651 -14028 6735 57295 22486 -37317 -23343 9714 -4843 -5300 -23586
14364 -23586 -43414 -86148 -76482 -31893 -65612 -95526 -42956 -20457 -18367 -19349 -3341 -44342
14352 -44342 -47768 -26751 -48618 -98849 -85052 -83600 -118989 -63062 -60178 -53442 -50288 -27382 6817
14339 6817 -2892 43195 -12692 -56675 -60065 -47637 -45829 -69338 -32956 -40494 -3840 11329 -11905
14326a1905N3318P0793k3305l9278l7242k8549j3673k4329Q085M0382L465q602
14314a0840o922N961j218j7625L0979l3373j471L954l3642k5954m112J0106K6497
14301e7660O9704J0514l9843P53j9638J1184l7063L7906J2239m3274k324K1249
14289c6253m0954K8004P353O215J6485J5092M1436J9260k4845K8864M0422n0380
14277E0699j22003R214K9813O8056K3430l1926m6745L6526l9200k2553l2528J1336
14265f5881N5454Q498n0694K3251L8202n0791k5095R489l2193J043Q683p115N3776
14252c3373O0522l6966l7121j2150m9999n5835o2604N6979N8685K5760N7290O1927
14240C3115K0562q272j6604P824K9242l5734n3077M3714k3805J0773M319k1422
$$ plain form
14326 -11905 41413 112206 88901 49623 12381 -16168 -29841 -54170 -46085 -5703 -2238 -10840
14314 -10840 -17762 -11801 -13019 -30644 335 -33038 -34509 -30555 -64197 -90151 -94263 -84157 -57660
14301 -57660 12044 22558 -17285 -16532 -36170 -24986 -62049 -24143 -11904 -55178 -57502 -36253
14289 -36253 -77207 -49203 -41850 -35635 -19150 -4058 37378 56638 31793 60657 101079 50699
14277 50699 -71304 -62090 -32277 35779 59209 27283 -19462 17064 -22136 -44689 -77217 -65881
14265 -65881 -10427 -1929 -52623 -29372 8830 -41961 -67056 -57567 -89760 -88717 -80034 -87149 -33373
14252 -33373 27149 -9817 -46938 -59088 -109087 -164922 -227526 -170547 -111862 -86102 -28812 33115
14240 33115 53677 45405 28801 36625 65867 30133 -22944 20770 -3035 7738 12057 -9365
14228i365k8320O5942K3582l5500m3055J0527j8468j6479P185Q751N223K3239
14216f738p4886J0263K9064K1263K1668K4142m024l1413r494n5176J2144N9418
14204c769K5716k7763o5072J4103N3152j9933q0754k7467N5572L8775n879k045
14192d5364L8104M2394m3559l0991j5734k1727M0340K6284p497R249j2007J4349
14180f159N484j1745o0041j0344M8304M7555K1629Q189L9075l5997m5071K8248
14168B9127J6762l6682N2763m514j4677l532J1022m7105J8784K6274o2606l1012
14156d5396j4743k7802N7942K5030J0686j8800o2614o273Q2017N113l920m545
14144c305J5876K7214J9397k6681n0495q512J512j9718j3965j6778L8558N8258
$$ plain form
14228 -9365 -37685 28257 51839 16339 -26716 -16189 -34657 -51136 -43951 -35200 -29977 -6738
14216 -6738 -81624 -71361 -42297 -21034 634 24776 20752 -10661 -20155 -75331 -63187 -3769
14204 -3769 21947 -5816 -70888 -56785 -3633 -23566 -104320 -131787 -76215 -37440 -43319 -45364
14192 -45364 -7260 35134 -8425 -39416 -55150 -76877 -36537 -10253 -17750 -8501 -20508 -6159
14180 -6159 -675 -12420 -72461 -82805 -34501 13054 34683 42872 81947 45950 879 29127
14168 29127 45889 9207 61970 57456 42779 39247 50269 3164 21948 48222 -14384 -45396
14156 -45396 -60139 -87941 -29999 -4969 5717 -13083 -75697 -81970 47 5160 1240 -3305
14144 -3305 12571 39785 59182 32501 -17994 -26506 -24994 -44712 -58677 -75455 -36897 21361
14132B1361K0951l6149m168q954K4743M090k474M8733k226m2177k1342l5116j1322
14119d4050j044P7931Q0152j2164K174J6095J0994k8589l8573o0195o380l356
14107g005k1835K0233O080L1464r18n0612p4975j483M0819l6810p303N9629L6815
14094e901L8496M2168J1132L802m0338k7100l5228J6763j6224j2392k5361L1720
14082a8463J6397n590K7179J1265j5782O456p0761r5185R455M1445M2018K8211
14070b3355k4041L3744O7224O459l4872j3803j6248L9085K5771l2492j9076n4148
14058d5752J5183M9237J9317k1280K07j6468L4198r554l1445o661J9384j7442
14046a1076j2235J8447M395l2851P886J8917J1150K963q6942o8831k5736O1333
$$ plain form
14132 21361 42312 6163 1995 -6959 17784 21874 19400 68133 65907 23730 2388 -32728 -44050
14119 -44050 -45094 32837 112989 100825 102999 119094 130088 101499 62926 2731 -3649 -7005
14107 -7005 -28840 -8607 -2527 28937 28019 -22593 -97568 -99051 -58232 -95042 -102345 -42716 -5901
14094 -5901 32595 74763 85895 89697 49359 22259 -12969 3794 -12430 -24822 -50183 -18463
14082 -18463 -2066 -7656 19523 30788 15006 21462 -49299 -144484 -135029 -93584 -51566 -23355
14070 -23355 -47396 -13652 53572 60031 25159 11356 -4892 34193 59964 27472 8396 -45752
14058 -45752 -30569 18668 37985 16705 16912 444 34642 25088 -6357 -13018 6366 -11076
14046 -11076 -23311 -4864 -469 -33320 -25434 -6517 4633 7596 -79346 -148177 -173913 -112580
14034a12580N2866K9875l2267j3942K3301Q8645Q8051k7642p4572q4884J2466
14023e0683o424j2495j3689J5118L5862P1715L548l1047L1093l764J2189j4099
14011C7324j3011k1674J1454J8923k0511j6375p898o980J114K339K897M0151n760
13998B1993R509j6473n019K0040J1314L3210M4006L6178q6238l2965J5153j0478
13986D0230k3999m8863O1277l0884J3165l1794k1737j7288l5109K8566J0543K6616
13974b9277K8725n977J0927R0379N1436l6670r5669m6015J209o5664n1508J0526
13962a37578R3641M3686M40N499N3426J6248o4649j0120k7501J7259Q3811o3773
13950A0389n4873j7092J1352M6052o24k4763p5461j5058K0563j8845N3859N2752
$$ plain form
14034 -112580 -59714 -29839 -62106 -76048 -52747 35898 123949 96307 21735 -63149 -50683
14023 -50683 -57107 -69602 -83291 -68173 -32311 39404 42952 11905 42998 39234 51423 37324
14011 37324 24313 2639 14093 33016 12505 -3870 -11768 -18748 -17634 -15295 -12398 27753 21993
13998 21993 31502 15029 10010 30050 41364 74574 118580 154758 68520 35555 50708 40230
13986 40230 16231 -32632 28645 -2239 10926 -20868 -42605 -59893 -95002 -66436 -55893 -29277
13974 -29277 -552 -6529 4398 94777 146213 109543 13874 -32141 -30932 -96596 -148104 -137578
13962 -137578 -43937 -251 189 5688 59114 75362 10713 593 -26908 -9649 74162 10389
13950 10389 -44484 -61576 -50224 -4172 -4796 -29559 -105020 -120078 -99515 -118360 -64501 -11749
13938a1749R3942k3225k7616k3574K6804J099P52j7692p0384m4436L0862n3780
13926a18997J2699O5273J5335m4500o289j2108j4209K3052J20219N7935n1331
13915D7079n4761q2283K3945O2260k043k1787k5346J8636k782O680M5262M6047
13903F0907M751K9356k8264m2839R218k5951k290k4750q214j4296k4056L521J5391
13890d7516j3614J9048l0409o525m1072J3629n936j6533j3045J638N7238j7937
13878a01034o0646M6432J2704M0196K9000R010l6176l3777K6651J9662k3207N3142
13866a8043L2102j2795o1718l7776j323M357J503L8324q348N583o4963n3298N5582
13853a20813P1756L1009J5526J4844j4162r445k3026J5215J1876m986N034L1377
$$ plain form
13938 -11749 82193 58968 31352 7778 34582 35681 36433 18741 -51643 -96079 -65217 -118997
13926 -118997 -106298 -41025 -25690 -70190 -76479 -88587 -102796 -79744 40475 98410 47079
13915 47079 -7682 -89965 -66020 -3760 -5803 -27590 -52936 -34300 -37082 -30402 14860 60907
13903 60907 65658 95014 66750 23911 33129 7178 4888 -19862 -28076 -42372 -66428 -62907 -47516
13890 -47516 -61130 -42082 -72491 -79016 -120088 -106459 -112395 -128928 -141973 -140335 -83097 -101034
13878 -101034 -161680 -115248 -102544 -62348 -33348 -24338 -60514 -94291 -67640 -47978 -71185 -18043
13866 -18043 14059 1264 -60454 -98230 -99553 -95196 -93693 -55369 -63717 -58134 -123097 -176395 -120813
13853 -120813 -49057 -18048 -2522 12322 -1840 -11285 -34311 -19096 -7220 -12206 -7172 24205
13841B4205j3236Q278K2480m7996r3788j0694L6350j4994m1954k1815L715N2284
13829i7165Q3817K844l8994M1264k0424J0622L0403j4350j5878l5024o7623j3139
13817a33647j5338p079L7619J7956J579O0887N1831l388k9705m6525k0361J6866
13805f9305O2822K1033p054l4791p835j0077m080J9470L0222R592j9390m853k77
13792a4523n0130J0060K2424J6420N0705J0832P125m7537l687k6580O639N4398
13780C6146l976M277N876p5210n213J2569J9743j7271r988n959k4992K6879L5332
13767a787m158j1351L9177P214k6431m4142L7662K6574K3529K6857n8940l8459
13755b4255J69n4767J2217O2589O2438L0612n2078l0293m1956j6286O8699J050
$$ plain form
13841 24205 10969 19247 41727 -6269 -100057 -110751 -74401 -89395 -131349 -153164 -149449 -97165
13829 -97165 -13348 -10504 -49498 -8234 -28658 -18036 12367 -1983 -17861 -52885 -120508 -133647
13817 -133647 -148985 -156064 -118445 -100489 -98910 -38023 13808 10420 -19285 -65810 -86171 -69305
13805 -69305 -6483 14550 7496 -27295 -35130 -45207 -49287 -29817 405 9997 -9393 -14246 -14523
13792 -14523 -64653 -54593 -32169 -15749 34956 45788 52913 5376 1689 -24891 -18252 36146
13780 36146 32170 36447 42323 -32887 -38100 -25531 -5788 -23059 -33047 -39006 -63998 -37119 -1787
13767 -1787 -5945 -17296 21881 29095 2664 -41478 -3816 22758 46287 73144 14204 -24255
13755 -24255 -24086 -78853 -66636 -4047 58391 89003 36925 6632 -35324 -51610 17089 18139
13743A8139k6665m0202l9284k5942q182J1342J034N9620P7818o2209q3739o9955
13731a88225J829P0113M3573k0424M5806k1855J6666J0988O7673J2035k5872J2150
13719B4457k0018p4415k8096K0951k6195M0891L6012j7891l0885J3461L7901J9187
13707d640j9429n8905K2727K2883K1094J7190l6870k8577l2140o6178j3575J8780
13695a57640J5515K5792r425p481K661R2733M4924j8061K2984L5261N885J6180
13683F9328o287m7763j2989K2671j7643l7916M3082m0241j8463k8181j6064Q033
13671h2433J3410m3891Q102K7197K4661R2904P4914j0217r5395k6780K0109M2676
13659D5257l206k8068j7359J0647k1459l9496n6828K6854P1612M6262M1503j5837
$$ plain form
13743 18139 -8526 -48728 -88012 -113954 -122136 -110794 -109760 -50140 27678 -34531 -118270 -188225
13731 -188225 -186396 -116283 -72710 -93134 -47328 -69183 -52517 -41529 26144 38179 12307 24457
13719 24457 4439 -69976 -98072 -77121 -103316 -62425 -26413 -44304 -75189 -61728 -23827 -4640
13707 -4640 -24069 -82974 -60247 -37364 -16270 920 -35950 -64527 -96667 -162845 -176420 -157640
13695 -157640 -142125 -116333 -125758 -133239 -130578 -37845 7079 -10982 12002 47263 53148 69328
13683 69328 63041 15278 2289 24960 7317 -30599 12483 -27758 -46221 -74402 -90466 -82433
13671 -82433 -69023 -112914 -104812 -77615 -52954 39950 114864 104647 9252 -17528 2581 45257
13659 45257 42051 13983 -3376 7271 -14188 -53684 -110512 -83658 -12046 34216 75719 59882
13647E9882l520p4337p0814j9374L3950K800p5427P078J9766N3515O1020L3879
13635B8418n2367m5482p90O0979J7130l4344n7773n034M8324L5989q905Q5577
13623G1722K3337k5525J0194J9863Q097l0951k6986K8875K2243l6339o0519k5344
13611b1333j0144k7024j7009k1121l3236K0066O5558l08O044J5456J5161j0345
13599a8235k6262J5594J7171o6438k3322M3368M7309P386m5380r483L2078K9453
13587C239m779l1333J9817J1690k2137L589p083k1517m3396n5967L4009K8987
13575h4881R519J6425P5976j9381o8064k8165n3466k0892M0742J9562P6463O0874
13563B4712j7889j577p689m1408m6429p4442P1140R1272n5774j579N3479J8661
$$ plain form
13647 59882 56362 -17975 -88789 -108163 -74213 -71413 -146840 -139762 -119996 -66481 -5461 28418
13635 28418 -23949 -69431 -70221 -9242 7888 -26456 -84229 -89263 -40939 -4950 -13855 71722
13623 71722 95059 69534 79728 99591 107688 76737 49751 78626 100869 64530 4011 -21333
13611 -21333 -31477 -58501 -75510 -96631 -129867 -109801 -44243 -44551 -38507 -23051 -7890 -18235
13599 -18235 -44497 -28903 -11732 -78170 -101492 -58124 -10815 -3429 -48809 -58292 -26214 3239
13587 3239 -1540 -32873 -13056 -1366 -23503 -19914 -26997 -48514 -91910 -147877 -113868 -84881
13575 -84881 -75362 -58937 17039 -2342 -70406 -98571 -152037 -172929 -132187 -112625 -36162 24712
13563 24712 6823 5246 -2443 -43851 -90280 -164722 -93582 -2310 -58084 -59663 -6184 12477
13551A2477M4130J435n628n1530j9700J111l4582Q323K0000L1925J1793J1367
13539C1121l8183k8041J7939l0673L5127M012J359m334R799l1722L6670l507m2516
13526d2949L53k3285n990N517n2597L7365L8637J866M390n4450q3391K3260R1187
13513f0087Q1736j3567l0161k7429K3490R431j3601m443K9838K282J6563k8419
13501a4367L3925K7915l6398q7862m4253O5858M9788q824j3641N4268p77j7268
13489H364L295l0933k6029K3023j2282j8471n267L6712q675k1852l2945O123j8604
13476i7541L9641O0511n749K0632K7313m4973m5883L5984K8955m055M4902M085
13464F3822o0468j6483J3548j0888p2101J3650L0443K9418N2913l0946j9775j4906
$$ plain form
13551 12477 56607 58042 52414 884 -18816 -17705 -52287 -43964 -23964 7961 19754 31121
13539 31121 -7062 -35103 -17164 -47837 -12710 -8698 -7339 -11673 -1874 -33596 3074 -433 -42949
13526 -42949 -42596 -65881 -71871 -66354 -118951 -81586 -42949 -41083 -36693 -91143 -174534 -151274 -60087
13513 -60087 21649 8082 -22079 -49508 -26018 -16587 -30188 -34631 -4793 -2511 14052 -14367
13501 -14367 19558 47473 11075 -76787 -121040 -55182 -5394 -14218 -27859 26409 25632 8364
13489 8364 11659 -19274 -45303 -22280 -34562 -53033 -58300 -21588 -30263 -52115 -85060 -78937 -97541
13476 -97541 -57900 2611 -3138 17494 44807 -166 -46049 -10065 18890 14835 59737 63822
13464 63822 3354 -13129 419 -10469 -82570 -68920 -38477 -9059 43854 12908 -6867 -21773
13452b1773k642P0374l3427N292r0474J6173K720J5249Q0728o464p78k3829n7836
13439d6687k6780m7383r47L9678M088K0003k526k4843L0714J641q510m010k0783
13426h6345j4217j1924P4M3510K3308K5628m0543o574O3032L1010J7521o3986
13414a9506J2306j148P382j9921m1672n777J9122l8472K904L108k8980K1394O9736
13401a9524k7680j932O6725m5106m2391J8612j7194k5759k3730J9848M3506L7384
13389a7241K4973m7668n5942l6846r280K6788J1573O1934P3134m8325n4032L6800
13377c4132J6711j1098J2981K6916o511k8968n3000r942K3505K1217n4262k2782
13365a19365R7839P2636K680J1901j8339m0213l8946m3452J1558l7725K7835K1444
$$ plain form
13452 -21773 -24415 45959 12532 17824 -72650 -56477 -53757 -38508 42220 35756 34978 11149 -46687
13439 -46687 -73467 -120850 -121797 -82119 -78031 -58028 -60554 -85397 -54683 -53042 -61552 -65562 -86345
13426 -86345 -100562 -112486 -112412 -68902 -45594 -19966 -60509 -67083 -4051 26959 44480 -19506
13414 -19506 -7200 -8348 -966 -20887 -62559 -68336 -49214 -87686 -84782 -81674 -110654 -89260 -19524
13401 -19524 -47204 -49136 17589 -27517 -69908 -51296 -68490 -94249 -117979 -98131 -54625 -17241
13389 -17241 7732 -39936 -95878 -132724 -142004 -115216 -103643 -41709 31425 -16900 -70932 -34132
13377 -34132 -17421 -28519 -15538 11378 4867 -24101 -77101 -87043 -63538 -42321 -96583 -119365
13365 -119365 -21526 51110 53790 65691 47352 7139 -31807 -75259 -63701 -101426 -73591 -52147
13353e2147O1131j3410l0792j0094j0083r0034J8074Q370N79N7407K6413n867
13341d0453j6077J3749q413j0940j6863l070L4407L4454P3280M8844M1047k469
13329A47496M176l0928o8643m7195j9879K2835p204k2074k689J7988K2026J7612
13317C3521k0945j3219L5018l1159J9712O860n0564o3368m4553L2892M6668J0685
13305c8452k0679N4336J1900l7260M0665l7374n9332J0834N0944J1893n5370k6061
13293i3956J3086L5163K8245P816l8462k2942J6610O9802L6248j6518m2743K023
13281e628J2023j5886m0941k3581K5400K3678K6494l93J6948m0540L6308p997
13269E885j6187O634O4348L4170N421l2221j8910K4107m081l0204k5706L1143
$$ plain form
13353 -52147 8984 -4426 -35218 -45312 -55395 -145429 -127355 -118985 -118406 -60999 -34586 -40453
13341 -40453 -56530 -42781 -51194 -62134 -78997 -82067 -47660 -13206 60074 108918 149965 147496
13329 147496 151672 120744 52101 4906 -14973 7862 658 -21416 -24105 -6117 15909 33521
13317 33521 12576 -643 34375 3216 22928 29788 -20776 -84144 -128697 -95805 -49137 -38452
13305 -38452 -59131 -4795 7105 -30155 10510 -26864 -86196 -75362 -24418 -12525 -67895 -93956
13293 -93956 -80870 -45707 -17462 -9646 -48108 -71050 -54440 15362 51610 35092 -7651 -5628
13281 -5628 6395 -9491 -50432 -74013 -48613 -24935 1559 1166 18114 -22426 13882 5885
13269 5885 -10302 -3668 60680 94850 100271 68050 49140 73247 69166 38962 13256 44399
13257D4399K4040m8776m2844r351k158M006l469N1133O6812M5533l4910k2645
13245G1770L5556K3009K552P5639K4196r0801j20208o1941M2359J7480J05085
13234A24696M137o7347p8750o6355j9457J4140N8807J5602j9085j9224Q660R787
13222c4389J2426K1709n2713Q452L6382M2831m6890r0866l97N4543M6854p771
13210i829K8652N4689m434n7598J361Q241k8250K0610J1463m2493j9827k9124
13198f6539k6926J9326O899r215J5345O843j8893m906L3488r575L7598Q065o210
13185a4700j5554K2727k7005O925K5625k0623J1130J8002J7130J2102o2680l5706
13173f2627K6879l022O262J7003J7169L3512R64J0782k974K3528k214M611m1233
$$ plain form
13257 44399 68439 19663 -23181 -32532 -34690 -30684 -34153 16980 83792 129325 94415 71770
13245 71770 107326 130335 132887 208526 232722 141921 21713 -40228 2131 19611 124696
13234 124696 128833 61486 -17264 -83619 -103076 -88936 -30129 -14527 -33612 -52836 -44176 -34389
13222 -34389 -21963 -254 -52967 -44515 -8133 34698 -12192 -103058 -103455 -48912 -2058 -9829
13210 -9829 18823 73512 69078 11480 12841 21082 -7168 13442 24905 -17588 -37415 -66539
13198 -66539 -93465 -74139 -67240 -76455 -61110 -54267 -73160 -78066 -44578 -54153 -16555 -8490 -14700
13185 -14700 -30254 -7527 -34532 -27607 -1982 -22605 -11475 6527 23657 35759 -26921 -62627
13173 -62627 -35748 -38770 -32508 -15505 1664 35176 36140 46922 43948 67476 65262 69873 28640
13160B8640n0882J213L8777L8856n5511j6898M3971l0302o861Q224L6117j8747
13148A6597o9901P8937O5254l0501l7181q582Q566K303k3850J0294K7817K7591
13136F7344L2812j459l2539m443J1252l8260Q328k957m1782J7440J0195O94l703
13123B2922J7462J3344k4964k4775q138O0942j3447J1867k2346m3074j061K2856
13111A1588j8064J9286L2822q448M6189R4968M9347P421J0082j0064k1998o4777
13099A48352q2389k7332m9987K591M4434J1595j437j5059o5061K8151J6206J6699
13087B6763L2591j2632J6161J6075l8205J3155K6361p1376q3310M959j8132N5183
13075c2407K4885m9831P584j8185K6323R3306n4747n1697N762M1721k2882M1670
$$ plain form
13160 28640 -22242 -21029 17748 56604 1093 -15805 28166 -2136 -8997 -773 35344 16597
13148 16597 -53304 25633 90887 60386 23205 14623 23189 25492 1642 11936 39753 67344
13136 67344 100156 98697 66158 61715 72967 34707 43035 40078 -1704 15736 25931 26625 22922
13123 22922 40384 53728 28764 3989 -4149 56793 43346 55213 32867 -10207 -11268 11588
13111 11588 -6476 12810 45632 37184 83373 178341 227688 235109 245191 235127 213129 148352
13099 148352 65963 38631 -11356 -8765 35669 47264 45827 30768 -34293 -6142 10064 26763
13087 26763 59354 46722 62883 78958 40753 53908 80269 8893 -74417 -69458 -87590 -32407
13075 -32407 -7522 -57353 -49769 -67954 -41631 51675 -3072 -54769 -49007 -7286 -30168 11502
13063A1502M1247N2449L2083j1807l6136l9761j074j1258m5269K0151M3466K9735
13051H5328L9080O5453R9453Q1860O3044N1429m8604m6486j06304p4905m5820
13040A63528j1421N92m7454p9102J1472P7298O9623l5445j3034k9873j189J541
13028A06536q2429p156k445L122N258j2662M3121K3331k6653j2869r839P6107
13016A03422k1328o6211l6914K0134j1957P0555J0164N1328Q8335J63860J81397
13005E52785J62375J14705P5288N4004p8566j35082j28095j23040j00629m6496
12995C47249o2066n1954j04493k3355N5979J851k4978o4066l376K9511o9880o3367
12983c2945j2560J4268N4635m3016j0765l325K214K9147K9642L3107k6399R113
$$ plain form
13063 11502 52749 105198 137281 125474 89338 49577 48503 37245 -8024 12127 55593 85328
13051 85328 124408 189861 289314 371174 434218 485647 437043 390557 284253 209348 163528
13040 163528 152107 152699 105245 26143 37615 114913 184536 149091 136057 106184 104995 106536
13028 106536 24107 16951 14506 17628 22886 10224 53345 76676 50023 37154 27315 103422
13016 103422 82094 15883 -21031 -897 -12854 57701 67865 119193 207528 371388 552785
13005 552785 715160 829865 905153 959157 880591 745509 617414 494374 393745 347249
12995 347249 285183 233229 128736 105381 161360 163211 138233 74167 70791 100302 30422 -32945
12983 -32945 -45505 -31237 23398 -19618 -30383 -33708 -31494 -2347 27295 60402 34003 43116
12971D3116P5393J3842k2005L253J3966j9354L0427P4856R9994Q7169K5675m9200
12959C77132J3309k9752q4356j4471n4808n6357k5946k7867l5670L9831J705q6264
12947A6486l1530q116J8386j756j3618K7007L1955M5021K350J3062l4806m1008
12935B3433O5393L3435L361p706p1605k0884K4475k9615m5007q183N244J8858
12923h801J9039P17j1486m170n9476k0876N4565P258l4978N412J8286K3642N6250
12910D5382P182Q949p550J4589K2740k5031J295p3392o6310L6948L1589N3091
12898D9482J2509k2663n674P848M329m1522j942K6643P866l0379r2122l2107K2413
12885i5319R2282J4819J4765o598m8157m1014L8846J9545J7806K5870K3439n6499
$$ plain form
12971 43116 118509 132351 110346 113599 127565 108211 138638 213494 313488 400657 426332 377132
12959 377132 390441 360689 276333 261862 207054 150697 124751 96884 61214 101045 102750 16486
12947 16486 -15044 -23160 -4774 -6530 -20148 6859 38814 83835 86185 99247 64441 23433
12935 23433 88826 122261 125622 117916 46311 25427 49902 20287 -24720 -32903 -27659 -8801
12923 -8801 10238 10955 -531 -4701 -64177 -85053 -30488 -23230 -58208 -52796 -34510 -10868 45382
12910 45382 52564 61513 53963 68552 91292 66261 67556 -5836 -72146 -35198 -3609 49482
12898 49482 61991 39328 33654 41502 45831 4309 2367 29010 36876 6497 -85625 -117732 -95319
12885 -95319 -3037 11782 26547 19949 -28208 -69222 -30376 -10831 6975 32845 56284 -215
12873b15K599r671q1413K5648R9450J1034J7271k7741k4146q143R527K9397P01
12860D4298K3041o3907M1273M3924M096j8228j9809O8825o162K1906r486p3203
12848E6568l296P1182Q961j1937R4786L4494j9030M1320R7683M7600j9801O9553
12836D68083J21490J23485J49874K61349L62595M60879O08099P65310P88130O41904
12826D751198L73593q417l45816m38653n12652n65849n10525l40436l12511k78986
12816A810946k16923j47312p9275r2481j05495j79382j31584j02604q632P1440
12806H18698N4198L8843N5993l6524m003M5679Q6464O1596O5265J42849J81334
12795A510392J52554K19817L63973N10146O87263Q76894Q34465N72417J76801
$$ plain form
12873 -215 2384 -7287 -88700 -63052 36398 47432 64703 36962 12816 4673 14200 43597 44298
12860 44298 67339 3432 44705 88629 92725 74497 54688 123513 117351 139257 129771 56568
12848 56568 53272 124454 133415 121478 216264 250758 231728 273048 370731 418331 398530 468083
12836 468083 589573 713058 862932 1124281 1486876 1947755 2555854 3321164 4109294 4751198
12826 4751198 5124791 5116374 4770558 4331905 3819253 3253404 2742879 2402443 2089932 1810946
12816 1810946 1594023 1446711 1367436 1274955 1169460 990078 858494 755890 747258 818698
12806 818698 872896 911739 967732 931208 927205 972884 1059348 1120944 1186209 1329058 1510392
12795 1510392 1662946 1882763 2246736 2756882 3444145 4321039 5155504 5727921 5904722
12786E904722l30991p20068q36830p93318p09801n10878l96541k53735k32567
12777A119993k36083j28241k2720m5961q9060n3408r2588l3719l3770l6074m1758
12766C06611o3063n3995J0377K426N684k3568P206j3062j519K3962n6810O459
12754A50708J9191j2458P13J5615J5932K1140J8077J8143n8759l8964n5640m5449
12742D8249q229P5182M3290j897m6287o2298m2788J9373N9253Q3065K682r6940
12730G2655o5060K6600j4669k868j1913l512L5899N1494M0887r192j2503J1744
12718A19562J2994l3698k0752K6917l2495k2580k073k5482J193Q958J721m430
12706B9835N646j5368p477q792n7652j09229l0917J19797M7181n692k6916l9629
$$ plain form
12786 5904722 5573731 4853663 4016833 3223515 2513714 2002836 1606295 1352560 1119993
12777 1119993 883910 755669 732949 686988 597928 544520 451932 418213 384443 348369 306611
12766 306611 243548 189553 199930 202356 208040 184472 191678 178616 177097 201059 144249 150708
12754 150708 169899 157441 158154 173769 189701 210841 228918 247061 188302 149338 93698 48249
12742 48249 40020 115202 158492 156595 110308 48010 5222 24595 83848 166913 169595 72655
12730 72655 7595 34195 19526 16658 4745 1233 37132 88626 129513 120321 107818 119562
12718 119562 132556 98858 78106 105023 72528 49948 47875 22393 23586 32544 34265 29835
12706 29835 35481 20113 12636 3844 -53808 -163037 -193954 -74157 -26976 -32668 -59584 -99213
12694i9213j9048L473L8773J03457L0180n0395m2724M4644M8837J374M6517J1218
12682A17093o4967j5399m4501l5647J8052N3528j2066k2471J8325O7459k3133
12671E6273j3423m6352n3803L8820k3306m2256J0648J0873N52k3116J7106j6992
12659h4976p077L9368k1600l1838L9843O5699M7706m6222l2561N7270M4077m6380
12647B3309n9099R578J1638Q797n731J9906N6742Q302R391J5039M7114j4023p5255
12634E5708Q011K9459J6829J7349R683L8107k3747N7328O2397J3779n1888K9957
12622B62972P5596J69738K00258J85962K33702K14208J85592J15096J4712p1765
12612A586071j57855j95454j87692j55037j90120j28741j32115p8386M185n7243
$$ plain form
12694 -99213 -118261 -114788 -76015 27442 57622 7227 -35497 9147 57984 59358 105875 117093
12682 117093 52126 36727 -7774 -43421 -25369 28159 16093 -6378 11947 79406 56273
12671 56273 42850 -3502 -57305 -18485 -41791 -84047 -73399 -62526 -61974 -85090 -67984 -84976
12659 -84976 -92053 -52685 -74285 -106123 -66280 -581 47125 903 -31658 25612 69689 23309
12647 23309 -35790 -26212 -14574 -5777 -11508 8398 65140 73442 82833 97872 144986 130963 55708
12634 55708 63719 93178 110007 127356 137039 175146 151399 208727 271124 284903 233015 262972
12622 262972 338568 508306 708564 894526 1128228 1342436 1528028 1643124 1657836 1586071
12612 1586071 1428216 1232762 1045070 890033 699913 571172 439057 360671 364856 307613
12602C07613q0475j16356L5014P5960l8870n7101o0021k9868j4519M0558P8210
12591A40145O0714l1910j121N4131N6348N7242l5601Q3347J74909J55055J23210
12580H36469O4842p397j25932j66050j21740j41431j08024K474L6069l0914k3631
12569B14735m0297o6080J5394L3862J6322o122q0380p4222k4346l0740j4961M0850
12557a5985M9597Q758r151K3593N4085J6790M7327j0939L190M8354R2184L0201
12545C38004J06978J49566R2732O5546Q5087m3253o0712r3557j76473j15797l9268
12534C08853n6406m3960J6658n1212r8791j5505j8284m4887J9595K3850N5439
12523I5350J8998n4999J7473J3925J5051L8047J1705J0842m7102o7231n6271j2151
$$ plain form
12602 307613 227138 110782 145796 221756 182886 125785 65764 35896 21377 61935 140145
12591 140145 200859 168949 167828 221959 278307 335549 299948 383295 558204 713259 836469
12580 836469 901311 893914 767982 601932 480192 338761 230737 233211 269280 238366 214735
12569 214735 174438 108358 123752 157614 173936 167814 87434 13212 -11134 -41874 -56835 -15985
12557 -15985 33612 42370 33219 56812 110897 127687 175014 164075 167265 215619 307803 338004
12545 338004 444982 594548 687280 752826 837913 794660 733948 640391 463918 348121 308853
12534 308853 252447 208487 225145 173933 75142 59637 41353 -3534 16061 39911 95350
12523 95350 114348 59349 76822 90747 105798 143845 155550 166392 119290 52059 -4212 -16363
12511a6363Q2866J05595k5402n7321r277L4058K9008P060o664l3557j3758N8050
12499A54295K6912J0655n5082l2403n4965K0422l3632m2468K3908O8374K1976
12488A07992M7158J29354O9988j1451p539j6511m6267q2051n7404K2494m1678
12477A14085O090M5969J9518L0793J6530J226J4631M11Q054j9046j4341n0869
12465A73051k6329K6211K9963k5000k0387K7263J0526K3593P021q3979M0304R1993
12453B74230L3222J22413J45927J54068J63342P2612j1529j13183j03685j33784
12443F03633j62713q8538m9178J8222N542J7749J0520M0066M6870l2149k2442
12432C87582M5098m2886q8439K8227J5045M265q987o0824m4817j4283q344J1177
$$ plain form
12511 -16363 66503 172098 146696 89375 80098 114156 143164 150224 143560 110003 96245 154295
12499 154295 181207 191862 136780 104377 49412 69834 36202 -6266 17642 86016 107992
12488 107992 155150 284504 354492 343041 335502 318991 272724 190673 133269 155763 114085
12477 114085 120175 166144 185662 216455 232985 234211 248842 249253 257307 238261 223920 173051
12465 173051 146722 172933 202896 177896 157509 184772 195298 218891 225912 141933 182237 274230
12453 274230 307452 429865 575792 729860 893202 965814 954285 841102 737417 603633
12443 603633 440920 352382 303204 321426 326968 344717 355237 395303 442173 410024 387582
12432 387582 432680 389794 301355 329582 344627 348892 339905 279081 234264 219981 211637 222814
12420B22814L1071L9458P9122o114p6792l2001k5120R6041R0133M4528o6349o8744
12408C28047p9841l5366K3917n4257k0701R1717J222p9218l4892N222Q9976O1628
12396B97454Q370J7541N1543j8296o8218q058J1044m5905k0696p0821l6871j3262
12384A03825M5031Q998O147J8051M3147k3717J0745N7945o7095l6613m7209K1588
12372A40843k8390l4743m0683l331O440J03J0960J3459K3517L6649M8375L9102
12360B12301n761l7595K4740L0002L8305O941K3617K2183M7897N7046O2055k2525
12348D59206m605M229l7680n9937K2282R891o418L8951K107j6343K9437P3305
12336E14425N1927O2026J37051J77261K32485K24463K57028J78785Q0185J06131
$$ plain form
12420 222814 253885 293343 372465 366351 289559 257558 232438 328479 418612 463140 396791 328047
12408 328047 248206 212840 236757 182500 161799 253516 254738 175520 140628 145850 235826 297454
12396 297454 305824 323365 374908 356612 288394 280336 291380 245475 224779 153958 117087 103825
12384 103825 148856 157854 164001 182052 225199 201482 212227 270172 203077 166464 119255 140843
12372 140843 112453 77710 37027 33696 40136 40239 51199 64658 88175 124824 173199 212301
12360 212301 206540 168945 193685 223687 261992 268933 292550 314733 362630 419676 481731 459206
12348 459206 454601 458830 421150 361213 383495 393386 386968 425919 428026 411683 441120 514425
12336 514425 566352 628378 765429 942690 1175175 1399638 1656666 1835451 1915636 2021767
12326B021767L3848l7995j53863k37640k31085k68264k39039k03596j96324j63584
12316C24225o2617o8952m3869J9426K1990K0538l7654o1711O7907K1076L5734
12305B36093q319L0440p050q4222j3121K2667J991K1637L0356N750K9887K3642
12293B89751k2011J0116l3197K6824L1141L7390R1062K0029j063l0021l0526q2633
12281C06862J966L1820L5446O3523R117o5234j0297P3449J627n4760J7183J08984
12269E19686J4830m1710J3950K7420o4902j5737L831O045O1750n056J4527R4888
12257F29522N1142K1183p497j8982J4678Q0876O1360o828l8138j485L488n012
12245G84307j5259K3985K4650Q9465J03337O3310Q3978R6211K6078O6326O8402
$$ plain form
12326 2021767 2055615 2017620 1863757 1626117 1395032 1126768 887729 684133 487809 324225
12316 324225 261608 192656 148787 168213 190203 210741 173087 111376 179283 200359 236093
12305 236093 227774 258214 251164 166942 153821 176488 178479 200116 230472 236222 266109 289751
12293 289751 267740 277856 244659 271483 302624 340014 431076 451105 450042 420021 389495 306862
12281 306862 308828 340648 376094 439617 448734 383500 373203 446652 448279 393519 410702 519686
12269 519686 534516 492806 506756 534176 469274 453537 457368 463413 525163 520107 534634 629522
12257 629522 680664 701847 694350 675368 690046 770922 832282 825454 787316 785831 789319 784307
12245 784307 769048 793033 817683 907148 1010485 1073795 1157773 1253984 1280062 1346388 1414790
12234A414790O6678J22693P5521J8952R0035R1162J04378J45384J06632R3570
12224B329795K02307J92094K03565J79848K51701L32221L83253M45085N51566
12215E071435P79655R85007J261412J585973J647681J681113J847292K044301
12207A6903869K295853K664693L325064M533137O689362J0408342J6574498K6403675
12199H9798493M0140819N0494379M8204902M1789303L0593888J2833125o380653
12192C07474256k0432849l6238127m8112527m7716437l9593625k9457706k0393325
12185F5529660j3631306r182191o436277m636067l545657k865300k468713k269534
12177B0494615k085040j981632j868400j680284j522283j292580j070005p69298
$$ plain form
12234 1414790 1481468 1604161 1679682 1698634 1788669 1879831 1984209 2129593 2236225 2329795
12224 2329795 2532102 2724196 2927761 3107609 3359310 3691531 4074784 4519869 5071435
12215 5071435 5851090 6836097 8097509 9683482 11331163 13012276 14859568 16903869
12207 16903869 19199722 21864415 25189479 29722616 36411978 46820320 63394818 89798493
12199 89798493 129939312 180433691 228638593 270427896 301021784 313854909 307474256
12192 307474256 287041407 250803280 202690753 154974316 115380691 85922985 65529660
12185 65529660 51898354 42716163 36279886 31643819 28098162 25232862 22764149 20494615
12177 20494615 18409575 16427943 14559543 12879259 11356976 10064396 8994391 8225093
12169H225093n97374n09415l58301k67666k83231j21317n6557j0361Q1113K4429
12159F126413R2911P2196J87009K41603M98745P08250Q73066J102644J346615
12150A1249452J691371K236856K955599M042986N941607Q964762J3684533K0465091
12142G1232257K8637695L4081597K9917356J3369925p996290k3678462k9480710
12135A16083368k7521861k1816153j5776877j0992951p546835n242077l700075
12128B3486539k844723k230932j818698j602359j425234j063283p90263n48073
12120A1162974m47150l34369j10944Q867K55469N70485O89922R07003J228288
12111A3930545J536754K037119K851655L957082N698934Q352633J1968803J6619589
$$ plain form
12169 8225093 7627719 7118304 6760003 6492337 6209106 6087789 6031232 6020871 6101984 6126413
12159 6126413 6219324 6291520 6478529 6720132 7218877 7927127 8800193 9902837 11249452
12150 11249452 12940823 15177679 18133278 22176264 28117871 37082633 50767166 71232257
12142 71232257 99869952 133951549 163868905 177238830 169242540 145564078 116083368
12135 116083368 88561507 66745354 50968477 39975526 32428691 27186614 23486539
12128 23486539 20641816 18410884 16592186 14989827 13564593 12501310 11711047 11162974
12120 11162974 10715824 10381455 10270511 10279378 10534847 11105332 11795254 12702257 13930545
12111 13930545 15467299 17504418 20356073 24313155 30012089 38364722 50333525 66953114
12103F6953114K1740713K4984550K4049373J7281284N477968p820798j8457560
12096A34208644k3816926k3802850k0231255j5601396j1345496p925433n582500
12089B5902788m041639l090906k644705k181635j736008j565832j360811j172747
12081H108505r56739p83914o14895n02806l95034l81705l94552l29883k22612
12072C526365j49464k22515k32382k12898k31237k16508k63964j58220j90487
12063A648690j52964n4215l4126q259m4221p4947q1871m8912m6192k2045n5410
12052A025528l4539o269O747L8652K2775m3189j3050L864k8934n5066o5600k9310
12040H21609m4557k3095k7272o4228r943j7008r941k0396m3754L0938P8629K5810
$$ plain form
12103 66953114 88693827 113678377 137727750 155009034 160487002 152666204 134208644
12096 134208644 110391718 86588868 66357613 50756217 39410721 31485288 25902788
12089 25902788 21861149 18770243 16125538 13943903 12207895 10642063 9281252 8108505
12081 8108505 7151766 6367852 5752957 5250151 4855117 4473412 4078860 3748977 3526365
12072 3526365 3376901 3154386 2922004 2709106 2477869 2261361 1997397 1839177 1648690
12063 1648690 1495726 1441511 1407385 1399126 1354905 1279958 1198087 1149175 1102983 1080938 1025528
12052 1025528 990989 984720 991467 1030119 1052894 1009705 996655 1000519 971585 916519 850919 821609
12040 821609 777052 753957 726685 662457 652514 635506 625565 605169 561415 592353 670982 696792
12028F96792J8531K9754K2546k0876n6266j4263j2280j6285M5928L8496l3726
12017F98351l2994q622k5974l1093k4898o9040o7604j2130k4054m4667n1231k2494
12005B83550m31J9820M6499K7755k5872j6362l1104j5057J201P0030l368k2275
11993C34386P740j0349k4105k048K9914m488n7249l9677m3475p66N5064J00306
11981C45253L3127K2852l209P5161N9045q2995r4497o9402p7139m0941K9754j9216
11969A77793p6846j2206k646K0751J6303L5094m0597L5307N5237o7022k2898K3044
11957A41314l9884J1549L834K1038J9100J6231L0066K4011J8888K6626n7892n1937
11945A62944j4744k6542K9043O3985J440o1087l2380l6691m7088N4961K1542O7784
$$ plain form
12028 696792 715323 745077 767623 746747 690481 676218 663938 647653 693581 732077 698351
12017 698351 665357 656735 630761 599668 574770 505730 438126 425996 401942 357275 306044 283550
12005 283550 283119 302939 349438 377193 351321 334959 303855 288798 289999 360029 356661 334386
11993 334386 342126 331777 307672 305624 335538 331050 273801 234124 190649 189883 244947 345253
11981 345253 378380 401232 398023 473184 532229 449234 354737 285335 208196 167255 197009 177793
11969 177793 100947 88741 86095 106846 123149 158243 117646 152953 208190 141168 118270 141314
11957 141314 101430 112979 116813 137851 156951 173182 203248 227259 246147 272773 214881 162944
11945 162944 148200 121658 150701 214686 216126 155039 122659 85968 38880 93841 115383 183167
11933A83167Q129m4625j827L078j0432O765q260K5366K0886L5672j9120k3624
11921A75175j2801k1248l1828j9338J3223L6626O1037J1972m0929K819K6554k2740
11909A78522k2037j1j5022K4168j1067l3299N8143q880j0001k9300N3141O5587
11897B49944k9723q5857l9602N5272k2969j15975r1102p633J528L8491N9098O5844
11885G7316k0320J7327k533J17l7126n1819N5363K5023n0927m4984O2402L1298
11873F1137k726j2455L9803K9412l7474K5957P745l2396l3064m5405k7073L0412
11861C873P9695K954M820p056n5566O878M5424N4356n1413o3612m7422N1625J3348
11848C7904M979N2156j3624j2257o996l1993m7804j9722K6904J2461J1814l2828
$$ plain form
11933 183167 191296 146671 144844 147922 137490 144255 135995 161361 182247 217919 198799 175175
11921 175175 162374 141126 109298 89960 103183 139809 200846 212818 171889 174708 201262 178522
11909 178522 156485 156474 141452 165620 154553 121254 179397 170517 160516 131216 184357 249944
11897 249944 220221 134364 94762 150034 127065 11090 -80012 -87645 -86117 -47626 11472 77316
11885 77316 56996 74323 71790 71907 34781 -17038 38325 63348 12421 -32563 29839 61137
11873 61137 58411 45956 85759 115171 77697 103654 111399 79003 45939 534 -26539 3873
11861 3873 83568 86522 91342 84286 28720 35598 81022 135378 83965 20353 -27069 24556 37904
11848 37904 42883 95039 81415 69158 62162 30169 -17635 -37357 -10453 2008 13822 -19006
11836a9006p430J3320O8901P5625m8064n2317J3458j7625J4589N0454M398n2439
11824D3864N5566j1875p4029q7384J7888K7832k1043N1515p494j9049j1604k9548
11812f5361m3029M2630R9858J0189j2557J6513L0367m3253j1689M6170k5292m9072
11800d526n324n4485m335L4768O368L7284k5448m4144L3010K9747R194K7843R096
11787D9048N164m2302l9660P7567Q5926N2781Q2027M7465o0969l0328J6752m502
11775B38969K3360J08659J48862K16282K57008K83861J67634J11433J21286k4302
11765A653052n9459j57198k11781j67278k06343j88620j67426j38578q5030l0196
11755B41143J0351L4070m7560l3177k7014k1741J8082k7459O479M8676j189p7778
$$ plain form
11836 -19006 -26436 -13116 55785 131410 83346 31029 44487 26862 41451 91905 96303 43864
11824 43864 99430 87555 13526 -73858 -55970 -28138 -49181 2334 -5160 -24209 -35813 -65361
11812 -65361 -108390 -65760 34098 44287 31730 48243 78610 35357 23668 69838 44546 -4526
11800 -4526 -9850 -64335 -68670 -33902 -27534 9750 -15698 -59842 -26832 2915 12109 39952 49048
11787 49048 54212 11910 -27750 49817 135743 188524 270551 318016 257047 226719 243471 238969
11775 238969 262329 370988 519850 736132 993140 1277001 1444635 1556068 1677354 1653052
11765 1653052 1593593 1436395 1224614 1057336 850993 662373 494947 356369 271339 241143
11755 241143 251494 285564 238004 204827 177813 156072 174154 146695 153174 201850 200661 122883
11743A22883n501P356M965j7498K9754O661j2421J3861M697O1910Q0910j10227
11731A87350q7874m3541j7508Q3854Q2430K2834J9127K2966j627n6028q6807k3831
11719A01345L8115L3729N1724M8667l3203m1881n282L3478K4275L481K2003L0970
11707C07421q5019K2493L9254l4462K9830J02395N91p2054M9055L3410J6791J22142
11695E31847J01263J00094J90682J65642K4384m0375o7043r1395j60032j49856
11685F05211p8932p4534j0008p5971q9356n234j0440M2593p2990m4892k1991k2220
11673A41236o9446m3343M0846M2096K2726L3863R743K8347j6083m1687k6619P1981
11661A93660O8569N6214K1338M8422O4575K1299Q4841R4335J01702O2054Q3840
$$ plain form
11743 122883 117382 124738 129703 112205 141959 148620 136199 150060 154757 216667 297577 187350
11731 187350 99476 55935 38427 122281 204711 227545 246672 269638 268011 211983 125176 101345
11719 101345 139460 173189 224913 273580 240377 198496 193214 226692 250967 254448 276451 307421
11707 307421 222402 244895 284149 249687 279517 381912 382503 310449 359504 392914 409705 531847
11695 531847 633110 733204 923886 1089528 1113912 1073537 1006494 915099 755067 605211
11685 605211 526279 451745 441737 365766 276410 271176 260736 303329 230339 185447 163456 141236
11673 141236 71790 28447 69293 111389 134115 167978 177721 206068 189985 148298 121679 193660
11661 193660 262229 318443 339781 388203 452778 474077 558918 653253 754955 817009 900849
11650I00849P1512k0034j18127j12912j32822j11730p8897J4340J6436M220J3506
11639D46341N3624q1574q8103q3516K3985M7561L4736k1281j5643j4787J9170
11628C20513K8213K575k8607l7898m4891n5064J9805O0912O884K0630j345L572
11616B95299r8058q6168L4707O1699K1396k9961l1022n8193k2442m7854j2031
11605B7372K2259o2598n3440N581J7498j681O457M4643L5100J1012N043k776o3827
11592i357m9743P4578K7718L0685j5724l2598k4292R357J7031L9133O814m2423
11580C1179l2579J816O9143R424o0255n2311Q6590K6143k4424p2166N8041L4037
11568G4638R257K148j1513k2053M365j110k6639K0898j5396k2322J2936p195k4952
$$ plain form
11650 900849 972361 952327 834200 721288 588466 476736 397839 412179 428615 432835 446341
11639 446341 499965 418391 330288 246772 270757 318318 353054 331773 316130 301343 320513
11628 320513 348726 351301 322694 284796 239905 184841 204646 265558 272442 293072 291727 295299
11616 295299 197241 111073 145780 207479 228875 198914 167892 109699 87257 39403 27372
11605 27372 49631 -12967 -66407 -60826 -43328 -45009 -38552 6091 41191 52203 57246 54470 -9357
11592 -9357 -59100 15478 43196 73881 58157 25559 1267 10624 27655 66788 73602 31179
11580 31179 -1400 416 69559 78983 18728 -33583 53007 79150 54726 -17440 40601 74638
11568 74638 83895 86043 74530 52477 56842 55732 29093 49991 34595 12273 25209 18014 -6938
11555f938P2861L913J3869L5228N1721K6427J461k9864m2435n8293J7999j9264
11543F6685m044N0494L8577m3526j3125k2158J7233m1692M3919P0389k9330o9547
11531F3875l677J9766J2780k2138n056J1822j0880o957j1924k5751P247J0511
11519C9618m780K6082K2949J4668L1936l7595j5435m1182j8310j686l1051K6217
11507A1431R8347L7016n0871j2370j0867k8990k1191M5624L7305l2039n8106K1199
11495C6488O8859K5536j7582J411P8000M8692J5742m6151j05418o1086n048P519
11483D6962N1029P5037J805M0131R326l4548m0922O497J5571L9314k7205j7544
11471A65453j3211Q693N9021j3265L256l5205m6509j3217M2525R8546j0222L6399
$$ plain form
11555 -6938 65923 69836 83705 118933 170654 197081 198542 168678 126243 67950 85949 66685
11543 66685 62641 113135 151712 108186 95061 72903 90136 48444 92363 162752 133422 63875
11531 63875 60198 79964 92744 70606 65550 77372 66492 59535 47611 21860 29107 39618
11519 39618 34838 60920 83869 98537 130473 92878 77443 36261 17951 16265 -14786 11431
11507 11431 109778 146794 95923 83553 72686 43696 22505 68129 105434 73395 15289 36488
11495 36488 105347 130883 113301 114712 192712 241404 257146 210995 105577 44491 39443 46962
11483 46962 97991 173028 174833 214964 224290 189742 148820 155317 170888 210202 182997 165453
11471 165453 152242 160935 219956 206691 209947 174742 128233 115016 157541 256087 245865 282264
11459B82264P191p4215q5658p098J0468O7199J7321j0425l2115k4117J2406j2894
11447A50327k7291J0294l3135q7159n2363L7925J16886P3832l318n2675l2239
11436A01084j4397j3824o6385R242Q68j8176R9978O2409l5372l7037l4484N0423
11424A04329K9510j1398p0397J5075j5742m1174k698n7668J0999L1101J0574M4276
11412D6787R4112j2014q3104k6929m1769Q7447J34349k6298n6044j2553K4367
11401A28351j0191J7969M3701l4794k0405l7263N6458J4641k3835o138N99k131
11389A26962K8904l1734j9052r240n8181J7981o485k820j5049N4826J7217m3412
11377E9917n8156r356N7168N0974K6628O3462L1839N654j0541r6386n9706L8198
$$ plain form
11459 282264 289455 215240 129582 122484 132952 200151 217472 207047 174932 150815 163221 150327
11447 150327 123036 133330 100195 13036 -39327 -1402 115484 189316 185998 133323 101084
11436 101084 86687 72863 6478 15720 16588 -1588 98390 160799 125427 88390 53906 104329
11424 104329 133839 122441 52044 67119 51377 10203 7505 -50163 -39164 -8063 2511 46787
11412 46787 140899 128885 45781 18852 -22917 64530 198879 172581 116537 103984 128351
11401 128351 118160 136129 179830 145036 124631 87368 143826 158467 134632 128494 129093 126962
11389 126962 155866 124132 105080 95840 37659 55640 49155 46335 31286 86112 103329 59917
11377 59917 1761 -7595 49573 100547 127175 190637 222476 228130 217589 121203 61497 99695
11365I9695M2694N6746K7005k4561K2375L4320K5881m3144n137q637m9998r428
11353A67811O4102K5953K5627K3918N252K2512R126n6324J9421K5883L4804K4495
11341C92580o2075k0371N0462K2558o829M3080O3151M6404N5183J02721L1857
11330G18721k224m7777Q164P5121P8725J28337R8999J7572M9864P8393J08451
11319A312346J80422K51120K04508K62498K53023K50081L09715M19477O10338
11310D053528Q01507R73961J329220J684646K020727K304455K299595J869042
11302A7336681J293752P28044K34732j4891m925K52476N85368Q10398Q61663O97459
11292B2780757L03351j17446l54267k17365J22387M63283Q97099J309492J850124
$$ plain form
11365 99695 142389 199135 226140 201579 223954 258274 284155 241011 235874 227237 177239 167811
11353 167811 231913 257866 283493 307411 312663 335175 344301 287977 307398 333281 368085 392580
11341 392580 330505 310134 360596 383154 376325 419405 482556 528960 584143 686864 718721
11330 718721 716497 668720 676884 752005 830730 959067 1058066 1075638 1125502 1203895 1312346
11319 1312346 1492768 1743888 1948396 2210894 2463917 2713998 3023713 3443190 4053528
11310 4053528 4855035 5828996 7158216 8842862 10863589 13168044 15467639 17336681
11302 17336681 18630433 19358477 19593209 19578318 19573393 19825869 20411237 21221635 22083298 22780757
11292 22780757 23084108 22966662 22612395 22395030 22517417 22980700 23877799 25187291 27037415
11283B7037415K464683K936324L286433L314238K907944K033078P95655o14168
11275D4161602j647712k131259k082068j747342j526504j268850j041734r11928
11267C1804205q11714q23047p34080m75286k03136n9650j3897j02419l18799l13026
11257B7949151l50622l40715m64422q49801j146509j329582j322536j082090q80488
11248B0182386p94287q50582j089517j195426j257903j064895p47355l91748K0256
11239A2810929L86744O42156R43171J042112R67843Q18791P29240R34067J141866
11230B0416919J365448J363243J149350P95901O25436O24091N54022N37521N12813
11221B7944744L83405J01361j51197j94027L7238N94480R55322J201404J254781
$$ plain form
11283 27037415 29502098 32438422 35724855 39039093 41947037 43980115 44775770 44161602
11275 44161602 42513890 40382631 38300563 36553221 35026717 33757867 32716133 31804205
11267 31804205 30992491 30169444 29435364 28960078 28756942 28697292 28683395 28580976 28262177 27949151
11257 27949151 27598529 27257814 26793392 25943591 24797082 23467500 22144964 21062874 20182386
11248 20182386 19388099 18537517 17448000 16252574 14994671 13929776 13182421 12790673 12810929
11239 12810929 13197673 13839829 14783000 15825112 16792955 17611746 18340986 19275053 20416919
11230 20416919 21782367 23145610 24294960 25090861 25716297 26340388 26894410 27431931 27944744
11221 27944744 28328149 28429510 28278313 28084286 28121524 28716004 29671326 30872730 32127511
11212C2127511J075490J003505J111295J405320J889296K587183L069936K932006
11204D7201542K208542Q98934o81811j924495k699726l028157k946125k527152
11196C6501552k090605j717486j282508p56279k84605K9750O6156m00701r15816
11187B9149458j205064j232841q91939l43839J53340L98334J63851m19500j111543
11178B4660257j813353k349897k689147k628551k383662k067032j545859j179007
11170H003749r23606p41019n98152m66868l16497k68206k68976k20123k01745
11161C998557j80014k01930j99796j60169j99906k21009j74785k16101j87959
11152B256888k04949j65544j18020r2715j18986n9149l5964o2178j31580j25030
$$ plain form
11212 32127511 33203001 34206506 35317801 36723121 38612417 41199600 44269536 47201542
11204 47201542 49410084 50309018 49627207 47702712 45002986 41974829 39028704 36501552
11196 36501552 34410947 32693461 31410953 30654674 30370069 30399819 30465975 30065274 29149458
11187 29149458 27944394 26711553 25819614 25475775 25629115 26027449 26191300 25771800 24660257
11178 24660257 22846904 20497007 17807860 15179309 12795647 10728615 9182756 8003749
11170 8003749 7080143 6339124 5740972 5274104 4957607 4689401 4420425 4200302 3998557
11161 3998557 3818543 3616613 3416817 3256648 3056742 2835733 2660948 2444847 2256888
11152 2256888 2051939 1886395 1768375 1675660 1556674 1497525 1461561 1399383 1267803 1142773
11142A142773n9725n7219p5774N273n0249o4430l3141p3112m8262l4345k6718
11131F25071l2623n3797l5466M2868j0566j2011K937L0725l070n0811L2796l2283
11119E03770n3455L6491k9260o2696j4730j43K6692j7621j8273J0683O0842L3408
11107D75708m5588r122J6080L8733j4891K8978K8605L7725K0053m2298l1581N2666
11095E55068J3594l6431q0052l9839J9899l8254k5765j5683p7840K2825M8878
11084C46400M261N382O973j08784J8998r815k2438k7243m3249L1291O4336L2877
11072B98989j4144K8278m6524k6438J5303j7771o8219J4617k2691P253K6537m7148
11060A48042q3816k5004O6172N708n443L561l5120L1071L9292k9118j5818q33
$$ plain form
11142 1142773 1083048 1025829 950055 955328 905079 840649 807508 734396 686134 651789 625071
11131 625071 592448 538651 503185 546053 535487 523476 526413 557138 554068 503257 536053 503770
11119 503770 450315 486806 457546 394850 380120 379977 406669 389048 370775 381458 442300 475708
11107 475708 430120 420998 437078 475811 460920 489898 518503 556228 576281 533983 502402 555068
11095 555068 568662 532231 452179 412340 432239 393985 368220 352537 274697 297522 346400
11084 346400 350661 356043 363016 254232 273230 263415 240977 213734 170485 201776 266112 298989
11072 298989 284845 313123 266599 240161 255464 237693 169474 184091 161400 168653 195190 148042
11060 148042 64226 39222 105394 111102 105659 109220 74100 105171 144463 115345 99527 98694
11048I8694o17J9460L7159q6841l998O2604M8668n4523o7239J3278M4057m7149
11036F3553n4040N6055K5506k9920M097K0872l0793m0551R1802K7496k4037k9555
11024H0485m1632J6294n1314m3147M0363N1911P2555M9812k5273l7801L9643o4420
11012H7476n9511K8834P6988k1054o9120L0824O0081M2957l851l5878o0778k2255
11000E4713j0720l9638L5152K8744n6931k4811K4648K0180P0676K4891M11r1975
10988C5340J6274L3094N960J2272J7355J3859r2276o3216L7470L1647K2125L3000
10976A02904M7089K9615j4864k7700K3437M6947o190K3476j4581r619o3192l4488
10964A02834j8306o8658M9351J28414M7965L4182n344p5393m4663l1622k0520
$$ plain form
11048 98694 98077 117537 154696 67855 63857 126461 175129 120606 53367 66645 110702 63553
11036 63553 9513 65568 91074 61154 65251 86123 55330 14779 106581 134077 110040 80485
11024 80485 38853 55147 3833 -39314 1049 52960 125515 175327 150054 112253 151896 87476
11012 87476 27965 56799 133787 112733 43613 74437 134518 177475 173624 137746 76968 54713
11000 54713 43993 4355 39507 68251 11320 -13491 11157 31337 102013 126904 127315 35340
10988 35340 51614 84708 90668 102940 120295 134154 41878 -21338 16132 47779 69904 102904
10976 102904 149993 179608 164744 137044 160481 207428 201238 224714 210133 200514 137322 102834
10964 102834 84528 15870 65221 193635 241600 275782 270438 195045 150382 118760 98240
10953I8240O863N1166Q842L9801J4833l0755j1808M24M0756j9142n6992m4686
10941I7542k3619l1422o120N4113N2530q4747J6850m583J8137K1691k637p9260
10929B8475m2756J9565L2910J0451Q3746r831L0714O7711J7071K4912Q995m0686
10917B31277m7552K8206N0033J9645j6913j0218j4786l3068j1347L7640l7040
10906A95877p6118l1161L2386P8170P0886P646Q431j0513r1525q2899l3066q66
10894F7248M0717N4863J8074k4014l6456q1492k3376J1245m958o699M3291K7364
10882H5807J1128j1378K320k6498r01l6679j4879K8552J6560M0079P3512N3174
10870B20797n5876m0088N961K6595j3212R618L3602R2346j8605L1933J5955m4919
$$ plain form
10953 98240 105103 156269 165111 204912 219745 188990 177182 177606 218362 199220 142228 97542
10941 97542 73923 42501 36381 90494 143024 58277 75127 70544 88681 110372 107735 28475
10929 28475 -14281 5284 38194 48645 132391 122560 153274 220985 238056 262968 271963 231277
10917 231277 183725 211931 261964 281609 264696 254478 239692 206624 195277 232917 195877
10906 195877 119759 88598 120984 199154 270040 277686 286117 275604 184079 101180 68114 67248
10894 67248 107965 162828 180902 156888 120432 38940 15564 26809 21851 15152 58443 85807
10882 85807 96935 85557 87877 61379 60478 23799 8920 37472 54032 94111 167623 220797
10870 220797 164921 124833 130794 157389 144177 153795 187397 279743 261138 293071 309026 264107
10858B64107l2907q0190l659k9580q1756N548m939M8354L2022O2393N9146j2645
10846B25894o5892k1933p243K8725N159q32L5153j2978K8496J0801j5601M235
10834B13984R9348q06k9720J8700N4757j6050o9859n0836m8852m3143Q8229l143
10822B12609o0L0586J6990j9409K2726J3845N9682j3632Q894k3612p6677l8680
10810A93262N6265N6126j4880J376k3225o2532n4999r828K3487N2086K9396l148
10798B43386L843r887O979K6409m964p1815L603j7653J4040m1090J1860O2051
10786B26762M9861L1673j7386k390K70J137m8805l4583m6638N7289K2020m6436
10774A92774Q219l3742M9941J2814L2672R968n7286m4737K9765j4132N8607k1262
$$ plain form
10858 264107 231200 151010 147351 117771 36015 41563 36624 84978 117000 179393 238539 225894
10846 225894 160002 138069 130826 159551 164710 163878 199031 186053 214549 225350 209749 213984
10834 213984 313332 312526 282806 301506 356263 340213 270354 219518 170666 127523 215752 212609
10822 212609 212549 243135 260125 240716 263442 277287 336969 323337 332231 308619 231942 193262
10810 193262 249527 305653 290773 292149 268924 206392 151393 141565 165052 217138 246534 243386
10798 243386 247229 237342 244321 270730 265766 193951 197554 179901 193941 152851 164711 226762
10786 226762 276623 308296 290910 288520 288790 289927 241122 206539 159901 217190 239210 192774
10774 192774 200993 167251 217192 230006 262678 272646 215360 170623 200388 186256 244863 223601
10762B23601J4033k78l9560q826l7831N3895l5978j890j6103l6157J075K9172
10750A45153N264K4142J393N4759K5920J0740J2004K0300M5792L0228n7289o840
10738C11566r721m2479j7452n2204J025L1993l5454r296n3812Q713m6575p298
10726G9006K1915N3169P5068L5157L0563j0890p4568j15517k0471J8024J5822
10715A07278l6362J0331O4147k9604m5071K7721j8185l2452o9449r9328N1243
10704f9731R4043J5123K0125k680J1635m4816n6020J6090J1286k1580p81J2665
10692a4641k9684j2254k7334j1831P976K1725L0197J2004L0692L3729J793L96
10680D2768J5024l173N6138j7241r6129k652K0786k5946n4622K2378m165R383
$$ plain form
10762 223601 237634 237356 197796 188970 151139 205034 169056 167166 151063 114906 115981 145153
10750 145153 150417 174559 175952 230711 256631 267371 279375 299675 345467 375695 318406 311566
10738 311566 301845 259366 241914 189710 190735 222728 187274 177978 124166 132879 86304 79006
10726 79006 100921 154090 229158 264315 294878 283988 209420 93903 73432 91456 107278
10715 107278 70916 81247 145394 115790 70719 98440 80255 47803 -21646 -120974 -69731
10704 -69731 24312 39435 59560 56880 68515 23699 -32321 -16231 -4945 -26525 -27306 -14641
10692 -14641 -44325 -56579 -83913 -95744 -87768 -66043 -35846 -23842 6850 40579 42372 42768
10680 42768 57792 54619 110757 93516 -2613 -5265 15521 -10425 -65047 -42669 -46834 -37451
10668c7451M8633P2710K7625o2092K927N0741Q465P8236n168k6053k3079n7985
10656G7509m9281o8493L052O2361L5704L332N265l155j8677m1593m609j4306J3411
10643E20N7237L1411J2022K4270n1608n4471Q893J4686K5977m101n329J3218K0093
10630I2818m1832Q793J8537j3711q4205k1081j0609P3618P6183m349M6309j3704
10618A26767k2827l5517l3399J019L8901k7706j00248J7593j1359O6119M8960
10607F8303L360M7619J3002o689L4846n9579n3886q3195J4144L3468k8773n3452
10595g0832m3101k8983N1192R1199O7338M1357k7507o9609l5751l1132N2175o955
10583a0609m2310K8413L2047k4468L0233P1043M1431k3914l631K7642j6217m2098
$$ plain form
10668 -37451 11182 83892 111517 49425 52352 103093 111558 189794 184626 158573 135494 77509
10656 77509 28228 -40265 -37213 25148 60852 64184 69449 66294 47617 6024 1415 -12891 520
10643 520 57757 89168 101190 125460 73852 19381 28274 42960 68937 64836 59507 72725 92818
10630 92818 50986 59779 78316 64605 -19600 -40681 -51290 22328 98511 94162 140471 126767
10618 126767 103940 68423 35024 36043 74944 47238 -53010 -35417 -46776 19343 68303
10607 68303 71663 119282 132284 125595 160441 100862 46976 -36219 -22075 11393 -17380 -70832
10595 -70832 -113933 -142916 -91724 -525 66813 108170 80663 11054 -24697 -55829 -3654 -10609
10583 -10609 -52919 -24506 7541 -16927 13306 84349 125780 101866 98235 125877 109660 67562
10571F7562j4264O297J3988N7540L3522k1411k7160K2832j0449o7856N7284M1010
10559A58895m5977k2012k595j4472J8083N7712K4618o747l239k4508j1323M7485
10547A75920K2785l6668m9283k654m9987j9546N642o231L4782j8450m4858k7277
10535a5825K7124l3494J4155J449M6840L110p425n5643j2534J4221O6042J2396
10523F0416j0264j9146N1040L3972J1845m0740j0553K4922O4101L4462K0677l0244
10511A90488L2902R7914j3824j3206m6293n8879K3907P0p5566l8662P9171K0963
10499A98985O638k8312n5097j0295M7402j313m8686k9059r935k8901k976l2799
10487E652k8639M015O053Q036K6843M3825n860J1917j5657l0440m0146J2170J03373
$$ plain form
10571 67562 53298 59595 73583 131123 164645 143234 116074 138906 128457 60601 117885 158895
10559 158895 112918 90906 88311 73839 91922 149634 174252 167505 164266 139758 128435 175920
10547 175920 198705 162037 112754 110100 60113 40567 46209 39978 74760 56310 11452 -15825
10535 -15825 11299 -22195 -8040 -6591 40249 43359 35934 -19709 -32243 -18022 48020 60416
10523 60416 50152 31006 82046 116018 127863 87123 76570 101492 165593 200055 220732 190488
10511 190488 223390 321304 307480 294274 247981 189102 213009 213079 137513 98851 178022 198985
10499 198985 205623 177311 122214 111919 159321 158008 109322 80263 70328 41427 38451 5652
10487 5652 -22987 -18972 -12919 -4883 21960 65785 59925 71842 56185 25745 -14401 -2231 101142
10474A01142K0166r3618j6180k9967J9564N1264N1936m400m4071l5746j3432O919
10462A3577k839l74J0331J4658Q9149l0587m0174q9265M6526O6976K088k6887
10450E3179j3485L29n423k2182m4849j8378P4721j3014m4805l5964m8513K6017
10438i2367N3175K6743M3782M4444K3960Q5280Q915n1106m6958j6609L2752k3789
10426H8222o3902m6766k3142Q2K3604L5738k2465j8974j333k0485L4222L8758
10414B3559o130N61l3665l5568N1544L0629J6189k4760m7117J784m139O9308L9385
10401H1580L7076m6936k7388k9787J2696m029p2495j9801k7718O2396N9630K4806
10389E0030M817L1099J5530K8495k6112j08106p1429O4781P8984l3795k005p4679
$$ plain form
10474 101142 121308 27690 11510 -18457 1107 52371 104307 99907 55836 20090 6658 13577
10462 13577 10738 10364 20695 35353 124502 93915 53741 -35524 11002 77978 80066 53179
10450 53179 39694 40023 34600 12418 -32431 -50809 23912 10898 -33907 -69871 -118384 -92367
10438 -92367 -39192 -12449 31333 75777 99737 185017 193932 142826 95868 79259 112011 88222
10426 88222 24320 -22446 -45588 -45506 -21902 13836 -8629 -27603 -28936 -49421 -15199 23559
10414 23559 17429 17990 -15675 -51243 301 30930 47119 22359 -24758 -22974 -27113 42195 81580
10401 81580 118656 71720 44332 14545 27241 23212 -49283 -69084 -96802 -34406 25224 50030
10389 50030 54847 85946 101476 129971 103859 -4247 -75676 -10895 68089 34294 32289 -42390
10377d2390K1536j6683j8934J13027K3640p5989r099j2005l5539o6564l3445N7465
10365i4980P5611p682l1891O4653J3998p7908j6688K0328m114L3483P9112M1337
10353I5259k3690l7529p6349l001P3412q362J7569K9510m9890j7760L399N7583
10341F0151L4920n2038m5847N2629L3607l8183p8943l6518K4323K6162p070K2632
10329d175M1804m9107m6138K3018l7696K0465k3824K8079j4541j4280k0578j2562
10317a09535J7935K0592j4738J8422n843o21k6888L1947L8674L5083m003o4866
10305f3841k9781R983J0522P7350M3833j9458m5771l7558J3734J4326M291L3266
10293A0896L0157Q405n0172j2782p001J7688L2304O374q912p5568N2434J2839
$$ plain form
10377 -42390 -20854 -37537 -56471 56556 80196 4207 -4892 -16897 -52436 -119000 -152445 -94980
10365 -94980 -19369 -27051 -58942 5711 19709 -58199 -74887 -54559 -58673 -25190 53922 95259
10353 95259 71569 34040 -42309 -45310 28102 19740 37309 66819 16929 -831 2568 60151
10341 60151 95071 43033 -2814 49815 83422 45239 -33704 -70222 -45899 -19737 -26807 -4175
10329 -4175 37629 -11478 -57616 -34598 -72294 -51829 -75653 -47574 -62115 -76395 -96973 -109535
10317 -109535 -91600 -71008 -85746 -67324 -73167 -73788 -100676 -68729 -30055 5028 1025 -63841
10305 -63841 -93622 -83639 -73117 4233 48066 28608 -17163 -54721 -40987 -26661 -22370 10896
10293 10896 41053 49458 -714 -13496 -20497 -2809 29495 35869 26957 -48611 3823 16662
10281A6662N3118L3843k8806p0861L3025N3352k2634l8413q021K0017R34l455
10269C8761l4186k9363l723J3399M3634j3212L345L3743K0105k7623o5263O666
10257a3717K8885n275n0927J7069M4507j3982n0923K7905K123J5487J9069R100
10245B9321N0677N9961J56678N5943k2673L8485J9318R69k9551r5001n7495j1230
10233A95402R354m5816j8687J6525j2504N686N2265O1734M1262P088K2827J6669
10221C51805M4309M8729L7968J11936J09209P0330M0845K5738L3443P7952J25972
10210A078236J19795K58905K79699K21038K04009K42508K44569K78839J73233
10201C100831O4966j457k40323l93242m97812n43838l80494k30603j66551j33992
$$ plain form
10281 16662 69780 103623 74817 3956 36981 90333 67699 29286 21265 41282 42216 38761
10269 38761 4575 -24788 -28511 -15112 28522 15310 18655 52398 72503 44880 -20383 -13717
10257 -13717 15168 9893 -41034 -23965 20542 6560 -44363 -16458 -14335 1152 20221 29321
10245 29321 79998 139959 296637 352580 329907 368392 387710 388679 359128 264127 206632 195402
10233 195402 204756 158940 140253 156778 144274 149960 202225 263959 305221 312309 335136 351805
10221 351805 396114 444843 482811 594747 703956 774286 815131 840869 874312 952264 1078236
10210 1078236 1198031 1456936 1736635 1957673 2161682 2404190 2648759 2927598 3100831
10201 3100831 3165797 3164340 2924017 2530775 2032963 1489125 1108631 878028 711477 577485
10191E77485q9739n2388m2127o6225o6933m9261p333O888k1283m6273j5112k6028
10179A01671N3976K249O809j8978j3451K8287K1791L7509N9276L9660K860J4343
10167C36002L004M1316P7934K6645M614J4065o2702o1710J4638o5454o6644J9721
10155B81429M0565J0685Q67M0982R714k2094N3150K0509p570k6240n3018k9573
10143C19406m3142L28l6868k1277J9221r336l0359q4948j5663J9042k0087p258
10131H9059K4348j1348j143o687m7152p71L3671P710p645J1035L7378l3018r0997
10118D440n1780O15N8449l8619L4703P1526M0K5161M0035k2632K31p3220k2381
10105B6568L613K4414k7233J7534M5404n48K0541K1048M7741M2741R150j2981
$$ plain form
10191 577485 487746 435358 393231 327006 260073 210812 203479 210367 189084 142811 127699 101671
10179 101671 155647 157896 164705 145727 132276 160563 182354 219863 279139 318799 321659 336002
10167 336002 339006 380322 458256 484901 489515 503580 440878 379168 393806 328352 261708 281429
10155 281429 321994 332679 333546 374528 384242 362148 415298 435807 428237 401997 348979 319406
10143 319406 276264 276592 239724 218447 237668 228332 197973 113025 97362 116404 96317 89059
10131 89059 113407 102059 100916 94229 47077 46306 79977 87687 80042 91077 128455 95437 4440
10118 4440 -47340 -46725 11724 -26895 7808 79334 79374 104535 144570 121938 122169 48949 26568
10105 26568 30181 54595 27362 44896 90300 89752 110293 131341 179082 221823 230973 217992
10093B17992o490R902k6645j842L0853P535k5045m8978p6106j3357M9262L3768
10081A50849M7254K2733J6415l5397j3207n1561l243j8495J6413m2446m2862J212
10069D7665P743K0627K805N1795n33m6506l6018n0404P1602K2519l9563k0768
10057C0964p305J4689N7036J4988M6098K7692o7293n8506M63n7966j660J7040
10045A6240j8486J8376k1773l2847l7881J6376J3376m1320L2196Q6855N7357M0585
10033A29054m2705n9991M8676m2122p4421j6355L3053K1545p338M4199O1787P035
10021A02417m3679J00N6280j9730q6740k8975o679L9346L5404l7742o823J9440
10009B2619J4017J20573O5911k7678M5017K0103J49N4598P2369M2648l3587n8086
$$ plain form
10093 217992 211502 221404 194759 192917 223770 231305 206260 157282 81176 67819 117081 150849
10081 150849 198103 220836 237251 201854 188647 137086 133843 115348 131761 89315 46453 47665
10069 47665 55408 76035 78840 130635 130102 83596 47578 -2826 68776 91295 51732 30964
10057 30964 23659 38348 95384 110372 156470 184162 116869 58363 58826 860 -800 16240
10045 16240 -2246 16130 -5643 -38490 -76371 -59995 -46619 -87939 -55743 31112 88469 129054
10033 129054 86349 26358 75034 32912 -41509 -57864 -24811 -3266 -10604 33595 95382 102417
10021 102417 58738 58838 115118 95388 8648 -20327 -27006 12340 47744 10002 3179 22619
10009 22619 36636 157209 223120 195442 240459 260562 260711 315309 387678 430326 396739 338653
9997C38653r3616m6779j9544l9612j05773J6547r194n0673k4734j07616L6884
9986a05457N9507M4333R7811P02J0230L7354j042l6265m9839j8364K2718O3648
9974A25336L635j7163J6266m5573l6293l8013l3790J6697K5476M091m3L0666M3272
9961I4564J3220r651J02222n56K1017L4666L442l655L2626L1506J4975K6243L2896
9948C93515N2158j1645K1763J8755l2371J3929k4271j25636p8904q6102n760p023
9936A28408J3668k7273J078j6371m6867L8458K1669J5800l2309k6709J451n884
9924F5119o5766l0203M6919J5376L0871L6891L224L3386N2360p429q936r827q1819
9911H0166p82N8203P1205O8730J7548k9748N787K9901N162R696M5285K4569M5041
$$ plain form
9997 338653 245037 198258 178714 139102 33329 49876 40682 -9991 -34725 -142341 -105457
9986 -105457 -45950 -1617 96194 96896 107126 144480 143438 107173 57334 38970 61688 125336
9974 125336 128971 111808 128074 82501 46208 8195 -25595 -8898 16578 20669 20626 51292 94564
9961 94564 107784 98133 200355 199799 220816 255482 258924 255269 287895 319401 334376 360619 393515
9948 393515 445673 434028 455791 474546 442175 456104 431833 306197 227293 141191 135431 128408
9936 128408 142076 114803 115881 99510 52643 91101 112770 128570 96261 69552 71003 65119
9924 65119 -647 -30850 16069 31445 62316 99207 102431 135817 188177 180748 171812 161985 80166
9911 80166 79384 137587 208792 277522 295070 265322 271109 301010 306172 315868 361153 385722 430763
9898D30763L2937K6753O162L7488L0362l5566q375k5714p3607m2574N909q841
9886C75697p1549l4229l5787L8090j2968L2424L7695J7109L5428j6556k3121k7981
9874C14252P1387M9878J58P1277L2404N3856j1837O3824M4658L9842J17904J21842
9862I69445J47250J55239K04581L05732M66740K94878R5971J22113J30728K16906
9852C109583L02560L46764N82421P69633R72526J153288J415295J727668K067160
9843A2446898K426694K958270L510757L997355M364416M628663N112478O096116
9835D5541647O510663L332746k534092o531221p325508o044247m031012k108324
9827B6810652p73844Q6225P59492J225151J583796J786789J527640N49496j007050
$$ plain form
9898 430763 463700 490453 496615 534103 564465 528899 520524 494810 421203 378629 384538 375697
9886 375697 304148 269919 234132 272222 259254 291678 329373 346482 381910 365354 342233 314252
9874 314252 385639 435517 435675 506952 539356 593212 581375 645199 689857 729699 847603 969445
9862 969445 1116695 1271934 1476515 1782247 2248987 2543865 2639836 2761949 2892677 3109583
9852 3109583 3412143 3758907 4341328 5110961 6083487 7236775 8652070 10379738 12446898
9843 12446898 14873592 17831862 21342619 25339974 29704390 34333053 39445531 45541647
9835 45541647 52052310 55385056 52850964 46319743 38994235 32949988 28918976 26810652
9827 26810652 26036808 26123033 26882525 28107676 29691472 31478261 33005901 33555397 32548347
9818C2548347k368775k986020k976231k528200k034765j746686j723143j715105
9810A4469422j596997j334246j098878q04707n24988m76461q14088r60992r45919
9801E912146p17394m94755k79252j96233j09754n8335k5670m9336k3154q382K0954
9790C970835K8266k2279n6829O827N3790P3759J86565K56387K91450M61261P36774
9779E986806R12033J048754J378437J749011K095918K269578K452935K774147
9771B0667619L261853L850441M462519M793680M917225M622494L866458K548585
9763E2990874J184490j2645p75178j274824j348583j204426q75720m51062q4529
9754D8148397M36701Q74378J135000J156391J028804R12033O96720O7423j006284
$$ plain form
9818 32548347 30179572 27193552 24217321 21689121 19654356 17907670 16184527 14469422
9810 14469422 12872425 11538179 10439301 9634594 9109606 8633145 7819057 6858065 5912146
9801 5912146 5194752 4699997 4420745 4224512 4114758 4056423 4030753 3981417 3958263 3949881 3970835
9790 3970835 3999101 3976822 3919993 3926820 3980610 4054369 4240934 4497321 4788771 5250032 5986806
9779 5986806 6898839 7947593 9326030 11075041 13170959 15440537 17893472 20667619
9771 20667619 23929472 27779913 32242432 37036112 41953337 46575831 50442289 52990874
9763 52990874 54175364 54162719 53387541 52112717 50764134 49559708 48683988 48232926 48148397
9754 48148397 48585098 49459476 50594476 51750867 52779671 53691704 54388424 54455847 53449563
9745E3449563k026574k961900l519299l771597l826850l628152l519808l401927
9737B6793456l251972l126098k759691k509342k247989j806516j406505j088183
9729H597160q74390o73416n56476m52256l78686l40788j93278r7438r6932l6622
9719D896878j1569m5000j09226j60787p5904j29069j14942m1619o473J12285J22753
9708D437327K30205L30803M43998N39350O58511P30665R25353J070285J229387
9699A0595884J329724J296494J514678J943551K354185K763906K964354K732416
9691B7495192K078262J104840J48354m58110q22478j047518j193419j068747q01733
9682B5434643l92578K02212O79182J042394J269392J361280J163470M46379n51117
$$ plain form
9745 53449563 51422989 48461089 44941790 41170193 37343343 33715191 30195383 26793456
9737 26793456 23541484 20415386 17655695 15146353 12898364 11091848 9685343 8597160
9729 8597160 7722770 7049354 6492878 6040622 5661936 5321148 5127870 5030432 4933500 4896878
9719 4896878 4885309 4840309 4731083 4570296 4494392 4365323 4250381 4208762 4202289 4314574 4437327
9708 4437327 4667532 4998335 5442333 5981683 6640194 7370859 8296212 9366497 10595884
9699 10595884 11925608 13222102 14736780 16680331 19034516 21798422 24762776 27495192
9691 27495192 29573454 30678294 30826648 30368538 29546060 28498542 27305123 26236376 25434643
9682 25434643 25042065 25244277 25923459 26965853 28235245 29596525 30759995 31206374 30655257
9673C0655257j685459k456048k815989k825086k561899k280289j905227j585838
9665A2539422j370461j190161j120816j017748q88941q63121q40884o63898o18669
9656C964723m47810k84619k98361k11774k28215j57664j71844j28981o8540n5899
9646A911016j45605j60909j46266m6410l8851p3990o4502p5286p2745n8912j6627
9635A010913k7364L1458L8056p5443n8969m0175p4790J0101J8969o6260p2389
9624F94107m7815K1578K286M905j5605j0018o5431q4898K8204N2290J6238K6355
9612F22196j6525o831m259m3786j8595j6539n8423j1635J1205n531o348j0187
9600D34742j7780J1042J4049q894Q161k9315l2992J358N2166m0145j5594l523
$$ plain form
9673 30655257 28969798 26513750 23697761 20872675 18310776 16030487 14125260 12539422
9665 12539422 11168961 9978800 8857984 7840236 6951295 6088174 5247290 4583392 3964723
9656 3964723 3516913 3232294 2933933 2722159 2493944 2336280 2164436 2035455 1966915 1911016
9646 1911016 1765411 1604502 1458236 1411826 1372975 1298985 1234483 1159197 1086452 1027540 1010913
9635 1010913 983549 1015007 1053063 977620 918651 878476 803686 813787 832756 766496 694107
9624 694107 646292 667870 670156 675061 659456 649438 584007 499109 527313 579603 595841 622196
9612 622196 605671 598840 594581 550795 532200 515661 457238 445603 456808 451277 444929 434742
9600 434742 416962 428004 442053 433159 441320 412005 379013 380371 432537 392392 376798 373275
9588C73275N6450K3358K8995n435n5303k0067m4456j6982Q855j9118Q270K6584
9576C64426P7330K6209j1472N1078l516l0724k578k3647j8034l7034j9075m635
9564C68328K8550M4650k1134m0104k7590J8892J8428j1559j3531J8705M7186J3713
9552D44534l3594o4897k026k7467o397l064P0840Q5198l2325q1826q5627k9907
9540B33442M1840P7673j4387k358Q161m8675o9103q1323K2483J03742n67r839
9528B61089k2738j3309J0003l597N6134P6230l3842k9958l4414J4327M2439n1716
9516B70648j0665L0117j367J6918L31n5474L3246K5200k8432J9759Q732K1807
9504C30820j2161l0656o2051j3102N1427j5655m5267L0803q549o2553j765P0408
$$ plain form
9588 373275 429725 453083 482078 476643 421340 401273 356817 339835 348690 329572 337842 364426
9576 364426 441756 467965 456493 507571 504055 473331 470753 447106 429072 392038 372963 368328
9564 368328 396878 441528 420394 380290 352700 371592 390020 378461 364930 383635 430821 444534
9552 444534 410940 346043 344017 316550 310153 307089 377929 463127 430802 348976 263349 233442
9540 233442 275282 352955 338568 336210 344371 295696 226593 145270 167753 271495 270928 261089
9528 261089 238351 225042 235045 231448 287582 363812 329970 300012 265598 279925 322364 270648
9516 270648 259983 290100 288733 305651 305982 250508 283754 308954 280522 300281 309013 330820
9504 330820 318659 288003 225952 212850 264277 248622 203355 234158 225609 163056 161291 231699
9492B31699N8625J000k6828o374r889j9861r5646n740N7258Q457J4942l402O3127
9479B67368J2825o091r49j9325O0440N5825k6247j9278J4055l344N3032n130k9836
9466C53345J4187o760n8425j1900r93n3092P883J7241N3908L4892k1595R946P3313
9453D11950L4151o5082j14438j2412J02504O0205j347L207O1559O428n08K0665
9441E06882K3745j0791K778R1137l5989K4252N1237j243N8149Q2430M6910M5936
9429H85433Q8421N5107K8983J02395J00846J63127K19238J65805J93851K50187
9419B253393L23227L84940M49765N23830O42743O73298N70897L84075K96634K11795
9409F714597J91370L07473M55947O04885O96380Q47638R80755J107488J202586
$$ plain form
9492 231699 290324 291324 264496 258122 248233 228372 132726 126986 184244 192701 207643 204241 267368
9479 267368 280193 274102 273153 253828 314268 370093 343846 324568 338623 335279 388311 383181 353345
9466 353345 367532 360772 302347 290447 289454 236362 244245 261486 315394 350286 328691 338637 411950
9453 411950 446101 381019 266581 254169 356673 416878 415531 418738 480297 486725 486217 506882
9441 506882 530627 519836 522614 613751 577762 602014 653251 652008 710157 792587 839497 885433
9429 885433 973854 1028961 1057944 1160339 1261185 1424312 1643550 1809355 2003206 2253393
9419 2253393 2576620 2961560 3411325 3935155 4577898 5251196 5822093 6206168 6502802 6714597
9409 6714597 6905967 7213440 7669387 8274272 8970652 9818290 10799045 11906533 13109119
9400A3109119J371298J486561J553252J568859J496909J258955R73657O17400
9392B3436010M08192M31469N86120P40475Q70802Q52683P46284O33030O10689
9383B9315754P31459P81792N30461J05704k32504n77069o37022n69122k32073
9374B9217380K8836K05109K34367L02894L53857L16991L19592J55844j59629m00060
9364C0575181o20352q49357j018916j100445j167592j206892j270858j140462
9356B2200307j019708q85465p73768p26567o21056n26433m53705m43658n03214
9347A6246733n77500o09474n16289n15911k95301j23870l5549O8637J7420J38288
9337A3797184L20488L35651M22422L71895K41709J19819p1668j46076p2347K16147
$$ plain form
9400 13109119 14480417 15966978 17520230 19089089 20585998 21844953 22818610 23436010
9392 23436010 23844202 24275671 24861791 25602266 26473068 27325751 28072035 28705065 29315754
9383 29315754 30047213 30829005 31359466 31465170 31232666 30655597 30018575 29449453 29217380
9374 29217380 29246216 29451325 29685692 29988586 30342443 30659434 30979026 31134870 30975241 30575181
9364 30575181 29954829 29105472 28086556 26986111 25818519 24611627 23340769 22200307
9356 22200307 21180599 20295134 19521366 18794799 18173743 17647310 17193605 16749947 16246733
9347 16246733 15669233 15059759 14543470 14027559 13732258 13608388 13572839 13641476 13658896 13797184
9337 13797184 14117672 14453323 14875745 15247640 15489349 15609168 15537500 15391424 15319077 15535224
9327A5535224L00613M21231N50241P49361J065731J307247J628190J799887J955831
9318B5313556K175752K221611K019588J563509R77552L92428M2490p7498R1476
9309C4720464L60121M23426M69859L22710K29724K44682L50252M96066N43209
9300C8160513L38359J10847p4117l31902k35435j24480l1879M2492J06198J13615
9290C8074211J10505R7035L8198j18851j46359k35346n63372r53958j250509j501759
9280C3549795j641788j663186j709593j686366j601245j432444j230459r69888
9272B1614826o74876n57406n19424m63722n06556o99022q04836r39118j037572
9263A5412294r97950r61006q98486p83556p45597q05669q81516p46224o16996
$$ plain form
9327 15535224 15835837 16257068 16807309 17556670 18622401 19929648 21557838 23357725 25313556
9318 25313556 27489308 29710919 31730507 33294016 34271568 34663996 34706486 34628988 34720464
9309 34720464 35080585 35504011 35973870 36296580 36526304 36770986 37121238 37617304 38160513
9300 38160513 38498872 38609719 38535602 38203700 37968265 37843785 37811906 37854398 37960596 38074211
9290 38074211 38184716 38281751 38319949 38201098 38054739 37819393 37256021 36302063 35051554 33549795
9280 33549795 31908007 30244821 28535228 26848862 25247617 23815173 22584714 21614826
9272 21614826 20939950 20382544 19863120 19399398 18892842 18193820 17388984 16449866 15412294
9263 15412294 14414344 13453338 12554852 11771296 11025699 10220030 9338514 8592290 7975294
9254G975294n74361m20186m24804k59966k63545l03375k28552j33073j05753j13760
9244E147919n6156q7787j03118j50472j86881j94603j17649j70115j14787l6355
9234C929996j08226q1583p6662m6520p5898r7214j89706j88889j39797p3243j16485
9223B735773n0908j24593j11320l5967j4910K437m5863k9425n2319n6792K2496
9212B238609j2418n0367j0776k1539o281m9420n8998m0935k728P3138Q5521K5266
9200B169072k4318n5759j00040k0182p746m1205j0453j0646l8347p3972p8306
9189A708098l9968K433l3772k3073K510K5623O9725L6684O7048K2766P2555O6424
9177A977053J0828m4103o1126j2624M537j9335k1856o4611j5179L6073K7150m0789
$$ plain form
9254 7975294 7400933 6980747 6555943 6295977 6032432 5729057 5500505 5367432 5261679 5147919
9244 5147919 5091763 5003976 4900858 4750386 4563505 4368902 4251253 4081138 3966351 3929996
9234 3929996 3821770 3740187 3663525 3617005 3541107 3443893 3254187 3065298 2925501 2852258 2735773
9223 2735773 2684865 2560272 2448952 2412985 2398075 2400512 2354649 2325224 2272905 2216113 2238609
9212 2238609 2226191 2175824 2165048 2143509 2137228 2087808 2028810 1987875 1985147 2058285 2143806 2169072
9200 2169072 2144754 2088995 1988955 1968773 1961027 1919822 1909369 1898723 1860376 1786404 1708098
9189 1708098 1668130 1670563 1636791 1613718 1616228 1641851 1711576 1748260 1815308 1838074 1910629 1977053
9177 1977053 1987881 1943778 1882652 1870028 1874565 1855230 1833374 1768763 1753584 1789657 1816807 1776018
9165A776018K2311N8027J5580L539K185Q769N6778r302l890L7495O766j8739J07601
9152B063138N6575M2661M2154J20651M9999K7303Q0425j174L325M9684J17863
9141B652604R2152J1359R804O2527O5294L028l3347j950J24032J54171O8162l1243
9129C176593J5121J02491L8338J0677P2069R8527N1447R3304Q1818O7625R1737
9118C899747J25496J70376J51030J19763K07307K09716K22656K15494L05602L35458
9108E962645L43678L84604L86225M38331M81410M88645N12112M59411L24829K65263
9098A0047153J88512J60504K79941K94409L53413M42486N95913P15313Q06510
9089A3884154Q26490R06329J036210J130057J268649J438129J603311J832088
$$ plain form
9165 1776018 1798329 1856356 1871936 1875475 1877660 1886429 1943207 1933905 1930015 1967510 1974276 1955537 2063138
9152 2063138 2119713 2162374 2204528 2325179 2375178 2402481 2482906 2481732 2485057 2534741 2652604
9141 2652604 2744756 2756115 2765919 2828446 2893740 2896768 2863421 2861471 2985503 3139674 3207836 3176593
9129 3176593 3191714 3294205 3332543 3343220 3415289 3513816 3565263 3658567 3740385 3808010 3899747
9118 3899747 4025243 4195619 4346649 4466412 4673719 4883435 5106091 5321585 5627187 5962645
9108 5962645 6306323 6690927 7077152 7515483 7996893 8485538 8997650 9457061 9781890 10047153
9098 10047153 10235665 10396169 10676110 10970519 11323932 11766418 12362331 13077644 13884154
9089 13884154 14710644 15616973 16653183 17783240 19051889 20490018 22093329 23925417
9081B3925417K014980K090764K226150K349039K323475K331108K323752K348450
9073D1933135K311274K238952K207863K135611J823684J405872J048392O63449
9065E5768232K00154k01140n34883r78921j412852j876993k261854k543456k737405
9056D3420882k739241k681969k646029k502312k242737k102276j937066j718407
9048B4850845j552193j356833j140778r36443q32950o81542l80135k45920k11495
9039A7512556p8372o8977k24093m51989o96935p50171p15417n45225l68096k46508
9029A3366773k50766k75548l96871n29803n37945m42095l45105j86902k08548
9020A0193190k06840j38082j27418p0205o5159j39648j70559k13930q8983Q6964
$$ plain form
9081 23925417 25940397 28031161 30257311 32606350 34929825 37260933 39584685 41933135
9073 41933135 44244409 46483361 48691224 50826835 52650519 54056391 55104783 55768232
9065 55768232 55968386 55767246 55232363 54253442 52840590 50963597 48701743 46158287 43420882
9056 43420882 40681641 37999672 35353643 32851331 30608594 28506318 26569252 24850845
9048 24850845 23298652 21941819 20801041 19864598 19031648 18350106 17969971 17724051 17512556
9039 17512556 17434184 17365207 17141114 16689125 15992190 15242019 14526602 13981377 13613281 13366773
9029 13366773 13116007 12840459 12443588 11913785 11375840 10933745 10588640 10401738 10193190
9020 10193190 9986350 9848268 9720850 9650645 9585486 9445838 9275279 9061349 8972366 9059330
9010I059330L07665O05320P06592P28083O37008K67877k87452n69460n47911n13682
9000A0393370l88939j96742p1161K2042l4403O766N9451J62194L08407M76006
8990A0736991N89330O56885M99331J91436j14807k94844m92645n71917n94415
8981A0605345n61974n10934m29942k80596j43039j25696p3095P2735J00998K79067
8971H932869P07916J097623J462091J838503J862668J322485L49532o33753j255192
8962A5684742j502628j337751r37981n73375k34162P9040J29807J4984k11127
8953A1111549l38320l86575k47605q6047Q5155J20374J71524K01989J11721r9779
8943A0643986l37993l31382l40642k32817j4795K59409M74704O78140Q86740Q66394
$$ plain form
9010 9059330 9366995 9972315 10678907 11406990 12043998 12311875 12024423 11454963 10907052 10393370
9000 10393370 10004431 9807689 9736528 9758570 9724167 9730933 9790384 9952578 10260985 10736991
8990 10736991 11326321 11983206 12482537 12673973 12559166 12264322 11771677 11199760 10605345
8981 10605345 10043371 9532437 9102495 8821899 8678860 8553164 8480069 8552804 8653802 8932869
8971 8932869 9640785 10738408 12200499 14039002 15901670 17224155 17573687 16939934 15684742
8962 15684742 14182114 12844363 11906382 11333007 11098845 11177885 11307692 11322676 11111549
8953 11111549 10773229 10386654 10139049 10053002 10138157 10258531 10430055 10632044 10743765 10643986
8943 10643986 10305993 9974611 9633969 9401152 9386357 9645766 10120470 10798610 11685350 12551744
8933A2551744O32708J59233k10793l58428k68777j88574j79248j91574l92032
8924A1554259o71142p46527o37540l37131o6316L68015Q31775J206539J281620
8915A2783552J049285N72547m9227n63457q76957r69556j007823q92262p37799
8906I308303o09223n02465m02421j42570k4199J33814M08332P50289J171416J668068
8896A1759344K168211K424083J949488P82078n70471j674679k160525k161408
8888A2516121j806040j335558r38937o44647l91719j38582K1828K56437N80385
8879H119288R80623J559583K097732K821577L649364M487223N191543M167748
8871C3074681k30354m176327n674672n199358m021149k783750j833247j112818
$$ plain form
8933 12551744 13184452 13343685 13132892 12774464 12505687 12317113 12137865 11946291 11554259
8924 11554259 10883117 10136590 9499050 9161919 9095603 9463618 10295393 11501932 12783552
8915 12783552 13832837 14405384 14356157 13792700 12915743 11946187 10938364 10046102 9308303
8906 9308303 8699080 8196615 7794194 7651624 7627425 7761239 8169571 8919860 10091276 11759344
8896 11759344 13927555 16351638 18301126 19083204 18512733 16838054 14677529 12516121
8888 12516121 10710081 9374523 8435586 7790939 7399220 7260638 7282466 7538903 8119288
8879 8119288 9099911 10659494 12757226 15578803 19228167 23715390 28906933 33074681
8871 33074681 32844327 28668000 22993328 17793970 13772821 10989071 9155824 8043006
8863H043006p19022m02486o5762K05757M46754P18633Q83968R58278O62428J57122
8853A0888676n18613r99560j111661j042302r19632q02691n31158m12540l11980
8844D238539r3897M9290K29703L27696M67519M47586M14256K61355l261k00148
8834F138638k61514k75803m27548m96279l33767k83687k48275q3816m1917l9134
8824C646898r212M7572J25922P3764J36052K16682J39743J70748K38393M12498
8814E199060N03572O40570Q82010J180709J621834K055042K626052L094906L022282
8805B0826037K406358J400237J97640q16023j223880j344780j492545j688019
8797A8265025j766238j717056j605741j341539j130467p85257l85463n5296L92977
$$ plain form
8863 8043006 7323984 6921498 6855736 7061493 7508247 8226880 9110848 10069126 10731554 10888676
8853 10888676 10370063 9370503 8258842 7216540 6296908 5494217 4963059 4550519 4238539
8844 4238539 4144642 4193932 4423635 4751331 5218850 5666436 6080692 6342047 6338786 6138638
8834 6138638 5877124 5601321 5173773 4677494 4343727 4060040 3811765 3727949 3686032 3646898
8824 3646898 3637686 3685258 3811180 3884944 4020996 4237678 4377421 4548169 4786562 5199060
8814 5199060 5702632 6343202 7225212 8405921 10027755 12082797 14708849 17803755 20826037
8805 20826037 23232395 24632632 24830272 24014249 22790369 21445589 19953044 18265025
8797 18265025 16498787 14781731 13175990 11834451 10703984 9918727 9533264 9477968 9870945
8788I870945O95782R84943J308534J539356J824610K044806K024844J601885Q60410
8779B2756115o7395q23451j256950j353737j238305j314213j492101j632612j601783
8770A1975568j580204j399931j134566q82128p12897n11239l97644l05520k45361
8761D806078j14853q5115n5629r9738n8010L8121K3866R4677J19457Q4141R5191
8750D848186J85564K40033K87953L18871M05635M66195N33411P09637Q43206J044981
8740I883672J231505J490177J713487K092871K290983K596486K517132K381199
8732B6197512K391864K528531K607589K518580K306795J663860O64838o92608
8724D0186961j875915k576994k972929l068274k781211k310698j874668j338407
$$ plain form
8788 9870945 10566727 11551670 12860204 14399560 16224170 18268976 20293820 21895705 22756115
8779 22756115 22688720 21865269 20608319 19254582 18016277 16702064 15209963 13577351 11975568
8770 11975568 10395364 8995433 7860867 6978739 6265842 5754603 5356959 5051439 4806078
8761 4806078 4691225 4606110 4550481 4450743 4392733 4430854 4454720 4549397 4668854 4752995 4848186
8750 4848186 5033750 5273783 5561736 5880607 6286242 6752437 7285848 7995485 8838691 9883672
8740 9883672 11115177 12605354 14318841 16411712 18702695 21299181 23816313 26197512
8732 26197512 28589376 31117907 33725496 36244076 38550871 40214731 40879569 40186961
8724 40186961 38311046 35734052 32761123 29692849 26911638 24600940 22726272 21387865
8716B1387865q05996l57840K19823P17307J151724J553839J953937K089685K019611
8707B9929955K079559K016734J983580J852353J218385L24303p89294j937848
8699C6677727k797494l355516l532071l268859k890460k491131k217311k031066
8691A4093819j779020j509423j265342j056307q65426p11378n35575l72188l40875
8682E658285l52206j72791j33861j23619o7943k8789L0039M698P3300J79384L32239
8671E398736N19814O78554P95570Q74078Q66601Q20286O75812N68447N72905P71374
8661A2542177R87208J261026J598176J689288J655141J436074J242314J164129
8653B3575533J156571J148973Q92946N71982Q9081m27583r31016j217696j426203
$$ plain form
8716 21387865 20581869 20224029 20443852 21161159 22312883 23866722 25820659 27910344 29929955
8707 29929955 32009514 34026248 36009828 37862181 39080566 39404869 38615575 36677727
8699 36677727 33880233 30524717 26992646 23723787 20833327 18342196 16124885 14093819
8691 14093819 12314799 10805376 9540034 8483727 7618301 6906923 6371348 5999160 5658285
8682 5658285 5306079 5133288 4999427 4875808 4807865 4779076 4809115 4813813 4887113 5066497 5398736
8671 5398736 5918550 6597104 7392674 8266752 9133353 9953639 10629451 11197898 11770803 12542177
8661 12542177 13529385 14790411 16388587 18077875 19733016 21169090 22411404 23575533
8653 23575533 24732104 25881077 26774023 27346005 27435086 27007503 26076487 24858791 23432588
8644B3432588j509765j420495j268538j023631p32247n72972l03973J12729M39125
8635A7152821P78326J050435J145214J105978R97385R71139R65782R68896Q58739
8626B5994715N24353J91779k77327q81445j560484k008053k376513k524809k356566
8617A4725650k017387j858940j571098j312837j040683q41796o22012m56782l81921
8608D622194l03633k90239k13202k07350j93551j70957j27163j18445j57776q6472
8598B753406m7372m8864j7407N4811N3224P1098R8688J39925K67085L22579L06570
8587C953743L36717L92816M35174M69691M78032L41674K81984M05131N39100N07213
8577H141275M10690K67466J6293k81514m28652n45588o08929n92106o54565o78251
$$ plain form
8644 23432588 21922823 20502328 19233790 18210159 17477912 16904940 16600967 16713696 17152821
8635 17152821 17931147 18981582 20126796 21232774 22230159 23201298 24167080 25135976 25994715
8626 25994715 26519068 26710847 26433520 25552075 23991591 21983538 19607025 17082216 14725650
8617 14725650 12708263 10849323 9278225 7965388 6924705 6082909 5460897 5004115 4622194
8608 4622194 4318561 4028322 3815120 3607770 3414219 3243262 3116099 2997654 2839878 2753406
8598 2753406 2706034 2657170 2639763 2694574 2747798 2818896 2917584 3057509 3324594 3647173 3953743
8587 3953743 4290460 4683276 5118450 5588141 6066173 6407847 6689831 7094962 7634062 8141275
8577 8141275 8551965 8819431 8835724 8554210 8125558 7579970 6971041 6378935 5724370 5046119
8567E046119m84043l96220k67602j09176J3865J49458K67673L31698L97355M98110
8557E447237N93029O86720P13147O73106N90904M05744K511l26798o40548p93570
8547G351482p76338o82709p22417p11781o04898n13222m04648l42991k98552k26285
8537B067641j91367j59537j28840j44105j20528q4334m4357p9278m9727m2502
8527A023066k2008n5040n3512l9079r2764n8699l7518m560K1790l6739j3726J2618
8515F43829m2638k5019J3951J39287k0279j6718J0571n7459l2022k0836l2266
8504E60401l7766M3902o175k7879n7193l3801n9504J223m5767K5199M319J3371
8492C80330L1951l1676L021k5747N6877N4528L6081K9606k7513l6373m4700q2715
$$ plain form
8567 5046119 4562076 4165856 3898254 3789078 3802943 3952401 4220074 4551772 4949127 5447237
8557 5447237 6040266 6726986 7440133 8113239 8704143 9109887 9112398 8785600 8145052 7351482
8547 7351482 6575144 5892435 5170018 4458237 3853339 3340117 2935469 2592478 2293926 2067641
8537 2067641 1876274 1716737 1587897 1443792 1323264 1238930 1194573 1115295 1065568 1023066
8527 1023066 1001058 946018 892506 853427 760663 701964 664446 659886 681676 644937 631211 643829
8515 643829 601191 576172 590123 729410 709131 692413 702984 645525 613503 592667 560401
8504 560401 522635 566537 560362 532483 475290 441489 381985 383208 337441 362640 366959 380330
8492 380330 412281 380605 383626 357879 414756 469284 505365 534971 507458 471085 426385 343670
8480C43670L4281L3486l1297o2806L6294O7579K0694P9949O6085n2144j2441J0883
8468E34233L7751K7385r1673m3094K9570J1749J1155J2528K2759k1522M0093J276
8456E72210n1123p7943l8428m0450n8866j475r52k5004K0827M3501R8451L5230
8444D75978m4917o3350j9090k3668M5990K3446L0071k0476J0146m425K6801K2471
8432D58977Q566J390k40l2471l908J5391k2479n0103k2306j3855K0727q425m9472
8419C01792N1211P165m4867j3998L7407K0183k3405o44R18L0042O390J2246M3804
8406D28244L1266K0341k565O308p1690k9535L4390M4611q555j5793l2132K1350
8394D26240K9610k5511l191n1993n584O6382L0245J190J2760J4486Q80k8601o4997
$$ plain form
8480 343670 377951 411437 380140 317334 353628 421207 441901 521850 587935 535791 523350 534233
8468 534233 571984 599369 507696 464602 494172 505921 517076 529604 552363 530841 570934 572210
8456 572210 521087 443144 404716 364266 305400 303925 302973 277969 298796 342297 440748 475978
8444 475978 431061 367711 348621 324953 370943 394389 424460 403984 414130 409705 436506 458977
8432 458977 467543 468933 468693 436222 432314 447705 425226 375123 352817 338962 359689 351264 301792
8419 301792 353003 360168 315301 301303 338710 358893 335488 334844 335762 365804 372194 384440 428244
8406 428244 459510 479851 477286 483594 411904 382369 416759 461370 452815 437022 404890 426240
8394 426240 455850 430339 427148 375155 369571 435953 466198 467388 480148 494634 495514 466913 401916
8381D01916q4380l9921J7972J5735K1598Q0468K2730M6255j0898o2042l7616J5197
8369C87014O5426K2076l9063j9179N9415j5043k0502L5845k0515q0040m0999L5719
8357C70154R4291O944k9582J4193J8883K1137l5272k9559m9042k7695k5328O656
8345C35780J2942J3016M0123k5592m9121m5853M0875P8632M0745k147Q352l2139
8333D15613j2153Q3463N6365L2374j6393m2972o2957q2744l1613K6682o4220K6837
8321C28282M3331m222M4245q881j3617n1987k9608P602L4608L6341j4425n6054
8309C15615m3495K456k2133j4189K7754L460K5816P501L7498l0397m3929n5894
8297B10063K6816K9206j7832N567n7097N8943P0712n3453m1927j1038M5970j86
$$ plain form
8381 401916 317536 277615 295587 311322 332920 413388 436118 482373 471475 409433 371817 387014
8369 387014 452440 474516 435453 416274 475689 460646 440144 475989 455474 375434 334435 370154
8357 370154 464445 471389 441807 456000 474883 496020 460748 431189 382147 354452 329124 335780
8345 335780 348722 361738 401861 376269 327148 281295 322170 400802 441547 439400 447752 415613
8333 415613 403460 486923 543288 575662 559269 516297 453340 370596 338983 365665 301445 328282
8321 328282 371613 367391 411636 402755 389138 337151 307543 315145 349753 386094 371669 315615
8309 315615 272120 274576 252443 238254 266008 269468 295284 302785 340283 309886 265957 210063
8297 210063 236879 266085 248253 253820 196723 255666 326378 272925 230998 219960 265930 265744
8285B65744K4791O7904Q0086O4443n2875p8889o4157n3918j7864j5096l1459J2191
8273B00901j5103K9439k2508j5729n416j6371M3160J4909j4276l7181K5356M6598
8261B33779O3885O0781k4798p8598p5189K978J8991M9102N9584N8542N5282L2031
8249D56370l9699m5604k9863o0056j2997j4484M5374O5944N3674P057o2775k4679
8237C38262Q742P382m3994m5825l7699l5378J9592N4604L7514J7107Q143N3872
8225C82322m6941q4358Q833M4876k192n1605p6058l489m5856l3331J5085J9349
8213A26635n395N6293L3382j28289J3842Q1753P74m4744K4043j7082l2235O9355
8201A78332K7405j6393J498j8116k2315P492o051M4989M2464k235L568k6458O900
$$ plain form
8285 265744 290535 358439 438525 502968 450093 371204 307047 253129 235265 220169 188710 200901
8273 200901 185798 215237 192729 177000 171584 155213 198373 213282 199006 161825 187181 233779
8261 233779 297664 358445 333647 255049 179860 182838 201829 250931 310515 369057 424339 456370
8249 456370 416671 371067 341204 281148 268151 253667 299041 364985 418659 425716 362941 338262
8237 338262 347004 354386 310392 264567 226868 191490 211082 265686 303200 320307 328450 382322
8225 382322 335381 251023 259856 304732 302540 250935 174877 171388 125532 92201 107286 126635
8213 126635 121240 177533 210915 82626 96468 178221 178995 134251 158294 141212 108977 178332
8201 178332 205737 189344 190842 172726 150411 157903 151852 196841 239305 237070 240638 214180 221080
8188B21080j6247o2266K0124O6661J2560m0517M5532j2959m4358K0833N1838m2532
8176B19749r4413K662L541J7421J9486o323k0653n0250N51R671j9601L7643O8955
8163A88439P258n3260J1240q077O393k9944o603L1556j3356L9735O0309j4569
8151B19121l2056O203j4174J5949p785L240j160O2054O2333J5183k259l580k7685
8138B95384l4365j3544L0485l3370J68O8624k1650l8331l8993l0361k2960J6801
8126A77888P632l6240j079n0383k1147k2839n0711m208O2802M8860k0926r232
8114H0417P2745L8055J4919p6636n7826J02498K8993l3287k0666l7627K4093K6800
8102A62478j8537p2771k8176j8503L8680J6825J2257J7157j2261j0337K294m6858
$$ plain form
8188 221080 204833 142567 162691 229352 241912 201395 246927 233968 189610 210443 262281 219749
8176 219749 125336 127998 131539 148960 168446 162123 141470 91220 91771 101442 81841 119484 188439
8163 188439 195697 142437 153677 145600 151993 122049 115446 147002 133646 173381 233690 219121
8151 219121 187065 193268 179094 195043 187258 190498 189338 251392 313725 328908 326649 323069 295384
8138 295384 261019 247475 277960 244590 244758 313382 291732 253401 214408 184047 161087 177888
8126 177888 185520 149280 148201 97818 76671 53832 3121 -1087 61715 110575 89649 80417
8114 80417 153162 191217 206136 129500 71674 174172 203165 169878 149212 111585 135678 162478
8102 162478 143941 71170 42994 24491 63171 79996 92253 109410 97149 86812 89106 42248
8090D2248j0838K8003k3512k3212P009m6146M2110P464j9039r43N8973M1166k1539
8077H1744m3969N0075M8907J5002L8070J9824o2624n9020p5782j6066M7119J0241
8065E3521j2368P4814K5523q4871l9048O8266L2299k6465k5000n0850M5757j9428
8053D2150K1961L702j7598J3851J0151l7116P2295M5241O7920j2938J4823l1245
8041A93197n1227J9736M2981m9109m3862K1885j3589j06083j6123P5518P0791
8030A44115n70r715J8297J7739k4234p0830M621L8152l6242r662L8841M20j8571
8017I2361O1426K4461k7364j8946O335O2160k9337k2009K0456O8913l7257n5655
8005A45544N5884j515J3082M7008K515k0770k2790J3614K008q1783K8520L4660
$$ plain form
8090 42248 31410 59413 35901 12689 19698 -26448 15662 23126 4087 3144 62117 103283 81744
8077 81744 37775 87850 136757 151759 189829 209653 147029 88009 12227 -3839 43280 53521
8065 53521 41153 115967 141490 56619 17571 85837 118136 91671 66671 15821 61578 42150
8053 42150 64111 67813 50215 64066 74217 37101 109396 154637 222557 209619 224442 193197
8041 193197 141970 161706 204687 155578 111716 133601 120012 13929 -2194 73324 144115
8030 144115 143545 133830 152127 169866 145632 74802 79423 117575 81333 71671 110512 110932 92361
8017 92361 153787 178248 150884 131938 138273 200433 171096 149087 169543 238456 201199 145544
8005 145544 201428 199913 212995 260003 262518 241748 218958 232572 234580 152797 181317 215977
7993B15977q708J5726L7356l2839n4712j5734n1235L0863N3017K3633j9855n9992
7981A33497o4625q4089O307j872N1835r549O353K2399M2889J9944M1531O2568
7969B27188k040L7533M2549m0045l2969k1868J555q961K525k5005k8576L6579
7957A88465K5491L660p3964m8915L4642J8254k4572n426q068r272n880K5951K1403
7944A41769r380R076J9358l6455J6889J2495M0420o009n262L129o3203l6051o6767
7931B0009n699O883Q5868J02037o674k6326o4413J0292J4886K2301O335m8550
7919A16949j8163P850j7380O8576L3393l0241r828n004j7637l3775n6550N6657
7907I4847k5863O010K1947k035J6529l6849n8300l4971J5377l613N5930K9716
$$ plain form
7993 215977 207269 222995 260351 227512 172800 157066 105831 136694 189711 213344 193489 133497
7981 133497 68872 -15217 -8910 -10782 41053 31504 37857 60256 103145 123089 164620 227188
7969 227188 225148 262681 305230 265185 232216 210348 211903 202942 205467 180462 151886 188465
7957 188465 213956 217616 143652 94737 129379 147633 123061 117635 109567 100295 94415 120366 141769
7944 141769 132389 141465 160823 124368 141257 153752 194172 188163 182901 186030 122827 86776 20009
7931 20009 14310 21193 107061 209098 202424 176098 111685 121977 136863 159164 165499 116949
7919 116949 98786 106636 89256 157832 191225 160984 151156 146152 128515 94740 38190 94847
7907 94847 68984 74994 96941 94906 111435 74586 16286 -18685 -3308 -6921 49009 78725
7895G8725L5348m944m8996O619P9213J6503k2380l9206k9298J0429L3685k1161
7883I4537j1829M9638k3991l3386J521Q8557M1789j2396m2437q3L5282q00k1098
7870A65304n3933n0804l2671o9620N943Q5705Q9682K0152L4325O850j0813l9820
7858A50300o9709k5432L2196L4377k4115m4889p5502L5294L4957j695K9335J2453
7846H7570J9912j2563n0293l2778N1320K6516n6557R820k2616N03M4435J878k3030
7833D4117Q2046k5359l2164l1180L8192M0106k0763n8697J318l5689R905J1869
7821B3701K9181j20J3963J9364M8182m9451K888j1901l3434J6491J4306M620L0243
7808A08033J3686p099K682l9119n4378L4497J8569O1842m7394n4551r175j0467
$$ plain form
7895 78725 114073 109129 60133 66752 145965 162468 140088 100882 71584 82013 115698 94537
7883 94537 82708 132346 108355 74969 76490 165047 206836 194440 152003 151920 187202 186402 165304
7870 165304 111371 60567 27896 -41724 -35781 49924 139606 159758 194083 200933 190120 150300
7858 150300 80591 55159 87355 121732 97617 52728 -22774 12520 47477 45782 75117 87570
7846 87570 107482 94919 44626 11848 63168 89684 33127 42947 20331 20834 65269 67147 44117
7833 44117 126163 100804 68640 37460 75652 115758 94995 36298 37616 1927 11832 23701
7821 23701 52882 52762 66725 86089 134271 84820 87708 75807 42373 58864 73170 77790 108033
7808 108033 121719 114620 117302 78183 23805 58302 76871 138713 91319 36768 27593 17126
7796A7126J3232J5146k1840J2228L7473L9132K2681k6762K95k4472k0821m9304
7784A4114J0501o233Q477l5966j500P081M906J9324l2851k1909M002L0698M5770
7771D6414O7080l561o5430q9376L573J4852K5978j3231J0345K456M8862N7245
7759A05207n2722l087j4566m327r309J7747P532J115K8044n5210o5027k9860J3624
7746f0839L1397K3286j7937o5237j6330L5325k8231O9554R5081k9688k2070J6480
7734C0791J6452K3730j4345l6298L2896k3458o5623L1571Q7261k0602m1502j3781
7722G092K3907m7073k745P5205k9230N1333M935l8657n0378K9298J9118J2988
7710E5793o9923l2244J9391j415L4610L4357O429o92L5889j9468j4365l919J9508
$$ plain form
7796 17126 30358 45504 23664 35892 73365 112497 135178 108416 108711 84239 63418 14114
7784 14114 24615 18382 26859 -9107 -10607 -3526 1380 20704 -12147 -34056 -30054 644 46414
7771 46414 113494 109933 44503 -44873 -41300 -26448 -470 -13701 -3356 -900 47962 105207
7759 105207 52485 49398 34832 30505 21196 38943 46475 47590 75634 20424 -44603 -74463 -60839
7746 -60839 -29442 -6156 -24093 -89330 -105660 -70335 -98566 -29012 66069 36381 14311 30791
7734 30791 47243 70973 56628 20330 53226 29768 -35855 -4284 82977 62375 20873 7092
7722 7092 30999 -16074 -18819 56386 27156 78489 83424 44767 -5611 23687 42805 55793
7710 55793 -14130 -46374 -26983 -28398 6212 40569 46998 46306 82195 62727 48362 44443 63951
7697F3951k7028n3841J7541O3348K1539p4725M8553R4892j2209q4077k9814K3382
7685E1512L7941M7858r289q2327m2747O299L1898J2160j1278K1173J2474j503
7673G4171m317k8136o8826Q324n509J5480M693P3554N0253k4446n0092N307n614
7660D4842q2879M7987Q9215N824l7954j7493K0180k1928O845k1377p281K3202
7648D9183j7190M154o105J6353O446n7925M156M9447j6808P885Q41m4043k5983
7635b9589p6255Q6578M9522M6806L3079j3925r8873k4319L5976k9017o6878J4092
7623g2803L8762R3547O8280n6101o6667m1903J1932k914m1937J3126J2917J6202
7611b7559N0193N820j4424o6972m014j7180p979K9858L2261n396l5457N8066K5770
$$ plain form
7697 63951 36923 -16918 623 63971 85510 10785 59338 154230 142021 57944 28130 51512
7685 51512 89453 137311 128022 45695 2948 9247 41145 53305 42027 63200 75674 74171
7673 74171 69854 41718 -27108 -18784 -24293 -8813 -4120 69434 119687 95241 45149 50456 44842
7660 44842 -38037 9950 99165 104989 67035 49542 69722 47794 54639 33262 25981 49183
7648 49183 31993 36147 30042 46395 52841 -5084 -928 48519 31711 39596 40437 -3606 -29589
7635 -29589 -105844 -19266 30256 77062 110141 96216 -2657 -26976 9000 -20017 -86895 -72803
7623 -72803 -34041 59506 127786 71685 5018 -36885 -24953 -27867 -69804 -56678 -43761 -27559
7611 -27559 22634 28454 14030 -52942 -56956 -74136 -82115 -52257 -19996 -25392 -60849 -2783 22987
7598B2987L1972M2420P088o0201l9426K5989q316k8944M0377p964M7035P6010
7586A49027K4754k6068m0470m9504o6258K959M021O104j7054l361M3876J8734
7574D6760K3585k1697P660l2544J6472J1940j3828m31j2381j7221J748L8545r193
7561C9415P246J0L1138n0871n6906M1527O2414p459L2687r741l5663K2696M6474
7548A22967J1725M4805n2098p4822p7971K0264p1994L6644N3800L3261k7661o9461
7536e0541K1832J4403j3072k2839n522N2650l5733K9639Q844J1319m2816j3848
7524d5684n6569K7250P0467K6660l3645j3492L8918l0232o924L3808m4504O3176
7512B9229N4398k3156l4319L7327O506l7714k7546j846L690l051K2560j9186P58
$$ plain form
7598 22987 54959 97379 104467 44266 4840 30829 22513 -6431 33946 25982 73017 149027
7586 149027 173781 147713 107243 57739 -8519 -5560 -1539 4565 -12489 -15850 28026 46760
7574 46760 70345 48648 56308 23764 40236 52176 38348 37917 25536 8315 10063 48608 39415
7561 39415 46661 46671 77809 26938 -29968 11559 73973 66514 99201 89460 53797 76493 122967
7548 122967 134692 179497 127399 52577 -25394 -5130 -77124 -40480 13320 46581 18920 -50541
7536 -50541 -28709 -14306 -27378 -50217 -55739 -3089 -38822 -9183 -339 10980 -31836 -45684
7524 -45684 -102253 -75003 -4536 22124 -11521 -25013 13905 -16327 -23251 10557 -33947 29229
7512 29229 83627 60471 26152 63479 69985 32271 4725 2879 6569 3518 26078 6892 7650
7499G650K3156J9968O340k4395n013J608n8886k1996N6322M1280K5394j0037k0389
7486D1002n677r8621j654J6359O4242N1267O6876m1997l850R487j9669l5108k5119
7473A7538K5011O7637L3898m6936o5644n1149m6932K7981M006J1091J1541J7042
7461E084K2312M0482r126j9505K7445j2968k5682j5329o3940k5387M8981P8995
7449E1362L8416n400K9446q398k0166O712j6839j6268L6946Q199k5660j2062J5320
7436H1608m4743j4962J2527P793o1802J176k1852k086k6868k9727Q0604P8055
7424E9723k9739k2667m833J0408k5811L5791k1309n3676k8698j3490K6992M5705
7412b1604K1547O3705k8202j1203j8966N1622Q0046k4065n6652k7591M954Q688
$$ plain form
7499 7650 30806 50774 57114 32719 27706 29314 -29572 -51568 4754 46034 71428 61391 41002
7486 41002 35325 -63296 -64950 -48591 15651 66918 133794 91797 87947 97434 77765 42657 17538
7473 17538 42549 110186 144084 97148 31504 -19645 -66577 -38596 -34590 -23499 -11958 5084
7461 5084 27396 67878 58752 39247 66692 53724 28042 12713 -51227 -76614 -27633 51362
7449 51362 89778 84378 113824 105426 85260 91972 75133 58865 95811 104010 78350 66288 81608
7436 81608 36865 21903 34430 42223 -19579 -18403 -40255 -42341 -69209 -98936 -18332 59723
7424 59723 29984 7317 2484 12892 -12919 22872 1563 -52113 -80811 -94301 -67309 -21604
7412 -21604 -57 63648 35446 24243 5277 56899 136945 112880 56228 28637 33591 42279
7400D2279j7825r757k3908j6612p0371M2905J03942K2475K3100n8043j2966J1376
7388C6595P0317J6798r985r552m2868q4118p9224l2086L7965M4022J5978M859
7376c1299K650J4198K7827O786K2854J02663m4277l4447N337o2811n4013j5399
7364e9931J5739J7289M2709M8489J860J8174Q6747r734j25485j6131M2650K7613
7352H9989l7765l9589M3458J1789m2497M5028J9354J4452L1057K1792o2325K3956
7340A18699j0058o6912N220L9078j9074L3404n859p6293k530M8014j0413P891
7328F1167j8248k53L506l4754m8639k4643N5177N264l969k7045Q373P4594R157
7315E9687l9182k5937m9725l6923N9294K4092k5924M9671k2608k0670k4513J2085
$$ plain form
7400 42279 24454 14697 -9211 -25823 -96194 -53289 50653 73128 96228 38185 25219 36595
7388 36595 106912 123710 113725 104173 61305 -22813 -102037 -134123 -96158 -52136 -36158 -31299
7376 -31299 -28649 -14451 13376 20162 43016 145679 101402 66955 72292 9481 -44532 -59931
7364 -59931 -44192 -26903 15806 64295 66155 84329 171076 161342 35857 19726 62376 89989
7352 89989 52224 12635 56093 67882 25385 70413 89767 104219 135276 157068 94743 118699
7340 118699 108641 41729 46949 86027 66953 100357 94498 18205 15675 63689 53276 61167
7328 61167 42919 42666 46172 11418 -37221 -61864 -6687 -1423 -5392 -32437 -24064 50530 59687
7315 59687 20505 -5432 -55157 -92080 -32786 -8694 -34618 15053 -7555 -28225 -52738 -40653
7303d0653N1819n262q249O1407R4157J2780n7569n5517K2594n062N5996L5213
7291A61654j03304l6476n0860K7779K6085O989k5956L3791M2912j2883J6681m577
7279H1835K2764j2096q402k5415K1309n7852M276M2872n1338o378P676J7803L3457
7266G0511k0693k9416J8172M2782N2051L7353q3773p6403k946K321J1820O8872
7254I0651m160j3677q374J3510j3744m406l4638j3755J7389K217J1375m0877l6501
7241c4990K948K6026L6729K712K9567k7958m7374O1419K1159j7933j06732m8832
7229a03259K2915K8595j634k2833J8196M7874q058N9569L0562K0213K5030q5286
7217C1884k7566N2566O9853M0803k7049m2757l5529o1553N1705P2404l0493n5350
$$ plain form
7303 -40653 11166 5904 -2345 59062 153219 165999 108430 52913 75507 70445 126441 161654
7291 161654 58350 21874 -28986 -1207 24878 31867 5911 39702 82614 69731 86412 81835
7279 81835 104599 92503 84101 58686 79995 22143 26419 69291 17953 11575 19251 37054 70511
7266 70511 49818 20402 38574 81356 133407 170760 86987 10584 7638 9959 21779 90651
7254 90651 86491 72814 64440 77950 64206 59800 25162 11407 28796 31013 42388 1511 -34990
7241 -34990 -32042 -6016 30713 33425 62992 35034 -12340 49079 70238 52305 -54427 -103259
7229 -103259 -80344 -51749 -53383 -76216 -58020 -10146 -18204 41365 71927 92140 117170 31884
7217 31884 4318 56884 126737 167540 140491 97734 62205 652 52357 124761 94268 38918
7205C8918k8619m365K4078j8013k9795R292K9409j4646r149J8827m895L9844j3690
7192C7196K3778M4n5919K2733L3615j739k4003j2534O6509j5591l0019m5159j9688
7179b0777K799k1362l3437M5344L9484M4903O1858m0736l6143j0818K4984l2246
7167B3853j1788L6211j1255m4593K9352J7223J2063k818M9901K7246L5925j2846
7155A48474k6655j03694N6434j4712n9429l4610k1004N3350M0781K2277l6688
7144B4524J3859P251L280N2828l2683k1757j0832o660N841J3881l405l405o654
7131C6068L3171L342j4519k149p791j6998l9614k5212L6374R972k3756M8320n061
7118C2147O725l739n1680k4525N3479J6777m3184k6517j5258l5097R1506Q4722
$$ plain form
7205 38918 10299 5934 30012 11999 -17796 -8504 20905 6259 -2890 15937 11042 50886 37196
7192 37196 60974 61018 5099 27832 61447 59708 35705 23171 89680 74089 44070 -1089 -20777
7179 -20777 -17978 -39340 -72777 -27433 12051 56954 118812 78076 41933 31115 56099 23853
7167 23853 12065 48276 37021 -7572 21780 39003 51066 48248 98149 125395 161320 148474
7155 148474 121819 18125 74559 59847 418 -34192 -55196 -1846 38935 61212 24524
7144 24524 38383 45634 48914 101742 69059 47302 36470 29810 35651 49532 46127 42722 36068
7131 36068 69239 72581 58062 55913 48122 31124 -8490 -33702 2672 12644 -11112 37208 32147
7118 32147 38872 35133 -16547 -41072 12407 29184 -14000 -40517 -55775 -90872 634 85356
7106H5356L1693m6878o2708l8569j1682l6453M4602l5578l5776M3634M4379l9934
7094e7914K6689M1893l7263n7552j5104M7870K566J6122J4434l9876l4628L7109
7082e5654K7943J2598O7055l0362o6109K0075K7635n642m2947m131Q428j5918
7070e7029m8915p2213M3393R8484L4001L0778J8153J3233q456m0933p901K8678
7058C1273m941k6624M2026l4659l7066K9737L8263K2842k1728j5780l589P515
7046B7269n883m3669j175N3167m6858L489j3021m2109j8802J1734N7711r409m6688
7033g4244O828J3324j6160L5032M7041L0949l2580L889K8688P6811N0451k5791
7021A44238q7106r0037n1648j4353K8181O3073L9933J6155L559K6106M9118q274
$$ plain form
7106 85356 117049 70171 7463 -31106 -42788 -79241 -34639 -70217 -105993 -62359 -17980 -57914
7094 -57914 -31225 10668 -26595 -84147 -99251 -51381 -48815 -32693 -18259 -58135 -92763 -55654
7082 -55654 -27711 -15113 51942 21580 -44529 -24454 3181 -2461 -45408 -49539 -41111 -57029
7070 -57029 -105944 -178157 -134764 -36280 -2279 28499 46652 59885 51429 10496 2595 31273
7058 31273 26332 -292 41734 7075 -29991 -254 38009 60851 39123 23343 19754 27269
7046 27269 21386 -22283 -23458 29709 -17149 -13660 -26681 -68790 -87592 -75858 -18147 -27556 -74244
7033 -74244 -67416 -54092 -70252 -35220 11821 42770 10190 14079 42767 119578 170029 144238
7021 144238 57132 -32905 -84553 -98906 -70725 -7652 32281 48436 51995 78101 127219 118945
7009A18945j8928m2670o2275q382L240l579m698l8061J1608J8634P8061J6066
6997F7961o1120l8906k8135M5657N5392K0374M7798m4027J9345Q980Q720j9254
6985H2785j8070j4356K333K8339k1756l0006M8189j3419j1018J2019l2796Q214
6973D0458l4198o7536o9679N8663P5376K8468R1027J2751l2240o1136o0559J9057
6961D52N1591J1282m6715l8905K107K8658o563L5091j1055k5835J5103n5660J2938
6948b7511N4101j2154K0924O2403k4127j2384n1394j1527N5161j1744q455K4415
6936E7708K3064r968l3163l1495N147P929r945J7434j342l4000l9149l7368K6485
6923e8663O6405K2848J320j9308m0019L1939K1451r637j3564k0472J6057l9250
$$ plain form
7009 118945 100017 57347 -4928 -13310 -10070 -13649 -18347 -56408 -44800 -26166 51895 67961
6997 67961 6841 -32065 -60200 -14543 40849 61223 109021 64994 84339 93319 102039 82785
6985 82785 64715 50359 52692 81031 59275 29269 77458 64039 53021 65040 32244 40458
6973 40458 6260 -61276 -130955 -72292 3084 31552 122579 135330 103090 41954 -18605 452
6961 452 52043 63325 16610 -22295 -20188 8470 1907 36998 25943 108 15211 -40449 -27511
6948 -27511 26590 14436 35360 97763 73636 61252 9858 -1669 53492 41748 33293 57708
6936 57708 80772 70804 37641 6146 11293 19222 9277 26711 25369 -8631 -47780 -85148 -58663
6923 -58663 7742 30590 31910 12602 -27417 4522 25973 16336 2772 -17700 -1643 -40893
6911d0893M5659M6045k5118j7512K2136p8827j5216J7152K8272K7293L1951M2236
6899H3178J5123j748l2640l0113k8162L4067K9404L2268j075j51l0300p2834k8590
6886c1573N2823P674m1078o2954K1513P1338L6272m53K0961L977o0095o0785r35
6873d3315J03693M0469r2219M942J5215j1972J196O3238l007p3379k0436J8889
$$ plain form
6911 -40893 4766 50811 25693 8181 30317 -48510 -63726 -46574 -18302 8991 40942 83178
6899 83178 98301 96553 63913 33800 5638 39705 69109 101377 100302 100151 69851 -2983 -31573
6886 -31573 21250 28924 -12154 -75108 -53595 17743 54015 53562 74523 78500 18405 -42380 -43315
6873 -43315 60378 100847 8628 13570 28785 16813 18009 81247 78240 4861 -15575 3314
$$ [...]
##END NTUPLES=NMR SPECTRUM
##END=
