##TITLE=Analysis number 329994
Compound Code cc 68513
Book Reference 528/70
Project Code adrs
Chemist Name davee
##JCAMPDX= 6.0         $$ Bruker NMR JCAMP-DX V2.0
##DATA TYPE= NMR SPECTRUM
##DATA CLASS= NTUPLES
##ORIGIN= Bruker BioSpin GmbH
##OWNER= nmr
$$ XWIN-NMR		Version 3.5
$$ Thu Oct 18 09:31:57 2007 GMT Daylight Time (UT+1h)  MAYBRIDGE\nmr@NMR_250MHZ
##.OBSERVE FREQUENCY= 250.131544655141
##.OBSERVE NUCLEUS= ^1H
##.ACQUISITION MODE= SIMULTANEOUS (DQD)
##.ACQUISITION SCHEME= undefined
##.AVERAGES= 16
##.DIGITISER RES= 18
##SPECTROMETER/DATA SYSTEM= dpx250
##.PULSE SEQUENCE= zg30
##.SOLVENT NAME= CDCl3
##.SHIFT REFERENCE= (INTERNAL, CDCl3, 0, 16.522)
##AUDIT TRAIL= $$ (NUMBER, WHEN, WHO, WHERE, WHAT)
$$ ##TITLE= Audit trail, XWIN-NMR		Version 3.5
$$ ##JCAMPDX= 5.01
$$ ##ORIGIN= Bruker BioSpin GmbH
$$ ##OWNER= nmr
$$ C:\u/data/dgb/nmr/ADRS/900/pdata/1/auditp.txt
$$ ##AUDIT TRAIL=  $$ (NUMBER, WHEN, WHO, WHERE, WHAT)
(   1,<2007-10-18 09:31:26.04 +100>,<MAYBRIDGE\nmr>,<NMR_250MHZ>,
      <created by zg, POWCHK disabled, PULCHK disabled
       configuration hash MD5:
       76 6E 9A 78 1E 09 19 81 EC 84 63 8F B0 6A 59 2D
       data hash MD5: 64K
       FE BC 96 99 56 90 84 02 50 DE 6E 18 CF 6B 4F A3>)
(   2,<2007-10-18 09:31:46.49 +100>,<MAYBRIDGE\nmr>,<NMR_250MHZ>,
      <Start of raw data processing
       ef LB = 0.3 FT_mod = 6 PKNL = 1 SI = 32K 
       data hash MD5: 32K
       80 89 9B 67 B8 AD 77 57 15 53 DB 68 CF F9 16 7D>)
(   3,<2007-10-18 09:31:48.68 +100>,<MAYBRIDGE\nmr>,<NMR_250MHZ>,
      <apk 
       data hash MD5: 32K
       1E 02 55 23 03 16 C1 57 8E 15 5F 25 29 A2 46 DE>)
(   4,<2007-10-18 09:31:49.44 +100>,<MAYBRIDGE\nmr>,<NMR_250MHZ>,
      <abs ABSG = 5 
       data hash MD5: 32K
       59 59 8D 6B 1E 49 99 A3 33 02 51 F2 65 F4 7D 98>)
$$ ##END=
$$ 
$$ hash MD5
$$ E0 F7 E2 FC E1 66 71 D4 CB 66 E3 DB A7 FA 6A 80
##$RELAX= 
##$RELAX= 
##$RELAX= 
##$RELAX= 
##$RELAX= 
##$RELAX= 
##$RELAX= 
$$ Bruker specific parameters
$$ --------------------------
##$DU= <C:\u>
##$EXPNO= 900
##$NAME= <ADRS>
##$PROCNO= 1
##$TYPE= <nmr>
##$USER= <dgb>
##$AMP= (0..31)
100 100 100 100 100 100 100 100 100 100 100 100 100 100 100 100 100 100 
100 100 100 100 100 100 100 100 100 100 100 100 100 100 
##$AQSEQ= 0
##$AQ_mod= 3
##$AUNM= <au_zg>
##$AUTOPOS= <3 >
##$BF1= 250.13
##$BF2= 250.13
##$BF3= 250.13
##$BF4= 250.13
##$BF5= 500.13
##$BF6= 500.13
##$BF7= 500.13
##$BF8= 500.13
##$BYTORDA= 1
##$CFDGTYP= 0
##$CFRGTYP= 5
##$CHEMSTR= <none>
##$CNST= (0..31)
1 1 145 1 1 1 1 1 1 1 1 1 1 1 1 1 1 1 1 1 1 1 1 1 1 1 1 1 1 1 1 1 
##$CPDPRG= <>
##$CPDPRG1= <>
##$CPDPRG2= <>
##$CPDPRG3= <>
##$CPDPRG4= <mlev>
##$CPDPRG5= <mlev>
##$CPDPRG6= <mlev>
##$CPDPRG7= <mlev>
##$CPDPRG8= <mlev>
##$CPDPRGB= <>
##$CPDPRGT= <>
##$D= (0..31)
0 1 0 0 0 0 0 0 0 0.06 0 0 0 0 0 0 0.0002 0 0 0 0 0 0 0 0 0 0 0 0 0 0 
0 
##$DATE= 1192696284
##$DBL= (0..7)
120 120 120 120 120 120 120 120 
##$DBP= (0..7)
150 150 150 150 150 150 150 150 
##$DBP07= 0
##$DBPNAM0= <>
##$DBPNAM1= <>
$$ [...]
##$SUBNAM7= <"">
##$SUBNAM8= <"">
##$SUBNAM9= <"">
##$SW= 20.6930455092707
##$SWIBOX= (0..15)
0 0 3 0 0 0 0 0 0 0 0 0 0 0 0 0 
##$SW_h= 5175.983436853
##$TD= 65536
##$TD0= 1
##$TE= 295.16
##$TE2= 300
##$TE3= 300
##$TEG= 300
##$TL= (0..7)
0 120 120 120 120 120 120 120 
##$TP= (0..7)
150 150 150 150 150 150 150 150 
##$TP07= 0
##$TPNAME0= <>
##$TPNAME1= <>
##$TPNAME2= <>
##$TPNAME3= <>
##$TPNAME4= <>
##$TPNAME5= <>
##$TPNAME6= <>
##$TPNAME7= <>
##$TPOAL= (0..7)
0.5 0.5 0.5 0.5 0.5 0.5 0.5 0.5 
##$TPOFFS= (0..7)
0 0 0 0 0 0 0 0 
##$TUNHIN= 0
##$TUNHOUT= 0
##$TUNXOUT= 0
##$USERA1= <user>
##$USERA2= <user>
##$USERA3= <user>
##$USERA4= <user>
##$USERA5= <user>
##$V9= 5
##$VALIST= <valist>
##$VCLIST= <CCCCCCCCCCCCCCC>
##$VD= 0
##$VDLIST= <DDDDDDDDDDDDDDD>
##$VPLIST= <PPPPPPPPPPPPPPP>
##$VTLIST= <TTTTTTTTTTTTTTT>
##$WBST= 1024
##$WBSW= 4
##$XGAIN= (0..3)
0 0 0 0 
##$XL= 0
##$YL= 0
##$YMAX_a= 611272
##$YMIN_a= -434969
##$ZGOPTNS= <>
##$ZL1= 120
##$ZL2= 120
##$ZL3= 120
##$ZL4= 120
##$ABSF1= 16.522
##$ABSF2= -4.171173
##$ABSG= 5
##$ABSL= 3
##$ALPHA= 0
##$AQORDER= 0
##$ASSFAC= 0
##$ASSFACI= 0
##$ASSFACX= 0
##$ASSWID= 0
##$AUNMP= <proc_1d>
##$AZFE= 0.1
##$AZFW= 0.1
##$BCFW= 0
##$BC_mod= 0
##$BYTORDP= 0
##$COROFFS= 0
##$CY= 12.5
##$DATMOD= 1
##$DC= 0
##$DFILT= <>
##$DTYPP= 0
##$F1P= 14.0000005364418
##$F2P= -0.99999901652339
##$FCOR= 0.5
##$FTSIZE= 32768
##$FT_mod= 6
##$GAMMA= 0
##$GB= 0
##$INTBC= 1
##$INTSCL= 1
##$ISEN= 128
##$LB= 0.3
##$LEV0= 0
##$LPBIN= 0
##$MAXI= 10000
##$MC2= 0
##$MEAN= 0
##$ME_mod= 0
##$MI= 0
##$NCOEF= 0
##$NC_proc= -4
##$NLEV= 6
##$NOISF1= 0
##$NOISF2= 0
##$NSP= 0
##$NTH_PI= 0
##$NZP= 0
##$OFFSET= 16.522
##$PC= 1
##$PHC0= 6.543952
##$PHC1= 5.683832
##$PH_mod= 1
##$PKNL= yes
##$PPARMOD= 0
##$PSCAL= 4
##$PSIGN= 0
##$REVERSE= no
##$SF= 250.13
##$SI= 32768
##$SIGF1= 0
##$SIGF2= 0
##$SINO= 400
##$SIOLD= 32768
##$SREGLST= <1H.CDCl3>
##$SSB= 0
##$STSI= 32768
##$STSR= 0
##$SW_p= 5175.98343685301
##$SYMM= 0
##$S_DEV= 0
##$TDeff= 65536
##$TDoff= 0
##$TI= <Analysis number 999999
Compound Code 99
Book Reference 9
Project Code 9>
##$TILT= no
##$TM1= 0
##$TM2= 0
##$TOPLEV= 0
##$USERP1= <user>
##$USERP2= <user>
##$USERP3= <user>
##$USERP4= <user>
##$USERP5= <user>
##$WDW= 1
##$XDIM= 32768
##$YMAX_p= 320658776
##$YMIN_p= -69750
$$ End of Bruker specific parameters
$$ ---------------------------------
##NTUPLES= NMR SPECTRUM
##VAR_NAME=  FREQUENCY,     SPECTRUM/REAL,   SPECTRUM/IMAG
##SYMBOL=    X,             R,               I
##VAR_TYPE=  INDEPENDENT,   DEPENDENT,       DEPENDENT
##VAR_FORM=  AFFN,          ASDF,            ASDF
##VAR_DIM=   32768,         32768,           32768
##UNITS=     HZ,            ARBITRARY UNITS, ARBITRARY UNITS
##FACTOR=    0.157963299565203, 1,           1
##FIRST=     4132.6476996994, 0,             0
##LAST=      -1043.33573715361, 0,           0
##MIN=       -1043.33573715361, -69750,      0
##MAX=       4132.6476996994, 320658776,     0
$$ Real data points
##PAGE= N=1
##DATA TABLE= (X++(R..R)), XYDATA
$$ [...]
18171D18901o874j1447q509J562j6708j9124J1184j900q267j4598j7076m561N696
18158C28279J6542J931m710k130P592k823j4247j5362q582R4j1764l992k643O166
18144B94351J3585J6263q483l195p5R854J6549L826J4368M770J3420L1731M1766
18131D48730M6523L1299M1607O7068Q7259J11066J66089J77350J66823K06119
18121A549933K23840K29479K82474L43718M31756O36872J022982J639120K758053
18112I118227M782634P322995O012541j175403n623967o934463n041805k859371
18104E601388j608686r81120o54286m75242l62895k64931j98357j43086r0353
18095H22432n8948p1860o9078o5095n4736l8604m1265l8935l1578j2967k1143
$$ y = [418901, 412027, 400580, 392071, 393633, 376925, 357801, 368985, 367085, 358818, 344220, 327144, 322583, 328279, 344821, 346752, 342042, 339912, 347504, 344681, 330434, 315072, 306490, 306584, 294820, 290828, 288185, 294351, 307936, 324199, 315716, 312521, 312446, 322300, 338849, 342675, 357043, 361813, 375233, 406964, 448730, 495253, 526552, 568159, 635227, 722486, 833552, 999641, 1176991, 1343814, 1549933, 1773773, 2003252, 2285726, 2629444, 3061200, 3698072, 4721054, 6360174, 9118227, 13900861, 21223856, 27236397, 26060994, 20437027, 13502564, 8460759, 5601388, 3992702, 3011582, 2357296, 1882054, 1519159, 1254228, 1055871, 912785, 822432, 763484, 691624, 622546, 557451, 502715, 464111, 422846, 383911, 352333, 339366, 318223]
18084C18223j8187n470k2677j0085P655L13j7119j4495j0728m534P299j0651k029
18071B17515n753n387k9400l2985o333O531Q078j1185k7369k8205O618J3262o499
18058I8888j9572r317N180P047K443O970J298k8448j8083J1064M252o268j604
18045E3850q54J3439O006l539L411L860n31p423J923m90J7179j287j2386l061
18031G0097j3560q184M73J5059J1797j0451m404r915k336M799R415K44j3938q326
18017D0770J1758Q929J4016p37m87l201l33K35J3271m154j517q553n211L651O988
18002G5425j3494j30J1291N203k8501r816Q466J9409K0452kk0445j4910N615m17
17988E8146j999m342l746J1851J3368o87j8321p795m728J1710K2304q698L421
$$ y = [318223, 300036, 294566, 271889, 261804, 269459, 269772, 252653, 238158, 227430, 222896, 230195, 219544, 217515, 211762, 206375, 176975, 143990, 137657, 144188, 152266, 141081, 113712, 85507, 92125, 105387, 98888, 79316, 69999, 75179, 82226, 84669, 91639, 92937, 64489, 46406, 57470, 61722, 55454, 53850, 52996, 66435, 72441, 68902, 72313, 76173, 75642, 68219, 70142, 69652, 86831, 85544, 73158, 70097, 56537, 48353, 48826, 63885, 75682, 65231, 60827, 50912, 48576, 53375, 62790, 63034, 49096, 40770, 52528, 61457, 75473, 74736, 74249, 71048, 70715, 70950, 84221, 80067, 78550, 69997, 64786, 68437, 75425, 61931, 61801, 73092, 78295, 49794, 39978, 48444, 67853, 88305, 88303, 67858, 52948, 58563, 58146, 56147, 51805, 48059, 59910, 73278, 72591, 54270, 46475, 41747, 53457, 75761, 67063, 70484]
17975G0484P772k9j2455j3896m902R454k327m756R189K2574o053Q41N042k4069
17961E6869j9875J560P681O275O082k441L465m216j2963l749J6906J1165q455
17948E8304o122J1641L3243O694j8570j9856R418J6296J854j0882N358o953p041
17935G3384n813j6002k0068k1042r128J3092R268j6573n625O741R274r08l263
17922A3337N25M199j2646q978k00p150O086R223o469j0736R792J3119j5587j0320
17908a5805J0244O982m82J049Q154J255j2101R123J7406R837J008j1520j0500
17895A4650m827q546q420Q415k334j5356m152J9112K3590j0121k4114Q190L2613
17882B8700J4487J4356k6514k0042j0131j685j435J5490J1391J4499j3812j3258
$$ y = [70484, 78256, 78227, 65772, 51876, 46974, 56428, 54101, 49345, 58534, 81108, 75055, 75896, 80938, 56869, 36994, 38554, 46235, 52510, 58592, 56151, 59616, 55400, 42437, 38688, 55594, 66759, 58304, 52182, 63823, 97066, 103760, 85190, 65334, 74752, 91048, 92902, 82020, 87378, 80425, 73384, 67571, 51569, 31501, 10459, 1331, 14423, 23691, 7118, 1493, 8234, 17508, 16600, 13337, 13862, 18061, 5415, -3563, -3763, -10913, -4827, 4396, -2073, -12809, -3017, 10102, -5485, -15805, -5561, 1421, 939, 1988, 10142, 11397, -704, 8419, 25825, 35662, 36670, 25150, 14650, 9823, 1277, -7143, 1272, -1062, -16418, -20570, -1458, 22132, 12011, -12103, -3913, 28700, 43187, 57543, 31029, 10987, 856, -829, -2264, 13226, 24617, 39116, 25304, 12046]
17870A2046M564j4632P776J8174J2651N926k0474j3477l875m51q765q90K274j4488
17856a3641j070J2873P105J1303R729l742p179n850J6447J936j1212j2838L805
17843G666j1316m375R728n287M981M488n402j0660p996N148R595l774p184l750
17829a8138j955M108j050P159R923J4606P449L028m229j2536l66K491j493p124
17815A873m425j1941N698J0160J9675K289k780o111j7728J827J2243M030n436
17802I374k0990m255o82j917P529N168L869N593P16l733q548K2588J3370j4241
17788A3841j7202o090q772K284J859q730J993R026j751k020J97l154j784M228
17774a6075J0154J9291j2877j8181J1709l143J1438n243J9P677j0547R412J4965
$$ y = [12046, 16610, 1978, 9754, 27928, 40579, 46505, 26031, 12554, 8679, 8228, -537, -1427, 847, -13641, -14711, -1838, 5267, 16570, 26299, 22557, 15378, 9528, 25975, 27911, 16699, 3861, 7666, -3650, -8025, 1703, -3584, 1397, 5885, 483, -10177, -18173, -13025, -3430, -7204, -14388, -18138, -20093, -15985, -17035, -9876, 47, 14653, 22102, 25130, 20901, 8365, 7999, 10490, 8997, 1873, -2552, -14493, -8795, 1365, 21040, 23329, 20549, 14438, -3290, -1463, 10780, 14810, 9374, -11616, -15871, -16553, -18470, -10941, -5773, -1904, 3689, 4405, 672, -7876, 14712, 28082, 13841, -3361, -9451, -18223, -15939, -14080, -22810, -20817, -11791, -13542, -15562, -15365, -18519, -20303, -16075, -5921, 13370, 493, -17688, -5979, -9122, 2316, -2927, -2908, 4769, -5778, 3634, 18599]
17761A8599p066l766k000J1990N136p377M342m382l912K214k675J364n64k792
17747I111m263p673J023J2474j0149Q686M355j7610l782J5885m716j6142j5797
17734b8598J0748M547J8092J328j7287l189L314P838M373J183l407m595j1912
17721a7565J6992l129P234Q012l606L408k228Q549R016L607l886j5561j0127L404
17707D120O376K449n585l79P981k205K371P762O047j0746r060J482j4522J539
17693b370J3937n747j0151J0867p303j4816n324l139J1697J5814r655j1446k973
17680b0609l57K928L0173R608o532J8778J0649j5474j3533l992k212l24r329M579
17666D353J3646Q178o690j0682j6324j8176P036M3478K3058k450Q011k0402j0448
$$ y = [18599, 11533, 7767, 5767, 17757, 22893, 15516, 19858, 15476, 11564, 13778, 11103, 12467, 11903, 9111, 4848, -2825, -1802, 10672, 523, 9209, 13564, -4046, -7828, 8057, 3341, -12801, -28598, -17850, -13303, 4789, 6117, -11170, -14359, -11045, -3207, 1166, 2349, -1058, -5653, -17565, -573, -3702, 3532, 11544, 7938, 11346, 9118, 17667, 26683, 30290, 26404, 10843, 716, 4120, 10496, 12945, 7360, 6981, 14962, 12757, 15128, 22890, 28937, 18191, 9131, 10613, -3909, -2370, 11567, 5820, -4331, 6536, -767, -15583, -20907, -24046, -12349, 3465, -6190, -17636, -20609, -20966, -18038, 12135, 21743, 15211, 33989, 44638, 29164, 15631, 11639, 9427, 9103, -226, 4353, 17999, 26177, 19487, 8805, -7519, -25695, -18659, 24819, 47877, 45427, 53438, 33036, 22588]
17653B2588Q334k059J1424k952O414j951J9751M55l37M577Q171L86j1177j3242
17639E0382O270K0514j73J8407P64K1449K0183J9158L4250J9528M2487M9474O8383
17626C71076O6616R5224J34852J61742K03874K06964K07850K57822K25256R1690
17616B022966N582K3043K5134r3943k06124k28530j98944j27059j07651j00424
17606A014050j25027j20834q8299l7384J2196r550o3556o7222m6080k484O5223
17595E31033L8550j6198n4407n1949L22L0211j5550p4205r8991p0205n3810l9611
17583A25190n191n51k3497j3922n185l2567j0597K670L084p99r491q117m887N717
17569B1857M854J211J0765R959j2037j2297L35J5654l444o523Q048J2111K316
$$ y = [22588, 30922, 28863, 40287, 37335, 43749, 41798, 61549, 62004, 61667, 66244, 74415, 74801, 63624, 50382, 56652, 77166, 76993, 95400, 96164, 117613, 137796, 156954, 191204, 210732, 253219, 302693, 371076, 437692, 532916, 667768, 829510, 1033384, 1240348, 1448198, 1706020, 1931276, 2022966, 2028548, 2051591, 2076725, 1982782, 1776658, 1548128, 1349184, 1222125, 1114474, 1014050, 889023, 768189, 679890, 642506, 654702, 645152, 581596, 514374, 468294, 465810, 531033, 569583, 553385, 498978, 447029, 447351, 477562, 462012, 387807, 288816, 218611, 164801, 125190, 119999, 119448, 95951, 82029, 76844, 44277, 33680, 36350, 39434, 38635, 29144, 21027, 16140, 21857, 26711, 27922, 38687, 48646, 36609, 24312, 24647, 40301, 36857, 30334, 38382, 50493, 52809]
17556E2809m042p602k2603j2948L645p155o752J4498N465j2717p149J6575K3953
17543C5977l488k4223K590L613N361L022M821q841K126J2326m014n606o545o853
17529A0266r742l263J545j1473j9936n124N173N920K2583R072q891J8098K0967
17516C5195j1017j4528j2130J8062J9137j5148k1620j1208p59J2402J987K643
17504C016P283j2904P44K553j1572l080R829q54l817J3164L446m078o843k148
17490e261N204j380n905j2881k455j79J201O868n023K912R872p392k084R728P251
17475D76L423L414N965o468J3404O16j0263j1669K547K009R233l885Q99M322j0017
17460D006j1177r349L991P135M216L311J4747j1815j0871L570K478L707L634K0931
$$ y = [52809, 48767, 41165, 18562, 5614, 9259, 2104, -4648, 9850, 15315, 2598, -4551, 12024, 35977, 32489, 8266, 10856, 14469, 19830, 22852, 27673, 18832, 20958, 33284, 29270, 23664, 17119, 10266, 524, -2739, -1194, -12667, -32603, -37727, -32554, -26634, -4051, 5021, -3870, 14228, 35195, 24178, 9650, -2480, 15582, 34719, 19571, -2049, -13257, -14016, -1614, 373, 3016, 10299, -2605, -1861, 692, -10880, -13960, -4131, -4985, -8802, 4362, 7808, 3730, -3113, -5261, -57, -1437, -7342, -20223, -22678, -22857, -21656, -14788, -19811, -16899, -7027, -14419, -16503, -6775, 476, 3899, 7313, 13278, 6810, 20214, 20830, 10567, -1102, 1445, 3454, 12687, 8802, 9701, 14023, 4006, -7171, -16520, -12529, -5394, -1178, 2133, 16880, 5065, -5806, -2236, 242, 3949, 7583, 28514]
17446B8514L1833J6687K3783K2506J4794r980m0833l1283j3302o745m960J4821
17434D5835M300j9010R30K878q801k843j4090q173n909m940p38L680O959J1329
17420A1407j1076K5P394M61N113m21J081j1195q446O571j2705M135O717R79k439
17405b399K69m254R507j807j0874j414J176L826j030r696L02k785r447k63O190
17390b2699m294k133J0935M480R553J2168r246k1233r984K5091J3500R448j2087
17377C499j872j2319Q385K226J4135m233j7125m641K7853K699j6913P001o710
17364A985k6677K980J4765q63j7153J0155J5179j9706O003N624J4733K4878j361
17351C0542q726j0729k0190j3106J3409K799Q990N046j2136Q180m490J1607J505
$$ y = [28514, 60347, 77034, 100817, 123323, 138117, 128137, 87304, 56021, 42719, 35974, 31014, 45835, 50135, 31125, 32055, 34933, 26132, 23289, 9199, 1026, -4883, -9823, -10561, -6881, 78, 11407, 331, 356, 7750, 8211, 13324, 12903, 13984, 2789, -5657, 914, -11791, -7656, -939, 40, -2399, -2130, -6384, 3123, 1316, -9558, -10972, -9796, -5970, -7000, -16696, -16394, -19179, -28626, -28889, -22699, -26993, -29126, -18191, -13711, -4158, 8010, -1236, -22469, -32453, -7362, 6138, 15586, 3499, 1627, -10692, -2307, -81, 14054, 9821, -7304, -11945, 15908, 18607, 1694, 8695, 1985, -24692, -21712, -6947, -7810, -24963, -14808, 371, -19335, -13332, -7708, 7025, 31903, 30542, 21816, 11087, -9103, -22209, -8800, -6001, 2989, 8035, -4101, 4079, -411, 11196, 12701]
17338A2701j0470j1430k080J0214k007J755K668K783l988l928R465K281N13j1815
17324c338l094K511M271l113k214M788J838L578l194l045L716k059k1405J4266
17310f494o18j6670m369O534J9792J0616j1414j1375J7188k062M701Q030J1194
17297B5053P046n223k650k1322k418J8799L672p829q084R664r80j8842o311l210
17283a2635J559k570n340N405J960q033j012J1870N223l725k364K79P049m398
17269f732l061R362o967j3251j2550j607k938Q754J9865n52l706K690L579J933
17255e181n665k842N387J4564K244k988q068K042J2818L624M02r183j9025j7239
17241b9110P546J0625k769q552M175J783k963q16J0424Q124j580j0513j6297J566
$$ y = [12701, 2231, -9199, -11279, -1065, -3072, -1317, 1351, 4134, 146, -3782, 5683, 7964, 8477, -3338, -6432, -3921, 350, -2763, -4977, -189, 1649, 5227, 2033, -1012, 2704, 645, -20760, -6494, -7112, -23782, -28151, -21617, -1825, 8791, -2623, -13998, 3190, 1128, 5829, 13859, 25053, 32099, 26876, 24226, 2904, 486, 19285, 22957, 15128, 7044, 16708, 15728, -3114, -9425, -12635, -11076, -13646, -18986, -13581, -11621, -19654, -20666, -8796, -3573, -7298, -9662, -9383, -2334, -6732, -9793, -431, -7398, -20649, -33199, -34806, -37744, -28990, -9125, -9677, -13383, -10693, -7114, -5181, -10846, -13688, -8301, 6263, 8507, 5519, -2549, -507, 12311, 15935, 16337, 7154, -11871, -29110, -21564, -10939, -13708, -22260, -18085, -16302, -19265, -20081, -9657, -1533, -3113, -13626, -29923, -28357]
17227b8357k777K337J326J6719p045r391N746m584J9631J6488K330p265j3770
17214h612o757k689J32l210k646K470J4448J3350P727m470r056M562L071j3366
17200e046m643J4709M22K0J3204M626q332J1800j2840n685J2678r56j392o283
17186A2282j923k5J0394m266k1340j2453j475J8008K723k662L638L338j7269j893
17172a2923R162Q442J7610k233p191K759o761o067N528k9011o081J6440P779N639
17158C092q142J4498J1044o745l419J1232Q229n051q911J0800p035j3081k0458
17145a3947m390J7399K0497M168j0559j1727L0068L2796j732q216k977r960N035
17132D6455J690l93k965P610J1003k512J6701J7005Q751J835K2336N9714N6196
$$ y = [-28357, -31134, -28797, -27471, -10752, -17797, -27188, -21442, -26026, -6395, 10093, 12423, 5158, -8612, -15369, -18058, -17926, -21136, -23782, -21312, -6864, 6486, 14213, 9743, 687, 5249, 8320, -5046, -9689, 5020, 5442, 5462, 18666, 23292, 14960, 26760, 13920, 8235, 20913, 19957, 18565, 12282, 10359, 10334, 20728, 16462, -4878, -17331, -18806, -798, 1925, -737, 2901, 6239, -11030, -12923, -3761, 4681, 22291, 20058, 12867, 15626, 8865, 2798, 8326, -20685, -26766, -10326, -2547, 3092, -5050, 9448, 20492, 13747, 10328, 21560, 29789, 24738, 15827, 26627, 19592, 6511, -13947, -18337, -938, 19559, 23727, 13168, 1441, 31509, 64305, 62573, 54357, 51380, 41420, 46455, 48145, 47752, 44787, 52397, 63400, 60888, 77589, 94594, 103345, 105180, 127516, 187230, 243426]
17119B43426M2389L9707L938k8896m7590n1232k7164o509J6937K6268L7909K5076
17107B74259J9897K7539J3557k497l1607j1744J5880L3628J3396K6054P313n3514
17095C32161o1831l3364l1854k6016R666L6068K7760K3232M5151K3726k4938n0647
17083B69114m2354m1804m3213l0961j9648j5525J5299k0884k0341j5851j007K736
17071C5561j4689j3254O943J2371k0065j346k79R963J0227n531k404N903P744
17058C1144j6107n090j597K178J0999R132l350j6555k0287O748O270M623J9890
17045B7998l348Q360p284m858n517Q63M325o717l028p565j995M511P551J2933
17031B6229r801m174q550o484M089J254K919N051L775r620j3418j8221J4782J2360
$$ y = [243426, 285815, 325522, 329460, 300564, 252974, 201742, 174578, 168069, 185006, 211274, 249183, 274259, 294156, 321695, 335252, 332755, 301148, 289404, 305284, 338912, 352308, 378362, 385675, 332161, 270330, 236966, 205112, 179096, 188762, 224830, 252590, 275822, 320973, 344699, 319761, 269114, 226760, 184956, 141743, 110782, 91134, 75609, 90908, 70024, 49683, 33832, 32825, 35561, 20872, 7618, 14561, 26932, 6867, 5521, 5242, 15205, 25432, 19901, 17497, 23400, 31144, 15037, 9947, 8350, 10528, 21527, 30659, 27309, 10754, -9533, -2785, 3485, 8108, 27998, 24650, 33010, 25726, 20868, 15351, 16214, 20539, 13822, 10794, 3229, 1234, 5745, 13296, 26229, 16428, 12254, 3704, -2780, 1309, 2563, 5482, 10533, 14308, 4688, -8730, -26951, -12169, 191]
17017A91N258m906l673J4708k697k619m60L478o850P882N604k56R22n641J3823
17002B4764J662J5663J2839J492J104q19k0637j2133k777J3347k787l154k965
16989B5599l702n438l464P953j987L202Q218l540K484K3501R363l001k362j7886
16975C8940m1129L951K3470o027L939L791n186J0297O461k1178R120j99K459K20
16961B8929Q516j034M413k841k3824M481q828o227o237j618L772n082r56K255
16947d281R383J2700K635Q97P791P893l781m106J0056J8302k496j3064O135j3208
16933C4856j7543Q207K464K1007K6047P490j1323J4635N412Q501j365J5359L0471
16920A44218L5728M6285K9178M7860L6291J6483J7523L311l987j0406j5688l0803
$$ y = [191, 5449, 543, -3130, 11578, 8881, 6262, 5802, 9280, 2430, 10312, 15916, 15660, 16582, 10941, 24764, 26426, 42089, 54928, 56420, 57524, 56705, 36068, 23935, 21158, 34505, 31718, 28564, 25599, 21897, 16459, 12995, 20948, 18961, 22163, 30381, 26841, 29325, 52826, 62189, 59188, 56826, 38940, -2189, 1762, 25232, 19205, 23144, 26935, 21749, 32046, 38507, 17329, 26449, 26250, 28709, 28929, 37445, 36411, 40824, 37983, 14159, 18640, 9812, 3585, -2652, -4270, -498, -5580, -6536, -4281, 5102, 17802, 20437, 21334, 29125, 37018, 33237, 29131, 39187, 57489, 54993, 41929, 48064, 34856, 17313, 25520, 27984, 48991, 75038, 82528, 71205, 85840, 91252, 99753, 98388, 113747, 144218, 179946, 226231, 255409, 303269, 339560, 356043, 373566, 376877, 372890, 362484, 346796, 315993]
16908C15993j6804l4596k7359k1851k1894j3486P188L6420L4644K5272M2317N3516
16896C79360L4132o273J4353J9729j128p925k3732p5564n1221m1694n0193m7215
16884A42629k9126k4064j9453j6250k6002Q386R920o801o200N660k361l736p035
16871B5567j588m730J5489O085j844j4960k4511m11J8851O243n582j0663o451
16858A495M318j532j06l684N175q76p982Q185L586N167j462J2842J8206j1158
16844C2174p567j0617j2001j9886r859J3552J3634O061J941o436m755l669J0250
16831B822L796j0773n740K399J0428J0357K4773J2576J1086K079l141j5549q894
16818C6219J2759p258j2712J6554J2764o396L020k830L993qj3843O744J5545O829
$$ y = [315993, 299189, 264593, 237234, 215383, 193489, 180003, 187191, 223611, 258255, 283527, 325844, 379360, 413492, 407219, 421572, 441301, 440173, 432248, 408516, 332952, 281731, 240037, 189844, 142629, 113503, 89439, 69986, 53736, 27734, 36120, 46040, 39239, 33039, 38699, 36338, 32602, 25567, 23979, 19249, 34738, 40823, 38979, 24019, -492, -903, 17948, 24191, 18609, 7946, 1495, 5813, 4281, 4175, 491, 5666, 4790, -3192, 4993, 8579, 13746, 12284, 25126, 43332, 32174, 24607, 13990, 1989, -17897, -27756, -14204, -570, 5491, 7432, 996, -3759, -7428, 2822, 6618, -4155, -9895, -7496, 2932, 13289, 38062, 50638, 61724, 63803, 60662, 45113, 36219, 48978, 41720, 29008, 45562, 58326, 51930, 54950, 52120, 56113, 56105, 42262, 49006, 64551, 71380]
16804G1380O514L662q86P465p489O742l69j440k273J1135J4178m888k0791q482
16790G4458p590m261j4353j3859P263m01q531R776J3993p601J1384J3271j8608
16777E4941m379r571K964J0211r81O902O845o977O457P824L369p655p722J3421
16763G5649k912n840n144k30l725K874j3162m979n589P665M946R487M696p69p885
16748E5082J7858J2995j417K101Q31j0715j2205k397M775K275K1352J5936j0306
16735I6165j2725l924K33j5959j960L31J0503J4270M160m862R413J8625p658j1989
16721I4623p626p707O335J1371Q446l831o048K979r663j2439L704N113l189l493
16707G8575K597J0645j44P961L34k077l410Q060Q411R236m179J715n715j0788
$$ y = [71380, 77894, 81556, 80670, 88135, 80646, 87388, 87019, 85579, 83306, 94441, 108619, 103731, 82940, 74458, 66868, 62607, 48254, 34395, 41658, 41257, 32726, 42502, 56495, 48894, 60278, 73549, 54941, 50562, 40991, 43955, 54166, 53185, 60087, 66932, 59955, 66412, 74236, 77605, 69950, 62228, 75649, 72737, 66897, 61753, 61523, 57798, 60672, 47510, 42531, 36942, 44607, 49553, 59040, 63736, 62967, 55082, 72940, 85935, 84518, 86619, 87450, 76735, 64530, 62133, 66908, 69183, 90535, 106471, 96165, 83440, 79516, 79749, 63790, 61830, 62161, 72664, 86934, 91094, 86232, 95645, 114270, 106612, 94623, 86997, 79290, 85625, 96996, 105442, 101611, 95563, 98542, 88879, 76440, 80144, 85257, 82068, 78575, 81172, 91817, 91673, 99634, 99968, 97891, 94481, 102541, 110952, 120188, 116009, 117724, 112009, 101221]
16693A01221j954J22J3518Q501L0893J0805r652q249M105j2092L406J3996j1406
16680A43214l915n012J6048L791j1976k4861M412k782j5772n06q328J1296K7254
16667A32863P181m530k022o311o618P510J9607Q805O64m888r326J006J5991J3439
16653A73371J4405n228k407j9269K524J3085L287j0295Q269R013J5356L5494M358
16640B41963j211J07J2834L515o52M674R841P605N60P987K3820L0373J2371J2055
16626C65842P587n985K7667K7988k798Q622K6787K3827K7903L0491K1939K1927
16614E81797N941J2301K2210K2478L6384L2782L0737M5359N6615Q4804R3416R5114
16602A119938J10078J08656P1325O2221O4127J17804J86461K54788L07574L24577
$$ y = [101221, 99267, 99389, 112907, 121408, 152301, 163106, 153454, 145205, 149310, 137218, 140624, 154620, 143214, 139299, 134287, 150335, 154126, 142150, 117289, 121701, 118919, 103147, 102641, 94313, 105609, 132863, 140044, 135514, 133492, 127181, 120563, 128073, 147680, 156485, 157149, 152261, 142935, 143941, 159932, 173371, 187776, 182548, 180141, 160872, 163396, 176481, 179768, 169473, 177742, 186755, 202111, 237605, 241963, 240752, 240859, 253693, 257208, 256556, 261230, 271071, 278676, 279236, 287223, 311043, 341416, 353787, 365842, 373429, 367444, 395111, 423099, 420301, 428923, 455710, 479537, 507440, 537931, 559870, 581797, 587738, 600039, 622249, 644727, 681111, 713893, 744630, 789989, 846604, 931408, 1024824, 1119938, 1230016, 1338672, 1409997, 1472218, 1536345, 1654149, 1840610, 2095398, 2402972, 2727549]
16592B727549K77995J54129R7752N2453J00104J89823K97737M64348O26391P60577
16582E748858Q60634R04616Q50740R00218J121269J659247K648344M218562O406322
16573B5318810Q532838R275062Q202155L572563k303629o273808p770521o335920
16565C2217550l606945m80364K602275N548790P669385Q213841O771753J964671
16557F0900956k674311n043822m233271l01330M331780P299502P447886K682775
16549G0410165m033375q624775j0426392q749973n540488j846463J793910N312594
16541C8295203P944017Q634905O858709P37311n673742r856529j1091706r425999
16533B6422169o856815m427541k784813j899631j528699j314971j149904r36572
$$ y = [2727549, 3005544, 3159673, 3257425, 3309878, 3409982, 3599805, 3897542, 4361890, 4988281, 5748858, 6609492, 7514108, 8364848, 9265066, 10386335, 12045582, 14693926, 18912488, 25318810, 33851648, 43126710, 51328865, 54901428, 52597799, 46323991, 38553470, 32217550, 28610605, 28130241, 30732516, 36281306, 43950691, 52164532, 58936285, 60900956, 58226645, 53182823, 48949552, 48648222, 52980002, 60279504, 67727390, 70410165, 66376790, 57752015, 47325623, 38575650, 33035162, 31188699, 32982609, 38295203, 46239220, 54874125, 61732834, 62470145, 56796403, 46939874, 35848168, 26422169, 19565354, 15137813, 12353000, 10453369, 8924670, 7609699, 6459795, 5523223]
16525E523223p20074n54720m58758l86560l21168k74598k04339j26661o7723n3796
16515B354826r9066j60175k02498j84762j61287j43331r0929n4770n0679k9082
16505A178247N09j1461O274m0582m2534q6049q6243o5975m7886m9569k4327j7732
16493G12672r429l778m773k0473l3721j8132j2098j0853k6601j8707J4654k093
16481E66668P95J3164m665J2703K9471J2231J8135L7239O1773P0029J24731J39391
16469A081665J31647J30472J39772J85902J72224P2180j8093l1919P616k1800
16459A849666j59601k00584j67551r8655r7820j21156r7818k6050K1856O1709
16449I63996P7777N5401P9435J28890J44553O3537K190K014k812k2788r2998j42778
$$ y = [5523223, 4803149, 4248429, 3789671, 3403111, 3081943, 2807345, 2603006, 2476345, 2408622, 2354826, 2255760, 2095585, 1893087, 1708325, 1547038, 1403707, 1312778, 1258008, 1207329, 1178247, 1178756, 1167295, 1173569, 1132987, 1090453, 1004404, 918161, 852186, 804300, 754731, 730404, 712672, 703243, 699465, 694692, 674219, 640498, 622366, 610268, 599415, 572814, 554107, 568761, 566668, 567463, 580627, 575962, 588665, 618136, 630367, 648502, 685741, 747514, 817543, 942274, 1081665, 1213312, 1343784, 1483556, 1669458, 1841682, 1913862, 1895769, 1863850, 1871466, 1849666, 1690065, 1489481, 1321930, 1223275, 1125455, 1004299, 906481, 880431, 902287, 963996, 1041773, 1097174, 1176609, 1305499, 1450052, 1513589, 1515779, 1517793, 1514981, 1492193, 1399195, 1256417]
16437A256417j44610j00204p1866j03166j14400n8130m2306m2608k9383r449j400
16426E38895j027J1043J6701O261l002O535J2614P195J6871L6820K7573J8862
16414F95341R779J3979M9423K2539J2255J0127K5399M6838O9237Q5667Q7282R6397
16402A224263J27759J08779J11961J29508J34902J40821J64084J53355J43523
16393B438955J45652J46828J57483J76716K40952L08189L42111M22537N07588
16384D887011O20751P43616Q73593J040303J281395J587584K066797K766530L896301
16375A9763881N542502O996482P066597O883808Q287482R605143P132857L147294
16367G4426046N66255K71365N13103j744311o453586q328684p550510o439848
$$ y = [1256417, 1111807, 1011603, 939737, 836571, 722171, 664041, 621735, 579127, 549744, 540295, 538895, 537868, 548911, 565612, 571873, 568871, 575406, 588020, 595215, 612086, 648906, 676479, 695341, 705120, 719099, 768522, 791061, 803316, 813443, 838842, 885680, 954917, 1040584, 1127866, 1224263, 1352022, 1460801, 1572762, 1702270, 1837172, 1977993, 2142077, 2295432, 2438955, 2584607, 2731435, 2888918, 3065634, 3306586, 3614775, 3956886, 4379423, 4887011, 5507762, 6251378, 7124971, 8165274, 9446669, 11034253, 13101050, 15867580, 19763881, 25306383, 32302865, 39369462, 46253270, 54540752, 64145895, 71278752, 74426046, 74992301, 75263666, 75776769, 74032458, 67578872, 59250188, 51699678, 45259830]
16359D5259830o218943n474348l733367j196224J443686L524436M191825M418732
16351D2215627N842401P155388N223459J945266j72400l84703k09024k079763
16343E9536251n958769p529602o968152o187815o200701n901874m909647l570848
16335A2308843k461480j736571j275375r40598o93717n63273m89814m15656l23652
16326C408707k72759k74249k37127j99419j63268j27314j18278j13432j20178
16317A782683r7591p6353p4883p1733p2130n7614l7785m9751p2523o3319n5387
16306A053614p0031n8027p4479o4419n0710m3600l3012j1905l9874l1250l7608
16295E38699k0763j886m833k8014j8594j3682j1666j2808kN662O008k5879j6595
$$ y = [45259830, 39040887, 33566539, 29833172, 28636948, 30080634, 33605070, 37796895, 42215627, 48058028, 55213416, 60436875, 62382141, 62209741, 61825038, 61616014, 59536251, 53577482, 46047880, 39079728, 32891913, 26691212, 20789338, 15879691, 12308843, 9847363, 8110792, 6835417, 5894819, 5201102, 4637829, 4148015, 3732359, 3408707, 3135948, 2861699, 2624572, 2425153, 2261885, 2134571, 2016293, 1902861, 1782683, 1685092, 1608739, 1533856, 1462123, 1389993, 1332379, 1294594, 1244843, 1172320, 1109001, 1053614, 983583, 925556, 851077, 786658, 735948, 692348, 659336, 647431, 607557, 576307, 538699, 517936, 516050, 511217, 483203, 464609, 450927, 439261, 426453, 426451, 432113, 438121, 412242, 395647]
16282C95647N178j2741j9717k4664k9276K79R309M337j8091J755K0127j167o480
16269C24496k1261j8045r316p826k382m417j8574R966J9328O647j9020j0514J0717
16256B59799l1626l2294J494k53J9772R790k81k2945j8093p41J486k694m727n992
16242A72695J117j6161J322K1105o837j4318L763O131L308j3150l628j6342j8900
16229A20105P009L186j817o86N780r291j6092R944J5106L875j0209p068O467j0685
16215A15624n0o273r109P891Q724R224O444j2717j4905j4288R605q95q318N792
16201I6749l823o384Q145j2720P79J0501J8684O414L808J3332j9529j4247O888
16188A08597r644r79O74p556j7161q962J9827j350k1257j9178r900L341Q731k793
$$ y = [395647, 400825, 388084, 368367, 343703, 314427, 314706, 324015, 328352, 310261, 312016, 332143, 330976, 324496, 303235, 285190, 275874, 268048, 265666, 261249, 242675, 252641, 271969, 278616, 259596, 249082, 259799, 228173, 195879, 197373, 197120, 216892, 226682, 226401, 203456, 185363, 184622, 186108, 183414, 178687, 172695, 173812, 157651, 158973, 180078, 173241, 158923, 162686, 168817, 172125, 158975, 155347, 139005, 120105, 127114, 130300, 128483, 127797, 133577, 124286, 108194, 118138, 133244, 137119, 126910, 119842, 126309, 115624, 115574, 109301, 100192, 108083, 116807, 126031, 132475, 119758, 104853, 90565, 100170, 99275, 90957, 96749, 92926, 86542, 94687, 81967, 82746, 93247, 111931, 118345, 122153, 135485, 115956, 101709, 108597, 98953, 97974, 98648, 91092, 73931, 64969, 84796, 83446, 62189, 43011, 33111, 36452, 45183, 42390]
16174D2390P179J1451j216P18R638O856K865J6888k330M62M188J1974J6723J9888
16160A47674K4808L3232L4791L6459J9201K5207R166M84l4682k2662r40j1386
16148B61352l6644k7621j0091j7741J7771K4519K6724K5434M5901M2612K1925
16137C74141J1059J3122m031k3187l9334m2793n0728k7076m1759l2736j5218k1713
16125I9747k1093j1897j0086o109R307o588O941J3536q23j8038j9002jJ1454Q816
16111E6164j6288J470R656L990L206j657m020j1109k4468K734J4035J2538k125
16098D4126j1236j252N372N089j8355q739J928m770J297J1934p318L398j3789
16085G685J985J2472J1156P16J8585O595j5263j2005Q243J1314J569k1175j2847
$$ y = [42390, 49569, 61020, 59804, 60522, 70160, 77016, 79881, 96769, 94439, 94901, 99089, 111063, 127786, 147674, 172482, 205714, 240505, 276964, 296165, 321372, 330538, 331022, 296340, 273678, 272738, 261352, 224708, 197087, 186996, 169255, 187026, 211545, 238269, 263703, 309604, 352216, 374141, 385200, 398322, 394291, 371104, 331770, 288977, 238249, 211173, 169414, 136678, 121460, 99747, 78654, 66757, 56671, 50562, 59869, 53281, 60222, 73758, 72935, 54897, 35895, 35894, 47348, 56164, 39876, 41346, 51002, 54992, 58198, 56541, 52521, 41412, 16944, 19678, 33713, 46251, 44126, 32890, 31638, 37010, 42099, 23744, 15005, 16933, 12163, 13460, 25394, 18076, 21474, 7685, 9670, 22142, 33298, 34014, 52599, 59194, 43931, 31926, 40169, 51483, 53052, 31877, 19030]
16072A9030M310J8333j136K2174M492j5671O070J2661Q577K98r078j1165k0472
16059C8423j0623l950j173O440o067k3410k068p110J231K0683K5408J5329j0620
16046D2493m257K719j16k198L596k421j8857k7023J0372N648M032j0450r766O88
16032e540R251J1057l678j0003J4962K6564O064J1358m01j641K6725K0872J2436
16019A18026K7685M3247M0397N4218L0689J6607m502k0039m6029n2251l0347k648
16007A75053L1847M4679M4649L9246L2995j2559l2953l6853j6511J3556J3066
15996B96215K7097K0859K0732j2045n1581n0969n1413k7709k4926J1096L8233
15985A95589N0135J8316J9960j235l8040m2031k6418k9424k6018j6644k8104k0653
$$ y = [19030, 23340, 41673, 40537, 62711, 67203, 51532, 57602, 70263, 78840, 79138, 70060, 58895, 38423, 27800, 23850, 22677, 29117, 23050, -360, -2428, -9538, -8307, 12376, 37784, 53113, 42493, 38236, 40955, 40839, 38641, 42237, 39816, 20959, -6064, 4308, 9956, 13988, 3538, -6228, -5540, 3711, 14768, 11090, 1087, 16049, 42613, 48677, 60035, 59634, 57993, 84718, 105590, 118026, 145711, 188958, 229355, 283573, 314262, 330869, 326367, 306328, 260299, 208048, 177701, 175053, 206900, 251579, 296228, 335474, 368469, 355910, 322957, 286104, 269593, 283149, 296215, 323312, 344171, 364903, 352858, 301277, 250308, 198895, 171186, 146260, 157356, 195589, 245724, 264040, 284000, 282765, 244725, 202694, 176276, 146852, 120834, 104190, 76086, 55433]
15973E5433j104r844k4903k4883m221N379J6224R716M200J3832J5442j4714q742
15960C1815j6300q887J4871L039j1161J6031j7646j2572m645J8353L501k260m09
15947A3730l766r752m597K5082Q0J226j4430j472p430K820j5072j6345j3695K5176
15933a8445J9538J2025P233O113j309Q621p913O472j109j6761M566J2896o23j2106
15919A9198j056M869q248q053q581K2454O75j78J3374l626j0296j5864p55J1801
15905A5714n952q106J5764M876m082q92L801J1041M993j668j4171O833K5424L7663
15891I1238K8182R771J8218K5525K4024N386j189K2342L8835N660j07j2950k596
15878B52339J873L8152R562k1884j2912q353j4131q535J1103j5175j4681n204
$$ y = [55433, 54329, 44485, 19582, -5301, -9522, -4143, 12081, 21797, 25997, 39829, 55271, 40557, 31815, 15515, 6628, 21499, 24538, 13377, 29408, 11762, -810, -5455, 12898, 16399, 14139, 13730, 9964, 212, -4385, 20697, 20777, 22003, 7573, 6101, -1329, 1491, -13581, -29926, -43621, -18445, 1093, 13118, 20351, 26464, 25155, 33776, 25863, 32335, 31226, 14465, 19031, 31927, 31304, 19198, 18142, 23011, 14763, 6710, -1871, 20583, 21258, 21080, 34454, 30828, 20532, 4668, 3913, 15714, 9762, 1656, 17420, 22296, 18214, 17322, 21123, 32164, 37157, 35489, 21318, 28151, 53575, 91238, 119420, 129191, 147409, 172934, 196958, 202344, 201155, 223497, 262332, 267992, 267885, 254935, 252339, 254212, 292364, 301926, 280042, 267130, 258777, 244646, 236111, 247214, 232039, 217358, 212154]
15866B12154J4684J2662J3405l288j5026P706m819j1511m836r658k4387n452K322
15853A83956K056l9587n0912j0859j3641l1428P347J0209n947j4245O46Q915j5081
15840C1429J0002J9685j5048k4155m574J8598J1821O362O06L278m946j0058o685
15827C6315O857J1453J4207J8638L4177L2632L0769L4725O2270M2521K5682J0224
15815C60470K542J636J1116P023k4490l1344k8711l7030l2585l5813k1349k07
15803A71258K5280O879J4333K5112L5989L9469K8135J6690J4695J078j0668n765
15791C62485j9289n1843m3091l0765k7295l8443m7235m2109k3884k1763k457o912
15779G399n079J7852n20L335Q94j6162M425K842L251q532N84k1754k4045K055
$$ y = [212154, 226838, 239500, 252905, 249617, 234591, 242297, 237478, 225967, 221131, 211473, 187086, 181634, 183956, 186012, 146425, 95513, 84654, 71013, 39585, 46932, 57141, 51194, 36949, 37595, 46510, 31429, 41431, 61116, 46068, 21913, 17339, 35937, 47758, 54120, 54726, 58004, 53058, 43000, 36315, 43172, 54625, 68832, 87470, 121647, 154279, 185048, 219773, 282043, 324564, 350246, 360470, 363012, 364648, 375764, 382787, 358297, 326953, 298242, 261212, 228627, 192814, 171465, 171258, 196538, 203417, 217750, 242862, 278851, 318320, 346455, 363145, 377840, 378918, 368250, 362485, 343196, 291353, 248262, 217497, 190202, 151759, 104524, 62415, 38531, 16768, 14311, 7399, 2320, 20172, 19652, 22987, 23881, 7719, 12144, 14986, 18237, 9705, 10289, -11465, -35510, -33455]
15765c3455K9089K6251P127q540o827k482J005j0188r473j821j0277j3507l641
15752c6739k52l699M957J9469J3707K464J0941j4079L241m159j1384L152N375
15739g006j196N78l828K688Q574K1583p527k0217o510K572R008K32m043l507r838
15724a8437j4535m670K2778J4695K144k50p6m20r962k2458Q955L678j913M068
15710a6403r442O554J1419J4933q39j1359o017Q219J045L237O965M732R437j3014
15696I467j1012l035o423O457n682J6855P058j6311L792k240J965J2531p238l980
15682B204P165N525m044Q40n592J3777M706q538j666q08O861j7503r868j5850
15668b2791K763P682K686L620l796J0195o582k904Q344j855n519Q810p975K972
$$ y = [-33455, -4366, 21885, 29012, 20472, 13645, 11163, 12168, 1980, -7493, -9314, -19591, -33098, -36739, -36991, -40690, -35733, -16264, -2557, -93, 10848, -3231, 10, -4149, -15533, -12381, -7006, -8202, -7624, -11452, -8764, -190, 21393, 13866, -6351, -12861, -10289, -1281, -1049, -5092, -8599, -18437, -32972, -37642, -14864, -169, 1975, 1725, 1649, 1229, -8733, -31191, -22236, -18558, -20471, -16403, -25845, -19291, -7872, 7061, 6222, -5137, -11154, -2935, -1890, 1347, 8312, 13044, 22481, 9467, -1545, -4580, -11003, -4546, -10228, 6627, 13685, -2626, 1166, -1074, 891, 13422, 6184, 2204, 9369, 14894, 10850, 11690, 6098, 19875, 24581, 16043, 14377, 13569, 20430, 2927, -6941, -22791, -20028, -12346, -9660, -6040, -9836, 359, -6223, -9127, -783, -2638, -8157, 653, -7322, -4350]
15654d350J2549J342p496O582m188n547j051m602P515j0043k7202L752R600o680
15640b9819K0908J6377K3000J9642l626j7337q406j1254p394M741q239o697l693
15627a1797o408O250N578J235M296n971j2190J0125l632J6150Q081L26N520K2363
15613C9926J7649n256j0249l6352m590N046J112j40J3685K570j1945n94j2917
15600b055M899K292j2108J5636j143q030O15M583J1684K1651J135k6952j8745
15587f538J1536Q853r13j2319j6603L242Q454J1919K965o321j582n748o465q430
15573a7950J5006k993J001q490M77J2012J0495j254K820l384L568o552o408j2469
15559a4121j7883m206J3648l908n973J6697J5766k421m541R943J551n130n479
$$ y = [-4350, 8199, 9541, 2045, 8627, 4439, -1108, -2159, -6761, 754, -9289, -36491, -32739, -23139, -29819, -8911, 7466, 30466, 50108, 46482, 29145, 20739, 9485, 2091, 6832, -1407, -8104, -11797, -18205, -11955, -6377, -5142, -846, -6817, -19007, -8882, -12514, 3636, 11717, 12043, 17563, 39926, 57575, 52319, 42070, 5718, 1128, 6174, 7286, 7146, 20831, 23401, 11456, 10862, -2055, 2844, 5136, -6972, 8664, 7521, -509, 106, 4689, 16373, 38024, 39159, 12207, -6538, 4998, 13851, 12938, 619, -15984, -12742, -4288, 7631, 10596, 4275, 2693, -3055, -9520, -17950, -2944, -5937, -4936, -13426, -12949, -937, 9558, 8304, 11124, 7740, 11308, 4756, -1652, -14121, -32004, -36210, -22562, -26470, -32443, -15746, 20, -2401, -6942, 3001, 4552, -578, -6057]
15546f057p706J199j288n825M517k218o341Q711J2652R08m215j823j7676j0592
15532c5754M754l461q673r705J4482O588O06J5215J7949J3262J7844k4359j5440
15519f692K1324n356j1849p608r380l200k2784l095K0092K0724K246J8568J382
15506A4372r68l424J3613N940q81l308j1572j369j90p478K53n759j5082K305l605
15491a7153j6185J1725m377m657j937J0192M252j2425K262m803J8133J2586j1845
15478a4232K135K504o957n857J5146J6482n065j43L497j3792j38J1316K564j6890
15464i430j3289J6720Q375J0393J246J3452q994j4597J911J3539P577l037K032
15451B5898n780N989k5601q450P201R642j200J004K422j1710j0545M376L361N037
$$ y = [-6057, -13763, -12564, -13852, -19677, -15160, -17378, -23719, -15008, -2356, -1448, -5663, -7486, -25162, -35754, -31000, -34461, -43134, -52839, -38357, -31769, -31163, -15948, 2001, 15263, 33107, 8748, -6692, 14632, 9276, -2573, -10181, -19561, -22761, -45545, -48640, -28548, -7824, -5578, 12990, 14372, 13404, 9980, 23593, 29533, 28652, 25344, 13772, 12403, 12213, 4735, 4988, -771, -15853, -13548, -17153, -33338, -21613, -25990, -30647, -32584, -22392, -18140, -30565, -28303, -33106, -14973, -2387, -14232, -12097, -9593, -16550, -22407, -7261, 9221, 4156, 4013, 7510, -6282, -6420, 4896, 7460, -9430, -22719, -5999, 2376, 12769, 14015, 27467, 18473, 3876, 5787, 19326, 26903, 23866, 25898, 20118, 26107, 506, -7944, -743, 8899, 7699, 8703, 11125, -585, -11130, -6754, -3393, 1644]
15437A644n287L470o300J2196K477K365J0352O63J306O578k968l069M787k2584
15423E630J646L325O932p472j9515r228O165O15J9780M063j1718J1497J1345m233
15409A8832j0062o836j5768q718J7081J4367K602j4056Q869K343k247l7J93p998
15395a435J803M365j0745j3674K639Q319N630m239K1748j5413o899K872K2845
15382A7816R764l000j9620k179Q875Q201k6133j7463J8N04N84p477M557p9J0361
15367a5271M49M266O64j3167R547O469m79k829J6513P120j433n811N242M116q906
15352F490j553M222R419J4017r797m938j828j5288M801J104K156m826j1526j2460
15338b0007j0288j021L969J0965L620O403J6636p615l775k1857L054j186o432
$$ y = [1644, -3643, -173, -6473, 5723, 8200, 10565, 20917, 21580, 22886, 29464, 26496, 23427, 28214, 5630, 7276, 10601, 17533, 10061, -9454, -18682, -12517, -11902, 7878, 11941, 223, 11720, 23065, 18832, 8770, 1934, -13834, -22552, -5471, 8896, 11498, -2558, 6311, 8654, 6407, 6370, 6563, -1435, 368, 4733, -6012, -19686, -17047, -8728, -3098, -7337, 14411, -1002, -7901, -5029, 17816, 27580, 24580, 4960, 2781, 11656, 19857, -6276, -23739, -23721, -23217, -22633, -30110, -25553, -25632, -15271, -14822, -10556, -9892, -23059, -13512, -7043, -7522, -10351, 6162, 13282, 11849, 6038, 11280, 15396, 6490, 4937, 9159, 18578, 32595, 22798, 17860, 16032, 744, 5545, 6649, 8805, 3979, -7547, -20007, -30295, -31316, -27347, -16382, -12762, -6359, 10277, 2662, -1113, -22970, -19916, -21102, -27534]
15325b7534J2761M419l652R84O643L245m750j2888n539R579N629K836M339m85
15311d413j2760K683j1482l660J301L865P283K3027n16K224L797L399j2275k1599
15297a9126j4385q306J0149J4382Q649J4259l593j09p662j4461j4953K0406O605
15284h145j3500Q277R137J37J0742K891k527p312N41m892n427j700N188N203j0336
15269a1723j332p106q222l040J0487J0124l653l622O656J140k212J4611n95k552
15255a039Q361p089k183J1208K290j6613j0229j3468j78K3195J0421j2536p435
15242a5295k198o998J0919R35k22N999L535N371J30j670K3508o06Q7p854K337
15227A7978j0906q730M455P243p438j479J8720J0034j5242j7501k906q403r929
$$ y = [-27534, -14773, -10354, -14006, -13022, -6379, -3134, -7884, -20772, -26311, -16732, -11103, -8267, -3928, -4413, -17173, -14490, -25972, -29632, -28331, -24466, -17183, 5844, 5328, 7552, 11349, 14748, 2473, -19126, -33511, -41817, -31668, -17286, -8637, 5622, 2029, 1920, -5742, -20203, -35156, -14750, -8145, -21645, -13368, -4231, -4094, 6648, 9539, 7012, -300, 241, -4651, -10078, -11778, -6590, -1387, -11723, -13055, -20161, -28383, -31423, -20936, -10812, -14465, -18087, -11431, -10291, -12503, 2108, 1513, -1039, 7322, 233, -1950, 9258, 11548, -5065, -15294, -28762, -28940, -5745, 4676, -7860, -15295, -17493, -24491, -13572, -12637, -12859, -6860, -3325, 2046, 2176, 506, 24014, 23408, 23495, 15641, 17978, 7072, -1658, 2797, 10040, 2602, 1123, 19843, 29877, 14635, -2866, -5772, -14175, -24104]
15214b4104J073m541O689L63j062K1880j687j243m805J7450J6986l156Q553l586
15200B8810k271k3264j6075O71N462N551j3178j6848M057P055K2556J0728J6232
15187B9486k531p888n329P581P427o073j9654j7555j9737p585J0856K440J0157
15174a8405k949j636K1536L057k193q344N108q781m476j294p138J4674R670J3402
15160A2231J369k0557n924P324l210j244N115q868p908r995P10Q679R442J1388
15146a448o689P982J1971p469N162J937k1898l940K371k674N453k194j0847l720
15132b6003m935J6143J1116K997j485J1146m110j5643N258J1699Q495k1958m709
15119a1989J7781l807j8505j045N281j898k267L756Q454J0211j0417o827p802
$$ y = [-24104, -23031, -27572, -20883, -20520, -21582, 298, -1389, -2632, -7437, 10013, 26999, 23843, 32396, 28810, 26539, 3275, -12800, -12129, -6667, -1116, -14294, -31142, -27085, -20030, 2526, 13254, 29486, 26955, 19067, 13738, 21319, 28746, 22673, 3019, -14536, -34273, -41858, -31002, -28562, -18405, -21354, -22990, -1454, 1603, -590, -8934, -3826, -12607, -17083, -18377, -25515, -10841, -1171, 12231, 13600, -6957, -12881, -5557, -8767, -10011, -4896, -13764, -21672, -31667, -30957, -22278, -12836, -1448, -8137, -155, 11816, 4347, 9509, 11446, -10452, -14392, -12021, -14695, -9242, -11436, -22283, -26003, -30938, -14795, -3679, -682, -2167, 8979, 4869, -10774, -5516, 6183, 14678, -7280, -11989, 5792, 1985, -16520, -17565, -12284, -14182, -16449, -12693, -4239, 5972, -4445, -11272, -19074]
15106a9074O626M214O975n000N839J5633M209n357n769M411J0274M729j1625r303
15092F782j2014j5006J525K164L891N361k579k486o99n856j8061o33J6109J2084
15078i418l377p16J9597K4672J776j0083j0544j0177J2298M750L335j5423M184
15065A0874J0924j1466j6027o975j7598M4m81P413J1808K3194O001m18n241j6257
15051d205j3048J3546p298j3103n012O198K245K424J3925J5963P821L957L967
15038B7380k728j8844j350J4879j2312j007R95j5731j0166O375J3064K2533j5058
15025H030j5767J9512r60j8895m48R823M566k1836M895N667j1863k53q413n174
15011c1116J4641K364l570n922L537L88q64R632O159o375Q593q43k79J038k997
$$ y = [-19074, -12448, -8234, -1259, -6259, -420, 15213, 19422, 14065, 8296, 12707, 22981, 27710, 16085, 6782, -5232, -20238, -18713, -16549, -12658, -7297, -9876, -12362, -13061, -18917, -36978, -37611, -21502, -9418, -12795, -13511, 6086, 30758, 32534, 22451, 11907, 1730, 14028, 18778, 22113, 6690, 10874, 21798, 10332, -5695, -12670, -30268, -30224, -30705, -23292, -11484, 11710, 17711, 17293, 12052, -4205, -17253, -3707, -11005, -24108, -29120, -22922, -20677, -18253, -4328, 11635, 19456, 23413, 27380, 24652, 5808, 4458, 19337, 7025, 6018, 7013, -8718, -18884, -12509, 555, 23088, 8030, -7737, 11775, 10815, -8080, -8528, 1295, 5861, -15975, -11080, -5413, -17276, -17529, -25942, -31116, -16475, -14111, -17681, -23603, -20066, -19678, -20542, -10910, -4751, -11126, -2533, -3376, -3655, -2617, -5614]
14996e614r931K741k300n806m995J67J4798J3045N220Q98j5749n112q607Q186
14982a3059j4646J85J5452R379J3106p450o663N665N127L388r509K932J0227q457
14968E677q292n697q28n170P796m88j924Q106p427j0524k209M733j770m581K4613
14953B015K1082j7521k1542J1052J0635L277L674j9407j370J3412K082n841J6439
14940A7987j4414o506o390j035j4286q697P427N866M761Q281O044L613R227q610
14926C268j616l762r523n698R261J1861J847k0427n884k566R813p012j4815J821
14912c3432R658O933J503j747J1329J1336j1039M784J2455n235r541l384m42j783
14898h605m080q682M736j862L028J9027P164j457J0317k09j719j7935p717j6159
$$ y = [-5614, -15545, -12804, -15104, -20910, -25905, -25738, -10940, 2105, 7325, 8223, -7526, -12638, -21245, -13059, -27705, -27520, -12068, -2689, 10417, 2967, -3696, 1969, 7096, 10484, 975, 3907, 14134, 5677, -2615, -8312, -9140, -14310, -6514, -7002, -8926, -820, -8247, -18771, -20980, -16247, -18017, -22598, 2015, 23097, 5576, -15966, -4914, 5721, 8998, 12672, -6735, -8105, 5307, 7389, 1548, 17987, 3573, -2933, -9323, -10358, -24644, -33341, -25914, -20048, -15287, -7006, -962, 2651, 11878, 3268, 1652, -2110, -11633, -17331, -8070, 3791, 5638, -14789, -20673, -23239, -13426, -20438, -35253, -33432, -23774, -16841, -15338, -17085, -5756, 5580, -5459, -675, 11780, 6545, -2996, -6380, -6822, -8605, -12685, -21367, -16631, -18493, -15465, 3562, 10726, 9269, 19586, 19377, 17658, -277, -7994, -24153]
14884b4153p764J6380k393l35N672k2443j2382J1257J1670J2104O024J0562J0614
14871A4813R640Q773o184o393j3114p622O865O369j6534L156k590j1281L172J7119
14857F189n164O734j2914j872J4392O774K228n315l55r323J953K573M234R216
14843A9350N825j755j3339k0751J736R340q070J0958J1806R520O590p620j827
14830B1763K242K251j3535r682j7803j4545j895J3746q502j2324J0650k337L040
14817b6931N69J1331p299L825J0208j2p955j0240q111J1908K3178J1450L447O49
14803A6017q404j6539j5016O01n651M006O44r366n058K715P180L9502l479j3661
14789f509n276N32Q457j3414j410J4838n678r131J2564J2193j4422j7430K521
$$ y = [-24153, -31917, -15537, -17930, -18265, -12593, -35036, -47418, -36161, -24491, -12387, -6363, 4199, 14813, 24453, 33226, 27042, 20649, 7535, -87, 6778, 13147, -3387, -231, -2821, -14102, -10930, 6189, 1025, 7759, -5155, -7027, 7365, 14139, 16367, 11052, 10697, 1374, 3327, 5900, 10134, 19350, 25175, 23420, 10081, -10670, -8934, 406, -7664, 3294, 15100, 24620, 31210, 23590, 21763, 24005, 26256, 12721, 3039, -14764, -29309, -31204, -17458, -25960, -38284, -27634, -29971, -26931, -26362, -15031, -22330, -18505, -8297, -8309, -16264, -26504, -34615, -22707, 471, 11921, 15368, 16017, 7613, -8926, -23942, -23341, -28992, -24986, -24342, -33708, -38766, -36051, -28871, 10631, 7152, -6509, -11785, -11253, -2796, -16210, -17620, -2782, -8460, -17591, -5027, 7166, -7256, -24686, -22165]
14776b2165M733j8390q594r65M224J4545J1251K0021o827k2426L162J2127k926
14763a2230L065R939M907j3926L562M910J0994r580l0641j1730K6075K4160L60
14750I865L951j0988N125J1077O159j6165l150j2872j8393m590Q779r458k371
14737c3031R387J1470L353q3j076j3436j3132J75J0433J4041J4299l440o349P195
14723a94J2009J310j5698k606J1214op953l047K905J2060j354l728N452K040J0730
14708B3134j9543k347J3626P594k913N969p191j1570j5962L28n724L359O936j2805
14694a7109k300j2563p961K2184K4220k3702j9905J5088J3856j5511j6126K1992
14682a7837R887K511L666R015o765L66N913N012q007p818R005n74k700j3339R75
$$ y = [-22165, -17432, -35822, -44416, -45381, -41157, -26612, -15361, 4660, -2167, -24593, -21431, -9304, -12230, -9165, 774, 5681, -8245, -4683, 227, 11221, 1641, -29000, -40730, -14655, 9505, 9865, 13816, 2828, 7953, 19030, 25189, 9024, 5874, -6998, -25391, -29981, -21202, -30660, -33031, -23644, -12174, -8821, -8904, -9980, -23416, -36548, -36373, -25940, -11899, 2400, -1040, -7389, -194, 11815, 13125, -2573, -5179, 6035, 6029, -1924, -4971, -2066, 9994, 8640, 4912, 10364, 12404, 23134, 3591, 1244, 14870, 22464, 19551, 25520, 18329, 6759, -9203, -8875, -14599, -11240, -4304, -17109, -19409, -31972, -39933, -17749, 6471, -17231, -37136, -22048, -8192, -23703, -39829, -17837, -7950, -5439, -1773, 7242, 477, 843, 6756, 11768, 3761, -4057, 4948, 4374, 1674, -11665, -10690]
14667a0690J4703M089O380L893n348j1521o175L769p143p300k301k7015j0219
14654e4878J2884J8629O433O720k925p436m801L216J0105l877j1966q791P186
14641b9501K8117L0939j9906k7008O64M719K633j0097m637M786r0o39J65O697
14627a3158R548J2917q899j2681J3043K220m321r819j1055P218R559J4752Q06
14614A0130p31O694J134R720P40q19j2527J852j5996n716L941J3530q352L657
14600G257k20j9452p609L670n035J535j3914N549J1660J8027R079Q02p963m819
14586a433l30L972N949q546j0914J0325k1229j0916J0539J5192P548r596j9015
14573b8454K598o03P954j2761n399J8783J7815o528l122O195m781k334L137K0723
$$ y = [-10690, 4013, 8102, 14482, 18375, 13027, 1506, -4669, -900, -8043, -15343, -17644, -44659, -54878, -41994, -23365, -16932, -10212, -13137, -20573, -25374, -22158, -12053, -15930, -27896, -36687, -29501, -1384, 29555, 9649, -17359, -16695, -11976, -9343, -19440, -24077, -19291, -19381, -20020, -19855, -13158, -3610, 9307, 408, -12273, 770, 2990, -1331, -11150, -22205, -14987, -5428, 9324, 10130, 9399, 16093, 17227, 26947, 27687, 26868, 14341, 16193, 197, -5519, -1578, 11952, 3600, 7257, 7037, -12415, -20024, -16354, -21389, -19854, -33768, -28219, -16559, 1468, 10547, 11349, 3386, -1433, -1763, 2209, 8158, -388, -11302, -977, -22206, -33122, -22583, -7391, 157, -9439, -28454, -25856, -26459, -18505, -31266, -36665, -17882, -67, -6595, -9717, -3522, -8303, -10637, -7500, 13223]
14559A3223J2282q415k293k698M224q473j170q162P736J7660q828K22j2j6869
14545a573k097P891P891K010j1124j8621l553J4074Q351P486r885j7249Q67J615
14531a3917J7518J1124J3619j5080K310j330p327n611M392N931Q11j383O391J5352
14517C2800p505o189j2552m052J190J466J990J6783q95j6749r558L711J557J9415
14503B1412J8138p694k0647k3206m332J5549j527l648m736r740j2089M966L590
14490b3964R131J0059Q601k357j2119Q51q172j587n375j5961J236J1877J688M25
14476b5667m352N166L603J2407K0643J1771j3928j2569j1107j0764O356K7081
14464H640J6971J422j5478j5272n880q975n482J8307r936j811J3694P359j4697
$$ y = [13223, 25505, 17090, 14797, 12099, 16323, 7850, 6680, -1482, 6254, 23914, 15086, 15308, 15296, -1573, -3670, 4221, 12112, 14122, 2998, -15623, -19176, -5102, 3249, 10735, 850, -16399, -15532, -13917, 3601, 14725, 28344, 13264, 15574, 14244, 6917, 1306, 5698, 11629, 12440, 11057, 17448, 32800, 25295, 19106, 6554, 2502, 3692, 5158, 7148, 23931, 23036, 6287, -3271, 440, 1997, 21412, 39550, 31856, 11209, -11997, -16329, -780, -2307, -5955, -10691, -20431, -32520, -27554, -23964, -14833, -4774, 3827, 1470, -10649, -9798, -17970, -19557, -24932, -40893, -39657, -27780, -26092, -25667, -30019, -24853, -21250, -8843, 11800, 23571, 9643, -2926, -14033, -24797, -18441, 8640, 25611, 27033, 11555, -3717, -9597, -18572, -24054, -5747, -15683, -17494, -3800, 3559, -11138]
14451a1138O873J0452k072K804j0308j3593j179O945j7293J282R316j2664R585
14438b0990K4706J2326m280o439j2228N510q696N382L704J14R685l087q883J903
14424a273l900o287J9819J843o158j6137j2621J0914M975n777j861J0187n0l880
14410a0206L352P222P078j6411k4841n536J106O761R095L201L435N484N118K868
14396b274n923K824L127k9229N718J1302R191l801J0555P780K030J768l386k3072
14382a3390q272O953j1218J225P579K779N37P300K1238M319k4023j9718j3695
14369c8386l220J4886K762l940O545l767Q746k580r641n848l295p274Q255k25
14355c6982o234K837J776M695K8358M100p562R199j261J334k023n881j3415j680
$$ y = [-11138, -4265, 6187, 4115, 6919, -3389, -16982, -18161, -11216, -28509, -27227, -17911, -30575, -20990, 3716, 16042, 11762, 5323, -6905, -1395, -10091, -4709, -1005, -891, 8794, 5707, -3176, -1273, -5173, -11460, 8359, 10202, 4044, -12093, -24714, -13800, -8825, -14602, -16463, -6276, -6326, -10206, -6854, 368, 7446, -8965, -33806, -39342, -38236, -31475, -22380, -19179, -15744, -10260, -5142, -2274, -8197, -5373, -2246, -31475, -25757, -14455, -5264, -9065, 1490, 9270, 11300, 13068, 9682, -13390, -21662, -14709, -25927, -24702, -17123, -14344, -13807, -6507, 14731, 19050, -4973, -24691, -38386, -41606, -26720, -23958, -27898, -21353, -25120, -16374, -18954, -28595, -34443, -37738, -45012, -36757, -36982, -43216, -40379, -38603, -33908, -5550, -1450, -9012, 187, -1074, 260, -1763, -7644, -21059, -22739]
14341b2739J3341K67O143J7414K213n100j6517M126M411j4751k2355P340P282
14328a8925P998K6337J442j4346J275j036j4542N295N058n801l256R782M660q838
14314d897j795j0107J0352O557L596n481j0420J0294m588M240n141n303l096R948
14300e841L691o433l541P458Q790k977n155p534j3813P180J7286K286R29j703
14286F23j2196j2136n706K450J6611J6366j4454L508J6311n664r790l456L048
14273d485P44O956j913n962K160r890J209o337j2266m43J4499J878O045K032J0224
14258D451r522j3414k60Q071M321n751n336L547K999N962k004j0243j3641J7447
14244a3373L438K5298O233j6169J1144J3297m893m752L300Q972q342O308L763
$$ y = [-22739, -9398, -9131, -2988, 14426, 16639, 11539, -4978, -852, 3559, -11192, -33547, -26207, -18925, -10927, 15410, 16852, 2506, 3781, 2745, -11797, -6502, -1444, -7245, -10501, -719, 3941, -4897, -6692, -16799, -6447, 110, 3706, -1775, -12195, -1901, -6489, -2249, -7390, -12693, -15789, -5841, -2150, -8583, -12124, -4666, 4124, 1147, -4008, -11542, -25355, -18175, -889, 1397, 2326, 623, -11573, -23709, -29415, -26965, -10354, 6012, -8442, -4934, 11377, 5713, -4077, -7533, -4485, -3741, 3215, 1302, -4660, -2500, -12390, -11181, -17518, -29784, -30227, -15728, -13850, -7805, -5773, 4451, -5071, -18485, -18745, -10674, -6353, -12104, -17440, -13893, -10894, -4932, -6936, -17179, -30820, -13373, -9935, 15363, 21596, 5427, 16571, 29868, 24975, 20223, 23523, 32495, 24153, 30461, 34224]
14231C4224j0753j7096k5009J6980J3727n287r06j0898j3552k73O37J2454Q920
14218C168M97M443k935k5411m455J119l721J1926J7013O406n60L560r647p959
14204f556p381M624l653M44j115J200n822J1698P357K167P994P834L522j257j0453
14189A0603j2476j0475P957L249m325P94L077J222q748j1115Q156k555J06K2107
14175G577N909j3125m281k853M687K1917K782j6778j0264o149m251m717R298q173
14161a8421n104j774K0295M441N32O56L519M028j730J383j4341J668J6370k3987
14147a2465q60n542p848P239K0942j8017j9918J0476K969p269J6458K0145Q043
14134A4353N108l849M370j2108j180M051r34p486k0412k7212o60J2578K0749J4446
$$ y = [34224, 23471, 6375, -18634, -1654, 12073, 6786, 5880, -5018, -18570, -18843, -18206, -5752, 3168, 3665, 8108, 5173, -20238, -24693, -23574, -27295, -15369, 1644, 8050, 7490, 11050, 1403, -6556, -13937, -9313, -12966, -12522, -13637, -12437, -18259, -6561, 796, 2963, 10957, 18791, 22313, 21056, 10603, -1873, -12348, -4391, -1142, -5467, -4673, -1596, -374, -9122, -20237, -12081, -14636, -14530, 7577, 13486, 361, -3920, -6773, -2086, 19831, 22613, 5835, -4429, -10578, -14829, -19546, -10248, -18421, -23525, -25299, -5004, -563, -31, 625, 4144, 8172, 6442, 7825, -6516, -4848, 11522, -12465, -13325, -18867, -26715, -19476, 1466, -16551, -36469, -25993, -23024, -30293, -13835, 6310, 14353, 19461, 15612, 19982, 7874, 6694, 10745, 9811, 2325, -18087, -45299, -45959, -33381, -12632, 1814]
14120A814p112l724M560l723l40m420R669K697J311k526Q526n713l639j8925j2670
14105c4215J1499K8350K0680J0537J938K098q898j1059j0921O421M733n153R6
14092A6106j4624j8118j2143m499K07K288J7635O263r625k983n200l883R726M373
14078a4477j2037n143j011M971J8615j1883J426k996j0735J6156n297O654l243
14065a9000j0362O071J7446J0112p988q198M862K0316J1584j0819l33j4724m519
14052e552J334J247k3782J2341O339J3208J1645r807r970p399L561l405Q372n997
14038g865l305k268n367P654J1678o494J592j954J850k12J0967O736j5994J633
14024a349J1385l540j5635q181p459j4573J3039P429k099J878J2166J0822N784
$$ y = [1814, -5298, -9022, -4462, -8185, -8525, -12945, -3276, -579, 732, -1794, 6732, 1019, -2620, -21545, -34215, -22716, 5634, 26314, 36851, 38789, 40887, 31989, 20930, 10009, 16430, 21163, 16010, 16106, 1482, -16636, -28779, -33278, -33071, -30783, -13148, -6885, -16510, -19493, -24693, -28576, -18850, -14477, -26514, -31657, -32668, -27697, -9082, -20965, -19539, -22535, -33270, -17114, -22411, -15757, -19000, -29362, -23291, -5845, 4267, -3721, -11919, -7057, 13259, 24843, 14024, 13691, -1033, -5552, -4218, -2971, -26753, -14412, -8073, 5135, 16780, 6973, -2997, -10396, -6835, -10240, -1868, -7865, -11170, -13438, -18805, -11151, 527, -5967, -4375, -6329, -4479, -4691, 6276, 13012, -2982, -1349, 10036, 6496, -9139, -17320, -24779, -39352, -26313, -18884, -20983, -19105, -6939, 3883, 9667]
14011I667j310q268Q82J983l422l003k934N117q727l291r019j1067J8049k225
13997a7568j1684K966J0036N422N168n827r361j2482l787J9541K7796J459n138
13984F541j2138j511J8473j167p936J946K184o618j4304n969J3630J457k657P064
13970a005J7106o600k1261o303m233J2870o18n824P818n350q031J331J7679J4657
13956A2236j2998q155n777J3792M512l763p595O945J3924O000k1462K597J0321
13943A0577R914R744k1855q707n827n241K414K958J3245j0164j6872N844k85J4060
13929a95R435j3869M031P747R09l007J7844p005n266n433k7889q612L984R206
13915a8120N867M177j1316j4748j0265j04P041j631n331J8578J6529m27L262K2197
$$ y = [9667, 8357, 89, 971, 2954, -468, -3471, -6405, -1288, -10015, -13306, -22325, -33392, -15343, -17568, -29252, -26286, -16250, -10828, -5660, -11487, -20848, -33330, -37117, -17576, 10220, 11679, 6541, -5597, -7108, 11365, 10198, 2262, 4208, 6392, -226, -14530, -20499, -6869, -5412, -8069, -1005, 16101, 9501, -11760, -18063, -22296, -9426, -10044, -15868, -8050, -13400, -21431, -20100, -2421, 12236, -762, -8917, -14694, -902, 3610, -153, -7748, -803, 13121, 19121, -2341, 256, 10577, 20491, 30235, 8380, -327, -6154, -11395, -8981, -6023, 7222, -2942, -19814, -13970, -14255, -195, 9240, -4629, -598, 7149, 8058, 5051, 22895, 15890, 10624, 5191, -22698, -31310, -27326, -18120, -12253, -8076, -19392, -34140, -44405, -44509, -37468, -39099, -44430, -25852, -9323, -9750, -6488, 15709]
13901A5709j915k0588r001M495L908q213j1457N540J26J9343J2701j1341K935
13888B242k648N466O498k316p389j1329Q061J9571k706j671j405j7573J770k444
13874e873k0049L524J4503J4593m052p210o534j4442O590L767q037M946J490j4045
13860c0829q3J6784J9076O296M171O586Q490l714o877M272J791m362l762K772
13846B0611n351m943o547P347n55J308J1493L389J4576K663k809Q221o86j8162
13832C0555Q523l581p701n067J2234J205M84j0448p167J7226J1378J2238L978
13819F3857m484O778r985k124M578J1682J1501J4218K9134k688J6251J9498K8291
13806A86507M0840M5051N3911M8048N6480Q3820J00973Q9355J17604J53283J96483
$$ y = [15709, 13794, -6794, -15795, -11300, -7392, -15605, -27062, -21522, -21396, -2053, 10648, -693, 2242, -406, 5060, 11558, 9242, 1853, -9476, -1415, 18156, 15450, 13779, 12374, -5199, -3429, -5873, -25922, -22398, -7895, 6698, 2646, -4564, -11098, -25540, -18950, -15183, -23220, -18274, -16784, -30829, -30912, -14128, 4948, 11244, 15415, 22001, 30491, 26777, 19900, 24172, 25963, 21601, 17839, 20611, 15260, 10317, 3770, 11117, 10562, 11870, 23363, 26752, 41328, 43991, 41182, 49403, 48717, 30555, 39078, 35497, 27796, 22729, 34963, 36168, 36652, 26204, 19037, 36263, 47641, 59879, 63857, 59373, 66151, 56166, 54042, 58620, 70302, 81803, 96021, 125155, 122467, 138718, 158216, 186507, 227347, 272398, 326309, 374357, 430837, 514657, 615630, 704985, 822589, 975872, 1172355]
13795A172355K64803M10634O51283R99480J172396R69789Q20090N15400L3744
13786G009974m27847o36508r97823j193625j097078q06240n17359l10554k09625
13777H13315j61298j04644p2322o4553o3170m8220l6389m6429m6042k4190k5941
13766A20117p192R96l633j6583l718L156r369k9171j7339r035K461Q788Q586m655
13752D3409K1664n884j086j0389j6562k328J2882q443j8290l413k708M639R818
13739B3309p366p221N732J7049j75j5225k655J6117r564J800N800j2543M464N227
13725B4749j7615k0535N354J2288k3587j2770R175O718k334n231J711m551n997
13712c2625j0643J5567K0370J53J5300J5039j2745m186l284K892j2910q201n039
$$ y = [1172355, 1437158, 1847792, 2499075, 3498555, 4670951, 5640740, 6460830, 6976230, 7009974, 6582127, 5945619, 4947796, 3754171, 2657093, 1850853, 1333494, 1022940, 813315, 652017, 547373, 475051, 410498, 347328, 299108, 262719, 216290, 170248, 146058, 120117, 112925, 113921, 110288, 93705, 89987, 93143, 83774, 54603, 37264, 28229, 30690, 39478, 48064, 43409, 65073, 59189, 58103, 47714, 31152, 28824, 41706, 33263, 14973, 11560, 8852, 13491, 23309, 15943, 8722, 14454, 31503, 31328, 16103, 13448, 29565, 20001, 21801, 27601, 15058, 19522, 24749, 7134, -13401, -8047, 4241, -19346, -32116, -22941, -16223, -18557, -23788, -22077, -26628, -32625, -43268, -27701, -7331, -7178, 8122, 23161, 10416, 6230, 2946, 5838, -7072, -15273, -20312]
13699b0312n427J3231R430k42n292J2527N454m494j7289k9514j5240Q19J3216
13686d3133K5715J0980k526Q56O785J6529K0195O930J0894j0939P951k830j1339
13673C6068q815j6649j7436j10n703N576J3174o24k1757r982J8931Q267k329R366
13659G977l986j8665o466P083J0908N709n43k722N343O125k3290J834K6010K9321
13645D4638L24j1461j321L902p40P177Q5j8755j2953k085o645m880j7140M408
13631a5446O426o294M387o1j1264M335l459j2209J2550J2602q490K094J1371K619
13617h39j2326l112R120Q028P74q227J830j3727K067N406n536j1776N317M480
13603a8521M584N388j558J993j1343k0876Q771J9068J1156J0121J5998M325j7528
$$ y = [-20312, -25739, -12508, -3078, -3320, -8612, 3915, 9369, 4875, -12414, -41928, -57168, -56349, -43133, -17418, -6438, -8964, -8108, -1323, 15206, 35401, 42331, 53225, 42286, 50237, 47407, 36068, 27253, 10604, -6832, -6942, -12645, -7069, 6105, 5481, -16276, -26258, -7327, 940, -1389, 7977, 3991, -14674, -21140, -14057, -3149, 2560, 2017, -705, 4638, 10763, -12527, -10693, 15317, 44638, 44962, 33501, 32180, 36082, 35342, 42519, 42604, 23849, 10896, 8811, 2166, -2714, -19854, -15446, -9020, -15314, -10927, -10988, -22252, -17917, -21376, -33585, -21035, -8433, -16923, -14829, -3458, -839, -13165, -16277, -7157, 871, 1645, -6582, -4752, -18479, -16412, -11006, -16542, -28318, -23001, -18521, -13937, -8549, -10107, -8114, -19457, -40333, -31562, -12494, -1338, 8783, 24781, 29106, 11578]
13590A1578k4146m1418j5764K0674J1678q795P6N478K935P72j99K879P116j2958
13576d0094L3009K0180j1905j6547q657m323j770r330K46r380N490K3012L829
13563a6240j7015j098K3262J818j2355M168j0441L702K4884O630j6038J183q945
13550a6485q267J012j0887k519Q644N486J4127J4445R587p906j5358m636J1210
13537a547M694r646q37j4727k4155j163M552J4902K3185K5378P655m010q347j1387
13523D547j7585p448n226n746Q488q457o374O566J2407k22L669n694r968o565
13509c7608M109Q16J1135m188o386p68J3588J5650k933N132J2955n676j2350p313
13495a3837j1521l905J4761J4580J5308o939K239o836q322N019K177j7758k5830
$$ y = [11578, -12568, -53986, -69750, -49076, -37398, -46193, -46117, -40639, -37704, -36932, -37131, -34252, -27136, -40094, -7085, 13095, 1190, -15357, -24014, -28337, -30107, -39437, -39191, -48571, -43081, -20069, -16240, -33255, -34353, -11091, -9273, -21628, -17460, -27901, -24199, 685, 7315, -8723, -7540, -16485, -24752, -23740, -34627, -37146, -28502, -23016, -8889, 5556, 15143, 7237, -8121, -12757, -1547, 3147, -6499, -7336, -22063, -46218, -47381, -42829, -27927, -4742, 20636, 28291, 24281, 15934, 4547, -13038, -20486, -25712, -31458, -22970, -31427, -37801, -31235, -18828, -19050, -15381, -21075, -31043, -37608, -33499, -32683, -21548, -25736, -32122, -32890, -19302, -3652, -6585, -1453, 11502, 5826, -6524, -13837, -25358, -29263, -14502, 78, 15386, 8447, 10686, 3850, -4472, 547, 2724, -15034, -40864]
13482d0864R356L2719O791p074R66m590J5362L119k7718l687j5012J6517J2473
13469a642k0q883J370M794N206P97q219K322q057N446K1752l542p576j2121m177
13454a2550n325l905J3478M644k577J324K1006q722k2485r627K3162R677j3716
13441e616r135P003j4462k2824p089J1881P723k747m96J8610M895j2824m749K6095
13427c735L25l262r872O520Q267K628q77l092Q004m646j4467j12J1751N88L310
13412A330q721m055J1365J1930k463m066j3698P797r005j3390J4655j911m72j0590
13398b1294P34P641K4132n684j8708j0939M811q05m592O638J4598J1483M579p422
13384E172j9475m251j8068J4267J9422n408j01r30J7855O05o46j4194k044L516
$$ y = [-40864, -31508, 1211, 8002, 928, 1894, -2696, 12666, 15785, -11933, -15620, -30632, -14115, -1642, -1662, -10545, -9175, -4381, 825, 1622, -6597, -4275, -12332, -6886, 14866, 11324, 3748, -8373, -12550, -17875, -21780, -8302, -3658, -6235, -4911, 16095, 7373, -15112, -24739, -1577, 8100, -5616, -14751, -7748, -22210, -45034, -52123, -40242, -32519, -35266, -35762, -17152, -12257, -25081, -29830, -3735, -3410, -6672, -16544, -10024, -1757, 871, -6, -3098, 4906, 260, -14207, -14319, -2568, -1980, 1330, -7391, -11446, -81, 11849, 9386, 5320, -8378, -581, -9586, -22976, -8321, -10232, -10704, -21294, -20560, -12919, 11213, 5529, -13179, -24118, -19307, -20112, -24704, -18066, -3468, 8015, 12594, 5172, -14303, -18554, -36622, -22355, -2933, -8341, -8442, -9372, 8483, 9088, 8442, -5752, -7796, -4280]
13370d280r617j4862J0987J7585j774r1m674J3326L395p994j3833q195o452J973
13356b4506Q53J8129J1581K621q260j202o071p108k31R956k085r095r169o7J2109
13341a2545J4320n791q70L369J467P693K3386J7904p652n913k0310r521O991n470
13327G058j9344m71L491O676l71j5833l238j272r387o074m843K4329J5331L299
13313f49J241Q287j6443L210K878J0976o923r713p407J6227M597J5944M441j1603
13299A5063J994J400m873L896Q549j1503k2941j5364k57J1534J8603N311l454
13286G958J885k5531l1748o492J8980J7674O777j229K86J1077r54k7208j4815
13273d3340J9652J6832l931J397O169j9275j2517m907q037J1572K5445N484j371
$$ y = [-4280, -13897, -28759, -17772, -187, -1961, -2052, -6726, 6600, 9995, 2001, -11832, -20027, -26479, -24506, -23653, -5524, 6057, 8678, 418, -784, -6855, -13963, -14194, -4238, -6323, -15418, -24587, -24654, -12545, 1775, -4016, -4886, -1517, -50, 7643, 31029, 48933, 41281, 35368, 15058, 5537, 12528, 7058, -12286, -12757, -9266, -2590, -2961, -18794, -22032, -23304, -32691, -38765, -43608, -19279, -3948, -649, 592, 8879, -7564, -4354, -1476, 9500, 2577, -7136, -14543, 1684, 6281, 22225, 26666, 15063, 17057, 18457, 13584, 17480, 26029, 14526, -8415, -23779, -24036, -12502, 6101, 11412, 7958, 9843, -15688, -47436, -53928, -34948, -17274, -10497, -11726, -11440, -363, -1317, -28525, -43340, -23688, -6856, -10787, -9390, -3221, -22496, -35013, -39920, -47957, -36385, -10940, -5456, -6827]
13260f827p156n629j703j0935k211K0967K3111N859o118p259m337N518j9038k2015
13246c7773L351K0644J1872K895k5749l448O770J5847L419m263k565J364K535
13233e101N407J0128l605p079j034o963m88n66O865Q521K857j1999L812M304j4981
13218i922n626N02m117N519K922M319J1935k674l0649l679J3913Q549J581o167
13204a3594K584M15K751q051p827J0041J3097r222p658r173J1070P69o074k45
13190b1117n790L24J0887R981N484Q023J1159j6048Q049O747J35j0689j9404j2113
13176b4372m732p39M082l342j1275p213P109J3039l94Q095k727L878l992k0016
13162d2599J069K2269J2710J2057k093k3162j449J3237L238o192q257J4363l243
$$ y = [-6827, -13983, -19612, -21315, -32250, -34461, -13494, 9617, 15476, 9358, 2099, -2238, 3280, -15758, -37773, -34422, -13778, -1906, 989, -24760, -28208, -21438, -5591, -2172, -6435, -9000, -7636, -5101, 306, 10434, 6829, -250, -1284, -8247, -8735, -9301, -2436, 6085, 8942, -3057, 755, 5059, -9922, -15548, -15046, -19163, -13644, -10722, -6403, 5532, 2858, -27791, -31470, -17557, -9008, -7427, -13594, -11010, -10595, -7844, -15895, -23722, -13681, -584, -9806, -17464, -26637, -15567, -14798, -20872, -21117, -26907, -26583, -15696, -5715, -231, 7792, 18951, 2903, 10952, 17699, 17834, 7145, -12259, -24372, -29104, -29843, -25761, -29103, -40378, -47591, -40482, -27443, -27837, -19742, -22469, -18591, -22583, -42599, -41530, -19261, -6551, 5506, 3413, -19749, -21198, -7961, -4723, -10915, -19172, -4809, -8052]
13149h052O041m440l317o43p887j1934o629M080J2974J1072o166l065J1144J0537
13135C715J338j2725k6219O521J0616J0951J0193l080j6173p901K805P604J7315
13122D960J2291l480k0563Q842j3649J726J1793j2125p660R709J4587j3858l78
13109g805q630r076q82M208n024J824j520K5911N555j8404N684m353J9118J1645
13095A8251K7529R999j2645q503j0850j3871Q314O760N618k2321j7209K095J8818
13082A1985j003M361P982J96l541N69j7985j4435n126K038L1317R112j0709p920
13068F841l945o367l516n62J2536O489P787N162Q914q537r033R299P245J0970
13054D3283O429J2771P9L683k1903l9712l65j933k0418j753J3795K3220k587j6564
$$ y = [-8052, -2011, -6451, -9768, -10411, -18298, -30232, -36861, -32781, -19807, -8735, -14901, -17966, -6822, 3715, 5053, -7672, -33891, -27370, -16754, -5803, 4390, 1310, -14863, -22764, -19959, -12355, 4960, 17251, 13771, -6792, 2050, -11599, -9873, 1920, -10205, -17865, -8156, 6431, -7427, -7805, -16435, -25511, -26393, -22185, -27209, -25385, -26905, -994, 4561, -13843, -8159, -12512, 6606, 18251, 45780, 55779, 43134, 34631, 23781, 9910, 18224, 24984, 30602, 8281, -8928, -6833, 11985, 10982, 15343, 23325, 23521, 19980, 20549, 2564, -11871, -16997, -14959, 16358, 25470, 14761, 6841, 2896, -3471, -6987, -7549, 4987, 11476, 19263, 24425, 33339, 24802, 15769, 25068, 32313, 43283, 49712, 62483, 62562, 66245, 44342, 4630, 4265, 2332, -18086, -19839, -6044, 17176, 14589, -1975]
13040a975P508N144N430j4284j655O816P828k0432k4928P250J805r932K398N042
13026b3985O502K0465J0791m910m976l83o80r169J0082J1979J4202M805o220q290
13012B0213J2991J5314J2979n933k4031k0163m980l493l749R894j101j6018j70
12999h247J6383J1300J1069p348n992j1162M724L833o275n624P040j7702r557
12986a7558M714m090R523K4826O958j7447j6472P165p982K227r55Q037k622m559
12972h235j4673L437N928j2745l21R133q72o146J7297J0560J795j1845j9840J3503
12958a3024m161l630P315l165k231N606J9400K3557l126j568q964j4984j2606
12945a1581J32J6730o529k3534J517J3740o663r259P198m93N009O807q082k22
$$ y = [-1975, 5533, 10677, 16107, 1823, 168, 6984, 14812, -5620, -30548, -23298, -21493, -31425, -29027, -23985, -17483, 2982, 13773, 8863, 3887, 3504, 2824, -6345, 3737, 15716, 29918, 34723, 28503, 20213, 33204, 48518, 61497, 55564, 31533, 11370, 6390, 2897, -852, 9042, 7941, -8077, -8247, 8136, 19436, 30505, 23157, 17165, 6003, 10727, 14560, 8285, 2661, 9701, -8001, -17558, -12844, -16934, -7411, 17415, 24373, 6926, -9546, -2381, -10363, -8136, -9091, -1054, -3676, -8235, -22908, -19471, -13543, -26288, -26609, -17476, -18348, -24494, -7197, 3363, 5158, -6687, -26527, -13024, -17185, -20815, -13500, -16665, -18896, -13290, 6110, 29667, 26541, 24973, 16009, 1025, -11581, -11449, 5281, -1248, -24782, -23265, -9525, -16188, -25447, -18249, -18742, -13733, -6926, -15008, -15230]
12931a5230J4011K4650q769K326R442Q596k993j8520j2186n450j1601l746R341
12918a0129l374P318p440J815J0557j0571j4417n495K801K3755O746l449K169
12905B86O70Q541k582M062j936N519N14j1214p276j8118k972l684N432J3472j0093
12890a9379m348O163K885m727j0338Q843J0531J2733P299j6389R605j6193j13
12877a3428q557R341J1138j9016j4199J4191J2072L961Q006r685r745J1450K8270
12864B3799r661k2001j0173l191p947L644J2136N816o697j0983L597K1557M149
12851D045J947q402r082o949L025J7442P588q135j3231J2425j4153r737J3931
12838i286J4190p518j1162l746J6297R03j6402o249O885P574Q073j2207p053L37
$$ y = [-15230, -1219, 23431, 14662, 16988, 26430, 35026, 32033, 13513, 1327, -4123, -15724, -19470, -10129, -13503, -6185, -13625, -11810, -1253, -11824, -26241, -31736, -28935, -5180, 1566, -1883, 286, 956, 9497, 6915, 10977, 9041, 14560, 15074, 3860, -3416, -21534, -24506, -28190, -22758, -9286, -19379, -23727, -17564, -14679, -19406, -29744, -20901, -10370, 2363, 9662, -6727, 2878, -13315, -13428, -21985, -12644, -1506, -20522, -34721, -20530, -8458, -4497, 3509, -6176, -15921, -4471, 23799, 14138, -7863, -18036, -21227, -29174, -25530, -13394, -7578, -14275, -25258, -21661, -104, 4045, 5992, -2410, -11492, -18441, -15416, 2026, 9614, 1479, -11752, 673, -13480, -23217, -9286, 4904, -2614, -13776, -17522, -1225, -322, -16724, -22973, -16088, -8514, -441, -12648, -19701, -19364]
12824a9364J939p282j5700N442J3079K1469J2567q857q852J272J293J664J0315
12811H985j374j8034o852J6959J3726j4581m798J3949K640j099L223N403M178
12798B2325J762j1331k4495o620m063l115K3217o246j287O556k932J1841o818
12785a206j1289Q377P68m507L927R822O789q398r083o115r895K976k266R172j098
12770a2026J969l00M024n958M973j260L151J5025O590L953j9523k498J8580J0170
12756B6870j3871K635P211N23j1947N703p995J706o992r960m980O418m202l044
12742a1925R28K3278L373k4090k0126J2108O072L638M480r49L361J0318N227o764
12728H929j0892p115Q807O691M28k858j6165l278Q249P336R274r562j6768q473
$$ y = [-19364, -17425, -24707, -40407, -34965, -21886, -417, 12150, 3293, -5559, -4287, -2994, -1330, 8985, 7611, -10423, -17275, -316, 13410, -1171, -5969, 7980, 10620, 9521, 12744, 18147, 22325, 24087, 12756, -11739, -18359, -22422, -25537, -2320, -8566, -9853, -3297, -6229, 5612, -1206, -12495, -4118, -3350, -7857, -3930, 5892, 12681, 4283, -4800, -10915, -20810, -17834, -20100, -10928, -12026, -10057, -10357, -6333, -12291, -7318, -8578, -5427, 9598, 16188, 20141, 618, -1880, 16700, 26870, 12999, 15634, 22845, 23368, 11421, 17124, 9129, 10835, 3843, -6117, -11097, -4679, -8881, -11925, -10997, 12281, 15654, -8436, -28562, -16454, -10382, -6744, -2264, -3213, 148, 10466, 15693, 8929, -1963, -9078, -271, 6420, 6848, 3990, -12175, -15453, -7204, 132, 9406, -156, -16924, -25397]
12714b5397l189O605J1805R430k070Q166j453L759n856o011Q065J1371j6328j2128
12700a3231l736n081J1108K2267M733J4656O144k351j453m463l368j1492l406
12687A0327L250R57N808J625j0881l947n517J2758n631j0338Q208o992m744N254
12673A37J7136M217n874r737J351q080k4116p465P577J8596K0733J6380p8j1486
12659A9291K355r009Q289P838n945R993P466r907k5942l337J4036Q396N940N116
12645C4580j7067p009L415L322m363n425M028J8281J180j833L339J0057J106j2180
12631C1431k2777k681k902N76j4347N167J2000Q210j7705J7435J4168j1393l243
12618A3939k072l210J2380J3631Q856n888j1267p089k236j776j2133r382p33K150
$$ y = [-25397, -28586, -21981, -10176, -746, -2816, 5350, 3897, 7656, 1800, -4211, 3854, 15225, -1103, -13231, -16967, -22048, -10940, 11327, 16060, 30716, 36860, 34509, 33056, 28593, 25225, 13733, 10327, 13577, 14534, 20342, 21967, 11086, 7139, 1622, 14380, 8749, -1589, 6619, -373, -5117, 137, 17273, 21490, 15616, 5879, 7230, -850, -24966, -32431, -24854, -6258, 14475, 30855, 30777, 19291, 21646, 12637, 20926, 28764, 22819, 32812, 40278, 30371, 4429, 1092, 15128, 23524, 29464, 34580, 17513, 10504, 13919, 17241, 12878, 7453, 11481, 29762, 30942, 29109, 32448, 42505, 43611, 31431, 8654, 5973, 3071, 3647, -10700, -5533, 6467, 14677, -3028, 14407, 28575, 17182, 13939, 11867, 8657, 21037, 34668, 43524, 37636, 26369, 19280, 17044, 15268, 3135, -6247, -6980, -4830]
12604d830P579N725K5470M027O633K0892R040M323J5888R848j3674R818J5566
12591A16305L365J302j0719k2701m977O113P770n814M113J3491J5720J0797J0234
12578A44999J5792K1896J0541L4193L0099K3732K2119L9876O3063R7154J27440
12567F30904J74157K19763K28004K05278J73109J10798P236p1930j50248k19572
12557A307499k40911k33746j81847j34151j10159o8092l2496l962j2028j541k6413
12546B62153l0287k0052k0402j6019K01k5350k2102k301J5235j9259k5391L229
12534I9655Q253O410j5803R94m584j2502j3560p923L240J1319J9637k725O94R35
12520I4040r225P158J7135j2786J74q639j0089j096r019L733M135q869j677P913
$$ y = [-4830, 2749, 8474, 33944, 37971, 44604, 65496, 74536, 78859, 94747, 104595, 90921, 100739, 116305, 119670, 120972, 110253, 87552, 82575, 88688, 96458, 90644, 94757, 108248, 123968, 134765, 144999, 160791, 182687, 193228, 227421, 257520, 281252, 303371, 343247, 406310, 503464, 630904, 805061, 1024824, 1252828, 1458106, 1631215, 1742013, 1749249, 1677319, 1527071, 1307499, 1066588, 832842, 650995, 516844, 406685, 338593, 306097, 302135, 290107, 288566, 262153, 231866, 211814, 191412, 175393, 175594, 150244, 128142, 125841, 141076, 121817, 96426, 99655, 107908, 114318, 98515, 99509, 94925, 82423, 68863, 60940, 64180, 75499, 95136, 92411, 93105, 94040, 84815, 91973, 109108, 96322, 96496, 87857, 77768, 76672, 67653, 71386, 75521, 66652, 64975, 72888]
12506G2888R640K4853m108j990r557J81P57J0019j0426n760q934j5741o319k485
12492E3018j4037j1P811J3029N791j901J636q573j4175M870l649J2724m616M476
12478E6393K1852P355q344j3276k2195R022J8029m033q225K3142M990j9423K042
12465F7329j4853K052J9031o561M708J2273J0310J3854O080j3777k1124j5902
12453F3420n379K179j72j8886p98O384j5999j9611j4843p198k3425j5989J786
12440d8531m608J1789J3271r393M238K2867J9272Q267K0848K259o480j3617p30
12427A9452R247J3385r446L819J1369J3098J9598p645m37J328K52k556j1160J1305
12413G1609J5896J1120o329K9o824r286m326L297q14k551J6665J4018J8583L0611
$$ y = [72888, 82528, 107381, 103273, 101283, 91726, 91907, 92664, 102683, 92257, 86497, 77563, 61822, 55503, 53018, 38981, 38970, 46781, 59810, 65601, 63700, 65336, 56763, 42588, 47458, 43809, 56533, 51917, 56393, 78245, 85600, 77256, 63980, 41785, 50807, 68836, 64803, 56578, 79720, 84710, 65287, 67329, 52476, 54528, 73559, 66998, 71706, 83979, 94289, 108143, 114223, 100446, 79322, 63420, 58041, 60220, 60048, 41162, 40364, 46748, 30749, 11138, -3705, -10903, -34328, -50317, -48531, -53139, -41350, -28079, -37472, -33234, -10367, 8905, 17172, 38020, 40279, 33799, 20182, 19452, 28699, 42084, 32638, 36457, 47826, 60924, 80522, 72877, 72440, 73768, 74020, 71464, 60304, 71609, 87505, 98625, 92296, 92325, 85501, 76215, 71889, 75186, 74372, 71821, 88486, 102504, 121087, 151698]
12399A51698J3673J5859K6953K6946J1366n225o28k5000l0671j7168n506o349
12387A55948j0869j3184k683j8370J188O134j7909k508K2300p923j865j2772k1914
12374G5573p411n775J5002Q812J0344J2252K0221K4991N156j5944n708J1111q217
12361A40407O291J3460J5610L7009K6847J0590j0988q765J3645K886j0944j927
12349B34121q995n333K1985O514r686k1114M121L378j2284N216N655M481J8159
12336B46218K6174J5764j014K3988L7345J4190J2629J7381r8k67k495o013r082
12323C74720L723J8370J2184n50k0683j4515k0149o937l8743l5821k0041o091
12311B45467j836j8400j8583j1167J5302k4598k5859J1906L738n934j2145j9822
$$ y = [151698, 165371, 181230, 208183, 235129, 246495, 241270, 240642, 215642, 184971, 167803, 162297, 155948, 145079, 131895, 129212, 110842, 112030, 118164, 100255, 97747, 120047, 112124, 110259, 97487, 75573, 68162, 62387, 77389, 86201, 96545, 108797, 129018, 154009, 159165, 143221, 137513, 148624, 140407, 146698, 160158, 175768, 212777, 239624, 250214, 239226, 230461, 244106, 246992, 236048, 234121, 225126, 219793, 241778, 248292, 238606, 217492, 221613, 224991, 212707, 217923, 223578, 228059, 246218, 272392, 288156, 287142, 311130, 348475, 362665, 375294, 392675, 392577, 392310, 389815, 383802, 374720, 378443, 396813, 408997, 408447, 387764, 373249, 353100, 346163, 307420, 271599, 251558, 245467, 243631, 225231, 206648, 195481, 210783, 186185, 160326, 172232, 175970, 170036, 157891, 138069]
12299A38069j6716M71k461n0R746L1208L1374J9916L3404J9950K1999K4336L9027
12286C50273L4877J0599j9942j3735j7261m012j450m045j9849j4942m615l629
12274B92269q254o223K1460L6431L0602k634m333K9266m131k4060k0080m973r482
12261C25858j276K14m572j1927o609L19L0024J8691J2495J4602K60L823J2896
12248C94798K527J5520J6822R986J1426N636L955k066j3025q292J3694M085P526
12235D62592j1505m051K636J5491J9534L3170J0508j3932m874K2295L6131L8063
12223F06058J5187J9396J7168J1324K5722L1376K6715J8244R972K8338K7314J5722
12211H52536K0399J6164J4047K0339J1131J8187R406R632K8831N1592L7321M5482
$$ y = [138069, 121353, 121824, 119363, 119313, 129059, 160267, 191641, 211557, 244961, 264911, 286910, 311246, 350273, 385150, 395749, 375807, 362072, 344811, 340799, 339349, 335304, 315455, 300513, 295898, 292269, 284015, 277792, 299252, 335683, 366285, 363651, 359318, 388584, 384453, 360393, 340313, 335340, 325858, 324582, 324796, 320224, 308297, 301688, 302007, 332031, 350722, 363217, 377819, 378079, 381902, 394798, 397325, 412845, 429667, 439653, 451079, 456715, 460670, 458604, 445579, 437287, 450981, 455066, 462592, 451087, 447036, 449672, 465163, 484697, 517867, 528375, 514443, 509569, 531864, 567995, 606058, 621245, 640641, 657809, 669133, 694855, 726231, 752946, 771190, 781162, 809500, 836814, 852536, 872935, 889099, 903146, 923485, 934616, 952803, 962209, 971841, 1000672, 1052264, 1089585, 1135067]
12199A135067M1521O4057O2379O2230O6665M1409L7743M9764O6204O9315P8773
12188A775127P4587O6339P5267P6823R9446J08418J27427J55322J68204J84301
12178B911261K29719K83453L16753L05310L03024L43650L52630L68112L92681
12169E806593M08450M36200M83716N98403P41065Q99394J106507J448426J867686
12160A3796440K366145K821258L140430L430810L751665M037741M423210M949224
12152D2716923N772842P199846R641513J3650984K0027755K9582702M1224257
12145A69816822M7998707M3556211L4319012K0980969L987055j3153395k6504330
12138B81001051l9501614m8112917m6666719l7899750k6597127j7438495j1307746
$$ y = [1135067, 1176588, 1240645, 1303024, 1365254, 1431919, 1473328, 1511071, 1560835, 1627039, 1696354, 1775127, 1849714, 1916053, 1991320, 2068143, 2167589, 2276007, 2403434, 2558756, 2726960, 2911261, 3140980, 3424433, 3741186, 4046496, 4349520, 4693170, 5045800, 5413912, 5806593, 6215043, 6651243, 7134959, 7733362, 8474427, 9373821, 10480328, 11928754, 13796440, 16162585, 18983843, 22124273, 25555083, 29306748, 33344489, 37767699, 42716923, 48489765, 55689611, 65331124, 78982108, 99009863, 128592565, 169816822, 217815529, 261371740, 295690752, 316671721, 320658776, 307505381, 281001051, 241499437, 193386520, 146719801, 108820051, 82222924, 64784429, 53476683]
12131E3476683p296140m695533l179297k427879k143264k217889k441356k754951
12123B6320374l080660l258386l135007k726632k174531j657652j268099j023640
12115G995767q38885o93558o05124m94834m01904l25540k83194k66594k30531
12106C855603k55298k39677j99876j78734j51940j40924j42840j15255r7213j05557
12096B228289j20755j08685q5259p7501p0972p7431m8074n3413o6238o8551n8094
12085A393316n8194m5676k5067k8884k9044j8299j5852k7996n7638m4851l5972
12074A005843n0195l9456k0764r084k2504j5377l0167j1971l5j88j3291r530j4534
12061G68747j7058O51n493Q111J1031m902L314k61n569k603k662J1561O229K0931
$$ y = [53476683, 46180543, 41485010, 38305713, 35877834, 33734570, 31516681, 29075325, 26320374, 23239714, 19981328, 16846321, 14119689, 11945158, 10287506, 9019407, 7995767, 7156882, 6463324, 5858200, 5363366, 4961462, 4635922, 4352728, 4086134, 3855603, 3600305, 3360628, 3160752, 2982018, 2830078, 2689154, 2546314, 2431059, 2333846, 2228289, 2107534, 1998849, 1913590, 1836089, 1765117, 1687686, 1639612, 1586199, 1519961, 1451410, 1393316, 1335122, 1289446, 1264379, 1235495, 1206451, 1188152, 1172300, 1144304, 1086666, 1041815, 1005843, 955648, 916192, 895428, 886344, 863840, 848463, 818296, 806325, 806290, 806102, 792811, 783281, 768747, 751689, 752340, 746847, 754958, 765989, 761087, 764401, 764140, 758571, 755968, 753306, 764867, 771096, 792027]
12047G92027M0254O1779N2439O2939Q7367J21201J49750J45441J10129O7352J2435
12036A703113l0268r7207j27422j37626j53489j53540j10125p3498m7751l2609
12026G39578N566R206j0821l0277l1067m6048n7124l3940l2690l7647j9506k9635
12014D25595l7562l6423j9436k0766q406P096P004l942k693p662j4853j1813r086
12001B67053r024j2483j2129M271r362j1681l289J5765k868J2858L5751K4498
11989B99360L4092K9499L7527K5844K9924Q593j9466k5882r287k040j9276k9546
11977C59342k4754m2799k849J0993n616L1j0158k5771j9052j3969j0116j9924
11965A95358j9122k0025P137M139p405k8724l5265k7720k3582k2475r129j1771
$$ y = [792027, 832281, 894060, 946499, 1009438, 1096805, 1218006, 1367756, 1513197, 1623326, 1690678, 1703113, 1672845, 1575638, 1448216, 1310590, 1157101, 1003561, 893436, 819938, 772187, 739578, 745144, 754350, 743529, 713252, 682185, 636137, 579013, 545073, 512383, 474736, 455230, 425595, 388033, 351610, 332174, 311408, 303002, 310098, 317102, 313160, 310467, 302805, 287952, 276139, 267053, 258029, 245546, 233417, 237688, 228326, 216645, 213356, 229121, 226253, 239111, 274862, 299360, 333452, 362951, 400478, 426322, 456246, 464839, 445373, 419491, 410204, 408164, 388888, 359342, 334588, 291789, 288940, 299933, 294317, 294348, 284190, 258419, 239367, 225398, 215282, 195358, 176236, 156211, 163348, 167487, 160082, 131358, 96093, 68373, 44791, 22316, 13187, 1416]
11953A416J042K920R001L0185J3610K098O380K7826R944J0071j220j4367j6731
11940H2175n416j922m30R829j4816M870j231r60J0507J1372J5686J0374M409j1433
11926A13014j2490O341R300o77J0640j8368N54J2349J3841J0345K276k143J0513
11913A55495j585j8394j8589J002p910n382L861m330J0582mj9443q684l64O910
11899I3165J1081n759o471Q476L206J1417Q027J4099J6399j1718r869J7565J7851
11886A67469p250j3581j3925l1875K461J0421J0173m000o28R58o313r389r264
11873I5257q744j5935K3436K0898j2177q198j2680j728J1121l238j2317O415J1666
11860I3776o160K355R717J5141K106o967J4627K8301K2972O526k791j934n466
$$ y = [1416, 2458, 5378, 14379, 44564, 58174, 60272, 66652, 94478, 104422, 114493, 113273, 98906, 82175, 76759, 74837, 74407, 84236, 69420, 74290, 73059, 72099, 82606, 93978, 109664, 120038, 124447, 113014, 100524, 106865, 116165, 115488, 126128, 107760, 108314, 120663, 134504, 144849, 147125, 144982, 155495, 153910, 135516, 116927, 117929, 110019, 104637, 108498, 104168, 114750, 114746, 95303, 86619, 86255, 93165, 104246, 98487, 92016, 100492, 103698, 115115, 123142, 137241, 153640, 141922, 132053, 149618, 167469, 160219, 146638, 132713, 100838, 103299, 113720, 123893, 119893, 119265, 120223, 113910, 104521, 95257, 86513, 70578, 94014, 114912, 102735, 94537, 81857, 80129, 91250, 88012, 75695, 82110, 93776, 87616, 89971, 99688, 114829, 116935, 109968, 124595, 152896, 175868, 182394, 179603, 177669, 172203]
11847A72203K78j0027k891J4479K134p554K456M477P407j9508l5284l0564M640
11834A02246K3848j0147l4159j7895k501L984j4688j3411O158R740p556j9520
11822B6099p59J7613J1223J346o636k6851j3001J1727J4233O027j622j866J1748
11809D9281j1307O585O746J0008j581O734L29J3738j4911j2216j2974r512j2260
11796A8660M823Q648j475m293O628j071J440J0693R473P934j0478j7865j696j0486
11782B0935o661M564P544P149J998O657N908J2086j913k030j095P01l409J2863
11768F5297R064j0156j046N743L580j3876j0759p564q049P672L110o805q539J2435
11754D0107J0291o709m849L566q494L44Q752N793m815R594J4124K747j786J308
$$ y = [172203, 172481, 162454, 159563, 174042, 176176, 168622, 171078, 175555, 182962, 163454, 128170, 97606, 102246, 126094, 115947, 81788, 63893, 61392, 65376, 50688, 37277, 43435, 53175, 45619, 26099, 25340, 42953, 54176, 55522, 48886, 22035, 9034, 20761, 34994, 41021, 39399, 37533, 49281, 37974, 44559, 51305, 61313, 59732, 66466, 66795, 80533, 65622, 53406, 40432, 30920, 18660, 23483, 32131, 30656, 26363, 32991, 31920, 33360, 44053, 53526, 61460, 50982, 33117, 31421, 20935, 14274, 18838, 26382, 33531, 35529, 42186, 48094, 60180, 58267, 56237, 55142, 55843, 52434, 65297, 74361, 64205, 63159, 68902, 72482, 58606, 47847, 40283, 32234, 39906, 43016, 36211, 27672, 40107, 50398, 43689, 38840, 42406, 33912, 34256, 43008, 48801, 43986, 53580, 67704, 70451, 68665, 69973]
11740F9973J5524J7758M477r086p143J4865J5887J0885K1516L0274J1779L231
11728A99940J1200L0992K9392N1016L7606N0351R2357J20478J56766K15091K40610
11717A235799K18460J88138J06337n786q4511j64513k16461k37223k29301j78422
11707F32517j15072q6911n5978m2628k6947k9725r032p860l1377j2297k3780k0694
11695A70216j2432K792l717m804j5601k0723r303N082K0013M878J3395N867r513
11682A46150J099J9680K0249J9661j657l471k78n601k429J3118K0307q344j638
11669B16846J2611K811j645O900K5200L6504J1577J3888J4421M305m765M461j7273
11656C25841m237n394j9278l670J631m493r659r669O484Q674P073K4307O052j7273
$$ y = [69973, 85497, 103255, 107732, 98646, 91503, 106368, 122255, 133140, 154656, 184930, 196709, 199940, 211140, 242132, 271524, 322540, 360146, 410497, 502854, 623332, 780098, 995189, 1235799, 1454259, 1642397, 1748734, 1742948, 1658437, 1493924, 1277463, 1040240, 810939, 632517, 517445, 430534, 374556, 331928, 304981, 275256, 266224, 258364, 226987, 214690, 190910, 170216, 157784, 160576, 156859, 152055, 136454, 115731, 106428, 111510, 131523, 136401, 149796, 155663, 146150, 147249, 166929, 187178, 206839, 205182, 201711, 201433, 195832, 193403, 206521, 226828, 218484, 216846, 229457, 232268, 230623, 237523, 262723, 299227, 310804, 324692, 339113, 343418, 338653, 343114, 325841, 321604, 316210, 296932, 293262, 294893, 290400, 280741, 271072, 277556, 286230, 293303, 317610, 323662, 306389]
11642C06389j3104J1662j5851q580j0989K246p490k2601k2786j6879L25j1426
11630A90916p960l313o089p828j4540j1088m297O633P531J1270j8545j1240J4951
11617A46401K3270l195j1160L781J1206r150j7620k127O515M467J0525L1341M840
11604A99094n699J4346J6316O471O564K8764M559Q985K259j1157J1308J6086O413
11591C04309J0279J1857J6695J2677J9619j876k3871j2529j24L872k13n119j7325
11578C18251p597O823N568l827j7246j6365n485M530N040j201J653n593k3667
11565B60884k9475Q591O773p254m983k0789O736K1369L040o944j1076k4264n675
11552A96933l554k4218k1087l984j0048n635L420k705o11m8j6336j03J0340p973
$$ y = [306389, 293285, 304947, 289096, 280516, 269527, 271773, 264283, 241682, 218896, 202017, 202342, 190916, 182956, 179643, 173554, 165726, 151186, 140098, 135801, 142434, 149965, 161235, 142690, 131450, 146401, 169671, 166476, 155316, 159097, 170303, 161153, 143533, 141406, 147921, 152388, 162913, 194254, 199094, 193395, 207741, 224057, 230528, 237092, 265856, 270415, 279400, 281659, 270502, 281810, 297896, 304309, 314588, 326445, 343140, 355817, 375436, 373560, 349689, 337160, 337036, 340908, 340695, 335576, 318251, 310654, 317477, 323045, 319218, 301972, 285607, 280122, 284652, 289692, 288491, 290144, 284551, 260884, 231409, 240000, 246773, 239519, 234536, 213747, 220483, 241852, 244892, 237948, 226872, 202608, 196933, 193379, 169161, 148074, 144090, 134042, 128407, 131827, 129122, 128511, 128463, 112127, 112024, 122364, 114391]
11538A14391l372L096p826L8n821M000M755j5207Q730j2528j4576J8299K9073
11525A23052K556o351J891J1198J0582J1353L2123J4183l584l062j6910j9220
11513A57811j3887L233l609j1145k3426j1487n190J7550K7947r121q35J780l699
11500A25922j4791K1618J5457l212m255N345j4592r333l717J2097L7246Q952q020
11487A68717J701R301P284j7596J1123J3642o375J5706L753J7398R341k304j3963
11474B17728L836K3198K527j3837P179J1647m614j1983K616r579J8380L5509L7024
11461C19631M2191N5270L5366N2477M4460M3383N9736O1185O1153P8779J08670
11450I62301J01204R5937J14608J12167J25864J34633J04224J11850J07485Q4037
$$ y = [114391, 111019, 114115, 106289, 106327, 100506, 104506, 109261, 94054, 102784, 90256, 75680, 93979, 123052, 125608, 119257, 121148, 132346, 142928, 154281, 186404, 200587, 197003, 193941, 177031, 157811, 143924, 147157, 143548, 132403, 108977, 97490, 92300, 109850, 137797, 128676, 127841, 129621, 125922, 111131, 132749, 148206, 144994, 140739, 146084, 131492, 122159, 118442, 130539, 167785, 176737, 168717, 170418, 179719, 187003, 169407, 180530, 194172, 187797, 203503, 207256, 224654, 233995, 231691, 217728, 221564, 244762, 247289, 233452, 240631, 252278, 247664, 235681, 238297, 228718, 247098, 282607, 319631, 361822, 417092, 452458, 504935, 549395, 592778, 652514, 713699, 774852, 853631, 962301, 1063505, 1159442, 1274050, 1386217, 1512081, 1646714, 1750938, 1862788, 1970273, 2054310]
11440B054310P2271O3222M2979L7706L0399R344O829J757k8374n2787n0597o6634
11428B120425r1117r6189r7867j10638r9433r8450q9021o0546n5410o3695n7431
11417A200628l8674k2075p443p630K1725L0726N0957N3239Q3910O1272Q1871J02306
11405A610812J08117J08708J06172J10884J05272Q5279P0977O4211N6507M1065
11395B468004L0578L321l2556l3858k1646m0465p7136q9308r6186j13409j24830
11384A872509j30489j20859j26827j14783j15831j21049j06701r6729p5764o9973
11374G93504p1382o9821m7514m3682m1303l0283l0286k5643k5354j0230k1067
11363C76939k5640j4547p557k836Q158J660Q738R944r724J2727J3205l190R63
$$ y = [2054310, 2126581, 2189803, 2232782, 2270488, 2300887, 2310231, 2317060, 2318817, 2290443, 2237656, 2187059, 2120425, 2029308, 1933119, 1835252, 1724614, 1625181, 1526731, 1437710, 1377164, 1321754, 1258059, 1200628, 1161954, 1139879, 1132436, 1124806, 1146531, 1177257, 1228214, 1281453, 1365363, 1426635, 1508506, 1610812, 1718929, 1827637, 1933809, 2044693, 2149965, 2235244, 2306221, 2370432, 2426939, 2468004, 2498582, 2501903, 2469347, 2435489, 2413843, 2373378, 2296242, 2206934, 2110748, 1997339, 1872509, 1742020, 1621161, 1494334, 1379551, 1263720, 1142671, 1035970, 939241, 863477, 793504, 722122, 652301, 604787, 561105, 519802, 489519, 459233, 433590, 408236, 398006, 376939, 351299, 336752, 329195, 326359, 334517, 336177, 344915, 354859, 345135, 357862, 371067, 367877, 368840]
11350C68840n036r200q288M038j2560j0819J5487J7859M849M362R822L958l10
11337C83002q875j484Q586j558k4082j8328K453K4486J0364O471R534P516J2797
11324D10882r809K422J1391K1204O411j3372N927J1831J1384K0974L4669J2645
11312E26559k780J2380L610J7189K3415M743N337R821J2586L1891L7584K3112
11300G05447J1692J4963J1657J4942K6167L8987K9780J2312L0000K4955K2033
11289I42935L9400L6859K1277K6641K8443L9856N4983M9483M3717N5707O2540
11278A401841O8031O4547P0875P7508Q4665J04973J10732J28549J35395J31777
11268B378893J40881J71086K15554K39370K30007K36788K74371K96751L46150
$$ y = [368840, 363804, 354604, 346316, 350354, 337794, 326975, 342462, 360321, 365170, 369532, 379354, 383312, 383002, 374127, 372643, 381229, 379671, 355589, 337261, 339714, 364200, 374564, 381035, 390569, 398085, 410882, 401073, 403495, 414886, 436090, 442501, 429129, 435056, 446887, 458271, 479245, 513914, 526559, 523779, 536159, 539769, 556958, 580373, 585116, 590453, 600274, 612860, 644751, 682335, 705447, 717139, 732102, 743759, 758701, 784868, 823855, 853635, 865947, 895947, 920902, 942935, 982335, 1019194, 1040471, 1067112, 1095555, 1135411, 1190394, 1239877, 1283594, 1339301, 1401841, 1469872, 1534419, 1605294, 1682802, 1767467, 1872440, 1983172, 2111721, 2247116, 2378893, 2519774, 2690860, 2906414, 3145784, 3375791, 3612579, 3886950, 4183701, 4529851]
11259D529851M13376N06096O09952P54470R58280J194320J429976J709434J981336
11250A4087091K145188K125780J877086J437308Q90137L94200J15935J63618M48724
11241B3685067Q39923J201178J382417J308816J104826Q42436O83604O78334Q37601
11232C2564202J094919J418944J847458K351142K819194L124753L128020K680071
11224E1028703J736522M75155o52834j324000j461803j210322p70227l72018k45087
11215D7204089n16379j064796j635385j962649j989180j797485j548082j349390
11207C5340743j207429j138233j139273j239960j420728j653557j879816j980487
11199B3681260j918829j727764j424666j100413r15762r03863r14872r21166q31938
$$ y = [4529851, 4943227, 5449323, 6059275, 6813745, 7772025, 8966345, 10396321, 12105755, 14087091, 16232279, 18358059, 20235145, 21672453, 22562590, 22956790, 23072725, 23236343, 23685067, 24524990, 25726168, 27108585, 28417401, 29522227, 30364663, 31048267, 31726601, 32564202, 33659121, 35078065, 36925523, 39276665, 42095859, 45220612, 48348632, 51028703, 52765225, 53240380, 52587546, 51263546, 49801743, 48591421, 47821194, 47449176, 47204089, 46687710, 45622914, 43987529, 42024880, 40035700, 38238215, 36690133, 35340743, 34133314, 32995081, 31855808, 30615848, 29195120, 27541563, 25661747, 23681260, 21762431, 20034667, 18610001, 17509588, 16593826, 15689963, 14775091, 13853925, 13021987]
11190A3021987o79232m60881k50014j6377J99084M10513O49449Q96560J073803
11181A4844892J130141J108745J040478J109194J295987J536713J816650J997864
11173B5880664K050183J943039J715713J476756J320575J240118J260875J333196
11165C8221119J472041J665083J960653K131521K106366J792549J248922P06229
11157E1304483M32154M89117Q43257J297145J581629J400172O03404o51020j984813
11148E5315528k965394l349287l252390k869993k388343j897632j443202j058614
11140C6090673p61418o17410o60346r02339j199725j444674j481228j282213r03797
11131B6837523m76543k05087j75124m85987j065484j728505k212011k452277k420293
$$ y = [13021987, 12342755, 11881874, 11631860, 11615483, 11814567, 12225080, 12874529, 13771089, 14844892, 15975033, 17083778, 18124256, 19233450, 20529437, 22066150, 23882800, 25880664, 27930847, 29873886, 31589599, 33066355, 34386930, 35627048, 36887923, 38221119, 39693160, 41358243, 43318896, 45450417, 47556783, 49349332, 50598254, 51304483, 51736637, 52225754, 53069011, 54366156, 55947785, 57347957, 57951361, 57300341, 55315528, 52350134, 49000847, 45748457, 42878464, 40490121, 38592489, 37149287, 36090673, 35329255, 34711845, 34051499, 33149160, 31949435, 30504761, 29023533, 27741320, 26837523, 26360980, 26155893, 25980769, 25494782, 24429298, 22700793, 20488782, 18036505, 15616212]
11122A5616212k200166j884343j559610j262569j018249q39298o48130n10852
11114E692995m27382l43731k71377k53885k62108k52136k48365k37604k28893
11105C167514k21347k01963j83557j83681j45196j18964j07044j10324q8834q9489
11095A717115j06536q1020o3004o3298n0736l2659j7710l5679n7207m7643k3228
11084A138395k4290m2030l6083l6495k6657k3208j9540j1924k8104j6712j3422
11073H59930p066J549L136M602N818l208J5587M0600L6929M4721L6814M7626M2044
11060A129082K631j3587j6835k4343n5926m0803k2180l2619m9226k5856j1119
11049H39219l2467k9680j6113j5450k7779j7072n655L299J9329r909j3177n704
$$ y = [15616212, 13416046, 11531703, 9972093, 8709524, 7691275, 6851977, 6203847, 5692995, 5265613, 4921882, 4650505, 4396620, 4134512, 3882376, 3634011, 3396407, 3167514, 2946167, 2744204, 2560647, 2376966, 2231770, 2112806, 2005762, 1895438, 1806604, 1717115, 1610579, 1529559, 1466555, 1403257, 1352521, 1319862, 1302152, 1266473, 1209266, 1161623, 1138395, 1114105, 1072075, 1035992, 999497, 972840, 949632, 930092, 918168, 890064, 873352, 859930, 852864, 854413, 857549, 862151, 867969, 864761, 880348, 920948, 957877, 1002598, 1039412, 1087038, 1129082, 1131713, 1118126, 1101291, 1076948, 1021022, 980219, 958039, 925420, 876194, 850338, 839219, 806752, 777072, 760959, 745509, 717730, 700658, 695003, 698302, 717631, 707722, 694545, 688841]
11037F88841M590o17n411J1585J0929M042q23J8410J8779L6229K7656L2412J6551
11024H63173o974k9618n1018p4017p3425o1592n9857n2801k8762r82m1252k7666
11012C55209k3817j8070M888j710m211J2375k890l4047j8262J1239R406K27k21
10999B90116O599l755J7184O60j8521l3959q449M096j938m399j2925P168J2116
10986B53993J269j3994rQ09j0212p643N656n028r993o383L860R087r922K753j522
10971B12721M017n690o227K603L379j1487k104Q629q167j4517n804M606m80R465
10957A90944R8J3114j7971j4359J3598l760r898o959j5973k857K0359J8243J380
10944A85959L833p223p289k192j1120o042k5398j4028K6905K0819p526k046j7833
$$ y = [688841, 693431, 692814, 687403, 698988, 709917, 713959, 713136, 731546, 750325, 786554, 814210, 846622, 863173, 856199, 826581, 775563, 701546, 628121, 566529, 506672, 453871, 425109, 424127, 382875, 355209, 331392, 313322, 318210, 316500, 312289, 324664, 321774, 287727, 269465, 280704, 290110, 290337, 290116, 296715, 292960, 310144, 310804, 292283, 258324, 249875, 253971, 252033, 247634, 234709, 241877, 253993, 255262, 241268, 241259, 242068, 231856, 224213, 229869, 224841, 214848, 208465, 212325, 221412, 211490, 214243, 212721, 216738, 211048, 204821, 207424, 210803, 199316, 197212, 205841, 197674, 183157, 177353, 181959, 181479, 190944, 191042, 204156, 186185, 171826, 185424, 181664, 171766, 164807, 148834, 145977, 166336, 184579, 185959, 189792, 182569, 175280, 173088, 161968, 155926, 130528, 116500, 143405, 164224, 156698, 154652, 136819]
10931A36819j1681N721P652Q795k308l660J9715P240m923K528P50K059P259O707
10917A82673Q534p795j7132q093j6513k259J1649M169j7635k5922j1989K9548
10905A29235N803j215J4335J2529K0814J0023m437Q721J90n810n26K3125j209
10892B11578j5241j2000J2767j4600j6631J2200O058J6781J024j5364j5580o101
10880A64891m61J3408j133R381P749O214J128j0981J971P993K2804J6793O239
10867B45996N560N308k1436m40J8739m972j4065J615j0011j8813j7610L479k237
10854A91113J925M713K0044l151N847m940Q353k203j2726q342N655J0637j2860
10841B04065j873J8215O059m986j7343N686K6027M068k984J742R564K3088J853
$$ y = [136819, 125138, 130859, 138511, 147306, 144998, 141338, 161053, 168293, 163370, 165898, 166648, 168707, 175966, 182673, 191207, 183412, 166280, 158187, 141674, 139415, 151064, 155233, 137598, 111676, 99687, 129235, 135038, 133823, 148158, 160687, 181501, 191524, 187087, 195808, 195998, 190188, 189662, 212787, 211578, 196337, 184337, 197104, 182504, 165873, 178073, 184131, 200912, 201936, 186572, 170992, 164891, 164430, 177838, 176705, 186086, 193835, 200049, 201177, 190196, 192167, 200160, 222964, 239757, 245996, 251556, 256864, 235428, 234988, 253727, 248755, 234690, 236305, 226294, 207481, 189871, 193350, 191113, 193038, 197751, 217795, 214644, 220491, 215551, 223904, 221701, 208975, 200633, 206288, 216925, 204065, 202192, 220407, 226466, 221480, 204137, 209823, 235850, 239918, 236934, 238676, 248240, 271328, 273181]
10828B73181j7159q501j283N959N373j2777O784K7784N77j1038N095L863j8472
10815B59386J762L2175K1376Q673P447k915Q284J2008K820O802m303n42N030N301
10801C63304J7959K7079J3619J7194K1699J0211L384P381j818n421n021R045J3527
10788D92142M312L620r614R840K2344l173P679J3922J5357m720N096p4l998q865
10774E43868O382O393R031J2002q10Q94m456N481O96K925K4251r02q444N153P677
10759F10141J1645P799M702p0R124K1707K5369K1779O245K1834j040K879O006
10746G48120J4361J6512J0951L2674K5280M1275M2829N3700K5321R553L286L4367
10734A058229K9309J0817N387q58q686J080m069K3529j115L305J1951J4256K2284
$$ y = [273181, 256022, 247521, 246238, 252197, 257570, 244793, 251577, 279361, 279938, 268900, 273995, 277858, 259386, 261148, 293323, 314699, 323372, 330819, 327904, 336188, 348196, 351016, 357818, 353515, 352973, 358003, 363304, 381263, 408342, 421961, 439155, 460854, 471065, 474449, 481830, 480012, 474591, 469570, 478615, 492142, 496454, 500074, 490460, 500300, 522644, 519471, 527150, 541072, 556429, 551709, 556805, 556731, 552733, 543868, 550250, 556643, 565674, 577676, 576866, 577760, 573304, 578785, 579481, 582406, 606657, 605755, 597311, 602464, 610141, 621786, 629585, 634287, 634217, 643341, 665048, 690417, 712196, 718441, 740275, 739235, 742114, 748120, 762481, 778993, 789944, 822618, 847898, 889173, 932002, 985702, 1011023, 1020576, 1023862, 1058229, 1087538, 1098355, 1103742, 1102884, 1094198, 1095278, 1091209, 1114738, 1113623, 1116928, 1128879, 1143135, 1165419]
10721A165419K456J1792K5044M5172L1182J9325L8416L7331L7317L9030N0894
10710A503378P8207O4836N7208O6842N8769N0452M3987M6729M7600L1920j987
10699B047941j2430j7407j3377o576M267j89N7J8881R807L30J4491n260p72K7239
10685B067002K3622K2344L1061J7371M7247L9871N1302Q0975Q4983P7355J03147
10674B646280J16414J35117J41830J51766J56635J92339K15313K57001L11555
10665D324250L56467M19360N38020O33354P59454R13670J075196J261357J431103
10656A1712231J564195J714588J939034K237385K697916L406519M447603N904950
10648C5624421P774316R827000J1510294J2052467J0915581Q114918M251607L23225
$$ y = [1165419, 1167875, 1179667, 1204711, 1249883, 1281065, 1300390, 1338806, 1376137, 1413454, 1452484, 1503378, 1581585, 1646421, 1703629, 1770471, 1829240, 1879692, 1923679, 1970408, 2018008, 2049928, 2047941, 2035511, 2018104, 2004727, 1998151, 2002418, 2002229, 2002286, 2021167, 2030974, 2031304, 2045795, 2040535, 2039763, 2067002, 2090624, 2112968, 2144029, 2161400, 2208647, 2248518, 2299820, 2380795, 2465778, 2543133, 2646280, 2762694, 2897811, 3039641, 3191407, 3348042, 3540381, 3755694, 4012695, 4324250, 4680717, 5100077, 5638097, 6271451, 7030905, 7944575, 9019771, 10281128, 11712231, 13276426, 14991014, 16930048, 19167433, 21865349, 25271868, 29719471, 35624421, 43398737, 53225737, 64736031, 76788498, 87704079, 95818997, 100070604, 100393829]
10640A00393829k762337m549577n149468m951798m328867l625964l008416k558600
10632F9458802k279171k087642j946761j749634j429280j037696o01105j69402
10624E8158111J64657M82692Q21965J225736J615141J904941K028782K073159
10616F8475184K114604K272749K638268L163364L895884M664342N149935M959619
10608I7333949L651616J080031k491598o379224r802912j2030728j2527343j1483530
10600D7350261r539384p398375n525260m067628l005872k258177j765919j481116
10592A2308530j294573j183716j097567r94668q62860p09652n74006m89190l85175
10583D717123l27151k92395k61166k36118j99848j63177j63863j41737j42269
$$ y = [100393829, 97631492, 93081915, 87932447, 82980649, 78651782, 75025818, 72017402, 69458802, 67179631, 65091989, 63145228, 61395594, 59966314, 58928618, 58327513, 58158111, 58322768, 58805460, 59627425, 60853161, 62468302, 64373243, 66402025, 68475184, 70589788, 72862537, 75500805, 78664169, 82560053, 87224395, 92374330, 97333949, 100985565, 102065596, 99573998, 93194774, 83391862, 71361134, 58833791, 47350261, 37810877, 30412502, 24887242, 20819614, 17813742, 15555565, 13789646, 12308530, 11013957, 9830241, 8732674, 7738006, 6875146, 6165494, 5591488, 5102298, 4717123, 4389972, 4097577, 3836411, 3600293, 3400445, 3237268, 3073405, 2931668, 2789399]
10574B789399j00476q0732p5874o8378o3901n6620n7959m4423m7973l7134k7222
10563B128707l7432j3848J2353q87j008K3764K4773r8j2772K853n302q459L806
10550B116450j0013j645l332j5599k3468n5293q3491q3725q0690j02761j07103
10539A549330r7916p6756p6871o6942l8209m8010n1022k4076k8787m5630k0753
10528I74358P350n50q996j5721k8581p554j892J1788J6794P630J535L0520R832
10515I96513j2269l573o227j8818l6342k4660k6768j2971k6085k4382j5105j6090
10503G73223l0018k1138j0687l0110m7874j4210l545j7984k49K403l0074j5541
10491E54196j2315n425r213k2103K96O464k152Q07n226j3363l804K1961m217k4653
$$ y = [2789399, 2688923, 2608191, 2532317, 2463939, 2400038, 2343418, 2285459, 2241036, 2193063, 2155929, 2128707, 2091275, 2077427, 2089780, 2088893, 2087885, 2111649, 2136422, 2136324, 2123552, 2126405, 2121103, 2112644, 2116450, 2106437, 2104792, 2101460, 2085861, 2062393, 2007100, 1923609, 1839884, 1759194, 1656433, 1549330, 1451414, 1374658, 1297787, 1230845, 1192636, 1144626, 1093604, 1069528, 1040741, 995111, 974358, 981708, 981158, 972162, 956441, 927860, 920306, 918414, 930202, 946996, 954626, 956161, 986681, 996513, 984244, 980671, 974444, 955626, 919284, 894624, 867856, 854885, 828800, 804418, 789313, 773223, 743205, 722067, 711380, 681270, 633396, 619186, 615641, 597657, 597408, 599811, 569737, 554196, 541881, 536456, 527243, 505140, 505436, 511900, 509748, 510555, 505329, 491966, 488162, 510123, 505906, 481253]
10477D81253O621K0473j304l5739k6172l3326j9514j2874k7312n042J0634m244
10465C53454j1856N063r580q146j3375n236k0118k4858o384J619J0602l635R515
10452B77065o066P881J0126k1680j0701l831l502o688J5633m700l0831O135K259
10439B31100N422j026J8344O553j7074j7623k8168j4518j716r375j5115n075o264
10426A45465r77Q549L054M41r168K843l690J45j9748Q546K3385m760Q84J671J5587
10411A72227M813j8076p366M126n040j470K324J1165k491m725l806k736J2885
10398A61830K9866R922n644r68P599j2294k3443J2099J8984J6477l213K4769K2250
10385B58234N480n999l2859j0227k691l620j3164k5577j0322R732n83j1951L119
$$ y = [481253, 487874, 508347, 507043, 471304, 445132, 411806, 392292, 379418, 352106, 347064, 357698, 353454, 341598, 346661, 337081, 328935, 315560, 310324, 290206, 265348, 258964, 260583, 271185, 267550, 277065, 270999, 278880, 289006, 267326, 256625, 252794, 249292, 242604, 258237, 253537, 222706, 228841, 231100, 236522, 235496, 253840, 260393, 243319, 225696, 197528, 183010, 181294, 171919, 156804, 151729, 145465, 144488, 153037, 156091, 156532, 147364, 150207, 146517, 146662, 126914, 135460, 158845, 154085, 154969, 156640, 172227, 177040, 158964, 151598, 155724, 150684, 149214, 151538, 162703, 160212, 155487, 151681, 148945, 161830, 191696, 201618, 195974, 195006, 202605, 190311, 166868, 178967, 197951, 214428, 211215, 235984, 258234, 263714, 257715, 224856, 214629, 211938, 208318, 195154, 169577, 159255, 168987, 168404, 156453, 159572]
10372A59572L0091J0088N087j5130o066r379O69R391N871N527n367k5820r023
10359A55511J3553P239M480K63k676J1115P121k0008k795k706k455j1402n389
10346A51851P223J2668J1003o06Q620q19n196J3259P363l778j3221k4392j2493
10333A51482l699J6717J2655j9928J0451K4244l088j45J7157J2159q803j7762
10321A91440l1368k42J7732R070J3388r345J454P615N056J385j4804k3651r0r76
10307A66664j0515n888O71j1115j5577l467N249O162J67n18n080n138L355q232
10293A16738o565J0079J7799l609O636j1880j6072n088J4942N514j6765J254J2093
10280A25076o630J0293J5932q849q272q07J0306J0291m486j5827J2811N297j3614
$$ y = [159572, 189663, 199751, 204838, 189708, 183642, 174263, 174932, 184323, 190194, 195721, 190354, 164534, 155511, 169064, 176303, 180783, 181046, 178370, 189485, 196606, 176598, 173803, 171097, 168642, 157240, 151851, 159074, 171742, 182745, 182139, 190759, 189940, 184744, 198003, 205366, 201588, 188367, 163975, 151482, 147783, 164500, 177155, 157227, 167678, 191922, 188834, 188689, 205846, 218005, 209202, 191440, 160072, 159830, 177562, 186632, 200020, 190675, 192129, 199744, 204800, 206185, 191381, 167730, 167640, 166664, 156149, 150261, 150932, 139817, 124240, 120773, 126022, 132184, 132351, 131833, 126753, 121615, 124970, 116738, 110173, 120252, 138051, 134442, 141078, 129198, 113126, 108038, 122980, 128494, 111729, 112983, 125076, 118446, 128739, 144671, 135822, 127550, 126743, 137049, 147340, 142854, 127027, 139838, 145135, 131521]
10267A31521l881p570r810n611R460Q682j9777j0627J2765J7006o818K065N44
10254A17949j5678J6773J2319j0373Q814M410M945n363P10N076N945J4939Q603
10241A69069p626j4604N099O641O458o672Q154K5621j1487J6123P240r158J3453
10228B08311K6739J5288J2699K7537M2777N4892L9302P8954O4347O0834L5006
10217F66686r56k4969k1991j8051k5299k5995r648j5552P465R463r374q824k4609
10204D98346k3195k1556j0886r664J0449J6880K0908K0367K5073P51Q709J117
10192E37299L3141L2226K7616L2626M1152M3736M4924L6651N2556O1930M3857
10181I87714K6315L7238N6362O5407R7374J46872K09687K49339K51277K08865
$$ y = [131521, 127640, 120070, 110260, 104649, 114109, 122791, 103014, 92387, 105152, 122158, 115340, 117405, 117949, 102271, 119044, 131363, 120990, 129804, 134214, 139159, 133796, 134506, 139582, 145527, 160466, 169069, 161443, 146839, 151938, 158579, 165037, 158365, 166519, 192140, 180653, 196776, 204016, 194858, 208311, 235050, 250338, 263037, 290574, 333351, 388243, 427545, 506499, 570846, 631680, 666686, 665730, 640761, 618770, 600719, 575420, 549425, 539777, 524225, 531690, 541153, 531779, 522955, 498346, 475151, 453595, 442709, 433045, 443494, 460374, 481282, 501649, 526722, 527473, 536182, 537299, 570440, 602666, 630282, 662908, 704060, 747796, 792720, 829371, 881927, 943857, 987714, 1014029, 1051267, 1107629, 1173036, 1270410, 1417282, 1626969, 1876308, 2127585, 2336450]
10171B336450J72872J48590J66454K77635L89533M36201L17856J61420J39445
10162D546456J35600n4996l70900m87927m31903l88482m70694n01736m48216l27301
10152A199901k23147j40688j11410p5756m9558l9153l6943l5575k5170l4804l6403
10141C91294j5246m399k3627k4238r180M488r235j2754r651j0176P632n966r950
10128B68992o386j66j973m222L27K1144J2449n603j5862O60J1674L847n548O261
10114B85594J077q648n756L952n048R287Q058n556M027m77L185K2928J0619J6735
10100C39977J1736J1174q978J3112P876m465j9872j1625j090J1127J700N323J3774
10087C69769M09j4881p950l894k610J0234L528k0520p661j8098n003m499p863
$$ y = [2336450, 2509322, 2657912, 2824366, 3102001, 3491534, 3927735, 4245591, 4407011, 4546456, 4682056, 4627060, 4256160, 3768233, 3336330, 2947848, 2477154, 1975418, 1527202, 1199901, 976754, 836066, 724656, 648900, 599342, 560189, 523246, 487671, 462501, 427697, 391294, 376048, 371649, 348022, 323784, 314604, 319092, 309857, 297103, 287452, 277276, 284908, 278942, 268992, 262606, 262440, 260467, 256245, 256572, 277716, 290165, 284562, 268700, 269360, 281034, 284881, 279333, 285594, 286671, 278023, 272267, 276219, 271171, 280458, 288516, 282960, 286987, 286510, 289695, 312623, 323242, 339977, 351713, 362887, 353909, 367021, 374897, 370432, 350560, 338935, 337845, 348972, 350672, 355995, 369769, 370178, 355297, 347347, 343453, 340843, 351077, 354605, 334085, 326424, 308326, 303323, 298824, 290961]
10074B90961j1139M351N791j797j2428j5168j1080j2211j5768n945J388j9620
10062A97335j3290K939O778K109J7360n950k7817O763M765n758K803o53J5868
10049B03252M579J3104N445p177j1207l451J0782J4328m629l34n534j3297Q283
10036B14144J1582L446N900O648M642j5499n49R789J4726j093O703J3516j7278
10023B56677j6942j4444J0154J5473J191L967J1383R945j7076q325J2548J386
10011B65937N919j6322j1193M459J1782L074m94J314j392J3799M3905M3291j0541
9998C53538k5461m4436m6621m3797r906J6779k537K153o779j8309j2831k669q372
9985A50752k3388r160K913l537l781M271J4631k004J0774j301j26Q60J8284O189
$$ y = [290961, 279822, 284173, 289964, 288167, 275739, 260571, 249491, 237280, 221512, 215567, 216955, 197335, 184045, 186984, 193762, 195871, 213231, 207281, 179464, 186227, 190992, 185234, 188037, 187384, 203252, 207831, 220935, 226380, 219203, 207996, 204545, 215327, 229655, 225026, 224692, 219158, 205861, 214144, 225726, 229172, 235072, 241720, 246362, 230863, 230314, 240103, 254829, 253736, 260439, 273955, 256677, 239735, 225291, 235445, 250918, 252109, 256076, 267459, 277404, 260328, 252003, 264551, 265937, 271856, 255534, 244341, 248800, 260582, 263656, 263162, 264476, 263084, 276883, 320788, 364079, 353538, 328077, 283641, 237020, 193223, 183317, 200096, 197559, 199712, 192933, 174624, 161793, 159124, 150752, 127364, 118204, 121117, 117580, 113799, 118070, 132701, 130697, 141471, 140170, 140044, 140904, 159188, 165377]
9971A65377N367P269j2213j0346o713j3114l991M920J5354J3315l609q181Q539
9958A61974K0249m721j0537o575o413J0624n01J3871J3498M38j5935J8401M633
9945A99006k616M389L505p14J5552m287j1977j0023m150r173Q277J9317j439n547
9931B00120n955J357j76J3236k999j3531n00O437N167m151J8346P124J419J4241
9917B40135J1478k3542k3290r923L385m421N276p483M898J8720k576m969j4109
9904A93579N113J0407J175j246P264R360O739J3767m283M542Q807R473j3112j1749
9890B39836J818J0691m512N427K5528J4159L901Q897P529m380L395J3665J5889
9877C41843Q889J8148N990j3827j0763L251J9788l89O809j374L187J2638J4291
$$ y = [165377, 170744, 178013, 165800, 155454, 148741, 135627, 131636, 136556, 151910, 165225, 161616, 153435, 161974, 182223, 177502, 166965, 160390, 153977, 164601, 164100, 177971, 191469, 191907, 175972, 194373, 199006, 196390, 200779, 204284, 203570, 219122, 214835, 202858, 192835, 188685, 179512, 187789, 207106, 205667, 200120, 194165, 195522, 195346, 208582, 205583, 192052, 191552, 197989, 203156, 199005, 217351, 224475, 225894, 240135, 251613, 228071, 204781, 194858, 198243, 193822, 199098, 191615, 196513, 215233, 212657, 207688, 193579, 198692, 209099, 210274, 209028, 216292, 225652, 232391, 246158, 241875, 246417, 255224, 264697, 251585, 239836, 241654, 252345, 247833, 253260, 278788, 292947, 296848, 305745, 313274, 308894, 312289, 325954, 341843, 350732, 368880, 374870, 361043, 350280, 353531, 373319, 372930, 379739, 378365, 381552, 394190, 408481]
9864D08481K3052O249l115J3716n769j8585J3548K828L417L735J1147K4477J6046
9851D99227K2687J9610R000J1679J1005K1546L5937K5650R194R580K3649P169
9839G05933q154J4252N522L3412L2571L2155K3892J2852J3017K4836K7207K5976
9827I43471M3995M8944M8167M2316L7606N4588O6358Q7694P0394Q4854J10708
9816A639095Q7170Q1929Q9663J02564Q6001J04475J62695K05338K47173K59343
9806C065446J86224J25411R8942P3681O1044M3576L5000L6197N7820P6476J17061
9795C976878J62785J72143J75735J87106K15199K10176J89632J84729J95325J95927
9785E865635J92929K43936K71383L55794M39798N19058O25128P16801P86079Q80070
$$ y = [408481, 431533, 437782, 434667, 448383, 442614, 424029, 437577, 440405, 443822, 447557, 458704, 483181, 499227, 521914, 541524, 550524, 562203, 573208, 594754, 630691, 656341, 665535, 675115, 698764, 705933, 697779, 712031, 717553, 750965, 783536, 815691, 839583, 852435, 865452, 890288, 917495, 943471, 987466, 1036410, 1084577, 1126893, 1164499, 1219087, 1285445, 1373139, 1443533, 1528387, 1639095, 1726265, 1808194, 1897857, 2000421, 2086422, 2190897, 2353592, 2558930, 2806103, 3065446, 3251670, 3377081, 3476023, 3549704, 3610748, 3654324, 3689324, 3725521, 3783341, 3859817, 3976878, 4139663, 4311806, 4487541, 4674647, 4889846, 5100022, 5289654, 5474383, 5669708, 5865635, 6058564, 6302500, 6573883, 6929677, 7369475, 7888533, 8513661, 9230462, 10016541, 10896611]
9775A0896611J007705J114690J208229J296040J315034J221221J083425Q78691
9767B0021646O38078L79350J39381l7487j22162j19902q0569j4239O2492J08245
9757B0974833R2056O5123M2061K0839j5203p6998j43213j64657j08154O456J63176
9746B0856319K41434K28773L1972k26108m17283m89599m14111j86185J25541N46249
9736B0297002R95503J267296J091885N89575J42337l3122R5672M61789R84001
9727B5891938J522870J607752O83715o74689j444636j440906q92182k43114K80962
9718B5291710O13899O26468K49888j98786l56347k50134K2802K71284M69598O18442
9708B7358824Q01280R65352J073197J067244R64429Q48605Q00025Q59527R70578
$$ y = [10896611, 11904316, 13019006, 14227235, 15523275, 16838309, 18059530, 19142955, 20021646, 20659724, 21039074, 21178455, 21140968, 21018806, 20898904, 20818335, 20804096, 20866588, 20974833, 21066889, 21132012, 21174073, 21194912, 21179709, 21102711, 20959498, 20794841, 20686687, 20693143, 20856319, 21097753, 21326526, 21358498, 21132390, 20715107, 20225508, 19811397, 19625212, 19750753, 20297002, 21292505, 22559801, 23651686, 24241261, 24383598, 24350476, 24446148, 24907937, 25891938, 27414808, 29022560, 29706275, 29031586, 27586950, 26146044, 25253862, 25010748, 25291710, 25905609, 26532077, 26781965, 26583179, 26226832, 25976698, 25999500, 26270784, 26740382, 27358824, 28160104, 29125456, 30198653, 31265897, 32230326, 33078931, 33878956, 34738483, 35709061]
9699C5709061J073917J118142J095340R69255P72772N44467L17204R7603n7075
9690D1640686r0326m204J17892J83635K44141K66613K33030L6590k36675m99384
9680D1891998p03515q80180j072321j223626j305172j348448j307782j234284
9672C2816670j132297j058543j070288j137219j171197j138659j102337j031402
9664B3974728r83860r02874q15147p11656o03884n21767m18863l23599k61155
9655A8431923k35504k49932k62752k65743k27601j66947j21160r1721k7842M9964
9645A6832685Q0123O8169L5726r756k9496j6037M2644J47850K71858M01116N38185
9634A8363067O62438P06095O45471M91639K38126K7521p0120j6821J03675K41424
$$ y = [35709061, 36782978, 37901120, 38996460, 39965715, 40738487, 41282954, 41600158, 41697761, 41640686, 41550360, 41546156, 41664048, 41847683, 42091824, 42358437, 42591467, 42628057, 42391382, 41891998, 41188483, 40308303, 39235982, 38012356, 36707184, 35358736, 34050954, 32816670, 31684373, 30625830, 29555542, 28418323, 27247126, 26108467, 25006130, 23974728, 22990868, 22087994, 21272847, 20561191, 19957307, 19435540, 19016677, 18693078, 18431923, 18196419, 17946487, 17683735, 17417992, 17190391, 17023444, 16902284, 16810563, 16782721, 16832685, 16912808, 16980977, 17016703, 17006947, 16977451, 16961414, 17004058, 17151908, 17423766, 17824882, 18363067, 19025505, 19731600, 20377071, 20868710, 21106836, 21134357, 21064237, 21047416, 21151091, 21392515]
9624B1392515K94865K47992J83134J44784J36223J75161J53783R2123P9264P3116
9614B2972960J06574J50628J74144J39188q421k46240n52265q46419j088096j304946
9604A9497107j458414j521058j473954j362160j225944j087173r52118q45361
9596I570925p47206o69620n89871n41396n00505m14536l33177k78734k37292k28296
9586E030292k08104j90409j71230j75336j90517j84271j57016j83269j71867j52365
9576C245908j19885r8455q6907q6518p9929r2191j16332j20359j29543j11704
9566B204085p8076p7519p7402l1281l4747j6717k5014m4602o1059m3162m2001
9555A672505n7564n4957o8816n1463m1337m6493o5809p1470m9637l3260k630j8786
$$ y = [21392515, 21687380, 21935372, 22118506, 22263290, 22399513, 22574674, 22728457, 22820580, 22899844, 22972960, 23079534, 23230162, 23404306, 23543494, 23535073, 23288833, 22736568, 21890149, 20802053, 19497107, 18038693, 16517635, 15043681, 13681521, 12455577, 11368404, 10416286, 9570925, 8823719, 8154099, 7564228, 7022832, 6522327, 6107791, 5774614, 5495880, 5258588, 5030292, 4822188, 4631779, 4460549, 4285213, 4094696, 3910425, 3753409, 3570140, 3398273, 3245908, 3126023, 3027568, 2940661, 2854143, 2774214, 2682023, 2565691, 2445332, 2315789, 2204085, 2126009, 2048490, 1971088, 1939807, 1905060, 1888343, 1863329, 1818727, 1757668, 1714506, 1672505, 1614941, 1559984, 1491168, 1439705, 1398368, 1351875, 1286066, 1214596, 1164959, 1131699, 1129069, 1110283]
9543A110283k2292j0173o784j6353j5130j2944k7360l4165j013P45j144J023n32
9530I64161l769j5589j7753k5275l1143m1143k2822j1054l1075l0900k8499j2009
9518F93130j7853j7878j1486r945N693J6257l50j1702o366J746j1618j4579j7682
9505E97367j885j449j0758K7j385p033k1069j6451J3983j015K683j3475j2974
9492E26566Q769j063m891n051j4886j5075n113L727l773Q526l394L692L903j0826
9478D91111q582Q148k0647j286M118j529N786M434K164L738j99P112J3935l66
9464E07937Q651K024j2906j464L304K9265K1488P278r324J0738j5851j4222n444
9451E31474K5351K7362J3286r325M648j488J5515N512J5989N518K7397M0559M4411
$$ y = [1110283, 1087991, 1077818, 1071034, 1054681, 1039551, 1026607, 999247, 965082, 964069, 964814, 963670, 964693, 964161, 960392, 944803, 927050, 901775, 870632, 829489, 806667, 795613, 764538, 733638, 705139, 693130, 675277, 657399, 645913, 635968, 641661, 657918, 657568, 645866, 639500, 641246, 629628, 615049, 597367, 595482, 594033, 583275, 583302, 581917, 574884, 553815, 537364, 551347, 550332, 553015, 539540, 526566, 535335, 534272, 529381, 524330, 509444, 494369, 489256, 492983, 489210, 497736, 494342, 498034, 501937, 491111, 482529, 490677, 470030, 468744, 472862, 471333, 477119, 481553, 483717, 487455, 487256, 494368, 508303, 507937, 516588, 518612, 505706, 504242, 507546, 536811, 558299, 565577, 556253, 566991, 551140, 536918, 531474, 556825, 584187, 597473, 588148, 592796, 591308, 606823, 612335, 628324, 633842, 661239, 701798, 746209]
9438G46209J3007K4779M5302M0549N1122O1190P4797P7990Q5881J02419J37985
9427A461230J52663J81127J95558K11014K49242L11241M04431N38312P59308J053663
9417E517789J423782J657250J522481J240620J297908J668965J496085J40639
9409A5965519j158601j624149j411419j255601j447156j557654j427405j101886
9401D981648p31402m70072l19206j93603j07337o5814l7730j9262p345K2691M3041
9390C095609M4392O3622O6308O7292P4760O5045M0573N3919M2518M6538J6560
9379C677136J281j1j2591K3903L7098K2640M1065K2851J9179L0052K4390K1464
9367C908457L5087M4379N6237O1562L4312O4923Q7995R5817J05517J15805R4466
$$ y = [746209, 759216, 783995, 829297, 869846, 920968, 982158, 1056955, 1134945, 1220826, 1323245, 1461230, 1613893, 1795020, 1990578, 2201592, 2450834, 2762075, 3166506, 3704818, 4464126, 5517789, 6941571, 8598821, 10121302, 11361922, 12659830, 14328795, 15824880, 15965519, 14806918, 13182769, 11771350, 10515749, 9068593, 7510939, 6083534, 4981648, 4250246, 3780174, 3460968, 3267365, 3160028, 3094214, 3056484, 3037222, 3029877, 3052568, 3095609, 3140001, 3203623, 3269931, 3337223, 3411983, 3477028, 3517601, 3571520, 3614038, 3660576, 3677136, 3678417, 3678406, 3665815, 3689718, 3726816, 3749456, 3790521, 3813372, 3832551, 3862603, 3886993, 3908457, 3943544, 3987923, 4044160, 4105722, 4140034, 4204957, 4292952, 4388769, 4494286, 4610091, 4704557]
9356D704557Q3037N2132K6033K2744L4116M1168P4940J13379J30670J36878J54664
9345E574318J55746J56036J57453J85473K31515L02336L55696M10418M79120N37303
9335H545414N84377O48000O78783P02882O89577O68899O46054O30581O09571O19997
9325A5024135O31422N97526N57226M90764M59642M94966N80751O97113Q07677
9316B0341222Q87130R23087Q69188Q05523P66913P56492P67484P69684P78825
9307B7665548P96912P95686P76322P56635P14080O94447P39693Q34982R13843
9298C4688148R56462Q56585N94153K55877M134j42321j75475l07722n23248p74299
9288C5432294r39582r20103p20806m48885k04582o1494K6574Q6767J55492K45472
$$ y = [4704557, 4787594, 4839726, 4865759, 4888503, 4922619, 4963787, 5038727, 5152106, 5282776, 5419654, 5574318, 5730064, 5886100, 6043553, 6229026, 6460541, 6762877, 7118573, 7528991, 8008111, 8545414, 9129791, 9777791, 10456574, 11159456, 11849033, 12517932, 13163986, 13794567, 14404138, 15024135, 15655557, 16253083, 16810309, 17301073, 17760715, 18255681, 18836432, 19533545, 20341222, 21228352, 22151439, 23020627, 23826150, 24593063, 25349555, 26117039, 26886723, 27665548, 28462460, 29258146, 30034468, 30791103, 31505183, 32199630, 32939323, 33774305, 34688148, 35644610, 36501195, 37095348, 37351225, 37355359, 37213038, 37037563, 36729841, 36206593, 35432294, 34492712, 33572609, 32851803, 32402918, 32198336, 32136842, 32163416, 32250183, 32405675, 32651147]
9278C2651147K91779K40725K04463J50670P6980P07j49674l73074o05520p01780
9268C1786423o29479m29984j51491J79898N28413P93862R67488J008098R50602
9259C5003830Q28016P48127O34848M28322J95569m155j34958j37482p1719J0192
9249C7500590N2544O6962J41881K79392M48907N38591N15202M79008N38451O87380
9239D1248908P83313O46236K78270k21395p31829j114765j286293j278241j212432
9230C7111772j200359j188182j114601r97010q90842p88523p75487q17857q45607
9221B8493304q25920q19366q37192q39020q57714q89557q54974q25551p55785
9212B0988225o55159n51619m80543m97956n27788n90282o14565o51216o90150
$$ y = [32651147, 32942926, 33183651, 33388114, 33538784, 33615764, 33616471, 33466797, 33093723, 32488203, 31786423, 31156944, 30726960, 30575469, 30755367, 31283780, 32077642, 33045130, 34053228, 35003830, 35831846, 36579973, 37214821, 37643143, 37838712, 37834557, 37699599, 37562117, 37490398, 37500590, 37553134, 37620096, 37761977, 38041369, 38490276, 39028867, 39544069, 40023077, 40561528, 41248908, 42032221, 42678457, 42956727, 42735332, 42003503, 40888738, 39602445, 38324204, 37111772, 35911413, 34723231, 33608630, 32611620, 31720778, 30932255, 30156768, 29338911, 28493304, 27667384, 26848018, 26010826, 25171806, 24314092, 23424535, 22569561, 21744010, 20988225, 20333066, 19781447, 19300904, 18802948, 18275160, 17684878, 17070313, 16419097, 15728947]
9203A5728947p51626p98155q07816q10437p54199o84636o32112n66037n30628
9194I393301m47605l90195k97546j98311j14279q0060q9896j23211j70552k19594
9184G262052k32185k11279j67305j35656j27778j17974j30057j45449j62516j63569
9174E668284j40119j43155j49299j26771q4313l7596k2063q763K6903J1027m360
9163D989775l2775n6425j21831j47242j54354j36390j16046q7354m9113m4374
9153D043871k8392j6991l2380m6970p3041r1153j02261j21230j27934j29496j25196
9142C148827j29297j07033j05220r5035q0033o1652m6718n6366o0399p8414r4299
9131B234361p8053r2128q4930n9012n7135m7928l7686k7079L832l894k3940m0375
$$ y = [15728947, 14977321, 14179166, 13371350, 12560913, 11806714, 11122078, 10489966, 9923929, 9393301, 8945696, 8555501, 8257955, 8059644, 7945365, 7865305, 7775409, 7652198, 7481646, 7262052, 7029867, 6818588, 6651283, 6515627, 6387849, 6269875, 6139818, 5994369, 5831853, 5668284, 5528165, 5385010, 5235711, 5108940, 5024627, 4987031, 4964968, 4956205, 4983108, 4994135, 4989775, 4957000, 4900575, 4778744, 4631502, 4477148, 4340758, 4224712, 4137358, 4088245, 4043871, 4015479, 3998488, 3966108, 3919138, 3846097, 3754944, 3652683, 3531453, 3403519, 3274023, 3148827, 3019530, 2912497, 2807277, 2712242, 2632209, 2570557, 2523839, 2467473, 2407074, 2328660, 2234361, 2156308, 2064180, 1979250, 1920238, 1863103, 1815175, 1777489, 1750410, 1754242, 1750348, 1726408, 1686033]
9119A686033l2269l1561j7014k6584m1070n8629o8069m5621k7701o0218m4015
9108A233282j3287j2005l8452k2629l6180j8778j0116k3500j9928m843j0580M406
9096A027390J4871K6096K0317J880j786j3828k9055m5329n5741n7300k1808r587
9084H56120k6336l6576j8780K296R530j7999K488R591P189M821j485p72O079J0382
9070H06548K710n259m095k2943m5300l5653l5736k1783k5695j7564j7296j3408
9058E64526k531J1973L2275J3518R043K6065M925K869K320N506L209K031k0644
9045F55085l7162j6763p892j193J0071R006o15k1540j2402Q449R933j0489J4004
9032E98492K4510J8863J6712j1203N408J2802q533k534P959j0475j0207J524j414
$$ y = [1686033, 1653764, 1622203, 1605189, 1578605, 1537535, 1478906, 1410837, 1365216, 1337515, 1277297, 1233282, 1219995, 1207990, 1169538, 1146909, 1110729, 1091951, 1081835, 1058335, 1038407, 1033564, 1022984, 1027390, 1042261, 1068357, 1088674, 1090554, 1088768, 1074940, 1045885, 1000556, 944815, 887515, 865707, 856120, 829784, 793208, 774428, 776724, 786254, 768255, 770743, 780334, 787523, 792344, 790859, 790087, 796166, 806548, 809258, 803999, 799904, 776961, 731661, 696008, 660272, 638489, 612794, 595230, 577934, 564526, 561995, 573968, 606243, 619761, 628804, 654869, 659794, 662663, 664983, 670489, 673698, 675729, 655085, 617923, 601160, 593268, 592075, 602146, 611152, 610537, 588997, 576595, 585044, 594977, 584488, 598492, 623002, 641865, 658577, 647374, 652782, 665584, 657051, 654517, 662476, 652001, 641794, 643318, 641904]
9019F41904l664j607j155k6812j9710N292J4902K3766l557M716N713J5928N198
9006F60914O862P998m111j5218l790p933J496k809q276Q347K9262j0029k0716
8993F41997r730m635k8408m3439j7737L717j0332j5265R880K354j91J4500l321
8980E39390L0116K0023r923k6987p172L184k97j3728j5494j1516Q095J4486J975
8967E32152j8O271J7601k505N684J5490K2321Q025j4061k542K8696J0041J6346
8954F43501J7208p626j2106j5229j8023k80M25k562J814J1151P922j0578m831
8941F10786K2272K133J395p29j7998M707J4316L635j301j0716K1063L1980O397
8928F87940L255J7308K1452M16j2349q820K905n363j0665j0865j7764j7240m575
$$ y = [641904, 638240, 636633, 635478, 608666, 588956, 594248, 609150, 632916, 629359, 634075, 639788, 655716, 660914, 667776, 675774, 671663, 656445, 652655, 644722, 646218, 643409, 635133, 643480, 672742, 662713, 641997, 632267, 627632, 599224, 555785, 538048, 541765, 531433, 516168, 526048, 528402, 528211, 542711, 539390, 569506, 589529, 579606, 552619, 545447, 548631, 548334, 534606, 519112, 507596, 515691, 530177, 532152, 532134, 538405, 556006, 553501, 559185, 574675, 596996, 605021, 590960, 588418, 617114, 627155, 643501, 660709, 653083, 640977, 625748, 607725, 607445, 607870, 605308, 607122, 618273, 626195, 615617, 610786, 633058, 635191, 636586, 635857, 617859, 622566, 636882, 640517, 639216, 628500, 649563, 681543, 687940, 691195, 708503, 729955, 730371, 718022, 709202, 712107, 706744, 696079, 685214, 667450, 650210, 645635]
8915F45635J6226m975j1811l54R731J6974P56k040J7657M799J0965K1768M751
8902G30082n984O008j7852k8150k4493j5093n123O076m391J4260J761l020m269
8889F49812o564P434J5453J8453J1928l235k1748j5252O02j834j6601J0265J6047
8876F64760N280k999o181k60K9861J9232j0061Q988P869J622J6470K0477K5484
8863G80542K2037L4800J8221N314J0350J3140L0808N3893L0250K7844N2893N3545
8851A133637Q9080J11876J40836J57742K05098K24641K60639L01522L07038L34211
8841C266320L71512L65751L56215M70456O41241R54934J451682K212497L419032
8832A3509640N128441O571113N100496j37373m743060o420378n515966l752452
$$ y = [645635, 661861, 656886, 645075, 644721, 654452, 671426, 672182, 670142, 687799, 692598, 703563, 725331, 730082, 724098, 730106, 712254, 684104, 659611, 644518, 639395, 645471, 641080, 655340, 657101, 654081, 649812, 643248, 650682, 666135, 684588, 696516, 693281, 671533, 656281, 656883, 655049, 638448, 648713, 664760, 670040, 667041, 660860, 660600, 690461, 709693, 699632, 708620, 716489, 718111, 734581, 755058, 780542, 802579, 837379, 855600, 860914, 871264, 884404, 915212, 969105, 999355, 1027199, 1080092, 1133637, 1222717, 1334593, 1475429, 1633171, 1838269, 2062910, 2323549, 2625071, 2932109, 3266320, 3637832, 4003583, 4359798, 4830254, 5471495, 6426429, 7878111, 10090608, 13509640, 18638081, 25209194, 30309690, 30172317, 25429257, 19008879, 13492913, 9740461]
8824I740461k374974j515615j037079p41249n30096l68427k81092k24460k16699
8815B450770k16387j81086j46725j45744j35859j07952q7251r1479o1009o1563
8805A215715n2825n9475n4604k8422k3192l9379l0676l745j1084k4016j5071N006
8793H78232j3358j7769J7728Q352k193p872j8193j5029m831J1164j1253Q500Q781
8780H42259N184j079M996J5240M025O483N531l39K1281K4220J3029K0126J2161
8767I73117K1874K4419K8206l698j5126J2591J6550O462J7722J7068J8605J7201
8755A134991J4774J5176K8698L0185M7109O9966Q0046Q6190J19529J18576J31390
8744A876630J38422J63139J78277J66332J83935K00299J89852K27876K53219K21501
$$ y = [9740461, 7365487, 5849872, 4812793, 4071544, 3541448, 3173021, 2891929, 2667469, 2450770, 2234383, 2053297, 1906572, 1760828, 1624969, 1517017, 1429766, 1338287, 1277278, 1215715, 1162890, 1103415, 1048811, 1020389, 997197, 957818, 927142, 923397, 912313, 888297, 873226, 878232, 864874, 847105, 864833, 873185, 870992, 863120, 844927, 829898, 825067, 836231, 824978, 833478, 842259, 847443, 846364, 851360, 866600, 870625, 877108, 882639, 882300, 903581, 927801, 940830, 960956, 973117, 994991, 1019410, 1047616, 1043918, 1028792, 1041383, 1057933, 1064395, 1082117, 1099185, 1117790, 1134991, 1149765, 1164941, 1193639, 1223824, 1270933, 1340899, 1420945, 1507135, 1626664, 1745240, 1876630, 2015052, 2178191, 2356468, 2522800, 2706735, 2907034, 3096886, 3324762, 3577981, 3799482]
8734C799482J75028J38114J24251J00391J24536J50389J96592K20171K04234J38399
8724E371587P1460n800n9770q8762j00555j03806p9439m2986r433J5991M8997
8713E017484P5644J02904J42614J70016K00478J75248J60069J04619N1749M6324
8703F247149O2865P4725J08666J06501M6035k5725p3150j19935j17888o0352m0868
8692F208023K8617Q7886J43080J68755J99795J88366J68264J52585J40319J64776
8682G650466K07528K24740K21360J85506J64311J89521K52827L29444M05181M72253
8672A0303137N29369N57331N31692N12102N19732N11061M97729M39134L13487
8663A4714774J58698J9230n8474j5282R0644K12430L78657N83393Q39071J120104
$$ y = [3799482, 3974510, 4112624, 4236875, 4337266, 4461802, 4612191, 4808783, 5028954, 5233188, 5371587, 5443047, 5437247, 5377477, 5288715, 5188160, 5084354, 5004915, 4961929, 4952496, 4968487, 5017484, 5093128, 5196032, 5338646, 5508662, 5709140, 5884388, 6044457, 6149076, 6200825, 6247149, 6310014, 6384739, 6493405, 6599906, 6645941, 6620216, 6547066, 6427131, 6309243, 6248891, 6208023, 6236640, 6324526, 6467606, 6636361, 6836156, 7024522, 7192786, 7345371, 7485690, 7650466, 7857994, 8082734, 8304094, 8489600, 8653911, 8843432, 9096259, 9425703, 9830884, 10303137, 10832506, 11389837, 11921529, 12433631, 12953363, 13464424, 13962153, 14401287, 14714774, 14873472, 14892702, 14834228, 14818946, 14909590, 15122020, 15500677, 16084070, 16923141, 18043245]
8653A8043245J447340J722486J889940J878579J645117J234231P07860Q8317m93183
8644B8163932r16092j064620r92435q01451n43672l05188j18233M8774K02120
8635B3673135L38988M78177N67625O49319P37786Q27540R11650R62222J003694
8626C0150136R51934P95305N32126K26169j17540m39945n70953n15284l01159
8617C0710789m0511J47145K76079L62776M78233O14153P68823Q54617Q41219P16751
8607C5730074N79760N11458O37287R28302J247224J495211J583667J603809J631082
8598D5947874J732364J851177J922493J944580J900742J845456J774005J732504
8590F0651195J815008J941311K078582K180690K261013K330578K383014K332736
$$ y = [18043245, 19490585, 21213071, 23103011, 24981590, 26626707, 27860938, 28568798, 28657115, 28163932, 27247840, 26183220, 25190785, 24389334, 23845662, 23540474, 23422241, 23471015, 23673135, 24012123, 24490300, 25057925, 25707244, 26445030, 27272570, 28184220, 29146442, 30150136, 31102070, 31897375, 32429501, 32655670, 32538130, 32098185, 31527232, 31011948, 30710789, 30670278, 30817423, 31093502, 31456278, 31934511, 32548664, 33317487, 34172104, 35013323, 35730074, 36309834, 36821292, 37458579, 38386881, 39634105, 41129316, 42712983, 44316792, 45947874, 47680238, 49531415, 51453908, 53398488, 55299230, 57144686, 58918691, 60651195, 62466203, 64407514, 66486096, 68666786, 70927799, 73258377, 75641391, 77974127]
8582G7974127K091638J710378J284010Q23856J74351p11629j693810k370816k505097
8573G6777008k238924j917050j809123j929159k182079k460496k626551k643206
8565E8970420k533348k273776j957916j674490j473292j368723j331586j377706
8557D4979583j451555j492897j485123j403038j315576j190847j059727j028154
8549C4552666j061397j056499r98877q72671o99863n03418l38835k25070j16876
8540B8679160J565J14229J96220J81539K6941j94545m65102o82987q92479j094007
8530B5870534j182136j174188j111722j007110q81214p29463n44498l49818j72900
8521A8717485Q002J16592K19922L54434M96236O10327O88983O62773N46385K90582
$$ y = [77974127, 80065765, 81776143, 83060153, 83884009, 84058360, 83346731, 81652921, 79282105, 76777008, 74538084, 72621034, 70811911, 68882752, 66700673, 64240177, 61613626, 58970420, 56437072, 54163296, 52205380, 50530890, 49057598, 47688875, 46357289, 44979583, 43528028, 42035131, 40550008, 39146970, 37831394, 36640547, 35580820, 34552666, 33491269, 32434770, 31435893, 30563222, 29863359, 29359941, 29021106, 28796036, 28679160, 28680725, 28794954, 28991174, 29172713, 29199654, 29005109, 28540007, 27857020, 26964541, 25870534, 24688398, 23514210, 22402488, 21395378, 20514164, 19784701, 19240203, 18890385, 18717485, 18725487, 18842079, 19062001, 19416435, 19912671, 20522998, 21211981, 21874754, 22421139, 22711721]
8511B2711721q4027n35895r42562j242849j438244j484247j416330j274316j063900
8502A3229351q82121o83717m95351l45751k03159p0043r916L2355L0744J7000
8492A0619392k5115r1454j08274j23396j79685k26672l01156l71934l96842l93221
8482H401643l61523l10029k75580k09569j63549j40750j28370j21501r5060q9457
8472F506255j17901j31754j53856j61864j67615j16279r0229n7859j6664L1916
8462E524150O0757R6080Q6166O1582K6391n940j4827p621n066m2027n4233r8320
8450E627092j15051j58881j49214j00338q0327o3094m3251j1099J9340N8854R3480
8439E077511J10241J08621J07118R1897P8238L2976M931m7458j09736j04656j15281
$$ y = [22711721, 22627694, 22091799, 21149237, 19906388, 18468144, 16983897, 15567567, 14293251, 13229351, 12347230, 11663513, 11168162, 10822411, 10619252, 10549209, 10539293, 10571648, 10602392, 10619392, 10594277, 10502823, 10394549, 10271153, 10091468, 9864796, 9563640, 9191706, 8794864, 8401643, 8040120, 7730091, 7454511, 7244942, 7081393, 6940643, 6812273, 6690772, 6595712, 6506255, 6388354, 6256600, 6102744, 5940880, 5773265, 5656986, 5566757, 5508898, 5492234, 5524150, 5584907, 5680987, 5767153, 5828735, 5855126, 5849186, 5834359, 5826738, 5821672, 5779645, 5725412, 5627092, 5512041, 5353160, 5203946, 5103608, 5023281, 4960187, 4916936, 4905837, 4925177, 4984031, 5077511, 5187752, 5296373, 5403491, 5495388, 5573626, 5606602, 5611533, 5564075, 5454339, 5349683, 5234402]
8428E234402j06919q4743q4639o1315l9802k8254j8271J5790L0522J0729l158
8417D864342k6542k7816l2372l5142j1806r635M35L010M3203N3905M7287M7604
8405D916473N8335M4172O0166M6396P3195R3813O4500O8426R2667R0882R3239
8394E702264O9289R0676R6645J12960J08756J08763J10294J08104J17799J24441
8384F749991J37808J28189J30593J42136J57301J46356J48567J70012J61913J69179
8374H242045J81093J70178J73413J77874J87513J94007K10217K25247K36431K41594
8364A0239612K49212K48941K76725K62154K72378K93009K93250L02068L12258
8355A2749607L33628L52211L61683L47643L82280L96281M11393M10378M23735
$$ y = [5234402, 5127483, 5042740, 4958101, 4896786, 4856984, 4828730, 4810459, 4826249, 4856771, 4867500, 4864342, 4837800, 4809984, 4777612, 4742470, 4730664, 4721029, 4721464, 4724474, 4767677, 4821582, 4868869, 4916473, 4974808, 5018980, 5079146, 5125542, 5198737, 5292550, 5357050, 5425476, 5518143, 5609025, 5702264, 5771553, 5862229, 5958874, 6071834, 6180590, 6289353, 6399647, 6507751, 6625550, 6749991, 6887799, 7015988, 7146581, 7288717, 7446018, 7592374, 7740941, 7910953, 8072866, 8242045, 8423138, 8593316, 8766729, 8944603, 9132116, 9326123, 9536340, 9761587, 9998018, 10239612, 10488824, 10737765, 11014490, 11276644, 11549022, 11842031, 12135281, 12437349, 12749607, 13083235, 13435446, 13797129, 14144772, 14527052, 14923333, 15334726, 15745104, 16168839]
8346A6168839M34556M83290N00415M93487M95393N13466N33259N62892N66641
8337B0752238N72798O06929O30526O27918O49330O76228O70876O89760P15586
8328B6592189P29313P39457P56262P46913P43137P58698P58376P70023P41609
8319C3335977P37026P39596P25828P14116O92143O51434O24894N84930N68154
8310C9374098N24934M48424L88961L69391L05069K45481J91149J30894O2849k1900
8300D2019350q6024j30101k14892k69820l09236l79755m40419m78914n22266n72171
8290C8615752n96973o36910o79200p01019p01029p37065p56264p61263p59056
8281C2286973p54433p59249p68368p53957p28334p34970p27119p23312p16232
$$ y = [16168839, 16603395, 17086685, 17587100, 18080587, 18575980, 19089446, 19622705, 20185597, 20752238, 21325036, 21931965, 22562491, 23190409, 23839739, 24515967, 25186843, 25876603, 26592189, 27321502, 28060959, 28817221, 29564134, 30307271, 31065969, 31824345, 32594368, 33335977, 34073003, 34812599, 35538427, 36252543, 36944686, 37596120, 38221014, 38805944, 39374098, 39899032, 40347456, 40736417, 41105808, 41410877, 41656358, 41847507, 41978401, 42041250, 42019350, 41933326, 41803225, 41588333, 41318513, 41009277, 40629522, 40189103, 39710189, 39187923, 38615752, 38018779, 37381869, 36702669, 36001650, 35300621, 34563556, 33807292, 33046029, 32286973, 31532540, 30773291, 30004923, 29250966, 28522632, 27787662, 27060543, 26337231, 25620999]
8272B5620999o97910o85020o60616o47907o44790o35388n95445n61137n69983
8263A9922803n56416n46101n12901n00815m66150m49100m57733m51448m51415
8254A5530724m21755l72589l73643l69231l50572l27819l16759l43721l23724
8245A2330911l01366k70086k85877k85412k52885k60521k63154k54607k44166
8236I912837k09565k19414k17908k03943j72805j82199j78602j54486j60190j42011
8226H071714j36436j38799j30198j34746j54287j72120j69522j65377j50780j44183
8216F575266j44869j25178j15088j07077j07335j12292j03317j02399j13603r1201
8206E452907r3622p2001p1771p6918q9630r3561o9967o7474o5850o4849q1628
$$ y = [25620999, 24923089, 24238069, 23577453, 22929546, 22284756, 21649368, 21053923, 20492786, 19922803, 19366387, 18820286, 18307385, 17806570, 17340420, 16891320, 16433587, 15982139, 15530724, 15108969, 14736380, 14362737, 13993506, 13642934, 13315115, 12998356, 12654635, 12330911, 12029545, 11759459, 11473582, 11188170, 10935285, 10674764, 10411610, 10157003, 9912837, 9703272, 9483858, 9265950, 9062007, 8889202, 8707003, 8528401, 8373915, 8213725, 8071714, 7935278, 7796479, 7666281, 7531535, 7377248, 7205128, 7035606, 6870229, 6719449, 6575266, 6430397, 6305219, 6190131, 6083054, 5975719, 5863427, 5760110, 5657711, 5544108, 5452907, 5359285, 5287284, 5215513, 5138595, 5048965, 4955404, 4885437, 4817963, 4752113, 4687264, 4605636]
8195D605636q0381q6028o5278p0544p8819n5871o4227p2684m7079m8605l4204
8184C901916l5035o9752p7498p0761p4566n4167n7177m7375n2227m5428k3410
8173C294520n0974m8271n7588n6275n3929m1691m7805m6618l0169j1317k9386
8162B820497l2663k2630l2056j7897q986l5868m6204k6441p189k3464k5984j8772
8150B522343j5147l6754n9225m6578k6128j6507k0976l7798m2480m8751l3880
8139B138119j9419j0082j7097k1624j358k1004k4899n055l0717l5507k5244r881
8127A916232j0412j9026k9270k9678j5480k0452p225k9996l3866l4031k3547k3566
8115A639683p091j2105j4209k8464k4510p817k1125k0961j4343l5855q02R471
$$ y = [4605636, 4525255, 4439227, 4373949, 4303405, 4224586, 4168715, 4104488, 4031804, 3984725, 3936120, 3901916, 3866881, 3797129, 3719631, 3648870, 3574304, 3520137, 3462960, 3415585, 3363358, 3317930, 3294520, 3243546, 3195275, 3137687, 3081412, 3027483, 2985792, 2937987, 2891369, 2861200, 2849883, 2820497, 2787834, 2765204, 2733148, 2715251, 2706265, 2670397, 2624193, 2597752, 2590563, 2567099, 2541115, 2522343, 2507196, 2470442, 2411217, 2364639, 2338511, 2322004, 2301028, 2263230, 2220750, 2171999, 2138119, 2118700, 2108618, 2091521, 2069897, 2068539, 2047535, 2022636, 2017581, 1986864, 1951357, 1926113, 1916232, 1905820, 1886794, 1857524, 1827846, 1812366, 1791914, 1784689, 1754693, 1720827, 1686796, 1663249, 1639683, 1632592, 1620487, 1606278, 1577814, 1553304, 1545487, 1524362, 1503401, 1489058, 1453203, 1452401, 1461872]
8103A461872J0602M19L99K76j9823r406k3170n0441l5285o077L927r529q629k8368
8089A286767l3857O733m59j8931o608j3965j0633M955l009j7434k2169N517J2609
8076A189516m189j7960j8914j2718j7697k7593k7153j0953m069j7513l727J038
8064A028068J2854J1279q846k7253p781r613o512r194j5671o990N953N08N192
8051I71994J0514j0072j8350K654r290k3777k1138k2380j7459l81P257M84m451
8038H65605r316P575K9551j0532k0654j4607p811N37j2482l8326k6459L309q68
8025G65522q982m840K332J0356j953r539j0940K851j1825l679k732L417j359j0255
8011G18374p437m921k6k1637q750O227R429P209j6269k1077j1239J1936J5991
$$ y = [1461872, 1472474, 1472893, 1473292, 1473568, 1453745, 1444339, 1421169, 1370728, 1335443, 1329366, 1333293, 1323764, 1315135, 1286767, 1252910, 1259643, 1259184, 1240253, 1233645, 1219680, 1209047, 1214002, 1210993, 1193559, 1171390, 1176907, 1189516, 1185327, 1167367, 1148453, 1135735, 1118038, 1090445, 1063292, 1052339, 1048270, 1030757, 1027030, 1028068, 1040922, 1052201, 1043355, 1016102, 1008321, 998708, 992196, 983002, 967331, 960341, 966294, 966802, 971994, 982508, 972436, 954086, 956740, 947450, 923673, 902535, 880155, 862696, 862315, 869572, 870056, 865605, 856289, 863864, 893415, 882883, 862229, 847622, 839811, 840348, 827866, 789540, 763081, 766390, 765522, 756540, 751700, 754032, 764388, 762435, 752896, 741956, 744807, 732982, 729303, 726571, 729988, 728629, 718374, 710937, 706016, 705990, 684353, 675603, 681830, 691259, 698468, 682199, 661122, 649883, 661819, 677810]
7998F77810j0868m91r479r104l858m344p383j7220m915j0731j891n015j6666J058
7984E76903J1652J5086P012j8235j1803J378M74o609o337O667J2904r178j3053
7971E66861k771l624j1166O293j0013j1812j5459r761L315J8693J1510L708J7077
7958E62851N278l270j5375k0272j2627q687r912k6074k127n064j1830j435j2949
7945D38507K388J1488O61M796J5492M105Q002L439j0466j1124o587M237o076j9164
7931D39698l513j8478j3725q549J107J870q381J0470R053J7034J4811L004J744
7918D46145J4117n246M660k791k0994p89l007m778k5476j8453m997j0624j5078
7905C52689j7245R45J5388J0695m195r375r888N478m091L159k151J1790K391o222
$$ y = [677810, 666942, 666451, 656972, 647868, 644010, 639666, 632283, 615063, 610148, 599417, 597526, 592511, 575845, 576903, 588555, 603641, 610653, 592418, 580615, 581993, 582467, 575858, 569521, 576188, 589092, 579914, 566861, 564090, 560466, 549300, 555593, 545580, 533768, 518309, 508548, 511863, 530556, 542066, 545774, 562851, 568129, 564859, 549484, 529212, 516585, 507898, 497986, 471912, 469785, 464721, 452891, 451456, 438507, 440895, 452383, 453044, 457840, 473332, 477437, 485439, 488878, 478412, 467288, 460701, 464938, 458862, 439698, 436185, 417707, 403982, 395433, 396540, 398410, 390029, 400499, 409552, 426586, 441397, 444401, 446145, 460262, 455016, 459676, 456885, 435891, 435102, 432095, 427317, 401841, 383388, 378391, 367767, 352689, 335444, 336389, 351777, 362472, 358277, 348902, 339014, 344492, 340401, 343560, 341409, 353199, 355590, 349368]
7891C49368n932L097M113j908R589Q676J09j5073o925k2011q752J0741J4833K125
7877C42050r156k426M36N38Q455R100j9671j1166K509p616k405j1723J330K902
7863C03157r197P625r057m204j155n514j2551l478j70Q521P847J4190m991k0847
7849B70176m406J749K798L455K706l850o508j90J1030J543p968l20Q420K189r991
7834B70833P503J0431j7835j992K0522N959j9022k4943j9032L404J4649O310J7100
7821B73887M472k0680n778P933J0596r139K093j7855m996q920q883p480q376P958
7807B14832N308K1239K0512k2454k1919O567J512M726k963q648o359j0800K440
7794B03993Q245r863q214J7803Q71n694P729Q823k0256o348p206k716p288p852
$$ y = [349368, 343436, 346533, 350646, 348738, 358327, 367003, 367112, 352039, 345114, 323103, 314351, 325092, 339925, 342050, 332894, 330468, 330904, 331442, 339897, 348997, 329326, 318160, 320669, 313053, 310648, 298925, 300255, 303157, 293960, 301585, 292528, 288324, 287169, 281655, 269104, 265626, 265456, 273977, 281824, 296014, 291023, 270176, 265770, 267519, 270317, 273772, 276478, 272628, 266120, 265930, 276960, 278503, 270535, 270215, 278635, 280824, 270833, 278336, 288767, 270932, 268940, 289462, 295421, 276399, 251456, 232424, 235828, 250477, 256787, 273887, 278359, 257679, 251901, 259834, 270430, 261291, 263384, 245529, 240533, 231613, 222730, 215250, 206874, 214832, 220140, 241379, 261891, 239437, 217518, 224085, 225597, 230323, 227360, 218712, 212353, 201553, 203993, 212238, 202375, 194161, 211964, 212835, 207141, 214870, 223693, 203437, 197089, 189883, 187167, 179879, 172027]
7780A72027o024L606K1748J0198r83q226l304p896M8P45M491L100k699l707k61
7765A82863j1237q502m86R548Q670j047K337j176j862J254L062r576p722o245
7751A59881J2322P90l81L443o556o926m552J7584J8583r91J2211n588q692n664
7737A85464J979k2361l808J0688m977R922J9693q234k357N999j476q063n612j7490
7723A59367m838Q913J0238l1421j5089J8584J8128J0012J2650J3357L078k3831
7711A79148j1318p65j6569n977J54j6376K1746N394l0308r477K5591K0436j3240
7698A48439j0655N661j6446q370J8681N950j1800l595Q05q823p20m651J3923J1626
7684A40025k425j1678j6914k686J101k661J5576P905k441q98R80M889P027r851
$$ y = [172027, 166003, 169609, 191357, 201555, 200572, 192346, 189042, 181146, 181194, 181939, 186430, 189530, 186831, 183124, 182863, 171626, 163124, 162638, 172186, 180856, 179809, 182146, 180970, 179108, 180362, 183424, 173848, 166126, 159881, 172203, 172993, 172612, 176055, 169499, 162573, 158021, 175605, 194188, 193197, 205408, 199820, 191128, 185464, 187443, 165082, 161274, 171962, 166985, 176907, 196600, 188366, 186009, 192008, 190532, 182469, 176857, 159367, 154529, 163442, 173680, 142259, 127170, 145754, 163882, 173894, 186544, 199901, 202979, 179148, 167830, 167065, 150496, 144519, 144673, 128297, 150043, 155437, 125129, 115652, 141243, 161679, 148439, 137784, 143445, 126999, 118629, 137310, 143260, 131460, 127865, 128670, 119847, 119127, 114476, 128399, 140025, 137600, 125922, 109008, 106322, 107423, 104762, 120338, 128243, 125802, 124904, 125884, 130773, 137800, 127949]
7670A27949J486o828j1543M060K734K3785J156j4341J3835L727j3804j6940r051
7657A06225N724Q716M522L383O203K152K577o295j5463J576J3594K1740k129j4223
7643A38302j1570o74o770j0590o458J4853K089J8976J3781k4129j3336j3384j7340
7630H3750O067J2727n264n880Q892J7790J762j2381L572K887R59K227k268k468
7616A12372J8809n346j2932k1570l647j885J019k971L304o778J3881N589j5732
7603H4113o774L036n603N337J0778K167j1586J1015M43J675o278J911M399p959
7589H6674O563M871p64j2304Q88J136j355r849J1499n765n659m182L575R121m283
7574H0166j1349J849K1394O088J939L058r800p992J9902P992m702J4685Q961J5547
$$ y = [127949, 129435, 122607, 111064, 115124, 117858, 141643, 142799, 128458, 142293, 146020, 132216, 115276, 106225, 111949, 120665, 125187, 128570, 134773, 136925, 139502, 133207, 117744, 119320, 132914, 154654, 152525, 138302, 126732, 126058, 119288, 108698, 102240, 117093, 119182, 138158, 151939, 127810, 114474, 101090, 83750, 89817, 102544, 97280, 91400, 100292, 118082, 119844, 107463, 111035, 113922, 114881, 117108, 114840, 112372, 131181, 125835, 112903, 91333, 87686, 85801, 86820, 83849, 87153, 80375, 94256, 99845, 84113, 77339, 80375, 74772, 80109, 90887, 93054, 81468, 92483, 92926, 94601, 88323, 90234, 94633, 86674, 93237, 98108, 97344, 85040, 85928, 87064, 85709, 75860, 87359, 81594, 75935, 71753, 75328, 84449, 80166, 68817, 70666, 92060, 98148, 100087, 103145, 93345, 85353, 105255, 113247, 108545, 123230, 132191, 147738]
7560A47738J2554k6254l6799j5468O966q18l246J4221j181m695k7257j596n60
7547F3605j932J272L576P355O722P485k0823j5307J3750J686n888j181M979N390
7533G0689m296J4470P959N674j816o392O059N463J4377j341p178o364j3452k5137
7519E8715j9411N553J8558K6278L318N324o040j0451J1710J622p769p118J049
7506H1338O430j9712l842J686m434j500L74O464K877r841N796M707l64J1774J6716
7491I8469L079o507k3330j1387J4857O950M290J6897O837k7285j4683L0801J1280
7478A10268K960n627r115J763j956j9107j803K6599q813l663k362o151q42j8949
7464F3202J53j0659m657m16N61l023m343J2009l304q642L880J5496J7280K928
$$ y = [147738, 160292, 134038, 97239, 81771, 88737, 87919, 84673, 98894, 97713, 93018, 65761, 64165, 63605, 61673, 62945, 66521, 73876, 80598, 88083, 67260, 51953, 65703, 67389, 61501, 60320, 65299, 70689, 66393, 80863, 88822, 94496, 92680, 86288, 92347, 97810, 112187, 110846, 103668, 97304, 83852, 58715, 39304, 44857, 63415, 89693, 93011, 98335, 92295, 81844, 93554, 95176, 87407, 80289, 81338, 87768, 68056, 64214, 65900, 61466, 59966, 60340, 66804, 69681, 59840, 65636, 70343, 69979, 81753, 98469, 101548, 95041, 71711, 60324, 75181, 82131, 86421, 103318, 110155, 82870, 68187, 98988, 110268, 113228, 107601, 98486, 100249, 98293, 79186, 77383, 103982, 95169, 91506, 89144, 82993, 82151, 63202, 63355, 52696, 48039, 47623, 48184, 45161, 40818, 52827, 49523, 40881, 44761, 60257, 77537, 80465]
7450H0465j4731L36K6047O739l546k6886K199q981L869J8053N049j4960k0041
7437E3612k732K4554o036n493O201m771Q282j994k4599K10R958p348o574N334
7423D8604J4620O128r509k222l680r555j5644j5973L3431J7937Q07J679j7141
7410D9482j5683N852N300O780L84Q835M002j145L247j919P1j4054p950J1130j596
7395E2736j2021m379k416J1326J0291J3670m705j1720O148J0387q197m602J4394
7382G0912J491k8715O440P891q628k652J3710J0111j8610L092K144j5130n861
7369C6195j7123j712J4070q124P201J0991K1932J6899k2141r632j5205O319N203
7356D4873J3740Q492P582K547j2145j4737j3806j1891N650J5044Q032l727K488
$$ y = [80465, 65734, 66070, 92117, 98856, 95310, 68424, 70623, 61642, 65511, 83564, 88613, 73653, 53612, 50880, 75434, 69398, 63905, 70106, 65335, 73617, 71623, 47024, 47234, 57192, 49844, 43270, 48604, 63224, 69352, 59843, 57621, 53941, 44386, 28742, 12769, 46200, 64137, 64944, 66623, 49482, 33799, 39651, 44951, 51731, 52115, 60950, 64952, 63807, 67054, 65135, 65206, 51152, 43202, 54332, 52736, 40715, 36336, 33920, 45246, 55537, 69207, 64502, 52782, 58930, 69317, 61120, 56518, 70912, 72403, 43688, 50128, 58019, 49391, 46739, 60449, 70560, 51950, 55042, 57186, 42056, 36195, 19072, 17360, 31430, 23306, 30507, 41498, 63430, 80329, 58188, 48556, 33351, 39670, 44873, 58613, 67105, 74687, 77234, 65089, 50352, 36546, 24655, 30305, 45349, 53381, 49654, 52142]
7343E2142l961P160j0075j9006K918J5270L515k346O57Q750o186P132Q401K691
7329F7062j2682o551j2763j1503N569P991O237Q761l008p385J9147Q758j8269
7316E1364j4532K044M094r204m370J7291J3555j2857o040p948l27J9154J2105
7303F4329o953k0918m072J6737J2645P323j0385j5271L299j1858j5370q078L66
7290A1794J1594J6363K687P75q495j3025M870J769r117L052L1086J1032j1435
7277E2950j0922n146q177J4056J274o297N8o996q369j9813j014N985P490O620
7263B1699N779q283j4259L458K253J2627J4546M206R846p590r807P354k88N386
7249D6927J3825n538O09m097k2561k6630j6224J3173J4935J6595n042P878J6040
$$ y = [52142, 48181, 55341, 45266, 26260, 29178, 44448, 47963, 45617, 46274, 55024, 48838, 55970, 64371, 67062, 54380, 47829, 35066, 23563, 29132, 37123, 43360, 52121, 49113, 41728, 60875, 69633, 51364, 36832, 38876, 42970, 33766, 29396, 46687, 60242, 47385, 41345, 33397, 33070, 52224, 64329, 57376, 36458, 32386, 49123, 61768, 69091, 58706, 43435, 46734, 34876, 19506, 11428, 11794, 23388, 39751, 42438, 43213, 34718, 21693, 26563, 28332, 19215, 22267, 53353, 64385, 52950, 42028, 36882, 28705, 42761, 44035, 37738, 37796, 30800, 22431, 2618, 1604, 7589, 15079, 21699, 27478, 19195, 4936, 8394, 10647, 23274, 37820, 42026, 51872, 44282, 34475, 41829, 41541, 46927, 60752, 55214, 55823, 51726, 29165, 2535, -13689, -516, 14419, 31014, 25972, 33850, 49890]
7236D9890o283l234J985m680R496J847K46Q673K893j6671M265J3201O03J365j7052
7221D6544j6552J746K597O82K189K7K417l957j0362J822N938o1j2430N515K419
7206B8534P497l370P985N441l0057J177J868j2370J5772K1271r445j2687j146
7193B0470J0808J4000k742q277P922N449P603O441j5075k5251n635k205J93P874
7179B1575k159q38M980k104r882j9329J042J5745J2219L874M879J2505j0090k5657
7165F760M982K6105J5103l970o861k733K909J951o164j7513K9061N78n407j1610
7151C3191r363R552K890O062Q99j5310n734R081l748O360N416k174n377M571J1497
7136D7813p883r364o493n82L166l771q83m446K626N009M18O450r405q004q252
$$ y = [49890, 43607, 40373, 42358, 37678, 47174, 49021, 49267, 57940, 60833, 44162, 48427, 61628, 62231, 63596, 46544, 29992, 31738, 34335, 35017, 37206, 37233, 39650, 35693, 25331, 27153, 33091, 33030, 20600, 26115, 28534, 36031, 32661, 40646, 46087, 16030, 17207, 19075, 6705, 22477, 43748, 34303, 21616, 20470, 31278, 45278, 42536, 34259, 42181, 47630, 55233, 61674, 46599, 21348, 15713, 13508, 13701, 21575, 19416, 18578, 23558, 21454, 11572, -7757, -6715, 9030, 21249, 25123, 30002, 42507, 32417, 6760, 11742, 37847, 52950, 48980, 42119, 39386, 42295, 44246, 38082, 20569, 49630, 50208, 44801, 33191, 23828, 33380, 36270, 42332, 43231, 27921, 22187, 31268, 27520, 33880, 39296, 37122, 31745, 36316, 47813, 39930, 30566, 24073, 23491, 26657, 22886, 22003, 17557, 20183, 25192, 25610, 32060, 22655, 14651, 6399]
7121F399J1272J3938k859q512j1052N357L459M624j014J0218k896r001k2924P660
7107D669O371Q199J0345J4481J0449P269J78k3550j1845P077r061j0027N258O54
7093B0467k132m971O200J8911J834L451M525J250p443n219R409j0039L624l527
7079C6340M661j0568j0529L456p612p960m244O894J6470J869O989J995m232l640
7065B9889J85O450K841P382K75j3874j2906K832P978n736p100j4628j5144J4134
7051B578L328n506K654J015M681J5209J8816k1366j3495N602J6521J0439o687
7038C3789n607R712p061r187J567l918J0398K837k015N67N988m31j2473q117L194
7023A9243J077j1693K672M18Q061J496p256m913J3100k092m147J1661P033N92
$$ y = [6399, 17671, 31609, 28750, 20238, 9186, 14543, 18002, 22626, 21612, 31830, 28934, 19933, -2991, 4669, 11040, 19239, 29584, 44065, 54514, 61783, 61961, 38411, 26566, 33643, 24582, 14555, 19813, 20467, 18335, 13364, 19564, 38475, 40309, 43760, 48285, 49535, 42092, 36873, 46282, 36243, 39867, 36340, 41001, 30433, 19904, 23360, 15748, 7788, 3544, 10438, 26908, 28777, 35766, 37761, 33529, 29889, 30074, 36524, 39365, 46747, 47022, 33148, 20242, 23074, 31052, 25316, 18216, 3588, -11556, 2578, 5906, 400, 3054, 4069, 8750, 23959, 42775, 21409, 7914, 13516, 30037, 40476, 33789, 28182, 37894, 30833, 21646, 23213, 19295, 29693, 32530, 30515, 31082, 37070, 36639, 24166, 16049, 19243, 20320, 8627, 11299, 11717, 19778, 21274, 14018, 9105, 22205, 20113, 15966, 27627, 34660, 35252]
7009C5252k0296j5102L028O40K608m180K577P797m798O854M968l434J1976J1050
6995C8940j9510q525j960J548K114R085L166O173n305M811O518j0380j6926q729
6981A020R356K0497J4647j177n442R208j0691j3367n519j5388R536K119l594j1034
6967A71l262K002o245K582P549M945M25r30K915K645K5796p243j6137Q694j3824
6952A0083q173J3585J4808q913j6536m293j0582P166L288K0099k383j740p773
6939H636L140j255k281M36l403k39K367J6154j332j4173n438Q982O286j1767N66
6924F679J0538L397M921R263r825k0012o628J080R529O472n214l388l199J8924
6910B2537m990p314k711J4396O559j1960q395r718R652L501j240J1250j8951j5063
$$ y = [35252, 14956, -146, 2882, 3522, 6130, 1950, 4527, 12324, 7526, 14380, 19348, 15914, 27890, 38940, 19430, 10905, 8945, 10493, 12607, 21692, 24858, 31031, 25726, 30537, 37055, 26675, 9749, 1020, 10376, 30873, 45520, 44343, 38901, 48109, 37418, 24051, 18532, 3144, 12680, 14799, 11205, 171, -3091, -1089, -7334, -4752, 2797, 7742, 8167, 7237, 10152, 12797, 38593, 31350, 15213, 23907, 10083, 1910, 15495, 30303, 21390, 4854, 561, -10021, -2855, 433, 20532, 18149, 16409, 8636, 11776, 10521, 8240, 8676, 5273, 5034, 7401, 23555, 22223, 8050, 2612, 11594, 17880, 6113, 6679, 17217, 20614, 25535, 34798, 24973, 4961, -1667, -587, 8942, 15414, 10200, 6812, 3613, 22537, 17547, 10233, 7522, 21918, 28477, 16517, 8122, -1596, 8056, 11557, 10317, 21567, 2616, -12447]
6896a2447j2978n97p980m31K009Q702J5017J0437J243R8J1239m049j7571M090
6882c218K037M899j008p251j3222n217J2315N968J3903N249J4224j84k679m014
6868B1802J685q180m262R802p234n26P360o631j106k1548P358p186o932K0296
6854D698M686N714J0296P715Q212p087j8541k2616j1714J2135q242j676L820J1433
6840a167K1379l456m155J6033j794j0247R364R730n303k9604j3498J6320N853
6827I455J7426l726l406q375J0416J3798L782l842O08O401J045j3806p669n97
6813B1510m321J0744M657k067o950P4n711l737k8861Q79L661l671J6853J0093
6799A3153q727k829J3631P81m922j0754j456k780J1564j6647J115P625R391R605
$$ y = [-12447, -25425, -26022, -34002, -34433, -32424, -23722, -8705, 1732, 2975, 3073, 14312, 10263, -7308, -3218, -1181, 3718, 2710, -4541, -17763, -22980, -10665, -4697, 9206, 14455, 28679, 28495, 25816, 21802, 23487, 15307, 11045, 20847, 13613, 13087, 20447, 13816, 12710, -8838, -1480, -8666, -15598, 4698, 9384, 15098, 25394, 33109, 41321, 34234, 15693, -6923, -18637, -6502, -14744, -16420, -12600, -1167, 20212, 16756, 12601, 28634, 26840, 16593, 25957, 35687, 30384, 780, -12718, 3602, 9455, 26881, 23155, 19749, 11374, 21790, 35588, 39370, 35528, 36136, 42537, 43582, 29776, 22107, 21510, 17189, 27933, 32590, 30523, 23573, 23647, 17936, 14199, -14662, -13783, -10122, -13793, 3060, 13153, 4426, 1597, 15228, 16009, 11087, 333, -1123, -3903, 7661, -8986, -7871, -246, 9145, 18750]
6785A8750m244M294M784Q657R994K219l88J762j0501k2292j3372P520J5382J2713
6771C5278R607m345k3563n529J0980j0989j5511j6055R982J2360O327P542N671
6758B1755o867j1002J192n302R336K0983j2269k4260J253P830R461q339j955J4012
6744A5828L974k133p253R77P427L290J626p03M85m572n854J2213R947J365l251
6729C3366j6780l182o621M522J0652n881N728L992k611k317K416k384K567j8045
6715E422k3731J900J6381J9528Q957r138p689L60Q958j754j4566n497j3455K194
6701a2130K2149J5035J9737l919j0150j8177Q760J381K797J0959P866j6976k2524
6688D808O564J099n658O661o66L376p149P0m17p536J939O528J1619n640j7177
$$ y = [18750, 14506, 18800, 23584, 32241, 42235, 44454, 44066, 45828, 35327, 13035, -337, 7183, 22565, 35278, 44885, 40540, 16977, 11448, 22428, 11439, -4072, -20127, -10145, 2215, 8542, 16084, 21755, 14888, 3886, 5078, -224, 9112, 30095, 17826, -6434, -5181, 2649, 12110, 3771, 1816, 15828, 19802, 17669, 10416, 11393, 18820, 22110, 23736, 23033, 23518, 18946, 13092, 25305, 35252, 36617, 33366, 16586, 13404, 6783, 11305, 21957, 16076, 21804, 25796, 23185, 20868, 23284, 20900, 23467, 5422, -18309, -16409, -28, 19500, 28457, 19319, 11630, 11990, 20948, 19194, 4628, -869, -14324, -12130, 10019, 25054, 44791, 40872, 30722, 12545, 21305, 22686, 25483, 36442, 44308, 27332, 4808, 11372, 12471, 6813, 13474, 12808, 16184, 9035, 9105, 8688, 1152, 3091, 9619, 21238, 15598, -1579]
$$ [...]
##END NTUPLES=NMR SPECTRUM
##END=
