##TITLE=Analysis number 330441
Compound Code cc 68601
Book Reference 559/6
Project Code adrs
Chemist Name benw
##JCAMPDX= 6.0         $$ Bruker NMR JCAMP-DX V2.0
##DATA TYPE= NMR SPECTRUM
##DATA CLASS= NTUPLES
##ORIGIN= Bruker BioSpin GmbH
##OWNER= nmr
$$ XWIN-NMR		Version 3.5
$$ Mon Nov 26 11:31:40 2007 GMT Standard Time (UT+0h)  MAYBRIDGE\nmr@NMR_250MHZ
##.OBSERVE FREQUENCY= 250.131544655141
##.OBSERVE NUCLEUS= ^1H
##.ACQUISITION MODE= SIMULTANEOUS (DQD)
##.ACQUISITION SCHEME= undefined
##.AVERAGES= 16
##.DIGITISER RES= 18
##SPECTROMETER/DATA SYSTEM= dpx250
##.PULSE SEQUENCE= zg30
##.SOLVENT NAME= DMSO
##.SHIFT REFERENCE= (INTERNAL, DMSO, 0, 16.522)
##AUDIT TRAIL= $$ (NUMBER, WHEN, WHO, WHERE, WHAT)
$$ ##TITLE= Audit trail, XWIN-NMR		Version 3.5
$$ ##JCAMPDX= 5.01
$$ ##ORIGIN= Bruker BioSpin GmbH
$$ ##OWNER= nmr
$$ C:\u/data/dgb/nmr/ADRS/2240/pdata/1/auditp.txt
$$ ##AUDIT TRAIL=  $$ (NUMBER, WHEN, WHO, WHERE, WHAT)
(   1,<2007-11-26 11:30:01.40 +000>,<MAYBRIDGE\nmr>,<NMR_250MHZ>,
      <created by zg, POWCHK disabled, PULCHK disabled
       configuration hash MD5:
       76 6E 9A 78 1E 09 19 81 EC 84 63 8F B0 6A 59 2D
       data hash MD5: 64K
       F2 C2 57 4C D5 7F E3 E7 4D D0 D1 7B 82 3E DB 56>)
(   2,<2007-11-26 11:30:51.43 +000>,<MAYBRIDGE\nmr>,<NMR_250MHZ>,
      <Start of raw data processing
       ef LB = 0.3 FT_mod = 6 PKNL = 1 SI = 32K 
       data hash MD5: 32K
       78 DF 18 33 21 3E 22 7B 1A 01 28 49 BD 8A 1D CC>)
(   3,<2007-11-26 11:30:54.00 +000>,<MAYBRIDGE\nmr>,<NMR_250MHZ>,
      <apk 
       data hash MD5: 32K
       07 8F 02 E7 8D D7 3A 93 47 1E 4D EC A8 22 03 40>)
(   4,<2007-11-26 11:31:10.18 +000>,<MAYBRIDGE\nmr>,<NMR_250MHZ>,
      <abs ABSG = 5 
       data hash MD5: 32K
       44 A2 E7 E2 F3 55 54 9A 9C B8 02 DE 48 3A FA 36>)
$$ ##END=
$$ 
$$ hash MD5
$$ 32 D0 75 CD 0C B5 B1 30 8D B8 4C AD 81 20 1E F1
##$RELAX= 
##$RELAX= 
##$RELAX= 
##$RELAX= 
##$RELAX= 
##$RELAX= 
##$RELAX= 
$$ Bruker specific parameters
$$ --------------------------
##$DU= <C:\u>
##$EXPNO= 2240
##$NAME= <ADRS>
##$PROCNO= 1
##$TYPE= <nmr>
##$USER= <dgb>
##$AMP= (0..31)
100 100 100 100 100 100 100 100 100 100 100 100 100 100 100 100 100 100 
100 100 100 100 100 100 100 100 100 100 100 100 100 100 
##$AQSEQ= 0
##$AQ_mod= 3
##$AUNM= <au_zg>
##$AUTOPOS= <15 >
##$BF1= 250.13
##$BF2= 250.13
##$BF3= 250.13
##$BF4= 250.13
##$BF5= 500.13
##$BF6= 500.13
##$BF7= 500.13
##$BF8= 500.13
##$BYTORDA= 1
##$CFDGTYP= 0
##$CFRGTYP= 5
##$CHEMSTR= <none>
##$CNST= (0..31)
1 1 145 1 1 1 1 1 1 1 1 1 1 1 1 1 1 1 1 1 1 1 1 1 1 1 1 1 1 1 1 1 
##$CPDPRG= <>
##$CPDPRG1= <>
##$CPDPRG2= <>
##$CPDPRG3= <>
##$CPDPRG4= <mlev>
##$CPDPRG5= <mlev>
##$CPDPRG6= <mlev>
##$CPDPRG7= <mlev>
##$CPDPRG8= <mlev>
##$CPDPRGB= <>
##$CPDPRGT= <>
##$D= (0..31)
0 1 0 0 0 0 0 0 0 0.06 0 0 0 0 0 0 0.0002 0 0 0 0 0 0 0 0 0 0 0 0 0 0 
0 
##$DATE= 1196076599
##$DBL= (0..7)
120 120 120 120 120 120 120 120 
##$DBP= (0..7)
150 150 150 150 150 150 150 150 
##$DBP07= 0
##$DBPNAM0= <>
##$DBPNAM1= <>
$$ [...]
##$SUBNAM6= <"">
##$SUBNAM7= <"">
##$SUBNAM8= <"">
##$SUBNAM9= <"">
##$SW= 20.6930455092707
##$SWIBOX= (0..15)
0 0 3 0 0 0 0 0 0 0 0 0 0 0 0 0 
##$SW_h= 5175.983436853
##$TD= 65536
##$TD0= 1
##$TE= 295.16
##$TE2= 300
##$TE3= 300
##$TEG= 300
##$TL= (0..7)
0 120 120 120 120 120 120 120 
##$TP= (0..7)
150 150 150 150 150 150 150 150 
##$TP07= 0
##$TPNAME0= <>
##$TPNAME1= <>
##$TPNAME2= <>
##$TPNAME3= <>
##$TPNAME4= <>
##$TPNAME5= <>
##$TPNAME6= <>
##$TPNAME7= <>
##$TPOAL= (0..7)
0.5 0.5 0.5 0.5 0.5 0.5 0.5 0.5 
##$TPOFFS= (0..7)
0 0 0 0 0 0 0 0 
##$TUNHIN= 0
##$TUNHOUT= 0
##$TUNXOUT= 0
##$USERA1= <user>
##$USERA2= <user>
##$USERA3= <user>
##$USERA4= <user>
##$USERA5= <user>
##$V9= 5
##$VALIST= <valist>
##$VCLIST= <CCCCCCCCCCCCCCC>
##$VD= 0
##$VDLIST= <DDDDDDDDDDDDDDD>
##$VPLIST= <PPPPPPPPPPPPPPP>
##$VTLIST= <TTTTTTTTTTTTTTT>
##$WBST= 1024
##$WBSW= 4
##$XGAIN= (0..3)
0 0 0 0 
##$XL= 0
##$YL= 0
##$YMAX_a= 425717
##$YMIN_a= -465722
##$ZGOPTNS= <>
##$ZL1= 120
##$ZL2= 120
##$ZL3= 120
##$ZL4= 120
##$ABSF1= 16.522
##$ABSF2= -4.171173
##$ABSG= 5
##$ABSL= 3
##$ALPHA= 0
##$AQORDER= 0
##$ASSFAC= 0
##$ASSFACI= 0
##$ASSFACX= 0
##$ASSWID= 0
##$AUNMP= <proc_1d>
##$AZFE= 0.1
##$AZFW= 0.1
##$BCFW= 0
##$BC_mod= 0
##$BYTORDP= 0
##$COROFFS= 0
##$CY= 12.5
##$DATMOD= 1
##$DC= 0
##$DFILT= <>
##$DTYPP= 0
##$F1P= 14.0000005364418
##$F2P= -0.99999901652339
##$FCOR= 0.5
##$FTSIZE= 32768
##$FT_mod= 6
##$GAMMA= 0
##$GB= 0
##$INTBC= 1
##$INTSCL= 1
##$ISEN= 128
##$LB= 0.3
##$LEV0= 0
##$LPBIN= 0
##$MAXI= 10000
##$MC2= 0
##$MEAN= 0
##$ME_mod= 0
##$MI= 0
##$NCOEF= 0
##$NC_proc= -2
##$NLEV= 6
##$NOISF1= 0
##$NOISF2= 0
##$NSP= 0
##$NTH_PI= 0
##$NZP= 0
##$OFFSET= 16.522
##$PC= 1
##$PHC0= 156.9453
##$PHC1= 6.644519
##$PH_mod= 1
##$PKNL= yes
##$PPARMOD= 0
##$PSCAL= 4
##$PSIGN= 0
##$REVERSE= no
##$SF= 250.13
##$SI= 32768
##$SIGF1= 0
##$SIGF2= 0
##$SINO= 400
##$SIOLD= 32768
##$SREGLST= <1H.DMSO>
##$SSB= 0
##$STSI= 32768
##$STSR= 0
##$SW_p= 5175.98343685301
##$SYMM= 0
##$S_DEV= 0
##$TDeff= 65536
##$TDoff= 0
##$TI= <Analysis number 999999
Compound Code 99
Book Reference 9
Project Code 9>
##$TILT= no
##$TM1= 0
##$TM2= 0
##$TOPLEV= 0
##$USERP1= <user>
##$USERP2= <user>
##$USERP3= <user>
##$USERP4= <user>
##$USERP5= <user>
##$WDW= 1
##$XDIM= 32768
##$YMAX_p= 284109112
##$YMIN_p= -69886
$$ End of Bruker specific parameters
$$ ---------------------------------
##NTUPLES= NMR SPECTRUM
##VAR_NAME=  FREQUENCY,     SPECTRUM/REAL,   SPECTRUM/IMAG
##SYMBOL=    X,             R,               I
##VAR_TYPE=  INDEPENDENT,   DEPENDENT,       DEPENDENT
##VAR_FORM=  AFFN,          ASDF,            ASDF
##VAR_DIM=   32768,         32768,           32768
##UNITS=     HZ,            ARBITRARY UNITS, ARBITRARY UNITS
##FACTOR=    0.157963299565203, 1,           1
##FIRST=     4132.6476996994, 0,             0
##LAST=      -1043.33573715361, 0,           0
##MIN=       -1043.33573715361, -69886,      0
##MAX=       4132.6476996994, 284109112,     0
$$ Real data points
##PAGE= N=1
##DATA TABLE= (X++(R..R)), XYDATA
$$ [...]
18973I16156l773J9774L6785N1980O7326O6485O1623Q4288J08329J41156J57759
18962A707888J62053J84981K41208L10043L38615L62052L53549L66311M56787
18953D483487O14757Q34651J186891J686124K498579L902388O204142R374798
18945C0785817J1577211Q030571L26851o011598q456561q073850o962532n423676
18937A5792233l771176k529497j716256j199262q49568n95121l78012k77598k08914
18928D266829j45001r0665m5139L5605J23510J95668K45295K44325K68952L53514
18918E452893N25925P68231J103896J596643K428080L769892O007041R261350
18910C0913951J2079843R593451J663392n596847q913232q877030p727716o148992
$$ plain form
18973 916156 912383 932157 968942 1020922 1088248 1154733 1216356 1300644 1408973 1550129 1707888
18962 1707888 1869941 2054922 2296130 2606173 2944788 3306840 3660389 4026700 4483487
18953 4483487 5098244 5932895 7119786 8805910 11304489 15206877 21411019 30785817
18945 30785817 42363028 50393599 50720450 44708852 36252291 28178441 21215909 15792233
18937 15792233 12021057 9491560 7775304 6576042 5726474 5131353 4753341 4475743 4266829
18928 4266829 4121828 4031163 3986024 4021629 4145139 4340807 4586102 4830427 5099379 5452893
18918 5452893 5978818 6747049 7850945 9447588 11875668 15645560 21652601 30913951
18910 30913951 42993794 52587245 54250637 48653790 39740558 30863528 23135812 16986820
18902A6986820m353705k925460k007595j413122j051411p68378n57699m38758
18894C470692l81221l55078k98854k54146k44395k23991j72665j29500j18229
18885A292613j05407q5315q5412q1774n8921m7692l2488l2923k7817J1741L1187
18874G77792l359l5421o9376m1976n9293o2990m4370k3979k3134l9175l8458j6048
18862C20213J457n440k8464k1210j5965j4016K1811j5539j5667K576q681j2138
18850B08937r173J3586K220p027q946j3943n889j1263k3036R64Q632J1338j5925
18837A50475p502k3723N180J5253o424n716K376j1752j6433k1121k450j4276l82
18824F3505J2005J0806J7002N606o639K0018M4886k168k2278k1197j4996j1767
$$ plain form
18902 16986820 12633115 9707655 7700060 6286938 5235527 4467149 3909450 3470692
18894 3470692 3089471 2734393 2435539 2181393 1936998 1713007 1540342 1410842 1292613
18885 1292613 1187206 1101891 1016479 934705 875784 828092 795604 762681 734864 746605 777792
18874 777792 774433 739012 669636 627660 568367 505377 461007 437028 413894 374719 336261 320213
18862 320213 321670 316230 287766 266556 250591 236575 258386 242847 227180 229756 221075 208937
18850 208937 199764 213350 215570 208543 199597 185654 179765 168502 145466 146430 155062 166400 150475
18837 150475 142973 119250 124430 139683 133259 127543 129919 118167 101734 80613 78163 63887 63505
18824 63505 75510 86316 103318 108924 102285 122303 167189 165021 142743 121546 106550 94783
18812I4783j3972j3610R565K2135q189j6298j0729j9566o150J1463P396R308J0882
18799G7018l786j7894j1580Q865M790j5872L776M923l208J187K1401Q323o737
18786G1206L261q798n36K8993J6953j3087j8002Q562q971k0275p070L690o64K794
18772E8056K966j6484j7963m09J5966O764J1704p741o62J9007L708r568p203j2272
18758D5869J5628j2816k4610k187K2338J7046J639O032K177o221k1016l751k495
18745C7633O644K319m177k0485j839P152m897j2251Q841J1011k2919K099J0390
18732A9521r907j984j2604O928P827J2836O454j896j5085L21l791j5994j0684
18719a8058P126J559J1321K0381K206L989J536l494k727j4241R279R945M118j4811
$$ plain form
18812 94783 80811 67201 76766 98901 90712 74414 63685 44119 37969 49432 56828 66136 77018
18799 77018 73232 55338 43758 52623 57413 41541 45317 50240 47032 48219 69620 77943 71206
18786 71206 74467 65669 65133 94126 111079 97992 79990 88552 79581 59306 52236 55926 55262 58056
18772 58056 61022 44538 26575 26166 42132 48896 60600 52859 52197 71204 74912 65344 58141 45869
18758 45869 61497 48681 24071 21884 44222 61268 62907 68939 71116 64895 43879 40128 37633
18745 37633 44277 46596 42419 21934 20095 27247 22350 10099 18940 29951 7032 9131 19521
18732 19521 9614 7630 -4974 1954 9781 22617 29071 27175 12090 12411 8620 -7374 -18058
18719 -18058 -10932 -9373 1948 22329 24535 28524 30060 26566 23839 9598 18877 28822 32940 18129
18705A8129j7695n356J7508J8959k360j3141J68j586O202q976J0411J5393O762
18692D4418o369J0760M920m29j5113j2710l356J1364J3618n839r343k3638M688
18679A2971J0920m010l966J2277J2656J185j0106j2959j4639j7966J6261J6387
18667A9011J9461N154j7885N49r947J54j6019p487J1289J6896q981K193K1929
18654C6317J013n478r786k0229J1161O761J3941n49k7388j0400J12j3005j5762
18641c3292J0165J8964k342K857J4648J8067j5372j6697j3044J9550J7451r514
18629A1441j5329p049n008L623o700O971J1839J7363J4608Q65m955L638K736k810
18615C1233J1238O137l280j8111N29n395j0737q469N709J0364J70M363j7149k3082
$$ plain form
18705 18129 434 -4922 12586 31545 29185 16044 16212 14626 20828 11852 22263 37656 44418
18692 44418 38049 48809 53729 53300 38187 25477 22121 33485 47103 41264 31921 8283 12971
18679 12971 23891 19881 15915 28192 40848 42033 31927 18968 4329 -13637 2624 19011
18667 19011 38472 43626 25741 26290 16343 16497 478 -7009 4280 21176 12195 14388 36317
18654 36317 37330 31852 22066 1837 12998 19759 33700 33151 5763 -4637 -4525 -17530 -33292
18641 -33292 -23127 -4163 -6505 -3648 11000 29067 13695 -3002 -16046 3504 20955 11441
18629 11441 -3888 -10937 -15945 -12322 -19022 -12051 -212 17151 31759 32624 27669 31307 34043 31233
18615 31233 42471 48608 45328 27217 27746 22351 11614 3145 8854 19218 19388 23751 6602 -16480
18601a6480j0399R131J8581J3270j9702o592j122m917m316n768J5434L975J1356
18588B451J9151m279k265j0848n596p901N703J3418j1191n826K2976L64k0655
18575d498j4793l972k646K4402K4260J2282r535m936J0026p125j8439o505K680
18562A201q922o357J082J1247J9683l296j3875j5270J579P215K174j798J033J1767
18548G463j4470K979Q500r693K863N963l568m374k180R008J5971r667l1422Q68
18534b1759J8537j2739m464Q345L642P270L398J6808q429j0350K005r23r075J1272
18520C538N745j3354m329m959O106M710P43n792J7187R052n392o883o915n228
18506e771J8648j0152j622k450L75K02L440K494r707j8661J6210M582j067j0620
$$ plain form
18601 -16480 -26879 -17748 833 14103 -5599 -12191 -13313 -18230 -22546 -28314 -12880 -8905 2451
18588 2451 21602 17323 15058 4210 -1386 -9287 -3584 9834 -1357 -7183 15793 16157 -4498
18575 -4498 -19291 -23263 -25909 -1507 22753 35035 25500 20564 30590 23465 5026 -1479 1201
18562 1201 -7721 -14078 -12996 -1749 17934 14638 763 -14507 -12928 -5713 -3539 -5337 -4304 7463
18548 7463 -7007 -4028 4472 -5221 -2358 3605 37 -4337 -6517 2491 18462 8795 -22627 -21759
18534 -21759 -3222 -15961 -20425 -12080 -8438 -1168 2230 19038 10609 259 2264 1341 -7734 3538
18520 3538 9283 -4071 -8400 -13359 -7253 -2543 -1800 -7592 9595 18647 13255 6372 -543 -5771
18506 -5771 12877 2725 1103 -1347 -972 -770 2670 5164 -4543 -23204 -6994 -2412 -3479 -14099
18492a4099M314J3637k1437j1194m815N341m623O33K8628K0503l408l345R951
18479B0086l401N054P372j2138j1572j2236Q574J0343O784J671q150j0349j571
18466D67j211K0200M863j1915k2729l381O200R411O903J265J4451K49j8617J489
18452G645Q99j956p340m28r184J0111J0339m13K719m954L328k62o440P513m017
18437G560n598J0439M479K575K507k80P296q363n123k89J1487R912M814N034j495
18422D4955J9290L1077J4088L4245J5027K3587K7870L0946j1714k4949l2281k4361
18410A47780j8782j7745k2285r920j0739j9557M22m689o39J348J5148L27o133
18397E4536n830q90N365n445j2543Q796q551j1894k582P947K9304J8029J4508
$$ plain form
18492 -14099 -9785 3852 -17585 -28779 -33594 -28253 -32876 -32243 -3615 16888 13480 10135 20086
18479 20086 16685 21739 29111 16973 5401 -6835 1739 12082 18866 20537 12387 2038 467
18466 467 -744 19456 24319 12404 -10325 -13706 -7506 1905 8808 10073 24524 24773 6156 7645
18452 7645 8544 6588 -752 -1180 -10364 -253 10086 9673 12392 7438 10766 10504 4064 11577 7560
18437 7560 1962 12401 16880 19455 21962 21682 28978 20615 15492 15203 26690 36602 41416 46450 44955
18422 44955 64245 95322 109410 143655 158682 182269 210139 241085 229371 204422 172141 147780
18410 147780 128998 111253 88968 79048 68309 48752 49174 44485 43846 45194 60342 60669 54536
18397 54536 48706 47816 53181 47736 35193 43989 35438 23544 20962 28909 58213 76242 90750
18384I0750J3103K3032J8148L1114L0596J1456j3406j9848k8200k5401l0995l1610
18372F8739j0113l685K432p153r253n808n438l816j1074K352n38j260J5657J3
18358C1055M269j5155l070P15J7730Q220j2340r800K68J1375J3332J1749J2035
18345G0383J5435N0364N6207L5643P030j1657l0337l1577j5147k8647k6821q840
18333H2036j1258p006m916n490k3648J1872o480J756K2103m35j7271r844M100
18320C5519O662j0702K560P384K121N832l763J3317J6924J4872L7408L8884L4421
18307B01439M6174N1344p375m6150o5444k8996l9560m4970o344R189j063k9024
18295C9220k7198j7253R689K3912J3132N32J480j9131j6475M819K0369P851k993
$$ plain form
18384 90750 103853 126885 145033 176147 206743 218199 204793 184945 156745 131344 100349 68739
18372 68739 58626 54941 57373 50220 40967 35159 29721 25905 14831 17183 16645 15385 31042 31055
18358 31055 35324 20169 17099 17814 35544 43764 31424 21624 21892 33267 46599 58348 70383
18345 70383 85818 136182 192389 228032 235062 223405 193068 161491 146344 117697 90876 82036
18333 82036 70778 63772 58856 53366 29718 41590 35110 36866 58969 58534 41263 31419 35519
18320 35519 42181 31479 34039 41423 43544 49376 45613 58930 75854 90726 128134 167018 201439
18307 201439 247613 298957 291582 245432 179988 150992 111432 66462 60118 69307 68244 39220
18295 39220 12022 -5231 4458 28370 41502 42034 43514 24383 7908 12727 33096 40947 37954
18282C7954r611j8795k810J5220J804R471q105k650m038k779l172r982n69n226
18268c288j8303P60J0996R273q600m032j8875J2368R184j0009N419J8271J738
18255D902M757J820k74k238r032r793n26O584K5879K1084p10j0934N826K218l785
18240C5778q254j8928R168P177O259R522j7734r240j29n695j807j420O305J4386
18226B5388j4259M909N068L707M485j6393n268r299m403n96Q283J2734O000J0937
18212C1293j0155r229j0151n812L2250K3566Q303l480p172k3116l3770k528J4592
18199D591J0201J1055r152o332Q792J808J095q901r544L191J0410j1914l85Q67
18185E782j443J0158J7831K84r789j5104j5613r842J82j871J3097K7852K1789
$$ plain form
18282 37954 28343 9548 6738 21958 23762 33233 25128 22478 18440 15661 12489 2507 1938 -3288
18268 -3288 -21591 -20831 -9835 -562 -9162 -13194 -32069 -19701 -10517 -20526 -15107 3164 4902
18255 4902 9659 11479 11205 8967 -65 -9858 -10384 -3800 22079 43163 42453 31519 37345 39563 35778
18240 35778 27524 8596 17764 24941 31200 40722 22988 13748 13619 7924 6117 4697 11002 25388
18226 25388 11129 16038 21106 24813 29298 12905 7637 -1662 -6065 -6661 1622 14356 20356 31293
18212 31293 21138 11909 1758 -4054 28196 51762 60065 56585 49413 26297 -7473 -10001 4591
18199 4591 14792 25847 16695 10363 19155 20963 22058 13157 3613 6804 17214 5300 4915 5782
18185 5782 4339 14497 32328 32612 22823 7719 -7894 -17736 -17554 -19425 -6328 21524 43313
18172D3313j7317m782O524o409j4219K059J7334J0625j0928j2081O562J2738k620
18159C0799N759L845O85r4N518J4429j544l0125Q060J1784n097j3388j273j0621
18145A8737j2690o217J3935N914p329J1491J7910J4492J2622j7564j5220p324
18133B8757K062J8221Q933P874k94j0264k2149k1758j9118l703K0630J0959r136
18120A1014n740l107P993M588J816j1184P47N342L738J9003N258k26k6953n687
18106F602K2429J2006J4335P875j3665j489j7850l98J1432P470j7231k1741J0871
18093B0646J5137Q359r217j0778R031N545j5385j1435J4084J178j3397o769K0329
18080B7328p80J511J458o500q540k4320j2328k648J3251L4638J8957Q205n403
$$ plain form
18172 43313 25996 21214 27738 21329 7110 9169 26503 37128 26200 14119 20681 33419 30799
18159 30799 36558 40403 41088 40994 46512 60941 59397 29272 37332 49116 44019 30631 29358 18737
18145 18737 6047 -170 13765 19679 12350 23841 41751 56243 68865 51301 36081 28757
18133 28757 30819 49040 57973 65847 65553 55289 33140 11382 -7736 -11439 9191 20150 11014
18120 11014 5274 2167 10160 14748 16564 5380 6127 11469 15207 34210 39468 39242 12289 6602
18106 6602 29031 41037 55372 63247 49582 48093 30243 29845 41277 48747 31516 9775 20646
18093 20646 35783 44142 34925 24147 33178 38723 23338 11903 25987 27165 13768 6999 27328
18080 27328 26548 28059 29517 23017 14477 -9843 -22171 -24819 -11568 23070 42027 50232 44829
18067D4829j448J39j4773N031m634P229J1179j2008L000j4261j9259P696J5974
18054B8694l611J9061K3651L687j2203j2117P845J3410J654j7251Q755J5602K121
18041G9298r708J1830j5589j7068M013p57M83P733J7899o343k4554k288L815j554
18027D7210j3942r951q769j673j702J6800R962Q94j1030L897J3678K1888N407
18014G2669o468j1849J4733r86J220J5880l236j4096j4272o585j2944J0257J5084
18001E9407L8008J327k2035Q628J7556Q286J881j5235J8637r717j6818J9518J3781
17988A23224M166l711R27n119Q106l594M244J0237O781j2361j8670J6654q601
17975A22283j965N226j616j1639l676j1651j4247j0965J1615L0169Q374J4038
$$ plain form
18067 44829 43381 43520 28747 33778 29144 36373 47552 35544 38544 24283 5024 12720 28694
18054 28694 25083 44144 67795 71482 59279 47162 55007 68417 70071 52820 61575 77177 79298
18041 79298 69590 81420 65831 48763 52776 52019 52502 60235 78134 71791 47237 44949 48764 47210
18027 47210 33268 23317 14548 12875 11173 27973 37935 38829 27799 31696 45374 67262 72669
18014 72669 66201 54352 69085 68099 69319 85199 81963 67867 53595 47010 34066 44323 59407
18001 59407 97415 98742 76707 85335 102891 111177 113058 97823 116460 106743 89925 109443 123224
17988 123224 127390 123679 124606 119487 127593 123999 128243 138480 145261 132900 114230 130884 122283
17975 122283 120318 125544 123928 112289 108613 96962 82715 71750 83365 113534 121908 135946
17963A35946J5767O450m422o250N058r83J6303Q701l516J0907P788M564l187R320
17949B02446J1826P132N753J8249N726r949K308K1454J6630K1052N056M155N597
17936C17435j3959j1186M528K473J5884N462J7813K7986K3393R467J7215J0571
17924D27082J8618R614J1628K1742L9105K5027K2033J4473J7604J9215L5962M0708
17912G02811K8766L1066L5647L5813N1734N0946M2652N0888P6748Q3698P9953
17901A270722J14951J43469J46559J44530J21049R7674J46270J69260K02491K48484
17891B805459K79901L27949L70020M40962N41485P12618R41613J289348J820903
17882I530258K658746M044573O275205R316007J1596118Q865920J497260n210693
$$ plain form
17963 135946 151713 158163 153741 147491 152549 151566 167869 176570 173054 183961 191749 196313 193126 202446
17949 202446 214272 221404 227157 245406 251132 241183 243491 264945 281575 302627 307683 311838 317435
17936 317435 303476 292290 296818 299291 315175 320637 338450 366436 389829 399296 416511 427082
17924 427082 445700 455314 466942 488684 527789 552816 574849 589322 606926 626141 662103 702811
17912 702811 731577 762643 798290 834103 885837 936783 979435 1030323 1107071 1190769 1270722
17901 1270722 1385673 1529142 1675701 1820231 1941280 2038954 2185224 2354484 2556975 2805459
17891 2805459 3085360 3413309 3783329 4224291 4765776 5478394 6420007 7709355 9530258
17882 9530258 12189004 16233577 22508782 31824789 43420907 52286827 53784087 48573394
17874D8573394q301545q449499p539989o084489m358440k926596k006172j444718
17866G461946j044234p46677n24519l77835k92772j85261q2559l3593M4671J20609
17856D339776J70170J46391J37232K09960L16813M79936P09274J020752J490324
17847I020628K205095L360559N258900P960458J0526799R423470L010860l844768
17839D6922001p588861q181411p391422o122962m493552l065328k092916j496615
17831F488934j122158q66137o81927n28730l92896l01312k27716j78150j49502
17822B040406j21731q8729j07964j41973j39128j61570j34979j03695r3928r5270
17812H51439p3929n8163m9122n2318m4443l6041l6206l5431l1993k4427L39p620
$$ plain form
17874 48573394 40271849 31822350 24282361 18197872 13839432 10912836 8906664 7461946
17866 7461946 6417712 5671035 5146516 4768681 4475909 4290648 4208089 4174496 4219167 4339776
17856 4339776 4509946 4656337 4793569 5003529 5320342 5800278 6509552 7530304 9020628
17847 9020628 11225723 14586282 19845182 27805640 38332439 47755909 50766769 46922001
17839 46922001 39333140 31151729 23760307 17637345 13143793 10078465 7985549 6488934
17831 6488934 5366776 4500639 3818712 3289982 2897086 2595774 2368058 2189908 2040406
17822 2040406 1918675 1829946 1721982 1580009 1440881 1279311 1144332 1040637 946709 851439
17812 851439 777510 719347 670225 617907 573464 537423 501217 465786 433793 409366 409705 402085
17800D02085k3841j9822m784j4730k4814j1570p71j0192j3960k1533N941O857
17788B68866j841j091r654o597k5056n679m659j2951j4988n873j2512j1152m10
17775A56403L02j3597M988N397L270r28q173k1180k003O935j2503K648J1292O584
17761A39435r845j062r516j3173J953K16k058r427P293L3129J9163J9643m541
17748A71210p667j8349j8791j3504k5574q768Q094n620j1668J0008j527r187L573
17735G2230O832p036q81M828j120p109Q614j1060j2175N434J988r822j211J5134
17721F4646j077l348O935J3385N966K2025P276j978l0196l6987k338j3388o659
17708B4262m521J5335Q867J75J033K47j0637j1515P865M545l2910K399J0280M712
$$ plain form
17800 402085 378244 358422 353638 338908 314094 302524 301753 291561 277601 256068 262009 268866
17788 268866 267025 265934 256280 249683 224627 218948 214289 201338 186350 180477 167965 156813 156403
17775 156403 156705 143108 148096 153493 156763 155835 147662 126482 124479 131414 118911 121559 132851 139435
17761 139435 129590 128528 119012 105839 107792 108008 105950 96523 103816 136945 156108 175751 171210
17748 171210 163543 145194 126403 112899 87325 78557 86651 81031 69363 79371 77844 68657 72230
17735 72230 79062 72026 71145 75973 74853 67744 76358 65298 53123 58557 60545 50723 49512 64646
17721 64646 63569 60221 67156 80541 86507 108532 115808 113830 83634 46647 44309 30921 24262
17708 24262 19741 35076 43943 44118 45151 45398 34761 23246 31111 35656 2746 5145 15425 20137
17694B0137J7541J1028L633j6872r622J546O654r14r46l274J088j707m272K7420
17680E1440K1585p699k3365M141n121r959l425R385M516J4236l745j4394m583
17667C3012q075m782r743J177M657o412M176J75j40M38j4997R197J2772p815j3154
17652D86P585M705L033J0229J314p333P760R244j2279l818l767j8388j2430J922
17638a1737J3889p081q928L231M339K799r971j760J845O276j328K172P727M660
17624F133J6731J3506j1282k3163p092J76L476o270o417J1088J1427l421L829
17611H721K861P23n865q830q445L704K4597L6644n038k6124j7157J5146P43k6419
17597d739J1926J7675j739j1792k1701l294Q223m143J925K592P25K612J430L252
$$ plain form
17694 20137 37678 48706 52339 35467 25845 27391 34045 33131 32185 28911 29999 28292 24020 51440
17680 51440 73025 65326 41961 46102 40981 31022 27597 36982 41498 55734 51989 37595 33012
17667 33012 24937 20155 10412 11589 16246 9834 14010 14185 14045 14483 -514 8683 21455 13640 486
17652 486 8071 12776 15809 26038 27352 20019 27779 37023 24744 20926 17159 -1229 -13659 -11737
17638 -11737 2152 -4929 -13857 -10626 -6287 -3488 -13459 -15219 -13374 -7098 -8426 -6254 1473 6133
17624 6133 22864 36370 25088 1925 -5167 -4991 -1515 -7785 -14202 -3114 8313 4892 8721
17611 8721 11582 12305 6440 -2390 -10835 -7131 17466 54110 49072 22948 5791 20937 21680 -4739
17597 -4739 7187 24862 23123 11331 -10370 -13664 -5441 -9584 -7659 -5067 -4342 -1730 -300 2952
17583B952O207k09O160Q044j820m816M630O168k3971n688J0497q112j3438q574
17569b1970P695J7275n531K298k541n202o303j1475o335J772K2672n420p699J0136
17555a0628J2451m523j3138L800R894L56L44r851j554Q29j369k1168J3646n131
17541b6042J8427J3891P267p730k7942q675R919R149o208j3986o421R915m668
17528c3104J2216N051M400o946P600J7882K105J802o455J140j737l289K60k854
17514a929n427K1152l406j1566J516M870r111j2138l431j354r124L023J3371m886
17500a8440r220L717J0419N629Q844R937m575j5895K838R123N994J027k0665j7354
17486b8621q643M038Q946J1732R613M221o986l84q323n515p78J7613q799k1348
$$ plain form
17583 2952 9159 8950 15110 23154 21334 16518 21148 27316 3345 -2343 8154 42 -13396 -21970
17569 -21970 -14275 3000 -2531 -233 -2774 -7976 -14279 -25754 -32089 -30317 -7645 -13065 -20764 -10628
17555 -10628 1823 -2700 -15838 -12038 -2144 -1788 -1444 -11295 -12849 -12020 -13389 -34557 -20911 -26042
17541 -26042 -7615 6276 13543 5813 -22129 -30804 -20885 -11736 -17944 -31930 -38351 -28436 -33104
17528 -33104 -20888 -15837 -11437 -18383 -10783 7099 9204 11006 4551 5691 3954 665 925 -1929
17514 -1929 -7356 13796 10390 -1176 340 5210 -3901 -16039 -19470 -20824 -29948 -26925 -13554 -18440
17500 -18440 -27660 -23943 -13524 -7895 949 10886 6311 -9584 -6746 2377 8371 9398 -11267 -28621
17486 -28621 -37264 -33226 -24280 -12548 -2935 1286 -5700 -6084 -14407 -19922 -20700 -3087 -11886 -33234
17472c3234M810N202o309l983J5606J645Q069J2773J7j2216J3505J1800j2417
17459E268j8774o39N193O800J1451Q065Q76j760P727L152q193j3496M106N894
17445A5670j2298K214J1994j1345r607k163K80K475n4K451j5294j5041j4829k535
17431d8082r208L361J3680K6863J8651j1250j9495j4640o349J3076J4378n593
17419b4608N357N653m065m147o37q68J5045J3399j5054k0528L367k27K129j3266
17405c8450P983J9536J7654N12r83r138j7938J0819l096k7867R110P587O340n92
17391a8523N350n176j215J914j9108m433O737J5274J0995p522J1944Q873q043
17378b933p36J8622j735j0475m379k003R661n935l728J3915R622j5261R440j0474
$$ plain form
17472 -33234 -28424 -23222 -29531 -33514 -17908 -16263 -8194 4579 4596 -7620 5885 17685 5268
17459 5268 -13506 -14145 -8952 -2152 9299 17364 18240 16480 24207 27359 19166 5670 9776 15670
17445 15670 3372 5586 17580 6235 -3372 -5535 -5255 -2780 -2834 -383 -15677 -30718 -45547 -48082
17431 -48082 -57290 -53929 -40249 -13386 5265 -5985 -25480 -40120 -46469 -33393 -19015 -24608
17419 -24608 -19251 -13598 -17663 -21810 -22447 -23315 -8270 5129 -9925 -30453 -27086 -27313 -25184 -38450
17405 -38450 -30467 -10931 6723 7235 6252 -2886 -20824 -10005 -13101 -40968 -31858 -24271 -17931 -18523
17391 -18523 -13173 -18349 -19564 -17650 -36758 -41191 -34454 -19180 -8185 -15707 -3763 5110 -2933
17378 -2933 -3669 14953 13218 2743 -1636 -3639 6022 87 -3641 10274 19896 4635 14075 3601
17364C601r294j166K568o117Q098Q882k363J1244n05n228o094j282L043o982j27
17349a722R380J0158P949j2949p197J757l0R095o122L275R110K2475J0579L3589
17335H9347K693K3042M8867L3643J9879l405k7458k9398l3561l2767m2387l3365
17323A5130j3853o718M599m675L074J5635N909J802M204R244k325q92M656q89
17309C4901k884k5213Q476K0867R246k123r301Q055K5204K7851L8933N0846K9259
17296B14117p105k3545q127j3918m2575m0384k5160p344j0785R985r731j0023
17284B5405p232j1276j7783R525J0162m154k311l227N994L581N485l187j717K426
17270A1691L82L508k0962j245J1404p372j2625k286L436J3983K2872p325l1017
$$ plain form
17364 3601 -5693 -6859 -4291 -10408 -2310 6572 4209 15453 14948 9720 3626 2344 5387 -1595 -1722
17349 -1722 7658 17816 25765 12816 5619 7376 7346 16441 10319 13594 22704 45179 55758 89347
17335 89347 92040 115082 163949 197592 217471 214066 186608 157210 123649 90882 48495 15130
17323 15130 1277 -5441 -842 -5517 -2443 13192 19101 20903 25107 34351 32026 31134 35790 34901
17309 34901 32017 6804 15280 36147 45393 43270 33969 42024 67228 95079 134012 184858 214117
17296 214117 207012 183467 175340 161422 118847 78463 53303 45959 35174 45159 35428 25405
17284 25405 18173 6897 -10886 -1361 8801 4647 2336 -891 5103 8684 14169 10982 9265 11691
17270 11691 12073 15581 -5381 -6626 4778 -2594 -15219 -17505 -14069 -86 22786 15461 -15556
17257a5556L512N255n239J61m647r917R704J9826j9600p701O434J834M862j328
17243a2400j2359j1540Q551R499j1891K09J3262K501p888M374J4205j5443j0331
17230b9251M332k670O388M886R071J3048j1285j1929n041j378J211n917M299J6539
17216g697O303J5357J638r891k0700n380j5127R118P325K575M092N867J2033j2519
17202g006m736m739J2576l439q396j282J0961J2856J825o418n118n463j295n72
17188a0246P007J260p866M068j441p412n045J0964J1085J62l237J6501J1691q88
17174B6603r790o102k6234P66J2102N706J1015Nk6799j6986J3004M854k550j2631
17160b7037J1223R368j2921j896m187m204Q176K452j3671l582L1840J9119o621
$$ plain form
17257 -15556 -12044 -6789 -12028 -11867 -16514 -26431 -16727 3099 -16501 -24202 -17768 -15934 -11072 -12400
17243 -12400 -24759 -36299 -27748 -18249 -30140 -29931 -16669 -14168 -22056 -17682 -3477 -18920 -29251
17230 -29251 -24919 -27589 -21201 -16315 -7244 5804 -5481 -17410 -22451 -23829 -22618 -28535 -24236 -7697
17216 -7697 -1394 13963 15601 5710 -14990 -20370 -35497 -26379 -19054 -16479 -12387 -6520 5513 -7006
17202 -7006 -11742 -16481 -3905 -7344 -15740 -17022 -6061 6795 8620 2202 -2916 -8379 -9674 -10246
17188 -10246 -3239 -1979 -9845 -5777 -7218 -14630 -19675 -8711 2374 2536 -701 15800 27491 26603
17174 26603 16813 10711 -15523 -14757 -2655 3051 14066 14071 -12728 -29714 -16710 -11856 -14406 -27037
17160 -27037 -15814 -6446 -19367 -21263 -25450 -29654 -21478 -19026 -32697 -36279 -4439 14680 8059
17147H059M21p796m175J3588j4019J289l72j6684q993M29K5344P607J5481R131
17133B9310q498l1201M352L070j571r700M98j6852j6407R807K0401J0645J3329
17120G183J1757j3358o599J8800k1570l790j1384j017n169k954R131j909M28n394
17106b5845k20J3605J157p815l78J3792P211j1952R414r294q09L634j5133p957
17092c0590J5543P178M805N448p262j213j0287J258J4468r28M320j1214j5744
17079b4218n588K4389J1021j3346o23n302R472m625L625M172k234j5907n641N271
17065a9534O281J0945M055J786n53k2857j5919J1744J6102q21j317j320l428M867
17051i969k697l364k78j2363J2036P165J7261K8583l600k216k1865j2974q52J322
$$ plain form
17147 8059 8480 684 -3491 10097 -3922 -2633 -3005 -19689 -28682 -28253 -2909 4698 20179 29310
17133 29310 20812 -10389 -6037 -2967 -4538 -14238 -13740 -30592 -46999 -37192 -16791 -6146 7183
17120 7183 18940 5582 -1017 17783 -3787 -7577 -18961 -19978 -25147 -28101 -18970 -20879 -20451 -25845
17106 -25845 -26065 -12460 -11303 -19118 -19496 -5704 1507 -10445 -1031 -10325 -11134 -7500 -22633 -30590
17092 -30590 -15047 -7869 -3064 2384 -4878 -6091 -16378 -15120 -652 -1580 2740 -8474 -24218
17079 -24218 -29806 -5417 5604 -7742 -8365 -13667 -4195 -8820 -5195 -1023 -3257 -19164 -24805 -19534
17065 -19534 -13253 -2308 1747 3533 2980 -19877 -35796 -24052 -7950 -8771 -10088 -11408 -14836 -9969
17051 -9969 -12666 -16030 -16308 -28671 -16635 -9470 7791 36374 32774 30558 8693 -4281 -5133 -3811
17037c811m730r38K0144J1742R08j2418n303q952j4382p830j418K230J7240j0840
17023a8358q233N665l289M105J5279J0790P138k35o709n782r113j1865j3959L689
17009c0877J3838M858l195j9385O149J1541L477Q400j649J4738k175q376j7819
16996b0475q862J4258M539n601j1721n461J775J276O241P631P35Q785l916m460
16982a5256l26J9366k651r536O396j4043j4919N637J1376R450q953K3956J0490
16969B0987j3481q49n946j0200l999l861L657O674l403m292J2969K349M053j2680
16955h022q206O332J719M501n018q352J3538K986j3348K896p885J9751j559k1150
16941b1817R98P954L455R073k590j0427L849J624n011L338q464N204O812K112
$$ plain form
17037 -3811 -8541 -9479 10665 22407 23315 10897 5594 -3358 -17740 -25570 -26988 -24758 -7518 -18358
17023 -18358 -26591 -20926 -24215 -20110 -4831 5959 13097 12862 6153 371 -8742 -20607 -34566 -30877
17009 -30877 -17039 -12181 -15376 -34761 -28612 -17071 -13594 -5194 -6843 7895 5720 -2656 -20475
16996 -20475 -29337 -15079 -10540 -16141 -27862 -33323 -31548 -30272 -24031 -16400 -15665 -6880 -10796 -15256
16982 -15256 -15582 3784 1133 -8403 -2007 -16050 -30969 -25332 -13956 -4506 -13459 10497 20987
16969 20987 7506 6657 711 -9489 -13488 -17349 -13692 -7018 -10421 -14713 -1744 605 4658 -8022
16955 -8022 -16228 -9896 -8177 -3676 -8694 -17046 -3508 -522 -13870 -10974 -18859 892 -667 -21817
16941 -21817 -20819 -12865 -9410 -337 -2927 -13354 -9505 -7881 -12892 -9554 -18018 -12814 -6002 -3890
16927c890j4831k003O529J4149O40J670k423j3053k1831R491J2624m245n195q102
16913c0470J1332M116J4659k691j5797k810R061j0982p023R437J9228J1138k945
16900F253n678j2085R663N884j124R615q74p594r646j5547l557L769P775k416
16886a5562m810K0036Q45j6636j0944J3287R267P01J353j0689O994J3056J3238
16873B0136J990n210j0656l3784j065K3910J9620J8095J62k3403k1530n179m56
16860a7370K0788L931p542M248l043j6993j1952J2678P772j868j452n206j64j473
16846a7646n078r479m333O8m795N405J1287Q407J6102L727q859k8334J0048P11
16832b2769j980R72R043N480j8044j8074j867J178J8099L0905L741K852J7535
$$ plain form
16927 -3890 -18721 -20724 -14195 -46 594 2264 -159 -13212 -35043 -25552 -12928 -17173 -22368 -30470
16913 -30470 -19138 -15022 -363 -3054 -18851 -21661 -12600 -23582 -30605 -21168 -1940 9198 6253
16900 6253 575 -11510 -1847 4037 2913 12528 11654 4060 -5586 -21133 -24690 -20921 -13146 -15562
16886 -15562 -20372 -336 509 -16127 -27071 -13784 -4517 -3816 -2463 -13152 -6158 6898 20136
16873 20136 22126 16916 6260 -27524 -28589 -4679 14941 33036 33198 9795 -11735 -16914 -17370
16860 -17370 3418 7349 -193 4055 1012 -15981 -27933 -15255 -7483 -9351 -10803 -16009 -16173 -17646
16846 -17646 -22724 -32203 -36536 -36468 -41263 -35858 -24571 -16164 -62 3665 -5194 -33528 -23480 -22769
16832 -22769 -24749 -23777 -14734 -9254 -27298 -45372 -47239 -46061 -27962 2943 6684 9536 27071
16819B7071K635o692j8537o466j557j5331K855q021j3169O737O793Q579J0073
16806e030Q273Q266p077j4097o53J6563O283j3862j5811M139Q694O630M512k893
16792C937N602j1308j9723q549J8795Q138j776Q893m976m11K72j4042K935K1815
16778I602l271k488j1271j495j870N301J1180m478j5084l946K0556Q749l062r769
16764a346j289l451J3928K554n448m817j0487j3627n411J2493J7661K0909n385
16751A6284k1243k1927r573R636q0j232K4481J1147j0813j1514J6647m960m089
16738g236K484N15j612M493r615j2306p705R112J5602m233j4088N586Q876P21
16724i406M457K4272l85r476J539o746j2578r173O890j0895k2674j0667J4609
$$ plain form
16819 27071 29706 23014 4477 -1989 -3546 -18877 -16022 -24043 -37212 -30475 -23682 -15103 -5030
16806 -5030 3243 11509 4432 -9665 -10318 6245 12528 -1334 -17145 -13006 -4312 2318 6830 3937
16792 3937 9539 -1769 -21492 -30041 -11246 -3108 -4884 4009 -967 -1378 -1106 -15148 -12213 9602
16778 9602 6331 3843 -7428 -8923 -10793 -5492 5688 1210 -13874 -17820 2736 11485 8423 -1346
16764 -1346 -2635 -6086 7842 10396 4948 131 -10356 -23983 -29394 -16901 760 21669 16284
16751 16284 -4959 -26886 -36459 -26823 -26903 -28135 -3654 7493 -3320 -14834 1813 -3147 -7236
16738 -7236 -4752 -4237 -5849 -1356 -10971 -23277 -30982 -21870 -6268 -10501 -24589 -19003 -10127 -9406
16724 -9406 -4949 19323 18938 9462 11001 4255 -8323 -17496 -10606 -21501 -44175 -54842 -40233
16711d0233J2859j529Q236P883m992P845j0200L098M818r802m137J4147Q459j0754
16697a4302m94p90J0133j1489Q857q05J775M915J5728N171j2729j4308j4360l819
16683b6517j56R878J1460J6088K3630j1519r971j7076k1988M940J1298l305L603
16670i635K3364j1325j0601K975R656K895o316j9120L303K962n027O481J1434
16657A046Q440J0172j5372j7203n944o866M206n236N828K3329N065n755L848J044
16643F602j9363N697P974o162m323o956l514K4787P346j8298l3072j1272R648
16630d0906J6769J6728R642M894j2841k355J4081m780M682L970j0568P427j3267
16617f524j2045j3585Q590J8880O625j1268l808J3878o218J9550J1016j0208l162
$$ plain form
16711 -40233 -27374 -28903 -20667 -12784 -17776 -9931 -20131 -17033 -12215 -22017 -26154 -12007 -3548 -14302
16697 -14302 -14796 -15586 -5453 -16942 -8085 -8890 -7115 -2200 13528 18699 5970 -8338 -22698 -26517
16683 -26517 -26673 -16795 -5335 10753 34383 22864 12893 -4183 -26171 -21231 -9933 -13238 -9635
16670 -9635 13729 2404 -8197 -5222 4434 7329 1013 -18107 -14804 -11842 -16869 -10388 1046
16657 1046 9486 19658 4286 -12917 -18861 -25727 -21521 -26757 -20929 2400 7465 1710 5558 6602
16643 6602 -12761 -7064 910 -5252 -9575 -16531 -20045 4742 12088 -6210 -39282 -50554 -40906
16630 -40906 -24137 -7409 2233 7127 -5714 -8069 6012 1232 5914 9884 -684 6743 -6524
16617 -6524 -18569 -32154 -23564 -4684 1941 -9327 -13135 743 -5475 14075 25091 14883 11721
16604A1721r414m050j1300k1945J1675J4069L468O424r67r525l017r168l06j4260
16590c6595k411J0380J4067J3196n727l076l151J4580J3713j959p789J1987m111
16577A3104J628J804j6564m869k531P515N683j3460q796M737n96k2288J4976Q146
16563a1511j9223J0092J1859J9716N480j3113j8456j1647J720J144J2432J0362
16551a145J3759J6841J61r59m808k2955j9613j4013M112J420j478m809q090p839
16537d9416L618n201K2805K2714N264m771k3586n143p616J9490P487p37j092j3068
16523b9252J0788J8634R828l114j3359p000J54Q033k415O031K270j7766j7557
16510c4725O137R172L250M373q711n209p263K046R542N125o895N487J9987J58
$$ plain form
16604 11721 2307 -1743 -13043 -34988 -23313 -9244 -5776 648 -319 -9844 -12861 -22029 -22335 -36595
16590 -36595 -39006 -28626 -14559 -1363 -7090 -10166 -13317 1263 14976 13017 5228 17215 13104
16577 13104 14732 16536 -28 -4897 -7428 87 5770 -7690 -16486 -11749 -12345 -34633 -19657 -11511
16563 -11511 -30734 -20642 -8783 10933 16413 3300 -15156 -26803 -25083 -23939 -11507 -1145
16551 -1145 12614 29455 29616 28657 23849 894 -18719 -32732 -28620 -27200 -28678 -33487 -41577 -49416
16537 -49416 -45798 -50999 -28194 -5480 -216 -4987 -28573 -33716 -41332 -21842 -14355 -15092 -16184 -29252
16523 -29252 -18464 170 9998 6884 -6475 -13475 -13321 -5288 -7703 -1672 598 -17168 -34725
16510 -34725 -28588 -19416 -16166 -11793 -20504 -25713 -32976 -30930 -21388 -16263 -23158 -17671 2316 2474
16496B474j347q15P635P422m130l388j723l02j0268r498m68q487P696N804J0324
16481I29J3415p562j9467m185L171Q068J2131N244o268P528O687n738J916K816
16467A8685K745j1066j2479j1198N42P218j1772q810P152R477J1438R774O504
16454A8210j2296p833L897r727Q12O84l223j1354P00q106K061J6450N441q814
16440a3098n367J836n447k316K226M848J780J0506J6231K1821n448j2702n423
16427I447r228O953O205N072k454l94j276L03j862j8895N356n127P806J0122l646
16412H382k3116j3721o419K709p489M74J3931J7994Q892j7412m22M520n900n006
16398b2583J5516K6588j0229j0510R251n367j929p008k916M89K055j0108J0068
$$ plain form
16496 2474 1127 312 7947 15369 11239 7851 6128 5826 -4442 -13940 -14408 -22895 -15199 -9395 929
16481 929 14344 6782 -12685 -16870 -13699 -5631 6500 11744 5476 13004 19691 13953 15869 18685
16467 18685 21430 10364 -2115 -13313 -12771 -5553 -17325 -26135 -18983 -9506 1932 11706 18210
16454 18210 5914 -1919 1978 -7749 -6937 -6253 -9476 -20830 -20130 -28236 -26175 -9725 -4284 -13098
16440 -13098 -18465 -16629 -22076 -24392 -22166 -17318 -15538 -5032 11199 33020 27572 14870 9447
16427 9447 219 7172 13377 18449 15995 15601 14325 14628 12766 -6129 -773 -5900 1906 12028 8382
16412 8382 -14734 -28455 -34874 -32165 -39654 -39180 -25249 -7255 1637 -15775 -16197 -11677 -17577 -22583
16398 -22583 -7067 19521 9292 -1218 8033 2666 737 -6271 -9187 -8698 -6643 -16751 -6683
16385f683J8834J1305k769j6856m537J404J0653j1147k3558L819J4399r60n694
16372a1790j638r33P03K059n526j377J0697N099j2221P82J4514N311k3977r634
16358b7931J2144J4312L866q572N117o29J677p851j6978K329Q284o700M560J4892
16344a480N297j0407p574p884P471J9079m121n972K473Q626j2655q101J2845J1273
16330H870M25k80M567J187j5610K253Q8k3400q649J3130n340m421J328K118K300
16315b1434p011N282R805j0733K1357N503r004j2033n163L792m470l991j7466
16302d5566J5881J8108j4327R537j545j284o498m147K431J5570J2865j0725j1955
16289b1655m013n744n766p08k771L211K1837M005L008K434P136Q18j1531r215
$$ plain form
16385 -6683 12151 23456 20687 3831 -706 698 11351 204 -23354 -19535 -5136 -6096 -11790
16372 -11790 -13428 -14361 -13658 -11599 -17125 -18502 -7805 -2706 -14927 -14145 369 5680 -18297 -27931
16358 -27931 -15787 -1475 2391 -6181 -1064 -1693 -16 -7867 -24845 -22516 -14232 -20932 -16372 -1480
16344 -1480 3817 -6590 -14164 -22048 -14577 4502 381 -5591 -3118 5508 -7147 -15248 -2403 8870
16330 8870 9295 9015 13582 14769 -841 1412 1500 -21900 -30549 -17419 -22759 -27180 -25852 -23734 -21434
16315 -21434 -28445 -23163 -13358 -24091 -2734 2769 -6235 -18268 -23431 -19639 -24109 -28100 -45566
16302 -45566 -29685 -11577 -25904 -16367 -17912 -19196 -25694 -29841 -27410 -11840 1025 -9700 -21655
16289 -21655 -25668 -31412 -37178 -37886 -40657 -37446 -15609 -11604 -8596 -6162 974 1792 -9739 -18954
16275a8954R659r415K649o44O589k235j0982j4568Q433L808J0986J1417r8P771
16261D416l302l157J753p509j4365n567J3807K006m767M020L958J0783K611Q402
16247A3089J1406O47j18j0580j9983J716J2629Q113j4939j0870j926j1051k216
16234b4083J2458M024j2356L14J2828Q216J4103L532j5860j3990j1177q560M999
16221b5552K2687K7814N463n961j3575j8096m216K613o21M603p606Q3P045L756
16207a563n855M685J8854N880r529P88q158j8110M496J6328P839J3129k455q234
16193A8095j0603k0289m048j0731N075J3530L227r091p593k643O100J9369J4839
16180A5237q495j3298o753k383m61M845J4839L863j0369r672k894j0536k83j10
$$ plain form
16275 -18954 -9295 -18710 -16061 -16705 -10116 -12351 -23333 -37901 -29468 -25660 -14674 -3257 -3355 4416
16261 4416 1114 -2043 -290 -7799 -22164 -27731 -13924 -11918 -16685 -12665 -8707 2076 4687 13089
16247 13089 24495 25142 25024 14444 -5539 -3823 8806 16919 1980 -8890 -10816 -21867 -24083
16234 -24083 -11625 -7601 -19957 -19643 -6815 1401 15504 19036 3176 -10814 -21991 -30551 -25552
16221 -25552 -2865 24949 30412 24451 10876 -7220 -11436 -8823 -9444 -4841 -12447 -12364 -5319 -1563
16207 -1563 -7418 -2733 16121 22001 12472 13260 5102 -13008 -8512 7816 15655 28784 26329 18095
16193 18095 7492 -12797 -16845 -27576 -22501 -8971 -5744 -14835 -22428 -25071 -18971 398 15237
16180 15237 6742 -6556 -13309 -15692 -16153 -11308 3531 7394 -2975 -12647 -15541 -26077 -26360 -26470
16166b6470J9413k3290k985J4105K1159Q142k5543j1696m241R001R044J6128k1802
16153a9035K148N005N176J224J25k514m263n558j654J6352o92j0501K390P291
16139d506l031l87l656p667O733m093J5993j0506l733R22R922l46k976j3146L287
16124a7190l227q183o82q616J6897J9233j473o391q385j4230R745J0101k665O868
16110h198L395M495L019Q472j3572l842j516j1539N316n782J1113J6242J7324
16097B4927O583J2662O35j5727k874P793m261k6435j4931j0435k984N276J1850
16084g921J2456r941j6128k636M164J7957M859j6131q342l672J9108J8226O021
16071A8020p417j059j8060j4873P910j241n48R326j0514q081L530n905R592M609
$$ plain form
16166 -26470 -7057 -30347 -33332 -19227 1932 10074 -15469 -27165 -31406 -22405 -13361 2767 -19035
16153 -19035 -16887 -11882 -6706 -5482 -5357 -7871 -12134 -17692 -19346 -2994 -3686 -14187 -11797 -4506
16139 -4506 -7537 -7924 -11580 -19247 -12514 -16607 -614 -11120 -14853 -13931 -4009 -4355 -7331 -20477 -17190
16124 -17190 -20417 -28600 -29282 -37898 -21001 -1768 -3241 -9632 -18017 -32247 -22502 -12401 -15066 -8198
16110 -8198 -4803 -308 2711 11183 -2389 -6231 -7747 -19286 -13970 -19752 -8639 7603 24927
16097 24927 31510 44172 44807 29080 26206 33999 29738 3303 -11628 -22063 -25047 -19771 -7921
16084 -7921 4535 -5406 -21534 -24170 -20006 -2049 2810 -13321 -21663 -25335 -6227 11999 18020
16071 18020 10603 9544 -8516 -23389 -15479 -16720 -17268 -7942 -18456 -26537 -23007 -28912 -19320 -14711
16057a4711N251o21O931L437l11L044K333j773j1647l809q132n339m220o815O834
16042b9548K0735O190j5369j339J2470n681j7002j1454J4607K4224J0425q572
16030c14J3J2413O48q8m27J482J059M962L194j5465j2454J772m752L9l819K596
16014i141J1329O576J3382j29q18j447j8001K994k683j4155k133O807j723J933
16000g209J1511O508p202M55j3982J348p516J1697L947J847r126q523l284J6491
15986c038m71J206J1111L117j1962m859K40N130J524n575J1283j5164l261j1134
15972b1853L943K1914J5691o175m936P622o132l038j3526j0112M834j1465p640
15959c0873J8641J6706K1801L018j4489l3337j4366N644J7409L142J0913J1695
$$ plain form
16057 -14711 -9460 -10081 -3150 287 -24 3020 5353 3580 -8067 -11876 -20008 -25347 -29567 -36382 -29548
16042 -29548 -8813 -2623 -17992 -19331 -6861 -12542 -29544 -40998 -26391 -2167 8258 -314
16030 -314 -301 12112 12760 12672 12245 13727 14786 19748 22942 7477 -4977 -3205 -7957 -7918 -11737 -9141
16014 -9141 2188 8764 22146 22017 21199 19752 1751 4745 2062 -12093 -14226 -7419 -9142 -7209
16000 -7209 4302 10810 3608 4063 -9919 -8571 -16087 -4390 -443 1404 -7722 -16245 -19529 -3038
15986 -3038 -3509 -2303 8808 11925 -37 -4896 -4656 474 1998 -3577 7706 -7458 -10719 -21853
15972 -21853 -17910 4004 19695 13520 8584 16206 10074 7036 -6490 -16602 -11768 -23233 -30873
15959 -30873 -12232 4474 26275 29293 14804 -18533 -32899 -27255 -9846 -6704 4209 15904
15947A5904o264j0489J4685J2072q445N1R01q86O267p081j3374j2251q133L060
15933a3983L949p228Q549j022k2076O139Q408m713l357q21M562O375k23j6947
15919c2388M180J4821j0670o295L361J3164Q460M158R883J0091M017K1687K2206
15906F6675k0235j3295l3123k4975M206J9988J465R330J1440K480m86m767j8070
15893F33j2046J3813J5560N455j8686j6119j0284J4412M478K143K1243J0762k2893
15880H471r032J2581r665n763R261j4398K498r113J1514M536M353j802j2130o112
15866a4801m924J5613J1925n788j0579q25J6403j4906K48J5180M491k46l445j0162
15852a816r482J1736P776j4073j929J3705J5J1528J5032k485j1146J6630j0808
$$ plain form
15947 15904 9640 -849 13836 25908 17463 17514 18415 17529 23796 16715 3341 -8910 -17043 -13983
15933 -13983 -10034 -17262 -8713 -9735 -31811 -25672 -17264 -21977 -25334 -26155 -21593 -15218 -15441 -32388
15919 -32388 -28208 -13387 -24057 -30352 -26991 -13827 -5367 -1209 8674 18765 22782 44469 66675
15906 66675 46440 33145 22 -24953 -20747 -759 706 10036 21476 23956 23470 18703 633
15893 633 -11413 2400 17960 23415 4729 -11390 -21674 -7262 -2784 -641 20602 31364 8471
15880 8471 -561 12020 2355 -3408 5853 -8545 -6047 -15160 -3646 890 5243 3441 -8689 -14801
15866 -14801 -19725 -4112 7813 2025 -8554 -9379 7024 -7882 -7634 7546 12037 11791 8346 -1816
15852 -1816 -11298 438 8214 -5859 -7788 5917 5932 17460 32492 30007 18861 35491 24683
15839B4683j5158R433j4638m363j0462l288N082Q320Q37P721j3570N979L591q739
15825d572J511j4937r998K6485J7539k4306r917q12n598L420J0531K1376K7406
15812C8128L285j7726k7150j2793K1878K0730j3610j7914o144k754j3604n334
15800c3008L052M095P72J8923J9133J404j381j5645J5999o780o835J4669k982
15787A1416j7420o50K0987P209L832j2975j030p280j1494k730k0672P766O70J4934
15773g437K6445J3750j2600j7970j5671j0216K734k233N643J7520Q39k2795j1396
15760c3387J9737l244k606J0570o869j0466O485P966J3013N656r51j0054P305
15747C155K2770p852j9515l303J2831L22o057L647o868R906J064q296j2590j5374
$$ plain form
15839 24683 9525 18958 4320 -43 -10505 -13793 -8711 -391 446 8167 -5403 576 4167 -4572
15825 -4572 -3061 -17998 -27996 -1511 16028 -8278 -18195 -19007 -24605 -21185 -10654 10722 38128
15812 38128 41413 23687 -3463 -16256 5622 26352 12742 -5172 -11316 -14070 -27674 -33008
15800 -33008 -29956 -25861 -25089 -6166 12967 14371 12990 -2655 13344 6564 -271 14398 11416
15787 11416 -6004 -6654 14333 21542 25374 12399 11369 4089 -7405 -10135 -30807 -23041 -22371 -7437
15773 -7437 19008 32758 20158 2188 -13483 -23699 -20965 -23198 -17555 -35 804 -21991 -33387
15760 -33387 -13650 -16894 -19500 -8930 -15799 -26265 -19780 -11814 1199 6855 5904 -4150 3155
15747 3155 25925 18073 -1442 -4745 8086 8408 2351 5998 -870 9036 10100 1804 -10786 -26160
15733b6160M409J7279n296L831m186p030J3430N855n356o022j0215n998n817Q679
15719b2597J2678Q476L722Q716p940P24q438o669n749J1232l80j069K5035r985
15705G756j1451K4J5770J1817p538N223n495j8365m345k802L881j559J0927J7629
15691B1472m482j3556j614K2751N534j925j0669k1782j9234J720L37l912O025
15678a9335M022K1778K482l277M127k534K982J2833k507M203N631q011l121j152
15664A8121J3371k2569j5593m298k887j7505J7227J0122q091R42J3596k45P242
15651I433r636j2837J0798N269q286j2002j7837o722O358J0670j9728p352R637
15638d2235K0806J1839N071J6679J7306k186j7829j7695j2174Q061K201L564l885
$$ plain form
15733 -26160 -21751 -4472 -9768 -5937 -10123 -17153 -3723 2132 -3224 -9246 -19461 -25459 -31276 -22597
15719 -22597 -9919 -1443 2279 10995 3055 3779 -4659 -11328 -17077 -5845 -6225 -7294 17741 7756
15705 7756 -3695 -3671 12099 23916 16378 21601 16106 -2259 -6604 -9406 -5525 -7084 3843 21472
15691 21472 16990 3434 1820 24571 30105 28180 17511 -4271 -23505 -21785 -21448 -25360 -19335
15678 -19335 -15313 6465 8947 5670 9797 7263 10245 23078 20571 24774 30405 22394 19273 18121
15664 18121 31492 8923 -6670 -10968 -13855 -31360 -14133 -4011 -12102 -11160 2436 2191 9433
15651 9433 -203 -13040 -2242 3027 -5259 -17261 -35098 -41820 -35462 -24792 -44520 -51872 -42235
15638 -42235 -21429 -9590 -4519 12160 29466 27280 9451 -8244 -20418 -12357 -10156 -6592 -10477
15625a0477m420n311K610K4738J1471p453j1375l0894r337J6920K1204J3255K0282
15612C1213O110j3085J552k8112k0712R105J2006J2624J5084j2786m627j649k2551
15599a5828j401J0709k506N350J3615j3850Q987M639m782Q139o331M910j283O750
15585A7118Q014j2352J154j1651j6875N172j5595j154k641n494O026J6825N688
15572e765j785q562N589J0586O143j2912j0419J1528J0994m458K576K536P632
15559A3683m06j4044j394l062p067j0819j370L078j254J3248J1549p865J6876
15546A1153J1966j9917K504L025m412m939O938R81l0661P362K4619J5097p908
15533A5808j1731n837j365p509j8750R59R489k462J0811j2717j2729m882O887
$$ plain form
15625 -10477 -14897 -20208 -17598 7140 18611 11158 -217 -31111 -40448 -23528 -2324 10931 31213
15612 31213 37323 24238 25790 -2322 -23034 -13929 -1923 10701 25785 12999 8372 6723 -15828
15599 -15828 -17229 -6520 -9026 -3676 9939 -3911 5076 9715 4933 13072 6741 11651 10368 17118
15585 17118 25132 12780 13934 2283 -14592 -9420 -25015 -26169 -28810 -34304 -28278 -11453 -5765
15572 -5765 -7550 -16112 -10523 63 6206 -6706 -17125 -5597 5397 939 3515 6051 13683
15559 13683 13277 -767 -2161 -5223 -12290 -23109 -24479 -21401 -22655 -9407 2142 -5723 11153
15546 11153 23119 3202 5706 8731 4319 -620 6318 7299 -23362 -16000 8619 23716 15808
15533 15808 4077 -1760 -3125 -10634 -29384 -28425 -18936 -21398 -10587 -23304 -36033 -40915 -34028
15520c4028J5464K230j6066K3720j2953J583J5408q185j6377K746Q195K424N355
15507a0484P587r918j1613O237K2502j075j2484q116o760o88P322m415J720K0044
15493a41m974j5465q561o682J994J6485O618q183O111O071k1121q549J2465Q518
15479a5414K1926P741q462l617j7297k2734J8760P794M392J4678r274N37J3767
15466A2797k884J1o224k2579k0116Q504K646R468j536n82p8j467O024J1647j6996
15451b1365K891m40K478O254O831O611j447o504j306J6141M911k2241K205K0880
15437A5899J083O526K75j5687O619L289o935n420K643n338l28j4540j3665J6788
15423h791J1533L786k425k1343j522j287k559J8391P090J839k819k4869L108Q609
$$ plain form
15520 -34028 -18564 -16334 -32400 -8680 -21633 -20050 -4642 -12827 -29204 -26458 -18263 -15839 -10484
15507 -10484 -2897 -12815 -24428 -18191 4311 3236 -9248 -17364 -24124 -24812 -17490 -21905 -20185 -141
15493 -141 -5115 -20580 -29141 -35823 -33829 -17344 -10726 -18909 -12798 -6727 -27848 -36397 -23932 -15414
15479 -15414 6512 14253 5791 2174 -15123 -37857 -19097 -11303 -6911 7767 -1507 -970 12797
15466 12797 9913 9924 3700 -18879 -38995 -30491 -27845 -18377 -19913 -20495 -20573 -22040 -16016 -4369 -21365
15451 -21365 -18474 -18914 -16436 -10182 -3351 3260 1813 -4691 -5997 10144 15055 -7186 -4981 15899
15437 15899 16982 23508 23783 8096 14715 18004 11069 5649 8292 2954 2626 -11914 -25579 -8791
15423 -8791 2742 6528 4103 -17240 -18762 -20049 -22608 -4217 2873 4712 1893 -22976 -19868 -11259
15409a1259j0496j7523J821J4348J6417o128m635j6650j066J18J6087J7829M225
15396C088n209O764k778j5930k1784L989J2271J9126R681q267l675r533j086P042
15382f301J2341O848m158r280p281M851J3813N410l623p052M160J0339l408j6104
15368E55j0945o72J8278p506j4688Q865N747j0762j4085J459R48O382m531L778
15354a7177J7419K94o754L54L268P232J771q752j0530k261j1596J4653j554O511
15340g122R073j1889j8529k602J0298J7258J081j7852j1562o644K854J0005J5469
15327a0162J105l383J763n677M629J7340K624j3090o813K797K235R797m920k4617
15313b6372k5226J3986J0413J1760J1877J8J367j0927j5216J181J8322j5952l966
$$ plain form
15409 -11259 -21755 -39278 -37457 -23109 -6692 -12820 -17455 -34105 -35171 -35053 -18966 -1137 3088
15396 3088 -2121 4643 1865 -14065 -35849 -31860 -19589 -463 9218 951 -2724 -12257 -13343 -6301
15382 -6301 6040 12888 8730 -550 -7831 -2980 10833 16243 12620 5568 9728 20067 16659 555
15368 555 -10390 -11062 7216 -290 -14978 -6113 -366 -11128 -25213 -23754 -22806 -16424 -20955 -17177
15354 -17177 242 536 -6218 -5864 -2596 4636 6407 -2345 -12875 -15136 -26732 -12079 -13633 -7122
15340 -7122 1951 -9938 -28467 -31069 -20771 -3513 -2432 -20284 -31846 -38490 -35636 -25631 -10162
15327 -10162 -9057 -12440 -10677 -16354 -11725 5615 8239 -4851 -11664 -8867 -6632 3165 -1755 -26372
15313 -26372 -51598 -37612 -27199 -15439 -3562 -3544 -2177 -13104 -28320 -27139 -8817 -24769 -28735
15300b8735N992J2148N116O181l436j7770P832K4432r414j415K0418J3346j1158
15287B3537j0045O47m835j5922n910K946l673M903L220o528O55m499N279J908
15273h317m669m997m891j1232P962n063O807J6284J3116n767J0153L886j4686
15260a414n414K820J074R01P771L558M171k940N86M570J612K60j8930j7156K108
15245a6423r445K1722J8438j4972r632r609P26K248M098K835K951l725P180o481
15231a0089l721k245R781K387p284J0594R435R703k407j7959k0993M535L65m372
15217b2270k847L732k103J9423K815k2458j7461o132N474J5156J0631J6160m68
15204c48o985j4934m615J442K1485N679j8881K611J0676J8615R574j1182k27Q531
$$ plain form
15300 -28735 -22743 -10595 -5479 702 -2734 -20504 -12672 11760 2346 931 21349 34695 23537
15287 23537 13492 14139 9304 -6618 -12528 -9582 -13255 -8352 -5132 -11660 -11005 -15504 -10225 -8317
15273 -8317 -12986 -17983 -22874 -34106 -26144 -31207 -24400 -8116 5000 -767 9386 13272 -1414
15260 -1414 -6828 -4008 -2934 -2033 5738 9296 13467 10527 11113 15683 17295 17555 -1375 -18531 -16423
15245 -16423 -25868 -4146 14292 -680 -10312 -19921 -19195 -16947 -12849 -10014 -7063 -10788 -3608 -10089
15231 -10089 -13810 -16055 -6274 -3887 -11171 -577 8858 18561 16154 -1805 -22798 -18263 -17898 -22270
15217 -22270 -25117 -21385 -23488 -4065 -1250 -23708 -41169 -47301 -41827 -26671 -16040 120 -348
15204 -348 -7333 -22267 -26882 -25440 -3955 1724 -17157 -14546 -3870 14745 24319 13137 12910 21441
15190B1441J1304P522m580j4701k5219j4877m767j665o436M766J9793J9353P931
15177A9865p296q84o591O789l758p608l095K3279J6569r395j4663j2338j0461
15164i587n780k088p464n692J624R927Q055j511k59J5039J7392l276n603j8105
15150g328o484Q642P256N169j9013k7678P696M926M158J6767Q972l274j1736m584
15136a6511P49N782J4988J8253o974j7529k7323J0420J2035m20R66P105Q842R427
15122A9810Q54o660k773l976m460P924j5746q102l784L626J0762m089J345M48
15108d821P862J946j0811J9161K553n384O747L264o783L631m855j5528q730N21
15094a1227P925o046p91J9288k8681j0583J6603J3753k435l77p063J1541O500
$$ plain form
15190 21441 32745 40267 35687 20986 -4233 -19110 -23877 -25542 -31978 -27212 -7419 11934 19865
15177 19865 12569 11685 5094 11883 8125 517 -2578 20701 37270 27875 13212 874 -9587
15164 -9587 -15367 -17455 -24919 -30611 -28987 -19060 -11005 -12516 -12775 2264 19656 16380 10777 -7328
15150 -7328 -13812 -5170 2086 7255 -11758 -39436 -31740 -26814 -22656 -5889 3083 -191 -11927 -16511
15136 -16511 -15762 -9980 5008 23261 16287 -1242 -28565 -18145 -6110 -6530 -5564 1541 10383 19810
15122 19810 20664 14004 11231 7255 2795 10719 -5027 -13129 -16913 -13287 -2525 -6614 -5269 -4821
15108 -4821 3041 4987 -5824 13337 15890 10506 17253 20517 13734 17365 12510 -3018 -11748 -11227
15094 -11227 -3302 -9348 -10139 9149 -19532 -30115 -13512 241 -2194 -2571 -9634 1907 8407
15081H407L579O644j285O379m300n068o710K469k2233k5069J2936k096J2692j2079
15067b5734j3497J0850p94j1376J645J2299J2984J7448j1577j6666n222J8346
15055a1294O181Q396l516j5882n807J2615R370P649l540R47m813L832P075p847
15041C366j1280J091J7065J4896j0631j372k267j5976m388N043Q684q332p351
15028a1452j978L600N866Q802K56Q92j005p925K247J6780l795n504m03o240o846
15013f705J6350m630j6907j3396N991J0960L198L540j7408n109k207J8547J2358
15000D582j255j1885n662j0288N900J0236J1481J0711j662r529j5878l525j92
14987a6966l228J719m444r877N836L4086J8672q732k3828j4425L147O097k485
$$ plain form
15081 8407 11986 18630 17345 23724 19424 14356 7646 10115 -12118 -37187 -24251 -26347 -13655 -25734
15067 -25734 -39231 -28381 -29175 -40551 -38906 -26607 -13623 3825 -7752 -24418 -29640 -11294
15055 -11294 -5113 3283 -233 -16115 -21922 -9307 63 7712 4172 5119 306 4138 11213 3366
15041 3366 -7914 -6823 10242 25138 14507 13135 10868 -5108 -9496 -4453 4231 -4101 -11452
15028 -11452 -13430 -9830 -3964 4838 5094 5986 4981 -2944 -697 16083 12288 6784 6381 141 -6705
15013 -6705 9645 5015 -11892 -25288 -19297 -8337 -5139 -1599 -19007 -24116 -26323 -7776 4582
15000 4582 3327 -8558 -14220 -24508 -18608 -8372 3109 13820 12158 2629 -13249 -16774 -16966
14987 -16966 -20194 -18475 -22919 -32796 -26960 7126 25798 17066 -6762 -21187 -18040 -11943 -14428
14974a4428k676O58K3366k373j9038Q074N488p855q635N210Q129L535J3040P167
14960A9662p115j1078m553M206P054P990K989K510n527r052q904r063J1151J813
14946B083l166J9931O063l191q199J394n228j0412m307P296k204j1799k5136q390
14932d5265M208N858O787J0795J2786n643m795L003P541J6258m438m114N20k778
14918G23m323M151n319j7049o319K3630L332j6345K842n355M76j0834N090K010
14904b3290j7666L687J4418K396J2514J5141J47j4163j7696l458J2238J5344p434
14891g822j2793L122R268R972j2031k9087P180O061J6138K1130M306l956j270
14878A0218O876j3816j6632Q85J0784k268Q489R740k984o56R100k430m022j1014
$$ plain form
14974 -14428 -17104 -16446 6920 4547 -14491 -6417 -929 -8784 -17419 -12209 -4080 -545 12495 19662
14960 19662 12547 1469 -3084 1122 8176 16166 19155 21665 16138 7086 -1818 -10881 270 2083
14946 2083 -1083 18848 24911 21720 13521 14915 9687 -725 -5032 2264 60 -11739 -36875 -45265
14932 -45265 -41057 -35199 -28412 -17617 -4831 -10474 -15269 -12266 -4725 11533 7095 2981 3501 723
14918 723 -3600 551 -4768 -21817 -28136 -4506 -1174 -17519 -14677 -20032 -19556 -30390 -25300 -23290
14904 -23290 -40956 -37269 -22851 -20455 -7941 7200 7347 -6816 -24512 -27970 -15732 -388 -7822
14891 -7822 -20615 -17493 -8225 1747 -10284 -39371 -32191 -26130 -9992 11138 15444 11488 10218
14878 10218 17094 3278 -13354 -12469 -1685 -3953 4536 14276 11292 10636 19736 17306 13284 2270
14864B270o530l082Q085J7081j0484j2983N351P73r820r047K872J3823j464K403
14850g52j4773j0102K937N013Q598o308o382m858j402J0711J8357r156j330Q870
14836e77o435q916K0321m58L134p50L222P458k063O863k0953O57k246N04m862
14821e101M517N52J6166J4758P520n212j9720j1280O459k620Q058N142J946O955
14807B8140J2483p704N142J826K760q242k8064k575J9000q642P643J509j7820
14794E456p163l596q53K0510r661k1531J3930L887l040O747p666J517j5821r746
14780b7030J5185P417J2643J914k5898k771P489Q068O974J487n557j2418j0934
14767b3431L549m343j2756Q195J2124J5431K511o71O307M43q25J4482j2606J2284
$$ plain form
14864 2270 -4260 -7342 743 17824 7340 -5643 -292 481 -9339 -18386 -15514 -1691 -3155 -752
14850 -752 -15525 -25627 -22690 -17677 -9079 -15387 -21769 -26627 -28029 -17318 1039 -8117 -9447 -577
14836 -577 -7012 -15928 4393 3935 7069 6319 9541 16999 14936 21799 846 1503 -743 -239 -5101
14821 -5101 -584 -32 16134 30892 38412 33200 13480 2200 8659 6039 14097 19239 21185 28140
14807 28140 40623 32919 38061 39887 42647 34405 6341 3766 22766 14124 21767 23276 5456
14794 5456 -1707 -5303 -6156 14354 4693 -16838 -2908 979 -2061 4686 -2980 -1463 -17284 -27030
14780 -27030 -11845 -4428 8215 10129 -15769 -18540 -11051 -2983 3991 5478 -79 -12497 -23431
14767 -23431 -19882 -24225 -36981 -28786 -16662 -1231 1280 609 6916 7359 6534 21016 8410 20694
14753B0694J3963p003l672m045J196J6669j1582m976j0010k066m421j3091Q511
14740A67J2626l048j3486L39M192p363m208q927J5957J9490l016m459j4308n382
14726a1426K289K852n060Q943J4602Q428l536l928r564l802j2432k655R416O567
14712F94O600J086M61P174o346m912k646j0554J65q985j533j2107l225J3344J267
14697a9517o316K912m100J1014L709n431M566L201J7738j2353N172M54k1037J298
14683a8690J3697L766j510n37j0153L130k150M75J354R43J0147n534j0435p530
14669b3027j384J5748J9035J13K500o084J129n623q146Q566K220j0550m750l140
14655a3393k441j1880N916o991J6729L6886J0744j2362j2170l648j5467k1202
$$ plain form
14753 20694 34657 27654 23982 19937 21133 37802 26220 21244 11234 9168 4747 -8344 167
14740 167 12793 9745 -3741 -3402 790 -6573 -10781 -19708 -3751 15739 12723 8264 -6044 -11426
14726 -11426 -9137 -6285 -11345 -2402 12200 20628 17092 13164 3600 -202 -12634 -15289 -5873 694
14712 694 7294 8380 8841 16015 9669 4757 2111 -8443 -8278 -17263 -18796 -30903 -34128 -20784 -19517
14697 -19517 -25833 -22921 -27021 -16007 -12298 -17729 -13163 -9962 7776 -4577 595 1049 -19988 -18690
14683 -18690 -4993 -1227 -2737 -3274 -13427 -10297 -12447 -11972 -10618 -9675 472 -5062 -15497 -23027
14669 -23027 -24411 -8663 10372 10485 12985 6901 8030 2407 -5739 2827 5047 -5503 -10253 -13393
14655 -13393 -15834 -27714 -21798 -28789 -12060 24826 35570 23208 11038 7390 -8077 -29279
14643b9279j5180J9356K3584K9199K203q19O557M352N682r159q176k072m990L267
14629B4525M483j2551l206P139j960J2736J0296j0090q694N05m867J3100q409
14616B3007k3689r086p648L600J4773N690m943j2340m054P964k209j2230p600
14603b8765J0047J2945O828J3132J49k414J2068N539j9661J0434l308l5469j1167
14590b9642J5617O953N46K364Q810R47j400J881j6248o577N532l819M386Q467
14576b183n385n754r381J3326n242P180L992j1330M660O157N488n766P455P238
14562A0455J0430n801q898N008R665J489n710j7945k1717K117R984N986J3743
14549H806N747k867m577J4724J806p715n142m603O368O162K3252k3364j0224J1715
$$ plain form
14643 -29279 -44459 -25103 -1519 27680 29883 29064 35621 39973 45655 36496 28320 26248 21258 24525
14629 24525 29008 16457 13251 20390 18430 31166 41462 31372 22678 23183 18316 31416 23007
14616 23007 -682 -9768 -17416 -13816 957 6647 1704 -10636 -14690 -6726 -8935 -21165 -28765
14603 -28765 -18718 -5773 1055 14187 14336 11922 23990 29529 9868 20302 16994 -18475 -29642
14590 -29642 -14025 -7072 -6526 -4162 4648 5595 4195 6076 -10172 -16749 -11217 -15036 -10650 -2183
14576 -2183 -7568 -13322 -22703 -9377 -14619 -7439 -3447 -14777 -10117 -3960 1528 -4238 3217 10455
14562 10455 20885 15084 6186 11194 20859 22348 16638 -1307 -23024 -20907 -10923 -4937 8806
14549 8806 14553 11686 7109 21833 23639 15924 10782 6179 12547 18709 41961 18597 8373 20088
14535B0088M453P07J0420L551l682p595j9085q56o714m07J5015q769j7715N196
14521e393O98l338J271p140j966J0705J1659L358J748j1083o129k0128J705L919
14507b0114p52J2088M283k411j550R825K298k2472R105J6462o879J0505k566J2092
14493A9914M911k5945m055m3j6152j7245J1382L1361N667l75Q834j521N617m278
14479A8072j5026k4049n734P267R476K0871J2723J2523P850j8368k0029l36Q871
14466A4111J9493K800q022j0062k000k876r720M473K3143j78j4622j2222j6422
14453a2104j054L3092p669j8053n392j51K629Q394J3267N924K685K834q999j7734
14439b331O892J2683j0891j5365Q625M814m972N907J3289j2191k69N526l27j2937
$$ plain form
14535 20088 24541 25248 35668 39219 35537 27942 8857 8001 1287 880 15895 7126 -10589 -5393
14521 -5393 -4695 -8033 -6762 -13902 -15868 -5163 6496 9854 11602 519 -5610 -25738 -24033 -20114
14507 -20114 -20866 -8778 -4495 -6906 -8456 1369 3667 -18805 -9700 6762 -117 10388 7822 19914
14493 19914 24825 -1120 -5175 -5218 -21370 -38615 -27233 4128 9795 9420 18254 16733 22350 18072
14479 18072 3046 -21003 -26737 -19470 -9994 10877 23600 36123 43973 25605 5576 5240 14111
14466 14111 33604 36404 28382 18320 16320 13444 3724 8197 31340 31162 16540 4318 -12104
14453 -12104 -13158 19934 12265 -5788 -11180 -11331 -8702 -308 12959 18883 21568 24402 15403 -2331
14439 -2331 4561 17244 6353 -9012 -387 4427 -545 5362 18651 6460 6191 11717 11390 -1547
14425a547r958rJ0148N434j5j0317l531R790N185M924J3630m202j2134o287K2063
14410B3174l696l792k341j675p709L289K381J0748m573j3852Q29M273K577N165
14396A4798q32q397N758O256j3155k789M588R350k994j1870j5697j4991k657j5800
14382d8432j0511J2245J2402K8665K8847J2132m686k166n428j3964j3058K464
14370a490N269k689K50n725j603o760m674R509k911m860J7805j4538p608L943
14356a6082J2452q117k374m622J150K0465K860M896j669q912L124q056P741J540
14342D396L756j6771r137K655K3338O738N575l895j8821k2060L710J5040O215
14329G39J4102M751k0898o838R478M184N391P651o401j1770q734N149J7492P80
$$ plain form
14425 -1547 -11505 -11514 -1366 4068 4053 -6264 -9795 -5 5180 10104 23734 19532 7398 1111 23174
14410 23174 19478 15686 13345 11670 3961 7250 9631 20379 15806 1954 2783 7056 9633 14798
14396 14798 13966 5569 11327 17583 4428 1639 6227 15577 12583 713 -14984 -29975 -32632 -48432
14382 -48432 -58943 -46698 -34296 -5631 23216 35348 30662 28496 23068 9104 -3954 -1490
14370 -1490 3779 1090 1340 -4385 -5988 -12748 -17422 -7913 -10824 -15684 2121 -12417 -20025 -16082
14356 -16082 -3630 -11747 -14121 -18743 -17593 2872 5732 10628 8959 47 3171 -4885 2856 4396
14342 4396 8152 -8619 -17756 -15101 8237 14975 20550 16655 -2166 -24226 -20516 -5476 739
14329 739 14841 19592 -1306 -8144 1334 5518 10909 18560 12159 389 -8345 -3196 14296 15076
14315A5076q288P491J2032k0403j0731O019j0898M19Q018j290J1307J0470o784
14302A2438k6712O704Q644K071j111k848l227l007p84J818l63j034n117J60N636
14287f732R964R259p431N609m838k0128q210J3955L5201Q098n905k1587k4409
14274a7154N537k122O619O020K148M02l986l389P948l764k2389O432K1685l319
14260F68L423p800K892M795J90r565j3046j405r69j642J3320J3951m645j172L636
14245B631k143K058J3191k1567j520L0767o963j4606J2965J605j510o324m194
14232D390o278q048J5899L801Q942k2907j7214P947j013o775K755O569M670n111
14218a2373k73m501J1355R265K211K930m559n549R075p62n893p379r622L93J5734
$$ plain form
14315 15076 6788 14279 26311 5908 -4823 1196 -9702 -9283 -1265 -2555 8752 19222 12438
14302 12438 -14274 -7570 1074 3145 2034 -814 -4041 -7048 -7832 -6014 -6377 -7411 -12528 -12368 -6732
14287 -6732 3232 12491 5060 10669 5831 -14297 -22507 -8552 26649 34747 28842 7255 -17154
14274 -17154 -11617 -13739 -7120 -1100 1048 1450 -2536 -5925 2023 -1741 -24130 -17698 3987 668
14260 668 4091 -3709 -817 3978 4168 -5397 -18443 -19848 -20817 -22459 -9139 4812 167 -1005 2631
14245 2631 488 2546 15737 -5830 -7350 23417 16454 1848 14813 16418 14908 8584 4390
14232 4390 -1888 -9936 5963 9764 18706 -4201 -21415 -13468 -14481 -21256 -18501 -11932 -7262 -12373
14218 -12373 -12646 -17147 -5792 3473 5684 8614 4055 -1494 7581 6819 926 -6453 -16075 -15682 52
14203E2M825m489Q189J6599L319R11P124r241M872k8009q657N509Q303o474M09
14188C242O158p465p299j3743L839J0001J7943m459J0563j216l250P695q561j3546
14174i8O900J5075j1270j1737p457J9304N233n181j4650o372L691J6880m133n759
14160D26k851Q095M030R065p620q834p760k4090n943n201R395R779O213J0648
14146d648J2749q44j6303o512n164O095P764Q617K714j2189j8705Q653R932l337
14132a1178Q307J4703j713P924R926L930j1212j0297j913j5833r969J1970J3414
14119H059j107l258J929P13j754j0471j2054q751K0938J6762O889R318j7105q381
14105A727O714P272q464j0548j0279j7717n372J9835P908j253P857N756o556r347
$$ plain form
14203 52 4877 388 8577 25176 28495 29406 36530 27289 32161 4152 -4505 1004 9307 2833 3242
14188 3242 9400 1935 -5364 -19107 -15268 -5267 12676 8217 18780 17564 14314 22009 13448 -98
14174 -98 6802 21877 10607 -1130 -8587 10717 15950 10769 -3881 -10253 -6562 10318 6185 426
14160 426 -2425 5670 9700 18765 11145 2311 -5449 -29539 -35482 -40683 -31288 -21509 -15296 -4648
14146 -4648 8101 7257 -9046 -15558 -20722 -14627 -6863 1754 4468 -7721 -26426 -17773 -7841 -11178
14132 -11178 -2871 11832 10119 18043 27969 31899 20687 10390 8477 -7356 -17325 -5355 8059
14119 8059 6952 3694 5623 6336 4582 -5889 -17943 -26694 -5756 11006 17895 27213 10108 1727
14105 1727 8441 15713 7249 -3299 -13578 -31295 -36667 -16832 -8924 -10177 -2320 3436 -3120 -12467
14091a2467p460J5J7058k671J159j2881J196K157L5452J9577K313r291j1637j77
14077B2343j2543j5190p74J2390N81K081m358n030N469m23p823j5541R227J3083
14063C492J0073j1540o779n377P975R868j4160K781L035m345p055k379J095J646
14049a1670J8927Q411o251m644j0990L871N286O182n969m714L181Q692J2180M678
14035B7170j3416K41j2170m953N064l610J065R352P159L90L546n461j1726m844
14021b193N837M154Q345R167p640K828j0485r476n457j6448l942K0339J5824J1181
14007B2034j3147n531j3517Q856R318j4931P343L321n707J393O935k2881J295
13994a5219M457J74M204J1173k581j183J4728j7398m180K9080J8934j3555j0304
$$ plain form
14091 -12467 -19927 -19912 -2854 -5525 -4366 -17247 -16051 -13894 21558 41135 43448 34157 22520 22343
14077 22343 9800 -5390 -6164 6226 6807 8888 4530 -500 4969 4546 -3277 -18818 -9591 3492
14063 3492 13565 2025 -4754 -10131 -2156 7712 -6448 -3667 -632 -4977 -12032 -14411 -13316 -11670
14049 -11670 7257 15668 9417 4773 -6217 -2346 2940 9122 3153 -1561 1620 10312 22492 27170
14035 27170 13754 13995 1825 -3128 1936 -1674 -609 8743 15902 16292 19838 14377 2651 -2193
14021 -2193 3644 7798 16143 25310 17670 20498 10013 537 -4920 -21368 -25310 -4971 10853 22034
14007 22034 8887 3356 -10161 -1305 8013 -6918 425 3746 -1961 -568 6367 -16514 -15219
13994 -15219 -10762 -10588 -6384 4789 2208 1025 15753 -1645 -5825 23255 42189 28634 18330
13981A8330j5012j3301o691j130M961N460J271q280R454J67J6058N056j9133p760
13967a0550J4664K8412n721m634L883k912k9923m964L612J2029M146p611j386
13954i55k12P16M398R829J0170j289n641n502k3663M112J4693J7741K2540L064
13940E0001m347j7903o938K51j0224p892o646L274K9739J1667J050j6643m7j826
13926B3516Q369l793k1480l997p112Q490O251J9952j5026j1219K353Q449J661
13913A6414j215j8978j2646J5539J2716J9009k716j4666N046O118N852r598K298
13900B3173p905K981r358m449J184l050n883j1193K2505J3428M526j3008J301
13887A4252M29k0797k3099J0655J9828J1993Q07M846l699R831M219Q365k53k1074
$$ plain form
13981 18330 3318 -9983 -16674 -17804 -12843 -7383 -6112 -14392 -4938 -4771 11287 16343 -2790 -10550
13967 -10550 4114 32526 26805 22171 26054 23142 -6781 -11745 -8133 3896 8042 431 -955
13954 -955 -1167 -451 3947 13776 23946 22657 17016 11514 -12149 -8037 6656 24397 46937 50001
13940 50001 45654 27751 20813 21064 10840 2948 -3698 -424 29315 40982 42032 25389 25342 23516
13926 23516 31885 28092 6612 2615 -4497 3993 10244 30196 15170 3951 6304 14753 16414
13913 16414 15199 -3779 -16425 -886 11830 30839 28123 13457 18503 24621 30473 20875 23173
13900 23173 15268 18249 8891 4442 5626 2576 -3307 -14500 8005 21433 25959 12951 14252
13887 14252 14681 -6116 -29215 -18560 1268 13261 14068 18914 15215 25046 29265 37630 37377 16303
13873A6303j2842p612k523Q884J0513R408L508r559N803M515p879j3349j0523
13860e353l475O767K038N999J3295O979j2895k315j0706r651j2984r175Q957J8871
13846c648J2741J6237M570j0066K731q154l848j9776P518J4773q270n843K77N211
13832D453R770R001L790k519j8199j1029L718Q605L829j0218N49O136L460k765
13818H581k369M010L485m605M549O239J564j318N590n484L717m862K562j1152
13804A0507Q75J1087m813N00n194n821P929Q010O150N337k3177q524Q831J6935
13790B8632M122r142q310K550j6362j9832L092J2220K6792J300j3813j7960j885
13777h596J3722J5560K1130p718k6488j7663P851K481J322j045L41M26O166J6816
$$ plain form
13873 16303 3461 -4151 -6674 2210 12723 22131 25639 16080 21883 26398 18519 5170 -5353
13860 -5353 -8828 -2061 -23 5976 19271 26250 13355 11040 334 -9317 -22301 -31476 -22519 -3648
13846 -3648 9093 25330 29900 19834 22565 14411 10563 -9213 -1695 13078 4808 -1035 -758 4453
13832 4453 14223 23224 27014 24495 6296 -4733 -1015 7590 11419 1201 1750 7886 11346 8581
13818 8581 6212 10222 13707 9102 13651 19890 21454 20136 25726 20242 23959 19097 21659 10507
13804 10507 11382 22469 17656 18156 12962 7141 15070 23080 29230 34567 11390 2866 11697 28632
13790 28632 32754 23612 15302 17852 1490 -18342 -15250 -3030 23762 25062 11249 -6711 -8596
13777 -8596 5126 20686 41816 34098 7610 -10053 -2202 279 1601 556 897 1323 7489 24305
13763B4305L906j8169j3953K722k273J496Q037N815o944o356O692j849N037M638
13749A3104j7089j453o007L71P09K0063R614M211J491k573q429k394R527Q549
13735B9694m792k520j2805l997o606Q725K0163q250l338P885k852j9099P968J2082
13721B2258p320r274J680K027j89J6639N097j1867l277j4059n828J0429J9869
13708B6185L796j0748m889j9152P176L5126K0908J6790k2398j3030j827p616J706
13695C2027p212N142P675m651p745j7065k986q746K388p410n521Q539J5019M546
13681A4000m569n431n397L702J4592K4026M115P268m371j4512q514j5381o15J8435
13667B7348o587k1026N49J2781M365J1405q087m806P044j1605J817K391N590J827
$$ plain form
13763 24305 28211 10042 -3911 -1189 -3462 -1966 6071 11886 4942 -1414 5278 3429 8466 13104
13749 13104 -3985 -5438 -11445 -11074 -10365 9698 19312 23523 25014 22441 14012 11618 21145 29694
13735 29694 24902 22382 9577 5580 -1026 7699 27862 19612 16274 24159 21307 2208 10176 22258
13721 22258 14938 5664 7344 9371 9182 25821 30918 19051 15774 1715 -4113 6316 26185
13708 26185 29981 19233 14344 -4808 2368 37494 58402 75192 52794 39764 37937 30321 32027
13695 32027 24815 29957 37632 32981 25236 8171 5185 -3561 -1173 -8583 -14104 -5565 9454 14000
13681 14000 9431 4000 -1397 2305 16897 40923 45038 52306 47935 33423 24909 9528 8913 27348
13667 27348 20761 -265 284 13065 17430 28835 20748 15942 22986 11381 13198 15589 21179 23006
13653B3006K4985K721r481r855M339j0899q929P895Q947L615j1267j2048K586
13640A5615M973P214M649P414p939K281j6556j0339Q070M89l130K0887J3169j7128
13626B9669j5252j4194k180P481Q797J0415P181k0621J6639J6838k0239o785P917
13613B5666j5191J643J4243P203o362o015J1972j4235k860n216l681K113J7367
13600B6647Q770j0095k4865K486N705j7464J233J7153K46k671j080j6220R501
13587f54l16Q18J8815L665j6423K015M056N05j2174l769J7955K0821K0107j3156
13573D2265j0074q895n756l093j926L4l019J735K328q243J040l565L981l673j0417
13558g278M065Q831k597J5658N082p906k947j1314O277J5472q22P006j2069n316
$$ plain form
13653 23006 47991 50712 41231 31376 35715 24816 15887 23782 32729 36344 25077 13029 15615
13640 15615 20588 27802 32451 39865 31926 34207 17651 7312 15382 15871 12741 33628 46797 29669
13626 29669 14417 223 -1957 5524 14321 24736 31917 11296 27935 44773 24534 17749 25666
13613 25666 10475 12118 26361 33564 27202 21187 33159 18924 16064 10848 7167 9280 26647
13600 26647 35417 25322 457 2943 8648 -8816 -7583 9570 9816 7145 6065 -10155 -654
13587 -654 -970 -152 18663 22328 5905 7920 11976 12481 307 -3462 14493 35314 55421 42265
13573 42265 32191 23296 17540 14447 12521 12555 9536 11271 13599 5356 6396 2831 6812 3139 -7278
13558 -7278 -3213 5618 3021 18679 23761 15855 12908 1594 7871 23343 22521 29527 17458 12142
13544A2142J2988K4289j0037l5552r012J8074R419l065j0299j81j2714k878J9277
13531A2451J9623j2306r614J0029M596j1830o783k0024P93J1583R044J1137R687
13518B8386P482p509K041j0538k0263r46L655m887n30J1823O739p070q420q433
13504h470Q327J4185K706Q918K776J0809M808k254j5801l236k936P803j9573p196
13490H66J7202J3382K104M9N114m152o437n528m494j1750Q876O103j345o790n53
13475A2647Q552p31j0063j316J032J1688M975Q15k838j0112j8005o196J04l946
13461a3394j614K3834n158p80j503j600J2828P984j6031j3246J1381r799n637
13448a2735N575J0264J1456J5188j438Q812j039k276j8991j254J2765l952j6012
$$ plain form
13544 12142 25130 49419 39382 3830 -5182 12892 22311 19246 8947 8766 -3948 -6826 12451
13531 12451 32074 19768 10154 20183 24779 12949 6166 -13858 -13065 -1482 7562 18699 28386
13518 28386 35868 28359 30400 19862 -401 -1347 2308 -2579 -3109 8714 15453 8383 -37 -8470
13504 -8470 -143 14042 16748 25666 28442 39251 44059 41805 26004 22768 19832 27635 8062 866
13490 866 18068 31450 33554 33603 38717 34565 28128 22600 18106 6356 15232 21335 19990 13200 12647
13475 12647 21199 20468 10405 9089 10121 21809 26784 27599 24761 14649 -3356 -9552 -9448 -13394
13461 -13394 -15008 8826 3668 2888 1385 -215 12613 20597 4566 -8680 2701 -7098 -12735
13448 -12735 -7160 3104 14560 29748 28310 37122 36083 33807 14816 13562 26327 22375 6363
13435F363k492r923J3278J3728M37J2776l479Q615M259J352j3033j23j0432r408
13421A1918J701J2334m434r680q283K995O156m921O038J0950J7181l203j6738
13408B2014r579m649J2115J1819m299m267k32j040R199P137J8085j1045J203n86
13394D5875j7206l44J253J6435P515K224j661j0701n688n064L453J0619j2576
13381C4134r363J8628j228j3712j573O767Q770l840J094R922J8627k514o959K754
13367F1507j46q861o095l2467j2171R632J4393q505K903j0162j5256J0628J5762
13354B1162J2522l378Q05J756l09j230q738n469L123j1991J6491j142P452q964
13340B2090L054K3523j428j280o190j1435P885J2935j0657J300R462R92M154Q065
$$ plain form
13435 6363 3871 -6052 7226 20954 21391 34167 30688 39303 43562 44914 31881 31758 21326 11918
13421 11918 13619 25953 21519 11839 3556 6551 12707 7786 13824 24774 41955 38752 22014
13408 22014 12435 7786 19901 31720 27421 23154 22922 21882 31081 38218 56303 45258 46461 45875
13394 45875 28669 28325 29578 46013 53528 55752 54091 43390 37702 32638 36091 46710 34134
13381 34134 24771 43399 42171 28459 26886 33653 42423 38583 39677 49599 68226 65712 58753 61507
13367 61507 61361 52500 46405 13938 1767 11399 25792 17287 20190 10028 -5228 5400 21162
13354 21162 33684 30306 31111 32867 32558 31328 22590 17121 20244 8253 24744 23602 31054 22090
13340 22090 25144 48667 47239 45959 39769 28334 36219 49154 38497 39797 49259 50251 54405 62470
13326F2470m043J721k0676k0872m130j5067O789J7566Q692r661j870K2588J8001
13313F1508Q620j3481K162n699l174p701K1927j030j0118J8119L702j754n63o907
13299F5611j4537J228k231o083M57Q579O838j5215j3588j8301n136R234J1268
13286B8124K2970J0752p439k502q433p890R449o788j7865J8910Q729j8841j8484
13273A0692J8192K9804n875j2540J0374K7085J4664l4339k4592J0760J7119Q710
13261G0054j1226j0984q372m623Q973Q247N476K7830J6783j3078j5957P890j011
13248H0002N442J2190J804J318k242J4836j3208o955M741Q494J2075Q300K173
13235A28970J6125O118J7732K6796M1605O2124M2433P9365R5436J30288J97838
$$ plain form
13326 62470 58427 60148 39472 18600 14470 -597 6192 23758 32450 22789 20919 43507 61508
13313 61508 70128 56647 58809 53110 49936 42235 64162 63132 53014 71133 74835 73081 72518 65611
13299 65611 51074 52302 50071 43988 44445 53024 59862 44647 31059 12758 7622 16856 28124
13286 28124 51094 61846 54407 51905 43472 35582 45031 38243 20378 39288 48017 29176 10692
13273 10692 28884 58688 52813 40273 50647 77732 92396 58057 33465 44225 61344 70054
13261 70054 58828 47844 39472 34849 43822 52069 57545 85375 102158 89080 73123 81013 80002
13248 80002 85444 97634 99438 100756 98514 113350 100142 93187 97928 106422 118497 126797 128970
13235 128970 145095 151213 168945 195741 237346 299470 341903 421268 516704 646992 844830
13224H44830K36868K28268R8634n5086j67628k07219j81779j51224j18847r6881
13214D29936q6494m9951k5864k6648l2537k3612l3469l0489R890L943j2875k2279
13202I9551j440K37j6113j6243n009N910N599L367P177o789j917M117p313P005
13188G8139J0199j9796l311J8465J0827L410r132r786M057p354l284r204o882
13175E6348o211n023J227J1572N269j7700K3156O605N593L140o614j5674k40j684
13161E9764j900n034l015o889J9608p677k2003K0272J8343j528k0442l72N833
13148E4960R422O210R646J0298p269r636J5948o773o023j231o552j2838j5275
13135D0887Q661K7506K2481K4982O356L676j2801j0163p734J076R525J0127k0140
$$ plain form
13224 844830 1081698 1309966 1408600 1353514 1185886 978667 796888 645664 526817 429936
13214 429936 343442 293491 267627 240979 208442 184830 151361 120872 130762 134705 121830 99551
13202 99551 98111 98348 82235 65992 60983 66893 72492 75859 83036 76247 74330 78447 71134 78139
13188 78139 88338 68542 65231 83696 94523 97933 88801 79015 83072 75718 72434 63230 56348
13175 56348 50137 45114 46341 57913 63182 45482 68638 75243 80836 83976 77362 61688 61448 59764
13161 59764 57864 52830 49815 42926 62534 54857 32854 53126 71469 69941 49499 49127 54960
13148 54960 64382 70592 80238 90536 83267 73631 89579 82806 76783 75552 69000 56162 40887
13135 40887 49548 77054 99535 124517 130873 134549 121748 111585 103851 104927 114452 124579 104439
13122A04439j1148k145r904j4602J1116O912P581N866K076m066r599m124R082
13109I1484m445q950P110J1871p186o692n317K4619J6586o800j7l97K505J5739
13095A30110k690J0804l309j5345P565j4634j0109N211J1054Q476r0K767Q318
13082A38128P249J5323J901l598Q3L296L2741q197n031k395k2825k4718m939q905
13068A18113j7718J170r492q475m438K2487J0412O151o323j1081q382j633J3163
13055A03954j1794N588J1037o727j2750m416J0369J8943L628L807l995j4189R445
13042A12900N621J3185Q169l1020j8514k267P041J9824J7131M625K3333M3654
13030B03682L550m313J1380J3681L2J3577l671N509K8924O490N077j023j9870
$$ plain form
13122 104439 93291 91146 81242 66640 77756 84668 92249 98115 100191 96125 86526 82402 91484
13109 91484 87039 78089 85199 97070 89884 83192 77875 102494 119080 112280 112263 111866 114371 130110
13095 130110 127420 138224 134915 119570 127135 112501 102392 107603 118657 127133 127043 129810 138128
13082 138128 145377 160700 162601 159003 159086 162382 195123 186926 181895 179500 156675 131957 127018 118113
13068 118113 100395 101565 92073 83598 79160 101647 112059 118210 111887 100806 92424 90791 103954
13055 103954 92160 97748 108785 102058 89308 84892 95261 114204 117832 121639 117644 103455 112900
13042 112900 118521 131706 139875 108855 90341 88074 95115 114939 132070 136695 160028 203682
13030 203682 207232 202919 214299 227980 228012 241589 237918 243427 272351 278841 283918 282895 263025
13017B63025k2928n0727m7285j5658k2033r006n002J3050J460O641O449K318M533
13004A24837L096R807J3801j0933j0430K071J1274J1854Q47L564K5844J1485j097
12991A96020j0823m308j5299O967J5191j669q361M0599K1392J1313M850l369r441
12978B43062l6767K354J3642O908r579L065j467q856K980r394k1296j2293r693
12965A62666j4550j7541k2813m630L37R735P354K9107J6521O384k93l075j4908
12952A54294J8420J2342j6789k820J3716j74J1599o24r118J0286J6804J446j1402
12939A97980k049J4980o38P307o205O186M358J1531R504m394o282j1228R596K4354
12925B55000J3761k8937K690J3384K489n958K0439J8685j479M205N423o154j3189
$$ plain form
13017 263025 240097 189370 142085 126427 104394 95388 90386 103436 104896 111537 117986 120304 124837
13004 124837 127933 137740 151541 140608 130178 132249 143523 155377 156224 159788 185632 197117 196020
12991 196020 185197 180889 165590 172557 187748 186079 177718 218317 239709 251022 255872 252503 243062
12978 243062 206295 208649 222291 229199 219620 222685 221218 212362 215342 205948 184652 172359 162666
12965 162666 148116 130575 107762 103132 103469 113204 120558 149665 166186 172570 172277 169202 154294
12952 154294 172714 185056 168267 165447 179163 178989 190588 189964 180846 191132 207936 209382 197980
12939 197980 195931 210911 210273 217580 211375 217561 221919 233450 242954 238560 232278 221050 230646 255000
12925 255000 268761 239824 242514 255898 258387 252429 272868 291553 290074 294279 299702 293548 280359
12912B80359k6736J9527J9505j1482o778q063R41N528J5928L527P432J539j3441
12899B87786k3793k3567j5139k9116l4619k5684O098O9967O6461O4525N4944K3727
12887D21590k971j1411j5945K14K018J1031J6318K4662N437o294J4420J8549O769
12874D84387q945L779J4941R079l654O076p634L3192K1501j1796m490k456K4151
12861E58131L2211R468R94j864J1164K5448J0124R822N068K1145K4553M8025J2027
12848G66316Q145J8842J2761P080J7304J0892P730R854K7812K7683K7109K1836
12836I63364K1603L8320L3025M0781L7376L0737M6190M9027N3798M7041K8233
12825A389495L6079N2771L2965M5606N1360O1245O8474N5636O8334Q5760O7467
$$ plain form
12912 280359 253623 273150 292655 281173 274395 266332 267273 272801 288729 292256 299688 301227 287786
12899 287786 263993 240426 225287 196171 161552 135868 141966 211933 278394 342919 397863 421590
12887 421590 418619 407208 391263 391477 393495 404526 420844 445506 450943 444649 459069 477618 484387
12874 484387 475442 479221 494162 503241 499587 505663 498029 531221 552722 540926 536436 533980 558131
12861 558131 590342 599810 600804 598940 610104 635552 645676 655498 660566 681711 706264 754289 766316
12848 766316 774461 793303 806064 813144 830448 841340 849070 858924 886736 914419 941528 963364
12836 963364 984967 1023287 1056312 1097093 1134469 1165206 1211396 1260423 1314221 1361262 1389495
12825 1389495 1425574 1478345 1511310 1556916 1608276 1669521 1737995 1793631 1861965 1947725 2015192
12814B015192P3255Q5029P8741J03785J32446J13281J13086J16425J25517J34539
12804C091296J62250J69514K06211K14685J97447K00558K16972K30984K12251
12795D902168K37872K75183L30060L91451M22910M63209N35848O31795P39880
12786H930376Q64543J016328J175712J377932J610595J831055K001757K173455
12778B0981753K464803K960994L759531M929020O622085R168259J3039410J9025606
12770H2951461K8060919M0323597N2316424N2192707K8264004o214875l2299436
12763B45594801m2889143m2431121l7310168k9561124k1604103j5349969j0974468
12756D5474705q057605o072751m613529l545264k837872k389299k084366j827249
$$ plain form
12814 2015192 2088447 2173476 2252217 2356002 2488448 2601729 2714815 2831240 2956757 3091296
12804 3091296 3253546 3423060 3629271 3843956 4041403 4241961 4458933 4689917 4902168
12795 4902168 5140040 5415223 5745283 6136734 6559644 7022853 7558701 8190496 8930376
12786 8930376 9794919 10811247 11986959 13364891 14975486 16806541 18808298 20981753
12778 20981753 23446556 26407550 30167081 35096101 41718186 50886445 63925855 82951461
12770 82951461 111012380 151335977 203652401 255845108 284109112 277894237 245594801
12763 245594801 202705658 160274537 122964369 93403245 71799142 56449173 45474705
12756 45474705 37417100 31344349 26730820 23185556 20347684 17958385 15874019 14046770
12748A4046770j546042j279239j076942r29959q15079p09515o44381n58041n11279
12739E976293m76773m27652l90195l63289l21760k94614k58797k10913j87496
12730C044804j76733j43917j25888j08240r8752r8846j18157j20138j00640p9859
12720A873634p3888o9101n9129n3957n9128n4584o6420m7901m1761l1872l9905
12709A275988m6535m8602n3097m2157m7716m0227j5031j3542j5974K387n941k7181
12697I22372l0525j8514k1583j6258j6039k7870l0005l3691l1817J728j1836l1831
12685F54131k9536j9343M456j7488j5254q889K672P113M962o955j3250L796q917
12672E57498m232k1160k4523j3617r887k7751k7759j7303n960J9601n43k3084
$$ plain form
12748 14046770 12500728 11221489 10144547 9214588 8399509 7689994 7045613 6487572 5976293
12739 5976293 5499520 5071868 4681673 4318384 3996624 3702010 3443213 3232300 3044804
12730 3044804 2868071 2724154 2598266 2490026 2391274 2292428 2174271 2054133 1953493 1873634
12720 1873634 1799746 1730645 1671516 1617559 1558431 1503847 1437427 1389526 1347765 1315893 1275988
12709 1275988 1229453 1180851 1127754 1085597 1037881 997654 982623 969081 953107 955494 949553 922372
12697 922372 891847 873333 851750 835492 819453 791583 761578 727887 696070 697798 685962 654131
12685 654131 624595 605252 609708 592220 576966 568077 570749 577862 582824 575869 562619 566415 557498
12672 557498 553266 532106 507583 493966 484079 456328 428569 411266 405306 424907 424364 401280
12660D01280j1537l2844j2494K133L745J1497j0311j9228l906n955j7963r603
12648B94814l797J1674K4322J5378L6083L6772O1711Q2372Q8952L9765m5479o7851
12636E74716p0114m4689m3622k6609j9790l5929j2912k7286j8922r491J4059o827
12624B72584k4169n339o470o253k4141q362J730j1847k561P588K9192P105M77
12611B29534N04J6823J7400m97r388k3968j7918j2693l1319q870K1034O670K495
12598A89807J0274k535p958k3J866l741N497j7l0767J5306M63r699n226M498Q454
12583A76199L162p442k1924r302Q114j593j9594j2159J3669J9999L714K4342L1759
12570B08944Q529o962R363j7924j3975j4579j1295k5012k4037j6503o101N821
$$ plain form
12660 401280 389743 356899 344405 346538 350283 361780 351469 332241 328335 322380 304417 294814
12648 294814 291017 302691 327013 342391 378474 415246 476957 559329 648281 688046 642567 574716
12636 574716 504602 459913 416291 389682 369892 333963 321051 293765 274843 265352 279411 272584
12624 272584 248415 243076 236606 230353 206212 197850 199580 187733 185172 192760 221952 229057 229534
12611 229534 230038 246861 264261 263764 254376 230408 212490 199797 168478 159608 180642 187312 189807
12598 189807 200081 197546 189588 189565 191431 187690 193187 193170 162403 177709 178172 168473 163247 167745 176199
12583 176199 179361 171919 149995 140693 148807 147214 127620 115461 129130 149129 152843 177185 208944
12570 208944 217473 210511 219874 201950 187975 173396 162101 137089 113052 96549 90448 96269
12558I6269p909J5162r613l1192q657M859K060J2790p31J861J3028J8933J0790
12545A17650l025k0190j631J518j2667p791J0061L215J6570J1370n450j729K2700
12532A30601j435j3061o601O513P055k867n57J0947J0087K556q564K076j609P686
12518A42827N871j0517L673O079J3516k65j5595k6467J303k569k1600j819Q332
12505A02769r676j2257j5283k138L576N431j148N752J7346j7604J546J4568L065
12492I5947k70k0551N191J3104k681O381n185M505K507P758q924J511m155m567
12478I0571J6414K38j1482j4961Q478k619P208K0476l774j4722n922k778J337
12465H8464O841R28L845p558r617j1686p272j1779k2361j1947q727p506P040J4408
$$ plain form
12558 96269 88360 103522 93909 62717 54060 58919 60979 73769 73038 74899 87927 106860 117650
12545 117650 114625 94435 92804 94322 81655 73864 83925 87140 103710 115080 109630 107901 130601
12532 130601 129166 116105 109504 116017 123072 120205 119648 130595 140682 143238 134674 136750 135141 142827
12518 142827 148698 138181 141854 147933 161449 161184 145589 119122 120425 117856 96256 94437 102769
12505 102769 93093 80836 65553 63415 66991 72422 71274 77026 94372 76768 78314 92882 95947
12492 95947 95677 75126 80317 93421 90740 97121 91936 96441 98948 106706 97782 99293 95138 90571
12478 90571 106985 107223 95741 80780 89258 86639 93847 114323 110549 95827 89905 87127 88464
12465 88464 95305 96233 100078 92520 82903 71217 63945 52166 29805 17858 9131 1625 8665 23073
12451B3073J9184J6054j4411j6297J0100M009O76J0253J4053j4756j0385L46J640
12438D3539l154K70J5962j366j4073P3K1112J2868J8701J455j2368p471K06q68
12424G4886m802P98l74j988l067k1455n263o780J3428J6843P231j3476j0716J4794
12410F0059J1202J567J1344M202L259j0296j1324o647r001O74M866O49K206o020
12396E6740j176J4370J0177L830l171m028J8169R456k8960j5861J608L3574L083
12383I7811j5850N180L281p492K555R201N707P761O836J2892k2218j7929M970
12370I2705N591P221M128J1781o406j0188L03j0320j877J5351j1279k214J697
12357I6493R098j114r750j06p792J8036n877N155J7011j463j1042j1620L223K2138
$$ plain form
12451 23073 42257 58311 43900 27603 37703 41712 42388 52641 66694 51938 41553 41899 43539
12438 43539 40385 40655 56617 55251 41178 41251 62363 75231 93932 95387 83019 75548 75754 74886
12424 74886 70084 70882 70508 68520 65453 43998 38735 31955 45383 62226 69457 55981 45265 60059
12410 60059 71261 72828 84172 88374 91633 81337 70013 63366 54365 55039 59905 60554 62760 56740
12396 56740 55564 69934 80111 83941 80770 76742 94911 104367 75407 59546 61154 94728 97811
12383 97811 81961 87141 90422 82930 85485 94686 100393 108154 114990 127882 105664 87735 92705
12370 92705 98296 105517 109645 121426 115020 104832 105135 94815 92938 108289 97010 94796 96493
12357 96493 105591 104477 94727 94621 86829 104865 98988 104143 121154 119691 108649 97029 100252 122390
12343A22390l249k1511n801o336l785J3040j826K372M418N223N130Q999J3083
12330A32147P474L520k1344j7644N775J1173l742M168J9524J6375M284L693Q389
12317A73792O999J1843J7554o442J00L5187K0097N1981L7332N0931R8132J37092
12305F34598J77254K25621K30636J44636K1358r5849j66934j92309j74983j56594
12295F47434j24621r3422n8720m8418l1796k2943k2835j9833j3767p919k6804
12284A76356j9133M102P919J2520J9004J2947K432J5284K5446p62j8313k2982
12272B14820l736j7047j0183l1314o350j6640q374J451P514J0427p587j8032O175
12259A21124J3982J950o40j1065q628Q287J217K450m093K253j0283k1552J0489
$$ plain form
12343 122390 119141 97630 91829 85493 81708 94748 92922 95294 99712 104935 110065 119064 132147
12330 132147 139621 143141 121797 104153 109928 121101 117359 121527 141051 157426 161710 165403 173792
12317 173792 180791 192634 210188 203746 203846 239033 259130 311111 348443 399374 497506 634598
12305 634598 811852 1037473 1268109 1412745 1434103 1338254 1171320 979011 804028 647434
12295 647434 522813 429391 370671 322253 290457 267514 244679 224846 211079 203160 176356
12284 176356 157223 161325 169244 181764 200768 213715 216147 231431 256877 256115 237802 214820
12272 214820 211084 194037 183854 152540 146190 129550 121176 122627 130141 140568 132981 114949 121124
12259 121124 135106 137056 136416 125351 116723 125010 126227 128677 124584 126837 116554 95002 105491
12246A05491J5573J2927K112p259N323j5477k642K1770M222j787j905N215J4524
12233A58087J1768K139j453j4435k1079Q850N715p879Q70O887J1031l382Q129
12220A65248k2468m039o460j80Q334R691J407k846K216J9684M827r685Q533L689
12206A77951o202l694M658J1963R612Q459n065j6842R294K1527j9210n728k077
12193A84646O871O037J0320J476m927n523j6174k853J1486j3035q90J0296j5953
12180A71777j461J5407J4111n464k4626j196P743J4518P155J7754L790Q069r058
12167B18519q520j417J8791J7924Q523q882m231J021J1623O853j1192k3292R684
12154B35404R699o196k369j146O32l903l168K1223Q995Q55j092J1176K0927j9974
$$ plain form
12246 105491 121064 133991 136103 128844 134167 118690 116048 137818 142040 140253 138348 143563 158087
12233 158087 169855 171994 170541 156106 135027 143877 149592 141713 142583 149470 160501 157119 165248
12220 165248 142780 138741 132281 132101 140435 150126 151533 148687 150903 170587 175414 165729 174262 177951
12206 177951 171749 168055 172713 184676 194288 202747 197682 180840 190134 211661 192451 186723 184646
12193 184646 191517 197554 207874 209350 204423 198900 182726 179873 191359 178324 177434 187730 171777
12180 171777 170316 185723 199834 194370 169744 168548 176291 190809 197964 215718 219508 227577 218519
12167 218519 209999 208582 227373 245297 253820 244938 240707 241728 253351 260204 249012 225720 235404
12154 235404 245103 238907 236538 235392 236024 232121 228953 250176 259171 260026 258934 270110 291037 271063
12140B71063n329o660P931K1758J3582r079q597q418J5547M292k3456l487l398
12127B65749J4507K3503J3975J234K283K424j3251M169N750O591k335N245q776
12114C21068j1924J4394M0513K6044j698l169j2742l097O082k252J322K5339P385
12101D07265J525L450K296o907o25M042q142p061P945J0334K9551K7145J7994
12088D88812M58j5381l044R445j1732O09J5369J5912N607j3874M811P080Q781
12075E12853L131J4776J8065O308j0770M877J5080k814J4029N479J6140L2348
12063F29502K4333N750Q051k019J2434O118J5593J7437K373j683J4719J7993Q437
12050G59038J4295J7630K6962Q882Q494R946J6597r470l368J3346K1059K1789
$$ plain form
12140 271063 265734 259074 267005 288763 302345 293266 284669 276251 291798 296090 272634 269147 265749
12127 265749 280256 303759 317734 318968 321251 323675 310424 314593 320343 326934 324599 329844 321068
12114 321068 309144 323538 364051 390095 388397 385228 372486 369389 375471 373219 374541 399880 407265
12101 407265 408790 412240 414536 407629 407004 411046 402904 395843 403788 414122 443673 470818 488812
12088 488812 489270 473889 470845 480290 468558 469167 484536 500448 506055 492181 496992 504072 512853
12075 512853 515984 530760 548825 555133 544363 549240 564320 561506 575535 581014 597154 629502
12063 629502 653835 659585 667636 665617 678051 684169 699762 717199 719572 717889 732608 750601 759038
12050 759038 773333 790963 817925 826807 835301 845247 861844 852374 849006 862352 883411 905200
12038I05200K5820L9462K9300l852j4958J3397K0242K2400J6739J5630K4226L1915
12026A125521J304R513K3632K1702K6170M1696J4304K4708K8657K6208J6741K9651
12014A389807L7664N1716K7488L2978J7676K6799L6214M3551M0135L9917N7243
12003A801188O5773N7520N1883J0695K410K9689L9057O0673N4131N0839M4901
11992B268759M7128N5763N5273M7576O1315Q4461O4861O1800P1525P0674O3479
11981B952614O8390Q5159Q9393P4663Q7042P7918R8797R8524P9817Q8068J04652
11970C905037J08855J12526J04390R0792R6926R7498J23442J32302J25924J11865
11960E009557J17383J27309J27881J03172J23237J29098J15840J00886J15182
$$ plain form
12038 905200 931020 970482 999782 995930 980972 994369 1014611 1037011 1053750 1069380 1093606 1125521
12026 1125521 1126825 1136338 1159970 1181672 1207842 1249538 1263842 1288550 1317207 1343415 1360156 1389807
12014 1389807 1427471 1479187 1506675 1539653 1557329 1584128 1620342 1663893 1704028 1743945 1801188
12003 1801188 1866961 1924481 1976364 1987059 1989469 2019158 2058215 2118888 2173019 2223858 2268759
11992 2268759 2315887 2371650 2426923 2474499 2535814 2620275 2685136 2746936 2818461 2889135 2952614
11981 2952614 3021004 3106163 3195556 3270219 3357261 3435179 3533976 3632500 3712317 3800385 3905037
11970 3905037 4013892 4126418 4230808 4321600 4418526 4516024 4639466 4771768 4897692 5009557
11960 5009557 5126940 5254249 5382130 5485302 5608539 5737637 5853477 5954363 6069545
11951F069545J25842J18464R9414J07318Q0220R0863Q6173P9284P9340N5710M3228
11940G035401N2342L9503J1891K1872R499O676o955k9744k5947j8584l8333o1611
11928F996010o7628r3423q8289p0254q0332r6887j17167j10896j00599j08432
11918F062103j05443j06682j26025j20945j23316j24771j20872j21477j37777
11909D974795j24734j21443j11049r8737j22433j12831j21441j21865j04744q2325
11899C853193j00643j08189j09072j12744p7389q3386p8400q1420p3457p6843
11889B951650p9758n9645p3899m3391m5764o6364q9520p3124m8441o4540n8637
11878B248567m9468n7980n6611n3999m9453l4053n2667n7524l9015m3772m6810
$$ plain form
11951 6069545 6195387 6313851 6413265 6520583 6600803 6691666 6777839 6857123 6936463 6992173 7035401
11940 7035401 7087743 7127246 7139137 7161009 7170508 7177184 7170229 7140485 7114538 7095954 7057621 6996010
11928 6996010 6928382 6834959 6746670 6676416 6596084 6499197 6382030 6271134 6170535 6062103
11918 6062103 5956660 5849978 5723953 5603008 5479692 5354921 5234049 5112572 4974795
11909 4974795 4850061 4728618 4617569 4518832 4396399 4283568 4162127 4040262 3935518 3853193
11899 3853193 3752550 3644361 3535289 3422545 3345156 3261770 3183370 3101950 3028493 2951650
11889 2951650 2871892 2812247 2738348 2694957 2649193 2582829 2493309 2420185 2371744 2307204 2248567
11878 2248567 2199099 2141119 2084508 2030509 1981056 1947003 1894336 1836812 1797797 1754025 1707215
11867A707215m0794l3421k8881m6112l5396k2810k7551l3528l2621k6224l4243
11856A345634l7394j5705l2824k0062j4216l5830l5631j6825o74n503j0523k3358
11844A097089l0262k0918j8763m569j2959k4467j1466j3565j2759J066p697l8115
11832I02615l8246k3031j8627l235m199k0073j9608q009M847j0358k3746k8541
11820G09789O302k312l579j2602k0879k1366o401l764p998j1025j2826q301n573
11807E99465O662q195l3221k5868k557M173k321J474r818j5291l219m369j0316
11794D96599j4728J406L229j1026j2038j2277P468O741j967p477p787j0030q944
11781D29169j2295r530m303o520j2068J079P530L067R424r624l4796O448R945
$$ plain form
11867 1707215 1666421 1633000 1604119 1558007 1522611 1499801 1472250 1438722 1406101 1379877 1345634
11856 1345634 1308240 1292535 1259711 1239649 1225433 1189603 1153972 1137147 1136473 1130970 1120447 1097089
11844 1097089 1066827 1045909 1027146 1022577 1009618 985151 973685 960120 947361 948427 940730 902615
11832 902615 864369 841338 822711 819476 815277 795204 775596 767587 772434 762076 738330 709789
11820 709789 716091 713779 710200 697598 676719 655353 648952 645188 637190 626165 613339 605038 599465
11807 599465 606127 597932 564711 538843 536286 540459 538138 539612 529794 514503 511284 506915 496599
11794 496599 481871 483277 486506 475480 463442 451165 458633 465374 463407 455930 448143 438113 429169
11781 429169 416874 407344 403041 396521 384453 385532 393062 396129 405553 395929 361133 367581 377526
11768C77526j2234j3285N256K293Q546Q016p262m473k921j4620j7466j2943m955
11755C11478j3030k201m509k795J1086J2313J3025L005o626r072j4562j2737p642
11742B77733j2933j928j1836k4991o623p378j3748j452J3550J6169L0155O555
11730B63273k554j0825j5288k0901o552J961M456P629j36o154J1126J1513o925
11717B30623n710j2576l777N943J718j872M641j1488M349k805r939j1252r923
11704A77932J8224L592k132O32j842j2431k851J519k0033o946k888J524o221R456
11690A57535J0560N793j1313k3588n605m468n825J5888K4785L290q599R105K22
11677A67780m040o511n300k956k274O661O845N548l855l39p670M88o394N298q372
$$ plain form
11768 377526 365292 352007 357263 359556 368102 376118 368856 364383 361462 346842 329376 316433 311478
11755 311478 298448 296247 291738 288943 300029 312342 325367 328372 321746 312674 298112 285375 277733
11742 277733 264800 262872 251036 226045 219422 212044 198296 196844 210394 226563 256718 263273
11730 263273 260719 249894 234606 213705 207153 209114 213570 221199 221063 214909 226035 237548 230623
11717 230623 224913 212337 208560 214503 216221 214349 218990 207502 211851 209046 199107 187855 177932
11704 177932 196156 199748 197616 198248 196406 183975 181124 182643 162610 155664 152776 154300 148079 157535
11690 157535 168095 173888 162575 138987 133382 128914 123089 138977 163762 167052 158453 167558 167780
11677 167780 163740 157229 151929 148973 146699 153360 160205 165753 161898 161559 153889 154377 147983 153281 144909
11662A44909j0228j5221p32p583K960L223j757L226r787m887J0866q56R589J3878
11648A37600L036l964j1002J0315L784j1627M032n946j2677m491l488N148N904
11635A16624j9389j4564M776K0837N668R510j4727k4578P708J2758m555m367n746
11622H9955Q027k884J603O053k928J0393J0290M857l409j1713q195k86n65k4076
11608G7122J502P571J7487K2835j3903k2340n341P765R730p573j7989j0557J0125
11595G6434K2189p436j1763J1425O411q601M148M327m757q723m814r446P5n866
11581F3603N783O509j3333P523J1698N731N347q313O353Q156o823l203l794m709
11567H0528L306p033j7508O103O429K046O070j522p698j7486J1039k184j2623
$$ plain form
11662 144909 134681 119460 118728 111145 114105 117328 115571 118797 109010 104123 114989 114133 123722 137600
11648 137600 140636 136672 125670 135985 139769 128142 132174 126228 113551 109060 105572 110720 116624
11635 116624 97235 82671 87447 108284 113952 123462 108735 84157 91865 104623 100068 95701 89955
11622 89955 97982 95098 96701 102754 99826 110219 120509 125366 121957 110244 102049 101763 101198 77122
11608 77122 78624 86195 103682 126517 112614 90274 84933 92698 102428 94855 76866 66309 76434
11595 76434 98623 91187 79424 90849 97260 88659 92807 97134 92377 83654 78840 69394 69469 63603
11581 63603 69386 75895 62562 70085 81783 87514 92861 84548 90901 99057 92234 89031 85237 80528
11567 80528 83834 76801 59293 65396 71825 73871 79941 78419 70721 53235 64274 62090 49467
11554D9467J3899J7890q310l554J6593N982k257P3L178r980p512L820J2P381k334
11539H4348j2737k4799j0770Q717J0653J3287p964j4219m425M769l215j2K36j0061
11525C3808j0460j0307P744J4282j0814J2793K1392J0847O630P398r012q271j0878
11512E5152j327q95n978O550K5439m57k779j2973r055O943p709J0040q546J574
11498E5979K029q603j100r200Q54M140J105j4483n166J4085K2050J3947r342k5692
11484D0603m683K807M438j4844q027J046M981J647J4567r080J5270Q462j2857
11471D4330j5623o78P305J3027J8435r519k2290j1192O038J0237J0590J2163O821
11458F9644o548N945j2361p153L128q093n037J314j7648K0874K4834k60q7P331
$$ plain form
11554 49467 63366 81256 72946 69392 85985 91967 89710 89783 92961 82981 75469 79289 79301 86682 84348
11539 84348 71611 46812 36042 44759 55412 68699 60735 46516 42091 46860 43645 43633 43869 33808
11525 33808 23348 13041 20785 35067 24253 37046 58438 69285 75915 83313 74301 66030 55152
11512 55152 53825 52930 46952 53502 78941 78484 75705 62732 53677 60620 52911 62951 54405 55979
11498 55979 58008 49405 48305 39105 39959 44099 45204 30721 25555 39640 61690 75637 66295 40603
11484 40603 35920 38727 43165 28321 20294 21340 26321 27968 42535 33455 48725 57187 44330
11471 44330 28707 28029 35334 48361 66796 57277 34987 23795 29833 40070 50660 62823 69644
11458 69644 63096 69041 56680 49527 52655 44562 39525 40839 23191 44065 68899 68639 68552 75883
11444G5883j651M88j2507j1874J6971j1119k1484j1864N376J4857p165L591K1889
11431F1391Q690k9948j6793k0826k880K5639J9993J2952n737q120j1207L336J4953
11418E1443L893j1600K03m46k939l281L991q192n685l940J45p716j5158j350J3191
11403A2559J4828J7960J268K721j1514k9594j2836o433J5646J4604J595J9330
11391D0134J4784n288q453o907k547j3398j841J2897K707k1495q235J1898J3774
11378B8030l742l457O075R186M604j043k0123j0137J3385k1155r170J8543P096
11365A8092J0782j1187p733K4193N191j772n007j5038J0479j018r591J170K336
11352B0897J7987m921r859k4628J3936J0479M607N408k859k40n036J927j0363
$$ plain form
11444 75883 74232 74720 62213 50339 67310 56191 34707 22843 28219 43076 35911 39502 61391
11431 61391 70081 40133 23340 2514 -366 25273 45266 58218 52481 44361 33154 36490 51443
11418 51443 55336 43736 43939 43493 40554 37273 41264 33072 27387 23447 23592 15876 718 -632 12559
11403 12559 27387 45347 46615 49336 37822 8228 -4608 -11041 4605 19209 20804 40134
11391 40134 54918 49630 41177 34270 31723 18325 16484 29381 32088 10593 2358 14256 28030
11378 28030 24288 20831 26906 36092 40696 39653 19530 9393 22778 1623 -7547 10996 18092
11365 18092 28874 17687 9954 34147 39338 37566 32559 17521 28000 26982 17391 18561 20897
11352 20897 38884 33963 24104 -524 13412 23891 28498 33906 31047 30807 25771 27698 17335
11339A7335j1486J0357j93R695Q767j1403m858m504M931J3632J396l454P143j3679
11325B3679q927Q901N054J4097j8067j3890O658n137k736J8782Q467J9665M449
11312F0995k1588j2360L54n509m788M688M875j2138q673J9292O459l416Q161r08
11298C5444q124j2482p661J219Q817J8238k59r690o326k2856p774P657J2001K420
11284A0624M179N474L262N736o094l730O953j969q653m179J3315J2376m015j782
11270C1497j3437j4124o377l046j329K2884O727M810j7849Q445R439P698K179
11257C7517j7599m595R217O366l63L929L957j3863k807j050K887r765j0287M256
11243G800O668J9800J6436k7174k1981J4251J16n037J1592J721J2037O897j1061
$$ plain form
11339 17335 5849 16206 16013 25708 34475 23072 18214 13710 18641 32273 33669 30215 37358 23679
11325 23679 14752 23653 28707 42804 24737 10847 17505 12368 9632 28414 36881 56546 60995
11312 60995 39407 27047 27401 21892 17104 21792 26667 14529 5856 25148 31607 28191 36352 35444
11298 35444 27320 14838 7177 8396 17213 35451 35192 25502 19176 -3680 -11454 -3797 8204 10624
11284 10624 14803 20277 23539 29275 23181 19451 26404 24435 15782 11603 24918 37294 33279 31497
11270 31497 18060 3936 -2441 -5487 -6816 16068 22795 27605 9756 18201 27640 35338 37517
11257 37517 19918 15323 24540 30906 30543 34472 38429 24566 21759 20709 23596 13831 3544 7800
11243 7800 14468 34268 50704 23530 1549 15800 15916 10879 22471 24192 36229 43126 32065
11230C2065J614P503q851Q848J2099r319k596j4676k4351j4913J1834J3416N895
11217A8568J843N47O110M613r854j7309J752r53J2451J0543J9699q55j8044L866
11203C2977L972l116J210j34j9303j3200J1858N603M612R229o661M893N34N146
11189C7620n682k8371j3679L330N254m850J588j777r0n014j314K946m94J3017
11175B484J3674o356N665P070p053k505N744q666n787n058J5065J4085M33j1614
11161A7181n110M17q257m482m152J463J5722j0758l094m37J1979J2617o468k4485
11147g864r189J1520O875j834m054j2484K2749J9871O012O136J3993m373k0173
11134B7185j3911P056j763M843l112Q99N300m668k011j1202k227O39j6779p124
$$ plain form
11230 32065 33679 41182 32331 41179 53278 43959 41363 26687 2336 -12577 -743 12673 18568
11217 18568 20411 20958 27068 31681 21827 4518 6270 5317 17768 28311 48010 47155 29111 32977
11203 32977 36949 33833 35043 34909 15606 2406 14264 19867 24479 33708 27047 31940 32474 37620
11189 37620 31938 3567 -10112 -6782 -1528 -6378 -4790 -6567 -6657 -11671 -12985 -10039 -10533 2484
11175 2484 16158 9802 15467 22537 15484 12979 18723 10057 4270 -788 14277 28362 28795 17181
11161 17181 12071 12488 4231 -251 -4403 -2940 12782 2024 -1070 -1507 10472 23089 16621 -7864
11147 -7864 -17053 -5533 1342 -492 -4546 -17030 5719 25590 31602 37738 51731 47358 27185
11134 27185 13274 20330 18567 23410 20298 21197 26497 21829 19818 8616 6389 7028 -9751 -16875
11120a6875K3953k324o315J5545M434R877P56k674K215P960K5997R54j0648K278
11106E5133q349j5812k0407P90R006m862O063J0127l067k872R573p678j8309j1988
11092b652k448M772q380P401N817J3500K490n553j3836N005J0271M631l507l398
11078A4113j9264l753p263l079J0969K0429J4321j0637L582J4448L42l729K370
11065C2849n522j5908n311P885K8921Q468k316p362j733M440K338p770l259J5782
11051E1502J7442k013N757P958K3573n334j4187q671M99J9163L546n060K7809
11038A21984M931N07k012O992J2787k153j3155K626K385L25k33Q10O267J2001
11024A54062L2810l817K54k661r711k2720k2671k9581n154J1328J9971P735n586
$$ plain form
11120 -16875 7078 4754 -1561 13984 18418 28295 29051 26377 28592 36552 62549 63503 52855 55133
11106 55133 46784 30972 10565 11355 20361 15499 21562 31689 28622 25750 35323 27645 9336 -2652
11092 -2652 -5100 -328 -8708 -1307 4510 18010 20500 14947 1111 6116 16387 21018 17511 14113
11078 14113 -5151 -8904 -16167 -19246 -8277 12152 26473 15836 19418 33866 34208 30479 32849
11065 32849 27327 11419 6108 13993 42914 51382 49066 41704 39971 44411 46749 38979 35720 51502
11051 51502 68944 66931 72688 80646 104219 98885 84698 76027 76526 95689 99235 94175 121984
11038 121984 126915 127422 125410 132402 145189 143036 129881 132507 134892 135217 134984 135794 142061 154062
11024 154062 186872 183055 183309 180648 170937 148217 125546 95965 90811 102139 122110 129845 124259
11011A24259O958L809j0408o486k184n748k941k5142j4110R04J7647L258n789
10998H4027P460m786n358L558k1133j3680j3558j4778K887q825M296R634J814
10985C1558l203L56O115n444J8236J73j1387p470R435j563o685k6294j2505K4589
10971A5911K0545n757l161J4382k941l766p267j0147M080j0172M964J160J608
10958A9439N009J6826j293j5285r643K119j3144p714P903J2709O872K4614j667
10945D6745k3474J5848l678N347K717p946n821K676n446R859R991k3530p819M299
10931A9768n948N848K0911R374n533n673k6944J375J1955M962p625J1570L384
10918C7424m474J1074n875p899M512N924j5062j7582J5999J1252o438j403N612
$$ plain form
11011 124259 131217 135026 124618 118132 115948 110200 107259 82117 68007 68911 86558 89816 84027
10998 84027 91487 86701 81343 84901 63768 50088 36530 21752 24639 15814 20110 29744 31558
10985 31558 28355 28711 34826 29382 47618 47791 36404 28934 38369 36806 30121 3827 -8678 15911
10971 15911 36456 30699 27538 41920 38979 35213 27946 17799 21879 11707 16671 17831 19439
10958 19439 24448 41274 39981 24696 15053 17172 4028 -3686 4217 16926 23798 48412 46745
10945 46745 23271 39119 35441 40788 43505 35559 29738 32414 26968 36827 46818 23288 15469 19768
10931 19768 13820 19668 40579 49953 44420 38747 11803 13178 25133 30095 22470 34040 37424
10918 37424 32950 44024 38149 30250 34762 40686 25624 8042 24041 35293 28855 27452 33064
10905C3064o981L812m548j1128k845J4395K526J4109M269J255K425j4686j3955
10892B1712J1604Q626n456r656j2683J1799K7035P624j8542k320p204o037l850
10879B2652J6471l268k742N339J3460j646J957j388J1889J1799k0882l412j2583
10866C7646k47J0095m956k2419L86N489J779K912m788o725L968J862J3771O467
10852D5240j481q996P114J5313R677j0895n145j3740n742P890j1028N584J6783
10839E0574p72j4205P196q057J1180J6884j1319N338N282K557O024l137k0366
10826D7179k1966q704J4498R165K2444L834K1k79K979q57J5065J7422j7838j6818
10812F6145Q72r072r392p784l893j375k196O36Q344J1120j57M212p57j0330j4569
$$ plain form
10905 33064 26083 29895 25347 14219 11374 25769 28295 42404 46673 47928 50353 35667 21712
10892 21712 33316 41942 36486 26830 14147 25946 52981 60605 42063 39743 32539 26502 22652
10879 22652 39123 35855 33113 38452 51912 50266 52223 50835 62724 74523 53641 50229 37646
10866 37646 37399 47494 42538 20119 20505 25994 27773 30685 25897 19172 23140 25002 38773 45240
10852 45240 43759 34763 41877 57190 66867 55972 50827 37087 31345 39235 28207 33791 50574
10839 50574 49802 35597 42793 34736 45916 62800 51481 56819 62101 64658 70682 67545 47179
10826 47179 25213 16509 31007 40172 62616 66450 66471 66192 69171 68314 83379 100801 82963 66145
10812 66145 67017 57945 48553 40769 36876 35501 33305 33941 42285 53405 53248 57460 56703 46373 31804
10797C1804n180O932Q37M753nQ006O501j515k755O91M151q629L413o993j0608
10782C1403j2668K5725Q972k4624q650J5618J0144p4J2349J2301K415j6215j1016
10769D5680R661J203j3709o193J681j445o310J6797K2063N716n005k692j0081
10756E7366K935j518l182r192k764J715K1n343P306p22j0874q204m190l613M339
10741B4080J3963J6810L608o819l765j0295r066r171K3797O520K029K450L886
10728E8027L493j6913K555K6839J1569J3209m097j4021j0121J7232O289N856L948
10715A03865j1623n093L124J3014n454p732J180J9354J7452j575j6808o881J2352
10702A15175J2900J2582j5498J964J3628J6196l077q87J5812K4793O857q727k937
$$ plain form
10797 31804 26624 33556 34393 39146 39141 47147 53648 52133 49378 50069 54220 45591 49004 42011 31403
10782 31403 18735 44460 53432 28808 20158 35776 45920 45846 58195 70496 72911 56696 45680
10769 45680 55341 56544 42835 36642 38323 36878 30568 47365 69428 75144 70139 67447 57366
10756 57366 60301 58783 55601 46409 43645 45360 45381 40038 47344 46622 35748 27544 23354 19741 24080
10741 24080 38043 54853 58461 51642 47877 37582 28516 19345 43142 49662 51691 54141 58027
10728 58027 61520 44607 47162 74001 85570 98779 94682 80661 70540 87772 94061 99917 103865
10715 103865 92242 87149 90273 103287 97833 90101 91281 110635 128087 126512 109704 102823 115175
10702 115175 128075 140657 125159 127123 140751 156947 153870 152983 168795 193588 200445 191718 188781
10689A88781P778j696j4114j6547O448J0244l508R509K1787R992k252k350n012
10676B09060J401R153J7467J4681M354N643J7137P572J6004J2410M978m126j2267
10663C03467R396J9905K0777O869J2086L0891J3746O658j310nK6358L1089J9959
10650D99886J4583K9615M6750L0765J3942L3488K5481L4805N8475L2512N1112
10639H71414L1782N2482N7004P3353J05048J10127J05079J00703J22017J20600
10629A749609J45850J82325K19899K55459L42564M28564N86397P54836R39872
10620E605375J174421J363261J377540J171330P62059L35757M6537n6182M6438
10611A1826536L38541Q07474J380236J991433K471084K482800J882053Q02383
$$ plain form
10689 188781 196559 194863 180749 164202 170650 180894 177386 186895 208682 218674 216422 214072 209060
10676 209060 210461 219614 237081 251762 256116 261759 278896 286468 302472 314882 319860 315734 303467
10663 303467 312863 332768 353545 360414 372500 403391 417137 423795 422485 422480 448838 479927 499886
10650 499886 514469 544084 590834 621599 635541 669029 694510 729315 787790 820302 871414
10639 871414 903196 955678 1012682 1086035 1191083 1301210 1406289 1506992 1629009 1749609
10629 1749609 1895459 2077784 2297683 2553142 2895706 3324270 3910667 4665503 5605375
10620 5605375 6779796 8143057 9520597 10691927 11453986 11789743 11836280 11780098 11826536
10611 11826536 12165077 12972551 14352787 16344220 18815304 21298104 23180157 23982540
10603B3982540k79266r47629j097638q38895k62348N40118J454323K326623K892153
10594B7769981K751793J682565K422j540250k450012k657474k344675j689645
10586B1524705q60108K0506P56282J190937J063682L10650q26855j786716k282780
10577A9110303k328508k021203j515531r77464n00420j53336O0390J2099l35603
10568A1350727p55281j108226j297143j300462j175773r93515q00138o47496n00837
10559B771856l86009l07999k35050j95858j54156j52654j24912r7397r2153q1574
10549I44094q2578o0525n9307n6219m6996l8462l8927l3008k3669j9979k3053
10538D61371k3593k4756k3216n199j1415j2431k2667m0001j2026q601K532o207
$$ plain form
10603 23982540 23703274 22755645 21658007 20819112 20556764 21096882 22551205 24877828 27769981
10594 27769981 30521774 32204339 32206761 30666511 28216499 25559025 23214350 21524705
10586 21524705 20664597 20685103 21441385 22632322 23696004 24006654 23179799 21393083 19110303
10577 19110303 16781795 14760592 13245061 12267597 11767177 11613841 11674231 11686330 11350727
10568 11350727 10595446 9487220 8190077 6889615 5713842 4720327 3920189 3272693 2771856
10559 2771856 2385847 2077848 1842798 1646940 1492784 1340130 1215218 1117821 1025668 944094
10549 944094 861516 800991 741684 685465 638469 600007 561080 528072 504403 484424 461371
10538 461371 437778 413022 389806 384607 373192 360761 338094 298093 286067 277466 279998 273791
10526B73791j3644R731Q915k563j2976m016j0917l561j3845k8303p896r631j1798
10513A73287N059m984k296Q11j2440q561J0769j146R26o532j0160O907J5383m214
10499A62809R51J426J1537j6305j7467n591p258O210n516j4032k794J444o343
10486A09071Q115l710O725k0321j4828M982K8440R953Q272r456k1210j7913M333
10473I2453J0643Q39N12O62J2046n348j4307o63k056j574K206O7L598n509m18
10458I3151L2n334m549K762K482j8428P838K2493j7054m457L144R941j3026j8178
10444F0817p819J6165N121q521j4735l149l09P782l824j4775j0308L526M819L095
10430C7885N450L270J0997J745k6511J0405q956j0602p034M054j3945J7680R284
$$ plain form
10526 273791 260147 269878 278793 276230 263254 259238 248321 244760 230915 202612 194716 185085 173287
10513 173287 178346 173362 171066 171877 159437 150876 161645 160499 161425 154893 144733 151640 167023 162809
10499 162809 163760 165186 176723 160418 142951 137360 130102 136312 130796 116764 113970 115414 109071
10486 109071 117186 113476 120201 99880 85052 90034 118474 128427 136699 127243 106033 88120 92453
10473 92453 103096 103935 104447 105109 117155 111807 97500 96837 94781 93207 95413 95480 99078 93569 93151
10458 93151 93183 87849 83300 86062 88544 70116 77954 100447 83393 78936 82080 92021 78995 60817
10444 60817 52998 69163 74284 65763 51028 47879 47570 55352 51528 36753 26445 29971 34790 37885
10430 37885 43335 46605 57602 59347 32836 43241 34285 23683 16649 20703 6758 24438 33722
10417C3722k790l112L195j422J357m233J4031J3536p018j5024j2031l864N134
10404B1481m777J5313J2249j2412j1989j189k122j1433P411K801J8910O79j744
10391C3178K982P440J128K492k272j1606n359J2608k2358j3655k537p826J8282
10378A2497J6895k8m916r580j0164K627O85L916N442P832q602R59j7505J1466
10364A1524J1880p280j8671l914M783K0896J073R741n003m789Q064m502m825J3502
10350C2479o836q315J324Q254q241k198P480M96K004o783M537J3827Q917q378
10336C8567j0246J111m897j5906q257J3789l452N821P761O57Q471J2380j37K099
10322D7761j8725j6291R476n088j0127J802q218o704J3113M339m217k2K42j4985
$$ plain form
10417 33722 30932 27820 31015 29593 30950 26717 40748 54284 47266 32242 20211 16347 21481
10404 21481 16704 32017 44266 31854 19865 18676 16554 5121 12532 15333 34243 34922 33178
10391 33178 36160 43600 44728 47220 44948 33342 27983 40591 18233 4578 2041 -5785 12497
10378 12497 29392 29364 24448 14868 4704 7331 8016 11932 17374 25206 16604 17563 58 11524
10364 11524 23404 16124 -2547 -6461 -1678 19218 20291 30032 25029 20240 28304 23802 18977 32479
10350 32479 25643 17328 18652 26906 18665 16467 23947 24443 26447 19664 24201 38028 46945 38567
10336 38567 28321 29432 24535 8629 372 14161 10709 16530 24291 24948 33419 45799 45662 47761
10322 47761 29036 12745 22221 17133 7006 8808 590 -6114 6999 11338 7121 7099 7341 -7644
10308g644q976J2035N836k580J1961j451o13J0815J861O32K187M067j7816k97
10294A0017n043j275J1225k2627j052J5319n425j5512Q972J2804m551n012l861
10281f021j282J944j676j2180Q179L2781J6365J4397l506j0614j5493j7257Q655
10268A4292R789J7325j8917k0270J16l711m926o398K616j0038P369N074O013J0857
10254I191p493r389j812j594Q105j363k549K088Q116m746r9j2146p253N073J3615
10239b256J8509N345M733J857r838o790j9812p172J6479M924k0120m890Q020J265
10225i746K08J614l604k671K60j305K465L610j2718J5093P460R7j0898j0562p015
10210b7712r288J002K9226J7091Q893M128k1509q866n752l772O686n397O559M297
$$ plain form
10308 -7644 -16620 -4585 1251 -1329 10632 9181 8568 19383 21244 21876 24063 28130 10314 10017
10294 10017 4974 3699 14924 -7703 -8755 6564 1139 -14373 -5401 7403 2852 -2160 -6021
10281 -6021 -7303 -5359 -7035 -19215 -11036 21745 38110 52507 49001 38387 22894 5637 14292
10268 14292 24081 41406 22489 2219 2335 -1376 -6302 -12700 -10084 -20122 -12753 -7679 -1666 9191
10254 9191 1698 -7691 -9503 -11097 -2992 -4355 -6904 -4816 3300 -1446 -1545 -13691 -20944 -15871 -2256
10239 -2256 16253 21598 26331 28188 18350 11560 -8252 -15424 1055 5979 -14141 -19031 -11011 -9746
10225 -9746 -9538 -7924 -11528 -14199 -13939 -15244 -12779 -9169 -21887 -6794 666 763 -10135 -20697 -27712
10210 -27712 -37000 -35998 -6772 10319 19212 23340 1831 -7035 -12787 -16559 -9873 -15270 -8711 -4414
10196d414J0734P359J0000O044j4571n730J7387P169m565J0267R117r172q194
10183C1431J2087O680Q652J0759P077J72j2700P707J0675j3356L923R699Q123
10170I0929J1634J5882N317j70M78k4161r923j0817m41J7541K7640R742J0476
10157A44127J4905L267J0588j178j2591j8258k332k750l566Q045J2694l041j8840
10144A31070L118j4702j2022m372j3805q251j1037j0148j3136J1873J823R669
10132G0080j0506P775j1693p421q227m854k0233j2585J6469q440o098j1512m346
10119a1591p294j1601q392K2193K0356R189l39n446j044K216N187L684j027m309
10105A1782q471p643J4570j024l623P457l920j4049O761j7912j3812J153J2130
$$ plain form
10196 -4414 6320 13679 23679 29723 15152 9422 26809 33978 29413 39680 48797 39625 31431
10183 31431 43518 50198 58850 69609 76686 76858 64158 71865 82540 69184 73107 82806 90929
10170 90929 102563 118445 123762 123592 124070 99909 89986 79169 78728 96269 123909 133651 144127
10157 144127 159032 162299 172887 171709 159118 140860 138528 135778 132212 140257 152951 149910 131070
10144 131070 134188 119486 107464 103092 89287 81036 69999 59851 46715 58588 60411 70080
10132 70080 59574 67349 55656 48235 40008 35154 14921 2336 18805 10365 4267 -7245 -11591
10119 -11591 -18885 -30486 -38878 -16685 3671 12860 12521 7075 6031 8247 13434 17118 16091 11782
10105 11782 3311 -4332 10238 9214 5591 13048 9128 -4921 1840 -16072 -29884 -28731 -16601
10092a6601J4110K889J2142K4640K960j5502k2075o389J5536R534j5725O451N55
10079A2525k984o102k1423J0702J4979R362N411N700j0254n281p561j7015P22
10066a1219J629J3008L42j5502n055j3001J4298J5817q440m163J2107K662P730
10053A0213K866J2625k473j0726j2924r603N611o201J9665l706m029M487j0351
10040d546j7596Q538K4713n090j8426K333J0744J0218j96r64j0357p578O980n881
10026g108M268n901N347L784j718L809J1383Q449j1398j9428P323R84P462j8284
10012a1028j8555O709O562J5137Q243j2212q248M821K6010M745N346j998r390
9999A6142k3745j0187J019J8046J33K526o576n395O73J3177j5102l459L621K362
$$ plain form
10092 -16601 -2491 398 12540 37180 40140 24638 2563 -3826 11710 21244 5519 11970 12525
10079 12525 9541 3439 -17984 -7282 7697 17059 22470 28170 17916 12635 5074 -11941 -11219
10066 -11219 -9590 3418 3760 -11742 -16797 -29798 -15500 317 -8123 -12286 -179 2483 10213
10053 10213 13079 25704 23231 12505 -419 -10022 -4411 -10612 9053 5347 1318 5805 -4546
10040 -4546 -22142 -13604 11109 6019 -12407 -10074 670 10888 10692 9728 -629 -8207 -1227 -7108
10026 -7108 -2840 -8741 -3394 390 -1328 2481 13864 22313 10915 -8513 -1190 -206 7256 -11028
10012 -11028 -29583 -22874 -16312 -1175 7068 -5144 -13392 -8571 17439 22184 27530 25532 16142
9999 16142 -7603 -17790 -16771 1275 1408 3934 -2642 -8037 -7364 5813 -9289 -12748 -9127 -6765
9985f765j1029n708J262r41N400L071J0594o129n67L09J4282M36J1716K0742j3137
9970B3536q531l861k510j4859j073L475k364j453j2052P061J2360l859J1048K0108
9956B7026N373N69j858k13P80m970p435Q149P306j5910l3325r385q301J3980J8946
9941G32J5400m028k0723k1645R245Q83J028N604Q550K553J1356J1696j3389N669
9927A2931J680M300P799o469k3801r166p240m693R464K0218o550N874q292q765
9913a2710j5587M523J4127q265l919n250j2866J7411J0496N436R093O253j2324
9900c582n041p841k940N559N551j0291l138K932Q206P792l345l719J08R16J5348
9885F515K5578j9128k1312K2497P080m106l230r761l9450j7415J1365N493J2261
$$ plain form
9985 -6765 -17794 -23502 -22240 -23181 -17781 -14710 -4116 -10245 -10812 -10503 3779 4215 15931 36673 23536
9970 23536 15005 11144 8634 -6225 -7298 -3823 -6187 -7640 -19692 -12631 -271 -4130 6918 27026
9956 27026 32399 32968 31110 30897 31677 26707 19272 27421 34727 18817 -14508 -23893 -32194 -18214 732
9941 732 16132 12104 -8619 -30264 -21019 -20136 -19108 -13504 -4954 -2401 8955 20651 7262 12931
9927 12931 14611 18911 26710 20241 -3560 -12726 -19966 -24659 -15195 5023 -1527 4347 -3945 -12710
9913 -12710 -28297 -23774 -9647 -17912 -21831 -27081 -39947 -22536 -12040 -6604 2489 8742 -3582
9900 -3582 -8623 -16464 -19404 -13845 -8294 -18585 -21723 -18791 -10585 -2793 -6138 -9857 -9749 -8833 6515
9885 6515 32093 12965 -8347 14150 21230 17124 13894 4133 -35317 -52732 -41367 -35874 -23613
9872b3613L883m313K103K248J2718J0365L95M568j904r825p284q110O995J8612
9858F838J7170J835k3850o583k044j1444j6748p048P790J7425n997J3243L308
9845f105k201L451J2645o024j6018J6323K80r689j5774K919P843J0232L715k003
9831d06J0127m938j0017k79J4720Q132Q999j397J028J192P362l591j4937r203
9817F792j0892P325J0029j1624r456j22K648L045K3084J8351O012k290j0299J3981
9803D6584J9218K0267j582j317N313Q680l204j132k1650k5397j8734m081N576
9790B8541J999r802J849L448M551J8303Q484O163J466L0098N5000O3879M2307
9777B56286L4782j3798m8173m7337m4774l4916k6006o592j8713j4876j9284j2203
$$ plain form
9872 -23613 -19730 -24043 -21940 -19692 -6974 3391 3786 8354 6450 -3375 -10659 -18769 -11774 6838
9858 6838 24008 25843 1993 -4590 -6634 -18078 -34826 -41874 -34084 -16659 -22656 -9413 -6105
9845 -6105 -8306 -4855 7790 1766 -14252 2071 2351 -7338 -23112 -20193 -12350 -2118 1597 -406
9831 -406 9721 4783 -5234 -5513 9207 17339 26338 24941 25969 27161 34523 30932 15995 6792
9817 6792 -4100 3225 13254 1630 -7826 -7948 -5300 -2255 20829 39180 45192 42902 32603 46584
9803 46584 65802 86069 84487 83170 88483 97163 93959 92827 71177 45780 27046 22965 28541
9790 28541 30540 20738 22587 26035 30586 48889 57373 63536 65002 95100 150100 213979 256286
9777 256286 291068 277270 229097 181760 136986 102070 76064 69472 50759 35883 16599 4396
9765D396q179k630K284N555k864l243n876J0472J8182k894j0054r158m828j1048
9751a9885J7690K5545J0499r728j9046J095O132n090j0443q224J4144P471J2531
9738B2691K870j1804k4004M659J8647Q000J043m149r15M178r458j7169J0987R795
9724A5371k4113k650k102j813J478J0919q854L455J1317m499p080q950R118k1381
9710b9784K253J3634K970P022j1893l382l35K8941O938j7782Q62J4956M678p307
9696A1771p842q618j1968N903J1473j324R213N054J6783j2050j0310L54L167L560
9682A5166j3478J1835J0402k1487j6434M978J8723J1142j5172k0484N019O535
9670c255J1947L587q400j0284m269K0981j4n186N713N273R222J3205K6400L2324
$$ plain form
9765 4396 -3783 -6413 -4129 1426 -1438 -4681 -10557 -85 18097 15203 5149 -4009 -8837 -19885
9751 -19885 -2195 23350 33849 24121 5075 6170 12302 7212 -3231 -11455 2689 10160 22691
9738 22691 25561 13757 -10247 -5588 13059 21059 22102 17953 17038 21216 11758 -5411 5576 15371
9724 15371 -8742 -11392 -13494 -15307 -13829 -2910 -11764 -8309 3008 -1491 -8571 -17521 -8403 -29784
9710 -29784 -27531 -13897 -10927 -3905 -15798 -19180 -19515 9426 16364 -1418 -556 14400 19078 11771
9696 11771 3929 -4689 -16657 -10754 719 -605 8608 13662 30445 18395 8085 8439 11606 15166
9682 15166 1688 13523 23925 2438 -13996 -9018 9705 20847 5675 -14809 -9790 -3255
9670 -3255 8692 12279 3879 -6405 -10674 10307 10293 5107 10820 16093 25315 38520 64920 97244
9656I7244K0319L4146J1085O266m320l3707m7671j4582j5601n637j1349k7081
9644I112J793Q734j1612n161k942N15Q15J6385k082j6840J4582O753j1630k0175
9630a1753j683J2354l159N709m937J872p345k189n052J2662M912j5622R777J5652
9616A1198N178j5076j5710r943J3833Q968n060m090N097J000o145K886O750r274
9602a0388j3881O219K4104J4914o097k0275l838J6961p006m108J630L206J0721
9589A2162O986j1385M54N320J4489r923l31j2975M64m475J891n075J713j1466
9575a2151l990R402Q988k249q154n445P991j2690J312O608l423Q965L675q935
9561a0096J2296j0976K477J5723j540o128j2531q834j3708K3536Q782n643m710
$$ plain form
9656 97244 117563 151709 162794 169060 164740 131033 83362 68780 53179 47542 36193 9112
9644 9112 10905 19639 8027 2866 -76 439 1254 17639 15557 -1283 13299 20052 8422 -11753
9630 -11753 -13436 -1082 -4241 1468 -3469 -1597 -8942 -11131 -16183 -3521 1391 -14231 -4454 11198
9616 11198 16376 1300 -14410 -24353 -10520 -1552 -6612 -10702 -5605 -4605 -10750 -7864 -1114 -10388
9602 -10388 -24269 -18050 6054 20968 14871 -5404 -9242 7719 713 -3395 -1765 1441 12162
9589 12162 19148 7763 8217 13537 28026 18103 17772 4797 5261 786 2677 -2398 -685 -12151
9575 -12151 -16141 -6739 2249 0 -8154 -13599 -5608 -18298 -16986 -10378 -13801 -4836 -1161 -10096
9561 -10096 2200 -8776 -6299 9424 7884 1756 -10775 -19609 -33317 -9781 -999 -6642 -11352
9548a1352j2521L706J6688J0124l505j564j2302J322Q274p565P118P516j7439
9535a1500R445J7860J5438P595j2825l54q109k077O178o665r767j930k68j495
9521A526j812L928l565o276J648P080j1083j1540J7822J4078j249Q67p636m530
9507g42q340J2202j42k600n387p121R27J92J3308J583N939o720j1414K969n566
9492a0912k777M585n715j1694J6916J7307J5276k190m061m128m686L085N934n460
9478A1480q878p12J0136l013j1239p870q113q45J413O222j6609K051J3151P859
9464d967Q316N128K600n653N426J083j176Q065j129m567j001M668j0270k877q978
9449e332p870j4945l154J4550K960L280R617j024M691j277M088J2357P976j4453
$$ plain form
9548 -11352 -23873 -20167 -3479 6645 3140 1576 -10726 -9404 -1130 -8695 -1577 5939 -11500
9535 -11500 -2055 15805 31243 38838 26013 25659 17550 15473 21651 14986 5219 3289 3021 1526
9521 1526 -286 3642 77 -6199 -4551 2529 -8554 -20094 -2272 11806 10557 11424 3788 -742
9507 -742 -9082 3120 2978 378 -5009 -12130 -11203 -11011 2297 3880 9819 3099 -8315 -5346 -10912
9492 -10912 -13689 -9104 -14819 -26513 -9597 7710 22986 20796 16735 12607 7921 11006 16940 11480
9478 11480 2602 1890 12026 9013 -2226 -10096 -18209 -19054 -17641 -11419 -28028 -25977 -12826 -4967
9464 -4967 3349 8477 11077 5424 10850 11933 10757 18822 17693 13126 12125 16793 6523 3646 -5332
9449 -5332 -13202 -28147 -31301 -16751 -13791 -10511 -894 -1918 2773 1496 5584 17941 25917 11464
9435A1464N224p243j0258o380K063n043l951j427o416J575K3303L317j1453j2435
9421a7660p962q105J0793M790K991M748q74Q496N586j3634m371o187Q150J2632
9407f07L81j1426J2281J8100K198l692j5741l739L301j6317p54K0165j4404J5411
9393E157K38K573N935L33p326j6259r752k886J6862O341p941j733J2486J3892
9379A7920J321K618j5945r240r136l605O154L856O398j690r371m825j478j0452
9365b7475O695j802Q840J1070K143J2632L979m644j0735j8500J514J8213k679
9352g49k017J9665J818l080j2975j971J5763J5628o243m438j5334j3658m286J5316
9338C439N572N115M013n354j253J1716j2955k3050o428R226J3542J2220r980N380
$$ plain form
9435 11464 16688 9445 -813 -7193 -5130 -10173 -14124 -15551 -21967 -20392 2911 6228 -5225 -17660
9421 -17660 -25622 -33727 -22934 -18144 -15153 -10405 -11279 -2783 2803 -10831 -15202 -21389 -13239 -607
9407 -607 -226 -11652 629 18729 20927 17235 1494 -2245 1056 -15261 -16015 4150 -10254 5157
9393 5157 5395 7968 13903 14236 6910 -9349 -19101 -21987 -5125 1216 -6725 -8458 4028 17920
9379 17920 19241 21859 5914 -3326 -12462 -16067 -9913 -6057 341 -1349 -10720 -15545 -17023 -27475
9365 -27475 -20780 -22582 -13742 -2672 -529 12103 16082 11438 703 -17797 -16283 1930 -749
9352 -749 -2766 16899 18717 15637 2662 691 16454 32082 25839 21401 6067 -7591 -11877 3439
9338 3439 9011 14126 18139 12785 11532 23248 10293 -12757 -19185 -9959 3583 15803 5823 11203
9324A1203r310n826P800N3J219m692L253n706k976J274N997n307k2572o105K7000
9309d695N705l453j2055j4572P560O831r69J0243J040K319l06P276N496O963K0228
9294C7611N208n486r583j3409J1917n929j3419q612J524L343J3698L070r971q418
9280A544M953L612N402K424m820j4820r621J6783N551k70m185k0334j6141K2543
9266g379K8887n954p135j2574o959R056P824k50j2526N614j4213M876R012p803
9252i524j0889J0054R187J3320n777j382L303m950K351J004j2965P180K6236P454
9238C4602k6728p388n79J5042n047j0566M093J5190q143m523M65L6M126O476j2708
9223D348j8629j9725q04O816J2667J4794J0001p294m123q624k205J6288l690k5726
$$ plain form
9324 11203 1893 -3933 3867 3920 5139 447 3700 -2006 -4982 -3708 2289 -3018 -25590 -31695 -4695
9309 -4695 1010 -2443 -14498 -29070 -21510 -14679 -15648 -5405 -4365 -2046 -2352 4924 10420 17383 37611
9294 37611 42819 37333 27750 14341 26258 20329 6910 -1702 -178 3165 16863 19933 9962 1544
9280 1544 6497 10109 15511 17935 13115 -1705 -11326 5457 11008 10738 6553 -13781 -29922 -7379
9266 -7379 21508 15554 8419 -4155 -11114 -2058 5766 5516 -7010 -1396 -15609 -10733 -1721 -9524
9252 -9524 -20413 -10359 -1172 12148 6371 4989 8292 3342 5693 6697 -6268 912 27148 34602
9238 34602 7874 486 -93 14949 9902 -664 3429 18619 10476 5953 6418 6454 10580 17056 4348
9223 4348 -14281 -34006 -34810 -27994 -15327 -533 9468 2174 -1949 -10573 -12778 3510 -180 -25906
9209b5906k768J1237J7189K6055o93m377j8893n480r019o004M310m949l950J5632
9195g616J1512k943k811q97N098m36J05J82j7132r996o083o24J2445L7Q827M478
9179e854j975O686M300m564M820p412q401p091p328O179J3108J2232Q089On936
9164F859k4056k710q324J7082O605k155Q025P797l356J5260J5611p209j3011k1948
9150e530m941J2002O780N766O037r587n294M610p648K082k61j2811O302Q172p684
9135b005n34j690J2279j0966l714J7293J842l159j2192j0868J3479J1738J067
9122A2570j4623r981O781P185m475M863j467K4121l08k314n167k3023j998l675
9108a1511J0669k132j2885M754q722j732L759J1281J4343l86j5966k317R732j2576
$$ plain form
9209 -25906 -28674 -17437 -248 25807 25114 20737 1844 -3636 -12655 -18659 -14349 -19298 -23248 -7616
9195 -7616 3896 953 -1858 -2755 2343 1907 2012 2194 -14938 -24934 -31017 -31641 -19196 -19159 -10332 -5854
9179 -5854 -7829 -1143 3157 -1407 3413 -3999 -12400 -19491 -26819 -20640 -7532 4700 12789 12795 6859
9164 6859 -17197 -19907 -28231 -11149 -4544 -6699 1326 9123 5767 21027 36638 29429 16418 -5530
9150 -5530 -10471 1531 8311 14077 20114 10527 5233 9843 2195 4277 4016 -8795 -2493 5679 -2005
9135 -2005 -2539 -4229 8050 -2916 -6630 10663 12505 9346 -2846 -13714 -235 11503 12570
9122 12570 -2053 -12034 -5253 1932 -2543 2320 853 24974 24666 22352 17185 -5838 -7836 -11511
9108 -11511 -842 -2974 -15859 -11105 -19827 -21559 -17800 -6519 7824 7438 -8528 -10845 -1113 -13689
9094a3689l548O700l80j0277J028K868O630J0084k53J6028K2692N030k3133n276
9080A4504l624l659J2004L98l939j3087j7100L895K2366r97k953j1737k958P023
9066A36P99M684o951q851k888J0098m106n470P663m7j648L344k559k565p438O380
9050i419K534O034P140l069K994J6228l942j7651j1681J4687n675p630N166J4345
9036A0061L541k2652n641M601L773R730N191j5680o460J1446J2068p922m472Q178
9022E762K504Q397k307p892J633n832j584L775q076n390j314j0678k683N173m374
9007b2886j564J0148J3398P868k264n289J6905N098r602j6857j88J070O275M21
8993B533j109Q36p631p594P50J0564j8206j4203J3108q296O632J2977m777o030
$$ plain form
9094 -13689 -17237 -10537 -10917 -21194 -20166 -17298 -10668 -584 -837 15191 37883 42913 19780 14504
9080 14504 10880 7221 19225 19623 15684 2597 -14503 -10608 11758 10761 7808 -3929 -6887 136
9066 136 935 5619 -1332 -10183 -13071 -2973 -7079 -12549 -4886 -4933 -6581 -3237 -5796 -8361 -15799 -9419
9050 -9419 -6885 -851 6289 3220 6214 22442 18500 849 -10832 3855 -1820 -9450 -4284 10061
9036 10061 13602 -9050 -14691 -10090 -6317 3413 8604 -7076 -13536 -2090 9978 2056 -2416 5762
9022 5762 8266 16663 14356 6464 8097 2265 681 4456 -3620 -9010 -10324 -21002 -23685 -18512 -22886
9007 -22886 -24450 -14302 -904 6964 4700 -589 16316 21414 11812 -5045 -5233 -4163 2112 2533
8993 2533 1424 2260 -5371 -12965 -12215 -1651 -19857 -34060 -20952 -29248 -22616 -9639 -14416 -20446
8979b0446J4992J9130L762j2075j0482J43m999O785n53L230J0652j235M586n708
8965G782n842o384K2003J0145k498j3091p500J3704o039k0990K141J4734J071
8952I236O750r119q969K293R930J7216K313m98j5188j1096j218n680J0896J5796
8938B2662K166m451N823k818M072n958l505J9947R414J797j2243q037j1793j935
8924A5141k648K063K844o971j4768P002m533j283m329N579J9021J2986q260k022
8910A9822k42q474p237P551O576Q909J0720J1027j1394k6108R1K080J1728J8279
8896D3328L617M564J172k626o993j0830p186n939n720P300J40j0964p421O583
8882I025J6557J1828j3417O71m262m189R786J0784q233j3867J7127J8991j1336
$$ plain form
8979 -20446 -5454 13676 17438 5363 -5119 -4976 -9975 -3190 -3743 -513 10139 8904 13490 7782
8965 7782 1940 -4444 17559 27704 25206 12115 4615 18319 12280 -8710 -6569 8165 9236
8952 9236 15986 6867 -2102 191 10121 27337 29650 29152 13964 2868 1650 -4030 6866 22662
8938 22662 24828 20377 26200 23382 27454 21496 17991 37938 47352 49149 36906 28869 17076 15141
8924 15141 12493 14556 17400 10429 -4339 2663 -1870 -3153 -7482 -1903 17118 30104 21844 19822
8910 19822 19580 11106 3869 11420 17996 26905 37625 48652 37258 11150 11241 13321 25049 43328
8896 43328 46945 51509 52681 50055 43062 32232 25046 19107 13387 20687 20827 9863 2442 9025
8882 9025 25582 37410 23993 24664 20402 16213 25999 36783 28550 14683 31810 50801 39465
8869C9465J571j0464k7953k8324K7236J2056P319j3989j3563Q341J216j1129K3352
8856A5134j4831q424J800R826K200J4702J2083O889M923j772P748M180j6426j5703
8842B2329J567l303j7239k984L549K4869J5101r906Q031R462j3007J7575P550
8829F3594M30n816K695j7609n874k913k273m327k381N944j1415q484j338L548
8815A3781m82q924r675P846O618J4195J6417p460k0856l536J6068O108p121q766
8801A4213j3761O678J878p233J266J8396r455N23K6540L472r031m287J9789P248
8787E6236j429M359p904L39P317j1660m292j514N909j2720j705R807p028j2997
8773B2718m070L600J0887j527j5823j2146r733P427j073J4191j1714M59n076O645
$$ plain form
8869 39465 41036 30572 2619 -25705 1531 13587 20906 6917 -6646 1695 2911 -8218 15134
8856 15134 303 -8121 -6321 3505 5705 20407 32490 39379 44302 42530 50278 54458 38032 22329
8842 22329 23896 20593 3354 370 3919 28788 43889 33983 42014 51476 38469 56044 63594
8829 63594 64024 58208 60903 43294 37420 34507 32234 27907 25526 31470 20055 11571 10233 13781
8815 13781 13299 4375 -5300 2546 9164 23359 39776 32316 11460 7924 23992 30100 22979 14213
8801 14213 452 7130 9008 1775 3041 21437 11982 12505 39045 42517 33486 29199 48988 56236
8787 56236 54807 59166 51262 51601 58918 47258 42966 41452 47361 34641 32936 42743 35715 22718
8773 22718 18648 22248 33135 31608 15785 3639 -6094 1333 260 14451 2737 3196 -1880 4765
8759D765J4323M351m778R721p160r045j827j080O746J2481p912r866R164j7242
8745B641J141J7723r44j1882M09P25j1355N074J7084J36p941J704j5197m791M478
8730i95J0064K1819J209n7O435j2682j3455J1992N351q833N25o256m819j2884
8716b586K83m850n9K1444N945j0138p044j6681q126K2169J7525K176M705k1646
8702C117j815j1532j9565J4157J8148J3942K0758o15j1693o989k4651M733J4619
8689A2614O702K958k2586r211J4816J7096J782n134p167J275m368R53N105J1590
8675B6425K516L569L323o304q004q269K561k613M211O208r581R423Q74p611k2105
8660e377k0479R566L2953P02k566J0615O69N726l782k2297q662k591L81Q340P119
$$ plain form
8759 4765 19088 23439 18661 28382 21222 12177 10350 9270 16016 28497 20585 10719 19883 2641
8745 2641 3782 21505 20561 8679 9088 9813 -1542 3532 20616 20752 12811 14515 -682 -5473 -995
8730 -995 9069 30888 32097 32040 38475 25793 12338 24330 29681 20848 21373 15117 10298 -2586
8716 -2586 -2303 -7153 -7212 14232 20177 10039 2995 -13686 -21812 357 17882 20058 24763 3117
8702 3117 1302 -10230 -29795 -15638 2510 16452 37210 36595 24902 17913 -6738 -2005 12614
8689 12614 19316 22274 -312 -9523 5293 22389 24171 19037 11870 13145 8777 9730 14835 26425
8675 26425 28941 32510 35833 29529 21525 13256 15817 13204 17415 23623 14042 23465 24339 16728 -5377
8660 -5377 -25856 -16290 16663 17365 14799 25414 26083 31809 28027 5730 -2932 -5523 -5142 3198 10317
8645A0317k781o646j9069m472J2025q703J2781P107P109k150P118j0539Q031J0522
8631B0650j5317J820R859q78l845j3436o177k006m4J4500R791M578Q848J833j3041
8616A7135p536J809m904n167n192j1505N939N464m621O530O754K4683J3387k0083
8602B2693n859J5531J0371o95r172k618j5422m740L677l072O591o249j636J330
8588A0730m478J467N878K87r847P791J715r963j0946J3856p710m927m758j4252
8574b5157r343J9484K1792N629K4230L007n493k3800j6036o664k715J5433J1988
8561A2355p153L335J0857J1282m972P853j6790k0078o643n32j801j6776N470O438
8547a7155J6521J7159J0985J061j6570n844n23j683N39p119j4659j184P20K1829
$$ plain form
8645 10317 7536 890 -18179 -22651 -10626 -19329 -6548 559 7668 5518 12636 2097 10128 20650
8631 20650 5333 7153 17012 16134 12289 -1147 -7324 -9330 -9374 5126 14917 19495 28343 30176 17135
8616 17135 9599 11408 6504 1337 -3855 -15360 -9421 -3957 -8578 -2048 4706 29389 42776 22693
8602 22693 16834 32365 42736 42041 32869 30251 14829 10089 13766 10694 17285 11036 9400 10730
8588 10730 6252 7719 13597 13884 4037 11828 13543 3580 -7366 6490 -1220 -6147 -10905 -25157
8574 -25157 -34500 -15016 6776 12405 36635 39642 34149 10349 -5687 -12351 -15066 367 12355
8561 12355 5202 8537 19394 30676 25704 33557 16767 -3311 -9954 -10486 -12287 -29063 -23593 -17155
8547 -17155 -634 16525 27510 28571 12001 6157 5634 3951 4490 -2629 -17288 -18472 -17752 4077
8533D077R225J8532J3487Q071J1430J0198j4040o57j2959j4427k837J1731k410
8520C9421j6679k1M908l448j5079J698R095J059N267k914R455k754p585K543j757
8505B3209j4061k809M058k827o647M190M993J4748J699k803J7408Q393j2508j7467
8491A9576l320K6458L1391Q334J0001L2993L2961P117j3198l6272j9501k0679
8479G5861j4443j3942r869j484j0419J886l438Q448r048k591J768P098N982n14
8465C5295l026Q92q830J460J0858o511j3368m736n267j4842l611K2527K8789K116
8451D1746j7378k320K058j1815k349O694O574n356J2957L3419J1910o982O295
8438G5453N270M307j1028k1189l2966j3502L966k045O564q083J0974p372m937
$$ plain form
8533 4077 13302 31834 45321 53392 64822 75020 60980 60323 47364 32937 30100 41831 39421
8520 39421 22742 22721 27629 24181 9102 10800 19895 20954 26221 23307 32762 30008 22423 24966 23209
8505 23209 9148 6339 10397 7570 923 5113 10106 24854 26553 23750 41158 49551 37043 19576
8491 19576 16256 42714 74105 82439 92440 125433 158394 165511 152313 116041 96540 75861
8479 75861 61418 47476 37607 36123 25704 27590 24152 32600 23552 20961 22729 29827 35809 35295
8465 35295 32269 33161 24331 25791 36649 30138 16770 12034 6767 -8075 -11686 10841 39630 41746
8451 41746 24368 22048 24106 12291 9942 16636 23210 17854 30811 64230 76140 69158 75453
8438 75453 80723 85030 74002 52813 19847 6345 10311 8266 14830 6747 17721 10349 5412
8425E412l46K555j3394J653J8386O173L859L352m036j5686k469m088o720n570
8411a0919M831L029J2206k861J118J3989l988n722K0384J4724k82n464J3289K2841
8397G7175J6086P337j7052j9866l745j2262j4272j0369N445N203o018k2284M974
8384A0352J8391J9669J620m147J0992j5025m915k1q946n938J7062M06K337Q53
8370D2690P207r454o326P6q212O898J2820n344j8145p431P750J9762p662O54K8087
8355F3370K9923J0959J9578K7530q038j6184j7599j5825k0602n429K872o104o046
8342E8405j3280m594j4502r513r885J3235K1146R854r631r519q071j0109l751
8329I785R145P430L457k643j5914J6088P723j5107j9764L638Q333M898R379J8926
$$ plain form
8425 5412 5066 7621 -5773 -4120 14266 20439 24298 27650 23614 7928 5459 1371 -5349 -10919
8411 -10919 -6088 -3059 9147 6286 7404 21393 17405 11683 32067 46791 46509 41045 54334 77175
8397 77175 93261 100598 83546 63680 59935 47673 33401 23032 28477 33680 27662 5378 10352
8384 10352 28743 48412 50032 45885 56877 41852 36937 36916 27970 22032 39094 39500 41837 42690
8370 42690 49897 40443 34117 34193 25981 32879 45699 40355 22210 14779 22529 42291 34629 35283 63370
8355 63370 93293 104252 123830 151360 143322 127138 109539 93714 73112 67683 70555 64451 58405
8342 58405 45125 40531 26029 16516 6631 19866 41012 50866 41235 31716 23645 13536 9785
8329 9785 18930 26360 29817 27174 11260 27348 35071 19964 200 3838 12171 17069 26448 45374
8315D5374j737k7987r252r5K4949L0796L0099J5071m257q400j7147l361R423r817
8301G3659j5603n071j6919j252q531N306k672k0368j1772o277l787J4558J788
8288C059K0108R891K502r481j617l762J5291m915j071l022o987Q632n518M882
8274B7992J2242j2820p59o893K436k858N690p099j0053K6694J4783R227k903r949
8260D5730j3308o407p621q845j766K6273J1077k887j7998P59j521j8973M76R913
8246A4902J0729L348p995j3638J3344L764P279l274J6543O463j228J309P2j8124
8232C3494n912O955q215r040J1618k325J1166l912l603l342J2426J1904r761M373
8218D5826k764j1202j6419n597O733M296P734K6566J091k1211p120J3482M978
$$ plain form
8315 45374 43637 15650 6398 6303 31252 62048 92147 107218 102961 94561 77414 74053 83476 73659
8301 73659 58056 52985 36066 34814 26283 31589 28917 8549 -3223 -9500 -13287 1271 3059
8288 3059 23167 33058 35560 26079 24462 20700 35991 31076 30005 26983 19996 28628 23110 27992
8274 27992 40234 27414 26655 19762 22198 19340 25030 17931 7878 34572 49355 58582 55679 45730
8260 45730 32422 26015 18394 9549 7783 34056 45133 42246 24248 25007 23486 4513 4989 14902
8246 14902 25631 28979 20984 7346 20690 24454 31733 28459 45002 51465 50237 51546 51618 33494
8232 33494 27582 34537 26322 17282 28900 26575 37741 33829 30226 26884 39310 51214 41453 45826
8218 45826 43062 31860 15441 9844 16577 20873 28607 55173 56264 35053 27933 41415 46393
8205D6393J710k442j259q221J106q373j4885Q984K419K638P576k096o056k176
8191B5318J1084J4821J7798l657j3027Q572n065q439j3136j0140M217M682q913
8178B4115j1653m778j3021m737N249K0157k485K044J4762J6822m310l233j9130
8165A9802j7629r89J60J823O320P682p32K341J414m932K320J232P991J0551J0627
8150D7981j062j1126j7307j9412r055j1723L888R185K1168J2410Q826J460M39
8137C5672r790J966j3135j3533n399M280K536m615j160k368M21J2532r815n819
8123h227j341j0899r470K0526O442n172J2750L983l435O094p234L669J0347J1140
8109B9173j1945l441O906o538o809j4351k025m044O366O116J42O631J7258k3r295
$$ plain form
8205 46393 48103 45661 44402 36181 37287 28914 14029 23013 25432 28070 35646 33550 27494 25318
8191 25318 36402 51223 69021 65364 52337 60909 55844 47405 34269 24129 28346 33028 24115
8178 24115 12462 7684 -5337 -10074 -4825 15332 12847 14891 29653 46475 42165 38932 19802
8165 19802 2173 1184 1344 3167 9487 17169 16437 18778 20192 15260 17580 18812 26803 37354 47981
8150 47981 46919 35793 18486 -926 -9981 -21704 -17816 -8631 12537 24947 33773 35233 35672
8137 35672 25882 27848 14713 1180 -4219 61 2597 -2018 -3178 -5546 -5125 7407 -2408 -8227
8123 -8227 -9568 -20467 -29937 -9411 -2969 -8141 4609 8592 5157 11251 4017 7686 18033 29173
8109 29173 17228 13787 20693 14155 7346 -7005 -9030 -13074 -6708 -592 -450 6181 23439 23416 14121
8094A4121R553j3216m665M019P546l074K407r80j248j6466P671J1881m993q353
8080D203l864N257K0142j062K430l967k354j7995q706N675L28J1008k924K3398
8066C1569j721k9283P263J4442R375K266j4057j7931j0789J3572J628j6724j491
8053a1881J0788N07O618K293m232j9385Q895m73N832K587l712L847j4026n222
8039a7564r0Q01J5442K7406M353j7278j4664K963N757Q129m851k5813p33K5334
8025I192J6913J5540q785p411j2151n398L224J3225K4170m942P60q887O224j1313
8011C0361j1651j91l192l381J3304p934J3655j4389j5768L122P99j659K054j5757
7997a0627Q893K3558K644k2434j6886J5360K0219m222j4172Q384J7532J2926j1052
$$ plain form
8094 14121 23674 10458 5793 9812 17358 14284 16691 15711 14463 -2003 5668 17549 12556 4203
8080 4203 339 5596 25738 24676 27106 23139 20785 2790 -5916 -241 87 11095 8171 31569
8066 31569 29848 565 7828 22270 31645 33911 19854 1923 -8866 4706 6334 -10390 -11881
8053 -11881 -1093 -586 6032 8325 4093 -15292 -6397 -6870 -1038 1549 -2163 1684 -12342 -17564
8039 -17564 -17654 -16853 -1411 25995 30348 13070 -1594 1369 7126 15255 10404 -15409 -16142 9192
8025 9192 26105 41645 32860 25449 13298 7900 11124 24349 48519 43577 44337 35450 41674 30361
8011 30361 18710 18519 15327 11946 25250 17316 30971 16582 814 3936 4735 3076 5130 -10627
7997 -10627 -1734 21824 24468 2034 -14852 508 20727 16505 2333 10717 28249 41175 30123
7984C0123l0891q171K0462L579q860J2569m87J0544N772j6225O58p105J299J7431
7970C0698p377j0282j3445L549M033n7k401P43o698n1J5273O262L284j483n407
7955A6641J927k598j866n386J6333o065k821O560j3161n67J028K103m723m143
7941C262K1946J366j746n147n156j1237r008j756n357l710N967M334o089M905
7927g426M710p346k4234N542N341Q023q38J9874o348m783K599j1186j2763J6929
7913a1906J1067J1794J0390k126Q891R877N187j6588j2737j2281l118q278Q275
7900a553k668l127J0841R537j0391N274n744j3882q583k489j2650K3248J4442
7887B255l9q759o264P007o883m729J83J1001L394J2410o216M195N628P388N339
$$ plain form
7984 30123 -768 -8939 11523 15102 6242 18811 18324 28868 34640 18415 19073 11968 13267 30698
7970 30698 23321 13039 -406 3143 7176 7119 4718 5461 -1237 -1288 13985 20247 23531 22048 16641
7955 16641 18568 15970 14104 8718 25051 18986 16165 22725 9564 8997 10025 12128 7405 3262
7941 3262 25208 26574 24828 19681 14525 3288 -5720 -7476 -12833 -16543 -10576 -6242 -12331 -7426
7927 -7426 -2716 -10062 -34296 -28754 -23413 -15390 -16228 3646 -2702 -7485 -4886 -16072 -28835 -11906
7913 -11906 -839 10955 21345 19219 28110 37987 43174 26586 13849 1568 -1550 -9828 -1553
7900 -1553 -4221 -7348 3493 13030 2639 7913 2169 -11713 -20296 -22785 -35435 -12187 2255
7887 2255 2216 -6543 -12807 -5800 -12683 -17412 -17229 -6228 -2834 9576 3360 7555 13183 20571 25910
7872B5910r284p782j147R810O684K2581J618j9291j4959j561l924j0669j2059
7859a4073k337j534L776J8245n79l084k048j4138l701J8577K341O64j4199o761
7845a8851J6739P102j8753j6172J2128R391J1247M272l40j0317m702l801K826
7832i231l991J431j1467M691P046J9264J1561p412j4157j1961L552J43l848Q910
7818e469o141j281k918j404L10O543O380q56M819j1322n39r643m417Q324L70R983
7802g261K5700M471j1910j3355j3653P465O197K871Q233n020j4818j058j2401
7789b4539j1230o442J1200K6055J6792j0582L078J1405N698j3645k2468o783J8380
7776c081j281J0528L74j0093j5283m793P016L559j3016M89J1006O342o765J5450
$$ plain form
7872 25910 16626 8844 7697 17507 24191 46772 48390 29099 14140 12579 8655 -2014 -14073
7859 -14073 -16410 -17944 -14168 4077 3498 414 -1634 -15772 -19473 -896 1445 2109 -12090 -18851
7845 -18851 -2112 4990 -13763 -29935 -17807 -8416 2831 7103 6763 -3554 -8256 -12057 -9231
7832 -9231 -13222 -11791 -23258 -18567 -11521 7743 19304 11892 -2265 -14226 -10674 -10531 -14379 -5469
7818 -5469 -11610 -12891 -15809 -17213 -16903 -10360 -3980 -4836 -17 -11339 -11878 -21521 -25938 -17614 -17244 -7261
7802 -7261 18439 22910 11000 -2355 -16008 -8543 -2346 525 8758 3738 -11080 -12138 -24539
7789 -24539 -35769 -42211 -31011 -4956 11836 1254 4332 15737 21435 7790 -14678 -21461 -3081
7776 -3081 -4362 6166 6540 -3553 -18836 -23629 -16613 -13054 -26070 -25581 -14575 -8233 -14998 452
7762D52P793r22j4781p240J9355L937j6352o598J1911K308O108r661j2878M883
7748a1685P130N936J0881m863j2592o657k1312j3046Q114K7356K1893K697j4592
7735g40j4043J4023J9964k090j8246Q7J1445l151M416M690j014m010j1458r519
7721i646K144J0583J0548m39l645K11k2300k721l693J868m452n826J5109Q532
7707c727O083j0774j0683k695L094K756k169J6097J0430J5354m706j6923J3260
7694A5397j703o864J012L442j0015J4718K399N371p265j9415m286l695l380K042
7680a2242J9041J402L862M611j0710k905K207O051k046j9033j830J7010R148o009
7666H557k052l936N892J1949p660j6627k628M677K2119J3117l915M650J235j3791
$$ plain form
7762 452 8245 7323 -7458 -14698 4657 8594 -7758 -14356 -2445 -137 5971 -3690 -16568 -11685
7748 -11685 -4555 1381 12262 7399 -5193 -11850 -33162 -46208 -38094 -10738 11155 13852 -740
7735 -740 -14783 -760 19204 17114 -1132 -1045 10400 7249 11665 16355 15341 11331 -127 -9646
7721 -9646 -7502 3081 13629 13190 9545 9756 -12544 -15265 -18958 -17090 -21542 -27368 -12259 -3727
7707 -3727 2356 -8418 -19101 -21796 -18702 -15946 -18115 -2018 8412 23766 19060 2137 15397
7694 15397 13694 6830 7842 11284 1269 15987 18386 23757 16492 -2923 -7209 -10904 -14284 -12242
7680 -12242 6799 8201 12063 16674 5964 3059 5266 11317 9271 -9762 -11592 5418 14566 8557
7666 8557 6505 2569 8461 20410 12750 -3877 -6505 -1828 20291 33408 29493 34143 35378 21587
7652B1587j7453q638J0067m231j5310j3900N788L450j811q369R749l06q798J130
7638b7045J5931K4683K3022K766j8374j4510q87k563j0114n820J5189j3206j2936
7625b3864p45J9531J6179m177p999n494P581o773j0922j3728L795R624K397J2468
7611b127N497K848m667L360J8423R675j209M984r912n020j3485o423j3683l484
7597a5223J256Q47j0614J350R966m460K7843L113q770J3547J7599p744j9187j917
7583G606p318M323R983q866o144J2151N168M569j8398r511j7036j001J5556M342
7569d576N465J0739j1n93J4066J9757m228j345k502l1519n575K1208p414q740
7555D732K483Q634j1595J712O75j1751P338P989Q22J396J0189Q438L776j0863
$$ plain form
7652 21587 4134 -4504 5563 1332 -13978 -27878 -22090 -18640 -20451 -28820 -19071 -19377 -28175 -27045
7638 -27045 -11114 13569 36591 39357 20983 6473 5586 3023 -7091 -12911 2278 -10928 -23864
7625 -23864 -24609 -5078 11101 6924 -1075 -6569 1012 -5761 -16683 -30411 -26616 -16992 -14595 -2127
7611 -2127 3370 6218 1551 4911 23334 33009 31800 36784 26872 21852 8367 1944 -11739 -15223
7597 -15223 -13967 -13120 -23734 -22384 -12418 -16878 10965 14078 5308 18855 36454 28710 9523 7606
7583 7606 288 4611 14594 5728 -416 11735 16903 21472 3074 -6437 -23473 -24474 -8918 -4576
7569 -4576 889 11628 11617 11024 25090 44847 40619 39274 36772 5253 -322 20886 13472 4732
7555 4732 7215 15849 4254 5966 6641 -5110 2228 10217 11039 12435 22624 31062 34838 23975
7541B3975k2785l4860N607K796J7738K919j441j713O216K2222j75m861l250J41
7527A2529j650k7057j0668P918L849L445K87j015J233Q086N10L267J392n938j3121
7512a6933j9685n222L322J1120J498r133O047J2858l875N514N965K059r431l455
7498a9351J0167O332M537N57m175l344L953P326m619J0813q832j7331j3671q292
7484c5930J0505J683L413Q717j2855N913O485L965l951M994k290P075J4643n85
7470A1782q89N117P671j5764k4668j0266r395K1080J5072j939o606M965r843L806
7456i877Q399J3200J9516m7j2733q276j5930J890Q529m726o398j2065j0877O048
7442b3347J3711l392q582p754R226J5573J6376k29o501j1195l989Om737n13n776
$$ plain form
7541 23975 1190 -33670 -28063 -25267 -7529 -4610 -6051 -7764 -1548 20674 20499 15638 12388 12529
7527 12529 10879 -16178 -26846 -18928 -15079 -11634 -11347 -12362 -11129 -3043 -2533 734 2126 -3812 -16933
7512 -16933 -36618 -41840 -38518 -27398 -25900 -35033 -28986 -16128 -20003 -14489 -8524 -6465 -15896 -19351
7498 -19351 -9184 -2852 1685 2242 -1933 -5277 -1324 6002 1383 12196 3364 -13967 -27638 -35930
7484 -35930 -25425 -23742 -20329 -11612 -24467 -18554 -12069 -8104 -12055 -7061 -9351 -2276 12367 11782
7470 11782 10893 16010 23681 7917 -16751 -27017 -36412 -15332 -260 -2199 -8805 -3840 -13683 -9877
7456 -9877 -1478 11722 31238 31191 18458 10182 -5748 -3858 4671 -55 -6453 -18518 -29395 -23347
7442 -23347 -9636 -13028 -21610 -29364 -20138 -4565 11811 11582 5081 -6114 -10103 -10097 -14834 -15347 -21123
7427b1123k851J7316R633K779J0134L697r498r07r04K936N146j6292j8654M660
7413a3928m830j0726O764m97J0614R810k059J0236q479n400l638l130L139k923
7399a5047Q287J9480j8042R334N882j760j9038n150J0943k590L201n082n862l670
7385a9114K584J0169N19O252J4595O449P537j3587j5603J0025L685k2612j4837
7372b3938J325J7598J6484n002M733K997J7179J8003k6123l3457l990Q787n401
7359a0805j987k392k71j267L897L044J2557M83m793J027M116j0086o133j1757
7345b4367n58K885j3269J3614J3244K636O097p311k947q299M859K4695m650l287
7331C342J4714k907l6977j0579J3255Q61K1865O13Q57K151j2136j3991p198Q633
$$ plain form
7427 -21123 -23974 -6658 2975 5754 15888 19585 10087 9180 8276 11212 16358 66 -18588 -13928
7413 -13928 -18758 -29484 -22720 -23217 -12603 -2793 -4852 5384 -3095 -8495 -12133 -15263 -12124 -15047
7399 -15047 -6760 12720 -5322 4012 9894 8134 -10904 -16054 -5111 -7701 -4500 -9582 -15444 -19114
7385 -19114 -16530 -6361 -5842 410 15005 21454 28991 15404 -199 9826 13511 -9101 -23938
7372 -23938 -22613 -5015 11469 6467 11200 14197 31376 49379 23256 -10201 -14191 -5404 -10805
7359 -10805 -12792 -15184 -15455 -16722 -12825 -9781 2776 3259 -1534 -507 3609 -6477 -12610 -24367
7345 -24367 -24925 -22040 -35309 -21695 -8451 -5815 282 -7029 -9976 -18275 -13416 11279 6629 3342
7331 3342 18056 15149 -21828 -32407 -19152 -18291 3574 4187 5044 7195 -4941 -18932 -26130 -17497
7317a7497J4527L261N719j06j228n457j1468p886k554K453k7931o136K1560J6205
7303a6538N998J657R845l372r144Q185P556l097j8746R498K2038k134k701q121
7289I24q794J1624l453p386n122p934m265J0553K8219K518o907q977l024Q729
7275F705O88k623M790k058p535K986L203n873L635Q315p308L208k16j6298p03
7260i084J0144J643j298j5181j0474n452M57j46J4302L37j0610m944M149l655
7246b9812o972J2711J9173n801O338k295J1049p58j4957K058K13m739N820O057
7232a915n370j5959q69L210J2021J202j1532l749J04Q874N302K0725k2188q193
7218a8337J2042m47j0959j8747j173M639O433O532O923O047r455N35j862J4830
$$ plain form
7317 -17497 -2970 291 6010 5904 4676 -781 -12249 -20135 -22689 -20236 -48167 -54303 -32743 -16538
7303 -16538 -10540 -8883 962 -2410 -11554 -3369 4187 1090 -17656 -8158 13880 11746 9045 924
7289 924 -7870 3754 301 -7085 -12207 -20141 -24406 -13853 14366 16884 9977 1000 -2024 6705
7275 6705 7393 4770 9560 7502 -33 2953 6156 283 3918 12233 4925 8133 7917 -8381 -9084
7260 -9084 1060 2703 1405 -13776 -24250 -29702 -29245 -29391 -15089 -14752 -25362 -30306 -26157 -29812
7246 -29812 -36784 -24073 -4900 -10701 -4363 -6658 4391 3633 -11324 -9266 -9053 -13792 -7972 -1915
7232 -1915 -7285 -23244 -24113 -20903 -8882 -7680 -19212 -22961 -22857 -13983 -8681 12044 -10144 -18337
7218 -18337 -6295 -6742 -17701 -36448 -37621 -32982 -26549 -20017 -13094 -7047 -16502 -15967 -17829 -2999
7204b999p766Q958O852m11q407P757N33j270j2911l3894J1802J121m036o255J4251
7189b6675J9541J1014J3997Q136O112m04r301n965P835j0608j7602j5359j923
7176b1202K514n422K856J3162P100k945n654K3156J0632j1759j5707k4514N180
7163b2603J886J0529o73O363M252k0162Q913N183k4855n125L94k786l35J6425
7149b2594J3714l093P971N186K182j1033N297l667k242K895m911M763R699R91
7135E158K600j0586l914k057j4883j6129O439N74P191L2974K291j2240j2961M059
7121a1484R466J1280p610j1883L463J3334l877j3727L050J5935R835j4024k2211
7108a8453J810J1584P398p24K123r896n799K921k540l189n349m089J8825J3778
$$ plain form
7204 -2999 -10765 -1807 5045 4634 -3773 3984 4517 3247 -9664 -43558 -31756 -30635 -34671 -40926 -26675
7189 -26675 -7134 3880 17877 26013 32125 31721 22420 16455 24290 13682 -3920 -19279 -21202
7176 -21202 -18688 -24110 -21254 -8092 -992 -3937 -9591 13565 24197 12438 -3269 -27783 -22603
7163 -22603 -20717 -10188 -10861 -4498 -246 -20408 -11495 -6312 -31167 -36292 -35898 -38684 -39019 -22594
7149 -22594 -8880 -11973 -4002 1184 3366 -7667 -2370 -6037 -8279 -5384 -10295 -5532 4167 5158
7135 5158 7758 -2828 -6742 -8799 -23682 -39811 -33372 -32798 -25607 7367 9658 -2582 -15543 -11484
7121 -11484 -2018 9262 1652 -10231 -6768 6566 2689 -11038 -7988 7947 17782 3758 -18453
7108 -18453 -16643 -5059 2339 1615 3738 -6158 -11957 -9036 -11576 -14765 -20114 -24203 -5378 8400
7094H400o605j8459o066q550R702N01q134P943n08K463N347Q821M036j7137r345
7079b7591R783J4860M438K716r854O492n29M688j6540K611J2926L846j1161j1390
7065a4705j498J0577J428j0578J005P448j6032j0014N947K2951J0466J2684j1540
7052H139j5823p20j536J0012J3426J5099J873l791M169j6067k0582j0814J3476
7039c139M281j4811j0250P653j050l515M991k506j0497J9893J348j6046j2392
7026c6040K118k262Q686Q632P216O990R32P344j1404k8577j0105J5166J2541M758
7012a4005M391J0532n100j847j6623j8231M478K0645p92j1681j2136P359J3282
6999a9728P169J2009J1969O52k0051j5471j561Q748K330n64J5884l387j1473m081
$$ plain form
7094 8400 1795 -16664 -22730 -31280 -21578 -21077 -29211 -21268 -21776 -19313 -13966 -5145 -1109 -18246 -27591
7079 -27591 -17808 -2948 1490 4206 -5648 844 315 5003 -11537 -8926 4000 7846 -3315 -14705
7065 -14705 -16203 -5626 -4198 -14776 -13771 -6323 -22355 -32369 -26422 -3471 6995 19679 8139
7052 8139 -7684 -8404 -9940 72 13498 28597 30470 26679 30848 14781 -5801 -16615 -3139
7039 -3139 1142 -13669 -23919 -16266 -17316 -20831 -15840 -18346 -28843 -8950 -7602 -23648 -36040
7026 -36040 -33922 -36184 -27498 -18866 -11650 -4660 -3728 3616 -7788 -36365 -46470 -31304 -18763 -14005
7012 -14005 -9614 918 -4182 -6029 -22652 -40883 -36405 -15760 -16552 -28233 -40369 -33010 -19728
6999 -19728 -12559 -550 11419 12071 -7980 -23451 -25012 -16264 -13934 -14498 1386 -2001 -13474 -17555
6985a7555n781p16J5072J4031P734N372N334r664k0651l115k200N286K880j640
6971e613N643R346j1999j6745R831J1613K958j1159n010O477Q33L90j3738P047
6957a0126K4157p215j7805N630p155n587n225j855J3142q495n939M290J2822K097
6943g264J5501J1518j4728l319m797j4797j312L115j0385K0398K3788J1751j8876
6930A0593j8676O510J4803l237J850L653p25o717r503p229j0697O293J9426o668
6916c24j1126r811J59J6799J2207N299j6141j946P852L284n573o848l036J1956
6902B751J2316m39K973n843o276j2033l786K521J781K77N567j76j8918J1068J57
6887h060J1038K849J507P182j1252j1253J2626N960p304k649J5372M784J6R76
$$ plain form
6985 -17555 -23336 -24052 -8980 5051 12785 18157 23491 13827 -6824 -9939 -12139 -6853 -3973 -5613
6971 -5613 30 9376 -2623 -19368 -9537 2076 5034 -6125 -11135 -4658 -3825 -3435 -17173 -10126
6957 -10126 14031 6816 -10989 -5359 -12514 -18101 -23326 -25181 -12039 -20534 -26473 -22183 -9361 -7264
6943 -7264 8237 19755 5027 1708 -3089 -17886 -19198 -16083 -26468 -6070 17718 29469 10593
6930 10593 -8083 -1573 13230 9993 11843 15496 14771 8054 -1449 -8678 -19375 -13082 6344 -324
6916 -324 -11450 -21261 -21102 -4303 7904 13203 -2938 -4884 2968 6252 679 -6169 -9205 2751
6902 2751 15067 14628 17601 11758 5482 -6551 -10337 -7816 -6035 -5758 -191 -367 -19285 -8217 -8060
6887 -8060 2978 5827 7334 14516 3264 -7989 4637 10597 3293 644 16016 20800 20816 21792
6873B1792j6293k1841q69J1819k477k0317j0465K059J9428J287j3063M610R333
6860a4997J3295L996j2383j2375M876R194P317K3288k944j6292j2312p461K0156
6847C358J0586j9528p556N090Q452J766J1880J1257j2784j6770m57K4344l628
6834A6010j2995j8894r034J6432N55j3555R536k485j748Q374L222J872q239J919
6820i030n887r197j331J0483J5674J8684N342J251J782j8426j5910q231Q663k261
6806h394K0813P559o876j7773q030q227J0560J7491J6827J994p013o220p074j1585
6792e948J2224J2839p642p325p879J966L807J5677r852j8226N704p92r409q570
6778b3426M036J7800J5891R563j6573r898m172O362J2467J1130p844l286o74p220
$$ plain form
6873 21792 5499 -16342 -17211 -5392 -7869 -28186 -38651 -36592 -17164 -15877 -28940 -24330 -14997
6860 -14997 -1702 2294 -10089 -22464 -17588 -8394 -1077 22211 19267 2975 -9337 -16798 3358
6847 3358 13944 -5584 -13140 -8050 402 2168 14048 25305 12521 -4249 -4706 19638 16010
6834 16010 3015 -15879 -24913 -8481 -7926 -21481 -11945 -14430 -16178 -7804 -4582 -2710 -10949 -9030
6820 -9030 -14917 -24114 -25445 -14962 712 19396 24738 25989 27771 9345 -6565 -14796 -6133 -8394
6806 -8394 12419 19978 13102 -4671 -12701 -20928 -10368 7123 23950 25944 18931 12711 5637 -5948
6792 -5948 6276 19115 11473 4148 -3731 -1765 2042 17719 7867 -10359 -4655 -5447 -14856 -23426
6778 -23426 -19390 -1590 14301 23864 7291 -2607 -6779 -417 12050 23180 15336 12050 11376 4156
6764D156K412K650j5662o117K27K448J1823m055N584P158j5270l890l50l646K72
6749a2260J1102J0621j6406n662O543K570k925m668j6108Q28r04K1780J0028M073
6735H612k223l000J514m12o096J1585K1466J9425p457j7649k5255p007J0905Q040
6721A2448R907k273J0443j3295j3067o49L845j1663j6269l6K5862Q052o372l513
6707C420j076p357o397j402P9m307r007n995m032J5733L1506J8146k0486k1220
6693a2395J8867N768j364r523j5964j3217j145J7432J8833R140n365P374P9J4012
6679C2532j4719l1968p528J7523p660k947j3810J4691K0609L046M515j3906j7698
6666a7320l448N153r398j7009P761J2179j8085P144l999R359J9665L844p564n762
$$ plain form
6764 4156 6568 9218 -6444 -12561 -12334 -9886 1937 -2118 3466 10624 -4646 -8536 -8886 -12532 -12260
6749 -12260 -1158 9463 -6943 -12605 -6062 -3492 -6417 -11085 -27193 -26365 -27269 -5489 4539 8612
6735 8612 6389 3389 4903 4491 -1605 9980 31446 50871 43414 25765 510 -6497 4408 12448
6721 12448 22355 20082 30525 17230 4163 3514 7359 -4304 -20573 -20609 5253 13305 6933 3420
6707 3420 2344 -5013 -11410 -12812 -12733 -17040 -26047 -32042 -36074 -20341 11165 29311 8825 -12395
6693 -12395 6472 12240 10876 1353 -14611 -27828 -28973 -11541 7292 16432 11067 18441 18520 32532
6679 32532 17813 -14155 -21683 -4160 -11820 -14767 -28577 -13886 6723 9769 14284 378 -17320
6666 -17320 -20768 -15615 -25013 -42022 -34261 -22082 -40167 -33023 -37022 -27663 -7998 -4154 -11718 -17480
6652a7480N655R138J3941K644l946j0398j2475j5738j76K4890K5487q263j1305
6639A974K076p51m009r560R095R275m897P26L280M569k0387o022r138l631J1769
6624a5631K1816J6786K088m725k4282p932n400O594q361L200K0082J0850r049
6611F036p441p554n13K532j0321K078o406J2660j841N48J4797M284j3154l317
6597g612R662N463L918J1398r800k7529J302O746q065j976J706n810m647N628
6583a9616p145j118J9570J2734J0407p007J0458K442j7006j3661Lo653j2254k761
6569c1607J2345Q350M314K050P452K15J134k149p432j2840l615j1761L473J3510
6555a6561J4014j116p065J7474n238K036k000P098P748q703L345K377n940p87
$$ plain form
6652 -17480 -11825 -2687 11254 13898 9952 -446 -12921 -28659 -28835 -3945 21542 13279 1974
6639 1974 4050 3299 -710 -10270 -1175 8100 3203 3929 7209 11778 -8609 -14631 -23769 -27400 -15631
6624 -15631 6185 22971 25059 20334 -3948 -11880 -17280 -10686 -19047 -15847 4235 15085 6036
6611 6036 -1405 -8959 -9472 -6940 -17261 -15183 -21589 -8929 -10770 -10222 4575 8859 -4295 -7612
6597 -7612 2050 7513 11431 22829 13029 -14500 -13198 -6452 -14517 -16493 -14787 -20597 -25244 -19616
6583 -19616 -26761 -27879 -8309 4425 14832 7825 18283 20725 3719 -9942 -9939 -16592 -28846 -31607
6569 -31607 -19262 -10912 -6598 -4548 2904 3119 4253 2104 -5328 -18168 -21783 -33544 -30071 -16561
6555 -16561 -2547 -3663 -10728 6746 1508 3544 1544 8642 16390 7687 11032 13409 7469 6682
6541F682J535o321L38l975l324L323O502l938J3983J875N602j310o776p841J270
6526G625L18O901K413O623L458j2691n854j6367n602M885P104K621p668j766J1830
6511C830K177j0523Q197r960j0809k523j7744Q24P346P314j993R596Q862l39j5807
6496b1552L392n498J333K1275Q624o057j3581q920J5910M867N317j894m98P068
6482I786j5201j1112J0629J578J5188J0405j0499l249m648Q999J4829n70j2514
$$ plain form
6541 6682 8217 1896 2234 -1741 -5065 -1742 4760 822 14805 16680 22282 20972 14196 6355 7625
6526 7625 7943 14844 17257 23880 27338 14647 8793 -7574 -13176 -8291 -1187 1434 -6234 -8000 3830
6511 3830 6007 -4516 3681 -6279 -17088 -19611 -37355 -36531 -29185 -21871 -23864 -14268 -5406 -5745 -21552
6496 -21552 -18160 -23658 -22325 -1050 7574 1517 -12064 -20984 -5074 -207 5110 3216 2718 9786
6482 9786 -5415 -16527 -5898 -4320 10868 21273 10774 7525 2877 11876 26705 26135 13621
$$ [...]
##END NTUPLES=NMR SPECTRUM
##END=
