##TITLE=Analysis number 318105
Compound Code cc 45239
Book Reference 440/158
Project Code adrs
Chemist Name craigr
##JCAMPDX= 6.0         $$ Bruker NMR JCAMP-DX V2.0
##DATA TYPE= NMR SPECTRUM
##DATA CLASS= NTUPLES
##ORIGIN= Bruker BioSpin GmbH
##OWNER= nmr
$$ XWIN-NMR		Version 3.5
$$ Wed Mar 15 12:36:35 2006 GMT Standard Time (UT+0h)  MAYBRIDGE\nmr@NMR_250MHZ
##.OBSERVE FREQUENCY= 250.131544655141
##.OBSERVE NUCLEUS= ^1H
##.ACQUISITION MODE= SIMULTANEOUS (DQD)
##.ACQUISITION SCHEME= undefined
##.AVERAGES= 16
##.DIGITISER RES= 18
##SPECTROMETER/DATA SYSTEM= dpx250
##.PULSE SEQUENCE= zg30
##.SOLVENT NAME= CDCl3
##.SHIFT REFERENCE= (INTERNAL, CDCl3, 0, 16.522)
##AUDIT TRAIL= $$ (NUMBER, WHEN, WHO, WHERE, WHAT)
$$ ##TITLE= Audit trail, XWIN-NMR		Version 3.5
$$ ##JCAMPDX= 5.01
$$ ##ORIGIN= Bruker BioSpin GmbH
$$ ##OWNER= nmr
$$ C:\u/data/dgb/nmr/ADRS/780/pdata/1/auditp.txt
$$ ##AUDIT TRAIL=  $$ (NUMBER, WHEN, WHO, WHERE, WHAT)
(   1,<2006-03-15 12:36:13.10 +000>,<MAYBRIDGE\nmr>,<NMR_250MHZ>,
      <created by zg, POWCHK disabled, PULCHK disabled
       configuration hash MD5:
       84 BC 41 DB A1 6E 1D 46 DA 25 12 A5 C1 ED C5 3A
       data hash MD5: 64K
       0D DA 6D C4 E9 7E E4 70 C1 DA 3E 47 44 C7 44 97>)
(   2,<2006-03-15 12:36:25.99 +000>,<MAYBRIDGE\nmr>,<NMR_250MHZ>,
      <Start of raw data processing
       ef LB = 0.3 FT_mod = 6 PKNL = 1 SI = 32K 
       data hash MD5: 32K
       93 7C 8C B6 B5 A8 C0 13 C1 F3 D0 84 87 4E 46 64>)
(   3,<2006-03-15 12:36:27.65 +000>,<MAYBRIDGE\nmr>,<NMR_250MHZ>,
      <apk 
       data hash MD5: 32K
       E9 50 98 F3 2F 0A E1 EA 82 23 57 03 F0 00 6E 50>)
(   4,<2006-03-15 12:36:28.52 +000>,<MAYBRIDGE\nmr>,<NMR_250MHZ>,
      <abs ABSG = 5 
       data hash MD5: 32K
       39 C1 13 74 7B BA 1E CC 05 DE D4 34 EA 77 7F 45>)
$$ ##END=
$$ 
$$ hash MD5
$$ 92 50 A3 E0 4F 0A 4F 27 BC 19 28 DF 72 E4 1A 6C
##$RELAX= 
##$RELAX= 
##$RELAX= 
##$RELAX= 
##$RELAX= 
##$RELAX= 
##$RELAX= 
$$ Bruker specific parameters
$$ --------------------------
##$DU= <C:\u>
##$EXPNO= 780
##$NAME= <ADRS>
##$PROCNO= 1
##$TYPE= <nmr>
##$USER= <dgb>
##$AMP= (0..31)
100 100 100 100 100 100 100 100 100 100 100 100 100 100 100 100 100 100 
100 100 100 100 100 100 100 100 100 100 100 100 100 100 
##$AQSEQ= 0
##$AQ_mod= 3
##$AUNM= <au_zg>
##$AUTOPOS= <28 >
##$BF1= 250.13
##$BF2= 250.13
##$BF3= 250.13
##$BF4= 250.13
##$BF5= 500.13
##$BF6= 500.13
##$BF7= 500.13
##$BF8= 500.13
##$BYTORDA= 1
##$CFDGTYP= 0
##$CFRGTYP= 5
##$CHEMSTR= <none>
##$CNST= (0..31)
1 1 145 1 1 1 1 1 1 1 1 1 1 1 1 1 1 1 1 1 1 1 1 1 1 1 1 1 1 1 1 1 
##$CPDPRG= <>
##$CPDPRG1= <>
##$CPDPRG2= <>
##$CPDPRG3= <>
##$CPDPRG4= <mlev>
##$CPDPRG5= <mlev>
##$CPDPRG6= <mlev>
##$CPDPRG7= <mlev>
##$CPDPRG8= <mlev>
##$CPDPRGB= <>
##$CPDPRGT= <>
##$D= (0..31)
0 1 0 0 0 0 0 0 0 0.06 0 0 0 0 0 0 0.0002 0 0 0 0 0 0 0 0 0 0 0 0 0 0 
0 
##$DATE= 1142426171
##$DBL= (0..7)
120 120 120 120 120 120 120 120 
##$DBP= (0..7)
150 150 150 150 150 150 150 150 
##$DBP07= 0
##$DBPNAM0= <>
##$DBPNAM1= <>
$$ [...]
##$SUBNAM7= <"">
##$SUBNAM8= <"">
##$SUBNAM9= <"">
##$SW= 20.6930455092707
##$SWIBOX= (0..15)
0 0 3 0 0 0 0 0 0 0 0 0 0 0 0 0 
##$SW_h= 5175.983436853
##$TD= 65536
##$TD0= 1
##$TE= 294.16
##$TE2= 300
##$TE3= 300
##$TEG= 300
##$TL= (0..7)
0 120 120 120 120 120 120 120 
##$TP= (0..7)
150 150 150 150 150 150 150 150 
##$TP07= 0
##$TPNAME0= <>
##$TPNAME1= <>
##$TPNAME2= <>
##$TPNAME3= <>
##$TPNAME4= <>
##$TPNAME5= <>
##$TPNAME6= <>
##$TPNAME7= <>
##$TPOAL= (0..7)
0.5 0.5 0.5 0.5 0.5 0.5 0.5 0.5 
##$TPOFFS= (0..7)
0 0 0 0 0 0 0 0 
##$TUNHIN= 0
##$TUNHOUT= 0
##$TUNXOUT= 0
##$USERA1= <user>
##$USERA2= <user>
##$USERA3= <user>
##$USERA4= <user>
##$USERA5= <user>
##$V9= 5
##$VALIST= <valist>
##$VCLIST= <CCCCCCCCCCCCCCC>
##$VD= 0
##$VDLIST= <DDDDDDDDDDDDDDD>
##$VPLIST= <PPPPPPPPPPPPPPP>
##$VTLIST= <TTTTTTTTTTTTTTT>
##$WBST= 1024
##$WBSW= 4
##$XGAIN= (0..3)
0 0 0 0 
##$XL= 0
##$YL= 0
##$YMAX_a= 454535
##$YMIN_a= -497021
##$ZGOPTNS= <>
##$ZL1= 120
##$ZL2= 120
##$ZL3= 120
##$ZL4= 120
##$ABSF1= 16.522
##$ABSF2= -4.171173
##$ABSG= 5
##$ABSL= 3
##$ALPHA= 0
##$AQORDER= 0
##$ASSFAC= 0
##$ASSFACI= 0
##$ASSFACX= 0
##$ASSWID= 0
##$AUNMP= <proc_1d>
##$AZFE= 0.1
##$AZFW= 0.1
##$BCFW= 0
##$BC_mod= 0
##$BYTORDP= 0
##$COROFFS= 0
##$CY= 12.5
##$DATMOD= 1
##$DC= 0
##$DFILT= <>
##$DTYPP= 0
##$F1P= 14.0000005364418
##$F2P= -0.99999901652339
##$FCOR= 0.5
##$FTSIZE= 32768
##$FT_mod= 6
##$GAMMA= 0
##$GB= 0
##$INTBC= 1
##$INTSCL= 1
##$ISEN= 128
##$LB= 0.3
##$LEV0= 0
##$LPBIN= 0
##$MAXI= 10000
##$MC2= 0
##$MEAN= 0
##$ME_mod= 0
##$MI= 0
##$NCOEF= 0
##$NC_proc= -2
##$NLEV= 6
##$NOISF1= 0
##$NOISF2= 0
##$NSP= 0
##$NTH_PI= 0
##$NZP= 0
##$OFFSET= 16.522
##$PC= 1
##$PHC0= 170.9722
##$PHC1= 6.661119
##$PH_mod= 1
##$PKNL= yes
##$PPARMOD= 0
##$PSCAL= 4
##$PSIGN= 0
##$REVERSE= no
##$SF= 250.13
##$SI= 32768
##$SIGF1= 0
##$SIGF2= 0
##$SINO= 400
##$SIOLD= 32768
##$SREGLST= <1H.CDCl3>
##$SSB= 0
##$STSI= 32768
##$STSR= 0
##$SW_p= 5175.98343685301
##$SYMM= 0
##$S_DEV= 0
##$TDeff= 65536
##$TDoff= 0
##$TI= <Analysis number 999999
Compound Code 99
Book Reference 9
Project Code 9>
##$TILT= no
##$TM1= 0
##$TM2= 0
##$TOPLEV= 0
##$USERP1= <user>
##$USERP2= <user>
##$USERP3= <user>
##$USERP4= <user>
##$USERP5= <user>
##$WDW= 1
##$XDIM= 32768
##$YMAX_p= 367001527
##$YMIN_p= -40254
$$ End of Bruker specific parameters
$$ ---------------------------------
##NTUPLES= NMR SPECTRUM
##VAR_NAME=  FREQUENCY,     SPECTRUM/REAL,   SPECTRUM/IMAG
##SYMBOL=    X,             R,               I
##VAR_TYPE=  INDEPENDENT,   DEPENDENT,       DEPENDENT
##VAR_FORM=  AFFN,          ASDF,            ASDF
##VAR_DIM=   32768,         32768,           32768
##UNITS=     HZ,            ARBITRARY UNITS, ARBITRARY UNITS
##FACTOR=    0.157963299565203, 1,           1
##FIRST=     4132.6476996994, 0,             0
##LAST=      -1043.33573715361, 0,           0
##MIN=       -1043.33573715361, -40254,      0
##MAX=       4132.6476996994, 367001527,     0
$$ Real data points
##PAGE= N=1
##DATA TABLE= (X++(R..R)), XYDATA
$$ [...]
15176d937k87M074l445o472L505K256K72N539j436n447m106M618L470p252j618
15161a1266L023n06K043R806M465m964j0350J806P687J523P6K242o06j256k617
15146A106l307L787n910q995Q05N186L530j691Q483j159j174K229l89J0371j012
15131A1860k715j129l920k784J014n49l920j431J215q268r658Q454L190j965j541
15116a2147m687n262P590K844n56J057P816K082j68P929M550n771r392J590k28
15101b753L936K649j132J108j509n820m479o877l656L368L160K070n138M000Q028
15086c045M888J469L349k624M53k676k193k565N140J25M824j695q839n485N063
15071c811n095n607K72k451R750J2112Q184j3811l953N692j902K671K935P700
$$ plain form
15176 -4937 -5224 -1150 -4595 -11067 -7562 -5306 -5034 505 -931 -6378 -10484 -5866 -2396 -9648 -11266
15161 -11266 -8243 -8749 -6706 3100 7565 2601 -7749 -5943 1744 3267 3343 5585 4979 3723 1106
15146 1106 -2201 1586 -4324 -13319 -12514 -7328 -3798 -5489 2994 1835 661 2890 2501 12872 11860
15131 11860 9145 8016 4096 1312 2326 1777 -2143 -3574 -2359 -10627 -20285 -11831 -8641 -10606 -12147
15116 -12147 -16834 -22096 -14506 -11662 -12218 -11161 -3345 -1263 -1431 6498 11048 5277 -4115 -2525 -2753
15101 -2753 1183 3832 2700 3808 2299 -3521 -8000 -14877 -18533 -15165 -12005 -9935 -15073 -11073 -3045
15086 -3045 1843 3312 6661 4037 4490 1814 -379 -2944 2196 2321 7145 5450 -3389 -8874 -3811
15071 -3811 -8906 -14513 -14241 -16692 -6942 5170 13354 -457 -4410 1282 -620 2051 4986 12686
15057A2686M756l623j1875l581k701R225r170k144Q320K988l685j1401K498l148
15043a0855o98o923n47J0467J0683O365j5603q298M232K239N078K037K386O309
15029F872K941p869m641o747j85p989K500K726o96k338m746Q209o197j874P795
15014a2239K737l5k532n007N629K937q417l058o723Q488R845m685k020Q227N880
14999i73m978r01k761l98J512j087j538J605J6414L795p571p922R56N119O305
14984G577M90p139K342p71j751j2028q590K200Q786L58O14N508J1725k542j5193
14969h414j622N905j128k735j763M941K986Q31j102N008m141p680O231L165Q194
14954H676R790K730l17o438q967P074L792m643j466o852J987k512l650p079p122
$$ plain form
15057 12686 17442 13819 1944 -1637 -4338 4887 -4283 -6427 1893 4881 1196 -10205 -7707 -10855
15043 -10855 -11553 -18476 -19023 -8556 2127 8492 -7111 -15409 -11177 -8938 -3860 -1823 563 6872
15029 6872 9813 1944 -2697 -9444 -9629 -17618 -15118 -12392 -13088 -15426 -20172 -11963 -18160 -20034 -12239
15014 -12239 -9502 -9537 -12069 -17076 -11447 -8510 -16927 -19985 -26708 -18220 -8375 -13060 -15080 -6853 -973
14999 -973 -5951 -6852 -9613 -10011 -8499 -9586 -11124 -9519 6895 10690 3119 -4803 -3847 1272 7577
14984 7577 8067 928 3270 2499 748 -11280 -19870 -17670 -8884 -8526 -7912 -2404 9321 6779 -8414
14969 -8414 -10036 -4131 -5259 -7994 -9757 -4816 -1830 -999 -2101 2907 -1234 -8914 -2683 482 8676
14954 8676 18466 21196 20879 14441 5474 12548 16340 11697 10231 3379 5366 2854 -796 -7875 -14997
14939a4997q80R479R723J371K236l075o89o680K947J542K942m225n274N752J5072
14924A5244n512m561k897p728J498j993J605P437l170m523O195j241o247K602
14910c291M65l0L792N360L1n773j0126L841J1350j0464p582m826O504k342K91
14895a2800N60L700K140Q543j322p074q811P922J0712n045L014J0153j0619l263
14881b190P39k526l133J23l009r158O98M287J362j063O300L319L756L866q165
14866d794q37k290j197J226M035J3196R566j405m423j290l205o451m864l310M383
14851a660O166j580P887N24j1314N401l63J669n731l871m771j983K8O02j809n199
14835a6004j505P149P949l750m037k330n921m291O753N097Q000R413M338j0918
$$ plain form
14939 -14997 -15877 -6398 3325 4696 6932 3857 3168 -3512 -565 977 3919 -306 -5580 172 15244
14924 15244 9732 5171 2274 -5454 -3956 -5949 -4344 3093 -77 -4600 1595 354 -5893 -3291
14910 -3291 -2826 -2856 936 6296 6327 554 -9572 -5731 5619 -4845 -12427 -17253 -10749 -13091 -12800
14895 -12800 -12240 -8540 -6400 2143 821 -6253 -15064 -7142 3570 -1475 1539 11692 1073 -2190
14881 -2190 -1451 -3977 -7110 -6987 -9996 -19154 -18456 -14169 -12807 -13870 -7570 -4251 -495 3371 -4794
14866 -4794 -5631 -7921 -9118 -7892 -3857 9339 18905 17500 13077 11787 8582 2131 -2733 -6043 -1660
14851 -1660 4506 2926 10813 11337 23 5424 5061 6730 999 -2872 -7643 -9626 -9598 -8996 -10805 -16004
14835 -16004 -17509 -10360 -2411 -6161 -10198 -12528 -18449 -22740 -15987 -10890 -2890 6523 10861 -57
14821e7l385l017m496O036k068O79P697R079K068l528M733m887r171p168j391
14806h876J886L170m461j45J0723N953j0660p548l757l366p64R821J0736n373
14792b661r096Q145K576L456p777J815P29N160L295J284N868m18K722n00l896
14777A0702K697J645o073o836o419M883L713J1443J027j142p011o165l102n113
14763e751n448L261L023n07m404O233J863k5K361m264K046K145p77k228p419L622
14747f269P164N795O290k456p030L466n400j0794r860M879N375l089O125O558
14733G54k994j477p4n860J0028K681k118M286N570n255k619k890m887L756r819
14718a0918j004M884N531K776P394J722o316o040p744k510J0312R083J932n98
$$ plain form
14821 -57 -3442 -6459 -10955 -4919 -6987 -6308 1389 10468 12536 9008 13741 8854 -317 -7485 -8876
14806 -8876 -6990 -3820 -8281 -8426 2297 8250 -2410 -9958 -13715 -17081 -17845 -8024 2712 -2661
14792 -2661 -11757 -3612 -1036 2420 -5357 -3542 -2813 2347 5642 6926 12794 12376 15098 14598 10702
14777 10702 13399 15044 8971 2135 -4284 599 4312 15755 16782 15640 8629 2464 -638 -5751
14763 -5751 -11199 -7938 -4915 -5422 -9826 -3593 -1730 -1755 606 -3658 -1612 533 -244 -2472 -9891 -6269
14747 -6269 895 6690 12980 10524 3494 6960 1560 -9234 -19094 -14215 -8840 -11929 -5804 754
14733 754 -2240 -3717 -3791 -9651 377 3058 940 5226 10796 5541 2922 32 -4855 -1099 -10918
14718 -10918 -11922 -7038 -1507 1269 8663 10385 4069 -1971 -9715 -12225 -1913 7170 9102 8504
14704H504M884k280L92o155q417J7050L27j5074j0883K27P715j351l56q268K101
14689a1584R222J066J612M091J65M527n097o916P6n46p307l84K003m07k339m794
14673a6612J768J0078N432O452K927j897m798J679m391q872n618L343O250L383
14659h76Q50n618p204N586P68r53p348k614R796P544k361r349k732n675M426O229
14643i531J508o019L848R53J114J0676o130O549Q06j59j1616K364O458M62l600
14628b317K838L161O921J686q605l434Q580k566l889m829M454N902o472m560J0061
14613F931J5807m989q342q927k836J792M523K925K077j0225j233N76o960J183
14599g698J0426m570m202R004R513L957j421r878l972K124M943P301m887q662
$$ plain form
14704 8504 13388 11108 11500 5345 -3072 13978 14305 -769 -11652 -11425 -3710 -5061 -5417 -13685 -11584
14689 -11584 -2362 -1296 316 4407 4572 9099 4002 -2914 -2838 -3384 -10691 -11075 -9072 -9479 -11818 -16612
14673 -16612 -14844 -4766 666 7118 10045 8148 3350 5029 638 -8234 -13852 -10509 -4259 -876
14659 -876 -26 -5644 -12848 -7262 -6494 -7447 -14795 -17409 -7613 -69 -2430 -11779 -14511 -20186 -15760 -9531
14643 -9531 -8023 -14042 -10194 -9241 -8127 2549 -3581 2968 3774 3615 -8001 -5637 821 1283 -2317
14628 -2317 521 3682 10603 12289 3684 250 8830 6264 2375 -2454 2000 7902 1430 -3130 6931
14613 6931 22738 17749 9407 480 -2356 -564 3959 6884 8961 -1264 -2497 -1921 -8881 -7698
14599 -7698 2728 -1842 -6044 2960 12473 16430 15009 5131 1159 3283 8226 15527 10640 1978
14585A978J2347P616p827l988r458k49K317l515M90l863P83M281j722r74K236
14570D52n47J485k179l192l915N544j920r15M414K246r210k053O930Q54P857j109
14554D742j0420o161j85M184J538N084M614M546M155o796l217o489K103k715k117
14539g134l884O118J5419q050j4326k849O177Q993K449j465o893n437l648J241
14525a3289N521l252n097R153M4j0345m271L502J1047O904j1046o857P260L293
14511g433r736m948P666J0584l919K078L295j269P043N579q074n636j706J913
14497d563N685L893l758p69M587K841K187J703q11J478Q93K381r636j0377j411
14482e677J2425J423n179J179J398q606p166P60K475q56m797L16m871j510P067
$$ plain form
14585 1978 14325 21941 14114 10126 668 419 2736 -779 -289 -4152 -3369 912 -810 -1784 452
14570 452 -95 1390 -789 -3981 -7896 -2352 -4272 -5187 -773 1473 -7737 -9790 -2860 -2006 5851 4742
14554 4742 -5678 -11839 -12024 -7840 -6302 -1218 3396 7942 12097 5301 2084 -4405 -2302 -5017 -7134
14539 -7134 -11018 -4900 10519 2469 -11857 -14706 -8529 464 2913 1448 -5445 -10882 -14530 -13289
14525 -13289 -7768 -11020 -16117 -6964 -6920 -17265 -21536 -18034 -6987 -83 -11129 -17986 -10726 -7433
14511 -7433 -17169 -22117 -14451 -3867 -7786 -5708 -2413 -3682 3361 8940 866 -4770 -6476 -4563
14497 -4563 1122 5015 1257 488 5075 7916 10103 11806 10995 12473 13366 15747 6111 -4266 -5677
14482 -5677 6748 8171 2992 4171 5569 -3037 -10203 -9443 -6968 -7824 -12621 -12305 -17176 -18686 -11619
14467a1619N122M156P85j629P03L602j546l097O017J07j921o741R204j871P824
14452I096j242j375n202L77j0860R156j990k534l62k087j15l491K242L368k46
14437e265L223j581k294O15n35M863Mn251m592O758P053Q066K146j0024j915P497
14421H768J359M215K735n285q018j0183p708P77O780K104o592O722M623O341L424
14406A0062l555j99N241Q137p638r299o415n135P158o803m413n857k436O38J1063
14391i451J2143l813j0205j829L983L082j829j0206p877O302J4803N746K256r011
14377e906N533O204N056m976j1697j323Q32J560O564R450J047M682n191q47k011
14362H977K19l101l968j060o168P96N827p472l106j292M38L211l785n817K625
$$ plain form
14467 -11619 -6497 -2341 -1556 -3185 -2482 1120 -426 -3523 2494 2601 680 -6061 3143 1272 9096
14452 9096 7854 6479 1277 1654 -9206 -50 -2040 -4574 -4936 -7023 -7138 -10629 -8387 -5019 -5265
14437 -5265 -2042 -3623 -5917 -5302 -5837 -974 -970 -6221 -10813 -4055 2998 11064 13210 3186 1271 8768
14421 8768 10127 14342 17077 11792 3774 -6409 -14117 -13340 -6560 -4456 -11048 -4326 297 6638 10062
14406 10062 6507 6308 11549 19686 12048 2749 -3666 -8801 -1643 -8446 -12859 -18716 -21152 -20514 -9451
14391 -9451 2692 -1121 -11326 -13155 -9172 -6090 -7919 -18125 -26002 -19700 -4897 849 3105 -5906
14377 -5906 -373 5831 10887 5911 -5786 -7109 -6277 -4717 1847 11297 12344 17026 11835 10988 8977
14362 8977 9196 6095 2127 1067 -5101 -4305 1522 -5950 -9056 -10348 -9910 -6699 -10484 -16301 -13676
14347a3676o100j738j688k588j212J484J4790N595L917j560J980N119M541l032
14333E832q073k658o312Q336J940q134j0067J0692P808P34L283L05r255p087j0906
14318b3562j546P137J951r76K575N171j798K285k202J2423l980k759R732j244
14304C207j1468m445P978J4534n93r14N320r86k189J320J006j2398N624L737r542
14289A91l020N604K866J485j2881j988R035P181j141q838k376K121l501m101l362
14274a2725Q047J817m083j205j0862K978J1L142j0663L914L033j859R697K58l054
14259a1554Q705R9P42j5378j690L223n552j319P747O760O195N462l431m990j327
14244f308j869N676K738R05N894l790J90j570k87J719l787k227m929q763O125
$$ plain form
14347 -13676 -19776 -21514 -23202 -25790 -27002 -25518 -10728 -5133 -1216 -2776 -796 4323 8864 5832
14333 5832 -2241 -4899 -11211 -2875 -935 -9069 -19136 -8444 -636 98 3381 3686 -5569 -12656 -23562
14318 -23562 -25108 -17971 -16020 -16996 -14421 -9250 -11048 -8763 -10965 1458 -2522 -5281 4451 3207
14304 3207 -8261 -12706 -4728 9806 9213 8299 13619 12633 10444 11764 12770 372 5996 9733 191
14289 191 -2829 2775 5641 7126 -5755 -7743 1292 8473 7332 -1506 -3882 -1761 -5262 -9363 -12725
14274 -12725 -4678 -2861 -6944 -8149 -19011 -16033 -16022 -12880 -23543 -19629 -16596 -18455 -8758 -8500 -11554
14259 -11554 -2849 -2750 -2008 -17386 -19076 -15853 -21405 -22724 -14977 -8217 -2022 3440 9 -4981 -6308
14244 -6308 -8177 -2501 237 1142 7036 3246 3436 1866 1579 3298 -489 -2716 -7645 -16408 -10283
14229a0283L897k529l755N707R304m348n543N725N58k507N008q070K052O659J142
14214C017o604K657j808p525P409N497J061L184o821j0506O71M610L55k259j667
14199h729Q578N731n163r198J0817M677Q11N496n585k324q902Q963P295P046m269
14184A5244j0127k713m393o321o02M548L948n682j427o40P609O020q1j2309l531
14169a0457j822Q69O63N526j40o129L813K932O360K788J80L286k692r958m854
14154i635R747O790L563j1225k66k457l127O815p995r107L124k685l77N566J22
14139a1147R43J0117L953l344o280k94j626L66J469j090l912n385J4320N775l496
14124C69l611N241O181l430j0699L880L809j389K970L66j0021q170q941l469J0860
$$ plain form
14229 -10283 -6386 -8915 -12670 -6963 2341 -2007 -7550 -1825 -1267 -3774 1234 -6836 -4784 1875 3017
14214 3017 -3587 -930 -2738 -10263 -2854 2643 3704 6888 67 -10439 -9768 -5158 -4803 -7062 -8729
14199 -8729 -151 5580 417 -8781 2036 6713 7524 13020 7435 5111 -3791 5172 12467 19513 15244
14184 15244 5117 2404 -1989 -8310 -8912 -4364 -416 -6098 -7525 -8165 -556 5464 5383 -6926 -10457
14169 -10457 -12279 -11410 -10747 -5221 -5361 -11490 -7677 -4745 1615 4403 4583 7869 5177 -4781 -9635
14154 -9635 112 6902 10465 -760 -1026 -3483 -6610 205 -7790 -16897 -13773 -16458 -16835 -11269 -11147
14139 -11147 -10204 -87 3866 522 -5758 -6052 -7678 -7312 -5843 -6933 -10845 -16230 -1910 3865 369
14124 369 -3242 1999 8180 4750 -5949 -2069 1740 351 3321 3687 -6334 -14504 -23445 -26914 -16054
14109a6054P286R245K771M541J477j348k596l925L481l737q025L991Q560k342
14095C325K835K095l755L828N069n919q473J171j071m351o5K476p02m381p321
14080a5239N793L020O793J3199J819K2l966j138m291l528J325J5366J3445p245
14066B5375o982Q597J3805J1894l01o018j5174m382j392L292l224q248j149l593
14052A2500l41O556m148l847m422R22o155M452O728k590k722p012k375r668l497
14037a5619J471P334J30O482P831j591l911l706k71J0924R226l676K313n70n721
14022A0646m330L223L104j6811p996j767J2340N33p206j0269q32P210J4866r33
14008A778j498p624o095L597k748l749N279K024K15l753L730J4114p059r025K271
$$ plain form
14109 -16054 -8768 477 3248 7789 9266 7918 5322 1397 4878 1141 -6884 -2893 5667 3325
14095 3325 6160 8255 4500 8328 13397 7478 -995 176 -895 -5246 -5311 -2835 -3537 -7918 -15239
14080 -15239 -9446 -6426 367 13566 15385 15407 11441 10303 6012 2484 3809 19175 32620 25375
14066 25375 18393 26990 40795 52689 52388 46370 31196 26814 25422 28714 25490 17242 16093 12500
14052 12500 12159 18715 14567 10720 6298 7220 1065 5517 12245 9655 6933 -79 -2454 -12122 -15619
14037 -15619 -14148 -6814 -6684 -202 7629 6038 2127 -1579 -1850 9074 18300 14624 16937 16367 10646
14022 10646 6316 9539 12643 -4168 -12164 -13931 -1591 -1058 -8264 -18533 -19365 -12155 2711 1778
14008 1778 280 -7344 -13439 -9842 -12590 -16339 -11060 -9036 -8821 -12574 -8844 5270 -1789 -10814 -8543
13993h543k541Q22M061m616J33q49L647J5777M699l18l706o852m025k569J636
13978c244k749j0478o657o87o330O804K0698O748l168O046N85j2865j7126o375
13964b8798N313k463N781J4367J5094m105k671N752n512m137j044m549m754L363
13950h363K788n260J171N698L878l2l090j766K822j776n004m379J662L676K680
13935e295n051O453K451R58m024J86N346O489J429m634j1026k705Q131P899J063
13920G670N897j262j0947l679J349k012o703n80Q462J6970L02j2035j3278N817
13906d029k730K860l504q22J1325O050j691Q56o857k905n211k295N21L649M28
13891d355k747l182N575j368J0380j836k930J66L949K307j3261q382l656R966
$$ plain form
13993 -8543 -11084 -10262 -6201 -10817 -10684 -11533 -7886 7891 12590 12272 8566 1714 -2311 -4880 -3244
13978 -3244 -5993 -16471 -23128 -23815 -30145 -23341 -2643 4105 937 6983 7568 -5297 -22423 -28798
13964 -28798 -23485 -25948 -20167 -5800 9294 5189 2518 8270 2758 -1379 -2423 -6972 -11726 -8363
13950 -8363 -5575 -10835 -9664 -3966 -88 -120 -3210 -4976 -2154 -3930 -8934 -13313 -11651 -7975 -5295
13935 -5295 -10346 -3893 -1442 -484 -4508 -4322 1024 7513 8942 4308 -6718 -9423 -1292 6607 7670
13920 7670 13567 12305 1358 -2321 -972 -2984 -9687 -10267 -1805 15165 15467 3432 -9846 -4029
13906 -4029 -6759 -3899 -7403 -8225 3100 9150 7459 8315 1458 -1447 -6658 -8953 -8432 -4783 -4355
13891 -4355 -7102 -10284 -4709 -6077 4303 2467 -463 -297 3652 5959 -7302 -15684 -19340 -9374
13877i374N879N124l50j2028p761J5643L498l417o238k94j620K629r8L49Q079
13862B1P668l99k767l926j015O823N233p368n280J406J898J931q032o952J855
13847h904J723N09m338o683N957Q718l109q946O870Q296m181r106N727K197k518
13832g788p94j1402n592Q454J5141N78o489m103P920Q569m916r312J415J81N32
13817g606j456l439l264M334K315O567J440O807j033j1899J987Q009P000J00j3169
13802c307j6188l732j0026K175M29J8594Q885o136L476O309m364q280r51N673
13788g443L118k992j7899J090M827M864K722K771J56k343n7p449k267j928P591
13773a5239K056N488k515k95l279P833L399R64k351N529J718q813r220Q54o901
$$ plain form
13877 -9374 -3495 1629 1279 -10749 -18510 -2867 631 -2786 -9024 -9318 -10938 -8309 -8407 -8058 21
13862 21 7689 7290 4523 597 -418 6405 11638 4270 -1010 396 2294 4225 -3807 -10759 -8904
13847 -8904 -7181 -6672 -11010 -17693 -11736 -3018 -6127 -15073 -8203 93 -4088 -13194 -7467 -5270 -7788
13832 -7788 -8582 -19984 -25576 -17122 -1981 -1403 -7892 -11995 -4075 4494 -422 -9734 -8319 -8138 -7606
13817 -7606 -9062 -12501 -15765 -11431 -9116 -2549 -1109 5698 4665 -7234 -5247 2762 9762 9862 -3307
13802 -3307 -19495 -23227 -33253 -31078 -30649 -12055 -3170 -9306 -5830 479 -3885 -12165 -13116 -7443
13788 -7443 -4325 -7317 -25216 -24126 -19299 -14435 -11713 -8942 -8786 -11129 -11186 -18635 -20902 -22830 -15239
13773 -15239 -13183 -7695 -10210 -10505 -13784 -5951 -2552 -1588 -3939 1590 3308 -5505 -14725 -13871 -20772
13758b0772J0796N320m625j618K5380J5172J5521J7622J1846p916j3778r52J3628
13745F5624j1722j2210q724r592n892j749j0782k603l104l536K50n422L49O484
13731b629J3374k297L488K12m471k652j0288l237J0268L204L451n604K559J2700
13717A8078j066j4626j1827J119l558m584J588Q597L387K918p150n620j1476O723
13703a7497J0431n329M582Q499j451J9469M845l013r307o137l173p155J1205K674
13689H643p473j975J478O458M998K869j685p800o484M021o000k377K081j326O075
13674A503N905m32m191l103j420q360P80J0511M631j3042m486O20J842J0885K681
13659D324j621r083l689q222m18j867K4056K511p016j0054P497Q08m022K225M498
$$ plain form
13758 -20772 -9976 -4656 -9281 -10899 14481 29653 45174 62796 74642 66726 52948 51996 65624
13745 65624 53902 41692 32968 23376 17484 15735 4953 2350 -754 -4290 -4040 -9462 -9113 -2629
13731 -2629 10745 8448 11936 12148 7677 5025 -5263 -8500 1768 4972 8423 2819 5378 18078
13717 18078 17012 2386 -9441 -8322 -11880 -16464 -14876 -6279 -2892 26 -7124 -12744 -24220 -17497
13703 -17497 -7066 -12395 -7813 686 -765 18704 23549 20536 11229 5092 1919 -5236 5969 8643
13689 8643 1170 -805 673 7131 12129 14998 13313 5513 -971 3050 -2950 -5327 -3246 -4572 1503
13674 1503 7408 6976 2785 -318 -1738 -10098 -9318 1193 5824 -7218 -11704 -11084 -9242 1643 4324
13659 4324 2703 -6380 -10069 -18291 -18709 -20576 3480 5991 -1025 -11079 -3582 -2774 -6796 -4571 -73
13644g3r670l312P122R152Q207L063K522p41o799j2480j736J879k608J5M622Q245
13628G408n651j3180n212P694K273R382k168q363O149O190J717o939j0577L002
13614h275m86K368Q862O167l271o917J788P894J673p514m645P071k572l817q45
13599b519q61n70m276j177K05k547k142O1O140J1876K397L300K173q771M1J296
13583D626K45N963O04J547n911j3465m595O740P344J00N93M864m112n338OR489
13567H700m350P851l94o273q788m121N26L864r71J020K118M631J0578M164O021
13552B4576Q583L063R873L393r048r482j1966m770J789L892Q109o162p359n987
13538H504m39M894m940m000j860N50J0683k665o387Q214k269J399m389J737m66
$$ plain form
13644 -73 -9743 -13055 -5933 3219 11426 14489 17011 16270 9471 -3009 -4745 -2866 -5474 -5459 -837 7408
13628 7408 1757 -11423 -16635 -8941 -6668 2714 546 -7817 -1668 4522 6239 -700 -11277 -8275
13614 -8275 -8761 -6393 2469 8636 5365 -1552 236 8130 9803 2289 -2356 4715 2143 -1674 -2519
13599 -2519 -3380 -3950 -8226 -9403 -9198 -11745 -13887 -13826 -7686 4190 6587 9887 12060 3289 3330 4626
13583 4626 4871 10834 11438 12985 7074 -6391 -10986 -4246 3098 3198 3791 8655 4543 -795 -789 8700
13567 8700 4350 12201 11807 5534 -3254 -7375 -6849 -2985 -3956 -2936 -818 3813 14391 18555 24576
13552 24576 33159 36222 46095 49488 40440 30958 18992 14222 16011 19903 28012 21850 14491 8504
13538 8504 8065 12959 8019 4019 2159 2709 13392 10727 4340 12554 10285 11684 7295 9032 8566
13523H566l71K774N365n633j4872L845O897Q70k007m55k237N164N33n843m135
13508a539L795L211L112k34m387J23k955j3281J648K193j745r202K247P043l615
13493a3586P68N014O124R5n599m224J407p48M799O481n320l729N689l913Q356
13478A614Q840k722m770m65N636m699O32L269k297j8135k729R270J3969j357m060
13463A996n086M841l745o199J897J1914K32j1097M696J5000q17k77L883r335q360
13448d57M075R338m987l271p170j0428N137Q774J653l987p323l002J285K943L982
13433c438J86M32M802M462K478K446j0593j060J515P11k216q78q94m088o09O23
13417f121m291j022N037K331k11j291n565n854N484N656j809j940J60n905J139
$$ plain form
13523 8566 8195 10969 16334 10701 -4171 -326 6571 7441 5434 4979 2742 7906 8439 2596 -1539
13508 -1539 2256 5467 8579 8345 3958 4081 1126 -12155 -10507 -8314 -10059 -19261 -17014 -9971 -13586
13493 -13586 -12818 -7804 -1680 -1585 -7184 -11408 -10001 -10749 -5950 531 -4789 -8518 -2829 -6742 1614
13478 1614 10454 7732 2962 2497 8133 3434 4066 7335 5038 -13097 -15826 -6556 7413 6056 1996
13463 1996 -3090 1751 -1994 -8193 -6296 5618 5850 -5247 -551 14449 13632 13355 17238 7903 -457
13448 -457 3618 12956 7969 4698 -2472 -12900 -7763 1011 2664 -1323 -8646 -11648 -10363 -7420 -3438
13433 -3438 -3252 -2820 1982 6444 8922 11368 775 -285 1230 1941 -275 -1153 -2047 -6135 -6744 -6121
13417 -6121 -10412 -11434 -6397 -4066 -4277 -5568 -11133 -16987 -11503 -5847 -7656 -9596 -9436 -15341 -14202
13402a4202k611M226k01L108l384J0432M267n301R14L005j621k046q536n080Q516
13387h514M067j54j460O243O918L704k945P978m49n444l768p178q037j883P64
13372a0158Q730l370o086q554J756Q821k92L320k062K806L357j0371n423L606
13358a3920J0532o519q318m738o893M715M610M004N905K532j339J803M437l499
13344f688n892k431J076R349M658O928J662J49m231j4569m193R194J854L386q32
13329e80j798L846N444p353o779l333q4M424M874R009O859o143n76o799o422k599
13313h010K454k561k976K936J3902J226l213L742O1p089j44m766m232N277K895
13298d98j3517j176P360L561N78q29r84m689k687K814R821m806q540k413n815
$$ plain form
13402 -14202 -16813 -12587 -12788 -9680 -13064 -2632 1635 -3666 -2752 253 -1368 -3414 -11950 -17030 -8514
13387 -8514 -4447 -4601 -6061 182 7100 10804 7859 15837 15388 9944 6176 -1002 -9039 -10922 -10158
13372 -10158 -1428 -4798 -10884 -19438 -17682 -8861 -9153 -5833 -7895 -5089 -1732 -12103 -17526 -13920
13358 -13920 -3388 -9907 -18225 -22963 -29856 -25141 -20531 -16527 -10622 -8090 -9429 -7626 -3189 -6688
13344 -6688 -12580 -15011 -13935 -4586 72 7000 8662 8811 4580 -9989 -14182 -4988 -3134 252 -580
13329 -580 -2378 1468 6912 -441 -7220 -10553 -10637 -6213 -1339 7670 14529 8386 7810 1011 -5411 -8010
13313 -8010 -5556 -8117 -11093 -8157 5745 6971 3758 7500 7561 472 328 -4438 -8670 -3393 -498
13298 -498 -14015 -15191 -7831 -4270 -3692 -4521 -5505 -10194 -12881 -10067 -246 -5052 -13592 -16005 -21820
13283b1820J822M784M588L013M141N70n544O084m023p84O671Q738M22l473n42
13268D647j194r726n288R116n449j723o890j784K428j566K122R003l904r544O259
13253a3493J4585M441n83j118n615q775k393j090M730R53Q165p792n76N933l901
13238f529L788J208N640R697J0047o223r643N470O53k065o42J413j587o435P577
13223A2369M05K033j145o243m901l788m903L36J111n711N036L436k151P08m57
13208c865N192R78q06J0038N873j3996p362R27M284P392j019J0851m405j3422
13194F60L074J8151M2982N3585N08k3807j7566k7087j8810j3155P76m493k475
13181A2343q281m830J407K649l44M428O694m002m669q286M07J1292N353j0221
$$ plain form
13283 -21820 -19998 -15214 -10626 -7613 -3472 -2902 -8446 -2362 -6385 -7169 -498 8240 8662 5189 4647
13268 4647 3453 -6273 -11561 -2445 -7894 -9617 -16507 -18291 -15863 -17429 -15307 -6304 -10208 -19752 -13493
13253 -13493 1092 5533 4950 3832 -1783 -10558 -12951 -14041 -9311 -8358 -193 -7985 -8561 -2628 -6529
13238 -6529 -2741 -1533 4107 13804 23851 17628 7985 13455 14108 12043 11401 12814 11227 4792 12369
13223 12369 12774 14807 13662 7419 2518 -1270 -6173 -5837 -4726 -10437 -5401 -1965 -4116 -3408 -3865
13208 -3865 1327 2305 1499 11537 17410 3414 -3948 -3021 1263 8655 7636 18487 14082 660
13194 660 3734 21885 64867 118452 118960 95153 77587 50500 31690 18535 19311 14818 12343
13181 12343 4062 -768 639 3288 2944 7372 14066 10064 5395 -2891 -2484 8808 14161 3940
13167C940j2630j0560o744K996J5846N060L987J0385L599n516m448m37J396p715
13153h41j724M510m109j749M86r377j432r033O070R903j288k09L615o024K419
13138h783J322N562q052r866J1486P275J925J896n718J247L123K025n05K501k427
13123C011l001k566j590R552j427l655M614Q39q84m601o737K120k878p562N476
13108i289M090l104P464J204k4k60N157J722l866k366J664O19j4408p562N255
13093a3704M088J013J621N207J485q540M646N672j6778n239K871M665R788J0453
13079G248K387n830n162L34P106M176j800j3765m219R32j0q70k599O16q046o849
13063b6351Q216P197J1882J2593l443n564j39q481n349j441K063R09p613j810
$$ plain form
13167 3940 -8690 -19250 -25994 -22998 -7152 -2092 1895 12280 15879 10363 5915 5478 6874 -841
13153 -841 -2565 1945 -2164 -3913 -3427 -12804 -14236 -23269 -17199 -7296 -8584 -8793 -5178 -11202 -8783
13138 -8783 -7461 -1899 -9951 -19817 -8331 -1056 869 2765 -2953 -1706 1417 3442 2937 5438 3011
13123 3011 10 -2556 -4146 5406 3979 324 4938 5777 4893 292 -6445 -4325 -7203 -14765 -9289
13108 -9289 -5199 -8303 -839 365 341 81 5238 6960 3094 728 2392 3011 -11397 -18959 -13704
13093 -13704 -9616 -8603 -6982 -1775 -290 -8830 -4184 1488 -15290 -20529 -17658 -12993 -3205 7248
13079 7248 9635 3805 -1357 -1023 6083 10259 8459 -5306 -9525 -8593 -8603 -9473 -12072 -11456 -19502 -26351
13063 -26351 -18135 -10938 944 13537 10094 4530 4391 -4090 -9439 -10880 -8817 -7908 -15521 -17331
13049a7331P860O496R471M139m736j661l88k029o716K009n70p480j0744L270J2490
13034e920L186R2j5366p514O218O975N022J45n427m073O226R473N93P472m360
13019B742j329J251O371m378q387j0109O061R553L186K320O801M903l692K472
13005A7765O141q42n796p655k80N547K818j3849j0711o621O06J718K079n599k353
12990a7032k890l254m96L093J0826Q955q195o676o432n882N591Q312K977P45l437
12975a3795O312P505J475o087M81O199N500l712Q62J531M389J949l461k659j1447
12960d958J995k218K12L412O054J231m420m285o258l329J197J852P113M422N598
12945G618K315n975K114R32J935K834j895L338j279q17j540j1208M119N03q684
$$ plain form
13049 -17331 -9471 -2975 6496 10635 5899 4238 3850 1821 -4895 -2886 -3456 -10936 -21680 -18410 -5920
13034 -5920 -2734 -2642 -18008 -25522 -19304 -12329 -7307 -7162 -12589 -16662 -10436 -963 -370 7102 2742
13019 2742 1413 2664 9035 4657 -3730 -13839 -7778 1775 4961 7281 14082 18985 15293 17765
13005 17765 23906 23064 17268 9613 9333 14880 17698 3849 -6862 -13483 -12877 -11159 -9080 -14679 -17032
12990 -17032 -19922 -23176 -23672 -20579 -9753 -798 -8993 -15669 -22101 -27983 -22392 -14080 -11103 -10358 -13795
12975 -13795 -7483 22 1497 -4590 -4109 2090 7590 3878 4740 6271 10660 12609 9148 6489 -4958
12960 -4958 -2963 -5181 -4969 -1557 4497 5728 1308 -2977 -9235 -12564 -11367 -9515 -2402 2020 7618
12945 7618 9933 3958 6072 7004 8939 11773 9878 13216 11937 11120 9580 -1628 2491 2994 -5690
12930e690j0584L026n292P916N147j0914l288O534J1118P366K395n140J0869j971
12916A1492j4332m725J0104j700q671L858R416m756l186l860K652n953j327n45
12902a1533L072P165M184j072n948r154L990M350L529j987k558p66N458J828j0447
12887i889L697O399o738k49M05J898M056o707M615L602N527M745j1011j2994K453
12872a0191N363M799L939k711Q21M903L546N157P524j2236j489L291p805n753
12858h42k354j2022r077l963m56J5879O962j591l518o36N527K882M114q90Q650
12843H665R484K841r589n052q810l026J927l173k295j343k172k686m302P979Q539
12828c013M824R558M611o448k3756j1105J3416J1792L537J014K863l879j927j1815
$$ plain form
12930 -5690 -16274 -13248 -18540 -10624 -5477 -16391 -19679 -13145 -2027 5339 7734 2594 13463 11492
12916 11492 -2840 -7565 2539 839 -7832 -3974 5442 686 -2500 -6360 -3708 -9661 -10988 -11533
12902 -11533 -8461 -1296 2888 1816 -4132 -13286 -9296 -4946 -1417 -3404 -5962 -6728 -1270 558 -9889
12887 -9889 -6192 207 -6531 -6780 -6375 -4477 -421 -7128 -2513 1089 6616 11361 350 -12644 -10191
12872 -10191 -4828 -29 3910 1199 2020 6923 10469 15626 23150 10914 9425 12716 4911 -842
12858 -842 -3196 -15218 -24295 -28258 -28714 -12835 -5873 -7464 -10982 -11618 -6091 -3209 905 15 8665
12843 8665 18149 20990 11401 6349 -2461 -5487 -3560 -6733 -9028 -10371 -12543 -15229 -19531 -11552 -3013
12828 -3013 1811 11369 15980 9532 -14224 -25329 -11913 -121 3416 4430 7293 3414 1487 -10328
12814a0328k493L366M933M713L173n429m074j660J61J0737n93N10j7887p096M707
12799a7260P523m91J634L298R946J0291l748m160o232j816m211j403P711O003
12785G085m68L89l277p974q721K95q62r55Q875J1303K089k028j093q506l057n01
12769g406J0669M610j618k078n805J381r999r851M550Q024L707j122O947j278
12755G31l932k324q060RO296J877K992m932j436N066r41q599O767N14o990K879
12739a0083L754n539o55K839n524m995J221Q694P907M127P928K879m381l742M224
12724H654j839n542r891P664J910l511R295k384m208l62J684l223O86N43Q77k138
12708a785m370J0070J882M227l306r853k069J850P653J729j371o475m34n526p472
$$ plain form
12814 -10328 -12821 -9455 -4522 191 3364 -2065 -6139 -7799 -7638 3099 2506 3016 -14871 -21967 -17260
12799 -17260 -9737 -10228 -8594 -5296 4650 14941 11193 7033 801 -1015 -5226 -6629 1082 7085
12785 7085 6617 7006 3729 -4245 -12966 -12671 -13533 -14488 -5613 5690 7779 5751 4658 -3848 -6905 -7406
12769 -7406 3263 7873 6255 4177 -1628 -247 -10246 -20097 -15547 -7523 -3816 -4938 2009 731
12755 731 -3201 -5525 -13585 -13576 -7280 -5403 -2411 -7343 -8779 -3713 -4654 -13253 -6486 -5972 -12962 -10083
12739 -10083 -6329 -11868 -12523 -9684 -15208 -20203 -18982 -10288 -2381 1746 9674 12553 8172 4430 8654
12724 8654 6815 1273 -8618 -954 956 -2555 6740 4356 148 -214 1470 -1753 -1067 -524 353 -1785
12708 -1785 -6155 3915 5797 10024 6718 -3135 -5204 -3354 4299 6028 4657 -1818 -2252 -7778 -15250
12693a5250L264R920j479J294j51J780Q831q141j4012L204J410L505R104L33r355
12678e743k676R64R447K186K67P64p611j1421j99K269L756k129j650J854j125
12663a1047P339R683q072q311l734K177Q979K416k925n262O031P56O397K585L35
12648G347k589q210K004J00L403j241M192r568l810L145R623N735k699j438q36
12633E158K165r454j0868k100P063J0602m585N077O414j17l052L852j880n445
12619B830k480J91o947N715M169K07j345j892m2k641m31k772p162R033K274p732
12603i025L573M178l354k29M45n567L023J56O2O43O408N169l416l272j305j991
12587d502n241l849M834J199r485O53O761J960j191P020l896p255O950Q534l817
$$ plain form
12693 -15250 -11986 -2066 -3545 -2251 -2402 -622 8209 68 -13944 -10740 -9330 -5825 3279 3612 -5743
12678 -5743 -8419 -7455 1992 4178 4445 5209 -2402 -13823 -14022 -11753 -7997 -10126 -11776 -9922 -11047
12663 -11047 -3708 5975 -2097 -10408 -14142 -11965 -2986 -570 -3495 -8757 -2726 -1970 4427 7012 7347
12648 7347 4758 -3452 -1448 -1348 2055 814 5006 -4562 -8372 -5227 4396 10131 7432 5994 5158
12633 5158 7323 -2131 -12999 -15099 -8036 2566 -2019 3058 9472 9355 6303 10155 8275 2830
12619 2830 350 541 -6406 -691 3478 3685 2340 448 406 -2235 -2666 -5438 -12600 -3567 -1293 -9025
12603 -9025 -5452 -1274 -4628 -4857 -4412 -9979 -6956 -6800 -6738 -6095 313 5482 2066 -1206 -2511 -4502
12587 -4502 -9743 -13592 -8758 -7559 -17044 -16391 -9630 -7670 -8861 -1841 -5737 -12992 -6042 2492 -1325
12572a325r342j916o553n28R615K876K155P190L956n696M686L147M609k523L874
12557A4225l976m018q755k31N997P045j912k674L243M713L007n762n305k263K442
12542E776J512P263P908J407l869K210J0929q964m929K1909K3089J0349K2384
12529I6974L2570J7267J0000J4027J5077P390n014j7785k2336j2962j4438k5557
12517I5213j6997o635j2013k3334j0919m952q811M77k332j314j477j938l071J0522
12503A2419N268J980j425j669Q91n350o809K911J532L093J372K878O94r597l263
12488D925l077k568l108J0796R781j4794j4568M660J1700N213L64O22r842o158
12474f054J635N201j614J686l49p705L239r74L025L513O727K67j638k978K634
$$ plain form
12572 -1325 -10667 -12583 -19136 -19664 -10049 -7173 -5018 2172 6128 432 5118 8265 12874 10351 14225
12557 14225 10249 6231 -2524 -2755 3242 10287 8375 5701 8944 13657 16664 10902 5597 3334 5776
12542 5776 7288 14551 22459 23866 19997 22207 33136 24172 19243 41152 64241 74590 96974
12529 96974 129544 146811 156811 170838 185915 193305 188291 170506 148170 135208 120770 95213
12517 95213 78216 71581 59568 36234 25315 20363 11552 12029 9697 8383 6906 4968 1897 12419
12503 12419 17687 19667 18242 16573 17464 12114 5305 8216 9748 12841 14213 17091 17785 8188 4925
12488 4925 1848 -720 -3828 6968 16749 1955 -12613 -7953 3747 8960 9324 9946 104 -6054
12474 -6054 -4419 782 -832 854 505 -7200 -3961 -4935 -1910 1603 8330 8597 6959 3981 6615
12459F615j541P94J4486K533o089o363K62J396J190j913J059K056j1427j168R947
12444A1837M658m707j2168k343O052J05K358L709l277k205L481k056m151K882
12430D175J348l605J752j712j3110q751Q487N84P098J482N813N525J646m436o063
12415B33k513L507o80N910k903J340Q870o055k414Q735J960k492n361l40L237
12400A1034M183n326j1797J535k597L757K412n034L03O689k134m029q407R19Q561
12385F9J142n589J619k826O86Q282P751K668n646q544L253J0360l438L870J0771
12370B4428j407p216l364J4656o13n550m196l913m821l779L17N067J810l736k638
12355E045l402J140j273k159J0345Q061M568m074l192N53o448p11N422j0743o374
$$ plain form
12459 6615 5074 5868 20354 22887 16798 10435 10697 12093 13283 11370 12429 14485 3058 1890 11837
12444 11837 16495 11788 -380 -2723 3329 3434 5792 9501 6224 4019 7500 5444 1293 4175
12430 4175 5523 1918 3670 1958 -11152 -19903 -11416 -10832 -3734 -2252 3561 9086 10732 6296 233
12415 233 -2280 1227 547 6457 3554 4894 13764 7709 5295 14030 15990 13498 8137 7797 11034
12400 11034 15217 9891 -1906 -371 -2968 789 3201 -1833 -1530 5159 3025 -1004 -9411 -8492 69
12385 69 1211 -4378 -2759 -5585 -4899 3383 11134 13802 8156 -388 2865 13225 9787 13657 24428
12370 24428 23021 15805 12441 27097 26484 20934 16738 12825 8004 4225 4542 9609 11419 7683 5045
12355 5045 1643 2783 1510 -649 9696 17757 22325 18251 15059 15612 9164 8453 13875 3132 -3242
12340c242N196J3086P016l159l143m651k580p256n272r082P784R586J673n46R73
12325F383R86m442m560k884j166R373K163l424N505Q12R346J0311n562j0805K84
12310A2320L016J4097P561k302J015o171J56o75m506n456j0922O01L83L084j426
12295A0775m581j0688p375M705J3313O406k342l078M713j748j2580Q381J0052
12282A5953N663Q069L071p75k655L359Q425N033J138j731j979n86m532o550J013
12267C2916j060j1763j3286n249j1009n834m736J597J664o51M276R142K526J507
12253D0p700L814J941O136J462r556r380J148N024l94L862P791N102m596K825
12238G519J754L361Q951M427J848J4211k205k001L403j290n77j63n966l142p689
$$ plain form
12340 -3242 1954 15040 22056 18897 15754 11103 8523 1267 -4005 -13087 -5303 4283 5956 5410 6383
12325 6383 7369 2927 -1633 -4517 -5683 3690 5853 2429 7934 8746 18092 28403 22841 12036 12320
12310 12320 15336 29433 36994 34692 35707 29536 29692 29017 24511 19055 8133 8734 9117 12201 10775
12295 10775 6194 -4494 -11869 -7164 6149 12555 10213 7135 11848 10100 -2480 5901 15953
12282 15953 21616 29685 32756 31981 29326 32685 41110 46143 47281 45550 43571 42985 38453 31903 32916
12267 32916 31856 20093 6807 1558 -9451 -15285 -20021 -18424 -16760 -17411 -13135 -3993 -1467 40
12253 40 -7660 -3846 -1905 4231 5693 -3863 -13243 -12095 -7071 -7465 -3603 4188 9290 4694 7519
12238 7519 9273 12634 21585 26012 27860 42071 39866 37865 41268 39978 39401 39238 33272 30130 22441
12223B2441L502L259M74p911K69k905r230l135P685P931q203l462N664q550j0740
12208b911k592J0869J5168L382M882O255l499o13R40K488O10m045L800n740P372
12193C6366Q886P763M999j859R572R314J0658K678j0049q285l96q616K241R060
12179G2332l695m445k61k739j305Q61K851l897p792J5038J2742k323M997J6701
12165I9065P775k638q00Q587J375r46J3273J3276j146o709N480J8387J6395J4669
12151A86043R986J2672J4857Q062J3919J8358J9955K7446K4145J9416K4250K7086
12139D06195N9749N8292M7124N9627Q6605R7430J32749J52638J73365K15583K50078
12128A739435K72817K94485L18193L41053L54982M23916N35680P08130R89749
$$ plain form
12223 22441 25943 29202 29676 21765 22034 19129 9899 6764 14449 22380 14177 10715 16379 7829 -2911
12208 -2911 -5503 5366 20534 23916 28798 35053 31554 30941 31881 34369 34979 30934 34734 28994 36366
12193 36366 45252 53015 58014 56155 65727 75041 85699 88377 78328 70043 69647 61031 63272 72332
12179 72332 68637 64192 63931 61192 59887 60748 63599 59702 51910 66948 79690 77367 82364 99065
12165 99065 106840 104202 103402 111989 113364 112418 125691 138967 137821 131112 136592 154979 171374 186043
12151 186043 196029 208701 223558 231620 245539 263897 283852 311298 335443 354859 379109 406195
12139 406195 465944 524236 571360 630987 717592 815022 947771 1100409 1273774 1489357 1739435
12128 1739435 2012252 2306737 2624930 2965983 3320965 3744881 4280561 4988691 5978440
12119E978440J455681K140371K976466L803640M558381N087396N097879M524573
12111C5622827L482763J948344J09605j703545l231476m298877m792273m805594
12103B2331774m401630l707183k912498k169330j567881j134021q18046o15131
12095E006054n01544m43351l95976l62686l57359l29152k89521k49464k14729
12086A862272j91173j58851j24554j05418j00134p3265q1688p4504n7392n2360
12076H42933m4525m1718m4919m6018m3322m0085l0430k7399k3602l0033k2586
12065D48296k4917k3793j4517j4008j1087o702n625p983O453P709R412R003K912
12052C75153p589j4608j7692j2461r905j9625l0873k7224k1343j0219j5390j2902
$$ plain form
12119 5978440 7434121 9574492 12550958 16354598 20912979 26000375 31098254 35622827
12111 35622827 39105590 41053934 41163539 39459994 36228518 31929641 27137368 22331774
12103 22331774 17930144 14222961 11310463 9141133 7573252 6439231 5621185 5006054
12095 5006054 4504510 4061159 3665183 3302497 2945138 2615986 2326465 2077001 1862272
12086 1862272 1671099 1512248 1387694 1282276 1182142 1108877 1027189 952685 895293 842933
12076 842933 798408 756690 711771 665753 622431 582346 551916 524517 500915 470882 448296
12065 448296 423379 399586 385069 371061 359974 353272 347647 339664 346117 353826 363238 372241 375153
12052 375153 367564 352956 335264 322803 312898 293273 262400 235176 213833 203614 188224 175322
12040A75322j650j468j0133l541O00j2164j6997q846k985m433q7k205n518J2577
12026A18472L924j3775q351m57j747k451N228j1310o886K26k207j644q622p461
12012F2939n266R582K989P696P295p353k712k104Q368L508n32P058p439j3033
11998G0996q08j76K006n143K57P002j151k256N001J916n19l402M49L649L748n195
11982G6374k133q378l408K640M201k380j402m628l80J996o138P558N885J250k431
11967F8626r119o221K970k208J567J11r517k387l30L534j0458j6603j0641q188
11953A136o819j185L112p54q111K039R550Q139J146N051p502j2488Q154K502j764
11938B206O068Q095N878M284n491m705r049K70N936q548p402n050P088p461j184
$$ plain form
12040 175322 173672 172204 162071 158530 159130 146966 129969 121123 118138 113705 113618 111413 105895 118472
12026 118472 122396 108621 100270 99813 98066 95615 100843 89533 82647 82873 80666 79022 70400 62939
12012 62939 57673 67255 70244 77940 85235 77882 75170 73066 81434 84942 84410 91468 84029 70996
11998 70996 70188 70012 72018 66875 67132 74134 72983 70727 75728 77644 77125 73723 74172 77821 81569 76374
11982 76374 74241 65863 62455 65095 69296 66916 65514 60886 60506 62502 56364 63922 69807 71057 68626
11967 68626 59507 53286 56256 54048 55615 55726 46209 43822 43492 47026 36568 19965 9324 1136
11953 1136 -5683 -6868 -3756 -4510 -12621 -10582 -1032 7107 8253 13304 5802 -6686 1468 3970 2206
11938 2206 8274 16369 22247 26531 21040 16335 7286 7556 13492 4944 -2458 -7508 -420 -7881 -9065
11923i065l074k430J0017J1100k113L10N82L90o521q069j283o316n299J1531J7526
11908G286O598r641r702j698J1310K578R31N289J378n614l586N07N108K440j367
11893A1817M32O142K549K011o680j592q08J292Q549K022n019Q179N597q549j9249
11878F693P42J3695l770L337j1836k345j681N63N188p90J439k501m271q632q005
11863a2174M381R073L02K179l961n998M372Q513L494n276M934k751K581J598j1267
11848@p181R214K917q6l312k259k705K239Q606L756J2641Q675j1374k573q711
11833I847q895m308n56l094L399M286J035J401L96M077n21r224p29K824N087p8
11817D947q237m099m430M658J2221n667j3190Q31o25l203L700M148R360P298p28
$$ plain form
11923 -9065 -12139 -14569 -4552 6548 4435 4745 5327 5717 -804 -8873 -10156 -16472 -21771 -10240 7286
11908 7286 13884 4243 -5459 -7157 4153 6731 7662 12951 14329 8715 5129 5636 10744 13184 11817
11893 11817 12249 18391 20940 22951 16271 14679 13871 15163 23712 25734 20715 28894 34491 25942 6693
11878 6693 7435 21130 17360 20697 8861 6516 4835 5398 10586 9796 11235 8734 4463 -4169 -12174
11863 -12174 -7793 1280 1582 3761 -200 -6198 -1826 6687 10181 4905 9839 7088 9669 11267 0
11848 0 -7181 2033 4950 4864 1552 -707 -3412 -1173 7433 11189 23830 32505 21131 18558 9847
11833 9847 952 -3356 -3912 -7006 -3607 679 1714 3115 3511 7588 7067 -2157 -2886 -62 5025 4947
11817 4947 -3290 -7389 -11819 -7161 5060 -607 -13797 -12966 -13591 -16794 -13094 -8946 414 7712 6984
11802F984J520L622R2o880j4240o858m5K15K933J621J0027R434O420n927q332
11787E86Q77P558J0603L241q772j3883p54n293K85L160p02K187L053J149n039
11772a744j101m856j013R879L628J475K372n682j966M59k779m476L992O490q10
11757C868J406P41r170q847M221L579K865L205P402m948p161O515K106M015m987
11742D810l132J2058N581L227j818q115n955K060L697p379k151k731j809J74K892
11727A409K69J726O88l44l773N450J2414P32m151j3226q044O134n487j152K266
11712e089K469O044K715q40M047Q428k17k055R44J331J680m5N140M649Q230R055
11696D6486K4009J4821J3416L1571K3063K3639J6620J360p23r670j1653j8227
$$ plain form
11802 6984 8504 12126 12218 5338 -8902 -15760 -15805 -15590 -12657 -11036 -1009 8425 14845 8918 586
11787 586 1463 9021 19624 22865 14093 210 -544 -5837 -5552 -2392 -3094 -907 2146 3295 -1744
11772 -1744 -2845 -7701 -8714 1165 4793 6268 8640 2958 992 1451 -1328 -5804 -1812 4678 3868
11757 3868 5274 6015 -3155 -12002 -7781 -4202 -1337 1868 9270 4322 -2839 3676 5782 9797 4810
11742 4810 1678 13736 19317 22544 20726 12611 6656 8716 12413 5034 2883 152 -1657 -1483 1409
11727 1409 1678 3404 4092 3748 -25 5425 17839 18571 14420 1194 -6850 -716 -6203 -7355 -5089
11712 -5089 -2620 3424 6139 5299 9346 17774 17557 15502 16446 17777 19457 19412 24552 29201 37431 46486
11696 46486 70495 85316 98732 130303 153366 177005 193625 194985 194262 184592 172939 154712
11684A54712k7128j7289k3303k4361j3555q678j793p064q762k771l10l867j490
11671A4341p584P066K327J506K980L791q14n243j5447j0109K608N897n359k822
11657f862M086p513m318M064K648P891J2733O271L045o930j1546N095Q112l255
11643A3521L65K9o402p422J146P981Q170L840p537k802j3210k840Q18o108R1Q12
11627i548j995M406m676n437K883O495M547L287n893l047n225K552M314O823N3
11612d61p325l275K698O304M871r609l50J0546L520R69N168J520J074r333m99
11597E818p411n842k936r74K019L772J186J1403k450K0Q292M153n172j3708l085
11582d915Q328K701m950R51K263P042J952R755J397q683P777K501m580j4717n029
$$ plain form
11684 154712 127584 110295 86992 62631 49076 40398 38605 31541 22779 20008 19698 15831 14341
11671 14341 6757 13823 16150 17656 20636 24427 23613 18370 2923 -7186 -4578 1319 -4040 -6862
11657 -6862 -2776 -10289 -14607 -10543 -7895 -4 12729 19000 22045 15115 3569 8664 16776 13521
11643 13521 13886 13915 7513 91 1237 9218 17388 21228 13691 10889 -2321 -5161 -4343 -10451 -10360 -9548
11627 -9548 -11543 -7137 -11813 -17250 -14367 -7872 -3325 -38 -5931 -8978 -14203 -11651 -7337 -514 -461
11612 -461 -7786 -11061 -8363 -2059 2812 -6797 -7147 3399 6919 7888 13056 14576 15650 6317 5818
11597 5818 -1593 -7435 -10371 -11345 -9326 -5554 -4368 7035 4585 4605 12897 17050 11878 -1830 -4915
11582 -4915 3413 6114 1164 2115 4378 11420 13372 23127 24524 15841 23618 26119 21539 6822 1793
11567A793J804N591l787m014l820m195N50o329k001O362L571R514R821N169j3333
11552F696o009N428j73m917n361j634J089K007L550j301k459R910O42k992j952
11537B524j9365q091J7491J2674k959k311L401q26O485J1432K311j1986j0730
11524E0p594Q700R489l769j4678m839N079P852Q83O752M403N85L663K145n507
11509A3214N296n25p122O364K624j4466j366r873J662J0096p96l342j4339q238
11495b0811K435j822q98J3683J1027k270M974j1346o518P284O935j1776l778p282
11481b0163q15N236R450K009P664O951p126l007L97k503k909N321O17o299J040
11466d137r518m193J322K148O892j278p588J570J167J237q16j704J406l481J0557
$$ plain form
11567 1793 3597 9188 5401 1387 -2433 -6628 -6078 -12407 -14408 -8046 -4475 5039 14860 20029 6696
11552 6696 687 6115 5942 1025 -4336 -5970 -4881 -2874 676 -625 -3084 6826 7468 4476 2524
11537 2524 -16841 -24932 -7441 5233 2274 -37 3364 2538 9023 20455 22766 10780 50
11524 50 -7544 1156 10645 6876 -7802 -12641 -7562 290 1173 7925 12328 12913 16576 18721 13214
11509 13214 18510 17985 10863 17227 19851 5385 4019 -5854 -4192 5904 5108 1766 -12573 -20811
11495 -20811 -18376 -20198 -21096 -7413 3614 1344 6318 -5028 -11546 -4262 2673 -9103 -12881 -20163
11481 -20163 -20978 -15742 -6292 -4283 3381 10332 3206 199 596 -1907 -4816 505 1122 -5177 -4137
11466 -4137 -13655 -17848 -16526 -14378 -7486 -8764 -16352 -14782 -13615 -12378 -13194 -14898 -13492 -16973 -6416
11451f416L672r59l167J011L210m23p598j371J237j736o348Q47J1221n539p448
11436a9807M702M812L005L20o533o385J472K913j3117q289J4544J1798M135M905
11422a525J7666n703j3148o691P957N017J791j954m173j0341L950J1043O579N425
11408A5893r941l626m129M695K376o579M190o568j343l420N238p146K419K504
11394e437K514K877r04k834P40P246p855q071O820L106J288k408J803Q075k573
11379D387j3064j1535n7m122J95M244p74l931N571L343J3316J2508O568J0096
11365B6745j0735k207n712l601o644j482L454J247J240j145o495k782j021K432
11351f706m418l322K405j386M127K616O14P206L754J694j787l897N341J63o371
$$ plain form
11451 -6416 -2744 -3703 -6870 -5859 -2649 -3072 -10670 -12041 -10804 -12540 -18888 -18041 -6820 -12359 -19807
11436 -19807 -15105 -10293 -7288 -6968 -13501 -19886 -18414 -15501 -28618 -36907 -22363 -10565 -6430 -1525
11422 -1525 16141 10438 -2710 -9401 -1444 3573 5364 3410 -763 -11104 -7154 3889 10468 15893
11408 15893 5952 2326 -1803 2892 5268 -1311 2879 -3689 -5032 -8452 -3214 -10360 -7941 -5437
11394 -5437 -2923 -46 -950 -3784 -3044 4202 -3653 -11724 -4904 -1798 -510 -2918 -1115 6960 4387
11379 4387 -8677 -20212 -20269 -24391 -24196 -19952 -20726 -24657 -19086 -15743 -2427 10081 16649 26745
11365 26745 16010 13803 8091 4490 -2154 -3636 -182 1065 2305 1160 -5335 -8117 -9138 -6706
11351 -6706 -11124 -14446 -12041 -13427 -9300 -6684 -6070 1136 4890 6584 4797 900 6241 6404 33
11336C3n769n870P429N845L825l86m690k198L013p538l992k16N412L828K603o290
11320d961n192l617j001j832L404J3432m62r693j915O850Q315m996M11K601j342
11305BN548K741K429N762K417Q180o290p010j499K692P89o385o678k914m688M717
11289a87O172J443P14J940J796j997o816n479Q492j285L28N90k376J979k504J06
11273B916k959M007R417J989j5156j094M526L164L586j548l63o29l354M27J5090
11258B0019N806k885k16j194J82r26R511J7176Q97j579N106J3505K3225L6728
11244A25355L2618K2792K3419P685m132J488M691R146K4446N0313P4174P3086
11232D45081N1575J8326l1996n8330o5899o9297n6794n0041l1422l0659j6195
$$ plain form
11336 33 -5736 -11606 -4177 1668 5493 5107 417 -1781 1232 -6306 -10298 -10514 -5102 -1274 1329 -4961
11320 -4961 -10153 -13770 -14771 -16603 -13199 233 -229 -9922 -11837 -4987 3328 -1668 -1257 1344 2
11305 2 5550 8291 10720 16482 18899 27079 20789 13779 12280 14972 15761 9376 2698 -216 -4904 -187
11289 -187 5985 7428 8142 10082 11878 9881 3065 -2414 6078 4793 5121 5711 3335 5314 2810 2916
11273 2916 -43 3964 13381 15370 214 -880 3646 6810 10396 8848 8485 7856 4502 4929 20019
11258 20019 25825 22940 22724 21530 21712 20786 30297 47473 48370 46791 51897 65402 88627 125355
11244 125355 157973 180765 204184 211869 207737 209225 213916 223062 247508 297821 371995 445081
11232 445081 496656 514982 482986 424656 358757 289460 232666 182625 151203 120544 104349
11221A04349j5547j9114q282p583j6481q437M219N085j588l323J927L098p469
11208C0854r158o798m294l551N632Q658L266K722o45r679n768K220O232l158p889
11193H644N784R159r416J077r11j65q175j0713O361M289J555L643N568l074j5412
11178a786r963k286R274R091J390n725m813K285P520L976n787R46k559n480M304
11163C87n42j481k508k608M348Q398k837j0639l044K329N025P075n301j0229O907
11148d720J4275J588N179o005m465O996j915n672O038K112j2274k489O329j411
11134C566K502J338L47n630M337M38k812m49J3446N134p306j5296p791O2O503
11119a611L003O230K079q686K182J644k369R657m93j560K525J872j396J70M818
$$ plain form
11221 104349 88802 69688 61406 53823 37342 28905 33124 38209 36621 33298 35225 38323 30854
11208 30854 21696 14898 10604 7053 12685 21343 24609 27331 26686 17007 11239 13459 19691 16533 8644
11193 8644 14428 23587 14171 15248 14337 14172 5997 -4716 1645 5934 7489 11132 16700 13626 -1786
11178 -1786 -11749 -14035 -4761 4330 5720 -5 -4818 -2533 4987 8963 3176 4122 1563 -3917 387
11163 387 -155 -1636 -4144 -6752 -2404 5994 3157 -7482 -10526 -8197 -3172 3903 -1398 -11627 -4720
11148 -4720 9555 11143 16322 10317 5852 12848 10933 5261 11299 13411 1137 -1352 4977 3566
11134 3566 6068 7406 7753 2123 6460 6898 4086 3637 17083 22217 14911 -385 -8176 -8114 -1611
11119 -1611 1392 7622 9701 1015 3197 4841 2472 12129 11636 10076 12601 14473 13077 13247 18065
11104A8065J636p413p467n587K820N629l339l552R498n76j0076O110R272L361
11090A8381k987j270J0654P368L98q899M959J1201K935N238J3915j283k454n374
11076E2782M138K671l223k415p906l082J1370N392N49k713k885k294q986L045
11062D6443M704n213p976L339M852R667J075n745O674J0771K43N931k986o236
11048F5543l851L29R365J590J868j292p783l496P441J0135R12p402o365j0212
11034E6782l592o715K205Q318Q667R580k192q196q766j145P051O130l980R93n366
11019E9774o098j988K406K254j699m971j44J243p375q436p21L264l68L231j4074
11004B6298q800K575J271q809j2354P551L879L697k3J858m97K642p139j7274J08
$$ plain form
11104 18065 19701 12288 4821 -766 2054 7683 4344 792 10290 9714 -362 5748 15020 18381
11090 18381 15394 14124 24778 32146 32544 23645 28604 39805 42740 47978 61893 60610 58156 52782
11076 52782 56920 59591 56368 53953 46047 42965 54335 59727 60276 57563 54678 52384 43398 46443
11062 46443 51147 45934 37958 41297 46149 55816 56891 51146 57820 68591 68834 74765 71779 65543
11048 65543 61692 62021 71386 72976 74844 73552 65769 62273 69714 79849 80761 73359 66994 56782
11034 56782 53190 46475 48680 56998 65665 75245 73053 64857 56091 54946 61997 68127 64147 65140 59774
11019 59774 53676 51688 54094 56348 54649 49678 49534 50777 43402 34966 34245 37509 37141 40372 26298
11004 26298 17498 20073 21344 12535 181 7732 11611 15308 15285 17143 16646 19288 12149 -5125 -5017
10989e017P253Q539N372L082k661j0541j1848j1150N284M729M546l59M044L731
10975E004k93j257n909K211m191j412N594Q868K679P086J291q037n959k361l268
10960D6k655R747L33q51l556J428O256K992n175r536k218J6846J232k984m487
10945G418l267Q86o017J471R876J446o132J114j484k76o55j0087Q48R301J0711
10930A5153o208p274O978K381J0458J230j3865j0801Q701J0347N258m648q329
10917I381k549J401K592j90o188q07K503M895j1546k047O990M112Q332K832q036
10902A1675l111Q68Q68l582L269O305k056k258k866l680K588N563k842o379m196
10887A66m662L676K061k118L398O044M761J188p068q660k036O685n861M620M226
$$ plain form
10989 -5017 2236 10775 16147 19229 16568 6027 -5821 -16971 -11687 -6958 -2412 -2771 1273 5004
10975 5004 4711 3454 -2455 -244 -4435 -5847 -253 8615 11294 18380 19671 11634 5675 3314 46
10960 46 -2609 7138 7471 6620 3064 4492 10748 13740 8565 -971 -3189 13657 14889 11905 7418
10945 7418 4151 5037 -980 491 10367 11813 5681 6795 5311 5035 4380 -5707 -4859 4442 15153
10930 15153 8945 1671 8649 11030 21488 22718 8853 -1948 6753 17100 22358 17710 9381
10917 9381 6832 8233 10825 10635 4447 3640 6143 11038 -508 -2555 4435 8547 16879 19711 11675
10902 11675 8564 9432 10300 6718 9987 16292 14236 11978 9112 5432 8020 13583 10741 4362 166
10887 166 -4496 -820 1241 -877 2521 8565 13326 14514 7446 -1214 -3250 3435 -2426 2194 6420
10872F420l268L398R099m035m63K058o35J710l562L789L635Q66n362j175R2l207
10856I360m96K642m512O380J0261J446q548j875M740L510l054k838p723k563Q836
10841A5566J3995L672q063j2310n643n742L653k893N532N410J683K886J292K453
10827B1491M082Q832O610l038o569K575J997M632Q249j389P77J154L834J2167
10813F5404N315j117K397j2557M023r92J923m700k612R948j309l559J032m260
10799E8936N255N99k65J915J211P067M357L273O548m613k894k627o60L551r37
10784H0716L714N281q47n084l729K472J0205N913J470j1981L831o64j045j747
10770H8505J826l439m37J0071R42o04K653n449j1494j962J919j2221k56o73L691
$$ plain form
10872 6420 3152 6550 15649 11614 11151 13209 12574 14284 10722 14511 18146 19012 13650 12475 12567 9360
10856 9360 8864 11506 6994 13374 23635 25081 16533 14658 19398 22908 19854 17016 9293 6730 15566
10841 15566 29561 33233 25170 12860 7217 1475 5128 2235 7767 13177 14860 17746 19038 21491
10827 21491 25573 34405 41015 37977 31408 33983 35980 40612 48861 47472 48249 49403 53237 65404
10813 65404 70719 69602 71999 59442 63465 62473 64396 59696 57084 67032 65723 62164 63196 58936
10799 58936 64191 64790 64525 66440 67651 74718 79075 82348 88896 84283 81389 78762 78102 81653 80716
10784 80716 84430 89711 88864 83780 80051 82523 92728 98641 100111 88130 91961 91297 90252 88505
10770 88505 90331 86892 86455 96526 97468 96864 99517 94068 82574 80612 82531 70310 70054 69381 73072
10755G3072J0187J929O36k317j271L308P031n166P234o113k690K801J859J126
10741I1626O137Q919j220r114m171J1812L857k283m538K295k615j8321j3763J2253
10727H0874J2424o259m061o242k466K502n66k543j7349p566j712J0974Q309M361
10713G0680o006p343p58p539m689k253o921r96L019l090l080R694J98m010J914
10698C8820J2823l537p27P662J1468l090k934N339p518J179q213m641J0212n927
10684E0916L041K898L917j482o062j519m03r908O451k244Q960Q683j0962l25J0177
10669F2138P119N508R05L460n718l698q019l313K416j0939K392O694M809N181
10655F8935R853k152j2339O013L220J820l316N822M643NL125q837n092n123J781
$$ plain form
10755 73072 83259 85188 85824 83507 82236 85544 92575 87409 94643 88530 85840 88641 90500 91626
10741 91626 97763 106682 105462 96348 92177 103989 107846 105563 101025 103320 100705 82384 68621 80874
10727 80874 93298 87039 82978 76736 74270 76772 76206 73663 56314 48748 47036 58010 66319 70680
10713 70680 64674 57331 56573 49034 44345 42092 35171 34175 37194 34104 31024 40718 40916 36906 38820
10698 38820 51643 48106 47379 55041 66509 63419 60485 65824 58306 59485 51272 46631 56843 50916
10684 50916 53957 56855 60772 59290 53228 51709 51306 41398 47849 45605 54565 63248 52286 51961 62138
10669 62138 69257 74765 75670 79130 73412 69714 61695 58382 60798 49859 52251 58945 63754 68935
10655 68935 78788 76636 64297 70310 73530 75350 72034 77856 82499 82504 85629 76792 71700 66577 68358
10640F8358l433N937n946n270o251J0093O465m214P58J1295O139R345j021N384
10626I7639o646j1806j502N33K847J774L751K860k357l26N439M349K566L471K9
10611A02621k54j3577k01P56o419K219J2285L378J546K142o355M339K372M013
10597A08865M402l409m031N375l639r71J513K427r31K179o664l356J710n112Q725
10582A07083J3591j738n214o284k063j935N364L175J528k459L95N508J4545Q32
10568A32328O32O756J2511m413o904N57j523l364j23R310J664j359J3005J4876
10554A73953Q157R043M3913Q2954J06202M7110k2792n0748o2967n9834m0179j8825
10542B15987j8110o997q27m424k653k99m359k85J5507P750L0r303j407k030O345
$$ plain form
10640 68358 64925 70862 64916 59646 53395 63488 69953 65739 66497 77792 83931 93276 92255 97639
10626 97639 90993 79187 77685 78218 81065 82839 86590 89450 87093 86767 92206 96555 99121 102592 102621
10611 102621 102367 88790 88589 89345 82926 85145 97430 100808 102354 104496 98141 102480 104852 108865
10597 108865 113267 109858 105827 111202 107563 106592 108105 110532 109601 111780 105116 101760 103470 98358 107083
10582 107083 120674 118936 113722 107438 105375 103440 108804 111979 113507 111048 111443 116951 131496 132328
10568 132328 132960 139716 152227 147814 140910 141467 139944 136580 136457 145767 147431 146072 159077 173953
10554 173953 182110 191153 235066 318020 424222 471332 448540 397792 334825 274991 234812 215987
10542 215987 197877 190880 190053 185629 182976 182677 178318 178033 193540 201290 201320 192017 190610 188580 194925
10527A94925K20o743P831J0634M371k418K499J0661M570k705K322m255l387K508
10513B21033N002n473n15N960O64m315J5283J2115N325O371R273m564k173P586
10499B71572j613J001K271k069m579l590R630K646N357L221N090J514J0705K468
10485C03624n263J3431K0170R652r15n072O759N472M360M45L144J5887K2152J0937
10471D04783K574J4625J8565J7878K267O667K724N637P015J1273J5948K0248J9422
10458E49626J3836J2909P226K3590J7649J8754K5479K4135K0147J3987J6467K2877
10446G66682J7602J3757K9489L5282L8551K0576K4585L4983L3287K6983L4520
10435A076297M9104N0301M5016M2986M9690O1221N7503O0210O6280O3764P3226
$$ plain form
10527 194925 195145 188402 196233 206867 211238 208820 211319 221980 226550 223845 226167 221912 218525 221033
10513 221033 226035 220562 220047 226007 226671 222356 237639 249754 255079 261450 270723 266159 263986 271572
10499 271572 269959 270960 273231 271162 266583 262993 272623 275269 280626 283847 288937 290451 301156 303624
10485 303624 298361 311792 331962 341614 340699 335627 342386 347858 352218 352663 355807 371694 393846 404783
10471 404783 407357 421982 440547 458425 460692 467359 470083 475720 482735 494008 509956 530204 549626
10458 549626 563462 576371 583597 607187 624836 643590 669069 693204 713351 727338 743805 766682
10446 766682 784284 798041 827530 862812 901363 921939 946524 981507 1014794 1041777 1076297
10435 1076297 1125401 1175702 1220718 1263704 1313394 1374615 1432118 1492328 1558608 1622372 1695598
10424A695598Q0605R7005R6991J03854J04447J11118J17202J31440J48109J59438
10414B845807J76312J85248K00507K14909K25407K40001K56914K79339L02908
10405D927352L09897L36191L52466L53135L60672L66767L57138L36195L18040
10396H017853L03374K77683K42133K12538J67641J29702J05432P8032O4620M3096
10386I642104K8253K6428K0273L7169N9187P8143J02193J20963J39475J68478
10376A0422666J87053K09771K42475K55974K67237K66336K76687K72833K59389
10367A2660421K37139K29179J87467J62885J25288R4757N1424J6697j4501n7114
10357A3693642r1217j33119j46672j68510j79820j85941j78646j43679p0690M9288
$$ plain form
10424 1695598 1776203 1873208 1970199 2074053 2178500 2289618 2406820 2538260 2686369 2845807
10414 2845807 3022119 3207367 3407874 3622783 3848190 4088191 4345105 4624444 4927352
10405 4927352 5237249 5573440 5925906 6279041 6639713 7006480 7363618 7699813 8017853
10396 8017853 8321227 8598910 8841043 9053581 9221222 9350924 9456356 9534388 9599008 9642104
10386 9642104 9670357 9696785 9717058 9754227 9813414 9891557 9993750 10114713 10254188 10422666
10376 10422666 10609719 10819490 11061965 11317939 11585176 11851512 12128199 12401032 12660421
10367 12660421 12897560 13126739 13314206 13477091 13602379 13697136 13748560 13765257 13750756 13693642
10357 13693642 13602425 13469306 13322634 13154124 12974304 12788363 12609717 12466038 12395348 12444636
10347A2444636J98033K65827L06011M32732M85989L85068K20836N3338j06737
10338A4685733k20361l23603m55177n77888n81216n02526m02513k89760j96984
10329A1135705j46066j22304j28475j65985k08378k29391k81645l17116l48566
10320I187779l60075l75757m00778l85766l82980l90319l83546l52157l40040
10311E816361l26944l00479k81358k63635k45793k36605k24616k14031j87264
10302C535636j83141j60389j47912j53807j45189j32647j18851j05484r5053r4960
10292B198203r6097q3841q6656q5285o7861o4155n9841o4843o5180n0626l8897
10281A434921m9101m8638l9897l6544m1894m6265l1182l1986l5733k8144j9354
$$ plain form
10347 12444636 12642669 12908496 13214507 13647239 14133228 14518296 14739132 14792470 14685733
10338 14685733 14465372 14141769 13686592 13108704 12527488 12024962 11622449 11332689 11135705
10329 11135705 10989639 10867335 10738860 10572875 10364497 10135106 9853461 9536345 9187779
10320 9187779 8827704 8451947 8051169 7665403 7282423 6892104 6508558 6156401 5816361
10311 5816361 5489417 5188938 4907580 4643945 4398152 4161547 3936931 3722900 3535636
10302 3535636 3352495 3192106 3044194 2890387 2745198 2612551 2493700 2388216 2293163 2198203
10292 2198203 2102106 2018265 1931609 1846324 1778463 1714308 1654467 1589624 1524444 1473818 1434921
10281 1434921 1385820 1337182 1297285 1260741 1218847 1172582 1141400 1109414 1073681 1045537 1026183
10270A026183k0971j5326k1385k5299k1067k0672j9115j4364j4971q391j0640
10259H33982k331p570q479n444m704j2109j1901j6640k0832j8293r403j1185j6800
10246F88291k6070k5785j9773k5249j1481j5341j2782j5001k0606j7453m935j3122
10234D80693j2159l638r433j5482o234j1299L779J589q212n689j476L825J491
10221D17755P586R91K107q656j8900j0596q88n982l57p347j1893p143j5066k4190
10207C17421j3009N996M0j2135J887P32j0284n836j819r048r127L715N406k268
10193B71671j6776j3745k146L621j298k005K989J073m430n338j499j0516N438
10180B27039N980j2297k1846j6055J565O604M818o625j6831n390l268j1661o704
$$ plain form
10270 1026183 1005212 989886 968501 943202 922135 901463 882348 867984 853013 844622 833982
10259 833982 831651 824081 815602 810158 805454 793345 781444 764804 743972 725679 716276 705091 688291
10246 688291 662221 636436 616663 591414 579933 564592 551810 536809 516203 498750 493815 480693
10234 480693 468534 464896 455463 439981 433747 422448 426227 427816 419604 413915 412439 416264 417755
10221 417755 425341 426332 428439 419783 400883 390287 389399 383417 383060 375713 363820 356677 341611 317421
10207 317421 304412 310408 310448 298313 300200 300932 290648 284812 282993 273945 264818 268533 273939 271671
10193 271671 254895 241150 239004 242625 241327 239322 242311 243384 238954 233616 232117 221601 227039
10180 227039 233019 220722 198876 182821 184386 190990 195808 189183 172352 166962 163694 152033 145329
10167A45329J3083P658L906p56p888M279R52q95J410l138j904k539j307m307o550
10152A47333M233N344N76o444j3803o114N424J2197O7p101N840L530m654j0372
10138A36056n412J380o845k019J547J896o383j2063L919m613P290N37p029J869
10124A10130K39O270J639m457M520m344j2032j0957M049M8m871j227j785j165
10110H6057J44j969o135l133O454K116K189J524n99n222M085J780p783J314k271
10095G8551j56O169O415J055m565m779n491K803R900J0592j0908o359j478m232
10081G7517o792L284L094M476N517J344J845r93P86o380K412m810q501N538N1
10066G8388r162p186J687R990M457r105j0257N983N659M778K932N433m526k291
$$ plain form
10167 145329 158412 166070 169976 169220 161332 165611 166563 165668 167078 163940 162036 159497 158190 153883 147333
10152 147333 151566 156910 157486 151042 137239 131125 136549 148746 148813 141712 147552 151082 146428 136056
10138 136056 130644 132024 125179 123160 124707 126603 120220 108157 112076 107463 114753 115290 108261 110130
10124 110130 110369 116639 118278 113821 118341 113997 101965 91008 95057 95105 90234 89007 87222 86057
10110 86057 86201 84232 78097 74964 81418 83534 85723 87247 86648 81426 85511 87291 79508 80822 78551
10095 78551 78395 84564 90979 92034 87469 82690 77199 80002 89902 100494 89586 83227 81749 77517
10081 77517 70725 74009 77103 81579 87096 88440 90285 89292 90078 83698 86110 81300 72799 78337 78388
10066 78388 69226 62040 63727 73717 78174 69069 58812 64795 70454 75232 78164 83597 79071 76780
10052G6780j8296p526K607L081j536J0180K333r033l060J3647p89m071j045N088
10038F8360k226p076j3330n793Q399Q607N461j339n278L141j028O13j1258m144
10024D3109P703M351Q088P68M315L277L230o989j1003P894J6404K289j4028n564
10010F3844j77l113l771K785l488k377Q688J64K566M477N284m692J102M63J343
9995G3098p980j2092n09j638L686O893Q299J212L501M585m897p892j442R023j297
9980G2550K903L290N202N154O338J541L967N271p26k538m95M122j129o369Q789
9965A07870k013o956K605N175n989K174N000J0852j507l000m861k190J89M688
9951A12037L273L69p741Q6P180O255R68M812P708P246M786O135l328o932q612
$$ plain form
10052 76780 58484 50958 53565 56646 55110 65290 67623 58590 55530 69177 68388 64317 63272 68360
10038 68360 66134 59058 45728 39935 48334 56941 62402 61063 55785 58926 57898 58511 47253 43109
10024 43109 50812 55163 63251 64019 68334 71611 74841 67852 56849 64743 81147 83436 69408 63844
10010 63844 63667 60554 56783 59568 56080 53703 62391 62555 65121 69598 74882 70190 71292 71755 73098
9995 73098 65118 53026 52517 50879 54565 61458 69757 70969 74470 79055 74158 66266 64824 73847 72550
9980 72550 75453 78743 83945 89099 95437 96978 100945 106216 105490 102952 102457 106579 105450 99081 107870
9965 107870 105857 98901 101506 106681 100692 102866 107866 118718 117211 114211 109350 107160 107349 112037
9951 112037 115310 115679 107938 108024 115204 121459 122427 127239 134947 142193 146979 153114 149786 142854 134242
9936A34242j960j633M070j0411n017p643o220N751J2234r78j2448r53Q43l190
9922A06687l521j322q362p001P885m97j776j945N943j549o583j25K014Q46O736
9907I7430m99Q92K198l67n665P880n55q759O837J0716k246o922o903L228p751
9892H9514o313j1512l079J0177K121l264K099l818n576j4467K746J0254L490K504
9878G4876j3761j1540K372L730k591J4296l822j3164L479R361k426m548m082j251
9864E0929j699O404M465j514q45L743M475n17P088j2282j3864o77J2358L494l764
9849E7794L650k940R065P52n12o112j5617k352l822R04K279K257L862k489J987
9834D8706p494o102J624J1171L364m395j95p99l410J199J558r436o690M361j232
$$ plain form
9936 134242 132282 130649 134719 124308 119291 111648 105428 111179 123413 122435 109987 109034 109877 106687
9922 106687 103166 101844 93482 86481 94366 93869 92093 90148 96091 94542 87959 87834 89848 90694 97430
9907 97430 96931 97823 100021 99654 93989 101869 101314 92555 99392 110108 107862 100940 94037 97265 89514
9892 89514 83201 71689 68610 78787 80908 77644 79743 75925 70349 55882 58628 68882 72372 74876
9878 74876 61115 49575 51947 55677 53086 67382 63560 50396 53875 63236 60810 56262 52180 50929
9864 50929 49230 55634 60099 58585 57740 61483 65958 65441 72529 60247 46383 45706 58064 61558 57794
9849 57794 61444 58504 67569 68321 67809 61697 46080 43728 39906 40810 43089 45346 49208 46719 48706
9834 48706 41212 35110 36734 47905 51269 46874 46679 45880 42470 43669 45227 35791 29101 33462 32230
9819C2230j167L385O676K278Q385J404j307M623L068N297J408l092k200n898p981
9804D7109J778m016J0393L332j755j1641n465J2539n780o812M794P14L597J0454
9790E9241J0285j0487j1017j0464J705N094N589P0o024j739r66M199J378K886
9776D9750J430J0341Q783k154j0088m337p392N11m293M309L080N40M410O452n64
9761F0778r216p736k282K471K809J064O08n377L17J301j989j922K15M800P817
9746E3658j806L732q112k391J1292K108k557R39n751j002m343K270J1084M070
9732F3191r342k470l66n821j050J2528m641j2553K603J0893l880R495Q632p02
9718F6517j0376o427j791l98j441R14O297J580M973L411q381j0170m36l708j132
$$ plain form
9819 32230 31063 34448 41124 43402 51787 53191 51884 56507 59575 64872 66280 63188 60988 55090 47109
9804 47109 48887 44871 55264 58596 56841 45200 39735 52274 46494 39682 44476 45190 48787 59241
9790 59241 69526 59039 48022 37558 39263 44357 49946 50016 43992 42253 41287 45486 46864 49750
9776 49750 51180 61521 70304 68150 58062 53725 46333 46844 42551 46860 49940 50480 54890 61342 60778
9761 60778 51562 43826 41544 44015 46824 47888 48496 43119 43436 44737 42748 40826 41041 45841 53658
9746 53658 51852 55584 47472 45081 56373 58481 55924 56863 51112 50110 45767 48037 59121 63191
9732 63191 53849 51379 51013 45192 44142 56670 52029 39476 42079 52972 49092 58587 67219 66517
9718 66517 56141 49714 47923 47525 46084 46998 53295 54875 59848 63259 54878 44708 44272 40564 39432
9703C9432J61Q634l34m471m61P003L151K272J790P31K16k01l989o094r931O820
9687D4729P192q37M558r482j855l1l141n856R070J821K183J2192L697j253J2252
9672G5239j612P654m29j5938q871J330Q884j3056l512K342j099L247p239P958
9658E4898J0671m293l371l029j093M064o28K950M468N370N195o15p600n369L655
9643F5273o006L456L055n152L999L971r312m297p77P82N757p125n06N651O996
9628F5765Q209o813o471K519k88k414r39M5k323L065J2722J632n05P5p189m079
9612F3011J0748M569P157j969j305J682k771j256O008P28k233Q738l291M142R269
9597A03227j5806m638q50M434N098j497p3P433j900J886l284l889L354j67r90
$$ plain form
9703 39432 39593 48227 47893 43422 42961 49964 53115 55387 57177 57908 58124 57923 53934 47840 37909 44729
9687 44729 51921 51084 55642 46160 44305 44274 41133 35277 44347 46168 48351 60543 64240 62987 75239
9672 75239 73627 81281 80852 64914 56043 57373 66257 53201 49689 52031 50932 54179 46940 54898
9658 54898 65569 61276 57905 54876 53783 57847 57219 60169 64637 70007 75202 74587 66987 61618 65273
9643 65273 59267 62723 65778 60626 64625 68596 59284 54987 54210 54992 60749 53624 53118 58769 65765
9628 65765 73974 67161 60690 63209 62921 60507 59568 59613 57290 60355 73077 74709 74204 74279 67090 63011
9612 63011 73759 78328 85485 83516 82211 83893 81122 79866 85874 86602 84369 93107 89816 93958 103227
9597 103227 87421 82783 81933 86367 91465 89968 89895 97328 95428 97314 94030 90141 93495 93328 92338
9582I2338O85n462n838K143l006J047J336r428j704l121M192J5225J0330j2246
9568H6491M084Q677j169M214j4172j1134L304O812R115L618o120L076K846M791
9554A04433J1580O668k05r63r144r040M692m088p348L315K285J02r819k258P002
9539I7212K829L278N476K851m745n143Q174n112N3M433N482J873k998m49O634
9524A19848M083J4883J6025Q320m773J1265P358q741k997P050p160j4839r055
9511A41267K136k942j05N334J58m353j5365L111o176L658N088k007J537j293R588
9496A39636M902J551k676m745m155O983j469J1396K1604L902N308k863J045L922
9482A84341P648m40J377r035p642l643L107P8q909j0840J0k331r128l554j603
$$ plain form
9582 92338 93023 87561 81723 83866 80860 81907 83243 73815 72111 68990 73182 88407 98737 86491
9568 86491 90575 99252 98083 102297 88125 76991 80295 87107 96222 99840 93720 96796 99642 104433
9554 104433 116013 122681 122476 121513 112369 103329 108021 103933 96585 99900 102185 102287 92468 90210 97212
9539 97212 100041 103319 108795 111646 106901 101758 109932 104820 104873 109306 114788 116661 113663 113214 119848
9524 119848 123931 138814 154839 163159 158386 169651 177009 168268 165271 172321 165161 150322 141267
9511 141267 143403 140461 140356 145690 145848 141495 126130 129241 123065 126723 131811 129804 131341 130048 139636
9496 139636 144538 146089 143413 138668 134513 141496 140027 151423 173027 176929 182237 179374 180419 184341
9482 184341 191989 191549 192926 183891 176249 172606 175713 175791 166882 156042 156052 153721 144593 141039 139436
9467A39436l18k065M349k613J625K353l847J007P439n688J507j383q542o102Q103
9452A35261K432k748q856P091M754p49Q584Q088m562l888j2389l768K789L30j393
9437A30976o558o093p922l095J925n269M764L357m507l938q3n330j0915P23N989
9422I4024M505j60K737L759K325J020r022o107m023j038L122P814M711P621p715
9407A03573k100R21k645R666J293r384l447J0727J902o338j2012o347j145J2156
9393I6820K284j0472K509M053k526j983L326n957n363L835J049r735j1754K54
9379F6340Q064R468L715l629L85m893n924j1533M647J5335M360j010p191L116
9365H1250P719k630O29j320n617M646m635J958P937P033j9m836m797N075q518
$$ plain form
9467 139436 139118 137053 141402 138789 140414 142767 138920 139927 147366 141678 143185 141802 133260 127158 135261
9452 135261 137693 134945 126089 133180 137934 137185 145769 153857 149295 145407 133018 129250 132039 132369 130976
9437 130976 124418 118325 110403 107308 109233 103964 108728 112085 107578 103640 103557 98227 87312 88035 94024
9422 94024 98529 98369 101106 104865 107190 108210 99188 93081 89058 88020 91142 98956 103667 111288 103573
9407 103573 101473 102394 99749 109415 110708 101324 97877 108604 110506 104168 92156 85809 84664 96820
9393 96820 99104 88632 91141 95194 92668 90685 94011 88054 82691 86526 87575 77840 66086 66340
9379 66340 74404 83872 87587 83958 84343 79450 73526 61993 66640 81975 86335 85325 78134 81250
9365 81250 88969 86339 86968 85648 80031 84677 80042 82000 89937 96970 96951 92115 87318 92393 83875
9350H3875K928L810k442k422L67k195R039m598p665N203M965k491j1575r067J3714
9335H1446L653J819J2895K38n805J343Q093K880o398j1935L1L23L576J0282k808
9320I9633m321k756L39j1553m848M675j202N59K1410J1427M732L221J931k436
9306A20811j0048j736N899L303q32j3556p304N302l309L168Q438J261N624P487
9292A24508L383n403o947j928K762L696J022N066J520o958l717l679o388J0404
9278A17341O795n232j852j2029m734M356j988J954J091K956N353K886j8587L268
9264A01578J6128j210J243O224m29P993J1530N178j0954o182m041L260J3898R79
9250A45195o942P264r92j2398j4811Q736L703N879q01j073l496O68o819o223L112
$$ plain form
9350 83875 86803 90613 88171 85749 86116 83921 92960 88362 80697 85900 90865 88374 76799 67732 81446
9335 81446 85099 86918 99813 100051 94246 95589 103682 106562 100164 88229 88260 88583 92159 102441 99633
9320 99633 95312 92556 92895 81342 76494 81169 79967 80526 101936 113363 118095 121316 123247 120811
9306 120811 110763 109027 114926 118229 117397 103841 96537 101839 98530 101698 110136 111397 117021 124508
9292 124508 127891 122488 115541 113613 116375 120071 121093 126159 127679 120721 117004 113325 106937 117341
9278 117341 124136 118904 117052 105023 100289 104645 102657 104611 105702 108658 114011 116897 98310 101578
9264 101578 117706 116496 117739 123963 123534 131527 143057 148235 137281 131099 127058 130318 144216 145195
9250 145195 138253 145517 144525 132127 117316 126052 129755 135634 134833 133760 130264 130932 124113 117890 121002
9235A21002M616k574j0183P76R800O805K852J600J530q904l283o2Q323J5556R575
9220A57429M860j0526k130Q059j943k486K014o484L666O012J6383M608N645n252
9206A79855o342j530N927K760k545O147M056l299K290Q657J9128Q140O024o86
9192B28582P80J1250Q794L154R48l401Q479P701J3991K4822J4009J1360J1611
9179C42080J5532K2787L4004L0239L5630N8390O1430P2258R3215J01781J30255
9168I97601J52367J66416J71368K03440K31875K42917K61190K73344K60285K30880
9158C191683J86482J16850K9662n6849j20367j51291j67096j42036j24881p7578
9148B684579j1691M5285Q3576J34874J94197K37635K43617K31788K21212J84631
$$ plain form
9235 121002 125618 123044 112861 113637 123437 130242 133094 134694 136224 127320 124037 123975 132298 147854 157429
9220 157429 162289 151763 149633 157692 155749 153263 155277 148793 152459 158471 174854 179462 185107 179855
9206 179855 173513 171983 177910 180670 178125 184272 188328 185029 187319 195976 215104 223244 229268 228582
9192 228582 229362 240612 249406 252560 253508 250107 258586 266287 280278 305100 319109 330469 342080
9179 342080 357612 380399 414403 444642 480272 538662 600092 672350 765565 867346 997601
9168 997601 1149968 1316384 1487752 1691192 1923067 2165984 2427174 2700518 2960803 3191683
9158 3191683 3378165 3495015 3524677 3467828 3347461 3196170 3029074 2887038 2762157 2684579
9148 2684579 2672888 2718173 2801749 2936623 3130820 3368455 3612072 3843860 4065072 4249703
9138D249703J79945J69386J94363K28107K66918L26343L88235M28483M71896M62083
9128G365462M38295L92641L42916K86844K46389K14034J78749J19654P0168k794
9118I652358p7656j34878k05039k48111k76401k93276k91521k81344k55729k00515
9108G387888j38484q0884j3323N5819J25562J92970K53531L11146L60250M08113
9098H862588M65351N22465N57315O01637O29006O36031O28318O07905N77289N38216
9088A4626121N01741M05997K76485J29624n2919k49076m25196n61143o60392p13062
9078A3278180p12209o90922o61321n97692n21315m50394l73820k89712k33951
9069H746844j50132o8720o715N9681J36272K01770K58885L18347L73184M15700
$$ plain form
9138 4249703 4429648 4599034 4793397 5021504 5288422 5614765 6003000 6431483 6903379 7365462
9128 7365462 7803757 8196398 8539314 8826158 9072547 9286581 9465330 9584984 9655152 9652358
9118 9652358 9574702 9439824 9234785 8986674 8710273 8416997 8125476 7844132 7588403 7387888
9108 7387888 7249404 7168520 7155197 7211016 7336578 7529548 7783079 8094225 8454475 8862588
9098 8862588 9327939 9850404 10407719 11009356 11638362 12274393 12902711 13510616 14087905 14626121
9088 14626121 15127862 15533859 15810344 15939968 15887049 15637973 15212777 14651634 13991242 13278180
9078 13278180 12565971 11875049 11213728 10616036 10094721 9644327 9270507 8980795 8746844
9069 8746844 8596712 8527992 8521277 8580958 8717230 8919000 9177885 9496232 9869416 10285116
9059A0285116M55440M71457M67393M56822M18876L43441K49167J26513j4094j60706
9049A3099425l19382m52095n58479o21216o45355o66981o43825o07754n57593
9040H026745n20968m73433m26531l87741l54060l15017k63049k21544j73984j37792
9030D752626r4687l9597R581N0496J13375J49809J69809J87778J82804J52857
9020E634851J07848L8455l8012j16307j68542k50710l07498l27223l32862l28485
9010C911515l01859k68791k37687k05081j71597j58000j38628j30741j14932j09318
9000B074881j01437r8125r2902j01120j03204r5464q7905q1593p3081p9167o5730
8989A095153m9210l7751k7588m2553m4837l1009k7097k4855m634j4555j9342j0687
$$ plain form
9059 10285116 10740556 11212013 11679406 12136228 12555104 12898545 13147712 13274225 13260131 13099425
9049 13099425 12780043 12327948 11769469 11148253 10502898 9835917 9192092 8584338 8026745
9040 8026745 7505777 7032344 6605813 6218072 5864012 5548995 5285946 5064402 4890418 4752626
9030 4752626 4657939 4618342 4627923 4678419 4791794 4941603 5111412 5299190 5481994 5634851
9020 5634851 5742699 5781154 5743142 5626835 5458293 5207583 4900085 4572862 4240000 3911515
9010 3911515 3609656 3340865 3103178 2898097 2726500 2568500 2429872 2299131 2184199 2074881
9000 2074881 1973444 1875319 1782417 1681297 1578093 1482629 1394724 1313131 1240050 1160883 1095153
8989 1095153 1045943 1008192 980604 938051 893214 862205 835108 810253 805619 791064 771722 761035
8977G61035j7714j7566n385j3816j8205q608P804j494M670m379j4878j0205q332
8964F52927m173p757P852J481k40M771N337J4627R387J8814K3682J3359K8221
8951G68288L8008L3321K3329L1321M6371N2916N8647O8622O6329O2718O5609O2323
8939A377802O4805O7992P8256P2959O3892M7489K9871L7610L9198N6199Q1403
8928B017476Q5795Q4247R4197J02961J08898J25569J42728J42259J43250J36686
8918C184066J19993P7049L5766P743l4882l3666l1934k7807q505J7702L8088O4387
8906C408000P7472J01104J13718J29060J33766J13657N9846k9398q9990q5146
8896C932089n0545m550M2718Q9372J26887J58215J82871J98452K10552K13660
$$ plain form
8977 761035 743321 725755 720370 706554 688349 679741 687545 686051 690721 686342 671464 661259 652927
8964 652927 648754 640997 648849 650330 650090 654861 660198 674825 684212 703026 726708 740067 768288
8951 768288 806296 839617 862946 894267 940638 993554 1052201 1120823 1187152 1249870 1315479 1377802
8939 1377802 1442607 1510599 1588855 1661814 1725706 1773195 1803066 1840676 1879874 1936073 2017476
8928 2017476 2103271 2187518 2281715 2384676 2493574 2619143 2761871 2904130 3047380 3184066
8918 3184066 3304059 3381108 3416874 3424617 3389735 3356069 3324135 3296328 3287823 3305525 3343613 3408000
8906 3408000 3485472 3586576 3700294 3829354 3963120 4076777 4136623 4107225 4017235 3932089
8896 3932089 3881544 3876994 3919712 4009084 4135971 4294186 4477057 4675509 4886061 5099721
8886E099721K02871J79535J53335J22937R1946O6507L5971j333k6162m0306m8646
8875E836376o8227q6143q1457q0028j00656j18972j16612j30077j35395j29427
8865D789382j16294p6638l5715j1902J4161M0487O7838J16978J56166J78307J88895
8854E311665J99890J98000J68369J33626R5316N8859L233m1762o8035r7844j23068
8843E838249j37481j30530j45108j50879j25711j41464j52753j38518j30226j11388
8833D474191r5745q5490o6595o8725o1359n4356o0646o6831p7798q3992q1993
8822C670661o1305l6827k4636k4012j7960o206r498r276j3695K528J1172m488
8810C476458m825l649j0549n40n704k1686j9393l7068o7583p6083p3227r6540
$$ plain form
8886 5099721 5302592 5482127 5635462 5758399 5850345 5916852 5952823 5951490 5925328 5885022 5836376
8875 5836376 5768149 5682006 5600549 5520521 5419865 5300893 5184281 5054204 4918809 4789382
8865 4789382 4673088 4596450 4560735 4548833 4562994 4603481 4671319 4788297 4944463 5122770 5311665
8854 5311665 5511555 5709555 5877924 6011550 6106866 6165725 6168958 6127196 6059161 5961317 5838249
8843 5838249 5700768 5570238 5425130 5274251 5148540 5007076 4854323 4715805 4585579 4474191
8833 4474191 4378446 4292956 4226361 4157636 4096277 4041921 3981275 3914444 3836646 3752654 3670661
8822 3670661 3609356 3572529 3547893 3523881 3505921 3499715 3490217 3480941 3467246 3469774 3480946 3476458
8810 3476458 3471633 3467984 3457435 3456895 3451191 3429505 3410112 3373044 3305461 3229378 3156151 3059611
8798C059611j10779j03774r9601r9727q9458o0797m6334k6523N531J4960K4574
8787B467683M6286N5851O4002N5722N6857M4856M3641N9529Q8130R2548R8173
8776C173278J13279J47268J75803J92236K07841K41346K74371L16577L91583M95806
8766E729388O22079P95877R76570J150474J206068J182661J252417J462204J807839
8757A6185577K273921K715489L055593L421874M005392N075779O953010J0047337
8749E3733972J4980996K2768494L4899880N2466164P1869194P4780820M1502007
8742C67001527o356124l8597303n6538647o0613883n1286534l7729423k6190513
8735H9689100j7982971j2530159q982985o765960n303696m227865l506424l046506
$$ plain form
8798 3059611 2948832 2845058 2745457 2645730 2556272 2495475 2449141 2422618 2428149 2443109 2467683
8787 2467683 2513969 2569820 2633822 2689544 2746401 2791257 2834898 2894427 2982557 3075105 3173278
8776 3173278 3286557 3433825 3609628 3801864 4009705 4251051 4525422 4841999 5233582 5729388
8766 5729388 6351467 7147344 8123914 9274388 10480456 11663117 12915534 14377738 16185577
8757 16185577 18459498 21174987 24230580 27652454 31657846 36733625 43686635 53733972
8749 53733972 68714968 91483462 126383342 178849506 250718700 325499520 367001527
8742 367001527 360645403 322048100 265509453 204895570 153609036 115879613 89689100
8735 89689100 71706129 59175970 50192985 43427025 38123329 33895464 30389040 27342534
8727B7342534k648155k293232k109251k003352j840641j653175j426509j214578
8719A2153641j051196r06127p88440o93037o19942n44609m66802m04884l59689
8710F318915l29031l08880k91487k87655k81811k73365k65200k40195k13543k00224
8700C627524j67302j57426j46234j50080j38050j28578j20314j25648j19121j12923
8690B261848j17615r6840q9488o5630m8692n1586n9507o4878n5086m5385m3054
8679A524087n8710n4838l2206l9142l4397k6383k2428j5489j6321j4116l6337
8668A173720l9907m8200j9027j6381k7988l3829k8547l8364l1313k1253q809K180
8656H62282J504K124J1549j740j3309j8075r082n117j2255j9705j5580l316R265
$$ plain form
8727 27342534 24694379 22401147 20291896 18288544 16447903 14794728 13368219 12153641
8719 12153641 11102445 10196318 9407878 8714841 8094899 7550290 7083488 6678604 6318915
8710 6318915 5989884 5681004 5389517 5101862 4820051 4546686 4281486 4041291 3827748 3627524
8700 3627524 3460222 3302796 3156562 3006482 2868432 2739854 2619540 2493892 2374771 2261848
8690 2261848 2144233 2047393 1957905 1892275 1843583 1791997 1732490 1667612 1612526 1567141 1524087
8679 1524087 1465377 1410539 1378333 1339191 1304794 1278411 1255983 1240494 1224173 1210057 1173720
8668 1173720 1133813 1085613 1066586 1050205 1022217 988388 959841 921477 890164 868911 860102 862282
8656 862282 863786 865910 877459 875719 862410 844335 835253 830136 817881 798176 782596 779280 788545
8643G88545J4820J1499J3188j06k966Q49r891o522j2742k057R629R316K3830M3444
8629H80836M2624K4942j1836k9623l1444l5027k6828l894q01j59L906j606l10
8616H10780L831K3480M7242N3267N8511N3868O2729P6094R4963J28640K03509
8605A616914L30874N48116R25645J402432J479863O34473l36100q33432j081470
8596D687315j029045p48950m75164l01295k01362j49900j33736j49356j87467
8587A311040j83204j44882q8687k9596K352J5225L2415J7479K5981Q751l227q008
8575I55639j9679k3977j8976j6406j6255q5l786j180K9829M1349O0054Q4519J10996
8562A182042J08783K3614m6550n3769k8229N1356J77596L52593M71999L03976
$$ plain form
8643 788545 803365 814864 828052 827946 824980 825829 815938 809416 796674 794617 804246 813562 837392 880836
8629 880836 923460 948402 936566 906943 875499 840472 813644 809750 808949 808790 812696 811090 810780
8616 810780 814611 838091 885333 938600 997111 1050979 1113708 1189802 1284765 1413405 1616914
8605 1616914 1947788 2495904 3421549 4823981 6303844 6938317 6602217 5768785 4687315
8596 4687315 3658270 2909320 2434156 2132861 1931499 1781599 1647863 1498507 1311040
8587 1311040 1127836 982954 894267 864671 867023 882248 914663 932142 958123 966874 963647 955639
8575 955639 935960 911983 893007 876601 860346 860261 856475 855295 885124 926473 986527 1071046 1182042
8562 1182042 1290825 1314439 1267889 1214120 1185891 1237247 1414843 1767436 2239435 2543411
8552B543411p5033k92443l81094l92192l17912k14505j32330q6493o0146l4445
8542E56818j9243k2557j3832p567n303j3827k1220j3818j855q506q387L947k358
8529D22292j5972j6922m556j0404m957j1405j4663n612j6504j6004k431q276r131
8516B85455j3329o886P200n012N863O288j886r448j756l422q025j3386O82P956
8502B50294k867o935r767o571M314l362K372M906L268k879P564l578l82p245L014
8487B32146P25q543P335R787J4313m75K505M894L509N508R228P51o591j607o560
8472B66925k920m612L115L168M463L097K617j0919k1521m775j1340j3409k068
8459B11821L498J066O564Q837P811Q642p529j1235j3023k4643j6176p248J486
$$ plain form
8552 2543411 2468378 2175935 1794841 1402649 1084737 870232 737902 651409 591263 556818
8542 556818 537575 515018 501186 493619 488316 474489 453269 439451 437596 429090 420703 424650 422292
8529 422292 406320 389398 384842 374438 369481 358076 343413 337801 321297 305293 302862 294586 285455
8516 285455 272126 265240 272440 267428 273291 279579 277693 268245 266489 263067 255042 241656 242338 250294
8502 250294 247427 240492 230725 224154 228468 225106 227478 232384 235652 232773 240337 236759 236377 229132 232146
8487 232146 232871 224328 231663 241450 255763 255288 257793 262687 266196 271704 280932 281683 275092 273485 266925
8472 266925 264005 259393 262508 265676 270139 273236 275853 264934 243413 238638 227298 213889 211821
8459 211821 215319 216385 222949 231786 239597 248239 240710 229475 216452 191809 175633 168385 169871
8446A69871M044q73j3609k089N036k635L37j6269j7080r63K602K863M525N568
8432A41328J1631O944k32k42K261P983Q384M788l908j3908j505r301q413K564
8418A48374P174p870L689l685M143N697l665m107r631j298J0317J2682O63o913
8404A55570j6594j3431M618L691m86n196o725L819Q326l748K824j649k045l664
8390A25310n575J1103J167r624m909k224j430K553N414k494l330J1051R739n32
8376A36219j1136Q49J0972k246k142O429N543N070J77L35p266R33K891PO312J35
8360A53082M944Q171N477J7773J406J1651K0943K8933K8302L6878K9834L8656
8348C86050O5594P4720R3416J33256J44391J52390J54302J25842Q2070M2495j7867
$$ plain form
8446 169871 173915 173042 159433 157344 162380 159745 160082 143813 126733 125770 128372 131235 135760 141328
8432 141328 152959 159903 159671 159429 161690 169673 178057 182845 178937 165029 163524 154223 145810 148374
8418 148374 155548 147678 151367 147682 151825 157522 153857 149750 140119 138821 149138 161820 162483 155570
8404 155570 138976 125545 130163 133854 133368 128172 121447 125266 133592 129844 132668 131019 128974 125310
8390 125310 119735 130838 132005 122381 117472 115248 113818 116371 121785 119291 115961 127012 136751 136219
8376 136219 125083 125932 136904 134658 132516 138945 144488 149558 149735 150070 142804 143737 146628 146635 152947 153082
8360 153082 158026 166197 171674 189447 190853 202504 223447 252380 280682 317560 347394 386050
8348 386050 451644 526364 619780 753036 897427 1049817 1204119 1329961 1412031 1454526 1436659
8337A436659p9887j24571j41907j51866j34739j11632q8906q0129n6267k8771
8327D37984l5265k8013k8391l0288l1432k1625k4126k0986j4723j5415j5868m098
8315A67754q300j0915l208K924l952P63R40n966m327K47K848L343M321R12o249
8300A41135J625j523j1770k590L217o367j788l752p312m584j193N94j4395r856
8286H1441j446K0150J7960L029n000N532O184o195k1913r542j21P276J1185R377
8272A17917j626l117m329J241p087J1445N572j700j2494j3759L992L533J0795
8259A10383J0513O024K178O455m052j3161n978O54o78n316l22J928K115J182m249
8244A07676j3m160m803p048n338j0069M200Q993J2007J0370Q768M548n191m803
$$ plain form
8337 1436659 1356772 1232201 1090294 938428 803689 692057 603151 523022 466755 437984
8327 437984 402719 374706 346315 316027 284595 262970 238844 217858 203135 187720 171852 167754
8315 167754 159454 148539 145331 148255 144303 145066 146006 140040 135713 135960 138808 142151 146472 147384 141135
8300 141135 142760 141237 129467 126877 130094 123727 121939 118187 110875 106291 105098 105692 91297 81441
8286 81441 79995 100145 118105 121134 116134 121666 127850 121655 99742 90200 90079 97355 108540 117917
8272 117917 116291 113174 108845 110086 102999 114444 120016 118316 105822 92063 96055 99588 110383
8259 110383 120896 126920 129098 135553 131501 118340 112362 113016 112338 107022 106700 108628 110743 111925 107676
8244 107676 107663 103503 98700 91652 86314 76245 80445 89438 101445 111815 120583 125131 119940 115137
8230A15137N042M372J0662k145r493M807M606j678J285J341j0852L55P253M492
8216A35184j3192m124J0197R753J360K384Q12n317j0750j707N251o026o144k423
8202A15258m342J0978k900k408L17l826r65q355p598P685N768K107j6459N039
8188A00299P469Q159r56p3p309j540M903j231K282n342n240k801P364j199J151
8173A05936R166m210O182O484O173J2131L625R744P1j0261p776j7735j1994K236
8159A09772q722l969J2931M887j02O087j1374m441j587Q93J3834o105J970k489
8145A11585J080Q279j4661j466J158K315l648m176O873k130l275k905P843N791
8131A12663l638l323l943J699O975J1856N623M431P777J1150J508n084r026q661
$$ plain form
8230 115137 120179 124551 135213 133068 123575 128382 132988 131310 132595 133936 123084 123439 130692 135184
8216 135184 121992 117868 128065 137818 139178 141562 142374 137057 126307 124600 129851 123825 117681 115258
8202 115258 110916 121894 118994 116586 116903 113077 112112 103757 96159 103844 109612 111719 95260 100299
8188 100299 107768 115927 114971 114898 107589 106049 110952 109721 112003 106661 101421 98620 105984 104785 105936
8173 105936 115102 110892 117074 123558 129731 141862 145487 155231 155302 145041 137265 119530 107536 109772
8159 109772 101050 97081 110012 114899 114797 120884 109510 105069 103482 104375 118209 112104 114074 111585
8145 111585 112665 120944 106283 104817 105975 108290 104642 100466 107339 105209 101934 99029 106872 112663
8131 112663 109025 105702 101759 103458 110433 122289 127912 132343 140120 151270 152778 147694 138668 130007
8117A30007j1600p299k551j343l386K737L05N386o899q440J2687J0628j559q517
8103A10156j1934R611L128j1674K126J6018J2929j459K271P535J6026J3083R53
8090A68769o547p638L22j699m227L26L432m049L631n318l214o360n475j369m850
8075A25734L272M927Q733R617J0603m124j794q911J185j77p280M82k756l019N18
8060A37010P222Q097J927k118l134J078K0642P678j0045m216K109L549N0J0479
8046A80328R288K217j1092j0040J0712K734l111j2856k679l371j617N262P779
8033A73554q981n848j830q100m008n410m298m76j835N234N523l188m739p430l679
8018A24489Q757J0048m642L225o566j832J0058P575M232k225P005J4132J1863
$$ plain form
8117 130007 118407 111108 108557 107214 103828 106565 106870 112256 105357 96917 109604 120232 118673 110156
8103 110156 98222 107833 110961 99287 101413 117431 130360 128901 131172 138707 154733 167816 168769
8090 168769 162222 154584 154906 153207 148980 149306 152738 148689 152320 147002 143788 137428 131953 130584 125734
8075 125734 129006 133933 142666 152283 162886 158762 156968 148057 149242 149065 141785 142267 139511 136492 137010
8060 137010 144232 152329 154256 152138 149004 150082 170724 178402 168357 164141 166250 169799 169849 180328
8046 180328 189616 191833 180741 170701 181413 184147 181036 168180 165501 162130 160513 165775 173554
8033 173554 164573 158725 156895 148795 144787 139377 135079 134603 132768 138002 143525 140337 135598 128168 124489
8018 124489 133246 143294 138652 141877 135311 133479 143537 151112 155344 153119 160124 174256 186119
8005A86119Q280O700J1069O25J089q068j3664l776p389q729j8347q724m397J627
7991A42415j3342j4846o714O17J1607M348N201Q382P331l631l367l822N876L441
7977A43496m666l694k867m195r394k200P71o175m003L922M605P568M101r189p690
7962A10390M206P625J101r058n407l808k722M128p274k16O714k678R816J0828
7948A23645Q672N267n068j7209p790P84k184j128j448j172n605J940n8p60j043
7933I6843j850p274J468N486l68Q624p230k313K672K640L925K642N274J2699P58
7918A23996K884M790J185m748K265J445j144l720L047O189L691J1700M280j245
7904A54615l353j0298j4936j2833n991j1442j5838m096M164R137J0988M681n527
$$ plain form
8005 186119 194399 201099 212168 212793 213882 205814 192150 188374 180985 172256 153909 145185 140788 142415
7991 142415 129073 114227 107513 108130 119737 124085 129286 137668 144999 141368 138001 134179 140055 143496
7977 143496 138830 135136 132269 128074 118680 116480 117251 111076 107073 110995 115600 123168 127269 118080 110390
7962 110390 114596 122221 123322 114264 108857 105049 102327 106455 99181 98965 105679 103001 112817 123645
7948 123645 132317 137584 132516 115307 107517 108301 106117 104989 103541 102369 96764 98704 98646 97886 96843
7933 96843 94993 87719 89187 94673 94305 102929 95699 93386 96058 98698 102623 105265 110539 123238 123996
7918 123996 126880 131670 132855 128107 130372 131817 130673 126953 130000 136189 139880 151580 155860 154615
7904 154615 151262 140964 126028 113195 107204 95762 79924 75828 79992 89129 100117 104798 99271
7891I9271j1071q227O114O753K0253J6007q138n341Q591J4835J4554j820m281
7878A47500j2711L81j461k300j848N877N504M031L77K096l127r509n975j8885
7864A09950j5492p839n21N175J726j2114p099r518l340l404M172O949L953J243
7850G3841P012P980p013q634r393m336J1310J209j6803n241Q574K174m303J376
7836E7753m259q200N15J411N20J1090q133p941J609o289p265J050P718k421j857
7821C5301O782J0358p736p225n174M935r083n093J2992N166o986L240K871l237
7807C7111k704o661J0434J4161R485O83J441j4338P392J3367j1905R45R266J411
7793G0088Q475k733K974J32J043l323j4029j0666L328j705n330j385o193m285
$$ plain form
7891 99271 88200 79973 86087 92840 113093 129100 120962 115621 124212 139047 153601 151781 147500
7878 147500 134789 135170 133709 131409 129561 135438 140942 144973 145350 147446 144319 134810 128835 109950
7864 109950 94458 86619 86098 91273 92999 80885 73786 64268 60928 57524 61696 68645 72598 73841
7850 73841 80853 88833 81820 73186 63793 59457 70767 71976 55173 49932 58506 60680 56377 57753
7836 57753 53494 45294 45809 47220 47740 58830 50697 42756 44365 38076 30811 31861 39579 37158 35301
7821 35301 42083 52441 44705 37480 32306 37241 28158 23065 36057 41223 34237 37477 40348 37111
7807 37111 34407 27746 38180 52341 61826 62509 63950 49612 57004 70371 58466 59411 68677 70088
7793 70088 78563 75830 78804 78936 79979 76656 62627 51961 55289 53584 48254 46869 40676 36391
7779C6391o296J454Q136K170r841k403p202O697J2683P775n845j2051Q305R24
7765D0897j7187j2566m2N983N862n295M906Q402L645N044J1393N640J249l370
7751E4561n597J278J6082J2103j465m320m7n336o047j792O468m418j1013l410
7737D7047J957p952l565m051L249J927M243K793M985j0797J24K475P149J847k720
7722D8711K915r729q102L59L441p287l183Q896J3597O45m215k125j1647j4008
7708A8268Q326L216k482J0384O507m798k060n849m8O997n572n590j497q011o387
7693A1404O997N148O813R302p342r466m620J4536P132j911k276M071K107n185
7679C6710p262k950l328M177k389l26m668J474J653L54n008J0161Q886j717J288
$$ plain form
7779 36391 30095 31549 39685 41855 32014 29611 22409 29106 41789 49564 43719 31668 39973 40897
7765 40897 23710 11144 11102 17085 22947 17652 22558 30960 34605 39649 51042 56682 57931 54561
7751 54561 48964 50242 66324 78427 76962 72642 72595 67259 61212 59420 65888 61470 50457 47047
7737 47047 49004 41052 37487 33436 36685 38612 42855 45648 50633 39836 39960 42435 49584 51431 48711
7722 48711 51626 41897 33795 34154 37595 30308 27125 36021 49618 50263 46048 43923 32276 18268
7708 18268 26594 29810 27328 37712 44219 39421 37361 31512 31464 38461 32889 27299 25802 17791 11404
7693 11404 18401 23549 30362 39664 32322 22856 18236 32772 39904 37993 35717 39788 41895 36710
7679 36710 29448 26498 23170 27347 24958 24632 19964 21438 23091 23445 18437 28598 37484 35767 37055
7664C7055L574k666m22j083l924J012O590O449J503l072M740m925p187j452R27
7649C7119L737M271l404j1308n059n227n739m521r843k964N428J1412Q624L876
7635B6402R32K035r484k332m363m257Q674O339P601M948K937q271p988J233o456
7620A7950o144K113L921O221N409K700M567k77r601r510o240j0574j110R39J300
7605A664l061j064R302J574J0472k23q845Q444Q141R694m467m322l854p896J462
7590A7021O308n864m926J848R872k044m960p355M122R589Q59o50n875L716L573
7575B5234Qj8562j1921M171O19k378J946N687m737N52L051J632J1594K752J902
7560B1550n608k960k678k605k114N508L334n203j6466R824J8611J259k239O031
$$ plain form
7664 37055 40629 37963 37541 36458 32534 33546 40136 46585 48088 45016 49756 44831 37644 36192 37119
7649 37119 40856 45127 41723 30415 25356 20129 14390 9869 26 -2938 2490 13902 22526 26402
7635 26402 27334 29369 19885 17553 13190 8933 17607 23946 31547 36495 39432 31161 23173 24406 17950
7620 17950 11806 13919 17840 24061 29470 32170 36737 36460 26859 17349 11109 535 -575 364 1664
7605 1664 -1397 -2461 6841 8415 18887 18664 9819 18263 26404 36098 31631 27309 23455 15559 17021
7590 17021 23329 17465 12539 14387 24259 22215 17255 9900 14022 23611 24470 23820 17945 21661 25234
7575 25234 25242 6680 -5241 -1070 -451 -2829 -883 4804 67 619 3670 5302 16896 19648 21550
7560 21550 15942 12982 10304 7699 5585 11093 14427 9224 -7242 2582 21193 22452 20213 26244
7546B6244p15m723m392n500j61K818q149O182L900P312O865j0189o768M058m565
7531A2217k391L071J1834j809o443k844j90o674J436J925P58l430J068K292M183
7516A5003L669L389o330n518K16j213k917L045k792o518N887N688j650Q63R166
7501A9988P201K1n791P98K330p829r049K222L715j856o355l486k918J1492R319
7486A9802M555K008M553n759p482R11J644r41k034J807k230N254j917K125P052
7471B9348P531o959j1334M113Q702j279L364j304m921n815k320J450o487k9P11
7456A4771q533k489Q46K636R07j2046Q809J2670j036j0454j090P861K853k239
7442A3466q81J029J237l939N49O424j177j03l38j176L210k321K45L846k561M249
$$ plain form
7546 26244 25529 20806 16414 10914 10753 13571 5422 11604 15504 22816 29681 19492 12724 16782 12217
7531 12217 9826 12897 24731 22922 16479 13635 13445 6771 8207 10132 10890 7460 8528 10820 15003
7516 15003 18672 22061 15731 10213 10429 9216 6299 9344 6552 34 5921 11609 9959 10822 19988
7501 19988 27189 27210 21419 22217 24547 16718 7669 9891 13606 11750 5395 1909 -1009 10483 19802
7486 19802 24357 26365 30918 25159 17677 18588 20232 19291 17257 19064 16834 22088 20171 22296 29348
7471 29348 36879 29920 18586 22699 31401 30122 33486 32182 27261 21446 19126 20576 14089 14060 14771
7456 14771 6238 3749 4595 7231 8138 -3908 4901 17571 16535 6081 4991 12852 15705 13466
7442 13466 12585 13614 14851 10912 11461 17885 16708 16605 16267 15091 18301 15980 16225 20071 17510 21759
7426B1759p082J7M680j0585n910j734J5780k90N903M327j0626L571m901q874L678
7411I713K833l443O116K2272m13m09m986L336P037n679m827o067o970p713l572
7396G228Q251P667o436r111M336L812P079J264q002J398o530P502J1541L86p708
7381B2677m038N690K418q604M731L070j56n069j2388l695K940P656P44l046l086
7366I844M288M91l202J0866J008m727k730m17k735l819j0532k587j829L64N210
7351e07P879J633L948M588o964k479O292k544o789M036M503p523K310N167p972
7336E578k92L085J959j407J656L727j0754q32Q916K635q548L413j740o039K042
7321C399J790j401p666Q077J0577r05j5167N482P878k833o330L579L972n298k42
$$ plain form
7426 21759 14677 14694 19374 8789 2879 1145 16925 16635 22538 26865 16239 19810 14909 6035 9713
7411 9713 12546 9103 15219 37491 37078 36669 31683 35019 42056 36377 31550 25483 18513 10800 7228
7396 7228 15479 23146 16710 7599 11935 15747 22826 24090 16088 17486 10956 18458 29999 30385 22677
7381 22677 18639 24329 26747 18143 22874 25944 25788 20719 8331 4636 7576 15232 15976 12930 9844
7366 9844 14132 14623 11421 22287 23295 18568 15838 15421 12686 8867 -1665 -4252 -6081 -5717 -507
7351 -507 7372 9005 12953 17541 10577 8098 14390 11846 5057 9093 13596 6073 8383 13550 5578
7336 5578 5286 8371 10330 8923 10579 14306 3552 2720 11636 14271 5723 9136 7396 1357 3399
7321 3399 5189 3788 -3878 4199 14776 13871 -1296 4186 12064 9231 2901 6480 10452 5154 4912
7306D912J0135K206p52K397m626j601j084P89K832L707k904j0314m026L865K027
7291G563j696m901J4915L248m195J890J33O43j048l314J49j174m995m394q101
7276e277K988J4932R811l203o842K454L21j1681j029R873J674m119J599N345l594
7261A3252K615M232P74N406o538n460O909J720R97n144j3104M526j109j1432q718
7246a1074O540M546j600n778M181J1206L041L41R258K376j1136o276j096k442
7232B087J488K557m753J716N47K325O192p51K687J416M64J017L234L384m472m415
7216A4723k795k046m29M577q996n304J2691M133l293j124o226p635J0397J0554
7202A9227L789r71J43Q143K075N410j0323r590q121q258J852O401r886N496r36
$$ plain form
7306 4912 15047 17253 16501 18898 14272 12671 11587 12376 15208 18915 16011 5697 1671 5536 7563
7291 7563 5867 966 15881 19129 14934 16824 16957 17600 16552 13238 13387 12213 7218 2824 -5277
7276 -5277 -2289 12643 22454 19251 12409 14863 15184 3503 2474 12347 14021 9902 11501 16846 13252
7261 13252 15867 20099 20873 26279 19741 14281 21190 22910 23907 18763 5659 10185 9076 -2356 -11074
7246 -11074 -4534 12 -1588 -7366 -3185 8021 11062 11403 20661 23037 11901 5625 4529 2087
7232 2087 3575 6132 1379 3095 3642 5967 12159 11408 14095 15511 15975 16992 20226 23610 19138 14723
7216 14723 11928 9882 9453 14030 5034 -270 12421 16554 13261 12137 5911 -1724 8673 19227
7202 19227 23016 22045 22188 30331 32406 37816 27493 17903 9782 1524 3376 9777 -109 5387 4451
7187D451m457M410l058l494r296J1312P077O910M847L481n090q803M057M686q33
7172A6200n558o401q088n490q43k855m806O900J0068N940J0344N61o600J6Q158
7157A7546L199p43j429m316k330N78q192M732j701L721N834P63m712J66k65r454
7141C397j019O572k807j053m608L052l685k171J192K678L699L534k820o6j373
7126D522j14J679j7Q930K909k102l800k522n458m168l501M078n165j125J0180
7111D326j575j05N082m877j0890n21Q348J4941l32J313Q66J528J974j3310L756
7096A0524P864l566p810O651O11l901M916P836l6q206k403P549M588p870m631
7081A2116K465Q11j906p390K518l217n625J010n531k979m551l399R809J1700L459
$$ plain form
7187 4451 -6 4404 1346 -2148 -11444 -132 6945 13855 18702 22183 17093 8290 12347 17033 16200
7172 16200 10642 4241 -3847 -9337 -10180 -13035 -17841 -10941 -873 5067 15411 15972 9372 9388 17546
7157 17546 20745 20002 18573 14257 11927 12505 4313 9045 7344 11065 16899 17662 12950 13116 12851 3397
7141 3397 2378 8950 6143 5090 482 3534 -151 -2322 -1130 1548 5247 8781 5961 5895 4522
7126 4522 4408 6087 6070 15000 17909 15807 12007 9485 4027 -141 -3642 436 -4729 -5854 4326
7111 4326 2751 2646 7728 2851 -8039 -8560 -212 14729 14397 15710 16576 18104 20078 6768 10524
7096 10524 18388 14822 7012 13663 14274 10373 15289 23125 23089 14883 12480 20029 24617 16747 12116
7081 12116 14581 15392 13486 6096 8614 5397 -228 782 -4749 -7728 -12279 -15678 -5869 5831 9290
7066I290o245p414J454J6909P263n020q342K508l33o374J21j1626k714k229N226
7051g526J55M509N35J2804J0962K860k556j0416j964m517L079q40o159N499J2299
7036A8724k129L008l401j0176p94j88l540o554P745L981P987l412r120r585j008
7021h462Q915O685M185n535j1618l97R127M232n145m342m51J1443J718J303n69
7006A1089J1412M79m348j3850k589N647M032N115N89n203j0784Q27k151Q956J256
6991A0477K461l776l636k71p308M552R569L527o399l639p153M620N223K253Q76
6976A1376k726J179J430q956j473m587O826K300r209N020R514K917o601k388l698
6961I24k702j102N465N401o944n302n7k416K082N976P839J1440r50m559j0259
$$ plain form
7066 9290 3045 -4369 -2915 13994 21257 16237 7895 10403 10070 3696 3817 -7809 -10523 -12752 -7526
7051 -7526 -7371 -2862 -2327 10477 21439 24299 21743 11327 9363 4846 7925 7085 926 6425 18724
7036 18724 16595 19603 16202 6026 5232 5044 1504 -5050 2695 6676 14663 11251 2131 -7454 -8462
7021 -8462 453 7138 11323 5788 -5830 -6227 2900 7132 1987 -2355 -2806 8637 10355 11658 11089
7006 11089 22501 22980 18632 4782 2193 7840 11872 16987 17576 12373 1589 2416 265 9221 10477
6991 10477 12938 9162 5526 5255 -2053 2499 12068 15595 9196 5557 -1596 3024 8247 10500 11376
6976 11376 8650 9829 11259 2303 830 -3757 3069 5369 -3840 1180 10694 13611 7010 4622 924
6961 924 -1778 -2880 2585 7986 1042 -4260 -4317 -6733 -4651 1325 9164 20604 19654 15095 4836
6946D836j0809k129M200L660J83K260k949m287R451J4363J94r233P51L283m654
6931I120J453N425J343O086k558l500j811L14o64J87P729J561l768j1178l747
6916E992L784M560m222p550M81J604j367Q254m624q183K858Q808R485k834p189
6901I857n214j2022m656J672M408O484j1515P097J1095L79l961o763o176J3466
6887D151J3294R15j0625o989O692K959j2038K836n151k628m21k326O120R047O563
6872A2399k810j475n71o641N213L852J49n080m292j701l181k22O484l044M58Q772
6856H310M920L601o043p383J267N303J3028J797L894O550j260r074p884j229j1564
6841D233m529p163P892O678k93J213J435q328J0334P748j5595k0263K403O411
$$ plain form
6946 4836 -5973 -8102 -3902 -242 -59 2201 -748 -5035 4416 18779 18973 9740 10491 13774 9120
6931 9120 10573 15998 17341 23427 20869 17369 15558 15872 15208 15395 23124 24685 20917 9739 5992
6916 5992 9776 14336 10114 2564 3045 4649 3282 11536 6912 -1271 1587 10395 19880 17046 9857
6901 9857 4643 -7379 -12035 -10363 -5955 529 -10986 -3889 7206 7585 3624 -3139 -9315 4151
6887 4151 17445 18360 7735 746 7438 10397 -1641 1195 -3956 -6584 -7005 -9331 -3211 5836 12399
6872 12399 9589 8114 7543 902 6115 9967 10116 5036 744 -957 -4138 -4360 2124 -920 -462 8310
6856 8310 13230 16831 10788 3405 4672 9975 23003 24800 28694 35244 33984 24910 17026 15797 4233
6841 4233 -296 -7459 433 7111 6818 8031 9466 1138 11472 19220 3625 -16638 -14235 -7824
6827g824j628K479J3020J1922r640o482j153o039m519n90N314Q880L755O722r07
6812A3310p632R816M713l410j3128n015M437K716N912m484k262L059k365O24k757
6797C534k988N591J915k953k619l084p042p733k368K738J1460O64J1248k749j3648
6782h034J2043O926j889p435K645n422p403K167N988Q949j442j910m428J3318
6768A4073P018p463m23K069k471K914p125M59K453L985N422l05J28m835r674q070
6752a845J062n72j288N62j024K293Q146Q760P398M091J667o616k007m521n456
6737A0650o217n933K818m66Q474Q600Q280J02o526j4791l154l525J768J6114O808
6722B3002m343q314r169o838Q654Q343K548p724J646Rk883M569k513k360K474
$$ plain form
6827 -7824 -9452 -6973 6047 17969 8329 1847 694 -5345 -9864 -10454 -5140 3740 7495 14217 13310
6812 13310 5678 15494 20207 16797 3669 -1346 3091 5807 11719 7235 4973 8032 5667 6291 3534
6797 3534 546 6137 8052 5099 2480 -604 -7646 -15379 -17747 -15009 -3549 -2885 8363 5614 -8034
6782 -8034 4009 10935 9046 1611 4256 -1166 -8569 -6402 -414 8535 7093 5183 755 14073
6768 14073 21091 13628 13205 15274 12803 15717 8592 9051 11504 15489 20911 20606 20734 15899 6225 -1845
6752 -1845 -783 -1355 -2643 -2081 -3105 -812 7334 16094 23492 27583 29250 22634 20627 16106 10650
6737 10650 4433 -1500 1318 852 9326 17926 26206 26308 19782 4991 1837 -1688 80 16194 23002
6722 23002 18659 10345 1176 -5662 2992 11335 13883 6159 7805 7814 4931 9500 6987 4627 7101
6707G101k213O754k254M78J47J289j0151n120l277N310J5676M600K471k433j1724
6692F654r514m201K076M764Q253J339n533l239N27R429L694L955r072n305o041
6677b214Q906o90n847N429m516n563J161R839J342j3795j1164K772J3525L280
6663B465L681o814O8j257l628n067k19r650N372K937j93O007R542P181M409l32
6647A4502k182P3m940k455o770k561j195P759O794j515j900m942J0259m925j5199
6632i197n242J0300P421k305q97o450j100J0609J4180N39n407l819l312j1892
6618f572Q331J502N262K686O53L423n352p646l785R05O003N091N875k108q780
6603E488N922M62m228p110r288n880J4457J788p541O499J37k122m48N212m51l591
$$ plain form
6707 7101 4888 11642 9388 9866 10013 11302 1151 -3969 -7246 -1936 13740 18340 20811 18378 6654
6692 6654 -2860 -7061 -4985 -221 8032 9371 3838 599 1126 10555 14249 18204 9132 3827 -2214
6677 -2214 6692 6002 155 5584 1068 -4495 -3334 6505 7847 -5948 -17112 -14340 -815 2465
6663 2465 6146 -668 -600 -1857 -5485 -10552 -10771 -20421 -15049 -12112 -12305 -6298 3244 10425 14834 14502
6647 14502 12320 12393 7453 4998 -1772 -4333 -5528 2231 9025 7510 5610 668 10927 6002 -9197
6632 -9197 -14439 -4139 3282 977 80 -6370 -7470 3139 17319 17858 12451 8632 5320 -6572
6618 -6572 1759 3261 8523 11209 11862 15285 9933 2287 -1498 -593 5410 10501 16376 14268 5488
6603 5488 11410 11872 7644 534 -8754 -14634 -177 1611 -5930 569 706 -1416 -1864 3348 2897 -694
6587f94k378k762K311M911l092n015o011l512K07K447Q883J3157p390j985R968
6572I045M661l298k440r818l997R873J076J04k588j278o8Q060j035p48L383k360
6556H572j026Q056L391j3103M902J1231k984j2804q302K840L405J838k091L507
6542G432N859l451p590L213J1760m53n462q020l34j650J91J065N876P310l04l942
6526A1500j820l119n373N672r27j384m390O241J0075j3624q158N082N424m899
6512C00j1792r22J847L300J254m945j672o141N913R013L005P262P49O95j68k165
6496E533m048m757R457J473j102M968M634o011j908J35p12k054j811m048M926
6481D675J2839m58j597q909j733r45l157L220n278m957m611J117k427L591L863
$$ plain form
6587 -694 -3072 -5834 -3523 1388 -1704 -6719 -12730 -16242 -16035 -13588 -4705 8452 1062 -923 9045
6572 9045 13706 10408 7968 -1850 -5847 4026 5102 5206 2618 1340 1272 9332 8297 7549 10932 8572
6556 8572 7546 15602 18993 5890 10792 22023 19039 6235 -2067 773 4178 6016 3925 7432
6542 7432 13291 9840 2250 5463 17223 16770 11308 3288 2954 1304 1495 2560 8436 15746 15442 11500
6526 11500 9680 6561 1188 6860 5933 4549 159 6400 16475 2851 -5307 -225 5199 300
6512 300 -11492 -12414 -10567 -7267 -6013 -10958 -12630 -18771 -12858 -3845 -840 6422 7171 7866 7698 5533
6496 5533 1485 -3272 6185 7658 6556 11524 16158 10147 8239 8374 7662 5608 3797 -251 4675
6481 4675 17514 17056 15459 6550 4817 3872 715 3935 -1343 -6300 -10911 -9794 -12221 -8630 -4767
6466d767N573J875N242p973o642P067Q162n32O563P37r521p903n2R74N456j222
6450C037l476P347k069m181k541L160K92M129L922J052k748Mo117j0363k039N776
6434d815L722L669J0906J86L56R906l816n714K403N275j2644j2060k751q93K328
6419c942k098L8O576N385j209j505o39n788n204K608L474j476N177J872j070n475
6403c276N518L592l704m229Q060O823o424m623k123Q062J493q951q917K93p47
6388i153j3030j542J1205R597J0822l12l524l533n28k83K915j449j6965R7L288
6373a2395n910O738N387p318R814R449l780n609L032K866k975o390K337P823m442
6358a373k676J806m349M455O44J481L742o222j0995M093L722L594J717J006l412
$$ plain form
6466 -4767 806 2681 7923 -50 -6692 375 8537 8005 14568 15305 5784 -2119 -2171 -1197 4259 3037
6450 3037 -439 6908 4839 658 -1883 1277 1569 5698 9620 10672 7924 7928 1811 -8552 -10591 -4815
6434 -4815 -1093 2576 13482 13668 14024 23930 20114 14400 16803 22078 9434 -2626 -5377 -6270 -3942
6419 -3942 -6040 -6002 574 5959 4750 3245 2606 -3182 -8386 -5778 -2304 -3780 1397 3269 2199 -3276
6403 -3276 2242 5834 2130 -2099 5961 12784 6360 1737 -386 7676 9169 218 -8699 -8406 -9153
6388 -9153 -22183 -23725 -12520 -2923 7899 7587 4063 530 2 -281 2634 1185 -15780 -15683 -12395
6373 -12395 -18305 -11567 -6180 -13498 -3684 5765 1985 -3624 -592 2274 -701 -7091 -4754 3069 -1373
6358 -1373 -4049 -2243 -6592 -2137 -1493 -12 3730 -2492 -13487 -9394 -5672 -2078 -361 645 -2767
6343b767m534L07J3799n095k049L824R455m326k400j651J0657j591K910K605l630
6328A5514J987k076o678M184K468j56k86p480Q259q214j0973n167n296M067N622
6313d225J10L469P91j04J1695l82j0315N188k519J742K213M911l251J114J186
6298A1623k834P08n754N097K607n972O07r818k232K700N98K381P407J686N666
6283A4470L60j0698J696l400q902q301m673Q466P454p432k297Q98o49L456k24
6268i776R536M912l440o867m810Q951n162j440o491J934J4997j391l302p58k567
6253e674n511l438K380n755P465J2083M274k110J339r299J642j1334o073J0998
6239i013J4627K011J752l403j2585K043J0468Q736n231n487K987J022K714P53
$$ plain form
6343 -2767 -7301 -6994 6805 1710 -339 3485 12940 8614 6214 4563 15220 13629 16539 19144 15514
6328 15514 17501 15425 8747 12931 15399 15243 14957 7477 15736 7522 -3451 -8618 -13914 -9847 -4225
6313 -4225 -4115 -646 145 41 11736 11354 1039 6227 3708 5450 7663 12574 9323 10437 11623
6298 11623 8789 9497 3743 8840 11447 5475 6082 -3736 -5968 -3268 -2670 -289 7118 8804 14470
6283 14470 14830 4132 5828 2428 -6474 -14775 -19448 -10982 -3528 -10960 -13257 -12359 -13008 -9552 -9776
6268 -9776 -240 4672 1232 -5635 -10445 -1494 -6656 -8096 -14587 -12653 2344 953 -2349 -3107 -5674
6253 -5674 -11185 -14623 -12243 -17998 -10533 1550 5824 3714 5053 -4246 -2604 -13938 -20011 -9013
6239 -9013 5614 7625 9377 5974 -6611 -4568 5900 14636 9405 3918 6905 7927 10641 11394
6225A1394J517J925j0603j0923P695P350o849P31L34p725j056R78J1435O505j2932
6210b24j1789m37l607L82P560k247q19L412M919J596j447J578L554o768j0073
6195a4410J671N96k060P219R84O388j530n107m524K189M183J299m040k577R95
6180h724O265N899O051J699l168o697O556K338Op47j060p318k229O214Q278j1824
6164A539l395j356l294Q611k662m042L855N661K377L924Q172N968k257j9465j5233
6149a1597k528J5830P656p8k442j0328j1468o10P416J2465M39n934m609N821O362
6134F395l934p795K935O036o971j0204M80l657P616N088o827J841R210N674J187
6119G074n334N962o282N255K224l518m676Q221J1220p885o611n349P562Q553J975
$$ plain form
6225 11394 12911 14836 4233 -6690 1005 8355 1506 2237 2571 -5154 -6210 -5232 6203 12708 -224
6210 -224 -12013 -12450 -16057 -15675 -8115 -10362 -11181 -7769 -2850 -1254 -2701 -1123 2431 -4337 -14410
6195 -14410 -12739 -12143 -14203 -6984 -6000 388 -1142 -6249 -10773 -8584 -4401 -3102 -7142 -9719 -8724
6180 -8724 -2459 3440 9491 11190 8022 1325 7881 10219 10225 9478 8418 1100 -1129 5085 13363 1539
6164 1539 -1856 -3212 -6506 2105 -557 -4599 -744 4917 7294 11218 19390 25358 23101 3636 -11597
6149 -11597 -14125 1705 9361 9283 6841 -3487 -14955 -15565 -8149 4316 4755 -1179 -5788 33 6395
6134 6395 2461 -5334 -2399 3637 -3334 -13538 -13058 -16715 -9099 -4011 -10838 -8997 213 5887 7074
6119 7074 1740 7702 1420 6675 8899 5381 705 8926 20146 12261 5650 301 7863 16416 18391
6104A8391j543o12P22j0417j642K440P659k313o13n613J02L212n52l652o985j440
6088b856j902o1N681p94P6J975Q139p520l351m244J594m788J017K017j0182q14
6072a6013J158P198K629m461K906R17m769p57J3208M696j965J2177P170r561p950
6057F583K277M832j745n253m218L043m712M513k987k896K212N621l288j920N352
6042G414K240l952o566K162O29L378q020r713J1970J1001m564k882l853N502K374
6027G120j1635q922N392N437o423p807P093J163q073Q767R454P262n835p060m008
6012h075P504R329Q772n328p085k146l595r85r164O901K968J088L545l411k063
5997a745K547P327l096q961j0514o64M501J427M820K732j703J4377j129o727j2923
$$ plain form
6104 18391 16848 16236 16958 6541 4899 7339 14998 12685 12072 6459 6561 9773 9221 5569 -1416 -2856
6088 -2856 -4758 -4819 862 68 144 2119 10258 2738 -613 -4857 -3263 -8051 -7034 -5017 -15199 -16013
6072 -16013 -14855 -7657 -5028 -9489 -6583 -5666 -10435 -11192 2016 6712 4747 16924 24094 14533 6583
6057 6583 8860 13692 11947 6694 2476 5519 807 5320 2333 -563 1649 7270 3982 2062 7414
6042 7414 9654 5702 -864 1298 1927 5305 -2715 -12428 -458 10543 5979 3097 -756 4746 7120
6027 7120 -4515 -13437 -8045 -2608 -9031 -16838 -9745 -8582 -16655 -7888 1566 8828 2993 -4067 -8075
6012 -8075 -571 8758 17530 12202 5117 2971 -624 -1609 -10773 -3872 -904 184 3729 318 -1745
5997 -1745 802 8129 5033 -3928 -14442 -15106 -10605 -9178 -4358 -1626 -3329 11048 9919 3192 -9731
5982i731k818P877J0299L355R32M293q417r251n097L466J480O64M486P70j117
5967A191L39O808L370L965L027m862M5N318L781q724n220N349k356k458m448K354
5951G479J313n39j161j4115K940O360P243J290m137n859n911m593K842M207n370
5936h011n999k924j422j709N380R422M735K290l169r327J598M437R242K727l798
5921C472K896L611m363R073l282j7830j519L349P79L977k890j84M632L992k361
5906C352L377K383n284L81R21o8K740J0033j140n199j319J688L953m765r365p887
5890f199l524P054O095R304L504p039r003N279J2429n435j4312l884N012M863
5876D144L355o726m090k781N246j969J915o51P84P830o154k092p82m47K670L232
$$ plain form
5982 -9731 -12549 -4672 5627 8982 9914 14207 5790 -3461 -8558 -5092 -3612 -2948 1538 2308 1191
5967 1191 1530 8338 11708 15673 18700 13838 13883 19201 22982 14258 9038 14387 12031 9573 5125 7479
5951 7479 8792 8253 7092 -7023 -4083 2277 9520 10810 6673 814 -5097 -9690 -6848 -2641 -8011
5936 -8011 -14010 -16934 -18356 -20065 -14685 -5263 -528 1762 -1407 -10734 -9136 -4699 4543 7270 3472
5921 3472 6368 9979 5616 14689 11407 -6423 -7942 -4593 -3814 163 -2727 -2911 1721 5713 3352
5906 3352 6729 9112 3828 4209 5130 5062 7802 17835 16695 11496 10177 11865 15818 11053 1688 -6199
5890 -6199 -9723 -2669 3426 12730 16234 9195 192 5471 17900 12465 -1847 -5731 -719 4144
5876 4144 7499 773 -3317 -6098 -852 -2821 -906 -1557 -773 7057 903 -1189 -1971 -2418 252 3484
5860C484M649n777L559J052j118p40k652j2894l213M478J0297P187q827j447M290
5845B328J509J222N616K495J7J530q038q527K1j095j753J4737O785j4142o142
5830c437N050n640o56O396j2942q858R318L540R237K788l103O100J027q707m284
5815d171K115O543O694l865L466J012j780n115n350j289j477O874P309m107o051
5800H08J701K368K56n648l301P885O261Q361o334j2174K663P04n418p575l433
5785a2876J0929P82k702L197J0751o166p836J205L491q819P221n79O810J13l519
5770B002J825j611o06k766n081l146J731j674R412J767o585j0998n204l313L071
5755b1176J3238K424J0009K400q687J645J023O514j431N426k848j2557m702J144
$$ plain form
5860 3484 8133 2356 5915 6967 5849 5109 2457 -10437 -13650 -9172 1125 8312 -515 -1962 2328
5845 2328 3837 5059 10675 13170 13187 14717 6679 -1848 -1827 -2922 -4675 10062 16847 2705 -3437
5830 -3437 1613 -4027 -4683 1713 -11229 -20087 -10769 -7229 2008 4796 1693 7793 8820 113 -4171
5815 -4171 -2056 4487 11181 7316 10782 11794 10014 4899 -451 -1740 -3217 3657 10966 6859 808
5800 808 2509 4877 5133 -515 -3816 4069 10330 18691 12357 183 2846 3550 -1868 -9443 -12876
5785 -12876 -1947 -1165 -3867 -670 10081 3915 -3921 -2716 775 -8044 -823 -1402 5408 5521 2002
5770 2002 3827 2216 1610 -1156 -6237 -9383 -7652 -9326 86 1853 -4732 -15730 -20934 -24247 -21176
5755 -21176 -7938 -5514 4495 6895 -1792 -147 876 7390 5959 11385 8537 -4020 -8722 -7578
5741g578m969N885R152l809j1571l236J2317R169j0626m090P711O868O096L757
5727A5076k809j1012l514O490L962j660M480j24N517m503j2577n628M555p615
5713i362m351J0055O896N13J448o605q219l819R55J3297P612P41K837P697q12
5698A8883j2383O458L003n397j2277MM754l186j2831K504Q729M278J440r051M493
5683e79Q560k890k495p999m002n957L17K630j73j419Q542q57N091l357M827P180
5667G419n663r374P64l822o35R136L608r43J525J464L03J606M268J693l225l022
5651E102p61K690L083k277r953M359O543o390j5908j2767L547J3789Q146K615
5637A818J980l795q91m59P968M0o193q77j574L494q45l603K268J2m452o258N760
$$ plain form
5741 -7578 -12547 -6662 2490 -1319 -12890 -16126 -3809 5360 -5266 -9356 -1645 5223 11319 15076
5727 15076 12267 1255 -2259 4231 8193 6533 11013 10889 16406 11903 -674 -6302 -1747 -9362
5713 -9362 -13713 -3658 3238 3751 5199 -1406 -9625 -13444 -12489 808 8420 9161 11998 19695 18883
5698 18883 6500 12958 15961 10564 -1713 -1709 3045 -141 -12972 -10468 -1739 2539 3979 -5072 -579
5683 -579 7981 5091 2596 -5403 -9405 -15362 -15045 -12415 -12588 -14007 -5465 -6322 -1231 -4588 239 7419
5667 7419 1756 -7618 -6854 -10676 -11311 -2175 1433 490 2015 3479 3782 5388 9656 11349 8124 5102
5651 5102 4341 7031 10114 7837 -2116 2243 8786 2396 -13512 -26279 -22732 -8943 -797 1818
5637 1818 3798 3 -888 -1347 6621 6661 468 -409 -1983 1511 666 -2937 -669 -657 -5109 -11367 -5607
5620e607N568J138n847n118p547k116P469Q415N053O097N066M524K516M277o069
5605A7819o82l748k773N909m378j6792l978J0199J489o019k125j410j351l747
5591a1587q97M254N194j0143k168M836M339Q485L510p895k102L533k255r450q51
5576a3197J232K114J6408K927q673r374l367J0023N31J207N988o624l42l169Q617
5561D301J962l977p767k641l397j945l592n368M704J4519Q884M18k291O463l532
5546F741p613L05J2096o594j0920M312r89k778n337K467Q960j232o635K486R14
5531c817l683l124K380l839o397P142J2952o985L36J0469n45l236L77r333Q39
5516f464M181O559P483M025j071o070p447P72n3l578j768l533m571M134J907J807
$$ plain form
5620 -5607 -39 1099 -4748 -9866 -17413 -19529 -12060 -3645 1408 7505 12571 17095 19611 23888 17819
5605 17819 17137 13389 10616 16525 12147 -4645 -8623 1576 3065 -2954 -5079 -6489 -7840 -11587
5591 -11587 -12484 -8230 -3036 -13179 -15347 -10511 -6172 2313 5823 -2072 -4174 -641 -2896 -12346 -13197
5576 -13197 -11965 -9851 6557 9484 811 -8563 -11930 -1907 -1376 -169 5819 -805 -1147 -4316 4301
5561 4301 6263 2286 -5481 -8122 -11519 -13464 -17056 -22424 -17720 -3201 5683 6101 3810 10273 6741
5546 6741 -872 -567 11529 4935 -5985 -1673 -2662 -5440 -10777 -8310 650 -582 -7217 -4731 -3817
5531 -3817 -7500 -10624 -8244 -12083 -18480 -11338 1614 -5371 -5035 5434 4889 1653 2030 -7303 -6464
5516 -6464 -2283 4276 11759 15784 14713 8643 1196 1968 1915 -1663 -3431 -6964 -11535 -7401 -5494 -3687
5500c687N759k858M463n774k944J685k499l253J2976Q80q955J188N701q99q646
5485f863n150o706N751Q923P71K914J42k888m987r906R61L15P675J5312r534J213
5469b057N396M19p528j0977n971M574Q880L34M154R330k482r693J1651j87J024
5454F867R065n280l121M437o655p601r03r15j17J866P32l17N664N713l386L37
5438F386m510p886p187j87L417n394j263Q020N889r61j90J410r161R868O241M126
5422H618j175k620n899l54k297Q542J0531j482K611o76n123N089Q0M959j0433
5407A0371p035M188o532p991L918J792l775o200k068M853L147Q79k402K031p202
5392a2026J966M7M466k397M998j915p159K256O506K219N230n208M124J843p204
$$ plain form
5500 -3687 2072 -786 3677 -2097 -5041 -3356 -5855 -9108 3868 4748 -4207 -3019 2682 1783 -6863
5485 -6863 -12013 -18719 -12968 -4045 -3274 -360 -218 -3106 -8093 -17999 -17038 -16723 -9048 6264 -3270 -2057
5469 -2057 3339 3758 -3770 -14747 -20718 -16144 -7264 -6930 -2776 6554 4072 -5621 6030 5843 6867
5454 6867 15932 10652 7531 11968 5313 -2288 -3191 -4106 -4223 -2357 -1625 -1942 3722 9435 6049 6386
5438 6386 1876 -6010 -13197 -13384 -9967 -15361 -16624 -8604 -2715 -3676 -3866 -2456 -11617 -1749 4492 8618
5422 8618 7443 4823 -1076 -1430 -3727 4815 15346 13864 16475 15799 10676 15765 15845 20804 10371
5407 10371 3336 7524 992 -6999 -3081 -1289 -5064 -11264 -13332 -8479 -5332 -4453 -6855 -4824 -12026
5392 -12026 -10060 -10013 -5547 -7944 -2946 -4861 -12020 -9764 -3258 -1039 4191 -1017 3107 4950 -2254
5377b254K253J1499N780J995j0118j0628l630M098O620O92n491K857O781o934
5363C520j913m257K188K890n448j1657j706N294j180m808p632j488P674J979M694
5348a1850p77N72l384J715J254J3734Q874R258m233n825j1339m652M371J0342
5334H060O400o027j0694P08J20q428k231K529p754J0923J4814p99l398m021J075
5319A277j337l991L552Q89j648M458J911L875P957p305p935R586K924J241k950
5304A2504O90j1577l749L809j0084q488J359J3172J7709J219k227n977j528l623
5290C209O054J062r876o26L062j787m150j0389p819O158O190J0004J42m521n749
5275i036O64K547J1763N132q635j450j179n07j815p848P366J1718l237p437q694
$$ plain form
5377 -2254 -1 11498 17278 19273 9155 -1473 -5103 -1005 5615 6307 816 3673 10454 3520
5363 3520 1607 -2650 -462 2428 -3020 -14677 -16383 -11089 -12269 -17077 -24709 -26197 -18523 -16544 -11850
5348 -11850 -12627 -12055 -15439 -13724 -12470 1264 10138 19396 15163 9338 -2001 -6653 -2282 8060
5334 8060 14460 8433 -2261 -1553 -1433 -9861 -12092 -9563 -17317 -6394 8420 7621 4223 202 1277
5319 1277 -60 -4051 -499 390 -1258 3200 5111 8986 16943 9638 1703 11289 14213 15454 12504
5304 12504 13194 1617 -2132 1677 -8407 -16895 -15536 -2364 15345 16564 14337 8360 6832 3209
5290 3209 9263 10325 449 -177 2885 1098 -3052 -13441 -21260 -15102 -8912 1092 1234 -3287 -9036
5275 -9036 -8372 -5825 5938 11070 2435 985 -194 -701 -2516 -10364 -2998 8720 5483 -1954 -10648
5260a0648m988K617o654M837J912K905N815N738k291M118O9K299P38n359k705
5245a597Q705k979K645L240K338k314m331k949q209j0125O905Q774L550p233j536
5230e116M100J0664j2077k0233R950N284K843l48J191o362K384O020r336Q43J3894
5215C701J031j3647j168M340J5704p64k567j0282n071O698O041m446P77n157Q917
5200D107P055r190M614L523l398K30o679o011o15L290n532r061N230j823J288
5185a2972J1296J1286m828K82l049M669o441l309J600j12M168m206q047l826k170
5170a5659L084j320J283R123M321k968N889M585M735r627k601l781L352P066n683
5155A799o808K887m116K893k53n81N47L751Q612P00k325O741N395J323k091r07
$$ plain form
5260 -10648 -15636 -13019 -19673 -14836 -12924 -10019 -4204 1534 -757 3361 3430 5729 6467 1108 -1597
5245 -1597 7108 4129 6774 10014 12352 10038 5707 2758 -5451 -15576 -8671 103 3653 -3580 -5116
5230 -5116 -1016 9648 -2429 -22662 -12712 -7428 -4585 -4933 -3742 -10104 -7720 -1700 -11036 -10193 3701
5215 3701 4732 -8915 -10083 -5743 9961 9197 6630 -3652 -8723 -2025 4016 -430 347 -4810 4107
5200 4107 11162 1972 6586 10109 6711 6941 262 -5749 -6364 -3074 -8606 -17667 -12437 -14260 -12972
5185 -12972 -1676 9610 4782 5064 2015 6684 243 -3066 -1466 -1578 2590 -1616 -9663 -13489 -15659
5170 -15659 -12575 -13895 -12612 -3489 832 -2136 3753 8338 13073 3446 845 -2936 416 7482 1799
5155 1799 -5009 -2122 -6238 -3345 -3598 -4179 -3632 119 8731 9431 7106 13847 19242 20565 18474 17567
5139A7567q242j0275l232k778M11Q710k117j267r8O391K502J223J3516J922l779
5124B0454r228l957q649K978J3558K403j1696L307l685m463j853l258j495O03
5110d981k238n20K8K618l507J6683P857j3178o104K629j995j006l801p021l547
5095a8083K88O280Q162o687j6911n583J5214J5094Q909n438L010n497j3559q797
5081b3598l380k634P232N414J861o38k563K290N756m437L82j840J2627R589j056
5066E005l829m773p965o647K410L358Q729k142K040l918r016R92L210p703k720
5051b2969m300P590Q025j063N275R588R818j51J825j1359k354l626n996K833Q75
5036e989j55j0249p63J1752R03M228r62J750M592J772p617n080m36L627J632N260
$$ plain form
5139 17567 9325 -950 -4182 -6960 -6549 2161 44 -1223 -1321 5070 7572 8795 22311 24233 20454
5124 20454 11226 7269 -1380 1598 15156 17559 5863 9170 5485 1022 -831 -4089 -5584 -4981
5110 -4981 -7219 -7739 -7711 -5093 -8600 8083 15940 2762 -3342 -713 -2708 -3714 -7515 -14536 -18083
5095 -18083 -17795 -11515 -3353 -10040 -26951 -32534 -17320 -2226 6683 1245 4255 -1242 -14801 -23598
5081 -23598 -26978 -29612 -22380 -16966 -15105 -15743 -18306 -16016 -10260 -14697 -14315 -16155 -3528 6061 5005
5066 5005 1176 -3597 -11562 -18209 -15799 -12441 -3712 -5854 -3814 -7732 -16748 -15756 -12546 -20249 -22969
5051 -22969 -27269 -19679 -11654 -12717 -7442 2146 11964 11813 13638 2279 -75 -3701 -9697 -6864 -5989
5036 -5989 -6144 -16393 -17156 -5404 -4501 -273 -1235 515 5107 6879 -738 -5818 -6254 -2627 -995 4265
5020D265M632k656j0928l30N646o903k031O507j8N281K972K360m224j3071k231
5005a0729J1518O480O972o742m803K686k052o628p688n518L180Q574k37P257o105
4990c835j973M206L501N772j076p768j70n10l078M783l548J6N634P825L409J847
4974A5035j665r467q705J026R175J3622n346j0264j287P250M42p950m142J37K966
4959H27m732J909J548q171Q592J1068k73L98j048o503k270n820Q492P399j8194
4944f778n216j610P375q422o089Q304Q282R158K275K759L393k621M21k095j293
4929G843j91r610l353K908M786J622j3815p383k608P817N510K586j866j95J836
4914d113M124N041M18j0597k573P822L473m425q342J655J1789N759K186p01r892
$$ plain form
5020 4265 8897 6241 -4687 -5017 629 -6274 -8305 -1798 -1816 3465 6437 8797 4573 -8498 -10729
5005 -10729 789 7269 14241 7499 2696 5382 3330 -3298 -10986 -16504 -13324 -4750 -4987 2270 -3835
4990 -3835 -5808 -1602 1899 7671 6595 -1173 -1343 -1853 -4931 -148 -3696 -3680 1954 9779 13188 15035
4974 15035 13370 3903 -4802 -3776 5399 19021 13675 3411 2124 9374 9816 1866 -2276 -2139 827
4959 827 -3905 -1996 -448 -8619 -27 11041 10768 11166 10118 3615 1345 -4475 4017 11416 -6778
4944 -6778 -11994 -13604 -6229 -14651 -20740 -12436 -4154 5004 7279 10038 13431 10810 11231 9136 7843
4929 7843 7652 -1958 -5311 -2403 2383 4005 -9810 -17193 -19801 -11984 -6474 -3888 -5754 -5949 -4113
4914 -4113 11 5052 5470 -5127 -7700 122 3595 -830 -9172 -7517 4272 10031 12217 11516 1624
4899A624j1777p609j373J0143N335p920L507M68R794N075l289q409K01J1030M368
4884A1168J760K60o582l191m510Q448M907m211j1939K66K350J766j003L435k451
4869D73l454m69N624k083R18o480m20N816j552k257m080L582O299r831r02k652
4853a1468K973k46n070J621P564P094m214M347N894Q47o624r0n990k257L121p253
4837i751m578Q167K644J534O628L109m573L145Q01n651n174J343L231k601k948
4822d674P326K243k264n785J147K731O336R22M188N268N01l367l911j1864o391
4807g594l716O361J901r57J440J921n074J240L263K687o925j400J708M383K809
4792B047j460Q100L424m0m182n728K65K038m535M172J181k346N459m14j2103K934
$$ plain form
4899 1624 -10153 -17762 -19135 -8992 -3657 -11577 -8070 -7602 2192 7267 3978 -4431 -4230 6800 11168
4884 11168 12928 13188 6606 3415 -1095 7353 12260 8049 -3890 -3624 -1274 492 -511 2924 473
4869 473 -2981 -3450 2174 91 1009 -5471 -5891 -75 -1627 -3884 -7964 -4382 1917 -7914 -8816 -11468
4853 -11468 -8495 -8741 -13811 -12190 -4626 2468 -1746 2601 8495 9342 2718 2628 -3362 -5619 -2498 -9751
4837 -9751 -14329 -6162 -3518 -1984 4644 7753 3180 6325 7126 1475 -3699 -2356 875 -1726 -4674
4822 -4674 2652 4895 2631 -3154 -2007 724 7060 7982 12170 17438 17939 14572 10661 -1203 -7594
4807 -7594 -11310 -4949 -3048 -4005 -2565 -644 -5718 -4478 -1215 1472 -5453 -6853 -5145 -762 2047
4792 2047 587 8687 12111 12071 7889 2161 2426 4464 -71 4101 5282 2936 8395 7981 -4122 -1188
4776a188J5894L532j1283m828n137J791J528k904o038m790q063j38J1126M381
4762f117M508p127m221Q122K605n0o909L030P946L617N699o895J210j577L471
4747G312J11l735j1157r213l938p79P977O078K277J1456k941o527k153K926o703
4732i009O940Q362P013j3140r002k429j436o806J3807J0898P359K800m299q09
4718A0249l946m130m51P034j677L24o270q880J343M962M913o876m435L203k02
4703d839N948K823j852N115J301J667K601J99M608p413j0618k039l014L279K613
4688C79K685k241q262N206m915n56K257P987j14m805o459M586M616R15m701P608
4672D186K318L100P248L110j1893p205p165o676J1094N668O559O45k785j241r808
$$ plain form
4776 -1188 14706 18238 6955 2127 -3010 -1219 309 -2595 -8633 -13423 -21486 -21624 -10498 -6117
4762 -6117 -1609 -8736 -12957 -4835 -2230 -2280 -9189 -6159 1787 5404 11103 4208 5418 3841 7312
4747 7312 7423 3688 -7469 -16682 -20620 -21399 -13422 -7344 -5067 6389 3448 -3079 -5232 -2306 -9009
4732 -9009 -2069 6293 13306 166 -8836 -11265 -12701 -19507 -5700 5198 12557 15357 11058 10249
4718 10249 6303 2173 1722 8756 7079 7403 1133 -7747 -6404 -1442 3471 -3405 -7840 -4637 -4839
4703 -4839 1109 3932 2080 7195 8496 10163 12764 12963 17571 10158 -460 -2499 -5513 -2234 379
4688 379 3064 823 -7439 -2233 -7148 -7704 -5447 2540 2426 -2379 -8838 -4252 364 1279 -3422 4186
4672 4186 6504 9604 16852 19962 8069 864 -6301 -12977 -1883 3785 10344 10989 8204 6963 -2845
4657b845K609O457n380p003M201j302p959r50O486m71J141m46J0498J732p871
4642a103m495J210M215J159P35o873n016M296L648K376q427L899Q60k140Q562
4627B906O059R006n755o190m622K168Q048j292j1089m595l966j055k317J125P215
4612d354L638N9l219m837O351L810J790l583R069Q955j2282K057R05o364n605
4597c610L919K864j938O93l719l260j426j0144k961j578J955J8329J6478l356
4583A2246r616m21o682K827P632N050O775k191r974l494J854l011q900o26R028
4568D97N391M504j192p52p7P054m644j1071m75M218j835j1456m998Q264O104j424
4552a892l056L012M662j961N390N795j500r502k265m599n722O984N986m078n804
$$ plain form
4657 -2845 -236 6221 841 -6162 -1961 -3263 -11222 -12172 -5686 -6157 -5016 -5462 5036 6768 -1103
4642 -1103 -5598 -4388 -173 986 1721 -5152 -10168 -5872 -2224 152 -8275 -4376 -3516 -5656 2906
4627 2906 8965 17971 12216 6026 1404 3572 11620 10328 -761 -5356 -9322 -10377 -12694 -11569 -4354
4612 -4354 -716 -657 -3876 -8713 -2362 1448 3238 -345 8724 17679 5397 7454 8359 1995 -3610
4597 -3610 309 3173 1235 1928 -1791 -5051 -6477 -16621 -19582 -21160 -19205 -876 15602 12246
4583 12246 2630 2209 -4473 -1646 5986 11036 17811 15620 5646 2152 4006 995 -7905 -8531 497
4568 497 5888 10392 9200 8448 8371 15425 10781 -290 -765 3453 1618 -9838 -14836 -6572 -468 -1892
4552 -1892 -4948 -1936 2726 765 6155 11950 10450 948 -1317 -5916 -11638 -4654 1332 -2746 -8550
4537h550N659M170n796o423K140P127K502L081k499l819n344j695N579K030J229
4522f09k868M470q050j2937R027J3335l585r703j202Q536O882j746m089j1083
4508a3622q804p79J0639Q209J840k078O303K264N706j158m00J460j4408m609P068
4493b369L342J358n135J604l448L652j521j696L240k448O2K190P79m732p089n701
4477a7912L669J3119J0068K036l548p126q513N133K932m869k367l988J1007O220
4463E861O097R165q791j195N61K270j111n484j4J885L195L590n041k056j391o67
4447F874k902m379m476j666j219R381J162o66K576J821j658K290o473p968l293
4432a0596M345J119J833J524q87L047n615j1452p575M619N837K968P41K878P082
$$ plain form
4537 -8550 -2891 1279 -4517 -10940 -8800 -1673 829 3910 1411 -2408 -7752 -9447 -3868 -1838 -609
4522 -609 -3477 993 -7057 -19994 -10967 2368 -1217 -10920 -12122 -3586 3296 1550 -2539 -13622
4508 -13622 -22426 -23205 -12566 -4357 -2517 -4595 1708 3972 9678 8520 8120 9580 -4828 -9437 -2369
4493 -2369 973 2331 -2804 -1200 -4648 -996 -2517 -4213 -973 -3421 -3359 -1169 -390 -5122 -12211 -17912
4477 -17912 -14243 -1124 8944 10980 7432 306 -8207 -3074 -142 -5011 -7378 -11366 -359 5861
4463 5861 11958 21123 12332 11137 11698 13968 12857 7373 7359 9244 12439 16029 10988 8932 7541 6874
4447 6874 3972 -407 -4883 -6549 -7768 1613 2775 2109 4685 6506 4848 7138 665 -7303 -10596
4432 -10596 -6251 -5132 -3299 -1775 -2662 385 -5230 -16682 -24257 -19638 -13801 -10833 -10092 -7214 -132
4417a32L354o267o883Q489O034n836n003P49J874P866k777n991l662K734N629
4402A78K082K134k953n521n199R883M942l882k963m528J653r633j3803K121O933
4387a8556L271M99O792K028J462l385q456p69n61k576P341q362K661j552l523
4372b3686L684M342K689J42p358k125k261L231J3060J9728K389j584k773m556
4358D922M83p573r375P62R680L070l442l390k020k871n520n619j20J496n09J998
4342a8028R140O053J2121K504o773m955l650m450o85N007K312m253N833K350L737
4327F263n605M722Q165j486p813L0l879N247M221m181K302q841o407k902P757
4312b407Q290M859k057p661l120N377n118m460j786L978k245M877N931K052j145
$$ plain form
4417 -132 3222 -3045 -9928 -1439 4595 -1241 -6244 -5495 -3621 4245 1468 -4523 -8185 -5451 178
4402 178 2260 4394 1441 -4080 -9279 604 5546 1664 -1299 -5827 -4174 -13807 -27610 -25489 -18556
4387 -18556 -15285 -14786 -7994 -5966 -4504 -7889 -16345 -17114 -17675 -20251 -12910 -21272 -18611 -20163 -23686
4372 -23686 -20002 -15660 -12971 -12829 -20187 -22312 -24573 -21342 -8282 11446 13835 12251 9478 4922
4358 4922 5405 -2168 -11543 -10781 -1101 1969 -1473 -4863 -6883 -9754 -15274 -20893 -21013 -19517 -20026 -18028
4342 -18028 -8888 -2835 9286 11790 5017 62 -3588 -8038 -8723 -3716 -1404 -5657 176 2526 6263
4327 6263 658 5380 13545 12059 4246 4276 397 5644 9865 5684 7986 -855 -7262 -10164 -2407
4312 -2407 5883 10742 8685 1024 -2096 3281 -1837 -6297 -8083 -4105 -6350 -1473 4458 6510 5365
4297E365k4o02j3914m678M434R431K585N236k138K616K928N727K958m447p492
4282G985l799L922m08k063q958j479K214m927N297K154J454K154M569k351m613
4267A151k579l23k776J218o354m267m473k248R729O773R26j4600J689R596M932
4252a606k288L273j041J058j599l600p493k498J1745Q237l883p585m01o661M83
4237a3859m019J247j298l043K958O852O935O983K479L951j0000p008n809J2407
4223a224J0q761l853j824R383M886N173p147M65K127J609Q38j376l022n71N413
4207B126j330j215J735p587m601Q565K69K131n965q712l465L117O184J691M618
4192b439P645p268J04l911n645J773L935M559q130l250M426J1331J221j2340k027
$$ plain form
4297 5365 5341 4739 -9175 -13853 -9419 12 2597 7833 5695 8311 11239 16966 19924 15477 7985
4282 7985 4186 8108 7700 5637 -3321 -4800 -2586 -7513 -2216 -62 1392 3546 8115 5764 1151
4267 1151 -1428 -1751 -4527 -3309 -9663 -13930 -18403 -20651 -10922 -4149 -3223 -17823 -16134 -6538 -1606
4252 -1606 -3894 -621 -1662 -604 -2203 -5803 -13296 -15794 -4049 4188 305 -7280 -7681 -14342 -13859
4237 -13859 -17878 -16631 -17929 -20972 -18014 -11162 -4227 2756 5235 9186 -814 -7822 -13631 -1224
4223 -1224 -1214 -9975 -13828 -15652 -6269 -1383 3790 -3357 -2892 -765 844 1682 306 -2716 -3287 2126
4207 2126 796 -419 1316 -6271 -10872 -2307 -2038 93 -5872 -14584 -18049 -14932 -8748 -7057 -2439
4192 -2439 5206 -2062 -1958 -5869 -11514 -9741 -5806 -1247 -9377 -12627 -8201 3130 4351 -7989 -10016
4177a0016M049m95O481N565m162Q53p2O767L733k795o902L382R92k141l913M399
4161E725O814m626k589M781k6j006M200m554k630p816j1685J281J334P1k03N297
4145e632N107O408j502m707k342J250L518k731K009J416l964p594m428m225P060
4130a0357O337O030O449L280k689j0537l860J847N676o460j226k488j30j662N580
4115d210l866m751j939M328J0001P454l022N346k544p983n251l440N418K027j4191
4100a6623N533J0009n21J285m411m481M735L79m132M789K547j18J2735N996r002
4085H720k310r957K181K573m796N81r50N405o627p410r581j493J2118J462o498
4070a6582L614O80R645M873O469K088P89j659r390q585J22l104P947j785M11j554
$$ plain form
4177 -10016 -5967 -6462 19 5584 1422 2275 2203 8970 12703 9908 3006 6388 7380 5239 1326 5725
4161 5725 12539 7913 5324 10105 10079 9073 13273 8719 6089 -1727 -13412 -12131 -10797 -10726 -10929 -5632
4145 -5632 -525 5883 4381 -326 -2668 -1418 2100 -631 1378 2794 -1170 -8764 -13192 -17417 -10357
4130 -10357 -4020 2010 8459 11739 9050 -1487 -5347 -3500 2176 -4284 -5510 -7998 -8128 -9790 -4210
4115 -4210 -8076 -12827 -14766 -10438 -437 7017 3995 9341 6797 -1186 -6437 -9877 -4459 -2432 -16623
4100 -16623 -11090 -1081 -1602 -317 -4728 -9209 -4474 -4095 -8227 -3438 -891 -1009 11726 17722 8720
4085 8720 6410 -3547 -1366 1207 -3589 -3008 -3958 1447 -5180 -12590 -22171 -23664 -11546 -10084 -16582
4070 -16582 -12968 -12288 -2643 2230 8699 10787 11576 9917 527 -8058 -7936 -11040 -3093 -4878 -4467 -6021
4054f021j034m57R721P605Q720n290r962l211J506m125L174J392N141L853L419
4039A4431n436r035n756O492O944n933j5589q102J0369K937j117Q021J3903j972
4025A0157q607k242j173m152M829m192N80m57k088J852K210J155J6854J0384j2893
4010A2217m039L413j076j362m937o689l028q269o593p520N541O170P360P765K875
3995A828M20K591k729j495l484L602K066k297l830N03n35n371R120M375m282Q558
3979I040q069r674M745k502j658N406J984K646o06m634o382m730K027J3114Q670
3964I377l479J584n545k195k023K38N726M37j4346j3615M572J3104J8449m517
3950G767r020m400p468l014J0845J5451Q197j0149p938J919j715l269q480k253
$$ plain form
4054 -6021 -7055 -7512 2209 9814 18534 13244 3282 71 1577 -2548 626 2018 7159 11012 14431
4039 14431 8995 -40 -5796 696 7640 1707 -13882 -21984 -11615 -8678 -9795 -1774 12129 10157
4025 10157 1550 -692 -1865 -6017 -1188 -5380 -4800 -5257 -7345 -5493 -3283 -2128 14726 25110 12217
4010 12217 8178 11591 10515 9153 4216 -2473 -5501 -13770 -20363 -27883 -22342 -16172 -8812 -1047 1828
3995 1828 2248 4839 2110 615 -2869 733 2799 502 -3328 -2825 -3360 -8731 389 4764 482 9040
3979 9040 971 -8703 -3958 -6460 -8118 -2712 -728 1918 1312 -3322 -9704 -14434 -12407 707 9377
3964 9377 5898 7482 1937 -258 -2281 -2043 3683 4120 -10226 -23841 -19269 -6165 12284 7767
3950 7767 -1253 -5653 -13121 -16135 -5290 10161 18358 8209 271 2190 475 -2794 -11274 -13527
3936a3527J0252K0286L109l017L942r001j562M84j0980k786J661l098k862K395
3922d704N857N01m180o56j017L610l657N09k579J275R53K30L62R9L908n071l426
3905g986J2396L095n504j355P802O855K622l20K354K46r254m731p541l552q05
3890e678l142m753k849J0178K621q644p153L194J6103O383l743m008O52r790J426
3875i203Q855M832j195l473j4100l471L955N205q115J79P383P84q95J169K794
3860e296Q90M102J0492L713j586m385r018L024M586q11m483o886j704k299o805
3845a6466O926P424N788N437j926j1962k90J3701m83p920l538k085q443M283O773
3830b781r81k721l550n413n573P695Q370P75j365r495J719l838R45K46O32j616
$$ plain form
3936 -13527 -3275 17011 20120 17103 21045 12044 10482 10966 -14 -2800 -1139 -4237 -7099 -4704
3922 -4704 1153 1654 -2526 -3182 -4199 -589 -4246 -3737 -6316 -5041 -4088 -3858 -3496 -3397 511 -4560 -7986
3905 -7986 4410 7505 2001 646 8448 15303 17925 17605 19959 20205 10951 6220 -1321 -4873 -5678
3890 -5678 -8820 -13573 -16422 -6244 -3623 -12267 -19420 -16226 -123 6260 2517 -1491 -839 -10629 -9203
3875 -9203 -348 4484 3289 -184 -14284 -17755 -13800 -8595 -16710 -16531 -9148 -8364 -9259 -8090 -5296
3860 -5296 -4406 -304 10188 13901 12315 7930 -1088 1936 6522 5711 1228 -5658 -7362 -9661 -16466
3845 -16466 -9540 -2116 3672 9109 7183 -4779 -5069 8632 8149 229 -3309 -5394 -13837 -9554 -2781
3830 -2781 -3762 -6483 -10033 -15446 -21019 -13324 -4954 -4179 -5544 -15039 -13320 -17158 -16213 -15967 -15335 -16951
3814a6951N551R73m651J621L067l7j441L644N954k48M079n570k804o88M846O648
3798C993l431m619Q273R42N492m997l743m440M317l843J850K08m195N139P421
3783H367P977p770r338J995L166r311o972Q99J1521J1956j1462r831L400L058
3769b345J857o492k554j759K686P119k812j889j59K237K897p221n764L488J283
3754i428m3n50J187P252N267k671j102m637n755L574M178Q520q283o344M056N528
3738G49m03n94M420j0361j5231K7N228R99n81m240k818M82J0679J310P640L940
3722A246N180k038j922m301k127J293k245o405O427J22n544K68L134J265J009
3707d638l970O108J3940q970p953L608Q952J471r269k462M750M245o29O5J792
$$ plain form
3814 -16951 -11400 -10427 -15078 -13457 -10390 -10427 -11868 -8224 -2270 -2518 1561 -4009 -6813 -7501 -2655 3993
3798 3993 562 -4057 4216 5158 10650 5653 1910 -2530 1787 -2056 -206 2 -4193 946 8367
3783 8367 16344 8574 -764 1231 4397 -4914 -11886 -10987 534 12490 1028 -8803 -5403 -2345
3769 -2345 -488 -6980 -9534 -11293 -8607 -1488 -4300 -6189 -6348 -4111 -1214 -8435 -14199 -10711 -9428
3754 -9428 -9471 -10021 -8834 -1582 3685 1014 -88 -4725 -10480 -6906 -2728 5792 -2491 -8835 -4779 749
3738 749 346 -248 4172 -6189 -21420 -21393 -16165 -15166 -15747 -19987 -22805 -22323 -11644 -10334 -2694 1246
3722 1246 6426 4388 2466 -1835 -3962 -2669 -4914 -11319 -4892 -4770 -10314 -10046 -6912 -5647 -4638
3707 -4638 -8608 -2500 11440 2470 -5483 -1875 7077 8548 -721 -3183 1567 5812 5183 5248 7040
3692G040J521J0681r604k0290o525k712L921R205P543K091j5496q359J0615P552
3678b817J776K356j541o63L266N606k374P44r712j469L628k797K866J411n008
3663d728q278k7P126l463o593N342O573L210n136n740K221j923M742K153o275
3648a0796m704k75P834K823p72q960J90J837L295K98q774k47P738M833P792J953
3632D065p642J454k065K41k905o926O365J3394M696r113l826Q037l346j6015o296
3617a9882P33K304M192O848R10m825l590M462N53N558J80j0818J12J0896R713
3602G346K675l193n577M543J2329K23j4668r254J750O071l677K289R606L51L293
3587A4107m269o110L527l12k918j6479L085K165P93l444k739N16M857k735P341
$$ plain form
3692 7040 8561 19242 9638 -10652 -17177 -19889 -15968 -6763 780 2871 -12625 -20984 -10369 -2817
3678 -2817 -1041 1315 -226 -889 2377 7983 5609 6353 -3359 -4828 -1200 -3997 -1131 280 -4728
3663 -4728 -13006 -13033 -5907 -9370 -15963 -10621 -4048 -838 -5974 -11714 -9493 -11416 -6674 -4521 -10796
3648 -10796 -15500 -15775 -7941 -5118 -5890 -14850 -14660 -12823 -9528 -9230 -18004 -18251 -10513 -5680 2112 4065
3632 4065 -3577 -2123 -4188 -3947 -6852 -13778 -7413 5981 10677 1564 -2262 5775 2429 -13586 -19882
3617 -19882 -19149 -16845 -12653 -5805 -4895 -9720 -13310 -8848 -8295 -2737 -2557 -13375 -13263 -2367 7346
3602 7346 10021 6828 1251 5794 18123 18346 3678 -5576 -3826 2245 -1432 857 10463 10814 14107
3587 14107 9838 3728 7255 6943 4025 -12454 -9369 -7204 -6411 -9855 -12594 -12078 -7221 -9956 -2615
3572b615k215n496l712L400L653n508j1012o327R966O623L247q81J0441O430p585
3557a591M861J907j0214l160R595k556k258n240L485K628L045N686r437q906R08
3542a1247O581P93j1594J449P280K794N32j698N75o2J0903m067k216k433o202
3527h612o204N116J4826L041r475j787J1882j348J034J483n223j864n031J41K453
3512D32N44j208K36L057j999N617N499q78l669k634j2199l770P63j062P287K813
3496a171j589k265J14L921m739O987M097r332m839J564O396N501p424o505k766
3481a2050R08O031j545k131Q536l028J855K069q828J038l737L035J5347N055m039
3466H516n652m586p939Q860O958m233k22L622k974k634M41L254Q011n503k530
$$ plain form
3572 -2615 -4830 -10326 -14038 -10638 -6985 -12493 -23505 -29832 -19866 -13243 -9996 -10877 -436 5994 -1591
3557 -1591 3270 5177 -5037 -8197 1398 -1158 -3416 -8656 -5171 -2543 502 6188 -3249 -12155 -11247
3542 -11247 -4666 -3873 -15467 -14018 -6738 -3944 -3412 -5110 -4535 -4597 6306 2239 23 -2410 -8612
3527 -8612 -14816 -9700 5126 8167 -1308 -3095 8787 7439 8473 9956 4733 2869 -2162 -2021 432
3512 432 976 -232 4 3061 1062 6679 12178 11300 7631 4997 -7202 -10972 -10209 -11271 -3984 -1171
3496 -1171 -2760 -5025 -4911 -990 -5729 1258 5355 -3977 -8816 -7252 -856 4645 -2779 -9284 -12050
3481 -12050 -11142 -5111 -6656 -8787 -251 -3279 -1424 645 -8183 -7145 -10882 -7847 7500 12555 8516
3466 8516 2864 -1722 -9661 -801 6157 1924 1702 5324 2350 -284 157 3411 11422 5919 3389
3451C389P660J804j4316q874K647k99Q75Q192k241J312q598n307l685r817L420
3436b3838Q575J414R786j363Q364J311O67N195K757n057j5018j1035k660L387
3422a7515N601J803M948L136J114m248l439K882O374J378n204K392n450j658P11
3407g175K648K807j071J150k823o863k215J526O359K252M207M164R836O014n306
3392A5510j208o676m700r492n886K114J0959l639L775j779p786O882J4782l758
3378I098l115m24l228L250j1578L97N783j487J810P397l363n525P00j024m377
3363e686n256J4489J8642O049n114p938k1935j7346L580J2555P765p482P474j145
3349a348J978J317q484J867Q011l827o606O275J847O618N889J058l704p153j0412
$$ plain form
3451 3389 11049 12853 -1463 -10337 -7690 -7989 -7114 1078 -1163 149 -8449 -13756 -17441 -27258 -23838
3436 -23838 -15263 -13849 -4063 -5426 2938 4249 4916 10111 12868 7811 -7207 -18242 -20902 -17515
3422 -17515 -11914 -10111 -5163 -2027 -913 -5161 -8600 -5718 656 2034 -3170 -778 -6228 -7886 -7175
3407 -7175 -4527 -1720 -2791 -1641 -4464 -11327 -13542 -12016 -5657 -3405 802 4966 14802 20816 15510
3392 15510 14302 7626 2926 -6566 -12452 -10338 621 -3018 757 -1022 -8808 -1926 12856 9098
3378 9098 5983 5559 2331 5581 -5997 -5600 183 -1304 506 7903 4540 -985 -285 -1309 -5686
3363 -5686 -10942 3547 22189 28238 23124 15186 -6749 -24095 -20515 -7960 -195 -7677 -203 -1348
3349 -1348 630 1947 -6537 -4670 3341 -486 -7092 -817 1030 7648 13537 14595 10891 3738 -6674
3334f674p580n349n229P174J4202J721m674L395M575J611J419O587o488M260J535
3319A0485J1p103l582K332K66j315J24k76q8l379j30r191o355k6Q794r58l242
3302a3633N115M84j258N328L196l360m223J609J1581R864K221j1135n867l154
3288c232L953l533O252O178j2314l214M255n76M192M012N51j1582m455p023K221
3273a4315Q130K538l406j1592q92K850P776n663n190J977J831m989J2820R400
3259A275p055O66J4024n184j292L858q051j4694q2N866P037l831o23K263P277
3244A454O059n581p29J336k511M103M62l146n070m008k710O821Q796P204K407
3229A4887q762r808q452n014L617M982J5400J354K876m380j634j2400J564Q14
$$ plain form
3334 -6674 -14254 -19603 -24832 -17658 -3456 -1735 -6409 -3014 1561 3172 4591 11178 4690 8950 10485
3319 10485 10496 3393 -189 2143 2409 1094 1218 942 854 -2525 -2655 -11846 -18201 -18227 -9433 -10391 -13633
3302 -13633 -8518 -8034 -9292 -3964 -768 -4128 -8351 -6742 4839 14703 16924 5789 -78 -3232
3288 -3232 721 -2812 3440 9618 -2696 -5910 -1655 -2231 1961 5973 6524 -5058 -9513 -16536 -14315
3273 -14315 -6185 -3647 -7053 -18645 -19537 -16687 -8911 -14574 -19764 -17787 -15956 -20945 -8125 1275
3259 1275 -5780 -5114 8910 3726 2434 6292 -1759 -16453 -16535 -10669 -3632 -7463 -8086 -5823 1454
3244 1454 7513 1932 1203 2539 28 4131 4593 1447 -3623 -7631 -10341 -3520 5276 12480 14887
3229 14887 6125 -3683 -12135 -17149 -13532 -8550 6850 8204 11080 6700 5066 -7334 -5770 -4956
3215d956R240L646M791p985q411R4o81R735R313o393n695R988j593p712j0536
3200g155r801O247O157M835j88J916J232j861J2p6l823K882M195k621p398O50
3184d797o180j171O600J332l6O073q005j522M561p906Q877N600L604j0910m732
3169h612N364n861o001k634q269m249N995J0282j68q803N515Q172N320l405j733
3154i087l538L888L642O842J934j860o258j047k815M860l355M245P481k101n719
3139b888k096O116L175j221m238l909j894n119l558k18N013J2339l85k203Q107
3124G021K061L630p598j0621K475M998r244l522J025L29M282J890J368O772O329
3109A1195O199q576j0475j849N459M792K624Q2o532k244m688k392m77J0139O516
$$ plain form
3215 -4956 4284 7930 12721 4736 -3675 -3581 -4262 5473 14786 8393 2698 12686 11093 3381 -7155
3200 -7155 -16956 -10709 -4552 283 95 2011 3243 1382 1394 1318 -2505 377 4572 1951 -5447 -4797
3184 -4797 -10977 -12148 -5548 -4216 -4252 1821 -6184 -7706 -3145 -11051 -2174 3426 7030 -3880 -8612
3169 -8612 -3248 -9109 -15110 -17744 -26013 -30262 -24267 -13985 -14153 -22956 -17441 -9269 -3949 -7354 -9087
3154 -9087 -12625 -8737 -5095 1747 3681 1821 -4437 -5484 -8299 -3439 -6794 -2549 4932 2831 -2888
3139 -2888 -4984 1132 4307 3086 -1152 -5061 -6955 -12074 -15632 -15850 -10837 1502 1117 -1086 7021
3124 7021 9082 12712 5114 -5507 -3032 1966 -7278 -10800 -9775 -9446 -5164 -3274 -1906 4866 11195
3109 11195 17394 8818 -1657 -3506 1953 6745 9369 9451 2919 675 -4013 -6405 -6882 3257 9773
3094I773k04N49k81j3809J76K064p085j899l051M175j800L495l418l572j484P929
3078h442L064p30m271k395J004P043m061l05K932L583n830N08O471K300j144p721
3062g994L516N909o890m139m658k93N192L919P606M259o981K97n125l274M736
3047c920M812n285m975o833n647m14J5027J7272n00r711k967M618j508m458n224
3032i713K401P003N979m892q667r192K809Q722J923o802n323O267L830k345j054
3017i054M702N680l568J257M355l598L749K336l886p311O526M512o949p405j071
3002i725M329M536k819M923j0073j750k42j275N921J67J3656L271j585M79l195
2987F618n705j2782K866Q938Q13p343J413p45m354O669n77N236J239n92j196r03
$$ plain form
3094 9773 9569 10118 9837 -3972 -3796 -1732 -8817 -10716 -13767 -9592 -11392 -7897 -11315 -14887 -16371 -8442
3078 -8442 -5378 -6108 -10379 -12774 -11770 -4727 -8788 -9093 -6161 -2578 -8408 -7900 -1429 871 -273 -7994
3062 -7994 -4478 1431 -5459 -9598 -14256 -14549 -9357 -5438 2168 6427 -554 -257 -5382 -8656 -3920
3047 -3920 892 -4393 -9368 -16201 -21848 -22262 -7235 10037 9537 -174 -3141 1477 -31 -4489 -9713
3032 -9713 -7312 -309 5670 778 -7889 -17081 -14272 -5550 -3627 -10429 -15752 -9485 -5655 -8000 -9054
3017 -9054 -4352 1328 -2240 -983 3372 -226 3523 5859 1973 -5338 1188 5700 -1249 -8654 -9725
3002 -9725 -5396 -860 -3679 1244 -8829 -10579 -10821 -12096 -6175 -6008 7648 10919 9334 9813 6618
2987 6618 913 -11869 -9003 -65 748 -6595 -5182 -5927 -10281 -3612 -4189 1047 2286 1694 498 -405
2971d05r149K105L629L682J15p568k785J700M200j006n334L083J233k749K047
2956g202n442K210J505M443m21l860M705L952m575o361j496J1391L80N226j2267
2941g812l864k358L180N380M568j197n231j866P536l53r312J65k963K013M533
2926g581k546J169N064N81J180M396j1176l827N136P555J583j436m0r024q879
2911a7845k429L186N686K594P149j726l59O082j972J246M125m952n065K774M973
2896C467m611o752R15O959K301l754r811K551l133N324j587m298k033l143M877
2881a2728R46p649m890k931J2502L486l85M904K540J286J44k02O203M702O556
2866A4484n217n084j1705J631Q954J0901j196m770j797J859m212Q56M25p902j9
$$ plain form
2971 -405 -9554 -7449 -3820 -138 -23 -7591 -10376 -8676 -4476 -5482 -10816 -7733 -6500 -9249 -7202
2956 -7202 -12644 -10434 -8929 -4486 -4907 -8767 -4062 -110 -4685 -11046 -12542 -1151 -771 4455 -7812
2941 -7812 -11676 -14034 -10854 -5474 -906 -2103 -7334 -9200 -1664 -2017 -11329 -11164 -14127 -12114 -7581
2926 -7581 -10127 -8958 -3894 -3313 -2133 2263 -8913 -12740 -7604 -49 1534 98 58 -8966 -17845
2911 -17845 -20274 -17088 -11402 -8808 -1659 -3385 -3744 2338 366 1612 5737 785 -4280 -1506 3467
2896 3467 -1144 -7896 -6981 -22 2279 -1475 -11286 -8735 -11868 -6544 -8131 -12429 -14462 -17605 -12728
2881 -12728 -11782 -19431 -24321 -27252 -14750 -11264 -11649 -6745 -4205 -2919 -2775 -2977 3226 7928 14484
2866 14484 9267 4183 -7522 -5891 3063 13964 12768 7998 6201 8060 3848 4704 5129 -2773 -2792
2851b792M555J660L021L45r167m283p63P875L253N538l099m975L639o315J650
2836A42o338k603k839O813K751j711J314P845M002j830r62q821o877o219Q21J0093
2820d419o35Q76O33J209L715Q762m320q242r96l401O076M486K713j1533N293N598
2804E815k628j0899l155L990M163R16P533K00j166K389J493r723O66K128j1133
2789i411N584K014k524j749K699K008L757N957Q249q451j614L695K573M500N546
2774B2833q5m045p548k228k413p378R787j610p393n77K77O36j046m987o115L321
2758h571l545l619J5609J2125R45m132L370k723m526p38J531K901q703o090O083
2743h3L637K479L583k372N676q830k981N980J669j690o437k630j966K103k386
$$ plain form
2851 -2792 1763 3423 6444 6789 -2378 -6661 -7424 451 3704 9242 6143 1168 4807 -1508 142
2836 142 -6196 -8799 -11638 -4825 -2074 -3785 -2471 5374 9376 7546 6584 -2237 -9114 -15333 -14512 -4419
2820 -4419 -5054 -4178 -3545 -2336 1379 10141 5821 -2421 -3417 -6818 -742 3744 6457 -5076 217 5815
2804 5815 3187 -7712 -10867 -6877 -2714 -1798 5735 5935 4769 7158 8651 -1072 -406 1722 -9411
2789 -9411 -3827 -1813 -4337 -6086 -3387 -1379 2378 8335 16584 8133 6519 10214 12787 17287 22833
2774 22833 22748 18703 11155 8927 6514 -864 8923 7313 -80 -657 -380 256 -790 -5777 -11892 -8571
2758 -8571 -12116 -15735 -126 11999 12944 8812 12182 9459 4933 4195 5726 8627 -76 -6166 -83
2743 -83 3554 6033 9616 7244 12920 4090 1109 7089 8758 7068 631 -1999 -3965 -1862 -4248
2728d248n44Q963p581n457J418n58K370J243L996M989k887m902j804k822J202
2713f622J020M63J3894J7612l373j0099j064r371j4819j545K749M106J1323k102
2699B172P309l365q845j0049O544R379j996n605p164k286J0855K630n353o600
2685a2374R109J4316O46m109p396L921Q595R916J647j3819j5054N000n179l615
2671h396J1806J961J859L85m593j639m6j538K353K475l150j6299J641O47L668
2656h866R833M200K815n470K026K12N169Q124l362m430j4506K152M952j430N808
2641G227j179m049j960P723J0872n01o714j329r945l504j872M044J823L983K131
2626F750J926n165J071q28o39j0885N254J1605L210j414m175n758q863l364K865
$$ plain form
2728 -4248 -4792 4171 -3410 -8867 -7449 -8007 -5637 -4394 -398 4591 1704 -3198 -5002 -7824 -6622
2713 -6622 -5602 -5139 8755 26367 22994 12895 11831 2460 -12359 -13904 -11155 -7049 4274 2172
2699 2172 9481 6116 -2729 -12778 -6234 3145 1149 -4456 -11620 -13906 -3051 -421 -5774 -12374
2685 -12374 -3265 11051 11697 7588 192 4113 12708 22624 24271 10452 -4602 398 -4781 -8396
2671 -8396 3410 5371 7230 7615 3022 1383 1337 -201 2152 4627 1477 -14822 -13181 -12534 -8866
2656 -8866 967 5167 7982 2512 4538 4750 9919 18043 14681 10251 -4255 -2103 2849 1419 7227
2641 7227 6048 1999 39 7762 18634 18133 11419 10090 145 -3359 -5231 -1187 636 4619 6750
2626 6750 8676 3511 4582 3754 3115 -7770 -2516 9089 12299 10885 6710 952 -7911 -11275 -8410
2611h410N173j468J453J72K188l34p710N282J1033P148l082m221m416q897l955
2596a0044N532J3071N012O63r603p896R3M03l349N748Q968K222n611J517l97l803
2580B526q582J261l708o797j772L796O033K051k817R283J038m12J958M836L072
2565A1766o336j41j307K077j153m679L451o501k60N018M256L543q57j5287l28
2550f738J3048J5338p836j037j0720j4695k480J0659J1488l136n795m88k89O341
2536C660M881p418n201K622O359P557n137l607j860m267N646O076P083R513m996
2521B0911j3151p530l420o238j639p33n864P543J2520M58n871j550m979k55R901
2506A03R023m728j460k976j900n775K780J3148r058o160K167o431O53N463N772
$$ plain form
2611 -8410 -3237 -4705 -3252 -3080 -892 -1226 -8936 -3654 7379 14527 11445 7224 2808 -6089 -10044
2596 -10044 -4512 8559 13571 14234 4631 -3265 -3172 -2769 -6118 -370 8598 10820 5209 6726 6329 2526
2580 2526 -6056 -4795 -8503 -15300 -17072 -13276 -7243 -5192 -8009 1274 2312 1900 3858 8694 11766
2565 11766 5430 5289 3982 6059 4906 227 3678 -2823 -3083 1935 6191 9734 8877 -6410 -6738
2550 -6738 6310 21648 13812 12775 2055 -12640 -15120 -4461 7027 3891 -1904 -2392 -2681 3660
2536 3660 8541 1123 -4078 -1456 4903 12460 7323 3716 1856 -2411 3235 9311 16394 25907 20911
2521 20911 7760 230 -3190 -9428 -11067 -11800 -17664 -10121 2399 2857 -3014 -4564 -9543 -9798 103
2506 103 9126 4398 2938 -38 -1938 -7713 -4933 8215 -843 -7003 -4836 -11267 -10614 -5151 621
2491F21J464j405k591P544K982n354K371l254L704L491o392m966Kl484K046k859
2475f080L356q533k217Q020n787m179J2245j210l452R751L102M056J0095o420
2461A2747j8867k715N979Q703P003m285p493p066j5712j1516k106J4569R088o608
2447a8279J755j238J055j851Q868L859K08j297K689O401J2402l740j3916o867
2433i951l22J771k543R610N612J031M95p518j360n170L153M482O81O071m305j16
2417A621R34k461j942k799q87m381R885N628m709L408L717n620q58R149J282k40
2401A1727p334L014L949n015j547k626Q302K532k251j4073m283k868K703R598
2387A828J966O244M240m556q142n907j619O10N537P852K014m984j4291k392L327
$$ plain form
2491 621 2085 680 -1911 5633 8615 3261 5632 2378 6082 9573 3181 -1785 -1783 -5267 -3221 -6080
2475 -6080 -2724 -11257 -13474 -5454 -11241 -15420 -3175 -4385 -7837 1914 5016 9072 19167 12747
2461 12747 -6120 -8835 -2856 5847 12850 8565 1072 -5994 -21706 -33222 -35328 -20759 -11671 -18279
2447 -18279 -16524 -17762 -16707 -18558 -9690 -5831 -5623 -6920 -4231 2170 14572 10832 -3084 -9951
2433 -9951 -10273 -8502 -11045 -1435 4177 5208 5703 -1815 -3175 -8345 -5192 -710 -29 6042 1737 1621
2417 1621 2555 94 -1848 -4647 -5534 -9915 -30 5598 889 4297 8014 2394 1536 10685 11967 11727
2401 11727 4393 7407 11356 6341 4794 2168 10470 13002 10751 -3322 -7605 -10473 -7770 1828
2387 1828 3794 10038 14278 9722 1580 -4327 -5946 -5336 201 8053 10067 5083 -9208 -11600 -8273
2372h273N375O319P622J604n239j329J443L094r938j6862k428K87N541J1216O018
2357D450m88p248P397O294j1863k168J72K611O184l962J720N166O054n772j0411
2342a864J934J551R81j1045m691P822N844L866j653N085P814j1031k021J0352
2328A2944n150o751l077J666m94m243Q771O552m183r963n033n15P360Q202M549
2313A0635l211m612n879k693L214Q487J487K580o736j0365r764N97P725j953L362
2298g126L930J576r979m003M940N353L724q929m994p239M615R582K812R589N308
2283I159M97m677P27q330j1323P345Q246N355K328k246l399o383m599o13k283
2268a0196R693k573n223j231m556o729q54r90M836L955l64J1028P241P551J515
$$ plain form
2372 -8273 -2898 3421 11043 12647 7408 6079 7522 10616 678 -16184 -18612 -18325 -12784 -1568 4450
2357 4450 3962 -3286 4111 10405 -1458 -3626 -3454 -843 5341 1379 3099 8265 14319 8547 -1864
2342 -1864 70 1621 2602 -8443 -13134 -5312 532 4398 2745 7830 15644 4613 2592 12944
2328 12944 7794 1043 -2034 -368 -862 -5105 3666 10218 6035 -3928 -8961 -9476 -2116 6086 10635
2313 10635 7424 2812 -3067 -5760 -2546 5941 7428 10008 3272 -7093 -16857 -16260 -8535 -10488 -7126
2298 -7126 -3196 -1620 -11599 -15602 -10662 -5309 -1585 -10514 -15508 -22747 -18132 -8550 -5738 3851 9159
2283 9159 9656 4979 5706 -2624 -13947 -6602 1644 6999 9327 7081 3682 -2701 -7300 -7913 -10196
2268 -10196 -503 -3076 -8299 -9530 -14086 -20815 -21669 -22659 -17823 -13868 -14232 -3204 4037 11588 13103
2253A3103j0413k431j0219p29Q088J5294L590j1235l888m673o382M34o88o86L053
2238g782N823M843j268P322K880q253l010L375N325N679j495l317m876P82J980
2223H008j2220p418l471L883R162L200m127l310M218j0083r518J873L834R909
2209f060R732K679J501L69J197K551q229k737k052o700N860J708j919M661L828
2194F389k999N856O389M441l068j586j0029q554j90P582L064m029j2381p876L413
2179a3578J1571L283k178j197l544R508J1138l305r773N145l301p143J145N239
2165C010J4224Q00n448j2650k320P26j450j420p321R445P106J0491n90o207k292
2150F104M94o199R16k704K06j435l846l153J705K465m701q23P628R350o4M704
$$ plain form
2253 13103 2690 259 -9960 -10689 -2601 12693 16283 5048 1160 -3513 -9895 -9461 -10149 -10835 -7782
2238 -7782 -1959 2884 1616 8938 11818 3565 555 3930 9255 14934 13439 10122 5246 6028 8008
2223 8008 -4212 -11630 -15101 -11218 -2056 1144 -2983 -6293 -2075 -12158 -21676 -19803 -15969 -6060
2209 -6060 3672 6351 7852 8221 9418 11969 3740 1003 -1049 -7749 -1889 -181 -2100 2561 6389
2194 6389 3390 9246 15635 20076 17008 15422 5393 -3161 -3351 4231 7295 3266 -9115 -16991 -13578
2179 -13578 -2007 1276 -902 -2099 -5643 3865 15003 11698 1925 7070 3769 -3374 -2229 3010
2165 3010 17234 18034 12586 -64 -2384 -1658 -3108 -4528 -11849 -2404 4702 15193 14603 8396 6104
2150 6104 6598 399 1315 -1389 -1183 -2618 -6464 -9617 -7912 -5447 -10148 -10971 -3343 6007 5943 10647
2134A0647M12l989l572K92J762j552O029r922n883r197m444N940K0143J3050l846
2119A5870q24q870j5666m84r2l490O388m954j063K385M626N829m772J850J4972
2104A1705K140r493j054R178J550l259l459j1159n752O078J789J709n89o812Q720
2089A292J2564O30j0464j2064n284N628O607L219P980o033j0471OK672Q634M033
2074H949M00j580J083j2675j546P024Q050n401j1109j342Q529K966L492m095Q90
2059C635N813O267j406j1180n303m523M00P510Q293n99j2705J374j0046O24J1762
2044h4Q206l137L335J178L288k789o4p25k817O888L847j1099j0365n225j983L338
2028h208J3691n6o587j440l240M529N439K625l975M06n149j4613R455R153P54
$$ plain form
2134 10647 11059 7070 3498 3790 5552 4000 10029 107 -5776 -14973 -19417 -13477 6666 19716 15870
2119 15870 15046 6176 -9490 -9974 -10066 -13556 -7168 -12122 -13185 -10800 -6174 -345 -5117 -3267 11705
2104 11705 13845 4352 3298 12476 14026 10767 7308 -3851 -9603 -3525 -1736 -27 -616 -7428 1292
2089 1292 13856 14486 4022 -8042 -13326 -7698 -1091 2128 10108 4075 -6396 -6390 -3718 4916 8949
2074 8949 9349 7769 8852 -3823 -5369 1655 9705 4304 -6805 -8147 382 3348 6840 2745 3635
2059 3635 9448 15715 14309 3129 -2174 -6697 -6297 1213 9506 8907 -3798 -2424 -12470 -11846 -84
2044 -84 8122 4985 8320 9498 12786 9997 9933 9208 6391 13279 17126 6027 -4338 -9563 -11546 -8208
2028 -8208 5483 5427 -1160 -2600 -5840 -1311 4128 6753 2778 3184 -1965 -16578 -7123 2030 2784
2013B784k880m033K060o724j892N099P877n703l050J0796P739m088k499j1306
1999e820L13p5j233J953M991N156k515k300J877P642n38O140l432p641P64L059
1983H341o716j0180k169R230L105Q606r784n218k667o116M419j0964K408L721
1969a3984k985J0013M203K674k659k925l733M760L07Q239N120n092l28L669o271
1954A008n03j730J0845k773L165o262r289N561L943O383L168J590j896j5546q831
$$ plain form
2013 2784 -96 -4129 -2069 -8793 -10685 -5586 2291 -3412 -6462 4334 12073 7985 5486 -5820
1999 -5820 -5507 -5582 -6815 -4862 129 5285 2770 470 2347 9989 9451 15591 12159 4518 5282 8341
1983 8341 1625 -8555 -10724 -1494 1611 10217 433 -4785 -7452 -13568 -9149 -20113 -17705 -13984
1969 -13984 -16969 -6956 -2753 -79 -2738 -5663 -9396 -4636 -4329 3910 9030 3938 3610 7279 1008
1954 1008 505 -1225 9620 6847 10012 3750 -5539 22 3965 10348 13516 15106 13210 -2336 -11167
$$ [...]
##END NTUPLES=NMR SPECTRUM
##END=
