##TITLE=Analysis number 314019
Compound Code cc 45246
Book Reference 440/64
Project Code adrs
Chemist Name craigr
##JCAMPDX= 6.0         $$ Bruker NMR JCAMP-DX V2.0
##DATA TYPE= NMR SPECTRUM
##DATA CLASS= NTUPLES
##ORIGIN= Bruker BioSpin GmbH
##OWNER= NMR
$$ XWIN-NMR		Version 3.5
$$ Mon Oct  3 10:47:08 2005 GMT Daylight Time (UT+1h)  MAYBRIDGE\NMR@NMR_250MHZ
##.OBSERVE FREQUENCY= 250.131544655141
##.OBSERVE NUCLEUS= ^1H
##.ACQUISITION MODE= SIMULTANEOUS (DQD)
##.ACQUISITION SCHEME= undefined
##.AVERAGES= 16
##.DIGITISER RES= 18
##SPECTROMETER/DATA SYSTEM= dpx250
##.PULSE SEQUENCE= zg30
##.SOLVENT NAME= CDCl3
##.SHIFT REFERENCE= (INTERNAL, CDCl3, 0, 16.522)
##AUDIT TRAIL= $$ (NUMBER, WHEN, WHO, WHERE, WHAT)
$$ ##TITLE= Audit trail, XWIN-NMR		Version 3.5
$$ ##JCAMPDX= 5.01
$$ ##ORIGIN= Bruker BioSpin GmbH
$$ ##OWNER= NMR
$$ C:\u/data/dgb/nmr/ADRS/10230/pdata/1/auditp.txt
$$ ##AUDIT TRAIL=  $$ (NUMBER, WHEN, WHO, WHERE, WHAT)
(   1,<2005-10-03 10:46:30.84 +100>,<MAYBRIDGE\NMR>,<NMR_250MHZ>,
      <created by zg, POWCHK disabled, PULCHK disabled
       configuration hash MD5:
       62 19 C7 07 E1 42 D1 B7 37 6C 3D D0 77 39 F9 E6
       data hash MD5: 64K
       6B EF 7C E2 2F D5 81 90 85 88 87 94 2B 8F 7A 7E>)
(   2,<2005-10-03 10:46:47.95 +100>,<MAYBRIDGE\NMR>,<NMR_250MHZ>,
      <Start of raw data processing
       ef LB = 0.3 FT_mod = 6 PKNL = 1 SI = 32K 
       data hash MD5: 32K
       59 59 69 80 49 85 CB F0 20 EC B7 0D 8C 42 3F 0A>)
(   3,<2005-10-03 10:46:53.55 +100>,<MAYBRIDGE\NMR>,<NMR_250MHZ>,
      <apk 
       data hash MD5: 32K
       FB 87 54 D8 CF ED 60 80 DE 4A 0C DA A8 A3 CA 5A>)
(   4,<2005-10-03 10:46:55.49 +100>,<MAYBRIDGE\NMR>,<NMR_250MHZ>,
      <abs ABSG = 5 
       data hash MD5: 32K
       3F AA BE 67 D3 40 50 2F 7A 1A 04 FC 14 D4 37 D5>)
$$ ##END=
$$ 
$$ hash MD5
$$ 80 24 76 74 AD 85 F3 E1 25 B3 E8 27 89 5B B3 BE
##$RELAX= 
##$RELAX= 
##$RELAX= 
##$RELAX= 
##$RELAX= 
##$RELAX= 
##$RELAX= 
$$ Bruker specific parameters
$$ --------------------------
##$DU= <C:\u>
##$EXPNO= 10230
##$NAME= <ADRS>
##$PROCNO= 1
##$TYPE= <nmr>
##$USER= <dgb>
##$AMP= (0..31)
100 100 100 100 100 100 100 100 100 100 100 100 100 100 100 100 100 100 
100 100 100 100 100 100 100 100 100 100 100 100 100 100 
##$AQSEQ= 0
##$AQ_mod= 3
##$AUNM= <au_zg>
##$AUTOPOS= <16 >
##$BF1= 250.13
##$BF2= 250.13
##$BF3= 250.13
##$BF4= 250.13
##$BF5= 500.13
##$BF6= 500.13
##$BF7= 500.13
##$BF8= 500.13
##$BYTORDA= 1
##$CFDGTYP= 0
##$CFRGTYP= 5
##$CHEMSTR= <none>
##$CNST= (0..31)
1 1 145 1 1 1 1 1 1 1 1 1 1 1 1 1 1 1 1 1 1 1 1 1 1 1 1 1 1 1 1 1 
##$CPDPRG= <>
##$CPDPRG1= <>
##$CPDPRG2= <>
##$CPDPRG3= <>
##$CPDPRG4= <mlev>
##$CPDPRG5= <mlev>
##$CPDPRG6= <mlev>
##$CPDPRG7= <mlev>
##$CPDPRG8= <mlev>
##$CPDPRGB= <>
##$CPDPRGT= <>
##$D= (0..31)
0 1 0 0 0 0 0 0 0 0.06 0 0 0 0 0 0 0.0002 0 0 0 0 0 0 0 0 0 0 0 0 0 0 
0 
##$DATE= 1128332789
##$DBL= (0..7)
120 120 120 120 120 120 120 120 
##$DBP= (0..7)
150 150 150 150 150 150 150 150 
##$DBP07= 0
##$DBPNAM0= <>
##$DBPNAM1= <>
$$ [...]
##$SUBNAM7= <"">
##$SUBNAM8= <"">
##$SUBNAM9= <"">
##$SW= 20.6930455092707
##$SWIBOX= (0..15)
0 0 3 0 0 0 0 0 0 0 0 0 0 0 0 0 
##$SW_h= 5175.983436853
##$TD= 65536
##$TD0= 1
##$TE= 295.16
##$TE2= 300
##$TE3= 300
##$TEG= 300
##$TL= (0..7)
0 120 120 120 120 120 120 120 
##$TP= (0..7)
150 150 150 150 150 150 150 150 
##$TP07= 0
##$TPNAME0= <>
##$TPNAME1= <>
##$TPNAME2= <>
##$TPNAME3= <>
##$TPNAME4= <>
##$TPNAME5= <>
##$TPNAME6= <>
##$TPNAME7= <>
##$TPOAL= (0..7)
0.5 0.5 0.5 0.5 0.5 0.5 0.5 0.5 
##$TPOFFS= (0..7)
0 0 0 0 0 0 0 0 
##$TUNHIN= 0
##$TUNHOUT= 0
##$TUNXOUT= 0
##$USERA1= <user>
##$USERA2= <user>
##$USERA3= <user>
##$USERA4= <user>
##$USERA5= <user>
##$V9= 5
##$VALIST= <valist>
##$VCLIST= <CCCCCCCCCCCCCCC>
##$VD= 0
##$VDLIST= <DDDDDDDDDDDDDDD>
##$VPLIST= <PPPPPPPPPPPPPPP>
##$VTLIST= <TTTTTTTTTTTTTTT>
##$WBST= 1024
##$WBSW= 4
##$XGAIN= (0..3)
0 0 0 0 
##$XL= 0
##$YL= 0
##$YMAX_a= 455740
##$YMIN_a= -513838
##$ZGOPTNS= <>
##$ZL1= 120
##$ZL2= 120
##$ZL3= 120
##$ZL4= 120
##$ABSF1= 16.522
##$ABSF2= -4.171173
##$ABSG= 5
##$ABSL= 3
##$ALPHA= 0
##$AQORDER= 0
##$ASSFAC= 0
##$ASSFACI= 0
##$ASSFACX= 0
##$ASSWID= 0
##$AUNMP= <proc_1d>
##$AZFE= 0.1
##$AZFW= 0.1
##$BCFW= 0
##$BC_mod= 0
##$BYTORDP= 0
##$COROFFS= 0
##$CY= 12.5
##$DATMOD= 1
##$DC= 0
##$DFILT= <>
##$DTYPP= 0
##$F1P= 14.0000005364418
##$F2P= -0.99999901652339
##$FCOR= 0.5
##$FTSIZE= 32768
##$FT_mod= 6
##$GAMMA= 0
##$GB= 0
##$INTBC= 1
##$INTSCL= 1
##$ISEN= 128
##$LB= 0.3
##$LEV0= 0
##$LPBIN= 0
##$MAXI= 10000
##$MC2= 0
##$MEAN= 0
##$ME_mod= 0
##$MI= 0
##$NCOEF= 0
##$NC_proc= -4
##$NLEV= 6
##$NOISF1= 0
##$NOISF2= 0
##$NSP= 0
##$NTH_PI= 0
##$NZP= 0
##$OFFSET= 16.522
##$PC= 1
##$PHC0= 147.3362
##$PHC1= 4.258472
##$PH_mod= 1
##$PKNL= yes
##$PPARMOD= 0
##$PSCAL= 4
##$PSIGN= 0
##$REVERSE= no
##$SF= 250.13
##$SI= 32768
##$SIGF1= 0
##$SIGF2= 0
##$SINO= 400
##$SIOLD= 32768
##$SREGLST= <1H.CDCl3>
##$SSB= 0
##$STSI= 32768
##$STSR= 0
##$SW_p= 5175.98343685301
##$SYMM= 0
##$S_DEV= 0
##$TDeff= 65536
##$TDoff= 0
##$TI= <Analysis number 999999
Compound Code 99
Book Reference 9
Project Code 9>
##$TILT= no
##$TM1= 0
##$TM2= 0
##$TOPLEV= 0
##$USERP1= <user>
##$USERP2= <user>
##$USERP3= <user>
##$USERP4= <user>
##$USERP5= <user>
##$WDW= 1
##$XDIM= 32768
##$YMAX_p= 480709437
##$YMIN_p= -160030
$$ End of Bruker specific parameters
$$ ---------------------------------
##NTUPLES= NMR SPECTRUM
##VAR_NAME=  FREQUENCY,     SPECTRUM/REAL,   SPECTRUM/IMAG
##SYMBOL=    X,             R,               I
##VAR_TYPE=  INDEPENDENT,   DEPENDENT,       DEPENDENT
##VAR_FORM=  AFFN,          ASDF,            ASDF
##VAR_DIM=   32768,         32768,           32768
##UNITS=     HZ,            ARBITRARY UNITS, ARBITRARY UNITS
##FACTOR=    0.157963299565203, 1,           1
##FIRST=     4132.6476996994, 0,             0
##LAST=      -1043.33573715361, 0,           0
##MIN=       -1043.33573715361, -160030,     0
##MAX=       4132.6476996994, 480709437,     0
$$ Real data points
##PAGE= N=1
##DATA TABLE= (X++(R..R)), XYDATA
$$ [...]
16712f229L311M769k748j955O697J99k880r68N003j382N20R889m027k79k667j1926
16696d673n16N204N06j0555L579K473P681K438K059l541m20l329o337J0283M436
16681I288n36q606o368J1136K371p583o15L636Q283R516j402j0453J270N105J686
16666A6728N775j697J503j627j0941k257j587n577L975l681Q34K972Q283P933
16652B0636n898q364q208m534L925L496j581J742R873K581j26m849j894K364J885
16637A1048P504N14P403m77n320J409o932Q252M282L989m861p456O64J790n931
16622A5878j245L57k865o109J447M911p414M47M67l939N322M312j614j904o895
16607A156o904k079J0962N280l49j2840o142K785J201R057j148R500Q813K314
$$ plain form
16712 -6229 -2918 1851 -897 -2852 3845 4044 1164 196 5199 3817 4337 14226 10199 9920 7253 -4673
16696 -4673 -5189 15 521 -10034 -6455 -3982 3699 6137 8196 4655 4235 906 -5431 4852 9288
16681 9288 8752 146 -6222 4914 7285 -298 -913 2723 11006 20522 19120 8667 9937 15042 16728
16666 16728 22503 20806 22309 20682 9741 7484 5897 320 4295 614 1448 4420 12703 20636
16652 20636 14738 6374 -1834 -6368 -2443 1053 -528 1214 11087 13668 13542 8693 6799 9163 11048
16637 11048 18552 19066 26469 25992 20672 22081 15149 23401 27683 31672 26811 19355 20019 21809 15878
16622 15878 14633 14990 12125 6016 7463 12374 4960 5407 5874 1935 7257 11569 9955 8051 1156
16607 1156 -5748 -7827 3135 8415 8066 -4774 -10916 -8131 -6930 2127 979 10479 19292 21606
16593B1606M059L073K1486K5835L1115N7765K5670L747L780J0052Q64l3227n2898
16580A22927l3379k3372j4707o680J3j5375j5940M04J1J637N434O01p958p032
16566F584j620M008k045q676L994N958J9012M843j4681j3592n394P218J834o441
16552A002j2314J343j152J771J628P80N455R443M026m717j3450K518k912M397
16538b182K837J1922N511k080l500r124r29P039n10j467k636j100o223o845p212
16523a6499M412L80O899O759K175Q448J39m539l736o809K002k864j0965Q355j725
16508g568O714N120K614O151M160m357q582j487M368o952j467J680Q089l366k094
16493C023j916O41O091K588P326o655n599P585M594m736J064P035o105k534J788
$$ plain form
16593 21606 25665 28738 50224 76059 107174 164939 190609 194356 198136 208188 209052 175825 122927
16580 122927 89548 66176 51469 44789 44802 29427 13487 13891 13902 15539 20973 21574 13616 6584
16566 6584 4964 8972 6927 -1749 2245 8203 27215 32058 17377 3785 -1609 5609 7443 1002
16552 1002 -11312 -9969 -11121 -9350 -7722 -6942 -1487 7956 11982 7265 -6185 -3667 -6579 -2182
16538 -2182 655 12577 18088 16008 12508 3384 2455 9494 8984 7517 4881 3781 -2442 -9287 -16499
16523 -16499 -12087 -11707 -4808 1951 4126 12574 12713 8174 4438 -2371 -369 -3233 -14198 -5843 -7568
16508 -7568 -854 4266 6880 13031 17191 12834 4252 2765 7133 181 -1286 394 8483 5117 3023
16493 3023 1107 1748 7839 10427 17753 11098 5499 13084 17678 12942 14006 21041 14936 12402 14190
16478A4190n372j417L842j1359j2246K588j124L157Q890J967j2429j03R520M120
16464D224m269j247J802M865K362j989n448k800K869k289j0818j442O768l226
16450a0638p958K200L196l038O417N52n841p346l232J1994M865m713l968M597
16436a2913Q30M792q575n656J2831O567l548q058K870J9737Q10m440n706l066
16422c525O426J2120P16p369M368r05k773j4942m361O18J1136M463m702j714N38
16407I4j079q545Q128J4011J064o531k965q136l911R286J0897M88r651j2090J789
16392g151J3314q792o814L741N607N102q106j0090J0152j619l885j3620P495P200
16378g466k453N616R034m497J91k929K521P855k890O975j1047j0707M723J580
$$ plain form
16478 14190 8818 7401 11243 -116 -12362 -9774 -10898 -7741 1149 3116 -9313 -9416 104 4224
16464 4224 -45 -1292 510 5375 7737 5748 300 -2500 369 -1920 -12738 -14180 -7412 -10638
16450 -10638 -18596 -16396 -13200 -16238 -9821 -9269 -15110 -22456 -25688 -13694 -8829 -13542 -17510 -12913
16436 -12913 -12083 -7291 -15866 -21522 -8691 -2124 -5672 -13730 -10860 8877 9687 5247 -459 -3525
16422 -3525 2901 15021 15737 8368 12736 11831 9058 -5884 -10245 -9627 1509 5972 1270 -444 94
16407 94 -985 -9530 -1402 12609 13673 7142 4177 -3959 -7870 1416 12313 12801 3150 -8940 -7151
16392 -7151 6163 -2629 -9443 -5702 -95 5007 -3099 -13189 -3037 -4656 -8541 -22161 -14666 -7466
16378 -7466 -9919 -4303 4731 234 425 -2504 17 7872 4982 11957 910 -9797 -5074 -3494
16364c494R66M55K490N06K385r978p686O567L550j43P572r731K13O549J315J6682
16348A8218k25L496n025l779n370q36k692o988R439L606l390P428n194m318M583
16333H953J845j5755n806L220J3527k826J466k359r143m00J521n75J1297J0873
16319A5838J3o291q878q704J910J0603P571l925L145n195l059m098p857p289Q447
16304g769R343O701k034o331Q66p79k773M452M658q81l541n758m21k85K5j430
16288e957q465p93J873N019j072J250R587Q13l903K682l285J0502K876o827m178
16273A22n580l28N343j089o555k662Q924L555O417M272K51j4101r556m114O395
16258h706j173N652K256K262m381m630r094L147J5345L285o720k07N133J847M179
$$ plain form
16364 -3494 -2528 -2073 417 923 3308 -6670 -14356 -7789 -4239 -4382 3190 -6541 -6328 221 1536 18218
16348 18218 17993 21489 16464 12685 7315 6479 3787 -3201 6238 9844 6454 13882 8688 4370 8953
16333 8953 10798 -4957 -10763 -7543 5984 3158 4624 2265 -6878 -7278 -5757 -6332 4965 15838
16319 15838 15851 9560 682 -8022 -6112 4491 12062 8137 11282 6087 3028 -1070 -8927 -16216 -7769
16304 -7769 1574 8275 6241 -90 776 -3 -2776 1676 6334 5453 1912 -3846 -4267 -4552 -4527 -5957
16288 -5957 -14422 -15215 -13342 -8323 -9395 -8145 1442 2255 -1648 1034 -2251 8251 11127 4300 122
16273 122 -5458 -5786 -443 -1532 -8087 -10749 -1825 1730 8147 12419 12670 -1431 -10987 -15101 -8706
16258 -8706 -9879 -4227 -1971 291 -4090 -8720 -17814 -14667 678 3963 -2757 -2964 2169 4016 8195
16243H195q137L916R385n656q084r255k041K171J539n021O489P177K661j895K179
16228C623l398K039l135j319K826L979k479n285q70j1219Q620R326J079o420N610
16213B977M231l048l921j039m972r795K221Q341K213q884N558N938k113M84L55
16198a454K647o994P91J2119K47j2104m280m451q515j561l520P48J2858R782k206
16183e893l580L839o147m113L770P402l435J408n059n682J2671J333n500M459
16169d527J975j617l769K299O585J987K653o239j5021J082n74N533J2199p262
16155d696n916R697R970j268r077j1100m457n994P296L639o92L970R720m887J297
16140b498O347J771P157r19M054q516j4617J203l27o428R20M402Q61n32k300k946
$$ plain form
16243 8195 58 3974 13359 7703 -381 -9636 -11677 -9506 -7967 -12988 -6499 678 3339 1444 3623
16228 3623 225 2264 -871 -2190 636 4615 2136 -3149 -4019 -15238 -6618 2708 3787 -2633 2977
16213 2977 7208 4160 239 -800 -5772 -15567 -13346 -5005 -2792 -11676 -6118 -180 -2293 -1809 -1454
16198 -1454 1193 -5801 -5010 7109 7356 -4748 -9028 -13479 -21994 -23555 -27075 -26327 -13469 -3687 -5893
16183 -5893 -9473 -5634 -11781 -15894 -12124 -4722 -8157 -6749 -11808 -17490 -4819 -3486 -8986 -4527
16169 -4527 -2552 -4169 -7938 -5639 946 2933 5586 -653 -15674 -14592 -15166 -9633 2566 -4696
16155 -4696 -10612 -915 9055 7787 -1290 -12390 -16847 -22841 -15545 -11906 -12598 -8628 1092 -3795 -2498
16140 -2498 3849 5620 12777 11858 15912 7396 -7221 -6018 -6345 -12773 -11853 -7451 -6590 -7122 -9422 -12368
16124a2368K923M976M403M478q190m073N670k833N442j1307p282o494M50l990
16110b8195q65n34O106n55J3783J2907k253n877Q926J1142n026O0r63j6789p257
16095a5390J0970k54j252O305n220J707J185P782n287j7781j520R580P167p516
16081i524P417J229L29k231n720k463M057P998J1412R492j386r306j9904K564
16067f036J5097J0274o693j2244l81n235j0886j76p04k836M597Q551J5256J155
16053I739p794m104O776L729r309J0862m11L881P53O944J464m344q334o470n223
16038a841o305N662m533k539l017n352j0377p786J3502M834Q892Q295R634J308
16024A0377k330o504M325K480j090N46M671p373l256Q35J103j2463j3742m949
$$ plain form
16124 -12368 -9445 -4469 -66 4412 -3778 -7851 -2181 -5014 428 -10879 -18161 -24655 -24205 -28195
16110 -28195 -29060 -29594 -23488 -24043 -10260 2647 394 -5483 3443 14585 9559 9619 8656 -8133 -15390
16095 -15390 -4420 -4674 -5926 379 -4841 -3134 -1949 5833 546 -17235 -18755 -9175 -2008 -9524
16081 -9524 -2107 -878 -549 -2780 -8500 -10963 -6906 1092 12504 21996 20610 11304 -8600 -6036
16067 -6036 9061 19335 12642 398 17 -5218 -16104 -16280 -16984 -19820 -15223 -6672 8584 9739
16053 9739 1945 -2159 4617 8346 -963 9899 9488 13369 14122 21066 22530 18186 9852 3382 -1841
16038 -1841 -8146 -2484 -7017 -9556 -12573 -17925 -28302 -36088 -22586 -17752 -8860 -565 9069 10377
16024 10377 8047 1543 5868 8348 7258 7804 12475 5102 1846 2681 3784 -8679 -22421 -27370
16010b7370J384P171J0951K960M74K958k19l758J3719q40q733m547j481l735N805
15995e261K128N368l769k928K824O059j0889M656L355p872j1376j155K235P758
15981h867M1k270M863K563N360q400j130Q263K621N949j043n281J542P435m62
15966A1184J473m381j3917p078M431Q590q036m412L134R003n446j038k893O748
15952b638l863o620O35J56l499L25P560m203p050j431q254J0443N818L056N835
15937c730N990j357o317J649P379n041n864J260K326n182K463k444j232Qj1150
15922b1242N139J4798O785j821j296o17O137k495n098N775j2600l404R648m857
15908e148J702O172K284j5198m497M296J606L773K202m277J858j1560m001Q31
$$ plain form
16010 -27370 -25986 -18815 -7864 -4904 -4430 -1472 -1691 -5449 8270 7430 -1303 -5850 -7331 -11066 -5261
15995 -5261 -3133 2235 -1534 -4462 -1638 4421 -6468 -1812 1543 -6329 -17705 -18860 -16625 -8867
15981 -8867 -8826 -11096 -6233 -3670 1690 -6710 -7840 423 3044 8993 7950 2669 4211 11646 11184
15966 11184 12657 8276 -5641 -12719 -8288 302 -7734 -12146 -9012 -9 -5455 -6493 -9386 -2638
15952 -2638 -6501 -13121 -12486 -12330 -15829 -15504 -7944 -12147 -19197 -20628 -28882 -18439 -12621 -9565 -3730
15937 -3730 2260 903 -5414 -3765 3614 -1427 -7291 -6031 -3705 -8887 -6424 -8868 -10100 -10092 -21242
15922 -21242 -16103 -1305 5480 3659 2363 1746 7883 5388 290 6065 -6535 -9939 -291 -5148
15908 -5148 -3446 2726 5010 -10188 -14685 -10389 -8783 -5010 -2808 -7085 -5227 -16787 -20788 -19957
15894a9957J00R037N962j589J318j0611J296l372N905J0880K035k0237p730O562
15880b0401O136K309K138J4074R985p601j2381j0977L383o80J2695J365k508L10
15866b153k956L251r1j794j0091N892p86n750k193O617M542j886J350J1620k055
15851C517K861P297j2141p003M271j031j796M436P852j740l139l386j805r988
15837a1795N855M751L704M250j340j0775q704N514K465J386Q86p567q23k698N822
15822i069k970k007l880m341R163R987q140j0293M122Q883K342n921j892j807
15808a5823j360k180K858q675n614J481N877L30m671r438K819N24Q396L765l72
15793b2083k681p952j2013k136N907J0809J0691J1179M529o013o374L553P907
$$ plain form
15894 -19957 -19857 -10820 -4858 -6447 -5129 -15740 -14444 -17816 -11911 -1031 1004 -19233 -26963 -20401
15880 -20401 -14265 -11956 -9818 4256 14241 6640 -5741 -16718 -13335 -14015 -1320 45 -2463 -2153
15866 -2153 -5109 -1858 -1949 -3743 -13834 -7942 -8728 -14478 -16671 -10054 -5512 -7398 -6048 5572 3517
15851 3517 6378 13675 1534 -5469 -1198 -2229 -4025 411 8263 6523 3384 -2 -1807 -11795
15837 -11795 -5940 -1189 2515 6765 5425 -5350 -14054 -8540 -6075 -4689 -3803 -11370 -12193 -14891 -9069
15822 -9069 -12039 -14046 -17926 -22267 -13104 -3117 -11257 -21550 -17428 -8545 -6203 -12124 -14016 -15823
15808 -15823 -17183 -19363 -16505 -25180 -30794 -29313 -23436 -23106 -27777 -37215 -34396 -33872 -25476 -21711 -22083
15793 -22083 -24764 -32716 -44729 -46865 -40958 -30149 -19458 -8279 -3750 -9763 -16137 -12584 -4677
15780d677k408P03K38m563p74M666j0858o115R672M592K960m886K682j858o952
15765a7578J726l831K592J2431K511m727k31p690k650J5097O993J52P776Q8o417
15750F242n640o728r749k485O348k137k509L389P761L060r449n984l301K350J4183
15735d649J1669q921j9240Q282N795L98o117L096L368m364J0856K680l62j5619
15721a3128j1732n002M993L044L298P852O601K741o796l326O263M074m318R070
15707C634M679k048r84J256N171M482M547p426p838q692J3861M482o168j164k586
15692E206L881P34m432p155m280l643L347l049j000P973M849n688o59m53n079
15677i448q331p192k702J1348J4474O8j3742J483r307M338O853L177L405M496
$$ plain form
15780 -4677 -7085 -6382 -6144 -10707 -11481 -6815 -17673 -23788 -14116 -9524 -6564 -11450 -8768 -10626 -17578
15765 -17578 -15852 -19683 -17091 -4660 -2149 -6876 -7107 -14797 -17447 -2350 4643 4795 12571 12659 6242
15750 6242 602 -6126 -15875 -18360 -12012 -14149 -16658 -13269 -5508 -2448 -11897 -17881 -21182 -18832 -4649
15735 -4649 7020 -1901 -21141 -12859 -7064 -6666 -12783 -9687 -6319 -10683 173 2853 2491 -13128
15721 -13128 -24860 -29862 -24869 -21825 -18527 -10675 -4074 -1333 -8129 -11455 -5192 -1118 -5436 3634
15707 3634 8313 6265 5281 6537 11708 16190 20737 13311 5473 -3219 10642 15124 8956 7792 5206
15692 5206 9087 9821 5389 -1766 -6046 -9689 -6342 -9391 -10391 -2418 2431 -3257 -3916 -4369 -9448
15677 -9448 -17779 -24971 -27673 -16325 -1851 -1783 -15525 -14042 -23349 -19011 -12158 -8981 -5576 -1080
15663a080q057j2918J07P471j128R521O468o399K858M95k352Q693J494p451O26
15648a652N87L442K819J1058J516N201o147o898K478L653m113N332m23o167j070
15633I616m130l038m163m777K40n2o516K033j2870J792M495O251O385o781m574
15618a6089J2473J2135n942O66L20J132k443m212M732O51j0584n815J1154m893
15604f715q156j5769M086L560O787O211o993J0741L966j340j04j597K564J354
15590a405j551j806m299n450N984N266l951l742k56r40j0976k497L672P829P27
15575a3395P434Q195P81o707n82K886o333m047l851k868M957k755j898L571m779
15560a9391J774M069p41p490O7Q422J0441J569P171p13j122p110p943n39O089
$$ plain form
15663 -1080 -9137 -22055 -21948 -14477 -15605 -6084 384 -6015 -3157 -2662 -5014 3679 5173 -2278 -1652
15648 -1652 -1065 2377 5196 16254 17770 22971 16824 9926 12404 16057 11944 17276 16853 10686 9616
15633 9616 5486 2448 -1715 -6492 -6252 -6304 -12820 -10787 -23657 -21865 -17370 -11119 -4734 -11515 -16089
15618 -16089 -3616 8519 2577 3243 3563 4695 2252 -1960 2772 3423 -7161 -12976 -1822 -6715
15604 -6715 -14871 -30640 -26554 -22994 -16207 -9996 -16989 -6248 -2282 -3622 -3726 -5323 -2759 -1405
15590 -1405 -2956 -4762 -9061 -14511 -8527 -3261 -7212 -10954 -11210 -12150 -23126 -25623 -21951 -14122 -13395
15575 -13395 -5961 2234 3015 -3692 -4274 -1388 -7721 -11768 -15619 -18487 -13530 -16285 -18183 -14612 -19391
15560 -19391 -17617 -13548 -14289 -21779 -21712 -13290 -2849 -1280 5891 5178 4056 -3054 -10997 -11536 -5447
15545e447R368J325J461r079o573j371L138k829J260k35M092N420k861n461K720
15530e072P29K180m436J411r054j0898j230J0011J1356P54l95M86j1351p58R477
15515f790p606p043M91k474M088N359L500M608Q298J143q73j832k442M687n927
15500b813r307M04l675k904M250n89k125N201q339m859J703J3401l275L006O583
15485c338k877m213l837J889O563K1397N803J1237L30m866l745R953p066j0762
15471A6468l778j0631k258P438Q433P760o796j9515m103K039k059J342M630j0979
15457a2009m576M508K526L439P47m265j868J2461J40n737j016l750l72P121j2740
15442a5391J45P804N952L636J604l504j0047k033r10m414M820K616o73K394J176
$$ plain form
15545 -5447 3921 5246 6707 -2372 -8945 -10316 -7178 -10007 -8747 -8982 -4890 530 -2331 -7792 -5072
15530 -5072 -4343 -2163 -6599 -5188 -14242 -25140 -26370 -16359 -5003 -4249 -4644 -4158 -15509 -16267 -6790
15515 -6790 -14396 -21439 -20948 -23422 -19334 -13975 -10475 -5867 2431 3574 2701 869 -1573 3114 -2813
15500 -2813 -12120 -11716 -15391 -18295 -14045 -14634 -16759 -11558 -19897 -24756 -23053 -9652 -12927 -9921 -3338
15485 -3338 -6215 -10428 -14265 -12376 -5813 15584 21387 32624 32954 28088 24343 34296 27230 16468
15471 16468 12690 2059 -199 7239 15672 23432 16636 -2879 -6982 -4943 -7002 -5660 -1030 -12009
15457 -12009 -16585 -12077 -9551 -6112 -5365 -9630 -11498 963 1103 -4634 -5650 -9400 -9772 -2651 -15391
15442 -15391 -15246 -7442 -1490 2146 3750 246 -9801 -11834 -12744 -17158 -12338 -9722 -10395 -8001 -6825
15427f825M190l953r234Q943J748m226J358N300l238o729j923L172J534M498J97
15412e188n468n393R91j921O27N551j711j670M022l008Q735j543n181q843K066
15397a7934J754M347l653N094o180M54P278m57P264L856k766k941o171j78o539
15382a6772m928j952N251n136O42l622J208M695R018l254j498N837j446o198R702
15367h453k43o2p61n606M756M730n161o666m468j2423m782j607J323N076J5630
15352a8717N279o83N15M014N497n271p674R557n418k026l580n899M091j1740l417
15337c5472L191J1398J4523J81q91J034K770j555K704n979j4861K410J4307M982
15323a258K949N214p008o020K021q956l200O115J668q74q109L352J01l076M1P605
$$ plain form
15427 -6825 -2635 -6588 -15822 -6879 -5131 -9357 -7999 -2699 -5937 -12666 -14589 -11417 -9883 -5385 -5188
15412 -5188 -10656 -16049 -15058 -16979 -16352 -10801 -12512 -14182 -10160 -13168 -4433 -5976 -11157 -20000 -17934
15397 -17934 -16180 -11833 -15486 -10392 -16572 -16118 -8840 -9297 -2033 1823 -943 -3884 -10055 -10233 -16772
15382 -16772 -21700 -23652 -18401 -23537 -22895 -26517 -25309 -20614 -11596 -14850 -16348 -10511 -11957 -18155 -8453
15367 -8453 -8696 -8758 -9519 -15125 -10369 -5639 -10800 -17466 -21934 -34357 -39139 -40746 -39423 -34347 -18717
15352 -18717 -13438 -14121 -13606 -9592 -4095 -9366 -17040 -7483 -12901 -14927 -18507 -24406 -20315 -32055 -35472
15337 -35472 -32281 -20883 -6360 -6179 -7070 -6036 -3266 -4821 -2117 -8096 -22957 -20547 -6240 -1258
15323 -1258 1691 6905 -103 -6123 -4102 -13058 -16258 -10143 -8475 -9349 -17458 -14106 -14005 -17081 -17040 -9435
15307i435P46q087J731O470M815M464j1697n711l401o84Q021P821J653R343m295
15292A754m944n880o525l120l028j915l227m911J313J1665R058r59K139P986p813
15277h407l142J2744P871J272j192j469p563r263q165o518M782M916M998J858
15263g278o311p296L325k89O694J2626o335j0290n849N32N756P05O119j850P46
15248h995L1N855j83j1154O880O393m195m454m40Q34j1651n402K05l677n588m621
15232d0162M667j068O089j295J031M798l458n908n41j3048Q8J0198Q379Q325Q792
15217a3113K37j0738L056L353k911p369R230L408n339L428L458l658j490K161
15203a6287j664j941p41P025J3581j998p284n495J216M372m701O170L293l347
$$ plain form
15307 -9435 -8689 -16776 -15045 -8575 -3760 704 -10993 -16704 -20105 -20789 -12768 -4947 -3294 6049 1754
15292 1754 -3190 -9070 -15595 -18715 -21743 -23658 -26885 -31796 -30483 -18818 -9760 -10719 -8580 -594 -8407
15277 -8407 -11549 1195 9066 10338 9146 7677 114 -9149 -17314 -23832 -19050 -14134 -9136 -7278
15263 -7278 -13589 -20885 -17560 -17849 -11155 1471 -4864 -15154 -21003 -20471 -14715 -14010 -7891 -9741 -8995
15248 -8995 -8964 -3109 -3292 -14446 -7566 -1173 -5368 -9822 -10262 -9428 -21079 -26481 -26276 -29953 -35541 -40162
15232 -40162 -35495 -36563 -30474 -31769 -30738 -25940 -29398 -35306 -35847 -48895 -48807 -38609 -30230 -21905 -13113
15217 -13113 -12876 -23614 -20558 -17205 -20116 -27485 -18255 -14847 -20186 -16758 -13300 -16958 -18448 -16287
15203 -16287 -17951 -19892 -20633 -13608 -27 -2025 -9309 -14804 -13588 -9216 -13917 -7747 -4454 -7801
15189g801m388n59Q733n952j3303n079N364J750K201L609J567m954K237J5746
15175h29O847K537M69q667L771M000k556j0442n267J518j519l438Q357n39j931
15160g689L501M028n530M05L268J0954P661M448L270p471j3762j1340n090K139
15146a1208J3457J580j0100n39r729o473j728K065j577J885P106L347j308j1279
15132b4501M96N552p188N33J5265Q356P133l119o383p130p248j026L004M664Q374
15117c218M898O696r277o784j791m50L367M55j565m663K004K149j819l965j720
15102a5683o64p730m414L143J1065P439l756J0126M372J916j0118j2855O585O317
15088d257K630R403j083j7980o429m622l887j821N999Q150R522q66O7k617l720
$$ plain form
15189 -7801 -12189 -12748 -4015 -9967 -23270 -28349 -22985 -21235 -19034 -15425 -13858 -18812 -16575 -829
15175 -829 6018 8555 9024 357 4128 8128 5572 -4870 -10137 -8619 -10138 -13576 -5219 -5758 -7689
15160 -7689 -4188 -160 -5690 -5285 -2017 8937 16598 21046 24316 16845 3083 -8257 -13347 -11208
15146 -11208 2249 3829 -6271 -6810 -16539 -23012 -24740 -22675 -24252 -22367 -15261 -11914 -13222 -24501
15132 -24501 -24005 -18453 -25641 -25108 -9843 -1487 5646 2527 -3856 -10986 -18234 -19260 -16256 -11592 -3218
15117 -3218 1680 8376 -901 -7685 -9476 -9926 -6559 -6104 -7669 -12332 -10328 -8179 -9998 -13963 -15683
15102 -15683 -16347 -24077 -28491 -25348 -14283 -6844 -10600 -474 3898 5814 -4304 -17159 -10574 -4257
15088 -4257 -1627 7776 6693 -11287 -17716 -22338 -26225 -28046 -22047 -13897 -4375 -5241 -5174 -7791 -11511
15073a1511p439o784K490Q792o281m800J6771J919q412j899J2008Q72n531N268
15059d537k468l697m776M399M664j0364k143R763o214L194J2627P14j588r42n484
15044f852o432n39l227J66L767O577q296n189J1623M244J988m138k614Q33L378
15029d711O61n771l172j144N030m779m362K485p76j601M723J399M70J653L151
15014f744j3262o519M391k959k110J0391Q43j188K034Q476J1047l42l224L328
15000D162l654o971R415K657K719Q502J1215m834R04M694k986o311n952j352N203
14985A7411j6113j2475q75l242Q146m320k084M879l616P855K572l119o69m265
14971i915n033L81M436L720m891o996R26l154m690J162J2695Q373J338l582j2628
$$ plain form
15073 -11511 -18950 -25734 -23244 -14452 -20733 -25533 -8762 -6843 -15255 -17154 -5146 -4274 -9805 -4537
15059 -4537 -7005 -10702 -15478 -11079 -6415 -16779 -18922 -9159 -15373 -12179 448 1162 -426 -1368 -6852
15044 -6852 -13284 -13823 -17050 -16884 -13117 -6540 -14836 -20025 -8402 -4158 -2170 -6308 -8922 -8089 -4711
15029 -4711 -4050 -9821 -12993 -14137 -9107 -13886 -18248 -15763 -16539 -18140 -13417 -12018 -11548 -9895 -6744
15014 -6744 -20006 -26525 -22134 -25093 -27203 -16812 -15969 -17157 -15123 -6647 4400 4058 834 4162
15000 4162 508 -6463 2952 5609 8328 16830 28045 23211 24115 28809 25823 19512 13560 12208 17411
14985 17411 1298 -11177 -12052 -15294 -7148 -11468 -13552 -8673 -12289 -4434 -1862 -4981 -5650 -9915
14971 -9915 -14948 -14567 -10131 -6411 -11302 -18298 -17372 -20526 -25216 -24054 -11359 -2986 -1648 -5230 -17858
14956a7858o457J133L133K96j13J1326J107n258R75L455r452o122R211L219p491
14941a8896m582K622K618M694O240n538l865M277l260O71J1143n06j932O138p452
14926g628L246o524n426M600j205K593o124O817k41j964j0957j1810k27L461K887
14911b8502K199J040J795n78R512k601m815M123L000Q125J899l825P93L021n653
14896a0467o748J398K903m773J408J4585P448m702o212j994M528k1j110p8J0667
14881F832p792l635n346m777r451l84R827Q606k507J08j372j5454m124P306m811
14866b6974k834m07N002N875J0221p06J699N72o110m047L866O378n609K2k611
14851a5663m457O267L923J2371M084l809l780n310j715k61L577k512j1339l354
$$ plain form
14956 -17858 -24315 -23182 -20049 -19753 -19866 -8540 -7433 -12691 -11716 -8261 -17713 -23835 -14624 -11405 -18896
14941 -18896 -23478 -20856 -18238 -13544 -7304 -12842 -16707 -12430 -15690 -15019 -3876 -4382 -6314 -176 -7628
14926 -7628 -4382 -10906 -16332 -11732 -12937 -10344 -16468 -9651 -9892 -11856 -22813 -34623 -34850 -31389 -28502
14911 -28502 -26303 -25263 -23468 -24046 -14534 -17135 -21950 -17827 -14827 -6702 -4803 -8628 -7835 -4814 -10467
14896 -10467 -17215 -15817 -12914 -17687 -16279 -1694 5754 1052 -5160 -7154 -2626 -2647 -3757 -3835 6832
14881 6832 -960 -4595 -9941 -14718 -24169 -24553 -14726 -6120 -8627 -8519 -9891 -25345 -29469 -22163 -26974
14866 -26974 -29808 -30215 -25213 -19338 -9117 -9823 -8124 -7552 -13662 -17709 -13843 -7465 -13074 -13052 -15663
14851 -15663 -20120 -13853 -9930 2441 6525 2716 -1064 -6374 -8089 -8350 -4773 -7285 -18624 -21978
14837b1978k733m203R235k612O297J560Q111M352Q305l325p273l794M435o781
14823a0404r417L580N342k621J1906m168j1762N780O49J698K98m587m972k9j647
14808b0354m900O778M568K469J0248j0296m344j867M473k997K533Q550N475K396
14794B732r467q606J56N651N615J489l906o039l989r289l879O2K840J0975j516
14779a7171n79m154N86l085j0432J611J2769M710K531K904N652O059n849n970
14765a0418q215J663j3661j2640o449J0050J3082R04p869N218J3284O162n971
14752a4860n375J040j501R024q9l328m887O579J964m831l892P084J47j520p662
14737b2107K96o704o704O707J4797N185L739M347k680m538p790j0456n944L573
$$ plain form
14837 -21978 -24711 -28914 -19679 -22291 -15994 -14434 -6323 -1971 6334 3009 -4264 -8058 -3623 -10404
14823 -10404 -19821 -16241 -10899 -13520 -1614 -5782 -17544 -11764 -11115 -9417 -9119 -13706 -18678 -18707 -20354
14808 -20354 -25254 -18476 -13908 -11439 -1191 -11487 -15831 -17698 -13225 -16222 -13689 -5139 336 2732
14794 2732 -6735 -15341 -15185 -9534 -3919 -2430 -6336 -12375 -16364 -25653 -29532 -29470 -26630 -15655 -17171
14779 -17171 -17750 -21904 -21318 -24403 -34835 -33224 -20455 -15745 -13214 -10310 -4658 1401 -4448 -10418
14765 -10418 -18633 -16970 -30631 -43271 -49720 -39670 -26588 -25684 -33553 -28335 -15051 -8889 -14860
14752 -14860 -20235 -19195 -20696 -11672 -11761 -15089 -19976 -13397 -11433 -16264 -20156 -13072 -12925 -14445 -22107
14737 -22107 -21811 -28515 -35219 -28512 -13715 -8530 -4791 -444 -3124 -7662 -15452 -25908 -31852 -28279
14723b8279K201M519O681J0120p311j5442j0751J0113Q498J2994K50p818l749
14710a7974P174O326P628k908P15r250o720j393n138p071K649O185m33P680l589
14695a6119p272M746j846l198q475o336M713N755J0989R535M660rm497m287O108
14680e533L106p004l912L231m95o606m347P672j796k499J0139n228q685J704Q751
14665a1502J2802K832l784l317M598K257k27L597R236J5614P940K321j311Q224
14651D9280N119l158j1348j6430j2535p840m291l360l95r162O174O838m497n307
14637a0912p342Q533M959N923O206n22n753K738o064q275l735o112K630L167N40
14622a4019L371O841N28k779L389J1197J562q572j4584o661j78J0115O864l962
$$ plain form
14723 -28279 -26078 -21559 -14878 -4758 -12069 -27511 -38262 -28149 -19651 -6657 -6407 -14225 -17974
14710 -17974 -10800 -4474 3154 246 961 -8289 -15009 -16402 -21540 -28611 -25962 -19777 -20210 -12530 -16119
14695 -16119 -23391 -18645 -20491 -23689 -32164 -38500 -33787 -28032 -17043 -7508 -2848 -2857 -7354 -11641 -5533
14680 -5533 -2427 -9431 -13343 -10112 -10607 -17213 -21560 -13888 -15684 -18183 -8044 -13272 -21957 -20253 -11502
14665 -11502 1300 4132 348 -2969 1629 3886 3659 7256 16492 32106 40046 42367 41056 49280
14651 49280 54399 51241 39893 23463 10928 3088 -1203 -4563 -4958 -14120 -7946 -1108 -5605 -10912
14637 -10912 -18254 -9721 -4762 1161 7367 6845 1092 3830 -2234 -10509 -14244 -20356 -17726 -14559 -14019
14622 -14019 -10648 -3807 -3279 -6058 -2669 8528 10090 1518 -13066 -19727 -19905 -9790 -2926 -6888
14608f888m657o992k27J2348o06r913K631Q191j167j0820j835O94l974O965O585
14593i665j1178q227L054O070J1035l321N038O598J0733k491j1645r470N244R319
14579A094J287r058n071l643K202K593K194o166m822k260k45L596M214O451q142
14564a5776Q0l833o063Q648n967k41n83j903o233N899J1312N267k655m618m383
14549b1049M834L591m679j7732M582Q551M315K692O790M707r424L970P003M003
14535B154q163l090j944p048J573J2847R443m36J6644K587j984j3018l570k912
14521C083m091k316k501K433l821K691J056n002n962l34k424k028M709N105K303
14506g099O123Q51j698J507o32K513k025p759p75m54l603K770L066J19n959j3213
$$ plain form
14608 -6888 -11545 -18537 -18764 -6416 -7022 -16935 -14304 -6113 -7280 -18100 -19935 -19241 -23215 -16250 -9665
14593 -9665 -20843 -29070 -26016 -19946 -8911 -12232 -7194 -596 10137 7646 -3999 -13469 -8225 1094
14579 1094 2381 -6677 -11748 -15391 -13189 -10596 -8402 -14568 -19390 -21650 -21895 -18299 -14085 -7634 -15776
14564 -15776 -15696 -19529 -25592 -16944 -22911 -23152 -23735 -25638 -31871 -25972 -14660 -9393 -12048 -16666 -21049
14549 -21049 -16215 -12624 -17303 -35035 -30453 -21902 -17587 -14895 -8105 -3398 -12822 -8852 -1849 2154
14535 2154 -6009 -9099 -11043 -18091 -16518 -3671 5772 5336 21980 24567 22583 9565 5995 3083
14521 3083 -1008 -3324 -5825 -3392 -7213 -4522 -3466 -8468 -14430 -14764 -17188 -19216 -14507 -9402 -7099
14506 -7099 -976 -125 -1823 -316 -948 1565 -460 -8219 -8994 -9448 -13051 -10281 -7215 -7096 -13055 -26268
14490b6268K215L439l05l278m498o759P629J0239M441L712o268l576L121J624
14476a4532k447j153J4408Q374Q674j0784r032m177k536O210l062j13J112q050
14462a7108j156n243p243j337J0982M374o394K692m875M085l185L792Q791Q317
14448c508K580n553j3156n584L731L142J3631P507q330j1036M505l867OL167k799
14433a5564K922J0752P935j0182J328K909M289J138j0669O230l95N346n300N660
14419F399L780j0343n687j521r808l394O265L646R76K59m775l733P562m121r393
14404b3888l137j0397o449O851J4592R195P57L933n055j3069n198N552R297J41
14390a6875o092K191j50k652l627L128L894M708O763R47n28O139j867o55q493
$$ plain form
14490 -26268 -24053 -20614 -20919 -24197 -28695 -35454 -27825 -17586 -13145 -9433 -15701 -19277 -16156 -14532
14476 -14532 -16979 -18132 -3724 4650 13324 2540 -6492 -10669 -13205 -6995 -10057 -10170 -9058 -17108
14462 -17108 -18264 -23507 -30750 -32087 -21105 -16731 -23125 -20433 -25308 -21223 -24408 -20616 -11825 -3508
14448 -3508 -928 -6481 -19637 -25221 -21490 -18348 -4717 2790 -5540 -16576 -12071 -15938 -15932 -12765 -15564
14433 -15564 -12642 -1890 6045 -4137 -2809 100 4389 5527 -5142 1088 693 6039 739 6399
14419 6399 10179 -164 -5851 -7372 -17180 -20574 -14309 -10663 -9687 -9428 -14203 -17936 -10374 -14495 -23888
14404 -23888 -27025 -37422 -43871 -37020 -22428 -13233 -12476 -8543 -13598 -26667 -31865 -26313 -17016 -16875
14390 -16875 -22967 -20776 -20926 -23578 -27205 -24077 -20183 -15475 -8712 -7765 -8293 -2154 -4021 -4676 -13169
14375a3169k238j914P18o296p61J1647O001N070r10k835K222K647l531p974m711
14360a6034M716n450r89M02o267J3442l509k819j651n274p709K828R87l496j695
14345c2518J1771N451M769k13l549l534p783n188K937P012k223m280Q56P259j538
14330b0771N105L985L163L026k740m891j768n500J072R419j933p023j1540j982
14316c2378J1614J790K962N876J658J257p539j707p431o737j266J0718l832k891
14302b7906Q032J4175J841j2059l351M319M212R312j987p027k716m581N861k257
14288a4132o337l573L38k284j157K404N322L192l10k617l584N903L650o362l490
14273b3037N851K743P700N248k881K046p375n428J505o01K661p176m304L258m339
$$ plain form
14375 -13169 -15407 -17321 -16603 -22899 -23660 -12013 -6012 -942 -1852 -4687 -2465 182 -3349 -11323 -16034
14360 -16034 -11318 -16768 -17757 -17355 -23622 -10180 -13689 -16508 -18159 -23433 -31142 -28314 -27327 -30823 -32518
14345 -32518 -20747 -15296 -10527 -10740 -14289 -17823 -25606 -30794 -27857 -20845 -23068 -27348 -26492 -19233 -20771
14330 -20771 -15666 -11681 -8518 -5492 -8232 -13123 -14891 -20391 -19319 -9900 -11833 -18856 -30396 -32378
14316 -32378 -20764 -18974 -16012 -10136 -8478 -7221 -14760 -16467 -23898 -30635 -31901 -21183 -25015 -27906
14302 -27906 -19874 -5699 -3858 -15917 -19268 -14949 -10737 -1425 -3412 -10439 -13155 -17736 -11875 -14132
14288 -14132 -20469 -24042 -23704 -25988 -27145 -24741 -19419 -16227 -16537 -19154 -22738 -16835 -13185 -19547 -23037
14273 -23037 -17186 -14443 -6743 -1495 -4376 -2330 -9705 -15133 -13628 -14229 -11568 -18744 -23048 -19790 -24129
14258b4129L877N008R063o50O470M257j2856k795M974N198N250j3666r48L71k174
14243a2750Q743Q552j054L379O79j1089n803j1161k363J1126o4q077J767J2105
14229f010Q358N320n43j3660n434K561j0991k972M251J673k375m88K957j478o46
14214a9477J1839J404q469l346q907o708N238P137P401p747q816P426P442n01
14200a6084Q695k794K554L634m716m930o765J638M558j0382k207R636J0393l201
14186i971P177l689p302K421j115l384L404l388j628M402p824j0554P001p28j1141
14171c6319Q06P301R497L8m821M624P743L363r951O68p902j0535q362Q297K885
14156c2668M98N020q917m824J0887J6661Q47k769l098P889L657j1393k532O767
$$ plain form
14258 -24129 -20252 -15244 -6181 -6831 -361 3896 -8960 -11755 -6781 -1583 3667 -9999 -10947 -10576 -12750
14243 -12750 -4007 4545 3491 6870 7549 -3540 -9343 -20504 -22867 -11741 -11805 -19882 -18115 -6010
14229 -6010 2348 7668 7125 -6535 -11969 -9408 -20399 -23371 -19120 -17447 -19822 -20310 -17353 -18831 -19477
14214 -19477 -7638 -6234 -14703 -18049 -26956 -33664 -28426 -21289 -13888 -21635 -30451 -23025 -15583 -16084
14200 -16084 -7389 -10183 -7629 -3995 -8711 -13641 -20406 -18768 -14210 -24592 -26799 -17163 -6770 -9971
14186 -9971 -2794 -6483 -13785 -11364 -12479 -15863 -12459 -15847 -17475 -13073 -20897 -31451 -24450 -25178 -36319
14171 -36319 -35513 -28212 -18715 -18677 -23498 -18874 -11131 -7768 -17719 -17051 -24953 -35488 -43850 -35553 -32668
14156 -32668 -32170 -27150 -36067 -40891 -30004 -13343 -12496 -15265 -18363 -10474 -6817 -18210 -20742 -13975
14142a3975L540o84k842Q13p353Q011J2282m642j3744j6240L198R206m109p821
14128c4360j658j056L729p258N437K431M364O011j715K22l29O28K018r124J363
14113b9297J5980o5k622l227N356J363Q185K897N68p257k904p803p372J265J67
14098b4766J093j252Q604O305J2429j214l944J7429J1295N471j527k207J390j7558
14084A1548l313Q033l535q551n240m507r19n553L079l09k707J486j4451o840m29
14069c2208j0749N808J6280N022q72j1956j930N21K521K577r67J1782P556l550
14055a0165o104J331o50q76O182P005j127j3189m271J141J624J0378l878K07n71
14040a2963J877m50m707o11l109P15K604J1399j925j486n126M160L865J1416p844
$$ plain form
14142 -13975 -10435 -11119 -13961 -13148 -20501 -12490 -208 -4850 -18594 -34834 -31636 -22430 -26539 -34360
14128 -34360 -36018 -37074 -33345 -40603 -35166 -32735 -28371 -22360 -24075 -23853 -24182 -23554 -21536 -30660 -29297
14113 -29297 -13317 -13382 -16004 -19231 -13875 -12512 -4327 -1430 -862 -8119 -11023 -18826 -26198 -24933 -24766
14098 -24766 -23673 -24925 -16321 -10016 2413 1199 -2745 14684 25979 31450 29923 27716 29106 11548
14084 11548 8235 16268 12733 4182 -1058 -5565 -6484 -12037 -8958 -9267 -11974 -10488 -24939 -31779 -32208
14069 -32208 -42957 -37149 -20869 -15847 -16719 -28675 -30605 -30084 -27563 -24986 -25953 -14171 -6615 -10165
14055 -10165 -16269 -14938 -15588 -16464 -10282 -3277 -4404 -17593 -21864 -20723 -19099 -8721 -12599 -12392 -12963
14040 -12963 -11086 -11536 -16243 -16854 -19963 -19248 -16644 -5245 -7170 -8656 -13782 -9622 -5757 5659 -2185
14025b185j4877j088L670j568j125m729L898J397o643M639M38O695o120q427l235
14010b9260Q003M491M148O460K347L231o970L108J696n387m580M467O246r86n975
13995h961L550J032L27m967M367m593j2465J5389J2449m574j0900p53N88P716
13981a795j298j885j79N275m729L41k08J651n072p338J431j327O91l624n300l519
13965b6885M225O526N611j1962n777o526O169R848j36M233L210o145j071O630
13951a2050Q84L690J755N984j356n649K272k911r19N304o857P199J0408n866j0957
13936i069R2P171P782N950j745j1864n935M383k821k808K150Q280l870k307K06
13921d405j031R356J960m641R50K380J739m60j886J1368J1584k760K059j764p976
$$ plain form
14025 -2185 -17062 -18150 -14480 -16048 -17173 -21902 -18004 -16607 -23250 -18611 -18173 -11478 -17598 -26025 -29260
14010 -29260 -21257 -16766 -12618 -6158 -3811 -580 -7550 -4442 -2746 -8133 -12713 -8246 -2000 -2986 -8961
13995 -8961 -5411 -4379 -4052 -9019 -4652 -9245 -21710 -6321 6128 1554 -9346 -10099 -9511 -1795
13981 -1795 -3093 -4978 -5157 118 -4611 -4270 -4478 -2827 -7899 -15237 -13806 -15133 -14442 -18066 -23366 -26885
13965 -26885 -22660 -16134 -10523 -22485 -28262 -34788 -28619 -18771 -18907 -14674 -11464 -17609 -18680 -12050
13951 -12050 -11166 -7476 -5721 263 -1093 -6742 -4470 -7381 -8300 -2996 -9853 -2654 7754 1888 -9069
13936 -9069 -8977 -1806 5976 11926 10181 -1683 -7618 -3235 -6056 -8864 -6714 1566 -2304 -4611 -4405
13921 -4405 -5436 3920 5880 1239 2189 4569 6308 5848 3962 15330 26914 24154 26213 24449 16473
13906A6473j526m30p041p426J27N216k68j2779n350O984J1435N592j036m256L892
13891I607q166o409r532p40p399J1187J1633p8r304L099q57o866M462k480q80
13876a2723L170N800j37k256P1l074j0307N401J2801l012r560q647K014O214K816
13861a1429N113M660p799m093J1032m883m701r795j0075Q06N653M686N363L237
13847a2225M995R913Q326O652M389N180m916K027o973o713l565m611P286l278
13833F487j4877j0285J936J156O406Q69j308M161n86r649M396O673q325J949r19
13818a1916j637l546r54J793J125P489o32J765M201k143L255P72N23K362k0K237
13802D674L069j850q88K658P622M403q995q639J743P821m071J972M798L881J723
$$ plain form
13906 16473 14947 14517 7476 50 177 5393 5125 -7654 -13004 -6020 5415 11007 9971 5715 9607
13891 9607 1441 -4968 -14500 -15240 -22639 -11452 181 103 -9201 -6102 -6959 -13825 -9363 -11843 -12723
13876 -12723 -9553 -3753 -3890 -6146 -6075 -9149 -19456 -14055 -1254 -4266 -13826 -22473 -20459 -14245 -11429
13861 -11429 -6316 -1656 -9455 -13548 -2516 -7399 -12100 -21895 -31970 -31164 -25511 -20825 -15462 -12225
13847 -12225 -7230 2683 11009 17661 22050 27230 22314 24341 17368 10655 7090 2479 9765 6487
13833 6487 -8390 -18675 -16739 -15583 -9177 -8308 -9616 -5455 -6041 -15690 -11294 -4621 -12946 -10997 -11916
13818 -11916 -13553 -17099 -18053 -16260 -15135 -7646 -8278 -6513 -2312 -4455 -1200 -428 95 2457 2437 4674
13802 4674 7743 5893 5005 7663 15285 19688 10693 2054 3797 11618 7547 9519 14317 18198 19921
13787A9921n882k332M75O435M42j222J481m382j435m634j893K675r96Q002O563
13772B3218m535J153o695k528n891m634M265M921J608j848m998M909K368n623
13758E690o590P069j563o768M969J696o578M14J544M527k023Q557P453P11j1314
13743G794k927o431m169J1167O618L185J679J500k413p614l147l934n44J1461
13729A2225Q257J2280o65j5808J905P281j725j350K315p86r785j37p825m711K710
13714D181J1430l984j2632M988O22o59J2495r98l2j260j848l273r343j863M828
13699B652Q932p962m49J2369m576o737j239m031p454N040j693j816J311n728j1216
13684b2597J242J3475Q247m261m480N242n63p163p262L107J3414R441Q8r047q725
$$ plain form
13787 19921 14039 11707 12182 18617 19059 17837 19318 14936 13501 8867 6974 9649 8653 16655 23218
13772 23218 18683 19836 13141 10613 4722 88 4353 9274 10882 9034 4036 8945 11313 5690
13758 5690 -900 6169 4606 -2162 2807 4503 -2075 -1661 -117 4410 2387 10944 18397 19108 7794
13743 7794 4867 -1564 -5733 5434 12052 15237 16916 18416 16003 8389 5242 1308 764 12225
13729 12225 20482 32762 32097 16289 18194 25475 23750 22400 24715 23929 14144 14007 6182 1471 4181
13714 4181 15611 11627 -1005 3983 4605 3946 16441 15443 15411 14151 12303 9030 -313 -2176 2652
13699 2652 11584 3622 3173 15542 10966 4229 2990 -1041 -8495 -3455 -5148 -6964 -5653 -11381 -22597
13684 -22597 -21355 -7880 367 -3894 -8374 -3132 -3695 -10858 -18120 -15013 -1599 7842 7930 -1117 -9842
13669i842m738o621L31J173L403L733j982P115J0382j0347p581j671Q912N858
13655a875K010j417j017j441R21l121K505p74L399K321q622j1079k57j499L895
13640a6051l09N381M154J927m097j84R103L930j573N522n462j0184o596L255K071
13625i113J1209J1782j0786j5119j04k519l867kJ53Q013Q98m48j207k98M968R681
13609C241K147n794o959L072J418N66L330L078M611j647N965K100l990p413n299
13594a574k746o08j096J51N779k419j820j165k215p037n081J073O442l57K920
13579i753r399p208K807l048l200J4193J0270O515n451o763l473q713K69J0514
13565a2440Q926j895o667J485P760J7126O925l416n936r144l295R619l394m984
$$ plain form
13669 -9842 -14580 -21201 -20870 -19697 -16294 -12561 -14543 -7428 2954 -7393 -14974 -16645 -7733 -1875
13655 -1875 135 -1282 -2299 -3740 -2819 -5940 -3435 -4209 -810 1511 -7111 -18190 -18447 -19946 -16051
13640 -16051 -16360 -10979 -6825 -4898 -8995 -9179 -76 3854 2281 7803 2341 -7843 -14439 -11184 -9113
13625 -9113 2096 13878 3092 -12027 -12131 -14650 -18517 -18519 -18366 -10353 -9455 -9903 -11110 -11408 -6440 3241
13609 3241 5388 -406 -7365 -4293 -2875 -2309 1021 4099 8710 7063 13028 15128 11138 3725 -1574
13594 -1574 -4320 -4928 -6024 -5873 -94 -2513 -4333 -5498 -7713 -14750 -19831 -18758 -12316 -12673 -9753
13579 -9753 -19152 -26360 -23553 -26601 -29801 -15608 -5338 1177 -4274 -11037 -14510 -23223 -22954 -12440
13565 -12440 -3514 -5409 -12076 -10591 -2831 14295 21220 17804 11868 2724 -571 9048 5654 670
13551F70J4466n776o16l704n290N547m796j1777M699J2616j546J309j637j0264
13537f099k937J0666O316j0058l387N115n391n61P309J928m294m540l836r59J0468
13522b60k157K04m028K265J2248J1460n213j0005K343N630r539p38L572j944Q305
13507A2143O699N536l194q479k010k131P19J244J684k572O007l647n833O216M331
13492A6713N93J3111K415j2836k040k434P26K649k395J665K75J508M499J422N632
13477C1503j3458k034K38r63l708l858J1436N842O30o362r650K139L539j158l890
13462A0246j4504p88M048k240P420J923K848N012k328Q3n884N216n425q656N56
13447b473P509J3522M855K85p429l223P545p177j2410J047l8r1K794J0086q078
$$ plain form
13551 670 15136 9360 8744 5040 -250 5297 501 -11276 -6577 6039 4493 5802 4165 -6099
13537 -6099 -9036 1630 7946 -2112 -5499 -384 -5775 -6336 973 2901 -1393 -5933 -9769 -10728 -260
13522 -260 -2417 -2213 -6241 -3976 8272 19732 14519 4514 6857 12487 2948 2210 5782 3838 12143
13507 12143 18842 24378 21184 12705 10695 8564 9283 10527 12211 9639 15646 11999 6166 12382 16713
13492 16713 17306 30417 32832 19996 17956 15522 16248 18897 16502 18167 18442 19950 24449 25871 31503
13477 31503 18045 16011 16249 15286 11578 7720 19156 24998 25628 19266 9616 11755 15294 14136 10246
13462 10246 -4258 -5046 -998 -3238 4182 6105 8953 13965 11637 11720 5836 11052 5627 -3029 -2473
13447 -2473 5036 18558 23413 23698 16269 13046 20591 13414 1004 2051 2013 1922 4716 14802 6724
13432F724j377K720K957J1221L866N744J475l920q475m888o992o629P39m257l249
13417d341L230P22m936N36L951p048j283m336Q247Q531j241j5848q291j103K737
13402b0473J0730K74K358L336j595n155l307L448J3482P771J450l072K683l225
13388H705l681M96P780N828q630L507J421J0147j311m937K430M791n485q773M309
13373A6597p791p923l252l070K63K726J602m028r2O675J261m090m084J4430q30
13358H394P043O130J253O657K580L323L843j060j359p07R273N96j2760j5317J551
13343A9440m192L250m240k170O462P477O41P413M21N161L062K117L274p263j5550
13328B5303R86L023M73r293l4L086l616q423K179o791p974M60J0524N55j3321
$$ plain form
13432 6724 5347 8067 11024 22245 26111 31855 33330 29410 20935 16047 9055 2426 3165 -1092 -4341
13417 -4341 -1111 -389 -5325 -4789 -838 -7886 -9169 -13505 -5258 3273 2032 -13816 -22107 -23210 -20473
13402 -20473 -9743 -9469 -7111 -3775 -5370 -10525 -13832 -10384 3098 10869 12319 9247 11930 8705
13388 8705 5024 5520 13300 19128 10498 14005 15426 25573 24262 19325 21755 26546 21061 12288 16597
13373 16597 8806 883 -2369 -5439 -5176 -2450 -848 -4876 -4968 1707 2968 -1122 -5206 9224 8394
13358 8394 15437 21567 22820 29477 32057 35380 39223 38163 36804 36097 45370 45966 33206 17889 19440
13343 19440 15248 18498 14258 12088 18550 26027 26668 34081 34502 39663 42725 44842 48116 40853 25303
13328 25303 26289 29312 29785 20492 20458 23544 19928 11505 13684 6893 -1081 -621 9903 10458 -2863
13313b863P60K080j11K301L740p318j2620l103J2799J71M7Q003N61j086M197n735
13297A823j2682K053j169K158P558J1507K74R723J2016l848l223L736j622p469
13283B0835K266l843M304K326p018J141J272j0672J398K503Q088l007J6577M191
13269D0361p418l397M672J5175Q342k564J304Q120L045j991n863J205j959j1261
13255D7771p506R715Q857l977n091O765o366j3066N054J5717P105p651n348j110
13241E0869O335j611k012j4126j0112M958k266J726P641m710k6355j1371J873
13228H39N438J0855L898J660O378O097l355N289N182j865j3029J794K164L243
13214C4588o343M630J3269J2834N490j59P73J2619N6961J07647Q7197K4200N512
$$ plain form
13313 -2863 -2103 -23 -134 2167 5907 -1411 -14031 -17134 -4335 -4164 -4117 3886 4447 3361 7558 1823
13297 1823 -10859 -8806 -9975 -7817 -259 11248 11522 21245 33261 29413 26190 29926 28304 20835
13283 20835 23101 19258 23562 25888 18870 20011 21283 10611 12009 14512 22600 19593 36170 40361
13269 40361 32943 29546 34218 49393 57735 55171 56475 64595 67640 65649 59786 60991 59032 47771
13255 47771 40265 49980 58837 54860 49769 56534 50168 37102 42156 57873 64978 57327 51979 50869
13241 50869 57204 55593 53581 39455 29343 34301 32035 33761 41402 36692 10337 -1034 839
13228 839 6277 17132 21030 22690 29068 35165 31810 37099 42281 40416 27387 29181 31345 34588
13214 34588 28245 32875 46144 58978 64468 64309 65082 77701 134662 242309 329506 353706 359218
13201C59218J6534P722l9762r1499o9764n0180k2702j4340r753p493j1782j8540
13189D7659j7980k552n590N774n06J658P044o34l937p94j0721K087N116J077R09
13174B8610m661q312N023m272k195J681n52L740q65n460m347O065M929p824j1332
13159B28j457P593q38k124l983L745P877l392o229n670j2162j906K349j468R254
13144h183O655p630O201K447l252k057j740J8530N949q588o504j968J876n450
13130c714O513L004j1800N542Q522O643K797j0329k090P036M846q654j6241j0107
13116a8032P184P961j2620r755J1230Q141o447q588J2136L542O175q29l944j165
13102e011J039J490O089p332p454l765K98o579L657N343R918L255M531J3184K38
$$ plain form
13201 359218 375752 383474 343712 252213 182449 132269 109567 95227 85474 77981 66199 47659
13189 47659 29679 27127 21537 27311 26805 28463 35507 34873 30936 30142 19421 21508 26624 27701 28610
13174 28610 23949 15637 20660 16388 14193 15874 15322 19062 18197 12737 8390 14455 19384 11560 228
13159 228 -1229 6364 5526 3402 -581 3164 11041 7649 1420 -4250 -16412 -18318 -15969 -17437 -8183
13144 -8183 -1528 -9158 -2957 -510 -3762 -5819 -7559 10971 16920 8332 1828 -140 1736 -3714
13130 -3714 2799 5803 -5997 -455 8067 14710 17507 7178 5088 12124 16970 8316 -7925 -18032
13116 -18032 -10848 -2887 -15507 -25262 -14032 -5891 -12338 -20926 -8790 -5248 927 98 -3846 -5011
13102 -5011 -3972 -2482 3607 -3725 -11179 -14944 -14646 -21225 -17568 -12225 -2307 948 5479 18663 18901
13087A8901l793n788o160j934L45j2800q183K059l016QP838J461M751O828O593
13072G110N31N92m109p001l986j925p115R48Q261J2462P681J0751j976p826m77
13057A3921p548q46n377o574N356p604n50O200J3399k835k333q490K366k820q043
13042a1778L773Q065l158M382J0986K494j067Q40p254k184n789N524J743p209
13028f32o35j046k105N800p136m061J1616J2682l111L429J953n893n653M740n98
13013I350K210M039O859r208q034N544l199J45k149p51p260k660O118L751n49
12998D206m348P44m817O739J0801M382k613L653Q045l182L022L979L24l783p356
12983A9796j1938P642O752L977P24j564L879K656j133j4073n559N552K461L390
$$ plain form
13087 18901 15108 9320 3160 1226 1571 -11229 -19412 -17353 -20369 -20361 -12523 -11062 -6311 517 7110
13072 7110 7641 8233 4124 -2877 -6863 -8788 -15903 -14955 -6694 5768 13449 24200 22224 14398 13921
13057 13921 6373 5527 150 -6424 -1068 -8672 -9222 -3022 10377 7542 5209 -3281 -915 -3735 -11778
13042 -11778 -8005 60 -3098 1284 12270 14764 13697 14537 7283 5099 -690 4834 6577 -632
13028 -632 -1267 -2313 -4418 1382 -5754 -9815 1801 14483 11372 14801 16754 10861 5208 9948 9350
13013 9350 11560 15599 22458 13250 5216 10760 7561 7706 5557 4806 -2454 -5114 1004 4755 4206
12998 4206 -142 602 -4215 2524 13325 17707 15094 18747 26792 23610 26632 30611 30935 27152 19796
12983 19796 7858 15500 22252 26229 26953 25389 29268 31924 30791 16718 11159 16711 19172 22562
12969B2562k791J826M193P673r123q329n612L470L695P891l721j0058n686O514
12955A2504Q538L669O474m317Q502J2329N650K507p016j516N141K437J3037R564
12941G7503r38q079l832J6350R577J3120J3320J8248J4277K2983M7636M6796O1290
12928C28251Q0547J08051J53246J55716J50957J44564J09537P9070K3276j3437
12918A319778n3279r3892j16312j33590j30177j08908r7743r5392p3805n7741
12908C58939m4034k7701k4046j6663k6512l3324j9548j6226j1887j2599j5585
12897A10814k524k931k3524p706K571P096m053q496j2378q16L246J395q487J390
12883E5597l061r064j2975j309Q382k394J211M335p13l012M343O378p559j1004
$$ plain form
12969 22562 19771 21597 25790 33463 24340 16011 10399 13869 17564 25455 21734 11676 5990 12504
12955 12504 21042 24711 31185 26868 35370 47699 53349 55856 48840 47324 52465 54902 67939 77503
12941 77503 76565 68486 64654 81004 90581 103701 117021 135269 149546 172529 220165 266961 328251
12928 328251 408798 516849 670095 825811 976768 1121332 1230869 1309939 1333215 1319778
12918 1319778 1266499 1172607 1056295 922705 792528 683620 585877 490485 416680 358939
12908 358939 314905 287204 263158 246495 219983 186659 167111 150885 138998 126399 110814
12897 110814 108290 105359 81835 74129 76700 83796 79743 71247 58869 58053 61299 62694 54207 55597
12883 55597 52536 43472 30497 29188 37570 35176 36387 40722 40009 36997 41340 47718 40159 29155
12869B9155q593j416J2611j152O673r171r461J850j821P359R932O480Q251Q880
12855E9577j964p989O334L869J050j7150j4394M260P172P390J381O409R426m158
12841F1213p833o555o197n405l860q668J248J754l08J2183K987m020L00j1308
12827B5531p868j929R623J1225p797o533K269M126M120K734k074p496R534J0728
12813D6193K072J612K014l144J288O482m317J554n294L788K91J129j602o566o88
12798D4812J135m814p98o816p843M764Q609O959L896N293N406M820N449m580j137
12783F5155J3118M459K204l052N040P891R401k360Q030L007J872m606M67K526
12769A13152N161Q269o231j1994p462P022K220M565J1730l548j2781l382jJ0484
$$ plain form
12869 29155 20562 19146 31757 30605 37278 28107 18646 20496 18675 26034 35966 42446 50697 59577
12855 59577 57613 49624 55958 59827 60877 43727 29333 33593 40765 48155 49536 55945 65371 61213
12841 61213 53380 46825 40628 35223 31363 22695 23943 25697 25389 37572 40559 36539 36839 25531
12827 25531 17663 15734 25357 36582 28785 22252 24521 28647 32767 35501 33427 25931 35465 46193
12813 46193 48265 49877 51891 48747 50035 56517 52200 53754 48460 52248 52539 53668 52066 45500 44812
12798 44812 45947 41133 40335 33519 25676 30440 39049 46008 49904 55197 60603 65423 70872 66292 65155
12783 65155 78273 82732 84936 81884 86924 94815 104216 101856 109886 112893 114765 110159 110626 113152
12769 113152 118313 126582 120351 108357 100895 107917 110137 114702 126432 122884 110103 106721 106720 117204
12755A17204m076O425O696l458P278q818p031K025m743k200J300O889Q555J013
12741A27059N513L397o622q501r982M605J3433o835K100K146J038j551m471j1442
12727A09887L142r217j0101p952o129m993P001R647m724n170k620K265j096J3673
12713I3613N501j1891R03Q317O148l356J544N94O459J0767J114q962j436m557
12699A04758L175O407M55N72j0523q653o375K228N506J6721j670q489k8M064M093
12684A12241m950M284L618m579j1720J324O726O126J1179Q342J1352M583J498
12671A50024L674J0738K0131K0676J0857J8372J4338N555n094j5671k4690j8126
12659A90784l9452n4657n9999n0029m3062l5762k3956k2802k1095L497J5903J0821
$$ plain form
12755 117204 113128 119553 126249 122791 130069 121251 114220 116245 111502 109302 110602 117491 126046 127059
12741 127059 132572 135969 129347 120846 110864 115469 128902 122067 124167 126313 127351 125800 121329 109887
12727 109887 113029 103812 93711 85759 79630 74637 81638 91285 86561 81391 78771 81036 79940 93613
12713 93613 99114 87223 88126 96443 102591 99235 100779 101373 107832 118599 119713 110751 109315 104758
12699 104758 107933 114340 114795 115367 104844 96191 89816 92044 97550 114271 112601 104112 104084 108148 112241
12684 112241 107291 111575 115193 110614 98894 100218 106944 113070 124249 132591 143943 148526 150024
12671 150024 153698 164436 184567 205243 216100 234472 248810 254365 249271 233600 208910 190784
12659 190784 151332 96675 36676 -13353 -56415 -92177 -116133 -138935 -160030 -156533 -140630 -129809
12647a29809J7072J5577L0450J8445J3438J7923Q977J0654Q171J1716J7842J2346
12635E2802R030R266M843J1331J2928K2008J3161J8844J9740J5536J8896J5295
12623B23680R304J3875q58P96n877L211R75j6386j0560l04j684o944r181l215
12609A96832o206p485r291k985P001N920M0n270rN647O439N451J0044K1715J6642
12594B44485R817O186K969l687O403J3923k781n825L435O524N912K802r66L641
12580B92838J2403J0494J9344J7678K2248K5289L0967L2231K2710K4277K6168
12569E36647L2484M2477L5690K7648K3683J2413K1014J4449K0526L3377L6604
12558H37012K7030K5857K5963K6725K5700L8018L9197L9525M7003N4777M8896
$$ plain form
12647 -129809 -112737 -97160 -66710 -48265 -34827 -16904 -7927 2727 10898 22614 40456 52802
12635 52802 61832 71098 75941 87272 100200 122208 135369 154213 173953 189489 208385 223680
12623 223680 232984 246859 246001 246797 240920 244131 245106 228720 218160 217856 216172 209228 200047 196832
12609 196832 190626 183141 173850 170865 177866 183786 183826 178556 178547 184194 190633 196084 206128 227843 244485
12594 244485 254302 260488 263457 259770 266173 280096 277315 271490 274925 281449 287361 290163 289197 292838
12580 292838 305241 315735 335079 352757 375005 400294 431261 463492 486202 510479 536647
12569 536647 569131 611608 647298 674946 698629 711042 732056 746505 767031 800408 837012
12558 837012 864042 889899 915862 942587 968287 1006305 1045502 1085027 1132030 1186807 1235703
12547A235703M2325N6052N4000M6178N2815P1472O6077P2642R0341R8216J11408
12536A997229J24978J32744J50006J67411J87456K11208K54089K67257K93047
12527C785425L38198L99433N01109O16002P55846R13778J058055J255661J440641
12518A1064148J626633J805348K000207K306173K823467L699142N170739P554508
12510C8050365J1194069J5849130K0638693K4903300K8361945K9887158K8379833
12503A97264493K4238116J7951430R656190M98101p998173j5001557k0421633
12496B06186967k3929342k4789169k3364333k0872031j7980952j4790089j1635741
12489F8825310r002127p057898n749179m854337m197404l719455l349833l036377
$$ plain form
12547 1235703 1278028 1334080 1388080 1434258 1487073 1558545 1624622 1697264 1787605 1885821 1997229
12536 1997229 2122207 2254951 2404957 2572368 2759824 2971032 3225121 3492378 3785425
12527 3785425 4123623 4523056 5024165 5640167 6396013 7309791 8367846 9623507 11064148
12518 11064148 12690781 14496129 16496336 18802509 21625976 25325118 30495857 38050365
12510 38050365 49244434 65093564 85732257 110635557 138997502 168884660 197264493
12503 197264493 221502609 239454039 249110229 249608330 241610157 226608600 206186967
12496 206186967 182257625 157468456 134104123 113232092 95251140 80461051 68825310
12489 68825310 59823183 52765285 47016106 42161769 37964365 34244910 30895077 27858700
12481B7858700k773150k513131k257774k016326j817466j639675j462079j328064
12473A2051035j189388j065529r49130q45927p60673o74694n84579n09939m57172
12464E014004m22446l80361l35937k92358k78058k43243k13512k02588j83800
12455B461701j68424j50369j30353j31872j12769j00408q3109r1106q3196p0998
12445A339097o6538n7788m8290n1535n3867m8586n6554m4273l1150k6836l8461
12434H15219k3695j1179p072j7568r188j0984l649m243j504n682j4073p667o781
12421F91934M74r921q725p310j5168q481m505m954j7540l3305k2337j1414j5407
12408E33341j2245j1854j5075m704L015p418L440P181k713j5154j1823p039n659
$$ plain form
12481 27858700 25085550 22572419 20314645 18298319 16480853 14841178 13379099 12051035
12473 12051035 10861647 9796118 8846988 8001061 7240388 6565694 5981115 5471176 5014004
12464 5014004 4591558 4211197 3875260 3582902 3304844 3061601 2848089 2645501 2461701
12455 2461701 2293277 2142908 2012555 1880683 1767914 1667506 1584397 1493291 1410095 1339097
12445 1339097 1272559 1214771 1166481 1114946 1061079 1012493 955939 911666 880516 853680 815219
12434 815219 791524 780345 773273 755705 746517 735533 731884 727641 726137 720455 706382 698715 691934
12421 691934 692408 682487 673762 666452 651284 642803 638298 633344 615804 582499 560162 548748 533341
12408 533341 521096 509242 494167 489463 492478 485060 488500 495681 492968 477814 465991 458952 453293
12395D53293m473m932r283q099r511j0469j3101j2973j3775l34l676q040j015
12382C53612l130k852j6851j2615q369n750K562J2391J7285K7200J3935R148J3534
12369D00100Q322j929R67p219q485L524j6479J945m721j345L628R979K3047K3406
12355D34740J8727K5441K6984J6434Q304K295j055j8142k8533k8136m6333n5688
12343C55038o1804n1227m0442k9102k4827k2020q27J6427J0024P977M965R75J4822
12330A79979J4249O786K675o644Q9M913N334K030J4151O618j386n968m525L851
12316B22152J360N906m253p433J1850J3429j2540r739l099n394m155m930q799
12303A94355n849O188N687n353r347j3961Q52j4405k3198j7542l962J0353J2199
$$ plain form
12395 453293 448820 443888 434605 426506 416995 406526 393425 380452 366677 366343 362667 354627 353612
12382 353612 350482 347630 330779 318164 309795 304045 306607 318998 336283 363483 377418 386566 400100
12369 400100 408422 406493 407460 400241 391756 395280 378801 380746 376025 374680 378308 388287 411334 434740
12355 434740 453467 478908 505892 522326 530630 532925 531870 513728 485195 457059 410726 355038
12343 355038 293234 242007 201565 172463 147636 125616 124789 141216 151240 159217 164182 165157 179979
12330 179979 194228 201014 203689 197045 197134 202047 207381 209411 223562 230180 228794 222826 218301 222152
12316 222152 223512 229418 225165 217732 229582 243011 230471 220732 217633 212239 208084 203154 194355
12303 194355 188506 194694 200381 195028 185681 171720 172572 158167 134969 117427 113465 123818 136017
12290A36017L850p169N93R633o87n56J754J812l900J364Q88N672r114L914R066
12275A53137N620J4186O781M127j5330o723l718M447J4988l52l575P73L184n784
12261A71761m040n253j564o166n848J468P035l061l885j574J0010J3605K712J662
12247A76862L277m700j463o780O338K816P767O532q50M906K578p65P770M46O809
12232B11543J3563L579P53l237J3829J2954J4699J140m261j5946m0767m9784m5390
12219A12675n8894n7560m1774l4236j9465j4585O36J1747J4985J2799J0923J8579
12207d4170K6495J6835M264J6715J8949Q831M078J2335J0741R230N481K0843J0790
12194A21417J5737J3430J5265J2801J8746J6539P112K1638J7030L661R130J6125
$$ plain form
12290 136017 139867 132698 133291 142924 142237 141681 143435 145247 141347 142711 143599 149271 140157 144071 153137
12275 153137 158757 172943 179724 183851 168521 161798 158080 162527 177515 177163 173588 174361 177545 171761
12261 171761 167721 162468 160904 154738 148890 150358 157393 154332 150447 148873 158883 172488 175200 176862
12247 176862 180139 175439 173976 167196 173534 176350 184117 190649 189799 194705 197283 196518 204288 204734 211543
12232 211543 225106 228685 229438 226201 240030 252984 267683 268823 264562 248616 207849 158065 112675
12219 112675 53781 -3779 -45553 -79789 -99254 -113839 -113203 -101456 -86471 -73672 -62749 -44170
12207 -44170 -17675 -840 3424 20139 39088 47919 51997 64332 75073 84303 89784 110627 121417
12194 121417 137154 150584 165849 178650 197396 213935 221047 242685 259715 263376 272506 288631
12182B88631M559r78q394n294k965p254j842k771L16j849j8823j0627o905j261
12168B24543M757O720j202o513k695j826o73J2697J6214P636O502J2667J5045
12155B93872O543J0630P310K489J045n801O298P213R565R969J1266J4259Q06N165
12141C80629J2959K4610L2732K2132K2101L3494L3978M2776M5426M0415L5710
12130G26962M5486M9614M6538M4498N6570P3001O7208P2952O2622O6375N9875
12119A371701N0489L3301K1859L948m140m574M681J4614J0201K2116K6875L9611
12107A590682M7582M9499N5452N7200N1663P3040R4118R3563J00502J33998J51837
12096B499136J64140J89227K11630K58299K93537L16419L52664M20191M97645
$$ plain form
12182 288631 293190 292212 283818 278524 275559 268305 266463 263692 264008 262159 243336 232709 225804 224543
12168 224543 229300 236020 234818 228305 225610 223784 223111 235808 252022 259658 266160 278827 293872
12155 293872 300415 311045 318355 320844 321889 316088 322386 329599 339164 349133 360399 374658 375464 380629
12141 380629 393588 418198 450930 473062 495163 528657 562635 605411 650837 691252 726962
12130 726962 772448 822062 868600 913098 969668 1042669 1109877 1182829 1245451 1311826 1371701
12119 1371701 1422190 1455491 1477350 1481298 1477158 1472584 1477265 1491879 1502080 1524196 1551071 1590682
12107 1590682 1638264 1687763 1743215 1800415 1852078 1925118 2019236 2112799 2213301 2347299 2499136
12096 2499136 2663276 2852503 3064133 3322432 3615969 3932388 4285052 4705243 5202888
12087E202888O10203P48335R35295J146620J343482J563836J783122J967556K120338
12078A7421675K307393K584341L081914L930659N366379P757057J1347493J5980388
12070F9777299K0717635K4906514K8391577K9806774K7912940K3566918J7386024
12063B42465681R056737l97818q976932j5685071k0841238k4245386k4928061
12056A56447912k3197170k0527010j7612611j4398563j1232629q673065o834956
12049E3971908n591094m778774m241787l828323l513225l270127l026966k774116
12041B2947496k494757k211644j956678j724539j513943j322661j162567j024480
12033I536227r01336p93386p09055o28188n52348n00469m43318l88036l63827
$$ plain form
12087 5202888 5813091 6561426 7496721 8643341 9986823 11550659 13333781 15301337 17421675
12078 17421675 19729068 22313409 25395323 29325982 34692361 42449418 53796911 69777299
12070 69777299 90494934 115401448 143793025 173599799 201512739 225079657 242465681
12063 242465681 251522418 251124600 242147668 226462597 205621359 181375973 156447912
12056 156447912 133250742 112723732 95111121 80712558 69479929 60806864 53971908
12049 53971908 48380814 43602040 39360253 35531930 32018705 28748578 25721612 22947496
12041 22947496 20452739 18241095 16284417 14559878 13045935 11723274 10560707 9536227
12033 9536227 8634891 7841505 7132450 6504262 5951914 5451445 5008127 4620091 4256264
12024D256264l34315k95479k65683k37589k15637j94277j64411j53953j49905
12015B245015j31914j12330r9711r8265r7179q5692o8484o0057n5566n1207m8880
12004A335730m3430l2420l8267k5268k1269k406p841L50J2346K7033N2047Q5099
11992A341704J21236J89891K59447L34802M10212M68928M73825M34242L80590
11983D414877K61091J21566l1854j69096k83131l62196l96965l98143l72797l33424
11973B449928k73155k10441j64280j37750j18932r4319p4363r4144j04414q5754
11963A092376q1766o7405n4053n6928m9857m3479k8485k4444l5046l7406k3670
11952E89837k2798k3172j7567j8969j6957j8108j9601q868j6243j4004j1203q761
$$ plain form
12024 4256264 3921949 3626470 3360787 3123198 2907561 2713284 2548873 2394920 2245015
12015 2245015 2113101 2000771 1901060 1802795 1705616 1619924 1551440 1491383 1435817 1384610 1335730
12004 1335730 1292300 1259880 1221613 1196345 1175076 1172670 1164829 1165179 1177525 1204558 1256605 1341704
11992 1341704 1462940 1652831 1912278 2247080 2657292 3126220 3600045 4034287 4414877
11983 4414877 4675968 4797534 4765680 4596584 4313453 3951257 3554292 3156149 2783352 2449928
11973 2449928 2176773 1966332 1802052 1664302 1545370 1451051 1376688 1282544 1178130 1092376
11963 1092376 1010610 943205 889152 832224 782367 738888 710403 685959 650913 613507 589837
11952 589837 567039 543867 526300 507331 490374 472266 452665 443797 427554 413550 402347 393586
11940C93586m831j0305j1373J0319J0847J1867J2803R191J6100R655m047o488
11928D37324n848l033J626K236J3078K1086L1755N9387P5050L8240K0267J3017
11916G04185K8365J9417k0425m7395k8778j9655m0556n4871n8809m9681n4607
11905C77190o9804n7966m4718m4307k6182k0825q964r696m10J002o661O650Q708
11892A04017J0263Q857J4386J877O060J6338J0291m841j0940o086p141k686p624
11879A32771j625K192L193p512o559o770L587L746L447p09M925j015l366j6469
11865A09836j5692m793N500N006m124q544j3408q28q343r119n14R795O218P584
11851G8574J1058Q417p504k477J571m456Q33N90R411K45k377O369P706k870p527
$$ plain form
11940 393586 388755 378450 367077 377396 388243 400110 412913 422104 438204 447859 443812 437324
11928 437324 431476 428443 430069 432305 445383 466469 498224 557611 632661 670901 691168 704185
11916 704185 732550 751967 731542 684147 655369 635714 595158 540287 481478 431797 377190
11905 377190 307386 249420 204702 160395 134213 113388 104424 94728 94318 95320 88659 95309 104017
11892 104017 114280 123137 137523 139400 145460 161798 172089 167248 156308 150222 143081 140395 132771
11879 132771 131146 133338 136531 129019 122460 115690 119277 123023 126470 125761 130686 129671 126305 109836
11865 109836 94144 89351 94851 99857 95733 87189 73781 72953 64610 55491 54977 64772 70990 78574
11851 78574 89632 98049 90545 88068 89639 85183 86016 86606 96017 96262 93885 100254 107960 105090 97563
11836I7563p110m306j268k105j4316j3100k236l375J300o678l089R763J2805J3967
11822G7815r543j2103M76m586P257Q175K174O779O003J2404n100l851k947L568
11808H6521K307q98m716n809K911M836N334n89l615N88n302k017j0595j0162J0884
11793F9678k044l692j1116J948r79q41k624N792K225k488L745N755j139l187L774
11778F4807j978n721j69O226Q619K181j1582j0635J0444J0958J0532j919n628
11765G6135p647K910M69p759j6495j1232k204M00M95K337N200J2342m99N245M990
11750F4687k254q118o042K583O064J3758M772Q66l260k244k806L412q8M723K310
11735G8363n702r527k339j969l215K378K177O558k256p937n099k720n963o262
$$ plain form
11836 97563 90453 86147 84879 82774 68458 55358 53122 49747 51047 44369 41280 51043 63848 77815
11822 77815 68272 56169 56645 52059 59316 67491 69665 76444 82447 94851 89751 85900 82953 86521
11808 86521 88828 87930 83214 77405 80316 85152 90486 89897 86282 86870 81568 79551 68956 58794 69678
11793 69678 67634 63942 52826 54774 53795 52954 50330 56122 58347 55859 59604 65359 64220 61033 64807
11778 64807 62829 57108 56939 63165 71784 73965 62383 51748 62192 73150 83682 81763 76135
11765 76135 68488 71398 71867 64108 47613 36381 34177 34577 35072 37409 42609 54951 54452 59697 64687
11750 64687 62433 54315 48273 50856 56920 70678 75450 76316 73056 70812 68006 71418 71330 76053 78363
11735 78363 72661 63134 60795 58826 55611 57989 60166 66724 64468 56531 51432 48712 42749 36487
11721C6487P390Q481k992p047m752R352O407L781N591j687J87o105J36J0138q384
11706E6983j2103K156J1587R588m148o654q829j881K233j206k501m549l014m278
11692C3384o26N610J394Q619N924k678n413L934n433m268k343J079R499J0999
11678E9681j837p35p747M016M761j161J1227L743j2613K917K4109J3368k438r75
11664I6316Q882m774r822P305J8560J3206m411J8640K4130J4857L6128M1221M6172
11651C06410O7663Q2224J05414J39745J54417J49542J17849J05302Q4940L2684
11641A346190j1720n6635q2013j05365j16288j14813j14460j04839q7407o8294
11631D84356o3043l9545l7032m1382l7711k2820k0124k0151j4401k1996j1290
$$ plain form
11721 36487 43877 52358 49366 42319 37567 46919 53326 57107 62698 61011 61198 55093 55229 65367 56983
11706 56983 44880 47036 58623 68211 64063 57409 48580 46699 48932 47726 45225 40676 37662 33384
11692 33384 32758 38368 39762 48381 54305 51627 46214 50148 44715 40447 38104 39183 48682 59681
11678 59681 57844 57109 49362 53378 58139 56978 68205 71948 59335 62252 86361 99729 97291 96316
11664 96316 105198 100424 90602 97907 116467 129673 125262 143902 168032 182889 219017 260238 306410
11651 306410 374073 456297 561711 701456 855873 1005415 1123264 1228566 1313506 1346190
11641 1346190 1334470 1277835 1195822 1090457 974169 859356 744896 640057 552650 484356
11631 484356 421313 381768 344736 303354 265643 242823 222699 202548 188147 166151 154861
11620A54861p224j8981j9283p562l031q443o345k593j1125k425M544R543n437
11607G6499j434K654l455L576N321q745n062j27k002o915j1775n359j380l527
11593C8269J372m33O070r731J746K77j06j670Q303M049K817K344n182q826k181
11578C7118o001p360R829l658l809Q215K550O93q19J1331K73n586J1500K371j1197
11563D5450O606J5516N487k128n207q69r157N390N418L369L717j5466j0339r603
11549C8184J173M793K354n829k813l959L257K945K975K12r206q6l675K097M226
11534C6648M599J523k982M41l083j748m752N239K804N896j357j0970J225K530
11520C6013M92n822l064M969L084n687O586J435L451M052l765o500L322l256K939
$$ plain form
11620 154861 147637 128656 109373 101811 98780 90337 83992 81399 70274 67849 72393 81936 76499
11607 76499 75065 77719 74264 77840 83161 74416 69354 69227 67225 60310 48535 43176 41796 38269
11593 38269 39641 39208 45278 35547 37293 37570 37464 35794 44097 48146 50963 53307 48125 39299 37118
11578 37118 31117 23757 33586 29928 26119 34334 36884 37577 36758 48089 48362 42776 54276 56647 45450
11563 45450 52056 67572 73059 70931 65724 64855 55698 61088 66506 69875 73592 58126 47787 38184
11549 38184 39357 44150 46504 40675 37862 33903 37160 40105 43080 43292 34086 34000 30325 32422 36648
11534 36648 41247 42770 39788 40229 37146 35398 30646 35885 38689 44585 43228 32258 33483 36013
11520 36013 36505 30683 27619 32588 35672 29985 36571 38006 41457 45509 41744 35244 38566 35310 38249
11505C8249K94k855Q5K762P357O723K546r035q683k61l501M002R092m649m308
11490C7818l16m466j677N79j080J727K982k012L242J645R12O657j684p287J405
11475C8445n471M099Q394l414k327P33K019K458O811K63N428k657j0585l697o679
11460C3820r80N923J3515m382j912m430q554K72K740n749K22K685l059Q210N663
11445D3984O009q116q421l949J640J0328k486j096R053p743p816L559J1091q569
11431C7468j2873p306Q837J0909M328m86R507K532n147N45p107j397J0587O38
11417E1035p509o55j12p808n235j34r015J635M531J336J4986P656k233j610j0241
11402C6627k452O882j921N498M815q70P689K529k842m453l253J0745K829k545
$$ plain form
11505 38249 38543 35688 35773 38535 45892 52615 55161 46126 37443 37182 33681 37683 46775 42126 37818
11490 37818 37502 33036 31359 31938 30858 32585 35567 33555 36797 38442 39354 46011 44327 37040 38445
11475 38445 32974 37073 45467 42053 39726 40459 42478 44936 51747 52010 57438 54781 44196 40499 33820
11460 33820 32840 38763 52278 47896 45984 41554 33000 33272 36012 30263 30485 33170 30111 38321 43984
11445 43984 49993 41877 33456 29507 31147 41475 38989 37893 46946 39203 31387 34946 46037 37468
11431 37468 24595 17289 26126 37035 41363 40877 50384 52916 47769 48314 41207 39810 50397 51035
11417 51035 43526 42871 42759 34951 29716 29582 20567 22202 26733 28069 43055 50711 48478 46868 36627
11402 36627 34175 41057 39136 44634 49449 48579 56268 58797 55955 51502 48249 58994 61823 59278
11388E9278m163n599m853N32n190P523N372r208q860l939L870J2359J1543n765
11374E2900n073j141Q361L230k185q895L61L051l284q761K654N432l201j5377
11360B8072L873M455o621j2289O397J1264M541p134J105N997R001l653r510l289
11346C2209J2257J7115M520k737o989L214j089j0141J884K9J0904K09j128l334
11332E6923j871n885k083R415J490r64K438n583M093j917j626P457p204j880K504
11317E5307k502q381j625l573p173j45j930k778J163L89k735n740o935N290P664
11302B6296R590O042J7480R259J249n183l689m781p275j894L540k999l129R957
11288E4463K512J058P857p117o715p133N122R586K275M814k13j186K33P977N394
$$ plain form
11388 59278 55115 49516 44663 45195 40005 47528 52900 43692 34832 30893 34763 47122 58665 52900
11374 52900 47827 46686 55047 58277 56092 47197 47558 50609 47325 38564 41218 46650 43449 28072
11360 28072 31945 36400 29779 17490 23887 35151 39692 32558 33663 39660 48661 45008 35498 32209
11346 32209 44466 61581 66101 63364 56375 59589 58500 48359 50243 50272 61176 61385 60257 56923
11332 56923 55052 49167 47084 56499 57989 57025 59463 53880 57973 56056 54430 61887 54683 52803 55307
11317 55307 52805 44424 42799 39226 32053 31908 29978 27200 28363 28752 26017 20277 13342 18632 26296
11302 26296 35886 41928 59408 68667 69916 64733 61044 56263 48988 47094 50634 47635 44506 54463
11288 54463 56975 58033 65890 58773 52058 44925 50047 59633 61908 66722 66509 65323 65556 73533 78927
11273G8927K595q094p662k467j5287r607N385J6777P207l364L351L698N421j862
11259G5018m943P696o941j2628j993L578O103n377l870L625O695J534O460P021
11245H1978J5144J1452k475L413M347J0249O881N744j3943L772N553j0063k925
11232A19127m185m076r210j010j7509k528P009k354L407J659l264J810J623K805
11218I3304M662K625j2527j5347N625L808N930P841K578k186k890l681K124k728
11204H9138k458j3185K754J0061J7279R576J0790K2319J6754L686j1293j0524
11192A44897n978q023n27j144j2238j566N352R819L021Q82J4768Q22j4333j2372
11178A23380q20J903M275n235l212q913j1650M894O48p641J027P148R715N087
$$ plain form
11273 78927 81522 73428 65766 63299 48012 38405 43790 60567 67774 64410 67761 71459 76880 75018
11259 75018 70075 77771 70830 58202 56209 59787 65890 60513 56643 60268 66963 68497 74957 81978
11245 81978 97122 108574 106099 109512 113859 124108 130989 136733 122790 126562 132115 122052 119127
11232 119127 114942 110866 101656 100646 83137 80609 87618 85264 88671 90330 87066 88876 90499 93304
11218 93304 97966 100591 88064 72717 78342 82150 88080 95921 98499 96313 93423 89742 91866 89138
11204 89138 86680 73495 76249 86310 103589 113165 123955 146274 163028 166714 155421 144897
11192 144897 138919 130896 130369 129225 116987 115421 120773 130592 133613 134495 149263 150085 135752 123380
11178 123380 122560 124463 128738 123503 120291 111378 99728 104622 105270 97629 98656 105804 115519 120606
11164A20606J118m096m639M186k76P889K1434J3084J1938N841O356Q646k395j7979
11150A71713j4725j2789k731k41o562J038l678j0731j997N816l245j766p751n222
11136A07129J4058M331n47q7p842L750R369J270r891q535K304k82L723l592Q965
11121A24123J0892J0351J868k41L988K826J5242K665J886l453n148o800j030j1333
11107A45836o796k328r638j103n084P87K414L358m170j2311K342L443q025n40
11093A08185N201J421n245N088n311o096N345N427K842M432q561n140j0208j220
11079I6160l765N013R544M165P327J229k877k056n035l557R766M954P03L85q35
11064A21121M942J0498J793q748k112J536n335k684K28n395J888r51o55j63n629
$$ plain form
11164 120606 121724 117628 112989 117175 116899 124788 146222 159306 171244 177085 183441 192087 189692 171713
11150 171713 156988 144199 141468 141227 134665 135703 132025 121294 119297 125113 121868 120102 112351 107129
11136 107129 121187 125518 124971 124884 117042 120792 130161 131431 121540 113005 115309 115027 118750 115158 124123
11121 124123 135015 145366 147234 146993 150981 153807 169049 171714 173600 170147 164999 158199 157169 145836
11107 145836 139040 136712 127074 125971 120887 121674 124088 127446 123276 110965 113307 116750 108725 108185
11093 108185 113386 114807 109562 114650 109339 103243 108588 114015 116857 121289 112728 107588 97380 96160
11079 96160 92395 97408 106952 111117 118444 119673 116796 114740 109705 106148 115914 120868 121571 121956 121121
11064 121121 126063 136561 138354 129606 127494 129030 123695 121011 121239 115844 117732 116781 116126 115963 110334
11049A10334k731j413j2733q778P162M313O933R115J620L346J894O041J1911q564
11035A28450j3181K05J173l975n173l724n668k493R146R988K116l340k939m273
11021A06312O902j978m685k233M527j196n584J774J5242J9669O094o251j1819
11008A26774q456k158O400P458o510M317r39M466J46n650j107j643J802m094K482
10993A23288J4997k196l877R046L39m412M335Q580K152K072N05r242J317J412
10979A48316r815r159j0M869p054j799q97N734K729q506Q324M292J322o777M701
10964A36270M123l662j764m941k878Q003Q14M532j865p076j819r509L484J1533
10950A35245P981M348N269r713n602m097l810j0866n288p715K96m402Q605O741
$$ plain form
11049 110334 107603 106190 93457 84679 91841 96154 103087 112202 113822 117168 119062 125103 137014 128450
11035 128450 115269 115474 116647 112672 107499 103775 98107 95614 104760 114748 116864 113524 110585 106312
11021 106312 113214 111236 106551 104318 108845 107649 102065 103839 119081 138750 144844 138593 126774
11008 126774 118318 116160 122560 130018 123508 127825 126886 131352 131498 125848 124741 123098 124900 120806 123288
10993 123288 138285 136089 132212 141258 141597 137185 141520 150100 152252 154324 154829 145587 146904 148316
10979 148316 138501 129342 129332 134201 127147 125348 124451 130185 132914 124408 132732 137024 138346 131569 136270
10964 136270 140393 136731 134967 130026 127148 135151 135965 140497 138632 131556 129737 120228 123712 135245
10950 135245 143226 147574 152843 143130 137528 133431 129621 118755 113467 105752 106048 101646 110251 116992
10936A16992q8p080J284J0741K791M484O911J3093J3925L749J15q8J3336Q836
10922A89001k373L448J7820R987R454J0486Q369P873l526j0013O34J2556O577
10909B60293J777l279J2558J9429J4623M5712P1542Q2552J32206K29127L64757
10898A231297N04780M85136K76889J33524J03992J5602j98915m08433m31007l31875
10888A380990k14899j54683j25188j01129q6483o4871m5651m6010m4299l5328
10878D62449k4895k4132k2440k3274k0143j6130j2807J98O149M436j700O522P86
10865C35019m88k0163j6315k1747j9247j0520q634n275o977J269N267j251l614
10852B27324l149O466j206j914K52n652L6Q402J2173L360n227l548l799j633J533
$$ plain form
10936 116992 116904 109824 111108 121849 124640 129124 136035 149128 163053 166802 166917 166829 180165 189001
10922 189001 186628 190076 207896 217883 227337 237823 246192 254065 250539 240526 241160 253716 260293
10909 260293 262070 258791 271349 290778 305401 351113 422655 505207 637413 866540 1231297
10898 1231297 1736077 2221213 2498102 2631626 2735618 2751220 2552305 2143872 1712865 1380990
10888 1380990 1166091 1011408 886220 785091 698608 633737 588086 542076 497777 462449
10878 462449 437554 413422 390982 367708 347565 331435 318628 318826 324975 329411 327711 334233 335019
10865 335019 334531 314368 298053 276306 257059 246539 237905 232630 225653 226922 232189 230938 227324
10852 227324 224175 230641 229435 227521 227773 222121 222157 230559 242732 246092 240865 237317 233518 231885 233418
10837B33418O849R577j206r106n695P757J5687R120K547k25l834K752O900l41
10823B74200j3093m020P406J2687P724J052J943J983P988j360j44N005k816j122
10809B97433P934J2291k093M613j997l73Q219Q597Q826L989L398J0406M659M814
10795C70716J8153J5929K616q40j0872R174K3721J7579J7552K8347J7757J1524
10783E21356K6063K7912P09j139J3567L830K212L429K594k282j154J060P63K301
10769F01221M097J665O088N336J2570J2609R252J9064K1186J0053J7949J4066
10757G35156P561K0545K0065M384J5554K3551J7955K0787K3330Q521m573p693
10745H85143Q828R89K490m27n56j0521j5320j024N714o362j4219j0306j0514J326
$$ plain form
10837 233418 240267 249844 248638 239532 233837 241594 257281 266401 268948 268723 264889 267641 274541 274200
10823 274200 261107 257087 264493 277180 284904 285956 287899 289882 297870 296510 296366 301371 298555 297433
10809 297433 305367 317658 315565 320178 318181 317808 326027 334624 343450 347439 350837 361243 365902 370716
10795 370716 388869 404798 407414 406574 395702 404876 428597 446176 463728 492075 509832 521356
10783 521356 547419 575331 576040 574901 588468 592298 594510 597939 600533 598251 597097 598157 598920 601221
10769 601221 605318 606983 613071 618407 630977 643586 652838 671902 693088 703141 721090 735156
10757 735156 742717 763262 783327 787711 803265 826816 844771 865558 888888 897409 892836 885143
10745 885143 893971 894960 897450 897023 896467 885946 870626 869602 875316 868954 854735 844429 833915 835241
10731H35241J217o695O784K3558J0727O974n576j1738k5472k2221j0291L067k040
10718H03535k206J2012J9281Q202j7278j118P86o166j4767j0966o041m502q522
10705G72250j8129j7235j1337j8662p786q063o842k2957k6510j4717j0243j1405
10693E98364j3443r072J2179J1985K045j3498m229J9462J4424o897m295p869j2995
10680E86161r438k3629L581O181m36N240M976j2921j6069p222j9125q781m851
10667E03667O74P794J3537L1499J7949J7535Q565k469l263r179j4975q645K116
10654E64805j487O698J6261K6828J7048Q070J3918N194O568J7098K1259L2369
10642G34629M3408M0065M4598M2902L3426J9565k5976q9857j43911j34806j01434
$$ plain form
10731 835241 836458 829763 836547 860105 870832 877806 872230 860492 835020 812799 802508 805575 803535
10718 803535 801329 813341 832622 840824 823546 822428 823214 817048 802281 791315 785274 780772 772250
10705 772250 754121 736886 725549 706887 699101 691038 684196 661239 634729 620012 609769 598364
10693 598364 584921 575849 588028 600013 602058 588560 584331 603793 618217 611320 607025 599156 586161
10680 586161 576723 553094 556675 562856 562420 567660 572636 559715 543646 536424 517299 508518 503667
10667 503667 504341 512135 525672 557171 575120 592655 601220 598751 595488 586309 571334 562689 564805
10654 564805 563318 570016 586277 613105 630153 638223 652141 657335 663903 681001 702260 734629
10642 734629 778037 818102 862700 905602 939028 958593 932617 842760 698849 564043 462609
10631D62609r6597j17442r7376k2460L1641M8644N6971M7048J8805K3208K6751
10620C81802L3519K9836L3049L1403M8152L6205J9242R128K455J7938J9240J4616
10608F76585L0795L2634L5717L5631K9626L0626L2325M4703N4256L7552J3433
10597A053883J4237J8670K945j7909j4191m084k284j8241j7022k2140k0725j8841
10585I54298J409m249O156J2132J2181M42J4670J7606O721R021J7407Q301J3841
10572A069936K8805L9869L2964K7682K6179R433R574K845r706j0317N578M528
10560A237370J422n364m934K3170L0349K0905J7579K5709L3038N3791N8242L9135
10548A530412M5536N6076O8636Q3501R2487P5065M8052M6728L0851K0137K4581
$$ plain form
10631 462609 366012 248570 151194 128734 160375 209019 265990 313038 331843 355051 381802
10620 381802 415321 445157 478206 509609 557761 593966 613208 622336 624791 642729 661969 676585
10608 676585 707380 740014 775731 811362 840988 871614 903939 948642 1002898 1040450 1053883
10597 1053883 1068120 1086790 1089735 1071826 1057635 1053551 1051267 1033026 1016004 993864 973139 954298
10585 954298 955707 951458 957614 969746 981927 982369 997039 1014645 1021366 1030387 1047794 1056095 1069936
10572 1069936 1098741 1138610 1171574 1199256 1225435 1234868 1244442 1247287 1237581 1227264 1232842 1237370
10560 1237370 1238792 1233428 1228494 1251664 1282013 1302918 1320497 1346206 1379244 1433035 1491277 1530412
10548 1530412 1575948 1632024 1700660 1784161 1876648 1951713 1999765 2046493 2077344 2097481 2122062
10537B122062L6376K9891J9625K8009N4018Q0826O2564M3426L8243M0305O8031
10526B623376Q9351Q0999O4849P4375R4455J09207J03492R0748R3666R6227R6214
10515C616959R9581J16100J44221J75779J83079J89028J96045K46232L17091L52827
10505E636942L69330L71166L99594M52053N38572O45680P96274J018548J262960
10496A1491119J322591J211127J192470J325204J482400J679450K040368K797991
10488B4542720L892373N363472P474557J0571612J5211716K2974775L7026584
10481A27057809O1369495R2166132R6907758N5483292K1940388J6679968R104595
10474D80709437k2915747o8615684q5295228o8161926m6613453l2405159k4962691
$$ plain form
10537 2122062 2158438 2188329 2207954 2235963 2289981 2370807 2433371 2476797 2515040 2555345 2623376
10526 2623376 2712727 2793726 2858575 2932950 3027405 3136612 3240104 3330852 3424518 3520745 3616959
10515 3616959 3716540 3832640 3976861 4152640 4335719 4524747 4720792 4967024 5284115 5636942
10505 5636942 6006272 6377438 6777032 7229085 7767657 8413337 9209611 10228159 11491119
10496 11491119 12813710 14024837 15217307 16542511 18024911 19704361 21744729 24542720
10488 24542720 28435093 33798565 41273122 51844734 67056450 90031225 127057809
10481 127057809 188427304 280593436 377501194 432984486 454924874 471604842 480709437
10474 480709437 457793690 389178006 303882778 235720852 189107399 156702240 131739549
10467A31739549k0520981j6385963j2625744r778046p771410o266144n292965
10460E3098296m865156m495102m050546l702529l496495l286037k950018k526568
10452B3725845k187296j944132j748391j533153j317463j128070r96079q90292
10444A1980969p72110o90517n94354n24129m40969m05188l86359l48228l18204
10435G500911k74913k26935j89216j52928j07980r3247q7645q2593n4823j9148
10425F211483p884L140J1120Q589M0716P8191R5313Q8264P2959O9794Q0707R4853
10413F847245J15735J28520J33847J56254J99723K24604K62124K78310K83724
10404H630086L17746L35932L65236L72447L75741L97291M22038M64583M85187
$$ plain form
10467 131739549 111218568 94832605 82206861 72428815 64657405 58391261 53098296
10460 53098296 48233140 43738038 39687492 35984963 32488468 29202431 26252413 23725845
10452 23725845 21538549 19594417 17846026 16312873 14995410 13867340 12871261 11980969
10444 11980969 11208859 10518342 9923988 9399859 8958890 8553702 8167343 7819115 7500911
10435 7500911 7225998 6999063 6809847 6656919 6548939 6455692 6368047 6285454 6230631 6211483
10425 6211483 6203599 6206739 6217859 6226448 6267164 6345355 6440668 6528932 6601891 6671685 6752392 6847245
10413 6847245 6962980 7091500 7225347 7381601 7581324 7805928 8068052 8346362 8630086
10404 8630086 8947832 9283764 9649000 10021447 10397188 10794479 11216517 11681100 12166287
10395A2166287N11458N63405O11920O58350P11779P67388Q30309Q94282R75847
10386A8691025J071656J164305J276603J374590J496683J627659J753752J879680
10378C0335953K019387K150306K262289K386269K491280K549215K578492K579640
10370D9352831K538357K438183K283694K084388J858129J619729J325821J059399
10362F4560531Q11710N88853L99432K66418J67854J26288J34086J86444K72403
10353F7514019L84285N22982P08990Q95968J077833J272771J450508J598741J726122
10344G7152219J835246J920578J966255J972457J936319J853641J721466J553619
10336I1911800J345940J102922Q30082N47317K58638l4204l08135n69914q06388
$$ plain form
10395 12166287 12677745 13241150 13853070 14511420 15223199 15990587 16820896 17715178 18691025
10386 18691025 19762681 20926986 22203589 23578179 25074862 26702521 28456273 30335953
10378 30335953 32355340 34505646 36767935 39154204 41645484 44194699 46773191 49352831
10370 49352831 51891188 54329371 56613065 58697453 60555582 62175311 63501132 64560531
10362 64560531 65372241 65961094 66360526 66626944 66794798 66921086 67055172 67241616 67514019
10353 67514019 67898304 68421286 69130276 70026244 71104077 72376848 73827356 75426097 77152219
10344 77152219 78987465 80908043 82874298 84846755 86783074 88636715 90358181 91911800
10336 91911800 93257740 94360662 95190744 95738061 95996699 95962495 95654360 95084446 94278058
10327I4278058j002822j174384j333761j505493j691542j786046j784725j787817
10319H2211468j788635j761591j653100j451403j254345j068703q62435o66451
10311G1704805m69370k60437p1727J01309K47715L61088M44575M80929M72680
10302G3011567M08806K57731M7155k28099n41166q75173j228364j559353j862320
10293F7430784k128523k337904k486816k581942k635226k651750k623318k569504
10285D7415801k502878k428942k334056k221507k100874j989788j882881j771783
10277C0183092j668528j563461j451782j366298j295968j217093j135978j057814
10269A9426170r93450r29864q56396p94829p32462o91950o50672n98865n62911
$$ plain form
10327 94278058 93275236 92100852 90767091 89261598 87570056 85784010 83999285 82211468
10319 82211468 80422833 78661242 77008142 75556739 74302394 73233691 72371256 71704805
10311 71704805 71235435 70974998 70903271 71004580 71252295 71613383 72057958 72538887 73011567
10302 73011567 73420373 73678104 73725259 73497160 72955994 72080821 70852457 69293104 67430784
10293 67430784 65302261 62964357 60477541 57895599 55260373 52608623 49985305 47415801
10285 47415801 44912923 42483981 40149925 37928418 35827544 33837756 31954875 30183092
10277 30183092 28514564 26951103 25499321 24133023 22837055 21619962 20483984 19426170
10269 19426170 18432720 17502856 16646460 15851631 15119169 14427219 13776547 13177682 12614771
10260A2614771n31907m99443m74910m46706m16232l98634l80521l46490l39316
10251H780612l11799k86014k66893k62848k54835k41051k26538k22046k08156
10242F500432j99242j90590j72252j48551j47852j60604j44614j31894j26611
10233E078222j18574j15797j06833j01814j04237j06013r9308j01982q3411o9492
10223D070761p2927q0165p6936o2837o8844p4306p9154p0486n8050n5212o7620
10212C304224n5462m9918n3137o2249n8543n4646o2777n1798m7228l8234l6908
10201B733324l2601m4862m0561l3074k8442k1014l2948l0687l3756k7703k1865
10190B385811k8239j8443j9132k6936k0060p911k3490j9389j5514k2003k7410
$$ plain form
10260 12614771 12082864 11583421 11108511 10661805 10245573 9846939 9466418 9119928 8780612
10251 8780612 8468813 8182799 7915906 7653058 7398223 7157172 6930634 6708588 6500432
10242 6500432 6301190 6110600 5938348 5789797 5641945 5481341 5336727 5204833 5078222
10233 5078222 4959648 4843851 4737018 4635204 4530967 4424954 4325646 4223664 4140253 4070761
10223 4070761 3997834 3917669 3840733 3777896 3709052 3634746 3555592 3485106 3427056 3371844 3304224
10212 3304224 3248762 3198844 3145707 3083458 3024915 2970269 2907492 2855694 2808466 2770232 2733324
10201 2733324 2700723 2655861 2615300 2582226 2553784 2532770 2499822 2469135 2435379 2407676 2385811
10190 2385811 2357572 2339129 2319997 2293061 2273001 2265090 2241600 2222211 2206697 2184694 2157284
10179B157284l2441l6679l0412k6552m3752l1693k8701l2805k7095j3519j2572
10168A841063j9082j7979j6048k1243j7533j7195j2350l3866k8253j9185j5176
10157A623153j1888j7673j3137j0609q489k049m403j1343l588N605p754O110J3832
10144A557767K8841K4709J9746L0545L5139L8301M4923N7359P1174R3276J46062
10133B147842K19650L11817M57515O90218J080630J663647K314331K600026K147280
10124A3632956J342535P36192K26582n90037j611072k236915k145651j689268
10116G665322j248605r45977p33984n74471m51690l65583k93542k26469j94402
10107B630599j84751j64003j42410j33122j19415j25451j14057j00788r1203q3316
$$ plain form
10179 2157284 2124843 2088164 2057752 2031200 1987448 1955755 1927054 1894249 1867154 1853635 1841063
10168 1841063 1821981 1804002 1787954 1766711 1749178 1731983 1719633 1685767 1657514 1638329 1623153
10157 1623153 1611265 1593592 1580455 1569846 1561357 1559308 1554905 1543562 1539974 1545579 1537825 1543935 1557767
10144 1557767 1586608 1611317 1631063 1661608 1696747 1735048 1779971 1837330 1908504 2001780 2147842
10133 2147842 2367492 2679309 3136824 3827042 4907672 6571319 8885650 11485676 13632956
10124 13632956 14975491 15711683 15938265 15348228 13737156 11500241 9354590 7665322
10116 7665322 6416717 5470740 4736756 4162285 3710595 3345012 3051470 2825001 2630599
10107 2630599 2445848 2281845 2139435 2006313 1886898 1761447 1647390 1546602 1455399 1372083
10097A372083p0913m7079m7475n2435n7011m1443l0667l2394l0140k6971k8652
10086I06903k1565j6477r943j8775j2266j8473j1157o934j5924p308l714j7445
10074G46922m249p246k838k375Q790j294J666O270k597Q724K3219J2778J9153
10061H06923L7913O0962Q8235J42254K46006L91526N37385M82537K81454J60872
10051C236067J08604k5588k45660m42302m53099l41405k36342j62462j31479j09801
10041A196533q8253o9925n5811m5704m8525n0590l5448l1426l2261m3803l3238
10030F61549k3699l4724k7584j1747p166j5494k1952l170O098J675o199M240k429
10017E19398p252p706j503j8189k9006o266L271M751N799J368q640o65J3804J4040
$$ plain form
10097 1372083 1301170 1254091 1206616 1154181 1097170 1055727 1025060 992666 962526 935555 906903
10086 906903 885338 868861 858918 840143 827877 809404 798247 791313 775389 768081 764367 746922
10074 746922 742673 735427 732589 730214 739004 737710 739376 745646 743049 751773 774992 787770 806923
10061 806923 844836 905798 994033 1136287 1382293 1773819 2311204 2793741 3075195 3236067
10051 3236067 3344671 3319083 3073423 2631121 2178022 1836617 1600275 1437813 1306334 1196533
10041 1196533 1108280 1038355 982544 936840 888315 837725 802277 770851 738590 694787 661549
10030 661549 637850 603126 575542 563795 556629 541135 519183 516013 522111 523786 517587 521827 519398
10017 519398 512146 504440 502937 484748 455742 449476 452747 457498 463297 464665 456025 455360 469164 483204
10003D83204K0048K9876J7034O926M410O408J167Q826J8441L0195N6698P6633
9991G59866J01891J31769J25982R3994O7888L2435o716n9120r5120j17609r5546
9980I39714r1418q2274n7673m9504l7053k3349j4034o916j3691o277j5031j5763
9968E26731p604r491q395q074q242o673O104P194P229L857k026J0252R795K532
9954E23189Q157J6769J8665J3574J7474q01m62L062J4629K402O373M311J2680
9941F40022k628l344N601P197R5j041K108J3364J1758q242J914K147L622M442
9927F77015M17J0237O710j084J3071J6528J5536K2566J3943J0105K6141L1066
9915H42251K7566J2898R136J6538J0292j501k2073l2403l3638l1265j4988o797
$$ plain form
10003 483204 503252 533128 550162 557088 561498 567906 569073 577899 596340 626535 683233 759866
9991 759866 861757 993526 1119508 1213502 1281390 1313825 1307109 1247989 1152869 1035260 939714
9980 939714 848296 766022 708349 658845 621792 598443 584409 577493 563802 557525 542494 526731
9968 526731 519127 509636 501241 493167 484925 478252 484356 491550 498779 502636 500610 510862 520657 523189
9954 523189 531346 548115 566780 580354 597828 597027 596565 599627 614256 616658 623031 627342 640022
9941 640022 637394 634050 639651 646848 646943 645902 648010 661374 673132 664890 666804 668951 672573 677015
9927 677015 677432 687669 694379 693295 706366 722894 738430 760996 774939 785044 811185 842251
9915 842251 869817 882715 891851 908389 918681 917180 895107 862704 829066 797801 782813 776016
9903G76016j5762j8813j9049j4141j9158j3869r448o013j572l639j0534j0120
9891F33898q778o542m441k248Q496N461J1767n69N317N83l347m796P103R93q554
9876F34343j1990j5110j2071J177j360j7321k4828j1419j8735k3062k1295k6558
9864D51771r107q969j2928j760r779j6130j2017j8539j3945j3333r308L356O387
9851C35699q513j0175j2662k1585j0369p659k285N485M100J535k963r40l250k618
9837B63800j36o563q475j8354j3437k09O232N104J516J324l58j0971M182l430
9823B20225m834j4812o651J5737K958n807o602J076J2724L901J259l27o60m439
9809B13748p636j618j0326n951p706l903P012R630j1825N450M398J391K542M470
$$ plain form
9903 776016 760254 741441 722392 708251 689093 675224 665776 659763 658191 654552 644018 633898
9891 633898 625120 618578 614137 611889 620385 625846 637613 637044 642361 642944 639597 634801 641904 642897 634343
9876 634343 622353 607243 595172 596349 594989 577668 552840 541421 522686 499624 478329 451771
9864 451771 442664 433695 420767 419007 409228 393098 381081 362542 348597 335264 325956 329312 335699
9851 335699 327186 317011 304349 282764 272395 264736 262451 267936 272036 273571 270608 269668 266418 263800
9837 263800 263664 257101 248626 230272 216835 216626 222858 227962 229478 230802 230444 219473 223655 220225
9823 220225 215391 200579 193928 209665 212623 206816 200214 201290 214014 217915 219174 218847 218187 213748
9809 213748 206112 204494 194168 188217 180511 176608 183620 193250 181425 186875 191273 192664 195206 199676
9795A99676q139M681N722l722m51l796j0262k075o360M131P249L763O164n481
9781A91100K486j495j292J499K988k02l812m487j2250j852m453Q80J549L431q165
9766A65925o696J0196J513q983K458J4285k523r833O766L567m270L711m949K940
9752A74107N995n94q329m118J36J548n690m787O115O840k063q185o955M598M229
9737A62847O964K08M697O13n434N911L26N144n658j3330K87N155M038p789m236
9722A59743J173q066N313k536Q1K273J033J955q844n816J909R93Q618j926m728
9707A51175p660J0824J8897J1487J0414Q085K574J881j546J649k088K568q1n120
9693B03059q861r395m735j6640j5799o917J8411Q77j2042o066J0643J4973M123
$$ plain form
9795 199676 191537 196218 201940 198218 197767 193971 183709 181634 175274 179405 186654 190417 196581 191100
9781 191100 193586 192091 190799 192298 195286 195084 191272 186785 174535 172683 168230 169110 170659 174090 165925
9766 165925 159229 169425 170938 161955 164413 178698 176175 166342 173108 176675 172405 176116 171167 174107
9752 174107 180102 179508 171179 167061 167197 168745 163055 158268 164383 171223 169160 160975 154020 158618 162847
9737 162847 169811 170019 174716 175329 169895 175806 176132 181276 175618 162288 162575 167730 171768 163979 159743
9722 159743 160916 152850 158163 155627 155708 157981 159014 160969 152125 146309 148218 149211 157829 155903 151175
9707 151175 143515 154339 173236 184723 195137 203222 205796 207677 206131 207780 205692 208260 208179 203059
9693 203059 194198 184803 180068 163428 147629 140712 159123 160000 147958 141892 152535 167508 171631
9680A71631P78o323r080m980o146l048K279m89P782n540N25O723L485k484M774
9665A59887q169j2065q65M419N476O930R06n188J754L07p701o892J500J565K915
9650A44779K236n106J170K000j873l597j619O60J404J37n257k052k931p581N80
9635A22950N721q534L850M665l45M236l598K042J3282R057k804m197l226q069
9621A35030K556J990j4092l027O833J413j758l84q698P94Q144N794j561k047O792
9606A37779L836j794n733j525O370K506q295n63r887r5J2275R861J239M181l704
9591A46451k237J862O5j516k158o083Q366P94m584n17L805N916j3469l736K149
9576A35108J0325o385K15L144o15L214J244j858N578M94l982R682k444j253O894
$$ plain form
9680 171631 172409 166086 157006 152026 145880 142832 145111 144622 152404 146864 147389 154112 157597 155113 159887
9665 159887 151718 139653 138788 143207 148683 155613 156519 151331 153085 153392 145691 138799 140299 141864 144779
9650 144779 147015 141909 143079 145079 143206 139609 137990 138650 140054 140191 134934 132882 129951 122370 122950
9635 122950 128671 120137 123987 128652 128307 132543 128945 130987 144269 153326 150522 146325 143099 135030
9621 135030 137586 139576 125484 122457 129290 130703 128945 128561 119863 120657 128801 134595 133034 130987 137779
9606 137779 141615 139821 134088 132563 138933 141439 133144 132581 122694 122599 134874 144735 145974 150155 146451
9591 146451 144214 146076 146141 144625 142467 136384 144750 145544 140960 140443 144248 150164 136695 132959 135108
9576 135108 145433 139048 139263 142407 141792 145006 146250 144392 149970 150464 146482 156164 153720 152467 159361
9561A59361l85l10m726R075J2255K891J73m071L368P554L346k517j1679n036J1092
9546A80391J4009K948R611P484J0884P688J2307J8745J7489N183P992J1034N35
9533C06300L04p209k636j0945j9365j3103m945p26n166l007j632N738Q313o60
9519B51261J672P195J0774O409P719J980J3521J3089P509J6201K1623L2444L5242
9506D26639J6052J8769J9242J7083J9983K0427Q956M430J0582O983j4261q759
9494E46126N97j1693j6714j1416j8271j3122j1348j2032j5609m528j2637j4465
9482D04888n830N247K012k627N052K4235K7853J6738J2786R734J3920K5616M1702
9469E81326L5212J9633L0485K5776K2055J9725Q800Q560O533j0090j2338j2036
$$ plain form
9561 159361 158976 158666 153940 163015 175270 178161 178334 174263 177631 185185 188531 186014 174335 169299 180391
9546 180391 194400 197348 206959 214443 225327 233015 245322 264067 281556 286739 294731 305765 306300
9533 306300 306604 299395 296759 285814 266449 253346 248401 247675 242509 239502 237870 243608 251921 251261
9519 251261 252933 260128 270902 277311 285030 287010 300531 313620 321129 337330 358953 391397 426639
9506 426639 442691 461460 480702 497785 517768 538195 547151 551581 562163 569146 554885 546126
9494 546126 546723 535030 518316 506900 488629 475507 464159 452127 436518 431990 419353 404888
9482 404888 399058 404305 406317 403690 408742 432977 460830 477568 490354 500088 514008 539624 581326
9469 581326 616538 636171 666656 692432 714487 734212 743012 751572 758105 748015 735677 723641
9457G23641j7793k7553j9601k5002k7863k7411k6059k7547k2929p771j4219r381
9445D70512N019j020j6817p357j792k143J948P282Q196J6370J6305K5281J4700
9432E36484J8543J8312K3856J8431J0308N737k576n723q285j2620k6127k2032
9420E54308k1935j6891j7616j9674k6908k5049j6249r829j0119j2871k4597k4267
9408C28303j1923M532l500j297q207J183Q519J839O020J2111k993K128Q142J275
9394C46132J4843R218o663M761O498q210M310j0997j5919k0800j9197L853P078
9381C14907j1074j1494j6615r588j370J1297P722p095n797K694L163N253m825
9368B77178k038N422j985n642o688L844J750O0Q082K963J590J146r487r553K885
$$ plain form
9457 723641 705848 678295 658694 633692 605829 578418 552359 524812 501883 494112 479893 470512
9445 470512 475531 474511 457694 450337 448545 446402 448350 455632 463828 480198 496503 521784 536484
9432 536484 555027 573339 597195 615626 625934 631671 629095 623372 615087 602467 576340 554308
9420 554308 532373 515482 497866 478192 451284 426235 409986 400157 390038 377167 352570 328303
9408 328303 316380 320912 317412 316115 307908 309091 317610 319449 325469 337580 334587 336715 344857 346132
9394 346132 360975 370193 363530 368291 374789 366579 370889 359892 343973 323173 303976 307829 314907
9381 314907 303833 292339 275724 266136 264766 276063 283785 276690 270893 273587 276750 282003 277178
9368 277178 275140 280562 278577 272935 266247 270091 271841 271901 279983 282946 284536 285682 276195 266642 269527
9353B69527O036Q101k35j305N403J7941P815k176l558J4060J2310j437j820P4
9339C30736m329l561Q272N00k950j2404n657N800n468o00O570j502P505L734M811
9324C31457Q760N715K203n36N154J1349J4635J4636m443j5470N394R067n891L01
9310C82331J0709N501n58R018K262J031J1018O179K214M246n341R484N497N4J202
9295D44847O104r770L166J604j994P335K235l394J547L416J0389R914J7308J1059
9281E03766j085j375O044N502P684J2968J0842N844o386j798L164l724K211M369
9267E48026M29J2359K13r96J452Q391J7435J037p320K06J2543o786K427j910N245
9252E92751M904M086j2857O969J4044J9727P189J2115J7159M074J2754J1020R708
$$ plain form
9353 269527 275563 283664 283429 282124 287527 305468 313283 311107 307549 321609 333919 332482 330662 330736
9339 330736 326407 322846 331118 331618 328668 316264 310607 316407 310939 310339 316909 315407 322912 326646 331457
9324 331457 340217 345932 348135 347599 352753 364102 378737 393373 388930 373460 378854 387921 382030 382331
9310 382331 393040 398541 397983 407001 409263 410294 421312 427491 429705 433951 428610 438094 443591 443645 444847
9295 444847 450951 441181 444347 445951 443957 451292 453527 450133 451680 455096 465485 475399 492707 503766
9281 503766 502681 501306 507350 512852 520536 533504 544346 550190 543804 542006 545170 541446 543657 548026
9267 548026 548455 560814 561027 560031 561483 569874 587309 588346 581026 581232 593775 586989 589416 587506 592751
9252 592751 597655 601741 588884 595853 609897 629624 636813 648928 666087 670161 682915 693935 703643
9239G03643J62J076Q652k578L533M481M287L819K237J34R492j496j1018o075M405
9224G24754M291M97J686J0903o932K902O850j29J69J1880k094P083J1604J9300
9210G92764J3027K536Q133J298P88Q720P438J1382J4372J7096K1488J0150N181
9197I14373P631l475J2380J7250Q376Q817J4764K479L392L704J115N671J1038
9184A007515J6528J7821J7459K1736K4833J7277L1111K7256L2092K8258K7502
9173A269388K7303M7072M4034M7402N5916N7090N8720O6089O7820O9490R4073
9162A904397R8503J17922J29022J32351J60905K03414K57189K99610L62648M39819
9152D105780N43123O48524P66475Q84952J032747J193413J349712J495204J620375
$$ plain form
9239 703643 703805 704881 713533 710955 714488 718969 723256 727075 729312 729446 738938 737442 726424 720349 724754
9224 724754 729045 729542 731228 742131 735199 738101 744951 744822 744991 756871 754777 761860 773464 792764
9210 792764 805791 808327 816460 817758 818546 827266 834704 846086 860458 877554 899042 909192 914373
9197 914373 922004 918529 930909 948159 956535 965352 980116 982595 985987 989691 990806 996477 1007515
9184 1007515 1024043 1041864 1059323 1081059 1105892 1123169 1154280 1181536 1213628 1241886 1269388
9173 1269388 1296691 1343763 1387797 1435199 1491115 1548205 1606925 1673014 1740834 1810324 1904397
9162 1904397 2002900 2120822 2249844 2382195 2543100 2746514 3003703 3303313 3665961 4105780
9152 4105780 4648903 5297427 6063902 6948854 7981601 9175014 10524726 12019930 13640305
9143A3640305J722629J786433J727207J528993J191503P87800L43386r9847n03818
9134B2124591q37560j045964j120359j070521r50660p86536n83535l66863j42404
9125A5220189P7728L25882N73065Q17503J050908J301409J530412J781307K058275
9116B4736678K316540K581096K855335L101480L264193L334375L295901L149868
9108D8635466K926843K645837K331719K024335J740578J461831J124080P52618
9100F3643307L47358p0166m94348q88793j235525j518016j698407j748822j688788
9091E4647800j549133j335457j062971p34610l44675P1181M82600Q66728J265458
9082E2306921J649814K025041K397630K767120L111521L441021L720318L917585
$$ plain form
9143 13640305 15362934 17149367 18876574 20405567 21597070 22384870 22728256 22628409 22124591
9134 22124591 21287031 20241067 19120708 18050187 17099527 16312991 15729456 15362593 15220189
9125 15220189 15297917 15623799 16196864 17014367 18065275 19366684 20897096 22678403 24736678
9116 24736678 27053218 29634314 32489649 35591129 38855322 42189697 45485598 48635466
9108 48635466 51562309 54208146 56539865 58564200 60304778 61766609 62890689 63643307
9100 63643307 63990665 63920499 63426151 62537358 61301833 59783817 58085410 56336588 54647800
9091 54647800 53098667 51763210 50700239 49965629 49620954 49692135 50174735 51041463 52306921
9082 52306921 53956735 55981776 58379406 61146526 64258047 67699068 71419386 75336971
9074G5336971M057151M137307M126340M041879L833152L459614K876489K111542
9066A03980445J220877K27752q24193j872643k826144l568260m023398m248049
9058H8066387m274901m152136l903499l564691l152472k706136k277672j834054
9050F2200826j388542r43014m84833l1453M11678Q51745J291261J705185K087053
9041F5699906K407358K667701K839092K893988K829124K601645K231707J704010
9033H5874531J019739K34554n84136j415535k167123k816029l327368l662761
9025G3155872l843818l887398l822876l682177l489220l272651l044092k803664
9017D5309976k551449k299801k048471j783213j499028j205747q91834n70840
$$ plain form
9074 75336971 79394122 83531429 87657769 91699648 95532800 98992414 101868903 103980445
9066 103980445 105201322 105429074 104604881 102732238 99906094 96337834 92314436 88066387
9058 88066387 83791486 79639350 75735851 72171160 69018688 66312552 64034880 62200826
9050 62200826 60812284 59869270 59384437 59352984 59764662 60616407 61907668 63612853 65699906
9041 65699906 68107264 70774965 73614057 76508045 79337169 81938814 84170521 85874531
9033 85874531 86894270 87128824 86544688 85129153 82962030 80146001 76818633 73155872
9025 73155872 69312054 65424656 61601780 57919603 54430383 51157732 48113640 45309976
9017 45309976 42758527 40458726 38410255 36627042 35128014 33922267 33030433 32459593
9009C2459593k24040J40052M44380P22814R16227R86313R95172R15213O86762
9000C8042486L38639p2036m95062r10818j305189j645122j879211j998049k021878
8991B8053760j960624j834826j676116j516069j361609j240049j146332j064227
8983A6253908r96510r58137r28809q88998q48724p93566p36613o93436o43695
8974H765420n86481n17996m75936m21033l64215l22445k89272k43673k15156k05217
8964E123996j70974j47731j22186j15365j06956r4888q3649o4819o7905n9332
8954D090191m5231n1240m3364k9679k0005j1515l001M411L142Q712J5372K3983
8942C941776K1249L3059L7419N4514O2701Q8254R5869J08061J42279J59119J72015
$$ plain form
9009 32459593 32235553 32375605 32819985 33542799 34459026 35445339 36440511 37355724 38042486
9000 38042486 38381125 38309089 37814027 36903209 35598020 33952898 32073687 30075638 28053760
8991 28053760 26093136 24258310 22582194 21066125 19704516 18464467 17318135 16253908
8983 16253908 15257398 14299261 13370452 12481454 11632730 10839164 10102551 9409115 8765420
8974 8765420 8178939 7660943 7185007 6763974 6399759 6077314 5788042 5544369 5329213 5123996
8964 5123996 4953022 4805291 4683105 4567740 4460784 4365896 4282247 4217428 4149523 4090191
8954 4090191 4044960 3993720 3950356 3920677 3900672 3889157 3886156 3890567 3893709 3902421 3917793 3941776
8942 3941776 3963025 3996084 4033503 4088017 4150718 4238972 4334841 4442902 4585181 4744300 4916315
8931D916315K04276K31858K61677K94394L18204L22463L57805L77682L90561M03593
8921H078828M24481M36553M46494M62430M77160N03482N09248N35757N55606N57677
8911A2987716N91157O18136O49355O96737P60749Q31847Q88134R18869R04747
8902A9847447Q18589O90890N18855L12787J32448l9398j49280j92815j73987j02626
8892B1662910J3275J46192K68285L76690M69945N17199N24710M96744M47678L87842
8882B5311470L50125L24130L18414L45506M05517N13750O27776P64202R07977
8873B9868867J047135J169657J262377J300604J268065J195562J075003R00974
8865C9088244P21465N34457L42523J71275L694j45868k68511l97618n32532o44216
$$ plain form
8931 4916315 5120591 5352449 5614126 5908520 6226724 6549187 6906992 7284674 7675235 8078828
8921 8078828 8503309 8939862 9386356 9848786 10325946 10829428 11338676 11874433 12430039 12987716
8911 12987716 13578873 14197009 14846364 15543101 16303850 17135697 18023831 18942700 19847447
8902 19847447 20666036 21356926 21875781 22188568 22321016 22281618 22132338 21939523 21765536 21662910
8892 21662910 21676185 21822377 22090662 22467352 22937297 23454496 23979206 24475950 24923628 25311470
8882 25311470 25661595 25985725 26304139 26649645 27055162 27568912 28196688 28960890 29868867
8873 29868867 30916002 32085659 33348036 34648640 35916705 37112267 38187270 39088244
8865 39088244 39809709 40344166 40686689 40857964 40861658 40715790 40447279 40049661 39517129 38872913
8855C8872913p69983q51676r08829r45622r62302r29505q64291p50307o03244
8846C1287154m24222k21798j3428K07037M46009O96143R14220J087371J231144
8837C5209630J310619J307893J216680J059162Q22173N39058K29379o1043l36851
8828D1296700n76678p44674q70430r61873j012416j022006j026950j016155r73529
8819C3091989r31562q99838q38966p41521o77346o11225n65035n48207n44523
8810B6733766n54318n72228n92141n82505n37946m78211m02782l20492k37874
8801B2455269j68719j33780j09896j16447j31396j48718j70966j84544j94020
8792B1096783j80241j75535j77223j75309k05107k78143l57041m59806n72566
$$ plain form
8855 38872913 38102930 37251254 36342425 35396803 34434501 33504996 32640705 31890398 31287154
8846 31287154 30862932 30641134 30627706 30834743 31280752 31976895 32891115 33978486 35209630
8837 35209630 36520249 37828142 39044822 40103984 40926157 41465215 41694594 41633551 41296700
8828 41296700 40720022 39975348 39104918 38143045 37130629 36108623 35081673 34065518 33091989
8819 33091989 32160427 31260589 30421623 29680102 29002756 28391531 27826496 27278289 26733766
8810 26733766 26179448 25607220 25015079 24432574 23894628 23416417 23013635 22693143 22455269
8801 22455269 22286550 22152770 22042874 21926427 21795031 21646313 21475347 21290803 21096783
8792 21096783 20916542 20741007 20563784 20388475 20183368 19905225 19548184 19088378 18515812
8783A8515812o72303p64872q36616q88900q97624q80070q31251p75016p00441
8774A1268719o20410n26094m45103l56821k90430k15283j37341r5880p5513p2585
8764H433259r6550j17835j34747j53217j70965j74241j57151j44884j21432j09747
8754G052490j19752j42658j74616k12932k53642k96537l13001l22665l06868k93153
8744D616666k72068k48631k21632j91921j74106j51397j45937j28189j30300j13668
8734B838817q0312p9509p7251o9517o0782n2705m9203m7070m3773k7789j7636
8723B233270l0950m0520k4537k3234l6951k7701k2819j3242j7871j8922j8191
8712A958332m053k308r773k739o292p583P286J4897P581J3936K4394J7468P934
$$ plain form
8783 18515812 17843509 17078637 16242021 15353121 14455497 13575427 12744176 11969160 11268719
8774 11268719 10648309 10122215 9677112 9320291 9029861 8814578 8677237 8581357 8505844 8433259
8764 8433259 8336709 8218874 8084127 7930910 7759945 7585704 7428553 7283669 7162237 7052490
8754 7052490 6932738 6790080 6615464 6402532 6148890 5852353 5539352 5216687 4909819 4616666
8744 4616666 4344598 4095967 3874335 3682414 3508308 3356911 3210974 3082785 2952485 2838817
8734 2838817 2758505 2678996 2601745 2532228 2471446 2418741 2369538 2322468 2278695 2250906 2233270
8723 2233270 2202320 2161800 2137263 2114029 2077078 2049377 2026558 2013316 1995445 1976523 1958332
8712 1958332 1954279 1951971 1942198 1939459 1933167 1925584 1932870 1947767 1955348 1969284 1993678 2011146 2019080
8699B019080K9212L3294K4161J9538J5748J9353J4067J0762K7490J8584J1646
8688B242935L020Q449R491M600r459j23J288J2287M376n04N6J1165J1520J1755
8674B310856P372J5210J6060K3847K5689K1975M6571L7802L9313N0893M4679M0575
8662B680842M2719M2888L7246M3763L8334L7874L8461L4702L0175K2180K4080
8651C073264L1744J9437K2819L7499L5826K8860K9795L2246M0120M3961N5496
8640C451067M3289M8450N1665N8369M9321N0388O0150Q9292Q3831P4478Q1462
8629D141762P6299J05640J08209R2040R5008J09965J19536J11146J06150J15047
8619E180802J20403J29154J28237J30063J44151J43439J43511J59875J66474J69826
$$ plain form
8699 2019080 2048292 2081586 2105747 2125285 2141033 2160386 2174453 2185215 2212705 2231289 2242935
8688 2242935 2245955 2254404 2263895 2268495 2259036 2258913 2260201 2272488 2276864 2276360 2276416 2287581 2299101 2310856
8674 2310856 2318228 2333438 2349498 2373345 2399034 2421009 2467580 2505382 2544695 2595588 2640267 2680842
8662 2680842 2723561 2766449 2803695 2847458 2885792 2923666 2962127 2996829 3027004 3049184 3073264
8651 3073264 3105008 3124445 3147264 3184763 3220589 3249449 3279244 3311490 3351610 3395571 3451067
8640 3451067 3494356 3542806 3594471 3652840 3702161 3752549 3812699 3901991 3985822 4060300 4141762
8629 4141762 4218061 4323701 4431910 4523950 4618958 4728923 4848459 4959605 5065755 5180802
8619 5180802 5301205 5430359 5558596 5688659 5832810 5976249 6119760 6279635 6446109 6615935
8609F615935J80028J84688J98604J93891K07221K18424K23750K45348K56975K62772
8599H787636K73003K79062K98154L26128L37662L53581L75102L81437M05064L98522
8589A2215351M11301M16935M25232M33500M44600M58868M66937M69215M80222
8580A6222161M77172M83277M89602M92899M90484M90961M77661M64511M49372
8571B0538100M33588M10164L78677L55059L23644K89239K59586J99562J49913
8562B3337532R5803N2009O713m2214q8923j30532j78606k29290k62459k93808
8552B2266225l32860l65161l82784m06628m25191m45203m58317m55790m68017
8543A8526274m77772m76550m84902m87514m85059m78860m69322m75614m51754
$$ plain form
8609 6615935 6795963 6980651 7179255 7373146 7580367 7798791 8022541 8267889 8524864 8787636
8599 8787636 9060639 9339701 9637855 9963983 10301645 10655226 11030328 11411765 11816829 12215351
8589 12215351 12626652 13043587 13468819 13902319 14346919 14805787 15272724 15741939 16222161
8580 16222161 16699333 17182610 17672212 18165111 18655595 19146556 19624217 20088728 20538100
8571 20538100 20971688 21381852 21760529 22115588 22439232 22728471 22988057 23187619 23337532
8562 23337532 23433335 23485344 23492057 23449843 23360920 23230388 23051782 22822492 22560033 22266225
8552 22266225 21933365 21568204 21185420 20778792 20353601 19908398 19450081 18994291 18526274
8543 18526274 18048502 17571952 17087050 16599536 16114477 15635617 15166295 14690681 14238927
8534A4238927m36350m39360m27846m09447l89390l86234l69989l56336l56199
8525A0667776l34766l31523l10016k91989k92802k86851k75337k62823k55246
8516H026423k49217k40820k16381k04968j91495j99707j88745j78791j71537j60648
8506F024114j49923j46740j55465j58437j43956j34839j38880j34934j30139j25603
8496D605198j18146j15082j09949j06808q7429j03024j03631r2548q0128o5357
8486C623096p1688q3520o7183m9032n2494p2929p0795o0446n3069n0588n3134
8475B938218m9985l6526l8935m3478o1489m9812m4867l6654l2406m4682n1202
8464B448182m6280l9433m8983n9087m5134l0842k1742j8445j0947p951j3086j3937
$$ plain form
8534 14238927 13802577 13363217 12935371 12525924 12136534 11750300 11380311 11023975 10667776
8525 10667776 10333010 10001487 9691471 9399482 9106680 8819829 8544492 8281669 8026423
8516 8026423 7777206 7536386 7320005 7115037 6923542 6723835 6535090 6356299 6184762 6024114
8506 6024114 5874191 5727451 5571986 5413549 5269593 5134754 4995874 4860940 4730801 4605198
8496 4605198 4487052 4371970 4262021 4155213 4067784 3964760 3861129 3768581 3688453 3623096
8486 3623096 3551408 3467888 3400705 3351673 3299179 3226250 3155455 3095009 3041940 2991352 2938218
8475 2938218 2888233 2851707 2812772 2769294 2707805 2657993 2613126 2576472 2544066 2499384 2448182
8464 2448182 2401902 2362469 2313486 2254399 2209265 2178423 2156681 2138236 2127289 2119338 2106252 2092315
8452B092315k6896l9134m3446m3851l6206m1419n5808n1747l6284k5723j3316
8441A678485L415r341q473j1388n101K144j0736p028j4878j8991j2906j8401k6617
8428A540184k5872k7546k8881k4482l1772j2797j2422j8470q559j6528k5030k4830
8416A282995k4114j2730j3521k1328j5791l856j2831j8950r790r933j8582k3301
8404A098268j0841j908r967j5991j2908j5031j3646j816j2589j1122j7722j7385
8392I57342j4771o037r853j6920j4074r446j7367j2398m57j6617k0423j2911j3107
8379G92961j2849j5890j3923k251j2772r513p638J957l787j106N839J5273n789
8366G30512j1087o265k994j0545j4052j5419j7210m490J941n68k975m953j4410
$$ plain form
8452 2092315 2065419 2026285 1982839 1938988 1902782 1861363 1805555 1753808 1717524 1691801 1678485
8441 1678485 1681900 1672559 1664086 1652698 1647597 1649741 1639005 1631977 1617099 1598108 1585202 1566801 1540184
8428 1540184 1514312 1486766 1457885 1433403 1401631 1388834 1376412 1357942 1349383 1332855 1307825 1282995
8416 1282995 1258881 1246151 1232630 1211302 1195511 1191655 1178824 1159874 1150084 1140151 1121569 1098268
8404 1098268 1087427 1085519 1075552 1059561 1046653 1031622 1017976 1016160 1003571 992449 974727 957342
8392 957342 942571 936534 926681 909761 895687 886241 868874 856476 856019 839402 818979 806068 792961
8379 792961 780112 764222 750299 748048 735276 725763 718125 720082 716295 715189 721028 736301 730512
8366 730512 719425 713160 710166 699621 685569 670150 652940 648450 650391 649823 646848 641895 627485
8353F27485j0771j3455j1030j2309j4833j1747l305j530j5280o210m512j743j772
8340E18988n828j0905k725m899n202p98l331n060o164Q00q517j4178J063O240
8326D59484L340N890J5936Q306k65O698J0519l702p023j5202j5394j4174r778
8313D44635j5806J071L616l662J0040J663m348q755m199O51l62k740n766R598
8299D25636J7516K168Q768L0574M0874P1445J17364J89113J87925J10866N6171
8288A258420M8589K3447n5853j34840j61803j41504j07277p7825n5936k8531j4347
8277E52540j8113k3290m238j0509j7398k4455j9792j4835j3686j9311q500k920
8265C75493j5751r333j0608j285J0072k39K199M777J1167R832K4101L5648M5172
$$ plain form
8353 627485 616714 603259 592229 579920 565087 553340 550035 548505 533225 527015 522503 520760 518988
8340 518988 513160 502255 499530 494631 489429 488631 485300 480240 474076 474876 466359 452181 453244 459484
8326 459484 462824 468714 484650 492956 492691 499389 509908 506206 499183 483981 468587 454413 444635
8313 444635 428829 429900 433516 429854 439894 441557 437209 428454 424255 424906 424544 421804 416038 425636
8299 425636 443152 445320 454088 484662 525536 596981 714345 903458 1091383 1202249 1258420
8288 1258420 1307009 1330456 1274603 1139763 977960 836456 729179 651354 595418 566887 552540
8277 552540 534427 511137 506899 496390 478992 454537 434745 419910 406224 386913 378413 375493
8265 375493 359742 350409 339801 338516 348588 348349 350548 355325 366492 376324 400425 436073 481245
8252D81245Q8320J38510J77450J60088R3901M5412K8953j0846q0468j48437j49989
8241H24139j25176j02308p3276n1128k9072k6276k5778j9210k1529j3702j6347
8230C20337j8951m971p980n954n222n666r959q510p308k02k959m787j1390o101
8216B20377l30j1268j18r72m742L399o667j4904n1k299N819K249J298O008P235
8201B05034K386k149l825m245j2472q713L815M128j2044q044J2619J2312K856
8188A91658l121p622J17K691M264M242o936p506m623L508r608k890P129Q426p79
8173A78950j65o117r401J0194N840q088o483K322K909J621K423n603K345m467
8159A66280m190M364j5535j0507m885J0876J4215j409k131n876k158m867l87p101
$$ plain form
8252 481245 569565 708075 885525 1045613 1139514 1184926 1213879 1203033 1122565 974128 824139
8241 824139 698963 596655 523379 472251 443179 416903 391125 371915 350386 336684 320337
8230 320337 301386 296415 288435 282481 277259 271593 261634 253124 245816 245614 242655 237868 226478 220377
8216 220377 220047 208779 208661 207689 202947 206346 199679 184775 184724 182425 188244 190493 191791 197799 205034
8201 205034 207420 205271 201446 197201 184729 176016 179831 183959 171915 163871 176490 188802 191658
8188 191658 188537 180915 181032 183723 187987 192229 185293 177787 173164 176672 167064 164174 171303 179729 178950
8173 178950 178785 172668 163267 173461 179301 171213 164730 167052 169961 171582 174005 168402 170747 166280
8159 166280 162090 166454 150919 140412 135527 146403 160618 159209 157078 151202 149044 144177 143790 136689
8145A36689L563m25J707M301l971j2923J904L550j81K247K000k227J986L266r428
8130A32058q839k751Q695k692n343O674N17l235j217j738k154l976l825l020m092
8115A05062R293J0011N52m685J228l724J131M129o02L719k300L539l959k677K080
8100A22797k678L453J0249J3633Q48j6246j1466K723J894j0967j1706O384M555
8087A13473O170r09L954l455n67n555j982O982N440o917q757q995J166M192K665
8072A06905n11o464M902M630j0563M637O40q982j348L230l100n214Q851J2571
8058A10184J0763N875N53l426J746K307J437l826N191K408j132n722o602n386
8044A14370j975Q026j592J934n016J052O395m128J46n71j1923M901J1875l112
$$ plain form
8145 136689 140252 139827 141534 145835 141864 128941 130845 134395 134214 136461 138461 136234 138220 141486 132058
8130 132058 123219 120468 129163 126471 121128 127802 128319 125084 123867 122129 119975 115999 112174 109154 105062
8115 105062 114355 124366 124918 120233 121461 117737 118868 122997 122395 126114 123814 127353 123394 120717 122797
8100 122797 120119 123572 133821 147454 148302 132056 120590 123313 125207 114240 102534 108918 113473
8087 113473 119643 118734 122688 119233 118666 113111 111129 118111 123551 116634 107877 98882 100048 104240 106905
8072 106905 106394 99930 104832 109462 98899 103536 104176 95194 93846 97076 93976 88762 97613 110184
8058 110184 120947 126822 127375 123949 125695 128002 129439 125613 130804 133212 132080 126358 119756 114370
8044 114370 112395 120421 118829 120763 115747 116799 123194 119066 119212 118641 106718 111619 123494 120382
8030A20382N904O966m031n726j0231P990J0200q03p288k101n296J023k634j0466
8016A03889n853m149o048J4269J4782m614k395j068k455N544N496J932p785O872
8002A18417O444K499j582n740j337J94O750L594J3771O829o790n442r758J99N200
7987A33248K067J369J4950M574r15r234j404p034j3584R85N95q752o442j39j629
7972A08655N168p007l92O925q668O591O135n537J293k756m893J172R797J846j0551
7957A07778o048K468M92K424O310Q909j219K32K74K37K351j7486j4312J0193L111
7942A05714Q598O76q52j240O778O504j5583l373J669l921n263m963n877j2090
7928G6777J643Q91K919L679l538o628M681O448r987n628K693J442l617p580m303
$$ plain form
8030 120382 126286 133252 129221 123495 113264 121254 131454 130651 123363 121262 115966 116989 114355 103889
8016 103889 98036 93887 87839 102108 116890 112276 109881 108813 106358 111902 117398 119330 111545 118417
8002 118417 124861 127360 125778 120038 118701 118895 125645 129239 143010 149839 143049 137607 127849 128048 133248
7987 133248 135315 136684 151634 156208 155293 146059 144655 137621 124037 125022 125617 116865 110423 110284 108655
7972 108655 113823 106816 106424 113349 104681 111272 117407 111870 113163 110407 105514 106686 116483 118329 107778
7957 107778 101730 104198 104690 107114 113424 122333 121114 121346 121620 121857 124208 106722 92410 102603 105714
7942 105714 114312 114988 114136 112896 119674 126178 110595 107222 108891 104970 99707 94744 88867 76777
7928 76777 78420 79311 82230 85909 82371 75743 80424 86872 76885 71257 73950 75392 71775 64195 59892
7913E9892r17R437M202j376q058j995P735J4239p27m880l484l332K485j543L401
7898G5079N002n700r235l280R447J0952m801N000J2694J4512K782r094m661j186
7884I7511L66j884J119j5740o012m314j1392L7K332N35L135M934m329o498J513
7869F1313J647k196J308k617K819Q542K367n112m727L192N953M744j373r976j304
7854F4580k960J1404j888K388L246J1028R174j20l39m94P665q250j5138j401P62
7839G9657J054m920n682n993m790J694J763j671M877R01o370l00O938J050K125
7824G0333L685p245m992n55k859L837q129j2761l397j680J849K02j737Q966Q941
7809E4458K268L327K227m311j200m376j2731N89J3548K236r109m805l715K486
$$ plain form
7913 59892 58975 68412 72614 71238 63180 61185 68920 83159 82432 77552 74068 70736 73221 71678 75079
7898 75079 80081 74381 65146 61866 71313 82265 77464 82464 95158 109670 112452 103358 98697 97511
7884 97511 97877 95993 97112 81372 75360 71046 59654 59691 62023 62558 65693 70627 66298 59800 61313
7869 61313 62960 60764 62072 59455 62274 70816 73183 68071 63344 66536 72489 77233 75860 65884 64580
7854 64580 61620 73024 71136 73524 76770 87798 96972 96852 96513 96019 103684 95434 80296 78895 79657
7839 79657 80711 75791 70109 64116 59326 61020 62783 61112 65989 66890 60520 60220 67158 68208 70333
7824 70333 74018 66773 61781 61226 58367 62204 54075 41314 37917 36237 38086 38288 36551 45517 54458
7809 54458 56726 60053 62280 57969 56769 52393 39662 40251 53799 56035 46926 42121 38406 40892
7795D0892O88N422L516p829N723j066m285R316M151j0514j3759n479n36p51N142
7780C0631P559j132q041m754J2499l323l473O907j39L133R750J349j3205R05M472
7765D3138J627l992q064q009j913j810N537J0531O755l859j934M639q382j1794
7751B2470P733j559n323Q150Q473J745k951N815Q971l208q581j156j62Q058r367
7736C9108K306J033j0712l977o681l424j021K699K558m40l399P290P973j0094
7722B3219L718L97k79M306o632j925M669j392o90N239M527j23M124L159j709j347
7706C9261O37p814p594j4097Q801Q134J1641P872J51j0392l305l566j791k789
7692B5149p114m416k734L598R59j419k107J370N802J192N794P94J188j0145M309
$$ plain form
7795 40892 41580 47002 50518 42689 48412 47346 43061 52377 56528 46014 32255 26776 26240 25489 30631
7780 30631 38190 37058 29017 24263 36762 33439 29966 36873 36734 39867 49617 50966 37761 38666 43138
7765 43138 44765 40773 32709 24700 22787 20977 26514 37045 43800 39941 38007 42646 34264 22470
7751 22470 30203 28644 23321 31471 39944 41689 38738 44553 53524 50316 41735 40579 40417 48475 39108
7736 39108 41414 42447 31735 27758 21077 17653 16632 19331 21889 21449 18050 25340 33313 23219
7722 23219 26937 27334 27055 31361 24729 22804 27473 26081 25391 30630 35157 35034 39158 42317 40608 39261
7706 39261 39898 32084 24490 10393 19194 27328 38969 46841 46992 36600 33295 29729 27938 25149
7692 25149 18035 13619 10885 14483 15442 14023 11916 13286 19088 20280 26074 26868 28056 17911 22220
7677B2220O433p41K66K129K258N195L629k406k664k594j3820l063J531M241M400
7662B7014P584R897r325K175k544j3376j0206M873R821M633k950j850k817j3396
7648I533l833J962P714R057J5537K968l018r333j0727K561j256o61p705j867p209
7633C723k000Q653O211R223J0537l449k940r66N369m470m866J3324k066l55J2889
7618D8817M025r768m10o712j0087k717J197Q74Q44N926m967r480K027k811o88
7603A6070m934l61o52J3904K306j719l979l783m553L553J5705J906J15P88M30
7588C4796n332n884m466k21q787J57J1523o171o822O832M760l688K779K722j241
7573B0957l926K276N546j264j785p74j103j913q22p100l412J036J2676O702Q628
$$ plain form
7677 22220 28653 27912 28178 30307 32565 37760 41389 38983 36319 33725 19905 16842 18373 22614 27014
7662 27014 34598 44495 35170 37345 34801 21425 11219 16092 25913 30546 27596 25746 22929 9533
7648 9533 5700 7662 15376 24433 39970 42938 39920 30587 19860 22421 21165 20504 12799 10932 3723
7633 3723 1723 10376 16587 25810 36347 32898 29958 28992 34361 29891 25025 38349 36283 35928 48817
7618 48817 52842 43074 42664 35952 25865 23148 24345 25219 26063 31989 27022 17542 19569 16758 16070
7603 16070 11136 10775 10123 24027 26333 24614 20635 16852 12299 15852 31557 33463 33578 34366 34796
7588 34796 29464 23580 19114 18893 10106 10263 21786 15615 8793 15625 20385 16697 19476 22198 20957
7573 20957 17031 19307 24853 23589 21804 21030 19927 18014 17192 10092 6680 7716 20392 27094 35722
7558C5722N22j3413j776k148N935J11p734p873j0308P322L721P863K723M235P874
7543C2776M006Q45j5210J46R066J32p239o837j769k132M4j687j2515o589P390
7528D27o424Q7K409m064K88R303R254J2769R804M220q075p032L718J979m256o350
7512A8057K24j607n422l255R88N409K326Q47r39n141l598k002M933J4991j2308
7497A3503J50J2574M717r529j1693l31J485L322O398Q484K746M787K192K891o481
7482C5215r476o745P55j616M260O166L499o922j0605p885P400M68l79R113o965
7467A6283k867P773m686o971n762O675L468J0008J925o633Q597O314r425o194
7453A8505Q484P121j83j0076j649N041j2774K741N997n211j612j748q805n270
$$ plain form
7558 35722 36244 22831 21055 18907 24842 24953 17219 9346 -962 6360 10081 17944 20667 24902 32776
7543 32776 36782 37627 22417 22563 31629 31761 24522 17685 15916 13784 13828 12141 -374 -6963 427
7528 427 -5997 -5910 -3501 -7565 -7277 2026 11280 24049 33853 38073 29998 22966 26684 28663 24407 18057
7512 18057 18281 16674 11252 7997 8985 14394 16720 17567 16628 11487 7889 5887 10820 25811 13503
7497 13503 13653 26227 30944 21415 9722 9391 10876 14198 20596 29080 31826 36613 38805 41696 35215
7482 35215 25739 18994 19749 18133 22393 28559 32058 25136 14531 6646 14046 14514 14135 23248 16283
7467 16283 13416 21189 16503 9532 3770 10445 13913 23921 25846 19213 27810 34124 24699 18505
7453 18505 26989 34110 33927 23851 22202 27243 14469 17210 23207 17996 16384 14636 5831 561
7439E61L240J5871Q710r705m131O104M418Q298r515j434Q041l030l975q795j2731
7424A927q144K735N562N705q14k042j633L83P013Q551m587j103k976n676Q033
7409A2934P243K554N249k310j694J875J988n617n157k039o634r886m073K090Q267
7394D790Q923N134L804J486m36L671K8l103r388l700R66J1038k766p825n739J817
7378H700N494K420j237N637K105L498J28O95Q628J0536j0248m798m077p761o83
7363A9037R876p494o384J03k47o489k632N578M501l142r446l165p388Q8R716j389
7347A123K235J5170O5j0077r489o632O641J3480j0425m057k382K127n91O010J2705
7332A5903o027l042j784L219O787l930q119O91M482L831j0130k737L583L595J0154
$$ plain form
7439 561 3801 19672 28382 18677 14546 20650 25068 33366 23851 22417 30458 27428 23453 14658 1927
7424 1927 -6217 -3482 2080 7785 6971 4929 3296 3679 10692 19243 14656 13553 10577 4901 12934
7409 12934 20177 22731 27980 25670 23976 25851 27839 22222 17065 15026 8392 -1494 -5567 -3477 4790
7394 4790 13713 18847 22651 24137 23701 27372 27400 24297 14909 11209 12175 23213 20447 12622 6883 8700
7378 8700 14194 16614 15377 21014 23119 26617 26745 27440 36068 46604 36356 31558 27481 19720 19037
7363 19037 28913 21419 15035 15138 14891 8402 5770 11348 15849 12707 3261 96 -7292 -7204 2512 1123
7347 1123 3358 18528 18593 8516 -973 -7605 -964 12516 2091 -1966 -4348 -2221 -2812 3198 15903
7332 15903 9876 6834 5050 8269 15056 11126 3007 3698 8180 12011 1881 -856 2727 6322 16476
7317A6476J1356J5332l459j0593n078O700l824j0338j0203j2120l645J1369P880
7304I853q972j601k767j000P646k915j220L517J1160R971q059m243r857J624J0355
7289A3492P616o761j1243o493J0116k490m403N943J0461K051o336L682O422k351
7275A9706o253m973m332n14J1943j153q912p274o4J352o434J1349Q873K705m61
7260A5558m645l409o810M104J004o138J0117m35M854N612L15R63l392J05M717
7245B2520J507j132L677l407K163J0241k021o09n795o325j2127J288r25k111L765
7230A0709o784l09O613k534j786P698N292m416m193M944j441p384N625Q744J59
7215B0937L16r477L946M752k796o870M083r056l162J0304J0282j750o774m534
$$ plain form
7317 16476 27832 43164 39705 29112 24034 30734 26910 16572 6369 -5751 -9396 1973 9853
7304 9853 881 -720 -3487 -4487 3159 244 -976 2541 13701 23672 15613 11370 1513 3137 13492
7289 13492 21108 14347 3104 -3389 6727 4237 -166 5777 16238 18289 11953 15635 22057 19706
7275 19706 13453 8480 4148 3634 15577 14424 5512 -1762 -1826 -474 -6908 4441 13314 16019 15558
7260 15558 10913 7504 694 4798 5802 -336 9781 9346 14200 19812 20127 21090 17698 17803 22520
7245 22520 24027 22895 26572 23165 25328 35569 33548 32939 27144 20819 8692 9980 9055 6944 10709
7230 10709 3925 3616 10229 7695 5909 13607 18899 14483 10290 15234 13793 6409 12034 20778 20937
7215 20937 21253 11776 15722 20474 17678 10808 14891 5835 2673 12977 23259 21509 14735 10201
7201A0201q03J279L728k001o477k631L433l83m917O689k579j1941k831k31K848
7186f616M088N524K824m989k453J2687o53k826j2909K695O459Q372n687j4490
7172g974j694n80O389J2628k702p651j594K934j659o05p649J4909n639p552O994
7157a445l749k173k817K737O4n42M618k456Q655P79o37N449O36k153L76K520K607
7140A2469l449P032R659R22l485o462l341p29Q321m548p106R064m012p579K051
7125H807r086j2319n92J2260j812M514L856l188L450J504K965q601k744J1287
7111A0301O618n574o856L346J506N22o270l408k149j0653L653J744l616J663L966
7096e207N878R768j311p981j062J51m043J2516N299J621P197k040j1290l363O285
$$ plain form
7201 10201 9398 10677 14405 12404 5927 3296 6729 6346 1429 8118 5539 -6402 -9233 -9464 -6616
7186 -6616 -2528 2996 5820 831 -1622 11065 10412 7586 -5323 -2628 3831 12203 6516 -7974
7172 -7974 -9668 -10248 -3859 8769 6067 -1584 -3178 -244 -1903 -2508 -10157 4752 -887 -8439 -1445
7157 -1445 -5194 -7367 -10184 -7447 -7383 -7925 -3307 -5763 2892 3671 3034 8483 9119 6966 7342 9862 12469
7140 12469 9020 16052 25711 26633 23148 16686 13345 12616 20937 16389 9283 18347 14335 6756 8807
7125 8807 -279 -12598 -13190 -930 -2742 1772 5628 2440 5890 7394 10359 1758 -986 10301
7111 10301 16919 11345 4489 7835 9341 9863 3593 185 -1964 -12617 -8964 -7220 -10836 -9173 -5207
7096 -5207 671 10439 9128 1147 85 236 -3807 8709 14008 15629 22826 20786 9496 6133 12418
7081A2418R215l570l707j664K271J070J439p674j1282o683k467M73J0610L296
7067C745K202j283K044l913m422o68Q92l580l368N646j761l62K081M757m390m600
7051f980N532M281N890o02l515M149O51P65M352q075L73L614L936k046O333l25
7035A8333J745j3554m085Q063q91M663J828p369k032P310l262j0771r426M391
7021e057M483j7745J797R200O651r59k108L458N054J747K904K255j381q322l010
7006a033J0105J3O997O809P099l355n273o09q787O08m292k127l178j3918j825
6991a2766J482N406k636o153Q79K06O177L148L642k725M585L748J110O762N495
6976A8360J384l44n710o253l052m4J798L197L749j35j000k925k562J608M899n800
$$ plain form
7081 12418 21633 18063 14356 12692 14963 16033 17472 9798 -1484 -8167 -10634 -10161 449 3745
7067 3745 5947 4664 6708 2795 -1627 -2295 -1403 -4983 -8351 -2705 -4466 -4828 -2747 2010 -2380 -6980
7051 -6980 -1448 2833 8723 8121 4606 8755 9406 10171 14523 6448 6821 10435 14371 12325 18658 18333
7035 18333 20078 6524 2439 10502 9611 14274 16102 8733 6701 14011 10749 -22 -9448 -5057
7021 -5057 -574 -18319 -16522 -7322 -671 -1630 -3738 -280 4774 6521 9425 11680 10299 1977 -1033
7006 -1033 9072 9085 16082 22891 29990 26635 21362 20753 11966 12574 8282 6155 2977 -10941 -12766
6991 -12766 -11284 -5878 -8514 -14667 -13788 -13582 -7405 -4257 -615 -3340 1245 4993 6103 12865 18360
6976 18360 19744 19400 13690 7437 4385 4341 6139 9336 13085 12950 11950 9025 6463 8071 12970 7170
6960G170p694K980O872P688O432o568j3932r878n663M741Q809K41j2915J901O855
6945b961R886q32j379K116P777J633n593n113l360K789M329n86j581j082j996
6930D047l953l779L776J0179k485o286m60Q95O72J0902Q991n00l349m041J632
6915A6241q243j1095k33M434J0991N521q170k973N404k770l610r310k352k045
6901h210P096J5083J0404j2305m998n66j495P223K441l326Q600m946l831r237
6887A933j778L632K392N812P19j666m155J714r690J584j196R50J275M633k9p043
6871i13L941n539k0429q630q370n992j574P656J1051R322k263o01Q871O188P975
6856F93K933J1647M792r311K626o793n844N558M089j1339K968R203p33p511j0257
$$ plain form
6960 7170 -524 2456 9328 17016 23448 16880 2948 -6930 -12593 -7852 957 1198 -11717 -9816 -2961
6945 -2961 6925 6093 4714 6830 14607 16240 10647 5534 2174 4963 9292 8706 7125 6043 4047
6930 4047 94 -3685 91 10270 7785 1499 1039 1934 2606 13508 22499 21999 18650 14609 16241
6915 16241 7998 -3097 -3330 1104 12095 17616 9446 6473 11877 9107 5497 -3813 -6165 -8210
6901 -8210 -1114 13969 24373 12068 7070 6504 5009 12232 14673 11347 19947 15001 11170 1933
6887 1933 155 3787 6179 11991 12710 11044 6889 8603 -1087 497 -699 251 1526 6159 6130 -913
6871 -913 3028 -2511 -22940 -31570 -39940 -45932 -47506 -39850 -28799 -19477 -21740 -22341 -13470 -7282 693
6856 693 3626 15273 20065 10754 13380 6587 743 6301 10390 -949 2019 11222 10489 2978 -7279
6841g279l44J3784Q729k791k559k297o874M179j176n840l449J0429Q606o665J234
6826G687K178K475j559o420j0336j214K915P750l279j1107o212j435J0320l655
6812a1892Q420L404r000n436K921N303P6j50M556L255j3012k395K2702M718m267
6797I203m528l93R98m455L702r479l095J3972o618l919K379O790J3072m654l417
6782I558o004j4748L25K892K701K660j830j810q78J557n779l993P173J459k195
6767h912k73N008m818J2990N538n068Nj1284n54P439L472j171r166L997L481j941
6751a257M849J0088k525p921r708j1091J0300Q584P057M967k737k711o261j346
6737B88o044L939j226q541j113K527Q155K721n408J683K400K791q690M021J5861
$$ plain form
6841 -7279 -7623 6161 14890 12099 9540 7243 369 4548 3372 -2468 -5917 4512 13118 6453 7687
6826 7687 9865 12340 10781 4361 -5975 -7189 -4274 3476 197 -10910 -17122 -18557 -8237 -11892
6812 -11892 -3472 -68 -9068 -14504 -11583 -6280 -6204 -6354 -1798 1457 -11555 -13950 8752 13470 9203
6797 9203 4675 4282 5280 825 4527 -4952 -8047 5925 -693 -4612 -2233 4557 17629 12975 9558
6782 9558 3554 -11194 -10869 -7977 -5276 -2616 -4446 -6256 -7134 -5577 -11356 -15349 -8176 -6717 -8912
6767 -8912 -9185 -4177 -8995 3995 9533 4465 4470 -6814 -7368 71 3543 2372 -6794 -2797 684 -1257
6751 -1257 3592 13680 11155 3234 -6474 -17565 -7265 1319 8376 13343 10606 7895 1634 288
6737 288 -5756 -1817 -3043 -11584 -12697 -10170 -2015 706 -4702 -3019 -619 2172 -6518 -2497 13364
6722A3364j007n780pp69Q634J353K421o350q770P823M857o141M665N884l801j5373
6706A003j0287k880r02N399l49m068P006J5307l751p245O653J685m266q65j2369
6691i929m891J640O470O856l878k416R2K764p344j585p320M874O649P46P27J434
6675e111P228J409l763l75J1936p61r185q057K858L225N817k422j875J758J2012
6660A4694p515o872P561Q378j1p466j1096n894k908P931M215k27J486Q212R88
6645A1476K349M537m576p728q042M038m516j402J1251P040j0645k440N192n132
6631A402o887l049L768P392J856M091O360j0225q022p897n777L054M145L867K51
6616e671K447M992M106l396l472j0639j3245o07Q624M579J870L885K08k00P760
$$ plain form
6722 13364 12357 6577 6570 5801 14435 15788 18209 11859 3089 10912 15769 9628 14293 20177 16376 1003
6706 1003 -9284 -12164 -13066 -7667 -8016 -12084 -5078 10229 6478 -767 5886 7571 3305 2440 -9929
6691 -9929 -14820 -13180 -6710 146 -3732 -6148 -6056 -3292 -10636 -12221 -19541 -14667 -8018 -7272 -6545 -5111
6675 -5111 2117 3526 -237 -612 11324 10563 1378 -6679 -3821 -596 5221 2799 924 2682 14694
6660 14694 7179 307 7868 16246 16235 8769 -2327 -8221 -11129 -3198 1017 790 2276 10488 11476
6645 11476 13825 18362 13786 6058 -1984 2054 -2462 -3864 7387 14427 3782 1342 6534 1402
6631 1402 -5485 -8534 -4766 2626 4482 8573 14933 4708 -3314 -11211 -16988 -13934 -9789 -5922 -5671
6616 -5671 -3224 1768 5874 2478 -994 -11633 -24878 -25485 -16861 -12282 -10412 -6527 -6319 -6519 1241
6601A241N973k659N591k457l357L54r646o11R183p4j1445J011P299m834n83N568
6585E54K193K244O935J0657M619p255p715n054l621m023j900K817p520j81K238
6570e012J0908m199l434M620l054L812N666q381m271m31Q031L268K69J348K301
6555A1441J971k301o620j1444j0555O746L851k608J075J361j0105M838J1735J446
6541H31l007Q063L478nm123o178j877k474q037M793O323l075L842L136N351J5056
6525B2097L224o157r942M034k952m738k854P668K419n446j6L180j1224m060P674
6510B907K982m710k370P242Q699l117q525l453o08n054J899K497J442N805L468
6495I104J497n553m399Q662r124n962Q941K725O33o064r128L631k377M734Q450
$$ plain form
6601 1241 7214 4555 10146 7689 4332 4686 -4960 -5571 3612 3538 -7907 -6896 403 -4431 -5014 554
6585 554 2747 4991 11926 22583 27202 19947 12232 7178 3557 -466 -2366 451 -7069 -7250 -5012
6570 -5012 5896 1697 -1737 2883 -171 3641 9307 926 -3345 -3776 4255 7523 7792 9140 11441
6555 11441 13412 11111 4491 -6953 -17508 -10762 -6911 -9519 -8444 -7083 -17188 -12350 -615 831
6541 831 -2176 5887 9365 9360 5237 -941 -2818 -5292 -13329 -8536 -2213 -5288 -1446 1690 7041 22097
6525 22097 25321 19164 9222 13256 10304 5566 2712 10380 12799 7353 7337 10517 -707 -4767 2907
6510 2907 5889 1179 -1191 6051 14750 11633 3108 -345 -953 -6007 -4108 -1611 -169 5636 9104
6495 9104 10601 5048 649 9311 187 -5775 3166 5891 6524 460 -8668 -5037 -7414 -2680 5770
6480E770J133L148l930j405P70r963L65J381K644q91J1856K091l334j215k689
6465E731n199m080p276M769R932L981P295n092o606r585l974K017j0061O07L284
6450a4257j481K945J1174P238k408K542l285r425n653J909j011N743L774P083
6436D888M543K075k176j042q281j338o356j2740o104l732J814M962P535J0639
6422e313K967M795M664M789q117n273M823k191j245k971l050k235K15q206k092
6407a8440L696L497J1200M335p489p193P227M187K798j18m174N754o641l288J961
6392b688J068R595n93j4135K302M504N15l832k633L699O215L139j936p64n136
6377f80m891l587K905n244j343K462n19J077J4117j473q571J723J2231O129o509
$$ plain form
6480 5770 6903 10051 6121 4716 5486 -4477 -4112 -2731 -87 -978 10878 12969 9635 8420 5731
6465 5731 532 -3548 -10824 -6055 3877 7858 15153 10061 3455 -6130 -10104 -8087 -18148 -17541 -14257
6450 -14257 -15738 -12793 -1619 5619 3211 5753 2468 -6957 -12610 -10701 -11712 -5969 -2195 4888
6436 4888 9431 11506 9330 8288 7 -1331 -7687 -20427 -26531 -30263 -28449 -23487 -15952 -5313
6422 -5313 -2346 2449 7113 11902 3785 -1488 3335 1144 -101 -3072 -6122 -8357 -8142 -16348 -18440
6407 -18440 -14744 -11247 -47 4288 -3201 -10394 -3167 1020 3818 3700 -474 5280 -1361 -4649 -2688
6392 -2688 -1620 7975 7382 -6753 -4451 53 568 -3264 -5897 -2198 4017 7156 5220 4456 -680
6377 -680 -5571 -9158 -6253 -11497 -12840 -10378 -10897 -9820 4297 2824 -5747 -4024 8207 14336 7827
6362G827p326n469j764j164j364J563l303q520M036N851J0671J1679n939k431
6348D347j7475P61K142K335J316M675m483J717M292k739L771M189O307L211m22
6333A3944n142K347n06p439l920k672L255J566Q256o32Q180L204m104q6l163m324
6317H764L527N574j6050r327p993m434M3Q91J496O476l54M766r19m33P628M399
6301D054r272j0853K391R457N126O668l80l59j4691M612J1385r38r295m247L499
6286b843P055O404m172j1018j6811j025P664N994N520l758q547K98O527O24p502
6271a5590r833Q032N520O105J823L570O580l970K449q714q409K15N345o55j17
6256g649J0646j017o556q559k414K503R525j0016j0712K116j131J559Q358K441
$$ plain form
6362 7827 501 -4968 -6732 -7896 -9260 -7697 -11000 -19520 -15484 -9633 1038 12717 6778 4347
6348 4347 -13128 -12367 -10225 -7890 -6574 -1899 -6382 -4665 -373 -3112 659 4848 11155 14366 13944
6333 13944 8802 11149 10643 3204 -716 -3388 -133 1433 9689 9057 17237 20441 16337 16251 13088 8764
6317 8764 12291 17865 1815 -7512 -15505 -19939 -19896 -19005 -17509 -11033 -11387 -6621 -7540 -7973 -345 4054
6301 4054 -5218 -16071 -13680 -4223 903 7571 7191 6832 -7859 -3247 8138 7200 -2095 -6342 -2843
6286 -2843 4212 10616 6444 -4574 -21385 -22410 -14746 -8752 -3232 -6990 -15537 -15239 -8712 -8088 -15590
6271 -15590 -25423 -17391 -11871 -5766 -3943 -373 6207 2237 4686 -4028 -12437 -12222 -6877 -7532 -7649
6256 -7649 2997 1980 -4576 -13135 -15549 -13046 -3521 -13537 -24249 -22133 -23264 -21705 -13347 -10906
6242a0906m130O963l556p089L847j704k151N911k616r727O062R470N804J1984
6228H162K2o839J077N7O024k980j0877R75J0133l966p251j183N802K599l155j0623
6212a2023k714O262M089k382m31Q85r684J175O845o086o461Q718L631o133j2150
6197b6459k321J2301J2113J386P83J789j891J343l100j4120p205L772m189J0526
6183a5272J5141j342j2606M425J1164M677K685m29q107n482N308M413o983j2912
6169a5320K210Q690L519m450m892M932J0296j57j6779j4176J5348N148j1639L615
6155a3655O046o882k925l514M983J3278M117l394J334M059K484k22K716m074o849
6140b498j0953J012J688m197K530O301N321l40M174q891j0514P19M953q79L960
$$ plain form
6242 -10906 -15036 -8073 -11629 -18718 -14871 -16575 -18726 -12815 -15431 -25158 -19096 -9626 -3822 8162
6228 8162 8184 1345 2422 2479 8503 5523 -5354 -4379 5754 1788 -5463 -6646 -844 1755 -1400 -12023
6212 -12023 -14737 -8475 -4386 -6768 -7199 -6314 -15998 -14823 -7978 -14064 -20525 -11807 -8176 -14309 -26459
6197 -26459 -28780 -16479 -4366 -2980 -2197 -408 -2299 -956 -4056 -18176 -25381 -21609 -25798 -15272
6183 -15272 -131 -1473 -14079 -9654 1510 6187 8872 8443 336 -5146 162 4575 -2408 -15320
6169 -15320 -13110 -4420 -901 -5351 -10243 -5311 4985 4828 -11951 -26127 -10779 -5631 -17270 -13655
6155 -13655 -7609 -14491 -17416 -20930 -15947 -2669 1448 -1946 -612 3447 5931 5709 8425 4351 -2498
6140 -2498 -13451 -12439 -10751 -14948 -12418 -6117 -796 -1136 3038 -5853 -16367 -15648 -10695 -11574 -7614
6125g614l015M476k420p464j952J364J1848J2040n701j302j0078J401J4770m491
6111A862j0047q60J018j492M579J500j580O022O806J752L429j2362r823O09l929
6096a2516l537M483Q970m771J832K970P082J211m665j430j2495o43K463j483M68
6081a2061L709L024L88j668j6502m748J4946K145j90q258K928J66M803O415L541
6066a362P023Q719K989m091j7427p015R234N272N384j3460n336K050L008k238
6052g250Q85q40K838L343N986n019k758M528O092q108l878R33M68K058n595l413
6036i730q797l887J084J4408O532r206n05M532P377Q875r310o105j731p250N919
6021g794K21j4198l177P307J2019M480p257q690J559J2058J64m02N37M169P635
$$ plain form
6125 -7614 -10629 -6153 -8573 -16037 -17989 -16625 -4777 7263 1562 260 -9818 -8417 6353 1862
6111 1862 -8185 -9045 -8027 -9519 -4940 -3440 -5020 1002 7808 9560 12989 627 -9196 -8587 -12516
6096 -12516 -16053 -11570 -2600 -7371 -5539 -2569 4513 5724 1059 -371 -12866 -13509 -11046 -12529 -12061
6081 -12061 -8352 -5328 -4940 -6608 -23110 -27858 -12912 -10767 -10957 -19215 -16287 -16121 -11318 -4903 -1362
6066 -1362 5661 14380 17369 13278 -4149 -11164 -1930 3342 8726 -4734 -10070 -8020 -5012 -7250
6052 -7250 -6365 -7205 -4367 -1024 4962 -57 -2815 1713 7805 -303 -4181 -3248 -2780 -722 -6317 -9730
6036 -9730 -18527 -22414 -21330 -6922 -390 -9596 -10101 -5569 1808 10683 1373 -4732 -6463 -13713 -7794
6021 -7794 -7573 -21771 -24948 -17641 -5622 -1142 -8399 -17089 -15530 -3472 -3308 -3710 -3173 996 8631
6006H631J700q112m106j342K437j275J604J821l559j0072n214q288Q285o446o62
5991b4598P441N407n749R255Q497J953o966k845m724k109o83J2340N705K582j0376
5976d870n596j0641n265N876K648Q710n485O328J3209M447K706J799n116j2651
5962c901k370O637N659J361m367r207q327J093N574r0O776l296l136o746j312
5947a5652M99j174q79p07P684R014J2597N144r547j1738k189r02m845l080Q253
5932g522J235o453M729M369N061j2179j369J1510n862l612P965J1500J334j182
5918I524o41P81j136k596m861r634m802Q908K608j7j212o79M359P016n998k950
5902a330l48r600j1140M280M399P297R476q175O763m404j310K824l266j951Q17
$$ plain form
6006 8631 10331 2219 -1887 -3229 -792 -2067 -463 1358 -2201 -12273 -17487 -25775 -17490 -23936 -24598
5991 -24598 -17157 -11750 -17499 -8244 253 2206 -4760 -7605 -12329 -14438 -15121 -2781 2924 5506 -4870
5976 -4870 -10466 -21107 -26372 -20496 -17848 -9138 -14623 -8295 4914 9361 12067 13866 8750 -3901
5962 -3901 -6271 366 6025 7386 3019 -6188 -14515 -13422 -7848 -7938 -1162 -4458 -7594 -14340 -15652
5947 -15652 -15153 -16327 -17206 -17913 -10229 -1215 11382 16526 6979 -4759 -6948 -7850 -12695 -15775 -7522
5932 -7522 -6287 -12740 -8011 -3642 1419 -10760 -12129 -619 -6481 -10093 -2128 9372 10706 9524
5918 9524 8883 9664 8528 5932 1071 -8563 -13365 -4457 -1849 -1866 -3078 -3757 602 7618 1620 -1330
5902 -1330 -1678 -11278 -22418 -18138 -13739 -6442 3034 -5141 1622 -2782 -4092 -1268 -4534 -6485 -5668
5887e668p350m22J110M597J2696l491n895j180m526J2299L764L174r275m463r41
5872e571j375k92j442N15p736q466J670Q847P506n94k506J648L728j260L877m293
5856e744n871J590O08n101J315N482P451J4680M130o352j564M781Q209p612o28
5841A5374l406j0842L547J678k893M170n720n612m792J584N41l829k402o820L461
5826a5961J5964L674r06n846m221o042M979K292o449K655O516N357l42M155m476
5811A349N79J410K421J432M897o92K304j819n546n664j1519j0711L61M737P172
5796i289M759n422q642k253j573l589j3152O786Q655j115O777P640O227p116r401
5781b0708q58O408Q025K398j673j797J929K386L581r63n444p702J1028k536O190
$$ plain form
5887 -5668 -13018 -13440 -12330 -7733 4963 1472 -4423 -5603 -10129 2170 5934 9108 -167 -4630 -5571
5872 -5571 -6946 -7238 -8680 -8165 -15901 -24367 -22697 -13850 -6344 -6938 -9444 -7796 -4068 -5328 -1451 -5744
5856 -5744 -11615 -10025 -9417 -14518 -13203 -7721 -270 14410 18540 12188 10624 15405 23614 16002 15374
5841 15374 11968 1126 4673 6351 3458 7628 1908 -3704 -8496 -6912 -6371 -10200 -12602 -19422 -15961
5826 -15961 3 3677 2771 -3075 -7296 -13338 -8359 -6067 -12516 -9861 -3345 2012 1670 5825 1349
5811 1349 1928 3338 5759 7191 12088 11396 13700 11881 6335 671 -10848 -21559 -21198 -16461 -9289
5796 -9289 -4530 -9952 -18594 -20847 -22420 -26009 -39161 -32375 -23720 -24835 -18058 -10418 -4191 -11307 -20708
5781 -20708 -21566 -15158 -7133 -4735 -6408 -8205 -6276 -3890 -309 -1272 -6716 -14418 -3390 -5926 264
5766B64O542O240q569k844n413O95j403p827j920m04p46Q520l704r535l093O639
5750a6558R820j412j251J495J2390q021l213j871k841P98L423QJ0247n114j839
5735c939N247J807J788K935l384M993l476j869k73K955K737m918r085p266j382
5720a3130J067P226r03m000M385L297j2j1008M977o78n059O12N062j873r041N787
5704a3291M104K17N515O186K131j910N082l767r353M98q043N53m591J037L81l861
5688a9112Q388N096O51M523J8802N851k348j656o968j188l418r230l482N389O903
5673H201J421m454p367M41l059l398j728J825J1079L290q158j651P306o722n516
5658h490n906n759P107J4368J484j5761Q40O291L960P481Q970k395j0803M942
$$ plain form
5766 264 6806 13046 4477 1633 -3780 -3085 -4488 -12315 -14235 -14639 -15385 -6865 -10569 -20104 -23197 -16558
5750 -16558 -6738 -8150 -9401 -7906 4484 -3537 -6750 -8621 -11462 -10664 -7241 -7233 3014 -2100 -3939
5735 -3939 1308 3115 4903 7838 4454 9447 5971 4102 3829 6784 9521 4603 -4482 -11748 -13130
5720 -13130 -12063 -4837 -5740 -9740 -5355 -2058 -2070 -13078 -8101 -8779 -13838 -13226 -8164 -10037 -19078 -13291
5704 -13291 -9187 -8970 -3455 2731 4862 2952 8034 4267 -5086 -4588 -12631 -12078 -16669 -15632 -15251 -19112
5688 -19112 -10724 -5628 -4977 -454 18348 24199 21851 20195 13227 12039 8621 -609 -4091 1298 8201
5673 8201 9622 5168 -2199 -1758 -4817 -8215 -9943 -8118 2961 6251 -1907 -3558 3748 -2974 -8490
5658 -8490 -14396 -20155 -13048 1320 2804 -12957 -12117 -5826 -1866 5615 14585 12190 1387 6329
5644F329M849N360n188J877k161j4825L279N432n019m545N508k50L492n50m580
5629i92L399M905k520K49O22j759m655l581n633j849L112L999k06o585p595j409
5613b0498l852L220J6029P992p21o025Q301L266r933k32o007J036N345N981J206
5598E108K98l334r999k237K11k323R182m998j909N023K18L538K094O637j2682
5583e173o899P932n163m844L135j664q440J0969J4552Q2p410o118N19j5179j417
5568b5118P765r33J449O130O059M367j255K288l335r516K40M931k126j0969K293
5553a7730Q544R881L516k056j33o974N422Q814J153o672r133l851n84n411M897
5538a0317P80K561L79O099O114j3580j0484M871j765J5919M576n814q872R003
$$ plain form
5644 6329 11178 16538 11350 13227 11066 -3759 -480 4952 -67 -4612 896 646 4138 3588 -992
5629 -992 2407 7312 4792 5041 5663 3904 -751 -4332 -9965 -11814 -8702 -4703 -4909 -11494 -19089 -20498
5613 -20498 -24350 -21130 -5101 2891 2170 -3855 4446 7712 -2221 -2453 -8460 -7424 -2079 3902 5108
5598 5108 5406 2072 -7927 -10164 -9953 -12276 -3094 -8092 -10001 -4978 -4760 -1222 872 7509 -5173
5583 -5173 -12072 -4140 -9303 -14147 -11012 -12676 -21116 -10147 4405 4487 -2923 -9041 -8522 -23701 -25118
5568 -25118 -17353 -18286 -16837 -10707 -4648 -281 -1536 752 -2583 -12099 -11859 -6928 -9054 -20023 -17730
5553 -17730 -9186 695 4211 2155 2022 -4952 470 9284 10437 3765 -5368 -9219 -9803 -15214 -10317
5538 -10317 -9537 -6976 -6597 -498 5616 -7964 -18448 -13577 -15342 577 5153 -661 -9533 -530
5524e30N576J927N456k431m682Q92m826J166M400J765O089j2673j1782O736J269
5509a648K759K214K527j1558o576M612J583J841n217M77P809n388p565l82N420
5494i092M497L033j509r179K235J0568Q616q610j7226q354m094M523J3377J3403
5480B188r044n293J3034j390k910k277k262Q319m242q983r722l378J0698L111
5466a2151n970o781K533J4415r255P997k286L4m177n868p688m895J3100P322J562
5451a2108P870M428J080q868j2986M382P521M800J36O133Q037k291m091O210K280
5436A2533K34K340r459J87k992q919j360M836o629n037L721L434k39l521J998
5421h873O29K678p939k793L995N000r516l201K344N302o21l239N065M964J4217
$$ plain form
5524 -530 5046 6973 12429 9998 5316 6208 1382 2548 6948 8713 14802 2129 -9653 -2917 -1648
5509 -1648 1111 3325 5852 -5706 -12282 -7670 -6087 -4246 -9463 -8986 -1177 -6565 -14130 -14512 -9092
5494 -9092 -4595 -1562 -3071 -12250 -10015 553 9169 559 -16667 -25021 -29115 -24592 -11215 2188
5480 2188 -6856 -12149 885 -505 -3415 -5692 -7954 365 -3877 -12860 -22582 -25960 -15262 -12151
5466 -12151 -18121 -24902 -22369 -7954 -17209 -9212 -11498 -11464 -15641 -21509 -29197 -34092 -20992 -13670 -12108
5451 -12108 -4238 190 1270 -7598 -20584 -16202 -8681 -3881 -3745 2388 10425 8134 4043 10253 12533
5436 12533 12767 15107 5648 5835 2843 -6076 -7436 -2600 -9229 -14266 -10545 -7111 -7350 -10871 -8873
5421 -8873 -8244 -5566 -13505 -16298 -12303 -7303 -16819 -20020 -17676 -12374 -12995 -16234 -11169 -6205 8012
5406H012P177j1997q097L699O676K42J773L180M795o932o185j408l427m362n074
5391a1928q948M816R641L872K377l40p380J459R672q31n082q018J737O426q369
5376a0896p681Q6Q16J6498R312J2216J231j1736q313J968o752o41N456P234j281
5361G517j181o517r944j8085J345J4925P547L822J052j553j2569l833N999q229
5347a9704k034O068J1739O960l569j3590L534K65J646J661o037j853N826L446
5333e642N621O641n411l206P8j5249K64l204K643O01L769M457O21m31J58O495
5317a795j0j029L759J995n411J0359m756n882k271J4192J0633j0929j5199N2R956
5302C664p869j975O017r490k375R679m71n494L316M181j648j0114m713p740q61
$$ plain form
5406 8012 15189 3192 -4905 -1206 5470 5712 7485 10665 15460 8528 2343 935 -2492 -6854 -11928
5391 -11928 -20876 -16060 -6419 -2547 -170 -510 -7890 -6431 3241 2410 -2672 -10690 -8953 -2527 -10896
5376 -10896 -18577 -18491 -17675 -1177 8135 20351 21582 9846 1533 3501 -3251 -3892 1564 8798 7517
5361 7517 6336 -181 -10125 -28210 -26865 -11940 -4393 -571 481 -1072 -13641 -17474 -11475 -19704
5347 -19704 -21738 -15670 -3931 3029 -540 -14130 -10596 -10331 -8685 -7024 -13061 -14914 -9088 -5642
5333 -5642 -21 6620 1209 -1997 -1919 -17168 -16904 -20108 -17465 -16864 -13095 -8638 -8017 -8448 -8290 -1795
5317 -1795 -1805 -2834 925 2920 -2491 7868 3112 -2770 -5041 9151 19784 8855 -6344 -6292 3664
5302 3664 -4205 -6180 -163 -9653 -12028 -2349 -2820 -8314 -4998 -817 -2465 -12579 -17292 -25032 -25893
5287b5893o74L565M744J453M273J789m32J422M957O55M011O701O01l741m846j2980
5271a4395R28p118j3332m577J3639J3207J1069M970J753q97k189k069K214O454
5257I657m748O070M712n944j3801J768l185m635J164N326j0732r455P517N086
5243a1200n36n6n142R215k815j0627k185O388J164l3J995O229p84l773L506l664
5227a2318P970J4906P369j4130j6274K97N490K942o546j884P748J1830M063K630
5213A4093J565j1552j3710k240J734P92K985n946m955J0605J1588J0330j0681
5200D608k66J88r05j611l622J329m726O636L241n802j0606p751Q617K906l633
5185a1397J309J1936J4540o452j1924Q39O14M741k335k923O97p365J300p07l95
$$ plain form
5287 -25893 -26567 -23002 -18258 -16805 -12532 -10743 -11175 -9753 -4796 -4141 -130 6571 7172 3431 -1415 -14395
5271 -14395 -13467 -20585 -33917 -38494 -24855 -11648 -579 4391 6144 5247 3058 989 3203 9657
5257 9657 4909 10979 15691 9747 -4054 -2286 -5471 -10106 -8942 -3616 -14348 -23803 -16286 -11200
5243 -11200 -11736 -11792 -16934 -7719 -10534 -21161 -23346 -16958 -15794 -15827 -13832 -7603 -8387 -12160 -8654 -12318
5227 -12318 -4348 10558 17927 3797 -12477 -12180 -6690 -3748 -10294 -12178 -4430 7400 11463 14093
5213 14093 15658 4106 -9604 -11844 -10110 -9318 -6333 -12279 -17234 -6629 4959 15289 4608
5200 4608 4342 4530 3625 2014 -1608 -279 -5005 1631 4872 -930 -11536 -19287 -10670 -7764 -11397
5185 -11397 -10088 1848 16388 9936 -1988 -1149 -535 4206 1871 -1052 -355 -7720 -6420 -7127 -7522
5170g522m106l271O808Q629j779O301l493N703m31q967n132M21n30n674k367o09
5154a6019N793P11l056j888N90N04M058M488J2038N734k719o40l390k57m043j4520
5138a2616L765K128N113J3343Q018P478k786p859j4242p220K801L621j657P85
5124F72R097j498j4915n583J813Q493N78J42n107r031m337k130j675O438P92J693
5108a4558P296Q589N455j0551n488k516Q177p041j810M039q308q624k854J0620
5094a7574R99N886p9j145K733k836k03R078Q683n717k58R660L582n002m666K48
5078C389K5k620j390q157j534J5983j033j4525J401N317L520r46j256J027k784
5063c583L507o310K566P702p265j1659j426L539R185q58j0615m156P052N274n870
$$ plain form
5170 -7522 -11628 -14899 -8091 538 -1241 5060 1567 7270 6839 -2128 -7260 -6839 -7369 -13043 -15410 -16019
5154 -16019 -10226 -9515 -12571 -14459 -13869 -13365 -9307 -4819 7219 12953 10234 9594 6204 5947 1904 -12616
5138 -12616 -8851 -6723 -1610 11733 19751 27229 24443 16584 2342 -4878 -2077 1544 -113 672
5124 672 9769 8271 -6644 -12227 -10414 -1921 -1343 -1201 -6308 -15339 -19676 -21806 -23481 -17043 -16251 -14558
5108 -14558 -7262 1327 6782 -3769 -9257 -11773 -3596 -10637 -12447 -8408 -16716 -25340 -28194 -17574
5094 -17574 -16575 -10689 -10768 -11913 -9180 -12016 -12219 -3141 5542 -175 -433 9227 12809 7807 3141 3389
5078 3389 3414 794 -596 -8753 -10287 5696 4663 -9862 -8461 -3144 376 -570 -1826 -799 -3583
5063 -3583 -76 -6386 -3820 3882 -3383 -15042 -16468 -12929 -3744 -4602 -15217 -19373 -12321 -7047 -12917
5048a2917L46N530L191l953K919M210L177M280lL073m325j0273j3387N748O119
5033f265O082k540l578L746Q93l747Q97j831r62n36P10K410l961K462k093k279
5017a0592K397j4300J677P320K204n028K933m41L651P939O833k834M00K065M480
5002H704l208j7871r217K0037O080L773N124N367l443K384K927p262L249p874
4988H770j1388n87N690M128k048n678J32L918m723J074n547k012O59R31N296k577
4972c962N152J0811j715n685O423q192K72j277r041J309M184L774J571J0767M904
4957A9295j0490o951j0789j5230m111m28L406J0400Q536K020K51m535j046j3942
4943b3614o085J0975N276q337p295m291P843P865N66j088N618Q115j543m86o281
$$ plain form
5048 -12917 -12571 -7041 -3850 -7803 -4884 -674 2503 6783 6780 9853 5528 -4745 -18132 -12384 -6265
5033 -6265 -183 -2723 -6301 -2555 -1662 -5409 -4512 -6343 -7305 -7841 -7131 -4721 -8682 -6220 -8313 -10592
5017 -10592 -8195 -22495 -20818 -13498 -11294 -16322 -13389 -13830 -10179 -2240 4593 1759 2159 4224 8704
5002 8704 5496 -12375 -21592 -1555 4525 8298 13422 18789 15346 17730 20657 13395 16644 8770
4988 8770 -2618 -3205 2485 6613 4565 -1113 -981 2937 -1786 -712 -6259 -8271 -7612 -6681 -1385 -3962
4972 -3962 1190 12001 10286 4601 11024 2832 3104 1827 -7214 -5905 -1721 2053 3624 14391 19295
4957 19295 8805 1854 -8935 -24165 -28276 -28704 -25298 -14898 -6362 -4342 -4091 -8626 -9672 -23614
4943 -23614 -29699 -18724 -13448 -21785 -29080 -33371 -25528 -17663 -17097 -18185 -12567 -4452 -5995 -6481 -12762
4928a2762r002J3848Q253p710l670R945O548M912p24j1212o473k276J0708k782
4914b397j3296m416J5651O960m313j0554j682J2401L541k714J0562j248l652l194
4900A649M240K746k508l982K195L558j0388q842O295R410N219K978K198M61o840
4885H389o797j768l330l339M071J142k038o053r952k545jj881r723q975J2585
4870c0215K3190P522j45l818p397o990k622L813N150l017J629q538o219l741J635
4855b9763k542M57K185J017N981Q79J18P90N975q2Q350J0317L374j621R375J3026
4839B7836M466p234o955k576j3933j2856q678m360Q526R280L581j338l349K585
4825e005N069o398q976J618M683P768M287k131j1000R417n922p032k482k51R345
$$ plain form
4928 -12762 -21764 -7916 337 -7373 -11043 -1098 5450 10362 9638 -1574 -8047 -10323 385 -2397
4914 -2397 -15693 -20109 -4458 2502 -1811 -12365 -14047 -1646 1895 -819 9743 8495 4843 1649
4900 1649 5889 8635 6127 2145 4340 7898 -2490 -11332 -5037 4373 9592 12570 14768 15229 8389
4885 8389 1592 -176 -3506 -6845 -2774 -1632 -3670 -9723 -19675 -22220 -22221 -24102 -33825 -42800 -30215
4870 -30215 -7025 497 352 -3466 -10863 -17853 -20475 -16662 -11512 -14529 -12900 -21438 -27657 -31398 -29763
4855 -29763 -32305 -31848 -29663 -28646 -22665 -21786 -21668 -20878 -14903 -14985 -6635 3682 7056 5435 14810 27836
4839 27836 32302 25068 18113 15537 1604 -11252 -19930 -24290 -15764 -6484 -2903 -4241 -7590 -5005
4825 -5005 64 -6334 -15310 -13692 -9009 -1241 3046 915 -10085 -668 -6590 -13622 -16104 -16355 -7010
4810g010K308j0915p799R905L322l98Q766K291L338L489l564m142k838J588j272
4795b931r518o69N06r51J0816O240Q054q49p27q850r548J826J657n695J981p20
4779i378k378L82O932o37J462M848j7415r783J1626O120J0190O101q899n456K060
4764d225J579q520j589L131J2163r93o400o56L419n185q305n863M120J0496M844
4749a984j858j632p411j30N766J2597N725j497j277m118j5861L344L070J793M746
4734A273j839n614l401L91L902M426O464k923J707k920k420o884K560K902k550
4719d926J715k64q667j2226n007R309L686n540O745R582Q808J517M38J888n456
4704A602j0424o950L282Q618J3115j172p227m729P368L101k704o348L77P61Q507
$$ plain form
4810 -7010 -4702 -15617 -23416 -13511 -10189 -10587 -1821 470 3808 7297 3733 -409 -3247 -1659 -2931
4795 -2931 -12449 -13118 -12612 -13563 -2747 3493 11547 10698 9971 1121 -8427 -6601 -4944 -10639 -8658 -9378
4779 -9378 -11756 -11374 -4442 -5079 -3617 1231 -16184 -25967 -14341 -8221 1969 8070 -829 -6285 -4225
4764 -4225 -2646 -11166 -12755 -9624 2539 1546 -4854 -5510 -2091 -7276 -15581 -21444 -17324 -6828 -1984
4749 -1984 -3842 -5474 -12885 -13015 -7249 5348 11073 9576 8299 4181 -11680 -8336 -5266 -3473 1273
4734 1273 -566 -6180 -9581 -9190 -5288 -862 5602 2679 4386 1466 -954 -7838 -5278 -2376 -4926
4719 -4926 -3211 -3475 -12142 -24368 -29375 -20066 -16380 -21920 -15175 -5593 3215 4732 5170 7058 1602
4704 1602 -8822 -15772 -12490 -3872 9243 8071 844 -3885 3483 6584 3880 -2468 -2091 -1330 7177
4689G177j80K546m848j6783q959K709P156m385N876O529j492R6r906k838J3298
4674d004j705m683l790p547R249k926k831j112N3N173O703J223O418P903l776
4659D348p670o82m94M79P712p47L005j319o187l293Q488M8l105J888m622J819
4643c32K229Q407O255r45j3409j1774p987M476Q785R420j4291L110o7M948R302
4628H127p982j144J556j1373l870O160N326M67L247l549q73Q68K967R176M160
4613A3263j5027p076J315M101R36p86m733l633O693K087n14R963o602j5326O536
4598h803L713n994o009N819J3088O457Q462j0334j3424L64M392M100L392l83k349
4583B491n445O934L721m733q09p983p639k178M65R909o56l404Q665l569r53J520
$$ plain form
4689 7177 6997 9543 4695 -12088 -21047 -18338 -11182 -15567 -9691 -3162 -4654 -4558 -14464 -17302 -4004
4674 -4004 -5709 -10392 -14182 -21729 -12480 -15406 -18237 -19349 -19296 -14123 -7420 -6197 221 8124 4348
4659 4348 -3322 -4004 -4498 -4019 3693 2946 5951 4632 -1555 -4848 3640 3688 583 2471 -2151 -332
4643 -332 1897 10304 16559 15614 2205 -9569 -17556 -13080 -4295 5125 -9166 -6056 -6123 -1175 8127
4628 8127 145 -999 557 -10816 -14686 -8526 -3200 -2733 514 -3035 -3908 -3040 -73 9103 13263
4613 13263 -1764 -8840 -7525 -3424 -2488 -3274 -8007 -11640 -4947 -2860 -3374 6589 -13 -15339 -8803
4598 -8803 -5090 -11084 -17093 -11274 1814 8271 16733 6399 -7025 -6661 -2269 1831 5223 4840 2491
4583 2491 -2954 3980 7701 2968 2159 -5824 -13463 -15641 -15176 -5267 -5923 -9327 -662 -4231 -5184 -3664
4567c664L160O114M983l559O042J818J459o268j0637k150L425J1910K196o69J026
4552A5186q239q33l229p503L545K638L603k709L85P115P04p353m458J0169j147
4537G874j409p537n49j593J0446l04q020j2695M834M333J998Q503j327n514M996
4522D036M906p754n096q926R8J60J180j775n305J0095q649l624N747J871N823
4507g213J0407p76o490l272O340l594p726N237L604M514m653N653J1948R885m890
4492A8974m407M824K008N9L787M680j2949j2975o234j3251j5210l641K926J480
4478b9929j848J3103O180l681P029k939N06M928j272M539J3663L40O87M165q462
4463G009n107N889K067j2155j212m72N746m241p454O890M704k541L002n12k295
$$ plain form
4567 -3664 -504 5610 10593 7034 13076 14894 16353 10085 -552 -2702 723 12633 14829 14160 15186
4552 15186 6947 6114 2885 -4618 -1073 1565 5168 2459 2844 9959 10663 3310 -1148 9021 7874
4537 7874 6465 -1072 -1621 -3214 7232 6928 -1092 -13787 -8953 -4620 -2622 5881 4554 -960 4036
4522 4036 8942 1188 -3908 -12834 -12736 -12576 -11396 -13171 -18476 -8381 -17030 -20654 -14907 -13036 -7213
4507 -7213 3194 2418 -4072 -7344 -1004 -4598 -12324 -7087 -3483 1031 -3622 2031 13979 23864 18974
4492 18974 14567 19391 21399 21458 25245 29925 16976 4001 -2233 -15484 -30694 -34335 -31409 -29929
4478 -29929 -31777 -18674 -12494 -16175 -9146 -12085 -11579 -6651 -7923 -3384 10279 10619 11306 15471 7009
4463 7009 1902 7791 9858 -2297 -3509 -3981 1765 -2476 -9930 -3040 1664 -877 2125 1613 -682
$$ [...]
##END NTUPLES=NMR SPECTRUM
##END=
