##TITLE=Analysis number 316521
Compound Code cc 45304
Book Reference 440/130/4
Project Code adrs
Chemist Name craigr
##JCAMPDX= 6.0         $$ Bruker NMR JCAMP-DX V2.0
##DATA TYPE= NMR SPECTRUM
##DATA CLASS= NTUPLES
##ORIGIN= Bruker BioSpin GmbH
##OWNER= nmr
$$ XWIN-NMR		Version 3.5
$$ Thu Jan 19 08:42:37 2006 GMT Standard Time (UT+0h)  MAYBRIDGE\nmr@NMR_250MHZ
##.OBSERVE FREQUENCY= 250.131544655141
##.OBSERVE NUCLEUS= ^1H
##.ACQUISITION MODE= SIMULTANEOUS (DQD)
##.ACQUISITION SCHEME= undefined
##.AVERAGES= 16
##.DIGITISER RES= 18
##SPECTROMETER/DATA SYSTEM= dpx250
##.PULSE SEQUENCE= zg30
##.SOLVENT NAME= CDCl3
##.SHIFT REFERENCE= (INTERNAL, CDCl3, 0, 16.4739)
##AUDIT TRAIL= $$ (NUMBER, WHEN, WHO, WHERE, WHAT)
$$ ##TITLE= Audit trail, XWIN-NMR		Version 3.5
$$ ##JCAMPDX= 5.01
$$ ##ORIGIN= Bruker BioSpin GmbH
$$ ##OWNER= nmr
$$ C:\u/data/dgb/nmr/ADRS/14900/pdata/1/auditp.txt
$$ ##AUDIT TRAIL=  $$ (NUMBER, WHEN, WHO, WHERE, WHAT)
(   1,<2006-01-19 08:41:34.72 +000>,<MAYBRIDGE\nmr>,<NMR_250MHZ>,
      <created by zg, POWCHK disabled, PULCHK disabled
       configuration hash MD5:
       62 19 C7 07 E1 42 D1 B7 37 6C 3D D0 77 39 F9 E6
       data hash MD5: 64K
       12 C5 9D 88 CE E8 20 9A A3 7C 68 F6 C3 01 B6 DD>)
(   2,<2006-01-19 08:42:02.67 +000>,<MAYBRIDGE\nmr>,<NMR_250MHZ>,
      <Start of raw data processing
       ef LB = 0.3 FT_mod = 6 PKNL = 1 SI = 32K 
       data hash MD5: 32K
       5D 3C 5A BD 7D 22 93 04 17 C4 4A 73 D8 D7 4D 61>)
(   3,<2006-01-19 08:42:06.48 +000>,<MAYBRIDGE\nmr>,<NMR_250MHZ>,
      <apk 
       data hash MD5: 32K
       C5 65 0F 5D 4B 60 7A 0A 82 9D 6C 40 04 47 2D A8>)
(   4,<2006-01-19 08:42:08.75 +000>,<MAYBRIDGE\nmr>,<NMR_250MHZ>,
      <abs ABSG = 5 
       data hash MD5: 32K
       F0 BD 29 6A 96 BD 62 66 01 B7 4E 93 1E AE 76 96>)
$$ ##END=
$$ 
$$ hash MD5
$$ 6A 4B 4B 6D DF BF A2 3A 38 9F C7 14 99 50 E5 4C
##$RELAX= 
##$RELAX= 
##$RELAX= 
##$RELAX= 
##$RELAX= 
##$RELAX= 
##$RELAX= 
$$ Bruker specific parameters
$$ --------------------------
##$DU= <C:\u>
##$EXPNO= 14900
##$NAME= <ADRS>
##$PROCNO= 1
##$TYPE= <nmr>
##$USER= <dgb>
##$AMP= (0..31)
100 100 100 100 100 100 100 100 100 100 100 100 100 100 100 100 100 100 
100 100 100 100 100 100 100 100 100 100 100 100 100 100 
##$AQSEQ= 0
##$AQ_mod= 3
##$AUNM= <au_zg>
##$AUTOPOS= <15 >
##$BF1= 250.13
##$BF2= 250.13
##$BF3= 250.13
##$BF4= 250.13
##$BF5= 500.13
##$BF6= 500.13
##$BF7= 500.13
##$BF8= 500.13
##$BYTORDA= 1
##$CFDGTYP= 0
##$CFRGTYP= 5
##$CHEMSTR= <none>
##$CNST= (0..31)
1 1 145 1 1 1 1 1 1 1 1 1 1 1 1 1 1 1 1 1 1 1 1 1 1 1 1 1 1 1 1 1 
##$CPDPRG= <>
##$CPDPRG1= <>
##$CPDPRG2= <>
##$CPDPRG3= <>
##$CPDPRG4= <mlev>
##$CPDPRG5= <mlev>
##$CPDPRG6= <mlev>
##$CPDPRG7= <mlev>
##$CPDPRG8= <mlev>
##$CPDPRGB= <>
##$CPDPRGT= <>
##$D= (0..31)
0 1 0 0 0 0 0 0 0 0.06 0 0 0 0 0 0 0.0002 0 0 0 0 0 0 0 0 0 0 0 0 0 0 
0 
##$DATE= 1137660087
##$DBL= (0..7)
120 120 120 120 120 120 120 120 
##$DBP= (0..7)
150 150 150 150 150 150 150 150 
##$DBP07= 0
##$DBPNAM0= <>
##$DBPNAM1= <>
$$ [...]
##$SUBNAM7= <"">
##$SUBNAM8= <"">
##$SUBNAM9= <"">
##$SW= 20.6930455092707
##$SWIBOX= (0..15)
0 0 3 0 0 0 0 0 0 0 0 0 0 0 0 0 
##$SW_h= 5175.983436853
##$TD= 65536
##$TD0= 1
##$TE= 294.16
##$TE2= 300
##$TE3= 300
##$TEG= 300
##$TL= (0..7)
0 120 120 120 120 120 120 120 
##$TP= (0..7)
150 150 150 150 150 150 150 150 
##$TP07= 0
##$TPNAME0= <>
##$TPNAME1= <>
##$TPNAME2= <>
##$TPNAME3= <>
##$TPNAME4= <>
##$TPNAME5= <>
##$TPNAME6= <>
##$TPNAME7= <>
##$TPOAL= (0..7)
0.5 0.5 0.5 0.5 0.5 0.5 0.5 0.5 
##$TPOFFS= (0..7)
0 0 0 0 0 0 0 0 
##$TUNHIN= 0
##$TUNHOUT= 0
##$TUNXOUT= 0
##$USERA1= <user>
##$USERA2= <user>
##$USERA3= <user>
##$USERA4= <user>
##$USERA5= <user>
##$V9= 5
##$VALIST= <valist>
##$VCLIST= <CCCCCCCCCCCCCCC>
##$VD= 0
##$VDLIST= <DDDDDDDDDDDDDDD>
##$VPLIST= <PPPPPPPPPPPPPPP>
##$VTLIST= <TTTTTTTTTTTTTTT>
##$WBST= 1024
##$WBSW= 4
##$XGAIN= (0..3)
0 0 0 0 
##$XL= 0
##$YL= 0
##$YMAX_a= 565191
##$YMIN_a= -433210
##$ZGOPTNS= <>
##$ZL1= 120
##$ZL2= 120
##$ZL3= 120
##$ZL4= 120
##$ABSF1= 16.47391
##$ABSF2= -4.219263
##$ABSG= 5
##$ABSL= 3
##$ALPHA= 0
##$AQORDER= 0
##$ASSFAC= 0
##$ASSFACI= 0
##$ASSFACX= 0
##$ASSWID= 0
##$AUNMP= <proc_1d>
##$AZFE= 0.1
##$AZFW= 0.1
##$BCFW= 0
##$BC_mod= 0
##$BYTORDP= 0
##$COROFFS= 0
##$CY= 12.5
##$DATMOD= 1
##$DC= 0
##$DFILT= <>
##$DTYPP= 0
##$F1P= 14.0000005364418
##$F2P= -0.99999901652339
##$FCOR= 0.5
##$FTSIZE= 32768
##$FT_mod= 6
##$GAMMA= 0
##$GB= 0
##$INTBC= 1
##$INTSCL= 1
##$ISEN= 128
##$LB= 0.3
##$LEV0= 0
##$LPBIN= 0
##$MAXI= 10000
##$MC2= 0
##$MEAN= 0
##$ME_mod= 0
##$MI= 0
##$NCOEF= 0
##$NC_proc= -3
##$NLEV= 6
##$NOISF1= 0
##$NOISF2= 0
##$NSP= 0
##$NTH_PI= 0
##$NZP= 0
##$OFFSET= 16.47391
##$PC= 1
##$PHC0= 90.1271
##$PHC1= 1.687307
##$PH_mod= 1
##$PKNL= yes
##$PPARMOD= 0
##$PSCAL= 4
##$PSIGN= 0
##$REVERSE= no
##$SF= 250.130012027715
##$SI= 32768
##$SIGF1= 0
##$SIGF2= 0
##$SINO= 400
##$SIOLD= 32768
##$SREGLST= <1H.CDCl3>
##$SSB= 0
##$STSI= 32768
##$STSR= 0
##$SW_p= 5175.98343685301
##$SYMM= 0
##$S_DEV= 0
##$TDeff= 65536
##$TDoff= 0
##$TI= <Analysis number 999999
Compound Code 99
Book Reference 9
Project Code 9>
##$TILT= no
##$TM1= 0
##$TM2= 0
##$TOPLEV= 0
##$USERP1= <user>
##$USERP2= <user>
##$USERP3= <user>
##$USERP4= <user>
##$USERP5= <user>
##$WDW= 1
##$XDIM= 32768
##$YMAX_p= 328254993
##$YMIN_p= -60863
$$ End of Bruker specific parameters
$$ ---------------------------------
##NTUPLES= NMR SPECTRUM
##VAR_NAME=  FREQUENCY,     SPECTRUM/REAL,   SPECTRUM/IMAG
##SYMBOL=    X,             R,               I
##VAR_TYPE=  INDEPENDENT,   DEPENDENT,       DEPENDENT
##VAR_FORM=  AFFN,          ASDF,            ASDF
##VAR_DIM=   32768,         32768,           32768
##UNITS=     HZ,            ARBITRARY UNITS, ARBITRARY UNITS
##FACTOR=    0.157963299565203, 1,           1
##FIRST=     4120.61915087557, 0,            0
##LAST=      -1055.36428597744, 0,           0
##MIN=       -1055.36428597744, -60863,      0
##MAX=       4120.61915087557, 328254993,    0
$$ Real data points
##PAGE= N=1
##DATA TABLE= (X++(R..R)), XYDATA
$$ [...]
16326a4535N944J197o033J980R22M891j089K950l573n112L923P507m925j2295
16312a8248n413J569J6967L599p820q291J255P080l3o463P71Q571M023j4489m558
16297b1480P494J46N006r88p955m699l944k436J2684Q122J0459j966n890k351
16283g798k670k543o514P313J790P130L633r394m530K966n542k731J611n300j378
16268b3957Q251M633J60j945N49O243K427o469n647j063N788k678l22K073r201
16253b1158K881N920l142j1149n439R937K686k848O958J851R891J192n609n234
16239a3263p493J134m020m356L590R627J494j0375n901O905N221n357r75J5635
16225h134p24m284l420J206O645n978O674m432m597n91O723l549r424j765O629
$$ plain form
16326 -14535 -8591 -7394 -13427 -11447 -10525 -5634 -6723 -3773 -7346 -12458 -8535 -1028 -5953 -18248
16312 -18248 -23661 -22092 -5125 -1526 -9346 -17637 -16382 -9302 -9335 -15798 -15027 -6456 -2433 -16922 -21480
16297 -21480 -13986 -13840 -8834 -9822 -17777 -22476 -26420 -28856 -16172 -8050 2409 443 -5447 -7798
16283 -7798 -10468 -13011 -19525 -12212 -10422 -3292 341 -9053 -13583 -10617 -16159 -18890 -17279 -22579 -23957
16268 -23957 -15706 -11073 -10913 -12858 -12309 -6066 -3639 -10108 -15755 -16818 -11030 -13708 -14030 -11957 -21158
16253 -21158 -18277 -12357 -15499 -26648 -32087 -22150 -19464 -22312 -15354 -13503 -3612 -2420 -8029 -13263
16239 -13263 -20756 -19622 -23642 -27998 -24408 -14781 -13287 -23662 -29563 -22658 -17437 -22794 -23769 -8134
16225 -8134 -8858 -13142 -16562 -15356 -8711 -14689 -8015 -12447 -17044 -17635 -10912 -14461 -23885 -25650 -19021
16210a9021j827j233K56L681R542l198j0874j720N149K719m433j695M265J091
16196a7298K733K995l19j506J052K113L178O397q358m489P699n008j1406P584
16182a4633R282m7j1797j008j443N873M02m097m21J2768J303l034q341k84L498
16167a1979Q848n272o705p895n686Q332N884q15N643o38o899L677o698k399J482
16152b1120k374P667J136L15O496J826k122J830n646l884J358Q839n980r244K961
16137a7942J0444Q832RN583o438k690p786n343O1L194n111j66L496K130J316N102
16121e309L739k970o290K761J0987K782m924j549p527m053P94M039q021m816Q058
16106a2299J204l926n850O259L167L83L908l739j4640K098J1495o41p266K184
$$ plain form
16210 -19021 -20848 -22081 -21825 -18144 -8602 -11800 -22674 -24394 -19245 -16526 -20959 -22654 -18389 -17298
16196 -17298 -14565 -11570 -11889 -13395 -12343 -10230 -7052 -655 -9013 -13502 -5803 -10811 -22217 -14633
16182 -14633 -5351 -5398 -17195 -18203 -19646 -13773 -13371 -17468 -17889 -5121 -3818 -6852 -15193 -15477 -11979
16167 -11979 -3131 -8403 -15108 -23003 -28689 -20357 -14473 -15288 -9645 -10283 -17182 -13505 -20203 -22602 -21120
16152 -21120 -23494 -15827 -14691 -14376 -7880 -6054 -8176 -6346 -11992 -15876 -14518 -5679 -11659 -20903 -17942
16137 -17942 -7498 1334 1343 6926 488 -2202 -9988 -15331 -15270 -12076 -17187 -17353 -13857 -11727 -10411 -5309
16121 -5309 -1570 -4540 -10830 -8069 2918 5700 776 -773 -8300 -12353 -11559 -7520 -15541 -20357 -12299
16106 -12299 -11095 -15021 -20871 -14612 -11445 -11062 -7154 -10893 -25533 -23435 -11940 -12581 -19847 -17663
16092a7663K417M009J713n039K617Q883J028l724N675k625O005p70p632k166j827
16077i099J635L504k37J64N113Ok057o017j2420l046O835p49O581M939r641K998
16061a1491K728l598j386K79n98J1914O194J437m153p824K93J346K460K08L397
16046A206J814K21l265r935n403j1119l477M228J1761Q968M023j226q986p359
16032a8549n450R130L709M833m695o639M950K665l657J484J495N149o819k745
16018a5139j659K524k776o882Q34M735m461j390N913p3j815J0034Q790k762j949
16003f076L104o598r17N908l658p394r409n708L689M493M991l980Q548P961K770
15988b276K474K638m020M006l628n517m357o747k408L5R525O84k188O20k97J382
$$ plain form
16092 -17663 -15246 -11237 -9524 -14563 -11946 -3063 -2035 -5759 -84 -2709 3296 2526 -5106 -7272 -9099
16077 -9099 -7464 -3960 -4197 -4033 1080 1086 -971 -6988 -19408 -22454 -15619 -16368 -9787 -4848 -14489 -11491
16061 -11491 -8763 -12361 -13747 -13468 -14066 -2152 4042 5479 1326 -6498 -6205 -4859 -2399 -2191 1206
16046 1206 3020 3241 -24 -9959 -15362 -26481 -29958 -25730 -13969 -5001 -978 -2204 -11190 -18549
16032 -18549 -23999 -14869 -11160 -6327 -11022 -17661 -12711 -10046 -13703 -12219 -10724 -5575 -12394 -15139
16018 -15139 -16798 -14274 -17050 -23932 -23098 -18363 -22824 -24214 -18301 -18374 -20189 -10155 -1365 -4127 -6076
16003 -6076 -2972 -9570 -10487 -4579 -8237 -15631 -25040 -30748 -27059 -22566 -17575 -21555 -13007 -5046 -2276
15988 -2276 198 2836 -1184 2822 -806 -6323 -10680 -17427 -19835 -19800 -10275 -9591 -11779 -11159 -11456 -10074
15972a0074L335K197o071Q91J1820N023m041j997p790K514P688K283R00m164p017
15957d503K03N4k826j259Q47K215J694l874j275L163K567j182n705m740J3138
15942a483O368l79K745o574o345k757L98M211m260l595K225R516j596l883l333
15927h742Q744k056j4028k851p345k146P858J4280j465K591K296L45O69k272o550
15912a0672k055J2529o10L720L38m834m084K289K012o834k862k679n762J961L975
15897a3568M119P152j734j656o00p55k054m535M971P990L865k543N176j647j4398
15882a0217l627P668j524j342M413L322r743k291k14Q160N668n884K621l144p625
15867a3759M751j337M391m82n311n8J0362M13p096k70Q415L951l028k040Q62j627
$$ plain form
15972 -10074 -6739 -4542 -10613 -9722 2098 7121 3080 1083 -6707 -4193 3495 5778 6678 2514 -4503
15957 -4503 -4300 -4246 -7072 -8331 -7484 -5269 -3575 -7449 -8724 -5561 -2994 -4176 -9881 -14621 -1483
15942 -1483 4885 4506 7251 677 -5668 -8425 -8027 -3816 -8076 -11671 -9446 70 -1526 -5409 -8742
15927 -8742 2 -2054 -16082 -18933 -26278 -28424 -20566 -6286 -7751 -5160 -2864 -2519 -1850 -4122 -10672
15912 -10672 -12727 -198 -808 2912 3250 -1584 -5668 -3379 -1367 -8201 -11063 -13742 -19504 -17543 -13568
15897 -13568 -9449 -2297 -4031 -5687 -6287 -7042 -9096 -13631 -8660 -670 3195 652 5828 4181 -10217
15882 -10217 -13844 -6176 -7700 -9042 -4629 -1307 -11050 -13341 -13555 -5395 273 -5611 -2990 -6134 -13759
15867 -13759 -9008 -10345 -5954 -6436 -11747 -11805 -1443 -1030 -8126 -8396 19 3970 942 -1098 -236 -1863
15851a863l125p106m255O955j632j545N001j144n571J49K469m08J0521O729J521
15836F696q11l728p687l233j419k228J065k02K169j090O153m376K348O169O260
15821F086K135j0238p843L731R199l195l315N715j142M62l303o523j267L967M05
15806e126p527P027K637P27k293l115L010m228j4171l151Q394R855L448l055L036
15791d532J344l469l704j993j242L745l816N7J091L244K055l355o805j494j342
15776b0216j567K150R251J187N285j492k22j131j334j429P40j787j911j395P841
15761f030j966l807M490j299j616N245M460Q55n053Q65m374p166N125j491m415
15746a6177M289K052j712M188K917k049n91o188K516Q0k977k06M137k805L714
$$ plain form
15851 -1863 -4988 -12094 -16349 -9394 -11026 -12571 -7570 -8714 -14285 -14136 -11667 -12075 -1554 5175 6696
15836 6696 5885 2157 -5530 -8763 -10182 -12410 -11345 -11547 -9378 -10468 -4315 -8691 -6343 -174 6086
15821 6086 8221 -2017 -9860 -6129 3070 -125 -3440 2275 1133 1595 -1708 -8231 -9498 -5531 -5126
15806 -5126 -12653 -5626 -2989 -2262 -4555 -7670 -4660 -8888 -23059 -26210 -17816 -7961 -4513 -7568 -4532
15791 -4532 -3188 -6657 -10361 -12354 -13596 -9851 -13667 -13610 -12519 -9275 -7220 -10575 -17380 -18874 -20216
15776 -20216 -21783 -19633 -10382 -9195 -3910 -5402 -5624 -6755 -8089 -9518 -8778 -10565 -12476 -13871 -6030
15761 -6030 -7996 -11803 -7313 -8612 -10228 -4983 -523 332 -4721 -3856 -8230 -15396 -10271 -11762 -16177
15746 -16177 -11888 -9836 -11548 -7360 -4443 -6492 -7083 -13271 -10755 -10675 -13652 -13858 -9721 -12526 -8812
15731h812N914K542L145m346l932m006k165K116O560J88J090J182j4361j4356
15717b9241M096M545K428M739k990p21l701J385K983J1104P94l977n59o175o974
15702b2264K303R955M525q975N32J271j914J198n704L049Q359O625K393k006k879
15687c532j0623L972R246m576l081Q42k958m80O240L599l279n977r054q515R72
15672b7204m92Q419R61j1O973j049M558o933l067O133M535N62j146M34m325M509
15656g143K542P385M647j0124j3432j424K503K922R805J838J954L702j429q64
15642B882O351j706j0093r379M03J070r57m496M474P870P555j643m708k619o367
15627a1363j960k430r19P00n055J0977R276K58q867k518J418l884n836o18L343
$$ plain form
15731 -8812 -2898 -356 2789 -1557 -5489 -9495 -11660 -9544 -2984 -2796 -1706 -524 -14885 -29241
15717 -29241 -25145 -20600 -18172 -13433 -16423 -17144 -20845 -19460 -16477 -5373 -4579 -8556 -9115 -15290 -22264
15702 -22264 -19961 -10006 -5481 -14456 -13924 -12653 -14567 -13369 -19073 -16024 -7665 -1040 1353 -653 -3532
15687 -3532 -14155 -10183 -937 -5513 -8594 -7752 -10710 -11190 -4950 -1351 -4630 -10607 -19661 -28176 -27204
15672 -27204 -27696 -19277 -18316 -18327 -11354 -12403 -7845 -14778 -17845 -11712 -7177 -6615 -7761 -7327 -11652 -7143
15656 -7143 -4601 2784 7431 -2693 -16125 -17549 -15046 -12124 -2319 -481 1473 5175 3746 2882
15642 2882 9233 7527 -2566 -11945 -11542 -10472 -11429 -15925 -11451 -3581 3974 2331 -2377 -4996 -11363
15627 -11363 -13323 -15753 -16672 -15972 -21027 -10050 -774 -516 -9383 -11901 -10483 -14367 -20203 -20821 -17478
15612a7478L104o05J622R427j949j796O621M576o881N752K154o36r101j18J238
15597d070p355L476l402L179K930k869N823P80m642j4833k215P171J1614k121
15583f534o225l242r96N89l097L899m863r15M248J185J2777o18o482l388k47o314
15567b0223j170L100l436m900P94N49J9801L135m561k937N708n957m914k983n479
15552b3473m432J356k096N404J1786N190n574m643J0233M364P743n171j2817n710
15538a7840N629K392j466n839N613K171K388K251q784K384j503J2k663L437j87
15523a2005J70O132K172o631N652P933K822M634l132p330k309J565m981N310J710
15508A712n237J022N926j437m161p283K801L333l059n813n131p862P078K176n372
$$ plain form
15612 -17478 -14374 -14979 -13357 -3930 -5879 -7675 -1054 3522 -3359 2393 4547 3911 -5190 -5308 -4070
15597 -4070 -11425 -7949 -11351 -8172 -5242 -8111 -2288 -1508 -6150 -20983 -23198 -16027 -4413 -6534
15583 -6534 -12759 -16001 -16997 -16408 -19505 -15606 -20469 -21384 -17136 -15951 -3174 -3792 -10274 -13662 -13909 -20223
15567 -20223 -21393 -18293 -21729 -26629 -25835 -25286 -5485 -2350 -6911 -9848 -4140 -10097 -15011 -17994 -23473
15552 -23473 -27905 -26549 -28645 -23241 -11455 -6265 -11839 -16482 -6249 -1885 5858 687 -12130 -17840
15538 -17840 -12211 -9819 -11285 -17124 -11511 -9340 -6952 -4701 -13485 -11101 -12604 -12592 -15255 -11818 -12005
15523 -12005 -11835 -5703 -3531 -10162 -4510 3423 6245 10879 7747 417 -1892 -327 -5308 2 1712
15508 1712 -3525 -2503 3423 1986 -2175 -9458 -6657 -3324 -6383 -12196 -17327 -25189 -18111 -15935 -21307
15493b1307N536N968P866N739j474r640q665j325M862k506j395N795P156L522
15479A32N9j0614K42m877o568N967K178k641N609J251n367j421J663L137o19K420
15463i449q25J865L421j065q72M601j686l906j201k868R97O554l76K947O060J5482
15447A9679m856r314m914n473m711Q751M918k250q028l829o99J788K099O66M81
15432e692o237M192p548Q029l490o663R041Q999j380r676k873M569Q181M273j277
15417B448J64j141k13l148N222K385l942q54L143P6m763l746j1419N183M951J689
15401c965r059L439J1972J943p687j734M143o582M715J705k058n106q31K695L291
15386c119L805k065j3272p629k624P823L012L522O141m214k09K349J661q253n811
$$ plain form
15493 -21307 -15771 -9803 -1937 3802 2328 -7312 -15977 -17302 -12440 -14946 -16341 -10546 -3390 132
15479 132 191 -10423 -10181 -15058 -21626 -15659 -13481 -16122 -10513 -9262 -14629 -16050 -14387 -11250 -11869 -9449
15463 -9449 -10274 -8409 -4988 -6053 -6925 -2324 -4010 -7916 -9117 -11985 -10988 -4434 -4810 -1863 4197 19679
15447 19679 14823 5509 595 -4878 -9589 -838 4080 1830 -6198 -10027 -10726 -8938 -6839 -6173 -5692
15432 -5692 -11929 -7737 -15285 -7256 -10746 -17409 -8368 631 -749 -10425 -13298 -8729 -548 3725 2448
15417 2448 2612 1471 1258 -1890 3332 5717 1775 921 4064 4140 -623 -4369 -15788 -10605 -5654 -3965
15401 -3965 -13024 -9585 2387 4330 -3357 -5091 -948 -7530 -2815 -1110 -3168 -8274 -9105 -6410 -3119
15386 -3119 686 -1379 -14651 -22280 -24904 -17081 -14069 -10547 -4406 -8620 -8829 -6480 -4819 -13072 -18883
15371a8883j982O349o85K599M181K106Q926J600l128j040Q589p695j0075K808
15357f330k700n288k44L010j205J767O045L791m628j0634j083P201P320J177N907
15342D106J982m876l734m018n041k23P320M661K718j0413R254J0552n236k99J608
15327H361q583n204o41k708k16Q148K590K349J914M5o103n999K442R084M596j1934
15311a859j3320M784L000p184j842j007j127K137Q850O273n59j191q245M371L4
15296f885l817P31N366k898M783N995J411o439j83n327L83m023M2j130j109R392
15280c708O367r90L439L660o066r041r71L476J60n101m03L427J3753K383m664
15265E721j0654l679K302n213P777m220l105j042p268K357Q465J0994Q174l917
$$ plain form
15371 -18883 -20865 -14516 -15201 -12602 -8421 -6315 2611 4211 1083 43 8632 937 -9138 -6330
15357 -6330 -9030 -14318 -14562 -11552 -12757 -10990 -4945 -1154 -5782 -16416 -17499 -10298 -2978 -1801 4106
15342 4106 6088 1212 -2522 -6540 -11581 -11804 -4484 177 2895 -7518 1736 12288 7052 6753 8361
15327 8361 -222 -5426 -6067 -8775 -8991 -843 1747 4096 6010 6055 -48 -6047 -3605 5479 10075 -1859
15311 -1859 -15179 -10395 -7395 -14579 -16421 -17428 -18555 -16418 -7568 -1295 -1854 -3045 -11290 -6919 -6885
15296 -6885 -10702 -9971 -4605 -7503 -2720 3275 4686 -1753 -1936 -7263 -6880 -10903 -10861 -11991 -13100 -3708
15280 -3708 2659 1669 5108 8768 2702 -6339 -7310 -3834 -3674 -8775 -9178 -5751 8002 10385 5721
15265 5721 -4933 -8612 -6310 -11523 -3746 -7966 -11071 -12113 -19381 -17024 -8559 2435 10609 6692
15251F692j0712r499K541J1060Q615M995k970j0050j498K774n091L433M061q954
15237d603m611p22J928o646L119n705j756K437K791l953R846j636p4M004n056
15222a0637Q935K015p380M483k533J63O308J828K83K331L363n250M617j749J524
15207H301p4p670j819j4j329O478O183m204q511l027j41P958L782j1716n431M300
15191f934M963j645m11l401j896J835J4814L440p214j0616o260l393k486Q825
15177a0379R328O315n334r911J0210P420l481k054O16j698j1369l846m870J2449
15163f604l261j1600o769L250M937m811P73l916j785N488J4730M379N119L639
15149C569j984j658O748m670j2516k815N963R79m576p49M471N998k940K157P624
$$ plain form
15251 6692 -4020 -13519 -10978 82 8697 13692 10722 672 -826 1948 -3143 290 4351 -4603
15237 -4603 -9214 -9936 -8008 -14654 -11535 -17240 -18996 -16559 -13768 -17721 -7875 -9511 -9585 -5581 -10637
15222 -10637 -1702 313 -7067 -2584 -5117 -4954 1354 3182 3465 5796 9159 3909 8526 6777 8301
15207 8301 8227 557 -1262 -1276 -2605 3873 10056 5852 -2659 -5686 -5827 2131 5913 -5803 -11234 -6934
15191 -6934 -1971 -3616 -4027 -7428 -9324 -7489 7325 10765 3551 -7065 -13325 -16718 -19204 -10379
15177 -10379 -1051 5264 -70 -9981 229 7649 4168 2114 2730 1032 -10337 -14183 -19053 -6604
15163 -6604 -9865 -21465 -28234 -24984 -20047 -24858 -24085 -28001 -29786 -24298 -9568 -5189 -70 3569
15149 3569 1585 -73 6675 2005 -10511 -13326 -7363 -6384 -10960 -11709 -7238 -1240 -4180 -2023 5601
15134E601j978n278J659J454j909j464k17K044L746J038N368N464p574k779o430
15119a255J967N050L264q264m545M894Q766l877j463j688k996R96R658M121j539
15104A3089l519q727j076l598R8M79j871M819k232K075Q92L381o836q2O956J722
15088E570K29n75O150k484K499r22q960j7857K488J6688J229o10m38K65k557k670
15072a955m643J435L886J694r49N732n393j241O454k36P685J1443N924L338l32
15057C2842r801o494q66p87n539r510Q73M742N184K73M330J57L008L039r141J606
15041A3916M118M245l151p397l448N305J88j308q723K805L873m169r69N071P832
15026A8188L508J2726M260o044m600L598N496J306m734n800n887O623J1953J3736
$$ plain form
15134 5601 3623 -1655 4 1458 -451 -1915 -2132 -88 3658 4696 10064 15528 7954 5175 -1255
15119 -1255 712 5762 9026 762 -3783 1111 9877 6000 4537 2849 -147 849 10507 14628 13089
15104 13089 9570 843 -233 -3831 -3733 -3254 -5125 -306 -2538 -463 429 3810 -3026 -3108 3848 5570
15088 5570 5799 5224 11374 8890 11389 10467 1507 -16350 -13862 2826 4055 3445 3007 3272 715 -1955
15072 -1955 -6598 -5163 -1277 417 -532 5200 -193 -1434 5020 4784 12469 23912 29836 33174 32842
15057 32842 23041 16547 15681 14894 9355 -155 718 5460 10644 10917 15247 15404 18412 21451 12310 13916
15041 13916 18034 22279 19128 11731 8283 13588 13776 12468 3745 6550 10423 6254 5285 10356 18188
15026 18188 21696 34422 38682 32638 28038 31636 37132 38438 33704 27904 22017 28640 40593 54329
15012E4329j835j732J6962Q459k97M812M54O881Q941j0948j1036j4866l388l269
14998E3467j5056j0963K663l492m313J56m438k596l369M204k215n619J456M592
14984A4477O459p37q749n086n432n711J6291N126l067m259o202p246q255q3J2170
14969c04L644o572k78Q605j26j0971n359k696L776O323M040K942R18M84K081J562
14953H069n44n207n508K24N374L959l399k306k008P222l466j3959M801Q202O99
14938B153j591J925Q446M638j4099r963R624k758o419J941m636K59j034O646n878
14923a0746K11o834k962P784L455K939n49J837L644j356m171O68r83P162m723
14908d624N255K487o690j006M767L874J599n972l46Q96m923k306j182O87J775
$$ plain form
15012 54329 52494 50762 67724 76183 75886 80698 81152 88033 96974 86026 74990 60124 56736 53467
14998 53467 38411 27448 30111 26619 22306 22462 18024 15428 12059 16263 14048 8429 9885 14477
14984 14477 20936 20199 11450 6364 932 -4779 11512 16638 13571 9312 3110 -4136 -12391 -12474 -304
14969 -304 3340 -3232 -3510 5095 4969 -6002 -11361 -14057 -10281 -3958 82 3024 3942 4426 6507 8069
14953 8069 7525 2318 -3190 -2966 2408 6367 2968 662 -1346 5876 2410 -11549 -6748 1454 2153
14938 2153 562 2487 10933 15571 1472 -8491 1133 -1625 -8044 -6103 -10739 -10480 -11514 -4868 -10746
14923 -10746 -10535 -17369 -20331 -12547 -9092 -6153 -6702 -4865 -1221 -2577 -6748 -6080 -7063 99 -4624
14908 -4624 631 3118 -3572 -4578 189 4063 5662 -310 -656 240 -4683 -6989 -8171 -7484 -5709
14893e709j732P347M654k311O673m783k791K385P447k322m518r105l256N784P590
14878E353J4706K712j0986j2224R75M652n042k838k551L039K373m194p377P483
14864c919N636l609j2972J73Q919J8299j151n366j83p429J125J797M262P869n922
14849G529j8692p605M884N977k030Q951L719l074P151n33q704Q186L538m474Q81
14834E704j528m130L140L060M556n950K667L402L522n110p931l289N687O33l451
14819I82J166K176O72O842J589p757K513r37j0485l082K847K379Q667J568j1288
14804b148K87O571L404Q648P616o092Q24j868m114k408m187o609j3362K030Q210
14789c198O766J097l486J603J374j713p767o649m229J185J1009l210O384J0852
$$ plain form
14893 -5709 -7441 -94 4560 2249 8922 4139 1348 3733 11180 8858 4340 -4765 -8021 -2237 5353
14878 5353 20059 22771 11785 -439 536 5188 146 -2692 -5243 -2204 169 -4025 -11402 -3919
14864 -3919 1717 -1892 -14864 -14691 -5772 12527 11376 6010 5827 -1602 -477 1320 5582 13451 7529
14849 7529 -11163 -18768 -13884 -7907 -9937 -986 2733 -341 6810 6277 -2427 5759 9297 4823 5704
14834 5704 4176 46 3186 6246 10802 4852 7519 10921 14443 9333 1402 -1887 3800 4433 982
14819 982 2148 4324 4996 11838 13427 5670 8183 7246 -3239 -6321 -3474 -1095 7572 9140 -2148
14804 -2148 -1861 4710 8114 16762 24378 18286 19110 17242 13128 10720 6533 -76 -13438 -11408 -3198
14789 -3198 3568 4665 1179 2782 4156 2443 -5324 -11973 -16202 -15017 -4008 -7218 -834 10018
14775A0018R578K369N329K381j4097j3476L48l292K88n634J165K624J438k551
14761c512k328l201k500O02R156N934m882n933o928M514M184P94P507P319N68
14746A1294j859r391k354J511N638R528L649q171p298M796Q850L223o238m720
14732H458R228o67r794L35L484j855k425P64o474q042q86N246l091L812L320L615
14716E028J610O618J832m032J865k533J65l854o5K502l526R49P379K890Q764l275
14700B2317j3520n937M128o154K417K896r803j796J749J5505J2325r742l516k35
14686A0634K695j011j0148q01M26M442L027p233J495O979r78K088j0781K27l008
14671a947j0946n355P500N63Q013N299J852P647j100L044O141k695o236p341J2
$$ plain form
14775 10018 19596 21965 27294 29675 15578 2102 2450 -842 -554 -6188 -5023 -2399 -961 -3512
14761 -3512 -5840 -9041 -11541 -10939 -1783 4151 -731 -6664 -13592 -9078 -4894 -4100 3407 10726 11294
14746 11294 9435 44 -2310 -799 4839 14367 18016 9845 2547 7343 16193 19416 13178 8458
14732 8458 17686 17019 7225 7560 11044 9189 6764 7528 1054 -6988 -7874 -2628 -5719 -1907 1413 5028
14716 5028 6638 13256 15088 11056 12921 10388 10553 6699 6634 9136 5610 6559 13938 16828 25592 22317
14700 22317 8797 2860 6988 834 3251 6147 -3656 -5452 -3703 11802 24127 14385 10869 10634
14686 10634 13329 12318 2170 1369 1795 6237 9264 2031 3526 10505 9527 11615 834 1061 -1947
14671 -1947 -12893 -18248 -10748 -10185 -2172 3127 4979 12626 11526 14570 20711 18016 11780 4439 4451
14656D451K097O981J424n980m644l81l328J0321R276j3114m080P277J6594J6425
14642D3319o070o761n199j467N440J8420J5786J3193K3293L5084K8105L1571L2041
14629B26755K5107n27j8193k9594l6692k1863l1183k9668k0594j5712j5733p919
14617B4184r85r66k108O31q23k964n244k803K397K615m252M364K2p511j4798M133
14601d108J0932Q403j1268j773L58L301k696k40k368j510J442P936L199k071O42
14586A0179n556k375M890M034J7406K43j3934j1730j5832R43L742J1028P692K296
14572A3026o325n417K352N046k871j1794j285J245n89J0438N549O359K093m511
14558A3316J689R62n207k920n16O096L358m585n933j085m289L599k581j866N776
$$ plain form
14656 4451 6548 13529 14953 8973 4329 3948 620 10941 20217 7103 3023 10300 26894 43319
14642 43319 37249 30488 25289 23822 29262 47682 63468 76661 99954 135038 163143 194714 226755
14629 226755 251862 251335 233142 203548 166856 144993 113810 84142 63548 47836 32103 24184
14617 24184 23199 22233 20125 20756 19933 16969 11725 8922 11319 13934 9682 14046 14068 6557 -8241 -4108
14601 -4108 6824 15227 3959 2186 2544 5845 3149 2909 541 -969 473 8409 11608 9537 10179
14586 10179 4623 2248 7138 11172 28578 28821 14887 3157 -12675 -11732 -7990 3038 10730 13026
14572 13026 6701 1284 3636 8682 5811 -5983 -7268 -6023 -6612 3826 9375 15734 17827 13316
14558 13316 15005 15967 10760 7840 7324 13420 16778 12193 6260 5175 886 4485 1904 38 5814
14543E814Q212L282o778L646J1916O247j053j3200n380L662K728k244N596R15
14529B3363o607j0822l060L209M283K607q263l916q334J3431j349j0830J904N443
14515A059O985K466j235j0210l443O003R859k914m454l158k443l396L21N038r11
14500d33J565o224m342N174O063q31n495n282N696O080K517K584j979K518J533
14485I144K030J1924l720m691j558m38j730r92o246k941J480l820o176L7P90j780
14469h687J022P653Q551M603N290j050p330M02N41K889O806M056K148j763q75
14454B4256j1239m220K613n286R949K517O16J520j302k73k621M748M60l063q439
14439A0236J2031r896m360k912R25n458p475j816Q14K926J1701J532P006j848
$$ plain form
14543 5814 14026 17308 10530 14176 26092 32339 31286 18086 12706 16368 19096 16852 22448 23363
14529 23363 16756 5934 2874 6083 10366 12973 4710 794 -7540 5891 4542 -6288 -4384 1059
14515 1059 8044 10510 9275 -935 -4378 1625 11484 8570 4116 958 -1485 -4881 -4560 478 -433
14500 -433 1132 -5092 -9434 -4260 1803 972 -4523 -9805 -4109 1971 4488 7072 5093 7611 9144
14485 9144 11174 23098 19378 14687 13129 12691 10961 9969 3723 782 2262 -1558 -7734 -7697 -6907 -8687
14469 -8687 -7665 -12 8539 13142 18432 17382 10052 10454 10995 13884 20690 24746 26894 25131 24256
14454 24256 13017 8797 11410 6124 16073 18590 19206 20726 19424 19151 16530 21278 21738 18675 10236
14439 10236 22267 12371 8011 5099 6024 566 -6909 -8725 -7911 -4985 6716 8248 15254 13406
14425A3406j1402L621P922Q8j981q54J472j132m340L622L100P85k225j324J706
14410A2464L495J018l210l047o246O735O95K601j1045K742j543m602N054k15j377
14395C519J1290j95R38J277k685p646q341l407R791M260K719j795j0377m157p671
14380a2480M550J744N554n101L931N437m648J155j846n811m144R998N804M583
14366H726J706P487Q54n653m673K411j163j175O154J0124l719r058j399P0l52
14351A0340J141q53m021O862N986n92n458q99k671p78K423q473N138O253r909
14336D489p884J1152J2515n513p04r594L40J59J030q29p11J345R07j492k357M851
14320G704J060m25l888l226J708O396L538j298K705M727k02J2848m275J671o970
$$ plain form
14425 13406 2004 5625 13547 13635 11654 10800 12272 11140 6800 10422 13522 14307 12082 10758 12464
14410 12464 15959 16977 13767 10720 4474 11209 11904 14505 3460 6202 4659 57 5111 4896 3519
14395 3519 14809 14614 15552 16829 14144 6498 -1843 -5250 4541 8801 11520 9725 -652 -4809 -12480
14380 -12480 -7930 -6186 -632 -5733 -1802 3635 -1013 142 -1704 -7515 -11659 -1661 4143 8726
14366 8726 10432 17919 18773 13120 8447 10858 9695 8520 14674 24798 21079 12021 10622 10692 10340
14351 10340 11481 10628 6607 13469 19455 18863 13405 12506 9835 9057 11480 3007 8145 14398 4489
14336 4489 -3395 7757 20272 14759 14055 4461 4801 4960 5990 5161 4450 5795 6702 5210 2853 7704
14320 7704 8764 8339 4451 1225 2933 9329 12867 11569 14274 19001 18799 31647 27372 29043 22073
14305B2073n124Q32J760m400r945k847K270K193O281l985o639M99j517L664P508
14290A2623k611n057p679k198O072R778K096K131K984l392Q31R134J350N459m557
14275B6964n856p124l829L372k399m170J471N237P050R43m283j100n798M627o50
14260A4455r33o581j677J942N136N94L794j426j0572k241k412l798N348j46j937
14245d54M731M880J805J799k347j1113k101L800Q538N186j0296m602Q745J301
14231I872n1J3132J578k667L165m140l375L704r309k621P34l558k112l50M541
14216H543k820k592o753J406J1514J7531l0k389l736J1487K55j2306n604l465
14202A1041j840o196j601P640P965K896l118r905l474M731R050Q261m716n033
$$ plain form
14305 22073 16949 17781 19541 15141 5196 2349 4619 6812 13093 9108 2469 2968 1451 5115 12623
14290 12623 10012 4955 -2724 -4922 1150 10928 13024 15155 18139 14747 15578 24712 26062 31521 26964
14275 26964 21108 13984 10155 13527 11128 6958 8429 13666 20716 21659 17376 16276 10478 15105 14455
14260 14455 13522 6941 5264 7206 12342 12936 16730 15304 4732 2491 79 -3719 1629 1483 -454
14245 -454 4277 9157 10962 12761 10414 -699 -2800 1000 9538 14724 4428 -174 8571 9872
14231 9872 9821 22953 24531 21864 25029 20889 17514 21218 11909 9288 10022 6464 4352 4002 8543
14216 8543 5723 3131 -3622 -2216 9298 26829 26799 24410 20674 32161 32416 20110 14506 11041
14202 11041 9201 3005 1404 9044 17009 19905 16787 6882 3408 8139 17189 25450 20734 15701
14188A5701m215k775P635j920k260k020k942J358j347L579L30m538k527j1312
14174g253J919P209N35o33n87L358O604R30J260O164J083k792l288l709j225L818
14158A3393o56j479J677J822O889L692j122l922J022L321o420q512M298K252j102
14143A5153L57l160l240M41L221l695j500j208L513J1048Q750J990q914q109M202
14128A8849p937k755k888p49q10M093L266K528l691j056P15K221m764o766J5918
14113A6174J0099k751l571j97J158K339m709M588J723l961j587M561J118p728
14099A7256q100K072L299k675o373M634N171Q01r639m361k494M760O434J130L8
14084A1953J0107o18o544m947l84o602R91k520l393L849P266M161m934M813k621
$$ plain form
14188 15701 11486 8711 16346 14426 12166 10146 7204 8562 7215 10794 11124 6586 4059 -7253
14174 -7253 -5334 1875 2410 1777 1190 4548 11152 12082 13342 19506 20589 17797 14509 10800 9575 13393
14158 13393 12737 11258 12935 14757 21646 25338 24216 20294 21316 24637 18217 9705 14003 16255 15153
14143 15153 15510 12350 9110 9551 12772 9077 7577 6369 9882 20930 29680 31670 22756 14647 18849
14128 18849 10912 8157 5269 4520 3710 7803 11069 13597 9906 8850 9565 11786 7022 256 16174
14113 16174 26273 23522 19951 19754 20912 23251 18542 23130 24853 20892 19305 23866 24984 17256
14099 17256 9156 11228 14527 11852 5479 10113 15284 16085 6446 2085 -409 4351 10785 11915 11953
14084 11953 22060 21442 14898 9951 9567 2965 3956 1436 -1957 1892 9158 13319 8385 13198 10577
14069A0577l864l377J933K290Q09m907O726J0155K195O920K235r142o988K560
14055A8122j583m658o62m66l743J38M393L128j633n041N670L26m464o123l112
14040B92O564O605l893l701J4181J4740k198j0643j396n346L800J4270N89l1Q08
14025C4641p258q395n110K789N350J098J801k556K579J2757L947N461o527o941
14011C3636n995P47L716j732m444m761Q388o846k499K582k008N496O564j363o110
13996B5371m52J1890k975o303M126k883N793J1492K769K620N928J2131J1234M333
13982H5074P389J9350K6421K2666L7823M9164Q8461J23252J36228J39898J35592
13971H71318J31873R3605M1019J440n0876j05395j31355j30825j28261j15214
$$ plain form
14069 10577 6713 3336 5269 7559 8368 3461 10187 20342 22537 29457 31692 22550 15562 18122
14055 18122 16539 11881 11219 10753 7010 7148 11541 14669 13036 7995 13665 13991 9527 3404 292
14040 292 6856 13461 9568 5867 20048 34788 32590 21947 20551 15205 19005 33275 33864 33833 34641
14025 34641 27383 18988 13878 16667 22017 23115 24916 22360 24939 37696 41643 47104 40577 33636
14011 33636 27641 28388 32104 30372 25928 21167 29555 22709 20210 22792 20784 26280 32844 31481 25371
13996 25371 24919 36809 33834 27531 31657 28774 34567 46059 48828 51448 57376 69507 80741 85074
13982 85074 92463 111813 138234 160900 198723 247887 336348 459600 595828 735726 871318
13971 871318 1003191 1096796 1137815 1139255 1088379 982984 851629 720804 592543 477329
13961D77329j03172r0519o0888m1885l1423k2547j9015j5670j5082l848m871j3276
13949E5133l169m446o165P476o82l229p261n933o475p84J330J119l671m815Q73
13934A9301J545M959N515j0885m051j747O110J286p354N93O351L103j146L467
13920B7047q365K329M667Q11k474l435k229j41n3L392L490N214J1213m871n583
13905C1012l863m508j2652J845P973K974o670r741Q082R043r81j296J764q655
13891A4327O863P417k377R25j551Q57m055l794O750N911p662l170P85k574j389
13876A7263r027K28J3660Q954K253k348n751k731l75M206L585N63n071j061r26
13861B3422k999K556l344q006N203O193J0052L861j061M42Q304N817P898N000
$$ plain form
13961 477329 374157 283638 222750 180865 149442 126895 107880 92210 77128 73280 68409 55133
13949 55133 51964 47518 41353 48829 48147 44918 37657 31724 25249 24465 25795 26914 23243 18428 19301
13934 19301 20846 25805 31320 20435 16384 14637 20747 22033 14679 15272 21623 24726 23580 27047
13920 27047 18682 21011 25678 26489 24015 20580 18351 18210 18157 21549 25039 30253 41466 36595 31012
13905 31012 27149 22641 9989 11834 19807 22781 16111 6370 14452 23495 22514 21218 22982 14327
13891 14327 21190 28607 26230 27155 25604 26461 22406 18612 25362 31273 23611 20441 21226 18652 17263
13876 17263 8236 8464 22124 31078 33331 30983 25232 22501 22126 26332 29917 30480 25409 24348 23422
13861 23422 20423 22979 19635 11629 16832 23025 33077 36938 35877 36319 44623 50440 58338 63338
13847F3338m034K486P862M507m91o730N93R856j150m653j103k120k523q596J548
13832E8790j295r641j5300n116P81n998j521R461R1K249k830q710k101L230O633
13817B8723n291M334J827m263j269J624k260J684M72P22j317L587l400j5005j83
13802I985O550L516q720J075M209r473M86K983K983R038Q206l977q19n171l290
13787A7581r44o845j26J0931K441k126j691K773n201o732N550n003q395J0073
13773A2286J2783O719j00m923n33j57j419j0176m333j386P141R216N575l090k454
13758B5149j722J53k015m55p401K450K15j359l50j671O51p12P002J1567j183j1564
13742A8755k711Q169N847n41Q0Q86K731P534k296L93k270n959n369m966R71l970
$$ plain form
13847 63338 59304 61790 69652 74159 73668 66938 67531 77387 76237 71584 70481 68361 65838 57242 58790
13832 58790 57495 47854 32554 27438 28219 22221 20700 30161 30252 32501 29671 20961 18860 22090 28723
13817 28723 23432 27766 29593 25330 24061 25685 23425 25109 25581 26303 24986 28573 25173 10168 9985
13802 9985 16535 20051 11331 12406 16615 7142 7628 10611 13594 22632 30838 26861 26042 20871 17581
13787 17581 16637 9792 9666 20597 23038 20912 19221 21994 16793 10061 15611 10608 2213 12286
13773 12286 25069 31788 31688 26765 26232 26075 24656 14480 10147 8761 15902 25118 30693 27603 25149
13758 25149 23427 23580 21565 21110 13709 16159 16374 15015 14665 12994 13645 12933 19935 31502 30319 18755
13742 18755 16044 24213 30060 29519 29599 30485 33216 40750 38454 38847 36577 30618 25249 20283 21254 17284
13726A7284R043L129J186L293K696j01M494J469j874m377k526P34q541n02l29
13711B5078M98m544L054k242N551N650n61l31n53l596q29L793l10r064j1044l292
13695G258q5O914J1119n809r560J584L113j190m102k927L547K007l68O157m37
13680A7221j972O710J0792N902N612j549m439o689m979l181j268p54p652j1437
13666B317K058O743J1293n17j471r561N665Q448l72O18m25K448m19R90M275j457
13650C0633n952l97o05L514P84J118j372l243p14p5m87m978P132R197p402r414
13634A7739M516O32k525J444j525q8M755Q162J678q731j749O799L711q73j0598
13619B3347m884L179J3721J3419J449k859o585m469m343r459o610L790m31l872
$$ plain form
13726 17284 26327 29456 30642 33935 36631 36530 41024 42493 40619 36242 33716 34450 25909 25407 25078
13711 25078 25576 21032 24086 21844 27395 33045 32484 32153 31600 28004 27175 30968 30658 21594 10550 7258
13695 7258 7173 14087 25206 19397 9837 11421 14534 13344 9242 6315 9862 11869 11501 17658 17221
13680 17221 15249 21959 32751 38653 44265 42716 38277 31588 26609 23428 22160 21406 13754 2317
13666 2317 4375 11118 22411 21894 20423 10862 16527 24975 24603 25221 24796 27244 26825 27815 32090 30633
13650 30633 24681 24284 23679 27193 27977 29095 27723 24480 23766 23691 23204 18226 25358 34555 27153 17739
13634 17739 22255 22887 20362 21806 20281 20193 24948 33110 34788 26057 24308 31107 34818 33945 23347
13619 23347 18463 21642 35363 48782 50231 47372 40787 36318 31975 22516 15906 19696 19265 15393
13605A5393l21L759J528n392m487N975Q459j133l04J69o84j675M095Q298R933
13590D3613m312l446r036j2661L316O166M035j605l699m493p84L841L717L943
13576B8595l527k561R596J711J527j883l768m513J476L21M151J144q957N50j116
13561B2746j018J113L278K753k499j768l598j517j037L950L870M649L887p224
13547B7585n734R25M512Ll989N413R200Q923J308m765r494R09M210K673l268k441
13531C5970p35j756j294M073J557l366J234O28K522p579l071M267q40P251M811
13516D3672M171Q994J614j1784j1255j183n10n28o6L514p28j411J86j151o413
13501B7122M907J774m246k248j967L790P81l210k564N745O300l74J513R49q178
$$ plain form
13605 15393 15072 18831 20359 14967 10480 16455 24914 23781 23477 23646 22962 21287 25382 33680 43613
13590 43613 39301 35855 26819 14158 17474 23640 27675 26070 22371 17878 17094 20935 24652 28595
13576 28595 25068 22507 32103 33814 35341 33458 29690 25177 26653 26974 31125 32269 23312 23862 22746
13561 22746 21728 22841 26119 28872 26373 24605 21007 19490 18453 22403 26273 30922 34809 27585
13547 27585 21851 22776 27288 27291 23302 28715 37915 46838 48146 43381 33887 34796 39006 41679 38411 35970
13531 35970 35235 33479 32185 36258 37815 34449 35683 36311 38833 31254 28183 32450 31610 38861 43672
13516 43672 47843 56837 58451 46667 35412 34229 33719 33191 33125 36639 35911 34500 34686 33535 27122
13501 27122 32029 33803 29557 27309 25342 29132 29913 26703 24139 29884 36184 35810 37323 38272 30094
13486C0094r92K535l370l852L528M965l454j0142k581L088N614Q619J1052o73
13472D4431p309p008n323L700P492O873P69n219K930j597N413L275q780l040M697
13457D1304L417r404m289l291J377J046J0077m541m980L735o85j080k648K327
13443C2365o170m34N701M30q161N450m013n608j823J559J2118j109l956L15O799
13428C3463L473O692m074j407K046k316m490k61J741J060k095l431n303j849J327
13413B4576m83Q31K849M208O392l54J321r93j265j498k24J543k036k235m733J047
13397B8946J19j524J291J725L178O82n010K831O101l588j2759j395O81l330K401
13382B0349p2P929J208O04O075L038q206j629l227l198R390J2226q677j0422J433
$$ plain form
13486 30094 29102 31637 28267 24415 27943 32908 29454 19312 16731 19819 25433 34052 45104 44431
13472 44431 37122 30114 24791 28491 35983 42856 43625 38406 41336 39739 45152 48427 39647 36607 41304
13457 41304 44721 35317 31028 27737 29114 30160 40237 35696 30716 34451 33766 32686 30038 32365
13443 32365 26195 25761 31462 31892 23731 29181 25168 19560 17737 19296 31414 30305 26349 26664 33463
13428 33463 36936 43628 39554 38147 40193 37877 33387 33126 34867 35927 33832 30401 25098 23249 24576
13413 24576 24093 24924 27773 31981 38373 38019 39340 38347 37082 35584 35360 36903 34867 32632 27899 28946
13397 28946 29065 27541 28832 30557 33735 34417 29407 32238 38339 34751 21992 20597 21278 17948 20349
13382 20349 20277 28206 29414 30018 36093 39131 30925 29296 26069 22871 32261 44487 35810 25388 26821
13367B6821P889J2212n651m038L171o513k220J1753j240o348m224Q478J537q86
13353D0741l9o233k812m70k74J207k907k453L076l35R817P660k079j3731m169
13338B6999P723m137k854K357M895L797l867k266m127P939L098J876O29k836M107
13323D3333P765k912q959j305M371n557L146J233o452j388K306K936Q167J005
13309D7689l218k925m030K084M061J180l616j818j152K973N112o11m307n129m957
13294C1336P35P000l106L512J1N694L628o140o882r293L352J014N792J598o326
13279C1925J047o186J440M466J0049N141L849O014L744k939m706J613p287M897
13265E3067n49j247k055m43k178j419m418p062N611J4724Q217r1l408k437L159
$$ plain form
13367 26821 34710 46922 41271 37233 40404 33891 31671 43424 42184 35836 31612 40090 41627 40741
13353 40741 40702 34469 31657 31187 30913 32120 29213 26760 29836 29501 39318 46978 44899 31168 26999
13338 26999 34722 30585 27731 30088 34983 38780 34913 32647 28520 36459 39557 41433 42062 39226 43333
13323 43333 51098 48186 39227 37922 42293 36736 39882 41115 34663 33275 35581 38517 46684 47689
13309 47689 44471 41546 37516 39600 43661 44841 41225 39407 38255 41228 46340 45729 41422 36293 31336
13294 31336 32071 39071 35965 39477 39488 45182 48810 42670 35788 26495 29847 30861 36653 38251 31925
13279 31925 32972 26786 28226 32692 42741 47882 51731 57745 61489 58550 53844 55457 48170 53067
13265 53067 52518 51271 49216 48773 46595 45176 40758 33696 39307 54031 62248 62157 58749 56312 59471
13250E9471k241j58k485o538J248R88m791k693J837M913Q20p340n756P759R817
13235E4851Q834J1699P51p382m911J651r631r756M042N791M708L840O674J3912
13221H5073P508L541q843n227q565j0188P766L451j2943j4243J424Q305P854L838
13207F8751J7918M8838O4225P400k8207l2690k3677k0496j5878j1312j2777n600
13195E6495m301o246o963l176q5l366N737O872R693j439k249m10P061L868K887
13180F4378J0427R705L963M947K745p368p441j0919j2261j491N229R032K121m834
13166F8233j1101K23j147L142j16N462N466R273J8050J4412K4474O0429P8890
13153B75690N1048O57l0905m2942n5333m3548k4307j6482j2898j1399n80o073
$$ plain form
13250 59471 57230 57072 54587 48049 49297 50285 45494 42801 44638 49551 50371 43031 37275 45034 54851
13235 54851 63685 75384 76135 68753 63842 65493 55862 46106 50148 55939 60647 64487 71161 85073
13221 85073 92581 96122 87279 82052 73487 63299 71065 74516 61573 47330 48754 57059 64913 68751
13207 68751 86669 135507 199732 207132 178925 146235 122558 102062 86184 74872 62095 56495
13195 56495 52194 45948 38985 35809 35724 32358 38095 44967 54660 53221 50972 50562 57623 61491 64378
13180 64378 74805 84510 88473 93420 96165 88797 81356 70437 58176 56685 61914 70946 73067 68233
13166 68233 57132 57355 56208 59350 59234 64696 70162 79435 97485 111897 136371 196800 275690
13153 275690 326738 327395 296490 253548 198215 154667 130360 113878 100980 89581 89001 82928
13141H2928j058j0373n138k091p588o31M975P318m82j271J1234J071q795l619
13127F6480q773o088L288L583P875J268O646N293N624J0778J1279J2035Q17M877
13113A24982L0348N7556R7344J47891J97287J72895N3183p0227j49501j57819
13103E03939j30841r3982o1773m2343l6701j5384j0276n019m233n855j3914r594
13091G4024n738L090k739j6993k027J2914M910M25o48l03N546P177o553m360l352
13076F5373N890J1771J3488N985Q815K716Q275K0907K4001M5757P9944J35885
13064D28807J95476J86046R6761m1078j42666j65216j45698j16672o7898m0772
13054A87090k6427j6569k0972k8429j3843k361o486p197M695J5426O329j1220
$$ plain form
13141 82928 81870 71497 66359 64268 56680 56049 61024 68342 67860 66589 77823 78894 70099 66480
13127 66480 57707 51619 54907 58490 66365 67633 74279 79572 85196 95974 107253 119288 120105 124982
13113 124982 155330 212886 310230 458121 655408 828303 881486 811259 661758 503939
13103 503939 373098 279116 217343 175000 138299 122915 112639 107620 103387 97532 83618 74024
13091 74024 68286 71376 68637 51644 49617 62531 67441 67866 67218 66915 72461 79638 73085 68725 65373
13076 65373 71263 83034 96522 102507 111322 114038 122313 143220 167221 212978 292922 428807
13064 428807 624283 810329 907090 866012 723346 558130 412432 295760 227862 187090
13054 187090 160663 144094 123122 94693 80850 78489 72003 64806 69501 84927 91256 80036
13042H0036j917L361o30o019q775N907J749r19o207r35j304N169k043n206L650
13027F5917N535M401O747J3500M736Q320J9320M0798O2966O5605L7406j537l8439
13014B95275n8168n4686m1744j6036p343j2824j0047p150r39j0362j0664k137
13002F3175N693Q042M108j1187j2396p89L368p337q574M787P149J457J873q179
12988E1190m177m84N475J807l735O665P130M295N901M867l447o884K551M503J923
12973G7580p653j0088k992j637k16J4603Q937m563l574j087K972J945n70o257
12959F7400p359l559k222L329m314J783K999j4358o69k039n102P515R722R23O118
12944F0167N54l699l616K997l895L355k7K867J011N31L561N432p852k336l042
$$ plain form
13042 80036 78119 81480 80850 74831 66056 71963 73712 72793 66586 65651 64347 69516 67473 62267 65917
13027 65917 71452 75853 82600 96100 100836 109156 128476 169274 232240 297845 335251 333714 295275
13014 295275 237107 182421 140677 124641 117298 104474 94427 87277 86338 75976 65312 63175
13002 63175 68868 76910 81018 69831 57435 56646 60014 52677 44103 48890 56039 57496 59369 51190
12988 51190 47013 46529 52004 53811 50076 56741 63871 68166 74067 78934 75487 68603 71154 75657 77580
12973 77580 69927 59839 56847 55210 54994 69597 78534 73971 70397 69310 72282 74227 73657 67400
12959 67400 60041 56482 54260 57589 53275 55058 58057 43699 43030 40991 35889 43404 53126 54049 60167
12944 60167 60721 57022 53406 56403 52508 55863 55836 58703 59714 60245 63806 69238 61386 59050 56008
12929E6008L32K258n28k459l18K679M902J1429J769r458r46l976m495o910M702
12914E4989o38R296n483m053L704R715N548Q220l636p336j985k359N171K287M181
12899G7621j827m253l461L077M880N081m664M81Q387q664j2140j1316R007J260
12885F3469o22n520L076k691J867M860N01Q184J031j386o078j49K68M346O158
12870G7314n718l819k057J797P871N113J0424N39j1886j0009K967M951J269N181
12856H3937j33o400r334r25N416L538J0134P766o689m613N838j4332o469l221
12842F4513P055J243j46j872m830m42J87k176O560R348M982j100o305j471K174
12827G7720M306r525j295j2451o7j323j918J0715P634P022M60l760M1l029o388
$$ plain form
12929 56008 56340 58598 58070 55611 55293 57972 62874 74303 76072 66614 65668 61692 57197 50287 54989
12914 54989 54351 63647 58164 54111 57815 67530 73078 81298 77662 70326 68341 65982 71153 73440 77621
12899 77621 75794 71541 68080 71157 76037 81118 76454 76935 85322 76658 64518 53202 62209 63469
12885 63469 62847 57327 60403 57712 59579 64439 64940 73124 74155 72769 66691 66542 66810 71156 77314
12870 77314 71596 67777 65720 67517 75388 80501 90925 91464 79578 69569 72536 77487 78756 83937
12856 83937 83804 77404 68070 67145 72561 76099 86233 93999 87310 82697 88535 74203 67734 64513
12842 64513 71568 72811 72665 70793 65963 65521 65708 63532 70092 79440 84422 83322 77017 75546 77720
12827 77720 82026 72501 71206 58755 58688 57365 55447 66162 73796 80818 81278 77518 77559 74530 68142
12812F8142N190P555m375m272N45k264L151q088p576O469J2630L40j942P346N65
12797H3416o686m833O439K998J180o388j0278N686M940m964n888O366N187O261
12783H3436P379j582j070l804k937J601j0293p597Q353k376k410J935N848j462
12769G5021N889K271k934K395m669P43J0781N445L883q612o009K547O78P88Q03
12754H9020P53l185k601N506K026K463l432P684r7o263r976R764O546n817K960
12739I5351L818m270k018j41j0544n549M870L134P579O190j164r076m148K405
12725H6437o303k542K513R500r601p764J1100Q378L943M885j115N14j493J529
12711I9981J096n890k298j329j1429q905p232o846n426m977j1774p847P286N701
$$ plain form
12812 68142 73332 80887 76512 72240 72785 70521 73672 65584 58008 64477 77107 77447 75505 82851 83416
12797 83416 76730 71897 78336 81334 82514 76126 65848 71534 76474 71510 65622 71988 77175 83436
12783 83436 90815 89233 88163 84359 81422 83023 72730 65133 73486 71110 68700 70635 76483 75021
12769 75021 80910 83181 80247 82642 77973 78716 89497 94942 98825 90213 84204 86751 87429 88217 89020
12754 89020 89773 86588 83987 89493 91519 93982 90550 98234 98137 91874 81898 91662 98208 92391 95351
12739 95351 99169 94899 92881 92740 82196 76647 81517 84651 92230 98420 97256 88180 84032 86437
12725 86437 80134 77592 80105 89605 80004 72240 83340 91718 95661 100546 99431 99945 98452 99981
12711 99981 101077 95187 92889 91560 80131 71226 63994 57148 51722 46745 34971 27124 34410 40111
12697D0111k277j231R252J6116N278L024J2483M666Q776J0913l925o450L453Q007
12683A08196J739K786J993Q735r07r42L017n481k972J283O450L283M101P61J304
12668A33346o114N474J5107Q367J2619J4474J4883J3694K3726L7533N0777N6882
12656C80768P4396P6538P9056P5775P0641N6933J9930N1j9028n4416p4672p8428
12644F07544q1343p8420o6551n1211l9890k9013j6454k2731j4569k3889r847M88
12632A74114q107j5289p325l417J088n099r102M64N226m99j4176l12k40J604O22
12617A19552n095N192R025j67r89J871o711j969L618L563K450k365m970K285M544
12602A29834O371K673M019p829j4991j88N183Q629n13l483n465P62R42m383J584
$$ plain form
12697 40111 37834 36603 45855 61971 67249 70273 82756 87422 96198 107111 103186 96736 100189 108196
12683 108196 109935 112721 114714 123449 122542 121600 124617 119136 116164 117447 123897 127180 131281 132042 133346
12668 133346 127232 132706 147813 156180 168799 183273 198156 211850 235576 273109 323886 380768
12656 380768 455164 531702 610758 686533 757174 814107 834037 834088 815060 760644 685972 607544
12644 607544 526201 447781 381230 330019 290129 261116 244662 221931 207362 183473 173626 174114
12632 174114 166007 150718 143393 139976 141064 135965 126863 127327 132553 132054 117878 117566 117326 118930 119552
12617 119552 114457 119649 128674 128507 127518 129389 122678 120709 124327 127890 130340 127975 123005 125290 129834
12602 129834 136205 138878 142897 135068 120077 119889 125072 133701 133188 129705 124240 125002 125944 121561 123145
12587A23145J4017J965m527m345p994m230P166Q691r1r935k685J0522J3810K722
12573A48231O557O32n047K461O175l786j0782k091k575p188m680n215N131R088
12559A36911P253k853j311J001O037n310o579J139j320l272J127n63r56P958k383
12544A36879L114Q01m492R49M428K273K30n112J46Q983J3219J8132J1556o093
12530A85013q862p225J992l576k410Q012n885p653L550P808q3m631O948K442l55
12515A75085l613m899N98O066O66m177q06P526k754K627Q436p291qm68J207N331
12499A83526k4N807J3552R953J0231N573J1643J0230P187J0825O393j3529l913
12486B57454K712L155k753j4492l839L525j0354j2557l182m910p053l889j0214
$$ plain form
12587 123145 137162 139127 134600 130255 122261 118031 125197 133888 133797 123862 121177 131699 145509 148231
12573 148231 154788 155420 150373 152834 159009 155223 144441 142350 139775 132587 127907 122692 127823 136911
12559 136911 144164 141311 140000 141001 147038 141728 135149 136288 134968 131696 132823 132260 131304 139262 136879
12544 136879 139993 140794 136302 137251 141679 143952 144182 139070 139216 148199 161418 179550 191106 185013
12530 185013 176151 168926 170918 167342 164932 172944 167059 159406 162956 170764 170681 166050 172998 175440 175085
12515 175085 171472 166573 167171 173237 173903 169726 168920 176446 173692 176319 184755 177464 177456 176988 178195 183526
12499 183526 183502 189309 202861 212814 223045 228618 240261 250491 257678 268503 274896 261367 257454
12486 257454 260166 263321 260568 246076 242237 245762 235408 222851 219669 214759 207706 203817 193603
12473A93603j3504j176J210J570K64k157n775m719J0990P826J491n666o500q697
12459A68760M797m291k924P107K938n729n563k108p569L127l534M855p586o828
12445A45452L086m864o381J798L100j345Q896R362J992L596k410r556p442O069
12431A51353K160m653Q705K8156L7439N0650M2716J4764m18k371j841K644P194
12418C36498L766r792j8025j3806o172j4314j2347p373m698p146k785P536O968
12405B58310k378l719K6q181L897O800l228m943j256M13K485M506m16j3325r098
12390B29893J058Q601P565M442N624N902P089j503M405L856l386O926O668J2627
12376B99767J3639J006L148J6475J2851Q708J2208J1693J2167L804J5596J7072
$$ plain form
12473 193603 180099 178923 180133 181703 181967 179810 174035 169316 180306 188132 189623 183957 177457 168760
12459 168760 173557 169266 166342 173449 176387 170658 165095 162987 155418 158545 155011 159866 152280 145452
12445 145452 148538 143674 137293 139091 142191 140846 149742 159104 161096 164692 162282 152726 145284 151353
12431 151353 153513 148860 157565 185721 223160 273810 316526 331290 330872 328501 326660 329304 336498
12418 336498 340264 330472 312447 298641 292469 278155 265808 258435 253737 246591 243806 251342 258310
12405 258310 255932 252213 252239 244058 247955 254755 251527 246584 245328 245741 248226 252732 252316 238991 229893
12390 229893 230951 239552 247117 251559 257183 263085 270174 268671 273076 276932 273546 280472 287140 299767
12376 299767 313406 314412 317560 334035 346886 355594 367802 379495 391662 395466 411062 428134
12364D28134p155o995q4l314j1179n861j9179k7518j5037j0968j0892l504r085
12351B97363j4173k135k167l273o851r672o9J0557J7476J4820N460J3190K198
12338C22724J250Q023Q675Q362N914Q186R540m484k033J0546J1965J0187J2381
12325D11236J0871N732K0346K1209m013K161P860J1441N814j584j41L722O149
12312E00803J7531O797q37J112R144M096N609J3471J1136K4384K0736J5383J2098
12299F41463J9127K4751K9065K6764M0511L0077J7802J6182K1401J7412K35L232
12287H88022N040N430J4516J9940J5998K5054K5524L1630L4016M4590M6407M9969
12275A206136O0900N9654O8062P2623Q1102Q6070Q5308R6921J02347R3470J11037
$$ plain form
12364 428134 420979 413984 413900 410586 399407 393546 374367 346849 331812 320844 309952 306448 297363
12351 297363 283190 281055 278888 275615 268764 259092 259023 269580 287056 301876 307336 320526 322724
12338 322724 323974 331997 340672 349034 354948 363134 372674 368190 366157 376703 388668 398855 411236
12325 411236 422107 427839 448185 469394 465381 467542 475402 486843 492657 491073 490932 494654 500803
12312 500803 518334 525131 524294 525406 534550 538646 544255 557726 568862 593246 613982 629365 641463
12299 641463 660590 685341 714406 741170 781681 811758 829560 845742 867143 884555 884790 888022
12287 888022 893062 898492 913008 932948 948946 974000 999524 1031154 1065170 1109760 1156167 1206136
12275 1206136 1267036 1326690 1394752 1467375 1548477 1634547 1719855 1816776 1919123 2012593 2123630
12264B123630J25414J39100J70600J95449K20189K58607L04468L65078M47840
12255D350375N53369O63302P79876Q88188J005756J081113J139665J227615J349489
12246A3038748J571010J987332K709143L967019O035579Q925523J1802335J4009941
12238F4046630J6168308J7497982J6848770J3977190J0016652N123199o19361
12231A43059370o461388j1492332j4679045j6255954j6555896j5722366j3527036
12224D8365353j0767569q137285n887137m221033l100965k367490j885734j574275
12216A0423865j371197j212788j093074r73661q49775p25534o03438m81613l84573
12207B728212l15117k56901k06077j69960j41822j16275r5284p4620p4345n3966
$$ plain form
12264 2123630 2249044 2388144 2558744 2754193 2974382 3232989 3537457 3902535 4350375
12255 4350375 4903744 5567046 6346922 7235110 8240866 9321979 10461644 11689259 13038748
12246 13038748 14609758 16597090 19306233 23273252 29308831 38234354 50036689 64046630
12238 64046630 80214938 97712920 114561690 128538880 138555532 143678731 143059370
12231 143059370 136597982 125105650 110426605 94170651 77614755 61892389 48365353
12224 48365353 37597784 29460499 23573362 19352329 16251364 13883874 11998140 10423865
12216 10423865 9052668 7839880 6746806 5773145 4923370 4197836 3594398 3112785 2728212
12207 2728212 2413095 2156194 1950117 1780157 1638335 1522060 1426776 1352156 1277811 1223845
12197A223845l7620l7273k9522k4459j2342k8899l4932l7382m2831m8228n7066
12186H33291o9744m9545m4998m9374m3990k7489l3127l3180k6223k2633j4719
12175D18269k2348k9762q189r535j2663m586j0305l596Q67m176K610n41q710j311
12161C06024n271Q595k247r900j3465Q668O099J0726M715J2378K6179L0358K6983
12148D09842L5022M5436N2249L5880J4761Q862j173k4075k5579l2552l5365l1480
12136D51828j7297j0285p665l473K457J5889L6547M2473M0379K5626K5348O986
12124F08813r787j3079j9135k1179M564L5400M4977Q3130J09369J21946J21283
12113A066302J05329Q1203M1293n294n2713r3081j29466j41969j41630j38033
$$ plain form
12197 1223845 1186225 1148952 1119430 1094971 1082629 1053730 1018798 981416 938585 890357 833291
12186 833291 763547 714002 669004 619630 575640 548151 515024 481844 455621 432988 418269
12175 418269 395921 366159 357970 348435 335772 331186 320881 317285 318152 313976 316586 316045 307335 306024
12161 306024 300753 309348 307101 297201 283736 292404 298503 309229 313944 326322 352501 382859 409842
12148 409842 444864 490300 542549 578429 593190 602052 600879 576804 551225 518673 483308 451828
12136 451828 434531 424246 416581 413108 415565 431454 468001 510474 550853 576479 601827 608813
12124 608813 599026 585947 566812 545633 550197 585597 630574 713704 823073 945019 1066302
12113 1066302 1171631 1252834 1294127 1288833 1236120 1143039 1013573 871604 729974 591941
12103E91941j14963r9839p9522n2244l8176l3290k0872j9699j1331q055o353j3778
12091I3819L523k472j701L84l380q239R50O10L628K101J417j532N853K977o081
12076I1857l339L423j780j2046l620L934N912J669J095L923J557J581L842m52
12062I7556J2490Q264n769K363K539J2053J5995j627m893l460j8044k1391k0025
12049G6051p740q509r861j01Q212J2077J4264J5627J4448J9514J0747N113J1754
12036A61596K507j255k508j696j0127j3750l743o238r86J957l11k001l404L57
12022A20398O312K597L843K796P379l0j0276o633l71j7356j1319J767M54o00q892
12007I0069k044o464n987k722l927K561R495N048M299O693j298O935R252l050
$$ plain form
12103 591941 476978 377139 297617 245373 207197 173907 153035 133336 122005 113950 107597 93819
12091 93819 97342 94870 93169 93553 90173 81934 82884 83494 87122 89223 90640 89108 94961 97938 91857
12076 91857 88518 91941 90161 78115 74495 78429 84341 86010 87105 91028 92585 94166 98008 97556
12062 97556 110046 118310 112541 114904 117443 129496 145491 143864 138971 135511 117467 96076 76051
12049 76051 68311 59802 49941 49840 58052 70129 84393 100020 114468 133982 144729 149842 161596
12036 161596 164103 162848 160340 158644 148517 134767 131024 124786 123800 125757 125446 123445 120041 120398
12022 120398 126710 129307 133150 135946 143325 143295 133019 126386 126015 108659 97340 99107 99561 98961 90069
12007 90069 88025 81561 75574 72852 68925 71486 80981 86029 90328 97021 95723 102658 111910 108860
11993A08860R38j3147j0705j982k096j793q059n474K984J932L187M22R836L545
11979H8448p536P520R560N932L53Q4n140J019n276n448o861J834J327J970o78
11964H7108p56K860m08M449l41M497J870P685J252m052p475O414o719n153K833
11949I4064K972o37k504m001j0649J1294O33q393M851O168K529O179N779O46N220
11934A14151j181r986l546Q118J4445M870o062l246K227M853K400p175p494m308
11920A08066K467P136O973Q741J984r698r838l292n869n1m244j4657j1363J021
11906G7376L789O119J342J698k460P189J604k964k331N967L277J0065M949m795
11892A10825Q43m739p52J746q697k79l899l712P097Q537J3504M80n323n3j760
$$ plain form
11993 108860 109798 96651 85946 83964 81868 80075 72016 66542 69526 71458 74645 75067 84903 88448
11979 88448 80912 88432 97992 103924 104277 104361 99221 100240 94964 89516 82655 84489 85816 87786 87108
11964 87108 86352 89212 88804 93253 92912 97409 99279 106964 108216 104164 96689 103103 96384 91231 94064
11949 94064 97036 96399 93895 89894 79245 90539 91172 82779 87630 93798 96327 102506 108285 108931 114151
11934 114151 112970 102984 99438 107556 122001 126871 120809 117563 119790 124643 127043 119868 112374 108066
11920 108066 110533 117669 124642 133383 135367 125669 115831 112539 106670 106619 102375 87718 76355 77376
11906 77376 81165 87284 88626 90324 87864 95053 96657 93693 91362 97329 100606 110671 115620 110825
11892 110825 111668 106929 106177 107923 99226 98947 95048 91336 98433 106970 120474 120954 115631 115578 113818
11877A13818m119N327K846m544n43J526K968K543r141m335j074K972Q255k090
11863A14409J216R198n671J512q050M212L39K747M543j112K452M884K879k017
11849A31541n530o917J187O445K412q599J866K337n65L255L100Q99M603M679o850
11834A33863n072N572N974O078M103J1368J0140J5367j443l501P77J4189J3170
11821B10585J7579J7908L2637M1336N5754P3578P7728R3946Q2684O8189M6989
11810H18913L2530M605k5565n0695o3883p9146q4921p2788o9298n8559l9132l8248
11798B73813k5999k8453j1431j0814q781p099j63k085q969j0255p629q150m806
11785A39179n554J862O3N26O194K316N385N402L31j029M137O287M955K0J5604
$$ plain form
11877 113818 109699 115026 117872 113328 112785 114311 117279 119822 110681 106346 105272 108244 116499 114409
11863 114409 115625 124823 119152 120664 112614 116826 117165 119912 124455 123343 125795 130679 133558 131541
11849 131541 126011 119094 120281 126726 129138 120539 122405 124742 124177 127432 130532 131431 136034 140713 133863
11834 133863 128791 134363 140337 146415 150518 161886 172026 187393 185950 182449 183226 197415 210585
11821 210585 228164 246072 278709 320045 375799 449377 527105 621051 703735 771924 818913
11810 818913 851443 856048 830483 779788 715905 636759 551838 479050 409752 351193 312061 273813
11798 273813 247814 219361 207930 197116 188335 181236 181073 178988 170019 159764 152135 143985 139179
11785 139179 133625 135487 135550 136076 142270 144586 149971 155373 155704 154675 158812 165099 170054 170074 185678
11770A85678J3637Q71p15m895N835P108p944j9861n131m944j0329p207j012K900
11756A53991j1011k552P634q17p257p20Q936M720j0286k543J258P683L457P59
11742A53252m143j1280n331Q92K174k293n959m044J2032J3041O855q52L876J722
11728A59942P309M467K061k800n820j453O038N516j795q274m585m979J752O047
11714A63426O808j095l977j0870q040j486J0644Q248k870p243M680K168m203P405
11700A63595o11R68M587j2365n723L03N571R268K768p907j1928j073j141M639
11686A50951O022K168j431R07k619J860J0924N23k441m726o833k787k070k912
11672A47536l461J264O315J162m781P38O382M649n045o906K503J1448N409P84
$$ plain form
11770 185678 199315 200186 199471 194576 200411 207519 199575 179714 174583 169639 159310 152103 151091 153991
11756 153991 142980 140428 148062 147245 139988 139268 148204 152924 142638 140095 141353 149036 152493 153252
11742 153252 149109 137829 132498 133390 135564 133271 127312 123268 135300 148341 155196 154344 158220 159942
11728 159942 167251 171718 173779 170979 165159 163706 169744 175260 173465 165191 160606 155627 157379 163426
11714 163426 170234 169139 165162 154292 146252 144766 155410 163658 160788 153545 158225 160393 156190 163595
11700 163595 162984 163952 168539 156174 150451 150754 156325 165593 168361 160454 148526 147453 146312 150951
11686 150951 156973 159141 157710 158617 155998 157858 168782 169305 166864 162138 155305 152518 150448 147536
11672 147536 144075 145339 151654 152816 148035 148773 155155 159804 154759 147853 150356 161804 167213 167997
11658A67997j5049Q8Q691l475m533k038m818M654n64K057M483O61N336k136j356
11643A59998P917R629P328O622M53j914p560j637k028o532J955m035m490j804
11629A63902Q731j627O533L15O77j798K570K311N677m289p861k850n5Q42J709
11614A74787k50k369j619K42J982Q785n51L716P584J0396N102p755o574k300j0934
11599A80242p502k862K374R494p31j87R459R776m371j6964l729K547J0264K752
11585A90562l336j107J423j598l829j735K998L418J2663o73M316q061j7035M89
11571A78495R029K975L091J903j42q407m116J2377M866M285l484j444j627N09
11557A98310L512P50L500k192p852M722J2751r513q805M411l578N955O314k450
$$ plain form
11658 167997 152948 153036 161727 158252 153719 151681 146863 151517 150953 153010 157493 158154 163490 161354 159998
11643 159998 167915 177544 184872 191494 191947 190033 182473 180836 178808 172276 174231 170196 165706 163902
11629 163902 172633 171006 177539 177854 178531 176733 179303 181614 187291 183002 175141 172291 172236 173078 174787
11614 174787 174537 172168 170549 170791 172773 181558 181007 184723 192307 202703 207805 200050 193476 191176 180242
11599 180242 172740 169878 172252 181746 181015 180828 190287 200063 195692 178728 174999 177546 187810 190562
11585 190562 187226 186119 187542 185944 182115 180380 183378 186796 199459 198786 203102 195041 178006 178495
11571 178495 187524 190499 193590 195493 195351 186944 182828 195205 200071 204356 200872 199428 197801 198310
11557 198310 201822 202572 206072 203880 196028 200750 213501 203988 195183 199594 196016 201971 208285 205835
11543B05835m820k812Q032r44O671M455P350l166j77m736j1739o761p511p077
11529A82600L390J0016Q004R034m760n871J8763L542m277O62J075p287n813k825
11515B06253L534P499O613M076n88n372m642L479K968m666n470Q303N150J100
11501B28237k755J779k762k983j15J978M510J982n76n331K349j330k293J1485
11487B34175M199K647K231o642j971k767k596J725L437j596J043J3201n579p997
11473B33510o024m208J2971J1216N292O106J555j2648j2728R47o254n806Q523
11460B32452L931j145N642J2013L328l713l835M288O230m280L719j527L264K610
11446B62977q260j867p779J587N470N922j997L887P781K794P783K793p225j612
$$ plain form
11543 205835 201015 198203 206235 205291 211962 216417 223767 220601 220424 215688 203949 197188 189677 182600
11529 182600 185990 196006 204010 213044 208284 202413 221176 224718 220441 221103 222178 214891 209078 206253
11515 206253 209787 217286 223899 227975 227387 222015 217373 220852 223820 219154 213684 221987 227137 228237
11501 228237 225482 227261 224499 221516 221401 223379 227889 229871 229295 223964 226313 224983 222690 234175
11487 234175 238374 241021 243252 236610 234639 231872 229276 231001 234438 232842 233885 247086 241507 233510
11473 233510 227486 223278 236249 247465 252757 258863 260418 247770 235042 235989 229735 223929 232452
11460 232452 236383 235238 240880 252893 256221 252508 248673 252961 259191 254911 258630 257103 260367 262977
11446 262977 254717 252850 245071 246658 252128 258050 256053 259940 267721 270515 278298 281091 273866 272254
11432B72254n263K235J508M75P464L622n515k70l033l341n311J1880J273N446
11418B83424Q725N299o420m835l182K223O166o834o655p271l034K60R834j923
11404B75777L747L551J384j438M666R006N593p549k74k393r289m617O929J1879
11390B96972L553N744N698J738p124j0539k601Q720O996J379K043l295K182J983
11376C13449L410j816k030r30j784l824N351K029o784N89O347K681m959m264L900
11361C11365k751N706J540l348K107N24k115Q473P267J568J282O093L31J367J1227
11346C50636K21k333J293p152n662j425J0231R212l454l325p50R438M39m010K246
11331C55605Q91J429P934k104p56k435r527k482q6Q928m344J382R867N555l62
$$ plain form
11432 272254 266991 269226 270734 271209 278673 282295 276780 276510 273477 270136 264825 276705 277978 283424
11418 283424 292149 297448 291028 286193 283011 285234 291400 284566 277911 270640 267606 267866 277700 275777
11404 275777 279524 283075 284459 283021 287687 296693 302286 294737 294463 292070 282781 278164 285093 296972
11390 296972 300525 306269 311967 313705 306581 296042 293441 302161 309157 310536 312579 309284 311466 313449
11376 313449 316859 315043 313013 312083 310299 306475 311826 313855 307071 307660 314007 316688 311729 307465 311365
11361 311365 308614 314320 315860 312512 314619 315143 313028 321501 328768 330336 331618 337711 338042 339409 350636
11346 350636 350857 348524 349817 342665 337003 335578 345809 355021 351567 348242 347492 356930 357369 353359 355605
11331 355605 356496 357925 365859 363755 362999 360564 351037 348555 348469 357397 353053 354435 364302 369857 369495
11316C69495m421Q063J1892N66o921q181K925o505J2575J1180L499j081J736M084
11302C98906O133l900j1420L493M471O391m474P87j1747j2480L071J3118M542
11289C96891M81k31l429K128Q11M560O175p455J899Q260k922K989L776K915N964
11274D22812K876N78O530k328n168j131N494K45m16K902R26l366p92J351P954
11259D38467O851J600Q25N824N098l101o767Q47N267K315J137p113n451J0575
11245D56374R486O063L374M673r389p815M199J687J2718O716r008O617J2357n481
11231D92571o510J7J044L482K905K073O136n88l551J103l890L428N396J1852J004
11216E16472O638Q142J2530P029Q416L742J110r559q608N912l302j2566L655Q260
$$ plain form
11316 369495 365074 373137 385029 385595 378674 370493 373418 366913 379488 390668 394167 393086 394822 398906
11302 398906 405039 401139 389719 393212 397683 404074 399600 400387 388640 376160 379231 392349 396891
11289 396891 397372 397141 393712 395840 396651 401211 407386 399931 401830 410090 407168 410157 413933 416848 422812
11274 422812 425688 426266 432796 430468 425300 424169 429663 429908 429492 432394 433320 429954 429162 430513 438467
11259 438467 445318 446918 447743 453567 458665 455564 448797 449644 454911 457226 458363 451250 445799 456374
11245 456374 465860 471923 475297 479970 470581 462766 466965 468652 481370 488086 479078 485695 498052 492571
11231 492571 486061 486078 487122 490604 493509 495582 501718 501130 497579 498682 494792 498220 503616 515468 516472
11216 516472 523110 531252 543782 550811 559227 562969 564079 554520 545912 551824 548522 535956 539611 547871
11202E47871j019m379N146P088L215l462M230J544L025k253Q53p74j070o83P058
11187E66390N258l161K852N576J1291P372N614L119O436L584L064O868N560L018
11173F32841P430P030N785M097J3302J1360J4177J6679P158p11J020m666j3515
11160G01987j2467j3517O556Q810o137q198L78K7J023N908R84R698n58n593J605
11145F90506J4466J4959r55j206P837Q457M730J1319P984n604o653M550P64M744
11131G55898J0702j293J657N859l874m545J695R188J1294J1067Q953J1667J5014
11118H33282P254P475P306K914k599n644o40o408q257L381j98J694L787M830K379
11103H50556J06P541O219J070Q543J5178J0835N243L959M557O527O289R080K444
$$ plain form
11202 547871 546852 542473 547619 554707 557922 554460 558690 560234 563259 561006 561859 561085 560015 559332 566390
11187 566390 571648 568487 571339 576915 588206 595578 601192 604311 610747 614331 617395 624263 629823 632841
11173 632841 640271 647301 653086 657183 670485 681845 696022 712701 719859 719148 720168 715502 701987
11160 701987 689520 676003 682559 691369 685232 677034 677412 677439 678462 684370 685354 695052 694494 688901 690506
11145 690506 704972 719931 718976 717770 725607 734064 738794 750113 758097 752493 745840 750390 751154 755898
11131 755898 766600 765307 766964 772823 768949 764404 766099 775287 786581 797648 806601 818268 833282
11118 833282 840536 848011 855317 858231 855632 849988 849348 842940 834683 838064 837866 839560 843347 848177 850556
11103 850556 850662 858203 864422 865492 874035 889213 900048 905291 909250 913807 920334 926623 935703 938147
11089I38147j1764l853M005k93M249L576l261J784O457Q245K41l083O776J1761
11075I62987R788O812k434n823J888N289K639J703J1448L067P370N980Q212J2655
11061A031581R314K128J597P620Q189p3o19r537o514R880J2579P403l426K835
11047A072957M998q653L667Q556K229r00Q303M002l053m278M526N605Q877n2j395
11032A105389j11K672J0332L200N083n328M743m805j310K35K636m617r77r19J0579
11017A126802O476L554L668K608J0019N980n106m737O149J3595M659K231o5j701
11003A174132m506o722J0394J5960O261q606j1730N507J0936L935p374N500l131
10990A190556q667M87O811j344j369N873J5289K658q773O36M119j590m322J4125
$$ plain form
11089 938147 926383 922530 926535 926242 930491 934067 930806 932590 939047 947292 947533 944450 951226 962987
11075 962987 972775 979587 977153 971330 973218 978507 981146 982849 994297 997364 1004734 1010714 1018926 1031581
11061 1031581 1040895 1043023 1044620 1052240 1060429 1060356 1059737 1050200 1043686 1053566 1066145 1073548 1070122 1072957
11047 1072957 1077955 1069302 1072969 1081525 1083754 1082854 1091157 1095159 1092106 1087828 1092354 1097959 1106836 1106784 1105389
11032 1105389 1105278 1107950 1118282 1121482 1126565 1121237 1125980 1121175 1119865 1120100 1122736 1118119 1117142 1116223 1126802
11017 1126802 1133278 1136832 1140500 1143108 1153127 1159107 1154001 1149264 1155413 1169008 1173667 1175898 1175833 1174132
11003 1174132 1169626 1162904 1173298 1189258 1195519 1186913 1175183 1180690 1191626 1195561 1188187 1193687 1190556
10990 1190556 1181889 1182376 1189187 1187843 1186474 1192347 1207636 1210294 1201521 1202157 1206276 1204686 1200364 1214489
10976A214489J2767K192r149j378K334K396R461K95K171M659R441K103j257j1174
10962A239350p675J505P316j742q46J5409J131r54J0966P018p540L055J5212L276
10948A285481q412k878O015Q713R769M879J065n208l255J45k932O493N552m356
10934A301071q79K144R76Q806J4819j150q263O23o594L702L447O427P679K400
10920A335208P105Q617k62L849M828N00O278M709j3308j703R440O192j858M634
10906A374229N078M576J1116J0619N167l725o437j3654r33R189O876K629K516
10893A407246J283j390J2751J5390j986j1502M993R739L057M424Q089k64p641
10880A444189p603M112J0583J0227J1360R498o770n705P40P244P26R697J3173
$$ plain form
10976 1214489 1227256 1229448 1220299 1218921 1221255 1223651 1233112 1233407 1235578 1240237 1249678 1251781 1250524 1239350
10962 1239350 1231675 1233180 1240496 1238754 1237908 1253317 1254448 1253494 1264460 1271478 1263938 1266993 1282205 1285481
10948 1285481 1277069 1274191 1280206 1288919 1298688 1303567 1304632 1299424 1296169 1296314 1293382 1299875 1305427 1301071
10934 1301071 1300192 1302336 1303312 1312118 1326937 1325787 1317524 1318147 1311553 1315255 1318702 1325129 1332808 1335208
10920 1335208 1342313 1350930 1350668 1354517 1359345 1359845 1366123 1370832 1357524 1355821 1365261 1371453 1369595 1374229
10906 1374229 1379307 1383883 1394999 1405618 1410785 1407060 1400623 1386969 1386036 1395225 1402101 1404730 1407246
10893 1407246 1408529 1407139 1419890 1435280 1433294 1421792 1426785 1436524 1439581 1444005 1452094 1451830 1444189
10880 1444189 1436586 1440698 1451281 1461508 1472868 1482366 1475596 1469891 1470631 1477875 1478601 1488298 1501471
10867A501471J719J905P903n75K93k238P42M913M466Q425n8m068N991O383J1019
10852A548291M07O005N084Q704O035L086M236N897Q914M382K053k153Q43Q399
10838A610183O951Q424k010P176J1405O828J153k752Q167R254J0832L53K303L177
10824A681444K749J4439P187J954L683J0611K018k605J2901J6249R152J0236L650
10811A773668J755P226Q665P238L233M372Q880Q625J6560J0917L70R292J2560
10798A873361J1245R392J4863J7471O559J2863K1377Q694J6138J6249R657K571
10786B020440P583O00O569J0342Q756R858M836M064J3380R990J0175J1902K0060
10773B138555J3512R542J7385K3809K1796J7809J8174J0316R059J2376R151N926
$$ plain form
10867 1501471 1503190 1505095 1512998 1512423 1512716 1510478 1511220 1516133 1520599 1529024 1528966 1524898 1530889 1537272 1548291
10852 1548291 1548698 1554703 1559787 1568491 1574526 1577612 1581848 1587745 1596659 1601041 1603094 1600941 1601784 1610183
10838 1610183 1617134 1625558 1623548 1630724 1642129 1648957 1650110 1647358 1655525 1664779 1675611 1675964 1678267 1681444
10824 1681444 1684193 1698632 1705819 1707773 1711456 1722067 1724085 1721480 1734381 1750630 1759782 1770018 1773668
10811 1773668 1775423 1782649 1791314 1798552 1801785 1806157 1815037 1823662 1840222 1851139 1851509 1860801 1873361
10798 1873361 1884606 1893998 1908861 1926332 1932891 1945754 1967131 1975825 1991963 2008212 2017869 2020440
10786 2020440 2028023 2028623 2035192 2045534 2054290 2064148 2068984 2073048 2086428 2096418 2106593 2118495 2138555
10773 2138555 2152067 2161609 2178994 2202803 2224599 2242408 2260582 2270898 2279957 2292333 2301484 2307410
10761B307410R269J9153J7278Q874R342J0106J1635R555J013J6846K3575J6664
10749B460720K5680K8391K8436K2270K8389M8960M7536N1858O2496P0670M3831
10738B919237L5994J8552L747o274r916j5130j5918l448N767M37J0684K4275L0804
10725B998811L0709L1699M1320M6387M0063M5387M2844N0575M9783M5330O5547
10714C488455R3066J37747K10337L54245P26860J473046J266884n74043p44066
10705F432531q06173q07523m77948k32226j26822q8995o5022l3045j0881M768
10695C788664J5002K3458L3699K3905J8274J2906P289J2312J2272Q754K0908L5249
10683D012692L0459M2307M6318N1699M4590N0564M9117N3781N9430O2354O0384
$$ plain form
10761 2307410 2316679 2335832 2353110 2361984 2371326 2381432 2393067 2402622 2403635 2420481 2444056 2460720
10749 2460720 2486400 2514791 2543227 2565497 2593886 2642846 2690382 2742240 2804736 2875406 2919237
10738 2919237 2955231 2973783 2977530 2971256 2961340 2946210 2930292 2926844 2932611 2933048 2943732 2968007 2998811
10725 2998811 3029520 3061219 3102539 3148926 3188989 3234376 3277220 3327795 3377578 3422908 3488455
10714 3488455 3581521 3719268 3929605 4283850 5010710 6483756 7750640 7176597 6432531
10705 6432531 5626358 4818835 4340887 4108661 3981839 3892844 3827822 3794777 3783896 3788664
10695 3788664 3803666 3827124 3860823 3884728 3903002 3915908 3923197 3935509 3947781 3956535 3977443 4012692
10683 4012692 4043151 4085458 4131776 4183475 4228065 4278629 4327746 4381527 4440957 4503311 4563695
10672D563695N5207O5684N6373N2749L7491L1746L0711M2893L2302L6316K2697
10661E027864K7208J2485L081O899J5432M2676O8712Q2841R4277P7323O8192O6504
10649E593494P0428P5674O6629P2117P4673P7024O7887O1015P3437P2903O1492
10638F366773P5102R0357Q7764R1013Q8746R1788R0221R5675R1424R1338J02832
10627G363033J07982J03167J10668J12706J24797J19457J19744J23327J26418
10618H411299J26659J43046J56371J72255K00505K42451K96901L64794M28917
10609A0543198M24415K65436O3226o2039j00956q6884k8959K9831N3511Q3410
10599A1184189J11084J30261J52105J73588J77754J80575K02418J97130J97501
$$ plain form
10672 4563695 4618902 4684586 4740959 4793708 4831199 4862945 4893656 4936549 4968851 5005167 5027864
10661 5027864 5055072 5067557 5070638 5077537 5092969 5135645 5204357 5287198 5381475 5458798 5526990 5593494
10649 5593494 5663922 5739596 5806225 5878342 5953015 6030039 6097926 6158941 6232378 6305281 6366773
10638 6366773 6441875 6532232 6619996 6711009 6799755 6891543 6981764 7077439 7168863 7260201 7363033
10627 7363033 7471015 7574182 7684850 7797556 7922353 8041810 8161554 8284881 8411299
10618 8411299 8537958 8681004 8837375 9009630 9210135 9452586 9749487 10114281 10543198
10609 10543198 10967613 11233049 11296275 11234236 11133280 11046396 11017437 11047268 11100779 11184189
10599 11184189 11295273 11425534 11577639 11751227 11928981 12109556 12311974 12509104 12706605
10590A2706605K05855K13352K16599K21154K25713K21415K38038K52982K55267
10581A4756980K61812K62179K57618K70266K80706K80601K93556K91932K92317
10572A7247967L05641L09774L18330L19000L19394L25393L37536L40646L46676
10563B0170357L43520L41919L45536L54131L61901L67989L65015L59398L68103
10554B3377869L78674L74647L76091L83722L87976L91634L85825L90249L93444
10545B6840131L90633L95117M01663L94348L96583L90676L87301L87420L88892
10536C0372764L83094L84748L89320L85803L77741L84231L81439L74171L66243
10527C3799554L66953L66595L54204L67814L51583L49183L52817L53860L42594
$$ plain form
10590 12706605 12912460 13125812 13342411 13563565 13789278 14010693 14248731 14501713 14756980
10581 14756980 15018792 15280971 15538589 15808855 16089561 16370162 16663718 16955650 17247967
10572 17247967 17553608 17863382 18181712 18500712 18820106 19145499 19483035 19823681 20170357
10563 20170357 20513877 20855796 21201332 21555463 21917364 22285353 22650368 23009766 23377869
10554 23377869 23756543 24131190 24507281 24891003 25278979 25670613 26056438 26446687 26840131
10545 26840131 27230764 27625881 28027544 28421892 28818475 29209151 29596452 29983872 30372764
10536 30372764 30755858 31140606 31529926 31915729 32293470 32677701 33059140 33433311 33799554
10527 33799554 34166507 34533102 34887306 35255120 35606703 35955886 36308703 36662563 37005157
10518C7005157L43553L38774L34016L20836L15765L17606L10470L10910K97972
10509C9895059K89764K82130K82556K86043K62357K55039K40640K40440K15688
10500D2249716K12905K07681J89897J80901J78097J64125J52239J41347J28535
10491D3805443J06943J04882R2223P6658N4316L7617J7532J125o604l5922n1494
10480D4202719n5425p7909q7410j09890j23552j25292j47787j65764j76314j86008
10470D2947368j98767k14594k27026k38881k49712k59534k67111k80384k82068
10461D0729291l03132l02739l08716l21642l31771l38505l50359l36608l38624
10452C7797195l42367l49634l54219l52585l40929l54258l71335l85720m01629
$$ plain form
10518 37005157 37348710 37687484 38021500 38342336 38658101 38975707 39286177 39597087 39895059
10509 39895059 40184823 40466953 40749509 41035552 41297909 41552948 41793588 42034028 42249716
10500 42249716 42462621 42670302 42860199 43041100 43219197 43383322 43535561 43676908 43805443
10491 43805443 43912386 44017268 44109491 44186149 44240465 44278082 44295614 44296739 44290135 44254213 44202719
10480 44202719 44147294 44069385 43981975 43872085 43748533 43623241 43475454 43309690 43133376 42947368
10470 42947368 42748601 42534007 42306981 42068100 41818388 41558854 41291743 41011359 40729291
10461 40729291 40426159 40123420 39814704 39493062 39161291 38822786 38472427 38135819 37797195
10452 37797195 37454828 37105194 36750975 36398390 36057461 35703203 35331868 34946148 34544519
10443C4544519l99314l86876l90008l93768l97518l92627l80064l55894l41713
10434C1106737l64864m09187m30344m33408m22320m12139m07913l89131l95508
10425B7441923l79117l61242l66656l72304l68221l64107l64959l54085l53093
10416B4158139l57389l57818l53797l51491l53283l49002l54172l44200l42979
10407B0994008l34981l21386l08564l11070l10765l12940k97890k96441l04588
10398A8195383k97011k86463k69660k60798k68478k78989k84352k77651k63004
10389A5708977k51323k39875k31541k01560j78255k09180k39758k31516k04288
10380A3721681j80976j92489k10206k13198k13905k15225j93943j95990j99058
$$ plain form
10443 34544519 34145205 33758329 33368321 32974553 32577035 32184408 31804344 31448450 31106737
10434 31106737 30741873 30332686 29902342 29468934 29046614 28634475 28226562 27837431 27441923
10425 27441923 27062806 26701564 26334908 25962604 25594383 25230276 24865317 24511232 24158139
10416 24158139 23800750 23442932 23089135 22737644 22384361 22035359 21681187 21336987 20994008
10407 20994008 20659027 20337641 20029077 19718007 19407242 19094302 18796412 18499971 18195383
10398 18195383 17898372 17611909 17342249 17081451 16812973 16533984 16249632 15971981 15708977
10389 15708977 15457654 15217779 14986238 14784678 14606423 14397243 14157485 13925969 13721681
10380 13721681 13540705 13348216 13138010 12924812 12710907 12495682 12301739 12105749 11906691
10371A1906691k00795j93892j94038j82521j74469j69566j70305j70430j67556
10362A0283119j55236j58269j51363j53267j44871j42971j34316j20857j17680
10353I004289j06683j10788j15461j12520r8479r7918p5439j8929O2193J16778
10343H447043M2150j12602k25958k45738k27494j84106j60622j45663j19780j14669
10333F952561r3247q4576p6393o6377n7823m9636m0665m6095m0072k5961m3078
10322F328638n8503q7707j33935j51906j27176j19389q3513m3545n7995p2438
10312E392531j00342j24229j16209q2781n7146m2182l6004m8553n3478m1587l6623
10301D653397m0936m9852m5238m1945l9516m2015l4944l9359l9230l1454l7802
$$ plain form
10371 11906691 11705896 11512004 11317966 11135445 10960976 10791410 10621105 10450675 10283119
10362 10283119 10127883 9969614 9818251 9664984 9520113 9377142 9242826 9121969 9004289
10353 9004289 8897606 8786818 8671357 8558837 8460358 8362440 8287001 8268072 8330265 8447043
10343 8447043 8489193 8376591 8150633 7904895 7677401 7493295 7332673 7187010 7067230 6952561
10333 6952561 6859314 6774738 6698345 6631968 6574145 6524509 6483844 6437749 6397677 6371716 6328638
10322 6328638 6270135 6182428 6048493 5896587 5769411 5650022 5566509 5522964 5464969 5392531
10312 5392531 5292189 5167960 5051751 4968970 4911824 4869642 4833638 4785085 4731607 4690020 4653397
10301 4653397 4612461 4562609 4517371 4475426 4435910 4393895 4358951 4319592 4280362 4248908 4211106
10290D211106l5340k5037l1350j6192k2253k3720o380j5918j9322j5385j7754
10279C982455j7077k5498l2828k3642k4773j8743j7881j4402l570n523J902K813
10267C803233p091m364j3569j1749j1633j1603p403k47J2123K5496K8577M5214
10255C846984O4369Q4615Q7409P8470O5370O0968N4104M4481K7220l256l8987
10244D371747o1320q2084o7732m9279l1339j1539k872K140J9849M0505O8327P3229
10232D269632R4789J10538J12772J26811J41233J51285J61791J67112J76577J46390
10222E658930J06278Q9725J20547J64914K21235K96968L87824M65203N35389O06171
10212H653184P24056R33501J221828J506714J569968J286750R41152Q14726R70505
$$ plain form
10290 4211106 4175766 4150729 4119379 4103187 4080934 4057214 4050834 4034916 4015594 4000209 3982455
10279 3982455 3965378 3939880 3907052 3883410 3858637 3839894 3822013 3807611 3804041 3798518 3800420 3803233
10267 3803233 3796142 3791778 3778209 3766460 3754827 3743224 3735821 3735574 3747697 3773193 3801770 3846984
10255 3846984 3911353 3995968 4083377 4161847 4227217 4288185 4342289 4386770 4413990 4410734 4371747
10244 4371747 4310427 4228343 4160611 4111332 4079993 4068454 4065582 4067722 4087571 4128076 4196403 4269632
10232 4269632 4364421 4474959 4587731 4714542 4855775 5007060 5168851 5335963 5512540 5658930
10222 5658930 5765208 5854933 5975480 6140394 6361629 6658597 7046421 7511624 8047013 8653184
10212 8653184 9377240 10310741 11532569 13039283 14609251 15896001 16837153 17651879 18622384
10203A8622384J400647K024922K764023L745158N159124P339899J0756051J5946512
10195F7758720K4008553L6842721N6098013P4454704O1752624P339658l4781186
10188B93473807n1465471n6503501m8247862l4424001k3492176j6812176j2761399
10181D9767221r873825p516084n519500l918532k683030j815372j146103p09621
10173A6585154o74775p68505p78362p67364q75896j053391j111885j096045r46185
10164H512746p06112n38840n81146n33445m10117l42061m30426m23596l53539
10155D193464l06692k89571k63806k16767j79365j37717j12394q6292p0174p0182
10145B460504p3001p3174o4011o1165o7670n7487n9433o8741p5172o2236m8755
$$ plain form
10203 18622384 20023031 22047953 24811976 28557134 33716258 41056157 51812208 67758720
10195 67758720 91767273 128609994 184708007 259162711 320915335 328254993 293473807
10188 293473807 242008336 185504835 137256973 102832972 79340796 62528620 49767221
10181 49767221 39893396 32377312 26857812 22939280 20256250 18440878 17294775 16585154
10173 16585154 15910379 15141874 14363512 13596148 12720252 11666861 10554976 9458931 8512746
10164 8512746 7806634 7267794 6686648 6153203 5743086 5401025 4970599 4547003 4193464
10155 4193464 3886772 3597201 3333395 3116628 2937263 2799546 2687152 2600860 2530686 2460504
10145 2460504 2387503 2314329 2250318 2189153 2121483 2063996 2004563 1935822 1860650 1798414 1749659
10134A749659m6212l2549k0855l2007k8680k4537j7039q840j9667j6780k0377
10123A482116j0556L929J981l437k770o36n731J650J169M276O627J405j0503p330
10109A462190j2777k1379k3836k5786k9605k3971l1177k2515k2124j7632r557
10098A221831K859N307M876J6260J4504K1207K3660L7668N8513Q1823R3261J20976
10086A702745J39590J64318J73365J71827J47225J12483Q4553O1694N9614Q1321
10076B898735R2169O6516j4459j07204j19772j15911j08895j08203j01664p7440
10066B303872m0971l8376p6455j31566j81592j95746j78181j59693j30830r7628
10056A072834p0386n7671m4183l4627j8313o343N177l944m765l013q597r201n470
$$ plain form
10134 1749659 1703447 1670898 1650043 1618036 1589356 1564819 1547780 1538940 1519273 1502493 1482116
10123 1482116 1471560 1475489 1477470 1474033 1471263 1470627 1464896 1466546 1467715 1471991 1478618 1480023 1469520 1462190
10109 1462190 1449413 1428034 1404198 1378412 1348807 1324836 1293659 1271144 1249020 1231388 1221831
10098 1221831 1224690 1229997 1234873 1251133 1265637 1286844 1310504 1348172 1406685 1488508 1581769 1702745
10086 1702745 1842335 2006653 2180018 2351845 2499070 2611553 2696106 2757800 2817414 2898735
10076 2898735 2990904 3057420 3042961 2935757 2815985 2700074 2591179 2482976 2381312 2303872
10066 2303872 2262901 2224525 2148070 2016504 1834912 1639166 1460985 1301292 1170462 1072834
10056 1072834 1002448 944777 900594 865967 847654 841311 846488 842544 837779 834766 826169 816968 811498
10043H11498p737j342P606J0730M180j2129j3726k772J6488L8762M7097M4850
10031I43505K2118r706l7434m1784l5085l0480j5310n052M24K1243M6196N9151
10019I17786L2269N2311O1087j9359l7698l7115p3121q0658o9089m9226m1168
10008F56019l1993k7008j7944o432K1291N6894R1370N6814O2113O0648O1558O7823
9996A051153L8468J3268j1198l1767m8073o2500p3504p6801n6016n0283l8206
9985F54541k0966q427j1591j4732j3616n532j7134j7814j4317L570J9o746o617
9972E20638o093j0276k0781j4727j1449r602o452j0343o672j3626m399K429m26
9959D08221J163P757Q586M414k960r76j833k284K620r951p600l670L94o791j1107
$$ plain form
10043 811498 803761 802419 810025 820755 824935 812806 799080 796308 812796 851558 898655 943505
10031 943505 965623 955917 918483 876699 841614 811134 795824 790772 791196 812439 858635 917786
10019 917786 950055 1002366 1063453 1044094 1006396 969281 896160 815502 746413 697187 656019
10008 656019 624026 597018 579074 572642 593933 650827 742197 799011 861124 921772 983330 1051153
9996 1051153 1089621 1102889 1091691 1059924 1011851 949351 875847 799046 743030 692747 654541
9985 654541 633575 625148 613557 598825 585209 579677 562543 544729 530412 533982 534001 527255 520638
9972 520638 514545 504269 483488 468761 457312 447710 441258 430915 424243 410617 406218 408647 408221
9959 408221 409384 417141 425727 430141 427181 426205 424372 422088 424708 414757 407157 403487 403881 397090 385983
9944C85983O080m737j4187j3954n44J671M507J0434O488M486m327j213K830K131
9930C85648l49p711n428n400p529j862n558n006l077q226p913K630M72n985k82
9915C24424k737p957j0431P196M54r057N263R406J355P732J7170L4057O5160J19933
9901E61968J55995J04280k8047r4310j24484j14253p9575m1626k4024j1820r168
9890B94936o714j2944l968J815N935K502m800j5267l977m926k754R353J270r132
9876B51329L302K739m65R285Q301K760n122o534p936L595j723j1502o554j2810
9862B28665j664P26O43J447k261m824o534j454L04j1768j4967j255J994O337k456
9847A92933L929k584k339L705J244n28J1255R693N236J591k632P734J0234N151
$$ plain form
9944 385983 392063 387326 373139 359185 358641 360312 364819 375253 381741 386227 381900 380687 383517 385648
9930 385648 385299 377588 372160 366760 359231 357369 351811 346805 343728 335502 327589 330219 330691 324706 324424
9915 324424 321687 313730 303299 310495 310949 301892 307155 316561 317916 325648 342818 376875 442035 561968
9901 561968 717963 822243 794196 699886 575402 461149 381574 339948 315924 304104 294936
9890 294936 288222 275278 271310 273125 279060 281562 276762 261495 257518 252592 249838 259191 260461 251329
9876 251329 254631 257370 256905 266190 274491 277251 272129 265595 257659 261254 259531 248029 241475 228665
9862 228665 227001 227727 228370 229817 227556 222732 216198 214744 215048 203280 188313 187058 189052 195389 192933
9847 192933 196862 194278 191939 195644 196888 196360 207615 217308 222544 224135 221503 229237 239471 244622
9833B44622n382n578O2o008n834K4l75K592J5494J1203O162J1277O731L295j0373
9818B67912n227l731j059m59J741P787P224J8776K4051K6795L3372N4403P4004
9805E05589J09780J99637L54287O59097J052778R90516K23490n12249p97169p80006
9795B005750o33064l87144k04971j26885j01240p6891o1139l9417k8727k7676
9785C18596j2924j0112k091k686J515L499P525J2022J4678K4420L2018L3469M0213
9772D60142P3235J21070J74330K46364L14610K80934Q6705j19973k19701k59464
9762A158252k38201j91038j22106p7723o4117n2704l2681o037K7237L1954j2307
9751D20529l5852m4319m3231l4233l2133j9592j3540j2842n516J277P63K035q305
$$ plain form
9833 244622 239240 233662 233724 227716 221882 221906 221531 224123 239617 250820 256982 268259 274990 278285 267912
9818 267912 262685 258954 257895 257436 259177 266964 274188 292964 317015 343810 377182 431585 505589
9805 505589 615369 815006 1169293 1828390 2881168 3871684 4095174 3582925 2785756 2005750
9795 2005750 1372686 985542 780571 653686 552446 475555 414416 374999 346272 318596
9785 318596 305672 295560 293469 290783 292298 295797 303322 315344 330022 354442 386460 419929 460142
9772 460142 533377 654447 828777 1075141 1389751 1670685 1757390 1637417 1417716 1158252
9762 1158252 920051 729013 606907 529184 465067 412363 379682 373645 400882 432836 420529
9751 420529 384677 340358 297127 262894 230761 211169 197629 184787 179271 180548 181311 183346 175041
9738A75041r249j46L93r004n126M634m281n247P324K0808L1894K4963L3297L0756
9724B96057l886k9484l7612l3469k8833j2746k081j1258p938n78n881q465n832
9711A07994j40K923q24q164m573J285N789Q492O647o313p215k679q857k355P194
9696I9204k91j92O386j020j0555Q787J4128k597j0392r137j825N63N488M549J469
9681A04565L754N28J556r172n448q24K891J536N553m874J8k969q044o474r407
9666G3189o847M034N491J440k567R250k627m701P540Q856o656q343m804k494K849
9651G3610J331p394j987J904j78m798p146k668N058L849N065O173J880K659j35
9636G7223n843L956R434mm939p409j913r161R154O406l335j1336o763p74L397
$$ plain form
9738 175041 165792 165646 166039 157035 151909 156543 152262 147015 154339 175147 207041 232004 265301 296057
9724 296057 292171 262687 225075 191606 162773 150027 147946 136688 128750 128172 122291 113826 107994
9711 107994 107854 110777 109953 101789 97216 98501 104290 112782 119429 113116 105901 103222 94365 92010 99204
9696 99204 98913 98721 105107 104087 93532 102319 116447 113850 103458 94321 92496 93059 98547 103096 104565
9681 104565 108319 108847 110403 101231 95783 94959 97850 99386 104939 100065 100083 97114 89070 82596 73189
9666 73189 66342 70376 75867 77307 74740 83990 81363 76662 84202 93058 86402 78059 73255 70761 73610
9651 73610 74941 67547 65560 67464 67286 62488 55342 52674 57732 61581 66646 72819 74699 77358 77223
9636 77223 71380 75336 84770 84766 79827 72418 70505 61344 70498 76904 73569 62233 55470 54696 58093
9621E8093m667k905o70J532J491Q064M895j0717n419N213J180k078J702J153P047
9606F3914J710O050m39p594l36l86O83K94N647o890k028j548J955O398P23j986
9590F6167p26l934o570O069N226L715L6o442m234r043m087j558R00N682k355l677
9574D5169L890m102K464M520M021m187L371k822J754J823m888J732P237l882n384
9559E0716R96R421n785n505J0786N860L361n356m839J225Q800o314n42m069j497
9544E7258j691n972m629O82O060J314j051l656l621j508J0067P852K265n850j0508
9529D7012j763M627P6j570J306l141n127L439L687J3328M46n982J066J443L486
9514F2333q400r408L06q310J2115M24l284m8j044r447k608m255N991J2057M945
$$ plain form
9621 58093 53426 50521 49851 51383 52874 60938 65833 55116 49697 54910 56090 54012 55714 56867 63914
9606 63914 65624 71674 71235 63641 63305 62919 63602 63896 69543 62653 60625 59077 61032 67430 68153 66167
9590 66167 65441 61507 54937 61006 66232 69947 69983 63541 59307 50264 46177 44619 45519 51201 48846 45169
9574 45169 49059 44957 47421 51941 55962 51775 55146 52324 54078 55901 51013 52745 59982 56100 50716
9559 50716 51712 61133 55348 49843 60629 66489 69850 64494 59655 60880 69680 63366 62824 58755 57258
9544 57258 55567 49595 44966 45648 51708 53022 51971 48315 44694 43186 53253 61105 63370 57520 47012
9529 47012 45249 49876 49952 48382 49688 46547 41420 44859 48546 61874 62320 56338 57404 58847 62333
9514 62333 53933 44525 44831 36521 48636 49060 45776 45728 44684 35237 32629 28374 34365 46422 51367
9499E1367K534N145m05q268l769R504O660l719m241K727J227k061P62L779J748
9484F2990j3211j2182l483J955L877p53n953m258R027L937P281K070N296K118
9470E8711r072m35K957j904J530M929k063j565n407J822q493l499m96N290J5369
9455E7674k604q988m859l893j896P713k435K866L690l671m328P269l596L993l54
9440D6581n68J788o984o130k742l388j526j273J993j045Q285K254J30k337l769
9425C1269P257J124R20K975m731j0404J37n570J534K755O905k379n979K562n811
9410B2564L627Q706J33o416R08Q868k46n357q342p303j867m22Q900R209K94o036
9394B7220o690k124L781J0122J1808K176k335j160J386o895q632P103Q291r440
$$ plain form
9499 51367 53901 59046 58641 50373 46604 56108 62768 59049 54808 57535 58762 56701 57463 61242 62990
9484 62990 49779 37597 34114 36069 39946 39193 33240 28982 38009 41946 49227 51297 56593 58711
9470 58711 49639 49204 52161 50257 51787 56716 54653 53088 47681 49503 41010 37511 37015 42305 57674
9455 57674 55070 46082 41223 37330 35434 43147 40712 43578 47268 43597 39269 46538 42942 46935 46581
9440 46581 46013 47801 40817 34687 31945 28557 27031 25758 27751 26706 34991 37245 37375 35038 31269
9425 31269 38526 39650 40570 43545 38814 28410 28547 22977 24511 27266 34171 31792 25813 28375 22564
9410 22564 26191 34897 35030 28614 29522 38390 38144 32787 24445 17142 15275 14853 23753 32962 33256 27220
9394 27220 20530 18406 22187 32309 44117 46293 43958 42798 44184 37289 28657 35760 44051 34611
9380C4611p255Q19k280m734L190J0933O83n473q328o662l185M130L579q827n339
9365E862R470N644K18P034M799p123l462N985r61n944l213k692k120P027o1n142
9349A5321P038j482m8J1658K598o496o10K436k726j263J638j2227P471l6l994
9334A9278J0346O161N72n458Q72L1l964N11J0682m541l669J235Q968j305j128
9319C8591m241m209q925L058J798n952q269P778k338J908L920K332L154J544K11
9304C0360K129Q094l807m646m144L65K117R002k921q972m026K343k588M363P160
9289C4829Q823K45m646j554N755K906m942l770l266O758l515J1632R555o015j1995
9274D0800k623l144k618N881j870k19l089M999n080R804Q297r816k900L731O70
$$ plain form
9380 34611 27356 28175 25895 21161 24351 35284 35967 30494 22166 15504 12319 16449 20028 11201 5862
9365 5862 15332 20976 21194 28228 33027 25904 22442 28427 27466 21522 18309 15617 13497 20524 20463 15321
9349 15321 22359 20877 20829 32487 35085 28589 27979 30415 27689 26426 28064 15837 23308 23272 19278
9334 19278 29624 35785 36357 30899 31771 31802 27838 28349 39031 34490 30821 32056 41024 39719 38591
9319 38591 34350 30141 21216 24274 26072 20120 11851 19629 17291 19199 23119 25451 28605 30149 30360
9304 30360 32489 40583 36776 32130 27986 28351 30468 39470 36549 27577 23551 25894 23306 27669 34829
9289 34829 43652 43897 39251 37697 43452 46358 41416 37646 34380 41138 37623 49255 58810 52795 40800
9274 40800 38177 35033 32415 38296 36426 36207 33118 38117 33037 42841 51138 41322 38422 42153 42823
9259D2823M662L062o169k095j0M48j3196O02n023r68j261M706J2225P490o844
9244D0452j026M797j381O350M561l504n341M052P123l699n538M676P193J1164
9230F9879K887K45J2925M524k468l341l936l356q90P825M483l461p781p82K349
9215G9102l68m303m202R09O941m960o945J660M15M219q99k262l312p567j829N028
9199F1627J032n187L134M574O929J642n375k747j147J746Q97M133M806L419J146
9184H0629N685N952j0539o643l057k908N48J624j845j498j056N10l064P586O564
9169G8488l69L363o029Q20P006M112m481k622O943M273q933j4116J885L162K483
9154G5985j783l394J547J2978K608p776l716P15l561N47N280K695l259M37P231
$$ plain form
9259 42823 47485 50547 44378 42283 42273 42721 29525 30127 25104 24136 22875 27581 39806 47296 40452
9244 40452 39426 44223 42842 49192 53753 50249 44908 48960 56083 52384 46846 51522 58715 69879
9230 69879 72766 73011 85936 90460 87992 84651 80715 77359 76469 84294 88777 85316 77535 76753 79102
9215 79102 78734 74431 70229 71138 78079 73119 66174 67834 68249 72468 71569 69307 65995 58428 56599 61627
9199 61627 62659 57472 60606 65180 72109 73751 68376 65629 64482 66228 67125 71258 76064 79483 80629
9184 80629 86314 92266 81727 75084 72027 69119 69667 71291 69446 67948 66892 67402 64338 71924 78488
9169 78488 78119 81482 75453 76273 83279 87391 82910 80288 87231 91504 82571 68455 70340 73502 75985
9154 75985 74202 70808 72355 85333 87941 80165 76449 77164 73603 74150 79430 82125 78866 79303 86534
9139H6534M941k20m132R47J0609L986O59j2390o529k113o663m746J500J061n836
9124F7608m179n031l681J1571K692n626O347O479R333R146P248J651p545j5096
9110H0917K026J71q356n578J795j456k829j117j518J0155O283m197m15N894L131
9095H4906M872j348j625R072j271p522J569j973k551m838m677j44p333L726l613
9080F7250J232O296O536m602j1294m389J064k928m20j928K846P115P624L371j055
9065G6718j0764o185K926m034l025L810m625k409N532J0920N879l60p565n769
9051F1049l77j243l860M041P468N841L901k708M285O481P35n298m875l191J666
9036G3915m9J767M539k233o972l623k462J380k607m04P696l235j302K88l198o622
$$ plain form
9139 86534 91475 91255 87123 88070 98679 102665 103324 90934 84405 82292 75629 70883 72383 73444 67608
9124 67608 63429 58398 54717 66288 68980 63354 69701 76180 85513 94659 101907 103558 96013 80917
9110 80917 82943 83114 74758 69180 70975 69519 66690 65573 64055 74210 80493 76296 75881 81775 84906
9095 84906 89778 88430 86805 95877 94606 87084 88653 86680 84129 79291 74614 74470 67137 70863 67250
9080 67250 68482 74778 81314 76712 65418 61029 62093 59165 58745 56817 59663 66778 74402 77773 76718
9065 76718 65954 59769 62695 58661 55636 59446 54821 52412 57944 68864 74743 74383 66818 61049
9051 61049 60672 59429 55569 59610 67078 72919 76820 74112 78397 84878 85613 80315 75440 72249 73915
9036 73915 73866 75633 80172 77939 70967 67344 64882 66262 63655 63251 70947 67712 66410 66698 63500 56878
9020E6878n547N602J1183p211L540P190j057j0202j1857M531K753K593M164J05
9006F2665k575j75m391j96J46Q565L156p380n410j1375q43K417L75O513N143O373
8990F3008N96J308l938n981k301m628P302K935o028k062N650J2923k110N76J955
8975F9205J828p592o583r465l880L028n226m919O238p2N53l587M46N635J553m038
8959D3124k417k759J967k367J389L382J092l627J357K571l045J644L294O760J483
8944E3848j055O36q452k427P061n800r411N113j203o73M220O46P950J2352K687
8929F5492K940J0622J7800O28j1825j7843j4919o825n282O642K353K434r83M148
8915E5382k418r661m896k22l967k878K443L78J851K859K628n5M281M945k619o695
$$ plain form
9020 56878 51331 56933 68116 60905 64445 71635 70578 60376 48519 53050 55803 58396 62560 62665
9006 62665 60090 59915 55524 55328 55474 64039 67195 59815 54405 43030 42187 44604 44979 51492 56635 63008
8990 63008 63604 64912 60974 54993 52692 48064 55366 58301 52273 50211 55861 68784 66674 67250 69205
8975 69205 71033 63441 56858 47393 43513 46541 41315 36396 42634 42562 43115 39528 39974 45609 47162 43124
8959 43124 40707 37948 39915 37548 38937 42319 43411 39784 41141 43712 40667 42311 45605 52365 53848
8944 53848 52793 53429 44977 42550 49611 43811 34400 39513 38310 37637 41857 42503 50453 62805 65492
8929 65492 68432 79054 96854 97482 85657 67814 52895 46070 40788 47430 49783 52217 51234 55382
8915 55382 52964 43303 38407 38185 34218 31340 33783 34161 36012 38871 41499 41444 45725 50670 48051 41356
8899D1356q014N765N658L893o379J728P574n635n617k32K298O566N690L919K830
8884F1400Q05L270J4813J899M501O55j880o464J030o001r021m003L012o14l072
8869F0330q740p181N361q1q078j072L582q416J386J4522J117L02j784N530j197
8854E5581K405L280O000p107j2131K170R850L569O16K984n815m277J1547Q89O96
8839G0257K018k010J120O663M20l971L57J411K597O348m516q012o210J486J0087
8824G8045O354k501n599l319r194p492q68K848J113J386J9116J4497Q303o290
8810I6399p868P278J630j5588l111Q833K805m953M138k301o650L48Q54p943p660
8795F6211K53m49l48K855o408Q957L521j709m394K509o208N308o129k821J1971
$$ plain form
8899 41356 33342 39107 44765 48658 42279 44007 51581 45946 40329 40097 42395 48961 54651 58570 61400
8884 61400 62205 65475 80288 82187 86688 87343 85463 78999 80029 74028 65007 61004 64016 63402 60330
8869 60330 51590 44409 49770 49689 41611 40539 44121 35705 37091 51613 52730 53032 51248 56778 55581
8854 55581 57986 61266 67266 60159 48028 50198 60048 63617 64233 67217 61402 57125 68672 69561 70257
8839 70257 72275 70265 71385 78048 78468 74497 74854 76265 78862 85210 80694 72682 66472 67958 78045
8824 78045 84399 81898 76299 72980 63786 56294 55426 58274 59387 60773 79889 94386 102689 96399
8810 96399 88531 95809 97439 81851 78740 87573 90378 85425 89563 87262 80612 80960 81814 73871 66211
8795 66211 66464 66015 65667 68522 62114 71071 74592 72883 68489 70998 64790 70098 63969 61148 73119
8780G3119J3916R852p568r118j232r69J883K949k991j67L545m063N68J1745Q301
8765I9770m883q985K27K044j051L694M97q827r847J666J800L149p64j106k368
8750G5016k936j70o70k325l021J3175Q534L177l830O414n31m736o75N176M843
8735I7441M642J251l332n514m600k368n092N99L313K596P508k08P693J4362K696
8720A20987k064L441N586O672m109J0880K0367M8115N7804L6915P440k6550m0077
8707B45407l7267k9679l0258j4367j063J374j785K346J771j795O564N874J111
8694A48233j243n29l989N751P59R84p11L166J447J271M820j234m326Q424L538
8679A66361K80J38Q52O886M396K170J562O221n693J008J5985m25k830l7L182L762
$$ plain form
8780 73119 87035 96887 89319 80201 78969 78000 79883 82832 79841 79674 83219 79156 79724 91469 99770
8765 99770 94887 85902 86129 88173 87122 90816 91313 82486 72639 74305 76105 79254 78490 77384 75016
8750 75016 72080 71910 71240 68915 65894 79069 87603 90780 86950 93364 92833 88097 87422 92598 97441
8735 97441 102083 103334 100002 94488 89888 87520 82428 83027 86340 88936 96444 96236 103929 118291 120987
8720 120987 118923 122364 127950 134622 130513 141393 161760 209875 267679 304594 312034 285484 245407
8707 245407 208140 178461 148203 133836 132773 134147 132362 134708 136479 134684 141248 147122 148233
8694 148233 146990 146461 142472 148223 148982 149966 149255 152421 153868 155139 159959 158725 154399 162823 166361
8679 166361 166641 166779 167631 174517 178913 181083 182645 188866 183173 184181 200166 199741 196911 196874 200056 203818
8663B03818j790Q686N727Q84J355M447J047n397K48O114J4415J8693J6881R613
8649B84741L639j094p736n617N610k827K490O793L43n717P994J5043M163l515
8635C04310J349L926J787J1060J3457j578R78J4754J6089L532M291J1746N612
8622C91313J90o44p311k611j4144k229o120K319J186Q444J1598M628O055P207
8608C99881P063L16J4163L8201N0441P0643J28876K43635L36838R5133j45020
8597A240170j76366k07021j58038q6946m2898j9469j4058k3983r821o841n145
8586D89584o071Q391J0629J5878J7373K5093L5841M4389N0354K0525J1790P951
8574G31727Q081J5589K2952L5518M5880M7549O1538O9175P2829P5279P6839P3866
$$ plain form
8663 203818 202028 210714 216441 217325 218680 223127 224174 218777 219025 225139 239554 258247 275128 284741
8649 284741 288380 287286 279550 273933 279543 276716 279206 285999 286342 280625 288619 303662 307825 304310
8635 304310 305659 309585 311372 322432 335889 334311 335289 350043 366132 369664 373955 385701 391313
8622 391313 391503 390859 383548 380937 366793 364564 358444 360763 361949 370393 381991 386619 392674 399881
8608 399881 406944 407260 421423 459624 510065 580708 709584 953219 1290057 1385190 1240170
8597 1240170 1063804 856783 698745 611799 568901 549432 535374 511391 501570 494729 489584
8586 489584 483513 491904 502533 518411 535784 560877 596718 641107 691461 711986 723776 731727
8574 731727 739808 755397 778349 813867 859747 907296 968834 1038009 1110838 1186117 1262956 1336822
8562A336822R5530J12172J32671J88319K57344L96127O78995J028840P05598J16544
8552E048962p8050k78524k94545j87022j27599j35472j69573k60690l45589l79882
8542B792016l69057l22618k74354k22788j91569j46734j18805p3468m0307m0374
8532I91942p3585q3326p3028n4763l0096j0841k0348l7711k9666j1903L17L374
8520E70366J0792K2218K91q501N623n848j036J7080N7312J52803K89850K24147
8508A335097q8062j72703j85898j72988q3768O161J03105J77170R1640m7405j05757
8497H56592j24996j12174q3113n1507m5066l2661k5690j6002j3848J5202N2210
8486D18947Q0249M6770m204l7467m5327j3021L1979L3608O392j3027q064K3495
$$ plain form
8562 1336822 1432352 1544524 1677195 1865514 2122858 2518985 3197980 4226820 4932418 5048962
8552 5048962 4970912 4692388 4397843 4210821 4083222 3947750 3778177 3517487 3171898 2792016
8542 2792016 2422959 2100341 1825987 1603199 1411630 1264896 1146091 1072623 1032316 991942
8532 991942 918357 835031 762003 707240 677144 666303 645955 608244 578578 566675 566992 570366
8520 570366 581158 603376 603667 595166 600789 594941 593905 610985 668297 821100 1110950 1335097
8508 1335097 1247035 1074332 888434 715446 631678 637839 740944 918114 1009754 962349 856592
8497 856592 731596 619422 536309 484802 439736 407075 381385 365383 351535 366737 418947
8486 418947 499196 545966 541762 504295 458968 445947 477926 511534 517926 504899 496835 520330
8474E20330L8834L7355M9858K176o2842q5216p6782o3973m8787m2471k6309k4605
8462B17568j8112j2290r446j773O061J9343K3883K4453L8512P4968O9468J1458
8450D44093k0784k4512l6350m6563l8272m0932k4151k1676j3227O01J2671J4636
8438B05534L2954L6920K4826L561k4420k3574r928N449o83j7371k7216k8734j0219
8425A67099J7149L7123J8578j4169k0250k0227k0197j8659j0210l098j2378j4113
8413A06648j5218j1051N79q66j994j097j437k597J975J1474R735O120J5442R668
8399A27381J6143P130j1353k7013k0870j4903n741J323M618N089P163O826Q217
8386A04010j500o245j857o282o770p387L451p91n842k470K98R910M954M507m686
$$ plain form
8474 520330 559164 596519 646377 648553 585711 500495 423713 359740 310953 268482 242173 217568
8462 217568 199456 187166 177720 175947 182008 201351 225234 249687 288199 363167 432635 444093
8450 444093 423309 398797 362447 315884 277612 236680 212529 190853 177626 178227 190898 205534
8438 205534 238488 275408 300234 303795 279375 255801 245873 251322 250639 233268 206052 177318 167099
8425 167099 184248 221371 239949 225780 205530 185303 165106 146447 136237 133139 120761 106648
8413 106648 91430 80379 80958 80092 78098 77001 75564 72967 74942 86416 96151 102271 117713 127381
8399 127381 143524 150654 139301 112288 91418 76515 70774 72097 76715 81804 88967 95793 104010
8386 104010 102510 96265 94408 88126 81356 73969 77420 76629 70787 68317 68615 78525 83479 87986 83300
8371H3300j0779n59l061n361m222K776Q776P391P450o718P91m981M731N449O829
8356I1812J2405J9505K2429P396J111n934k0811k1187j6198j1675j1197j1629
8344E6027m254l491k202K814R834q151m839K834k235k712M151O747j095p735J525
8329D7218R295Q079K492p738m097o226N069Q576n274O962J903k07n115m994j196
8314E4747m444j146l445K786P987r14K881J574K899M141p105m935j383j311J313
8299E3645Q224n905j2813r457N516L347k679k675n98k170K124P284L776q943r663
8284B9013m811R283J402J615J11j470N18P901j406l710M324R45L380O625O81p024
8268D7377p053L300Q181N668K3l740j008o207j0246r545O464R767j959j5946o431
$$ plain form
8371 83300 72521 71962 68901 63540 59318 62094 70870 78261 85711 78993 79784 74803 79534 84983 91812
8356 91812 104217 123722 146151 153547 154658 148724 127913 106726 90528 78853 67656 56027
8344 56027 51773 48282 46080 48894 58728 50577 45738 48572 46337 43625 47776 54523 53428 45693 47218
8329 47218 56513 64592 67084 59346 55249 49023 54092 62668 57394 64356 66259 66052 60937 55943 54747
8314 54747 50303 49157 45712 48498 56485 55571 58452 60026 62925 67066 59961 55026 53643 52332 53645
8299 53645 61869 55964 43151 33694 39210 42557 39878 37203 36605 34435 36559 43843 47619 38676 29013
8284 29013 24202 33485 34887 36502 36613 35143 35661 43562 42156 38446 42770 43715 47095 53720 54401 47377
8268 47377 40324 43624 51805 57473 57496 53756 52748 46541 36295 26750 33214 42981 41022 25076 18645
8253A8645J65L447O68j196K358J0890j412J070P482Q874l241p794k513q421m168
8238B4854N67N130J0400k108j2290k290P459k174Q47O417O259J371j0489p030
8224B6923O858l016J520m100l128l723j0456O405L916O950P873l15n931J676m482
8209B6970M690j313j40M546N807P363J1503K8718J4572j419j6033j7090j1841
8196E6333p792l723p718j2766M174P081q714j0298o160q243M622L298L419K600
8182A6113M534l77M642L024m762m791k809M450j239p193J438L373j658J979K565
8167A9289p465j210J0787M737K245k661m34M649K171L368k667j89R47R369J2672
8152E5608L114J0024J4125M804j263l622r998j1936l461m289q617j2464j2559
$$ plain form
8253 18645 18810 22257 22925 21729 24087 34977 33565 34635 42117 50991 47750 39956 37443 29022 24854
8238 24854 25421 30551 40951 38843 26553 24263 31722 29548 30395 36812 43071 44442 33953 26923
8224 26923 33781 30765 32285 28185 25057 21334 10878 17283 21199 28149 36022 35707 29776 31452 26970
8209 26970 31660 30347 30207 34753 40560 47923 59426 88144 102716 101297 85264 68174 56333
8196 56333 48541 44818 37100 24334 28508 35589 26875 16577 10417 2174 6796 10094 13513 16113
8182 16113 20647 20270 24912 27936 23174 18383 15574 20024 18785 11592 13030 16403 14745 16724 19289
8167 19289 11824 10614 21401 26138 28383 25722 25288 29937 32108 35476 32809 32620 33567 42936 55608
8152 55608 58722 68746 82871 87675 86412 82790 72792 60856 57395 53106 44489 32025 19466
8139A9466o866J729p004L363R303Q618k063N345m565J405Q31o413J53K952j168
8124B5086j832O651r19n686J37j510R162M012R242P598k177R461R013N961r598
8109F4601m337M299r840n679O090J15J462J909J446l548L491Q767N036J0141R600
8094I3553M017J4719J2530j6227p1j0400j2232j2082p773P778J0812K927P03J0419
8080I8673P099j811o219r223j2193p251J0492l397J686N428J2185P435P732N853
8066A16489p453o966n407o47Qq185j3255M799O501N662L272J0977N204N401J4179
8051A30579K2856K6620L3809K5105J1182N40k874O73l765j3588j2238j3283j6227
8038A89389j0483J953M61O186J874j226J803n950j0714q881j0094J004J3983K1019
$$ plain form
8139 19466 12600 14329 7325 10688 19991 28609 26546 31891 27326 28731 29562 23149 23302 26254 25086
8124 25086 23254 29905 28986 23300 23437 21927 31089 35101 44343 51941 49764 59225 68238 74199 64601
8109 64601 60264 64563 54723 49044 55134 55249 56711 58620 60066 56518 60009 68776 73812 83953 93553
8094 93553 97570 112289 124819 108592 108521 98121 85889 73807 66034 73812 84624 87551 88254 98673
8080 98673 105772 103961 97742 88519 76326 69075 79567 76170 77856 83284 95469 102904 110636 116489
8066 116489 109036 102070 96663 96016 96024 87839 74584 79383 85884 91546 94818 105795 110999 116400 130579
8051 130579 153435 180055 213864 238969 250151 250691 247817 248490 244725 231137 218899 205616 189389
8038 189389 178906 180859 181320 187506 189380 188154 189957 184007 173293 164412 154318 155322 169305 190324
8024A90324J5542J3556J3233k650o005j3113r040n310n808k3812q949K994J0270
8011A71232j692N126J2224K5990K3687J2030Q375P307J5287K4473K0434J3413
7999C37886K4276J7559L216p08k193n188K727K407K66o666p958Q2N691M080l14
7984C75163l563l517M37Q010Q494J4440K0730K6327J2535j003j7517j5420j1850
7971D13266r835j9549m947K380o67L70R822M857M682J3329K784J1990K7600L7745
7957D93827L7792M0989M8783P1120P5644N5355L317m4099o7120o9240n7910n0732
7945E37726k7425k1960j5972k0477k2702l2126k6753j6052k3721j6875p598k403
7933C03662K340L74M68L144J2134M205m232j671p43N66P989P531M532P723L351
$$ plain form
8024 190324 205866 219422 232655 230005 224000 210887 201847 196537 190729 166917 157968 160962 171232
8011 171232 169540 174666 186890 212880 236567 248597 256972 264279 279566 304039 324473 337886
7999 337886 362162 379721 382937 382229 380036 374848 377575 379982 380248 373582 365624 365706 371397 375477 375163
7984 375163 371600 368083 368520 376530 385024 399464 420194 446521 459056 458053 440536 425116 413266
7971 413266 403431 383882 378935 381315 380648 381018 390840 395697 400379 413708 416492 428482 456082 493827
7957 493827 531619 572608 621391 692511 768155 823510 826827 782728 715608 646368 588458 537726
7945 537726 510301 488341 472369 451892 429190 397064 370311 354259 330538 313663 306065 303662
7933 303662 306002 306376 306844 309988 322122 326327 322095 320424 319681 320247 328236 335767 340299 348022 351373
7918C51373J1561P468J0224K722K3957L3763K8372L2560K8392J7085M439j419
7906E50497j4746j6123k6494k0227q745p779l3538l9074m4212l7198k1356j6606
7894B64399j3438j4751r215m476r252j0991n731m492l6P587l748j3204l378K403
7880A81677L101L152L668N768k521l662N375J2409O164m436P446R901J299K567
7866B31908O085K455o716j0168r349o674j3644j4560j7901j9060o949n448n819
7853A24160q859j4859j4498k172M103L027M443L665n478j2153k067l696l791j1233
7839F0592k483R626K274k82o312r671j1858j991J244L180K078j39K300l249P891
7824E3200N609J16n976k037Q758O698j757j0302m635n30j4481j2416K967k713
$$ plain form
7918 351373 362934 370402 380626 383348 407305 441068 469440 502000 530392 547477 551916 550497
7906 550497 535751 519628 493134 472907 464162 456383 422845 383771 339559 302361 281005 264399
7894 264399 250961 236210 226995 222519 213267 202276 196545 192053 192017 199604 195856 182652 179274 181677
7880 181677 184778 187930 191598 197366 194845 191183 196558 208967 215131 210695 218141 228042 229341 231908
7866 231908 237993 240448 233732 223564 214215 207541 193897 179337 161436 142376 135427 129979 124160
7853 124160 115301 100442 85944 83772 87875 90902 95345 99010 93532 81379 79312 75616 71825 60592
7839 60592 58109 67735 70009 69727 63415 53744 41886 39895 41139 44319 46397 46258 48558 45309 53200
7824 53200 58809 58925 52949 50912 59670 66368 64611 54309 49674 49144 34663 22247 25214 22501
7810B2501L042M776n468r999l796m63N112J271j836M21l497p78N667m214L368
7795A6107J2673K577j6287j011M740L028l49M742Q288r566q1K376q140j51O295
7780B5241r73m442o589l297N555n716M664q459p818m283N006K102K960k463M028
7765E516K6n90o088l254N112P369N864k804o091L432N355L018M119o36q197p359
7749D792j600L412O35K885m754j1837m170N301J919o164J2526N463l169J163n728
7734F74N244k617K87N221j882p53k300P516O193p877j3368m802j796L678R016
7719B434o128j2764k163O296o396o898K374Q639P66J0069n823j2266L299J0589
7705g972o46N484l811K029l816k244m842j50L162l389j85n021J1461J726j612
$$ plain form
7810 22501 25543 30319 24851 14852 11056 10593 15705 16976 15140 15561 12064 11286 16953 12739 16107
7795 16107 28780 31357 15070 14059 18799 21827 21478 26220 34508 24942 24861 27237 19097 18946 25241
7780 25241 24268 19826 13237 9940 15495 9779 14443 5984 -1834 -6117 -1111 991 3951 1488 5516
7765 5516 5542 4952 -1136 -4390 722 8091 13955 11151 5060 8492 13847 16865 20984 20348 12151 4792
7749 4792 3192 6604 7239 10124 5370 -6467 -10637 -5336 -3417 -9581 2945 8408 5239 6402 674
7734 674 5918 3301 3588 8809 6927 6174 3874 11390 17583 9706 -3662 -8464 -10260 -6582 2434
7719 2434 -3694 -16458 -18621 -12325 -18721 -25619 -23245 -14606 -13840 -3771 -9594 -21860 -18561 -7972
7705 -7972 -8618 -3134 -6945 -4916 -8732 -10976 -15818 -15968 -12806 -16195 -16380 -21401 -9940 -8214 -9826
7690i826R925M861N786M93J45o82r480o191K752K819n250j1023M441N325n075
7675a0980o192l771q37j155J831J313K029P759j823j360k627m753n968J168P708
7660a7658L020o017j465L444j583J072O009P012m884J609n251p541K612Q335l521
7645a4807J047O540n463R24M785j026J395J988n101J789j04k780O854l411p180
7630a4550l84M511o671p300J70L373m860k321N199K839k031j0651L97O917K724
7615b2638l593J1028L342o43n1n285O16L087P82m358M251J2273l194n797r623
7600a9803j0319o010k686L326N151N81J411J1575M194j400N604j0197n951m593
7586b9117m217J599O796J0008N684o498m038M659l498K61k233j099k290n219J074
$$ plain form
7690 -9826 99 4960 10746 11239 11384 10702 1222 -4969 -2217 602 -4648 -15671 -11230 -5905 -10980
7675 -10980 -17172 -20943 -21780 -22935 -21104 -19791 -17762 -10003 -11826 -13186 -15813 -20566 -26534 -25366 -17658
7660 -17658 -14638 -20655 -22120 -18676 -20259 -19187 -13178 -6166 -11050 -9441 -14692 -22233 -19621 -11286 -14807
7645 -14807 -13760 -7220 -12683 -11759 -6974 -8000 -6605 -4617 -9718 -7929 -8033 -10813 -3959 -7370 -14550
7630 -14550 -14934 -10423 -17094 -24394 -24224 -20851 -25711 -28032 -22833 -19994 -22025 -32676 -32279 -25362 -22638
7615 -22638 -26231 -15203 -11861 -12504 -12555 -17840 -17224 -14137 -13355 -17713 -13462 -1189 -4383 -10180 -19803
7600 -19803 -30122 -36132 -38818 -35492 -30341 -29760 -28349 -16774 -12580 -13980 -8376 -18573 -24524 -29117
7586 -29117 -33334 -31735 -24939 -14931 -9247 -15745 -19783 -15124 -18622 -18361 -20594 -21693 -23983 -29202 -28128
7571b8128P143p14m46q198j313O156P3n251Q480Q274o688p736N210N341k418l982
7555b4197j564K490P272M108m725l870j94o865M434J953l004Q88K169p467M648
7540b3924L544l15l944l320l212K44n250O683L436K954k508q86J559j1165l421
7525c9525L453Q427N091m610K762m224o085P752P793n168n424P616j690J26M554
7510a9152J056J609o14r348J0849k783l131j641j880j2213J355K109P983J0097
7496a5704o534p113j511L503p24Q86J5782j879p191K050n537O344L278L052j791
7481a3089j3193q86L315O893j812k007j900K684J896L756L595j89r02q042l915
7466b3796O114J1893j469r706o245M99k231P47L225M171Q812n924j543L144M219
$$ plain form
7571 -28128 -20985 -21699 -22145 -30343 -31656 -25500 -25427 -30678 -22198 -13924 -20612 -28348 -23138 -17797 -20215 -24197
7555 -24197 -25761 -23271 -15999 -11891 -16616 -20486 -20680 -27545 -23111 -21158 -24162 -23274 -21105 -28572 -23924
7540 -23924 -20380 -20695 -24639 -27959 -31171 -30927 -36177 -29494 -26058 -23104 -25612 -26498 -24939 -36104 -39525
7525 -39525 -36072 -27645 -22554 -27164 -24402 -28626 -34711 -26959 -19166 -24334 -29758 -22142 -23832 -23706 -19152
7510 -19152 -18096 -16487 -17101 -26449 -15600 -18383 -21514 -23155 -25035 -37248 -35893 -33784 -25801 -15704
7496 -15704 -22238 -29351 -30862 -27359 -28083 -27197 -11415 -13294 -20485 -18435 -23972 -17628 -14350 -11298 -13089
7481 -13089 -26282 -27168 -23853 -16960 -18772 -20779 -22679 -19995 -18099 -14343 -10748 -10937 -11839 -19881 -23796
7466 -23796 -17682 -5789 -7258 -16964 -23209 -22710 -24941 -24194 -20969 -16798 -7986 -13910 -15453 -12309 -8090
7451h090J89n569k202N351j732m087J547l144j5928R17N25Q05J320k62mM67L550
7434b6347m000o04p971j885R987M008J503Q512j300o550N655L289m29K611o950
7419b0471m612Q76k288p999n529M138L009O935J0935N542m909N150K372n613N70
7404a1894K419l78k50n132M313P605o719j3078l177K211k272p622L061J0157J3316
7389g440L151q905n102j434l243n716L711m255l890j236R832Q879O92r356o599
7374c0911P305N309J01n702q358o058L575Q320P618K814l03o248O611J0589p58
7359f096l675r857J176P703k400j0414m626O076K404M473l356m448J825R148l02
7344a2369p715M654J121o40N61j775M20J63p019o747k352M242K556n495j863L972
$$ plain form
7451 -8090 -7901 -13470 -15672 -10321 -12053 -16140 -14593 -17737 -33665 -32748 -32223 -31418 -30098 -30360 -30364 -29897 -26347
7434 -26347 -30347 -30951 -38922 -40807 -30820 -26812 -25309 -16797 -18097 -24647 -18992 -15703 -16132 -13521 -20471
7419 -20471 -25083 -24207 -26495 -34494 -40023 -35885 -32876 -25941 -15006 -9464 -14373 -9223 -6851 -12464 -11894
7404 -11894 -9475 -9853 -10103 -15235 -10922 -3317 -10036 -23114 -26291 -24080 -26352 -33974 -30913 -20756 -7440
7389 -7440 -4289 -13194 -18296 -19730 -22973 -28689 -24978 -29233 -33123 -34359 -24527 -15648 -14956 -24312 -30911
7374 -30911 -23606 -18297 -18196 -23898 -32256 -38314 -34739 -26419 -18801 -15987 -16290 -22538 -15927 -5338 -6096
7359 -6096 -9771 -19628 -18452 -10749 -13149 -23563 -28189 -22113 -19709 -15236 -18592 -23040 -21215 -12067 -12369
7344 -12369 -20084 -15430 -14309 -14949 -14388 -16163 -15743 -15580 -22599 -29346 -31698 -27456 -24900 -30395 -32258 -28286
7328b8286M964k414L215K256Q33k183j475l510k731K515R062J1718o522L15k559
7313a4802k947n849m833J567N498l708l680L597Q586O658m210J049J772P528J951
7298a823m373k946j204j590n528o274M261k89o636J349L408o924J491R313L488
7283a4277j0112N343J2286M018n740m561m006M369p939m600K154j762j2322P05
7269c6444L375L526l441k700K048J981K49J71K210K193O239j943N25J3385J0133
7254A507p993j1699k340r358j959J0751L281L704q72j0313M004O938R091J735
7240c523l959m269n249o851l568p239n349J882P990J0591M170p34j195J837k00
7225a5666k435p777K493q393j427K746k603K22L820r81L171L089J533M02m783
$$ plain form
7328 -28286 -23322 -25736 -22521 -20265 -19432 -21615 -23090 -26600 -29331 -26816 -17754 -6036 -12558 -12243 -14802
7313 -14802 -17749 -23598 -28431 -26864 -21366 -25074 -28754 -25157 -16571 -9913 -14123 -13074 -11302 -3774 -1823
7298 -1823 -6196 -9142 -10346 -11936 -17464 -23738 -19477 -19766 -26402 -25053 -21645 -28569 -27078 -17765 -14277
7283 -14277 -24389 -19046 -6760 -2742 -8482 -13043 -17049 -12680 -20619 -25219 -23065 -24827 -37149 -36444
7269 -36444 -33069 -29543 -32984 -35684 -33636 -31655 -31406 -31235 -29025 -26832 -20593 -22536 -22011 -8626 1507
7254 1507 -6486 -18185 -20525 -29883 -31842 -21091 -17810 -14106 -14978 -25291 -21287 -14349 -5258 -3523
7240 -3523 -7482 -11751 -17000 -23851 -27419 -34658 -40007 -38125 -30135 -19544 -15374 -16108 -17303 -15466 -15666
7225 -15666 -18101 -25878 -23385 -31778 -33205 -30459 -33062 -32840 -29020 -30001 -26830 -23741 -22208 -21806 -26589
7210b6589k641Q906N161N874p56q522j606O590l971j502O483M932l870n072j025
7195a7608n567M967j593k56j899k131j4560k719N781M858n773j457N064J87O126
7180b6580M205k483r79n720Q53K973J267l695P006O711J931K307k531j1274o158
7165c2167J069k674L12J20O66K089l271Q51M729j275k237N066k655n011p08N45
7149c4551l41N616M537P097L755l946j769L913N404P390k987p122m241n556K810
7134a9991J523J28l024p78J525L573o316j600k901P156N565M864j542o130k430
7119b0378q999J850l0O354J107j608Q423r279j0623O445L233J435m037k79J424
7104b4962R26j525M029K370L95o09J227O482M26K711L37j715L302N365L901k641
$$ plain form
7210 -26589 -29230 -20324 -15163 -9289 -10045 -18567 -20173 -13583 -17554 -19056 -12573 -7641 -11511 -16583 -17608
7195 -17608 -23175 -18208 -19801 -20057 -21956 -24087 -38647 -41366 -35585 -30727 -36500 -37957 -32893 -32706 -26580
7180 -26580 -22375 -24858 -25837 -31557 -30704 -27731 -26464 -30159 -23153 -16442 -14511 -12204 -14735 -26009 -32167
7165 -32167 -31098 -33772 -33460 -33340 -32674 -30585 -33856 -33005 -28276 -29551 -31788 -26722 -29377 -34388 -35096 -34551
7149 -34551 -34892 -29276 -24739 -17642 -13887 -17833 -19602 -15689 -10285 -2895 -5882 -13004 -17245 -22801 -19991
7134 -19991 -18468 -18340 -21364 -22142 -20617 -17044 -23360 -24960 -27861 -20705 -15140 -10276 -11818 -17948 -20378
7119 -20378 -29377 -27527 -27557 -21203 -20096 -21704 -13281 -22560 -33183 -26738 -23505 -22070 -26107 -26386 -24962
7104 -24962 -24036 -25561 -21532 -19162 -18767 -19376 -18149 -11667 -11241 -8530 -8193 -9908 -6606 -1241 2660 19
7088A9j4172o950m958N270K875q158j0046k727J974L505J1490j0678J029Q809
7074b2718M242l397k912L779M821k359P594p76j4883L126Q38m452J0161j481m90
7059a8907R710Q558o258k882K477m530q760O409K59p304K338J2346K715o096J937
7044g988j886m677j710J389j259j667j875n907K72J1056N845O256n937j0230j5008
7029c3326l008R374J0418j090J564j0974m741l240k090J2863J1531M986l197p925
7015a8855j876P708k572j1113J592O297N405M854m248n058k991m331j802j192
7001b8182m340Q430r69R135M802K43m439J22Q884n557J337m793J965k13p601j577
6985b2753M577J576K500P283L584o636n744l379J090L084P718m916k554j1597
$$ plain form
7088 19 -14153 -21103 -26061 -20791 -17916 -26074 -36120 -38847 -36873 -33368 -21878 -32556 -31527 -22718
7074 -22718 -18476 -21873 -24785 -21006 -16185 -18544 -10950 -11726 -26609 -23483 -22645 -27097 -16936 -18417 -18907
7059 -18907 -9197 -639 -6897 -9779 -7302 -11832 -20592 -14183 -13924 -21228 -18890 -6544 -3829 -9925 -7988
7044 -7988 -9874 -14551 -16261 -14872 -16131 -17798 -19673 -25580 -25308 -14252 -8407 -2151 -8088 -18318 -33326
7029 -33326 -36334 -26960 -16542 -17632 -16068 -27042 -31783 -35023 -37113 -24250 -12719 -7733 -10930 -18855
7015 -18855 -20731 -13023 -15595 -26708 -25116 -18819 -13414 -8560 -12808 -17866 -20857 -25188 -26990 -28182
7001 -28182 -32522 -24092 -25061 -15926 -11124 -10881 -15320 -15198 -6314 -11871 -10534 -15327 -13362 -13575 -21176 -22753
6985 -22753 -18176 -16600 -14100 -6817 -3233 -9869 -15613 -18992 -17902 -14818 -7100 -12016 -14570 -26167
6971b6167n927P221l844m505l861k631J1414J893n89P680K11m01l372m234J792
6956b5320N534k609J140K821L675J514m981O176J347l061k141k152J634j773j59
6941a8355k890l39l89k378l47q65J830M361n820p050k007R736L909j887J839Q252
6925a2400m10k550n509o261N820M796j366O332K643J263r06J93L639o601r479
6910b0796n764O647k227l019J0033J412L355R099L657o757p249m23l925k49L526
6895a2680r23n928M522j0100n387J1679P82K228K873K107n099m879L818p886m055
6880b8928M294j117J77P633O490l647o609j164P171L401j1034J092L477M680m925
6865a9009k349j971P264Q78k177K586m283M054P236o643k287J0719K20P214J5642
$$ plain form
6971 -26167 -32094 -24873 -28717 -33222 -37083 -39714 -28300 -26407 -26996 -19316 -19105 -19506 -22878 -27112 -25320
6956 -25320 -19786 -22395 -21255 -18434 -14759 -13245 -18226 -12050 -10703 -13764 -15905 -18057 -16423 -18196 -18355
6941 -18355 -21245 -21584 -21973 -24351 -24698 -25563 -23733 -19372 -25192 -32242 -34249 -24513 -20604 -22491 -20652 -12400
6925 -12400 -12810 -15360 -20869 -27130 -21310 -16514 -17880 -11548 -8905 -7642 -8548 -8355 -4716 -11317 -20796
6910 -20796 -26560 -19913 -22140 -25159 -15126 -13714 -10359 -1260 2397 -4360 -11609 -12032 -15957 -16206 -12680
6895 -12680 -13603 -19531 -15009 -25109 -30496 -18817 -18035 -15807 -12934 -10827 -15926 -20805 -16987 -24873 -28928
6880 -28928 -24634 -25751 -25574 -17941 -11451 -15098 -21707 -22871 -15700 -12299 -23333 -22241 -18764 -14084 -19009
6865 -19009 -21358 -23329 -16065 -15187 -17364 -14778 -19061 -15007 -7771 -14414 -16701 -5982 -5762 1452 17094
6850A7094n269j1734j8808k298l030r26k245P180J0470K305p661r853K506O69
6836b1600K089L829n217M285Q273m45m12Q347r2q328l780l732N135J132m882j100
6820a6498L32j407q84m948M400q22N38o139m512K495N025L776L253l90o974p792
6804c0547O283J2599K045L12J76j2895M099J60n57q52j01k48P082L345j885N200
6788e784j605j546n188j248l327l464K630k63O098M037J627l832k14L660l810
6773a2229J594J243q076k390J484j039J441J663l405K008J5961J8378o050j8240
6759g657o430m142q23p50k392n624Q849J2018k3q2o57J790N786n31l37q05l914
6742e724j846N07k687p06M805L483K184n003r83p631k135m804J891N05M28k097
$$ plain form
6850 17094 11825 91 -18717 -21015 -24045 -24971 -27216 -20036 -9566 -7261 -14922 -24775 -22269 -21600
6836 -21600 -19511 -15682 -20899 -16614 -8341 -8786 -9198 -851 -943 -9271 -13051 -16783 -11648 -10516 -15398 -16498
6820 -16498 -16166 -17573 -18457 -23405 -19005 -19827 -19289 -25428 -29940 -27445 -22420 -18644 -15391 -15781 -22755 -30547
6804 -30547 -24264 -11665 -9620 -9308 -9132 -22027 -17928 -17768 -18325 -19177 -19278 -19526 -12444 -9099 -10984 -5784
6788 -5784 -7389 -8935 -14123 -15371 -18698 -22162 -19532 -19795 -13697 -9660 -8033 -11865 -12079 -8419 -12229
6773 -12229 -10635 -9392 -17468 -19858 -18374 -19413 -17972 -16309 -19714 -17706 -1745 16633 10583 -7657
6759 -7657 -14087 -18229 -19052 -19802 -22194 -27818 -18969 -6951 -6974 -7056 -7713 -5923 -137 -668 -1005 -1810 -5724
6742 -5724 -7570 -7063 -9750 -10456 -5651 -2168 16 -4987 -5970 -13601 -15736 -20540 -18649 -18144 -17716 -19813
6726a9813J671O979k280K54M910l023L503P371O80K962L467M848k427M779O895
6711B0776N621j291p294p591J654J6665O921q18n545M99M87J1862M75K524M204
6696D9149L087P203j0817k51J7811J4407L233K8022M2986L2301M3182O2689Q6077
6683C79079J05892R1414K3668q2428j11884j18678r1215o0584m2822k8587j9681
6672D4174o14j354j0366j3050o124j0526k501M471r158m245K297R179L833M289
6658A0305R548k43p982p694j2395r014O109J818k292M160r28o23j761n823l001
6643a9816Q601M945O481k094L021N741m285l136r663J561q075J720J1518J853
6629a628n363J275q43R154l886r084k471N779J717m992n110L576K821J352m084
$$ plain form
6726 -19813 -18142 -11163 -13443 -13189 -8279 -11302 -7799 -428 252 3214 6681 11529 9102 13881 20776
6711 20776 26397 25106 17812 10221 11875 28540 35461 34643 29098 29597 30084 41946 42421 44945 49149
6696 49149 52236 59439 48622 48371 66182 80589 83822 111844 154830 187131 230313 293002 379079
6683 379079 484971 576385 600053 517625 405741 287063 195848 135264 92442 63855 44174
6672 44174 43560 42206 31840 18790 12666 2140 -361 4110 -5048 -9293 -6996 2183 6016 10305
6658 10305 19853 19610 11628 3934 -8461 -17475 -11366 -9548 -11840 -7680 -8608 -9231 -10992 -16815 -19816
6643 -19816 -11215 -6270 211 -1883 1138 6879 2594 -542 -10205 -8644 -16719 -14999 -3481 -1628
6629 -1628 -6991 -5716 -6559 2595 -1291 -10375 -12846 -7067 -5350 -10342 -15452 -11876 -9055 -7703 -11787
6614a1787P008l42J198m761n999l005K244J264Q026Q317m592o836q89q72m220
6599a5246k25j316J791o100j5069n228Q719P4Q752J2923l173o884j590J903L636
6584a7033J1488k926q748j721K659r838M392O614n37k04j124Q356l405P676m614
6569h965M440R45p254N21K896P40N938J307k799q15r404j980L57j676J0720j89
6553e218j74Q48j2598p633P02J915l709P12K539j401o55l419J027j293o329P921
6537b6765L007n813m490J249Q546K428j919j12M002k9J162R301m37J439l296o368
6521a8095P533M722J126M385p71q990M523J924Q320j0762q317R450L051n474k031
6506i406n539j676P894N558l576m332p44J317J013j959J274k995j50O419l363
$$ plain form
6614 -11787 -4779 -5121 -3923 -8684 -14683 -17688 -15444 -14180 -6154 2163 -2429 -9265 -10154 -11026 -15246
6599 -15246 -15471 -16787 -14996 -21096 -36165 -41393 -32674 -32600 -23848 -10925 -14098 -20982 -22572 -20669 -17033
6584 -17033 -5545 -8471 -17219 -18940 -16281 -26119 -21727 -15113 -15650 -15854 -16978 -8622 -12027 -4351 -8965
6569 -8965 -4525 -3580 -10834 -10313 -7417 -6677 -739 568 -2231 -3046 -12450 -14430 -14073 -15749 -5029 -5218
6553 -5218 -5392 -4544 -17142 -24775 -24073 -22158 -25867 -25155 -22616 -24017 -24672 -28091 -27064 -28357 -34686 -26765
6537 -26765 -23758 -29571 -34061 -32812 -24266 -21838 -23757 -23869 -19867 -19896 -18734 -9433 -9870 -8431 -11727 -18095
6521 -18095 -10562 -5840 -4714 -329 -1100 -10090 -5567 -3643 4677 -6085 -14402 -4952 -1901 -7375 -9406
6506 -9406 -14945 -16621 -8727 -3169 -6745 -11077 -11821 -10504 -9491 -11450 -10176 -13171 -13321 -6902 -10265
6491a0265j19Q99L378k239j4445K063P763l942l663l625P525P421m445J482L008
6476i204k929o158K619N241R63L655L5k167J91J168l083J3842J280j0671r159
6461a4377n885l950K151m809k580J1935M762L119K732l259O78J339j0431n807
6447b4382k002n342R33K466M958J0627l652o363J0599M587l907j605j061M271
6433i873j91j998P180M899k674p097q274r404l882m350K695K681M413R021L209
6418a3645J569P248M9n078p737j0585R16N469K53P914O794j443q380q8L693k226
6402a5277l706N593M222J769q273j715L966k839p70m954J1557L239l189K110k036
6387a0303M26k080l516k529n452p759K724j898q244M492P857o069K524m120P527
$$ plain form
6491 -10265 -10384 -9485 -6107 -8346 -22791 -20728 -12965 -16907 -20570 -24195 -16670 -9249 -13694 -12212 -9204
6476 -9204 -12133 -18291 -15672 -10431 -9468 -5813 -5778 -7945 -7754 -6586 -9669 4173 5453 -5218 -14377
6461 -14377 -20262 -24212 -22061 -26870 -29450 -17515 -12753 -9634 -6902 -10161 -9483 -8144 -18575 -24382
6447 -24382 -26384 -31726 -30793 -28327 -23369 -12742 -16394 -22757 -12158 -7571 -11478 -13083 -14144 -9873
6433 -9873 -10064 -12062 -4882 17 -2657 -9754 -18028 -27432 -31314 -35664 -32969 -30288 -25875 -16854 -13645
6418 -13645 -12076 -4828 -4779 -9857 -17594 -28179 -27263 -21794 -21541 -13627 -6833 -8276 -16656 -16744 -13051 -15277
6402 -15277 -18983 -13390 -9168 -7399 -15672 -17387 -13421 -16260 -17030 -21984 -10427 -7188 -10377 -8267 -10303
6387 -10303 -9877 -11957 -15473 -18002 -23454 -31213 -28489 -30387 -38631 -34139 -26282 -32351 -29827 -33947 -26420
6372b6420L624j894l197L367O886M35P39L556p589n648J429O348P052N942L808
6357a562m509L361M67J190R5m316o852L365Q151l455n920R060j91j0480r70O237
6341f329L998r254q063j56J211j85R478L77L025j581o670R17r450n37K615m090
6325b4694j305M524n684j614Q760J573J307J34n18l210L945N500M603M807p483
6310i355N03k806k083o76N550K126k217P309K570n903k945J076k681K091P173
6295b68p06l414k687o166j0363j753P711M587k352L332O54R213J193q016n531
6280a4566q84k672m869O414o47j0345l883P382J0126Q300m474o462P2j546R204
6265h850L029J814N728N0j461l354k129J909k36k793L562J226J172P456q808l008
$$ plain form
6372 -26420 -22796 -24690 -27887 -24520 -17634 -17199 -16460 -12904 -20493 -26141 -24712 -18364 -11312 -5370 -1562
6357 -1562 -6071 -2710 -2243 -1053 -958 -5274 -12126 -8761 -610 -4065 -9985 -925 -1116 -11596 -12566 -6329
6341 -6329 -2331 -11585 -19648 -19804 -18593 -18778 -9300 -8923 -5898 -7479 -14149 -13232 -22682 -23219 -20604 -24694
6325 -24694 -25999 -21475 -27159 -28773 -20013 -18440 -17133 -16999 -17517 -20727 -16782 -11282 -6679 -1872 -9355
6310 -9355 -8852 -11658 -13741 -14417 -8867 -6741 -8958 -1649 921 -4982 -7927 -6851 -9532 -7441 -268
6295 -268 -974 -4388 -7075 -13241 -23604 -25357 -17646 -13059 -15411 -12079 -11425 -2212 -1019 -9035 -14566
6280 -14566 -15450 -18122 -22991 -16577 -17224 -27569 -31452 -24070 -13944 -5644 -10118 -16580 -16508 -18054 -8850
6265 -8850 -5821 -4007 1721 1771 310 -3044 -5173 -3264 -3500 -6293 -2731 -1505 -333 7123 -1685 -4693
6249d693R81n50m635m87L147q750k221P006N905l255N21O977l174p029N442J0630
6233E815l303o396Q32M781q066k920k573l461l065J3643P814p866L872N549q747
6218d091m234J437k307l069M481M566k76j0251n729m34K964M532L542l116j910
6203a3895J523o49k221n90N4Q877J78j764m307n111L086j441J0099K206o276l530
6187a3761m636N180J2898q096l720M645J738k347j474m226K598l131K800l691
6173a5223P14O271N42l503m57J306P374l54r646j4019P34l567J673Q187m969M38
6157b4499L453J658l95k792O39J178j63K854K817j570L11R064m658j111q22M408
6141i628k616r460l830J0985Q063K523J90j0182n867J1048N141L659k81p949m08
$$ plain form
6249 -4693 -3712 -4262 -8897 -9384 -6237 -14987 -17208 -10202 -4297 -7552 -7031 -54 -3228 -10257 -4815 5815
6233 5815 2512 -3884 -3052 1729 -6337 -9257 -11830 -15291 -18356 -4713 3101 -4765 -893 4656 -4091
6218 -4091 -8325 -6888 -9195 -12264 -7783 -3217 -3493 -13744 -19473 -19907 -16943 -12411 -8869 -11985 -13895
6203 -13895 -12372 -13021 -15242 -15832 -15778 -6901 -6723 -8487 -12794 -17905 -14819 -16260 -6161 -3955 -10231 -13761
6187 -13761 -18397 -13217 -319 -8415 -12135 -7490 -5752 -8099 -9573 -13799 -11201 -14332 -11532 -15223
6173 -15223 -14509 -8238 -7696 -11199 -11656 -10350 -2976 -3330 -12976 -26995 -26261 -29828 -28155 -19968 -24937 -24499
6157 -24499 -21046 -19388 -19783 -22575 -21936 -20758 -20921 -18067 -15250 -16820 -16509 -7445 -12103 -13214 -14036 -9628
6141 -9628 -12244 -21704 -25534 -14549 -6486 -3963 -3773 -13955 -19822 -8774 -3633 26 -255 -8204 -8612
6126h612M872L336j785k208m227l944l67K689J296m199Q641N768K306M410n431
6111B545q652K035p313l235J024o888N676L942L72m962p144r241l053R537N502
6096a9855N077L509N291J0568j021l747l623n001M091O577k629p410M84L953N771
6081B035n706j699N35q068q152N411L515K768n481k408M082q43J67M15M715K045
6065f669j252r159M582K670J192p458q940K268L18j63O372j821o548P199k86N395
6049a2300N505m02O367N855k109l384K77j464k197L325j439j317M93m65j1040
6034a4295m160R13O847N674k0j793K997M046P375M466J297k737m655J538j158
6019F335k916o487j906K980j662J269Q15o423p3L073j28p507q179K537L302o67
$$ plain form
6126 -8612 -3740 -404 -2189 -4397 -8624 -12568 -12935 -10246 -8950 -13149 -4508 1260 3566 7976 2545
6111 2545 -6107 -4072 -11385 -14620 -13596 -20484 -14808 -10866 -10494 -15456 -22600 -31841 -34894 -25357 -19855
6096 -19855 -14778 -11269 -5978 4590 3569 -178 -3801 -8802 -4711 1866 -763 -8173 -7689 -3736 2035
6081 2035 -3671 -5370 -4835 -12903 -21055 -15644 -12129 -9361 -14842 -17250 -13168 -14011 -13844 -13429 -8714 -6669
6065 -6669 -7921 -17080 -12498 -9828 -8636 -16094 -25034 -22766 -22448 -22611 -16239 -18060 -24608 -17409 -17695 -12300
6049 -12300 -6795 -7197 -830 5025 2916 -468 -191 -1655 -3852 -527 -1966 -3283 -2790 -3255 -14295
6034 -14295 -18455 -17542 -10695 -5021 -5041 -6834 -3837 209 7584 12050 13347 10610 5955 7493 6335
6019 6335 3419 -3068 -4974 -1994 -3656 -2387 -1572 -7995 -8068 -4995 -5123 -12630 -20809 -18272 -14970 -15637
6003a5637l653K353J2366L43o212j002J2003M028L726J112k307m276J134m191
5989b13o756m839l295L761O79L608P90K151M943k888m533j940J723J2252o028
5974e85n606N9P40k982r377K701j417j435L425J906N163q03K300p319p624J158
5958a9696J1541J062j35m81L728O547m413m465k668K169P311k715p106K241M362
5943b718K978J989J402o40J147k784m631p258k676J290p956r26Q843P247k584
5928g277l230m682p50k24L210K390O303O517l09K570j876q676k950P079o71p242
5912i818k915N144P019j111o136j87N719L985L907k643q547J982K625K369n018
5897c625j0425N283L425j485q498j576p116M791P440L5o31k23L749J5568k632
$$ plain form
6003 -15637 -19290 -16937 -4571 -4228 -10440 -11442 561 4589 8315 9427 7120 2844 3978 -213
5989 -213 -6969 -11808 -15103 -11342 -10663 -7055 -6265 -4114 829 -2059 -6592 -8532 -6809 5443 -585
5974 -585 -6191 -6132 -5392 -8374 -17751 -15050 -16467 -17902 -14477 -12571 -7408 -8211 -5911 -13230 -20854 -19696
5958 -19696 -8155 -7093 -7228 -7709 -3981 2566 -1847 -6312 -8980 -6811 500 -2215 -9321 -7080 -2718
5943 -2718 260 2249 3651 3011 4158 1374 -3257 -10515 -13191 -11901 -19857 -20783 -11940 -4693 -7277
5928 -7277 -10507 -15189 -15939 -16163 -12953 -10563 -4260 2257 1948 4518 2642 -6034 -8984 -1905 -2576 -9818
5912 -9818 -12733 -7589 -570 -1681 -7817 -8004 -2285 1700 5607 2964 -5583 -3601 -976 1393 -3625
5897 -3625 -14050 -8767 -5342 -6827 -15325 -16901 -24017 -19226 -11786 -11751 -12382 -12605 -8856 6712 4080
5882D080p783j868j870r70M036L12q568q197J299P737M31o580J330R325M374M884
5866A972r530r581M422m369l299Q262N938J871k546l484o968N580l318O462J0214
5851A626O221K709j620l497n067L94O905N546r698m383j0090l122q660k975j092
5836b6803J2643M066l811Q737l187o220Q128Q145j19n593o603n53P263J478J45
5821b284l27j719l172N346K587j1296n982J0391Q640m612o594m891J475J2622
5807A84j919r53m069L304L890K904j890K312m74p110K382m309L615j852n804k308
5791a2097m64o085K113j527j882K96M536k056q21K008M107Q007M635m239n152
5776h621K4J1868n418M423n171p825j127N361Q485k383m848j1886j587N016O604
$$ plain form
5882 4080 -3703 -5571 -7441 -8411 -4375 -4063 -12631 -20828 -19529 -11792 -11361 -17941 -16611 -7286 -2912 1972
5866 1972 -7558 -17139 -12717 -17086 -20385 -12123 -6185 -4314 -6860 -10344 -17312 -11732 -15050 -8588 1626
5851 1626 7847 10556 8936 5439 372 766 7671 13217 3519 -864 -10954 -14076 -22736 -25711 -26803
5836 -26803 -14160 -10094 -13905 -5168 -8355 -14575 -6447 1698 1579 -4014 -10617 -11170 -3907 -2429 -2284
5821 -2284 -2611 -4330 -7502 -2156 431 -10865 -16847 -6456 2184 -2428 -9022 -13913 -12438 184
5807 184 -1735 -2688 -6757 -3453 437 3341 1451 3763 3289 -3821 -1439 -5748 -2133 -3985 -9789 -12097
5791 -12097 -12561 -18646 -16533 -18060 -19942 -19646 -15110 -17166 -17987 -15979 -11872 -3865 770 -3469 -8621
5776 -8621 -8597 3271 -2147 2276 -2895 -10720 -11847 -6486 1999 -384 -5232 -17118 -18705 -13689 -7085
5761g085N254l021N195K965l247o253o250k682J366N32r85k452L929L000N734
5746d000P458K320k559j0302k313o126l219J1319O336k734j844K338k769k558
5732h653p00M830Q346L818l82k531M59n65p710Q28j531K143K881M46J99Q447R090
5715A9415K732j6206m020k830o692m984L564J1799k089m481q096j977P88L05Q80
5700a1892n363Q30P664O159P037P306R20n794j0646j962M782O050k330K578j227
5685D112L04j779k271n050L080l12o078p170L135J1329J760l890L125m42l038
5670c185M922j799k847L494J260m56K826J921L998o997J173M900m783m847j989
5655b409L542M614o669j0777q363P314N169j293j944O4Jn347m495K178Q177O169
$$ plain form
5761 -7085 -1831 -4852 343 3308 61 -6192 -12442 -15124 -13758 -13226 -14211 -16663 -12734 -9734 -4000
5746 -4000 3458 5778 3219 -7083 -9396 -15522 -18741 -7422 -1086 -3820 -5664 -3326 -6095 -8653
5732 -8653 -9353 -4523 3823 7641 7259 4728 5187 4622 -3088 -2260 -3791 -1648 1233 1679 1878 10325 19415
5715 19415 22147 5941 1921 -909 -7601 -12585 -9021 2778 689 -3792 -11888 -13865 -13077 -12772 -11892
5700 -11892 -17255 -16425 -8761 -2602 4435 11741 12661 6867 -3779 -5741 -959 5091 2761 5339 4112
5685 4112 4416 2637 366 -4684 -1604 -1916 -7994 -15164 -12029 -700 1060 -2830 295 -147 -3185
5670 -3185 1737 -62 -2909 585 1845 1389 4215 6136 10134 3137 4310 9210 4427 -420 -2409
5655 -2409 1133 5747 -922 -11699 -20062 -12748 -7579 -8872 -10816 -10752 -10751 -16098 -20593 -18415 -10238 -4069
5639d069j456p7k16K821K206j1019o074j95Q050M515Q42J206j292N317k14r191
5623h846O258K972j771n366o887k635M690O859r31k999o508j488O672J714M357
5608c909J1291L192j2584l330j608o719L235K781L623j080J20o61K796K515L772
5593C434k760l78j213m693j391j174l772p227L911J6183J285j3000j2681k262
5579b5738R298P167L44O85M696K588n950n903n394m419Q140P543N284k249l704
5564g612K213r33m337q03n032J726l99M916L076O410r02j625l565k630M149L773
5548a575O713J585K682m633q514M322M707m967j3326P687K982p46N715N176j0462
5533b654M532K220p345o364j665N444R133j161m048O014J159m877M44P740Q00
$$ plain form
5639 -4069 -5525 -5602 -5818 -2997 -791 -11810 -17884 -18079 -10029 -5514 -4672 -3466 -4758 559 345 -8846
5623 -8846 -2588 384 -1387 -6753 -13640 -16275 -11585 -4726 -5657 -8656 -15164 -16652 -9980 -8266 -3909
5608 -3909 7382 10574 -2010 -5340 -6948 -13667 -10432 -7651 -4028 -5108 -4988 -5649 -2853 -338 3434
5593 3434 674 296 -917 -5610 -7001 -8175 -11947 -19174 -15263 920 2205 -10795 -23476 -25738
5579 -25738 -16440 -9273 -8929 -8244 -3548 -960 -6910 -12813 -18207 -22626 -14486 -6943 -1659 -3908 -7612
5564 -7612 -5399 -6332 -10669 -11472 -16504 -14778 -15177 -10261 -7185 -775 -1677 -3302 -6867 -9497 -5348 -1575
5548 -1575 5138 6723 9405 4772 -3742 580 5287 320 -13006 -5319 -2337 -3083 2632 7808 -2654
5533 -2654 1878 4098 -3247 -9611 -11276 -5832 3301 2140 -1908 4106 5265 388 832 8572 9372
5518I372j752j590j151k109J01m862p38o639O96M146K064m210o205R188O13j638
5502d714k425l364P35m250m757N389J1147K998l959J119K832L711p816l467j933
5487h754l208K776R771p9L412O932p596p460l231l787P282N986k623O04j0088
5472a0063N84j567m8J144K782r007Q134J0938n114r074l847Q151R145L482N522
5457A1162p555m919k07o291j578L187j912K764l868o105R026k877L747L708o50
5442b368L267P557m626o849l081K001j74m483K436L377J317O501q728m035J236
5427f652N46N417M229j3498o726l493K59J953K079Q622O115M846m836r152j438
5412a1729N241o9p74N54m34J948j755L432J5189O29n082r513j034R26k086M57
$$ plain form
5518 9372 7620 6030 4879 2770 2871 -1991 -2729 -9368 -8672 -4526 -2462 -6672 -12877 -3689 -3076 -4714
5502 -4714 -7139 -10503 -9768 -14018 -18775 -13386 -2239 759 -3200 -2081 751 4462 -3354 -6821 -8754
5487 -8754 -11962 -9186 585 506 3918 10850 3254 -4206 -7437 -11224 -3942 2044 -579 25 -10063
5472 -10063 -9479 -11046 -11094 -9950 -7168 -16175 -8041 2897 -2217 -11291 -15138 -6987 2158 5640 11162
5457 11162 3607 -1312 -1519 -7810 -9388 -6201 -8113 -5349 -9217 -15322 -6296 -9173 -5426 -1718 -2368
5442 -2368 899 8456 3830 -3019 -6100 -4099 -4273 -8756 -6320 -2943 -1626 4875 -3853 -7888 -6652
5427 -6652 -6106 -689 3540 -9958 -16684 -20177 -19918 -17965 -15886 -7264 -1149 3697 -1139 -10291 -11729
5412 -11729 -6488 -6557 -7331 -6777 -7211 -5263 -7018 -3586 11603 12232 7150 -2363 -3397 -2471 -4557 -4100
5396d100Q502o406j268M897O288l071m99k64R03K206K423j871J383m34m01m874
5380C414J805J144j1126l127L561m76l592Q24K069O492k974j0351K480J3151M012
5365G306m413O837O054k822K516m366k337O089M52n18M515J136m225q520j6089
5350h385k639J0669M662j295k759j493j1286o255P713N585j373N427j010j474
5336c913k428O905M756N5n09l984m166j033L631l832l066O932k778N671j657o921
5320f337p214k88J0859j82n387k361M897J761J104m665m669M012M563m898L753
5305e052k118M827R93n103J574L289J820M841j477j596N79m843M06M710n234n024
5289g408K000n601M49k819M689P001N040o035o635j79l057J544Q23J863J01m526
$$ plain form
5396 -4100 4402 -2004 -3272 1625 7913 4842 4343 4079 4982 7188 9611 7740 9123 8689 8288 3414
5380 3414 5219 6363 -4763 -7890 -4329 -4805 -8397 -7573 -5504 988 -1986 -12337 -9857 3294 7306
5365 7306 2893 9730 15784 12962 15478 11112 8775 14864 15316 14798 19313 20449 16224 7704 -8385
5350 -8385 -11024 -355 4307 3012 253 -1240 -12526 -18781 -11068 -5483 -6856 -1429 -2439 -3913
5336 -3913 -6341 564 5320 5375 4866 882 -3284 -4317 -686 -4518 -7584 -652 -3430 2241 584 -6337
5320 -6337 -13551 -13839 -2980 -3162 -8549 -10910 -6013 -4252 -3148 -7813 -12482 -8470 -3907 -8805 -5052
5305 -5052 -7170 -2343 -1350 -6453 -4879 -1590 230 5071 3594 1998 2577 -2266 -1860 2850 -2384 -7408
5289 -7408 -5408 -11009 -10560 -13379 -8690 -1689 3351 -2684 -9319 -9498 -12555 -11011 -10188 -8325 -8224 -12750
5273a2750J39M531K58L313k625m503p95r67l9l289j394j316k264P922K604Q4L994
5256g097K546J18j654M81p60k51k497J134P030k00j174m087j771l091J1362K648
5240B737l493j621o723m877k166J2577K573R7k668R920O469q406o937o469L26
5225h661O315k701P73L053m099q511O666J3580J628r427L373L584n753k674L66
5210b488l506K098J724M602L1j230N114n478o856n828n518J699P280O564N975
5195D183l08o517j0545P99p781l832N979N150J569K488O839j972K050J36R94M640
5179C872o486m697J898K608L247J549m593k474l20K010j61O028J748j0127O65
5164e233O862K394m791M847O041q306j0591N15j006o77L044K43J488J410q187
$$ plain form
5273 -12750 -12611 -8080 -7822 -4509 -7134 -11637 -12432 -13399 -13438 -16727 -18121 -19437 -21701 -13779 -11175 -11091 -7097
5256 -7097 -4551 -4433 -6087 -5606 -6366 -6617 -9114 -7980 -950 -1150 -2324 -6411 -8182 -11273 89 2737
5240 2737 -756 -2377 -9100 -13977 -16143 -3566 -993 -896 -3564 6356 12825 4419 -2518 -8987 -8661
5225 -8661 -2346 -5047 -4274 -1221 -5320 -13831 -7165 6415 8043 -1384 1989 5573 -180 -2854 -2488
5210 -2488 -5994 -3896 -2172 2430 2461 1231 6345 867 -5989 -11817 -17335 -15636 -8356 -1792 4183
5195 4183 3875 -2642 -13187 -12388 -20169 -24001 -18022 -12872 -11303 -8815 -1976 -3948 -1898 -1762 -768 3872
5179 3872 -2614 -7311 -5413 -2805 442 1991 -2602 -5076 -5396 -3386 -3547 2481 4229 -5898 -5233
5164 -5233 1629 4023 -768 4079 10120 1814 -8777 -8262 -9268 -9945 -6901 -6658 -5170 -3760 -11947
5149a1947L651J685k3J61J207Q225l375l7M385m433o714p86R522L738J279j960
5133D578n21p22J917k103M247l783n174J626J581K463J340k630l04q868l352J457
5117h248m44m203j2083Q180P182K51Q77m69k423J785j585k525j010N495O069k22
5101c373M678P15n839K105J605K561j13j3599l288R857J1932k732q748p337K585
5086h991k258k449L506P54O087l446m362N465K860L37k040j123J782j715L592
5071b001j589n46k215r24O295L025l414l971K494M855O210m617L456J637k0904
5056a2209o896O603Q349O796q39M223J740L045M619Q84j1089q991O550K70j941
5041A114L8j159l604L040M813K479l633L711M275k97J740n401l475J462q482m478
$$ plain form
5149 -11947 -8296 -6611 -6634 -6473 -5266 2959 -416 -453 3932 -501 -7215 -8001 1521 5259 6538 4578
5133 4578 4057 3335 5252 3149 7396 3613 -1561 65 1646 4109 5449 2819 2515 -6353 -9705 -8248
5117 -8248 -8692 -12895 -24978 -16798 -9616 -9365 -8488 -8957 -11380 -9595 -11180 -13705 -14715 -9220 -3151 -3373
5101 -3373 1305 2020 -3819 -1714 -109 2452 2339 -11260 -14548 -4691 7241 4509 -4239 -11576 -8991
5086 -8991 -11249 -13698 -10192 -9438 -3351 -6797 -11159 -5694 -2834 -2497 -4537 -5660 -3878 -5593 -2001
5071 -2001 -3590 -4136 -6351 -7275 -980 2045 -1369 -5340 -2846 2009 8219 3602 7058 8695 -12209
5056 -12209 -19105 -12502 -4153 2643 1804 6027 7767 10812 15431 16315 5226 -3765 2785 3055 1114
5041 1114 1152 -7 -3611 -571 4242 6721 3088 6799 11074 10777 12517 7116 3641 5103 -3379 -7857
5025g857K926J566J2370O097m481L171K03p775l864l573l03K187j992K047l88
5010C34l384r463q313O907M194O548j328r063P465O455L514M884k030m732q407
4995f419p719n60J0258O936O324r768p28O496M962r95R02j1145m082n13l865N356
4979d560j960m059n623j74O970N375k725M926O798q6j416j0331L805O71M031O65
4963B307L53O691q016k835l741K787j345L867L024L763j532k544l644K224m652
4948c293K283L331J865j1331j345Q379N019J625n499j1463N18O460L811L276P314
4933A0950J1789j210j6453l782Q386M411o321n102P02n941j939P638P265N186
4919A5579N804n010n476r145p147l232M9M436L449L825l938l536j248O398J321
$$ plain form
5025 -7857 -4931 -3365 9005 15102 10621 13792 13995 6220 2356 -1217 -1520 667 -1325 722 334
5010 334 -3050 -12513 -20826 -13919 -9725 -3177 -4505 -13568 -6103 352 3866 8750 6720 1988 -6419
4995 -6419 -14138 -14698 -4440 2496 8820 -948 -1676 4820 9782 8787 9689 -1456 -5538 -6051 -9916 -4560
4979 -4560 -6520 -10579 -16202 -16376 -9406 -4031 -6756 -1830 4968 4882 3466 -6865 -3060 -2389 1642 2307
4963 2307 2660 9351 1335 -1500 -5241 -2454 -3799 68 3092 6855 5323 2779 -865 1359 -3293
4948 -3293 -1010 2321 4186 -7145 -8490 -111 4908 6533 1034 -10429 -9911 -3451 360 3636 10950
4933 10950 22739 21529 5076 1294 9680 14091 7770 2668 3370 -2571 -4510 3128 10393 15579
4919 15579 21383 16373 10897 1752 -5395 -8627 -8578 -4142 -693 3132 -806 -4342 -5590 808 2129
4904B129m778j8829m943J1061j58R069J6806K500n795j169j126o0k041M844n44
4889F966j559r432k222J188N709n177r218K399O264l55l009L539L911M705M584
4874H293L30O364J394j975p752p331N098l7m415Q785K525l74M949j966n650j0360
4858b122m564O54j776q639K791J2597m341J385m887m644m885J266K892k45P83
4843a3735O791J0142r713J47j96J665J2000N658o057p875m827L722R078L895p734
4828B961j1918J435Q42k308k239l330N082R545L182L276o86n311J819M335q596
4813a911j1825m147o975k964M061P323J125J96Q334J2991L193l681o425M033o04
4798B724L782N065j0436J514P351K376o386k460J467L228J89l317K179K963L476
$$ plain form
4904 2129 -2649 -21478 -26421 -15360 -15518 -6449 10357 12857 7062 5893 4767 4707 2666 7510 6966
4889 6966 5407 -4025 -6247 -5059 650 -4527 -13745 -11346 -5082 -5437 -8446 -4907 -996 3709 8293
4874 8293 8623 14987 16381 14406 6654 -677 4421 4384 -31 8754 11279 10905 15854 13888 8238 -2122
4858 -2122 -6686 -6032 -7808 -16447 -13656 -1059 -5400 -4015 -8902 -13546 -18431 -17165 -14273 -14518 -13735
4843 -13735 -6944 3198 -6515 -6368 -6564 -4899 7101 12759 6702 -1173 -6000 -2278 6800 10695 2961
4828 2961 -8957 -7522 -6680 -8988 -11227 -14557 -9475 70 3252 6528 5842 531 2350 6685 -1911
4813 -1911 -13736 -17883 -24858 -27822 -23761 -16438 -15313 -15117 -6783 6208 9401 5720 -705 3328 2724
4798 2724 6506 11571 1135 2649 10000 12376 5990 3530 4997 8225 8414 5097 7276 10239 13715
4783A3715k362j2195r69m851j87OM578P008N072l25k646m761q905K524o980n501
4767a6779P196L930l23Q056K550o264K147M988J432m602J409K305J346k88J786
4752H889L786J580m764k096R899j899j4145J008K862n631j530R32L139Q892P042
4737A7964l554o752o86k27j856K570L207M72O60j286j0212q255L636P208O57L858
4721G404p105o442n55N790N385l461R84p93K615n292N7k48Q007K953o66j117o691
4704H25q981n840k537J3362J5072Q761l833q023n16o669j552L221j133L51l188
4689f80j814k533l663K047o61L044m156n011O105M809L507R8K339K667O158j557
4673A0699j3923k528j219L848M013l525j004N992L902J099m568o024k20L723M629
$$ plain form
4783 13715 11353 -842 -1811 -6662 -6849 -6843 -2265 4743 9815 9490 6844 2083 -6822 -4298 -11278 -16779
4767 -16779 -9583 -5653 -5976 2080 4630 -1634 513 5501 6933 2331 3740 6045 7391 7103 8889
4752 8889 12675 14255 9491 7395 17294 15395 1250 2258 5120 -511 -2041 -1109 2030 10922 17964
4737 17964 14410 7658 6972 6745 4889 7459 10666 11138 11798 10512 300 -7955 -4319 2889 3546 7404
4721 7404 299 -6143 -6698 -908 4477 1016 2000 1207 3822 -1470 -1413 -1661 6346 9299 8633 7516 825
4704 825 -8156 -13996 -16533 -3171 11901 20662 16829 8806 8290 1621 69 3290 2157 2508 -680
4689 -680 -2494 -5027 -8690 -6643 -7304 -4260 -8416 -13427 -7322 -2513 994 1092 3431 6098 12256 10699
4673 10699 -3224 -5752 -6971 -3123 890 -2635 -3639 2353 6255 7354 2786 -3238 -3458 265 4894
4658D894j17Q59Q17J001j433j4052l71L961J754M286n679p1J583j217r619Q660
4642d744Q020r623m810L327M117K869K081m898K557M455l452n826o394m629K236
4627a4714J672R071J462m90K832j876q851N780K614M960N015o223n332J141N131
4612B192L198m390j415K695N56M498q12o707J295k530r682M126K787r184L333
4597a0040J0842N619O542K676O930J611q414n678j516j5465L648J0443k30l736
4583C232k921p26Q819P781l907p681j973K397P175M742K929o28q097n960r020
4568c838n628l244R349Q684k286n304K032l217K958K647j693M656J1647J692n321
4553A3134q862M801P52J377J610q964r464J0333q66N34J0751K827J990K781p681
$$ plain form
4658 4894 4777 5636 6453 7454 6021 -8031 -8402 -4441 -2687 1599 -4080 -4151 -2568 -3785 -13404 -4744
4642 -4744 3276 -6347 -11157 -7830 -3713 -844 1237 -3661 -1104 3351 -101 -5927 -12321 -16950 -14714
4627 -14714 -13042 -3971 -2509 -2999 -167 -2043 -10894 -5114 -2500 2460 7475 1252 -4080 -2939 2192
4612 2192 5390 1000 -415 2280 2836 7334 6522 -185 1110 -1420 -11102 -6976 -4189 -13373 -10040
4597 -10040 802 6421 12963 15639 22569 24180 15766 10088 8572 -6893 -3245 7198 6968 3232
4583 3232 311 -415 8404 16185 12278 4597 2624 5021 12196 16938 19867 19239 11142 5182 -3838
4568 -3838 -9466 -12710 -3361 5323 3037 -2267 -235 -3452 -494 2153 460 5116 16763 18455 13134
4553 13134 4272 9073 9825 11202 12812 3848 -5616 4717 3851 4385 15136 17963 19953 22734 15053
4538A5053n203l696K55r97n933l541j097O151k621R314O224M645M091q458m662
4523I525l691l037J655M023k797m170l302j839l067N757J677p148J997n76R276
4508D283O534l374l589M12j0075M848P238Q110m083o333j5905J727P408j276l740
4493g815L772M652M551n119q234M914N602K813k733K612K719Q216N541l798n777
4478A1916j2153n91J664j313k653M31O818K965j589M875K081J568M893M36l479
4463A5869Q01k897j1687l733j352l55j145K898N617L775o04p978j235M217K278
4448D469j936k296k536Q37k592Q809J0159J554l988p786l049P020J1031k162n366
4433A2168K435k453l073p198o84k562L255O958Q719k184j0942l701L161o499n799
$$ plain form
4538 15053 9850 6154 6409 5412 -521 -4062 -5159 992 -1629 7685 13909 18554 22645 14187 9525
4523 9525 5834 2797 4452 8475 5678 1508 -1794 -3633 -6700 -943 734 -6414 -4417 -4993 4283
4508 4283 10817 7443 3854 4266 -5809 -961 6277 14387 10304 3971 -11934 -10207 -2799 -4075 -7815
4493 -7815 -4043 609 5160 41 -8193 -3279 2323 5136 2403 5015 7734 15950 21491 17693 11916
4478 11916 -237 -828 836 -477 -3130 -2699 4119 7084 5495 10370 12451 14019 18912 19348 15869
4463 15869 16670 13773 2086 -1647 -2999 -3354 -4499 -1601 4016 7791 7187 -791 -2026 2191 4469
4448 4469 2533 237 -2299 -1462 -4054 4755 14914 16468 12480 4694 1645 8665 19696 17534 12168
4433 12168 14603 12150 9077 1879 1195 -1367 1888 8846 17565 15381 4439 738 3899 -2600 -8399
4418h399K64L466J1545o6j1130n259q850l147Q232J3219J0137p404q394M560J1232
4403A0006n797j1527o102L708k375k201J0969J0908P209k293j200P1n732j483
4389D161j891m470k116L454k154r007j168M180J039P727J892j1242O617J0554
4375G576P393k784N011L747p663n015k181l984M278L17j450j662Q37k151o372
4360d103n66N233K610j029o522q948k050Q682P976J192l289N632R008j252m46
4345A2128N661N259l369j0293k968L459O575J0084r98j5592j6109L02L509R97
4331a355J3537q39o721m488p388j581L209Q454L443m506n92L113o558K782k161
4316a651l987M060M972J027l051l012L632L73r221n880N222j104L220M295k639
$$ plain form
4418 -8399 -8135 -4669 6876 6810 -4320 -9579 -18429 -21576 -13344 -125 10012 2608 -5786 -1226 10006
4403 10006 4209 -7318 -13420 -9712 -12087 -14288 -3319 7589 14798 12505 11305 11376 5644 4161
4389 4161 2270 -2200 -4316 -862 -3016 -12023 -13191 -9011 -7972 -245 1647 -9595 -2978 7576
4375 7576 14969 12185 17196 20943 13280 8265 6084 2100 6378 6695 5245 3583 4420 2269 -4103
4360 -4103 -4669 564 3174 2145 -4377 -13325 -15375 -6693 1283 2475 -814 4818 13826 12574 12128
4345 12128 17789 23048 19679 9386 6418 9877 16452 26536 25538 9946 -6163 -5861 -2352 -1355
4331 -1355 12182 11343 4622 134 -7254 -8835 -5626 2828 6271 1765 1173 4286 -2272 510 -1651
4316 -1651 -5638 -1578 3394 4421 1370 -1642 1990 2363 -6858 -12738 -7516 -8620 -5400 -1105 -3744
4301c744j805J115P180M601p20K256k296l937J436L276j894r7j891J488N307K335
4285A2610p487p935M617l960O107k116L602Q017j762j0190j208P799O869J666
4271A6629l91j488k930m308m459J584N001M612l254m599M021N433L110l243K184
4256A7902M479J257o379M302n961J807p720q007N642o6j161m79j209j831q939
4241f363P137L882r13j427L48l369m071J702J0056k811N302J050K269N27j4333
4226a014j627K196l101K673Q030K737J2519k483p651l120l634j600L005L225k822
4211G333n769k030j786J086N360J777l26L460q39O396j298l988J234j0068j4298
4196a3756O413R146P318N589j947m106l851o651l586N544o106p006L418M945L624
$$ plain form
4301 -3744 -5549 -4434 2746 7347 6627 8883 6587 2650 4086 7362 5468 5371 3480 4968 10275 12610
4285 12610 5123 -2812 1805 -2155 3952 1836 5438 13455 11693 1503 295 8094 14963 16629
4271 16629 16238 14750 11820 7512 3053 4637 9638 14250 10996 6397 10418 15851 18961 15718 17902
4256 17902 22381 23638 17259 21561 15600 17407 9687 1680 7322 7256 6095 5616 4407 2576 -6363
4241 -6363 774 4656 3743 2316 2664 -705 -4776 -3074 6982 4171 9473 10523 12792 13319 -1014
4226 -1014 -2641 -445 -3546 -873 7157 9894 22413 19930 12279 9159 5525 3925 6930 10155 7333
4211 7333 1564 -466 -2252 -1166 4194 5971 5645 9105 8266 14662 13364 9376 10610 542 -13756
4196 -13756 -7343 1803 9121 14710 12763 8657 4806 -1845 -5431 113 -5993 -12999 -9581 -4636 -1012
4181a012J000m521o18L593m360O499L437m288p594P743O639k009N637l618p968
4166a440K200M632L344q61j1775l942O24l063M909J1432L659m268l702m988K203
4151a036M803K085n474M258k38M33J896n200n691q352K044J84O17P140L419o581
4135e693M079k599m327n814J524R243M436J832N397l997k353K718l09J86o226
4120a903M377J0306j243K69J770k492N068M321M897K45n546q933o983J438k573
4105C018q205k720Q515J0341m835m268K093K643l910J975j736r234K186O410J0112
4090A2385J373l193m087l541j639l615p963m133L442N600O945J210J832l070p468
4075e922N376O273O50j630K360j868l611k694k592L005L144O509O159P316l607
$$ plain form
4181 -1012 -12 -4533 -5151 -1558 -5918 581 4018 -270 -7864 -121 6518 4509 10146 6528 -1440
4166 -1440 760 5392 8736 7875 -3900 -7842 -7218 -10281 -5372 6060 9719 5451 1749 -3239 -1036
4151 -1036 3767 5852 378 4636 4398 4831 6727 1527 -4164 -12516 -10472 -10288 -9671 -2531 888 -5693
4135 -5693 -1614 -4213 -8540 -14354 -12830 -3587 849 2681 8078 4081 1728 4446 4137 4323 -1903
4120 -1903 2474 12780 11537 11806 13576 11084 16152 20473 25370 25615 20069 11136 4153 5591 3018
4105 3018 -5187 -7907 608 10949 6114 1846 3939 6582 2672 4647 2911 -6323 -4137 2273 12385
4090 12385 13758 10565 6478 2937 1298 -2317 -10280 -14413 -10971 -5371 1574 2784 4616 1546 -5922
4075 -5922 -546 5727 6377 4747 7107 5239 1628 -1066 -3658 -653 2491 9000 15159 22475 18868
4060A8868p792k062J0223K395p993j0981j708q84k409J002j762L848J107K138
4046C990r87q522N853R08q534l084R754J2457N386K301j926q393j640J325l643
4031E245m847j198P613k259n64K290M004l462n670J036J0074P218kM108k451l649
4015A7486p126n901P108m678j600J379K812K277n358L922K733N64p174m341J736
4000C839j195L85R666K343l571k082N326j52k961q510o115P20J008L009O42m665
3984b313N635o26m798j01Q05l085Q981O974n170q887Q667O806J669J820k615M69
3968A4231N065j805m746k052q053k555j596J857j720j061k289k815j0796L960
3954a4375N579O899k55K681p00L306J018J659k808qK832o519p752J781k112K687
$$ plain form
4060 18868 11076 9014 19237 21632 13639 2658 950 66 -2343 -1341 -3103 745 1852 3990
4046 3990 3003 -5519 334 1242 -7292 -10376 -622 11835 17221 19522 17596 9203 7563 8888 5245
4031 5245 398 -800 6813 4554 3990 6280 10284 6822 1152 2188 12262 19480 19478 23586 21135 17486
4015 17486 10360 4459 11567 6889 5289 6668 9480 11757 6399 10321 13054 13618 6444 2103 3839
4000 3839 2644 3029 12695 15038 11467 9385 14711 14559 11598 3088 -3027 -2307 -1299 1710 2352 -2313
3984 -2313 3322 2696 -2102 -2203 -1398 -4483 4498 11472 6302 -2585 6082 12888 14557 16377 13762 14231
3968 14231 19296 17491 12745 10693 2640 85 -1511 346 -1374 -2435 -4724 -7539 -18335 -14375
3954 -14375 -8796 -1897 -2152 529 -171 3135 4153 5812 3004 2996 5828 -691 -8443 -6662 -8774 -6087
3938f087M273k542O293R269q920r992O002Q191K129J719p261j0698r84p701L724
3923a2585N458J197n6l621J670K856J0331o15k6q96K973j37m245j225k341m623
3907e885m011M165K584L963L515j49K004K893n487l707N831K360j0519J594J785
3892I36j49O792p849k58K584k789M373o19R87J609l164j115L644R23o02J545l945
3875B903J2491Q703j6823q424n40P428m145p470N357Q68M144L059r295l427N652
3860D81M456j578O459Q99j819O839P63J911l938n508q902K473R72p01k083M397
3844E121M483m646k236N053M506n711j261l316k901n16Q4L513J0671Q859n064
3829A6639p255o793k612K017Q935J144l096j536n862l987K685K343P507K960j2822
$$ plain form
3938 -6087 -1814 -4356 1937 11206 2286 -7706 -1704 6487 8616 10335 3074 -7624 -8608 -16309 -12585
3923 -12585 -7127 -5930 -5986 -9607 -7937 -5081 5250 4635 4609 3713 6686 6549 2304 1079 -1262 -5885
3907 -5885 -9896 -5731 -3147 816 4331 4182 6186 9079 3592 -115 5716 8076 -2443 -849 936
3892 936 787 7579 -270 -528 2056 -733 3640 3021 4008 5617 2453 1338 4982 5905 5303 6848 2903
3875 2903 15394 24097 7274 -1150 -1690 5738 1593 -5877 -520 348 4492 7551 -1744 -5171 481
3860 481 4937 3359 9818 10717 8898 15737 16500 18411 14473 8965 63 2536 3508 2807 724 5121
3844 5121 9604 4958 2722 7775 12281 6570 5309 1993 -908 -1424 -1340 2173 12844 21703 16639
3829 16639 9384 2591 -21 1996 10931 12075 8979 7443 1581 -2406 279 2622 10129 13089 267
3814B67j6402j501M817O521Q306m704K041J4721R246n763j1130k332j112o812
3800c837k323K820M210M096L496J0491m598r64l536k045j383p74K186N112Q14
3785A3765o11k020M275m659j020J113o803m418j050N6K456l6j870J2034M669O80
3769A6561M96n868j618J821J399m504j395N599n827m551N159r19K489N707L793
3754A8342l547j027q614n311l843J854K527M733O202n306O47Q665k817n931k503
3739D071L428j037n994R664M709q350o355m194L998K169k086N646N597N19J239
3724A3024n254k481p225j061j2m29L974Q651m400q140L486K88k249N959l868n247
3708d984k294J098L533O616L729l685q888j313k713L208L6L590M454J056k210
$$ plain form
3814 267 -16135 -17636 -12819 -6298 2008 -2696 -655 14066 23312 17549 6419 4087 2975 -3837
3800 -3837 -6160 -3340 870 4966 8462 18953 14355 13391 9855 7810 6427 5653 7839 12951 13765
3785 13765 13154 11134 15409 10750 9730 10843 4040 -378 -1428 -1372 1084 1048 -822 11212 15881 16561
3769 16561 17057 11189 9571 11392 12791 8287 6892 12491 6664 2113 7272 6353 8842 14549 18342
3754 18342 14795 13768 5154 -157 -4000 -2146 381 5114 11316 6010 6657 15322 12505 6574 4071
3739 4071 7499 6462 468 10132 14841 6491 136 -4058 -60 2109 23 5669 11266 11785 13024
3724 13024 7770 5289 -1936 -2997 -3009 -3438 536 9187 4787 -3353 133 421 -1828 4131 263 -4984
3708 -4984 -7278 -6180 -2647 3969 7698 4013 -4875 -6188 -8901 -5693 -5657 -2067 2387 3443 1233
3693A233p766l076P757m138l609n164O929J3455N758r535n068M409P093P019l911
3678A1386o386q435m01M544M664P761j25l268j11J484J56p097o76M344n156N281
3662G965J734O80o043r056m436J703P839L152k412N311j245q999n860J990l220
3647a0897O760M705j44L945n072K973J394L887j534r803j1344R659J1564o714
3633f21r57O226o05j0480p896L753O432o874o257J742N427K072j868N946M705
$$ plain form
3693 1233 -6533 -9609 -1852 -5990 -9599 -14763 -7834 5621 11379 1844 -3224 1185 8278 15297 11386
3678 11386 5000 -3435 -3836 708 5372 13133 13008 9740 9629 11113 11269 4172 3496 7840 2684 7965
3662 7965 9699 10379 4336 -4720 -9156 -7453 386 3538 1126 6437 5192 -3807 -9667 -7677 -10897
3647 -10897 -4137 568 424 4369 -703 2270 3664 7551 6017 -3786 -15130 -5471 6093 -621
3633 -621 -1578 4648 4043 -6437 -14333 -10580 -4148 -11022 -17279 -15537 -10110 -8038 -9906 -3960 745
$$ [...]
##END NTUPLES=NMR SPECTRUM
##END=
