##TITLE=Analysis number 316307
Compound Code cc 45311
Book Reference 382/156/1
Project Code adrs
Chemist Name simons
##JCAMPDX= 6.0         $$ Bruker NMR JCAMP-DX V2.0
##DATA TYPE= NMR SPECTRUM
##DATA CLASS= NTUPLES
##ORIGIN= Bruker BioSpin GmbH
##OWNER= nmr
$$ XWIN-NMR		Version 3.5
$$ Tue Jan 10 13:57:54 2006 GMT Standard Time (UT+0h)  MAYBRIDGE\nmr@NMR_250MHZ
##.OBSERVE FREQUENCY= 250.131544655141
##.OBSERVE NUCLEUS= ^1H
##.ACQUISITION MODE= SIMULTANEOUS (DQD)
##.ACQUISITION SCHEME= undefined
##.AVERAGES= 16
##.DIGITISER RES= 18
##SPECTROMETER/DATA SYSTEM= dpx250
##.PULSE SEQUENCE= zg30
##.SOLVENT NAME= CDCl3
##.SHIFT REFERENCE= (INTERNAL, CDCl3, 0, 16.522)
##AUDIT TRAIL= $$ (NUMBER, WHEN, WHO, WHERE, WHAT)
$$ ##TITLE= Audit trail, XWIN-NMR		Version 3.5
$$ ##JCAMPDX= 5.01
$$ ##ORIGIN= Bruker BioSpin GmbH
$$ ##OWNER= nmr
$$ C:\u/data/dgb/nmr/ADRS/14440/pdata/1/auditp.txt
$$ ##AUDIT TRAIL=  $$ (NUMBER, WHEN, WHO, WHERE, WHAT)
(   1,<2006-01-10 13:57:14.68 +000>,<MAYBRIDGE\nmr>,<NMR_250MHZ>,
      <created by zg, POWCHK disabled, PULCHK disabled
       configuration hash MD5:
       62 19 C7 07 E1 42 D1 B7 37 6C 3D D0 77 39 F9 E6
       data hash MD5: 64K
       01 CB 33 20 F6 B1 D3 9D D2 3C 02 B7 F0 97 64 88>)
(   2,<2006-01-10 13:57:32.78 +000>,<MAYBRIDGE\nmr>,<NMR_250MHZ>,
      <Start of raw data processing
       ef LB = 0.3 FT_mod = 6 PKNL = 1 SI = 32K 
       data hash MD5: 32K
       29 24 3F EB A9 25 B6 FD 75 85 9A F3 B8 22 52 D1>)
(   3,<2006-01-10 13:57:34.72 +000>,<MAYBRIDGE\nmr>,<NMR_250MHZ>,
      <apk 
       data hash MD5: 32K
       EE 60 A0 D1 59 F7 2F B6 6E 9E C1 90 DE 78 63 76>)
(   4,<2006-01-10 13:57:35.42 +000>,<MAYBRIDGE\nmr>,<NMR_250MHZ>,
      <abs ABSG = 5 
       data hash MD5: 32K
       EF 40 0B 9D E5 6A 9E 3D 27 C9 70 A5 9C 2B F2 92>)
$$ ##END=
$$ 
$$ hash MD5
$$ 46 F4 49 82 7E 60 21 79 58 80 FC ED 90 D5 7D E9
##$RELAX= 
##$RELAX= 
##$RELAX= 
##$RELAX= 
##$RELAX= 
##$RELAX= 
##$RELAX= 
$$ Bruker specific parameters
$$ --------------------------
##$DU= <C:\u>
##$EXPNO= 14440
##$NAME= <ADRS>
##$PROCNO= 1
##$TYPE= <nmr>
##$USER= <dgb>
##$AMP= (0..31)
100 100 100 100 100 100 100 100 100 100 100 100 100 100 100 100 100 100 
100 100 100 100 100 100 100 100 100 100 100 100 100 100 
##$AQSEQ= 0
##$AQ_mod= 3
##$AUNM= <au_zg>
##$AUTOPOS= <28 >
##$BF1= 250.13
##$BF2= 250.13
##$BF3= 250.13
##$BF4= 250.13
##$BF5= 500.13
##$BF6= 500.13
##$BF7= 500.13
##$BF8= 500.13
##$BYTORDA= 1
##$CFDGTYP= 0
##$CFRGTYP= 5
##$CHEMSTR= <none>
##$CNST= (0..31)
1 1 145 1 1 1 1 1 1 1 1 1 1 1 1 1 1 1 1 1 1 1 1 1 1 1 1 1 1 1 1 1 
##$CPDPRG= <>
##$CPDPRG1= <>
##$CPDPRG2= <>
##$CPDPRG3= <>
##$CPDPRG4= <mlev>
##$CPDPRG5= <mlev>
##$CPDPRG6= <mlev>
##$CPDPRG7= <mlev>
##$CPDPRG8= <mlev>
##$CPDPRGB= <>
##$CPDPRGT= <>
##$D= (0..31)
0 1 0 0 0 0 0 0 0 0.06 0 0 0 0 0 0 0.0002 0 0 0 0 0 0 0 0 0 0 0 0 0 0 
0 
##$DATE= 1136901433
##$DBL= (0..7)
120 120 120 120 120 120 120 120 
##$DBP= (0..7)
150 150 150 150 150 150 150 150 
##$DBP07= 0
##$DBPNAM0= <>
##$DBPNAM1= <>
$$ [...]
##$SUBNAM6= <"">
##$SUBNAM7= <"">
##$SUBNAM8= <"">
##$SUBNAM9= <"">
##$SW= 20.6930455092707
##$SWIBOX= (0..15)
0 0 3 0 0 0 0 0 0 0 0 0 0 0 0 0 
##$SW_h= 5175.983436853
##$TD= 65536
##$TD0= 1
##$TE= 294.16
##$TE2= 300
##$TE3= 300
##$TEG= 300
##$TL= (0..7)
0 120 120 120 120 120 120 120 
##$TP= (0..7)
150 150 150 150 150 150 150 150 
##$TP07= 0
##$TPNAME0= <>
##$TPNAME1= <>
##$TPNAME2= <>
##$TPNAME3= <>
##$TPNAME4= <>
##$TPNAME5= <>
##$TPNAME6= <>
##$TPNAME7= <>
##$TPOAL= (0..7)
0.5 0.5 0.5 0.5 0.5 0.5 0.5 0.5 
##$TPOFFS= (0..7)
0 0 0 0 0 0 0 0 
##$TUNHIN= 0
##$TUNHOUT= 0
##$TUNXOUT= 0
##$USERA1= <user>
##$USERA2= <user>
##$USERA3= <user>
##$USERA4= <user>
##$USERA5= <user>
##$V9= 5
##$VALIST= <valist>
##$VCLIST= <CCCCCCCCCCCCCCC>
##$VD= 0
##$VDLIST= <DDDDDDDDDDDDDDD>
##$VPLIST= <PPPPPPPPPPPPPPP>
##$VTLIST= <TTTTTTTTTTTTTTT>
##$WBST= 1024
##$WBSW= 4
##$XGAIN= (0..3)
0 0 0 0 
##$XL= 0
##$YL= 0
##$YMAX_a= 613813
##$YMIN_a= -541226
##$ZGOPTNS= <>
##$ZL1= 120
##$ZL2= 120
##$ZL3= 120
##$ZL4= 120
##$ABSF1= 16.522
##$ABSF2= -4.171173
##$ABSG= 5
##$ABSL= 3
##$ALPHA= 0
##$AQORDER= 0
##$ASSFAC= 0
##$ASSFACI= 0
##$ASSFACX= 0
##$ASSWID= 0
##$AUNMP= <proc_1d>
##$AZFE= 0.1
##$AZFW= 0.1
##$BCFW= 0
##$BC_mod= 0
##$BYTORDP= 0
##$COROFFS= 0
##$CY= 12.5
##$DATMOD= 1
##$DC= 0
##$DFILT= <>
##$DTYPP= 0
##$F1P= 14.0000005364418
##$F2P= -0.99999901652339
##$FCOR= 0.5
##$FTSIZE= 32768
##$FT_mod= 6
##$GAMMA= 0
##$GB= 0
##$INTBC= 1
##$INTSCL= 1
##$ISEN= 128
##$LB= 0.3
##$LEV0= 0
##$LPBIN= 0
##$MAXI= 10000
##$MC2= 0
##$MEAN= 0
##$ME_mod= 0
##$MI= 0
##$NCOEF= 0
##$NC_proc= -3
##$NLEV= 6
##$NOISF1= 0
##$NOISF2= 0
##$NSP= 0
##$NTH_PI= 0
##$NZP= 0
##$OFFSET= 16.522
##$PC= 1
##$PHC0= 83.5228
##$PHC1= 3.810715
##$PH_mod= 1
##$PKNL= yes
##$PPARMOD= 0
##$PSCAL= 4
##$PSIGN= 0
##$REVERSE= no
##$SF= 250.13
##$SI= 32768
##$SIGF1= 0
##$SIGF2= 0
##$SINO= 400
##$SIOLD= 32768
##$SREGLST= <1H.CDCl3>
##$SSB= 0
##$STSI= 32768
##$STSR= 0
##$SW_p= 5175.98343685301
##$SYMM= 0
##$S_DEV= 0
##$TDeff= 65536
##$TDoff= 0
##$TI= <Analysis number 999999
Compound Code 99
Book Reference 9
Project Code 9>
##$TILT= no
##$TM1= 0
##$TM2= 0
##$TOPLEV= 0
##$USERP1= <user>
##$USERP2= <user>
##$USERP3= <user>
##$USERP4= <user>
##$USERP5= <user>
##$WDW= 1
##$XDIM= 32768
##$YMAX_p= 397240041
##$YMIN_p= -80918
$$ End of Bruker specific parameters
$$ ---------------------------------
##NTUPLES= NMR SPECTRUM
##VAR_NAME=  FREQUENCY,     SPECTRUM/REAL,   SPECTRUM/IMAG
##SYMBOL=    X,             R,               I
##VAR_TYPE=  INDEPENDENT,   DEPENDENT,       DEPENDENT
##VAR_FORM=  AFFN,          ASDF,            ASDF
##VAR_DIM=   32768,         32768,           32768
##UNITS=     HZ,            ARBITRARY UNITS, ARBITRARY UNITS
##FACTOR=    0.157963299565203, 1,           1
##FIRST=     4132.6476996994, 0,             0
##LAST=      -1043.33573715361, 0,           0
##MIN=       -1043.33573715361, -80918,      0
##MAX=       4132.6476996994, 397240041,     0
$$ Real data points
##PAGE= N=1
##DATA TABLE= (X++(R..R)), XYDATA
$$ [...]
##PAGE= N=2
##DATA TABLE= (X++(I..I)), XYDATA
15071G01713J1957J9128k346l698J1371J4439k5862R74J1903q80j304k479k524
$$ 701713 713670 732798 730452 726754 738125 752564 726702 727676 739579 738699 737395 734916 732392
15058G32392O092j5056K695N916j0515O299J1938o919k9907q38J0603J7696J3224
$$ 732392 738484 723428 726123 732039 721524 727823 739761 732842 702935 702097 712700 730396 743620
15045G43620J3780l506Q344j0161J7833J760M960j1780J625j3908o027L197l981
$$ 743620 757400 753894 762238 752077 769910 771670 776630 764850 766475 752567 746540 749737 745756
15032G45756P72Q788K2699m279j9589m779p369n568j04j244J3027J6951k940J0009
$$ 745756 746528 755316 778015 773736 754147 749368 741999 736431 736327 735083 748110 765061 762121 772130
15018G72130j277j2437J7478O238j3734l0099j5625L0451K0122q06j289j3377
$$ 772130 770853 758416 775894 782132 768398 738299 722674 753125 773247 772441 771152 757775
15006G57775k2438q382L623J7820J2836P819J7302K335p619k3543L852J7584J4031
$$ 757775 735337 726955 730578 748398 761234 769053 786355 788690 781071 757528 761380 778964 792995
14993G92995J8957K144j7431j7405K766O521Q80m401j441M46n79k651J1957J4962
$$ 792995 811952 814096 796665 779260 782026 788547 789427 785026 783585 784031 783452 780801 792758 807720
14979H07720j419j0118j1321K135J7253j2911P481J7169J1807j0021k284o529
$$ 807720 806301 796183 784862 786997 804250 791339 798820 815989 827796 817775 815491 808962
14967H08962j8422o863Q686K874n612q503q253l32J4921L6029K1892L85n523j7624
$$ 808962 790540 783677 792363 795237 789625 781122 772869 772537 787458 823487 845379 845764 840241 822617
14953H22617j988J638o765j4859N548K7190j9059N062j959j7199n917J9299K1225
$$ 822617 820629 822267 815502 800643 806191 833381 814322 819384 817425 800226 794309 813608 834833
14940H34833q178m904m862j786k3802J2014J0779Km900l198k4234n793J3679J3258
$$ 834833 826655 821751 816889 815103 791301 803315 814094 814096 809196 805998 781764 775971 789650 802908
14926H02908J0318K335m027J0606j6503R60Q724j861j359K9813Q42n637k0139
$$ 802908 813226 815561 811534 822140 805637 806597 815321 813460 812101 841914 842756 837119 816980
14913H16980p211L733j0220J047K0986O342o038j4076j5838M995K5409J3376j1798
$$ 816980 809769 813502 803282 804329 825315 831657 825619 811543 795705 800700 826109 839485 827687
14900H27687j0111Q440j1919J199p40j7579N75J5160P994j9563n616J0204L422
$$ 827687 817576 826016 814097 815296 814556 796977 797552 812712 820706 801143 795527 805731 809153
14887H09153J5138n984N67m511K697r565K3L756K3291m751p835O413m297j802
$$ 809153 824291 818307 818874 814363 817060 807495 807518 811274 834565 829814 821979 828392 824095 822293
14873H22293j2255p172O016l045Q681J5444P978o119j9090O109O684m52N334J9767
$$ 822293 810038 802866 808882 805837 814518 829962 837940 831821 812731 818840 825524 825072 830406 850173
14859H50173P485j6132j4024J1399J5218J5229P52P627J4479j5228j3856K898
$$ 850173 857658 841526 827502 838901 854119 869348 870100 877727 892206 876978 863122 866020
14847H66020l440r246M32J4327J9896J721j4343p635M655J0753J502J440m513
$$ 866020 862580 853334 853766 868093 887989 889710 875367 867732 872387 883140 884642 886082 881569
14834H81569j3632j178J9999m340j1418M870n453q212N409K614o771J8924J6364
$$ 881569 867937 866759 886758 882418 871000 875870 870417 862205 867614 870228 863457 882381 898745
14821H98745k751j246O29k754r671J2005l307J892Q326K0196J0967k7224j9914
$$ 898745 895994 894748 895377 892623 882952 894957 891650 893542 901868 922064 933031 905807 885893
14808H85893j1562M225M0372K095l481P104Q011J9073M205J0899k25r405j2179
$$ 885893 874331 878556 918928 921023 917542 924646 932657 951730 955935 966834 966609 957204 945025
14795I45025J8129J3415j1402P635J1901j9797p504J2393K299K9831L0451J7604
$$ 945025 963154 976569 965167 972802 984703 964906 957402 969795 972094 1001925 1032376 1049980
14783A049980J8396q745p242j9456l9356l0519l1513l9194m4883k6363m5214n6478
$$ 1049980 1068376 1059631 1052389 1032933 993577 963058 931545 892351 847468 821105 775891 719413
14771G19413l7880J823j683K282M118J3937R918K928q456O373J7097L3477J6458
$$ 719413 681533 683356 681673 683955 688073 702010 711928 714856 706400 712773 729870 763347 779805
14758G79805J504j5415j2477R036N003L564j5143k891L0374J2934R807Q810p24
$$ 779805 781309 765894 753417 762453 767456 771020 755877 752986 783360 796294 806101 814911 814187
14745H14187o8M90m028O626J4813o722k1709J9491J3100J3848K218k526M657M948
$$ 814187 814119 814609 810581 817207 832020 825298 803589 823080 836180 850028 852246 849720 854377 859325
14731H59325r431n829o899j349j8482o320j2832K4444m112q473P246K184j0705
$$ 859325 849894 844065 837166 835817 817335 811015 798183 822627 818515 810042 817288 819472 808767
14718H08767K0163R07J0184j29j2247m051j315L952j878K2969J9997J8247L481
$$ 808767 828930 829837 840021 839892 827645 823594 822279 826231 824353 847322 867319 885566 889047
14705H89047k335K009k112J275l779l779r439j1069J377m955P220R809r507n045
$$ 889047 886712 888721 886609 887884 884105 880326 870887 859818 861195 856240 863460 873269 863762 858717
14691H58717P981Q261R40p089J038J3657j2191R573o038Q058j0297K4231K4977
$$ 858717 866698 874959 875899 868810 869848 883505 871314 880887 874849 882907 872610 896841 921818
14678I21818Q890o715J0696J6567j986r717k3970P100l194J000K845j3240j5576
$$ 921818 930708 923993 934689 951256 949270 939553 915583 922683 919489 920489 923334 910094 894518
14665H94518J23J792J4917N633J7657N815m7668j852l373m490Q588M958Q353K0806
$$ 894518 894641 896433 911350 916983 934640 940455 892787 890935 887562 883072 891660 896618 904971 925777
14651I25777r809n494j608J960p647N670J253k691k570J428J1257Q301P98M277
$$ 925777 915968 910474 908866 910826 903179 908849 910102 907411 904841 906269 917526 925827 926625 930902
14637I30902m246J1635J1181n429L097k023l815J2731q057o703J1309N916j0210
$$ 930902 926656 938291 949472 944043 947140 945117 941302 954033 945976 939273 950582 956498 946288
14624I46288j2825J0692O048k475J362k4110k069o56q348N678J8432j035N926
$$ 946288 933463 944155 950203 947728 949090 924980 922911 922255 913907 919585 938017 936982 942908
14611I42908r588j6849J8024N565j9661j8330R612N731K945M812l250m617K434
$$ 942908 933320 916471 934495 940060 920399 902069 911681 917412 920357 925169 921919 917302 919736
14598I19736J5269o02Q400P807m238j5052p055L678j2466n443p793R998N446J9716
$$ 919736 935005 934403 942803 950610 946372 931320 924265 927943 915477 910034 902241 912239 917685 937401
14584I37401q19Q586r3K157O433J95M974q498K554p26j893M582J7101Q111o809
$$ 937401 936582 945168 945075 947232 953665 953860 958834 950336 952890 952164 950271 954853 971954 980065 973256
14569I73256K4198L552j1709l414K158j9775j2166O68k3466P375J6362l343k222
$$ 973256 997454 1001006 989297 985883 988041 968266 956100 956768 933302 940677 957039 953696 951474
14556I51474O063L150K960K3008L040q516j0192j7809J4362R743J3567n769o926
$$ 951474 957537 960687 963647 986655 989695 981179 970987 953178 967540 977283 990850 985081 978155
14543I78155J1955k79k017J0370k4096K313p793o952J1446j3941J870M383r728
$$ 978155 990110 989831 987814 998184 974088 976401 968608 961656 973102 959161 961031 965414 955686
14530I55686L677N664J2740M924M433K2892L995j5509p760j848J1901L344N321
$$ 955686 959363 965027 977767 982691 987124 1010016 1014011 998502 990742 988894 1000795 1004139 1009460
14517A009460N092m096j2001R09j4457J4K519J6532Q268j5766M810J0192j2284
$$ 1009460 1014552 1010456 998455 999364 984907 984921 987440 1003972 1012240 996474 1001284 1011476 999192
14504I99192M289J0931k391q498P321J8707q612j9466l759L984M766Q270R044
$$ 999192 1003481 1014412 1012021 1003523 1010844 1029551 1020939 1001473 997714 1001698 1006464 1014734 1023778
14491A023778M832L867j7580j9831j5035K3666K0873R89j8465pK7710j0810k2638
$$ 1023778 1028610 1032477 1014897 995066 980031 1003697 1024570 1025559 1007094 1007087 1034797 1023987 1001349
14478A001349j5073n148N394J9414J5013j2311N779J6895q62k1261Q017J0828
$$ 1001349 986276 981128 986522 1005936 1020949 1008638 1014417 1031312 1030450 1009189 1017206 1028034
14466A028034o63R334r673j4922l365n52J5583K2399o901l424n057O251M543j0215
$$ 1028034 1027371 1036705 1027032 1012110 1008745 1008193 1023776 1046175 1039274 1035850 1030793 1037044 1041587 1031372
14452A031372L514J344N266J0004m869p908j5217J874J6511n748L154k313p080
$$ 1031372 1034886 1036230 1041496 1051500 1046631 1038723 1023506 1025380 1041891 1036143 1039297 1036984 1029904
14439A029904j8199j4317R796l224K216J997k170J1101K2697R47k7744O160J6393
$$ 1029904 1011705 997388 1007184 1003960 1006176 1008173 1006003 1017104 1039801 1040748 1013004 1019164 1035557
14426A035557l715k6859j0515k225K7438Q559P417l142N490j925n789l780J406
$$ 1035557 1031842 1004983 994468 992243 1019681 1028240 1035657 1032515 1038005 1036080 1030291 1026511 1027917
14413A027917R436J640M474K1454q029n271J7366o175o626q118M481J3622J7762
$$ 1027917 1037353 1038993 1043467 1064921 1056892 1051621 1068987 1062812 1056186 1048068 1052549 1066171 1083933
14400A083933j1596j2557j3626J5785J7780N995q730r330p925m142J1635J4128
$$ 1083933 1072337 1059780 1046154 1061939 1079719 1085714 1076984 1067654 1059729 1055587 1067222 1081350
14388A081350L331j0058k418J5770j840k1102q169N864l320r611J2729K2184j4203
$$ 1081350 1084681 1074623 1072205 1087975 1086135 1065033 1056864 1062728 1059408 1049797 1062526 1084710 1070507
14375A070507K192r0p466p529j1252J9349L3901J5160J9561j3144k6483j0974
$$ 1070507 1072699 1072609 1065143 1057614 1046362 1065711 1099612 1114772 1134333 1121189 1094706 1083732
14363A083732o134M719J0617J2879L431j2321k1676M447P739L57N029O210l414
$$ 1083732 1077598 1082317 1092934 1105813 1109244 1096923 1075247 1079694 1087433 1087790 1092819 1099029 1095615
14350A095615q912Q029J0284j75J167j2076o569j2292l2K8812o456j2709M641
$$ 1095615 1086703 1094732 1105016 1104841 1106008 1093932 1087363 1075071 1075039 1103851 1097395 1084686 1089327
14337A089327R225o151P55M447j3711j919q092q670j60k611O890J4385J2415j24
$$ 1089327 1098552 1092401 1093156 1097603 1083892 1081973 1073881 1065211 1065051 1062440 1069330 1083715 1096130 1096006
14323A096006l86P533j4270l740N769o140j3374N502K8897l557o566N244K936
$$ 1096006 1095620 1103153 1088883 1085143 1090912 1084772 1071398 1076900 1105797 1102240 1095674 1100918 1103854
14310A103854K0878O332J155j659j5980Q89n433n12r407q166K10Q937N605j298
$$ 1103854 1124732 1131064 1132219 1130560 1114580 1115469 1110036 1109524 1100117 1091951 1092161 1101098 1106703 1105405
14296A105405j37K360R008J748O82k1099n27K1455K9018Q327k7956p224J549l044
$$ 1105405 1105268 1107628 1116636 1118384 1119066 1097967 1097440 1118895 1147913 1156240 1128284 1121060 1122609 1119565
14282A119565J2101J1771p826j013n621N466n199o703l732l576M949J5557J867
$$ 1119565 1131666 1143437 1135611 1134598 1128977 1134443 1129244 1122541 1118809 1115233 1120182 1135739 1137606
14269A137606j8299o735l483j3357Q520O197j540o291L472J6068J9989J56R57
$$ 1137606 1119307 1112572 1109089 1095732 1104252 1110449 1108909 1102618 1106090 1122158 1142147 1142303 1143260
14256A143260K1305j9483l1727m720j438K119J0319J2078R517l032L894l726P612
$$ 1143260 1164565 1145082 1113355 1108635 1107197 1109316 1119635 1131713 1141230 1138198 1142092 1138366 1145978
14243A145978J4864j7420m864L579j0706j2934K2477n962Q070J3162J8001R741
$$ 1145978 1160842 1143422 1138558 1142137 1131431 1118497 1140974 1135012 1143082 1156244 1174245 1183986
14231A183986j6890j5533k639q256q935N181p904k4548J7157J6998J7274J0882
$$ 1183986 1167096 1151563 1148924 1140668 1131733 1136914 1129010 1104462 1121619 1138617 1155891 1166773
14219A166773l057M065K543O47k5393k544r188J6031O467J0675l525j2300q787
$$ 1166773 1163716 1167781 1170324 1170971 1145578 1143034 1133846 1149877 1156344 1167019 1163494 1151194 1142407
14206A142407k825Q701l25P702J4575j7728p768K1088J7019J7479J5663j0174
$$ 1142407 1139582 1148283 1147958 1155660 1170235 1152507 1144739 1165827 1182846 1200325 1215988 1205814
14194A205814j1823j851M379j7311j0677P601J1632M219N517P287j4170k5833
$$ 1205814 1193991 1192140 1196519 1179208 1168531 1176132 1187764 1191983 1197500 1204787 1190617 1164784
14182A164784j1658n217L262R326O151L366J3365J4931J1252n723j0860m486p324
$$ 1164784 1153126 1147909 1151171 1160497 1166648 1170014 1183379 1198310 1209562 1203839 1192979 1188493 1181169
14169A181169M53J3319j0276P856M522O325j4574p022L110o615j894J7627K7162
$$ 1181169 1181622 1194941 1184665 1192521 1197043 1203368 1188794 1181772 1184882 1178267 1176373 1194000 1221162
14156A221162O206n423o227p364l078J6668R001P017q862k6685m529M928n81o300
$$ 1221162 1227368 1221945 1215718 1208354 1205276 1221944 1230945 1237962 1229100 1202415 1197886 1202814 1202233 1195933
14142A195933O84K1195j5953n651R19q693K7080K1485J2299j7438K057Q96n877
$$ 1195933 1196617 1217812 1201859 1196208 1197127 1188434 1215514 1236999 1249298 1231860 1233917 1234813 1228936
14129A228936j3488O08P053P779p582j4119n13L1148p967M471l005l586J0599
$$ 1228936 1215448 1216056 1223109 1230888 1223306 1209187 1208674 1239822 1231855 1236326 1233321 1229735 1240334
14116A240334k1913P477P997J2108K670M792n577m792j6978l68J4277R052n926
$$ 1240334 1218421 1225898 1233895 1246003 1248673 1253465 1247888 1243096 1226118 1225750 1240027 1249079 1243153
14103A243153j4572j0363j890J3696L538L549n873l375N834R301P651J60m059
$$ 1243153 1228581 1218218 1216328 1230024 1233562 1237111 1231238 1227863 1233697 1242998 1250649 1250809 1246750
14090A246750o972J4830J5263j4390N270J4863O853j7917p444M366m990j1592
$$ 1246750 1239778 1254608 1269871 1255481 1260751 1275614 1282467 1264550 1257106 1261472 1256482 1244890
14078A244890l173K1064J9384j5750k3649M860l737R252O498j2322l074P069J6465
$$ 1244890 1241717 1262781 1282165 1266415 1242766 1247626 1243889 1253141 1259639 1247317 1244243 1251312 1267777
14065A267777j3443o542J3863K3943J0260j2264k3914Q999K1838M205j3366j1946
$$ 1267777 1254334 1247792 1261655 1285598 1295858 1283594 1259680 1268679 1290517 1294722 1281356 1269410
14053A269410j0022k2311J8973J7303p851q494M381J2149J6621p212j6752k1384
$$ 1269410 1259388 1237077 1256050 1273353 1265502 1257008 1261389 1273538 1290159 1282947 1266195 1244811
14041A244811J0860M621j1246k303M983K7248N618K0181P420j2019k7945q953
$$ 1244811 1255671 1260292 1249046 1246743 1251726 1278974 1284592 1304773 1312193 1300174 1272229 1263276
14029A263276o094J4871J0543k933J3695N095N40k8096j2970p949Q236L5548J1050
$$ 1263276 1257182 1272053 1282596 1279663 1293358 1298453 1298993 1270897 1257927 1249978 1258214 1293762 1304812
14016A304812o071k1104j892M401L217R547k749Q768n782q735K44r812j0510l15
$$ 1304812 1298741 1277637 1275745 1280146 1283363 1292910 1290161 1298929 1293147 1284412 1284656 1274844 1264334 1264019
14002A264019k890J4002L2056Q077k5850j5478j2404J1543K3444J8274J4497l814
$$ 1264019 1261129 1275131 1307187 1315264 1289414 1273936 1261532 1273075 1296519 1314793 1329290 1325476
13990A325476M897j0979k9549K6394n110J410j3593j6538L938L5938J9784j2953
$$ 1325476 1330373 1319394 1289845 1316239 1311129 1312539 1298946 1282408 1286346 1322284 1342068 1329115
13978A329115n378k3955k958J0884l664j5344M03J52K06J0428M568k1165j3492
$$ 1329115 1323737 1299782 1296824 1307708 1304044 1288700 1289103 1289255 1289461 1299889 1304457 1283292 1269800
13965A269800J8722J8828j184J2803J1647O293l388L994K0083k27m370k234Q650
$$ 1269800 1288522 1307350 1306166 1318969 1330616 1336909 1333521 1337515 1357598 1357371 1353001 1350767 1359417
13952A359417j0658J135m345j5424j5569o430L7207J8333O619j0405k5008q238
$$ 1359417 1348759 1349894 1345549 1330125 1314556 1308126 1345333 1363666 1370285 1359880 1334872 1326634
13940A326634J6229K3950l078k4838j9257n550M106J5270j487j961j9133o07L2721
$$ 1326634 1342863 1366813 1363735 1338897 1319640 1314090 1318196 1333466 1331979 1330018 1310885 1310278 1342999
13927A342999J676k0853j6551N035J2537P902R682M148j2623p856j697K1419j729
$$ 1342999 1344675 1323822 1307271 1312306 1324843 1332745 1342427 1346575 1333952 1326096 1324399 1345818 1344089
13914A344089l802O931J4251J745o029n309l923L128J1057J1385J737K768M724
$$ 1344089 1340287 1347218 1361469 1363214 1357185 1351876 1347953 1351081 1362138 1373523 1375260 1378028 1382752
13901A382752o777J5567L675m248j7544k1133j243R955J2595J1422O750l709l353
$$ 1382752 1375975 1391542 1395217 1390969 1373425 1352292 1351049 1361004 1373599 1385021 1391771 1388062 1384709
13888A384709j4398k928P344k437r420J2682J4648P073M428J848k0073k4145j2871
$$ 1384709 1370311 1367383 1374727 1372290 1362870 1375552 1390200 1397273 1401701 1403549 1383476 1359331 1346460
13875A346460K125o088m68N603m156l927j880k0949n44J7948Q425M486J1864q012
$$ 1346460 1348585 1342497 1342029 1347632 1343476 1339549 1337669 1316720 1316176 1334124 1342549 1347035 1358899 1350887
13861A350887O406K1484M4685Q144l0035l6625k0630L393J1392P731J2657K1336
$$ 1350887 1357293 1378777 1423462 1431606 1401571 1364946 1344316 1347709 1359101 1366832 1379489 1400825
13849A400825J7600l949j963q44n68j7951n617k233N976K842k230R319J5326j1636
$$ 1400825 1418425 1414476 1412513 1411669 1411101 1393150 1387533 1385300 1391276 1394118 1391888 1401207 1416533 1404897
13835A404897K283J0928K336o08p470o495L983J1383J5586r637j0744r138J2777
$$ 1404897 1407180 1418108 1420444 1419836 1412366 1405871 1409854 1421237 1436823 1427186 1416442 1407304 1420081
13822A420081P711K04k907k3089j4748R080P484R097J4673k223n268j3161M439
$$ 1420081 1427792 1427996 1425089 1402000 1387252 1396332 1403816 1412913 1427586 1425363 1420095 1406934 1411373
13809A411373k5200p041K8218L843J2476N957q154j4194J807K8492J2426J3552
$$ 1411373 1386173 1379132 1407350 1411193 1423669 1429626 1421472 1407278 1409085 1437577 1450003 1463555
13797A463555l066Q760J1459K534j7242j7084j3738J9574j0783q958J7824J429
$$ 1463555 1460489 1469249 1480708 1483242 1466000 1448916 1435178 1454752 1443969 1435011 1452835 1454264
13785A454264M373O722J2155p979l3134j4051J5551K589j0849O704K695R637l315
$$ 1454264 1458637 1465359 1477514 1469535 1436401 1422350 1437901 1440490 1429641 1436345 1439040 1448677 1445362
13772A445362n227O540Q058m211j2506J5229J6141q738l494O994J2403J0139J7889
$$ 1445362 1440135 1446675 1454733 1450522 1438016 1453245 1469386 1460648 1457154 1464148 1476551 1486690 1504579
13759A504579j4164l4236J0600P748j1466l960R498P850P204O37j9352p442k417
$$ 1504579 1490415 1456179 1466779 1474527 1463061 1459101 1468599 1476449 1483653 1484290 1464938 1457496 1455079
13746A455079Q698J0395j1637o377r690P044P445O253k045o332O900K3678J6456
$$ 1455079 1463777 1474172 1462535 1456158 1446468 1453512 1460957 1467210 1465165 1458833 1465733 1489411 1505867
13733A505867q486l474L774l851k943L627N802P459P88j9687p047R774J6789R042
$$ 1505867 1497381 1493907 1497681 1493830 1490887 1494514 1500316 1507775 1508563 1488876 1481829 1491603 1508392 1517434
13719A517434Q673j0121j1885N054J0172l571Q55k340k3372j6444Q520J7405K4621
$$ 1517434 1526107 1515986 1504101 1509155 1519327 1515756 1516611 1514271 1490899 1474455 1482975 1500380 1525001
13706A525001K48O411N564n785j5032J997K2113K6271p272k0677k4800Q188J8897
$$ 1525001 1525249 1531660 1537224 1531439 1516407 1518404 1540517 1566788 1559516 1538839 1514039 1522227 1541124
13693A541124N195q972q091K485O782r611l558J8690M642M644j7747p679J7515
$$ 1541124 1546319 1537347 1529256 1531741 1538523 1528912 1525354 1544044 1548686 1553330 1535583 1527904 1545419
13680A545419L680J40j1380j2828l097O347r944O152J8542O452o251j6219J3127
$$ 1545419 1549099 1549239 1537859 1525031 1521934 1528281 1518337 1524489 1543031 1549483 1543232 1527013 1540140
13667A540140J5305O973N225q701j1000r918q547J3286O73j924R986J5064M447
$$ 1540140 1555445 1562418 1567643 1558942 1547942 1538024 1529477 1542763 1543436 1541512 1551498 1566562 1571009
13654A571009o00R213l939J1024nL598M724k728m873o88J362l470j8603j3556
$$ 1571009 1570409 1579622 1575683 1586707 1586702 1590300 1595024 1592296 1587423 1586735 1588097 1584627 1566024 1552468
13640A552468L623J758q452o82M579Q281M287K67K026O956R59l121O33q05L363
$$ 1552468 1556091 1557849 1549397 1548715 1553294 1561575 1565862 1566129 1568155 1575111 1576070 1572949 1573582 1572777 1576140
13625A576140J2093R795j6934l702J631l383n027L371L93o19J9072M307j1934
$$ 1576140 1588233 1598028 1581094 1577392 1579023 1575640 1570613 1573984 1574377 1573758 1592830 1597137 1585203
13612A585203m088N743j582J2154O563O505K678O94N842k7785j2460J3871n699
$$ 1585203 1581115 1586858 1585276 1597430 1603993 1610498 1613176 1613870 1619712 1591927 1579467 1593338 1587639
13599A587639M147K1167L86J375L627q979K328k509J0570j2709o242M23P120l204
$$ 1587639 1591786 1612953 1613339 1614714 1618341 1609362 1611690 1609181 1619751 1607042 1600800 1601223 1608343 1605139
13585A605139j9474j0858K7815J9636l133J624m264L647j2190j0089R708Q814
$$ 1605139 1585665 1574807 1602622 1622258 1619125 1620749 1616485 1620132 1607942 1597853 1607561 1616375
13573A616375M149R7M567L395q119M631J2479j85q491N393O118n34l035R623k0773
$$ 1616375 1620524 1620621 1625188 1628583 1620464 1625095 1637574 1637389 1628898 1634291 1640409 1639875 1636840 1646463 1625690
13558A625690k0383j3793J1590k474K3579Q894j0160J1164J5600P249J414l40
$$ 1625690 1605307 1591514 1603104 1600630 1624209 1633103 1622943 1634107 1649707 1656956 1658370 1658030
13546A658030j3977j0849l400L080K717J0121K4323R133k2093j1933j5015o144
$$ 1658030 1644053 1633204 1629804 1632884 1635601 1645722 1670045 1679178 1657085 1645152 1630137 1623993
13534A623993k528K201J1459K4880Q119p048k2083p357K0185O243k21J4010J473
$$ 1623993 1621465 1623666 1635125 1660005 1668124 1661076 1638993 1631636 1651821 1658064 1657843 1671853 1673326
13521A673326r411Q070j0815p130J4064J4835j3635j0967j186Q212j4065N831
$$ 1673326 1663915 1671985 1661170 1654040 1668104 1682939 1669304 1658337 1657151 1665363 1651298 1657129
13509A657129j1592k2666J5237L3532L3114R111j1979n472j8129J4970m348o338
$$ 1657129 1645537 1622871 1638108 1671640 1704754 1713865 1701886 1696414 1678285 1693255 1688907 1682569
13497A682569q043J2349L847n807q026K849L552M672l415J3645J3674j8362K958
$$ 1682569 1674526 1686875 1690722 1684915 1676889 1679738 1683290 1687962 1684547 1698192 1711866 1693504 1696462
13484A696462K3J5517j127J4474M825l932J2706k9046l344J1707n872J3001j1830
$$ 1696462 1696485 1712002 1710875 1725349 1730174 1726242 1738948 1709902 1706558 1718265 1712393 1725394 1713564
13471A713564o215K3481J0013k479j4518j5181J6182J589j2449Q774l438p489
$$ 1713564 1707349 1730830 1740843 1738364 1723846 1708665 1724847 1726436 1713987 1722761 1719323 1711834
13459A711834j0092p019J5340L1118O205L850J9019k2911q728L738N039p096N026
$$ 1711834 1701742 1694723 1710063 1741181 1747386 1751236 1770255 1747344 1738616 1742354 1747393 1740297 1745323
13446A745323J1298n392k111K026l745J1391O151K04l0958k2578n278P443J2916
$$ 1745323 1756621 1751229 1749118 1751144 1747399 1758790 1764941 1765145 1734187 1711609 1706331 1713774 1726690
13433A726690J1005j2975n894Q677J3716R18L993K50n519m94k698J3990K282r481
$$ 1726690 1737695 1724720 1718826 1727503 1741219 1742137 1746130 1746380 1740861 1740367 1737669 1751659 1753941 1744460
13419A744460j948m086K1172J2116O795j0942K909P537j964j1222O212J5026J5939
$$ 1744460 1742512 1738426 1759598 1771714 1778509 1767567 1770476 1778013 1776049 1764827 1771039 1786065 1802004
13406A802004l829j0568k1326j1479J2187N61j0564L578R26o307J3926J8974K357
$$ 1802004 1798175 1787607 1766281 1754802 1766989 1767550 1756986 1760564 1761490 1755183 1769109 1788083 1790440
13393A790440q901k4881j5038J4090J6690M184J4025L867j8051J3862M776r314
$$ 1790440 1781539 1756658 1741620 1755710 1772400 1776584 1790609 1794476 1776425 1790287 1795063 1785749
13381A785749l116J4461J5487o807j6479M41J792k515J2585K2534K151j7114J3545
$$ 1785749 1782633 1797094 1812581 1805774 1789295 1789736 1791528 1789013 1801598 1824132 1826283 1809169 1822714
13368A822714j262j1387Q139J4529L060K906o963j5279J6656J3499J4826J908
$$ 1822714 1821452 1810065 1818204 1832733 1835793 1838699 1831736 1816457 1833113 1846612 1861438 1863346
13356A863346j2464r886j8601j6610J6084J0441n393L454J0202n669L608Q599
$$ 1863346 1850882 1840996 1822395 1805785 1821869 1832310 1826917 1830371 1840573 1834904 1838512 1847111
13344A847111J1026o243R020m268O993m291j0625j5319o353J3079J8660K544j0771
$$ 1847111 1858137 1851894 1860914 1856646 1863639 1859348 1848723 1833404 1827051 1840130 1858790 1861334 1850563
13331A850563k0091O001J560Q049J6315J230J1060n912j3491J363O112Q497R453
$$ 1850563 1830472 1836473 1838033 1846082 1862397 1863627 1874687 1868775 1855284 1856647 1862759 1871256 1880709
13318A880709K168o752L24J9143m29j9167l40M767j915O158j37Q151O698j5626
$$ 1880709 1882877 1876125 1876449 1895592 1895163 1875996 1875656 1880423 1878508 1884666 1884529 1892680 1899378 1883752
13304A883752j0536L670J8800P340n765r626Q806K9383J1722j9041k7181N51J0039
$$ 1883752 1873216 1876886 1895686 1903026 1897261 1887635 1896441 1925824 1937546 1918505 1891324 1891875 1901914
13291A901914J5900j1421j230j4372M320J7531J1008j149L000j280j3576p288
$$ 1901914 1917814 1906393 1905163 1890791 1895111 1912642 1923650 1922501 1925501 1924221 1910645 1903357
13279A903357m77O73J6855K7492L575k5975j4081l8K105N916J7190j541N300j4041
$$ 1903357 1902880 1903553 1920408 1947900 1951475 1925500 1911419 1911381 1913486 1919402 1936592 1935051 1940351 1926310
13265A926310j3772r146n97K5069o509K450J1873l483J7109m273J1031l16k749
$$ 1926310 1912538 1903392 1902795 1927864 1921355 1923805 1935678 1932195 1949304 1945031 1956062 1955746 1952997
13252A952997Q47L276n597J7530q927p615R773p182N242L90k175L886N243M228
$$ 1952997 1953844 1957120 1951523 1969053 1960126 1952511 1962284 1955102 1960344 1960734 1958559 1962445 1967688 1971916
13238A971916M212J3369K0154J0761q151p554M648m336j2446q89M924R133j0473
$$ 1971916 1976128 1989497 2009651 2020412 2012261 2004707 2009355 2005019 1992573 1991684 1996608 2005741 1995268
13225A995268k4365q211K24j626N988P321l588j467k684j1235l936K5719L4685
$$ 1995268 1970903 1962692 1962916 1961290 1967278 1974599 1971011 1969544 1966860 1955625 1951689 1977408 2012093
13212B012093J394j2055j9719n834J2111J1694j029k235J2206n481K154o278J3069
$$ 2012093 2013487 2001432 1981713 1975879 1987990 1999684 1998655 1996420 2008626 2003145 2005299 1999021 2012090
13199B012090j139J4507J9002q237j0305j5220J5361K4079J1849j6010k1885J2617
$$ 2012090 2010951 2025458 2044460 2036223 2025918 2010698 2026059 2050138 2061987 2045977 2024092 2036709
13187B036709J3925j521o314j6504J1915O959J3520O243q772j0781k628j1661
$$ 2036709 2050634 2049113 2042799 2026295 2038210 2045169 2058689 2064932 2056160 2045379 2042751 2031090
13175B031090j0619L466J7112K2337O870n608k52K694K938R927q013j2666n418
$$ 2031090 2020471 2023937 2041049 2063386 2070256 2064648 2064396 2067090 2070028 2079955 2071942 2059276 2053858
13162B053858Q194k19M468o433K493R524J0758K32K202p04r171j3237N346K824
$$ 2053858 2062052 2061833 2066301 2059868 2062361 2071885 2082643 2082875 2085077 2084373 2075202 2061965 2067311 2070135
13148B070135J1432n490J0598M164K9842J6093j1357j3165r399j1069m503R361
$$ 2070135 2081567 2076077 2086675 2090839 2120681 2136774 2125417 2112252 2102853 2091784 2087281 2096642
13136B096642R931J5468M185k7506k0422j5228P272J2672R326N178Q893P207j235
$$ 2096642 2106573 2122041 2126226 2098720 2078298 2063070 2070342 2083014 2092340 2097518 2106411 2113618 2112383
13123B112383k44j932j1166o364l839K4836J7334l101O909k007p30j1777j15J0701
$$ 2112383 2112139 2110207 2099041 2092677 2088838 2113674 2131008 2127907 2134816 2132809 2132079 2120302 2120187 2130888
13109B130888j4270o227p63J0035J96j568R931k993l054j5639J0255j2583O714
$$ 2130888 2116618 2110391 2109628 2119663 2119859 2118291 2128222 2125229 2122175 2106536 2116791 2104208 2110922
13096B110922L0309J8994K0945Q139N013k1373l736n77o244N429o963j4179J7126
$$ 2110922 2141231 2160225 2181170 2189309 2194322 2172949 2169213 2168636 2162392 2167821 2160858 2146679 2163805
13083B163805J4355o538j300J5857J1832q655j627K419p162M559o27J1414J2821
$$ 2163805 2178160 2171622 2170322 2186179 2198011 2189356 2187729 2190148 2182986 2187545 2186918 2198332 2211153
13070B211153p302J6592J3015K047R057n140j612J131o686j3142p660k0949r235
$$ 2211153 2203851 2220443 2233458 2235505 2244562 2239422 2237810 2238941 2232255 2219113 2211453 2190504 2181269
13057B181269J8352N505O080P675o362q754j3702K5720J3352K3907J720k1544
$$ 2181269 2199621 2205126 2211206 2218881 2212519 2203765 2190063 2215783 2229135 2253042 2254762 2233218
13045B233218k1020J259K6089j758k2648K191L235P644Q797k17N014L982r363
$$ 2233218 2212198 2213457 2239546 2237788 2215140 2217331 2220566 2228210 2237007 2236790 2241804 2245786 2236423
13032B236423J2588J2757l9J0395p197m102l485O278J0502P490J7319o598j3892
$$ 2236423 2249011 2261768 2261729 2272124 2264927 2260825 2257340 2263618 2274120 2281610 2298929 2292331 2278439
13019B278439N838J3493n636j0355L938J5471P176m808m606J571j245p573J0305
$$ 2278439 2284277 2297770 2292134 2281779 2285717 2301188 2308364 2303556 2298950 2300521 2299276 2291703 2302008
13006B302008R167j1579P263J5013l220M34J874j2640k922l476K2879L649j5672
$$ 2302008 2311175 2299596 2306859 2321872 2318652 2319086 2320960 2308320 2305398 2301922 2324801 2328450 2312778
12993B312778j93K7340j3636j8236J3370J5910R855o115Q638J569J6088N951j9378
$$ 2312778 2312585 2339925 2326289 2308053 2321423 2337333 2347188 2341073 2349711 2351280 2367368 2373319 2353941
12980B353941l380k106m690j0988N174J2553J8696n481J1130j4674o409J0514
$$ 2353941 2350561 2348455 2343765 2332777 2337951 2350504 2369200 2363719 2374849 2360175 2353766 2364280
12968B364280K570K6121K6967O718l1843j1620k568o605j286R911K339n875J6570
$$ 2364280 2366850 2392971 2419938 2426656 2394813 2383193 2380625 2374020 2372734 2382645 2384984 2379109 2395679
12955B395679M326n612o479p761q452J4297O116J8123J772j5007L160O767j0508
$$ 2395679 2400005 2394393 2387914 2380153 2371701 2385998 2392114 2410237 2412009 2397002 2400162 2406929 2396421
12942B396421P890R07O750j3300k1748R296K5207K0994O66j2203Q225N940j5487
$$ 2396421 2404311 2405218 2411968 2398668 2376920 2386216 2411423 2432417 2433083 2420880 2429105 2435045 2419558
12929B419558L398M248K7416q926j7768L365J7204n579J0302K0486N966j6630
$$ 2419558 2422956 2427204 2454620 2445694 2427926 2431291 2448495 2442916 2453218 2473704 2479670 2463040
12917B463040k1964K7366J0419j7365o728M503O172P059J035o152M856J2949R310
$$ 2463040 2441076 2468442 2478861 2461496 2454768 2459271 2465443 2472502 2473537 2467385 2472241 2485190 2494500
12904B494500k683M61o559J1774R912J0534J5382k106r074O83N173r355M865m784
$$ 2494500 2491817 2492278 2485719 2497493 2507405 2517939 2533321 2531215 2522141 2522824 2527997 2518642 2523507 2518723
12890B518723j9901j4704J8663L9906m230n116j4824l959R832l907K1985J8958
$$ 2518723 2498822 2484118 2502781 2542687 2538457 2533341 2518517 2514558 2524390 2520483 2542468 2561426
12878B561426k72j818j0478J5453K1494j1700j8922Q536j7129r524L4129K139
$$ 2561426 2561154 2559336 2548858 2564311 2585805 2574105 2555183 2563719 2546590 2537066 2571195 2573334
12866B573334j1970L810O571J6764J1862R376J3180m046j7213k8265j7998P888
$$ 2573334 2561364 2565174 2571745 2588509 2600371 2609747 2622927 2618881 2601668 2573403 2555405 2563293
12854B563293J3057N128K9548P483L412n604J0016k46Q15J378K0382N066O07l325
$$ 2563293 2576350 2581478 2611026 2618509 2621921 2616317 2626333 2626087 2626902 2628280 2648662 2653728 2654335 2651010
12840B651010j5865j0780j854K4460J3261L798R757j2425k7696q663J5506J3866
$$ 2651010 2635145 2624365 2622511 2646971 2660232 2664030 2673787 2661362 2633666 2625003 2640509 2654375
12828B654375n897J2651L388n838j0328j3639J0883K4758j8898p146o388j2174
$$ 2654375 2648478 2661129 2664517 2658679 2648351 2634712 2645595 2670353 2651455 2644309 2637921 2625747
12816B625747l48K651O048P891K594J6936J2525K805n716J730O965M508P888K5732
$$ 2625747 2625399 2628050 2634098 2641989 2644583 2661519 2674044 2676849 2671133 2672863 2679828 2684336 2692224 2717956
12802B717956J6094m271o350j8026Q229J6780l544J0551l975N998K433j0614q787
$$ 2717956 2734050 2729779 2723429 2705403 2713632 2730412 2726868 2737419 2733444 2739442 2741875 2731261 2722474
12789B722474Q916J0105P343r073o910J0501R916J6183j5848O950J1342J493P027
$$ 2722474 2731390 2741495 2748838 2739765 2732855 2743356 2753272 2769455 2753607 2760557 2771899 2773392 2780419
12776B780419L051j0090j1224o296j3392L386J2856o425j7073N590L468N897k023
$$ 2780419 2783470 2773380 2762156 2755860 2742468 2745854 2758710 2752285 2735212 2740802 2744270 2750167 2748144
12763B748144M646L61j0428J1190R421N985P140j0669P503K1211J7584p517k7919
$$ 2748144 2752790 2753151 2742723 2753913 2763334 2769319 2776459 2765790 2773293 2794504 2812088 2804571 2776652
12750B776652J5458R669R576m954o368K9100P247k2276Q083P869m3k350l569L44
$$ 2776652 2792110 2801779 2811355 2806401 2800033 2829133 2836380 2814104 2822187 2830056 2830013 2827663 2824094 2824438
12736B824438j034J924J0258q594J0983K9963J3460r128r781j7678j0944p30n93
$$ 2824438 2823404 2825328 2835586 2826992 2837975 2867938 2881398 2872270 2862489 2844811 2833867 2833137 2832544
12723B832544J1793K973P121p571K0322Q758J3255R476R582j8404k6012J7230
$$ 2832544 2844337 2847310 2854431 2846860 2867182 2875940 2889195 2898671 2908253 2889849 2863837 2881067
12711B881067J9930P375k1195K6421J6750j4030J044J2465Q252k0155k417q227
$$ 2881067 2900997 2908372 2887177 2913598 2930348 2916318 2917362 2929827 2938079 2917924 2915507 2907280
12699B907280m907J5526L1139J3830K2847j8960l0575m149J1705M72r306M036
$$ 2907280 2902373 2917899 2949038 2962868 2985715 2966755 2936180 2932031 2943736 2944208 2934902 2938938
12687B938938J6777K2625q374M495m513P743P770M945p852n565J2552M960L006
$$ 2938938 2955715 2978340 2969966 2974461 2969948 2977691 2985461 2990406 2982554 2976989 2989541 2994501 2997507
12674B997507N917K4006L7380L040j5813p346l001j2604k417J8782K8153j0763
$$ 2997507 3003424 3027430 3064810 3067850 3052037 3044691 3041690 3029086 3026669 3045451 3073604 3062841
12662C062841k3124R640L2709J3659j2012O656P662J8943n949P77l971J071P014
$$ 3062841 3039717 3049357 3082066 3095725 3083713 3090369 3098031 3116974 3111025 3111802 3107831 3108902 3115916
12649C115916J1004K0993P830r443j217J3630J2795k659p135J6626R918k4423
$$ 3115916 3126920 3147913 3155743 3146300 3145083 3158713 3171508 3168849 3161714 3178340 3188258 3163835
12637C163835n478N664j2154l600J9780R286K5271L184L587j589K339N924j2763
$$ 3163835 3158357 3164021 3151867 3148267 3168047 3177333 3202604 3205788 3209375 3207786 3210125 3216049 3203286
12624C203286m960m468q638J0320P759L708N909j517n495Q900J1260q276R775
$$ 3203286 3198326 3193858 3185220 3195540 3203299 3207007 3212916 3211399 3205904 3214804 3226064 3217788 3227563
12611C227563J7804o059j1358p544N044K5218J5778j6083M461n05J3688J6473
$$ 3227563 3245367 3239308 3227950 3220406 3225450 3250668 3266446 3250363 3254824 3254319 3268007 3284480
12599C284480P160o825q873m100k875M776r57O355L3040J9682m918J2855J9524
$$ 3284480 3291640 3284815 3275942 3271842 3268967 3273743 3272786 3279141 3312181 3331863 3326945 3339800 3359324
12586C359324j497q556r413L351O042j532q668J1469L6061n206j8454J0420J7365
$$ 3359324 3357827 3349271 3339858 3343209 3349251 3347719 3339051 3350520 3386581 3381375 3362921 3373341 3390706
12573C390706N974P146p984L055Q466J2570J5684J0750j477p955p459o107J1376
$$ 3390706 3396680 3403826 3395842 3398897 3407363 3419933 3435617 3446367 3444890 3436935 3429476 3423369 3434745
12560C434745Q753J8076R49Q619K20j3675j1837J5194O25Q214Q687P170J1297
$$ 3434745 3443498 3461574 3462523 3471142 3471362 3457687 3445850 3461044 3461669 3469883 3478570 3485740 3497037
12547C497037l191M421J7604j595l0391j0165J2484P695K5510M2371L936q904
$$ 3497037 3493846 3498267 3515871 3514276 3483885 3473720 3486204 3493899 3519409 3561780 3565716 3556812
12535C556812k633Q506P387j2127l101Q307J1507M83P220K0918Q036r742J2505
$$ 3556812 3554179 3562685 3570072 3557945 3554844 3563151 3574658 3575141 3582361 3603279 3611315 3601573 3614078
12522C614078j1212N332j52L625O944n376o685Q019K9823J6539K1497N46J7R135
$$ 3614078 3602866 3608198 3608046 3611671 3618615 3613239 3606554 3614573 3644396 3660935 3682432 3682978 3682995 3692130
12508C692130J9793k653L21J5947P467R84P034O002R744K3642J3873L938M906
$$ 3692130 3711923 3709270 3709591 3725538 3733005 3733989 3741023 3747025 3756769 3780411 3794284 3798222 3803128
12495C803128J0791J9003J898K5619L8100K6902J2990K129l267O308J1097K345
$$ 3803128 3813919 3832922 3834820 3860439 3898539 3925441 3938431 3940560 3937293 3943601 3954698 3957043
12483C957043o095R60J9377K2015J3984J9425J2234K8200L9690L7575M6759L9529
$$ 3957043 3950948 3951908 3971285 3993300 4007284 4026709 4038943 4067143 4106833 4144408 4191167 4230696
12471D230696K1893J3929k0961l1513o5625q8758p7519q0256j33414j32467j04429
$$ 4230696 4252589 4266518 4245557 4214044 4148419 4059661 3982142 3901886 3768472 3636005 3531576
12460C531576p1040l9266j149Q269J8857K5825M8058N6180L6245J7318L256O341
$$ 3531576 3460536 3421270 3420121 3428390 3447247 3473072 3521130 3577310 3613555 3630873 3634129 3640470
12448C640470L1999L3004K3974J5743M932K1384J4604N975J9366M0301K2346M406
$$ 3640470 3672469 3705473 3729447 3745190 3750122 3771506 3786110 3792085 3811451 3851752 3874098 3878504
12436C878504K0680q179J5982K5148o827O091J9568K5213K4124l537k750Q491
$$ 3878504 3899184 3891005 3906987 3932135 3925308 3931399 3950967 3976180 4000304 3996767 3994017 4002508
12424D002508K399l891K3494J8039J1512J4890J5648O306o704O48J5646K0994
$$ 4002508 4004907 4001016 4024510 4042549 4054061 4068951 4084599 4090905 4084201 4084849 4100495 4121489
12412D121489j0799K4542K1978J673M557J7234P120l508m608J1847L2855N833
$$ 4121489 4110690 4135232 4157210 4158883 4163440 4180674 4187794 4184286 4179678 4191525 4224380 4230213
12400D230213l6n354k978P535K9647K1752P014J673J7368K944n254J0247J0664
$$ 4230213 4230177 4224823 4221845 4229380 4259027 4280779 4287793 4289466 4306834 4309778 4304524 4314771 4325435
12387D325435J3860Q975q070J8092J8870K0875J8067M832n017L353o847J2269
$$ 4325435 4339295 4348270 4340200 4358292 4377162 4398037 4416104 4420936 4415919 4419272 4412425 4424694
12375D424694K4847J1863K0385j523J636q169Q613J6465R982K798j8745L4252
$$ 4424694 4449541 4461404 4481789 4480266 4481902 4473733 4482346 4498811 4508793 4511591 4492846 4527098
12363D527098L2393J5432Q438J8364K4231J29J2979K6793P259Q619N065P588J0715
$$ 4527098 4559491 4574923 4583361 4601725 4625956 4626085 4639064 4665857 4673116 4681735 4686800 4694388 4705103
12350D705103K0419K8249K1964L0582n351j8425J5982L2843K7751M442N99j7059
$$ 4705103 4725522 4753771 4775735 4806317 4800966 4782541 4798523 4831366 4859117 4863559 4864158 4847099
12338D847099j4530K4941M4709N204j693J6314P858J0052J6265L5415J9272j1471
$$ 4847099 4832569 4857510 4902219 4907423 4905730 4922044 4929902 4939954 4956219 4991634 5010906 4999435
12326D999435l296J0227L6749L6013L7097J0001J1537J6354L5250J9824N472J9197
$$ 4999435 4996139 5006366 5043115 5079128 5116225 5126226 5137763 5154117 5189367 5209191 5214663 5233860
12314E233860J8757J4184K2088J0912L674J8891Q135k1764J0329K1254K474n409
$$ 5233860 5252617 5266801 5288889 5299801 5303475 5322366 5330501 5308737 5319066 5340320 5342794 5337385
12302E337385k47r159Q007J9358L2585n231J2069J5449k9625k9836j2834l7706
$$ 5337385 5337138 5327979 5335986 5355344 5387929 5382698 5394767 5410216 5380591 5350755 5337921 5300215
12290E300215m0370l6229k7631k6061j0806J4702J7393J9934L4345L3911K0964
$$ 5300215 5259845 5223616 5195985 5169924 5159118 5173820 5191213 5211147 5245492 5279403 5300367
12279E300367J2683K7343K7441M3442K5514J2620K8852L0876K9057K3074K5716
$$ 5300367 5313050 5340393 5367834 5411276 5436790 5449410 5478262 5509138 5538195 5561269 5586985
12268E586985J4717K6766J9925M1614M4619L2668L6336J7432L1560L5862J8944
$$ 5586985 5601702 5628468 5648393 5690007 5734626 5767294 5803630 5821062 5852622 5888484 5907428
12257E907428Q412J0548L570l3590l3847j3550k180M300Q412K275K1992J2567
$$ 5907428 5915840 5926388 5929958 5896368 5862521 5848971 5846791 5851091 5859503 5861778 5883770 5896337
12245E896337L0326O3497M5501M6948L2282J2842J6931K7321L6950L9998K3055
$$ 5896337 5926663 5990160 6035661 6082609 6114891 6127733 6144664 6171985 6208935 6248933 6271988
12234F271988K7326L6164K4769J3245K9979J1649J0090K9436K7551J8064M9071
$$ 6271988 6299314 6335478 6360247 6373492 6403471 6415120 6425210 6454646 6482197 6500261 6549332
12223F549332L7441K2204K4257J0447K4828O1731M1425J1718J7688L2487M4216
$$ 6549332 6586773 6608977 6633234 6643681 6668509 6730240 6771665 6783383 6801071 6833558 6877774
12212F877774M1388J3301K9595L8274M5159N7698K2064K4466L2938L8072L4881
$$ 6877774 6919162 6932463 6962058 7000332 7045491 7103189 7125253 7149719 7182657 7220729 7255610
12201G255610J5338K5300M6391L0787M3719N0824M4849M5577M1674L2616L9565
$$ 7255610 7270948 7296248 7342639 7373426 7417145 7467969 7512818 7558395 7600069 7632685 7672250
12190G672250M9305M5254M6896M2463N3470L9914M7065M1658O4232O6922O5405
$$ 7672250 7721555 7766809 7813705 7856168 7909638 7949552 7996617 8038275 8102507 8169429 8234834
12179H234834N4642N8345L9774L0084M3548N8054N1303O3715M9156J4346M5264
$$ 8234834 8289476 8347821 8387595 8417679 8461227 8519281 8570584 8634299 8683455 8697801 8743065
12168H743065K5172L2004N1178N3335O3575P2759O4487O0009O6632P3272M9023
$$ 8743065 8768237 8800241 8851419 8904754 8968329 9041088 9105575 9165584 9232216 9305488 9354511
12157I354511P0686P1658P1882P1542N8700Q4574P8971P9139O6115P7056Q1353
$$ 9354511 9425197 9496855 9568737 9640279 9698979 9783553 9862524 9941663 10007778 10084834 10166187
12146A0166187P2045Q6072Q8942Q7650J04974R8526J04721R0662J10163Q9804
$$ 10166187 10238232 10324304 10413246 10500896 10605870 10704396 10809117 10899779 11009942 11099746
12136A1099746J07357J17243J19004R2055R6388J14458J32292J13877J13809J14607
$$ 11099746 11207103 11324346 11443350 11535405 11631793 11746251 11878543 11992420 12106229 12220836
12126A2220836J14323J23269J31173J66016J35352J04952J44502J48716J67977
$$ 12220836 12335159 12458428 12589601 12755617 12890969 12995921 13140423 13289139 13457116
12117A3457116J53759J64231J89652K17673J92163K03806K10379J92235K16793
$$ 13457116 13610875 13775106 13964758 14182431 14374594 14578400 14788779 14981014 15197807
12108A5197807K11429K23837K57289K47535K44504K43699K58351L03383L11261
$$ 15197807 15409236 15633073 15890362 16137897 16382401 16626100 16884451 17187834 17499095
12099A7499095L04255L22231L26873L31156K97278K76411K85174L14466L03469
$$ 17499095 17803350 18125581 18452454 18783610 19080888 19357299 19642473 19956939 20260408
12090B0260408L12286L83004M34763M80392N06029N38932N78552O21908O71527
$$ 20260408 20572694 20955698 21390461 21870853 22376882 22915814 23494366 24116274 24787801
12081B4787801P21918P29907P67480Q29505Q65520R27454R89560J076288J165885
$$ 24787801 25509719 26239626 27007106 27836611 28702131 29629585 30619145 31695433 32861318
12072C2861318J288793J383827J518731J662468J764348J813748J890589K005389
$$ 32861318 34150111 35533938 37052669 38715137 40479485 42293233 44183822 46189211
12064D6189211K082812K183194K393545K762753L232595L861156M688944N681094
$$ 46189211 48272023 50455217 52848762 55611515 58844110 62705266 67394210 73075304
12056G3075304O576141O859481N569866K612081r00536n245995j1122355j7786901
$$ 73075304 79651445 86510926 92080792 94692873 93792337 88546342 77423987 59637086
12048E9637086k2598750k5027599k5936832k5357695k2193121j6373121j0213601
$$ 59637086 37038336 12010737 -13926095 -39283790 -61476911 -77850032 -88063633
12041h8063633m940424l77799L693270O295499P228770O998005O134026N120658
$$ -88063633 -93004057 -93381856 -89688586 -83393087 -76164317 -69166312 -63032286 -57911628
12033e7911628M216841L481269K892963K504661K229555K066482J936117J851444
$$ -57911628 -53694787 -50213518 -47320555 -44815894 -42586339 -40519857 -38583740 -36732296
12025c6732296J764940J684697J611699J529340J394683J266724J180439J097490
$$ -36732296 -34967356 -33282659 -31670960 -30141620 -28746937 -27480213 -26299774 -25202284
12017b5202284R92449R00084Q46722Q32497P71502P25884O87600O31709O12300
$$ -25202284 -24209835 -23309751 -22463029 -21630532 -20859030 -20133146 -19445546 -18813837 -18201537
12008a8201537N76938N32938N12387M78883M38550M42268M03365L95439L76211
$$ -18201537 -17624599 -17091661 -16579274 -16100391 -15661841 -15219573 -14816208 -14420769 -14044558
11999a4044558L40543L37255L24039L16157L01434K87647K75188K68663K42397
$$ -14044558 -13704015 -13366760 -13042721 -12726564 -12425130 -12137483 -11862295 -11593632 -11351235
11990a1351235K17192J98933J77835J53206J38135J43462J50909J63928J85723
$$ -11351235 -11134043 -10935110 -10757275 -10604069 -10465934 -10322472 -10171563 -10007635 -9821912
11981i821912J76948J81729J79035J75383J64136J77298J69901J66472J36034
$$ -9821912 -9644964 -9463235 -9284200 -9108817 -8944681 -8767383 -8597482 -8431010 -8294976
11972h294976J54051J79858J59555J49786J30168J38803J42961J35029J40420
$$ -8294976 -8140925 -7961067 -7801512 -7651726 -7521558 -7382755 -7239794 -7104765 -6964345
11963f964345J26895J09535J27295J12556J01573R9316R5292R2637R3405J03159
$$ -6964345 -6837450 -6727915 -6600620 -6488064 -6386491 -6287175 -6191883 -6099246 -6005841 -5902682
11953e902682J01448R1450Q4446Q8693Q0900J03510R2581R7421Q1927P0328N7018
$$ -5902682 -5801234 -5709784 -5625338 -5536645 -5455745 -5352235 -5259654 -5162233 -5080306 -5009978 -4952960
11942d952960O2451Q0927Q1291O5035N6225P7118R2674O8979N2823O4746P1679
$$ -4952960 -4890509 -4809582 -4728291 -4663256 -4607031 -4529913 -4437239 -4368260 -4315437 -4250691 -4179012
11931d179012M3351M6470P5237Q0744O4830L9041M1633N3108N3816O8013R0349
$$ -4179012 -4135661 -4089191 -4013954 -3933210 -3868380 -3829339 -3787706 -3734598 -3680782 -3612769 -3522420
11920c522420P7542O9560N1905M2397N2900M5258L1657K4815L2348N7148L7263
$$ -3522420 -3444878 -3375318 -3323413 -3281016 -3228116 -3182858 -3151201 -3126386 -3094038 -3036890 -2999627
11909b999627M9734M3920K7599L1119O5160K7238L7027O2159M2339L1425J8672
$$ -2999627 -2949893 -2905973 -2878374 -2847255 -2782095 -2754857 -2717830 -2655671 -2613332 -2581907 -2563235
11898b563235J7240L7796N1387M0745N9725O0069J1621K6561L3355L7289L3355
$$ -2563235 -2545995 -2508199 -2456812 -2416067 -2356342 -2296273 -2284652 -2258091 -2224736 -2187447 -2154092
11887b154092M3813L8387K2561J8970L0935L6875K5462L4723L2109K9653M6878
$$ -2154092 -2110279 -2071892 -2049331 -2030361 -1999426 -1962551 -1937089 -1902366 -1870257 -1840604 -1793726
11876a793726K7968K0803K329K1028N0611M7045L4116L5854L4125L1831K8184
$$ -1793726 -1765758 -1744955 -1742626 -1721598 -1670987 -1623942 -1589826 -1553972 -1519847 -1488016 -1459832
11865a459832K0520J6670J6582K3653L8758K9531K9481L4382L2950K9063N678
$$ -1459832 -1439312 -1422642 -1406060 -1382407 -1343649 -1314118 -1284637 -1250255 -1217305 -1188242 -1182564
11854a182564K5157K3820O802O369K5689P519J3624L6941K5832K5285Q383J8833
$$ -1182564 -1157407 -1133587 -1126785 -1120416 -1094727 -1087208 -1073584 -1036643 -1010811 -985526 -977143 -958310
11842i58310M5608L7521J7019L6601L7792J3881j0538j1321R032K9472K1409K6793
$$ -958310 -912702 -875181 -858162 -821561 -783769 -769888 -780426 -791747 -782715 -753243 -731834 -705041
11830g05041P26J2545K3716O401J6515J3547P42L2424K8911K6832O211K8624L6208
$$ -705041 -704315 -691770 -668054 -661653 -645138 -631591 -630849 -598425 -569514 -542682 -536471 -507847 -471639
11817d71639J9553J8698J6706K5721J7156J0742J4774J1572J2473L0998K2948
$$ -471639 -452086 -433388 -416682 -390961 -373805 -363063 -348289 -336717 -324244 -293246 -270298
11806b70298K734l052Q660L2478K9972J0056R323J2412J1715J3627L3589K9177
$$ -270298 -267564 -270616 -261956 -229478 -199506 -189450 -180127 -167715 -156000 -142373 -108784 -79607
11794g9607J5735k069J0664J8567N815p948r335J0592K6070K0923J2556J8604
$$ -79607 -63872 -65941 -55277 -36710 -30895 -38843 -48178 -37586 -11516 9407 21963 40567
11782D0567K0447J8241K0199k260J4161K2795J8796K0606K3158K0501N678P903
$$ 40567 61014 79255 99454 97194 111355 134150 152946 173552 196710 217211 222889 230792
11770B30792K6466Q779l42Q197K0703J2760m240J8664J6423J7514K0933J7524
$$ 230792 257258 266037 265695 273892 294595 307355 303115 321779 338202 355716 376649 394173
11758C94173K572J0300K2228J3050O104K3979L4927J57J7552R167m086K1679L5197
$$ 394173 396745 407045 429273 442323 448427 472406 507333 507490 525042 534209 530123 551802 586999
11745E86999J9597J3790n997m792q624j578o207K7299J1345m675n753O644K1667
$$ 586999 606596 620386 614389 609597 600973 599395 593188 620487 631832 627157 621404 628048 649715
11732F49715J2251L6587K1531L812j821Q765M320J0470K5948J8852R080j861R058
$$ 649715 661966 698553 720084 723896 722075 730840 735160 745630 771578 790430 799510 797649 806707
11719H06707J3426O095Q351J7638R67k4Q174Q639J6693L958J6364K9845K6199
$$ 806707 820133 826228 834579 852217 853184 853160 861334 869973 886666 890624 906988 936833 963032
11706I63032J3387P90o440m042J4294K0234J1463k395K934K7987J7990J5837K1045
$$ 963032 976419 977209 970769 966727 981021 1001255 1012718 1010323 1013257 1041244 1059234 1075071 1096116
11693A096116J8914O600J4914J2332M089R978L517J050R730J9581L1338n229j507
$$ 1096116 1115030 1121630 1136544 1148876 1152965 1162943 1166460 1167510 1177240 1196821 1228159 1222930 1221423
11680A221423J0040J9124N723J2008m739J7883J1243M615J3794K2466J4687j601
$$ 1221423 1231463 1250587 1256310 1268318 1263579 1281462 1292705 1297320 1311114 1333580 1348267 1346666
11668A346666Q748K664J016J1380M189K7700M0534K0559L220J8486J5798k099
$$ 1346666 1355414 1358078 1359094 1370474 1374663 1402363 1442897 1463456 1466676 1485162 1500960 1498861
11656A498861m123J6219K0041J2566J5623N104J4234K0502R217J6758J5436J6494
$$ 1498861 1494738 1510957 1530998 1543564 1559187 1564291 1578525 1599027 1608244 1625002 1640438 1656932
11644A656932R209R002L1032M4372J7507p10J5761L1370L8429K5012M0294K8717
$$ 1656932 1666141 1675143 1706175 1750547 1768054 1767344 1783105 1814475 1852904 1877916 1918210 1946927
11632A946927K3686J9598K4231K3770j4848n8345o5073q0802r8781j01093j03149
$$ 1946927 1970613 1990211 2014442 2038212 2023364 1965019 1899946 1819144 1720363 1619270 1516121
11621A516121r6835q9590r5318l8547K417K1675K9416L8709M6754M3425L2113
$$ 1516121 1419286 1329696 1234378 1195831 1198248 1219923 1249339 1288048 1334802 1378227 1410340
11610A410340M077J0615K9567L2271N3538L8712K0028M110l91M33K1001J1767
$$ 1410340 1414417 1425032 1454599 1486870 1540408 1579120 1599148 1603258 1602867 1603300 1624301 1636068
11598A636068K2147M704J6765J1791m409K6100K3943J7656P76N618Q380J525N293
$$ 1636068 1658215 1662919 1679684 1691475 1687066 1713166 1737109 1754765 1755541 1761159 1769539 1771064 1776357
11585A776357O65N488l623J7616J8221m616K185K2481K1832J5931J2810J9302
$$ 1776357 1777022 1782510 1778887 1796503 1814724 1810108 1812293 1834774 1856606 1872537 1885347 1904649
11573A904649K9620J3694P805q80j1034p024J9265J6557k513J4055L5434R623
$$ 1904649 1934269 1947963 1955768 1954888 1943854 1936830 1956095 1972652 1970139 1984194 2019628 2029251
11561B029251K5231K6444Q969o23k0899K137K765J1828L6374J776o202j6883J37
$$ 2029251 2054482 2080926 2089895 2089272 2068373 2070510 2073275 2085103 2121477 2123253 2117051 2100168 2100305
11548B100305J7031J6920O585K0359M699Q110P742p842o71L413o690p635J7898
$$ 2100305 2117336 2134256 2140841 2161200 2165899 2174009 2181751 2173909 2173238 2176651 2169961 2162326 2180224
11535B180224L65O281J3955M514J342O41J3299K0676J3720J6815K0597K0928j203
$$ 2180224 2180589 2186870 2200825 2205339 2206681 2207322 2220621 2241297 2255017 2271832 2292429 2313357 2312154
11522B312154o693O516J1252M888O194M035j0840n971j615N373J4907J9169J5602
$$ 2312154 2305461 2311977 2323229 2328117 2334311 2338346 2327506 2321535 2319920 2325293 2340200 2359369 2374971
11509B374971J9095O441k722K4570K8042J4396j0028j8752K0455K9759K5483l790
$$ 2374971 2394066 2400507 2397785 2422355 2450397 2464793 2454765 2436013 2456468 2486227 2511710 2507920
11497B507920j2375p125n342N113N564R759p573J4971J8952r584m253K9235N451
$$ 2507920 2495545 2488420 2483078 2488191 2493755 2503514 2495941 2510912 2529864 2520280 2516027 2545262 2550713
11484B550713J2906O362K658L663J1667P729J2878J5180K5902M090m524p312P000
$$ 2550713 2563619 2569981 2572639 2576302 2587969 2595698 2608576 2623756 2649658 2653748 2649224 2641912 2648912
11471B648912j04J3815M623N972J4295J1490J0315P975l024j9204M29J2338j302
$$ 2648912 2648808 2662623 2667246 2673218 2687513 2699003 2709318 2717293 2714269 2695065 2695494 2707832 2706530
11458B706530q47J4996J8791J3168J6062J8781K0841o744J2755L274j1178p7Q632
$$ 2706530 2705683 2720679 2739470 2752638 2768700 2787481 2808322 2801578 2814333 2817607 2806429 2806352 2814984
11445B814984J1825J8187J0681K0059P789P949k553n831K4922m146k1436q339
$$ 2814984 2826809 2844996 2855677 2875736 2883525 2891474 2888921 2883090 2908012 2903866 2882430 2874091
11433B874091N471M237J3658O028L0785Q617J2568J2758J0866J772n807m750L702
$$ 2874091 2879562 2883799 2897457 2903485 2934270 2942887 2955455 2968213 2979079 2980851 2975044 2970294 2973996
11420B973996J0448L2283K1853o715L862J1237K395N331L1100K625n845J6546
$$ 2973996 2984444 3016727 3038580 3031865 3035727 3046964 3049359 3054690 3085790 3088415 3082570 3099116
11408C099116J3932O156l02K2687J211j0561k250J3073M419N237K7148J1669j5332
$$ 3099116 3113048 3119204 3118902 3141589 3142800 3132239 3129989 3143062 3147481 3152718 3179866 3191535 3176203
11395C176203J273q838J5544J0317L0620K8629p645j3721p129J2949M051J5034
$$ 3176203 3177476 3168638 3184182 3194499 3225119 3253748 3246103 3232382 3225253 3238202 3242253 3257287
11383C257287K4771L410q989q748N626m492J995K9248K4338J7009L0835O541j579
$$ 3257287 3282058 3285468 3276479 3267731 3273357 3268865 3270860 3300108 3324446 3341455 3372290 3378831 3377252
11370C377252q760J3700J7498J9405J5561j2089j1748J3886J8896O469J7859K0136
$$ 3377252 3368492 3382192 3399690 3419095 3434656 3422567 3410819 3424705 3443601 3450070 3467929 3488065
11358C488065K259j1260l080N618j0343O857j887J2525K5487N009J9917J9727
$$ 3488065 3490324 3479064 3475984 3481602 3471259 3478116 3476229 3488754 3514241 3519250 3539167 3558894
11346C558894J9840J3087o176k343K352O020J4705O723q065J2671J0208L938p407
$$ 3558894 3578734 3591821 3585645 3583302 3585654 3591674 3606379 3613102 3605037 3617708 3627916 3631854 3624447
11333C624447J5137J7876K1469L3898n080Qk248J0248K6063k757J6192J8092J5932
$$ 3624447 3639584 3657460 3678929 3712827 3707747 3707755 3705507 3715755 3741818 3739061 3755253 3773345 3789277
11320C789277J0993j2883K761Q26L287j739N765J9462R876O249N526K0801J2589
$$ 3789277 3800270 3787387 3790148 3790974 3794261 3792522 3798287 3817749 3827625 3833874 3839400 3860201 3872790
11307C872790l562J54p576O474L6475J5916j3268j584P482k270q77J2415K4541
$$ 3872790 3869228 3869382 3861806 3868280 3904755 3920671 3907403 3905819 3913301 3911031 3910154 3922569 3947110
11294C947110J6690J2828j3173J761l945J9061K5281O593k5635n479J8898L3517
$$ 3947110 3963800 3976628 3963455 3965216 3961271 3980332 4005613 4012206 3986571 3981092 3999990 4033507
11282D033507J6960L598o936n799J7888p18N735R787O895n960O765R895L2262
$$ 4033507 4050467 4054065 4047129 4041330 4059218 4058500 4064235 4074022 4080917 4074957 4081722 4091617 4123879
11269D123879Q101J5144K0832J4000J1268O825m281O122K1480K3190J2544m906
$$ 4123879 4131980 4147124 4167956 4181956 4193224 4200049 4195768 4201890 4223370 4246560 4259104 4254198
11257D254198L695J6478J2840q355P941J2007K2971R321m46J2212K8323K1855
$$ 4254198 4257893 4274371 4287211 4278856 4286797 4298804 4321775 4331096 4330650 4342862 4371185 4393040
11245D393040R376J0540K6418N605Q507J7027J3762J3975k5282k9506k1385K0023
$$ 4393040 4402416 4412956 4439374 4444979 4453486 4470513 4484275 4498250 4472968 4443462 4422077 4442100
11233D442100K5639J3423K0901J3943J3175J8223M3493K0016O758m941j6553l4370
$$ 4442100 4467739 4481162 4502063 4516006 4529181 4547404 4590897 4610913 4617671 4612730 4596177 4561807
11221D561807k7834j6597j3328M007j0421O494K798K9338K9029J5228K2528J4525
$$ 4561807 4533973 4517376 4504048 4508055 4497634 4504128 4506926 4536264 4565293 4580521 4603049 4617574
11209D617574o795J3355K0413J6394K1854L8176K9423K9681j6028J417J8686J1506
$$ 4617574 4610779 4624134 4644547 4660941 4682795 4720971 4750394 4780075 4764047 4765464 4784150 4795656
11197D795656k599o628j4203n784J945r422l3447l9411m0972l0028k0274j6012
$$ 4795656 4793057 4786429 4772226 4766442 4768387 4758965 4725518 4686107 4645135 4615107 4594833 4578821
11185D578821O619r196J8520K2507K3115O143J8834J8774K9241L9680L2772K170
$$ 4578821 4585440 4576244 4594764 4617271 4640386 4646529 4665363 4684137 4713378 4753058 4785830 4788000
11173D788000Q17J1747K4312R933K3019J9941K3306J9521R618K3253o726P045
$$ 4788000 4788817 4800564 4824876 4834809 4857828 4877769 4901075 4920596 4930214 4953467 4946741 4953786
11161D953786m67k2751l3771k2866k3523j7405J8286K2176K6482J6489J0995K2866
$$ 4953786 4953319 4930568 4896797 4873931 4850408 4833003 4851289 4873465 4899947 4916436 4927431 4950297
11149D950297L3410L2803J9669l38o731K054L4024K0967j0750k924J8823K0802
$$ 4950297 4983707 5016510 5036179 5035841 5029110 5031164 5065188 5086155 5075405 5072481 5091304 5112106
11137E112106N599M037p896p170L8583K2463J0173j863O883K5972K4730O622N947
$$ 5112106 5117705 5121742 5113846 5106676 5145259 5167722 5177895 5176032 5182915 5208887 5233617 5240239 5246186
11124E246186O404l501L64J1583L5390K0666J2245J1165Q806J9924K8117J0877
$$ 5246186 5252590 5249089 5249453 5261036 5296426 5317092 5329337 5340502 5349308 5369232 5397349 5408226
11112E408226J0957K6252L6210k97j5773J6607L547K5629J784J3236L5937J8829
$$ 5408226 5419183 5445435 5481645 5481348 5465575 5482182 5485729 5511358 5513142 5526378 5562315 5581144
11100E581144J625N072J3769P881K1606Q545J0594K1654K2518O968p783k334P509
$$ 5581144 5582769 5587841 5601610 5609491 5631097 5639642 5650236 5671890 5694408 5701376 5693593 5691259 5698768
11087E698768R000J2352J9132J8140K5691K9016L5478J1758N277k257p626K37
$$ 5698768 5707768 5720120 5739252 5757392 5783083 5812099 5847577 5859335 5864612 5862355 5854729 5854966
11075E854966o303J1178J8985L8584J2378J7551K6825P355J6144N346j661J4950
$$ 5854966 5848663 5859841 5878826 5917410 5929788 5947339 5974164 5981519 5997663 6003009 6001348 6016298
11063F016298L344R554J4019J0844K0701K5874J5665K666k419n306K0739L7475
$$ 6016298 6019642 6029196 6043215 6054059 6074760 6100634 6116299 6118965 6116546 6111240 6131979 6169454
11051F169454K9245K3510K639k661K4702J3126Q456J1597K6244K2839O799K0828
$$ 6169454 6198699 6222209 6224848 6222187 6246889 6260015 6268471 6280068 6306312 6329151 6335950 6356778
11039F356778Q224J6976K4067L678r924m891Q170K3650K3198K7305J8784K1815
$$ 6356778 6365002 6381978 6406045 6409723 6399799 6394908 6403078 6426728 6449926 6477231 6496015 6517830
11027F517830p521Q443K3758J1064N343L5624L8384K1031J2412J0682O160K0515
$$ 6517830 6510309 6518752 6542510 6553574 6558917 6594541 6632925 6653956 6666368 6677050 6683210 6703725
11015F703725R733J5500K9535J5912P404J1132J1910K4422J6717o325K1873L3586
$$ 6703725 6713458 6728958 6758493 6774405 6781809 6792941 6804851 6829273 6845990 6839665 6861538 6895124
11003F895124j6576j0174N738L513K5514K8115L1724R377J9859R176J1139J8364
$$ 6895124 6878548 6868374 6874112 6877625 6903139 6931254 6962978 6972355 6992214 7001390 7012529 7030893
10991G030893K0484l950O219K5097Q948J5355K3955K2967J6733N175J0909K3549
$$ 7030893 7051377 7047427 7053646 7078743 7087691 7103046 7127001 7149968 7166701 7171876 7182785 7206334
10979G206334P603Q984M363L3995L1470J8356L974L885J8957o704J9863M8691
$$ 7206334 7213937 7222921 7227284 7261279 7292749 7311105 7315079 7318964 7337921 7331217 7351080 7399771
10967G399771K9254J3297N275J7211L3980L0630j1293N695L7373K8942M395j3666
$$ 7399771 7429025 7442322 7447597 7464808 7498788 7529418 7518125 7523820 7561193 7590135 7594530 7580864
10955G580864J6407K4990O169J5676K2510L3675J8143J9843K7962K4163k812J9927
$$ 7580864 7597271 7622261 7628430 7644106 7666616 7700291 7718434 7738277 7766239 7790402 7787590 7807517
10943G807517K0016K0220K8561K336J465l237n923K6127L0049o304J4464L0508
$$ 7807517 7827533 7847753 7876314 7878650 7880115 7876878 7870955 7897082 7927131 7920827 7935291 7965799
10931G965799K9209K8410L200M175J5385J5272J2601J6559L0900J3668L7547J2068
$$ 7965799 7995008 8023418 8026618 8030793 8046178 8061450 8074051 8090610 8121510 8135178 8172725 8184793
10919H184793l388P236K4287K6936L2337J2904p697J5593J6994j322K6599K3653
$$ 8184793 8181405 8188641 8212928 8239864 8272201 8285105 8277408 8293001 8309995 8308673 8335272 8358925
10907H358925j491R841K4053K3955J4625J5998K1930L7099K0658K2672N216o136
$$ 8358925 8357434 8367275 8391328 8415283 8429908 8445906 8467836 8504935 8525593 8548265 8553481 8547345
10895H547345j1273M5243L9711J9390L8565J2657J7440K3592K1781K4660L742
$$ 8547345 8536072 8581315 8621026 8640416 8678981 8691638 8709078 8732670 8754451 8779111 8782853
10884H782853J6131M987J1683K5758L7502K4203J9406K0659J1613J3869L0990
$$ 8782853 8798984 8803971 8815654 8841412 8878914 8903117 8922523 8943182 8954795 8968664 8999654
10873H999654K7995K5242L1350K8521J4097M2362L4920K0465Q696R374J8779K4253
$$ 8999654 9027649 9052891 9084241 9112762 9126859 9169221 9204141 9224606 9233302 9242676 9261455 9285708
10861I285708L2035L1843L5283K8100K3727K4347J7361J5472J6443K5759K0137
$$ 9285708 9317743 9349586 9384869 9412969 9436696 9461043 9478404 9493876 9510319 9536078 9556215
10850I556215J8982L6132L6043K6827L2985J7687K8512L7991M1213L7959K5556
$$ 9556215 9575197 9611329 9647372 9674199 9707184 9724871 9753383 9791374 9832587 9870546 9896102
10839I896102J5954J5948K2380K5279L0166K7904J1554L196K9155L4930M2704
$$ 9896102 9912056 9928004 9950384 9975663 10005829 10033733 10045287 10048483 10077638 10112568 10155272
10828A0155272K7673K5483K6212M0426K4563M4899M0207M3683L0536L4068M0462
$$ 10155272 10182945 10208428 10234640 10275066 10299629 10344528 10384735 10428418 10458954 10493022 10533484
10817A0533484J0293L3532K5138L1583M7103M6703K9759K8552L7061M3245L5809
$$ 10533484 10543777 10577309 10602447 10634030 10681133 10727836 10757595 10786147 10823208 10866453 10902262
10806A0902262J8370L0247M0971N0535K9750M7513L2987L4052L9396L3250J9431
$$ 10902262 10920632 10950879 10991850 11042385 11072135 11119648 11152635 11186687 11226083 11259333 11278764
10795A1278764L2600M0365L8804K8492K5794J8032L4113M6188M2881M2269N7547
$$ 11278764 11311364 11351729 11390533 11419025 11444819 11462851 11496964 11543152 11586033 11628302 11685849
10784A1685849K8849L3015M4096K8223L8576N8463L3446K2457O6237O1611M3091
$$ 11685849 11714698 11747713 11791809 11820032 11858608 11917071 11950517 11972974 12039211 12100822 12143913
10773A2143913K6157J9313N5722O3464N0117M3281M5035L7957L2260L0707N6155
$$ 12143913 12170070 12189383 12245105 12308569 12358686 12401967 12447002 12484959 12517219 12547926 12604081
10762A2604081M5950L3120L2778O9226M7799J4601L8540N1157M2225N2881L6262
$$ 12604081 12650031 12683151 12715929 12785155 12832954 12847555 12886095 12937252 12979477 13032358 13068620
10751A3068620N5748M0406L1380N6355M1222N6665P3755O6290M5027M1781J5558
$$ 13068620 13124368 13164774 13196154 13252509 13293731 13350396 13424151 13490441 13535468 13577249 13592807
10740A3592807K3330P0043P1952O9466N6198M4556M1357M4841M3390O6773N0795
$$ 13592807 13616137 13686180 13758132 13827598 13883796 13928352 13969709 14014550 14057940 14124713 14175508
10729A4175508N7812M7587M8960P2017N1885L9169O7503O1478N6517N7305N6946
$$ 14175508 14233320 14280907 14329867 14401884 14453769 14492938 14560441 14621919 14678436 14735741 14792687
10718A4792687N1300N4998M9042O5545O0165P3237Q0403P4936P4421N6437N8978
$$ 14792687 14843987 14898985 14948027 15013572 15073737 15146974 15227377 15302313 15376734 15433171 15492149
10707A5492149N6989N3807O2708N9770O1124Q4437P8115N7104O7614P0455O4916
$$ 15492149 15549138 15602945 15665653 15725423 15786547 15870984 15949099 16006203 16073817 16144272 16209188
10696A6209188P7761Q2888P6867P8903P6776O4718N2484O0679O9159P9195O8341
$$ 16209188 16286949 16369837 16446704 16525607 16602383 16667101 16719585 16780264 16849423 16928618 16996959
10685A6996959O7194N7467R2730Q0781P8450R0762O1683R3804R2628O8475J09346
$$ 16996959 17064153 17121620 17214350 17295131 17373581 17464343 17526026 17619830 17712458 17780933 17890279
10674A7890279Q1198O7486P8975R5053R2067J02105R9934J15633J25022R7944
$$ 17890279 17971477 18038963 18117938 18212991 18305058 18407163 18507097 18622730 18747752 18845696
10664A8845696R0609P1819P1018Q7580J06860J31878J06486R8517J16127J15105
$$ 18845696 18936305 19008124 19079142 19166722 19273582 19405460 19511946 19610463 19726590 19841695
10654A9841695J17253J30925J17068J13658J44118J62472J80703K02056J82861
$$ 19841695 19958948 20089873 20206941 20320599 20464717 20627189 20807892 21009948 21192809
10645B1192809J36827O1524r1707k98262m14014l36878j37220L5623J25439J63567
$$ 21192809 21329636 21391160 21299453 21001191 20587177 20250299 20113079 20148702 20274141 20437708
10635B0437708J91385J81338J82329J83372J76624J66156J57386J43070J21686
$$ 20437708 20629093 20810431 20992760 21176132 21352756 21518912 21676298 21819368 21941054
10626B1941054J34239J26788J37471J37715J33116J37366J33711J41346J55230
$$ 21941054 22075293 22202081 22339552 22477267 22610383 22747749 22881460 23022806 23178036
10617B3178036J24251J22639J56499J26406J35493J25949J00642J27928J30784
$$ 23178036 23302287 23424926 23581425 23707831 23843324 23969273 24069915 24197843 24328627
10608B4328627J36718J17002J37662J28604J55706J55714J34754J32636J57176
$$ 24328627 24465345 24582347 24720009 24848613 25004319 25160033 25294787 25427423 25584599
10599B5584599J61373J41564J31136J31364J36179J25491J46213J41377J18994
$$ 25584599 25745972 25887536 26018672 26150036 26286215 26411706 26557919 26699296 26818290
10590B6818290J16493J36547J47836J34719J39252J41946J41912J45099J22000
$$ 26818290 26934783 27071330 27219166 27353885 27493137 27635083 27776995 27922094 28044094
10581B8044094J29543J44270J32974J14088R2961J13151J16830J28637J16758
$$ 28044094 28173637 28317907 28450881 28564969 28657930 28771081 28887911 29016548 29133306
10572B9133306J09823J12990J12780J07255J28849J11654Q0667J14007Q9755Q0813
$$ 29133306 29243129 29356119 29468899 29576154 29705003 29816657 29897324 30011331 30101086 30181899
10562C0181899P9082P6471O9962N8090P0736O2414L6713K8890K7513N5044L5228
$$ 30181899 30260981 30337452 30407414 30465504 30536240 30598654 30635367 30664257 30691770 30746814 30782042
10551C0782042J6172M752n575k322K756j8737k6505l0877m1370p5207n4396m8272
$$ 30782042 30798214 30802966 30797391 30795069 30797825 30779088 30752583 30721706 30680336 30605129 30550733 30502461
10539C0502461m4030q7288j26943j47519j47318j52468j50444j38416j71227j72756
$$ 30502461 30458431 30371143 30244200 30096681 29949363 29796895 29646451 29508035 29336808 29164052
10529B9164052k13441k51041k43191k28874k60131l05416l21700l40303l75390
$$ 29164052 28950611 28699570 28456379 28227505 27967374 27661958 27340258 26999955 26624565
10520B6624565l98775m08728m17091m28974m55786m92859m98346n25286n73331
$$ 26624565 26225790 25817062 25399971 24970997 24515211 24022352 23524006 22998720 22425389
10511B2425389n66849n77108o06438o27797o55209o90688p28940p38185p19934
$$ 22425389 21858540 21281432 20674994 20047197 19391988 18701300 17972360 17234175 16514241
10502A6514241p43871p98769p93891p96542q33370q63875q59441q95467q90278
$$ 16514241 15770370 14971601 14177710 13381168 12547798 11683923 10824482 9929015 9038737
10493I038737q98927r24690r11603r07493r15078r25066r37720r19153r17354
$$ 9038737 8139810 7215120 6303517 5396024 4480946 3555880 2618160 1699007 781653
10484G81653r04149r01385r05667r10483q84894q58519q64062q71852q61149q25897
$$ 781653 -122496 -1023881 -1929548 -2840031 -3724925 -4583444 -5447506 -6319358 -7180507 -8006404
10474h006404p89121p94398q08272p51560p12389o80175o66030o41282o05790
$$ -8006404 -8795525 -9589923 -10398195 -11149755 -11862144 -12542319 -13208349 -13849631 -14455421
10465a4455421n52360n69740n54569n14706m95901m66762m39324m54268m21059
$$ -14455421 -15007781 -15577521 -16132090 -16646796 -17142697 -17609459 -18048783 -18503051 -18924110
10456a8924110l77643l72427l51987l04782k81542k69440k83147k32164k14278
$$ -18924110 -19301753 -19674180 -20026167 -20330949 -20612491 -20881931 -21165078 -21397242 -21611520
10447b1611520k15021j87715j75407j85168j63641j23335r3888p3595p9022n6207
$$ -21611520 -21826541 -22014256 -22189663 -22374831 -22538472 -22661807 -22755695 -22829290 -22908312 -22964519
10437b2964519n0168m0896l3380k8048j8322M64J7227L8367M0155L1083J8891
$$ -22964519 -23014687 -23055583 -23088963 -23117011 -23135333 -23134869 -23117642 -23079275 -23039120 -23008037 -22989146
10426b2989146P437M8299P0775P8795Q5923J01030J09342P3465Q0956R5696J56209
$$ -22989146 -22981709 -22933410 -22862635 -22783840 -22697917 -22596887 -22487545 -22414080 -22333124 -22237428 -22081219
10415b2081219J35259J30273J26635J22300J17873J00583J06759J25157J40060
$$ -22081219 -21945960 -21815687 -21689052 -21566752 -21448879 -21348296 -21241537 -21116380 -20976320
10406b0976320J30252J34357J36740J38451J38350J38004J46514J67792J68991
$$ -20976320 -20846068 -20711711 -20574971 -20436520 -20298170 -20160166 -20013652 -19845860 -19676869
10397a9676869J59738J62154J78214J76459J42788J60010K01872J75121J48712
$$ -19676869 -19517131 -19354977 -19176763 -19000304 -18857516 -18697506 -18495634 -18320513 -18171801
10388a8171801J67685J74181J87692J79951J73747J65595J59070J74283J26911
$$ -18171801 -18004116 -17829935 -17642243 -17462292 -17288545 -17122950 -16963880 -16789597 -16662686
10379a6662686J53723J76816J83287K08628J96567J83932K00123J87156J79103
$$ -16662686 -16508963 -16332147 -16148860 -15940232 -15743665 -15559733 -15359610 -15172454 -14993351
10370a4993351J72752J95648J97324J98255J92155K00671J95078J69763J89855
$$ -14993351 -14820599 -14624951 -14427627 -14229372 -14037217 -13836546 -13641468 -13471705 -13281850
10361a3281850J87756J85508J92806J98963K06655K02995K13385K29376K13850
$$ -13281850 -13094094 -12908586 -12715780 -12516817 -12310162 -12107167 -11893782 -11664406 -11450556
10352a1450556K07705J73028J47242J45236J56814J76122J96489J89674K10454
$$ -11450556 -11242851 -11069823 -10922581 -10777345 -10620531 -10444409 -10247920 -10058246 -9847792
10343i847792K25123K38367K37422K67360K61481K63461K52008K24339J83934
$$ -9847792 -9622669 -9384302 -9146880 -8879520 -8618039 -8354578 -8102570 -7878231 -7694297
10334g694297J21801P0957K2296j2054l4877o5677n0631j5694L0903Q5810J74537
$$ -7694297 -7572496 -7501539 -7479243 -7491297 -7526174 -7591851 -7642482 -7658176 -7627273 -7541463 -7366926
10323g366926K17141K31189K64686L08791K77255K94148K98738K65857K53716
$$ -7366926 -7149785 -6918596 -6653910 -6345119 -6067864 -5773716 -5474978 -5209121 -4955405
10314d955405K72227K79804K59874K55153K35068K56442K58678K50308K59121
$$ -4955405 -4683178 -4403374 -4143500 -3888347 -3653279 -3396837 -3138159 -2887851 -2628730
10305b628730K42349K53128K63844K75095K79718K87220K73878K80434K94078
$$ -2628730 -2386381 -2133253 -1869409 -1594314 -1314596 -1027376 -753498 -473064 -178986
10296a78986K99961K89221L10391L48597L33809L40803L61052L56776L66785L85416
$$ -178986 120975 410196 720587 1069184 1402993 1743796 2104848 2461624 2828409 3213825
10286C213825L79880L77809L94423M22840L97037L77715M18894M02985M45430
$$ 3213825 3593705 3971514 4365937 4788777 5185814 5563529 5982423 6385408 6830838
10277F830838M79018M71533N04485N42855N50898N76518N99636O32662O94164
$$ 6830838 7309856 7781389 8285874 8828729 9379627 9956145 10555781 11188443 11882607
10268A1882607P05719P15858P37322P30341P41179Q00175Q67050R35853R97128
$$ 11882607 12588326 13304184 14041506 14771847 15513026 16313201 17180251 18116104 19113232
10259A9113232J011646J008153J053395J115930J182330J263803J376388J476290
$$ 19113232 20124878 21133031 22186426 23302356 24484686 25748489 27124877 28601167
10251B8601167J579358J698859J867591K016014K194253K356464K510553K668050
$$ 28601167 30180525 31879384 33746975 35762989 37957242 40313706 42824259 45492309
10243D5492309K743426K668095K521581K628727L255987M198122N149461O040021
$$ 45492309 48235735 50903830 53425411 56054138 59310125 63508247 68657708 74697729
10235G4697729O929548P981386R340514J1092331J3300511J5766050J7992520
$$ 74697729 81627277 89608663 98949177 110041508 123342019 139108069 157100589
10228A57100589J8601884J3437235p463508n6954135j15023315j18624580p5784790
$$ 157100589 175702473 189139708 181676200 124722065 9698750 -108925830 -184710620
10221a84710620l0384534J384829J5634400J8893468J7740612J5429471J3182561
$$ -184710620 -215095154 -213710325 -198075925 -179182457 -161441845 -146012374 -132829813
10214a32829813J1280794R666088Q294462P119376O127708N245881M315890L302458
$$ -132829813 -121549019 -111882931 -103588469 -96469093 -90341385 -85095504 -80779614 -77477156
10206g7477156K602575K456984K576964K645582K516118K124786J724431J685637
$$ -77477156 -74874581 -72417597 -69840633 -67195051 -64678933 -62554147 -60829716 -59144079
10198e9144079J747329J761548J697919J606470J494282J378708J305643J268281
$$ -59144079 -57396750 -55635202 -53937283 -52330813 -50836531 -49457823 -48152180 -46883899
10190d6883899J189260J078943R65357R06697Q36572P88126Q12263P99755P44576
$$ -46883899 -45694639 -44615696 -43650339 -42743642 -41907070 -41118944 -40306681 -39506926 -38762350
10181c8762350O79809O21860N77637N45521N37867N47826N22168M96942M89674
$$ -38762350 -38082541 -37460681 -36883044 -36337523 -35799656 -35251830 -34729662 -34232720 -33743046
10172c3743046M71364M57063M28606M48614M20665M06062M16596L91371L40346
$$ -33743046 -33271682 -32814619 -32386013 -31937399 -31516734 -31110672 -30694076 -30302705 -29962359
10163b9962359L11526L29997L09146L11892L00998K84914K94396K79917K57056
$$ -29962359 -29650833 -29320836 -29011690 -28699798 -28398800 -28113886 -27819490 -27539573 -27282517
10154b7282517K47887K63507K76992K61628K34059K43362K36394K33569K21851
$$ -27282517 -27034630 -26771123 -26494131 -26232503 -25998444 -25755082 -25518688 -25285119 -25063268
10145b5063268K27934K52311K36756K43252K04913J87660K06501J75842J71227
$$ -25063268 -24835334 -24583023 -24346267 -24103015 -23898102 -23710442 -23503941 -23328099 -23156872
10136b3156872J83556J76461J83042J68570J54158J53146J35685J25898J57990
$$ -23156872 -22973316 -22796855 -22613813 -22445243 -22291085 -22137939 -22002254 -21876356 -21718366
10127b1718366J46434J40126J42679J32881J32140J22582J31278J60872J60800
$$ -21718366 -21571932 -21431806 -21289127 -21156246 -21024106 -20901524 -20770246 -20609374 -20448574
10118b0448574J41362J11291J29313J23728J30520J17190R0148P9143J11131J35024
$$ -20448574 -20307212 -20195921 -20066608 -19942880 -19812360 -19695170 -19605022 -19525879 -19414748 -19279724
10108a9279724J29025J10236R7107R7712J15464J00846J07901Q6832Q8462J26355
$$ -19279724 -19150699 -19040463 -18943356 -18845644 -18730180 -18629334 -18521433 -18434601 -18346139 -18219784
10098a8219784J36677J35077J30580J41478O3835M4731N4178N7941N9454R2690
$$ -18219784 -18083107 -17948030 -17817450 -17675972 -17612137 -17567406 -17513228 -17455287 -17395833 -17303143
10088a7303143Q0776M8016O2825P6492P0405O0045R0593Q5073O6309P4348N2920
$$ -17303143 -17222367 -17174351 -17111526 -17035034 -16964629 -16904584 -16813991 -16728918 -16662609 -16588261 -16535341
10077a6535341N5354N7998Q3215N3901O9061P0825O4233N1833O5624P7371Q7879
$$ -16535341 -16479987 -16421989 -16338774 -16284873 -16215812 -16144987 -16080754 -16028921 -15963297 -15885926 -15798047
10066a5798047P9696P4124M3072M5828O2314O2711M6643N8321O2918M4145O0351
$$ -15798047 -15718351 -15644227 -15601155 -15555327 -15493013 -15430302 -15383659 -15325338 -15262420 -15218275 -15157924
10055a5157924O1085O1529P0592O5479M2449L1007M6441N5876N4471O3348O6643
$$ -15157924 -15096839 -15035310 -14964718 -14899239 -14856790 -14825783 -14779342 -14723466 -14668995 -14605647 -14539004
10044a4539004N1331N2376N3282N3699O5573P0091N8428N3120M7358K6902M2336
$$ -14539004 -14487673 -14435297 -14382015 -14328316 -14262743 -14192652 -14134224 -14081104 -14033746 -14006844 -13964508
10033a3964508M4214M3950L7294L5449K8571N1168M7646N0233M1883K3275L4598
$$ -13964508 -13920294 -13876344 -13839050 -13803601 -13775030 -13723862 -13676216 -13625983 -13584100 -13560825 -13526227
10022a3526227N7445O8224Q5804M2199J4251K0585K7441L4743N1374M5921M3817
$$ -13526227 -13468782 -13400558 -13314754 -13272555 -13258304 -13237719 -13210278 -13175535 -13124161 -13078240 -13034423
10011a3034423J8748K7917M6641N2024J3254K7022L5053L5297M2988M0627L1453
$$ -13034423 -13015675 -12987758 -12941117 -12889093 -12875839 -12848817 -12813764 -12778467 -12735479 -12694852 -12663399
10000a2663399K9539O0399N4064L5190M8420K7424J0288J9420L4279M9444M9333
$$ -12663399 -12633860 -12573461 -12519397 -12484207 -12435787 -12408363 -12398075 -12378655 -12344376 -12294932 -12245599
9989a2245599L5898K4491L7591K5972K6579L3648K9839L4953M1117M3889K7799
$$ -12245599 -12209701 -12185210 -12147619 -12121647 -12095068 -12061420 -12031581 -11996628 -11955511 -11911622 -11883823
9978a1883823K1508M9971M5852N5618L0259J6364J7287r401J6444L6555L2011
$$ -11883823 -11862315 -11812344 -11766492 -11710874 -11680615 -11664251 -11646964 -11656365 -11639921 -11603366 -11571355
9967a1571355M6188K4056J5614J0255K0033M0888M1717M9015L2776K4801L6308
$$ -11571355 -11525167 -11501111 -11485497 -11475242 -11455209 -11414321 -11372604 -11323589 -11290813 -11266012 -11229704
9956a1229704L3188K9262L0857L0736L3978L7179N2401K4747J4887N3589L1216
$$ -11229704 -11196516 -11167254 -11136397 -11105661 -11071683 -11034504 -10982103 -10957356 -10942469 -10888880 -10857664
9945a0857664J0499O459J4035L0445N3493J8947R849L1844M0576L6311L0584K3900
$$ -10857664 -10847165 -10840706 -10826671 -10796226 -10742733 -10723786 -10713937 -10682093 -10641517 -10605206 -10574622 -10550722
9933a0550722J5327L3473L1051M6707J8625Q849K4449J3415J8182J1525N4162
$$ -10550722 -10535395 -10501922 -10470871 -10424164 -10405539 -10396690 -10372241 -10358826 -10340644 -10329119 -10274957
9922a0274957N9228J0419O539J7855L211j4930j4946R024M3914K1480K6198M8352
$$ -10274957 -10215729 -10205310 -10198771 -10180916 -10177705 -10192635 -10207581 -10198557 -10154643 -10133163 -10106965 -10058613
9910a0058613M2656J5766J5741J0384J3262J1958L090K2956M4010L4744L3046
$$ -10058613 -10015957 -10000191 -9984450 -9974066 -9960804 -9948846 -9945756 -9922800 -9878790 -9844046 -9811000
9899i811000L2606J7164R638M7614L0384J1002K9112L6011K4590J1357J4989P247
$$ -9811000 -9778394 -9761230 -9751592 -9703978 -9673594 -9662592 -9633480 -9597469 -9572879 -9561522 -9546533 -9539286
9887i539286M262K4632K9728K3451K9961J8737L7252L1845J4523J9077K4773J1351
$$ -9539286 -9535024 -9510392 -9480664 -9457213 -9427252 -9408515 -9371263 -9339418 -9324895 -9305818 -9281045 -9269694
9875i269694J2938J8329K5032J1801K3038K8367K5273L1065J7489J9814k396j100
$$ -9269694 -9256756 -9238427 -9213395 -9201594 -9178556 -9150189 -9124916 -9093851 -9076362 -9056548 -9058944 -9060044
9863i060044Q680J989L0261N4449J8812P441J5560M9040K8224N109J0781K0945
$$ -9060044 -9051364 -9049375 -9019114 -8964665 -8945853 -8938412 -8922852 -8873812 -8845588 -8840479 -8829698 -8808753
9851h808753K9590L8016M7003J3613K3128K2629J3232J735K4574Q067K3117R056
$$ -8808753 -8779163 -8741147 -8694144 -8680531 -8657403 -8634774 -8621542 -8619807 -8595233 -8587166 -8564049 -8554993
9839h554993R311Q833K2153J0160L4514J5825j538K9682K4600Q526K9833K4151
$$ -8554993 -8545682 -8536849 -8514696 -8504536 -8470022 -8454197 -8455735 -8426053 -8401453 -8392927 -8363094 -8338943
9827h338943N326M3138M9918J6605K8410K7069K1599J5308M6757M3269M7123L7256
$$ -8338943 -8333617 -8290479 -8240561 -8223956 -8195546 -8168477 -8146878 -8131570 -8084813 -8041544 -7994421 -7957165
9815g957165M1717K2703J5576L5559M1894N3975N9245P6756Q4825Q3168Q5168
$$ -7957165 -7915448 -7892745 -7877169 -7841610 -7799716 -7745741 -7686496 -7609740 -7524915 -7441747 -7356579
9804g356579O4252O2537m7104k49637m51616n12062l61587j67120r433P5690P6394
$$ -7356579 -7292327 -7229790 -7276894 -7526531 -7978147 -8490209 -8851796 -9018916 -9028349 -8952659 -8876265
9793h876265P3568J13878P9453O3161N9267M4982L5836L8834L1648M5885L6334
$$ -8876265 -8802697 -8688819 -8609366 -8546205 -8486938 -8441956 -8406120 -8367286 -8335638 -8289753 -8253419
9782h253419K4274K0683M8298L7883K7873J8410P964J3313L945K1925K3886L1935
$$ -8253419 -8229145 -8208462 -8160164 -8122281 -8094408 -8075998 -8068034 -8054721 -8050776 -8028851 -8004965 -7973030
9770g973030n62P846K5498J8930K5558R257K8007J6836J7015K2942K5923M3028
$$ -7973030 -7973592 -7965746 -7940248 -7921318 -7895760 -7886503 -7858496 -7841660 -7824645 -7801703 -7775780 -7732752
9758g732752L0032J9514J8576K804q894k032L1266J7416J1697L3571L0141J1667
$$ -7732752 -7702720 -7683206 -7664630 -7661826 -7670720 -7672752 -7641486 -7624070 -7612373 -7578802 -7548661 -7536994
9746g536994n916P587o30j518j1915J2849K1260L4146K0381N919K1891M712J9202
$$ -7536994 -7542910 -7535323 -7535953 -7537471 -7549386 -7536537 -7515277 -7481131 -7460750 -7454831 -7432940 -7428228 -7409026
9733g409026J3686J7857R260M656J5360J2647J5741K6754J1772m207K670Q920
$$ -7409026 -7395340 -7377483 -7368223 -7363567 -7348207 -7335560 -7319819 -7293065 -7281293 -7285500 -7282830 -7273910
9721g273910P199N193J6612N867J1031J8795J0694P810J2178J8630J4112J4255
$$ -7273910 -7266711 -7261518 -7244906 -7239039 -7228008 -7209213 -7198519 -7190709 -7178531 -7159901 -7145789 -7131534
9709g131534M415J4452J9762J0617J260J1612J7809M69J0017K890L891K5027K3101
$$ -7131534 -7127119 -7112667 -7092905 -7082288 -7081028 -7069416 -7051607 -7051138 -7041121 -7038231 -7034340 -7009313 -6986212
9696f986212r12O560K7330K2633J4243J2206O591L339R892K2815N497P552J2038
$$ -6986212 -6987124 -6980564 -6953234 -6930601 -6916358 -6904152 -6897561 -6894222 -6884330 -6861515 -6856018 -6848466 -6836428
9683f836428L0083J6451J4342M758j0190j7102p795Q354K4432J0805J414K2817
$$ -6836428 -6806345 -6789894 -6775552 -6770794 -6780984 -6798086 -6805881 -6797527 -6773095 -6762290 -6760876 -6738059
9671f738059K4959N495K6041k738J482M410O153p057Q851M8077j1781J4045L1695
$$ -6738059 -6713100 -6707605 -6681564 -6684302 -6682820 -6678410 -6672257 -6679314 -6670463 -6622386 -6634167 -6620122 -6588427
9658f588427j826O05N450K578J4239P357K4537J8110r26K374J2285J5777K0448
$$ -6588427 -6590253 -6589648 -6584198 -6581620 -6567381 -6560024 -6535487 -6517377 -6518303 -6515929 -6503644 -6487867 -6467419
9645f467419L0917J3073j280k252m981J1877J024l082J6668K2811K1282n948m212
$$ -6467419 -6436502 -6423429 -6424709 -6426961 -6431942 -6420065 -6419041 -6422123 -6405455 -6382644 -6361362 -6367310 -6371522
9632f371522J109r946r295J169P544K0699M277l60j0700J0127J4833K0841L6930
$$ -6371522 -6370413 -6380359 -6389654 -6388485 -6380941 -6360242 -6355965 -6356325 -6367025 -6356898 -6342065 -6321224 -6284294
9619f284294L1848N658o303J9208J3108J6560P672k748n62J0540j2153q999J4896
$$ -6284294 -6252446 -6246788 -6253091 -6233883 -6220775 -6204215 -6196543 -6199291 -6199853 -6189313 -6201466 -6210465 -6195569
9606f195569K2464L204J1869K7097L819R34J2468Q603l814J2125l624L705J011
$$ -6195569 -6173105 -6169901 -6158032 -6130935 -6127116 -6126182 -6113714 -6105111 -6108925 -6096800 -6100424 -6096719 -6095708
9593f095708J4199J5158L4715r071j5481J1126J2157J614M916n847L20L0396J5858
$$ -6095708 -6081509 -6066351 -6031636 -6040707 -6056188 -6045062 -6032905 -6031291 -6026375 -6032222 -6031902 -6001506 -5985648
9580e985648M545K1258J8893J4659r362P319m400p79n224M062K6029K2577K210
$$ -5985648 -5981103 -5959845 -5940952 -5926293 -5935655 -5928336 -5932736 -5933515 -5938739 -5934677 -5908648 -5886071 -5883861
9567e883861j1710R128K3693J1313K1871J3970M043j735n455K6701K3276r615
$$ -5883861 -5895571 -5886443 -5862750 -5851437 -5829566 -5815596 -5811553 -5813288 -5818743 -5792042 -5768766 -5778381
9555e778381j4003R523p980O678J5754L3202L207Q270q657L912K793q59n164N018
$$ -5778381 -5792384 -5782861 -5790841 -5784163 -5768409 -5735207 -5732000 -5723730 -5732387 -5728475 -5725682 -5726541 -5731705 -5726687
9541e726687K6734R225j6215N109J1193R081J366Q134Q609P397J0804J8044R911
$$ -5726687 -5699953 -5690728 -5706943 -5701834 -5690641 -5681560 -5680194 -5672060 -5663451 -5656054 -5645250 -5627206 -5617295
9528e617295K0311j3580j0954L827J1506p613J4810O190M049J2423J1663Q908
$$ -5617295 -5596984 -5610564 -5621518 -5617691 -5606185 -5613798 -5598988 -5592798 -5588749 -5576326 -5564663 -5555755
9516e555755j6814N188j515L0925P022J2459J1964j2479O076o438o778K349K2282
$$ -5555755 -5572569 -5567381 -5568896 -5537971 -5530949 -5518490 -5506526 -5519005 -5512929 -5519367 -5526145 -5523796 -5501514
9503e501514K7157L106L018L874L211J1540R809M260l740J3470J3264J2007q674
$$ -5501514 -5474357 -5471251 -5468233 -5464359 -5461148 -5449608 -5439799 -5435539 -5439279 -5425809 -5412545 -5400538 -5409212
9490e409212J5133k646k925L589J0277j0690K0778K5763J552l667n359j871R214
$$ -5409212 -5394079 -5396725 -5399650 -5396061 -5385784 -5396474 -5375696 -5349933 -5348381 -5352048 -5357407 -5359278 -5350064
9477e350064J1735Q809K9j102N397M703Q326K2760P560J0281K2992P04r611O11
$$ -5350064 -5338329 -5329520 -5329491 -5330593 -5325196 -5320493 -5312167 -5289407 -5281847 -5271566 -5248574 -5247870 -5257481 -5256870
9463e256870j810J2397K5844J6476Q156L605Q585K2857m305m932J559j4429j9845
$$ -5256870 -5258680 -5246283 -5220439 -5203963 -5195807 -5192202 -5183617 -5160760 -5165065 -5169997 -5168438 -5182867 -5202712
9450e202712K733J001J1195K1979J8558j56n114K2406K4691N655O05k1001J463
$$ -5202712 -5199979 -5198978 -5187783 -5165804 -5147246 -5147402 -5152516 -5130110 -5105419 -5099764 -5099159 -5120160 -5118697
9437e118697k432o530K9824J6266q60j2304J5978K6986R662J741j0048o088J5088
$$ -5118697 -5121129 -5127659 -5097835 -5081569 -5082429 -5094733 -5078755 -5051769 -5042107 -5040366 -5050414 -5056502 -5041414
9424e041414J4649Q681J470n225O044j575J8729R767L18P401K778J1513K0214
$$ -5041414 -5026765 -5018084 -5016614 -5021839 -5015795 -5017370 -4998641 -4988874 -4988556 -4981155 -4978377 -4966864 -4946650
9411d946650J8439j7016j0757r628j7227Q259K3488K0984K2575J2524o006Q330
$$ -4946650 -4928211 -4945227 -4955984 -4965612 -4982839 -4974580 -4951092 -4930108 -4907533 -4895009 -4901015 -4892685
9399d892685l592j0864j6063j5284K3774K4188J3930O460L240j8587Q797J0131
$$ -4892685 -4896277 -4907141 -4923204 -4938488 -4914714 -4890526 -4876596 -4870136 -4866896 -4885483 -4876686 -4866555
9387d866555J2946J6185r550j3936M587O305l084P467N320j2899K68K404K0655
$$ -4866555 -4853609 -4837424 -4846974 -4860910 -4856323 -4850018 -4853102 -4845635 -4840315 -4853214 -4852946 -4850542 -4829887
9374d829887O899J2388J5741J6031J996K024j286m75L890L946K2847j475j0090
$$ -4829887 -4822988 -4810600 -4794859 -4778828 -4776832 -4774808 -4776094 -4776569 -4772679 -4768733 -4745886 -4747361 -4757451
9361d757451J4953K008L132J2736L637m556J0764J1493n684L943L1368M2140j8019
$$ -4757451 -4742498 -4740490 -4737358 -4724622 -4720985 -4725541 -4714777 -4703284 -4708968 -4705025 -4673657 -4631517 -4649536
9348d649536l8279J1681O805j5311m324J5527P109j3138j2344K174K3614O843
$$ -4649536 -4687815 -4676134 -4669329 -4684640 -4688964 -4673437 -4666328 -4679466 -4691810 -4689636 -4666022 -4659179
9336d659179k650L912J3482R071J5954J0073K699J6051o056j9459J0176J5172
$$ -4659179 -4661829 -4657917 -4644435 -4635364 -4619410 -4609337 -4606638 -4590587 -4596643 -4616102 -4605926 -4590754
9324d590754k0564n288O426J1905P896J3312l095J6634P374J4406Q560K513l661
$$ -4590754 -4611318 -4616606 -4610180 -4598275 -4590379 -4577067 -4580162 -4563528 -4556154 -4541748 -4533188 -4530675 -4534336
9311d534336J1292j493n89l032j1152J0669j3035M132K5774J1096R626J0893j6741
$$ -4534336 -4523044 -4524537 -4525126 -4528158 -4539310 -4528641 -4541676 -4537544 -4511770 -4500674 -4491048 -4480155 -4496896
9298d496896j3097o93Q615Q072R993J238R241j714m274K537j199N537K6532L599
$$ -4496896 -4509993 -4510686 -4502071 -4493999 -4484006 -4482768 -4473527 -4475241 -4479515 -4476978 -4478177 -4472640 -4446108 -4442509
9284d442509K5920J0564j5867l671k197m651J2903J8018m313n079N614m558k2163
$$ -4442509 -4416589 -4406025 -4421892 -4425563 -4427760 -4432411 -4419508 -4401490 -4405803 -4410882 -4405268 -4409826 -4431989
9271d431989M296M5762K0557r579p822j4339q342L0112K0767j2917j2247m404
$$ -4431989 -4427693 -4381931 -4361374 -4370953 -4378775 -4393114 -4401456 -4371344 -4350577 -4363494 -4375741 -4380145
9259d380145J4913J2783K130n626K1034J7685P978J9272Q675J6045q795j3249
$$ -4380145 -4365232 -4352449 -4350319 -4355945 -4334911 -4317226 -4309248 -4289976 -4281301 -4265256 -4274051 -4287300
9247d287300Q595j0161P178J0784Q340J4669r076q171j942J4105J0946j9010m240
$$ -4287300 -4278705 -4288866 -4281688 -4270904 -4262564 -4247895 -4256971 -4265142 -4267084 -4252979 -4242033 -4261043 -4265283
9234d265283p578L543N682J3465n694M315K3609N306J0584J0609J3732j4663j9553
$$ -4265283 -4272861 -4269318 -4263636 -4250171 -4255865 -4251550 -4227941 -4222635 -4212051 -4201442 -4187710 -4202373 -4221926
9221d221926M211L7205J261p236j1673n17J0671l811J8840J2809P424r250J3391
$$ -4221926 -4217715 -4180510 -4179249 -4186485 -4198158 -4198675 -4188004 -4191815 -4172975 -4160166 -4152742 -4161992 -4148601
9208d148601o191j441j0651N497J2087n80J4757k439k2010J7201K2372J1266J0327
$$ -4148601 -4154792 -4156233 -4166884 -4161387 -4149300 -4149880 -4135123 -4137562 -4159572 -4142371 -4119999 -4108733 -4098406
9195d098406l068j6235j0566m672J0675J9651Q973O156j5733r535J2303K0161
$$ -4098406 -4101474 -4117709 -4128275 -4132947 -4122272 -4102621 -4093648 -4087492 -4103225 -4112760 -4100457 -4080296
9183d080296J5191M192k541j1293j1242Q804J0909J1497J0835Q474k1662P861
$$ -4080296 -4065105 -4060913 -4063454 -4074747 -4085989 -4077185 -4066276 -4054779 -4043944 -4035470 -4057132 -4049271
9171d049271L264J4723P903M398K782l627p054q40J6637Q770L905J0897j6154
$$ -4049271 -4046007 -4031284 -4023381 -4018983 -4016201 -4019828 -4026882 -4027722 -4011085 -4002315 -3998410 -3987513 -4003667
9158d003667J4984K1759j7858j5798m093k907Q809J6390J1281l692L33j7036n682
$$ -4003667 -3988683 -3966924 -3984782 -4000580 -4004673 -4007580 -3998771 -3982381 -3971100 -3974792 -3974459 -3991495 -3997177
9145c997177K4382J519J5911Q417P077n112j4428L83J0295M743Q690J0412K0657
$$ -3997177 -3972795 -3971276 -3955365 -3946948 -3939871 -3944983 -3959411 -3959028 -3948733 -3943990 -3935300 -3924888 -3904231
9132c904231N536o236J0896r720j3952P06J3639p925R35J9978O648m243M847o031
$$ -3904231 -3898695 -3904931 -3894035 -3903755 -3917707 -3917001 -3903362 -3911287 -3910352 -3890374 -3883726 -3887969 -3883122 -3889153
9118c889153O54J0019L446j264N556J7708P350j5104j2030L0602N02R292j157
$$ -3889153 -3888499 -3878480 -3875034 -3876298 -3870742 -3853034 -3845684 -3860788 -3872818 -3842216 -3841714 -3832422 -3833579
9105c833579j7501Q999J819L964k395k2874j415K4616K4606k176k801J9402j7651
$$ -3833579 -3851080 -3842081 -3840262 -3836298 -3838693 -3861567 -3862982 -3838366 -3813760 -3815936 -3818737 -3799335 -3816986
9092c816986j7859J8001J3238j2431J2723K5446L016P180o528J0555R600j9152
$$ -3816986 -3834845 -3816844 -3803606 -3816037 -3803314 -3777868 -3774852 -3767672 -3774200 -3763645 -3754045 -3773197
9080c773197j0180m830o945j026M247J2404K2117P756j0053l015j249N496o187
$$ -3773197 -3783377 -3788207 -3795152 -3796178 -3791931 -3779527 -3757410 -3749654 -3759707 -3762722 -3763971 -3758475 -3764662
9067c764662M857J9399R764k853J0960M927j9140K320M196O139J3661m789l115
$$ -3764662 -3759805 -3740406 -3730642 -3733495 -3722535 -3717608 -3736748 -3734428 -3730232 -3724093 -3710432 -3715221 -3718336
9054c718336J5324j075M949J05J1476K0821J2574m492j5539j9876k836J3648P062
$$ -3718336 -3703012 -3704087 -3699138 -3699033 -3687557 -3666736 -3654162 -3658654 -3674193 -3694069 -3696905 -3683257 -3676195
9041c676195Q545O550k829N731J1870j104q44J1822q265l1319j4958J2173J7375
$$ -3676195 -3667650 -3661100 -3663929 -3658198 -3646328 -3647432 -3648276 -3636454 -3644719 -3676038 -3690996 -3678823 -3661448
9028c661448l907K724K2550K0076R092j7707p938K534k0998j0348K0820K9861
$$ -3661448 -3665355 -3662631 -3640081 -3620005 -3610913 -3628620 -3636558 -3634024 -3655022 -3665370 -3644550 -3614689
9016c614689j0593Q376J0814q341r589K916J1439Q435M421o593n061J3021J2138
$$ -3614689 -3625282 -3616906 -3606092 -3614433 -3624022 -3621106 -3609667 -3601232 -3596811 -3603404 -3608465 -3595444 -3583306
9003c583306J7322l846j2172k594r461m762O476K1615P818j0019R105P305j784
$$ -3583306 -3565984 -3569830 -3582002 -3584596 -3594057 -3598819 -3592343 -3570728 -3562910 -3572929 -3563824 -3556519 -3558303
8990c558303l126Q443J3890k892k6277o687l977K7258J0853j5087r109k844J9003
$$ -3558303 -3561429 -3552986 -3539096 -3541988 -3568265 -3574952 -3578929 -3551671 -3540818 -3555905 -3565014 -3567858 -3548855
8977c548855l386j0699J2896Q394J7678N136P255j063J5089l439j0520r1R958
$$ -3548855 -3552241 -3562940 -3550044 -3541650 -3523972 -3518836 -3511581 -3512644 -3497555 -3500994 -3511514 -3511605 -3501647
8964c501647J5743J5893m458j015n462O563m563J983Q418j423o720K617K3462
$$ -3501647 -3485904 -3470011 -3474469 -3475484 -3480946 -3474383 -3478946 -3476963 -3468545 -3469968 -3476688 -3474071 -3450609
8951c450609j4496k5760M750P050O598K3294O324O440J594K791O585P797p913
$$ -3450609 -3465105 -3490865 -3486115 -3479065 -3472467 -3449173 -3442849 -3436409 -3434815 -3432024 -3425439 -3417642 -3425555
8938c425555j0521K673p21P676J376m637P473p92J0571J1680o148l319J9239J2952
$$ -3425555 -3436076 -3433403 -3434124 -3426448 -3425072 -3429709 -3422236 -3423028 -3412457 -3400777 -3406925 -3410244 -3391005 -3378053
8924c378053P112K658k0904Q422O296l68K038K855j2758n868J8456L072K369j8839
$$ -3378053 -3370941 -3368283 -3389187 -3380765 -3374469 -3374837 -3372799 -3369944 -3382702 -3388570 -3370114 -3367042 -3364673 -3383512
8910c383512L227J4859O474j2274R66J0475m859L380P416J5137N159J8506J4774
$$ -3383512 -3380285 -3365426 -3358952 -3371226 -3370260 -3359785 -3364644 -3361264 -3353848 -3338711 -3333552 -3315046 -3300272
8897c300272o50k4673j844J6120K085j1042J717j167J337q485p101N058L0029
$$ -3300272 -3300922 -3325595 -3327439 -3311319 -3309234 -3320276 -3318559 -3319726 -3318389 -3326874 -3333975 -3328917 -3298888
8884c298888J9287M566L068J1248J3521K711j2809J069K2769J7157J3400J2393
$$ -3298888 -3279601 -3275035 -3271967 -3260719 -3247198 -3244487 -3257296 -3256227 -3233458 -3216301 -3202901 -3190508
8872c190508J3137j2103r537J0650J6603M39J5558Q226K0591K5263J9510J1903
$$ -3190508 -3177371 -3189474 -3199011 -3188361 -3171758 -3171319 -3155761 -3147535 -3126944 -3101681 -3082171 -3070268
8860c070268P519L3731o097j5362p5361j40814j11721o1421r736j342K1563J5718
$$ -3070268 -3062749 -3029018 -3035115 -3050477 -3125838 -3266652 -3378373 -3439794 -3449530 -3450872 -3429309 -3413591
8848c413591O912L2746L5507K4711P363J2801r458j0975J968J1571K4246J6173
$$ -3413591 -3406679 -3373933 -3338426 -3313715 -3306352 -3293551 -3303009 -3313984 -3312016 -3300445 -3276199 -3260026
8836c260026J0292j4447j861J9906J105q442J0071J5575Q572N419k2354k1804
$$ -3260026 -3249734 -3264181 -3266042 -3246136 -3245031 -3253473 -3243402 -3227827 -3219255 -3213836 -3236190 -3257994
8824c257994K0602J5681J0016J0930n327O834J6881Q593j6841j5896J613J1524
$$ -3257994 -3237392 -3221711 -3211695 -3200765 -3206092 -3199258 -3182377 -3173784 -3190625 -3206521 -3204908 -3193384
8812c193384Q400N432j3098O778L2918J0659j9804N58r42J2645J3789O806m499
$$ -3193384 -3184984 -3179552 -3192650 -3185872 -3152954 -3142295 -3162099 -3161541 -3162483 -3149838 -3136049 -3129243 -3133742
8799c133742J0470l818j5327k6067k2360O794K3020P096J1292J3967Q002l264
$$ -3133742 -3123272 -3127090 -3142417 -3168484 -3190844 -3184050 -3161030 -3153934 -3142642 -3128675 -3120673 -3123937
8787c123937k2485j6793M654J5341J7637K5678M7m350J2657j0344j2894K6512
$$ -3123937 -3146422 -3163215 -3158561 -3143220 -3125583 -3099905 -3099858 -3104208 -3091551 -3101895 -3114789 -3088277
8775c088277J2242O020J009r618j2025j0963k627P498J3096J8743M901N285J1044
$$ -3088277 -3076035 -3070015 -3069006 -3078624 -3090649 -3101612 -3104239 -3096741 -3083645 -3064902 -3060001 -3054716 -3043672
8762c043672j2198K738O241O740j6219k263r566L025K1101K988j131R472r808
$$ -3043672 -3055870 -3053132 -3046891 -3040151 -3056370 -3058633 -3068199 -3065174 -3044073 -3041085 -3042216 -3032744 -3042552
8749c042552P936q073K035J6733J7584l310k1317p16o305J6288O771o761M075
$$ -3042552 -3034616 -3042689 -3040654 -3023921 -3006337 -3009647 -3030964 -3031680 -3037985 -3021697 -3014926 -3021687 -3017612
8736c017612j057o318L440K2995J9092J0613j6980j071J0280j725p734L86M694
$$ -3017612 -3018669 -3024987 -3021547 -2998552 -2979460 -2968847 -2985827 -2986898 -2976618 -2978343 -2986077 -2985691 -2980997
8723b980997L891j2836l697j38J9439J5406Q277p993l800K089M564q01K0277N171
$$ -2980997 -2977106 -2989942 -2993639 -2993777 -2974338 -2958932 -2950655 -2958648 -2962448 -2960359 -2955795 -2956596 -2936319 -2931148
8709b931148j6621O073N871n03N696j0765p679O949J5207Q345k3975m509K5403
$$ -2931148 -2947769 -2941696 -2935825 -2936328 -2930632 -2941397 -2949076 -2942127 -2926920 -2918575 -2942550 -2947059 -2921656
8696b921656J516j827N163P444R704P64P332j6055k701K1344Q112J3348p807M441
$$ -2921656 -2920140 -2921967 -2916804 -2909360 -2899656 -2898892 -2891560 -2907615 -2910316 -2888972 -2880860 -2867512 -2875319 -2870878
8682b870878P126O03j6681q472K6047r952j972J6755q770K586O903L012M373M970
$$ -2870878 -2863752 -2863149 -2879830 -2888302 -2862255 -2872207 -2874179 -2857424 -2866194 -2863608 -2856705 -2853693 -2849320 -2844350
8668b844350o302J791J6994q530p250m371j7336J8775J1666L360J4088l203o874
$$ -2844350 -2850652 -2848861 -2831867 -2840397 -2847647 -2852018 -2869354 -2850579 -2838913 -2835553 -2821465 -2824668 -2831542
8655b831542O66M593j2594m309P184J0875J5641O420p73N649K266N327j0698q89
$$ -2831542 -2830876 -2826283 -2838877 -2843186 -2836002 -2825127 -2809486 -2803066 -2803839 -2798190 -2795924 -2790597 -2801295 -2802184
8641b802184J699J2084j7618o708L750J8141J234l0889J7442J0928m573J2952
$$ -2802184 -2800485 -2788401 -2806019 -2812727 -2808977 -2790836 -2789602 -2820491 -2803049 -2792121 -2796694 -2783742
8629b783742k033J4632K1767q708J5565K692J7072N790m406R519N590J245L251
$$ -2783742 -2785775 -2771143 -2749376 -2758084 -2742519 -2739827 -2722755 -2716965 -2721371 -2711852 -2706262 -2705017 -2701766
8616b701766P685J2787l6055l4114l081j0124k0247j7733j7414j4618l2187k5634
$$ -2701766 -2694081 -2681294 -2717349 -2751463 -2754544 -2764668 -2784915 -2802648 -2820062 -2834680 -2866867 -2892501
8604b892501j4293l0404j2823j2708k3841r982o211m578K403R104J2164k635l144
$$ -2892501 -2906794 -2937198 -2950021 -2962729 -2986570 -2996552 -3002763 -3007341 -3004938 -2995834 -2983670 -2986305 -2989449
8591b989449M897m469p938r988j5939k2020j3630q10k1653j9269K591J6158J4148
$$ -2989449 -2984552 -2989021 -2996959 -3006947 -3022886 -3044906 -3058536 -3059346 -3080999 -3100268 -3097677 -3081519 -3067371
8578c067371J3523m347J1264N321Q778J3951P248K172M487j320J7829J4767J0838
$$ -3067371 -3053848 -3058195 -3046931 -3041610 -3032832 -3018881 -3011633 -3009461 -3004974 -3006294 -2988465 -2973698 -2962860
8565b962860j614M590j6948P247o816J90N621N054m608M848K3094j632K381K4682
$$ -2962860 -2964474 -2959884 -2976832 -2969585 -2976401 -2976211 -2970590 -2965536 -2970144 -2965296 -2942202 -2943834 -2941453 -2916771
8551b916771J6794q833q03j0220j9662j3008J5976K4297J3174k640J3403J1003
$$ -2916771 -2899977 -2908810 -2909613 -2919833 -2939495 -2952503 -2936527 -2912230 -2899056 -2901696 -2888293 -2877290
8539b877290j0169R617J3017K553K5142J4818l0016o291J0130j973j0607P895
$$ -2877290 -2887459 -2877842 -2864825 -2862272 -2837130 -2822312 -2852328 -2858619 -2848489 -2850462 -2861069 -2853174
8527b853174j9998J1313K8471p097K476Q239k833k70K334p278q446K671K107p539
$$ -2853174 -2873172 -2861859 -2833388 -2840485 -2838009 -2829770 -2832603 -2832873 -2830539 -2837817 -2846263 -2843592 -2841485 -2849024
8513b849024j2292l993O376J2104J6082P913Q620R251Q903j6885O234K9117P948
$$ -2849024 -2861316 -2865309 -2858933 -2846829 -2830747 -2822834 -2814214 -2804963 -2796060 -2812945 -2806711 -2777594 -2769646
8500b769646P350J573K099j122k0042j4206j3811J4209J2774J6894J9410Q148
$$ -2769646 -2762296 -2760723 -2758624 -2759746 -2779788 -2793994 -2807805 -2793596 -2780822 -2763928 -2744518 -2736370
8488b736370j7891j1661j5312J4300Q00O909J5152M17j0162j0286J787L356J017
$$ -2736370 -2754261 -2765922 -2781234 -2766934 -2766134 -2759225 -2744073 -2743656 -2753818 -2764104 -2762317 -2758961 -2757944
8475b757944q98l195l472J0100J5702O940q511j7386j0277J7677J2436J2113K1263
$$ -2757944 -2758842 -2762037 -2765509 -2755409 -2739707 -2732767 -2741278 -2758664 -2768941 -2751264 -2738828 -2726715 -2705452
8462b705452k59k954L750m961J424M176j2319L865J2942K6826M823k9138n808
$$ -2705452 -2705711 -2708665 -2704915 -2709876 -2708452 -2704276 -2716595 -2712730 -2699788 -2672962 -2668139 -2697277 -2703085
8449b703085J8242M122M450p861q26j1253J0174K114J3768K434O343J558k590
$$ -2703085 -2684843 -2680721 -2676271 -2684132 -2684958 -2696211 -2686037 -2683923 -2670155 -2667721 -2661378 -2659820 -2662410
8436b662410m544r335q432J501O486K633k076N063o055J2598l649m395J8348J7342
$$ -2662410 -2666954 -2676289 -2684721 -2683220 -2676734 -2674101 -2676177 -2671114 -2677169 -2664571 -2668220 -2672615 -2654267 -2636925
8422b636925j451L687R428J0969K422j8169P378M948n085J158k518J2690J1300
$$ -2636925 -2638376 -2634689 -2625261 -2614292 -2611870 -2630039 -2622661 -2617713 -2622798 -2621640 -2624158 -2611468 -2600168
8409b600168k3347r899K4584J3753Q078q70k3918k9490k2472j9812J1357N537
$$ -2600168 -2623515 -2633414 -2608830 -2595077 -2586999 -2587869 -2611787 -2641277 -2663749 -2683561 -2672204 -2666667
8397b666667m899J3833J9724LM428k0862K3689J2813k504j2487K2769J1076o755
$$ -2666667 -2671566 -2657733 -2638009 -2638006 -2633578 -2654440 -2630751 -2617938 -2620442 -2632929 -2610160 -2599084 -2605839
8384b605839j04K0529J1197P332j308n919k0910l501Q886J7603Q941q66J3918
$$ -2605839 -2605943 -2585414 -2574217 -2566885 -2568193 -2574112 -2595022 -2598523 -2589637 -2572034 -2563093 -2563959 -2550041
8371b550041r057j6025k0812J0251j3933J0060J8j712p396Q387J0706j6482j0984
$$ -2550041 -2559098 -2575123 -2595935 -2585684 -2599617 -2589557 -2589539 -2591251 -2598647 -2590260 -2579554 -2596036 -2607020
8358b607020J0749Q601M344o959L704J4019R231O254l218l658o666M429j085L386
$$ -2607020 -2596271 -2587670 -2583326 -2590285 -2586581 -2572562 -2563331 -2557077 -2560295 -2563953 -2570619 -2566190 -2567275 -2563889
8344b563889J2203P166R948M821L971O475l013n888p31N246J0993j2128m628N468
$$ -2563889 -2551686 -2544520 -2534572 -2529751 -2525780 -2519305 -2522318 -2528206 -2528937 -2523691 -2512698 -2524826 -2529454 -2523986
8330b523986j5093N364J2553L117K0983J664K281K537r687n249r67K539J7260
$$ -2523986 -2539079 -2533715 -2521162 -2518045 -2497062 -2495398 -2493117 -2490580 -2500267 -2505516 -2506483 -2503944 -2486684
8317b486684p601o513l507k9902R884L983k3J2886M974J5845l208J3228n402K480
$$ -2486684 -2494285 -2500798 -2504305 -2534207 -2524323 -2520340 -2520363 -2507477 -2502503 -2486658 -2489866 -2476638 -2482040 -2479560
8303b479560j3352j1520M143k161O560J2815o043R567K7279M869O340j6585j1939
$$ -2479560 -2492912 -2504432 -2500289 -2502450 -2495890 -2483075 -2489118 -2479551 -2452272 -2447403 -2441063 -2457648 -2469587
8290b469587j2949k4073q686K1152K0148J3193j3635Q584m183k464l897K3596
$$ -2469587 -2482536 -2506609 -2515295 -2494143 -2473995 -2460802 -2474437 -2465853 -2470036 -2472500 -2476397 -2452801
8278b452801M109O189o876j3683m238J6160p929j1834Q949J2395m812j9054N338
$$ -2452801 -2448692 -2442503 -2449379 -2463062 -2467300 -2451140 -2459069 -2470903 -2461954 -2449559 -2454371 -2473425 -2468087
8265b468087J0450J2378J3554k992N237J380j2979j010M020q967P269k074j1857
$$ -2468087 -2457637 -2445259 -2431705 -2434697 -2429460 -2428080 -2441059 -2442069 -2438049 -2447016 -2439747 -2441821 -2453678
8252b453678O837l822J6284L082m43N552J540j6797Q017j321J8444K0708J386
$$ -2453678 -2446841 -2450663 -2434379 -2431297 -2431740 -2426188 -2424648 -2441445 -2433428 -2434749 -2416305 -2395597 -2394211
8239b394211j986k694l310K516J0893K2879l1649l5602J276Q188N214m733J9286
$$ -2394211 -2396197 -2398891 -2402201 -2399685 -2388792 -2365913 -2397562 -2433164 -2431888 -2423700 -2418486 -2423219 -2403933
8226b403933L727k0187k2350R737J759K082J004J0260K4255K3560P272J0138m198
$$ -2403933 -2400206 -2420393 -2442743 -2433006 -2431247 -2429165 -2428161 -2417901 -2393646 -2370086 -2362814 -2352676 -2356874
8213b356874m969j2533M333P176l774l310l648K429m997q055J3822Q971k075M866
$$ -2356874 -2361843 -2374376 -2370043 -2362867 -2366641 -2369951 -2373599 -2371170 -2376167 -2384222 -2370400 -2361429 -2363504 -2358638
8199b358638J0467J3488O104M044p857j4524n309O5Q730j0079M067R004K703k0880
$$ -2358638 -2348171 -2334683 -2328579 -2324535 -2332392 -2346916 -2352225 -2352160 -2343430 -2353509 -2349442 -2340438 -2337735 -2358615
8185b358615r088K4919J5122Q66m118j782J378M152o307l590m897J8479P052l683
$$ -2358615 -2367703 -2342784 -2327662 -2326796 -2330914 -2332696 -2331318 -2327166 -2333473 -2337063 -2341960 -2323481 -2316429 -2320112
8171b320112k464l788j8980m06L5964K9586O980L9K043k337l1619K412J4638J3195
$$ -2320112 -2322576 -2326364 -2345344 -2345750 -2309786 -2280200 -2273220 -2273181 -2271138 -2273475 -2305094 -2302682 -2288044 -2274849
8157b274849J1493o47j997J8223N821N828N95K330k5212n7897m3702m1448j89
$$ -2274849 -2263356 -2264003 -2266000 -2247777 -2241956 -2236128 -2235533 -2233203 -2258415 -2316312 -2360014 -2401462 -2401651
8144b401651J1815M459J9923J9470j2092J3547K0539o736J2334M917l908J5345
$$ -2401651 -2389836 -2385377 -2365454 -2345984 -2358076 -2344529 -2323990 -2330726 -2318392 -2313475 -2317383 -2302038
8132b302038K8257j1463p717K1944P762j5568J1463r774q03k101q486l105P621
$$ -2302038 -2273781 -2285244 -2292961 -2271017 -2263255 -2278823 -2267360 -2277134 -2277937 -2280038 -2288524 -2291629 -2284008
8119b284008L124J0084J1198K4827K5060L125J931K5381K6884k063k4244m2196
$$ -2284008 -2280884 -2270800 -2259602 -2234775 -2209715 -2206590 -2204659 -2179278 -2152394 -2154457 -2178701 -2220897
8107b220897m9765l3071k160p660N785K3471J1380Q070N370o079K744m076m770
$$ -2220897 -2270662 -2303733 -2305893 -2313553 -2307768 -2284297 -2272917 -2264847 -2259477 -2265556 -2262812 -2266888 -2271658
8094b271658J8549J9949P503l245j1848m22J4647K0719L582M903l794n844N99
$$ -2271658 -2253109 -2233160 -2225657 -2228902 -2240750 -2241172 -2226525 -2205806 -2202224 -2197321 -2201115 -2206959 -2206360
8081b206360r578l225N051J2331m762P972r254m024J3437J8980j2368j4007P570
$$ -2206360 -2215938 -2219163 -2214112 -2201781 -2206543 -2198571 -2207825 -2211849 -2198412 -2179432 -2191800 -2205807 -2198237
8068b198237J4982j0779K2008K4384j0767L768L381R47L733j4652R01Q177j5997
$$ -2198237 -2183255 -2194034 -2172026 -2147642 -2158409 -2154641 -2151260 -2150313 -2146580 -2161232 -2160331 -2152154 -2168151
8055b168151O214J5189P172N097K7819K1317o9q039Q884J8387K5495J595j0861
$$ -2168151 -2161937 -2146748 -2139576 -2134479 -2106660 -2085343 -2085412 -2093451 -2084567 -2066180 -2040685 -2039090 -2049951
8042b049951j9746R12P38L081q944k3648k2566J2736L620Q779j4033j3625o777
$$ -2049951 -2069697 -2068785 -2068047 -2064966 -2073910 -2097558 -2120124 -2107388 -2103768 -2094989 -2109022 -2122647 -2129424
8029b129424k529j6958P255j1615j5547k300J931J2505J2942Q273J1706J0140
$$ -2129424 -2131953 -2148911 -2141656 -2153271 -2168818 -2171118 -2169187 -2156682 -2143740 -2135467 -2123761 -2113621
8017b113621J0130m445k198J2645J4476J1477k918P029K5193L4717L2172K1156
$$ -2113621 -2103491 -2107936 -2110134 -2097489 -2083013 -2071536 -2074454 -2067425 -2042232 -2007515 -1975343 -1954187
8005a954187K0597K3421N290K0615K9931Q067k1016q5735j58223j38570j08590
$$ -1954187 -1933590 -1910169 -1904879 -1884264 -1854333 -1846266 -1867282 -1953017 -2111240 -2249810 -2358400
7994b358400m8085M145M0761L3644M2037N3736M5328M926j9610m6440r1139p8248
$$ -2358400 -2406485 -2402340 -2361579 -2327935 -2285898 -2232162 -2186834 -2181908 -2201518 -2247958 -2339097 -2417345
7982b417345m6456k886L4961L5794J0715L8240K3501m223O22L0220J7183R479
$$ -2417345 -2463801 -2466687 -2431726 -2395932 -2385217 -2346977 -2323476 -2327699 -2327077 -2296857 -2279674 -2270195
7970b270195J1476K1590J6553l617P720K4393P295J1596k950N645K6312P834J1425
$$ -2270195 -2258719 -2237129 -2220576 -2224193 -2216473 -2192080 -2184785 -2173189 -2176139 -2170494 -2144182 -2136348 -2124923
7957b124923K3312n966o873k7919n5938p5444k6766m4361j5480K6440J5261J3940
$$ -2124923 -2101611 -2107577 -2114450 -2142369 -2198307 -2273751 -2300517 -2344878 -2360358 -2333918 -2318657 -2304717
7945b304717J2187n585o4391q1677o1450j4415J9198K4777K5893l940J862J5472
$$ -2304717 -2292530 -2298115 -2362506 -2444183 -2505633 -2520048 -2500850 -2476073 -2450180 -2454120 -2452258 -2436786
7933b436786K5634L2929J4754m20J8309J4573p484K334m554R803K1798J2502j00
$$ -2436786 -2411152 -2378223 -2363469 -2363889 -2345580 -2331007 -2338491 -2336157 -2340711 -2330908 -2309110 -2296608 -2296708
7920b296708m769O196J4449J0632P718K3204N830k7435k4114k2177k7409J1160
$$ -2296708 -2301477 -2295281 -2280832 -2270200 -2262482 -2239278 -2233448 -2260883 -2284997 -2307174 -2334583 -2323423
7908b323423m345j0630J2926k794p09K4476o021j9486K503K109Q882K0673J4927
$$ -2323423 -2327768 -2338398 -2325472 -2328266 -2328975 -2304499 -2310520 -2330006 -2327503 -2325394 -2316512 -2295839 -2280912
7895b280912j083K806r427o339J1202J0343N667j07L0087L585j0060j6568j9161
$$ -2280912 -2281995 -2279189 -2288616 -2294955 -2283753 -2273410 -2267743 -2267850 -2237763 -2234178 -2244238 -2260806 -2279967
7882b279967j7092j1776q348K3832N467p920N920K0409K640n359P736M571M53
$$ -2279967 -2297059 -2308835 -2317183 -2293351 -2287884 -2295804 -2289884 -2269475 -2266835 -2272194 -2264458 -2259887 -2259434
7869b259434o727K1244Q780q066j4329K6286J0038J520J4944J0178j4037l211
$$ -2259434 -2266161 -2244917 -2236137 -2244203 -2258532 -2232246 -2222208 -2220688 -2205744 -2195566 -2209603 -2212814
7857b212814K3941n90o425R713J8041k663o020o151O787p273K01k015R032n719
$$ -2212814 -2188873 -2189463 -2195888 -2186175 -2168134 -2170797 -2176817 -2182968 -2176181 -2183454 -2183253 -2185268 -2176236 -2181955
7843b181955o882L383J3993J139K085M70j1033K904q14j8287M03j363Q748J4503
$$ -2181955 -2188837 -2185454 -2171461 -2170322 -2168237 -2167767 -2178800 -2175896 -2176710 -2194997 -2194594 -2195957 -2187209 -2172706
7829b172706J1530j5259j3086J0073J9621J5629o39k039j629L144n539L86j773
$$ -2172706 -2161176 -2176435 -2189521 -2179448 -2159827 -2144198 -2144837 -2146876 -2148505 -2145361 -2150900 -2150514 -2152287
7816b152287q495l664K4916K1083K1203o002p279r689q231j2165J2662R820r696
$$ -2152287 -2160782 -2164446 -2139530 -2118447 -2097244 -2103246 -2110525 -2120214 -2128445 -2140610 -2127948 -2118128 -2127824
7803b127824o143m679N904J72K2133J2429N829j1448j4247m089J3902l373m122
$$ -2127824 -2133967 -2138646 -2132742 -2132570 -2110437 -2098008 -2092179 -2103627 -2117874 -2121963 -2108061 -2111434 -2115556
7790b115556m335J1997r656n430K961J4482J5783k2791l496j3360j2019J392J0188
$$ -2115556 -2119891 -2107894 -2117550 -2122980 -2120019 -2105537 -2089754 -2112545 -2116041 -2129401 -2141420 -2140028 -2129840
7777b129840J8481J994N659K9597L676l031n803j7131k486j9671j7552Q503J7321
$$ -2129840 -2111359 -2109365 -2103706 -2074109 -2070433 -2073464 -2079267 -2096398 -2098884 -2118555 -2136107 -2127604 -2110283
7764b110283K2593L579j0217o061J267J4754m09N719R622j1348P863O33k2116
$$ -2110283 -2087690 -2084111 -2094328 -2100389 -2099122 -2084368 -2084777 -2079058 -2069436 -2080784 -2072921 -2072288 -2094404
7751b094404J389m28J0390j3357k359J9540J6311k6112j3905K0259j721l652J4440
$$ -2094404 -2093015 -2093443 -2083053 -2096410 -2098769 -2079229 -2062918 -2089030 -2102935 -2082676 -2084397 -2088049 -2073609
7738b073609K3001j0938j266P595q438J766p190P490K2125j921k2738j38N123
$$ -2073609 -2050608 -2061546 -2062812 -2055217 -2063655 -2061889 -2069079 -2061589 -2039464 -2041385 -2064123 -2064261 -2059138
7725b059138L4j274k1887K3425Q897o205J093K3438O520j497k7025j1522K7l537
$$ -2059138 -2059104 -2060378 -2082265 -2058840 -2049943 -2056148 -2055055 -2031617 -2025097 -2026594 -2053619 -2065141 -2065114 -2068651
7711b068651M750j227J4678J5610j0711o620N894J7295J4093J3498R487j537j1733
$$ -2068651 -2063901 -2065128 -2050450 -2034840 -2045551 -2052171 -2046277 -2028982 -2014889 -2001391 -1991904 -1993441 -2005174
7698b005174j9866O301o456l57J4417j263J248k1030j0281k440J0430K4596J6799
$$ -2005174 -2025040 -2018739 -2025195 -2025552 -2011135 -2012398 -2011150 -2032180 -2042461 -2044901 -2034471 -2009875 -1993076
7685a993076m038k0862k719j616j9282J2362M2168K155j0483m175K518l802k594
$$ -1993076 -1997114 -2017976 -2020695 -2022311 -2041593 -2029231 -1987063 -1984908 -1995391 -1999566 -1997048 -2000850 -2003444
7672b003444q850J7499J5883R885O121n732j665k6920m584p830l735j1275p149
$$ -2003444 -2012294 -1994795 -1978912 -1969027 -1962906 -1968638 -1970303 -1997223 -2001807 -2009637 -2013372 -2024647 -2031796
7659b031796p469J682J4871N249J6756P704j4316P776R263k538j1760j0817Q856
$$ -2031796 -2039265 -2037583 -2022712 -2017463 -2000707 -1993003 -2007319 -1999543 -1990280 -1992818 -2004578 -2015395 -2006539
7646b006539R345J0238R360O039j374n161j5978r593J052P427M149J4648p802
$$ -2006539 -1997194 -1986956 -1977596 -1971557 -1972931 -1978092 -1994070 -2003663 -2002611 -1995184 -1991035 -1976387 -1984189
7633a984189r032r998P627K471j415P557p363P162J2004M198P164M489K478J0934
$$ -1984189 -1993221 -2003219 -1995592 -1993121 -1994536 -1986979 -1994342 -1987180 -1975176 -1970978 -1963814 -1959325 -1956847 -1945913
7619a945913P388q888O058Q893p935k1725r359k454L20J886J2963J6610P213J2470
$$ -1945913 -1938525 -1947413 -1941355 -1932462 -1940397 -1962122 -1971481 -1973935 -1973615 -1971729 -1958766 -1942156 -1934943 -1922473
7605a922473K348k6150l14O474o443k6537j4354K3139K2663o981j0080J0966J2310
$$ -1922473 -1920125 -1946275 -1946589 -1940115 -1946558 -1973095 -1987449 -1964310 -1941647 -1948628 -1958708 -1947742 -1935432
7592a935432J0208J0711j2498O650j9683k0716j4298O570R198L251P348o581m206
$$ -1935432 -1925224 -1914513 -1927011 -1920361 -1940044 -1960760 -1975058 -1968488 -1959290 -1956039 -1948691 -1955272 -1959478
7579a959478J5137Q691m948n313Q502Q221j1960j0640o54l713N357O608O108n562
$$ -1959478 -1944341 -1935650 -1940598 -1945911 -1937409 -1929188 -1941148 -1951788 -1952442 -1956155 -1950798 -1944190 -1938082 -1943644
7565a943644k6203J7795K4457M662p1O575r123p066o712j531M087o946L776Q866
$$ -1943644 -1969847 -1952052 -1927595 -1922933 -1923004 -1916429 -1925552 -1932618 -1939330 -1940861 -1936774 -1943720 -1939944 -1931078
7551a931078J1252j431o184q397Q370j519p820n501J3816j1540p493r01J0707
$$ -1931078 -1919826 -1921257 -1927441 -1935838 -1927468 -1928987 -1936807 -1942308 -1928492 -1940032 -1947525 -1948426 -1937719
7538a937719Q791K1154p588l499J2400j3822k2685K0467J9503p179J1308L140
$$ -1937719 -1928928 -1907774 -1915362 -1918861 -1906461 -1920283 -1942968 -1922501 -1902998 -1910177 -1898869 -1895729
7526a895729j1823o332j4950J506J2015J5159L093O916j0037j5127o290R919K4727
$$ -1895729 -1907552 -1913884 -1928834 -1927328 -1915313 -1900154 -1897061 -1890145 -1900182 -1915309 -1921599 -1911680 -1886953
7513a886953k202Q496J5992l547j5406j4071M205K4719m1k0728M718k355k8046
$$ -1886953 -1889155 -1880659 -1864667 -1868214 -1883620 -1897691 -1893486 -1868767 -1868808 -1889536 -1884818 -1887173 -1915219
7500a915219J8188k14j387m791j2431K943K5002J3220k288p778L347J6894o315
$$ -1915219 -1897031 -1897245 -1898632 -1903423 -1915854 -1912911 -1887909 -1874689 -1876977 -1884755 -1881408 -1864514 -1870829
7487a870829K563j1053j3388J4973j2340q622L154j6778j0378k783j874O063J9527
$$ -1870829 -1868266 -1879319 -1892707 -1877734 -1890074 -1898696 -1895542 -1912320 -1922698 -1925481 -1927355 -1921292 -1901765
7474a901765J4952P901k1244r454O554M321L208k164k699N860L806Q775J0157
$$ -1901765 -1886813 -1878912 -1900156 -1909610 -1903056 -1898735 -1895527 -1897691 -1900390 -1894530 -1890724 -1881949 -1871792
7461a871792j01l2295j3224K0779q70L202J3118j0044J2670J1540j470r269J5801
$$ -1871792 -1871893 -1904188 -1917412 -1896633 -1897503 -1894301 -1881183 -1891227 -1878557 -1867017 -1868487 -1877756 -1861955
7448a861955M342K557k230O641k567N753J1378J08Q793M661j0132q843K017m595
$$ -1861955 -1857613 -1855056 -1857286 -1850645 -1853212 -1847459 -1836081 -1835973 -1827180 -1822519 -1832651 -1841494 -1839477 -1844072
7434a844072J4722j2675j3894J8160o613n992J2344O675j9445J4164n025j681
$$ -1844072 -1829350 -1842025 -1855919 -1837759 -1844372 -1850364 -1838020 -1831345 -1850790 -1836626 -1841651 -1843332
7422a843332R701n874j026O176o08j0449j298P490L163J904j3210K4554J8385
$$ -1843332 -1833631 -1839505 -1840531 -1834355 -1834963 -1845412 -1846710 -1839220 -1836057 -1834153 -1847363 -1822809 -1804424
7409a804424q359l558k52l495j2522p113r496J4288K9161r670j0861L283n342
$$ -1804424 -1812783 -1816341 -1816593 -1820088 -1832610 -1839723 -1849219 -1834931 -1805770 -1815440 -1826301 -1823018 -1828360
7396a828360N800m539j181M421o49o952K311Q116L1284R089j3679k9551m413K2068
$$ -1828360 -1822560 -1827099 -1828280 -1823859 -1824508 -1831460 -1829149 -1821033 -1789749 -1780660 -1794339 -1823890 -1828303 -1806235
7382a806235J577o591n155K2930m984j2404l314R416P252N460j25q519j8959Q066
$$ -1806235 -1804658 -1811249 -1816404 -1793474 -1798458 -1810862 -1814176 -1804760 -1797508 -1792048 -1792173 -1800692 -1819651 -1811585
7368a811585J3799q395j4964K188o937j89J6744P867l0566j9164K4179O440M868
$$ -1811585 -1797786 -1806181 -1821145 -1818957 -1825894 -1826083 -1809339 -1801472 -1832038 -1851202 -1827023 -1820583 -1815715
7355a815715M442J6340q301m775Q449N62J714O122q135j7134l451N634Q017l667
$$ -1815715 -1811273 -1794933 -1803234 -1808009 -1799560 -1798998 -1797284 -1791162 -1799297 -1816431 -1819882 -1814248 -1806231 -1809898
7341a809898l621J1816j080j3801j7288J4061r38q841K0407J1398L787J2916l785
$$ -1809898 -1813519 -1801703 -1802783 -1816584 -1833872 -1819811 -1820749 -1829590 -1809183 -1797785 -1793998 -1781082 -1784867
7328a784867l5359o207J1211j363l495J7526J42J2421J4528J27o752m080J9585
$$ -1784867 -1820226 -1826433 -1815222 -1816585 -1820080 -1802554 -1802412 -1789991 -1775463 -1775336 -1782088 -1786168 -1766583
7315a766583J425n338O141k170J1091j6602q277r195r420K7405M837m686L911
$$ -1766583 -1765158 -1770496 -1764355 -1766525 -1755434 -1772036 -1780313 -1789508 -1798928 -1771523 -1766686 -1771372 -1767461
7302a767461N351J6049j9144m51J1425j507k6702o50K0573J3566J5774n476j3303
$$ -1767461 -1762110 -1746061 -1765205 -1765656 -1754231 -1755738 -1782440 -1783090 -1762517 -1748951 -1733177 -1738653 -1751956
7289a751956k0467j1099O245n614o865j478J7289J2685m222N027J1282m247k349
$$ -1751956 -1772423 -1783522 -1777277 -1782891 -1789756 -1791234 -1773945 -1761260 -1765482 -1760455 -1749173 -1753420 -1755769
7276a755769n064j0624j504J0459K3505n707l355j9281q566q562o401J4814J7282
$$ -1755769 -1760833 -1771457 -1772961 -1762502 -1738997 -1744704 -1748059 -1767340 -1775906 -1784468 -1790869 -1776055 -1758773
7263a758773n581j3115l479J3489J7911n809n69r657R90O539Q362J7799J7075
$$ -1758773 -1764354 -1777469 -1780948 -1767459 -1749548 -1755357 -1755926 -1765583 -1764593 -1758054 -1749692 -1731893 -1714818
7250a714818o591l619J0064m101j3576L71k880j4321k7143J2193K476J0943j37
$$ -1714818 -1721409 -1725028 -1714964 -1719065 -1732641 -1732270 -1735150 -1749471 -1776614 -1764421 -1761945 -1751002 -1751139
7237a751139p221m594P608J7325Q531p382j627k7012j162K059o398N467m188O855
$$ -1751139 -1758360 -1762954 -1755346 -1738021 -1729490 -1736872 -1738499 -1765511 -1766673 -1764614 -1771012 -1765545 -1769733 -1762878
7223a762878J3043K4353J5657J1101L208l2143l023L157j3590o032k5K8812L78
$$ -1762878 -1749835 -1725482 -1709825 -1698724 -1695516 -1727659 -1730682 -1727525 -1741115 -1747147 -1747172 -1718360 -1717982
7210a717982M290P176k870N523J0787m082q797j6992Q178K279j5096n086j2197
$$ -1717982 -1713692 -1706516 -1709386 -1703863 -1693076 -1697158 -1705955 -1722947 -1714769 -1712490 -1727586 -1732672 -1744869
7197a744869J596l135j7710L3299K6099l070l1547k356N078J7069J7787J6024
$$ -1744869 -1743273 -1746408 -1764118 -1730819 -1704720 -1707790 -1739337 -1741693 -1736615 -1719546 -1701759 -1685735
7185a685735L249r445o694p501k1290q69p750K2559J6616r953j1812n800K1911
$$ -1685735 -1682486 -1691931 -1698625 -1706126 -1727416 -1728285 -1736035 -1713476 -1696860 -1706813 -1718625 -1724425 -1702514
7172a702514j0573O091P677J011j9803k2106J8280J2895K797l94j9281j0558J6099
$$ -1702514 -1713087 -1706996 -1699319 -1698308 -1718111 -1740217 -1721937 -1709042 -1706245 -1706639 -1725920 -1736478 -1720379
7159a720379J8944j2537l0819J567K2614M505r24N860m110J1283L78k478q49l89
$$ -1720379 -1701435 -1713972 -1744791 -1743224 -1720610 -1716105 -1717029 -1711169 -1715279 -1703996 -1703618 -1706096 -1706945 -1707334
7145a707334k6075J3272J3773p83N342J1659K0212j594j5878n859j3048l0142
$$ -1707334 -1733409 -1720137 -1706364 -1707147 -1701805 -1690146 -1669934 -1671528 -1687406 -1693265 -1706313 -1736455
7133a736455J0917Q167L645M882J9040J6567j720K360L762M10N538J679j2153
$$ -1736455 -1725538 -1717371 -1713726 -1708844 -1689804 -1673237 -1674957 -1672597 -1668835 -1668425 -1662887 -1661208 -1673361
7120a673361k2271J1979J4098k2223R233N729J3930Q867M97j0865j0676R70K3285
$$ -1673361 -1695632 -1683653 -1669555 -1691778 -1682545 -1676816 -1662886 -1654019 -1653522 -1664387 -1675063 -1674093 -1650808
7107a650808k930M615N693m6226j3144J2604L323J8205J0611p440m304K793Q846
$$ -1650808 -1653738 -1649123 -1643430 -1689656 -1702800 -1690196 -1686873 -1668668 -1658057 -1665497 -1669801 -1667008 -1658162
7094a658162j875m490L342j514j0792M723l730q7J1572j2379k143J0803m652J0010
$$ -1658162 -1660037 -1664527 -1661185 -1662699 -1673491 -1668768 -1672498 -1672585 -1661013 -1673392 -1675535 -1664732 -1669384 -1659374
7080a659374P572J321J0781K564j4763n303l5j1974l664K3608K202n755k0431
$$ -1659374 -1651802 -1650481 -1639700 -1637136 -1651899 -1657202 -1657237 -1669211 -1672875 -1649267 -1647065 -1652820 -1673251
7067a673251r504L8142l526q914m017o405j5424L098J0240L543o428M168q7n627
$$ -1673251 -1682755 -1644613 -1648139 -1657053 -1661070 -1667475 -1682899 -1679801 -1669561 -1666018 -1672446 -1668278 -1668365 -1673992
7053a673992J8225L993j1137j0224J817K0763j413L634J0062j0243j6491p24P281
$$ -1673992 -1655767 -1651774 -1662911 -1673135 -1671318 -1650555 -1651968 -1648334 -1638272 -1648515 -1665006 -1665730 -1658449
7040a658449l645n690N817m659J0560J0236K2654K2062q879j2922q00o839r31
$$ -1658449 -1662094 -1667784 -1661967 -1666626 -1656066 -1645830 -1623176 -1601114 -1609993 -1622915 -1623715 -1630554 -1631485
7027a631485j1777j6024n772j1828J7555J1263Q44m418r417j8030Q162J8088l55
$$ -1631485 -1643262 -1659286 -1665058 -1676886 -1659331 -1648068 -1647224 -1651642 -1661059 -1679089 -1670927 -1652839 -1653194
7014a653194p724L113n954K4544K1483m568j3364M871J1750j7393p104J2324R671
$$ -1653194 -1660918 -1657805 -1663759 -1639215 -1617732 -1622300 -1635664 -1630793 -1619043 -1636436 -1643540 -1631216 -1621545
7001a621545k836J804j4942J085j0668k946J5469K5580r699k03J5457N411k5771
$$ -1621545 -1624381 -1622577 -1637519 -1636434 -1647102 -1650048 -1634579 -1608999 -1618698 -1618901 -1603444 -1598033 -1623804
6988a623804r797m795O473p817j2313J4706J5589L13p934J5600j67p552P123J39
$$ -1623804 -1633601 -1638396 -1631923 -1639740 -1652053 -1637347 -1621758 -1621445 -1629379 -1613779 -1613946 -1621498 -1614375 -1614236
6974a614236j4365j2721L92R234J3497J264J311o435j4465q923M809O947J0366
$$ -1614236 -1628601 -1641322 -1640930 -1631696 -1618199 -1616935 -1615624 -1622059 -1636524 -1645447 -1640638 -1633691 -1623325
6961a623325k742n899J1816J5053M560L334r07J079O082j1751m139j435j866m965
$$ -1623325 -1626067 -1631966 -1620150 -1605097 -1600537 -1597203 -1598110 -1597031 -1590949 -1602700 -1606839 -1608274 -1610140 -1615105
6947a615105j6508J2948m960O712l261J7331K6074k6006J459L1634k4244j5629
$$ -1615105 -1631613 -1618665 -1623625 -1616913 -1620174 -1602843 -1576769 -1602775 -1601316 -1569682 -1593926 -1609555
6935a609555r26J4164O330k2529j685K2856J0639N880j7091r887k5027K885J9975
$$ -1609555 -1610481 -1596317 -1589987 -1612516 -1614201 -1591345 -1580706 -1574826 -1591917 -1601804 -1626831 -1623946 -1603971
6922a603971J576K1701M562J5682j0536j5655K18K277r072k628l662J5664n455
$$ -1603971 -1602395 -1580694 -1576132 -1560450 -1570986 -1586641 -1586423 -1584146 -1593218 -1595846 -1599508 -1583844 -1589299
6909a589299l218N745j5769l663J825j2132l232l445K5906L4382J7813O516p075
$$ -1589299 -1592517 -1586772 -1602541 -1606204 -1604379 -1616511 -1619743 -1623188 -1597282 -1562900 -1545087 -1538571 -1545646
6896a545646k4216j8181K047M160j9875j7604n371M131J819J8714J7759J1902
$$ -1545646 -1569862 -1588043 -1585996 -1581836 -1601711 -1619315 -1624686 -1620555 -1618736 -1600022 -1582263 -1570361
6884a570361N891j0151o571r549J4373J3059R389j8380q245M107j8363k553N622
$$ -1570361 -1564470 -1574621 -1581192 -1590741 -1576368 -1563309 -1553920 -1572300 -1580545 -1576438 -1594801 -1597354 -1591732
6871a591732O806O016J689j3862O43J5298N19q977q642J3650J2218Q856l908k208
$$ -1591732 -1584926 -1578910 -1577221 -1591083 -1590440 -1575142 -1574623 -1583600 -1592242 -1578592 -1566374 -1557518 -1561426 -1563634
6857a563634q27n004q256r601O407j1748K1196j035K7561Q544j1868q794k1j5884
$$ -1563634 -1564461 -1569465 -1577721 -1587322 -1580915 -1592663 -1571467 -1572502 -1544941 -1536397 -1548265 -1557059 -1557080 -1572964
6843a572964O649Q437l162j388k1M946r111j460R239j150J0995J2327j2754n716
$$ -1572964 -1566315 -1557878 -1561040 -1562428 -1562449 -1557503 -1566614 -1568074 -1558835 -1559985 -1548990 -1536663 -1549417 -1555133
6829a555133q479l907j7814j8681R645M074M025N605N689J4898N731J1202j1164
$$ -1555133 -1563612 -1567519 -1585333 -1604014 -1594369 -1590295 -1586270 -1580665 -1574976 -1560078 -1554347 -1543145 -1554309
6816a554309j4534j432P762J3942Q836Q391Q949j7711k4872J112P867N745k931
$$ -1554309 -1568843 -1570275 -1562513 -1548571 -1539735 -1531344 -1522395 -1540106 -1564978 -1563866 -1555999 -1550254 -1553185
6803a553185K998J0112j5792m970j909M637K264J3884J1642j5864p998N406R061
$$ -1553185 -1550187 -1540075 -1555867 -1560837 -1562746 -1558109 -1555845 -1541961 -1530319 -1546183 -1554181 -1548775 -1539714
6790a539714o657p506j023J0482J6023p110J0215P84j0146p838j224J537J7642
$$ -1539714 -1546371 -1553877 -1554900 -1544418 -1528395 -1535505 -1525290 -1524506 -1534652 -1542490 -1543714 -1542177 -1524535
6777a524535j8415k3250O217q911j1083J0677K6304J6799p809o049J2714N25J435
$$ -1524535 -1542950 -1566200 -1559983 -1568894 -1579977 -1569300 -1542996 -1526197 -1534006 -1540055 -1527341 -1526816 -1525381
6764a525381R125M623j3339K58J5610j053l5640o571K2673K2749J2633n332K455
$$ -1525381 -1516256 -1511633 -1524972 -1524714 -1509104 -1510157 -1545797 -1552368 -1529695 -1506946 -1494313 -1499645 -1497190
6751a497190p223R87J0494J3472J064j0240M378M099j7308o055P426Q189O84K0955
$$ -1497190 -1504413 -1503426 -1492932 -1479460 -1478396 -1488636 -1484258 -1480159 -1497467 -1503522 -1496096 -1487907 -1487223 -1466268
6737a466268J0761j1050k3763k4812k5620n537L4886R195n219J4655J7250p096
$$ -1466268 -1455507 -1466557 -1490320 -1515132 -1540752 -1546289 -1511403 -1502208 -1507427 -1492772 -1475522 -1482618
6725a482618j1578J2708J3414J2529N371K1365J43k0270j4804O778K2792r050
$$ -1482618 -1494196 -1481488 -1468074 -1455545 -1450174 -1428809 -1428666 -1448936 -1463740 -1456962 -1434170 -1443220
6713a443220j5362r898m0183m4410j4101r433K711J4083Q980Q903N538K4352M104
$$ -1443220 -1458582 -1468480 -1508663 -1553073 -1567174 -1576607 -1573896 -1559813 -1550833 -1541930 -1536392 -1512040 -1507936
6700a507936j7130o053M214J8011k095k0311J1465o759j6013j1968J6626P958
$$ -1507936 -1525066 -1531119 -1526905 -1508894 -1510989 -1531300 -1519835 -1526594 -1542607 -1554575 -1537949 -1529991
6688a529991J5073J7574j720k3699j1765N790j3070P76J1180K5553K948q861j6099
$$ -1529991 -1514918 -1497344 -1499064 -1522763 -1534528 -1528738 -1541808 -1541032 -1529852 -1504299 -1501351 -1510212 -1526311
6675a526311m709m056r012r275J188K1859L993J3834L659J3404P300M78R956q615
$$ -1526311 -1531020 -1535076 -1544088 -1553363 -1552175 -1530316 -1526323 -1512489 -1508830 -1495426 -1488126 -1487648 -1477692 -1486307
6661a486307K090q593r927J1938J6851J6059r159j0134n574j5212j7323J4549
$$ -1486307 -1484217 -1492810 -1502737 -1490799 -1473948 -1457889 -1467048 -1477182 -1482756 -1497968 -1515291 -1500742
6649a500742j1331K525J3649J0461k110k4701p599J0165L504K155J7452M889J349
$$ -1500742 -1512073 -1509548 -1495899 -1485438 -1487548 -1512249 -1519848 -1509683 -1506179 -1504024 -1486572 -1481683 -1480334
6636a480334P621k7995j4131Q457K1989J1058J446j0668j4939L707K046O618O398
$$ -1480334 -1472713 -1500708 -1514839 -1506382 -1484393 -1473335 -1471889 -1482557 -1497496 -1493789 -1491743 -1485125 -1478727
6623a478727k0024Q410J3943K1706L097L303l215j2810j5908p681J3236L32m369
$$ -1478727 -1498751 -1490341 -1476398 -1454692 -1451595 -1448292 -1451507 -1464317 -1480225 -1487906 -1474670 -1474338 -1478707
6610a478707P417J2503N920J579j2203p720L687n591j5537j5843J3113J6566j180
$$ -1478707 -1471290 -1458787 -1452867 -1451288 -1463491 -1471211 -1467524 -1473115 -1488652 -1504495 -1491382 -1474816 -1475996
6597a475996R139j2534l771K2981n106L172R186k0066q356l686j3867n227R304
$$ -1475996 -1466857 -1479391 -1483162 -1460181 -1465287 -1462115 -1452929 -1472995 -1481351 -1485037 -1498904 -1504131 -1494827
6584a494827J6648J0154k083l220p774n195N847P727J5615R103p359l3224K4419
$$ -1494827 -1478179 -1468025 -1470108 -1473328 -1481102 -1486297 -1480450 -1472723 -1457108 -1448005 -1455364 -1488588 -1464169
6571a464169O986j8544P917L0318q247k6280m204J7110J0829q448q466M985j031
$$ -1464169 -1457183 -1475727 -1467810 -1437492 -1445739 -1472019 -1476223 -1459113 -1448284 -1456732 -1465198 -1460213 -1461244
6558a461244J2714j50j1573l825J3698l331q539j8301m51j022L463O604J538L787
$$ -1461244 -1448530 -1448680 -1460253 -1464078 -1450380 -1453711 -1462250 -1480551 -1481002 -1482024 -1478561 -1471957 -1470419 -1466632
6544a466632o088K158J596M618J8588j139q903l224N701Q816J2602k221k7514
$$ -1466632 -1472720 -1470562 -1468966 -1464348 -1445760 -1446899 -1455802 -1459026 -1453325 -1444509 -1431907 -1434128 -1461642
6531a461642r784N911n866j629o405j694K9498J2893m638J9123J9229n767m898
$$ -1461642 -1471426 -1465515 -1471381 -1473010 -1479415 -1481109 -1451611 -1438718 -1443356 -1424233 -1405004 -1410771 -1415669
6518a415669j8400j3126m824j1019r490j7447M820L0489J7201o063j3219O962
$$ -1415669 -1434069 -1447195 -1452019 -1463038 -1472528 -1489975 -1485155 -1454666 -1437465 -1443528 -1456747 -1449785
6506a449785j0311j809j835l420M204O790N568j0382J0660n629m359j368J6307
$$ -1449785 -1460096 -1461905 -1463740 -1467160 -1462956 -1456166 -1450598 -1460980 -1450320 -1455949 -1460308 -1461676 -1445369
6493a445369K5584L009l000j0122J1964J2217n076k6433k9830M317O90l661J3543
$$ -1445369 -1419785 -1416776 -1419776 -1429898 -1417934 -1405717 -1410793 -1437226 -1467056 -1462739 -1462049 -1465710 -1452167
6480a452167K2150p672j3636J4364J2128L268j2642q059M18J3161O112k9645j7855
$$ -1452167 -1430017 -1437689 -1451325 -1436961 -1424833 -1421565 -1434207 -1442266 -1441848 -1428687 -1422575 -1452220 -1470075
6467a470075J5610K5314L409J468P261Q421R8J659M71p717l762J4878M298j9811
$$ -1470075 -1454465 -1429151 -1425742 -1424274 -1417013 -1408592 -1408494 -1406835 -1406364 -1414081 -1417843 -1402965 -1398667 -1418478
6453a418478q157l936M928J6600N726J1970J536L034m074j5999r594P139p718
$$ -1418478 -1426635 -1430571 -1425643 -1409043 -1403317 -1391347 -1389811 -1386777 -1390851 -1406850 -1416444 -1409305 -1417023
6440a417023K1748Q475j357J112r041k3798k810k691q022J3730O663n810j0410
$$ -1417023 -1395275 -1386800 -1388157 -1387045 -1396086 -1419884 -1422694 -1425385 -1433407 -1419677 -1413014 -1418824 -1429234
6427a429234j1040j5532j9898O753J423m909J1241K9762j4744N744n889N387k330
$$ -1429234 -1440274 -1455806 -1475704 -1468951 -1467528 -1472437 -1461196 -1431434 -1446178 -1440434 -1446323 -1440936 -1443266
6414a443266J0653j1995l93O247J5570L0582J6876o687j7540P796n927n248O012
$$ -1443266 -1432613 -1444608 -1445001 -1438754 -1423184 -1392602 -1375726 -1382413 -1399953 -1392157 -1398084 -1403332 -1397320
6401a397320K659l5102j5874K113J1942J2945J0642K2318J8390Q980o661o614
$$ -1397320 -1394661 -1429763 -1445637 -1443524 -1431582 -1418637 -1407995 -1385677 -1367287 -1358307 -1364968 -1371582
6389a371582o876j3741M121q869L080p63j4843M045n920J186Q775q36K0848K3620
$$ -1371582 -1378458 -1392199 -1388078 -1396947 -1393867 -1394630 -1409473 -1405428 -1411348 -1410162 -1401387 -1402223 -1381375 -1357755
6375a357755j3169j5243p982L045J5809J353j8796m885j1078R78R823K2503p27
$$ -1357755 -1370924 -1386167 -1394149 -1391104 -1375295 -1373942 -1392738 -1397623 -1408701 -1407723 -1397900 -1375397 -1376124
6362a376124J0423k636o104j901k715J3814J261Q454J015j4107j7763j886L905
$$ -1376124 -1365701 -1368337 -1374441 -1376342 -1379057 -1365243 -1363982 -1355528 -1354513 -1368620 -1386383 -1388269 -1384364
6349a384364j3103N785Q234J371J112O893J3244k0219k2019j1679K3356K0834
$$ -1384364 -1397467 -1391682 -1383448 -1382077 -1380965 -1374072 -1360828 -1381047 -1403066 -1414745 -1391389 -1370555
6337a370555n388p653j7515J304J7416j3304k097K0249p44r037N642M805P438
$$ -1370555 -1375943 -1383596 -1401111 -1399807 -1382391 -1395695 -1397792 -1377543 -1378287 -1387324 -1381682 -1376877 -1369439
6324a369439r767M650M760j2256n501p260K1920P486l757j011p528k1347j7399
$$ -1369439 -1379206 -1374556 -1369796 -1382052 -1387553 -1394813 -1372893 -1365407 -1369164 -1370175 -1377703 -1399050 -1416449
6311a416449K2617K0743O619l209M561Q242m274p879k853m638r969j2229N423
$$ -1416449 -1393832 -1373089 -1366470 -1369679 -1365118 -1356876 -1361150 -1369029 -1371882 -1376520 -1386489 -1398718 -1393295
6298a393295M09j2689K639P190K1885J7740n773k0243K2986J8099q531j11L081
$$ -1393295 -1392886 -1405575 -1402936 -1395746 -1373861 -1356121 -1361894 -1382137 -1359151 -1341052 -1349583 -1349694 -1346613
6285a346613o584p881r710R389N865m270k7992Q456J4180j380j9872o858J1484
$$ -1346613 -1353197 -1361078 -1370788 -1361399 -1355534 -1359804 -1387796 -1379340 -1365160 -1366540 -1386412 -1393270 -1381786
6272a381786L560r466O036Q007j868Q560N272o123j3596N08R439M465m464j567
$$ -1381786 -1378226 -1387692 -1381656 -1373649 -1375517 -1366957 -1361685 -1367808 -1381404 -1380896 -1371457 -1366992 -1371456 -1373023
6258a373023k756J1954R09l055J863j389j1775j4908j4040K2049J7841J448Q306
$$ -1373023 -1375779 -1363825 -1362916 -1365971 -1364108 -1365497 -1377272 -1392180 -1406220 -1384171 -1366330 -1364882 -1356576
6245a356576j1138j5344j321p399P182N186j3383r958J9993K4528k866J105J6266
$$ -1356576 -1367714 -1383058 -1384379 -1391778 -1384596 -1379410 -1392793 -1402751 -1382758 -1358230 -1361096 -1359991 -1343725
6232a343725j513N439P530nP48J1502L577N607K0185k5995j8699M822j7171j0355
$$ -1343725 -1345238 -1339799 -1332269 -1332274 -1331526 -1320024 -1316447 -1310840 -1290655 -1316650 -1335349 -1330527 -1347698 -1358053
6218a358053Q582P571Q880p81q848n056O504J1762o465j8512j1327q466O702K016
$$ -1358053 -1349471 -1341900 -1333020 -1333801 -1342649 -1347705 -1341201 -1329439 -1335904 -1354416 -1365743 -1374209 -1367507 -1365491
6204a365491L561J3456j79M147P087j1654J4460l075O231k546o468m277k785R017
$$ -1365491 -1361930 -1348474 -1348653 -1344506 -1337419 -1349073 -1334613 -1337688 -1331457 -1334003 -1340471 -1344748 -1347533 -1338516
6190a338516Q628K656o74k049p135j5399R311q728o287K1737q06n748N678o89
$$ -1338516 -1329888 -1327232 -1327906 -1329955 -1337090 -1352489 -1343178 -1351906 -1358193 -1336456 -1337262 -1343010 -1337332 -1338021
6176a338021p684M252J512J7627M845j7192j2181R965J8772J4019j3895j3183
$$ -1338021 -1345705 -1341453 -1339941 -1322314 -1317469 -1334661 -1346842 -1336877 -1318105 -1304086 -1317981 -1331164
6164a331164j8737J8745j96j4984q92J5232O773r994p754j3180R717R04M586J9573
$$ -1331164 -1349901 -1331156 -1331352 -1346336 -1347228 -1331996 -1325223 -1335217 -1342971 -1356151 -1346434 -1345530 -1340944 -1321371
6150a321371J2867K6697k829k8675j5552K824R978j1331k422J806K84j2230o548
$$ -1321371 -1308504 -1281807 -1284636 -1313311 -1328863 -1326039 -1316061 -1327392 -1329814 -1328008 -1327724 -1339954 -1346502
6137a346502J499J343p767l408O599J1022M507J9664q822k544q592J0377R039
$$ -1346502 -1345003 -1343660 -1351427 -1354835 -1348236 -1337214 -1332707 -1313043 -1321865 -1324409 -1333001 -1322624 -1313585
6124a313585j3927j5543J2092O149k314M537j599j5633n916R835K2952P519J389
$$ -1313585 -1327512 -1343055 -1330963 -1324814 -1327128 -1322591 -1324190 -1339823 -1345739 -1335904 -1312952 -1305433 -1304044
6111a304044J1066Q068r000N760N394q325j360p547k4360K784J2460K1868r324
$$ -1304044 -1292978 -1284910 -1293910 -1288150 -1282756 -1291081 -1292441 -1299988 -1324348 -1321564 -1309104 -1287236 -1296560
6098a296560j7610O647J1140P904R897k2264M281o976j9200k5928J866J0733l528
$$ -1296560 -1314170 -1307523 -1296383 -1288479 -1278582 -1300846 -1296565 -1303541 -1322741 -1348669 -1346803 -1336070 -1339598
6085a339598Q709J4925Q350O031n514j4855J0178O546P171o514j6744J4642M76
$$ -1339598 -1330889 -1315964 -1307614 -1301583 -1307097 -1321952 -1311774 -1305228 -1298057 -1304571 -1321315 -1306673 -1306197
6072a306197P666p725r556O048M306j0064K685J8221j7944j4542J4088K718L77
$$ -1306197 -1298531 -1306256 -1315812 -1309764 -1305458 -1315522 -1312837 -1294616 -1312560 -1327102 -1313014 -1310296 -1309919
6059a309919k2004j3485J1188J0260L373P124l025L869m52K480j172J6034j2773
$$ -1309919 -1331923 -1345408 -1334220 -1323960 -1320587 -1313463 -1316488 -1312619 -1313071 -1310591 -1311763 -1295729 -1308502
6046a308502k790K717M130p312o820O614K9238J7867k4174j2575j765o627k857
$$ -1308502 -1311292 -1308575 -1304445 -1311757 -1318577 -1311963 -1282725 -1264858 -1289032 -1301607 -1303372 -1309999 -1312856
6033a312856K4409K4488p471n647Q236K124j6640p966o839l720J1212P105n120
$$ -1312856 -1288447 -1263959 -1271430 -1277077 -1268841 -1266717 -1283357 -1291323 -1298162 -1301882 -1290670 -1283565 -1288685
6020a288685l3365j9917R279M402q655Q410J0014p043j246R483J9115P008J0767
$$ -1288685 -1322050 -1341967 -1332688 -1328286 -1336941 -1328531 -1318517 -1325560 -1326806 -1317323 -1298208 -1291200 -1280433
6007a280433j8627j0462o213m635K1826J1531m21j441K0020N225j0997r536O666
$$ -1280433 -1299060 -1309522 -1315735 -1320370 -1298544 -1287013 -1287434 -1288875 -1268855 -1263630 -1274627 -1284163 -1277497
5994a277497p496J6549j1091l016j1549j7777J2707K187J3779R679j0778j0137
$$ -1277497 -1284993 -1268444 -1279535 -1282551 -1294100 -1311877 -1299170 -1296983 -1283204 -1273525 -1284303 -1294440
5982a294440j0685N07J5459P816k004M69J3542J1713L257j9023j5992P283k0481
$$ -1294440 -1305125 -1304618 -1289159 -1281343 -1283347 -1282878 -1269336 -1257623 -1254366 -1273389 -1289381 -1282098 -1302579
5969a302579j8220J7330J1038J4360j3927j982K4057P7m764J6026Q34j0536Q500
$$ -1302579 -1320799 -1303469 -1292431 -1278071 -1291998 -1293980 -1269923 -1269846 -1274610 -1258584 -1257750 -1268286 -1259786
5956a259786k2266K878K9911O104j7163k523J2114j253J1588L240j5104j6971
$$ -1259786 -1282052 -1279174 -1249263 -1243159 -1260322 -1262845 -1250731 -1251984 -1240396 -1237156 -1252260 -1269231
5944a269231k746K4393L137N648j7261j8300k2125J0985J4195L641J0663j3452
$$ -1269231 -1271977 -1247584 -1244447 -1238799 -1256060 -1274360 -1296485 -1285500 -1271305 -1267664 -1257001 -1270453
5932a270453o171j203J6792J3714j6338k0991j1838R661J7058J047l280j97J7311
$$ -1270453 -1276624 -1277827 -1261035 -1247321 -1263659 -1284650 -1296488 -1286827 -1269769 -1268722 -1272002 -1272199 -1254888
5919a254888N367K364j0876j1449j220k19J5393L954q377k966J3757j2711j5975
$$ -1254888 -1249521 -1247157 -1258033 -1269482 -1270702 -1270921 -1255528 -1251574 -1259951 -1262917 -1249160 -1261871 -1277846
5906a277846J0708K1669K5280L396R802k0011k8321K94P217m438p193j499J3405
$$ -1277846 -1267138 -1245469 -1220189 -1216793 -1206991 -1227002 -1255323 -1255029 -1247812 -1252250 -1259443 -1260942 -1247537
5893a247537J5137j1523o991l664M426J576j715n693K185j1752k388L023o488
$$ -1247537 -1232400 -1243923 -1250914 -1254578 -1250152 -1248576 -1250291 -1255984 -1253799 -1265551 -1267939 -1264916 -1271404
5880a271404J101k827j0151n837P138j8195K463J59K9699J0383J246N606P397
$$ -1271404 -1270303 -1273130 -1283281 -1289118 -1281980 -1300175 -1297712 -1297553 -1267854 -1257471 -1256225 -1250619 -1243222
5867a243222n316k321J8736m992p368k245p883o102K136R714j4855P499q988Q439
$$ -1243222 -1248538 -1250859 -1232123 -1237115 -1244483 -1246728 -1254611 -1260713 -1258577 -1248863 -1263718 -1256219 -1265207 -1256768
5853a256768K365j2265k011K164J2465K3616k1233j3750J6905K2738n165j1581
$$ -1256768 -1254403 -1266668 -1268679 -1266515 -1254050 -1230434 -1251667 -1265417 -1248512 -1225774 -1230939 -1242520
5841a242520k3253j6908L107L745J3561O536L158q05J5420k3129j5969k393K0134
$$ -1242520 -1265773 -1282681 -1279574 -1275829 -1262268 -1255732 -1252574 -1253379 -1237959 -1261088 -1277057 -1279450 -1259316
5828a259316O555q834O704M972L798J1761O402M859j9198o116l035R50l1711k262
$$ -1259316 -1252761 -1261595 -1254891 -1249919 -1246121 -1234360 -1227958 -1223099 -1242297 -1248413 -1251448 -1250498 -1282209 -1284471
5814a284471P374J8586J8075L217N193N971l0301O105J8673J422m077R243k809
$$ -1284471 -1277097 -1258511 -1240436 -1237219 -1232026 -1226055 -1256356 -1250251 -1231578 -1230156 -1234233 -1224990 -1227799
5801a227799J1126O896p888l223j48n04L268o538m058R929Q923k655k245K055
$$ -1227799 -1216673 -1209777 -1217665 -1220888 -1221036 -1221540 -1218272 -1224810 -1228868 -1218939 -1210016 -1212671 -1214916 -1212861
5787a212861k205O876Q106k1810k1031l010j611N679K5443J0208j1989j3267L231
$$ -1212861 -1215066 -1208190 -1200084 -1221894 -1242925 -1245935 -1247546 -1241867 -1216424 -1206216 -1218205 -1231472 -1228241
5774a228241R825M182q246o788O08j532o066j2978J1879J8869M042k0753o183
$$ -1228241 -1218416 -1214234 -1222480 -1229268 -1228660 -1230192 -1236258 -1249236 -1237357 -1218488 -1214446 -1235199 -1241382
5761a241382P258J2082k0163J6271L0169j1287k8796j3823j3178N231P191J3875
$$ -1241382 -1234124 -1222042 -1242205 -1225934 -1195765 -1207052 -1235848 -1249671 -1262849 -1257618 -1250427 -1236552
5749a236552p674k3039m048Q075J0738N101N891O53O462o815p06K0941J5765l562
$$ -1236552 -1244226 -1267265 -1271313 -1263238 -1252500 -1247399 -1241508 -1240855 -1234393 -1241208 -1241914 -1220973 -1205208 -1208770
5735a208770r465j183r609P057O265N70P822L911m395j4880k7067k948J1681J1792
$$ -1208770 -1218235 -1219418 -1229027 -1221970 -1215705 -1215135 -1207313 -1203402 -1207797 -1222677 -1249744 -1252692 -1241011 -1229219
5721a229219L186J193j874Q546m525p287K416J3964N717L193J4168r701q776R906
$$ -1229219 -1226033 -1224840 -1226714 -1218168 -1222693 -1229980 -1227564 -1213600 -1207883 -1204690 -1190522 -1200223 -1208999 -1199093
5707a199093P581k081k5526q756J4418J8569J0445L197j3782j1046K170j612M061
$$ -1199093 -1191512 -1193593 -1219119 -1227875 -1213457 -1194888 -1184443 -1181246 -1195028 -1206074 -1203904 -1205516 -1201455
5694a201455L4k592j6972J6182P87M38P120J1149L935o716j0112K188Q235o681
$$ -1201455 -1201421 -1204013 -1220985 -1204803 -1204016 -1203578 -1196458 -1185309 -1181374 -1188090 -1198202 -1196014 -1187779 -1194460
5680a194460J826Q690q034J9158K0168j7625k5398j1465p402K455K731k190j64
$$ -1194460 -1192634 -1183944 -1191978 -1172820 -1152652 -1170277 -1195675 -1207140 -1214542 -1212087 -1209356 -1211546 -1211710
5667a211710p393J1717J5930R373m642k709O099L690l6473j4869j9508j550L649
$$ -1211710 -1219103 -1207386 -1191456 -1182083 -1186725 -1189434 -1183335 -1179645 -1216118 -1230987 -1250495 -1252045 -1248396
5654a248396R94j0826K1907M188j677K4817J5400o836Q854j3533j8429J717K85
$$ -1248396 -1247402 -1258228 -1236321 -1232133 -1233810 -1208993 -1193593 -1200429 -1191575 -1205108 -1223537 -1221820 -1221535
5641a221535O243l505J4568l118M026J743j5516N926J8048m685j3317J754M197
$$ -1221535 -1215292 -1218797 -1204229 -1207347 -1203321 -1201578 -1217094 -1211168 -1193120 -1197805 -1211122 -1209368 -1205171
5628a205171P564O328J2925L868O067q586P603K0528J0567j0066j2980R811n622
$$ -1205171 -1197607 -1191279 -1178354 -1174486 -1168419 -1177005 -1169402 -1148874 -1138307 -1148373 -1161353 -1151542 -1157164
5615a157164n437J442J0170P470k0387j2847j2766N501J4418j3440p677J7399
$$ -1157164 -1162601 -1161159 -1150989 -1143519 -1163906 -1176753 -1189519 -1184018 -1169600 -1183040 -1190717 -1173318
5603a173318j5880j190K5302O16k206o766k3277o880M459q466r421K4076Q912
$$ -1173318 -1189198 -1190388 -1165086 -1164470 -1166676 -1173442 -1196719 -1203599 -1199140 -1207606 -1217027 -1192951 -1184039
5590a184039o977k2913l103J7670L0048o271j7116l175J4915J1458k250J1150
$$ -1184039 -1191016 -1213929 -1217032 -1199362 -1169314 -1175585 -1192701 -1195876 -1180961 -1169503 -1171753 -1160603
5578a160603k801j38n357j6056M410J0030J0703L636j7444j3664M636P286j2723
$$ -1160603 -1163404 -1163542 -1168899 -1184955 -1180545 -1170515 -1159812 -1156176 -1173620 -1187284 -1182648 -1175362 -1188085
5565a188085o990N28j0289J5529J4404o667M308k0510n181K752K0338Q386Q939
$$ -1188085 -1195075 -1194547 -1204836 -1189307 -1174903 -1181570 -1177262 -1197772 -1202953 -1200201 -1179863 -1171477 -1162538
5552a162538j847j3970R811L03j1363n939k202l599J803j5741J0253J4408K963
$$ -1162538 -1164385 -1178355 -1168544 -1168241 -1179604 -1185543 -1187745 -1191344 -1189541 -1205282 -1195029 -1180621 -1177658
5539a177658J6304O611k1824l427J0652J1775J0703j0129O36j7519j0503J2767
$$ -1177658 -1161354 -1154743 -1176567 -1179994 -1169342 -1157567 -1146864 -1156993 -1156357 -1173876 -1184379 -1171612
5527a171612J6581o462k2800O440R52M208O608p717j5511J4333J3768O251J0807
$$ -1171612 -1155031 -1161493 -1184293 -1177853 -1176901 -1172693 -1166085 -1173802 -1189313 -1174980 -1161212 -1154961 -1144154
5514a144154R944o116O618r486n693j6780J299o390k117j4291k82P689j1913J232
$$ -1144154 -1134210 -1140326 -1133708 -1143194 -1148887 -1165667 -1164368 -1170758 -1172875 -1187166 -1187448 -1179759 -1191672 -1190440
5500a190440Q891J2292Q296J1078l419j1672L894R933O093j3135n394j2241p428
$$ -1190440 -1181549 -1169257 -1160961 -1149883 -1153302 -1164974 -1161080 -1151147 -1145054 -1158189 -1163583 -1175824 -1183252
5487a183252Q786n886Q549q714j3207J4220K766q816K2308R701j113L521r007
$$ -1183252 -1174466 -1180352 -1171803 -1180517 -1193724 -1179504 -1176738 -1185554 -1163246 -1153545 -1154658 -1151137 -1160144
5474a160144k021J3375O378L658L547j1047j0519m969Q491j973p743R443l490
$$ -1160144 -1162165 -1148790 -1142412 -1138754 -1135207 -1146254 -1156773 -1161742 -1153251 -1155224 -1162967 -1153524 -1157014
5461a157014j3580j5154L89L0797K6705n8j0710j9745Q597q0j1570l512n741j9723
$$ -1157014 -1170594 -1185748 -1185359 -1154562 -1127857 -1127915 -1138625 -1158370 -1149773 -1149853 -1161423 -1164935 -1170676 -1190399
5447a190399J2634J5433j0647K125J1866m139j3448q614O960L4862P725k8048
$$ -1190399 -1177765 -1162332 -1172979 -1170854 -1158988 -1163127 -1176575 -1185189 -1178229 -1143367 -1135642 -1163690
5435a163690k0390j330P655L7173R464j543L012R208j7574r253l672j8493N44
$$ -1163690 -1184080 -1185410 -1177755 -1140582 -1131118 -1132661 -1129649 -1120441 -1138015 -1147268 -1150940 -1169433 -1168889
5422a168889J4993N373m333j8291m532k701M568N729J8391P288o654j4516l994
$$ -1168889 -1153896 -1148523 -1152856 -1171147 -1175679 -1178380 -1173812 -1168083 -1149692 -1142404 -1149058 -1163574 -1167568
5409a167568P110J198K5251j6306J644N464R026M274j0192j8950J2030R728J2526
$$ -1167568 -1160458 -1159260 -1134009 -1150315 -1148671 -1143207 -1134181 -1129907 -1140099 -1159049 -1147019 -1137291 -1124765
5396a124765L58j2124o615M529J318j6762J1859J5617K4269j105k7516L687N006
$$ -1124765 -1124407 -1136531 -1143146 -1138617 -1137299 -1154061 -1142202 -1126585 -1102316 -1103421 -1130937 -1127250 -1122244
5383a122244p959p157K644K165j2783o720J8673J1131M698L536J232L074o587
$$ -1122244 -1130203 -1137360 -1134716 -1132551 -1145334 -1152054 -1133381 -1122250 -1117552 -1114016 -1112784 -1109710 -1116297
5370a116297j674p574J006o478k7541o982K9138J6266j7509j2078N887n679j1199
$$ -1116297 -1117971 -1125545 -1124539 -1131017 -1158558 -1165540 -1136402 -1120136 -1137645 -1149723 -1143836 -1149515 -1160714
5357a160714m310R60Q014L909n929j1902J5706K8477O839r363j3580J2765K923
$$ -1160714 -1165024 -1164064 -1156050 -1152141 -1158070 -1169972 -1154266 -1125789 -1118950 -1128313 -1141893 -1129128 -1126205
5344a126205p339J844q168j106K574m983r314L606N416N952Q679J7011J1315j0794
$$ -1126205 -1133544 -1131700 -1139868 -1140974 -1138400 -1143383 -1152697 -1149091 -1143675 -1137723 -1129044 -1112033 -1100718 -1111512
5330a111512j2842j2263M366m20P796k297j3637K107J9235N874j0515P328j056
$$ -1111512 -1124354 -1136617 -1132251 -1132671 -1124875 -1127172 -1140809 -1138702 -1119467 -1113593 -1124108 -1116780 -1117836
5317a117836l167l926N471J1296j7282j2803k3776p134j9629L3376K196L05O575
$$ -1117836 -1121003 -1124929 -1119458 -1108162 -1125444 -1138247 -1162023 -1169157 -1188786 -1155410 -1153214 -1152909 -1146334
5304a146334J4659o961k0421Q31L951Q755K498J3467J3753K353j9907j4569M875
$$ -1146334 -1131675 -1138636 -1159057 -1158226 -1154275 -1145520 -1143022 -1129555 -1115802 -1113449 -1133356 -1147925 -1143050
5291a143050J5181N514J134N692l008K416J2421j5368j1281j1468l21J9991k597
$$ -1143050 -1127869 -1122355 -1121221 -1115529 -1118537 -1116121 -1103700 -1119068 -1130349 -1141817 -1142138 -1122147 -1124744
5278a124744p764r438J3044l995p668O006J643J725J9332J2537l231J380j278
$$ -1124744 -1132508 -1141946 -1128902 -1132897 -1140565 -1134559 -1132916 -1131191 -1111859 -1099322 -1102553 -1101173 -1102451
5265a102451l337j2556j408J1125Q384Q343L260L886j1116K099M608p423l1926
$$ -1102451 -1105788 -1118344 -1119752 -1108627 -1100243 -1091900 -1088640 -1084754 -1095870 -1093771 -1089163 -1096586 -1128512
5252a128512k054J6615n556j0715R635J872m825R497J0489J1206J1334j3383k8183
$$ -1128512 -1130566 -1113951 -1119507 -1130222 -1120587 -1118715 -1123540 -1114043 -1103554 -1092348 -1081014 -1094397 -1122580
5239a122580k694O229O972J5469m613J5643n568k2623j0838q705J8642k267J4168
$$ -1122580 -1125274 -1119045 -1112073 -1096604 -1101217 -1085574 -1091142 -1113765 -1124603 -1133308 -1114666 -1116933 -1102765
5226a102765m919j6697K818K2651l073j3845J1240K473m208p983j9661O630N061
$$ -1102765 -1107684 -1124381 -1121563 -1098912 -1101985 -1115830 -1104590 -1102117 -1106325 -1114308 -1133969 -1127339 -1122278
5213a122278K1041M353M420j2124j0523J316P366j6758R698J8646J841j2579L042
$$ -1122278 -1101237 -1096884 -1092464 -1104588 -1115111 -1113795 -1106429 -1123187 -1113489 -1094843 -1093002 -1105581 -1102539
5200a102539L84j2491k9130Q12L7075j272o253P015L831q521L48K2631o54l0434
$$ -1102539 -1102155 -1114646 -1143776 -1142964 -1105889 -1107161 -1113414 -1106399 -1102568 -1111089 -1110741 -1088110 -1088764 -1119198
5186a119198L006Q783K4296K4145k8069k1132J954J1249k32m870J048j391k2187
$$ -1119198 -1116192 -1107409 -1083113 -1058968 -1087037 -1108169 -1106215 -1094966 -1095198 -1100068 -1099020 -1100411 -1122598
5173a122598j8526J3526J0054K2909K3662k907k9214r147K080J825L190K669j532
$$ -1122598 -1141124 -1127598 -1117544 -1094635 -1070973 -1073880 -1103094 -1112241 -1110161 -1108336 -1105146 -1102477 -1104009
5160a104009n870O974J0548n198P423j5794j0608N128J8123O485J1090K2862L190
$$ -1104009 -1109879 -1102905 -1092357 -1097555 -1090132 -1105926 -1116534 -1111406 -1093283 -1086798 -1075708 -1052846 -1049656
5147a049656j0841k9191j7038j6410r260J4841N652q268q597J5895P427N474j640
$$ -1049656 -1060497 -1089688 -1106726 -1123136 -1132396 -1117555 -1111903 -1120171 -1128768 -1112873 -1105446 -1099972 -1101612
5134a101612j0876J9469J2805J3990k7759j3888R882P313K190N254R3j74n750
$$ -1101612 -1112488 -1093019 -1080214 -1066224 -1093983 -1107871 -1097989 -1090676 -1088486 -1083232 -1083139 -1083313 -1089063
5121a089063k2936j5988L2720L4456j3911r195q729M280O438K804p831j0349j3577
$$ -1089063 -1111999 -1127987 -1095267 -1060811 -1074722 -1083917 -1092646 -1088366 -1081928 -1079124 -1086955 -1097304 -1110881
5108a110881o960J0991K3844N748j5019J1119K725l329l716k208J1122j105j097
$$ -1110881 -1117841 -1106850 -1083006 -1077258 -1092277 -1081158 -1078433 -1081762 -1085478 -1087686 -1076564 -1077669 -1078766
5095a078766k649k3506n625J4869j815K260k92j1538K636j972J4553K5146j4852
$$ -1078766 -1081415 -1104921 -1110546 -1095677 -1097492 -1095232 -1095524 -1107062 -1104426 -1106398 -1091845 -1066699 -1081551
5082a081551j0751K039K6293J4020j1577j1719j2188l96K15j87p725M555j0138
$$ -1081551 -1092302 -1090263 -1063970 -1049950 -1061527 -1073246 -1085434 -1085830 -1085615 -1085802 -1093527 -1088972 -1099110
5069a099110P400P821p271J0384K0334j2610j5419j1929K3851J362m807O622k172
$$ -1099110 -1091710 -1083889 -1091160 -1080776 -1060442 -1073052 -1088471 -1100400 -1076549 -1075187 -1079994 -1073372 -1075544
5056a075544j164k38R060n040p371P380J493j773n111K59j0159k5351M060J3868
$$ -1075544 -1076708 -1076946 -1067886 -1072926 -1080297 -1072917 -1071424 -1073197 -1078308 -1078049 -1088208 -1113559 -1109499 -1095631
5042a095631j1441J3638K0278L668q630q390R662K745j5359j1403P738J245n687
$$ -1095631 -1107072 -1093434 -1073156 -1069488 -1078118 -1086508 -1076846 -1074101 -1089460 -1100863 -1093125 -1091880 -1097567
5029a097567L630k289o775p651L447o451n994M498J9154R555K701L743o800J157
$$ -1097567 -1093937 -1096226 -1103001 -1110652 -1107205 -1113656 -1119650 -1115152 -1095998 -1086443 -1083742 -1079999 -1086799 -1085642
$$ [...]
##END NTUPLES=NMR SPECTRUM
##END=
