##TITLE=Analysis number 315374
Compound Code cc 45322
Book Reference 449/46
Project Code adrs
Chemist Name davee
##JCAMPDX= 6.0         $$ Bruker NMR JCAMP-DX V2.0
##DATA TYPE= NMR SPECTRUM
##DATA CLASS= NTUPLES
##ORIGIN= Bruker BioSpin GmbH
##OWNER= NMR
$$ XWIN-NMR		Version 3.5
$$ Thu Nov 17 08:59:56 2005 GMT Standard Time (UT+0h)  MAYBRIDGE\NMR@NMR_250MHZ
##.OBSERVE FREQUENCY= 250.131544655141
##.OBSERVE NUCLEUS= ^1H
##.ACQUISITION MODE= SIMULTANEOUS (DQD)
##.ACQUISITION SCHEME= undefined
##.AVERAGES= 16
##.DIGITISER RES= 18
##SPECTROMETER/DATA SYSTEM= dpx250
##.PULSE SEQUENCE= zg30
##.SOLVENT NAME= CDCl3
##.SHIFT REFERENCE= (INTERNAL, CDCl3, 0, 16.4767)
##AUDIT TRAIL= $$ (NUMBER, WHEN, WHO, WHERE, WHAT)
$$ ##TITLE= Audit trail, XWIN-NMR		Version 3.5
$$ ##JCAMPDX= 5.01
$$ ##ORIGIN= Bruker BioSpin GmbH
$$ ##OWNER= NMR
$$ C:\u/data/dgb/nmr/ADRS/12520/pdata/1/auditp.txt
$$ ##AUDIT TRAIL=  $$ (NUMBER, WHEN, WHO, WHERE, WHAT)
(   1,<2005-11-17 08:59:27.75 +000>,<MAYBRIDGE\NMR>,<NMR_250MHZ>,
      <created by zg, POWCHK disabled, PULCHK disabled
       configuration hash MD5:
       62 19 C7 07 E1 42 D1 B7 37 6C 3D D0 77 39 F9 E6
       data hash MD5: 64K
       42 01 1E 95 0C 56 59 DE 87 54 39 95 F1 2E 2A 94>)
(   2,<2005-11-17 08:59:44.76 +000>,<MAYBRIDGE\NMR>,<NMR_250MHZ>,
      <Start of raw data processing
       ef LB = 0.3 FT_mod = 6 PKNL = 1 SI = 32K 
       data hash MD5: 32K
       7A C5 E6 81 09 B4 54 CC E2 3C 14 46 13 02 58 42>)
(   3,<2005-11-17 08:59:46.73 +000>,<MAYBRIDGE\NMR>,<NMR_250MHZ>,
      <apk 
       data hash MD5: 32K
       31 85 A2 63 84 4D 9C 3E 9D 3C 8D 10 35 82 7D 4C>)
(   4,<2005-11-17 08:59:47.51 +000>,<MAYBRIDGE\NMR>,<NMR_250MHZ>,
      <abs ABSG = 5 
       data hash MD5: 32K
       03 4F 27 64 39 16 8F 75 6D 37 B9 C6 01 E7 EE 67>)
$$ ##END=
$$ 
$$ hash MD5
$$ A9 E4 56 2F 74 AE 81 0B F4 00 F8 C1 E4 C8 20 38
##$RELAX= 
##$RELAX= 
##$RELAX= 
##$RELAX= 
##$RELAX= 
##$RELAX= 
##$RELAX= 
$$ Bruker specific parameters
$$ --------------------------
##$DU= <C:\u>
##$EXPNO= 12520
##$NAME= <ADRS>
##$PROCNO= 1
##$TYPE= <nmr>
##$USER= <dgb>
##$AMP= (0..31)
100 100 100 100 100 100 100 100 100 100 100 100 100 100 100 100 100 100 
100 100 100 100 100 100 100 100 100 100 100 100 100 100 
##$AQSEQ= 0
##$AQ_mod= 3
##$AUNM= <au_zg>
##$AUTOPOS= <2 >
##$BF1= 250.13
##$BF2= 250.13
##$BF3= 250.13
##$BF4= 250.13
##$BF5= 500.13
##$BF6= 500.13
##$BF7= 500.13
##$BF8= 500.13
##$BYTORDA= 1
##$CFDGTYP= 0
##$CFRGTYP= 5
##$CHEMSTR= <none>
##$CNST= (0..31)
1 1 145 1 1 1 1 1 1 1 1 1 1 1 1 1 1 1 1 1 1 1 1 1 1 1 1 1 1 1 1 1 
##$CPDPRG= <>
##$CPDPRG1= <>
##$CPDPRG2= <>
##$CPDPRG3= <>
##$CPDPRG4= <mlev>
##$CPDPRG5= <mlev>
##$CPDPRG6= <mlev>
##$CPDPRG7= <mlev>
##$CPDPRG8= <mlev>
##$CPDPRGB= <>
##$CPDPRGT= <>
##$D= (0..31)
0 1 0 0 0 0 0 0 0 0.06 0 0 0 0 0 0 0.0002 0 0 0 0 0 0 0 0 0 0 0 0 0 0 
0 
##$DATE= 1132217966
##$DBL= (0..7)
120 120 120 120 120 120 120 120 
##$DBP= (0..7)
150 150 150 150 150 150 150 150 
##$DBP07= 0
##$DBPNAM0= <>
##$DBPNAM1= <>
$$ [...]
##$SUBNAM7= <"">
##$SUBNAM8= <"">
##$SUBNAM9= <"">
##$SW= 20.6930455092707
##$SWIBOX= (0..15)
0 0 3 0 0 0 0 0 0 0 0 0 0 0 0 0 
##$SW_h= 5175.983436853
##$TD= 65536
##$TD0= 1
##$TE= 294.16
##$TE2= 300
##$TE3= 300
##$TEG= 300
##$TL= (0..7)
0 120 120 120 120 120 120 120 
##$TP= (0..7)
150 150 150 150 150 150 150 150 
##$TP07= 0
##$TPNAME0= <>
##$TPNAME1= <>
##$TPNAME2= <>
##$TPNAME3= <>
##$TPNAME4= <>
##$TPNAME5= <>
##$TPNAME6= <>
##$TPNAME7= <>
##$TPOAL= (0..7)
0.5 0.5 0.5 0.5 0.5 0.5 0.5 0.5 
##$TPOFFS= (0..7)
0 0 0 0 0 0 0 0 
##$TUNHIN= 0
##$TUNHOUT= 0
##$TUNXOUT= 0
##$USERA1= <user>
##$USERA2= <user>
##$USERA3= <user>
##$USERA4= <user>
##$USERA5= <user>
##$V9= 5
##$VALIST= <valist>
##$VCLIST= <CCCCCCCCCCCCCCC>
##$VD= 0
##$VDLIST= <DDDDDDDDDDDDDDD>
##$VPLIST= <PPPPPPPPPPPPPPP>
##$VTLIST= <TTTTTTTTTTTTTTT>
##$WBST= 1024
##$WBSW= 4
##$XGAIN= (0..3)
0 0 0 0 
##$XL= 0
##$YL= 0
##$YMAX_a= 467112
##$YMIN_a= -566560
##$ZGOPTNS= <>
##$ZL1= 120
##$ZL2= 120
##$ZL3= 120
##$ZL4= 120
##$ABSF1= 16.47672
##$ABSF2= -4.216452
##$ABSG= 5
##$ABSL= 3
##$ALPHA= 0
##$AQORDER= 0
##$ASSFAC= 0
##$ASSFACI= 0
##$ASSFACX= 0
##$ASSWID= 0
##$AUNMP= <proc_1d>
##$AZFE= 0.1
##$AZFW= 0.1
##$BCFW= 0
##$BC_mod= 0
##$BYTORDP= 0
##$COROFFS= 0
##$CY= 12.5
##$DATMOD= 1
##$DC= 0
##$DFILT= <>
##$DTYPP= 0
##$F1P= 14.0000005364418
##$F2P= -0.99999901652339
##$FCOR= 0.5
##$FTSIZE= 32768
##$FT_mod= 6
##$GAMMA= 0
##$GB= 0
##$INTBC= 1
##$INTSCL= 1
##$ISEN= 128
##$LB= 0.3
##$LEV0= 0
##$LPBIN= 0
##$MAXI= 10000
##$MC2= 0
##$MEAN= 0
##$ME_mod= 0
##$MI= 0
##$NCOEF= 0
##$NC_proc= -3
##$NLEV= 6
##$NOISF1= 0
##$NOISF2= 0
##$NSP= 0
##$NTH_PI= 0
##$NZP= 0
##$OFFSET= 16.47672
##$PC= 1
##$PHC0= -68.38586
##$PHC1= 6.57946
##$PH_mod= 1
##$PKNL= yes
##$PPARMOD= 0
##$PSCAL= 4
##$PSIGN= 0
##$REVERSE= no
##$SF= 250.130011325849
##$SI= 32768
##$SIGF1= 0
##$SIGF2= 0
##$SINO= 400
##$SIOLD= 32768
##$SREGLST= <1H.CDCl3>
##$SSB= 0
##$STSI= 32768
##$STSR= 0
##$SW_p= 5175.98343685301
##$SYMM= 0
##$S_DEV= 0
##$TDeff= 65536
##$TDoff= 0
##$TI= <Analysis number 999999
Compound Code 99
Book Reference 9
Project Code 9>
##$TILT= no
##$TM1= 0
##$TM2= 0
##$TOPLEV= 0
##$USERP1= <user>
##$USERP2= <user>
##$USERP3= <user>
##$USERP4= <user>
##$USERP5= <user>
##$WDW= 1
##$XDIM= 32768
##$YMAX_p= 273009078
##$YMIN_p= -106018
$$ End of Bruker specific parameters
$$ ---------------------------------
##NTUPLES= NMR SPECTRUM
##VAR_NAME=  FREQUENCY,     SPECTRUM/REAL,   SPECTRUM/IMAG
##SYMBOL=    X,             R,               I
##VAR_TYPE=  INDEPENDENT,   DEPENDENT,       DEPENDENT
##VAR_FORM=  AFFN,          ASDF,            ASDF
##VAR_DIM=   32768,         32768,           32768
##UNITS=     HZ,            ARBITRARY UNITS, ARBITRARY UNITS
##FACTOR=    0.157963299565203, 1,           1
##FIRST=     4121.32236280227, 0,            0
##LAST=      -1054.66107405074, 0,           0
##MIN=       -1054.66107405074, -106018,     0
##MAX=       4121.32236280227, 273009078,    0
$$ Real data points
##PAGE= N=1
##DATA TABLE= (X++(R..R)), XYDATA
$$ [...]
$$ plain form
19151 1890206 1976444 2111317 2312385 2602893 3032369 3691888 4659445 5992214 7654012
19142 7654012 9511086 11259983 12480053 13078334 13292641 13384005 13607519 14212188 15339864
19133 15339864 16880183 18319695 19247497 19579038 19155437 17954440 16335328 14699213
19125 14699213 13307895 12334518 11837466 11706314 11590828 11142533 10360847 9336655 8132561
19116 8132561 6866372 5704359 4732889 3974879 3417106 3023485 2759091 2590850 2465818
19107 2465818 2374051 2326830 2314600 2330865 2381939 2475124 2624555 2843847 3189228 3718775
19097 3718775 4528276 5712994 7291909 9173080 11161182 12831865 13824216 14248423 14383620
19088 14383620 14500888 14875940 15767878 17234429 18958637 20405667 21323772 21543953 20824566
$$ packed form
19151A890206Q6238J34873K01068K90508M29476O59519R67557J332769J661798
19142G654012J857074J748897J220070N98281K14307R1364K23514O04669J127676
19133A5339864J540319J439512R27802L31541m23601j200997j619112j636115
19125A4699213j391318r73377m97052j31152j15486m48295p81686j024192j204094
19116H132561j266189j162013r71470p58010n57773l93621k64394j68241j25032
19107B465818r1767m7221j2230J6265N1074R3185J49431K19292L45381N29547
19097C718775Q09501J184718J578915J881171J988102J670683R92351M24207J35197
19088A4383620J17268L75052Q91938J466551J724208J447030R18105K20181p19387
$$ plain form
19079 20824566 19360638 17617122 15967391 14662617 13863691 13569127 13493980 13178842 12425830
19070 12425830 11312098 9929096 8390670 6894046 5588024 4524253 3694496 3079822
19062 3079822 2626875 2296881 2048908 1851636 1684683 1538749 1411631 1300472 1201389 1110354
19052 1110354 1027715 947952 880448 816410 763838 717197 668964 627225 586636 553329 521009
19041 521009 492015 468443 443081 422719 404524 388696 374776 368581 359136 344232 338155 330703
19029 330703 326661 325518 326502 323710 317432 318902 316809 315479 312902 308944 304532 290847 286745 282998
19015 282998 286763 289116 284504 273488 258551 246325 243798 237501 224439 213883 205492 200806 192160
19002 192160 177779 162431 153124 145493 140237 134311 129577 124279 123662 121903 117405 115633 116190 115978
$$ packed form
19079B0824566j463928j743516j649731j304774p98926k94564p5147l15138p53012
19070A2425830j113732j383002j538426j496624j306022j063771q29757o14674
19062C079822m52947l29994k47973j97272j66953j45934j27118j11159r9083r1035
19052A110354q2639p9763o7504o4038n2572m6641m8233m1739m0589l3307l2320
19041E21009k8994k3572k5362k0362j8195j5828j3920o195r445j4904o077p452
19029C30703m042j143R84k792o278J470k093j330k577l958m412j3685m102l747
19015B82998L765K353m612j1016j4937j2226k527o297j3062j0556q391m686q646
19002A92160j4381j5348r307p631n256n926m734n298o17j759m498j772N57k12
$$ plain form
18988 115978 114636 117102 117649 112928 120323 128853 139375 147281 154124 158479 162896 167883 177594 183304
18974 183304 183644 188945 198784 202632 205077 200301 194599 201012 202721 202503 200901 200126 193566 185157 177183
18959 177183 178960 173766 165582 159909 157117 144893 128903 119222 113395 105474 102145 102604 97689 96610
18945 96610 99333 97435 90651 86149 83745 76607 65771 63894 67519 69865 65522 65201 68425 62765
18931 62765 57839 55230 60758 61340 60354 60921 66074 69408 66477 63429 57822 60869 61513 65535 73606
18916 73606 72218 72234 74576 73936 73554 65114 65294 60291 55292 50209 47162 54134 58388 58010 55728 50402
18900 50402 47253 44514 43177 39986 35186 41824 45993 40688 31991 26365 22315 25230 24606 25556 26612
18885 26612 35097 32367 24375 17577 21243 24765 23094 18034 19376 18157 20671 23582 24688 22984
$$ packed form
18988A15978j342K466N47m721P395Q530J0522P906O843M355M417M987R711N710
18974A83304L40N301R839L848K445m776n702O413J709k18j602p75o560q409p974
18959A77183J777n194q184n673k792j2224j5990r681n827p921l329M59m915j079
18945I6610K723j898o784m502k404p138j0836j877L625K346m343l21L224n660
18931F2765m926k609N528N82r86N67N153L334k931l048n607L047O44M022Q071
18916G3606j388J6K342o40l82q440J80n003m999n083l047O972M254l78k282n326
18900E0402l149k739j337l191m800O638M169n305q697n626m050K915o24R50J056
18885B6612Q485k730p992o798L666L522j671n060J342j219K514K911J106j704
$$ plain form
18871 22984 23724 17811 18315 20579 22504 20258 24504 33191 35141 37948 41304 37451 38130 38406 40847
18856 40847 44217 43543 46015 48883 45059 38314 41522 39800 34446 35486 41584 40681 36003 38869 37567
18841 37567 31459 35020 38579 34622 36157 38093 42826 36732 38646 41296 43809 49409 45485 36624
18827 36624 38564 37546 36764 38670 41321 45072 51812 50214 44365 41889 45795 48901 60486 64500
18813 64500 71578 84234 98573 109235 115147 112177 110127 107190 93907 85980 76433 67306 62278
18800 62278 53256 43445 43972 45532 49330 54245 61785 58120 49744 44786 46530 52582 53371 54177 62662
18785 62662 66470 76838 81791 77686 71995 72907 74113 75319 77741 70876 65399 67438 74173 75632
18771 75632 80458 89559 96599 105312 124595 151709 182633 216197 238058 245900 249909 246622 235015
$$ packed form
18871B2984P40n913N04K264J925k246M246Q687J950K807L356l853O79K76K441
18856D0847L370o74K472K868l824o745L208j722n354J040O098r03m678K866j302
18841C7567o108L561L559l957J535J936M733o094J914K650K513N600l924q861
18827C6624J940j018p82J906K651L751O740j598n849k476L906L106J1585M014
18813F4500P078J2656J4339J0662N912k970k050k937j3283p927r547r127n028
18800F2278r022r811N27J560L798M915P540l665q376m958J744O052P89Q06Q485
18785F2662L808J0368M953m105n691R12J206J206K422o865n477K039O735J459
18771G5632M826R101P040Q713J9283K7114L0924L3564K1861P842M009l287j1607
$$ plain form
18758 235015 212862 179452 155082 142740 127990 110483 94368 80226 69656 63710 57151 49861
18746 49861 53141 57063 56953 58294 63859 66164 66837 59367 59558 65556 73154 76183 76346 78392 86304
18731 86304 90852 94692 92130 90718 91985 92502 85765 83503 81854 80760 85136 86158 93363 101658 112494
18716 112494 119452 130631 141192 142182 145963 149113 144368 132756 122228 110460 99647 84089 76306
18703 76306 69854 74258 84191 84998 81450 78387 82688 93715 103905 118430 132480 146396 159050
18690 159050 163451 171436 170004 166785 178595 182769 189731 201266 210111 216367 225038 230561 233977 234599
18676 234599 226497 215510 205923 196406 185378 182920 174289 171503 174955 173424 164814 152091 142743
18663 142743 131517 125012 118169 110082 102881 103956 104000 96775 98122 105630 118392 125045 130249 126488
$$ packed form
18758B35015k2153l3410k4370j2342j4750j7507j6115j4142j0570n946o559p290
18746D9861L280L922j10J341N565K305O73p470J91N998P598L029J63K046P912
18731H6304M548L840k562j412J267N17o737k262j649j094M376J022P205Q295J0836
18716A12494O958J1179J0561R90L781L150m745j1612j0528j1768j0813j5558p783
18703G6306o452M404R933Q07l548l063M301J1027J0190J4525J4050J3916J2654
18690A59050M401P985j432l219J1810M174O962J1535Q845O256Q671N523L416O22
18676B34599q102j0987r587r517j1028k458q631k786L452j531q610j2723r348
18663A42743j1226o505o843q087p201J075M4p225J347P508J2762O653N204l761
$$ plain form
18649 126488 128926 126937 125239 126131 125515 137940 157595 179665 191750 192692 187714 176362 161294
18636 161294 143258 128561 120008 116327 119474 114774 107474 103083 96684 97724 94822 86577 85294 83689
18622 83689 92903 105212 105628 100092 99764 109043 114184 122013 131493 141368 149965 158491 168621 165997
18608 165997 166552 166040 169369 177709 195106 213495 229706 236654 231878 220963 211662 204469 202801 217238
18594 217238 250603 282107 292091 282320 259721 241708 217383 198809 186471 180504 183367 197403
18582 197403 203819 195195 186060 181399 175540 163858 163147 172335 187334 185412 180812 180204 185407 192951
18568 192951 199038 209936 221806 237149 255554 271723 279702 285791 292290 299662 312167 323496
18556 323496 337407 362644 391698 418551 447877 476846 507979 529919 554456 583673 618774
$$ packed form
18649A26488K438j989j698Q92o16J2425J9655K2070J2085R42m978j1352j5068
18636A61294j8036j4697q553l681L147m700p300m391o399J040k902q245j283j605
18622H3689R214J2309M16n536l28R279N141P829R480R875Q597Q526J0130k624
18608A65997N55n12L329Q340J7397J8389J6211O948m776j0915r301p193j668J4437
18594B17238L3365L1504R984r771k2599j8013k4325j8574j2338n967K863J4036
18582A97403O416q624r135m661n859j1682p11R188J4999j922m600o08N203P544
18568A92951O087J0898J1870J5343J8405J6169P979O089O499P372J2505J1329
18556C23496J3911K5237K9054K6853K9326K8969L1133K1940K4537K9217L5101
$$ plain form
18545 618774 664237 714864 785813 870561 970875 1082819 1222215 1419127 1697323 2086560
18535 2086560 2636691 3369387 4240931 5210012 6302712 7466995 8432178 9040225 9505418
18526 9505418 10018353 10540347 11067356 11798473 12811829 13820411 14529930 15021464 15257347
18517 15257347 14996622 14327795 13571833 12837082 12094210 11487236 11166062 10980329 10579489
18508 10579489 9912291 9158337 8329398 7342764 6296540 5348933 4551090 3897889 3383621
18499 3383621 3011285 2758686 2595504 2492693 2444364 2438870 2469497 2549598 2693408 2916947
18489 2916947 3258396 3776664 4543531 5596359 6860013 8259971 9847323 11602402 13139591
18480 13139591 14123939 14791370 15455294 16106980 16708897 17546230 18807862 20180683 21273796
$$ packed form
18545F18774M5463N0627P0949Q4748J00314J11944J39396J96912K78196L89237
18535B086560N50131P32696Q71544R69081J092700J164283R65183O08047M65193
18526I505418N12935N21994N27009P31117J013356J008582P09519M91534K35883
18517A5257347k60725o68827p55962p34751p42872o06974l21174j85733m00840
18508A0579489o67198p53954q28939r86634j046224r47607p97843o53201n14268
18499C383621l72336k52599j63182j02811m8329n494L0627Q0101J43810K23539
18489B916947L41449N18268P66867J052828J263654J399958J587352J755079J537189
18480A3139591R84348O67431O63924O51686O01917Q37333J261632J372821J093113
$$ plain form
18471 21273796 22115731 22662195 22488863 21607425 20481654 19341942 18121285 16986081 16228575
18462 16228575 15764242 15123962 14125171 12971956 11740253 10321589 8772551 7316739
18454 7316739 6054116 4994569 4140800 3485211 2988762 2611358 2325405 2101671 1918312
18445 1918312 1767624 1631876 1510903 1411362 1322987 1241988 1173749 1106243 1046879 994979 949412
18434 949412 917668 881079 839078 798370 765296 723202 676058 625154 577578 535088 500935
18423 500935 460052 425185 403212 378298 355224 340738 326551 311576 297828 291792 297302 298683
18411 298683 301873 305619 303962 300614 293482 287228 266979 259802 255617 249388 239972 228366 226180 228961
18397 228961 233619 236260 242181 253463 259234 269908 270343 270876 265221 258827 265989 277939 287106 295336
$$ packed form
18471B1273796Q41935N46464j73332q81438j125771j139712j220657j135204p57506
18462A6228575m64333o40280r98791j153215j231703j418664j549038j455812
18454G316739j262623j059547q53769o55589m96449l77404k85953k23734j83359
18445A918312j50688j35748j20973r9541q8375q0999o8239o7506n9364n1900m5567
18434I49412l1744l6589m2001m0708l3074m2094m7144n0904m7576m2490l4153
18423E00935m0883l4867k1973k4914k3074j4486j4187j4975j3748o036N510J381
18411B98683L190L746j657l348p132o254k0249p177m185o229r416j1606k186K781
18397B28961M658K641N921J1282N771J0674M35N33n655o394P162J1950R167Q230
$$ plain form
18383 295336 299996 302366 303782 298552 295596 288210 273442 256464 230820 203933 181849 160987 153826
18370 153826 149224 146915 142460 135753 137251 149776 161068 166782 172659 175317 174746 170524 168475 169840
18356 169840 174508 174321 175104 178347 177772 173085 171163 177157 176884 181400 182143 188161 189305 185981 187385
18341 187385 192006 201709 212334 224791 237267 261557 282511 298241 323699 356186 382649 405536
18329 405536 435394 473328 511143 547922 584152 616131 643212 669610 686004 704040 718606
18318 718606 732201 763816 813616 882346 987038 1122219 1294158 1515717 1812151 2209921
18308 2209921 2747663 3512304 4623911 6283416 8669615 11791580 15235457 18298137
18300 18298137 20627536 22269658 22966557 22213216 20085740 17251643 14273182 11423168
$$ packed form
18383B95336M660K370J416n230k956p386j4768j6978k5644k6887k2084k0862p161
18370A53826m602k309m455o707J498J2525J1292N714N877K658n71m222k049J365
18356A69840M668j87P83L243n75m687j922N994k73M516P43O018J144l324J404
18341A87385M621R703J0625J2457J2476K4290K0954J5730K5458L2487K6463K2887
18329D05536K9858L7934L7815L6779L6230L1979K7081K6398J6394J8036J4566
18318G18606J3595L1615M9800O8730J04692J35181J71939K21559K96434L97770
18308B209921N37742P64641J111607J659505K386199L121965L443877L062680
18300A8298137K329399J642122O96899p53341k127476k834097k978461k850014
$$ plain form
18292 11423168 8909845 6885892 5390007 4335062 3593149 3056086 2657631 2371974 2163516
18283 2163516 2020103 1924076 1861484 1825486 1817095 1820378 1822217 1830437 1833708 1821531 1788897 1739433
18271 1739433 1688742 1644576 1623580 1632316 1671886 1763086 1904187 2104167 2387037 2774837 3297354
18260 3297354 4004870 5011670 6471751 8630827 11806751 16165457 21341277 26350628
18252 26350628 30356713 33280979 34965549 34661341 32057849 27981440 23412268 18910045
18244 18910045 14799700 11369487 8747569 6857195 5530642 4589014 3897131 3376353
18236 3376353 2973851 2659410 2412590 2215589 2064744 1956982 1891096 1838741 1795265 1755669
18226 1755669 1707340 1650278 1574545 1487443 1397225 1316943 1253765 1208104 1186569 1193416 1235713
$$ packed form
18292A1423168k513323k023953j495885j054945p41913n37063l98455k85657k08458
18283B163516j43413r6027o2592l5998q391L283J839Q220L271j2177l2634m9464
18271A739433n0691m4166k0996Q736L9570R1200J41101J99980K82870L87800N22517
18260C297354P07516J006800J460081K159076L175924M358706N175820N009351
18252B6350628M006085K924266J684570l04208k603492m076409m569172m502223
18244A8910045m110345l430213k621918j890374j326553r41628o91883n20778
18236C376353m02502l14441k46820j97001j50845j07762o5886n2355m3476l9596
18226A755669m8329n7062p5733q7102r0218q0282o3178m5661k1535O847M2297
$$ plain form
18215 1235713 1311902 1423771 1585633 1815120 2143450 2635116 3372196 4481635 6068753
18206 6068753 8067088 10140842 11880950 13180911 14032862 14184264 13382587 11846529 10012921
18197 10012921 8163648 6442931 4967587 3817335 2975736 2379333 1962141 1661392 1434399
18188 1434399 1264080 1130096 1022440 920216 844762 798053 759218 727171 696364 665868
18178 665868 639685 614992 586040 551157 506943 462612 420361 387788 363038 340064 310683
18167 310683 290758 273789 265032 247137 228775 215955 215232 212811 202845 194325 191308 178228 176458
18154 176458 177958 173497 177185 170400 164016 162480 158000 150558 146890 147659 157453 156936 150880 150165 153219
18139 153219 153162 158616 160226 160053 162192 159938 152588 154326 162960 170539 179442 188907 192499 199145 210416
$$ packed form
18215A235713P6189J11869J61862K29487L28330M91666P37080J109439J587118
18206F068753J998335K073754J740108J299961Q51951J51402q01677j536058j833608
18197A0012921j849273j720717j475344j150252q41599n96403m17192l00749k26993
18188A434399j70319j33984j07656j02224p5454m6709l8835l2047l0807l0496
18178F65868k6183k4693k8952l4883m4214m4331m2251l2573k4750k2974k9381
18167C10683j9925j6969q757j7895j8362j2820p23k421r966q520l017j3080j770
18154A76458J500m461L688o785o384j536m480p442l668P69R794n17o056p15L054
18139A53219n7N454J610j73K139k254p350J738Q634P579Q903R465L592O646J1271
$$ plain form
18124 210416 221662 232508 243860 258287 271349 284448 310670 346595 401267 478009 575202
18113 575202 702943 868661 1106651 1480887 2146615 3429546 5760727 8653300 10029988
18104 10029988 9406237 8211520 7007648 5478063 3852391 2621536 1846448 1385013
18096 1385013 1091368 897329 765553 670499 588974 519404 462572 412970 380860 351852 325609
18085 325609 301713 278510 252878 230227 209703 198524 195745 197209 191619 181500 169521 162845
18073 162845 154588 143855 133237 129642 126555 120217 120187 120246 113074 103796 91990 84214 84754 78699 70630
18058 70630 75242 79922 74801 67752 68101 73205 75884 76506 72045 70685 71762 67007 66084 61312 57865
18043 57865 60909 60953 59601 63252 58717 60021 60622 54852 49791 53764 56440 58401 58160 57181 59779 59582
$$ packed form
18124B10416J1246J0846J1352J4427J3062J3099K6222L5925N4672P6742R7193
18113E75202J27741J65718K37990L74236O65728J282931K331181K892573J376688
18104A0029988o23751j194717j203872j529585j625672j230855p75088m61435
18096A385013k93645j94039j31776r5054q1525o9570n6832m9602l2110k9008k6243
18085C25609k3896k3203k5632k2651k0524j1179k779J464n590j0119j1979o676
18073A62845q257j0733j0618l595l087o338l0N9p172r278j1806p776N40o055q069
18058G0630M612M680n121p049L49N104K679O22m461j360J077m755r23m772l447
18043E7865L044M4j352L651m535J304O01n770n061L973K676J961k41r79K598j97
$$ plain form
18027 59582 64700 62771 63969 67624 70556 79280 86361 97335 105814 111941 115006 116287 120049 125547
18013 125547 129322 132664 134376 140719 149176 149554 140064 136970 132693 129774 125230 125508 121966 121360 121108
17998 121108 117606 118364 109141 97997 91979 82093 75053 67620 65570 62796 55276 55243 54482 52357 48471
17983 48471 50301 47909 46834 46542 46443 45791 40395 40394 51973 57125 63588 69922 65470 67330 72796 74866
17967 74866 73080 75278 77716 82056 93430 105771 108269 101236 101237 105997 101792 93788 87335 84481 77013
17952 77013 64526 59057 57279 52775 47848 45010 46518 46212 38418 30617 33253 36270 35479 29830 32219
17937 32219 42982 48073 47863 45435 45317 46575 45277 42860 40629 45078 41239 38135 41174 42006 44515
17922 44515 45479 47188 42891 40479 35149 23963 11104 4892 3402 7768 8765 869 93 6865 18110
$$ packed form
18027E9582N118j929J198L655K932Q724P081J0974Q479O127L065J281L762N498
18013A25547L775L342J712O343Q457L78r490l094m277k919m544K78l542o06k52
17998A21108l502P58r223j1144o018r886p040p433k050k774p520l3p61k125l886
17983D8471J830k392j075k92r9o52n396jJ1579N152O463O334m452J860N466K070
17967G4866j786K198K438M340J1374J2341K498p033JM760m205q004o453k854p468
17952G7013j2487n469j778m504m927k838J508l06p794p801K636L017p91n649K389
17937C2219J0763N091k10k428j18J258j298k417k231M449l839l104L039Q32K509
17922D4515R64J709m297k412n330j1186j2859o212j490M366R97p896p76O772J1245
$$ plain form
17907 18110 23382 32416 35967 28596 15227 6769 3599 11781 24600 25548 19644 17937 20675 25564
17893 25564 24509 27544 25844 28636 29903 27505 22966 19332 18050 16693 20557 26478 18960 21926
17879 21926 31547 34590 29115 26606 26342 31094 27480 19576 18739 20479 24734 22775 25391 24709 18363
17864 18363 20973 21507 16333 16472 18231 18437 18806 22009 24460 21705 16547 12892 14023 18234 22772
17849 22772 15869 15220 15365 18996 21327 24612 25455 25655 21985 18709 25847 27578 24873 24365 27324 23138
17833 23138 17260 18732 22734 21422 16839 23360 16845 19334 18055 20854 21134 29033 28997 23207 20954
17818 20954 19819 17054 18887 15999 11948 15528 15139 9109 19804 22960 22472 24355 26723 30695 25961
17803 25961 22454 20816 18618 16367 13981 22862 32284 35653 39490 48699 56203 68654 86203 98901
$$ packed form
17907A8110N272R034L551p371j3369q458l170Q182J2819R48n904j707K738M889
17893B5564j055L035j700K792J267k398m539l634j282j357L864N921p518K966
17879B1926R621L043n475k509k64M752l614p904q37J740M255j959K616o82o346
17864A8363K610N34n174J39J759K06L69L203K451k755n158l655J131M211M538
17849B2772o903o49J45L631K331L285Q43K00l670l276P138J731k705n08K959m186
17833B3138n878J472M002j312m583O521o515K489j279K799K80P899l6n790k253
17818B0954j135k765J833k888m051L580l89o030J0695L156m88J883K368L972m734
17803B5961l507j638k198k251k386Q881R422L369L837R209P504J2451J7549J2698
$$ plain form
17789 98901 105648 109228 102494 93891 85582 76895 65735 53367 45711 43246 34354 31857 34402 24524
17775 24524 18830 14434 6858 12006 19332 22401 22683 20308 16426 18399 18036 8299 2380 5583 8307
17760 8307 8681 5987 9838 11154 14276 19913 22907 31096 37852 33795 32262 39622 48667 47222 52084
17745 52084 69871 95896 122911 150408 170932 181643 186834 185019 178006 163226 140033 119617
17733 119617 94125 75858 57797 45608 41429 40160 33428 24456 23580 22355 25962 25045 24377 28320
17719 28320 27974 18326 7732 5404 12839 11171 9802 10722 14884 17580 12721 13154 15302 14426 14518 10534
17703 10534 7797 9345 8806 18245 27134 37047 41946 45533 56206 69517 80927 88098 99450 99403
17689 99403 93315 88206 77976 64623 55986 45087 36804 35290 35164 26756 17996 22448 31091 34979
$$ packed form
17789I8901O747L580o734q603q309q687j1160j2368p656k465q892k497K545r878
17775B4524n694m396p576N148P326L069K82k375l882J973l63r737n919L203K724
17760H307L74k694L851J316L122N637K994Q189O756m057j533P360R045j445M862
17745E2084J7787K6025K7015K7497K0524J0711N191j815p013j4780k3193k0416
17733A19617k5492j8267j8061j2189m179j269o732q972q76j225L607r17o68L943
17719B8320l46r648j0594k328P435j668j369R20M162K696m859M33K148q76R2l984
17703A0534k737J548n39R439Q889R913M899L587J0673J3311J1410P171J1352m7
17689I9403o088n109j0230j3353q637j0899q283j514j26q408q760M452Q643L888
$$ plain form
17675 34979 33547 29153 25790 21376 17418 15647 18581 22511 25581 25693 27774 23080 20956 24555 22841
17660 22841 17542 18995 20014 13413 6829 5518 12225 18459 17966 16399 16005 24538 29657 17176 11941
17645 11941 9687 6939 6715 9964 7860 2598 1371 -1723 -1395 2272 5783 5051 -1054 -147 6592
17630 6592 13606 14199 16736 15375 11443 11676 14684 15466 22555 24528 19814 11487 15710 21885 23845
17615 23845 17026 11757 8574 5462 1050 4288 4602 2559 2794 3574 7996 9561 122 -6176 -7672
17600 -7672 -8902 -9128 -9304 -9398 -12606 -13569 -8887 -5236 -2501 -3206 181 475 -3882 -5620 -3495 -783
17584 -783 387 -3122 -6467 -3752 -2389 -4712 -16 1266 -2069 1230 2657 4256 1082 1790 -694
17569 -694 -1934 207 1989 5880 8418 6443 5824 2977 4847 2349 -3340 -4229 -6651 -4672 -5919
$$ packed form
17675C4979j432m394l363m414l958j771K934L930L070J12K081m694k124L599j714
17660B2841n299J453J019o601o584j311O707O234m93j567l94Q533N119j2481n235
17645A1941k254k748k24L249k104n262j227l094L28L667L511p32o105R07O739
17630F592P014N93K537j361l932K33L008P82P089J973m714q327M223O175J960
17615B3845o819n269l183l112m412L238L14k043K35P80M422J565r439o298j496
17600g672j230k26j76r4l208r63M682L651K735p05L387K94m357j738K125K712
17584g83J170l509l345K715J363k323M696J282l335L299J427J599l174P08k484
17569f94j240K141J782L891K538j975o19k847J870k498n689q89k422J979j247
$$ plain form
17554 -5919 -8923 -11432 -4320 -294 -1040 -4819 -6121 160 5490 1774 -5985 -5689 -5675 -6045 -11599 -9825
17538 -9825 -1041 -629 2649 1368 4337 -3299 -5950 -4771 -4253 -9843 -11282 -6551 2317 10962 9149
17523 9149 2961 574 1182 4157 4391 10201 9181 498 1111 2062 3782 8439 10763 11515 12929 16053
17507 16053 15817 8458 3228 4839 11415 9711 2783 1173 -2563 -1972 -2802 -3806 -2338 4914 5419
17492 5419 -1355 -5184 -6039 -8298 -7098 2634 10211 11125 9020 4371 368 -1035 -5637 -8152 -8675
17477 -8675 -8781 -8721 -8284 949 9553 4365 2944 1133 -22 -2618 -2045 1571 2992 1234 -1640 -335
17461 -335 -7272 -7132 -4328 5014 10756 8142 5472 2667 6186 12364 12332 5693 4323 6099 3653 1320
17445 1320 6946 11049 10951 17082 28214 35472 44464 50203 45547 41083 36156 31389 28636 27761 19272
$$ packed form
17554e919l004k509P112M026p46l779j302O281N330l716p759K96J4l70n554J774
17538i825Q784M12L278j281K969p636k651J179N18n590j439M731Q868Q645j813
17523I149o188k387O08K975K34N810j020q683O13R51J720M657K324P52J414L124
17507A6053k36p359n230J611O576j704o928j610l736N91q30j004J468P252N05
17492E419o774l829q55k259J200R732P577R14k105m649m003j403m602k515n23
17477h675j06O0M37R233Q604n188j421j811j155k596N73L616J421j758k874J305
17461c35o937J40K804R342N742k614k670k805L519O178l2o639j370J776k446k333
17445A320N626M103r8O131J1132P258Q992N739m656m464m927m767k753q75q489
$$ plain form
17430 19272 5609 -809 898 -910 692 6332 5215 3230 -3703 4601 6324 5391 3640 -6147
17416 -6147 -10408 -4631 2369 4097 5395 7647 6052 6369 4195 8239 15459 13682 10979 7050 4390
17401 4390 7909 6724 6402 5784 6589 7468 8031 -1238 -4994 -465 -5019 -1911 2355 -2013 -839 714
17385 714 2298 1307 -1505 -6733 -5773 3268 7807 7870 8497 11325 12484 10942 18579 19913 17172 12798
17369 12798 7557 5239 1035 -1731 -2816 -4155 -7241 410 8961 7263 6341 7825 3561 -3578 -4448
17354 -4448 1280 5056 7054 7947 11509 13899 8735 3861 -2535 -11642 -14202 -9577 -5895 3781 4614
17339 4614 1730 585 3697 1645 6401 6086 2579 2063 -4868 -14869 -18579 -18269 -16285 -15236 -15058
17324 -15058 -4996 -2522 -3393 -1236 2580 4864 9101 10739 13706 17519 15741 15878 14876 12375 13346
$$ packed form
17430A9272j3663o418J707j808J602N640j117j985o933Q304J723r33j751r787
17416f147m261N777P000J728J298K252j595L17k174M044P220j777k703l929k660
17401D390L519j185l22o18Q05Q79N63r269l756M529m554L108M266m368J174J553
17385G14J584r91k812n228R60R041M539O3O27K828J159j542P637J334k741m374
17369A2798n241k318m204k766j085j339l086P651Q551j698r22J484m264p139q70
17354d448N728L776J998Q93L562K390n164m874o396r107k560M625L682R676Q33
17339D614k884j145L112k052M756l15l507n16o931j0001l710L10J984J049J78
17324a5058J0062K474q71K157L816K284M237J638K967L813j778J37j002k501R71
$$ plain form
17309 13346 12293 6954 2085 -1777 708 3049 -3060 -2293 214 -2749 -782 -455 -221 -935 -294 -5344
17293 -5344 -5523 -3174 -1638 -3421 -5441 -4310 -3855 1838 2296 -2416 -3917 -6735 -7743 -7284 -6566 111
17277 111 3590 5680 8281 6706 -1259 -7257 -9079 -4010 1117 -3564 -29 6741 -809 -7532 -5464
17262 -5464 -2436 -6892 -8876 -11697 -8009 -8303 -9858 -10313 -15978 -15305 -12351 -9908 -13541 -13000 -13990 -11089
17246 -11089 -11572 -13843 -9578 -5024 -6344 -6302 -8237 -7331 -9216 -6594 -3936 -2788 -5570 -14289 -15749
17231 -15749 -9282 -6006 -283 -2734 -8504 -7942 -9604 -9145 -10511 -13296 -10351 -11409 -15174 -12856 -11237
17216 -11237 -15486 -17574 -14041 -6137 -5795 -5540 -5656 -6429 -10800 -9432 -7570 -10724 -12187 -9199 -6983
17201 -6983 -8876 -10600 -13933 -13050 -9351 -8950 -6117 -8403 -13628 -6953 -3297 -2261 -12 -3296 -14369
$$ packed form
17309A3346j053n339m869l862K485K341o109P67K507k963J967L27K34p14O41n050
17293e344j79K349J536j783k020J131M55N693M58m712j501k818j008M59P18O677
17277A11L479K090K601j575p965n998j822N069N127m681L535O770p550o723K068
17262e464L028m456j984k821L688k94j555m55n665O73K954K443l633N41r90K901
17246a1089m83k271M265M554j320M2j935R06j885K622K658J148k782q719j460
17231a5749O467L276N723k451n770N62j662M59j366k785K945j058l765K318J619
17216a1237m249k088L533P904L42K55j16p73m371J368J862l154j463K988K216
17201f983j893j724l333Q83L699M01K833k286n225O675L656J036K249l284j1073
$$ plain form
17186 -14369 -15251 -9499 -8877 -690 -461 756 222 1288 -172 181 4268 6547 556 -6590 -10932 -14351
17170 -14351 -12989 -8127 -5249 -322 655 -1113 -3476 -9524 -14823 -15625 -10577 -8232 -8547 -6303 -6948
17155 -6948 -11246 -8820 -4028 1824 2259 -1278 1328 1160 2615 -4899 -1089 -1517 -2403 -183 -884 -1985
17139 -1985 -1505 119 -7230 -11609 -11158 -8826 -1694 1641 -775 -4628 -1198 -3345 -6999 -6321 -4601
17124 -4601 -3670 -931 4862 1593 3263 1846 -3113 -3671 -2171 -223 1201 -1003 478 -352 6530
17109 6530 12486 2246 -1719 643 2917 6721 1455 -4609 -5503 -5231 -7562 -7593 -8284 -6905 -7329 -3408
17093 -3408 -4883 -6983 -8869 -5388 -3996 5567 15520 12836 5639 4948 -152 873 4677 2038 -7596
17078 -7596 -8398 -8047 -6462 -10674 -12634 -8395 -3035 -2746 -3974 -2349 -11286 -14287 -9461 -9094 -7706 -6801
$$ packed form
17186a4369q82N752O22Q187K29J217n34J066j460L53M087K279n991p146m342l419
17170a4351J362M862K878M927R77j768k363o048n299q02N048K345l15K244o45
17155f948m298K426M792N852M35l537K606j68J455p514L810m28q86K220p01j101
17139a985M80J624p349m379M51K332P132L335k416l853L430k147l654O78J720
17124d601R31K739N793l269J670j417m959n58J500J948J424k204J481q30O882
17109F530N956j0240l965K362K274L804n266o064q94K72k331l1o91J379m24L921
17093c408j475k100j886L481J392R563R953k684p197o91n100J025L804k639r634
17078g596q02L51J585m212j960M239N360K89j228J625q937l001M826L67J388R05
$$ plain form
17062 -6801 -9092 -11255 -8637 -7557 -1712 -1246 -6911 -49 3801 -2352 -7182 -6546 -3424 -4013 -8921
17047 -8921 -11883 -12950 -10504 -13292 -9868 225 766 2773 -171 -12947 -17943 -18323 -8998 -7322 -6847
17032 -6847 -4130 570 8385 9509 9355 6924 -2332 -6198 -5471 -7014 -5659 3786 11394 8320 4676
17017 4676 341 -3282 -7873 -10461 -6599 1941 5201 4239 -3597 -1862 -967 222 -4666 -8100 -6944
17002 -6944 -12050 -16985 -18647 -19111 -24806 -26634 -18097 -13060 -12216 -15737 -9191 -7537 -14403 -13943 -7063
16987 -7063 -11661 -12085 -11691 -13908 -12822 -14309 -9060 -354 -1824 -451 -2209 -4663 -6212 1180 3722
16972 3722 22 -4887 -14226 -15161 -15993 -12175 -7659 -7954 -8990 -3640 4149 6802 4882 -1334 -4956
16957 -4956 -4657 -3335 333 730 -5228 -4242 -675 883 -644 -6444 -10847 -7125 -11109 -13002 -11078
$$ packed form
17062f801k291k163K618J080N845M66n665O862L850o153m830O36L122n89m908
17047h921k962j067K446k788L424J0093N41K007k944j2776m996l80R325J676M75
17032f847K717M700P815J124j54k431r256l866P27j543J355R445P608l074l644
17017D676m335l623m591k588L862Q540L260r62p836J735Q95J189m888l434J156
17002f944n106m935j662m64n695j828Q537N037Q44l521O546J654o866M60O880
16987g063m598m24L94k217J086j487N249Q706j470J373j758k454j549P392K542
16972C722l700m909r339r35q32L818M516k95j036N350P789K653j920o216l622
16957d956K99J322L668L97n958R86L567J558j527n800m403L722l984j893J924
$$ plain form
16942 -11078 -3673 1579 -5754 -9257 -3327 -1563 -7026 -5258 -4455 427 1009 -1730 -6154 -1358 3789
16927 3789 8999 5737 -4476 -16472 -21898 -14295 -19021 -21954 -17763 -12587 -6623 -1866 -6334 -12228
16913 -12228 -8046 -3461 -7763 -12649 -6872 -3917 -6422 -3661 -7595 -8380 -10193 -4927 279 -1468 -6637
16898 -6637 -6526 -7369 -10374 -12674 -16592 -13513 -13204 -10087 -7779 -11970 -13347 -7206 -2696 -6618 -6858 -6049
16882 -6049 -11282 -4097 2688 -2471 -9052 -6292 -7345 -11783 -14654 -16570 -14183 -7740 -2738 350 -6210
16867 -6210 -8625 -10559 -15581 -17878 -9093 -4649 -3717 3249 5096 -2535 -6805 -10851 -10100 -10616 -7855
16852 -7855 -8401 -15744 -17951 -13662 -14472 -12690 -1994 -1956 -4510 -3351 -4029 764 -1730 -5892 -3237 543
16836 543 1410 1211 -3775 -8478 -11325 -7913 -5243 -2451 2251 1152 -918 -1559 2132 3288 -2196 -620
$$ packed form
16942a1078P405N252p333l503N930J764n463J768Q03M882N82k739m424M796N147
16927C789N210l262j0213j1996n426P603m726k933M191N176N964M757m468n894
16913a2228M182M585m302m886N777K955k505K761l934p85j813N266N206j747n169
16898f637J11q43l005k300l918L079L09L117K308m191j377O141M510l922k40Q09
16882f049n233P185O785n159o581K760j053m438k871j916K387O443N002L088o560
16867f210k415j934n022k297Q785M444R32O966J847p631m270m046P51n16K761
16852g855n46p343k207M289q10J782J0696L8k554J159o78M793k494m162K655L780
16836E43Q67j99m986m703k847L412K670K792M702j099k070o41L691J156n484J576
$$ plain form
16820 -620 2366 -252 -3495 -8107 -2231 -7977 -9313 -1688 3624 1826 -5623 -2932 2571 2584 989
16805 989 -6773 -7275 -2455 1562 3491 -1567 -3977 -4164 -8258 -9339 -6686 2390 32 -2794 -164
16790 -164 3870 853 -3362 -9091 -8119 -6188 -5090 -3997 -3715 -1315 -2430 -7541 -10207 -13095 -9681
16775 -9681 -12674 -16677 -17870 -17460 -11858 -9879 -4836 -1862 394 3213 3204 1417 1032 2527 -2292 -5106
16759 -5106 -8221 -5037 -7202 -9667 -6536 -2291 -3195 -2220 -8342 -4732 -1004 -5200 -8862 -12865 -10409
16744 -10409 -7986 -11635 -16105 -12215 -11826 -16188 -12110 -11085 -15006 -14549 -11896 -16495 -22987 -17601 -13408
16729 -13408 -8587 -10981 -12431 -15580 -14484 -12258 -8299 -16022 -17662 -12687 -11594 -10414 -10060 -9166 -9662
16714 -9662 -14452 -8871 -9218 -7030 -706 -6897 -12479 -8069 -5817 -2524 -2401 -4763 -8086 -7762 -2667
$$ packed form
16820f20K986k618l243m612N876n746j336P625N312j798p449K691N503J3j595
16805I89p762n02M820M017J929n058k410j87m094j081K653R076k358k826K630
16790a64M034l017m215n729R72J931J098J093K82K400j115n111k666k888L414
16775i681k993m003j193M10N602J979N043K974K256K819rj787l85J495m819k814
16759e106l115L184k165k465L131M245r04R75o122L610L728m196l662m003K456
16744a0409K423l649m470L890L89m362M078J025l921M57K653m599o492N386M193
16729a3408M821k394j450l149J096K226L959p723j640M975J093J180L54Q94m96
16714i662m790N581l47K188O324o191n582M410K252L293J23k362l323L24N095
$$ plain form
16699 -2667 -7389 -13432 -7703 -6763 -11390 -10139 -4864 323 2628 1854 -3597 -5215 -400 234 -4816
16684 -4816 -13003 -16567 -17623 -13524 -12769 -17223 -16393 -18115 -20482 -16882 -16293 -10204 -3815 -8675 -18098
16669 -18098 -16662 -16006 -14973 -5631 3720 4684 2553 -922 -11187 -13602 -13272 -11489 -11698 -17738 -20400
16654 -20400 -15712 -7254 -1845 -809 5970 13014 2929 4802 -1933 -3747 1985 -786 -4122 -1705
16640 -1705 -1237 390 -4305 -2981 4213 3396 -1140 -5652 -6278 -7786 -13064 -13018 -9452 -9268 -6721 -4586
16624 -4586 -5339 -10147 -12663 -5630 1476 3692 10376 7852 -876 -6468 -10279 -12758 -11400 -10480 -11353
16609 -11353 -12054 -4192 1448 1067 -1441 -2306 -4208 -1609 -3826 -7075 -6368 -6478 -922 -4867 -9289 -11822
16593 -11822 -10895 -14224 -12807 -7313 -4999 -7105 -2301 581 -2464 -9697 -7321 -1152 -1488 -8975 -10075
$$ packed form
16699b667m722o043N729R40m627J251N275N187K305p74n451j618M815O34n050
16684d816q187l564j056M099P55m454Q30j722k367L600N89O089O389m860r423
16669a8098J436O56J033R342R351R64k131l475j0265k415L30J783k09o040k662
16654b0400M688Q458N409J036O779P044j0085J873o735j814N732k771l336K417
16640a705M68J627m695J324P194q17m536m512o26j508n278M6L566J84K547K135
16624d586p53m808k516P033P106K216O684k524q728n592l811k479J358R20q73
16609a1353p01P862N640l81k508q65j902K599k217l249P07j10N556l945m422k533
16593a1822R27l329J417N494K314k106M804K882l045p233K376O169l36p487j100
$$ plain form
16578 -10075 -13501 -11517 -10435 -6060 925 4413 2054 -3686 -1001 -56 -4220 -9764 -14644 -12796 -4905
16563 -4905 1822 9690 10467 -2242 -5428 -6348 -8261 -7370 -12648 -14976 -14549 -14106 -13384 -9905 -8288 -7542
16547 -7542 -3306 1081 5851 3245 -4969 -5931 -7714 -6540 -12103 -12643 -9266 -10416 -10699 -10738 -12394 -11625
16531 -11625 -15321 -15629 -6784 -1721 -5615 -6807 -349 4354 -438 -9288 -4782 3031 266 -4526 -10295
16516 -10295 -6630 -4518 -6605 -11470 -12067 -10541 -6550 -10 -3496 -5484 -2522 -2511 -3346 -4898 -8424
16501 -8424 -14753 -12353 -8539 -17320 -15130 -10024 -9502 -11208 -10259 -6645 -3617 -1874 -3870 -1525 5548
16486 5548 8409 3182 -2477 -1496 -754 -9062 -6246 -5256 1185 3896 8824 7571 -239 -242 2031 3476
16470 3476 4367 -574 -8518 -17207 -19315 -13028 -7096 -4114 -3228 3406 886 -1171 -3603 -9627 -13177
$$ packed form
16578a0075l426J984J082M375O985L488k359n740K685R45m164n544m880J848P891
16563d905O727P868P77j2709l186r20j913Q91n278k328M27M43P22L479J617P46
16547g542M236M387M770k606q214r62j783J174n563n40L377j150k83l9j656P69
16531a1625l696l08Q845N063l894j192O458M703m792q850M506P813k765m792n769
16516a0295L665K112k087m865n97J526L991O540l486j988K962J1q35j552l526
16501h424o329K400L814q781K190N106N22j706R49L614L028J743j996K345P073
16486E548K861n227n659R81P42q308K816R90O441K711M928j253p810lK273J445
16470C476Q91m941p944q689k108O287N932K982Q86O634k520k057k432o024l550
$$ plain form
16455 -13177 -10991 -8834 -9466 -4306 2350 3383 3406 5559 4914 4241 3051 1336 4617 2294 -204 1757
16439 1757 -1992 -2476 -5980 -4854 -1475 -4939 -8946 -11793 -10969 -4142 -4296 -3172 673 2518 11091
16424 11091 16988 19348 19456 17974 17645 20131 24005 26906 22581 20209 11453 7016 9148 8127 5479
16409 5479 7373 8147 9123 6642 -1608 -2138 1077 -6143 -8166 -7607 -10265 -7841 -4783 -1096 -6503 -8717
16393 -8717 -9155 -12513 -10134 -11336 -9871 -8229 -7391 -5656 -386 -672 -2265 -7065 -9041 -7392 -6158
16378 -6158 -8588 -4748 -4983 2251 5233 3445 1098 -6017 -10040 -13882 -12183 -8208 -12378 -16107 -16458
16363 -16458 -16025 -12591 -10817 -5010 -6908 -6765 -5814 -5151 -5423 -3906 -822 -1619 -1962 -1198 1682 179
16347 179 -3073 -5625 -8598 -15879 -16576 -13608 -5743 -352 5689 5011 -556 -4809 -10578 -12837 -6643
$$ packed form
16455a3177K186K157o32N160O656J033K3K153o45o73j190j715L281k323k498J961
16439A757l749m84l504J126L379l464m007k847Q24O827j54J124L845J845Q573
16424A1091N897K360J08j482l29K486L874K901m325k372q756m437K132j021k648
16409E479J894P74R76k481q250n30L215p220k023N59k658K424L058L687n407k214
16393h717m38l358K379j202J465J642Q38J735N270k86j593m800j976J649J234
16378f158k430L840k35P234K982j788k347p115m023l842J699L975m170l729l51
16363a6458M33L434J774N807j898J43R51O63k72J517L084p97l43P64K880j503
16347A79l252k552k973p281o97K968P865N391O041o78n567m253n769k259O194
$$ plain form
16332 -6643 -343 -960 1355 2725 5885 5645 1669 -2196 -1379 -3660 -4767 -8496 -2760 -1621 -3941
16317 -3941 -6193 -3773 -1176 2999 3160 1793 -5157 -15607 -19578 -23114 -15880 -10873 -4955 -448 -1796
16302 -1796 -5126 -8424 -7413 -4753 -9690 -10283 -5465 -4848 -4224 -945 -1193 -1245 -892 4072 -564 -8819
16286 -8819 -19390 -13081 -14278 -10403 -4067 -4396 744 -2408 -2790 -5972 -9420 -10963 -11826 -7352 -3726
16271 -3726 -10167 -12250 -11879 -10275 -8915 -5420 -2782 -4333 -2012 -11179 -17132 -15727 -15686 -14901 -10413 -9158
16255 -9158 -7285 -5206 -2745 -872 -7315 -14913 -14958 -11843 -6613 -2067 -6763 -11423 -10843 -10364 -12447 -13162
16239 -13162 -10018 -3167 -2159 -9223 -18679 -16246 -10944 1400 5478 -704 -4296 -9936 -4409 -5725
16225 -5725 -12615 -11574 -8612 -13912 -12218 -4757 -2830 438 -539 -4643 -6041 -7542 -6640 -7132 -13379
$$ packed form
16332f643O300o17K315J370L160k40l976l865Q17k281j107l729N736J139k320
16317c941k252K420K597M175J61j367o950j0450l971l536P234N007N918M507j348
16302a796l330l298J011K660m937n93M818O17O24L279k48n2L53M964m636q255
16286h819j0571O309j197L875O336l29N140l152l82l182l448j543q63M474L626
16271c726o441k083L71J604J360L495K638j551K321r167n953J405M1P85M488J255
16255i158J873K079K461J873o443p598m5L115N230M546m696m660N80M79k083p15
16239a3162L144O851J008p064r456K433N302J2344M078o182l592n640N527j316
16225e725o890J041K962n300J694P461J927L268r77m104j398j501R02m92o247
$$ plain form
16210 -13379 -16266 -6529 3153 -114 -1899 -2164 -4347 -8877 -12192 -11630 -15307 -13153 -8352 -2352 -2727
16195 -2727 -8024 -8822 -8840 -7224 -2656 -2186 -6810 -11650 -12087 -10874 -9690 -3405 -168 -3372 -5721 -7559
16179 -7559 -5876 -5532 -6409 -3023 -3593 -10404 -7248 -1823 -3378 -7418 -11478 -8298 -4911 -3442 -6870
16164 -6870 -7903 -6615 -7070 -10962 -14264 -15987 -13825 -9299 -6984 -6006 -7602 -12215 -11554 -9875 -7839
16149 -7839 -10349 -10300 -13119 -11426 -4237 -3496 -2324 -5293 -12541 -13498 -12960 -9669 -11833 -10328 -12728 -14413
16133 -14413 -8188 -1542 -3966 -5763 -5041 -5723 -5950 -6265 -11162 -13286 -11680 -4356 -4435 -7556 -14755 -9260
16117 -9260 -8259 -4204 -3829 -7822 -1968 308 1341 2673 7108 8980 1660 3307 5037 -1446 -5395
16102 -5395 -2265 -2133 -4883 -11595 -14575 -12357 -9530 -8733 -8202 -6409 -11300 -12016 -9439 -14861 -17289 -6980
$$ packed form
16210a3379k887R737R682l267j785k65k183m530l315N62l677K154M801O000l75
16195b727n297p98j8J616M568M70m624m840m37J213J184O285L237l204k349j838
16179g559J683L44q77L386n70o811L156N425j555m040m060L180L387J469l428
16164f870j033J288m55l892l302j723K162M526K315R78j596m613O61J679K036
16149g839k510M9k819J693P189P41J172k969p248r57N38L291k164J505k400j685
16133a4413O225O646k424j797P22o82k27l15m897k124J606P324p9l121p199N495
16117i260J001M055L75l993N854K276J033J332M435J872p320J647J730o483l949
16102e395L130J32k750o712k980K218K827P97N31J793m891p16K577n422k428J0309
$$ plain form
16086 -6980 -3089 1656 -2576 -2267 2443 -1615 2610 7813 4808 3556 2471 2031 -7418 -18485 -17248
16071 -17248 -8467 -1803 -8164 -9817 -3715 -5737 -7400 -8587 -7395 -6749 -4293 -8958 -14478 -17714 -13056
16056 -13056 -9998 -5934 -4250 1027 4035 7956 6388 -1191 -7777 -6645 -579 -1421 -4845 -8140 -4560
16041 -4560 -554 -2002 -1058 -1839 -5885 -3092 -6641 -7297 -4556 -4878 -3228 1647 1303 586 -188 -4538
16025 -4538 -2114 -1160 -2517 -7475 -11242 -17363 -18908 -22013 -20514 -15369 -12525 -10935 -12573 -14665 -15321
16010 -15321 -14761 -13627 -13359 -15581 -15740 -10266 -11996 -12989 -11123 -11535 -8668 -12878 -13311 -10839 -13828 -17216
15994 -17216 -16201 -15140 -12738 -10340 -1852 -925 -698 -1665 -1471 3588 4820 8927 8487 12481 12993 3448
15978 3448 -2162 -5129 -5613 551 5906 -207 -7929 -11146 -12133 -2748 1889 6220 14443 6281 80
$$ packed form
16086f980L891M745m232L09M710m058M225N203l005j252j085m40r449j1067J237
16071a7248Q781O664o361j653O102k022j663j187J192O46K456m665n520l236M658
16056a3056L058M064J684N277L008L921j568p579o586J132O066q42l424l295L580
16041d560M006j448R44p81m046K793l549o56K741l22J650M875l44p17p74m350
16025d538K424R54j357m958l767o121j545l105J499N145K844J590j638k092o56
16010a5321N60J134K68k222j59N474j730r93J866m12K867m210m33K472k989l388
15994a7216J015J061K402K398Q488R27K27r67J94N059J232M107m40L994N12r545
15978C448n610k967m84O164N355o113p722l217r87R385M637M331Q223q162o201
$$ plain form
15963 80 -4795 -5059 -9555 -10208 -6084 -10549 -9635 -5415 -8641 -3002 -6295 -6870 -4875 -4187 -1783 -3322
15947 -3322 -5964 -2122 -1702 1888 5354 325 -3885 -5073 -1286 2266 1363 83 -1634 -2981 -6365
15932 -6365 -5893 -6880 -5287 3237 1948 -3263 -4079 -14220 -11591 -6369 -8674 -13022 -16840 -12749 -6994
15917 -6994 -3371 -3629 -7724 -9172 -8835 -7927 -4370 -1515 -3772 -5000 4379 6843 1518 -1033 2375
15902 2375 -1560 2679 -4994 -7428 -464 3196 4291 3535 973 -562 -236 -1479 -1548 -4537 -3693 -3046
15886 -3046 -8402 -5835 -1689 -2801 -9272 -5813 -3822 -3233 -1808 -1823 7041 5772 5320 743 1780 4365
15870 4365 4675 -3742 -9662 -12885 -9399 -6484 -3688 -5347 -4953 612 -129 1322 3863 910 -1733
15855 -1733 766 1188 -3352 -1655 2069 850 3308 3672 380 5546 5398 -3461 2876 4792 6724
$$ packed form
15963H0m875k64m496o53M124m465R14M220l226N639l293n75J995O88K404j539
15947c322k642L842M20L590L466n029m210j188L787L552r03j280j717j347l384
15932f365M72r87J593Q524j289n211q16j0141K629N222k305m348l818M091N755
15917f994L623k58m095j448L37R08L557K855k257j228R379K464n325k551L408
15902B375l935M239p673k434O964L660J095p56k562j535L26j243o9k989Q44O47
15886c046n356K567M146j112o471L459J991N89J425j5Q864j269m52m577J037K585
15870D365L10q417n920l223L486K915K796j659L94N565p41J451K541k953k643
15855a733K499M22m540J697L724j219K458L64l292N166j48q859O337J916J932
$$ plain form
15840 6724 2423 2449 5367 381 -4267 -1609 5197 9298 6139 7042 3412 -3638 399 7562 9110
15825 9110 4385 -2140 -277 1970 2789 -2034 -8703 -5865 -6065 -6992 -7278 -2548 166 35 -2853 -4197
15809 -4197 -6680 -8606 -7607 -3130 1149 -3064 -3052 -5421 -7047 -3065 -3516 -1308 -2208 2698 97 -8058
15793 -8058 -9208 -5885 -5522 -8254 -4560 -2280 -3232 -2067 -213 -212 -1335 374 -1922 -7568 -9594 -6481
15777 -6481 -6793 -6072 -7355 -6895 -10251 -8863 -8946 -1166 -242 -5504 -6193 -5877 -3473 914 1544 1333 2493
15760 2493 -2374 -7660 -8516 -6709 -14647 -17332 -7826 -1800 -7614 -7897 -6300 -12837 -17160 -15155 -11583
15745 -11583 -9650 -5283 7505 13509 16948 12378 7512 5438 7108 4788 2039 -3075 2206 3135
15731 3135 -565 -373 -6793 -23 8454 7352 -429 -974 -4211 -2404 9560 9917 2334 -3154 -1431
$$ packed form
15840F724m301K6K918m986m648K658O806M101l159R03l630p050M037P163J548
15825I110m725o525J863K247Q19m823o669K838k00r27k86M730K714j31k888j344
15809d197k483j926R99M477M279m213J2k369j626L982m51K208r00M906k601q155
15793h058j150L323L63k732L694K280r52J165J854Jj123J709k296n646k026L113
15777f481l12P21j283M60l356J388q3P780R24n262o89L16K404M387O30k11J160
15760B493m867n286q56J807p938k685R506O026n814k83J597o537m323K005L572
15745a1583J933M367J2788O004L439m570m866k074J670k320k749n114N281R29
15731C135l700J92o420O770Q477j102p781n45l237J807J1964L57p583n488J723
$$ plain form
15716 -1431 10429 14680 4408 -8903 -13881 -9858 -944 -3904 -1814 -1212 2303 8416 2526 -2450
15702 -2450 -4546 -619 1547 -11449 -10039 2263 1699 -4975 -4257 -5828 -8235 -726 4089 -2760 -7283
15687 -7283 -2057 -3078 -9249 -9341 -7315 -3099 2229 5727 5665 2634 5385 4680 6757 12130 11197 9498
15671 9498 10045 10878 6414 248 -8730 -12073 -7989 176 453 1658 4331 5979 5900 1075 1930 2247
15655 2247 3657 560 -65 357 -3188 -10231 -6500 -1957 2025 2093 422 7848 12310 8583 2289 -4183
15639 -4183 -3704 3170 7397 200 -6883 -4959 -3632 -3842 -6432 -5661 -8431 -12654 -7628 4336 -495
15624 -495 -2458 71 2234 1879 -952 -4697 -4470 -2471 -2367 -3607 -3269 -3499 -840 2322 918 113
15608 113 8770 7981 1589 -1153 2390 7488 2352 578 -148 3857 -818 304 184 2305 1204 -7117
$$ packed form
15716a431J1860M251j0272j3311m978M023Q914k960K090O02L515O113n890m976
15702b450k096L927K166j2996J410J2302n64o674P18j571k407P509M815o849m523
15687g283N226j021o171r2K026M216N328L498o2l031K751p05K077N373r33j699
15671I498N47Q33m464o166q978l343M084Q165K77J205K673J648p9m825Q55L17
15655B247J410l097o25M22l545p043L731M543L982O8j671P426M462l727o294o472
15639d183M79O874M227p197p083J924J327k10k590P71k770m223N026J1964m831
15624d95j963K529K163l55k831l745K27J999J04j240L38k30K659L162j404q05
15608A13Q657p89o392k742L543N098n136j774p26M005m675J122j20K121j101q321
$$ plain form
15592 -7117 -6998 864 8346 7070 3630 2093 5544 4565 4846 11700 13416 9308 8059 -992 -3868
15577 -3868 -6618 -4041 5949 7906 10724 11348 13799 18901 15075 9153 6844 5659 3517 -1992 -4989
15562 -4989 -1293 2589 2002 4875 7850 12003 12098 12542 10145 2851 -55 897 6795 10297 8344 2955
15546 2955 -361 4409 6570 2534 7100 11498 11366 7179 5714 4766 3961 4357 1253 1731 2303 5235
15530 5235 2875 -2403 -4106 2009 8786 10449 5604 1505 -2227 -3734 -8090 -2426 2762 4372 8454
15515 8454 14515 18157 13579 13072 15472 14528 17786 15659 8473 7581 4654 3279 2543 2587 3650 3109
15499 3109 5874 9117 4948 1955 4538 4596 4651 2962 -582 1467 4692 2805 -2179 -8486 -6713 -7760
15483 -7760 -6016 -2667 -1608 953 6196 7125 2532 5160 6239 9081 10370 9232 7499 15240 11309
$$ packed form
15592g117J19P862P482j276l440j537L451r79K81O854J716m108j249r051k876
15577c868k750K577R990J957K818O24K451N102l826n922k309j185k142n509k997
15562d989L696L882n87K873K975M153R5M44k397p294k906R52N898L502j953n389
15546B955l316M770K161m036M566M398j32m187j465r48q05L96l104M78N72K932
15530E235k360n278j703O115O777J663m845m099l732j507m356N664N188J610M082
15515H454O061L642m578n07K400r44L258k127p186q92k927j375p36M4J063n41
15499C109K765L243m169k993K583N8N5j689l544K049L225j887m984o307J773j047
15483g760J744L349J059K561N243R29m593K628J079K842J289j138j733P741l931
$$ plain form
15468 11309 7087 4883 5350 13689 13685 6791 109 -1701 7251 9948 11086 8535 7487 4313 2910
15453 2910 328 -3229 1633 3303 6057 9137 7851 5012 6239 8560 10453 14230 14127 11560 10356
15438 10356 8161 6775 9748 8315 5048 7166 2705 -196 751 950 932 -2408 -6889 -9855 -5079
15423 -5079 -2436 -4134 -1464 3474 8021 7103 6167 7836 6456 6763 4053 5473 12843 13599 14293 15514
15407 15514 16787 21612 19380 14336 13642 10357 7119 10732 14501 14600 14568 7780 2550 7336 8876 6097
15391 6097 3137 4047 4067 7111 -754 510 10581 18257 11698 7325 8381 7412 8997 10157 1564
15376 1564 -4706 -6492 -186 235 2242 3735 537 3129 7347 9138 11433 8830 9449 14509 18468
15361 18468 13597 11034 8550 2600 -3832 -6613 -7770 -11239 -7461 -8572 -3048 -3127 -856 -3230 638
$$ packed form
15468A1309m222k204M67Q339mo894o682j810Q952K697J138k551j048l174j403
15453B910k582l557M862J670K754L080j286k839J227K321J893L777j03k567j204
15438A0356k195j386K973j433l267K118m461k901R47J99j8l340m481k966M776
15423e079K643j698K670M938M547r18r36J669j380L07k710J420P370P56O94J221
15407A5514J273M825k232n044o94l285l238L613L769R9l2o788n230M786J540k779
15391F097k960R10K0L044p865J264J0071P676o559m373J056r69J585J160q593
15376A564o270j786O306M21K007J493l198K592M218J791K295k603O19N060L959
15361A8468m871k563k484n950o432k781j157l469L778j111N524p9K271k374L868
$$ plain form
15346 638 323 -3959 -3323 6807 4063 -7583 -20581 -14429 5877 34369 47355 38133 31123 47854
15332 47854 69902 70151 49788 25500 3011 -13603 -17818 -13939 -6177 2559 3400 261 -1796 -618
15318 -618 31 4985 8784 4984 5558 -614 -864 -3551 -3214 6168 8565 7482 7860 4898 5611 4951 5863
15301 5863 4625 4774 8035 6214 2182 846 8729 14424 9090 6003 3104 4261 2947 -451 -556
15286 -556 1645 1778 3448 3085 10694 13545 9245 7563 4882 6967 9530 6440 7324 11105 18594 17363
15270 17363 17731 10903 5381 4678 432 6353 13961 12607 14604 18438 16742 17954 19499 12621 6385
15255 6385 5590 5225 7172 9230 11813 4246 -2580 -2099 -4278 -3061 -7805 -2068 -1618 -1322 1819 1705
15239 1705 683 -950 1693 6760 4298 4794 7720 6801 6566 12881 17443 15254 8767 9455 9940 14751
$$ packed form
15346F38l15m282O36J0130k744j1646j2998O152K0306K8492J2986r222p010J6731
15332D7854K2048K49k0363k4288k2489j6614m215L879P762Q736Q41l139k057J178
15318f18O49M954L799l800N74o172k50k687L37R382K397j083L78k962P13o60R12
15301E863j238J49L261j821m032j336P883N695n334l087k899J157j314l398j05
15286e56K201J33J670l63P609K851m300j682k681K085K563l090Q84L781P489j231
15270A7363L68o828n522p03m246N921P608j354J997L834j696J212J545o878o236
15255F385p95l65J947K058K583p567o826M81k179J217m744N737M50K96L141j14
15239A705j022j633K643N067k462M96K926r19k35O315M562k189o487O88M85M811
$$ plain form
15223 14751 13819 10401 9145 3559 6035 8707 10729 16818 10881 7302 6445 6892 6864 1806 3967 7710
15207 7710 7451 10774 14201 13506 11790 13950 16853 17222 15709 16513 17434 10003 4885 4407 5651 9713
15191 9713 12672 11525 5530 -1538 4494 5177 3256 9220 8412 4508 1827 -1046 -4030 -4562 -2341
15176 -2341 -2073 177 6816 10199 3483 -573 5196 7517 10793 17297 16462 12652 12727 14464 9621 3904
15160 3904 79 870 1866 8867 8562 6611 8389 7313 13970 12883 13187 15417 15248 13552 6518 6787
15144 6787 1745 11 -710 409 -404 325 4449 9839 12001 13384 14935 20469 20250 15851 14945 8360
15128 8360 8956 6732 7697 7055 1618 2350 3373 3113 2995 7277 13160 16659 17487 21572 23472 27529
15112 27529 36726 54208 63838 67357 76120 82373 81908 80761 76754 74627 63228 50052 39678 38553
$$ packed form
15223A4751r32l418j256n586K476K672K022O089n937l579q57M47k8n058K161L743
15207G710k59L323L427o95j716K160K903L69j513Q04R21p431n118m78J244M062
15191I713K959j147n995p068O032O83j921N964q08l904k681k873k984n32K221
15176b341K68K250O639L383o716m056N769K321L276O504q35l810P5J737m843n717
15160C904l825P91R96P001l05j951J778j076O657j087L04K230j69j696p034K69
15144F787n042j734p21J119q13P29M124N390K162J383J551N534k19m399r06o585
15128H360N96k224R65o42n437P32J023k60j18M282N883L499Q28M085J900M057
15112B7529R197J7482R630L519Q763O253m65j147m007k127j1399j3176j0374j125
$$ plain form
15098 38553 39149 31952 29513 23326 15300 13179 13121 19795 20619 20162 15612 210 -1887 10401 17250
15083 17250 11637 12345 18573 20831 18595 9322 -20 -2672 3084 2101 6161 8225 7491 11131 15244
15068 15244 16171 10989 13402 13018 3272 -979 1716 4873 5415 11954 14528 11101 9518 8100 11920
15053 11920 10466 12212 10104 13328 18004 19123 20351 17558 18068 19004 20776 16001 9664 5339 1985
15038 1985 2485 7191 8800 7005 30 -3259 -1766 6190 9442 5243 316 1011 1248 -492 4156
15023 4156 4251 6536 10954 11243 11538 8466 8908 8755 4189 9159 7945 5614 1901 1848 4275 5551 4544
15006 4544 9051 15035 15231 8189 9388 14263 16300 14972 19717 19805 20119 27349 31116 32449 34964 33393
14990 33393 30786 25621 25463 27543 20291 16321 14486 15088 20738 18126 13957 13196 13625 12116 9717
$$ packed form
15098C8553N96p197k439o187q026k121n8O674Q24m57m550j5402k097J2288O849
15083A7250n613P08O228K258k236r273r342k652N756r83M060K064p34L640M113
15068A5244R27n182K413l84r746m251K695L157N42O539K574l427j583j418L820
15053A1920j454J746k108L224M676J119J228k793N10R36J772m775o337m325l354
15038A985N00M706J609j795o975l289J493P956L252m199m927O95K37j740M648
15023D156R5K285M418K89K95l072M42j53m566M970j214k331l713n3K427J276j007
15006D544M507N984J96p042J199M875K037j328M745Q8L14P230L767J333K515j571
14990C3393k607n165j58K080p252l970j835O02N650k612m169p61M29j509k399
$$ plain form
14975 9717 11776 14422 16677 12342 10712 7596 2160 7217 9166 8944 12600 12901 13809 8125 -1408
14960 -1408 2395 9166 8465 11663 16128 16448 13853 11932 9304 3250 574 -3022 -3097 -7835 -3163 5303
14944 5303 8598 5529 15479 20506 24767 33606 38323 44165 53198 57046 58158 56767 53267 48601 46634
14929 46634 48666 46486 37192 27595 23577 22096 24302 14920 9452 5524 2923 7164 7843 -3374
14915 -3374 -4163 -3211 -944 -6757 -5902 -3995 -2610 940 3929 7908 6565 8203 1974 2368 3707 1595
14899 1595 6295 6949 9747 10945 4966 1790 2636 5087 4461 5022 13648 26710 24927 16965 15943
14884 15943 9582 5445 3259 4561 2381 -3937 -1530 4633 2489 -256 5692 11223 9897 9960 7301
14869 7301 -4082 -5791 -3853 -5978 -13593 -15860 -9690 -4180 -1157 -678 -3073 -2760 -59 2066 -484
$$ packed form
14975I717K059K646K255m335j630l116n436N057J949k22L656L01R08n684r533
14960a408L803O771p01L198M465L20k595j921k628o054k676l596p5m738M672Q466
14944E303L295l069R950N027M261Q839M717N842R033L848J112j391l500m666j967
14929D6634K032k180r294r597m018j481K206r382n468l928k601M241O79j1217
14915c374p89R52K267n813Q55J907J385L550K989L979j343J638o229L94J339k112
14899A595M700O54K798J198n979l176Q46K451o26N61Q626J3062j783p962j022
14884A5943o361m137k186J302k180o318K407O163k144k745N948N531j326O3k659
14869G301j1383j709J938k125p615k267O170N510L023M79k395L13K701K125k550
$$ plain form
14854 -484 -5913 198 1224 -2636 -6711 -10207 -13552 -11572 -6287 -10243 -4956 -569 -2837 -4812 5681
14839 5681 10274 12083 14721 11221 4727 -7995 -17231 -16954 -14714 -15958 -9645 -5036 -2317 -1100 4681
14824 4681 8839 7266 -421 -6680 -6209 -3005 -4940 -3649 -5172 -2277 4495 2990 2525 310 1451
14809 1451 6928 8427 4338 3111 -4482 -10558 -10995 -9858 -12760 -8069 -1367 7537 338 -7349 -6635
14794 -6635 -4495 -1319 3334 1145 -2624 983 437 -6045 -6206 -7076 -6744 -1143 -1187 -857 2113 511
14778 511 4720 5564 -1034 -1465 -3220 -4635 -2738 4734 8787 3798 1325 4867 -590 -4121 -4226 -906
14762 -906 4612 7008 5628 4074 -207 4628 14148 17914 22951 27662 27399 31030 31642 24278 23314 23309
14746 23309 29770 33219 29457 25837 20348 12677 9549 11521 9128 8002 6681 6962 6869 -1048 -4399
$$ packed form
14854d84n429O111J026l860m075l496l345J980N285l956N287M387k268j975J0493
14839E681M593J809K638l500o494j2722r236K77K240j244O313M609K719J217N781
14824D681M158j573p687o259M71L204j935J291j523K895O772j505m65k215J141
14809A451N477J499m089j227p593o076m37J137k902M691O702Q904p199p687P14
14794f635K140L176M653k189l769L607n46o482j61q70L32N601m4L30K970j602
14778E11M209Q44o598m31j755j415J897P472M053m989k473L542n457l531j05L320
14762i06N518K396j380j554m281M835R520L766N037M711k63L631O12p364r64n
14746B3309O461L449l762l620n489p671l128J972k393j126j321K81r3p917l351
$$ plain form
14731 -4399 -1181 3835 11798 5424 2111 1541 241 -2218 -4672 -6688 -4261 -2243 -4711 -5363 -726
14716 -726 4135 2015 -8244 -6318 -959 2312 -1207 -5417 -1071 -1614 -6497 -13202 -14263 -9706 -6612
14701 -6612 -3039 2989 606 -1215 4264 3718 1324 2414 11678 11503 10646 11735 8557 2170 -6117
14686 -6117 -6569 -7831 -7682 -8316 -8058 -6390 -11529 -13533 -11838 -10496 -8594 -9453 -12219 -14208 -17759 -9251
14670 -9251 -8870 -13507 -12115 -8203 -5449 -2280 2824 3695 6584 7265 3820 -1615 -4990 -789 -2547
14655 -2547 -8414 -13234 -15714 -10571 -6606 -1091 2559 5698 -3593 -8436 -11504 -12149 -9768 -9193 -9027
14640 -9027 -12018 -8464 -5686 -2540 -7787 -13913 -15538 -15652 -20470 -20898 -17002 -13379 -13048 -7979 -4135
14625 -4135 -2330 -4681 87 3719 1645 857 -6743 -8882 -8310 -13358 -17054 -12475 -15433 -17902 -18548
$$ packed form
14731d399L218N016P963o374l313n70j300k459k454k016K427K018k468o52M637
14716g26M861k120j0259J926N359L271l519m210M346n43m883o705j061M557L094
14701f612L573O028k383j821N479n46k394J090R264j75q57J089l178o387q287
14686f117m52j262J49o34K58J668n139k004J695J342J902q59k766j989l551Q508
14670i251L81m637J392L912K754L169N104Q71K889O81l445n435l375M201j758
14655b547n867m820k480N143L965N515L650L139r291m843l068o45K381N75J66
14640i027k991L554K778L146n247o126j625j14m818m28L896L623L31N069L844
14625d135J805k351M768L632k074p88p600k139N72n048l696M579k958k469o46
$$ plain form
14610 -18548 -16678 -14280 -10422 -6704 -5795 -2058 -3502 -8186 -3344 1761 -1046 -4907 -3130 -2894 -1120
14595 -1120 -3157 -1741 -2642 -6602 -9258 -12691 -13064 -4975 -2921 -8049 -11183 -8979 -6890 -9200 -11463
14580 -11463 -7150 -4652 -4181 -7770 -7582 -8202 -8856 -4764 -3262 -7948 -8331 -9591 -13227 -12305 -5025 -3332
14564 -3332 -5936 -11575 -10045 -6192 -6893 -16544 -16793 -10964 -12283 -8240 -5929 -5644 -5664 -37 2700 6349
14548 6349 1862 -2160 -2471 -4214 -7993 -9172 -10772 -11755 -5298 -2133 -7800 -15760 -22180 -18403 -15236
14533 -15236 -17589 -14988 -9731 -7340 -8829 -12154 -10530 -6788 -4950 -7015 -10195 -19813 -27262 -22927
14519 -22927 -11055 -5836 -1092 -1639 -4334 -6861 -11104 -13828 -8259 -2751 750 4540 5913 4914 1023
14504 1023 -4815 -2950 -4750 -8109 -9033 -4440 -5030 -4984 -4991 -57 6523 4241 7703 8810 6684 3981
$$ packed form
14610a8548J870K398L858L718R09L737j444m684M842N105k807l861J777K36J774
14595a120k037J416r01l960k656l433l73Q089K054n128l134K204K089k310k263
14580a1463M313K498M71l589J88o20o54M092J502m686l83j260l636R22P280J693
14564c332k604n639J530L853p01r651k49N829j319M043K311K85k0N627K737L649
14548F349m487m022l11j743l779j179j600r83O457L165n667p960o420L777L167
14533a5236k353K601N257K391j489l325J624L742J838k065l180r618p449M335
14519b2927J1872N219M744n47k695k527m243k724N569N508L501L790J373r99l891
14504A023n838J865j800l359r24M593n90M6pM934O580k282L462J107k126k703
$$ plain form
14488 3981 3726 3736 2072 2010 6608 10901 10415 5149 1355 1323 -4761 -7916 -4916 -12899 -10375 -2168 -3461
14471 -3461 -4023 -3604 -5463 -2461 -5103 -9414 -7970 -6532 -10748 -11140 -7094 113 2512 1177 -3111
14456 -3111 -4422 -5292 -2614 -4007 -8879 -10934 -12868 -12163 -12933 -10599 -8696 -12569 -14394 -9095 -5688
14441 -5688 -8842 -9398 -5919 -1684 -1407 -2113 -7910 -6320 -967 -678 243 4097 4913 9780 7475 1608
14425 1608 -3476 -4087 -4377 -3325 -8448 -18388 -18909 -16101 -15579 -9336 -1178 -3335 -8591 -6485 -1553 -3778
14409 -3778 -8157 -15797 -12580 -11904 -10468 -10957 -7658 -9765 -7019 -5078 1083 -4493 -11661 -11805 -13703
14394 -13703 -13444 -10768 -9449 -13754 -17439 -16820 -10606 283 -940 -6188 -8074 -4448 -1077 -3791 -11858
14379 -11858 -24453 -21642 -17168 -14075 -11862 -10698 -13409 -19126 -21774 -21613 -18296 -13094 -8668 -8751 -9968
$$ packed form
14488C981k55J0j664o2M598M293m86n266l794l2o084l155L000p983K524Q207j293
14471c461n62M19j859L002k642m311J444J438m216l92M046P207K399j335m288
14456c111j311q70K678j393m872k055j934P05p70K334J903l873j825N299L407
14441e688l154n56L479M235K77p06n797J590N353K89R21L854Q16M867k305n867
14425A608n084o11k90J052n123r940n21K808N22O243Q158k157n256K106M932k225
14409c778m379p640L217O76J436m89L299k107K746J941O161n576p168j44j898
14394a3703K59K676J319m305l685O19O214J0889j223n248j886L626L371k714q067
14379a1858j2595K811M474L093K213J164k711n717k648J61L317N202M426q3j217
$$ plain form
14364 -9968 -14282 -17188 -14043 -8648 -6171 -6183 -6224 -6633 -10647 -10405 -6942 -7270 -9545 -13168 -10514 -9264
14348 -9264 -9159 -8114 -4317 -6113 -12600 -2192 8114 10120 8476 6310 3650 3449 -821 -6665 -14853
14333 -14853 -19107 -23477 -20767 -9544 -1704 587 -3391 -9493 -8948 -13616 -15335 -17701 -16005 -12295
14319 -12295 -9511 -9169 -5589 -5676 -4731 -2777 -5310 -14439 -24658 -21070 -17717 -18187 -12154 -8016 -6187
14304 -6187 -7347 -4269 -5565 -5924 -2351 -2580 -2389 -8117 -15267 -15710 -17655 -16269 -13722 -8772 -9768 -12964
14288 -12964 -9452 -4590 -6357 -7564 -3205 -6799 -5370 -6648 -13513 -19560 -16839 -11474 -9028 -11546
14274 -11546 -12654 -13755 -12323 -10511 -9268 -11173 -13212 -11791 -12618 -13449 -11372 -12556 -19961 -22786 -14514
14259 -14514 -12758 -13520 -9231 -5184 -1017 -1947 -8215 -11780 -13834 -12914 -16426 -19926 -14939 -11124 -13343
$$ packed form
14364i968m314k906L145N395K477j2m1m09m014K42L463l28k275l623K654J250
14348i264J05J045L797j796o487J0408J0306K006j644k166k660k01m270n844q188
14333a4853m254m370K710J1223P840K291l978o102N45m668j719k366J696L710
14319a2295K784L42L580q7R45J954k533r129j0219L588L353m70O033M138J829
14304f187j160L078j296l59L573k29J91n728p150m43j945J386K547M950r96l196
14288a2964L512M862j767j207M359l594J429j278o865o047K721N365K446k518
14274a1546j108j101J432J812J243j905k039J421q27q31K077j184p405k825Q272
14259a4514J756p62M289M047M167r30o268l565k054R20l512l500M987L815k219
$$ plain form
14244 -13343 -10622 -14434 -13373 -7801 -10698 -15886 -15715 -18912 -17030 -12131 -16786 -16392 -9796 -7636 -7964
14229 -7964 -4228 -7846 -7315 -11043 -14765 -14139 -16589 -12087 -11426 -6960 -7859 -10240 -6123 -10280 -20163 -22812
14213 -22812 -23716 -15582 -8924 -7927 -6854 -4784 2770 8183 9652 6941 7933 -349 2157 -3159 -8197
14198 -8197 -9715 -11529 -12122 -16287 -13912 -10397 -13278 -14068 -11165 -10225 -8929 -10211 -11424 -10504 -7659 -7586
14182 -7586 -12337 -10685 -8344 -11470 -15123 -14340 -11790 -17439 -20200 -14667 -14704 -15274 -19966 -17524 -11123 -3229
14166 -3229 -5325 -8906 -11180 -16904 -17777 -16872 -17430 -24283 -21505 -15594 -13093 -16719 -17865 -19416 -20047 -15871
14150 -15871 -16281 -25280 -29626 -29184 -26603 -19726 -18694 -16080 -12994 -9070 -9544 -7977 -10456 -14134 -13681
14135 -13681 -19100 -16188 -11362 -14361 -21705 -20054 -18957 -18704 -10931 -9249 -11164 -11461 -14519 -14016 -10070
$$ packed form
14244a3343K721l812J061N572k897n188J71l197J882M899m655L94O596K160l28
14229g964L736l618N31l728l722O26k450M502O61M466q99k381M117m157r883k649
14213b2812r04Q134O658R97J073K070P554N413J469k711R92q282K506n316n038
14198h197j518j814n93m165K375L515k881p90K903R40J296j282j213R20K845P3
14182g586m751J652K341l126l653P83K550n649k761N533l7n70m692K442O401P894
14166c229k096l581k274n724q73R05n58o853K778N911K501l626j146j551o31M176
14150a5871m10q999m346M42K581O877J032K614L086L924m74J567k479l678M53
14135a3681n419K912M826k999p344J651J097K53P773J682j915k97l058N03L946
$$ plain form
14120 -10070 -8520 -2444 1917 -3133 -6609 -3080 569 -1939 -9881 -15314 -13758 -19291 -17981 -12208
14106 -12208 -11322 -6446 -4564 -1081 -5625 -9653 -8544 -5600 -5060 -6135 -5049 1313 1582 6327 2789
14091 2789 -5281 -8994 -7574 -12541 -17081 -17955 -15184 -7451 -5305 -4021 419 -1550 -2350 -2850 -3504 -3727
14075 -3727 -3412 -3351 -636 -1075 -4192 -917 -552 2516 7420 8987 7028 11686 24217 35106 42691
14060 42691 51979 64109 78207 94000 111025 139927 162911 175853 179928 175668 167001 156150
14048 156150 140770 120941 100537 82152 70171 65650 53080 39045 35049 27796 27674 21406 7735
14035 7735 5198 2305 -1045 1305 5188 7016 8260 7657 9107 8851 8735 8832 11915 9010 5140 1662
14019 1662 1166 -119 -4898 -2438 -6617 -8190 -7799 -5393 -7032 -6596 -1392 4573 5724 2116 -3253
$$ packed form
14120a0070J550O076M361n050l476L529L649k508p942n433J556n533J310N773
14106a2208Q86M876J882L483m544m028J109K944N40j075J086O362K69M745l538
14091B789q070l713J420m967m540q74K771P733K146J284M440j969q00n00o54k23
14075c727L15O1K715m39l117L275L65L068M904J567j959M658J2531J0889P585
14060D2691R288J2130J4098J5793J7025K8902K2984J2942M075m260q667j0851
14048A56150j5380j9829k0404j8385j1981m521j2570j4035l996p253j22o268j3671
14035G735k537k893l350K350L883J828J244o03J450k56j16R7L083k905l870l478
14019A662m96j285m779K460m179j573L91K406j639M36N204N965J151l608n369
$$ plain form
14004 -3253 -4081 -8199 -6245 946 -116 -5249 -5719 -5217 -5629 -1765 88 -2373 -3935 -8959 -11683 -8566
13988 -8566 -9495 -9826 -4774 -4776 -8020 -13849 -17984 -18084 -9522 2122 1666 -8834 -13888 -11662 -10234 -10233 -11067
13971 -11067 -9403 -15247 -15487 -11983 -11097 -16956 -16731 -16170 -13114 -9029 -10402 -6720 -2952 -2875 -6307 -7704
13955 -7704 -3917 -1528 -2892 -11537 -16562 -13818 -11838 -10528 -4267 1207 1662 1092 -1253 -436 955
13940 955 -1146 1463 261 771 823 3258 11059 15717 12788 8462 8915 6576 2078 1710 6470 6515 4542
13923 4542 8587 14856 12845 10158 8865 11882 10351 8529 4403 -815 -4294 -5939 -11203 -8791 -3386
13908 -3386 -7434 -1461 4191 -1272 -1949 -2540 3776 8761 8068 14003 17686 15993 20823 26572 25886 18819
13892 18819 19559 17666 12172 3032 1606 562 4056 2661 -1429 -73 -5181 -15159 -17005 -13896 -5003
$$ packed form
14004c253q28m118J954P191j062n133m70N02m12L864J853k461j562n024k724L117
13988h566r29l31N052kl244n829m135j00Q562J1644m56j0500n054K226J428Jq34
13971a1067J664n844k40L504Q86n859K25N61L056M085j373L682L768P7l432j397
13955g704L787K389j364q645n025K744J980J310O261N474M55n70k345Q17J391
13940I55k101K609j202N10N2K435P801M658k929m326M53k339m498l68M760M5j973
13923D542M045O269k011k687j293L017j531j822m126n218l479j645n264K412N405
13908c386m048N973N652n463o77n91O316M985o93N935L683j693M830N749o86p067
13892A8819P40j893n494r140j426j044L494j395m090J356n108r978j846L109Q893
$$ plain form
13877 -5003 2832 -1327 -169 1978 -691 -9941 -11583 2359 5659 4947 5023 5569 5109 7886 9357 11367
13861 11367 5270 5389 4816 5504 6802 3075 -3552 -13700 -16328 -4855 3837 3461 1221 -846 -4496
13846 -4496 -3872 -7225 -10128 -6631 -7721 -9498 -7723 -9716 -7738 -4795 -7729 -8419 -6311 -6958 -12617
13831 -12617 -5804 1484 4733 7353 4907 2179 1254 6410 5874 -1255 -651 -4360 -3640 1949 -2261
13816 -2261 -7220 -4337 -1882 -6009 -11655 -11644 -9113 -7918 -10888 -11946 -8562 -3483 1009 -5494 -12864
13801 -12864 -15445 -11946 -11314 -6532 -8778 -10796 -10190 -14428 -15857 -14974 -9523 -9508 -17015 -22084 -24723 -17881
13785 -17881 -12863 -14297 -4865 -2286 -1019 5916 7150 7112 11813 13024 9544 11055 11463 10026 13457
13770 13457 19061 16935 9121 5157 7424 8801 8789 8135 5555 6099 -2701 -6850 -1917 1984 4563
$$ packed form
13877e003P835m159J158K147k669r250j642J3942L300p12P6N46m60K777J471K010
13861A1367o097J19n73O88J298l727o627j0148k628J1473Q692l76k240k067l650
13846d496O24l353k903L497j090j777J775j993J978K943k934o90K108o47n659
13831a2617O813P288L249K620k446k728r25N156n36p129O04l709P20N589m210
13816b261m959K883K455m127n646J1K531J195k970j058L384N079M492o503p370
13801a2864k581L499O32M782k246k018O06m238j429Q83N451J5p507n069k639O842
13785a7881N018j434R432K579J267O935J234l8M701J211l480J511M08j437L431
13770A3457N604k126p814l964K267J377j2o54k580N44q800m149M933L901K579
$$ plain form
13755 4563 6713 6067 4729 5256 -198 -7391 -9297 -7224 -8455 -9577 -6146 -5474 -7 3670 4812
13740 4812 838 1316 -4970 -7847 1137 10788 12016 12505 8037 862 -5826 -5883 -17713 -18767 -10129
13725 -10129 -4775 -1017 -3157 -9265 -12815 -15596 -15642 -15413 -13686 -7988 -4009 -2922 239 4455 11096
13710 11096 3613 -6777 -10241 -9966 -12916 -8396 -9168 -8056 -6785 -6568 -6974 -8915 -13309 -14174 -14138 -12851
13694 -12851 -14631 -7791 -2263 1239 -1696 -3377 -7974 -7215 -3117 -6043 -7654 -13265 -13094 -13456 -12350
13679 -12350 -9534 -14204 -15896 -14739 -18700 -18761 -14218 -9755 -15208 -23098 -18611 -18370 -20526 -15556 -13664
13664 -13664 -8782 -11603 -13730 -15010 -17085 -14866 -13318 -13729 -19480 -18619 -15030 -14176 -12135 -7145 -8200
13649 -8200 -13543 -14671 -12571 -10269 -1825 6116 7322 1490 -6460 -14473 -17635 -19146 -17998 -18754 -22140
$$ packed form
13755D563K150o46j338N27n454p193j906K073j231j122L431O72N467L677J142
13740D812l974M78o286k877Q984R651J228M89m468p175o688n7j1830j054Q638
13725a0129N354L758k140o108l550k781m6K29J727N698L979J087L161M216O641
13710A1096p483j0390l464K75k950M520p72J112J271K17m06j941m394q65L6J287
13694a2851j780O840N528L502k935j681m597P59M098k926j611n611J71l62J106
13679a2350K816m670j692J157l961o1M543M463n453p890M487K41k156M970J892
13664a3664M882k821k127j280k075K219J548m11n751Q61L589Q54K041M990j055
13649h200n343j128K100K302Q444P941J206n832p950q013l162j511J148p56l386
$$ plain form
13634 -22140 -20966 -15408 -8628 -9468 -9395 -4314 -7192 -13182 -8591 -4619 2718 8954 8871 5664 -2246 -710
13618 -710 -1247 -3801 -1175 4703 1371 -3022 1088 7045 8201 14131 26885 30624 27211 23023 16699
13603 16699 9498 2382 2234 -904 -1506 -1067 -2176 -3802 -3413 -7906 -9001 -3588 -5022 -8734 -12702
13588 -12702 -16543 -16530 -9354 432 7626 8705 12685 19153 23513 11711 9636 11943 20559 19653 22698
13573 22698 18604 16264 14510 13784 13858 11737 11799 17137 23645 37730 62329 83733 87122 72692 59155
13558 59155 52427 43877 38881 28336 20770 15380 12078 8241 5417 3050 1405 5147 -1185 -1513
13544 -1513 -3320 -8982 -11645 -10279 -12346 -7865 217 -229 -4116 -9139 -1531 3356 3794 -3328 -6701
13529 -6701 -2058 -2931 -3423 -4859 5699 3915 -930 7795 13215 16547 30355 49404 67154 80540
$$ packed form
13634b2140J174N558O780q40P3N081k878n990M591L972P337O236q3l207p910J536
13618g10n37k554K626N878l332m393M110N957J156N930J2754L739l413m188o324
13603A6699p201p116j48l138o02M39j109j626L89m493j095N413j434l712l968
13588a2702l841J3P176R786P194J079L980O468M360j1802k075K307Q616r06L045
13573B2698m094k340j754p26P4k121O2N338O508J4085K4599K1404L389j4430j3537
13558E9155o728q550m996j0545p566n390l302l837k824k367j645L742o332l28
13544a513j807n662k663J366k067M481Q082m46l887n023P608M887M38p122l373
13529f701M643q73m92j436J0558j784m845Q725N420L332J3808J9049J7750J3386
$$ plain form
13515 80540 87086 83776 72202 72077 77354 67212 55384 51955 41854 29511 21417 17617 6887
13502 6887 4042 6497 4124 2194 1095 -1007 -4334 -1929 1016 7955 15357 11770 10519 4571 -2551
13487 -2551 -4405 -5232 -4212 -2084 -5534 -819 -4066 -8642 -7049 -1434 1207 2502 5208 9940 16131
13472 16131 23396 33098 36426 36459 39507 48697 57106 50931 41906 39034 32813 20475 9203 3796
13458 3796 5664 5419 -1732 -1340 6106 13401 15034 10747 -3437 -12550 -9448 -2295 3123 2878 -1608
13443 -1608 -6669 -8723 -4450 -2004 -2034 -1919 1155 -3657 -5546 -4400 -5667 -7118 -9737 -11825 -9296
13428 -9296 -2571 502 1937 1630 8520 11349 11976 14289 16103 16379 9882 4146 1370 1400 5301 2724
13412 2724 -3329 -5751 -2056 8318 11581 12274 5229 6131 13302 13326 7366 -1329 -8004 -9839 -2133
$$ packed form
13515H0540O546l310j1574j25N277j0142j1828l429j0101j2343q094l800j0730
13502F887k845K455k373j930j099k102l327K405K945O939P402l587j251n948p122
13487b551j854q27J020K128l450M715l247m576J593N615K641J295K706M732O191
13472A6131P265R702L328L3L048R190Q409o175r025k872o221j2338j1272n407
13458C796J868k45p151L92P446P295J633m287j4184r113L102P153N418k45m486
13443a608n061k054M273K446l0J15L074m812j889J146j267j451k619k088K529
13428i296O725L073J435l07O890K829O27K313J814K76o497n736k776L0L901k577
13412B724o053k422L695J0374L263O93p045R02P171K4n960q695o675j835P706
$$ plain form
13397 -2133 -718 -742 2342 1412 3693 614 -296 -3989 -8544 -6020 624 1850 -4959 -9178 -3820 -5882
13381 -5882 -8493 -8990 -6536 -3707 -3886 -7678 -9028 -8692 -10232 -15915 -19253 -18915 -13202 -6749 -16120 -21214
13365 -21214 -11884 -3927 649 -1112 -5603 -2778 2802 2411 1954 1511 3517 9735 9717 4580 2518 2687
13349 2687 3551 -225 -8317 -10205 -10013 -7926 -7406 -4656 2502 7500 8445 10282 8826 3059 -2542 -6633
13333 -6633 -5348 -1469 190 973 1727 515 -14503 -27345 -27177 -16907 -7480 -4624 -3115 2540 -403
13318 -403 -9564 -10431 -628 3067 344 7280 6288 3988 4829 10188 11717 10306 4795 6558 10363 8572
13302 8572 729 -2988 2984 7475 8428 7846 15678 9248 -3795 -2285 1232 2281 6339 11625 5361
13287 5361 5133 4847 1365 354 -5045 -7617 -7400 -8934 -5277 -4617 -5784 -1651 2377 2886 9895 9334
$$ packed form
13397b133J415k4L084r30K281l079r10l693m555K524O644J226o809m219N358k062
13381e882k611m97K454K829j79l792j350L36j540n683l338L38N713O453r371n094
13365b1214R330P957M576j761m491K825N580l91m57m43K006O218j8n137k062J69
13349B687Q64l776q092j888J92K087N20K750P158M998R45J837j456n767n601m091
13333f633J285L879J659P83P54j212j5018j2842J68J0270R427K856J509N655k943
13318d03r161q67R803L695k723O936r92k300Q41N359J529j411n511J763L805j791
13302H572p843l717N972M491R53n82P832o430j3043J510L517J049M058N286o264
13287E361k28k86l482j011n399k572K17j534L657O60j167M133M028N09P009n61
$$ plain form
13271 9334 9593 7604 3820 2924 5357 6617 -141 -4508 5145 9309 10603 11836 13917 17397 19481
13256 19481 10836 1833 -756 -874 9048 19748 28359 26857 23764 27248 28501 21981 18784 21456
13242 21456 23890 26554 25935 30241 31857 34018 34177 32237 36156 37972 44708 51455 54526 65188 81812
13227 81812 96890 111907 119922 132709 159331 200266 260193 348877 501385 750954 1074579
13216 1074579 1341712 1398931 1300085 1139067 949819 741102 545113 396213 291265 222423
13206 222423 177504 156095 142919 123426 105043 84134 74743 65914 57202 58266 59231 56717 61360
13193 61360 65286 55352 40655 32889 27798 22763 12792 9478 20603 34235 44898 47108 45836
13180 45836 43857 40921 33629 32323 27923 24695 30025 38673 40148 41964 42978 44955 45729 46659 54107
$$ packed form
13271I334K59j989l784q96K433J260o758m367R653M164J294J233K081L480K084
13256A9481q645r003k589j18R922J0700Q611j502l093L484J253o520l197K672
13242B1456K434K664o19M306J616K161J59j940L919J816O736O747L071J0662J6624
13227H1812J5078J5017Q015J2787K6622M0935N9927Q8684J52508K49569L23625
13216A074579K67133N7219r8846j61018j89248k08717j95989j48900j04948o8842
13206B22423m4919k1409j3176j9493j8383k0909r391q829q712J064R65k514M643
13193F1360L926r934j4697p766n091n035r971l314J1125J3632J0663K210j272
13180D5836j979k936p292j306m400l228N330Q648J475J816J014J977P74R30P448
$$ plain form
13165 54107 65732 77295 89719 102295 113306 124165 139497 166959 203112 253041 306989 373110
13153 373110 458592 585045 761031 1037025 1491589 2196524 3136413 4078902 4686222 4780113
13143 4780113 4442058 3867015 3184392 2483486 1867741 1405744 1097028 888602 743136
13134 743136 638629 556623 498931 451466 408942 373308 343542 321368 307423 292874 292997 305805
13122 305805 312438 315573 320765 328033 343968 374810 411855 453917 509776 579632 676555 810490
13110 810490 980318 1185693 1433056 1764812 2231578 2949830 4145545 6078011 8834903
13101 8834903 11896111 14188060 14903694 14109248 12402954 10272420 8027977 5973775
13093 5973775 4367735 3267579 2564507 2108821 1787784 1544718 1346016 1186118 1057806
$$ packed form
13165E4107J1625J1563J2424J2576J1011J0859J5332K7462L6153M9929N3948O6121
13153C73110Q5482J26453J75986K75994M54564P04935R39889R42489O07320R3891
13143D780113l38055n75043o82623p00906o15745m61997l08716k08426j45466
13134G43136j04507q2006n7692m7465m2524l5634k9766k2174j3945j4549J23J2808
13122C05805O633L135N192P268J5935L0842L7045M2062N5859O9856R6923J33935
13110H10490J69828K05375K47363L31756M66766P18252J195715J932466K756892
13101H834903L061208K291949P15634p94446j706294k130534k244443k054202
13093E973775j606040j100156p03072m55686l21037k43066j98702j59898j28312
$$ plain form
13084 1057806 951629 861589 778945 715890 674511 639624 617568 599224 588663 583497 582721 589938
13072 589938 605250 634227 678962 727170 789376 886019 1003290 1148312 1325830 1561782 1888344
13061 1888344 2347004 3023695 4101166 5859431 8467108 11565934 14167016 15295684
13053 15295684 14789208 13194565 11077644 8778112 6597812 4822124 3572223 2755818
13045 2755818 2229007 1871598 1611201 1399508 1226011 1084120 965713 861945 777176 702354
13035 702354 638891 594112 553678 516511 487755 466278 439080 421014 412030 406540 399962 400932
13023 400932 410057 434896 473670 524545 584739 657414 752934 889725 1101528 1445174 2002934
13012 2002934 2841964 3887011 4828574 5313824 5242083 4781771 4137180 3395042 2629850
$$ packed form
13084A057806j06177r0040q2644o3055m1379l4887k2056j8344j0561n166p76P217
13072E89938J5312K8977M4735M8208O2206R6643J17271J45022J77518K35952L26562
13061A888344M58660O76691J077471J758265K607677L098826K601082J128668
13053A5295684n06476j594643k116921k299532k180300j775688j249901q16405
13045B755818n26811l57409k60397k11693j73497j41891j18407j03768q4769p4822
13035G02354o3463m4779m0434l7167k8756k1477k7198j8066q984n490o578R70
13023D00932R125K4839L8774N0875O0194P2675R5520J36791K11803L43646N57760
13012B002934Q39030J045047R41563M85250p1741m60312o44591p42138p65192
$$ plain form
13003 2629850 1960303 1452367 1100190 883748 745915 640975 554666 478131 409547 351491
12993 351491 310334 278298 253015 230480 213014 197351 187768 185126 179175 172477 159348 150792
12981 150792 139475 130016 125947 122364 120842 116384 108801 98280 100382 103936 101869 98798 95005 91887
12967 91887 79800 73610 76091 78322 79730 83852 89700 88601 86367 83293 80869 76117 76404 82934
12953 82934 81165 78422 84010 100336 111871 117246 131983 143324 140442 123611 103932 90168 73475
12940 73475 58421 43674 35537 43642 57579 67530 75214 82818 96450 98744 90473 83351 80121
12927 80121 77910 78106 78816 80339 83071 79309 76713 66333 61135 58544 63591 67573 61069 64575 65444
12912 65444 62928 57864 52598 44533 34476 23676 19981 16125 9885 8860 19532 28511 37510 52287
$$ packed form
13003B629850o69547n07936l52177k16442j37833j04940q6309p6535o8584n8056
12993C51491m1157l2036k5283k2535j7466j5663r583k642n951o698j3129q556
12981A50792j1317r459m069l583j522m458p583j0521K102L554k067l071l793l118
12967I1887j2087o190K481K231J408M122N848j099k234l074k424m752K87O530
12953H2934j769k743N588J6326J1535N375J4737J1341k882j6831j9679j3764j6693
12940G3475j5054j4747q137Q105J3937R951P684P604J3632K294q271p122l230
12927H0121k211J96P10J523K732l762k596j0380n198k591N047L982o504L506Q69
12912F5444k516n064n266q065j0057j0800l695l856o240j025J0672Q979Q999J4777
$$ plain form
12898 52287 61475 70122 75964 73709 65613 58525 60694 65288 67418 74338 85015 99553 110127 132014
12884 132014 214884 386423 512179 460084 307641 196441 108845 -1062 -89039 -106018
12874 -106018 -80059 -53963 -42045 -30704 -15691 -4836 7556 20006 25571 29962 38646 42692
12862 42692 46467 47585 51430 55889 62291 67179 61736 62321 69769 75060 85824 92164 96033 98601
12848 98601 102258 114606 127851 143740 167689 199175 259280 330227 354458 338376 319481 293559
12836 293559 266325 249821 236127 217569 205817 207356 214400 218170 213986 203469 197135 192838 190903
12823 190903 191475 195303 207580 217000 228744 229093 223763 227792 251629 283042 307957 330735 356255
12810 356255 381867 414230 443717 473910 508923 543640 569366 580583 591221 617404 662228
$$ packed form
12898E2287R188Q647N842k255q096p088K169M594K130O920J0677J4538J0574K1887
12884A32014Q2870J71539J25756n2095j52443j11200q7596j09907q7977j6979
12874a06018K5959K6096J1918J1341J5013J0855J2392J2450N565M391Q684M046
12862D2692L775J118L845M459O402M888n443N85P448N291J0764O340L869K568
12848I8601L657J2348J3245J5889K3949L1486O0105P0947K4231j6082j8895k5922
12836B93559k7234j6504j3694j8558j1752J539P044L770m184j0517o334m297j935
12823A90903N72L828J2277R420J1744L49n330M029K3837L1413K4915K2778K5520
12810C56255K5612L2363K9487L0193L5013L4717K5726J1217J0638K6183M4824
$$ plain form
12799 662228 722450 784884 851139 920400 983824 1045936 1117398 1216725 1326559 1474431 1675949
12788 1675949 1943638 2317463 2825751 3413290 3843160 3970692 3944733 3905896 3868358 3852702
12778 3852702 3937701 4161678 4464650 4772779 5100815 5529683 6095591 6775216 7595403 8639932
12768 8639932 10036017 11845533 13933897 16236460 19006412 22528106 27149785 33507002
12760 33507002 42780671 57230726 81245286 122101612 183655956 246470668 273009078
12753 273009078 260305189 232773253 200940458 161712502 120418545 86917392 63675116
12746 63675116 48513049 38702434 32192266 27663493 24236970 21350154 18810991 16591465
12738 16591465 14660573 12993083 11553433 10295704 9218727 8325956 7582111 6928580
$$ packed form
12799F62228O0222O2434O6255O9261O3424O2112P1462R9327J09834J47872K01518
12788A675949K67689L73825N08288N87539M29870J27532k5959l8837l7538j5656
12778C852702Q4999K23977L02972L08129L28036M28868N65908O79625Q20187J044529
12768H639932J396085J809516K088364K302563K769952L521694M621679O357217
12760C3507002R273669J4450055K4014560M0856326O1554344O2814712K6538410
12753B73009078j2703889k7531936l1832795l9227956m1293957l3501153k3242276
12746F3675116j5162067r810615o510168m528773l426523k886816k539163k219526
12738A6591465j930892j667490j439650j257729j076977q92771p43845o53531
$$ plain form
12730 6928580 6341727 5831265 5398768 5000003 4630588 4288571 3981834 3712618 3478621
12721 3478621 3275261 3097755 2939782 2803274 2680734 2556514 2424776 2294126 2164132
12712 2164132 2041487 1932867 1846716 1781458 1723897 1657014 1588288 1515417 1442323 1380806 1323951
12701 1323951 1269311 1226644 1190744 1155946 1123929 1086844 1059028 1037794 1021193 994622 956363
12690 956363 924118 906282 879361 843851 806484 782106 767855 751120 729139 692137 658868
12679 658868 639701 637254 622161 606154 594746 586197 570176 562807 563279 570077 575130 571895 560943
12666 560943 540819 519802 508219 495687 490886 487895 481794 469236 458444 445673 437115 434020
12654 434020 433841 429164 426168 423261 412530 407218 399816 389780 394871 396398 389439 382924 383760 385235
$$ packed form
12730F928580n86853n10462m32497l98765l69415l42017l06737k69216k33997
12721C478621k03360j77506j57973j36508j22540j24220j31738j30650j29994
12712B164132j22645j08620q6151o5258n7561o6883o8726p2871p3094o1517n6855
12701A323951n4640m2667l5900l4798l2017l7085k7816k1234j6601k6571l8259
12690I56363l2245j7836k6921l5510l7367k4378j4251j6735k1981l7002l3269
12679F58868j9167k447j5093j6007j1408q549j6021p369M72O798N053l235j0952
12666E60943k0124k1017j1583j2532m801k991o101j2558j0792j2771q558l095
12654D34020j79m677k996k907j0731n312p402j0036N091J527o959o515Q36J475
$$ plain form
12640 385235 381589 379132 381655 384715 388549 400096 422513 450583 484912 517532 559195 610624
12628 610624 647098 638410 561776 461437 400965 366207 336036 312749 295980 282330 287179 290881
12616 290881 293190 294557 290354 280623 272729 267411 272153 277953 287758 304487 317161 335016 348865
12603 348865 358182 366310 372493 378908 378096 376921 383800 401890 423638 459980 504249 565421 628689
12590 628689 691451 746059 786894 815522 832099 831184 805711 762270 695332 624953 560078 495798
12578 495798 437300 388054 345682 315080 283417 267928 266401 275777 282879 288054 282466 261240
12566 261240 229034 194569 174080 166977 164559 160187 144192 140244 149415 151218 143355 142123 139895
12553 139895 140687 150174 151793 160671 160431 154590 155644 153913 154035 159929 170213 178360 183842 190660 191537
$$ packed form
12640C85235l646k457K523L060L834J1547K2417K8070L4329L2620M1663N1429
12628F10624L6474q688p6634j00339o0472l4758l0171k3287j6769j3650M849L702
12616B90881K309J367m203r731p894n318M742N800R805J6729J2674J7855J3849
12603C48865R317Q128O183O415q12j175O879J8090K1748L6342M4269O1172O3268
12590F28689O2762N4608M0835K8628J6577r15k5473m3441o6938p0379o4875o4280
12578D95798n8498m9246m2372l0602l1663j5489j527R376P102N175n588k1226
12566B61240l2206l4465k0489p103k418m372j5995l948R171J803p863j232k228
12553A39895P92R487J619Q878k40n841J054j731J22N894J0284Q147N482O818Q77
$$ plain form
12538 191537 183273 178770 169290 165078 161521 164571 164718 155157 146735 148485 157192 153861 154366 156559 159463
12523 159463 157029 164406 171033 173190 172296 171454 166524 164461 162707 162213 158010 154333 151452 150832 140352
12508 140352 131797 128615 125127 128473 126910 125431 114240 94791 87105 88715 96693 102920 106580 111654
12494 111654 113904 110703 112890 109620 115421 121759 125870 132948 135805 136903 139604 141098 137938 138447
12480 138447 136230 131906 132956 140239 135766 142122 140918 137250 135055 126701 116959 114898 112321 110816
12466 110816 112297 111137 109251 108278 104665 91962 82200 84031 84412 84417 76465 69557 65166 63578 62998
12451 62998 56133 34764 12511 11333 22648 36475 50649 61952 63306 65747 64962 65033 66138 73793
12437 73793 79322 82750 88760 93122 101216 115521 127518 131021 134390 147219 157997 162811 166425
$$ packed form
12538A91537q264m503r480m212l557L050J47r561q422J750Q707l331N05K193K904
12523A59463k434P377O627K157q94q42m930k063j754m94m203l677k881o20j0480
12508A40352q555l182l488L346j563j479j1191j9449p686J610P978O227L660N074
12494A11654K250l201K187l270N801O338M111P078K857J098K701J494l160N09
12480A38447k217m324J050P283m473O356j204l668k195q354r742k061k577j505
12466A10816J481j160j886r73l613j2703r762J831L81Np952o908m391j588n80
12451F2998o865k1369k2253j178J1315J3827J4174J1303J354K441p85P1J105P655
12437G3793N529L428O010M362Q094J4305J1997L503L369J2829J0778M814L614
$$ plain form
12424 166425 169081 170359 173014 174097 176114 178897 173541 155867 142102 132237 128084 123912 120327 114634
12410 114634 110547 106940 102598 95463 95369 90885 85507 80784 82577 82571 86616 88649 87192 88878 85184
12395 85184 84182 84959 86230 82468 76071 77394 78031 78005 82608 88780 92339 100383 103501 99158 103565
12380 103565 105813 108914 97157 85914 80071 85006 100647 105584 111825 126165 133487 134159 134092 126965
12366 126965 123007 125656 121915 114776 115551 115218 116371 117362 121434 118737 109917 113353 110422 106448 113517
12351 113517 119714 123225 123941 124115 118499 109474 109077 109081 113400 116227 110093 110348 114356 117420 117722 125117
12335 125117 130017 135810 135069 130107 127323 124308 116103 102479 94855 90425 82343 79635 83824 86927
12321 86927 93527 96087 99562 102377 102243 100114 107967 118049 126786 127559 126090 128098 133115 140047 144476
$$ packed form
12424A66425K656J278K655J083K017K783n356j7674j3765r865m153m172l585n693
12410A14634m087l607m342p135r4m484n378m723J793oM045K033j457J686l694
12395H5184j002P77J271l762o397J323O37k6M603O172L559Q044L118m343M407
12380A03565K248L101j1757j1243n843M935J5641M937O241J4340P322O72o7p127
12366A26965l958K649l741p139P75l33J153R91M072k697q820L436k931l974P069
12351A13517O197L511P16J74n616r025l97MM319K827o134K55M008L064L02P395
12335A25117M900N793p41m962k784l015q205j3624p624m430q082k708M189L103
12321H6927O600K560L475K815j34k129P853J0082Q737P73j469K008N017O932M429
$$ plain form
12306 144476 151570 161293 172810 198058 214649 231464 236572 243225 253225 254934 251276 241890 239446
12293 239446 252082 271598 303015 364411 462292 629797 906693 1238442 1453671 1463156 1349439
12282 1349439 1185270 994361 782063 597615 465843 381667 315642 272220 244098 228173
12272 228173 216352 204883 193976 184650 173875 169688 175221 174152 167388 163591 161586 154343 149556
12259 149556 153032 153877 156508 159940 169660 174893 181330 186203 188782 194775 199587 209855 219471 231682
12245 231682 236314 240086 236084 225515 225627 233670 236593 237394 243143 241984 244584 258368 277356 287688
12231 287688 293318 305978 327839 341326 354920 373499 397237 412894 426803 446306 472005 501104
12219 501104 527038 547578 580460 624118 661190 702122 739752 783535 832101 878734 940558
$$ packed form
12306A44476P094R723J1517K5248J6591J6815N108O653J0000J709l658r386k444
12293B39446J2636J9516L1417O1396R7881J67505K76896L31749K15229R485j13717
12282A349439j64169j90909k12298j84448j31772q4176o6025m3422k8122j5925
12272B28173j1821j1469j0907r326j0775m187N533j069o764l797k005p243m787
12259A49556L476Q45K631L432R720N233O437M873K579N993M812J0268R616J2211
12245B31682M632L772m002j0569J12Q043K923Q01N749j159K600J3784J8988J0332
12231B87688N630J2660K1861J3487J3594J8579K3738J5657J3909J9503K5699K9099
12219E01104K5934K0540L2882M3658L7072M0932L7630M3783M8566M6633O1824
$$ plain form
12208 940558 1002694 1070255 1147936 1233506 1333341 1443947 1558537 1689461 1831398 1988539
12198 1988539 2154434 2351149 2585016 2861850 3198072 3601886 4084253 4670091 5355320
12189 5355320 6147022 7033390 8018694 9121977 10368074 11809422 13549087 15749078 18693946
12180 18693946 22780540 28434555 35892458 45121773 55956459 67991434 80318092 91732908
12172 91732908 101137944 107675300 110633893 109634711 104826337 96889613 86765668 75435190
12164 75435190 63840056 52916980 43358005 35475036 29232378 24440087 20839367 18131515
12156 18131515 16033703 14335839 12880626 11580536 10400289 9313188 8318213 7425614
12148 7425614 6641383 5958388 5357675 4842927 4403253 4031621 3706060 3424752 3181642
$$ packed form
12208I40558O2136O7561P7681Q5570R9835J10606J14590J30924J41937J57141
12198A988539J65895J96715K33867K76834L36222M03814M82367N85838O85229
12189E355320P91702Q86368R85304J103283J246097J441348J739665K199991K944868
12180A8693946M086594N654015P457903R229315J0834686J2034975J2326658J1414816
12172I1732908R405036O537356K958593r99182m808374p936724j0123945j1330478
12164G5435190j1595134j0923076r558975p882969o242658m792291l600720k707852
12156A8131515k097812j697864j455213j300090j180247j087101r94975q92599
12148G425614p84231o82995o00713n14748m39674l71632l25561k81308k43110
$$ plain form
12139 3181642 2968171 2778642 2605278 2444254 2295488 2158666 2037185 1929964 1832403 1744359
12129 1744359 1663215 1583676 1516485 1451912 1392930 1330285 1270792 1220687 1172728 1125032 1085700
12118 1085700 1046613 1015775 982630 947603 925748 902074 868280 840655 817036 791883 766711
12107 766711 745339 712957 688709 676568 660510 638228 620474 596229 578566 563142 551569
12096 551569 540175 528070 518292 505662 491820 488581 486664 485038 485891 472835 464059 461646 461371
12083 461371 452878 443291 440809 435925 430308 424066 414367 409496 412040 416855 419998 413145 408323 406827
12069 406827 397019 386482 377320 378015 377767 385711 393487 400794 409819 415931 412807 417104 415382 412114
12055 412114 410215 397504 401151 404655 404306 415977 428149 438545 454504 469475 473818 473692 467869
$$ packed form
12139C181642k13471j89529j73364j61024j48766j36822j21481j07221r7561q8044
12129A744359q1144p9539o7191o4573n8982o2645n9493n0105m7959m7696l9332
12118A085700l9087l0838l3145l5027k1855k3674l3794k7625k3619k5153k5172
12107G66711k1372l2382k4248j2141j6058k2282j7754k4245j7663j5424j1573
12096E51569j1394j2105r778j2630j3842l239j917j626Q53j3056q776k413k75
12083D61371q493r587k482m884n617o242r699m871K544M815L143o853m822j496
12069D06827r808j0537r162O95k48P944P776P307R025O112l124M297j722l268
12055D12114j899j2711L647L504l49J1671J2172J0396J5959J4971M343j26n823
$$ plain form
12042 467869 453119 429107 406932 384798 366656 352565 348515 334978 325744 323700 323809 323085 318996
12029 318996 307051 301401 304996 301480 301202 300730 308940 309308 306646 308088 316589 318745 317627 308278 300427
12014 300427 290122 278831 269754 263854 269994 270634 267203 262469 255709 248699 246021 243198 240706 244775
12000 244775 240580 236005 238742 234444 230317 229757 234166 233095 230486 231545 234083 233028 232581 233432 237523
11985 237523 237638 232963 229869 229022 224182 218627 213145 204429 193412 185944 184509 182061 179980 179806 187184
11970 187184 195684 199592 194976 191249 191153 193398 198640 200650 197689 197488 189967 184857 187722 196000 207148
11955 207148 209907 198535 188429 187904 191541 193467 192517 195558 190557 190479 191097 184041 177909 169385 162772
11940 162772 157787 160628 165633 174351 173482 168872 168109 168204 166826 166193 162994 155727 151182 146176 150259
$$ packed form
12042D67869j4750k4012k2175k2134j8142j4091m050j3537r234k044J09p24m089
12029C18996j1945n650L595l516k78m72Q210L68k662J442Q501K156j118r349p851
12014C00427j0305j1291r077n900O140O40l431m734o760p010k678k823k492M069
12000B44775m195m575K737m298m127n60M409j071k609J059K538j055m47Q51M091
11985B37523J15m675l094q47m840n555n482q716j1017p468j435k448k081j74P378
11970A87184Q500L908m616l727r6K245N242K010k961k01p521n110K865Q278J1148
11955B07148K759j1372j0106n25L637J926r50L041n001p8O18p056o132q524o613
11940A62772m985K841N005Q718q69m610p63R5j378o33l199p267m545n006M083
$$ plain form
11925 150259 151315 153601 147734 142665 139820 142185 144580 139416 139607 140228 134856 133135 132322 133959 134413
11910 134413 135283 134949 142596 146225 146852 147964 148692 147714 146726 147258 144416 141120 144324 151298 152176 152367
11894 152367 157227 163429 166134 159205 150125 141813 138540 133316 120810 123595 121406 121588 121550 121095 121387
11879 121387 115135 109247 106124 102513 103470 102143 108245 109853 103490 100426 93653 79468 71933 64287
11865 64287 67436 73722 74568 78399 74831 76129 81901 86747 88736 84664 76053 75364 86677 91073 92725
11850 92725 91303 87660 92073 102131 102275 105087 104705 99578 91820 91193 89574 90841 96238 97641 96777
11835 96777 97846 101204 109489 112833 110857 112987 109417 106737 97166 97134 101145 97549 96732 89611 90073
11820 90073 89898 89848 89719 90943 87558 91067 96759 101182 100913 101205 106404 102760 98969 96066 101037 103944
$$ packed form
11925A50259J056K286n867n069k845K365K395n164J91O21n372j721q13J637M54
11910A34413Q70l34P647L629O27J112P28r78r88N32k842l296L204O974Q78J91
11894A52367M860O202K705o929r080q312l273n224j2506K785k189J82l8m55K92
11879A21387o252n888l123l611R57j327O102J608o363l064o773j4185p535p646
11865F4287L149O286Q46L831l568J298N772M846J989m072q611o89J1313M396J652
11850I2725j422l643M413J0058J44K812l82n127p758o27j619J267N397J403q64
11835I6777J069L358Q285L344j976K130l570k680r571l2M011l596q17p121M62
11820I0073j75n0j29J224l385L509N692M423k69K92N199l644l791k903M971K907
$$ plain form
11804 103944 98677 90741 87650 94102 100407 102902 105654 101693 99158 101373 97921 96746 100710 96396
11790 96396 87478 85545 90961 95544 101195 106483 101880 98964 99888 103039 104577 104610 95769 95419 96930
11775 96930 102106 110549 109747 109882 109537 109916 114214 113897 117542 129989 139057 141481 146354 157435 166427
11760 166427 168833 182588 200448 225842 253594 289222 338117 385498 439704 495481 556063 600880
11748 600880 630398 648079 645930 619156 581005 536878 486195 438741 388437 339421 298040 259525
11736 259525 232427 219645 208216 197169 184704 177161 172565 162295 150949 145371 137960 132466
11724 132466 132317 131685 121879 118479 120710 125144 124617 117644 116286 116700 109198 110547 114274 109285 104368
11709 104368 100398 97615 101910 106148 107099 99853 97808 97431 97935 104841 108571 113045 108451 101974 97717
$$ packed form
11804A03944n267p936l091O452O305K495K752l961k535K215l452j175L964m314
11790I6396q918j933N416M583N651N288m603k916R24L151J538L3q841l50J511
11775I6930N176Q443q02J35l45L79M298l17L645J2447R068K424M873J1081Q992
11760A66427K406J3755J7860K5394K7752L5628M8895M7381N4206N5777O0582M4817
11748F00880K9518J7681k149k6774l8151m4127n0683m7454n0304m9016m1381l8515
11736B59525k7098j2782j1429j1047j2465p543m596j0270j1346n578p411n494
11724A32466j49o32r806l400K231M434n27o973j358M14p502J349L727m989m917
11709A04368l970k783M295M238R51p246k045l77N04O906L730M474m594o477m257
$$ plain form
11694 97717 100677 99357 98636 98545 95658 92911 93654 91647 87667 90148 96213 100261 104049 103731 101769 99709
11678 99709 96394 102104 97944 103819 106300 106258 101666 108716 106969 102206 104643 109147 108037 106628 105668
11663 105668 107444 105885 104258 103585 101306 99799 95286 91989 93940 96110 94303 92641 98177 102544
11649 102544 101261 100210 104900 107434 103938 107370 107683 107035 111485 108014 100010 99693 96729 98368 95870
11634 95870 93079 97070 107004 104018 102460 104754 108378 106825 98501 103302 111387 105913 105676 109763 111303
11619 111303 110283 114152 112340 103814 97986 97291 100925 99418 101950 103244 99538 93998 90481 91185 96770
11604 96770 100409 97019 98360 96775 93845 90339 93148 94212 86602 91898 88798 87204 93295 97828
11590 97828 102196 104211 99970 97880 99403 101317 105609 106788 111208 105508 104151 96633 100637 104951
$$ packed form
11694I7717K960j320p21r1k887k747P43k007l980K481O065M048L788l18j962k060
11678I9709l315N710m160N875K481m2m592P050j747m763K437M504j110j409r60
11663A05668J776j559j627o73k279j507m513l297J951K170j807j662N536M367
11649A02544j283j051M690K534l496L432L13o48M450l471q004l17k964J639k498
11634I5870k791L991R934k986j558K294L624j553q324M801Q085n474k37M087J540
11619A11303j020L869j812q526n828o95L634j507K532J294l706n540l517P04N585
11604I6770L639l390J341j585k930l506K809J064p610N296l100j594O091M533
11590I7828M368K015m241k090J523J914M292J179M420n700j357p518M004M314
$$ plain form
11576 104951 101419 99077 99246 101001 100383 90758 94179 98973 96851 94594 97425 101640 98172 96224 93473
11561 93473 90203 98392 102440 103570 100791 97665 99905 106539 108959 108294 111190 113458 111361 107630 109646
11546 109646 112596 111878 111691 116501 118555 110707 104920 100961 101727 105983 108019 110747 110644 114067 112257
11531 112257 114222 111574 107944 105586 106641 108169 104696 103115 109851 114277 113227 116971 113667 115530
11517 115530 118444 119890 118874 118064 121244 122809 116197 114452 112699 112891 108173 102913 105042 105575 101843
11502 101843 100746 105393 104330 111069 109650 107840 114671 116668 116981 117238 114570 113632 111797 110742 104839
11487 104839 114675 121296 121663 119631 118011 119917 117537 121262 122475 119072 122239 118226 118317 116685 116244
11472 116244 121677 125877 124431 122884 123595 122455 121316 120002 121912 127735 131573 133648 134569 134760 142368
$$ packed form
11576A04951l532k342J69J755o18r625L421M794k122k257K831M215l468j948k751
11561I3473l270Q189M048J130k779l126K240O634K420o65K896K268k097l731K016
11546A09646K950p18j87M810K054p848n787l959P66M256K036K728j03L423j810
11531A12257J965k648l630k358J055J528l473j581O736M426j050L744l304J863
11517A15530K914J446j016q10L180J565o612j745j753J92m718n260K129N33l732
11502A01843j097M647j063O739j419j810O831J997L13K57k668r38j835j055n903
11487A04839R836O621L67k032j620J906k380L725J213l403L167m013R1j632m41
11472A16244N433M200j446j547P11j140j139j314J910N823L838K075R21J91P608
$$ plain form
11457 142368 152432 158904 170959 187830 222706 272815 345183 433914 507356 533939 519681 476442
11445 476442 422637 365636 307027 258870 231930 209381 189415 179460 170641 163760 160144 154931
11433 154931 148227 153443 153532 155013 155846 149341 142443 133618 129025 130403 138837 140783 138292 138680 137288
11418 137288 138300 137502 137493 141062 135719 133355 134477 135559 137874 135843 138666 146768 148982 145973 142311
11403 142311 141701 141810 143526 137986 134989 136662 139061 142179 140889 138934 137587 136611 142714 146166 142026
11388 142026 143006 140278 149404 146866 137772 138834 141098 145598 150476 150528 147239 149813 157753 150946 144265
11373 144265 144441 138698 137961 142442 145973 155464 163919 156523 156360 153540 160392 157539 151810 154132 156667
11358 156667 157843 156805 159598 161082 159089 156715 154964 156489 160914 164638 163756 162233 162867 166500 170343
$$ packed form
11457A42368J0064O472J2055J6871L4876N0109P2368Q8731P3442K6583j4258m3239
11445D76442n3805n7001n8609m8157k6940k2549j9966r955q819o881l616n213
11433A54931o704N216Q9J481Q33o505o898q825m593J378Q434J946k491L88j392
11418A37288J012p98rL569n343k364J122J082K315k031K823Q102K214l009l662
11403A42311o10J09J716n540k997J673K399L118j290j955j347r76O103L452m140
11388A42026R80k728R126k538r094J062K264M500M878N2l289K574P940o807o681
11373A44265J76n743p37M481L531R491Q455p396j63k820O852k853n729K322K535
11358A56667J176j038K793J484j993k374j751J525M425L724q82j523O34L633L843
$$ plain form
11343 170343 169773 166306 167691 163054 160771 165655 168700 167971 167079 172067 171815 172037 178775 186278 184217
11328 184217 179683 178693 179166 174745 172207 177261 175350 170376 173107 173600 166156 171004 178320 179077 187657
11313 187657 190513 188993 193976 206531 213412 210920 202208 201401 206113 204263 196172 187212 181166 179890
11299 179890 182849 182866 182669 181593 183059 183588 182077 183931 192485 204438 204648 199536 199322 190836 183451
11284 183451 185018 185475 186794 189684 185240 180879 179216 182675 179810 171831 171979 177990 176075 172177 168878
11269 168878 174333 183685 194425 198760 197381 196606 193164 195437 199140 199962 205176 208353 207368 213840 217467
11254 217467 221728 220988 221952 221640 219838 211976 207147 212320 210309 211359 215723 213424 210212 218729 228322
11239 228322 235841 241138 250086 269484 282153 295817 309680 322850 328427 320969 312579 302122 286493
$$ packed form
11343A70343n70l467J385m637k283M884L045p29q92M988k52K22O738P503k061
11328A84217m534r90M73m421k538N054j911m974K731M93p444M848P316P57Q580
11313A87657K856j520M983J2555O881k492q712q07M712j850q091q960o046j276
11299A79890K959J7j97j076J466N29j511J854Q554J1953K10n112k14q486p385
11284A83451J567M57J319K890m444m361j663L459k865p979J48O011j915l898l299
11269A68878N455R352J0740M335j379p75l442K273L703Q22N214L177r85O472L627
11254B17467M261p40R64l12j802p862m829N173k011J050M364k299l212Q517R593
11239B28322P519N297Q948J9398J2669J3664J3863J3170N577p458q390j0457j5629
$$ plain form
11226 286493 268429 258052 251461 241386 235106 230553 227374 227246 229636 238327 236084 231583 229438 227401
11212 227401 229290 225621 224024 224551 221685 219373 217960 222611 226749 228027 222599 219864 223826 224918
11198 224918 218532 222950 227113 227671 231575 232401 228521 225630 224802 225474 227910 237516 237472 245858 247935 248385
11182 248385 257418 264572 269771 262406 257248 261776 263137 260379 261445 273972 276881 271296 269049 272564
11168 272564 275282 273189 274557 271764 271709 269882 264481 267502 268687 262354 257690 255969 257295 262090 267527
11153 267527 264486 268293 269621 261870 263295 265377 271168 268213 271493 278274 279601 280431 275631 277395
11139 277395 279986 276087 275493 280691 282100 287181 293127 288246 286050 287273 292076 298844 300160 299834 306708
11124 306708 317196 317703 329000 339657 339387 340369 344972 349125 350379 338775 332064 327922 325571 330843
$$ packed form
11226B86493j8064j0377o591j0075o280m553l179j28K390Q691k243m501k145k037
11212B27401J889l669j597N27k866k312j413M651M138J278n428k735L962J092
11198B24918o386M418M163N58L904Q26l880k891q28O72K436R606m4Q386K077M50
11182B48385R033P154N199p365n158M528J361k758J066J2527K909n585k247L515
11168B72564K718k093J368k793n5j827n401L021J185o333m664j721J326M795N437
11153B67527l041L807J328p751J425K082N791k955L280O781J327Q30m800J764
11139B77395K591l899n94N198J409N081N946m881k196J223M803O768J316l26O874
11124C06708J0488N07J1297J0657k70R82M603M153J254j1604o711m142k351N272
$$ plain form
11110 330843 323267 319223 321435 319822 321542 319224 316613 315075 315227 324814 328173 329647 327316 330406
11096 330406 324128 319838 326459 332010 335053 339084 339237 337446 341580 345256 344389 346455 357944 371330
11082 371330 373296 370947 372292 380756 387596 386799 386590 377538 363832 355069 346973 348673 359811 365099
11068 365099 368787 372727 374946 375197 382411 394701 403578 406793 412745 423730 427254 427660 424960 426438
11054 426438 429722 431787 431231 434229 434973 428405 429082 432398 431594 431365 435604 430124 425933 423400 424871
11039 424871 420869 414285 416531 420679 413093 414813 424617 425945 423135 414501 413005 420499 429840 425971
11025 425971 423650 431393 426802 421447 431370 439993 444342 451718 452141 450543 455214 462803 466695 469540
11011 469540 471454 471423 473316 471806 472849 472648 470973 476400 475222 477980 484286 483484 479385 484911 484534
$$ packed form
11110C30843p576m044K212j613J720k318k611j538J52R587L359J474k331L090
11096C30406o278m290O621N551L043M031J53j791M134L676q67K066J1489J3386
11082C71330J966k349J345Q464O840p97k09r052j3706q763q096J700J1138N288
11068C65099L688L940K219K51P214J2290Q877L215N952J0985L524M06k700J478
11054D26438L284K065n56K998P44o568O77L316q04k29M239n480m191k533J471
11039D24871m002o584K246M148p586J720R804J328k810q634j496P494R341l869
11025D25971k321P743m591n355R923Q623M349P376M23j598M671P589L892K845
11011D69540J914l1J893j510J043k01j675N427j178K758O306q02m099N526l77
$$ plain form
10996 484534 485451 491855 492841 497570 501986 511227 519929 521654 519142 529126 534849 531348 534103 534023 537138
10981 537138 539839 536495 542791 548606 551473 546435 549839 552720 549449 554950 560160 560561 566284 575445
10967 575445 573233 573354 577039 581947 585597 592151 599106 601781 604819 605550 607642 607037 602802 606457 609247
10952 609247 615887 622154 623596 622925 625399 626287 632038 627998 627497 635013 641236 647889 651955 657362 664035
10937 664035 661129 662765 667538 675586 684912 688295 691539 689830 691190 695910 706515 710509 717212 722393
10923 722393 725436 725167 725856 729117 734297 738933 740230 744089 751123 750558 755712 763911 772352 778402 781177
10908 781177 777688 782092 790948 791881 789454 793350 790868 793499 799837 802560 810315 816196 822558 834379
10894 834379 838299 835529 836810 842393 850324 855713 861791 868523 868920 867410 871937 877017 883033 886218
$$ packed form
10996D84534R17O404R86M729M416R241Q702J725k512R984N723l501K755q0L115
10981E37138K701l344O296N815K867n038L404K881l271N501N210M01N723R161
10967E75445k212J21L685M908L650O554O955K675L038P31K092o05m235L655K790
10952F09247O640O267J442o71K474Q88N751m040n01P516O223O653M066N407O673
10937F64035k906J636M773Q048R326L383L244j709J360M720J0605L994O703N181
10923G22393L043k69O89L261N180M636J297L859P034n65N154Q199Q441O050K775
10908G81177l489M404Q856R33k427L896k482K631O338K723P755N881O362J1821
10894H34379L920k770J281N583P931N389O078O732L97j510M527N080O016L185
$$ plain form
10880 886218 892897 893598 899876 906328 904420 906698 915858 920565 923947 922576 925035 928711 933436 935466
10866 935466 936538 940130 938240 939468 946461 950791 951987 952136 953632 959684 965128 964239 964907 966054 970928
10851 970928 972056 975106 983250 985291 980985 987899 992941 1004217 1012311 1015836 1019967 1021725 1021713 1027417
10837 1027417 1034542 1035473 1041250 1047057 1051706 1056811 1061858 1062593 1065059 1068435 1074711 1078026 1083296 1084038 1087664
10822 1087664 1089978 1094770 1094901 1098842 1102998 1106688 1108520 1110742 1117098 1117440 1121214 1132608 1137290 1147111
10808 1147111 1161429 1170054 1178805 1185978 1194665 1201211 1205313 1205784 1206573 1215106 1223025 1229883 1231555 1230386
10794 1230386 1238071 1248659 1253103 1252690 1250990 1253054 1262754 1267619 1275152 1279401 1282336 1286458 1297839 1307583
10780 1307583 1313278 1319233 1324272 1332778 1343100 1348387 1355768 1358294 1359325 1371579 1384162 1391226 1398524
$$ packed form
10880H86218O679P01O278O452j908K278R160M707L382j371K459L676M725K030
10866I35466J072L592j890J228O993M330J196J49J496O052N444q89O68J147M874
10851I70928J128L050Q144K041m306O914N042J1276Q094L525M131J758j2N704
10837A027417P125R31N777N807M649N105N047P35K466L376O276L315N270P42L626
10822A087664K314M792J31L941M156L690J832K222O356L42L774J1394M682R821
10808A147111J4318Q625Q751P173Q687O546M102M71P89Q533P919O858J672j169
10794A230386P685J0588M444m13j700K064R700M865P533M249K935M122J1381R744
10780A307583N695N955N039Q506J0322N287P381K526J031J2254J2583P064P298
$$ plain form
10767 1398524 1409157 1420284 1430719 1447856 1460559 1467351 1473315 1486118 1498949 1512422 1520980 1526562
10755 1526562 1528629 1534395 1539014 1543778 1548191 1552624 1559048 1563645 1572902 1582195 1603023 1623039 1636170
10742 1636170 1641567 1652245 1660131 1670525 1684140 1692732 1707158 1717774 1723776 1733959 1749455 1762398
10730 1762398 1780830 1794385 1803027 1806966 1816831 1832732 1849972 1863767 1869263 1877151 1891008 1903496
10718 1903496 1914460 1921968 1936648 1951603 1967939 1975529 1992791 2010572 2027138 2042898 2063435 2076295
10706 2076295 2087824 2107492 2131960 2152681 2170828 2188727 2205500 2224993 2241055 2259433 2279283
10695 2279283 2299889 2316025 2328700 2343182 2364643 2387255 2408699 2430040 2454278 2472506 2485252
10684 2485252 2501967 2524436 2552140 2577142 2594603 2614926 2634685 2650969 2669469 2696970 2721745
$$ packed form
10767A398524J0633J1127J0435J7137J2703O792N964J2803J2831J3473Q558N582
10755A526562K067N766M619M764M413M433O424M597R257R293K0828K0016J3131
10742A636170N397J0678P886J0394J3615Q592J4426J0616O002J0183J5496J2943
10730A762398J8432J3555Q642L939R865J5901J7240J3795N496P888J3857J2488
10718A903496J0964P508J4680J4955J6336P590J7262J7781J6566J5760K0537J2860
10706B076295J1529J9668K4468K0721J8147J7899J6773J9493J6062J8378J9850
10695B279283K0606J6136J2675J4482K1461K2612K1444K1341K4238J8228J2746
10684B485252J6715K2469K7704K5002J7461K0323J9759J6284J8500K7501K4775
$$ plain form
10673 2721745 2743947 2768474 2792972 2814846 2837706 2863004 2892678 2932048 2964720 2989462 3014629
10662 3014629 3046117 3090414 3128815 3153422 3179149 3212376 3236041 3259797 3287339 3316798 3351736
10651 3351736 3379980 3406519 3440216 3477552 3514300 3558295 3597246 3634147 3673686 3709350 3741557
10640 3741557 3782520 3819339 3859343 3897047 3940881 3986026 4029148 4074376 4122838 4170436 4221582
10629 4221582 4271981 4323254 4376519 4425766 4476159 4526939 4575440 4629166 4685679 4744191 4806104
10618 4806104 4866742 4926812 4986914 5050217 5116681 5184227 5256314 5328214 5393811 5471331 5550396
10607 5550396 5628454 5713683 5799912 5893322 5996712 6093964 6198556 6319962 6459639 6619803
10597 6619803 6808941 7040722 7294447 7543464 7749557 7880000 7932389 7934949 7914638 7884685
$$ packed form
10673B721745K2202K4527K4498K1874K2860K5298K9674L9370L2672K4742K5167
10662C014629L1488M4297L8401K4607K5727L3227K3665K3756K7542K9459L4938
10651C351736K8244K6539L3697L7336L6748M3995L8951L6901L9539L5664L2207
10640C741557M0963L6819M0004L7704M3834M5145M3122M5228M8462M7598N1146
10629D221582N0399N1273N3265M9247N0393N0780M8501N3726N6513N8512O1913
10618D806104O0638O0070O0102O3303O6464O7546P2087P1900O5597P7520P9065
10607E550396P8058Q5229Q6229R3410J03390R7252J04592J21406J39677J60164
10597F619803J89138K31781K53725K49017K06093J30443N2389K560k0311k9953
$$ plain form
10587 7884685 7861236 7867111 7896329 7949481 8022612 8104978 8189651 8289734 8393474 8509894 8635775
10576 8635775 8764620 8895641 9030059 9161235 9301685 9445950 9591380 9746337 9908355
10567 9908355 10074690 10245293 10413150 10579473 10750877 10931271 11123581 11324525 11524673
10558 11524673 11733105 11949452 12164650 12365567 12562850 12762595 12961959 13162857 13372691
10549 13372691 13589256 13817579 14049078 14286393 14526104 14767502 15013968 15264820 15530114
10540 15530114 15790239 16056809 16325767 16594020 16872472 17148112 17430074 17714482 18006412
10531 18006412 18303398 18592607 18884091 19187682 19496999 19812520 20121194 20430286 20754228
10522 20754228 21073880 21390378 21718408 22042952 22357743 22676994 23003075 23337274 23670315
$$ packed form
10587G884685k3449N875K9218N3152P3131Q2366Q4673J00083J03740J16420J25881
10576H635775J28845J31021J34418J31176J40450J44265J45430J54957J62018
10567I908355J66335J70603J67857J66323J71404J80394J92310K00944K00148
10558A1524673K08432K16347K15198K00917J97283J99745J99364K00898K09834
10549A3372691K16565K28323K31499K37315K39711K41398K46466K50852K65294
10540A5530114K60125K66570K68958K68253K78452K75640K81962K84408K91930
10531A8006412K96986K89209K91484L03591L09317L15521L08674L09092L23942
10522B0754228L19652L16498L28030L24544L14791L19251L26081L34199L33041
$$ plain form
10513 23670315 24001391 24327998 24660616 24995278 25326897 25659899 26001047 26345417 26676943
10504 26676943 27003126 27338022 27681094 28017517 28348737 28682592 29016791 29346370 29684286
10495 29684286 30016950 30339665 30663163 30979473 31299143 31623361 31945530 32257635 32566871
10486 32566871 32868394 33163977 33456165 33754302 34050976 34329910 34593539 34852858 35103539
10477 35103539 35348572 35581457 35804650 36021247 36223984 36421445 36612924 36787232 36948910
10468 36948910 37096190 37227499 37342903 37444067 37530924 37611932 37676513 37734129 37777030 37804094
10458 37804094 37811786 37797357 37774338 37741899 37697520 37637154 37561772 37474667 37369062 37247453 37110993
10447 37110993 36968672 36814269 36646157 36461891 36274772 36074679 35858468 35635276 35416344
$$ packed form
10513B3670315L31076L26607L32618L34662L31619L33002L41148L44370L31526
10504B6676943L26183L34896L43072L36423L31220L33855L34199L29579L37916
10495B9684286L32664L22715L23498L16310L19670L24218L22169L12105L09236
10486C2566871L01523K95583K92188K98137K96674K78934K63629K59319K50681
10477C5103539K45033K32885K23193K16597K02737J97461J91479J74308J61678
10468C6948910J47280J31309J15404J01164Q6857Q1008O4581N7616M2901K7064
10458C7804094P692j4429k3019l2439m4379o0366p5382q7105j05605j21609j36460
10447C7110993j42321j54403j68112j84266j87119k00093k16211k23192k18932
$$ plain form
10438 35416344 35185182 34949915 34696682 34434452 34164583 33892071 33619264 33333533 33028662
10429 33028662 32713741 32402917 32106059 31791101 31451410 31094760 30737643 30380130 30022844
10420 30022844 29679097 29334943 28984842 28620569 28258632 27908935 27562305 27218010 26876018
10411 26876018 26533873 26193427 25862297 25529990 25191802 24858074 24537041 24207963 23879541
10402 23879541 23557997 23232818 22905319 22577242 22253729 21931830 21609236 21298146 20995583
10393 20995583 20697349 20399761 20104567 19818109 19523965 19231735 18945678 18663446 18381866
10384 18381866 18106817 17833290 17568035 17306891 17048220 16791842 16540821 16291660 16044107
10375 16044107 15807118 15583546 15355677 15119177 14890909 14674740 14463678 14255554 14047316
$$ packed form
10438C5416344k31162k35267k53233k62230k69869k72512k72807k85731l04871
10429C3028662l14921l10824k96858l14958l39691l56650l57117l57513l57286
10420C0022844l43747l44154l50101l64273l61937l49697l46630l44295l41992
10411B6876018l42145l40446l31130l32307l38188l33728l21033l29078l28422
10402B3879541l21544l25179l27499l28077l23513l21899l22594l11090l02563
10393B0995583k98234k97588k95194k86458k94144k92230k86057k82232k81580
10384A8381866k75049k73527k65255k61144k58671k56378k51021k49161k47553
10375A6044107k36989k23572k27869k36500k28268k16169k11062k08124k08238
$$ plain form
10366 14047316 13833673 13610653 13393468 13183637 12979235 12770510 12568191 12375844 12197062
10357 12197062 12017553 11840558 11674989 11506355 11339159 11173331 10998522 10834532 10675519
10348 10675519 10510919 10353951 10206428 10059271 9913894 9769924 9632398 9500136 9362148
10339 9362148 9232212 9110665 8989667 8874591 8759962 8648220 8534274 8416317 8302993
10330 8302993 8207305 8115185 8004135 7890996 7776131 7656567 7543587 7448203 7360269 7269779
10320 7269779 7178733 7097183 7017151 6930083 6840887 6756572 6674465 6598266 6523706 6453425 6384123
10309 6384123 6318712 6251690 6191812 6158658 6151223 6160278 6129974 6035213 5889194 5734220 5591955
10298 5591955 5442961 5324493 5243261 5191138 5142955 5086608 5039095 4990376 4942437 4901174 4854945
$$ packed form
10366A4047316k13643k23020k17185k09831k04402k08725k02319j92347j78782
10357A2197062j79509j76995j65569j68634j67196j65828j74809j63990j59013
10348A0675519j64600j56968j47523j47157j45377j43970j37526j32262j37988
10339I362148j29936j21547j20998j15076j14629j11742j13946j17957j13324
10330H302993r5688r2120j11050j13139j14865j19564j12980r5384q7934r0490
10320G269779r1046q1550q0032q7068q9196q4315q2107p6199p4560p0281o9302
10309F384123o5411o7022n9878l3154p435R055l0304r4761j46019j54974j42265
10298E591955j48994j18468q1232n2123m8183n6347m7513m8719m7939m1263m6229
$$ plain form
10287 4854945 4816922 4778178 4739024 4702412 4660114 4617326 4583706 4548863 4507149 4458905 4407015
10276 4407015 4365379 4322898 4284409 4244946 4201632 4160732 4126874 4080911 4044755 4012496 3975360
10265 3975360 3933707 3892759 3855609 3821126 3793724 3769278 3745781 3728033 3718063 3710632 3694113 3670964
10253 3670964 3660858 3656174 3650945 3654586 3668212 3690949 3723374 3777218 3867135 4004113 4195381
10242 4195381 4419011 4607112 4685474 4634679 4501658 4336474 4160253 3980417 3830406 3719804
10232 3719804 3650641 3604123 3565013 3540225 3520906 3496797 3466086 3438021 3415248 3392109 3389033
10221 3389033 3405425 3430670 3461561 3496135 3537298 3578912 3624386 3675462 3744034 3821915 3919822
10210 3919822 4038878 4177540 4322289 4470293 4633360 4813632 5016870 5236405 5500384
$$ packed form
10287D854945l8023l8744l9154l6612m2298m2788l3620l4843m1714m8244n1890
10276D407015m1636m2481l8489l9463m3314m0900l3858m5963l6156l2259l7136
10265C975360m1653m0948l7150l4483k7402k4446k3497j7748r970p431j6519k3149
10253C670964j0106m684n229L641J3626K2737L2425N3844Q9917J36978J91268
10242D195381K23630J88101P8362n0795j33021j65184j76221j79836j50011j10602
10232C719804o9163m6518l9110k4788j9319k4109l0711k8065k2773k3139l076
10221C389033J6392K5245L0891L4574M1163M1614M5474N1076O8572P7881R7907
10210C919822J19056J38662J44749J48004J63067J80272K03238K19535K63979
$$ plain form
10201 5500384 5828860 6230798 6693251 7187927 7727182 8347415 9088702 9984067 10983686
10192 10983686 12003065 13004824 14052281 15274947 16798490 18744662 21286922 24651608
10184 24651608 29086668 35003531 43069818 54401450 70813743 94842141 128521792
10177 128521792 169071174 204649621 221428397 217480398 200415688 176093295 147127276
10170 147127276 117436662 91567006 71517086 56900155 46435940 38861494 33238317
10163 33238317 28962074 25651430 23057877 21016954 19363176 17918057 16530605 15175265
10155 15175265 13881351 12677983 11567663 10571484 9699397 8951079 8312203 7763456 7278631
10146 7278631 6838323 6451948 6109419 5799587 5523754 5276738 5052542 4860585 4682176
$$ packed form
10201E500384L28476M01938M62453M94676N39255O20233P41287Q95365R99619
10192A0983686J019379J001759J047457J222666J523543J946172K542260L364686
10184B4651608M435060N916863Q066287J1331632J6412293K4028398L3679651
10177A28521792M0549382L5578447J6778776l947999j7064710k4322393k8966019
10170A47127276k9690614k5869656k0049920j4616931j0464215p574446n623177
10163C3238317m276243l310644k593553k040923j653778j445119j387452j355340
10155A5175265j293914j203368j110320r96179q72087p48318o38876n48747m84825
10146G278631m40308l86375l42529l09832k75833k47016k24196j91957j78409
$$ plain form
10137 4682176 4508525 4350451 4192186 4037340 3894526 3771235 3664183 3556340 3456342 3355606
10127 3355606 3260874 3169780 3078993 2993960 2912235 2840328 2775237 2719758 2669654 2622608 2576262
10116 2576262 2534495 2494801 2460250 2430367 2397050 2358945 2314989 2269749 2231234 2193416 2166297
10105 2166297 2137718 2105082 2074048 2040092 2010897 1985295 1955481 1930101 1906523 1887607 1869176
10094 1869176 1846641 1831123 1816742 1803311 1797662 1788404 1774714 1747570 1722113 1701140 1681181 1670794
10082 1670794 1655420 1635426 1619675 1604620 1596866 1585107 1574534 1565523 1557255 1548505 1533097 1520404
10070 1520404 1506756 1494061 1485372 1478357 1478165 1474161 1459233 1445582 1441361 1435576 1432159 1428265 1428657
10057 1428657 1431438 1429785 1439428 1449799 1464089 1479113 1508228 1527435 1532307 1513272 1476859 1419426
$$ packed form
10137D682176j73651j58074j58265j54846j42814j23291j07052j07843r9998j00736
10127C355606r4732r1094r0787q5033q1725p1907o5091n5479n0104m7046m6346
10116B576262m1767l9694l4551k9883l3317l8105m3956m5240l8515l7818k7119
10105B166297k8579l2636l1034l3956k9195k5602k9814k5380k3578j8916j8431
10094A869176k2535j5518j4381j3431n649r258j3690k7144k5457k0973j9959j0387
10082A670794j5374j9994j5751j5055p754j1759j0573r011q268q750j5408j2693
10070A520404j3648j2695q689p015j92m004j4928j3651m221n785l417l894L92
10057A428657K781j653R643J0371J4290J5024K9115J9207M872j9035l6413n7433
$$ plain form
10045 1419426 1370270 1336321 1312061 1288612 1270574 1249488 1235107 1226568 1220251 1214285 1204728 1191125
10033 1191125 1178856 1169214 1163745 1164445 1163236 1163471 1166406 1167119 1172736 1179202 1176448 1168173 1147441 1133980
10019 1133980 1122934 1107579 1090802 1073696 1058033 1049681 1051020 1051198 1044176 1038490 1033190 1027873 1021317
10006 1021317 1007952 1005256 1005899 999997 992158 987040 980392 972414 960862 955150 947801 940777 940410 947815
9992 947815 960693 965222 958403 955124 944598 918017 896665 885836 876339 867202 851860 837531 823409
9979 823409 821483 822865 819531 810320 804842 803203 797845 795623 788745 793877 804172 803549 801407 797622
9965 797622 788600 784330 783048 782290 778232 768783 762881 762025 757389 748179 748408 751443 753677 750742 741676
9950 741676 729062 724360 718008 709701 699845 695669 693969 689580 688092 684951 678708 678900 679109 677800 672861
$$ packed form
10045A419426m9156l3949k4260k3449j8038k1086j4381q539o317n966r557j3603
10033A191125j2269r642n469P00j209K35K935P13N617O466k754q275k0732j3461
10019A133980j1046j5355j6777j7106j5663q352J339J78p022n686n300n317o556
10006A021317j3365k696O43n902p839n118o648p978j1552n712p349p024l67P405
9992I47815J2878M529o819l279j0526k6581k1352j0829r497r137j5342j4329j4122
9979H23409j926J382l334r211n478j639n358k222o878N132J0295o23k142l785
9965G97622r022m270j282p58m058r449n902q56m636r210K29L035K234k935r066
9950G41676j2614m702o352q307r856m176j700m389j488l141o243J92K09j309m939
$$ plain form
9935 672861 674702 674699 671118 666029 662688 658805 647662 644206 651700 654783 650639 636363 622225 620506
9921 620506 645889 683807 691523 671865 636909 605832 581968 550558 531513 533349 540569 543394
9909 543394 543561 546957 548796 547241 542432 536829 546877 549540 547937 542274 536038 529356 529134 530827 531338
9894 531338 533410 529998 520011 514284 513112 509843 504173 497411 498483 497553 497273 505593 505935 493259 482732
9879 482732 476602 470542 468655 464085 453744 448405 446193 438796 429782 425287 422277 428338 437571 447369
9865 447369 456577 451559 447515 444490 444885 440532 442516 441883 446847 449380 451371 455599 455038 455603 461184
9850 461184 467001 472109 479370 481111 479118 480174 483915 488701 490702 487318 492949 492517 492161 491065 495086
9835 495086 500611 506414 515236 534405 542611 548703 556243 567720 583035 604410 620450 640063 666467
$$ packed form
9935F72861J841ll581n089l341l883j1143l456P494L083m144j4276j4138j719
9921F20506K5383L7918P716j9658l4956l1077k3864l1410j9045J836P220K825
9909E43394J67L396J839j555m809n603J0048K663j603n663o236o682k22J693N11
9894E31338K072l412r987n727j172l269n670o762J072r30k80Q320L42j2676j0527
9879D82732o130o060j887m570j0341n339k212p397r014m495l010O061R233R798
9865D47369R208n018m044l025L95m353J984o33M964K533J991M228n61N65N581
9850D61184N817N108P261J741j993J056L741M786K001l384N631m32l56j096M021
9835D95086N525N803Q822J9169Q206O092P540J1477J5315K1375J6040J9613K6404
$$ plain form
9822 666467 694385 726839 758849 783898 821579 874413 948115 1049418 1178665 1311993 1414325
9811 1414325 1472020 1519707 1583498 1651586 1734947 1863344 2058246 2328044 2686578 3158771
9801 3158771 3785864 4613481 5723007 7311089 9804350 14115186 21914823 34771157
9793 34771157 50794031 63331850 66748522 62295215 54195749 44607486 34168048 24513053
9785 24513053 17190572 12381727 9391325 7520293 6276960 5385659 4704566 4151927 3695277
9776 3695277 3319906 3014449 2771665 2584149 2439010 2346255 2281287 2202021 2090494 1957411
9766 1957411 1816946 1676630 1557549 1456462 1375712 1318327 1301066 1292746 1313536 1366522 1450611
9755 1450611 1572853 1744212 1958592 2176491 2380792 2585861 2838348 3091667 3186645 3045159
$$ packed form
9822F66467K7918L2454L2010K5049L7681N2834P3702J01303J29247J33328J02332
9811A414325N7695M7687O3791O8088Q3361J28397J94902K69798L58534M72193
9801C158771O27093Q27617J109526J588082K493261M310836P799637J2856334
9793C4771157J6022874J2537819L416672m453307q099466r588263j0439438r654995
9785B4513053p322481m808845k990402j871032j243333q91301o81093n52639m56650
9776C695277l75371l05457k42784j87516j45139r2755o4968p9266j11527j33083
9766A957411j40465j40316j19081j01087q0750n7385j7261q320K0790N2986Q4089
9755A450611J22242J71359K14380K17899K04301K05069K52487K53319R4978j41486
$$ plain form
9745 3045159 2769299 2458847 2129764 1791441 1502583 1284288 1118744 1003957 920192 852030
9735 852030 806331 769840 734889 705935 683561 663465 638602 622359 604027 582637 564061 554151
9723 554151 543158 532992 520141 511110 493732 476212 467955 462236 459145 457108 453250 446861 436893
9710 436893 428883 415099 414428 411750 405303 406628 401177 397631 395300 396312 397410 393895 388549 385432
9696 385432 378929 369096 360818 361765 360197 351606 348901 351546 347622 340110 342417 338947 333062 332460 336238
9681 336238 332804 333088 331468 333316 329584 328366 326694 326820 329543 323964 323036 322603 328545 337887 342616
9666 342616 347634 346187 341367 328320 317451 309078 297782 286837 283762 285153 284331 288613 283700 282539
9652 282539 282727 285291 277221 272466 273907 269988 268693 268492 262266 270125 282288 288831 286870 278766 277076
$$ packed form
9745C045159k75860l10452l29083l38323k88858k18295j65544j14787q3765o8162
9735H52030m5699l6491l4951k8954k2374k0096k4863j6243j8332k1390j8576r910
9723E54151j0993j0166j2851r031j7378j7520q257n719l091k037l858o389r968
9710D36893q010j3784o71k678o447J325n451l546k331J012J098l515n346l117
9696C85432o503r833q278R47j568q591k705K645l924p512K307l470n885o02L778
9681C36238l434K84j620J848l732j218j672J26K723n579r28m33N942R342M729
9666C42616N018j447m820j3047j0869q373j1296j0945l075J391q22M282m913j161
9652B82539J88K564q070m755J441l919j295k01o226P859J2163O543j961q104j690
$$ plain form
9637 277076 279776 273509 268242 263523 256400 251918 251677 254305 253872 259246 258641 258107 256935 260335 253230
9622 253230 247796 241051 237912 240654 239016 238434 243347 228937 219423 215361 224508 229946 226908 230047
9608 230047 240098 244691 247245 244519 241476 238846 231824 225163 225938 225459 230219 234318 238908 244135 250455
9593 250455 251915 252987 251485 250405 245528 242184 240505 238568 236704 225380 220828 214896 211836 211118
9579 211118 207860 212780 218853 217468 213713 214033 213912 209983 205822 203662 205887 208510 206169 206221 205505 205542
9563 205542 208307 200082 194046 195183 195441 200298 207792 206148 213138 207620 203649 200960 197118 195802 200569
9548 200569 203114 197725 190869 191916 185994 186534 185023 180355 178982 175715 176634 179646 183726 185424 190445
9533 190445 192563 187393 179772 178757 180356 180771 184474 186102 188560 188470 188380 181242 180616 178671 184367 185501
$$ packed form
9637B77076K700o267n267m719p123m482k41K628m33N374o05n34j172L400p105
9622B53230n434o745l139K742j638n82M913j4410r514m062R147N438l038L139
9608B30047J0051M593K554k726l043k630p022o661P75m79M760M099M590N227O320
9593B50455J460J072j502j080m877l344j679j937j864j1324m552n932l060p18
9579B11118l258M920O073j385l755L20j21l929m161k160K225K623k341N2p16L7
9563B05542K765q225o036J137K58M857P494j644O990n518l971k689l842j316M767
9548B00569K545n389o856J047n922N40j511m668j373l267R19L012M080J698N021
9533A90445K118n170p621j015J599M15L703J628K458r0r0p138o26j945N696J134
$$ plain form
9517 185501 188769 187949 186067 187005 187987 185117 178872 181422 188056 184502 181121 179426 172682 172245 172128 167607
9501 167607 171203 177809 179462 173989 177790 176624 163196 159357 160675 166927 173271 171889 169543 161569
9487 161569 153785 151225 151730 155345 163420 169337 169794 163079 159129 162441 160260 157539 156451 153244 150514
9472 150514 157904 161629 156777 159793 162834 163649 160793 158299 161233 160314 156267 146434 147246 161578 169127
9457 169127 163302 160043 163299 169256 169864 166019 163636 162401 167739 167495 161486 158111 155007 154715 156549
9442 156549 159225 161370 162115 156133 148983 149689 151210 153098 152074 156481 154389 152025 146834 142345 152004
9427 152004 154464 151356 148574 144776 146984 147601 148365 150323 153266 153211 149546 145870 143742 141120 144103
9412 144103 148186 149782 146650 148308 145094 140630 139030 141904 144475 144449 144977 144779 149432 157119 160391
$$ packed form
9517A85501L268q20j882R38R82k870o245K550O634l554l381j695o744m37j17m521
9501A67607L596O606J653n473L801j166j3428l839J318O252O344j382k346p974
9487A61569p784k560N05L615Q075N917M57o715l950L312k181k721j088l207k730
9472A50514P390L725m852L016L041Q15k856k494K934r19m047r833Q12J4332P549
9457A69127n825l259L256N957O08l845k383j235N338k44o009l375l104k92J834
9442A56549K676K145P45n982p150P06J521J888j024M407k092k364n191m489R659
9427A52004K460l108k782l798K208O17P64J958K943n5l665l676k128k622K983
9412A44103M083J596l132J658l214m464j600K874K571k6N28j98M653P687L272
$$ plain form
9397 160391 153240 153611 152687 151477 155822 159616 159058 158974 158913 165840 172390 175963 188220 207362 247153
9382 247153 316819 397728 464978 487177 465373 418467 361650 308971 264832 229623 207623 189526
9370 189526 171953 165451 160038 157627 156736 147743 145213 149407 145423 142982 144055 141264 143746 146756
9356 146756 145928 143170 142627 142827 132523 130715 134976 130822 133643 137717 136994 133572 129466 129868 130830 137155
9340 137155 138392 137390 137191 141561 134348 129917 133214 132617 133582 132573 136405 143741 143548 142368 145154
9325 145154 140041 129155 121954 117381 116565 114574 110825 111040 118557 121546 121132 121209 117433 121831 123288
9310 123288 119667 113264 114259 116275 118424 120648 123245 124476 120992 120698 118578 114953 112924 115060 118081
9295 118081 116337 116309 111661 108201 106358 106148 110348 115302 114016 111156 102611 97339 93118 92543 99623
$$ packed form
9397A60391p151L71r24j210M345L794n58q4o1O927O550L573J2257J9142L9791
9382B47153O9666Q0909O7250K2199k1804m6906n6817n2679m4139l5209k2000j8097
9370A89526j7573o502n413k411q91q993k530M194l984k441J073k791K482L010
9356A46756q28k758n43K00j0304j808M261m154K821M074p23l422m106M02R62O325
9340A37155J237j002j99M370p213m431L297n97R65j009L832P336j93j180K786
9325A45154n113j0886p201m573q16j991l749K15P517K989m14P7l776M398J457
9310A23288l621o403R95K016K149K224K597J231l484k94k120l625k029K136L021
9295A18081j744k8m648l460j843k10M200M954j286k860q545n272m221n75P080
$$ plain form
9280 99623 101194 101814 102575 107575 116433 118940 114205 119452 119621 120191 117200 118324 116895 112780 110768 108459
9264 108459 105921 111992 115248 111902 108492 110110 113433 124582 125752 120875 112626 112681 111069 106529 108804
9249 108804 109751 108193 103016 100695 107689 113269 110907 110425 115211 112924 108179 105622 104155 108776 109172
9234 109172 110617 111493 111183 112623 110041 107825 102301 93212 98756 110613 110199 103722 104321 108957 111180
9219 111180 110609 113461 114077 107477 100716 105779 117714 117712 111030 107567 114447 113021 113684 114443 104045 100320
9203 100320 100322 103960 100065 97759 105325 102869 110159 115996 117080 111293 105042 107694 109278 100875 101854
9188 101854 107582 113871 122779 118903 112918 108217 110175 107163 102815 100915 108061 117498 118694 106880
9174 106880 100359 102169 96227 91675 101651 105025 104214 106787 104341 103757 99057 99311 96528 98764 100200
$$ packed form
9280I9623J571O20P61N000Q858K507m735N247J69N70k991J124j429m115k012k309
9264A08459k538O071L256l346l410J618L323J1149J170m877q249N5j612m540K275
9249A08804R47j558n177k321O994N580k362m82M786k287m745k557j467M621L96
9234A09172J445Q76l10J440k582k216n524r089N544J1857m14o477N99M636K223
9219A11180n71K852O16o600o761N063J1935ko682l463O880j426O63P59j0398l725
9203A00320KL638l895k306P566k456P290N837J084n787o251K652J584q403R79
9188A01854N728O289Q908l876n985m701J958l012m348j900P146R437J196j1814
9174A06880o521J810n942m552R976L374q11K573k446n84m700K54k783K236J436
$$ plain form
9159 100200 101575 103258 106283 99133 99429 102227 103560 103347 104056 105298 106702 98270 96079 99014 99243
9144 99243 100543 98889 101290 98621 101113 102338 98864 97630 102398 112819 110320 107165 104889 103591
9130 103591 110718 113448 115026 115648 117114 119366 121418 126498 130440 130072 129597 129169 127778 126943 120223 119368
9114 119368 114944 111081 102074 99482 92644 94689 102374 99681 98054 101625 98136 89741 83543 86500
9100 86500 92146 94179 94505 97474 94460 95968 101723 105287 102973 101449 97882 95524 97756 100467 94286
9085 94286 94825 94930 89583 93305 100331 104897 101295 96910 91369 92784 94738 87924 88584 91857 91960 98146
9069 98146 93521 91512 92238 89694 92291 94282 90175 92257 93469 93947 94144 92565 85640 83885 82313
9054 82313 77395 79495 79078 75453 80904 95118 93583 83782 82081 84358 78827 76304 79782 83423 87138
$$ packed form
9159A00200J375J683L025p150K96K798J333k13P09J242J404q432k191K935K29
9144I9243J300j654K401k669K492J225l474j234M768J0421k499l155k276j298
9130A03591P127K730J578O22J466K252K052N080L942l68m75m28j391q35o720q55
9114A19368m424l863r007k592o838K045P685k693j627L571l489q395o198K957
9100H6500N646K033L26K969l014J508N755L564k314j524l567k358K232K711o181
9085I4286N39J05n347L722P026M566l602m385n541J415J954o814O60L273J03O186
9069I8146m625k009P26k544K597J991m107K082J212M78J97j579o925j755j572
9054H2313m918K100m17l625N451J4214j535r801j701K277n531k523L478L641L715
$$ plain form
9039 87138 76282 74724 72252 71922 75123 82459 82429 77150 77396 84661 84810 85870 89921 85432 84617 84939
9023 84939 85344 85484 83771 87339 86184 80671 70949 69833 75357 79634 80139 73749 75141 77697 74306
9008 74306 72307 75781 73258 73046 73831 71310 74385 83243 81823 81519 82822 84273 85862 93964 96438
8993 96438 103848 125021 149369 163980 166365 158101 147821 132352 114695 103146 90819 81516 75413
8980 75413 69675 65989 69638 72435 77348 82215 79323 71766 68814 69372 67865 67140 66991 68325 70086
8965 70086 68339 69037 72472 73597 76425 76010 77392 79257 77102 76308 74265 75309 75900 80187 85566 93481
8949 93481 104819 125197 155877 203671 234375 238637 225104 201600 176463 146780 126868 119256
8937 119256 109998 98687 83349 78723 79491 73283 77132 79552 87032 87472 83458 79643 73577 71550
$$ packed form
9039H7138j0856j558k472l30L201P336l0n279K46P265J49J060M051m489q15L22
9023H4939M05J40j713L568j155n513r722j116N524M277N05o390J392K556l391
9008G4306j999L474k523k12P85k521L075Q858j420l04J303J451J589Q102K474
8993I6438P410K1173K4348J4611K385q264j0280j5469j7657j1549j2327r303o103
8980G5413n738l686L649K797M913M867k892p557k952N58j507p25j49J334J761
8965G0086j747O98L435J125K828m15J382J865k155p94k043J044N91M287N379P915
8949I3481J1338K0378L0680M7794L0704M262j3533k3504k5137k9683j9912p612
8937A19256r258j1311j5338m626P68o208L849K420P480M40m014l815o066k027
$$ plain form
8923 71550 74237 70984 67360 71326 71370 71246 69820 71810 74978 71172 65114 63721 62686 70082 74398
8908 74398 65151 72505 80691 87318 87321 93697 105167 129246 156206 161599 154904 141734 128449 107781
8894 107781 96083 94869 98904 93568 88542 81477 75438 69614 71536 76540 78342 75834 71454 64669
8880 64669 60551 59532 61480 57956 59506 68194 79926 76442 67477 60263 64811 68204 67589 66246 67194
8865 67194 72129 71171 65382 66061 68602 63419 60768 60509 63200 59559 55624 55819 57901 66990 65479 66252
8849 66252 70197 77170 76638 71664 68601 71353 77929 84286 84309 78136 75205 71667 66697 71059 75970
8834 75970 80527 70331 63990 62864 63275 69176 73476 69148 59564 60431 60815 60321 60460 63112 68791 77342
8818 77342 88541 102170 107723 111056 101488 93163 82348 71782 71819 74666 74008 72199 68878 78244
$$ packed form
8923G1550K687l253l624L966M4j24j426J990L168l806o058j393j035P396M316
8908G4398r247P354Q186O627LO376J1470K4079K6960N393o695j3170j3285k0668
8894A07781j1698j214M035n336n026p065o039n824J922N004J802k508m380o785
8880F4669m118j019J948l524J550Q688J1732l484q965p214M548L393o15j343R48
8865F7194M935r58n789O79K541n183k651k59K691l641l935J95K082R089j511P73
8849F6252L945O973n32m974l063K752O576O357K3o173k931l538m970M362M911
8834G5970M557j0196o341j126M11N901M300m328r584Q67L84m94J39K652N679Q551
8818G7342J1199J3629N553L333r568q325j0815j0566L7K847o58j809l321R366
$$ plain form
8804 78244 85349 85413 84490 79655 78803 79346 86735 94141 86396 80360 75020 75904 70594 67312 68566 72923
8788 72923 77987 77211 76671 71246 60718 55966 57800 63899 70727 76753 84666 90158 94192 94239 106682
8773 106682 124781 140590 145312 143879 140845 127792 111635 84959 66377 64755 66774 70474 66543
8760 66543 62876 65708 68819 68247 68220 70098 77200 80992 81936 82053 78149 73302 68332 62501 67288 68933
8744 68933 63593 69116 70689 68823 63621 68978 77690 88717 89825 82477 77230 72412 72692 73436 75706
8729 75706 80134 84165 100482 110994 110866 104730 97350 100467 104103 102903 101342 95429 83646 78842
8715 78842 72614 67144 61106 55854 57708 61033 63351 67065 71897 77273 80025 83617 82918 80496 79305
8700 79305 72564 59158 54203 56522 64146 70739 71964 71040 73456 80318 78943 78627 82157 79055 74211
$$ packed form
8804G8244P105O4r23m835q52N43P389P406p745o036n340Q84n310l282J254M357
8788G2923N064p76n40n425j0528m752J834O099O828O026P913N492M034M7J2443
8773A06682J8099J5809M722j433l034j3053j6157k6676j8582j622K019L700l931
8760F6543l667K832L111n72k7J878P102L792R44J17l904m847m970n831M787J645
8744F8933n340N523J573j866n202N357Q712J1027J108p348n247m818K80P44K270
8729G5706M428M031J6317J0512j28o136p380L117L636j200j561n913j1783m804
8715G8842o228n470o038n252J854L325K318L714M832N376K752L592o99k422j191
8700G9305o741j3406m955K319P624O593J225r24K416O862j375l16L530l102m844
$$ plain form
8685 74211 73065 69709 68475 71319 74174 74793 70080 72438 67112 75329 89271 109692 113474 102830
8671 102830 91828 84573 63036 46243 42929 47507 55288 59856 61953 61465 62104 71063 72653 78169
8657 78169 75446 68806 67602 65753 69367 72426 72350 74743 76707 77824 84687 92689 97239 101433 96543
8642 96543 95788 87484 83741 90432 85736 87739 91323 93736 98257 101114 101826 105534 111149 121984 133155
8627 133155 134145 135677 143090 149904 146830 148605 160415 163981 165240 175245 185964 197975 215486
8614 215486 236771 253110 264787 279016 304654 338156 371520 419978 487370 572738 661236 745151
8602 745151 847099 995892 1187191 1438316 1778639 2275394 3077305 4470114 6958577
8593 6958577 10936503 15227172 17163910 16345593 14487313 12366721 9791903 7149969
$$ packed form
8685G4211j146l356j234K844K855O19m713K358n326Q217J3942K0421L782j0644
8671A02830j1002p255k1537j6793l314M578P781M568K097m88O39Q959J590N516
8657G8169k723o640j204j849L614L059p6K393J964J117O863Q002M550M194m890
8642I6543p55q304l743O691m696K003L584K413M521K857P12L708N615J0835J1171
8627A33155R90J532P413O814l074J775J1810L566J259J0005J0719J2011J7511
8614B15486K1285J6339J1677J4229K5638L3502L3364M8458O7392Q5368Q8498Q3915
8602G45151J01948J48793J91299K51125L40323M96755Q01911J392809K488463
8593F958577L977926M290669J936738q18317j858280k120592k574818k641934
$$ plain form
8585 7149969 5083281 3705096 2832713 2293302 1941158 1696801 1513763 1379290 1276188
8576 1276188 1196208 1117215 1045123 990019 938731 890004 854248 836336 832427 831928 839499 859940
8564 859940 898768 963143 1046295 1152276 1290535 1445302 1604028 1792856 2040332 2373181
8554 2373181 2814179 3421017 4300471 5673833 8013857 12274287 19614273 28659548 33836994
8545 33836994 32949479 29461360 25454496 20538414 15155227 10752755 7757150 5855748
8537 5855748 4654404 3864720 3298981 2886390 2578395 2345848 2153852 1966960 1790732
8528 1790732 1638829 1502425 1365743 1247424 1152821 1083801 1027504 982904 947882 924113 910229
8517 910229 916656 942501 976739 1027430 1089372 1161762 1265567 1408005 1604950 1874821 2263223
$$ packed form
8585G149969k066688j378185q72383n39411l52144k44357j83038j34473j03102
8576A276188p9980p8993p2092n5104n1288m8727l5756j7912l909m99P571K0441
8564H59940L8828O4375Q3152J05981J38259J54767J58726J88828K47476L32849
8554B373181M40998O06838Q79454J373362K340024M260430P339986R045275N177446
8545C3836994q87515l488119m006864m916082n383187m402472k995605j901402
8537E855748j201344p89684n65739m12591l07995k32547j91996j86892j76228
8528A790732j51903j36404j36682j18319r4603o9020n6297m4600l5022k3769j3884
8517I10229O427K5845L4238N0691O1942P2390J03805J42438J96945K69871L88402
$$ plain form
8506 2263223 2866010 3862976 5648729 8753693 12979339 16194880 16499968 14980749 13009696
8497 13009696 10729308 8096482 5757824 4109239 3051284 2384555 1949479 1656541 1445828
8488 1445828 1295688 1186489 1088581 998961 913102 832461 752023 682017 620186 576526 544288
8477 544288 518001 490114 454953 429536 402769 375165 349387 330194 314760 303705 291426 283113
8465 283113 274481 270853 263693 245014 233428 222788 209555 200434 204237 199679 197056 193740 189078
8452 189078 182187 174065 166150 157849 151676 152406 156524 155286 152414 150853 151526 148909 149529 154210 163586
8437 163586 170817 166169 161111 153845 146097 138639 131228 124318 112055 106112 107150 108924 108144 105331
8423 105331 113759 116097 121086 132112 142799 133152 115161 95322 90430 95940 92508 90216 84994
$$ packed form
8506B263223O02787R96966J785753L104964M225646L215541L05088j519219j971053
8497A3009696k280388k632826k338658j648585j057955o66729m35076k92938k10713
8488A445828j50140j09199r7908q9620q5859q0641q0438p0006o1831m3660l2238
8477E44288k6287k7887l5161k5417k6767k7604k5778j9193j5434j1055j2279q313
8465B83113q632l628p160j8679j1586j0640j3233r121L803m558k623l316m662
8452A89078o891q122p915q301o173P30M118j238k872j561O73k617O20M681R376
8437A63586P231m648n058p266p748p458p411o910j2263n943J038J774p80k813
8423A05331Q428K338M989J1026J0687r647j7991j9839m892N510l432k292n222
$$ plain form
8410 84994 87610 84965 88810 96359 94000 86760 83758 78820 76761 79914 86488 89923 86645 85386 83792
8395 83792 85196 85381 85970 85067 85701 83367 84222 78953 73311 73993 74911 72974 75779 74178 73965 72656 72022
8378 72022 71450 77337 83954 81051 85532 84548 75890 76615 69789 61866 52828 54489 57539 60338 64930
8363 64930 66861 71283 72004 76865 77589 76396 66302 61829 65848 73276 69828 64846 63325 59880 63424
8348 63424 65419 63031 59083 58588 53341 52478 53160 48827 49623 53340 59309 65179 69788 69404 63087 62575
8332 62575 63613 55995 56286 55855 57283 62936 61549 59029 51693 51375 44869 40106 41807 38816 37220
8317 37220 37786 44593 42677 40832 36817 33556 34035 34557 44302 49542 45066 41785 36315 41974 43988
8302 43988 44141 46345 50257 50684 51051 50595 48241 48053 47972 46282 48223 51784 51740 58791 59105 47876 39615
$$ packed form
8410H4994K616k645L845P549k359p240l002m938k059L153O574L435l278j259j594
8395H3792J404J85N89r03O34k334Q55n269n642O82R18j937K805j601k13j309o34
8378G2022n72N887O617k903M481r84q658P25o826p923r038J661L050K799M592
8363F4930J931M422P21M861P24j193j0094m473M019P428l448m982j521l445L544
8348F3424J995k388l948m95n247q63O82m333P96L717N969N870M609l84o317n12
8332F2575J038p618K91m31J428N653j387k520p336l18o506m763J701k991j596
8317C7220N66O807j916j845m015l261M79N22R745N240m476l281n470N659K014
8302D3988J53K204L912M27L67m56k354j88q1j690J941L561m4P051L14j1229q261
$$ plain form
8285 39615 39526 35442 33734 36912 43554 48142 45143 38286 42022 44193 45443 50538 53788 49716 44876
8270 44876 42288 36779 35379 39524 43515 44962 43800 44505 43428 44805 46003 40013 40311 43048 44657
8255 44657 43445 41314 37185 39408 34037 32308 35030 29947 25545 34706 41540 42074 38178 36396 38622
8240 38622 40268 33895 30819 34413 39281 41978 41680 44206 42468 36144 29013 28507 33622 38339 41634
8225 41634 40582 40389 37360 33645 35464 33639 35031 34364 34548 31849 36296 34967 36867 45673 45162 40719
8209 40719 35495 39616 41425 39870 41466 44167 41850 45794 51550 48761 45052 39733 41214 43127 39388
8194 39388 38738 43536 51406 60476 73523 94269 115015 125731 126369 121524 106643 95211 77600
8181 77600 67129 54011 45757 41815 44871 46342 48520 52364 51883 54582 56282 50628 49336 54184
$$ packed form
8285C9615q9m084j708L178O642M588k999o857L736K171J250N095L250m072m840
8270D4876k588n509j400M145L991J447j162P05j077J377J198n990K98K737J609
8255D4657j212k131m129K223n371j729K722n083m402R161O834N34l896j782K226
8240C8622J646o373l076L594M868K697k98K526j738o324p131n06N115M717L295
8225D1634j052j93l029l715J819j825J392o67J84k699M447j329J900Q806n11m443
8209D0719n224M121J809j555J596K701k317L944N756k789l709n319J481J913l739
8194C9388o50M798P870R070J3047K0746K0746J0716O38m845j4881j1432j7611
8181G7600j0471j3118q254l942L056J471K178L844m81K699J700n654j292M848
$$ plain form
8167 54184 48384 39973 34968 37997 40590 38199 43031 47666 47009 46932 43180 38048 46721 50736 49504
8152 49504 53221 51025 48682 49502 47512 56636 69417 86638 118557 161591 198789 210513 194866
8139 194866 172202 152115 126694 97841 78388 63220 65001 67782 61221 59046 59197 54508 53618
8126 53618 52697 53478 42514 29611 26562 30356 38669 39400 35968 38025 41993 45515 39468 39491 38733 39907
8110 39907 45395 45015 41021 49259 46491 39171 36852 34886 40609 39612 47673 64082 83588 104652
8096 104652 116213 114092 102882 95947 79520 70509 58098 47755 42851 45034 49953 46349 44795
8083 44795 44500 45310 41930 42359 41042 42468 41706 41726 36028 29795 29524 30013 30575 29015 32509 36059 44870
8066 44870 45323 45231 44364 36125 32813 36806 42129 39593 29483 32814 37710 34551 38958 45453 51436
$$ packed form
8167E4184n800q411n005L029K593k391M832M635o57p7l752n132Q673M015j232
8152D9504L717k196k343Q20j990R124J2781J7221L1919M3034L7198J1724j5647
8139A94866k2664k0087k5421k8853j9453j5168J781K781o561k175J51m689q90
8126E3618r21P81j0964j2903l049L794Q313P31l432K057L968L522o047K3p58J174
8110C9907N488l80l994Q238k768p320k319j966N723r97Q061J6409J9506K1064
8096A04652J1561k121j1210o935j6427r011j2411j0343m904K183M919l604j554
8083D4795k95Q10l380M29j317J426p62K0n698o233k71M89N62j560L494L550Q811
8066D4870M53r2q67q239l312L993N323k536j0110L331M896l159M407O495N983
$$ plain form
8051 51436 53138 59948 68295 74169 71582 65772 64711 62668 59083 48431 41355 43068 46043 46051 41355
8036 41355 42021 49177 49312 47135 43603 43830 51143 52513 47728 47556 41459 39828 39211 39708 38521 40184
8020 40184 40253 44029 51770 56389 54623 56523 56983 52318 58260 62925 55359 55419 68255 76166 82564 89604
8004 89604 97956 100130 96508 90430 88065 82403 75289 68894 65901 67453 68995 74787 79354 69254
7990 69254 60327 58871 59298 52764 54370 61426 61172 59642 55188 52565 54416 59416 63785 59628 61619
7975 61619 61570 55485 55659 55623 55943 58979 58845 58363 60292 62835 60952 64376 67893 64581 69147 68836 67253
7958 67253 70110 71192 75082 81805 82936 79104 72215 69333 73459 74015 78019 83542 82257 80315 79060
7943 79060 73022 65905 60897 63371 67225 62822 59187 55434 53499 53706 55228 55991 53641 49204 49832
$$ packed form
8051E1436J702O810Q347N874k587n810j061k043l585j0652p076J713K975Qm696
8036D1355O66P156J35k177l532K27P313J370m785j72o097j631o17M97j187J663
8020D0184O9L776P741M619j766J900M60m665N942M665p566O0J2836P911O398P040
8004H9604Q352K174l622o078k365n662p114o395k993J552J542N792M567j0100
7990F9254q927j456M27o534J606P056k54j530m454k623J851N000M369m157J991
7975F1619m9o085J74l6L20L036j34m82J929K543j883L424L517l312M566l11j583
7958F7253K857J082L890O723J131l832o889k882M126N56M004N523j285j942j255
7943G9060o038p117n008K474L854m403l635l753j935K07J522P63k350m437O28
$$ plain form
7928 49832 48906 47828 42386 34512 38598 37657 38048 37352 42589 46697 47248 55665 56499 53244 55149 57871
7912 57871 57051 51048 46084 50570 61247 63887 67345 70819 69576 73734 77404 67754 66562 65947 65803
7897 65803 64407 64091 61831 58901 57611 58810 54302 56446 53237 43512 37867 36705 36537 36308 41533
7882 41533 44633 39214 36306 42938 42291 48663 51543 44077 44908 47298 37215 36704 42617 41826 37102
7867 37102 39206 44790 50371 49116 37283 35426 40394 38253 33353 32584 29377 24043 23640 30980 34919
7852 34919 34221 28621 35442 42532 39950 31307 28409 25154 29698 31820 37519 40519 37935 34539 26074
7837 26074 24118 23427 24284 30637 33981 37958 42480 36711 30346 31373 28370 26444 25678 27996 31067
7822 31067 32651 28717 26295 30942 31192 34286 26770 22144 12295 11964 11234 14802 14519 12448 17179 23782
$$ packed form
7928D9832r26j078n442p874M086r41L91o96N237M108N51Q417Q34l255J905K722
7912E7871q20o003m964M486J0677K640L458L474j243M158L670r650j192o15j44
7897F5803j396l16k260k930j290J199m508K144l209r725n645j162j68k29N225
7882D1533L100n419k908O632o47O372K880p466Q31K390j0083n11N913p91m724
7867C7102K104N584N581j255j1833j857M968k141m900p69l207n334m03P340L939
7852C4919o98n600O821P090k582q643k898l255M544K122N699L000k584l396q465
7837B6074j956o91Q57O353L344L977M522n769o365J027l003j926p66K318L071
7822C1067J584l934k422M647K50L094p516m626r849l31p30L568k83k071M731O603
$$ plain form
7806 23782 21598 21719 22710 21653 16969 14406 15566 15540 16129 22651 22483 13805 14737 22759 21691 19926
7790 19926 22172 22559 17392 15576 14845 16783 14891 14486 22001 20446 20051 19251 17021 19309 21959 22787
7774 22787 13394 3180 495 5950 10361 18296 20940 17221 18239 22885 23278 22199 22867 21124 23573
7759 23573 24111 18377 17032 20743 21168 18357 20500 20146 15404 17058 21094 14194 10917 10958 9328 12732
7743 12732 13047 12304 3320 4427 7103 8042 11438 9247 7679 11091 15307 20222 26355 24017 23714 22996
7727 22996 19001 17584 16214 18525 20049 12771 10712 12889 11944 16703 19283 16381 19755 21842 21521
7712 21521 25837 23541 17692 16268 19579 21106 21458 19011 13557 14767 14280 14408 16631 17326 14151 12225
7696 12225 10838 9498 8544 16578 18852 20564 19324 19383 19463 15426 18014 20117 18092 16292 7755 7491
$$ packed form
7806B3782k184J21R91j057m684k563J160k6N89O522j68q678R32Q022j068j765
7790A9926K246L87n167j816p31J938j892m05P515j555l95q00k230K288K650Q28
7774B2787r393j0214k685N455M411P935K644l719J018M646L93j079O68j743K449
7759B3573N38n734j345L711M25k811K143l54m742J654M036o900l277M1j630L404
7743A2732L15p43q984J107K676R39L396k191j568L412M216M915O133k338l03p18
7727B2996l995j417j370K311J524p278k059K177r45M759K580k902L374K087l21
7712B1521M316k296n849j424L311J527L52k447n454J210m87J28K223O95l175j926
7696A2225j387j340r54Q034K274J712j240N9Q0m037K588K103k025j800q537k64
$$ plain form
7680 7491 10410 13565 13322 6609 11685 13018 13706 17226 15155 15403 13549 12715 9977 13284 17926 11655
7664 11655 9465 10432 9767 11476 10970 13316 7080 4997 9221 8056 5493 2472 1424 3821 8643
7649 8643 8418 9596 10544 15315 17597 16913 14227 9991 9933 11991 14403 12558 12537 10071 7599 13141 19048
7632 19048 21315 18673 21747 20162 15337 7260 1773 5909 10433 10181 5686 7721 5659 6803 1826
7617 1826 1703 5260 9342 12788 9572 7630 7259 5011 7504 10065 14982 18718 20381 22497 20735
7602 20735 14673 26216 40637 47129 48307 51188 54786 60109 49506 32261 15973 8854 3835
7589 3835 5342 7603 16795 15642 10770 11361 11622 12372 18147 13321 9259 11025 13403 17869 21710 26514
7573 26514 18235 11674 13971 16649 12549 6851 6388 14930 16049 17966 12601 9322 6983 8634 13352
$$ packed form
7680G491K919L155k43o713N076J333O88L520k071K48j854q34k738L307M642o271
7664A1655k190R67o65J709n06K346o236k083M224j165k563l021j048K397M822
7649H643k25J178R48M771K282o84k686m236n8K058K412j845k1k466k472N542N907
7632A9048K267k642L074j585m825q077n487M136M524k52m495K035k062J144m977
7617A826j23L557M082L446l216j942l71k248K493K561M917L736J663K116j762
7602B0735o062J1543J4421O492J178K881L598N323j0603j7245j6288p119n019
7589C835J507K261R192j153m872N91K61P50N775m826m062J766K378M466L841M804
7573B6514q279o561K297K678m100n698m63Q542J119J917n365l279k339J651M718
$$ plain form
7558 13352 16255 15135 11120 12272 9361 7892 11580 7860 5445 2326 5043 9431 9357 5288 7911
7543 7911 11302 11279 614 2214 8649 9540 8094 5775 10073 13381 4267 3022 5147 4909 414 110
7527 110 5305 7442 6808 8037 9369 13277 17658 11615 5664 2718 9235 10401 2830 58 -2908
7512 -2908 -4037 3624 4684 2618 3918 11162 10757 9871 9235 14599 13497 5506 1235 1853 1745 4771
7496 4771 8773 4690 1155 8219 13004 11817 12413 8933 4550 8238 13273 11513 6583 5923 9626
7481 9626 13365 10105 2755 7261 11402 13079 14557 15673 17795 13106 7209 5261 5522 7757 7918
7466 7918 14293 13141 8755 6413 6021 9342 10471 6238 775 5956 2981 2452 5586 6341 8975 13820
7450 13820 13901 8750 12119 13656 13939 13619 12658 12362 11072 5878 8703 12110 11887 12233 15286 14550 11269
$$ packed form
7558A3352K903j120m015J152k911j469L688l720k415l119K717M388p4m069K623
7543G911L391k3j0665J600O435Q91j446k319M298L308r114j245K125k38m495l04
7527A10N195K137o34J229J332L908M381o043n951k946O517J166p571k772k966
7512b908j129P661J060k066J300P244m05q86o36N364j102p991m271O18j08L026
7496D771M002m083l535P064M785j187N96l480m383L688N035j760m930o60L703
7481I626L739l260p350M506M141J677J478J116K122m689n897j948K61K235J61
7466G918O375j152m386k342l92L321J129m233n463N181k975n29L134P55K634M845
7450A3820Q1n151L369J537K83l20r61k96j290n194K825L407k23L46L053p36l281
$$ plain form
7433 11269 5093 5553 2702 9021 8942 13109 17972 19765 15467 6574 4393 3397 5309 10444 11700 8596
7417 8596 1097 4720 6057 5836 6829 7119 7593 5124 -1334 -937 2021 1465 -1387 1833 13373 20179
7401 20179 15245 9017 6761 6501 10617 11199 8620 10617 13475 10157 9597 2940 -2156 2921 7892
7386 7892 7034 6826 4569 3851 5161 5082 3401 -728 -23 412 619 -2718 -895 -1482 1509 3917 2873
7369 2873 3519 4464 5238 8031 6499 -569 3334 2977 4772 7114 7871 13613 15544 13072 7065 8784
7353 8784 13422 9204 4966 3515 5850 6412 7980 5837 6564 4606 3062 2007 3947 1719 5081
7338 5081 11270 4861 3923 3980 7083 1968 2400 1374 6798 6736 3135 5114 10921 8326 8022 10021 16680
7321 16680 15860 8097 12206 11415 6048 3900 5740 3539 4276 -357 -1579 3465 6412 6677 6568 11445
$$ packed form
7433A1269o176M60k851O319p9M167M863J793m298q893k181r96J912N135J256l104
7417H596p499L623J337k21R93K90M74k469o458L97K958n56k852L220J1540O806
7401B0179m934o228k256k60M116N82k579J997K858l318n60o657n096N077M971
7386G892q58k08k257p18J310p9j681m129P05M35K07l337J823n87K991K408j044
7369B873O46R45P74K793j532p068L903l57J795K342P57N742J931k472o007J719
7353H784M638m218m238j451K335N62J568k143P27j958j544j055J940k228L362
7338E081O189o409r38N7L103n115M32j026N424o2l601J979N807k595l04J999O659
7321A6680q20p763M109p91n367k148J840k201P37m633j222N044K947K65j09M877
$$ plain form
7305 11445 8800 3598 7473 7125 9708 5468 251 -1568 2554 2536 628 -1721 1913 6277 2109
7290 2109 -5121 -3331 -845 4209 5815 11100 12715 13420 9448 5407 4785 4893 5256 6089 5024 6458
7274 6458 8936 9201 4152 3188 4786 -3174 -8487 -2453 2953 8978 11748 11160 10084 5237 6834 15411
7258 15411 21776 15613 6540 2788 -64 2331 7140 9088 6219 5994 10972 10167 11272 9757 3895
7243 3895 3347 8568 10768 -822 -3602 1301 7348 10337 1660 -5494 -4454 -4008 -4491 -3703 -4101 -7964
7227 -7964 -10049 -247 6190 4116 11805 12202 5964 -3217 -7846 -9158 -4471 4897 13679 22152 27659
7212 27659 34370 35217 26312 16191 8333 -2540 -2723 7004 7819 3590 -4682 -9575 -6722 -2599 -2392
7197 -2392 2548 1019 5267 12384 10443 10177 7455 6458 7132 6075 7212 8697 9208 10623 10676 14506
$$ packed form
7305A1445k645n202L875l48K583m240n217j819M122j8j908k349L634M364m168
7290B109p230J790K486N054J606N285J615P05l972m041o22J08L63Q33j065J434
7274F458K478K65n049r64J598p960n313O034N406O025K770n88j076m847J597Q577
7258A5411O365o163r073l752k852K395M809J948k869k25M978q05J105j515n862
7243C895n48N221K200j1590k780M903O047K989q677p154J040M46m83P88l98l863
7227g964k085R802O437k074P689L97o238r181m629j312M687R368Q782Q473N507
7212B7659O711Q47q905j0121p858j0873j83R727Q15m229q272m893K853M123K07
7197b392M940j529M248P117j941k66k722r97O74j057J137J485N11J415N3L830
$$ plain form
7181 14506 17058 17819 12117 14920 17028 8833 6287 4261 3857 1987 4302 3849 5953 8786 4619
7166 4619 -6962 -6181 -3878 -4212 916 5899 8443 9696 4044 8192 12325 17335 12339 2318 2376
7151 2376 1212 -2850 1211 1133 2877 5305 7350 8070 2896 -582 -6028 -5656 -5719 -11775 -6927 -3547
7135 -3547 -488 476 6975 7143 2778 2543 2875 5620 8002 8997 6754 4038 1221 6901 8261 1787
7119 1787 1652 4293 9383 11820 8632 8093 4082 -549 -434 -2048 -7009 -5711 1204 8684 13792 6789
7103 6789 6507 6559 6956 9015 18189 14086 9490 10553 6500 -739 4240 4847 3023 4030 7314 1986
7087 1986 -5336 -6654 -6041 -4447 -3258 490 1553 3263 5746 9324 5451 2810 5940 7128 6093
7072 6093 8864 2902 609 2401 4448 4699 12916 16864 13968 4095 5611 9465 13835 9149 4491
$$ packed form
7181A4506K552P61n702K803K108q195k546k026m04j870K315m53K104K833m167
7166D619j1581P81K303l34N128M983K544J253n652M148M133N010m996j0021N8
7151B376j164m062M061p8J744K428K045P20n174l478n446L72o3o056M848L380
7135c547L059R64O499J68m365k35L32K745K382R95k243k716k817N680J360o474
7119A787j35K641N090K437l188n39m011m631J15j614m961J298O915P480N108p003
7103F789k82N2L97K059R174m103m596J063m053p239M979O07j824J007L284n328
7087A986p322j318O13J594J189L748J063J710K483L578l873k641L130J188j035
7072F093K771n962k293J792K047K51Q217L948k896r873J516L854M370m686m658
$$ plain form
7057 4491 5699 2245 2197 1438 854 4083 11739 13650 12324 5770 -289 782 2446 2260 4089 2878
7041 2878 1726 546 -184 4017 5741 5066 -618 -2242 -2902 -8 5287 3037 -817 -606 -1468 -1731
7025 -1731 -2735 -3499 -2032 -877 1449 422 3944 4115 3787 5873 -291 -7104 -15428 -16299 -13965 -15936
7009 -15936 -13637 -9247 -4960 -1071 2749 2728 4314 4561 212 -3415 -6421 3990 5833 6962 7751
6994 7751 5620 5961 7864 -402 -3700 -4209 23 4497 6658 2726 305 2292 4275 2012 -6801
6979 -6801 -12590 -12057 -5654 -2976 -1826 3783 6285 4241 1936 6304 2998 -2944 -4389 -3802 1531
6964 1531 4490 10395 5212 -473 -1869 -306 1821 6903 6048 4524 2905 3054 374 8911 1126
6949 1126 3380 2252 -1331 -1307 2615 5204 -350 -3530 -2418 3579 5597 7842 4366 4644 -99 -3741
$$ packed form
7057D491J208l454m8p59n84L229P656J911j326o554o059J071J664j86J829j211
7041B878j152j180p30M201J724o75n684j624o60K894N295k250l854K11q62k63
7025a731j004p64J467J155K326j027L522J71l28K086o164o813q324q71K334j971
7009a5936K299M390M287L889L820k1J586K47m349l627l006J0411J843J129P89
6994G751k131L41J903q266l298n09M232M474K161l932k421J987J983k263q813
6979f801n789N33O403K678J150N609K502k044k305M368l306n942j445N87N333
6964A531K959N905n183n685j396J563K127N082q55j524j619J49k680Q537p785
6949A126K254j128l583K4L922K589n554l180J112N997K018K245l476K78m743l642
$$ plain form
6933 -3741 -1378 3594 5348 1189 2053 3982 4898 -7505 -10105 1035 4956 1643 1091 2550 3311
6918 3311 1761 5520 1270 -7297 -8775 -6112 -2793 -8700 -5531 677 6733 989 5669 7518 7795
6903 7795 7980 2286 1190 4434 3361 -7169 -11779 -6317 -5107 -4537 -6700 2827 9938 7061 3467
6888 3467 -2298 1015 2297 4092 8976 9223 5602 4775 5134 7276 5908 2301 -187 -5488 527 1361
6872 1361 397 -301 2139 3952 859 482 3154 6343 2712 916 1280 3055 456 2518 9194 13694
6856 13694 5146 498 -463 7824 8233 1521 2094 -1361 1356 8874 4999 3479 2009 4867 9335
6841 9335 4275 3398 5921 8927 5142 -2313 -6963 -8488 -1620 -1052 -2124 3723 3989 10655 10866 10719
6825 10719 2087 -1206 6834 9136 11392 10019 1945 4319 7234 11612 4087 -5541 -2643 -2362 -4672
$$ packed form
6933c741K363M972J754m159Q64J929R16j2403k600J1140L921l313n52J459P61
6918C311j550L759m250q567j478K663L319n907L169O208O056n744M680J849K77
6903G795J85n694j096L244j073j0530m610N462J210N70k163R527P111k877l594
6888C467n765L313J282J795M884K47l621q27L59K142j368l607k488n301O015Q34
6872A361r64o98K440J813l093l77K672L189l631j796L64J775k599K062O676M500
6856A3694q548m648r61Q287M09o712N73l455K717P518l875j520j470K858M468
6841I335n060q77K523L006l785p455m650j525O868N68j072N847K66O666K11j47
6825A0719q632l293Q040K302K256j373q074K374K915M378p525r628K898K81k310
$$ plain form
6810 -4672 -452 1134 2618 3042 2506 8975 13166 4210 -1966 2863 78 -6109 -7997 -4428 -462
6795 -462 1794 3148 1953 6985 2410 3644 4447 8934 9314 4310 4636 5632 -2986 -12258 -5110 -1779
6779 -1779 4188 8082 12514 10583 4987 4544 5604 2921 6419 10986 6398 5394 8513 15515 11378
6764 11378 8513 6449 4686 -312 3145 6838 1516 -3196 1767 2956 1247 3611 8726 12081 4614
6749 4614 -3401 -3686 876 -1153 -715 4972 6651 5515 1301 -43 3355 3916 4892 11127 14737 11804
6733 11804 15270 16780 11958 9484 6444 12410 16378 14505 8631 7727 12662 16912 16146 10045 4408
6718 4408 2756 5863 12258 10908 14387 15489 15059 17411 18766 16001 15029 23505 17250 14288 15610
6703 15610 25134 32714 35121 31072 29074 30725 30765 33416 37603 32323 30070 30521 33415 32975 37738 39863
$$ packed form
6810d672M220J586J484M24n36O469M191q956o176M829k785o187j888L569L966
6795d62K256J354j195N032m575J234Q03M487L80n004L26R96q618r272P148L331
6779a779N967L894M432j931n596m43J060k683L498M567m588j004L119P002m137
6764A1378k865k064j763m998L457L693n322m712M963J189j709K364N115L355p467
6749D614q015k85M562k029M38N687J679j136m214j344L398N61R76O235L610k933
6733A1804L466J510m822k474l040N966L968j873n874r04M935M250p66o101n637
6718D408j652L107O395j350L479J102m30K352J355k765r72Q476o255k962J322
6703A5610R524P580K407m049j998J651M0K651M187n280k253M51K894m40M763K125
$$ plain form
6687 39863 40210 47112 48156 57411 79087 112486 153266 202605 252265 308386 336590 322456 291091
6674 291091 252833 201273 151844 118823 96557 78388 57631 49071 36771 29991 28269 31712
6662 31712 32731 25859 21480 23365 22362 19821 16879 20608 18481 19415 18013 15491 10205 9087 8294
$$ packed form
6687C9863L47O902J044R255K1676L3399M0780M9339M9660N6121K8204j4134l1365
6674B91091l8258n1560m9429l3021k2266j8169k0757q560j2300o780j722L443
6662C1712J019o872m379J885j003k541k942L729k127R34j402k522n286j118p93
$$ [...]
##END NTUPLES=NMR SPECTRUM
##END=
