##TITLE=Analysis number 314139
Compound Code cc 45401
Book Reference 397/90
Project Code adrs
Chemist Name brucer
##JCAMPDX= 6.0         $$ Bruker NMR JCAMP-DX V2.0
##DATA TYPE= NMR SPECTRUM
##DATA CLASS= NTUPLES
##ORIGIN= Bruker BioSpin GmbH
##OWNER= NMR
$$ XWIN-NMR		Version 3.5
$$ Thu Oct  6 12:36:15 2005 GMT Daylight Time (UT+1h)  MAYBRIDGE\NMR@NMR_250MHZ
##.OBSERVE FREQUENCY= 250.131544655141
##.OBSERVE NUCLEUS= ^1H
##.ACQUISITION MODE= SIMULTANEOUS (DQD)
##.ACQUISITION SCHEME= undefined
##.AVERAGES= 16
##.DIGITISER RES= 18
##SPECTROMETER/DATA SYSTEM= dpx250
##.PULSE SEQUENCE= zg30
##.SOLVENT NAME= DMSO
##.SHIFT REFERENCE= (INTERNAL, DMSO, 0, 16.516)
##AUDIT TRAIL= $$ (NUMBER, WHEN, WHO, WHERE, WHAT)
$$ ##TITLE= Audit trail, XWIN-NMR		Version 3.5
$$ ##JCAMPDX= 5.01
$$ ##ORIGIN= Bruker BioSpin GmbH
$$ ##OWNER= NMR
$$ C:\u/data/dgb/nmr/ADRS/10590/pdata/1/auditp.txt
$$ ##AUDIT TRAIL=  $$ (NUMBER, WHEN, WHO, WHERE, WHAT)
(   1,<2005-10-06 12:35:57.30 +100>,<MAYBRIDGE\NMR>,<NMR_250MHZ>,
      <created by zg, POWCHK disabled, PULCHK disabled
       configuration hash MD5:
       62 19 C7 07 E1 42 D1 B7 37 6C 3D D0 77 39 F9 E6
       data hash MD5: 64K
       7C 34 00 32 1A E2 0A B9 18 10 A5 AE 6B D8 7F CB>)
(   2,<2005-10-06 12:36:07.87 +100>,<MAYBRIDGE\NMR>,<NMR_250MHZ>,
      <Start of raw data processing
       ef LB = 0.3 FT_mod = 6 PKNL = 1 SI = 32K 
       data hash MD5: 32K
       4C 06 48 89 17 EB 41 2A 35 70 5C 67 B6 62 9A F0>)
(   3,<2005-10-06 12:36:09.45 +100>,<MAYBRIDGE\NMR>,<NMR_250MHZ>,
      <apk 
       data hash MD5: 32K
       E3 82 5D E9 7B 74 55 D6 3A 5B 05 1D 5A F2 27 F0>)
(   4,<2005-10-06 12:36:10.15 +100>,<MAYBRIDGE\NMR>,<NMR_250MHZ>,
      <abs ABSG = 5 
       data hash MD5: 32K
       B8 67 66 21 99 CC E1 CF B8 1C 06 36 EC 37 A3 DD>)
$$ ##END=
$$ 
$$ hash MD5
$$ 29 44 6E 95 EC A7 36 84 41 3C 9B E6 FD D2 0C C2
##$RELAX= 
##$RELAX= 
##$RELAX= 
##$RELAX= 
##$RELAX= 
##$RELAX= 
##$RELAX= 
$$ Bruker specific parameters
$$ --------------------------
##$DU= <C:\u>
##$EXPNO= 10590
##$NAME= <ADRS>
##$PROCNO= 1
##$TYPE= <nmr>
##$USER= <dgb>
##$AMP= (0..31)
100 100 100 100 100 100 100 100 100 100 100 100 100 100 100 100 100 100 
100 100 100 100 100 100 100 100 100 100 100 100 100 100 
##$AQSEQ= 0
##$AQ_mod= 3
##$AUNM= <au_zg>
##$AUTOPOS= <28 >
##$BF1= 250.13
##$BF2= 250.13
##$BF3= 250.13
##$BF4= 250.13
##$BF5= 500.13
##$BF6= 500.13
##$BF7= 500.13
##$BF8= 500.13
##$BYTORDA= 1
##$CFDGTYP= 0
##$CFRGTYP= 5
##$CHEMSTR= <none>
##$CNST= (0..31)
1 1 145 1 1 1 1 1 1 1 1 1 1 1 1 1 1 1 1 1 1 1 1 1 1 1 1 1 1 1 1 1 
##$CPDPRG= <>
##$CPDPRG1= <>
##$CPDPRG2= <>
##$CPDPRG3= <>
##$CPDPRG4= <mlev>
##$CPDPRG5= <mlev>
##$CPDPRG6= <mlev>
##$CPDPRG7= <mlev>
##$CPDPRG8= <mlev>
##$CPDPRGB= <>
##$CPDPRGT= <>
##$D= (0..31)
0 1 0 0 0 0 0 0 0 0.06 0 0 0 0 0 0 0.0002 0 0 0 0 0 0 0 0 0 0 0 0 0 0 
0 
##$DATE= 1128598556
##$DBL= (0..7)
120 120 120 120 120 120 120 120 
##$DBP= (0..7)
150 150 150 150 150 150 150 150 
##$DBP07= 0
##$DBPNAM0= <>
##$DBPNAM1= <>
$$ [...]
##$SUBNAM7= <"">
##$SUBNAM8= <"">
##$SUBNAM9= <"">
##$SW= 20.6930455092707
##$SWIBOX= (0..15)
0 0 3 0 0 0 0 0 0 0 0 0 0 0 0 0 
##$SW_h= 5175.983436853
##$TD= 65536
##$TD0= 1
##$TE= 295.16
##$TE2= 300
##$TE3= 300
##$TEG= 300
##$TL= (0..7)
0 120 120 120 120 120 120 120 
##$TP= (0..7)
150 150 150 150 150 150 150 150 
##$TP07= 0
##$TPNAME0= <>
##$TPNAME1= <>
##$TPNAME2= <>
##$TPNAME3= <>
##$TPNAME4= <>
##$TPNAME5= <>
##$TPNAME6= <>
##$TPNAME7= <>
##$TPOAL= (0..7)
0.5 0.5 0.5 0.5 0.5 0.5 0.5 0.5 
##$TPOFFS= (0..7)
0 0 0 0 0 0 0 0 
##$TUNHIN= 0
##$TUNHOUT= 0
##$TUNXOUT= 0
##$USERA1= <user>
##$USERA2= <user>
##$USERA3= <user>
##$USERA4= <user>
##$USERA5= <user>
##$V9= 5
##$VALIST= <valist>
##$VCLIST= <CCCCCCCCCCCCCCC>
##$VD= 0
##$VDLIST= <DDDDDDDDDDDDDDD>
##$VPLIST= <PPPPPPPPPPPPPPP>
##$VTLIST= <TTTTTTTTTTTTTTT>
##$WBST= 1024
##$WBSW= 4
##$XGAIN= (0..3)
0 0 0 0 
##$XL= 0
##$YL= 0
##$YMAX_a= 368284
##$YMIN_a= -275642
##$ZGOPTNS= <>
##$ZL1= 120
##$ZL2= 120
##$ZL3= 120
##$ZL4= 120
##$ABSF1= 16.51604
##$ABSF2= -4.177132
##$ABSG= 5
##$ABSL= 3
##$ALPHA= 0
##$AQORDER= 0
##$ASSFAC= 0
##$ASSFACI= 0
##$ASSFACX= 0
##$ASSWID= 0
##$AUNMP= <proc_1d>
##$AZFE= 0.1
##$AZFW= 0.1
##$BCFW= 0
##$BC_mod= 0
##$BYTORDP= 0
##$COROFFS= 0
##$CY= 12.5
##$DATMOD= 1
##$DC= 0
##$DFILT= <>
##$DTYPP= 0
##$F1P= 14.0000005364418
##$F2P= -0.99999901652339
##$FCOR= 0.5
##$FTSIZE= 32768
##$FT_mod= 6
##$GAMMA= 0
##$GB= 0
##$INTBC= 1
##$INTSCL= 1
##$ISEN= 128
##$LB= 0.3
##$LEV0= 0
##$LPBIN= 0
##$MAXI= 10000
##$MC2= 0
##$MEAN= 0
##$ME_mod= 0
##$MI= 0
##$NCOEF= 0
##$NC_proc= -5
##$NLEV= 6
##$NOISF1= 0
##$NOISF2= 0
##$NSP= 0
##$NTH_PI= 0
##$NZP= 0
##$OFFSET= 16.51604
##$PC= 1
##$PHC0= -67.6513
##$PHC1= 13.9688
##$PH_mod= 1
##$PKNL= yes
##$PPARMOD= 0
##$PSCAL= 4
##$PSIGN= 0
##$REVERSE= no
##$SF= 250.130001491082
##$SI= 32768
##$SIGF1= 0
##$SIGF2= 0
##$SINO= 400
##$SIOLD= 32768
##$SREGLST= <1H.DMSO>
##$SSB= 0
##$STSI= 32768
##$STSR= 0
##$SW_p= 5175.98343685301
##$SYMM= 0
##$S_DEV= 0
##$TDeff= 65536
##$TDoff= 0
##$TI= <Analysis number 999999
Compound Code 99
Book Reference 9
Project Code 9>
##$TILT= no
##$TM1= 0
##$TM2= 0
##$TOPLEV= 0
##$USERP1= <user>
##$USERP2= <user>
##$USERP3= <user>
##$USERP4= <user>
##$USERP5= <user>
##$WDW= 1
##$XDIM= 32768
##$YMAX_p= 524438512
##$YMIN_p= -598205
$$ End of Bruker specific parameters
$$ ---------------------------------
##NTUPLES= NMR SPECTRUM
##VAR_NAME=  FREQUENCY,     SPECTRUM/REAL,   SPECTRUM/IMAG
##SYMBOL=    X,             R,               I
##VAR_TYPE=  INDEPENDENT,   DEPENDENT,       DEPENDENT
##VAR_FORM=  AFFN,          ASDF,            ASDF
##VAR_DIM=   32768,         32768,           32768
##UNITS=     HZ,            ARBITRARY UNITS, ARBITRARY UNITS
##FACTOR=    0.157963299565203, 1,           1
##FIRST=     4131.15731043152, 0,            0
##LAST=      -1044.82612642149, 0,           0
##MIN=       -1044.82612642149, -598205,     0
##MAX=       4131.15731043152, 524438512,    0
$$ Real data points
##PAGE= N=1
##DATA TABLE= (X++(R..R)), XYDATA
$$ [...]
20396C2689987p504718n388820l729361k625387k268247j831271j214312j054364
$$ 32689987 25185269 19796449 16067088 13441701 11173454 9342183 8127871 7073507
20388G073507q77318n03991l76754m58454k74364k27290l50055k09599j33071
$$ 7073507 6196189 5692198 5315444 4856990 4582626 4355336 4005281 3795682 3662611
20379C662611p4530l06914m0641K1557j29390R95K2902J27952Q6984J19936J35007
$$ 3662611 3588081 3281167 3240526 3262083 3132693 3133688 3156590 3284542 3371526 3491462 3626469
20368C626469K650n9868o12913n66208k37944k99064l92881k27455m0879j21944
$$ 3626469 3629119 3569251 2956338 2390130 2152186 1853122 1460241 1232786 1191907 1069963
20358A069963l16374k11109m097q9355Q064M274n6317P5196J14320j89020n3102
$$ 1069963 753589 542480 538383 449028 457092 461366 405049 480245 594565 405545 352443
20347C52443L3107l4842p4367j40608n2716K153J77084q5027K15003K09146R0061
$$ 352443 385550 350708 276341 135733 83017 85170 262254 177227 392230 601376 691437
20336F91437j18893p0445j11852j70789m8273J94552J99375K60829M39067O05486
$$ 691437 572544 502099 390247 219458 171185 365737 565112 825941 1265008 1870494
20326A870494R60533J167822J030270P38404J29237n97551j015798j094779j009346
$$ 1870494 2831027 3998849 5029119 5767523 5896760 5299209 4283411 3188632 2179286
20317B179286p42693l20812j43977k08602k72816j86012r7259j03489R551K0900
$$ 2179286 1436593 1115781 971804 763202 490386 304374 207115 103626 113177 134077
20307A34077j34652p0246J3876J2482P2061Q9817j10928j16531R9349P6270l4631
$$ 134077 -575 -70821 -56945 -44463 27598 117415 6487 -110044 -10695 65575 30944
20296C0944L4647r2817k11314j06048l0666J02934J18851n9478l928q96J03090
$$ 30944 65591 -27226 -238540 -344588 -375254 -272320 -153469 -212947 -216875 -217771 -114681
20285a14681J36937L9623Q2974K11958J41757j61357k18903j66566N010n4024
$$ -114681 22256 61879 144853 356811 498568 337211 118308 -48258 -43248 -97272
20275i7272j34365O0310j9424Q5283R0151M1724R237k9572o3998k61706q7883
$$ -97272 -231637 -171327 -190751 -105468 -15317 26407 35644 6072 -57926 -319632 -407515
20264d07515O0181K2715L623j27893M6775P7751J50409p6311L5358J64182J09480
$$ -407515 -347334 -324619 -320996 -448889 -402114 -324363 -173954 -250265 -214907 -50725 58755
20253E8755L9636L267k14977j0620L8741j13956p9108l8368Q5297j20386j49377
$$ 58755 98391 101658 -113319 -123939 -85198 -199154 -278262 -316630 -231333 -351719 -501096
20242e01096M0607J32521J11876O7571O8196j0037j32318P1713P287j0584k0618
$$ -501096 -460489 -327968 -216092 -148521 -80325 -90362 -222680 -150967 -143680 -154264 -174882
20231a74882j6933p0139m0879j1514J38855k08382j00772P4869j5213k0056J18678
$$ -174882 -191815 -261954 -302833 -314347 -175492 -383874 -484646 -409777 -424990 -445046 -326368
20220c26368O4320J0987P1797R6149J6618J88154R3935j09151k67714J25474L7999
$$ -326368 -262048 -251061 -179264 -83115 -66497 121657 215592 106441 -161273 -35799 2200
20209B200k943J4058k9164K3666L3338j7554j43686K4358j3301J7077O0829J49197
$$ 2200 -743 13315 -15849 7817 41155 23601 -120085 -95727 -109028 -91951 -31122 118075
20197A18075K7445M5621Q9625Q0419j31044j03448O9714J5383n8255o0404j09071
$$ 118075 145520 191141 280766 361185 230141 126693 196407 211790 153535 93131 -15940
20186a5940M2932K0021Q5968k19422p6981N8005p2260J20039N2887K5593p0039
$$ -15940 26992 47013 132981 -86441 -163422 -105417 -177677 -57638 -4751 20842 -49197
20175d9197j51206J6709p4664j8158K50610o5497n117p8917j67855O692J60007
$$ -49197 -200403 -183694 -258358 -276516 -25906 -91403 -96520 -175437 -343292 -336600 -176593
20164a76593J94638N4958K7002P0579K44957M5567j07647o0894l4064q8355j77768
$$ -176593 18045 73003 100005 170584 415541 461108 353461 292567 258503 170148 -7620
20153g620j8592P1954R935n4973J5944l5035J38379J5113j8727j52859r389P3514
$$ -7620 -26212 45742 55677 704 16648 -18387 119992 135105 116378 -36481 -45870 27644
20141B7644K13452L2119o3263j5148Q4855J56919m9346j79320k2615J19411R5652
$$ 27644 241096 273215 209952 194804 279659 436578 387232 207912 185297 304708 400360
20130D00360j31957j45594n0414K1191j03200L55o2729O8247J2535M6047J00671
$$ 400360 268403 122809 72395 93586 -9614 -9259 -71988 -3741 8794 54841 155512
20119A55512l1448L3504q044j9841J7760Q8795J3027n801j9533j19128j08039
$$ 155512 124064 157568 149524 129683 147443 236238 249265 243464 223931 104803 -3236
20108c236J61197j58054m0458j09469l8773K06765K20396n4712j17603j17572
$$ -3236 157961 -93 -40551 -150020 -188793 17972 238368 183656 66053 -51519
20098e1519j3372J3030J05123J39988K1499Q7251P571m4762k6422j38752L9875
$$ -51519 -64891 -51861 53262 193250 214749 302000 309571 264809 238387 99635 139510
20087A39510j6792p1013L559J19732q8276j35242J99247P7293k63038k36272L8174
$$ 139510 122718 51705 55264 174996 86720 -48522 150725 228018 -35020 -271292 -233118
20076b33118J11155J88019J13173R5982m4617l0352j51079j55049K22970J2124
$$ -233118 -121963 66056 179229 275211 230594 200242 49163 -105886 117084 129208
20066A29208K8121l0269J90161K82647J36355R6314K32980k4158k82962j29908
$$ 129208 157329 127060 317221 599868 736223 832537 1065517 1041359 758397 628489
20056F28489J11660J71896K11127J29414J9393j1145r5402o073k36193k77544
$$ 628489 740149 912045 1123172 1252586 1271979 1260834 1165432 1159359 923166 645622
20046F45622k32428K1598N3164j6763K36735P7226N3850m378k14564n2761o8524
$$ 645622 413194 434792 487956 471193 707928 785154 839004 834626 620062 567301 498777
20035D98777j22853k73064j19926J21235K81485j2025j77790J81545j8662j14922
$$ 498777 375924 102860 -17066 104169 385654 373629 195839 377384 358722 243800
20025B43800J23556R3883q0857j36330M1937J23710k72317k28574k6392J81738
$$ 243800 367356 461239 380382 244052 285989 409699 137382 -91192 -117584 64154
20015F4154J72091Q4916J4469L9199j7954q1207j65894r791J2460J9510N2330
$$ 64154 236245 321161 335630 374829 356875 275668 109774 99983 112443 131953 184283
20004A84283K09804J41732o4725l8793N9663J7188M1347J37196o5077j84009k32329
$$ 184283 394087 535819 471094 432301 491964 509152 550499 687695 622618 438609 206280
19993B06280p2377Q8790K5570M3382O510o8978R2123n2203j20429L2642o414j21826
$$ 206280 133903 222693 248263 291645 298155 229177 321300 269097 148668 181310 174896 53070
19981E3070j40517J0275n247k2922l9798J0349J1359K01721L2910p1838j41058
$$ 53070 -87447 -77172 -82419 -105341 -145139 -134790 -123431 78290 111200 39362 -101696
19970a01696J13260L691q3867K27759J24886n2467k69581J6580K12725M4920J32775
$$ -101696 11564 15255 -68612 159147 284033 231566 -38015 -21435 191290 236210 368985
19959C68985p3431r707J66173K06186J41576K58153K61366K27663K87105N9362
$$ 368985 295554 285847 452020 658206 799782 1057935 1319301 1546964 1834069 1893431
19949A893431k83457j03227n6131k55611k38224k30994j10126j68578l42681q1939
$$ 1893431 1609974 1506747 1450616 1195005 956781 725787 615661 447083 104402 22463
19939B2463N22J32321J17091Q9911P4132o8653q7439k5521j16851j38298j06624
$$ 22463 22985 155306 272397 362308 436440 367787 280348 254827 137976 -322 -106946
19928a06946m1983j28417K937J83568J02878J09877p3502k17010K8956J79706
$$ -106946 -148929 -277346 -274409 -90841 12037 121914 48412 -168598 -139642 40064
19918D0064N5945j48216r105K4633Q7063J371r576j1573R7127R4774K226p8859
$$ 40064 96009 -52207 -61312 -36679 50384 51755 42179 30606 127733 222507 224733 145874
19906A45874j45867K029P5853J44218j9287j11304R8506j70559j42469L7731J59334
$$ 145874 7 2036 77889 222107 202820 91516 190022 19463 -123006 -85275 74059
19895G4059N1286J74494r1501L2062q1737j40452J81931q101l5603J10198q2332
$$ 74059 125345 299839 208338 240400 158663 18211 200142 192041 156438 266636 184304
19884A84304m9075N7105R2254l3449j06602R6590j04542p1419o7910M6944N9697
$$ 184304 135229 192334 284588 251139 144537 241127 136585 65166 -2744 44200 103897
19873A03897j22305m9606k8159r3228L9884Q8852j03423j7295K07143N0280J09285
$$ 103897 -18408 -68014 -96173 -189401 -149517 -60665 -164088 -181383 25760 76040 185325
19862A85325q3606N0794K3235J22031M163j24509p2181P281R7434j59149j49740
$$ 185325 101719 152513 175748 297779 301942 177433 105252 112533 209967 50818 -98922
19851i8922J4745j20351j5855J35472K13010J47236m4970j57038p3786M588M8049
$$ -98922 -84177 -204528 -220383 -84911 128099 275335 230365 73327 -459 4129 52178
19840E2178J91701p455j9625j17576m2950q2272J7824N2194o5340K5242J07486
$$ 52178 243879 236424 216799 99223 56273 -25999 -8175 44019 -21321 3921 111407
19829A11407j45874j07145K3573l1742M2718j4358K6698n6728k997L2635L4858
$$ 111407 -34467 -141612 -118039 -149781 -107063 -121421 -94723 -151451 -154448 -121813 -86955
19818h6955J29317J75000J13029N6599k3918n9650l9775j02785j24635k5570r2839
$$ -86955 42362 217362 330391 386990 363072 303422 263647 160862 36227 10657 -82182
19807h2182O6275J45441K8613l9921k94793q5771J33525K9459J54440J19458K000
$$ -82182 -15907 129534 158147 118226 -176567 -262338 -128813 -99354 55086 174544 176544
19796A76544j1148J8698l9935O170Q1769J01471l6022j90737Q9722P1129m4770
$$ 176544 165396 184094 144159 150329 232098 333569 297547 106810 196532 267661 222891
19785B22891j72809j04472p7452J20412J39521J0891N1029j61187J9784N7140
$$ 222891 50082 -54390 -131842 -11430 128091 138982 190011 28824 48608 105748
19775A05748n770l8967j47647R0024K38087O0290J33570N96M1105J03928j65876
$$ 105748 99978 61011 -86636 3388 241475 301765 435335 435931 477036 580964 415088
19764D15088j85649k8924m9958L5606N7751O9575J375L1098q3246j69939P8968
$$ 415088 229439 200515 150557 186163 243914 313489 314864 345962 262716 92777 171745
19753A71745R7701P9210j3022j74316j88654O8501K25259P552j7008M5983j01513
$$ 171745 269446 348656 335634 161318 -27336 41165 266424 273976 256968 302951 201438
19742B01438j19030n9242m542J8509K36241K41883J22567K18060L48889M15097
$$ 201438 82408 23166 18624 37133 273374 515257 637824 855884 1204773 1619870
19732A619870P6059n0061r2457P054j21446j53553k19310j94625j08235j00687
$$ 1619870 1695929 1645868 1553411 1560465 1439019 1285466 1066156 871531 763296 662609
19722F62609j94715o1821m0j56460R575l4582R4067j6965j4795O1637n9967q5325
$$ 662609 467894 406073 406033 249573 259148 224566 318633 301668 286873 348510 288543 203218
19710B03218J4519J15921O3466j70827N086N2523k7119M1586M1984P7891J3774
$$ 203218 217737 333658 397124 226297 231383 283906 256787 298373 340357 418248 432022
19699D32022J38726k3568j15953j56623J9161O0442k2410M2611J8441L4967R8893
$$ 432022 570748 547180 431227 274604 293765 354207 331797 374408 392849 427816 526709
19688E26709J72972j08148r0141m9183j12539j63710j29432n9013J96771J46254
$$ 526709 699681 591533 501392 452209 339670 175960 46528 -12485 184286 330540
19678C30540p2696k15510r6674K10868J48003p3134r5409J7273K6033J65753K08510
$$ 330540 257844 42334 -54340 156528 304531 231397 135988 153261 179294 345047 553557
19667E53557O4425j74122k08376J52381r0743j78258K51857K76133J6704o4215
$$ 553557 617982 443860 235484 387865 297122 118864 370721 646854 663558 599343
19657E99343j60252N8045N1071J25914O5307k2831j12890p7481M1747M2056j41110
$$ 599343 439091 497136 548207 674121 739428 716597 603707 526226 567973 610029 468919
19646D68919Q9680N6494N4544J60912J48414L4496m9402q1511o4851m9174k7934
$$ 468919 558599 615093 669637 830549 978963 1013459 964057 882546 817695 768521 740587
19635G40587N453j72783P2819J23303r970M9575l7452n3675K557q0804j3300J03901
$$ 740587 746040 573257 646076 769379 759409 808984 771532 717857 720414 639610 626310 730211
19623G30211N5577j10406q7499p1243r9696j25085m4717L5168J23273J32318j33587
$$ 730211 785788 675382 587883 516640 416944 291859 247142 282310 405583 537901 404314
19612D04314o5701R487J7587p190k4570m4615N4480L7269L0721P86J69270l5505
$$ 404314 338613 348100 365687 358497 333927 289312 343792 381061 411782 412568 581838 546333
19600E46333j75164R7867J01190P5648J83989q6289J32189J13879j4357j42412
$$ 546333 371169 469036 570226 645874 829863 743574 875763 989642 975285 832873
19590H32873q5664P8149L6044J33358J46338J35516M42861L08865J9655j05295
$$ 832873 747209 825358 861402 994760 1141098 1276614 1719475 2028340 2047995 1942700
19580A942700k79115k57495j7561j0114J58984M24794M11321K16827l9599k33291
$$ 1942700 1663585 1406090 1388529 1378415 1537399 1962193 2373514 2590341 2550742 2317451
19570B317451m18804l65466l18818j38765n7210j01585j36557j45697m6845P4652
$$ 2317451 1898647 1533181 1214363 1075598 1018388 916803 780246 634549 587704 662356
19560F62356k1381J35168L08929L7552p0042j53836J8338K12686P8699o9002j24569
$$ 662356 640975 776143 1085072 1122624 1052582 898746 917084 1129770 1208469 1139467 1014898
19549A014898K00184J73831J54677J47850j62394l5230j84707Q627K29887K7071
$$ 1014898 1215082 1388913 1543590 1691440 1529046 1493816 1309109 1317736 1547623 1574694
19539A574694j96005J13564L56390K20800K36890R9001q7930j98994k89526k74533
$$ 1574694 1378689 1492253 1848643 2069443 2306333 2405334 2317404 2118410 1828884 1554351
19529A554351k18532j97415J22233L7498J4295K70797J79349n2467k98522l03923
$$ 1554351 1335819 1138404 1260637 1298135 1312430 1583227 1762576 1710109 1411587 1107664
19519A107664k33613j89537J8626P4682J3521p7267j59479K932N2379K2882l5649
$$ 1107664 874051 684514 703140 777822 791343 714076 554597 557529 609908 632790 597141
19508E97141p5032j83245o358k3809j08228O6703p261J76330m5381l75452p1031
$$ 597141 522109 338864 332506 308697 200469 267172 259911 436241 390860 15408 -55623
19497e5623J99739p393J31616J56305J02916J29368K54555J13485Q2837p9354
$$ -55623 144116 136723 268339 424644 527560 656928 911483 1024968 1107805 1028451
19487A028451j20224j05987o2016j14716J394P5780j2923m0589p4234O3129Q9687
$$ 1028451 908227 802240 740224 625508 626902 702682 689759 649170 574936 638065 727752
19476G27752p087R9644J66867n125j41539k91823o2372L7088N3408L5431J11727
$$ 727752 720665 820309 987176 982051 840512 548689 486317 523405 576813 612244 723971
19465G23971J6059j80412j22159Q7928O9792R5252J43416j791p3072R6412J17391
$$ 723971 740030 559618 437459 525387 595179 690431 833847 832056 758984 855396 972787
19454I72787j8862k23750j27128l7883J78258Q5271L8491J23948j0002j43708
$$ 972787 953925 730175 603047 565164 743422 828693 867184 991132 981130 837422
19444H37422j13554P1093K92990J25527q1455J22144J1809j80489j87208O8020
$$ 837422 723868 794961 1087951 1213478 1132023 1254167 1265976 1085487 898279 966299
19434I66299k8514p4577j00883M9753J60482J07294l604n3888j21935M8030J44902
$$ 966299 937785 863208 762325 812078 972560 1079854 1076250 1022362 900427 948457 1093359
19423A093359j21499j6499j69181j07349p1955j04880J02839N5151M8895l7568
$$ 1093359 971860 955361 786180 678831 606876 501996 604835 659986 708881 671313
19413F71313J77375J20111J03108n6086j18490j11641n519q0168n0957N2485J61556
$$ 671313 848688 968799 1071907 1015821 897331 785690 780171 700003 649046 701531 863087
19402H63087J20673k3243j92791M9307J77657J21996J6604J01848O4933o0011
$$ 863087 983760 960517 767726 817033 994690 1116686 1133290 1235138 1300071 1240060
19392A240060m7601R2994j38278N9836J30963n3386j52532J7736O113J17794M6307
$$ 1240060 1192459 1285453 1147175 1207011 1337974 1284588 1132056 1149792 1155905 1273699 1320006
19381A320006j79968m9539J33443J91676J6665k06796N7053L0132p9599k03396
$$ 1320006 1140038 1090499 1223942 1415618 1432283 1225487 1282540 1312672 1233073 1029677
19371A029677J92995J74016O8401J67282K51397J65474N4954j90755j86434O5601
$$ 1029677 1222672 1396688 1465089 1632371 1883768 2049242 2104196 1913441 1727007 1792608
19361A792608N7858M6402j2440n2151P2557M1561L1930n3182J36963J89379R0761
$$ 1792608 1850466 1896868 1884428 1832277 1904834 1946395 1978325 1925143 2062106 2251485 2342246
19350B342246L61565J37187M2236N9895L4143m6591P1018J84212K01498j1050
$$ 2342246 2703811 2840998 2883234 2943129 2977272 2930681 3001699 3185911 3387409 3376359
19340C376359K92574R7295J8727k29517k02742J74051J40469J84488n167J35198
$$ 3376359 3668933 3766228 3784955 3555438 3352696 3526747 3667216 3851704 3846537 3981735
19330C981735M43265K44794M88513O86558P00276O90449P71300O65701M22060
$$ 3981735 4425000 4669794 5158307 5844865 6545141 7235590 8006890 8672591 9094651
19321I094651M42748O45521O53791Q46965J063580J314869J580333J894806K356928
$$ 9094651 9537399 10182920 10836711 11683676 12747256 14062125 15642458 17537264 19894192
19312A9894192L153625M352950N614381P505328J1056930J6592387K4856373L6439145
$$ 19894192 23047817 27400767 33015148 40520476 51577406 68169793 93026166 129465311
19304A29465311N0370098O1622823O2467347M7836058K0485304j3191966m3210040
$$ 129465311 179835409 241458232 303925579 351761637 372246941 359054975 315844935
19297C15844935o0062696o1847127n3352947m0559875k8633878j9485714j2920382
$$ 315844935 255782239 193935112 140582165 100022290 71388412 51902698 38982316
19290C8982316q828521o220712m478744l317335k459043j880473j208700r48359
$$ 38982316 30153795 23933083 19454339 16137004 13677961 11797488 10588788 9640429
19282I640429p15478n24452m07496l40376l00841k25378k92760o26931n86442
$$ 9640429 8924951 8400499 7993003 7652627 7351786 7126408 6833648 6206717 5620275
19273E620275m08226m97185n82254m81939k19712j90679l10308k71381j92902
$$ 5620275 5212049 4714864 4132610 3650671 3430959 3240280 2929972 2658591 2465689
19264B465689K0797k0422O6455O8029L8432n2054l807N509R90p5264j86028k0410
$$ 2465689 2486486 2466064 2532519 2600548 2638980 2586926 2583119 2588628 2589618 2514354 2328326 2307916
19252B307916O1038j25201j96938p0850q3132j45012j02201n2013j17537K6772
$$ 2307916 2368954 2243753 2046815 1975965 1892833 1747821 1645620 1593607 1476070 1502842
19242A502842j22841j65348j02826o7004m5338l6967q4372L6941P9464j791J56487
$$ 1502842 1380001 1214653 1111827 1044823 999485 962518 878146 915087 994551 992760 1149247
19231A149247J32734K03762m7964k02765k46523m1487Q2688P0735J10568J55985
$$ 1149247 1281981 1485743 1437779 1235014 988491 947004 1029692 1100427 1210995 1366980
19221A366980J25318j79528q2297J1792N9790j14727j01117m0517j2355n0250
$$ 1366980 1492298 1312770 1230473 1242265 1302055 1187328 1086211 1045694 1033339 983089
19211I83089J70617P7893q4608k3477J07226R5245l6915m2070P4451p1189K488
$$ 983089 1153706 1231599 1146991 1123514 1230740 1325985 1289070 1247000 1321451 1250262 1252750
19200A252750M6237L9655J23640M5253L5766K89521L09903j7900j18507o3754
$$ 1252750 1298987 1338642 1462282 1507535 1543301 1832822 2142725 2124825 2006318 1942564
19190A942564l565k6463J36309J53915q7963j22537K7529J51672K11997J17196
$$ 1942564 1938999 1912536 2048845 2202760 2114797 1992260 2019789 2171461 2383458 2500654
19180B500654Q1334M8995k4576J33917J19189K46659K16292K67953K39876N4640
$$ 2500654 2581988 2630983 2606407 2740324 2859513 3106172 3322464 3590417 3830293 3884933
19170C884933k00997l24535p9179K2263R3866n2059l6064q3922O5997J47472M5706
$$ 3884933 3683936 3359401 3280222 3302485 3396351 3344292 3308228 3224306 3290303 3437775 3483481
19159C483481J3008J67180K48191L43972K60339L03054J42697K34988L44769L00865
$$ 3483481 3496489 3663669 3911860 4255832 4516171 4819225 4961922 5196910 5541679 5842544
19149E842544N07341M15052N75526J042758J317196J779031K450264L235746M548699
$$ 5842544 6349885 6764937 7340463 8383221 9700417 11479448 13929712 17165458 21714157
19140B1714157N701352O733722O678198M888080J542412j143199k542120k678534
$$ 21714157 27415509 34149231 40827429 45715509 47257921 46114722 43572602 40894068
19132D0894068q14569K105452N649820Q842687J1040141J1663350R128058L664209
$$ 40894068 40079499 42184951 47834771 56677458 67717599 79380949 88509007 92173216
19124I2173216l425635q784081j1200315j1054951q951500n734670k354485N28011
$$ 92173216 88747581 79963500 68763185 57708234 48756734 43022064 40667579 41195590
19116D1195590K496062L974467M757916L169178o24963m150355n837452o552725
$$ 41195590 43691652 47666119 52424035 55593213 54968250 50817895 44980443 38427718
19108C8427718o358388n605677m454657l274600k113515j155577m36350K12277
$$ 38427718 32069330 26463653 22008996 18734396 16620881 15465304 15028954 15241231
19100A5241231J094397J637039K635443L879258N323307P164897P801558O476344
$$ 15241231 16335628 17972667 20608110 24487368 29810675 36975572 44777130 51253474
19092E1253474L339296k03407k387606k481784j99338L706490P974846J2278794
$$ 51253474 54592770 54389363 52001757 49519973 49320635 53027125 61001971 73280765
19084G3280765J4647986J2856629O870854j007289p862737j2213490j2892665
$$ 73280765 87928751 100785380 107656234 106648945 98786208 86572718 73680053
19077G3680053j0945462p720785l700856K60532L657581O639202P757297N874327
$$ 73680053 62734591 55013806 51312950 51573482 55231063 61870265 69627562 75501889
19069G5501889Q64830m906645q718276j0526817r949204q057139n865395l898998
$$ 75501889 76366719 71460074 62741798 52214981 42265777 34208638 28343243 24444245
19061B4444245k156654r20956J76274J081442J919388L089219M475807O114163
$$ 24444245 22287591 21366635 21542909 22624351 24543739 27632958 32108765 38222928
19053C8222928P382056Q700530J0098250J0891826R936008P643704O399569O838896
$$ 38222928 45604984 54305514 64403764 75295590 85231598 92875302 99274871 106113767
19045A06113767Q159730Q136361P001720O253128P907687J0053339Q677608L839074
$$ 106113767 114273497 122409858 129411578 135664706 143572393 153625732 162303340 166142414
19037A66142414n89719k132768k413162l893083p303993j0061902j0907221r499683
$$ 166142414 165552695 163419927 161006765 157113682 149809689 139747787 128840566 119340883
19029A19340883o544026m291124m508308o619431p563051p263618p357801q275736
$$ 119340883 112796857 108505733 103997425 97377994 89814943 82551325 75193524 66917788
19021F6917788r272308r236865q544889p652734o297620n202428m090557l058548
$$ 66917788 57645480 48408615 39863726 32210992 25913372 20710944 16620387 13561839
19013A3561839k253055j567120j211880j010168r47705o16995n45569o34645m57063
$$ 13561839 11308784 9741664 8529784 7519616 6571911 5954916 5409347 4774702 4317639
19004D317639l57411k05736k62218k37966j83333j06160l52398l44696l01965
$$ 4317639 3960228 3754492 3492274 3254308 3070975 2964815 2612417 2267721 1965756
18995A965756k87514l81393k32161j87542O563m780J02370o6807j83517j21824
$$ 1965756 1678242 1296849 1064688 877146 883709 878929 981299 914492 730975 609151
18985F09151j08586r2465J99675k5187K1627m3399k4874R9626J17183L5507j08474
$$ 609151 500565 408100 607775 582588 604215 560816 535942 635568 752751 788258 679784
18974F79784p6031l3314j62990N292J03169m3515m3297J06698J4081o9457J669
$$ 679784 603753 570439 407449 412741 515910 472395 429098 535796 549877 480420 482089
18963D82089J08890Q3531j6230q9939P4556p561n1689j75963j35548J1934Q4984
$$ 482089 590979 674510 658280 568341 642897 635336 583647 407684 272136 284070 369054
18952C69054L6822J14128K9759j43790q6460j25138K2894Q5496O7368J68409j31156
$$ 369054 405876 520004 549763 405973 319513 194375 217269 302765 370133 538542 407386
18941D07386j47217o1979J61218j57392r6076p1237O0026P1522K7779K4086J2543
$$ 407386 260169 198190 359408 202016 105940 34703 94729 166251 194030 218116 230659
18930B30659M3151p132J68357q8183J3623j6520M8911l2005m4552K19913J68308
$$ 230659 273810 266678 435035 346852 360475 343955 392866 360861 316309 536222 704530
18919G04530J63003J18191j19490q1187L1353n5242o8172k5709j6304L5032l1180
$$ 704530 867533 985724 866234 785047 816400 761158 692986 667277 650973 686005 654825
18908F54825J77622K35839l8100k38409j09543J20443k0098k63976j4389J16591
$$ 654825 832447 1068286 1030186 791777 682234 802677 782579 518603 504214 620805
18898F20805q9557m0014j02889j7709J12767K7617j94111k54358J9933N9233O8561
$$ 620805 531248 491234 388345 370636 483403 511020 316909 62551 82484 141717 210278
18887B10278M3857N1484m9909j2974K8687K22829J17018j23189j4488J09746p5046
$$ 210278 254135 305619 255710 242736 271423 494252 611270 488081 473593 583339 508293
18876E08293l1627k28373O6752p8215k31307j5920j61345q570K6129J93505j58251
$$ 508293 476666 248293 315045 236830 5523 -10397 -171742 -180312 -154183 39322 -118929
18865a18929N0452J29516J31939j15621j95023J24742R6684J62996o744p8251
$$ -118929 -68477 61039 192978 77357 -117666 7076 103760 266756 260012 181761
18855A81761J0101k0425J12635R4594o3714n1449J12689L4008q5913R4281K02527
$$ 181761 191862 171437 284072 378666 314952 263503 376192 410200 324287 418568 621095
18844F21095P2498r9338j66857k25036j42133J36875Q6647J09234k4676q9613
$$ 621095 693593 594255 427398 202362 60229 197104 283751 392985 368309 278696
18834B78696J03424j21042M528q6842Q846J42501J39549K4692j90707N756l3189
$$ 278696 382120 261078 265606 178764 187610 330111 469660 494352 303645 309401 276212
18823B76212P613j52076O107j5560k1000J45641J55642q0723l63366J1586J1713
$$ 276212 283825 131749 137856 122296 101296 246937 402579 321856 -41510 -29924 -18211
18812a8211J20046R6675J37171J8436k33950J1388J21657J32748N1964M8455p7850
$$ -18211 101835 198510 335681 354117 120167 131555 253212 385960 437924 486379 408529
18801D08529R23R4205o96J92203K9095j77519P4073R9726o7719n1371k18762n9652
$$ 408529 409452 503657 502961 695164 724259 546740 620813 720539 652820 601449 382687 323035
18789C23035J7711k9260K488J64413j20554p8564o2823M8385M9848J61573m5629
$$ 323035 340746 311486 313974 478387 357833 279269 216446 264831 314679 476252 430623
18778D30623R2931J90966M7033K497m302J34651O0534j28454j81490j72618j06269
$$ 430623 523554 714520 761553 764050 759748 894399 954933 826479 644989 472371 366102
18767C66102j29730j10536k8708J43020m647j10958p2036J2299J59443K4706O2098
$$ 366102 236372 125836 97128 240148 235501 124543 52507 64806 224249 248955 311053
18756C11053O3291o1424q5816j7047Q7530p5994R7599R6739K0916m3356M7230
$$ 311053 374344 312920 227104 210057 297587 221593 319192 415931 436847 393491 440721
18745D40721R918m4782q8175J00031K2781k6051j00833L5879l1494P50J30559
$$ 440721 450639 405857 317682 417713 440494 414443 313610 349489 317995 318745 449304
18734D49304j6311R6687Q9860J50930J23450j3235j1245K80313K22464n5824r6811
$$ 449304 432993 529680 619540 770470 893920 880685 869440 1149753 1372217 1316393 1219582
18723A219582j35579k53548o3059L0827J36570r3019j48378K9530J24825j05858
$$ 1219582 1084003 830455 767396 798223 934793 841774 693396 722926 847751 741893
18713G41893l5641J3461p5105O2159r3595k8936M6900N1822J03012J66267r9295
$$ 741893 706252 719713 644608 706767 613172 584236 631136 682958 785970 952237 852942
18702H52942j93620Q528P8873j53828k66695k8337J85793J86004K0572J00432
$$ 852942 659322 667850 746723 592895 326200 297863 483656 669660 690232 790664
18692G90664J43903l3491q1684j19904j47557J7826J00810J2581O34J37534K02121
$$ 790664 934567 901076 819392 699488 551931 569757 670567 683148 683782 821316 1023437
18681A023437q9401L3185J46428J34940J29672n2443L4061j435k2543J14130j08090
$$ 1023437 934036 967221 1113649 1248589 1378261 1325818 1359879 1358444 1335901 1450031 1341941
18670A341941k19179j41547R0106L7772j44893R3611J6867J09852J55914O6314
$$ 1341941 1122762 981215 1071321 1109093 964200 1057811 1074678 1184530 1340444 1406758
18660A406758M5156J404l0585Q7949P483L7464j3864K0503P2228j49794J0524
$$ 1406758 1451914 1453318 1422733 1510682 1518165 1555629 1541765 1562268 1634496 1484702 1495226
18649A495226K84370R5910j40380J49566J99534Q1345K84645M14663J94246o7740
$$ 1495226 1779596 1875506 1735126 1884692 2084226 2165571 2450216 2864879 3059125 2991385
18639B991385k37491l38281l67888j53806j31179p7472j2902o8937j63884m2898
$$ 2991385 2753894 2415613 2047725 1893919 1762740 1685268 1672366 1603429 1439545 1396647
18629A396647J24497m7897p542K91297L14904m1778p1045K13434J30111p675M9995
$$ 1396647 1521144 1473247 1465705 1757002 2071906 2030128 1959083 2172517 2302628 2294953 2344948
18618B344948Q1988O8166N7431l3094K38649J59517L02467J23513L24602M62156
$$ 2344948 2426936 2495102 2552533 2519439 2758088 2917605 3220072 3343585 3668187 4130343
18608D130343L14616K84016K27616N72380O30446J100333J576527J717154K075505
$$ 4130343 4444959 4728975 4956591 5528971 6159417 7259750 8836277 10553431 12628936
18599A2628936K364316J687688N34704k52299p33111p88295j47139Q59999K030540
$$ 12628936 14993252 16680940 17215644 16963345 16230234 15441939 15294800 16154799 18185339
18590A8185339L275300M043977M302133M022685K874460L10359k188000l334000
$$ 18185339 21460639 25504616 29806749 33829434 36703894 37014253 34826253 31492253
18582C1492253l521423k887691j903645n85020P29243J476138J937389K301686
$$ 31492253 27970830 25083139 23179494 22594474 23323717 24799855 26737244 29038930
18574B9038930J160242q50517k201151l089446l307184k854112k204882j417739
$$ 29038930 30199172 29348655 27147504 24058058 20750874 17896762 15691880 14274141
18566A4274141o95604j37829K12219M47803O12646Q21926J230464J692474K224907
$$ 14274141 13578537 13440708 13652927 14100730 14713376 15535302 16765766 18458240 20683147
18557B0683147L009225M106148N954665Q478387J1241806J3816378J5097935J4421724
$$ 20683147 23692372 27798520 33753185 42231572 53473378 67289756 82387691 96809415
18549I6809415R557856K803914k999638n731514n007235q58695M984001J1671452
$$ 96809415 106367271 109171185 106171547 100440033 95432798 94574103 99558104 111229556
18541A11229556J7631977K1757006K1208331J5777489P066755M79847o62413L259845
$$ 111229556 128861533 150618539 171826870 187604359 194671114 195150961 194488548 197748393
18533A97748393N794710K532408k699750l619888J177924O425681M204485p121120
$$ 197748393 203543103 206075511 203375761 199755873 200933797 207359478 211563963 204442843
18525B04442843k0768797k9437128l0950483k7385836k2085903j6757064j2178179
$$ 204442843 183674046 154236918 123286435 95900599 73814696 57057632 44879453
18518D4879453q764630o430582m730478l169308k193268j682681j350060j031689
$$ 44879453 36114823 29684241 24953763 21784455 19591187 17908506 16558446 15526757
18510A5526757r13147p41101q17139o96764n27784n16844l18357k00371j12838
$$ 15526757 14613610 13872509 13055370 12358606 11830822 11313978 10995621 10795250 10682412
18501A0682412K9539L91285R46727J240075J449815J831946K570779L610700N421571
$$ 10682412 10711951 11103236 12049963 13290038 14739853 16571799 19142578 22753278 28174849
18492B8174849Q212593J2241086J7388580K0731464J9143813J3426227Q388993
$$ 28174849 36387442 48628528 66017108 86748572 105892385 119318612 127707605
18485A27707605N530263M06173q421766j6661606k0104102j8768793j4766925
$$ 127707605 133237868 133644041 125222275 108560669 88456567 69687774 54920849
18478E4920849j1254076r116247p565691o228749m836984l404783k406631j615708
$$ 54920849 43666773 34550526 26984835 20756086 15919102 12514319 10107688 8491980
18470H491980j272225q86219m22670m02481j27118j83541k08864L9154K3609o3290
$$ 8491980 7219755 6333536 5910866 5508385 5381267 5197726 4988862 5028016 5051625 4988335
18460D988335p7005j91014k45033l48326l60480l29079m0638n6960o6513m2388
$$ 4988335 4911330 4720316 4475283 4126957 3766477 3437398 3396760 3339800 3273287 3230899
18450C230899Q4693L70696M44964N47543J216505J698218K332304L527952N014406
$$ 3230899 3315592 3686288 4131252 4678795 5895300 7593518 9925822 13453774 18468180
18441A8468180O384243O172190M067144J646391O17993k95128k233896m420743
$$ 18468180 24852423 31024613 35091757 36738148 37356141 37061013 34827117 30406374
18433C0406374n907158o184450n126941l824743k579703j704494j174517p84221
$$ 30406374 24499216 18314766 13187825 9363082 6783379 5078885 3904368 3120147
18425C120147n51590m07110m30622l05978j47572l5085p9558R2839m7899j5124
$$ 3120147 2568557 2161447 1730825 1424847 1277275 1242190 1162632 1255471 1207572 1192448
18415A192448K440P8294P0829J08187Q81j36591j47803R0463J7142O027j18204
$$ 1192448 1194888 1273182 1344011 1452198 1453079 1316488 1168685 1259148 1276290 1282317 1164113
18404A164113k37510k70383j78637o1789o4054O3384n0248j77346j06556o7602
$$ 1164113 926603 656220 477583 415794 351740 415124 364876 187530 80974 13372
18394A3372L8416N8582J30399n4635r3069J71737J58629o0376p2521p4753J2845
$$ 13372 51788 110370 240769 186134 93065 264802 423431 363055 290534 215781 228626
18383B28626k0032J52476J3546j58155j51819N0211K7054n0088j989J18263K03072
$$ 228626 208594 361070 374616 216461 64642 114853 141907 91819 89830 208093 411165
18372D11165q7565j40454M6614n2052M0044J28197N9879o0105J88416J32066j81458
$$ 411165 323600 183146 229760 177708 217752 345949 405828 345723 534139 666205 484747
18361D84747q8754n3319j17415p9988J40868R776j15328J39808J40273J02972
$$ 484747 395993 342674 225259 145271 286139 295915 180587 320395 460668 563640
18351E63640P9796O3887j73327j38803o1123N2399l6515k09536k04431j24442
$$ 563640 643436 707323 533996 395193 334070 386469 349954 140418 -64013 -188455
18341a88455L6666O1508P0496j15278o0406Q8575o57k4773r7705j03662r957L12431
$$ -188455 -151789 -90281 -19785 -135063 -195469 -106894 -107551 -132324 -230029 -333691 -343648 -31217
18329c1217L22504n1927k26561k18855r7035l9571k772j28816J52201M6670n3507
$$ -31217 291287 239360 12799 -206056 -303091 -342662 -345434 -474250 -322049 -275379 -328886
18318c28886P5598M7213j29137m7119J2020R8385O9168j32512J02515J71258K53942
$$ -328886 -253288 -206075 -335212 -382331 -370311 -271926 -202758 -335270 -232755 -61497 192445
18307A92445O2075n151J28362j88801l2084Q317J47626m5802k5279j24891m2801
$$ 192445 254520 249369 377731 188930 156846 165163 312789 266987 241708 116817 74016
18296G4016L3482l7408q7297j10838n7854O4908m3530R2406M5768J02454P0964
$$ 74016 107498 70090 -17207 -128045 -185899 -120991 -164521 -72115 -26347 76107 147071
18285A47071P8338K59514R8337k30658j85203m4360Q9334K2205k6266p7446k60983
$$ 147071 225409 484923 583260 352602 167399 123039 212373 234578 208312 130866 -130117
18274a30117l1317P9668J71643J10281j30522q7880j83256j44793J12681J77695
$$ -130117 -161434 -81766 89877 200158 69636 -18244 -201500 -346293 -233612 -55917
18264e5917k5270o280o5409p8285J8665J49780J92356M986K4220q6734k45922
$$ -55917 -81187 -87467 -152876 -231161 -212496 -62716 129640 134626 158846 72112 -173810
18253a73810k53008k7722P8654J15653J14495L0198j64454p9562R1033K3808L0515
$$ -173810 -426818 -454540 -375886 -260233 -145738 -115540 -279994 -359556 -268523 -244715 -214200
18242b14200J34701J11533L8237K8150J3162K1872m1170j91193r7179J23452j372
$$ -214200 -79499 32034 70271 98421 111583 133455 92285 -98908 -196087 -72635 -74007
18231g4007l715O5576K0292n7438j06119m2244K571j7235j37220Q716K29273n6519
$$ -74007 -77722 -12146 8146 -49292 -155411 -197655 -195084 -212319 -349539 -340823 -111550 -168069
18219a68069r0066Q908p3786j73625o4232K29160J58754r2142j17608r975M8082
$$ -168069 -258135 -249227 -323013 -496638 -560870 -331710 -172956 -265098 -382706 -392681 -344599
18208c44599K77420J7130j50863J6691N7986M0898j92212P8710J22587Q9364j16927
$$ -344599 -67179 -50049 -200912 -184221 -126235 -85337 -277549 -198839 -76252 13112 -103815
18197a03815k7359N1285N126j3089Q6082o1274Q1058p8226l3620l8808o6999n5897
$$ -103815 -131174 -79889 -74763 -87852 -1770 -63044 18014 -60212 -93832 -132640 -199639 -255536
18185b55536j04520N88O3942J91457k6043l4592M7646O5900J36265j30775j46480
$$ -255536 -360056 -359468 -295526 -104069 -130112 -164704 -117058 -51158 85107 -45668 -192148
18174a92148J30167J41146l5668j62049j28159P8824P0375l5150r8164l5956P1140
$$ -192148 -61981 79165 43497 -118552 -246711 -167887 -97512 -132662 -230826 -266782 -195642
18163a95642M273k5512J07921J3836M6112l7648O4052J24346J5477k99327k36142
$$ -195642 -191369 -216881 -108960 -95124 -49012 -86660 -22608 101738 117215 -182112 -418254
18152d18254K68395K91051K7396p1493l4760N9355M256j19613Q488m8159j61699
$$ -418254 -149859 141192 168588 97095 62335 121690 125946 6333 14821 -33338 -195037
18141a95037p1613o384K43931m0948n7n0844m3328J25836P4449N099m7007k4735
$$ -195037 -266650 -273034 -29103 -70051 -70108 -120952 -164280 -38444 36005 41104 -5903 -30638
18129c0638j16513J9357p9374n5019L2455J16998Q4531j53914L5418J59786R114
$$ -30638 -147151 -127794 -207168 -262187 -229732 -112734 -28203 -182117 -146699 13087 22201
18118B2201j14828q0661l0952L5164K19303K07708J28828p1943J9307o5897q433
$$ 22201 -92627 -173288 -204240 -169076 50227 257935 386763 314820 334127 268230 259797
18107B59797k2447j17288n8921J44617K10924J87177k04054k17773l6191n7359
$$ 259797 237350 120062 61141 205758 416682 603859 399805 182032 145841 88482
18097H8482P3093R4986O7486n0758p2583J0723m8626K7202m1690n562l4236j13569
$$ 88482 161575 256561 324047 273289 200706 211429 162803 190005 148315 142753 108517 -5052
18085e052j5810J8609J14052J17990n6446j97817j39394l8875J39949K04580K75441
$$ -5052 -20862 -2253 111799 229789 173343 -24474 -163868 -202743 -62794 141786 417227
18074D17227r524p9095r6388k7054Q8273J20830k3163k5812J13359J4849J302
$$ 417227 407703 328608 232220 205166 293439 414269 391106 365294 478653 493502 494804
18063D94804J73380Q5624J11734J51111m7843j01199j19215l4478j67585j34774
$$ 494804 668184 753808 865542 1016653 968810 867611 748396 713918 546333 411559
18053D11559l972o347j14974o6490j00077k9499j28017k79262J18885O9492j50724
$$ 411559 407587 401240 286266 219776 119699 90200 -37817 -317079 -198194 -128702 -279426
18042b79426M173J43194M3738r8719l6175J21597P0245l1687M0322k42098K9802
$$ -279426 -275253 -132059 -88321 -187040 -223215 -101618 -31373 -63060 -22738 -264836 -235034
18031b35034J55742K05324J04651j62884R7266J06753J9823J10314O7379K0871
$$ -235034 -79292 126032 230683 67799 165065 271818 291641 401955 469334 490205
18021D90205L2395m5813O8220j58468j28602k6023J02504K09922P172n244n0673
$$ 490205 522600 476787 545007 386539 257937 231914 334418 544340 551512 546268 495595
18010D95595j28438j000J85455j28162o9327j7238m9769J54753J76122N3724O0005
$$ 495595 367157 366157 551612 423450 354123 336885 287116 441869 617991 671715 731720
17999G31720Q7952j3753j97014k60405P5634J05900n7608q3547k5058n4211q5509
$$ 731720 819672 805919 608905 348500 424134 530034 472426 388879 363821 309610 224101
17988B24101m8899n051r8817k9470Q3235J03521L5888J32284P6803k4413J06032
$$ 224101 175202 170151 71334 41864 125099 228620 264508 396792 473595 449182 555214
17977E55214P2324P2080O4841K18344j5458j16742j02020k77125r0000J02668
$$ 555214 627538 699618 764459 982803 967345 850603 748583 471458 381458 484126
17967D84126P8566j35732k31220K7222J33198l3013j43927K6900J65531q7270
$$ 484126 562692 426960 195740 222962 356160 323147 179220 206120 371651 284381
17957B84381m6702K0674p4458p9K4544o235m1738p1210l9353J48581J72078J75268
$$ 284381 237679 258353 183895 183816 208360 202125 160387 89177 49824 198405 370483 545751
17945E45751J1802O6940r5992o5096o1015q6618j46183p5522m3791Q3055L0600
$$ 545751 557553 624493 528501 463405 402390 315772 169589 94067 50276 133331 163931
17934A63931J1336J3644Q8485Q9228P4392k3852l5453K5076K6804J9052k7667
$$ 163931 175267 188911 277396 366624 441016 417164 381711 406787 433591 452643 424976
17923D24976q4410M2668l6449k10570p9976j59731q0097r870K24557K39183L9348
$$ 424976 340566 383234 346785 136215 56239 -103492 -183589 -193459 31098 270281 309629
17912C09629o9155k79562j57546N4874J59876j02504o7961R4014N9954n8743j50085
$$ 309629 240474 -39088 -196634 -141760 18116 -84388 -152349 -58335 1619 -57124 -207209
17901b07209n6804m5100Q6199K8457p6113N2959K33255J08117K2237q220l672
$$ -207209 -264013 -309113 -222914 -194457 -270570 -217611 15644 123761 145998 137778 134106
17890A34106q8696r9863m7615m0345k813n928j11466j45944Q9096M9856o9602
$$ 134106 45410 -54453 -102068 -142413 -145226 -151154 -262620 -408564 -319468 -269612 -339214
17879c39214p1112J40458J27910O2035j57336k4840r0370P3166J82271J47371
$$ -339214 -410326 -269868 -141958 -79923 -237259 -262099 -352469 -279303 -97032 50339
17869E0339l3365J0930p6369j6066j27610j26938j02892P9558J8590j19930O640
$$ 50339 16974 27904 -48465 -64531 -192141 -319079 -421971 -342413 -323823 -443753 -437113
17858d37113O6960O465R1952j02439O9990J19810m9570l9708r5454K5774R7695
$$ -437113 -370153 -363688 -271736 -374175 -304185 -184375 -233945 -273653 -369107 -343333 -245638
17847b45638j4364J56460P8107n0442j17463k975J36422J25059p9220l4773j1347
$$ -245638 -260002 -103542 -25435 -75877 -193340 -196315 -59893 65166 -14054 -48827 -60174
17836f0174n3400m7636L9628m3000O9332r7916o7045J09219J18319j5316j91786
$$ -60174 -113574 -161210 -121582 -164582 -95250 -193166 -260211 -150992 -32673 -47989 -239775
17825b39775j5613L4073K0476J0780r818M1803M4036R4941p5810j43183J7782
$$ -239775 -255388 -221315 -200839 -190059 -199877 -158074 -114038 -19097 -94907 -238090 -220308
17814b20308k589m65J10982J10252k4651j88047j08936N4976J35291J43072P5860
$$ -220308 -222897 -223362 -112380 -2128 -26779 -214826 -323762 -268786 -133495 9577 85437
17803H5437j32758k05195J0665J03170J4482n5781j51368m0874L8667m5715P318
$$ 85437 -47321 -252516 -241851 -138681 -124199 -179980 -331348 -372222 -333555 -379270 -371952
17792c71952K9573J36497q2926J5014L4871K297j7442j2375P3758p5269J746K241
$$ -371952 -342379 -205882 -288808 -273794 -238923 -236626 -254068 -266443 -192685 -267954 -266208 -263967
17780b63967j22697K3066J3557J56895P2941J880j39000k4549k4917J04352k4849
$$ -263967 -386664 -363598 -350041 -193146 -120205 -118325 -257325 -281874 -306791 -202439 -227288
17769b27288L2608o3951m9311q0348j710k9671j35234R3653J46896l5311L6455
$$ -227288 -194680 -258631 -307942 -388290 -390000 -419671 -554905 -461252 -314356 -349667 -313212
17758c13212l2465J4345L6286J12392J45823j08955j10083l4304M4015N3470J36443
$$ -313212 -345677 -331332 -295046 -182654 -36831 -145786 -255869 -290173 -246158 -192688 -56245
17747e6245o0985Q968J48076K7878l6669j1201L8120J09048j5306k7866k1822
$$ -56245 -117230 -108262 39814 67692 31023 19822 57942 166990 151684 123818 101996
17736A01996j7831j5507j62633q594Q185J06377L9537j88314r1035M2444J09517
$$ 101996 84165 68658 -93975 -102569 -94384 11993 51530 -136784 -227819 -185375 -75858
17725g5858n865k3055J06447l5764k05175O9311P2218o6916k01588n6673Q8925
$$ -75858 -81723 -104778 1669 -34095 -239270 -169959 -97741 -164657 -366245 -422918 -333993
17714c33993J28409J08244j00365p5221O3514o5485J5034j7447J26121J7974j31757
$$ -333993 -205584 -97340 -197705 -272926 -209412 -274897 -259863 -277310 -151189 -133215 -264972
17703b64972Q3066L210k1585o1365j03837Q7849r5436m4664q2570r7901J43614
$$ -264972 -181906 -178696 -200281 -261646 -365483 -277634 -373070 -417734 -500304 -598205 -454591
17692d54591K16935J4336J40006K01215n8940k3609J41618j3546q752l1415j60107
$$ -454591 -237656 -223320 -83314 117901 58961 35352 176970 163424 154672 123257 -36850
17681c6850q1399J87987O188J7073j22822r9290N1195Q0430O2985J337j00311
$$ -36850 -118249 69738 75926 92999 -29823 -129113 -77918 2512 65497 66834 -33477
17670c3477j11526j20046m416j9940J1256J00609k7994J28451N5278J80346r7571
$$ -33477 -145003 -265049 -269465 -289405 -278149 -177540 -205534 -77083 -21805 158541 60970
17659F0970j16220m1352j27237m2977l6314Q5321r2151j97572J22860J10101L9619
$$ 60970 -55250 -96602 -223839 -266816 -303130 -217809 -309960 -507532 -384672 -274571 -234952
17648b34952J20717R7896R727j55662L4605K18791J17899q7304j15319O0937n6414
$$ -234952 -114235 -16339 -6612 -162274 -127669 91122 209021 121717 6398 67335 10921
17637A0921m3670k9154l7910O6841J04604n0092k6423o3298q3903k1970l0578
$$ 10921 -32749 -61903 -99813 -32972 71632 21540 -4883 -68181 -152084 -174054 -204632
17626b04632J74841J84277j6375j43476j80235k34300j17522J52609K15860O5440
$$ -204632 -29791 154486 138111 -5365 -185600 -419900 -537422 -384813 -168953 -103513
17616a03513l2435p1535P8056J74932Q1612J6005K5818j47847k4204q2042j15163
$$ -103513 -135948 -207483 -129427 45505 127117 143122 168940 21093 -3111 -85153 -200316
17605b00316J5270m8672K7698N1661K3602J17006J3845k2691j4757j50220n6969
$$ -200316 -185046 -233718 -206020 -154359 -130757 -13751 94 -22597 -37354 -187574 -244543
17594b44543q162q1117j54646J9891K13214Q3213m9361P1165p6514j06545M7126
$$ -244543 -252705 -333822 -488468 -468577 -255363 -172150 -221511 -150346 -226860 -333405 -286279
17583b86279P1203N2247j26741j09309J32841J37547l7387m5264L9086j6353l5853
$$ -286279 -215076 -162829 -289570 -398879 -266038 -128491 -165878 -211142 -172056 -188409 -224262
17572b24262l5054J35860p7967l7985O9761l8635j34858N4105K14383J01318o3810
$$ -224262 -259316 -123456 -201423 -239408 -169647 -208282 -343140 -289035 -74652 26666 -37144
17561c7144r9971J5976L061M8442Q8782k8700J0382O9375j12945k9550j9913j51911
$$ -37144 -137115 -121139 -118078 -69636 19146 -9554 828 70203 -42742 -72292 -92205 -244116
17549b44116L9715O5183o5170J6283N7818l683Q5885O3098l332l5388r5286m2797
$$ -244116 -204401 -139218 -204388 -188105 -130287 -133970 -48085 15013 11681 -23707 -118993 -161790
17537a61790l4494j34026J43310J36933O8707p2938k41747p945J21650O9033m101
$$ -161790 -196284 -330310 -187000 -50067 18640 -54298 -296045 -303990 -182340 -113307 -117408
17526a17408j08883p524Q1728K4890m003m1461J16399j3172q8103J3877R535Q7036
$$ -117408 -226291 -233815 -152087 -127197 -131200 -172661 -56262 -69434 -157537 -143660 -134125 -47089
17514d7089j47952o7377R1969L7366L111O7908O7963j47405k04594m6465q4911
$$ -47089 -195041 -262418 -170449 -133083 -129972 -62064 5899 -141506 -346100 -392565 -477476
17503d77476R858J73170K05806j47468o2173p7372L849J81753L2900r155K5901
$$ -477476 -467618 -294448 -88642 -236110 -298283 -375655 -371806 -190053 -157153 -166308 -140407
17492a40407L5150j5605q9415N2161O9420J7814k27915j09393P6989j38798P1685
$$ -140407 -105257 -120862 -210277 -158116 -88696 -70882 -298797 -408190 -331201 -469999 -398314
17481c98314J07226O8692Q8541j20340J1383K19226J57955o7042j16219j9483
$$ -398314 -291088 -222396 -133855 -254195 -242812 -23586 134369 67327 -48892 -68375
17471f8375o1853j38471j71109J04033Q734M1529N2156M1565J41472M9737l1642
$$ -68375 -130228 -268699 -439808 -335775 -327041 -285512 -233356 -191791 -50319 -582 -32224
17460c2224M368j48497J2951R3357Q9224J570k1409L2781j40590N4842j8009n472
$$ -32224 -27856 -176353 -163402 -70045 19179 20749 -660 32121 -108469 -53627 -71636 -77108
17448g7108R4078o5851j91050p310Q15K13879J044o4021M4507M0070O3530J65695
$$ -77108 16970 -48881 -239931 -247241 -246426 -32547 -31503 -95524 -51017 -10947 52583 218278
17436B18278k2185l19180O2866j9783j44107J6220N3805J9081J76185n7747L0052
$$ 218278 196093 -123087 -60221 -80004 -224111 -207891 -154086 -135005 41180 -16567 13485
17425A3485Q1011j50517j07913j22997o2729R9741J96017M2773K1006j08542j24898
$$ 13485 94496 -56021 -163934 -286931 -349660 -249919 -53902 -11129 9877 -98665 -223563
17414b23563N7883p5555k6136P1533m4039o5410j818R8705N3442r5091j52396
$$ -223563 -165680 -241235 -267371 -195838 -239877 -305287 -307105 -208400 -154958 -250049 -402445
17403d02445J67213K39956P7652j52209m0242L1898J10829o3112k03001L6839
$$ -402445 -235232 4724 82376 -69833 -110075 -78177 32652 -30460 -233461 -196622
17393a96622L3236J2349P7692M8620p4418O5357n5061N139M5024j46922n1447
$$ -196622 -163386 -151037 -73345 -24725 -99143 -33786 -88847 -83708 -38684 -185606 -237053
17382b37053k9070M7789N6250r3473m3205M7598j3512o1774Q6664Q488J03184
$$ -237053 -266123 -218334 -162084 -255557 -298762 -251164 -264676 -326450 -239786 -231298 -128114
17371a28114N794j10404Q2274R275k0687j76717j04650M6720O2193O4988l5003
$$ -128114 -122320 -232724 -150450 -141175 -161862 -338579 -443229 -396509 -334316 -269328 -304331
17360c04331J38919J03033M721J5490N0300l0182p1474Q1148j02088Q6187J70844
$$ -304331 -165412 -62379 -57658 -42168 8132 -22050 -93524 -12376 -114464 -28277 142567
17349A42567L1705j38777Q7050P5060j71326n0814Q6252K1075r9902K1198j6657
$$ 142567 174272 35495 122545 197605 26279 -24535 61717 82792 -17110 4088 -12569
17338a2569M2748j93577M9958J17691j44434m3398J43699k1579j19619J38577
$$ -12569 30179 -163398 -113440 4251 -140183 -183581 -39882 -61461 -181080 -42503
17328d2503J13819o1387j54650K6189J0321l2039j19777K6488R4913K8945L4178
$$ -42503 71316 9929 -144721 -118532 -108211 -140250 -260027 -233539 -138626 -109681 -75503
17317g5503L7134l0331l8597n7069k7286J07967l4158J5020P5574K6953m7210
$$ -75503 -38369 -68700 -107297 -164366 -191652 -83685 -117843 -102823 -27249 -296 -47506
17306d7506k7833p4528J09576J05303j032q9884N7413J60624l4329j86600m6503
$$ -47506 -75339 -149867 -40291 65012 63980 -25904 31509 192133 157804 -28796 -75299
17295g5299m7825R5753q319k08540J2559J20208k0736j659m8598J5774P1859j98233
$$ -75299 -123124 -27371 -35690 -244230 -231671 -111463 -132199 -133858 -182456 -166682 -94823 -293056
17283b93056k43713m6763R0173J62969R7265K6350J36550J65873l2435r3218j34007
$$ -293056 -536769 -583532 -493359 -330390 -233125 -206775 -70225 95648 63213 -30005 -164012
17272a64012l8527j5667j46456J51261L5021K759J23612L0308r4302M6064O8925
$$ -164012 -202539 -218206 -364662 -213401 -178380 -175621 -52009 -21701 -116003 -69939 -1014
17261a014J36292P4578M6061k14085p0803m8934O6133o0686l9487j06275q8562
$$ -1014 135278 209856 255917 41832 -28971 -77905 -11772 -72458 -111945 -218220 -306782
17250c06782J135K4177k755N41N9562J48118Q6850o6215O5750k5528o9607L2515
$$ -306782 -305647 -281470 -284225 -283684 -224122 -76004 10846 -55369 10381 -15147 -84754 -52239
17238e2239o4616j11653m8892J505j4148j59587q8221O5685J40803J67683j17150
$$ -52239 -116855 -228508 -277400 -275895 -290043 -449630 -537851 -472166 -331363 -163680 -280830
17227b80830j32169p8193K10632J7146M6825O2947k6402K419J04826J64775O0606
$$ -280830 -412999 -491192 -280560 -263414 -216589 -153642 -180044 -177625 -72799 91976 152582
17216A52582k9107j87200n9400J21542m2598k6645n2544j6415q3666o0112M7769
$$ 152582 123475 -63725 -123125 -1583 -44181 -70826 -123370 -139785 -223451 -283563 -235794
17205b35794K5284j06263q1237K12619N1460J9639r6031l6697M3167K7309Q148
$$ -235794 -210510 -316773 -398010 -185391 -133931 -114292 -210323 -247020 -203853 -176544 -168396
17194a68396n7343n4993P9690J98396J32057K8857j77026j91844K55697P8276
$$ -168396 -225739 -280732 -201042 -2646 129411 158268 -18758 -210602 45095 123371
17184A23371j64482M3003k0492l7903J24332J43289N0034j04890l32509O7560
$$ 123371 -41111 1892 -18600 -56503 67829 211118 261152 156262 -176247 -108687
17174a08687J21488o1933m8209J05106R7177N2777j74305p8913M3584J43861j7405
$$ -108687 12801 -49132 -97341 7765 104942 157719 -16586 -95499 -51915 91946 74541
17163G4541j70569m3360p624j9943j96585j88056R3612R3240J39541J12306r4728
$$ 74541 -96028 -139388 -147012 -166955 -363540 -551596 -457984 -364744 -225203 -112897 -207625
17152b07625K3814k8739R5851P1591r2957m1871J73990n2581o2206m548o2005
$$ -207625 -183811 -212550 -116699 -45108 -138065 -179936 -5946 -58527 -120733 -125281 -187286
17141a87286J31181l7580l665Q0928k2895O0174N5176K3071j10879k0633j12745
$$ -187286 -56105 -93685 -97350 -16422 -39317 20857 76033 99104 -11775 -32408 -145153
17130a45153j1497J22661R0167j28027m3554k630q4019r190J9091M9085N9043
$$ -145153 -156650 -33989 56178 -71849 -115403 -118033 -202052 -211242 -192151 -143066 -84023
17119h4023J3626r2283R6480L3902r5042L4307L7053L2449K15649N5519k89161
$$ -84023 -70397 -162680 -66200 -32298 -127340 -93033 -55980 -23531 192118 247637 -41524
17108d1524P8847J27709j80104q7637j6806o3813J15451r952j11998n4249k61359
$$ -41524 37323 165032 -15072 -102709 -119515 -183328 -67877 -77829 -189827 -244076 -505435
17097e05435p2300j2311J27387M1546j3254K8968R1979J63245P6617l8983j691
$$ -505435 -577735 -590046 -462659 -421113 -434367 -405399 -313420 -150175 -73558 -112541 -114232
17086a14232J50066j34528m9001P0561J26019j46306l0957j37451p8382K9309
$$ -114232 35834 -98694 -147695 -77134 48885 -97421 -128378 -265829 -344211 -314902
17076c14902j63434R7714L02171K53836J56062k01243j72677p4859P5925L5552
$$ -314902 -478336 -380622 -78451 175385 331447 130204 -42473 -117332 -41407 -5855
17066e855k5254k2827K6724m5895l634J02481k7139k1175j98460m0506J96416
$$ -5855 -31109 -53936 -27212 -73107 -76741 25740 -1399 -22574 -221034 -261540 -65124
17055f5124J5158p1606L9965O7299l8268P6454j36374p9851j995l2885k7476J55325
$$ -65124 -49966 -121572 -81607 -14308 -52576 23878 -112496 -192347 -194342 -227227 -254703 -99378
17043i9378J26290k8306q3633L0031J7196o2125l0119j66628j45577K08654R5044
$$ -99378 26912 -1394 -85027 -54996 -37800 -99925 -130044 -296672 -442249 -233595 -138551
17032a38551j665R4558n7339j37065j37390k5595M5487q1792K03809J09086p796
$$ -138551 -140216 -45658 -102997 -240062 -377452 -403047 -357560 -439352 -235543 -126457 -134253
17021a34253P6916r8510k9747k0801K1369M7032o3122j07869m6652R4930R4144
$$ -134253 -57337 -155847 -185594 -206395 -185026 -137994 -201116 -308985 -355637 -260707 -166563
17010a66563r3718l6079J48537J10577r515o4677j4552J10693m1128J24584r799
$$ -166563 -260281 -296360 -147823 -37246 -46761 -111438 -125990 -15297 -56425 68159 58360
16999E8360J05982J19123j00929p8758n5456j3973q1768q9469q3619l8617m0038
$$ 58360 164342 283465 182536 103778 48322 34349 -47419 -136888 -220507 -259124 -299162
16988b99162J99720Q3631k5654K6185J8285o4857n9873k599P3238m950q2033l5375
$$ -299162 -99442 -15811 -41465 -15280 3005 -61852 -121725 -124324 -51086 -56036 -138069 -173444
16976a73444r2710n7834j6640L6642K7976j44653j4989K50405K80253J349o4538
$$ -173444 -266154 -323988 -340628 -303986 -276010 -420663 -435652 -185247 95006 96355 31817
16965C1817q0043j83421O794R3306l9978M2842m2527l8550Q7694j5004j68224
$$ 31817 -48226 -231647 -224853 -131547 -171525 -128683 -171210 -209760 -122066 -137070 -305294
16954c05294J54868o7789n953J21085J94891R1950j11914j73846j60642j07922
$$ -305294 -150426 -218215 -224168 -103083 91808 183758 71844 -102002 -262644 -370566
16944c70566K24129J44481N0207L2779R79k31709o3427k3301M8906q7602k6623
$$ -370566 -146437 -1956 48251 81030 82009 -149700 -213127 -236428 -187522 -275124 -301747
16933c01747K73928O2474r8929o5226J48995j7101j35186j24813M8436j00639
$$ -301747 -27819 34655 -64274 -129500 19495 2394 -132792 -257605 -209169 -309808
16923c09808M0305l017O4980J60231J8069q1981J2579M1125o541m6592P2492p2947
$$ -309808 -269503 -272520 -207540 -47309 -29240 -111221 -98642 -57517 -64058 -110650 -38158 -111105
16911a11105l2316J3156k9123Q138K81838M3033o1575K2561k1504J9663n7274
$$ -111105 -143421 -130265 -159388 -151250 130588 173621 112046 134607 113103 132766 75492
16900G5492k02548r6891m9014M6480J99753P7338n9357j76928O2238o1979J1084
$$ 75492 -127056 -223947 -272961 -226481 -26728 50610 -8747 -185675 -123437 -185416 -174332
16889a74332M0732O4069j71571l7026O0147j5414M6090K43470j51005j37573j03833
$$ -174332 -133600 -69531 -241102 -278128 -217981 -233395 -187305 56165 -94840 -232413 -336246
16878c36246J16152K44438j5742j46371P494J05984l7898q3502J16288q27J6596
$$ -336246 -220094 24344 8602 -137769 -130275 -24291 -62189 -145691 -29403 -30230 -13634
16867a3634K6858p0123r5234m9744N727m5261k629J54P2598J54233o2018P682
$$ -13634 13224 -56899 -152133 -201877 -196150 -241411 -244040 -243886 -171288 -17055 -79073 -71391
16855g1391P1840Q1514j07522J40581J04580k21444j88832O4073J686r5932N010
$$ -71391 449 81963 -25559 115022 219602 -1842 -190674 -126601 -124915 -220847 -215837
16844b15837n0016n8149J54279J3336M1229o0089p0347l6707K9312J99704R2747
$$ -215837 -265853 -324002 -169723 -156387 -115158 -175247 -245594 -282301 -252989 -53285 39462
16833C9462j68203j06022J1502j7482K8078j41493K9395J06521J03943J03352
$$ 39462 -128741 -234763 -223261 -240743 -212665 -354158 -324763 -218242 -114299 -10947
16823a0947K9253J6666n5343n7776j04519p7404K8410J81802J45044j28270J2522
$$ -10947 18306 34972 -20371 -78147 -182666 -260070 -231660 -49858 95186 -33084 -20562
16812b0562j1780k47069r7353M0367L3611L8589j27587l9634N8809J6166J20041
$$ -20562 -32342 -279411 -376764 -336397 -302786 -264197 -391784 -431418 -372609 -356443 -236402
16801b36402K8565P8220R4337Q1657o5253j55497P4192J31341Q3841k3971o7875
$$ -236402 -207837 -129617 -35280 46377 -18876 -174373 -100181 31160 115001 91030 23155
16790B3155L1681M731j55242k74382m3267J82045R6618o6851J3807J02299l9594
$$ 23155 54836 59567 -95675 -370057 -413324 -231279 -134661 -201512 -187705 -85406 -125000
16779a25000R0930R4191J53479n7005j91080j00642l4138J74661k2730j09664
$$ -125000 -34070 60121 213600 156595 -34485 -135127 -169265 5396 -17334 -126998
16769a26998k0213j27800J4172n0449K08605J79037J63469m2532n0681P2968k02409
$$ -126998 -147211 -275011 -260839 -311288 -102683 76354 239823 197291 146610 219578 17169
16758A7169p7415j41140L6230k754M0310N2170n2695K5747M9942M5237K06588
$$ 17169 -60246 -201386 -165156 -167910 -127600 -75430 -128125 -102378 -52436 -7199 199389
16747A99389R6692j05245l5540j39719j00395j0961Q481M1891P8019q3300j75565
$$ 199389 296081 190836 155296 15577 -84818 -95779 -87298 -45407 32612 -50688 -226253
16736b26253k0908L2905M9477O448p4624P4622L06273j23432q7907L127j17158
$$ -226253 -247161 -214256 -164779 -158331 -232955 -158333 147940 24508 -63399 -60272 -177430
16725a77430j4999J81180j425J5838N6205M6338j18736j53871O564l3002P4813
$$ -177430 -192429 -11249 -12674 3164 59369 105707 -13029 -166900 -160336 -193338 -118525
16714a18525k9406l4233O4085m082j5191q9242o21p7811l1760J50402j23477j04270
$$ -118525 -147931 -182164 -118079 -122161 -137352 -226594 -227215 -305026 -336786 -186384 -309861 -414131
16702d14131J37895J41424n8092J7573j13780j01898O5416r9387j6096m1797N7175
$$ -414131 -276236 -134812 -192904 -175331 -289111 -391009 -325593 -424980 -441076 -482873 -425698
16691d25698K15778J99236k5624K3124l3381k05593r9269m9241J64819J56522
$$ -425698 -209920 -10684 -36308 -13184 -46565 -252158 -351427 -400668 -235849 -79327
16681g9327N2441j764K1861j1774n4935J05255N4776L6995j43399m010n288q7035
$$ -79327 -26886 -28650 -6789 -18563 -73498 31757 86533 123528 -19871 -23881 -29169 -116204
16669a16204M5381J40326L2888J3644k1195P070K3469R8782Q8286m1712j24959
$$ -116204 -70823 69503 102391 116035 94840 101910 125379 224161 312447 270735 145776
16658A45776j89215k24296k3682Q2399N1002P0945m2040n9533J5291J14900l1902
$$ 145776 -43439 -267735 -291417 -209018 -158016 -87071 -129111 -188644 -173353 -58453 -90355
16647i0355k4072Q1972n4092l988J8493n721M2272j17467J7938O8461o692J20043
$$ -90355 -114427 -32455 -86547 -90535 -72042 -77763 -35491 -152958 -135020 -66559 -73251 46792
16635D6792J74017O8839o1184j81830L2481j05527J04492p453J36783M8736j20603
$$ 46792 220809 289648 228464 46634 79115 -26412 78080 70627 207410 256146 135543
16624A35543n7764m2422m6978K7873o7038j3981J64210J17962l7400j79626j58698
$$ 135543 77779 35357 -11621 16252 -50786 -64767 99443 217405 180005 379 -158319
16613a58319r6321O7673l0378o1951Q2289n4217j13828j5040L0587J25271L563
$$ -158319 -254640 -186967 -217345 -279296 -197007 -251224 -365052 -380092 -349505 -224234 -220671
16602b20671O7735Q535j37516M6145K06275P3261K1960j0J1305o7753N7892J15319
$$ -220671 -152936 -144401 -281917 -235772 -29497 43764 65724 65714 77019 9266 67158 182477
16590A82477j50026R1371J32191m6604r1331P0093j17892j44860n7373k0038r961
$$ 182477 32451 123822 256013 209409 118078 188171 70279 -74581 -131954 -151992 -161953
16579a61953L841J41543l3122j20548O978j1263J7861j11912j10314o6398l7134
$$ -161953 -158112 -16569 -49691 -170239 -163261 -174524 -156663 -268575 -378889 -445287 -482421
16568d82421J63100K50000L9569r1678k00440r7624J80151O213r904p6514M8239
$$ -482421 -319321 -69321 -29752 -121430 -321870 -419494 -239343 -233130 -243034 -319548 -271309
16557b71309J33819k736J87769J20141m9578p8153k8518J20381j61262J4273l5508
$$ -271309 -137490 -140226 47543 167684 118106 39953 11435 131816 -29446 -15173 -50681
16546e0681j25450N1307O6687J48764J8011o3747m8691N3459R753J7280j2543
$$ -50681 -176131 -124824 -58137 90627 108638 44891 -3800 49659 59412 76692 64149
16535F4149j9239m1084k51981j8595N5303K6360J15866J28613N2433o8691j9809
$$ 64149 44910 3826 -248155 -266750 -211447 -185087 -69221 59392 111825 43134 23325
16524B3325j01916p3395j1186l8060k1811K3085J37753K73965o4992j51098j09295
$$ 23325 -78591 -151986 -163172 -201232 -223043 -199958 -62205 211760 146768 -4330 -113625
16513a13625N4452Q4045L6438q4725k01511Q4189O1634m0634j05070J2114O3856
$$ -113625 -59173 24872 61310 -23415 -224926 -140737 -79103 -119737 -224807 -212693 -148837
16502a48837n3188m7406M7332l8905j5216J10753R1010J33748o8607j00526J21925
$$ -148837 -202025 -249431 -202099 -241004 -256220 -145467 -54457 79291 10684 -89842 32083
16491C2083p295j27589m3452J74777J14873k2528o7429J0509j10105j38199q7987
$$ 32083 24788 -102801 -146253 28524 143397 120869 53440 63949 -46156 -184355 -272342
16480b72342P120J93038O0511r0046Q331M250J14047J0082j77488j03819J5422
$$ -272342 -265222 -72184 -11673 -101719 -93388 -89138 24909 34991 -142497 -246316 -230894
16469b30894J14817l4837l0681R2963J16032K6475n7321p3381M0147k4328q7994
$$ -230894 -116077 -150914 -181595 -88632 27400 53875 -3446 -76827 -36680 -61008 -149002
16458a49002j61148r6393J56057K43376M6028j35967j60473j03692N4755L00969
$$ -149002 -310150 -406543 -250486 -7110 38918 -97049 -257522 -361214 -306459 -5490
16448e490P2670P375O5136J52288k5424j49751q3954J74620J10066j85845k35722
$$ -5490 67180 74555 139691 291979 266555 116804 32850 207470 317536 131691 -104031
16437a04031j43377j13886J54340J42712J0113q9712L8031J85053r339j15308
$$ -104031 -247408 -361294 -206954 -64242 -54129 -143841 -105810 79243 69904 -45404
16427d5404N4023m2488r7852R8842J34734k1962q1646q9106k9813n2934j26099
$$ -45404 8619 -33869 -131721 -32879 101855 79893 -1753 -90859 -120672 -173606 -299705
16416b99705J47688J19250l5583p2829J36792K82700o1382j28290q1353k3089
$$ -299705 -152017 -32767 -68350 -141179 -4387 278313 216931 88641 7288 -15801
16406a5801j01105o8518N0887J35292j1807K1562o1463l0277o5291M9620J58250
$$ -15801 -116906 -185424 -134537 755 -11052 10510 -50953 -81230 -146521 -96901 61349
16395F1349k2825o1320K5985J23506q532k51988j98242N676K5018J49453N5425
$$ 61349 38524 -22796 3189 126695 118163 -133825 -332067 -326391 -301373 -151920 -96495
16384i6495N972j22483k1686R8087L2396N2551Q455j926m5850M537Q13J0507Q7051
$$ -96495 -90523 -213006 -234692 -136605 -104209 -51658 -43203 -45129 -90979 -86442 -85629 -75122 11929
16371A1929O4561j61202j31354P6804Q2237m9028n8889j26532J67267O6289j5071
$$ 11929 76490 -84712 -216066 -139262 -57025 -106053 -164942 -291474 -124207 -57918 -72989
16360g2989l4557n8851J7043L2010J37738L19833J15727j73239r8165j52252j27476
$$ -72989 -107546 -166397 -149354 -117344 20394 340227 455954 282715 184550 32298 -95178
16349i5178o4521j1184q2996K0246j46005J12089k1196k377J19190J67912p2827
$$ -95178 -159699 -170883 -253879 -233633 -379638 -267549 -288745 -291122 -171932 -4020 -76847
16338g6847m2090J74369J53293o858N2249j4459O5960j16663j61777m7106j90840
$$ -76847 -118937 55432 208725 201867 254116 239657 305617 188954 27177 -19929 -210769
16327b10769j0757J04052M0898o621J56294J3020o3078p3917m4309J5644l0977
$$ -210769 -221526 -117474 -76576 -83197 73097 86117 23039 -50878 -95187 -79543 -110520
16316a10520m2999M5759N6498P2353J39329J27956l2632j06032l3710l4537j10879
$$ -110520 -153519 -107760 -51262 21091 160420 288376 255744 149712 116002 81465 -29414
16305b9414M1844l1230j25205o0037q7699o0907j12881J41984K94257J06568k0437
$$ -29414 12430 -18800 -144005 -204042 -291741 -352648 -465529 -323545 -29288 77280 56843
16294E6843r5711k1252k1J02511n9040j28729N3721n3779j6549L2539K737N7655
$$ 56843 -38868 -60120 -60141 42370 -16670 -145399 -91678 -145457 -162006 -129467 -126730 -69075
16282f9075j33757P468K17867K1625r1153K1884M5188m8850j56597l3904J07338
$$ -69075 -202832 -195364 22503 44128 -47025 -25141 20047 -28803 -185400 -219304 -111966
16271a11966j58032M4501J55867J52870m2879j01178O6078N5599J05188l594K8862
$$ -111966 -269998 -225497 -69630 83240 40361 -60817 5261 60860 166048 162454 191316
16260A91316p5735k17436n3483N2402L2546J34233k1491j07050Q5547Q2378r3414
$$ 191316 115581 -101855 -155338 -102936 -70390 63843 42352 -64698 20849 103227 9813
16249I813K12304O5685j87942k52403J10042j08055l8062j72032N1952J36355
$$ 9813 222117 287802 99860 -152543 -42501 -150556 -188618 -360650 -308698 -172343
16239a72343O0315N589J11349L754j15588p5860q4379R669J56671m2755l129L9476
$$ -172343 -112028 -106439 4910 8664 -106924 -182784 -267163 -257494 -100823 -143578 -146707 -107231
16227a07231m5633J1347k499J58146J9189j61422j7230J81108p3922j29344j30472
$$ -107231 -152864 -141517 -144016 14130 33319 -128103 -145333 35775 -38147 -167491 -297963
16216b97963o811N0881j26707R0167N1883j4123J21932M0911L7982o6276L6992
$$ -297963 -304774 -253893 -380600 -290433 -238550 -252673 -130741 -89830 -51848 -118124 -81132
16205h1132J29734P1165k7947J17725o7402m6672k8756m0276k0871l0125o6140
$$ -81132 48602 119767 91820 209545 142143 95471 66715 26439 5568 -24557 -90697
16194i0697K0506k4430l7864m3273J1325M0264l07M5254j13741m6991J85299N439
$$ -90697 -70191 -94621 -132485 -175758 -164433 -124169 -124476 -79222 -192963 -239954 -54655 -49216
16182d9216j37376J03574P0489J59014j0049n2566o7862L4108K5536k8252j09338
$$ -49216 -186592 -83018 -12529 146485 136436 83870 16008 50116 75652 47400 -61938
16171f1938l0258k3812l7449N3325P8226R0519k6085K6780J008L1961K4067J7613
$$ -61938 -92196 -116008 -153457 -100132 -21906 68613 42528 69308 70316 102277 126344 143957
16159A43957j92071l42110k967L09565J86327r9821k08530m9618J72183R1899
$$ 143957 -48114 -390224 -393191 -83626 102701 2880 -205650 -255268 -83085 8814
16149H814n8240j00609l0650N6655j04011J19551K01180k3052j10313K8581O3633
$$ 8814 -49426 -150035 -180685 -124030 -228041 -108490 92690 69638 -40675 -12094 51539
16138E1539l11054k59250J29519J94736J05535Q5638Q0173P3812l2620l9089r409
$$ 51539 -259515 -518765 -389246 -194510 -88975 -3337 76836 150648 118028 78939 69530
16127F9530J4092J03917j26046k71385p9772J1851l0005J19342r105N3832J42439
$$ 69530 83622 187539 61493 -209892 -289664 -277813 -307818 -188476 -197581 -143749 -1310
16116a310J35154n2687q9720L2064J8514q3679M7918j03353j74832J06018J1159
$$ -1310 133844 81157 -8563 23501 42015 -41664 6254 -97099 -271931 -165913 -154754
16105a54754j39350n6944J64732L6705J176K3936J7251p7251j13768J5082L5561
$$ -154754 -294104 -351048 -186316 -149611 -148435 -124499 -107248 -184499 -298267 -283185 -247624
16094b47624O3422J19907j20540J2926J35510Q4818P3684m0152P973q185j16479
$$ -247624 -184202 -64295 -184835 -171909 -36399 48419 122103 81951 89924 81739 -34740
16083c4740j1907J46712J99944q9607j82721j53239j361k2203J5499Q3187R2870
$$ -34740 -46647 100065 300009 210402 27681 -125558 -126919 -149122 -133623 -50436 42434
16072D2434J01826j08541q9000j78817P4212j7454O7499p5620k2193O193J0472
$$ 42434 144260 35719 -53281 -232098 -157886 -175340 -107841 -183461 -205654 -199461 -188989
16061a88989Q122K3972P0558J10657p8181j73770L4644K6124n1066J09303J7279
$$ -188989 -180867 -156895 -86337 24320 -53861 -227631 -192987 -166863 -217929 -108626 -91347
16050i1347j03356l0203N5474j37931J21811J29741n7705J62238L8133n1716r2589
$$ -91347 -194703 -224906 -169432 -307363 -185552 -55811 -113516 48722 86855 35139 -57450
16039e7450J8324N38J33952Q3229J8135O0517J233p7961k25913j4815J14315k8372
$$ -57450 -39126 -38588 95364 178593 196728 257245 258478 180517 -45396 -60211 54104 25732
16027B5732k20212q8350J82477J65487n3100j44506k7687Q4423k4836L925l2135
$$ 25732 -194480 -282830 -100353 65134 12034 -132472 -160159 -75736 -100572 -96647 -128782
16016a28782p560r2007Q3022Q2729n4778q2078J08603P5636J40043r7880j48988
$$ -128782 -136342 -228349 -145327 -62598 -117376 -199454 -90851 -15215 124828 26948 -122040
16005a22040J64843L7265M0234O2140r1813j20513J3648q526K8674N4355P7184
$$ -122040 42803 80068 120302 182442 90629 -29884 -16236 -24762 3912 58267 135451
15994A35451L8547K2347o1365q4561m5645M1072m7506j18565j8187J22604J99452
$$ 135451 173998 196345 134980 50419 4774 45846 -1660 -120225 -138412 -15808 183644
15983A83644j04945k13370n6487N1818L9530R2647m9925n1610j6688J77432R3190
$$ 183644 78699 -134671 -191158 -139340 -99810 -7163 -57088 -108698 -125386 52046 145236
15972A45236r6973J1414M2874j37349j11737L0275M5209k7609p1310K25391J39872
$$ 145236 48263 59677 102551 -34798 -146535 -116260 -71051 -98660 -169970 55421 195293
15961A95293Q2539k8842J1190r3594q8133l3790n4900o6670j28146n621J30156
$$ 195293 277832 248990 260180 166586 78453 44663 -10237 -76907 -205053 -210674 -80518
15950h0518O9516r9134j7898m0099N6994K2149L4171l837k4566L6830j15657M913
$$ -80518 -11002 -110136 -128034 -168133 -111139 -88990 -54819 -58656 -83222 -46392 -162049 -157136
15938a57136K54794J40070j07457j41922L1984O9163n9087P1470J25840J22830
$$ -157136 97658 237728 130271 -11651 20333 89496 30409 101879 227719 350549
15928C50549j38426K1434K2934k1947k09858j30090R478J17326O7556K2496l0032
$$ 350549 212123 233557 256491 234544 24686 -105404 -95926 21400 88956 111452 81420
15917H1420L2017j95939J40625p6945o3941j8981P2510O7870L9136J1550j12719
$$ 81420 113437 -82502 58123 -18822 -82763 -101744 -29234 38636 77772 89322 -23397
15906b3397j5216n6293L1000J45099J99006Q5626q3599j28128p0263k41990K8207
$$ -23397 -38613 -94906 -63906 81193 280199 365825 282226 154098 83835 -158155 -129948
15895a29948R3420J93111k9139K3846p0027m1170O1398O1106p4683l6717M9683
$$ -129948 -36528 156583 127444 151290 81263 40093 101491 162597 87914 51197 100880
15884A00880K765q6667K2545q77L1775o428l9877j647K2932q5742j01997m7975
$$ 100880 103645 16978 39523 38646 70421 63993 24116 22469 45401 -40341 -142338 -190313
15872a90313K0062J3226J06126n1767j45119P482L6338J208J02256q1706K08728
$$ -190313 -170251 -157025 -50899 -102666 -247785 -240303 -203965 -202757 -100501 -182207 26521
15861B6521M5768m9607r1854P2171R380j92211j05561L7035L5496J66061L5560
$$ 26521 72289 22682 -69172 2999 12379 -179832 -285393 -248358 -212862 -46801 -11241
15850a1241q511j09161p7562j3929J8249k949l9124R7664M5172K08385j57384
$$ -11241 -19752 -128913 -206475 -220404 -202155 -205104 -244228 -146564 -101392 106993 -50391
15839e0391L1294J16614j96546P7479Q3167j1291o4862n7526M8036N9066j00363
$$ -50391 -19097 97517 -99029 -21550 61617 50326 -14536 -72062 -24026 35040 -65323
15828f5323m0881J68577l4921n8813j1548j29103N1955N7167P2565J00747Q1629
$$ -65323 -106204 62373 27452 -31361 -42909 -172012 -120057 -62890 9675 110422 192051
15817A92051j2698J20789p1182j50056m8494k07131j58978P6639P2074o4796J55258
$$ 192051 179353 300142 228960 78904 30410 -176721 -335699 -259060 -186986 -251782 -96524
15806i6524O1203J5286O3244k78Q2371J461N6038l6173Q3689J72945J09142k4774
$$ -96524 -35321 -20035 43209 42931 125302 126763 182801 146628 230317 403262 512404 487630
15794D87630m8941K05370K42726K87311K33379J26806K74026J66558J13514R048
$$ 487630 438689 644059 886785 1174096 1407475 1534281 1808307 1974865 2088379 2097427
15784B097427J43168O9353N6266m3696j58803j25535k90950l15266k35790j81523
$$ 2097427 2240595 2309948 2366214 2322518 2163715 2038180 1747230 1431964 1196174 1014651
15774A014651j45309j16909N1690j01674j51967j50957q7948j21798J03705Q6362
$$ 1014651 869342 752433 804123 702449 550482 399525 311577 189779 293484 379846
15764C79846r492J5946k25506j52840n3041j51060L0734P3368R8519p4728J45799
$$ 379846 370354 386300 160794 7954 -45087 -196147 -165413 -92045 6474 -68254 77545
15753G7545K82224p0867p225m0623o2342n8499K9255m102k4776n3061l7857j57750
$$ 77545 359769 288902 281677 241054 178712 120213 149468 145366 120590 67529 29672 -128078
15741a28078O1417J16604L8575P2051O0506m1342Q0094j64464j29124k4776J33764
$$ -128078 -66661 49943 88518 160569 221075 179733 259827 95363 -33761 -58537 75227
15730G5227l0222N8029o8616N0656P7614k8853l9011q367l96M2814r2973j18540
$$ 75227 45005 103034 34418 85074 162688 133835 94824 86457 86061 128875 35902 -82638
15718h2638J36634j45193j98444K11604J01230p7868j30239Q9648P8209m3622
$$ -82638 53996 -91197 -289641 -78037 23193 -54675 -184914 -95266 -17057 -60679
15708f0679J07362J58832R8618o5600j15171j56986j5386M1268j2755J4232m4645
$$ -60679 46683 205515 304133 238533 123362 -33624 -49010 -7742 -20497 -6265 -50910
15697e0910j2626J29004J77243p0268m2696K5723N6175k8065K6265R5299k3451
$$ -50910 -63536 65468 242711 172443 129747 155470 211645 183580 209845 305144 281693
15686B81693q5528q4029j27486j26157L502J02311J43595j24095j6997O1713j03332
$$ 281693 196165 112136 -15350 -141507 -138005 -35694 107901 -16194 -33191 28522 -74810
15675g4810p1812l2582M5372R1565j0773j1843N4987p2780q7423p8579j1693J76200
$$ -74810 -146622 -179204 -133832 -42267 -53040 -64883 -9896 -82676 -170099 -248678 -260371 -84171
15663h4171N4751n2065M4598k05160J7208K765K7617L8930O0229J39178J31871
$$ -84171 -29420 -81485 -36887 -242047 -224839 -222074 -194457 -155527 -95298 43880 175751
15652A75751R1298M5017m4174j33435j35574m5648J66209P0766j08231j82672
$$ 175751 267049 312066 267892 134457 -1117 -46765 119444 190210 81979 -100693
15642a00693O4064J94558k4563j53621O044Q7550J48945J31831M0568k33220k36268
$$ -100693 -36629 157929 133366 -20255 -14211 73339 222284 354115 394683 161463 -74805
15631g4805j78968R9336j3230N2412o3742L4002K02656J07272L452j1650N4135
$$ -74805 -253773 -154437 -167667 -115255 -178997 -144995 57661 164933 168385 156735 210870
15620B10870O107p874j20469k6672R9873J66040n3520p6771j67967L5239k1157
$$ 210870 216977 209103 88634 61962 161835 327875 274355 197584 29617 64856 43699
15609D3699m4937q7548j73768J0156J22829P5760L8192P8638N0989k824O7193
$$ 43699 -1238 -88786 -262554 -252398 -129569 -53809 -15617 63021 114010 111186 178379
15598A78379M7690L26098K90422j05070k97353o3030M3731K54662O3551k61871
$$ 178379 226069 552167 842589 737519 440166 377136 420867 675529 739080 477209
15588D77209m01131n4164J00394j3729j44379R6844P2988J34820Q8342Q7487j21509
$$ 477209 76078 21914 122308 108579 -35800 61044 134032 268852 357194 444681 323172
15577C23172l45247j1813K5272R9820P2333L3548p4652j3512M8593j25166J84101
$$ 323172 -22075 -33888 -8616 91204 163537 197085 122433 108921 157514 32348 216449
15566B16449P4305j6734M5641j44476J77495J04793j73492J8430O7991Q6071r7704
$$ 216449 290754 274020 319661 175185 352680 457473 283981 302411 370402 456473 358769
15555C58769j40273m5903k5071j88945j75177K3474J49263K0207r2181o9614P8338
$$ 358769 218496 172593 147522 -41423 -216600 -193126 -43863 -23656 -115837 -185451 -107113
15544a07113l9428Q062J07526k7402J25898o2834q625k921R348J53588N327p4784
$$ -107113 -146541 -138479 -30953 -58355 67543 4709 -3916 -6837 2511 156099 161426 86642
15532H6642k11766j2052J46188J07276J57327K1740J22744J04385J95441J59869
$$ 86642 -125124 -137176 9012 116288 273615 295355 418099 522484 717925 877794
15522H77794Q382p4909R6444O2795j65189o5794j11560j3270K8500k0286J12203
$$ 877794 886176 811267 907711 970506 805317 739523 627963 614693 643193 622907 735110
15511G35110k0800N56j74003k38357j95208K28317J47633q770M1692J03681J75512
$$ 735110 714310 714866 540863 302506 107298 335615 483248 474478 516170 619851 795363
15500G95363j08638l2231L0735r4242n0959N5910l135j80352O034N2436P5524
$$ 795363 686725 654494 685229 590987 540028 595938 592803 412451 418485 470921 546445
15489E46445r7346J28857r826K0648j31958M4911R395J37608m3713j47223n3784
$$ 546445 449099 577956 568130 588778 456820 501731 511126 648734 605021 457798 404014
15478D04014k4026O4116J03932R7669o5459r1305p5449K43515N3685Q677j09175
$$ 404014 379988 444104 548036 645705 580246 488941 413492 657007 710692 719369 610194
15467F10194j21361J17684J13313L8317K9285J1229k07693k4787j03805K4580
$$ 610194 488833 606517 719830 758147 787432 798661 590968 566181 462376 486956
15457D86956l4562J48704J2286N8772r232k6817Q3310J52976j36763j404J77009
$$ 486956 452394 601098 613384 672156 662924 636107 719417 872393 735630 734226 911235
15446I11235J226Q8137P4261q9088P393l8664J34233P9560j17372l9276m7336
$$ 911235 912461 1000598 1074859 985771 993164 954500 1088733 1168293 1050921 1011645 964309
15435I64309j22206P3276J14650J56957J83227r4085j48603j2166Q2762j22616
$$ 964309 842103 915379 1030029 1186986 1370213 1276128 1127525 1115359 1198121 1075505
15425A075505n478K07541J34307P1896m7082j51565J18810Q4117j5597j1014J13842
$$ 1075505 1070027 1277568 1411875 1483771 1436689 1285124 1403934 1488051 1472454 1461440 1575282
15414A575282l8639p1274J53148J50148P0187p4471j79338J22275K72226Q1724
$$ 1575282 1536643 1465369 1618517 1768665 1838852 1764381 1585043 1707318 1979544 2061268
15404B061268j05516n162O5621P9697K38100K36661J62589R9238J13156m2459
$$ 2061268 1955752 1950590 2016211 2095908 2334008 2570669 2733258 2832496 2945652 2903193
15394B903193j50095j52930K4200Q8973L9383J12323K03606J20747L1473J45779
$$ 2903193 2753098 2600168 2624368 2713341 2752724 2865047 3068653 3189400 3220873 3366652
15384C366652J12469p4802J81897L30176K79496J25978K13884J70458K67809M08493
$$ 3366652 3479121 3404319 3586216 3916392 4195888 4321866 4535750 4706208 4974017 5382510
15374E382510M18164K86741M37075L23943L77116M75519O98277O14615O18220
$$ 5382510 5800674 6087415 6524490 6848433 7225549 7701068 8399345 9013960 9632180
15365I632180O94787Q82940J189701J221306J470062J718771J866161K255210
$$ 9632180 10326967 11209907 12399608 13620914 15090976 16809747 18675908 20931118
15357B0931118K870582L224424L671270M063519M616393N494022O724882Q322230
$$ 20931118 23801700 27026124 30697394 34760913 39377306 44871328 51596210 59918440
15349E9918440J0455892J3425305J7951158K3760545L0715860L8656486M6528043
$$ 59918440 70374332 83799637 101750795 125511340 156227200 194883686 241411729
15342B41411729N3224488N7189685N6729023N0897608L9226032K2534888L225059
$$ 241411729 294636217 351825902 408554925 459452533 498678565 521213453 524438512
15335E24438512j6349470l4135337m7904360n5998563n8660464n6208445m9994358
$$ 524438512 508089042 473953705 426049345 370050782 311390318 255181873 205187515
15328B05187515m1768332l3431767k5566554j9169639j4402816j0834273q308416
$$ 205187515 163419183 129987416 104420862 85251223 70848407 60014134 51705718
15321E1705718o524178n595851m758178m088679l555213l285874k856596k452369
$$ 51705718 45181540 39585689 34827511 30738832 27183619 23897745 21041149 18588780
15313A8588780j982762j579579j293286j149955j104835j018122q00298o80061
$$ 18588780 16606018 15026439 13733153 12583198 11478363 10460241 9659943 8979882
15305H979882p25568m68110o20316n30072m89590l55111k20938l26508m30874
$$ 8979882 8254314 7786204 7165888 6635816 6146226 5791115 5570177 5243669 4812795
15296D812795l15444j62883k18957k88396k40945q9311r8498l58340k91479l2301
$$ 4812795 4497351 4334468 4115511 3827115 3586170 3496859 3398361 3040021 2748542 2716241
15286B716241J09968j0472K7850j90242j03903j00931j19443q2597j89089r7440
$$ 2716241 2826209 2815737 2843587 2653345 2549442 2448511 2329068 2246471 2057382 1959942
15276A959942j84074m3948L9796P5469k5932j51987J3555j55923n7023P1291o5905
$$ 1959942 1775868 1731920 1771716 1847185 1821253 1669266 1682821 1526898 1469875 1541166 1475261
15265A475261l9810j15241o8505j71450j46975J9200L8010O7884j5674j07531
$$ 1475261 1435451 1320210 1251705 1080255 933280 952480 990490 1058374 1042700 935169
15255I35169N3335m7903j27088l4274j68230L8235J51146l2073L0154j29358q8546
$$ 935169 988504 940601 813513 779239 611009 649244 800390 768317 798471 669113 580567
15244E80567J06037J3793k083j59488J15881J42516j13451m4978n9403o7677J18167
$$ 580567 686604 700397 698314 538826 654707 797223 683772 638794 579391 511714 629881
15233F29881r9896j09496K5048R3544R297o6084n3836K3352J18278j20752l2677
$$ 629881 529985 420489 445537 539081 548378 482294 428458 451810 570088 449336 416659
15222D16659R4018q5330j6985J52078K17107j26085r0251n1140r0177l2170K16490
$$ 416659 510677 425347 408362 560440 777547 651462 561211 510071 419894 387724 604214
15211F04214Q8741o82J3752J1478m5026r0736j19687j73811j87413K7954J10950
$$ 604214 692955 692273 706025 717503 672477 581741 462054 288243 100830 128784 239734
15200B39734j1466K5618N7084o2510j57010j80089J03544M0742L9785J68043J04301
$$ 239734 228268 253886 310970 248460 91450 -88639 14905 55647 95432 263475 367776
15189C67776k02546r6571J12235L3236j66493P880J7942n0480j79444n2404O3538
$$ 367776 165230 68659 180894 214130 47637 55517 73459 22979 -156465 -208869 -145331
15178a45331j02088j76502P2255K47714k3346J27091P447J2986l7772k4549J42454
$$ -145331 -247419 -423921 -351666 -103952 -127298 -207 7240 20226 -17546 -42095 100359
15167A00359q4963q821l8351j6955M9951l5797J7183J31098o448l7527j23264
$$ 100359 15396 6575 -31776 -48731 1220 -34577 -17394 113704 107256 69729 -53535
15156e3535j8485J0399J53732j1573L9267q9224j92356j8376o0004N6708J03258
$$ -53535 -72020 -61621 92111 80538 119805 30581 -161775 -180151 -240155 -183447 -80189
15145h0189J9049K03853J52554K8811n5109M4736J15500J22892q243j1682K16098
$$ -80189 -61140 142713 295267 324078 268969 313705 429205 552097 543854 532172 748270
15134G48270J28136j72900j70563J42666J71980J72118o1680k13203J7702J18009
$$ 748270 876406 703506 532943 675609 847589 1019707 958027 744824 762526 880535
15124H80535K46705K82179J52382M15124M94077M87895L57242K62332L29843K4302
$$ 880535 1127240 1409419 1561801 1976925 2471002 2958897 3316139 3578471 3908314 3932616
15114C932616j37151k38943k27673l38263m65195m72280l63144j44632l92763
$$ 3932616 3795465 3556522 3328849 2990586 2525391 2053111 1689967 1545335 1152572
15105A152572k11903j12670k08672j67798j43704o2105J54639Q7143J63259m8056
$$ 1152572 940669 827999 619327 451529 307825 245720 400359 487502 650761 602705
15095F02705j36169m4667j03774j7885J25366O215N5090j6731j34345o7047P8698
$$ 602705 466536 421869 318095 300210 425576 431791 486881 470150 335805 268758 347456
15084C47456M8740p9062m2369L055l2933J7663L8861Q0277J1542k73728o0697
$$ 347456 396196 317134 274765 277820 244887 262550 301411 381688 393230 119502 58805
15073E8805j09871J65392J51383Q9353k3293j13271J6323j34928J2822j12489
$$ 58805 -51066 114326 265709 355062 331769 218498 234821 99893 112715 226
15063B26q8087N1206J76915O6157j53721L5523r2052L7123J72216k6468m5205
$$ 226 -87861 -36655 140260 206417 52696 88219 -3833 33290 205506 179038 133833
15052A33833k5884n2217K6374J47407m6634J8429m5607j21407q6532k2149n6599
$$ 133833 107949 55732 82106 229513 182879 201308 155701 34294 -52238 -74387 -130986
15041a30986J1637J15780R6136k8033J49120J81413o5907k25850o2678K3170M7690
$$ -130986 -119349 -3569 92567 64534 213654 395067 329160 103310 40632 63802 111492
15030A11492N9974J1090r3059k5164M2125q5865K9947j05795l9909M7444J11870
$$ 111492 171466 182556 89497 64333 106458 20593 50540 -55255 -95164 -47720 64150
15019F4150K5842M2177j11527p9353K1478M4831o3668K7128R9748J92319R0773
$$ 64150 89992 132169 20642 -58711 -37233 7598 -56070 -28942 70806 263125 353898
15008C53898p754j13309j11268P5179l1352M6663j69617j17286O1759J30649J8311
$$ 353898 346144 232835 121567 196746 165394 212057 42440 -74846 -13087 117562 135873
14997A35873m9155n7362r3308J02309O2275j72978j41833k8757J36073n3125j3572
$$ 135873 86718 29356 -63952 38357 100632 -72346 -214179 -242936 -106863 -159988 -173560
14986a73560Q3624R2503J56840J7214m7068n131Q9475p8903j67935o0979M2645
$$ -173560 -89936 2567 159407 176621 129553 124422 213897 134994 -32941 -93920 -51275
14975e1275O672P2124j19752n7965J4912N5448R6334l0371M4186Q5921p968k7538
$$ -51275 -44603 27521 -92231 -150196 -135284 -79836 16498 -13873 30313 116234 108266 80728
14963H0728N514j09862J9079M8762o4307J19958q2579j17422n7412j55920J1629
$$ 80728 86242 -23620 -4541 44221 -20086 99872 17293 -100129 -157541 -313461 -301832
14952c01832L8072N4295M2351K11408P0826q9787q6583Q1606J17290J39948j54982
$$ -301832 -263760 -209465 -167114 44294 115120 25333 -61250 20356 137646 277594 122612
14941A22612p1704M9926P4308K010N6444J05830Q900r9567J8905j50635J4425
$$ 122612 50908 100834 175142 177152 233596 339426 348326 248759 267664 117029 131454
14930A31454J94622Q2983k10930m11564k15705K40618J61996K20013q4519o371
$$ 131454 326076 409059 198129 -213435 -429140 -188522 -26526 193487 108968 102597
14920A02597O2185Q445j4539l6442K7999O3601L5838m5043n6241m3256k2178J68208
$$ 102597 164782 173227 158688 122246 150245 213846 249684 204641 148400 105144 82966 251174
14908B51174O8115r411L4810q167J51268J89610p4076k31687r23J89241n4916
$$ 251174 319289 309878 344688 336521 487789 677399 603323 371636 370713 559954 505038
14897E05038L0148j756P8823o1006N9137K22946L36401L63732J46785K30382J00521
$$ 505038 535186 533430 612253 551247 610384 833330 1169731 1533463 1680248 1910630 2011151
14886B011151J62558K52507Q8661M0289j73346j8551j98361l40476k67507j76135
$$ 2011151 2173709 2426216 2514877 2555166 2381820 2363269 2164908 1824432 1556925 1380790
14876A380790j64652k22246j95536k83707j24129r0447j65215l6205m5413l4995
$$ 1380790 1216138 993892 798356 514649 390520 300073 134858 98653 53240 18245
14866A8245M0734m8937R8354Q6865O3022o4889q0453k2064Q1802j30827M9672
$$ 18245 58979 10042 108396 195261 258283 193394 112941 90877 172679 41852 91524
14855I1524l7570K21251M6695J8228J43945j41561j14592j52825l8002L63l616
$$ 91524 53954 275205 321900 340128 484073 342512 227920 75095 37093 37456 33840
14844C3840J56045N4327j08622q1077p0318M5498j1741K16J01155n6971p000O093
$$ 33840 189885 244212 135590 54513 -15805 29693 17952 18168 119323 62352 55352 61445
14832F1445m2182l9542J88078K5054O6732r8209j87163L4882Q0232p0218k04531
$$ 61445 19263 -20279 167799 192853 259585 161376 -25787 9095 89327 19109 -185422
14821a85422p2295J8244M3173P04p6940J20344N8103j59385k4722R7183j11702
$$ -185422 -257717 -239473 -196300 -195596 -272536 -152192 -94089 -253474 -278196 -181013 -292715
14810b92715N6057J61175n7688J01896j89578J14632J24727k1139O73M2954k2
$$ -292715 -236658 -75483 -133171 -31275 -220853 -106221 18506 -2633 -1960 40994 40972
14799D0972j12905M1494j2546j13469O2626J18822o7435j8616j8103m5182p0606
$$ 40972 -71933 -30439 -42985 -156454 -93828 24994 -42441 -61057 -79160 -124342 -194948
14788a94948R0320J86388P2976j22052r2017n615J63356J40543o7796j685l12494
$$ -194948 -104628 81760 154736 32684 -59333 -64948 98408 238951 171155 169470 -143024
14777a43024j32281J8439R1556J37014R2638J09753P3762l4666m0569M3928j42340
$$ -143024 -275305 -256866 -165310 -28296 64342 174095 247857 213191 172622 216550 74210
14766G4210j77390j26852J92508K22970J5418o1245j05126k4848J43601N1723
$$ 74210 -103180 -230032 -37524 185446 200864 139619 34493 9645 153246 204969
14756B04969k6337l2580j64808j13451j05593J5615J45898J8521J29584M3862
$$ 204969 178632 146052 -18756 -132207 -237800 -222185 -76287 -57766 71818 115680
14746A15680o1960K7654j4218N3612J31212k1671q4170j00087q529J02036L7290
$$ 115680 53720 81374 67156 120768 251980 230309 146139 46052 37523 139559 176849
14735A76849l4975r6390o5008K2379j06209p1346j29964k738Q5837j4191l1885
$$ 176849 141874 45484 -19524 2855 -103354 -174700 -304664 -307402 -221565 -235756 -267641
14724b67641P1227J67639J06403j15262p9589M1495q872j05745j05362P2326O4660
$$ -267641 -196414 -28775 77628 -37634 -117223 -75728 -84600 -190345 -295707 -223381 -158721
14713a58721J07383J78970q1185n6846m5546J53766J73731O065j05848n9345j17470
$$ -158721 -51338 127632 46447 -10399 -55945 97821 271552 277617 171769 112424 -5046
14702e046M1349K3335R9112k4721j69665r3823j47994M1558J20334J22350J28199
$$ -5046 36303 59638 158750 134029 -35636 -129459 -277453 -235895 -115561 6789 134988
14691A34988j27110j42118m5645N5506L2539Q0335Q2883q2355o456q4352k00279
$$ 134988 7878 -134240 -179885 -124379 -91840 -11505 71378 -10977 -17433 -101785 -302064
14680c02064O1235M6620J27326J88818k2558j31159n5161q9612j7923K25700J03335
$$ -302064 -240829 -194209 -66883 121935 99377 -31782 -86943 -176555 -194478 31222 134557
14669A34557K0615m6902r0766P0524J45446n8833q0528k9082q4900q3526n3388
$$ 134557 155172 108270 17504 88028 233474 174641 94113 65031 -19869 -103395 -156783
14658a56783m9174L3222R4271n9805j10294J15671k5726l676O031Q7828q563j9336
$$ -156783 -205957 -172735 -78464 -138269 -248563 -132892 -158618 -162294 -156263 -68435 -76998 -96334
14646i6334k07869K21198J55330j69063m9148J07961J18022k1072j08110p3353
$$ -96334 -304203 -83005 72325 -96738 -145886 -37925 80097 59025 -49085 -122438
14636a22438O1183m4193p3421k4396Q4138M2528q0372L5322n276Q4296K02564
$$ -122438 -61255 -105448 -178869 -203265 -119127 -76599 -156971 -121649 -126925 -42629 159935
14625A59935p2872O5835l5405n8965j25365K7105P9686j47934j68227r9079J28207
$$ 159935 87063 152898 117493 58528 -66837 -39732 39954 -107980 -276207 -375286 -247079
14614b47079p296k1250L62O9008K81555J30430j40406k86650j37829Q593L2666
$$ -247079 -254375 -275625 -275263 -206255 75300 205730 65324 -221326 -359155 -350562 -317896
14603c17896r7931L6788J18325l5899j466O1265N4693N6052J30074p7642J8565
$$ -317896 -415827 -379039 -260714 -296613 -298079 -236814 -182121 -126069 4005 -73637 -55072
14592e5072M0131P1065M5460n9860J00417O8043q7080r2967j58551o764N4672
$$ -55072 -14941 56124 101584 41724 142141 210184 123104 30137 -128414 -135178 -80506
14581h0506j1956p1173j241J22385J20811M3031j13577n3505j8566L0978p250
$$ -80506 -92462 -163635 -164876 -42491 78320 121351 7774 -45731 -64297 -33319 -40569
14570d0569N2064j19964N1906J06811o9311j44779j47277K02582J51574j61448
$$ -40569 11495 -108469 -56563 50248 -19063 -163842 -311119 -108537 43037 -118411
14560a18411q3645p6719J70950K12881r5860j05444k4926L2359J48829R7771J8425
$$ -118411 -202056 -278775 -107825 105056 9196 -96248 -121174 -88815 60014 157785 176210
14549A76210l1150J2793j21953j06573n6339o1459Q3636L0537m7854J48594J10779
$$ 176210 145060 157853 35900 -70673 -127012 -188471 -104835 -74298 -122152 26442 137221
14538A37221j61153q815M9570n3791J09273K01835k6568l02387j22567O9074p7896
$$ 137221 -23932 -32747 16823 -36968 72305 274140 247572 -54815 -177382 -108308 -186204
14527a86204j12804Q1820J73295J88310N7958o6723k20566n6372n5824R3351J17365
$$ -186204 -299008 -217188 -43893 144417 202375 135652 -84914 -141286 -197110 -103759 13606
14516A3606j44983r9291J12348j3046o436J41207K4958P3215j10070M4946M4226
$$ 13606 -131377 -230668 -118320 -131366 -137802 3405 28363 101578 -8492 36454 80680
14505H0680l8284J58459J28526q6048k52438n5201J09722o9025M914P082O2963
$$ 80680 42396 200855 329381 243333 -9105 -64306 45416 -23609 -18695 -11613 51350
14494E1350j05177J01J10086N1503Q3527j10985j01701j3461n2603j72605Q4301
$$ 51350 -53827 -53726 56360 107863 191390 80405 -21296 -34757 -87360 -259965 -175664
14483a75664R1710J28344l9868N7252J7703j68528r9369M477P32O3256K5202R1474
$$ -175664 -83954 44390 4522 61774 79477 -89051 -188420 -183943 -183211 -119955 -94753 -3279
14471c279j8303L7503j34416M9374P4263j06880l534n6100p3448J02889O9541
$$ -3279 -21582 15921 -118495 -69121 5142 -101738 -105272 -161372 -234820 -131931 -62390
14460f2390Q6038r0840k6774r2336J34661J34783n1579m172P969J36600P715L9330
$$ -62390 23648 -67192 -93966 -186302 -51641 83142 31563 27391 35360 171960 179675 219005
14448B19005l0097q9918o2532K6445q480J32831m1477R1253J08713n606j81343
$$ 219005 188908 98990 36458 62903 54423 187254 145777 237030 345743 340137 158794
14437A58794n3666J1264p2800P6195m1041p5664j36174j60647r3788J81152J15719
$$ 158794 105128 116392 43592 119787 78746 3082 -133092 -293739 -387527 -206375 -90656
14426i0656p1234J63932O4462q4855o6758L810r631J8701p9797j1328N0617j14295
$$ -90656 -161890 2042 66504 -18351 -85109 -81299 -90930 -72229 -152026 -163354 -112737 -227032
14414b27032r8468k6221K03131K112K0267Q7153j6170n8965m5751J01783M3677
$$ -227032 -325500 -351721 -148590 -146478 -126211 -39058 -55228 -114193 -159944 -58161 -14484
14403a4484j17107r5453K07425Q0457J5572J19112P6988M1750r0726k11449k10025
$$ -14484 -131591 -227044 -19619 60838 76410 195522 272510 314260 223534 12085 -197940
14392a97940p5571K1091K0477l032L1327J29515J48140n7648j76416j51537O8158
$$ -197940 -273511 -252420 -231943 -234975 -203648 -74133 74007 16359 -160057 -311594 -243436
14381b43436J4889j01995L451K03138K6847n9147l2282M5359R8935O9600m1728
$$ -243436 -228547 -330542 -327091 -123953 -97106 -156253 -188535 -143176 -44241 25359 -16369
14370a6369N1173J5654k19909j66076K01624J32243r5788k4234j1576j8282o160
$$ -16369 34804 50458 -169451 -335527 -133903 -1660 -97448 -121682 -133258 -151540 -157700
14359a57700m6371m9154R0543M7673j32156J0987J78291p1057p3279K13589p2394
$$ -157700 -204071 -253225 -162682 -115009 -247165 -236178 -57887 -128944 -202223 11366 -61028
14348f1028k171J39804L3108o9112n7825J35899P837m8583R8637k62404j29485
$$ -61028 -63199 76605 109713 40601 -17224 118675 126512 77929 176566 -85838 -215323
14337b15323O6276J45701J33831j2708n1490r9723j59078N9457J1568O3702N0304
$$ -215323 -149047 -3346 130485 117777 66287 -33436 -192514 -133057 -121489 -57787 -7483
14326g483j07061p7041L6130J59421Q1337j67800j64901K3112j10090J77825R9614
$$ -7483 -114544 -191585 -155455 3966 85303 -82497 -247398 -224286 -334376 -156551 -56937
14315e6937R9893j41358k16903J9362N8026N5276N6097m8651k07967J91038J04690
$$ -56937 42956 -98402 -315305 -295943 -237917 -182641 -126544 -175195 -383162 -192124 -87434
14304h7434m7526J5667J7463M016q8152N9069M6816r5380K7899J62380k3721o1000
$$ -87434 -134960 -119293 -101830 -97814 -185966 -126897 -80081 -175461 -147562 14818 -8903 -69903
14292f9903n4540L0484M4130K2656J20318q9737m6981J49735O6379o6261r4218
$$ -69903 -124443 -93959 -49829 -27173 93145 3408 -43573 106162 172541 106280 12062
14281A2062m3261J20181J3956P875p9080p3610j9960j8334N7210j9360J19020
$$ 12062 -31199 88982 102938 110813 31733 -41877 -61837 -80171 -22961 -42321 76699
14270G6699L09344O0750J04016j00736m7659J51336O9049o151k7478N7268m2894
$$ 76699 386043 446793 550809 450073 402414 553750 622799 616648 589170 646438 603544
14259F03544N6211L9071r4139q5855K2318P114r1992j56510j8600j71952N8759
$$ 603544 659755 698826 604687 518832 541150 548264 456272 299762 281162 109210 167969
14248A67969P8843j32805j85290o1759p1419j27080K8411J35856O8072o7303k7554
$$ 167969 246812 114007 -71283 -133042 -204461 -331541 -303130 -167274 -99202 -166505 -194059
14237a94059o9519O0132P4501K24973J24844O5316L8266r6236P1891N3923j23312
$$ -194059 -263578 -203446 -128945 96028 220872 286188 324454 228218 300109 354032 230720
14226B30720k07059Q1279R037j15092r995M6027q7556M1141k3143q4058M7136
$$ 230720 23661 104940 113977 -1115 -11110 34917 -52639 -11498 -34641 -118699 -71563
14215g1563J04305k3839o2739K300K3244l0459J19471L8860L8040j0808j58953
$$ -71563 32742 8903 -53836 -51536 -28292 -58751 60720 99580 137620 126812 -32141
14204c2141K3672K11163k5312j38789K017p1295K3484n5386j04732N5389N6468
$$ -32141 -8469 202694 177382 38593 40610 -30685 -7201 -62587 -167319 -111930 -55462
14193e5462J1627O034K4601m8093M1146N9777j9593p4393q1351R4457k5626K00249
$$ -55462 -43835 -37801 -13200 -61293 -20147 39630 20037 -54356 -135707 -41250 -66876 133373
14181A33373M2694q7618M9572p7876j68999J306q96J65296O4360M0465K7973L8671
$$ 133373 176067 88449 138021 60145 -108854 -107548 -108444 56852 121212 161677 189650 228321
14169B28321j9944p5301q4207o0633M5830N5761J12869J48112N426j34739k06019
$$ 228321 208377 133076 48869 -11764 34066 89827 202696 350808 356234 221495 15476
14158A5476r9153l9997P3976J16585K5906J54085M7338L2854m9541M4204k9568
$$ 15476 -83677 -123674 -49698 66887 92793 246878 294216 327070 277529 321733 292165
14147B92165q1661m0019J7087j17301N0469P676l5939k1815n4789j23389j6065
$$ 292165 210504 170485 187572 70271 120740 128416 92477 70662 15873 -107516 -123581
14136a23581K2903j5234m5272J39280J31618k6542j22720K4552K5574r9739n2205
$$ -123581 -100678 -115912 -161184 -21904 109714 83172 -39548 -14996 10578 -89161 -141366
14125a41366l8896K43965k1748q2583L2242N1694O6593o9720j57471p8601J0297
$$ -141366 -180262 63703 41955 -40628 -8386 43308 109901 40181 -117290 -195891 -185594
14114a85594R1329q4136N8194M337J5168J65020J5367j28413o3868Q8720Q6154
$$ -185594 -94265 -178401 -120207 -115870 -100702 64318 79685 -48728 -112596 -23876 62278
14103F2278j4479j0045N8435o1320j96841j6467k608Q2659p8425r9225n2674R818
$$ 62278 47799 37754 96189 34869 -161972 -178439 -181047 -98388 -176813 -276038 -328712 -318894
14091c18894M381n8466J33467K23830m8043o5956J10822p7334p7018o7365j02791
$$ -318894 -314513 -372979 -239512 -15682 -63725 -129681 -18859 -96193 -173211 -240576 -343367
14080c43367j37701J35695j140R8564N0043p4861J00044J53644J07328P291J344
$$ -343367 -481068 -345373 -346513 -247949 -197906 -272767 -172723 -19079 88249 95540 96884
14069I6884o1130o6441N2735M0728k62746j40932L5359M3132J47109P6031P2810
$$ 96884 35754 -30687 22048 62776 -199970 -340902 -305543 -262411 -115302 -39271 33539
14058C3539Q6682j13713k81305p4535Q6426J05525J34451j8664K3360N3948N0061
$$ 33539 120221 6508 -274797 -349332 -262906 -157381 -22930 -41594 -18234 35714 85775
14047H5775o4164O999l9245j69852o5096N4585j3313Q3602J8350K9289N9765q2809
$$ 85775 21611 28610 -10635 -180487 -245583 -190998 -204311 -120709 -102359 -73070 -13305 -96114
14035i6114j45215r7261K345J2346O6115R1683J91462J04567l155p3393j18654
$$ -96114 -241329 -338590 -336245 -323899 -257784 -166101 25361 129928 126773 53380 -65274
14024f5274L6440j6180k2673o1966J6342R4231n0982r107N0910N2985J0392k9529
$$ -65274 -28834 -45014 -67687 -129653 -113311 -19080 -70062 -79169 -28259 24726 35118 5589
14012E589k49878J1513J67152K3516k3202N7261Q087J68689Q7900j88971j02940
$$ 5589 -244289 -232776 -65624 -42108 -65310 -8049 38 168727 256627 67656 -35284
14001c5284Q8397P5975j4927j72494k20199N2387J68330L4134j15697o4001n8077
$$ -35284 53113 129088 114161 -58333 -278532 -226145 -57815 -23681 -139378 -203379 -261456
13990b61456p9697J77394K04569J3606k08211J0845J26127N982j76916O2472n1502
$$ -261456 -341153 -163759 40810 54416 -153795 -142950 -16823 -10841 -187757 -125285 -176787
13979a76787k2258m8119J35589J01275j26384j89015P027Q975J49036Q2394m5595
$$ -176787 -199045 -247164 -111575 -10300 -136684 -325699 -318672 -309697 -160661 -78267 -123862
13968a23862P6317p4540j36807J61207R7631q0240N8392M7945j6273o7501k04846
$$ -123862 -47545 -122085 -258892 -97685 -54 -80294 -21902 26043 9770 -57731 -262577
13957b62577J30587J41347j3097k23081j4816J33166N4748k1045m8966k0433n2201
$$ -262577 -131990 9357 -3740 -226821 -241637 -108471 -53723 -74768 -123734 -144167 -196368
13946a96368j2252J8361J31873n5708n2419O1470R401N9015J662M3233J69019
$$ -196368 -208620 -190259 -58386 -114094 -166513 -105043 -95642 -36627 -34965 8268 177287
13935A77287L4535L4685j1235o879p667j05703k62172k36010l0114K23104Q6435
$$ 177287 211822 246507 235272 228393 220726 115023 -147149 -383159 -413273 -190169 -103734
13924a03734O0864P594l8189N6019J62386j48532O0399J26464k6457n1918J7865
$$ -103734 -42870 -35276 -73465 -17446 144940 -3592 56807 183271 156814 104896 122761
13913A22761m6538o0940J40084K5332L6481q5460j90632k298j02250N3590J65923
$$ 122761 76223 15283 155367 180699 217180 131720 -58912 -61210 -163460 -109870 56053
13902E6053R6498j95240q1025M0126J10278l2759J04130J57897J07870K1931k05273
$$ 56053 152551 -42689 -123714 -83588 26690 -6069 98061 255958 363828 385759 180486
13891A80486k29731p759j2611O8593Q7075m1452q6226J35572j825o0454O2038
$$ 180486 -49245 -57004 -69615 -1022 86053 44601 -41625 93947 92122 31668 93706
13880I3706p3409r7021j9234o1221k2388J08814J33417O8122j974j40274k34895
$$ 93706 20297 -76724 -95958 -157179 -179567 -70753 62664 130786 128812 -11462 -246357
13869b46357J15602K46134J06254O7441k6829o8892J16212J14311j29306j79387
$$ -246357 -130755 115379 221633 289074 262245 193353 309565 423876 294570 115183
13859A15183J9451K7909R3691l7768J70261Q4649o6043J79444Q1570M0324m4245
$$ 115183 134634 162543 256234 218466 388727 473376 407333 586777 668347 708671 664426
13848F64426j54244K3077N4867J16247J11707J54679J41997P9051P4979j08967
$$ 664426 510182 533259 588126 704373 816080 970759 1112756 1191807 1266786 1157819
13838A157819P6859l7951k49733l3484P9653P0243j14213J13556N7004O0014J4623
$$ 1157819 1234678 1196727 946994 913510 993163 1063406 949193 1062749 1119753 1179767 1194390
13827A194390j26819r823o9126K5146J3931j48298j58575m7376J90878O2304j74101
$$ 1194390 1067571 1057748 988622 1013768 1027699 879401 720826 673450 864328 926632 752531
13816G52531j82386j91955l0672j43512j13983L35718J21478k47029k46014j3569
$$ 752531 570145 378190 347518 204006 90023 425741 547219 300190 54176 40607
13806D0607O0638Q6956K729q6913n5176k2597k0955J04706N5888k63258r917J42022
$$ 40607 101245 188201 190930 104017 48841 26244 5289 109995 165883 -97375 -107292 34730
13794C4730P0317k7442p662j01983J0264p5998j28163j22572m373K75887J23192
$$ 34730 105047 77605 69943 -32040 -21776 -97774 -225937 -348509 -352882 -76995 46197
13783D6197p2315m2847J06544j1671J00612R0524k0289k5589J73145J35309o8264
$$ 46197 -26118 -68965 37579 25908 126520 217044 196755 171166 344311 479620 411356
13772D11356j04822j5886P6736q9736j24022k41754n6940J54955N7672Q7573k9365
$$ 411356 306534 290648 367384 277648 153626 -88128 -145068 9887 67559 155132 125767
13761A25767P701p0235r0268q2149J12984K16177m4351j50649M3018M1261Q0044
$$ 125767 133468 63233 -27035 -109184 3800 219977 175626 24977 67995 109256 189300
13750A89300R5879K7446N0R098k7271l2412o4714K4915J24233j88336k73313n5900
$$ 189300 285179 312625 312675 321773 294502 262090 197376 222291 346524 158188 -115125 -171025
13738a71025m0534M9430l2719j3505J06598P685O8730N9009k40624j17184P6250
$$ -171025 -211559 -162129 -194848 -208353 -101755 -94070 -25340 33669 -206955 -324139 -247889
13727b47889K05012R8779M9520P9281o8238J00037o3120k19507r0310Q1752J74443
$$ -247889 -42877 55902 105422 184703 116465 216502 153382 -66125 -156435 -74683 99760
13716I9760P138l9324m1899k51908q877r6646J31658J74662N1357o2777l8637
$$ 99760 106898 67574 25675 -226233 -235110 -331756 -200098 -25436 25921 -36856 -75493
13705g5493j00914J22375J78560J8141j0226p868p0740j03157k5233j37054n7061
$$ -75493 -176407 -54032 124528 142669 132443 124575 53835 -49322 -74555 -211609 -268670
13694b68670J12267M3585L01651R0800J6207j07618r4024m2267M490M717J4073
$$ -268670 -156403 -112818 188833 279633 295840 188222 94198 51931 56421 61138 75211
13683G5211M9013M104L570m4911M3574l7608k8517j18378j98560q9741J39652
$$ 75211 124224 128328 131898 86987 130561 92953 64436 -53942 -252502 -342243 -202591
13672b02591p236r3053l6400J01734K8693L5155J69833K08364j77324j71148j3430
$$ -202591 -209827 -302880 -339280 -237546 -208853 -173698 -3865 204499 27175 -143973 -157403
13661a57403N1755J48472p4301j62113k4943O8548J6796K19914q3659j95465M3571
$$ -157403 -105648 42824 -31477 -193590 -218533 -149985 -133189 86725 3066 -192399 -148828
13650a48828K18298K4087q921j02654j53014o4285j20546l1838M6821P6196K8730
$$ -148828 69470 93557 84636 -18018 -171032 -235317 -355863 -387701 -340880 -264684 -235954
13639b35954M0378j78286M2128N5934O2885J91642R3024J6824R4551J28000O2044
$$ -235954 -195576 -373862 -331734 -275800 -212915 -21273 71751 88575 183126 311126 373170
13628C73170j05619j15442j61475l7168J8766Q0825L5205q7315j34954j9920O1122
$$ 373170 267551 152109 -9366 -46534 -27768 53057 88262 947 -134007 -153927 -92805
13617i2805J39450R3721P5115j3668o9291j42640j32296p471K45980L7361o3373
$$ -92805 46645 140366 215481 201813 132522 -10118 -142414 -149885 96095 133456 70083
13606G0083j8804j22309o2020J17112m4276n9496J93531M2085q3519k2966O2465
$$ 70083 51279 -71030 -133050 -15938 -60214 -119710 73821 115906 32387 9421 71886
13595G1886K1419j46851j17517J07070J54311l2168P631p9792j5005J109J47983
$$ 71886 93305 -53546 -171063 -63993 90318 58150 65781 -14011 -29016 -27907 120076
13584A20076J06749p9707r7451n2705l0651k0033j1959L6185K857R5148L513k3447
$$ 120076 226825 147118 49667 -3038 -33689 -53722 -65681 -29496 -26639 68509 72022 48575
13572D8575n1082j56763N8597J00153J6992p9666O2197M0490p5241j17105L1357
$$ 48575 -2507 -159270 -100673 -520 16472 -63194 -997 39493 -35748 -152853 -121496
13561a21496Q3635J43045Q2876q2032j18362P7364P7621J8426K9101j31716q3132
$$ -121496 -37861 105184 188060 106028 -12334 65030 142651 161077 190178 58462 -24670
13550b4670R9038J87867q1874m4835L6116N1222N155J7079k9947j3721J883k21608
$$ -24670 74368 262235 180361 135526 171642 222864 228019 245098 215151 201430 203313 -18295
13538a8295j2300J12236J06635J640K0714K35001R2355j25441l2597j70210j24984
$$ -18295 -30595 81641 188276 189916 210630 445631 537986 412545 379948 209738 84754
13527H4754N1173J00984O6365L2559l624q9236J297K89051m1989n8144l1760O5966
$$ 84754 135927 236911 303276 335835 332211 242975 244272 533323 491334 433190 401430 467396
13515D67396J8312j99650j54499J6938J09878R469N1449q2446p2838j05984j96180
$$ 467396 485708 286058 131559 148497 258375 267844 319293 236847 164009 58025 -138155
13504a38155K7332N2870n1354J05911J03047J60326N5288J8525k4550o1301m3777
$$ -138155 -110823 -57953 -109307 -3396 99651 259977 315265 333790 309240 247939 204162
13493B04162k05384j01174J08271R3163m6035M5993K6694p2626P6606J2131K3304
$$ 204162 -1222 -102396 5875 99038 53003 98996 125690 53064 129670 141801 165105
13482A65105K4802r1747j40709M7747J61614j06214q1946m6029m3809P1863J17976
$$ 165105 189907 98160 -42549 5198 166812 60598 -21348 -67377 -111186 -39323 78653
13471G8653k5898J09622m3753k02759R5498M7425o4768O4558J36242K9533p6331
$$ 78653 52755 162377 118624 -84135 11363 58788 -5980 58578 194820 224353 148022
13460A48022k29736N8905P4913m9782P7188J30157N6844o0165k03836j40526R7789
$$ 148022 -81714 -22809 52104 2322 79510 209667 266511 206346 2510 -138016 -40227
13449d0227M4449J64371q65k9553l9626P651j5820j35324r8884J61751O2724J3583
$$ -40227 4222 168593 167728 138175 98549 106200 90380 -44944 -143828 17923 80647 94230
13437I4230J69228o1190p9205R7613N4208J8058p0007j46369R7142K00142n4372
$$ 94230 263458 202268 123063 220676 274884 292942 222935 76566 173708 373850 319478
13426C19478j39559k05343k7740k6988o2075o0396J91287l061p6788Q2117J89024
$$ 319478 179919 -25424 -53164 -80152 -142227 -202623 -11336 -14397 -91185 -9068 179956
13415A79956Q2829m2405p587R5536o7790j41344o1488j39485j03149N5954N4373
$$ 179956 262785 220380 212793 308329 240539 99195 37707 -101778 -204927 -148973 -94600
13404i4600k3984O3409j3372o8977m0610Q5152L155J3983j16155N0178r5705n1035
$$ -94600 -118584 -55175 -68547 -137524 -178134 -92982 -89827 -75844 -191999 -141821 -237526 -288561
13392b88561N0837K03254O7422o5720P2633j6458m41L1495o8504J9712J40884
$$ -288561 -237724 -34470 32952 -32768 39865 23407 22966 54461 -14043 5669 146553
13381A46553J01860j24055l3235J42231n588k0256p6414K5312j89582K1528J02691
$$ 146553 248413 124358 91123 233354 227766 207510 131096 156408 -33174 -11646 91045
13370I1045K9964k76232J0480J40971l0103p5283k2390l6912J41505K26743M9395
$$ 91045 121009 -155223 -144743 -3772 -33875 -109158 -131548 -168460 -26955 199788 249183
13359B49183q7265k3899m0984o0084j62633r4759Q5113J74677n613k12210P2255
$$ 249183 161918 138019 97035 36951 -125682 -220441 -135328 39349 33736 -178474 -106219
13348a06219J45985J84086O2678q5378l6542k5223J386m6450n3757M9849K28947
$$ -106219 39766 223852 286530 201152 164610 139387 140773 94323 40566 90415 319362
13337C19362J16172k4639J5007k284j79439j94904p2365k1311j39296n7554Q8298
$$ 319362 435534 410895 425902 423618 244179 49275 -23090 -44401 -183697 -241251 -152953
13326a52953l1118j32747Q8572J65573q828Q0974J17231r8001q0032q733m6617
$$ -152953 -184071 -316818 -228246 -62673 -71501 9473 126704 28703 -51329 -60062 -106679
13315a06679r774L8070J70644J42481k4150j04547q504M4540o904Q4920j01906
$$ -106679 -116453 -78383 92261 234742 210592 106045 97541 142081 135177 220097 118191
13304A18191q3333p590o9759J03476J39878k8932N0139j28486Q4748K66365r3447
$$ 118191 34858 27268 -42491 60985 200863 171931 222070 93584 178332 444697 351250
13293C51250n1556k12454K243M4253r1724j6465O0538j4371m1681M7687J01159
$$ 351250 299694 87240 89483 133736 42012 25547 86085 71714 30033 77720 178879
13282A78879l6661j87767o1484J10028o7080j61480N1072M8963k97J56845r4405
$$ 178879 142218 -45549 -107033 2995 -64085 -225565 -174493 -125530 -125827 31018 -63387
13271f3387k24663P0635Q1712J51641Q0677K2679M1405l3258o982J2393j72151
$$ -63387 -288050 -217415 -135703 15938 96615 119294 160699 127441 120459 132852 -39299
13260c9299q6740K89990J06279K42050q0546r4154n2650N7808J43707m0300j81403
$$ -39299 -126039 163951 270230 512280 431734 337580 284930 342738 486445 446145 264742
13249B64742o8021P9749J25535M2424r9467k06744j86498L5410M4696o6838P1574
$$ 264742 196721 276470 402005 444429 344962 138218 -48280 -12870 31826 -35012 36562
13238C6562M595o2867q6753J9802J44252K0171m0769J16937J7293r8963r1991
$$ 36562 41157 -21710 -108463 -88661 55591 75762 34993 151930 169223 70260 -21731
13227b1731n7464j71874M3726J00757N3153l088M9163J00994o6474j87354L3159
$$ -21731 -79195 -251069 -207343 -106586 -53433 -56521 -7358 93636 27162 -160192 -127033
13216a27033o9144K631J31756k0811L5447J91874k7724j30194J29792P0765r9940
$$ -127033 -196177 -193546 -61790 -82601 -47154 144720 116996 -13198 116594 187359 87419
13205H7419p2475q8927l738j1602j06057L1743o8964J2225L1991M7201M2461J67343
$$ 87419 14944 -73983 -77721 -89323 -195380 -163637 -232601 -220376 -188385 -141184 -98723 68620
13193F8620P9985n0433O5255o1475K4507j40610j67631o8980k1402K33899J89814
$$ 68620 148605 98172 163427 101952 126459 -14151 -181782 -250762 -272164 -38265 151549
13182A51549J7167j83704M8283N431l4441r1403j99175J6371K18587J17572K34560
$$ 151549 168716 -14988 33295 38726 4285 -87118 -286293 -269922 -51335 66237 300797
13171C00797J18307j67434N67o7659j56791L2327J87979M9006j46699J40201O5300
$$ 300797 419104 251670 252237 184578 27787 60114 248093 297099 150400 290601 355901
13160C55901p2529j81401L2113J4805j18005j65810J27570k7392J07475J39220
$$ 355901 283372 101971 134084 148889 30884 -134926 -7356 -34748 72727 211947
13150B11947l190o3370j04623o6161N2362J69700j56046m2995j8126q9425O7267
$$ 211947 208757 145387 40764 -25397 26965 196665 40619 -2376 -20502 -109927 -42660
13139d2660Q7562J00459R6049J28524M5599r3795o8589j0366j01408j07710M5089
$$ -42660 44902 145361 241410 369934 415533 321738 253149 242783 141375 33665 78754
13128G8754K8720j24606n8946Q1760P2142o4517j26431J04222R3783l5570K1756
$$ 78754 107474 -17132 -76078 5682 77824 13307 -113124 -8902 84881 49311 71067
13117G1067Q9244L2636K82316M2609j15809j8368r7865l2194p0776N7464j03174
$$ 71067 160311 192947 475263 517872 402063 383695 285830 253636 182860 240324 137150
13106A37150j11557l352N7159K21957n3082j30824k8202l972K04218R1472j02265
$$ 137150 25593 22241 79400 301357 248275 117451 89249 85277 289495 380967 278702
13095B78702j06605r3360N0582K23735l9033l09947J8813J15332J73608Q8192
$$ 278702 172097 78737 129319 353054 314021 4074 22887 138219 311827 400019
13085D00019o4156q9306m4299M6182K8163j56483j92655K4911J47702O7083j9278
$$ 400019 335863 246557 202258 248440 276603 120120 -72535 -47624 100078 167161 147883
13074A47883r9175M4444M7982j14381J9086k2365o4690L8216R8060K04806J12534
$$ 147883 48708 93152 141134 26753 45839 23474 -41216 -3000 95060 299866 412400
13063D12400o9385k3649p8394J23562Q8520j78133k39070K2398j42589j3999M713
$$ 412400 343015 319366 240972 364534 453054 274921 35851 58249 -84340 -98339 -93626
13052i3626Q4781p251J3377J47869M6700j28327n3235L8559J08781R3839L1980
$$ -93626 -8845 -16096 -2719 145150 191850 63523 10288 48847 157628 251467 283447
13041B83447k9703k1909j43293m2260M3974m4964q1902J0355j792J13654R3619
$$ 283447 253744 231835 88542 46282 90256 45292 -36610 -26255 -28047 85607 179226
13030A79226o0649Q7330m4939j40638r9789L5649Q204l2229M4503O6087K5368
$$ 179226 118577 205907 160968 20330 -79459 -43810 -35606 -67835 -23332 42755 68123
13019F8123R9066l3823P470k3457o3631r7298O8452P2334J1583O5809m3777j79354
$$ 68123 167189 133366 140836 117379 53748 -43550 24902 97236 108819 174628 130851 -48503
13007d8503q5013J33038J69465j42555r0697l429J53790J5819K0015L404O92r4018
$$ -48503 -133516 -478 168987 26432 -64265 -67694 86096 101915 121930 125334 126026 32008
12995C2008j13808P6804Q0966O0629K73970L5391n8830j53911o6366m9167j1221
$$ 32008 -81800 -4996 75970 136599 410569 445960 387130 233219 166853 117686 106465
12984A06465Q3111P7518j25254n9800N2906R4932o3379l6341K02066j05642m5972
$$ 106465 189576 267094 141840 82040 134946 229878 166499 130158 332224 226582 180610
12973A80610k4044L3914j33339J22099N4881j7473N8701l5702j34146j44342J06053
$$ 180610 156566 190480 57141 179240 234121 216648 275349 239647 105501 -38841 67212
12962F7212J93552J0630j22919j53584p7002J00717M9658o6275R1202J53957M3138
$$ 67212 260764 271394 148475 -5109 -82111 18606 68264 1989 93191 247148 290286
12951B90286l7360r500k4665j30216p8662O0892M087l9225l5100l0077J00612
$$ 290286 252926 243426 218761 88545 9883 70775 74862 35637 537 -29540 71072
12940G1072m1463M0108O6079L827o1173j2971R5312J61174O6761j04694j67497
$$ 71072 29609 69717 135796 139623 78450 65479 160791 321965 388726 284032 116535
12929A16535n6166K3782j8777j53911O4645L8883R0532P5469M2963J6809L5247
$$ 116535 60369 84151 65374 -88537 -23892 14991 105523 180992 223955 240764 276011
12918B76011n3007j48218m9897K129K28044J66653j081L8686n3227j01919q2116
$$ 276011 223004 74786 24889 27018 255062 421715 420634 459320 406093 304174 222058
12907B22058Q2686j32196O3641M3493n3148m8559J27684j4528q6220Q6880p0360
$$ 222058 304744 172548 236189 279682 226534 177975 305659 291131 204911 291791 221431
12896B21431J2110J01635j4593k31614j80777j27142l0865O4334J86336P8901
$$ 221431 233541 335176 320583 88969 -91808 -218950 -249815 -185481 855 79756
12886G9756P3797N2870j17316J201Q9933p6025j47343k6989J36952j00646j4884
$$ 79756 153553 206423 89107 90308 180241 104216 -43127 -70116 66836 -33810 -48694
12875d8694J01968M6502J02257o316j3985O7944J40265M0353o2649j41283M8296
$$ -48694 53274 99776 202033 195717 181732 249676 389941 430294 367645 226362 274658
12864B74658j4981k34540p1154L6239J37577P7467O8511j69580J871O7738M9133
$$ 274658 259677 25137 -46017 -9778 127799 205266 273777 104197 106068 173806 222939
12853B22939n3349k18795m5308L0326j27424K0690J3191J33016p892k0234J37550
$$ 222939 169590 -49205 -94513 -64187 -191611 -170921 -157730 -24714 -32606 -52840 84710
12842H4710J06555N0439Q4199m5243j1982O7010l6656O2376m681k2116k13913
$$ 84710 191265 241704 325903 280660 268678 335688 299032 361408 356727 334611 120698
12831A20698m2387r2482K347P5348M818L0967K3172R3052L4805l5195N2304N0946
$$ 120698 78311 -14171 -11824 63524 68342 99309 122481 215533 250338 215143 267447 318393
12819C18393r572k40850p3036J30297p1200p5693K2983k1832O4406o410K08096
$$ 318393 308821 67971 -5065 125232 54032 -21661 1322 -20510 43896 37486 245582
12808B45582n077R3402M3132j58603j26346j74644Q4324J93161K03737M0037j3025
$$ 245582 240505 333907 377039 218436 92090 -82554 1770 194931 398668 438705 425680
12797D25680j65036n9116K19513l0193K7620J64305j21423j53961J43381l2675
$$ 425680 260644 201528 421041 390848 418468 582773 461350 307389 450770 418095
12787D18095m3096n1896j16769R555o4917J20792O3534L6434P4223J17452K4789
$$ 418095 374999 323103 206334 215889 150972 271764 335298 371732 445955 563407 588196
12776E88196q5437p8628j063j17426j62232O864P7916M3659o5228p3626p9199
$$ 588196 502759 424131 423068 305642 143410 150274 228190 271849 206621 132995 53796
12765E3796j17807j749K3615P9241Q1994J53121J924Q3461P7964p0808j35566
$$ 53796 -64011 -65760 -42145 37096 119090 272211 274135 357596 435560 364752 229186
12754B29186o1008K5369o1726m6712L9037n6478K2572J64337R695j22305j14874
$$ 229186 168178 193547 131821 85109 124146 67668 90240 254577 264272 141967 27093
12743B7093p7007j6139j8836n5092J07657K37300K00043j28438r6334J49020J13429
$$ 27093 -49914 -66053 -84889 -139981 -32324 204976 405019 276581 180247 329267 442696
12732D42696j08783r0968J3245J19057j31843j36679j1079J31800N7252J98562
$$ 442696 333913 242945 256190 375247 243404 106725 95646 227446 284698 483260
12722D83260M6674r2825k2350L1850k35151p3024j09641r01K8641J43830J06591
$$ 483260 529934 437109 414759 446609 211458 138434 28793 27892 56533 200363 306954
12711C06954N3637j21766m6826j33957k9982N5897r7932n7119K83154J23239p2118
$$ 306954 360591 238825 191999 58042 28060 83957 -13975 -71094 212060 335299 263181
12700B63181m5820j13891J7030j0922N7869J64961K845l0186j15675K0056R6324
$$ 263181 217361 103470 120500 109578 167447 332408 335253 305067 189392 209448 305772
12689C05772Q6458j74096q0806K52316r4993r9880n5742L5569P8998o1631Q0763
$$ 305772 392230 218134 137328 389644 294651 194771 139029 174598 253596 191965 272728
12678B72728J55052J05554J13237j05588k40313j22728J4254P1377J06555j3101
$$ 272728 427780 533334 646571 540983 300670 177942 192196 263573 370128 357027
12668C57027j12145q5505J59372K34042J4720j67343p7465J5601J4015o0219r5890
$$ 357027 244882 159377 318749 552791 567511 400168 322703 338304 352319 292100 196210
12657A96210P0357J31957k447j3073J08632r3226j78244p1813j52495r4156R8596
$$ 196210 266567 398524 396077 383004 491636 398410 220166 148353 -4142 -98298 298
12646B98l0534o8158J93022J17095j7273P5356j8653J41200R0675J3003N7054
$$ 298 -30236 -98394 94628 211723 194450 269806 251153 392353 483028 496031 553085
12635E53085j46699j10501J19155P6651L6014j63728j11031m0118M4384J74950
$$ 553085 406386 295885 415040 491691 527705 363977 252946 212828 257212 432162
12625D32162j65928l53923p8779J32484J31172J91058m529O000J47346P1461K7677
$$ 432162 266234 -87689 -166468 -33984 97188 288246 283717 289717 437063 508524 536201
12614E36201l3061n5669r1959k9918Q9097J16738m0689p5120Q9862j88045j16744
$$ 536201 503140 447471 355512 325594 414691 531429 490740 415620 505482 317437 200693
12603B00693J60580Q5868J49480k5528L380j5887o4515o7918j31177r6011j43278
$$ 200693 361273 447141 596621 571093 574473 558586 494071 426153 294976 198965 55687
12592E5687J29960N3312q2462J49676J54277m5871K999L6559r3723J21714O2860
$$ 55687 185647 238959 156497 306173 460450 414579 417578 454137 360414 482128 544988
12581E44988j24710p1827p1198Q4879L5528Q930M4336O674k7173k47728J08264
$$ 544988 420278 348451 277253 362132 397660 406590 450926 457600 430427 182699 290963
12570B90963R1017k61561j27027J79464K84467l321l5004j4704j5722r1834k7810
$$ 290963 381980 120419 -6608 172856 457323 454002 418998 404294 388572 296738 268928
12559B68928j00249K0554J61383R276q8337j02840j87262O5623Q7358O3037J80497
$$ 268928 168679 189233 350616 359892 271555 168715 -18547 47076 134434 197471 377968
12548C77968R095j26119N3167k0947J72537P2807o4729j6540q335j62809o3936
$$ 377968 387063 260944 314111 293164 465701 538508 473779 457239 448904 286095 222159
12537B22159J1107k0412K2369J65944O2033j17976m8634J66337L0597N8484N4321
$$ 222159 233266 212854 235223 401167 463200 345224 296590 462927 493524 552008 606329
12526F06329J8491k091j55558j5772J07919M0052r0372k9172r7079J14171K146
$$ 606329 624820 622729 467171 451399 559318 599370 508998 479826 382747 496918 499064
12515D99064o0521J01284m4675q4961J87103J71997q2595r4559n1737R6900o5905
$$ 499064 438543 539827 495152 410191 597294 769291 686696 592137 540400 637300 571395
12504E71395k04243k0948M9897l3242Q2489P9978K5770L3520J79045L2711K9472
$$ 571395 367152 346204 396101 362859 445348 525326 551096 584616 763661 796372 825844
12493H25844j9419k10644l5960m0253J47539k2409j98283j37869N5628J77170
$$ 825844 806425 595781 559821 519568 667107 644698 446415 308546 364174 541344
12483E41344j63772k23469J5553J12555J1543J85101J13365J18561p7464k46443
$$ 541344 377572 154103 169656 282211 293754 478855 592220 710781 633317 386874
12473C86874l6474M8663k8903K6709K66727J71158n5974r4036K6269J17984n9515
$$ 386874 350400 399063 370160 396869 663596 834754 778780 684744 711013 828997 769482
12462G69482m4142p7439n9144J02340j20487Q8341J20961j25048k0753J22933
$$ 769482 725340 647901 588757 691097 570610 658951 779912 654864 634111 757044
12452G57044J72869L0310j92402k94385q5752K5986M0242J46000j61955j6811
$$ 757044 929913 960223 767821 473436 387684 413670 453912 599912 437957 421146
12442D21146K5206P9643K29147N8063k8850m4913O2662M5055Q7058N779p6263
$$ 421146 446352 525995 755142 813205 784355 739442 802104 847159 934217 939996 863733
12431H63733n6199k14095j01264J23535J34646L7070J14456M6315k5484o2646
$$ 863733 807534 593439 492175 615710 750356 787426 901882 948197 922713 860067
12421H60067K804K21230j1771j50840j15255r1263J6499N580r8998N0768n8262
$$ 860067 862871 1084101 1072330 921490 806235 714972 731471 737051 638053 688821 630559
12410F30559r1355M0495J29325J84566o9077j76273J9698J9261m4955L9547K05357
$$ 630559 539204 579699 709024 893590 824513 648240 667938 687199 642244 681791 887148
12399H87148j01659j48404m2144K9378j4710q9939Q1346M3537J51160K4909o6401
$$ 887148 785489 637085 594941 624319 609609 519670 601016 644553 795713 820622 754221
12388G54221P4536O8627j0272o4035o2837j7256j30544R0806J30169O6860J58877
$$ 754221 828757 897384 887112 823077 760240 742984 612440 703246 833415 900275 1059152
12377A059152o5449r1055j241j0329j23209J2885J8021K7026r050Q7707m9456
$$ 1059152 993703 902648 901407 891078 767869 780754 798775 825801 816751 904458 855002
12366H55002N8876O9451j63784l6899J88461q0322k34715Q3358J90641K2321j09061
$$ 855002 913878 983329 819545 782646 971107 890785 656070 739428 930069 952390 843329
12355H43329K1655P3683l5444P3657J11734m7610j36437R2257R3113n7186Q390
$$ 843329 864984 938667 903223 976880 1088614 1041004 904567 996824 1089937 1032751 1041141
12344A041141j13692r7337J33082R6003J1632r6062M9127J63621Q1865p7180j82854
$$ 1041141 927449 830112 963194 1059197 1070829 974767 1023894 1187515 1269380 1192200 1009346
12333A009346n4818Q364K338o8280J38393J40267p5166R3165p0908O4029L6447
$$ 1009346 954528 962892 965230 896950 1035343 1175610 1100444 1193609 1122701 1186730 1223177
12322A223177j17018m7585N2878R4999j4309l2559J94434K30914j6452k16493
$$ 1223177 1106159 1058574 1111452 1206451 1192142 1159583 1354017 1584931 1568479 1351986
12312A351986j48286n6329M9155N6463q2648p4689J80895Q8015n5883k8692n0233
$$ 1351986 1203700 1147371 1196526 1252989 1170341 1095652 1276547 1364562 1308679 1279987 1229754
12301A229754O703J7318J74060J18270j33820r3058j5624K205j44617Q3822L2452
$$ 1229754 1236457 1253775 1427835 1546105 1412285 1319227 1303603 1305808 1161191 1245013 1277465
12290A277465l2986N3268J62954M9535j35650L9491o9740O3088J02774q0560k15578
$$ 1277465 1244479 1297747 1460701 1510236 1374586 1414077 1344337 1407425 1510199 1429639 1214061
12279A214061m8121J67943K7263j4642J8814r4487r1840k9005J66971O1693M7519
$$ 1214061 1165940 1333883 1361146 1346504 1365318 1270831 1178991 1149986 1316957 1378650 1426169
12268A426169N5504J02864q3121j58040m6995P6261Q9570P3666j7689k22129O203
$$ 1426169 1481673 1584537 1501416 1343376 1296381 1372642 1462212 1535878 1518189 1296060 1302263
12257A302263K01641O3810l9683k8273k1712J03736J19057R7458O0019j56471
$$ 1302263 1503904 1567714 1528031 1499758 1478046 1581782 1700839 1798297 1858316 1701845
12247A701845n6030Q7975M6952j746J8085J56723r9754n5427J63121J51256m9231
$$ 1701845 1645815 1733790 1780742 1778996 1797081 1953804 1854050 1798623 1961744 2113000 2063769
12236B063769O3109K01041q3285j20968j65442o8838J01312l3251L3767l918m0097
$$ 2063769 2126878 2327919 2244634 2123666 1958224 1889386 1990698 1957447 1991214 1987296 1947199
12225A947199m1142J24336J5134j37767L170r112N2740J96982Q1443l8049m5842
$$ 1947199 1906057 2030393 2045527 1907760 1910930 1901818 1954558 2151540 2232983 2194934 2149092
12214B149092m3487J09321J28763K09603j73534j56237L1497k0467p9686Q6421
$$ 2149092 2105605 2214926 2343689 2553292 2379758 2223521 2255018 2234551 2154865 2241286
12204B241286L5184m8446j6898Q4929P1635J17071J45590J00449o2264j14642
$$ 2241286 2276470 2228024 2211126 2296055 2367690 2484761 2630351 2730800 2668536 2553894
12194B553894L9550J11656J34076J9350J5915j09282j64167Q0012Q3487j7946
$$ 2553894 2593444 2705100 2839176 2858526 2874441 2765159 2600992 2681004 2764491 2746545
12184B746545m2131O5375P2200j35522q7306R1957L44J22731J18660P286J23851
$$ 2746545 2704414 2769789 2841989 2706467 2619161 2711118 2711462 2834193 2952853 2960139 3083990
12173C083990P7164j76435n4356M8675j37375M101O9071R5458J59664L09993P170
$$ 3083990 3161154 2984719 2930363 2979038 2841663 2845764 2914835 3010293 3169957 3479950 3487120
12162C487120j15141J30736R7388l0002J5104Q5926L8830Q6220o677J4227K0631
$$ 3487120 3371979 3502715 3600103 3570101 3585205 3671131 3709961 3796181 3789504 3803731 3824362
12151C824362P4974L0947R0718k9236Q1221o1092j12602J8220J02826N99J2420
$$ 3824362 3899336 3930283 4021001 3991765 4072986 4011894 3899292 3917512 4020338 4020937 4033357
12140D033357P8162J93107J51459N0438r6708J18733J27479o984J03105K8348
$$ 4033357 4111519 4304626 4456085 4506523 4409815 4528548 4656027 4649043 4752148 4780496
12130D780496J55917J1903r7907K9696L6722M5869j6197L7795P5132N8947J39822
$$ 4780496 4936413 4948316 4850409 4880105 4916827 4962696 4946499 4984294 5059426 5118373 5258195
12119E258195R3365N7720J00766J87468Q3567L4443p4041p5897J07522K82099
$$ 5258195 5351560 5409280 5510046 5697514 5781081 5815524 5741483 5665586 5773108 6055207
12109F055207O3743K1757J84521O9099J0039J7970r082l5370l1347J62655Q9040
$$ 6055207 6118950 6140707 6325228 6394327 6404366 6422336 6413254 6377884 6346537 6509192 6598232
12098F598232J23170L269J72606J79843J73958K81839K69268K08439j16965j69226
$$ 6598232 6721402 6724671 6897277 7077120 7251078 7532917 7802185 8010624 7893659 7724433
12088G724433J13115J13563P3114o0710J07567L2722J50158J32995K3474J34916
$$ 7724433 7837548 7951111 8024225 7963515 8071082 8103804 8253962 8386957 8410431 8545347
12078H545347J15054N4316j15744M0324L47771J24105J21145J16564J82101J56494
$$ 8545347 8660401 8714717 8598973 8639297 8987068 9111173 9232318 9348882 9530983 9687477
12068I687477J64415K14418L3485Q9502J17744o7281J57150K48554K40031J55177
$$ 9687477 9851892 10066310 10099795 10189297 10307041 10239760 10396910 10645464 10885495 11040672
12058A1040672L3890M6290n1096K70657L85586K40676L3226J30683K81328L48036
$$ 11040672 11074562 11120852 11069756 11340413 11725999 11966675 11999901 12130584 12411912 12759948
12048A2759948L18091K54113K43981J58718m9386Q4364L26017L53461K91158J89288
$$ 12759948 13078039 13332152 13576133 13734851 13685465 13769829 14095846 14449307 14740465 14929753
12038A4929753K40442J96891J52356M52484L97279L17661L98650K76673J63236
$$ 14929753 15170195 15367086 15519442 15971926 16369205 16686866 17085516 17362189 17525425
12029A7525425L48229K75544L87679K85719K18484K25757M51975N08606L20533
$$ 17525425 17873654 18149198 18536877 18822596 19041080 19266837 19718812 20227418 20547951
12020B0547951L75160L70885L59399M94097M90122O53960O26818M28324L69615
$$ 20547951 20923111 21293996 21653395 22147492 22637614 23291574 23918392 24346716 24716331
12011B4716331N57925L93707L54002M77771O22960Q11442Q50197N97782M57515
$$ 24716331 25274256 25667963 26021965 26499736 27122696 27934138 28784335 29382117 29839632
12002B9839632P00422P01990O20948P48442Q58003Q06052Q40070P90705J134396
$$ 29839632 30540054 31242044 31862992 32611434 33469437 34275489 35115559 35906264 37040660
11993C7040660J010012R98092J088433J132634J040698J066968R52337J217512
$$ 37040660 38050672 39048764 40137197 41269831 42310529 43377497 44329834 45547346
11985D5547346J399503J343321J438656J415142J480668J505305J629649J776315
$$ 45547346 46946849 48290170 49728826 51143968 52624636 54129941 55759590 57535905
11977E7535905J683587J565823J729649J868667K126865K322997K246717K354003
$$ 57535905 59219492 60785315 62514964 64383631 66510496 68833493 71080210 73434213
11969G3434213K350624K301626K312519K548062K762833K875879K800677L009910
$$ 73434213 75784837 78086463 80398982 82947044 85709877 88585756 91386433 94396343
11961I4396343L165961L199377L474307L416941L440349L600748L745715L919260
$$ 94396343 97562304 100761681 104235988 107652929 111093278 114694026 118439741 122359001
11953A22359001L962106L752716L882205M071507M194196M323164M510683M494428
$$ 122359001 126321107 130073823 133956028 138027535 142221731 146544895 151055578 155550006
11945A55550006M412808M148647L957852M040150L929789L779070L625733L397739
$$ 155550006 159962814 164111461 168069313 172109463 176039252 179818322 183444055 186841794
11937A86841794L099510K859683K491656J942118J970592J775475J031035P06531
$$ 186841794 189941304 192800987 195292643 197234761 199205353 200980828 202011863 202718394
11929B02718394L50912l03748o69201j213955j454832j755289k031751k467776
$$ 202718394 203069306 202765558 202096357 200882402 199427570 197672281 195640530 193172754
11921A93172754l044501l067542l261802l605365l886698m132214m006513l961049
$$ 193172754 190128253 187060711 183798909 180193544 176306846 172174632 168168119 164207070
11913A64207070l986606m199935m230046m200429m138142m158867m134520m103236
$$ 164207070 160220464 156020529 151790483 147590054 143451912 139293045 135158525 131055289
11905A31055289l961920m087062l912684l664662l749106l523554l224095l155058
$$ 131055289 127093369 123006307 119093623 115428961 111679855 108156301 104932206 101777148
11897A01777148l055104l175948l029033l015842k799585k707467k684490k458838
$$ 101777148 98722044 95546096 92517063 89501221 86701636 83994169 81309679 78850841
11889G8850841k499981k377443k247372k002145j958331k049200j992292j939963
$$ 78850841 76350860 73973417 71726045 69723900 67765569 65716369 63724077 61784114
11881F1784114j915459j803189j748884j731627j446439j376397j424382j323311
$$ 61784114 59868655 58065466 56316582 54584955 53138516 51762119 50337737 49014426
11873D9014426j309977j387383j278943j041080r46222j028177j114500j281819
$$ 49014426 47704449 46317066 45038123 43997043 43050821 42022644 40908144 39626325
11865C9626325j064998j027578q41436r12345r57976p53853q03399o72986q19467
$$ 39626325 38561327 37533749 36692313 35779968 34821992 34068139 33264740 32591754 31772287
11856C1772287o95383n49202n26697p03212r00036p11102n51677o48083p30083
$$ 31772287 31076904 30527702 30001005 29297793 28397757 27686655 27134978 26486895 25756812
11847B5756812n15727l11776l27646n20134m62440m07371m83731o94895m76699
$$ 25756812 25241085 24929309 24601663 24081529 23619089 23211718 22727987 22033092 21556393
11838B1556393l81231m92345m49954k56713k50974n10619m20383k24232l12837
$$ 21556393 21175162 20682817 20232863 19976150 19725176 19214557 18794174 18569942 18257105
11829A8257105l51807k99325m67891l24671K2237l15280l62344k12319k02219
$$ 18257105 17905298 17605973 17138082 16813411 16835648 16520368 16158024 15945705 15743486
11820A5743486l75636k70369l16558l90475k50691j37358k69621k93548k79963
$$ 15743486 15367850 15097481 14780923 14390448 14139757 14002399 13732778 13439230 13159267
11811A3159267k20835j38082j20326k02826j83472n4092r7862k67993l06020j67269
$$ 13159267 12938432 12800350 12680024 12477198 12293726 12239634 12141772 11873779 11567759 11400490
11801A1400490k36056m0054M1989k95086k93389j1998n3205j09363k46814l27554
$$ 11400490 11164434 11124380 11166369 10871283 10577894 10565896 10512691 10403328 10156514 9828960
11791I828960k18239k04503j17080q3028o1961m3555j80035j86803j47816r737
$$ 9828960 9610721 9406218 9289138 9206110 9144149 9100594 8920559 8733756 8585940 8576203
11781H576203n3986j21522j65453r2999J952j17879k84841j72087n3044j29321
$$ 8576203 8522217 8400695 8235242 8142243 8144195 8026316 7741475 7569388 7516344 7387023
11771G387023m2114j05346J65280r4490p6309o4087j74179k73347j77476m4057
$$ 7387023 7344909 7239563 7404843 7310353 7234044 7169957 6995778 6722431 6544955 6500898
11761F500898l0148M9243k13772r9987m8036q8964N2552p1749j26616q2423R0411
$$ 6500898 6470750 6519993 6306221 6206234 6158198 6069234 6121786 6050037 5923421 5840998 5931409
11750E931409k46533j18785j14203N8198Q1329n9553N4982q9401M7790J06795
$$ 5931409 5684876 5566091 5451888 5510086 5591415 5531862 5586844 5497443 5545233 5652028
11740E652028j66974r8036n731r3837Q8678J00839p3699q8055j48310j79128n1063
$$ 5652028 5485054 5387018 5381287 5287450 5376128 5476967 5403268 5315213 5166903 4987775 4936712
11729D936712M1729M1773k0157k23050P049J66186q7503p2690j9744L7659k8841
$$ 4936712 4978441 5020214 5000057 4777007 4784056 4950242 4862739 4790049 4770305 4807964 4779123
11718D779123p376j5923p0149j74878k32118r6541P0417j5435l3121K512k21591
$$ 4779123 4771747 4755824 4685675 4510797 4278679 4182138 4252555 4237120 4203999 4206511 3984920
11707C984920j7644J53568j46376L9591J05161j17558j4096l3043k9293M5829
$$ 3984920 3967276 4120844 3974468 4014059 4119220 4001662 3987566 3954523 3925230 3971059
11697C971059L6612j35776j93185O0482k2871l7699J00878k28799j17047j20516
$$ 3971059 4007671 3871895 3678710 3739192 3716321 3678622 3779500 3550701 3433654 3313138
11687C313138j86640J741n7413j10862N4078m4267Q9373O9060K28309J54581m6959
$$ 3313138 3126498 3128239 3070826 2959964 3014042 2969775 3059148 3128208 3356517 3511098 3464139
11676C464139j33218r4760P7574K3688k22699j12787o9712o71P6927o0104j66884
$$ 3464139 3330921 3236161 3313735 3337423 3114724 3001937 2932225 2931554 3008481 2948377 2781493
11665B781493j60251p3374J4470J11851K06023N6089m2344q024k35867n2930J40813
$$ 2781493 2621242 2547868 2562338 2674189 2880212 2936301 2893957 2885933 2650066 2597136 2737949
11654B737949K09646J6517p4333j31655k17979p6589j4009K281j80690M2782k1085
$$ 2737949 2947595 2964112 2889779 2758124 2540145 2463556 2449547 2451828 2271138 2313920 2292835
11643B292835m6730M5350K47187J83402J0175q0618j3976j07105j5014j06256
$$ 2292835 2246105 2291455 2538642 2722044 2732219 2651601 2637625 2530520 2515506 2409250
11633B409250k07403p705J63921k5858p6936j5948n1505o7028j09645P9937M4528
$$ 2409250 2201847 2194142 2358063 2332205 2255269 2239321 2187816 2120788 2011143 2091080 2135608
11622B135608j7404m7237L6511m0605k0310J4010K11227K5018j96419r5350k27607
$$ 2135608 2118204 2070967 2107478 2066873 2046563 2060573 2271800 2296818 2100399 2005049 1777442
11611A777442P2850J74253J82773k2370M7479p7338o7653r9640o6863j09061n2267
$$ 1777442 1850292 2024545 2207318 2184948 2232427 2155089 2087436 1987796 1920933 1811872 1759605
11600A759605J35622J4957q9778j33795Q4331o7128l6932R7945N2555P2180j61728
$$ 1759605 1895227 1910184 1820406 1686611 1770942 1703814 1666882 1764827 1817382 1889562 1727834
11589A727834O2282J07663L2183r2682n398q6831L520k8203j36785o3500K1355
$$ 1727834 1790116 1897779 1929962 1837280 1831882 1745051 1748571 1720368 1583583 1520083 1541438
11578A541438M8854J35683l3895n891n609L6369j06005J0764J59379o6027r7494
$$ 1541438 1590292 1725975 1692080 1686189 1680580 1716949 1610944 1621708 1781087 1715060 1617566
11567A617566m85M4591l4674L0616j78556j21118r9632l9996L8744k2022j11531
$$ 1617566 1617081 1661672 1626998 1657614 1479058 1357940 1258308 1218312 1257056 1235034 1123503
11556A123503L5883m80k7062K12076Q7549p0077J17241J4065n3216j10056R3639
$$ 1123503 1159386 1158906 1131844 1343920 1431469 1361392 1478633 1492698 1439482 1329426 1423065
11545A423065M706j28783r6321j33785j86083L8077P0234N220j3829K6469k2058
$$ 1423065 1427771 1298988 1202667 1068882 882799 920876 991110 996330 982501 1008970 986912
11534I86912J6215K22448J44364r4122q4015l2047o2538Q1332j7828r634r8532
$$ 986912 1003127 1225575 1369939 1275817 1191802 1159755 1097217 1178549 1160721 1151087 1052555
11523A052555P0397P479p2568j44330N318J45890n153l4192j3909Q2572Q2446
$$ 1052555 1122952 1130431 1057863 913533 918851 1064741 1059588 1025396 1011487 1094059 1176505
11512A176505j49816j47223M1119J57840L4123L2772k08247j91884L1645J965
$$ 1176505 1026689 879466 920585 1078425 1112548 1145320 937073 745189 776834 778799
11502G78799R6869K76323J19528N4712j78972j01533l4729r8326k6130M2620j7582
$$ 778799 875668 1151991 1271519 1326231 1147259 1045726 1010997 912671 886541 929161 911579
11491I11579J59181k7124j41900r8946J59181K11519J96816Q315j55446j15476
$$ 911579 1070760 1043636 901736 802790 961971 1173490 1370306 1378621 1223175 1107699
11481A107699m0022o0929j95262J2852J48277j09954k7407M8231N9602r3171q8205
$$ 1107699 1067677 1006748 811486 824338 972615 862661 835254 883485 943087 849916 761711
11470G61711n0502J54354k135j71667j61340j3151Q6045r2111J80394J02310L7755
$$ 761711 711209 865563 863428 691761 530421 517270 603315 511204 691598 793908 831663
11459H31663K3846Q2894J90998J05283j59226j14120R6543o3795j77563j01031
$$ 831663 855509 938403 1129401 1234684 1075458 961338 1057881 994086 816523 715492
11449G15492j07484Q8847J87416J99472k23189m1750L0231j64259j19359J05957
$$ 715492 608008 696855 884271 1083743 860554 818804 849035 684776 565417 671374
11439F71374J69235K9009j02438j26298j9881J11689J29708m5193m7766J645K1433
$$ 671374 840609 869618 767180 640882 621001 732690 862398 817205 769439 771084 792517
11428G92517L5401L3965m5759N0998K6393j76848r4733R3845o6802n5304o8546
$$ 792517 827918 861883 816124 867122 893515 716667 621934 715779 648977 593673 525127
11417E25127L7100R3338l2450p6484L8638J82292Q3774r3631k9257O4055j48315
$$ 525127 562227 655565 623115 546631 585269 767561 851335 757704 728447 792502 644187
11406F44187k18774J3331J30288J03121j3997O3501Q8438P1371j78795l01544
$$ 644187 425413 438744 569032 672153 658156 721657 810095 881466 702671 401127
11396D01127j09837J71616J9440J4479J11328l9095J0461j47458J8587k9672J3642
$$ 401127 291290 462906 482346 496825 608153 569058 579519 432061 450648 420976 434618
11385D34618K09552J82570O18r1815q5100o0059R6623Q9930J18k3266j72247n0287
$$ 434618 644170 826740 827358 735543 650443 590384 687007 776937 777055 753789 581542 531255
11373E31255N3225K10412M2640j70866j51185N4330Q3714L3952L6053K1840q9684
$$ 531255 584480 794892 837532 666666 515481 569811 653525 687477 723530 745370 655686
11362F55686l065j39980k8163J01323N452r8324k6004N9201P5658j41457j43861
$$ 655686 652621 512641 484478 585801 591253 492929 466925 526126 601784 460327 316466
11351C16466Q2344N3779O6852l3445j0710J31477R639j0535l9927K6438r9929
$$ 316466 398810 452589 519441 485996 475286 606763 616402 605867 565940 592378 492449
11340D92449K5524K2417j6580L7203n9274P9929j01492L2805J5911n972O4095
$$ 492449 517973 540390 523810 561013 501739 581668 480176 512981 528892 522920 587015
11329E87015m2337r7732m8885O7341Q0196j46202J23870l4669q6860R0876J53123
$$ 587015 544678 446946 398061 465402 545598 399396 523266 488597 401737 492613 645736
11318F45736q3249l9725j34702j61479N9093R7449J09708q610j03737K5328P0580
$$ 645736 562487 522762 388060 226581 285674 383123 492831 484221 380484 405812 476392
11307D76392M9627j47061J91611Q0979O5983J18012k00413k21790P8265J36306
$$ 476392 526019 378958 570569 651548 717531 835543 635130 413340 491605 627911
11297F27911K5212k24490k10266r4276J81658L7484k8296J33101Q2934J74418
$$ 627911 653123 428633 218367 124091 305749 343233 314937 448038 530972 705390
11287G05390m8943k04051j05941J26774M3392m5405k1550j5912o8706J60607L437
$$ 705390 656447 452396 346455 473229 516621 471216 449666 433754 365048 525655 529092
11276E29092K8666j53837j65733L4644q243O3926o5202L2718K3892O8059R4901
$$ 529092 557758 403921 238188 272832 264589 328515 263313 296031 319923 387982 482883
11265D82883N2361q4991o9484p5327j13003k9067j43603N3208J03543N02J0595
$$ 482883 535244 450253 380769 305442 192439 163372 19769 72977 176520 177022 187617
11254A87617P7771N1883j27761L461j6550P4517N2780J44489q1591J51749J60985
$$ 187617 265388 317271 189510 192971 176421 250938 303718 448207 366616 518365 679350
11243F79350j34105k13493K9186M1237j19206r5565j1570J38913P2258r5707n1328
$$ 679350 545245 331752 360938 402175 282969 187404 175834 314747 387005 291298 239970
11232B39970J59739j5379P5360p3413m5086j71268K21307K48152k69486l84054
$$ 239970 399709 384330 459690 386277 341191 169923 391230 639382 369896 -14158
11222a4158n6347J29189J52331n0626j95949Q9646J43181m6166r3752N8166J4095
$$ -14158 -70505 58684 211015 160389 -35560 54086 197267 151101 57349 115515 129610
11211A29610k9803K3264L6565l1221R100n8787m7035J27636J83786o3627p0744
$$ 129610 99807 123071 159636 128415 137515 78728 31693 159329 343115 279488 208744
11200B08744O1481j14967k4120k5000J2346j9405J69421J71726J23603q9185k88096
$$ 208744 270225 155258 131138 106138 118484 99079 268500 440226 563829 474644 186548
11189A86548n5719J50026L2593o4897m2004P9820m4300m7126R8183j27142k783
$$ 186548 130829 280855 313448 248551 206547 286367 242067 194941 293124 165982 163199
11178A63199J91286Q9729p0352j02882n8726M4067j2499O1332M5751n0555p4248
$$ 163199 354485 444214 373862 270980 212254 256321 243822 305154 350905 300350 226102
11167B26102n8335J59210M4612j31388o8216n2516l7547P938N8053Q1559J99326
$$ 226102 167767 326977 371589 240201 171985 119469 81922 89860 147913 229472 428798
11156D28798o0040k21465o4996J08430J42460J24392o878j61946m3896j41639
$$ 428798 368758 147293 82297 190727 333187 457579 450701 288755 244859 103220
11146A03220M9750P1615j57092k17905l8497J78474K92614Q7804K5671r0422O9439
$$ 103220 152970 224585 67493 -150412 -188909 -10435 282179 369983 395654 305232 374671
11135C74671m5028L1527M5339J38296J80226m9391l14028k36468n1793K616J48891
$$ 374671 329643 361170 406509 544805 725031 675640 361612 125144 73351 75967 224858
11124B24858R5781n2897j82001R6405M7129m2837k3899N7442n8743j2716K9112
$$ 224858 320639 267742 85741 182146 229275 186438 162539 219981 161238 148522 177634
11113A77634M230p9078J37912K57838J06360j36440j92226m3394o9674L2186L9076
$$ 177634 181864 102786 240698 498536 604896 468456 276230 232836 163162 195348 234424
11102B34424j38146N2108m4396L4733Q4573L145r2558Q1965P9762L3980q267p2046
$$ 234424 96278 148386 103990 138723 223296 226441 133883 215848 295610 329590 321323 249277
11090B49277J19032j79173L9648J92680j38150r1547q9003J29390K32004N9198
$$ 249277 368309 189136 228784 421464 283314 191767 102764 232154 464158 523356
11080E23356j27952k58028j76099J37330N4175o8841k8518M4998j78700j08050
$$ 523356 395404 137376 -38723 98607 152782 83941 55423 100421 -78279 -186329
11070a86329j9614M1054n9549J12557J41287J011n1161J81922J77261J84042M818
$$ -186329 -205943 -164889 -224438 -111881 29406 30417 -20744 161178 338439 522481 527299
11059E27299j18309q2344J517j02364k39428j4844M2917m455Q8423J02160J12174
$$ 527299 408990 326646 328163 225799 -13629 -28473 14444 9989 98412 200572 312746
11048C12746p3292R9027O3250p3903j54816q6824o531J2611J62711M8360M1526
$$ 312746 239454 338481 401731 327828 173012 86188 79657 92268 254979 303339 344865
11037C44865J72172O4349J41205J46566J46772j35095j38248L8394j06014k8499
$$ 344865 517037 581386 722591 869157 1015929 880834 742586 780980 674966 646467
11027F46467J96894J46045J05318P182m1572j07847M951k8216k3037l5427R3168
$$ 646467 843361 989406 1094724 1101906 1060334 952487 957438 929222 906185 870758 963926
11016I63926J59373n0341J18578L35468M3010p8147L853k65683k76583j33389
$$ 963926 1123299 1072958 1191536 1527004 1570014 1491867 1495720 1230037 953454 820065
11006H20065N3312J62840N6040k7154Q5782R8563j10077o3306j83554j02626l46154
$$ 820065 873377 1036217 1092257 1065103 1150885 1249448 1139371 1076065 892511 789885 443731
10995D43731j99041p1228J43463K63240Q0528m3979q3222q5636o0048k7314o113
$$ 443731 244690 173462 316925 580165 660693 616714 533492 447856 387808 360494 354381
10984C54381j23861j08670j1087Q842O2596m1005J3673L4910j8549j98810K1041
$$ 354381 230520 121850 110763 119605 182201 141196 154869 189779 171230 -27580 -6539
10973f539j81912O3399J38197P4596k44411k3835J72118J68341q8049j05488L6560
$$ -6539 -188451 -125052 13145 87741 -156670 -180505 -8387 159954 71905 -33583 2977
10962B977P023J1869P7432M8345m5199N0798K4082j14155l5295L0531J50263J13236
$$ 2977 10000 21869 99301 147646 102447 153245 177327 63172 27877 58408 208671 321907
10950C21907k24391o4185Q8803j85628K7467r4260J2136Q6729O5784O442J85521
$$ 321907 97516 33331 122134 -63494 -36027 -130287 -118151 -31422 34362 40804 226325
10939B26325K14420j51976j47732l4576O6Q841O8446o1606q2050K04179J53865
$$ 226325 440745 288769 141037 106461 106527 115368 183814 122208 40158 244337 398202
10928C98202J60154p8240j75403m2643P764J7860r5425K9370l9319o8405j05711
$$ 398202 558356 480116 304713 262070 269834 287694 192269 221639 182320 113915 8204
10917H204j14948J10185J48157J0229l405j12897M8148P5808o8072q8081q3438
$$ 8204 -106744 3441 151598 161827 158422 45525 93673 169481 101409 13328 -70110
10906g0110q2984J81029o8644j41798J40069J59804l2881m1340Q8146J7147k51521
$$ -70110 -153094 27935 -40709 -182507 -42438 117366 84485 43145 131291 148438 -103083
10895a03083l5343K07745j2638k20247j83349R2302J98862J47420M3413k5932
$$ -103083 -138426 69319 56681 -163566 -346915 -254613 -55751 91669 135082 109150
10885A09150p7170P2643n5528m8466K7662j63744j06105K27401k2782q1198j06855
$$ 109150 31980 104623 49095 629 28291 -135453 -241558 -14157 -36939 -118137 -224992
10874b24992J65117J77136N6153o7602j53440M9335J43546N971m6317l1223j1959
$$ -224992 -59875 117261 173414 105812 -47628 1707 145253 151224 104907 73684 61725
10863F1725N7575J73859J6667j29326O6615P0096n8646j10838j54220O334l9154
$$ 61725 119300 293159 309826 180500 247115 317211 258565 147727 -6493 -159 -39313
10852c9313J00880K00961R4084j82802j5758J9627K3923m8280K3883l271k165
$$ -39313 61567 262528 356612 173810 158052 177679 201602 153322 177205 173934 171769
10841A71769k7027p0852j7137r6050k7016P3999M2679Q6648j86160j78658J38381
$$ 171769 144742 73890 56753 -39297 -66313 7686 50365 137013 -49147 -227805 -89424
10830h9424o6962K4712K22314N6490j09808K9081j06705j00639O1637j3732j88675
$$ -89424 -156386 -131674 90640 147130 37322 66403 -40302 -140941 -79304 -93036 -281711
10819b81711k5748J15120Q2481R4744j63100L9775P4306R8901O3182j25156p6221
$$ -281711 -307459 -192339 -109858 -15114 -178214 -138439 -64133 34768 97950 -27206 -103427
10808a03427L8477p5820J9917R7801N4303O6834o5669k0179J0346p7826k9324
$$ -103427 -64950 -140770 -120853 -23052 31251 98085 32416 12237 22583 -55243 -84567
10797h4567O322j4577N1349j48518J6711j2705N7673m1970R0214K33l7627j24057
$$ -84567 -78245 -92822 -41473 -189991 -173280 -185985 -128312 -170282 -80068 -79835 -117462 -241519
10785b41519o5910J8865P2671J57575K67813J04009r5933j88233O4679K00930
$$ -241519 -307429 -288564 -215893 -58318 209495 313504 217571 29338 94017 294947
10775B94947j6317j25806q0057O6716r654j04252j8918M6770J59553j12817q3052
$$ 294947 278630 152824 72767 139483 129829 25577 6659 53429 212982 100165 17113
10764A7113J009k9041j14388J35499J2409J32141J24400n1438J22200k3883j7019
$$ 17113 18122 -10919 -125307 10192 22601 154742 279142 227704 349904 326021 309002
10753C09002k686q5533l9225n6606n1783M6719R9157l1470r5977J30899R3752
$$ 309002 306316 220783 181558 124952 73169 119888 219045 187575 91598 222497 316249
10742C16249q6065l2551n7684P2834K8752j8208N0762J33809R1418P1043p8615
$$ 316249 230184 197633 139949 212783 241535 223327 274089 407898 499316 570359 491744
10731D91744K310J18158j26082n1497j82104O6071P9327R616o6796l3983k6636
$$ 491744 494054 612212 486130 434633 252529 318600 397927 407543 340747 306764 280128
10720B80128o4782K9296l4291J87928j44660k29351r9700l0893j5797J29006O1834
$$ 280128 215346 244642 210351 398279 253619 24268 -75432 -106325 -122122 6884 68718
10709F8718k6911J05230k2712q2966j67468J73836K38345j27541j66861M4848
$$ 68718 41807 147037 124325 41359 -126109 47727 286072 158531 -8330 36518
10699C6518J88315J9049m3563L7902j01511j79990M4731q464K4211P4298N6201
$$ 36518 224833 243882 200319 238221 136710 -43280 1451 -7013 17198 91496 147697
10688A47697P0740P4290n3641j28941J21310O4237J6550K0950J41046j55944J43847
$$ 147697 218437 292727 239086 110145 231455 295692 312242 333192 474238 318294 462141
10677D62141l6967j40465O5611K3323k0694j47210j27777j14974Q8192Q3940J81726
$$ 462141 425174 284709 350320 373643 352949 205739 77962 -37012 51180 135120 316846
10666C16846L3720o8376q9353Q125J27318j6246m5189J60052P5024k861j54235
$$ 316846 350566 282190 192837 200962 328280 312034 266845 426897 501921 499060 344825
10655C44825p4628O1747O2245K0007N5238j15832j523R2721M5698J86502Q9818
$$ 344825 270197 331944 394189 414196 469434 353602 352079 444800 490498 677000 766818
10644G66818O0412R9908M0250O6133M5341j72894J7617L3525Q2533n4212J44273
$$ 766818 827230 927138 967388 1033521 1078862 905968 923585 957110 1039643 985431 1129704
10633A129704K27521M7778R0341J90360J66680M9803K51675L24920M67481M36811
$$ 1129704 1357225 1405003 1495344 1685704 1852384 1902187 2153862 2478782 2946263 3383074
10623C383074M90595M14090M51099M39825P08046P99360J187521J386170J837307
$$ 3383074 3873669 4287759 4738858 5178683 5886729 6686089 7873610 9259780 11097087
10614A1097087K703798L991264N459510P313494R629683J1550339J2335291J0346903
$$ 11097087 13800885 17792149 23251659 30565153 40194836 51745175 64080466 74427369
10606G4427369N904884J155723k490748l665539k209694R62837N672688J1145806
$$ 74427369 80332253 81487976 78997228 75331689 73121995 74084832 79757520 90903326
10598I0903326J7365475K2801729K4401663J8738486O903390n217412j2941902
$$ 90903326 108268801 131070530 155472193 174210679 181114069 175896657 162954755
10591A62954755j4712563j1154834m169620M117194J3252740K2550191K9524716
$$ 162954755 148242192 137087358 132917738 137034932 150287672 172837863 202362579
10584B02362579K9580803J8851989P05814j6758269k6800023k8345046k3176942
$$ 202362579 231943382 250795371 251501185 234742916 207942893 179597847 156420905
10577A56420905j5023548o052309K403461J0099438J5049954J4417520O592275
$$ 156420905 141397357 135345048 137748509 147847947 162897901 177315421 183907696
10570A83907696n998417j7124528k2790457k2553091j8333813j2629933o891449
$$ 183907696 177909279 160784751 137994294 115441203 97107390 84477457 77586008
10563G7586008j788567J903075L756161K930563n42442n642349r853231j1579321
$$ 77586008 75797441 77700516 81456677 84387240 83844798 78202449 68349218 56769897
10555E6769897j1383534r864290p827718n820787m226039l175508k211549j679285
$$ 56769897 45386363 35522073 27694355 21873568 17647529 14472021 12260472 10581187
10547A0581187j217254r79797o80198n90830o80183o19063m56310l19859n21326
$$ 10581187 9363933 8384136 7703938 7113108 6432925 5813862 5357552 5037693 4516367
10538D516367m33285k06150J423l15352p7960j1551k10384m20372k22223j06702
$$ 4516367 4083082 3876932 3878355 3563003 3485043 3473492 3263108 2842736 2620513 2513811
10528B513811j42204j13491k47940o7103j1023j2662M1885L1171m149q6045k01301
$$ 2513811 2371607 2258116 2010176 1943073 1932050 1919388 1961273 1992444 1988295 1902250 1700949
10517A700949j39662J20046L6425j57945p9142q3329Q8380j7815j20380j2355
$$ 1700949 1561287 1681333 1717758 1559813 1480671 1397342 1485722 1467907 1347527 1335172
10507A335172j13112K0022K8885p4650j33050L8108j08530M5488m5498J91241
$$ 1335172 1222060 1242082 1270967 1196317 1063267 1101375 992845 1038333 992835 1184076
10497A184076M1469o7928j28115j9664l7943K6151M2568P1362j70730r5892N4513
$$ 1184076 1225545 1157617 1029502 1009838 971895 998046 1040614 1111976 941246 845354 899867
10486H99867j3330n7576o0728j35365j5572M7303J50400o3971l2509k605J1843
$$ 899867 886537 828961 768233 632868 617296 664599 814999 751028 718519 715914 727757
10475G27757m1046J14618J5596j23179Q870m9740k02627M9653J94673l1893P3546
$$ 727757 686711 801329 816925 693746 702616 652876 450249 499902 694575 662682 736228
10464G36228n2590j49148K971j9457r8361q7502m5811M9033o6110p075n8762J08020
$$ 736228 683638 534490 537461 518004 419643 332141 286330 335363 269253 262178 203416 311436
10452C11436O7384J130J0597O0224k5415J1636Q8734J23034r9037k6421n0819
$$ 311436 378820 379950 390547 450771 425356 436992 525726 648760 549723 523302 472483
10441D72483k47540K0863K2208O4194P7818N6889k8178j02405M999N1897O7319
$$ 472483 224943 245806 268014 332208 410026 466915 438737 336332 341331 393228 460547
10430D60547n4069J24350l585j08295K1651j37333r3845J19735M4158k4032k3829
$$ 460547 406478 530828 527243 418948 440599 303266 209421 329156 373314 349282 325453
10419C25453L2565j08540j633L1623J00476m3024k4763N1685n7835q8746k7188
$$ 325453 358018 249478 247845 279468 379944 336920 312157 363842 306007 217261 190073
10408A90073Q6641J46486m8969j92286j44098r0853l1690K16686J11873p7258
$$ 190073 276714 423200 374231 181945 37847 -53006 -84696 131990 243863 166605
10398A66605N5619p802o4262M6168R9356K01124J89656m1784J67958Q6281j86078
$$ 166605 222224 214422 150160 196328 295684 496808 686464 644680 812638 898919 712841
10387G12841l01772j83733J54648R8290j44278j05022J83338P6772Q2367J13115
$$ 712841 411069 227336 381984 480274 335996 230974 414312 491084 573451 686566
10377F86566j40619k0274P2341q9520M773K61511J64630J74884J76388K26544
$$ 686566 545947 525673 598014 508494 513267 774778 939408 1114292 1290680 1517224
10367A517224L56639M53220N59792M38684M40403L84149K81511J64850j2178j94154
$$ 1517224 1873863 2327083 2886875 3325559 3765962 4150111 4431622 4596472 4584294 4390140
10357D390140k53464m60428l20767q9796j74219k21862k79353j14656j92724l93881
$$ 4390140 4136676 3676248 3355481 3265685 3091466 2869604 2590251 2475595 2282871 1888990
10347A888990l92233j7055k5498k54854l4292j14182l5764R1844j12642r3266
$$ 1888990 1496757 1479702 1454204 1199350 1165058 1050876 1015112 1106956 994314 901048
10337I01048k18903l6659J58249J21399O7888l8036o6362j31327j42058j45612
$$ 901048 682145 645486 803735 925134 993022 954986 888624 757297 615239 469627
10327D69627L5234l4257m3688j25907j13392o1725O6624Q8172L6209N3787J08285
$$ 469627 504861 470604 426916 301009 187617 125892 192516 280688 316897 370684 478969
10316D78969j68800k51820k6491J33479J6173j39506j36547K94222J68710j39981
$$ 478969 310169 58349 31858 165337 181510 42004 -94543 199679 368389 228408
10306B28408k5726P9877M2016j4205q6043L4894n9503J36335J67071J53692j29373
$$ 228408 202682 282559 324575 310370 224327 259221 199718 336053 503124 656816 527443
10295E27443j97548P9172J05282n6093k27818j7753j01401p6312l5597K00338
$$ 527443 329895 409067 514349 458256 230438 212685 111284 34972 -625 199713
10285A99713K34086Q2897k8106O9889K8727j5528j34590r8121M4248N8294n1072
$$ 199713 433799 516696 488590 558479 587206 571678 437088 338967 383215 441509 390437
10274C90437L0441l3047j85536L3155J81792O2063n1109q886K04064K22071L45781
$$ 390437 420878 387831 202295 235450 417242 479305 428196 419310 623374 845445 1191226
10263A191226K60244L52606N18910L38388J99932L1978m932j39171k73937k15234
$$ 1191226 1451470 1804076 2322986 2661374 2861306 2893284 2888352 2749181 2475244 2260010
10253B260010l41795l55137k02009k23887j46222n8704p3422j97324n1983r8178
$$ 2260010 1918215 1563078 1361069 1137182 990960 932256 858834 661510 609527 511349
10243E11349r1097j39739j28810q3671o7066J98514L7059r9662m4150J01813j49909
$$ 511349 420252 280513 151703 68032 966 199480 236539 136877 92727 194540 44631
$$ [...]
##END NTUPLES=NMR SPECTRUM
##END=
