##TITLE=Analysis number 316424
Compound Code cc 45409
Book Reference 440/128/5
Project Code adrs
Chemist Name craigr
##JCAMPDX= 6.0         $$ Bruker NMR JCAMP-DX V2.0
##DATA TYPE= NMR SPECTRUM
##DATA CLASS= NTUPLES
##ORIGIN= Bruker BioSpin GmbH
##OWNER= nmr
$$ XWIN-NMR		Version 3.5
$$ Fri Jan 13 10:10:19 2006 GMT Standard Time (UT+0h)  MAYBRIDGE\nmr@NMR_250MHZ
##.OBSERVE FREQUENCY= 250.131544655141
##.OBSERVE NUCLEUS= ^1H
##.ACQUISITION MODE= SIMULTANEOUS (DQD)
##.ACQUISITION SCHEME= undefined
##.AVERAGES= 16
##.DIGITISER RES= 18
##SPECTROMETER/DATA SYSTEM= dpx250
##.PULSE SEQUENCE= zg30
##.SOLVENT NAME= CDCl3
##.SHIFT REFERENCE= (INTERNAL, CDCl3, 0, 16.522)
##AUDIT TRAIL= $$ (NUMBER, WHEN, WHO, WHERE, WHAT)
$$ ##TITLE= Audit trail, XWIN-NMR		Version 3.5
$$ ##JCAMPDX= 5.01
$$ ##ORIGIN= Bruker BioSpin GmbH
$$ ##OWNER= nmr
$$ C:\u/data/dgb/nmr/ADRS/14580/pdata/1/auditp.txt
$$ ##AUDIT TRAIL=  $$ (NUMBER, WHEN, WHO, WHERE, WHAT)
(   1,<2006-01-13 10:09:54.64 +000>,<MAYBRIDGE\nmr>,<NMR_250MHZ>,
      <created by zg, POWCHK disabled, PULCHK disabled
       configuration hash MD5:
       62 19 C7 07 E1 42 D1 B7 37 6C 3D D0 77 39 F9 E6
       data hash MD5: 64K
       2C 91 0A 7D 0C 39 1A 4B F6 CD 8D A1 E4 83 01 D8>)
(   2,<2006-01-13 10:10:09.82 +000>,<MAYBRIDGE\nmr>,<NMR_250MHZ>,
      <Start of raw data processing
       ef LB = 0.3 FT_mod = 6 PKNL = 1 SI = 32K 
       data hash MD5: 32K
       C1 C8 AC 2B 7C 7C 8A FD 04 E1 54 83 D1 F5 41 9D>)
(   3,<2006-01-13 10:10:11.82 +000>,<MAYBRIDGE\nmr>,<NMR_250MHZ>,
      <apk 
       data hash MD5: 32K
       FB 50 85 36 57 C6 3C 0E 85 14 D7 EA 95 A3 6C BB>)
(   4,<2006-01-13 10:10:12.67 +000>,<MAYBRIDGE\nmr>,<NMR_250MHZ>,
      <abs ABSG = 5 
       data hash MD5: 32K
       A3 46 0D 75 A8 C9 F5 E4 AF E4 B2 81 3E 0C 1B D4>)
$$ ##END=
$$ 
$$ hash MD5
$$ 7F 46 0C E4 F3 A5 D5 7E 57 E1 77 56 3B 42 4D 0A
##$RELAX= 
##$RELAX= 
##$RELAX= 
##$RELAX= 
##$RELAX= 
##$RELAX= 
##$RELAX= 
$$ Bruker specific parameters
$$ --------------------------
##$DU= <C:\u>
##$EXPNO= 14580
##$NAME= <ADRS>
##$PROCNO= 1
##$TYPE= <nmr>
##$USER= <dgb>
##$AMP= (0..31)
100 100 100 100 100 100 100 100 100 100 100 100 100 100 100 100 100 100 
100 100 100 100 100 100 100 100 100 100 100 100 100 100 
##$AQSEQ= 0
##$AQ_mod= 3
##$AUNM= <au_zg>
##$AUTOPOS= <54 >
##$BF1= 250.13
##$BF2= 250.13
##$BF3= 250.13
##$BF4= 250.13
##$BF5= 500.13
##$BF6= 500.13
##$BF7= 500.13
##$BF8= 500.13
##$BYTORDA= 1
##$CFDGTYP= 0
##$CFRGTYP= 5
##$CHEMSTR= <none>
##$CNST= (0..31)
1 1 145 1 1 1 1 1 1 1 1 1 1 1 1 1 1 1 1 1 1 1 1 1 1 1 1 1 1 1 1 1 
##$CPDPRG= <>
##$CPDPRG1= <>
##$CPDPRG2= <>
##$CPDPRG3= <>
##$CPDPRG4= <mlev>
##$CPDPRG5= <mlev>
##$CPDPRG6= <mlev>
##$CPDPRG7= <mlev>
##$CPDPRG8= <mlev>
##$CPDPRGB= <>
##$CPDPRGT= <>
##$D= (0..31)
0 1 0 0 0 0 0 0 0 0.06 0 0 0 0 0 0 0.0002 0 0 0 0 0 0 0 0 0 0 0 0 0 0 
0 
##$DATE= 1137146993
##$DBL= (0..7)
120 120 120 120 120 120 120 120 
##$DBP= (0..7)
150 150 150 150 150 150 150 150 
##$DBP07= 0
##$DBPNAM0= <>
##$DBPNAM1= <>
$$ [...]
##$SUBNAM7= <"">
##$SUBNAM8= <"">
##$SUBNAM9= <"">
##$SW= 20.6930455092707
##$SWIBOX= (0..15)
0 0 3 0 0 0 0 0 0 0 0 0 0 0 0 0 
##$SW_h= 5175.983436853
##$TD= 65536
##$TD0= 1
##$TE= 294.16
##$TE2= 300
##$TE3= 300
##$TEG= 300
##$TL= (0..7)
0 120 120 120 120 120 120 120 
##$TP= (0..7)
150 150 150 150 150 150 150 150 
##$TP07= 0
##$TPNAME0= <>
##$TPNAME1= <>
##$TPNAME2= <>
##$TPNAME3= <>
##$TPNAME4= <>
##$TPNAME5= <>
##$TPNAME6= <>
##$TPNAME7= <>
##$TPOAL= (0..7)
0.5 0.5 0.5 0.5 0.5 0.5 0.5 0.5 
##$TPOFFS= (0..7)
0 0 0 0 0 0 0 0 
##$TUNHIN= 0
##$TUNHOUT= 0
##$TUNXOUT= 0
##$USERA1= <user>
##$USERA2= <user>
##$USERA3= <user>
##$USERA4= <user>
##$USERA5= <user>
##$V9= 5
##$VALIST= <valist>
##$VCLIST= <CCCCCCCCCCCCCCC>
##$VD= 0
##$VDLIST= <DDDDDDDDDDDDDDD>
##$VPLIST= <PPPPPPPPPPPPPPP>
##$VTLIST= <TTTTTTTTTTTTTTT>
##$WBST= 1024
##$WBSW= 4
##$XGAIN= (0..3)
0 0 0 0 
##$XL= 0
##$YL= 0
##$YMAX_a= 435538
##$YMIN_a= -282565
##$ZGOPTNS= <>
##$ZL1= 120
##$ZL2= 120
##$ZL3= 120
##$ZL4= 120
##$ABSF1= 16.522
##$ABSF2= -4.171173
##$ABSG= 5
##$ABSL= 3
##$ALPHA= 0
##$AQORDER= 0
##$ASSFAC= 0
##$ASSFACI= 0
##$ASSFACX= 0
##$ASSWID= 0
##$AUNMP= <proc_1d>
##$AZFE= 0.1
##$AZFW= 0.1
##$BCFW= 0
##$BC_mod= 0
##$BYTORDP= 0
##$COROFFS= 0
##$CY= 12.5
##$DATMOD= 1
##$DC= 0
##$DFILT= <>
##$DTYPP= 0
##$F1P= 14.0000005364418
##$F2P= -0.99999901652339
##$FCOR= 0.5
##$FTSIZE= 32768
##$FT_mod= 6
##$GAMMA= 0
##$GB= 0
##$INTBC= 1
##$INTSCL= 1
##$ISEN= 128
##$LB= 0.3
##$LEV0= 0
##$LPBIN= 0
##$MAXI= 10000
##$MC2= 0
##$MEAN= 0
##$ME_mod= 0
##$MI= 0
##$NCOEF= 0
##$NC_proc= -4
##$NLEV= 6
##$NOISF1= 0
##$NOISF2= 0
##$NSP= 0
##$NTH_PI= 0
##$NZP= 0
##$OFFSET= 16.522
##$PC= 1
##$PHC0= 86.91119
##$PHC1= 5.987872
##$PH_mod= 1
##$PKNL= yes
##$PPARMOD= 0
##$PSCAL= 4
##$PSIGN= 0
##$REVERSE= no
##$SF= 250.13
##$SI= 32768
##$SIGF1= 0
##$SIGF2= 0
##$SINO= 400
##$SIOLD= 32768
##$SREGLST= <1H.CDCl3>
##$SSB= 0
##$STSI= 32768
##$STSR= 0
##$SW_p= 5175.98343685301
##$SYMM= 0
##$S_DEV= 0
##$TDeff= 65536
##$TDoff= 0
##$TI= <Analysis number 999999
Compound Code 99
Book Reference 9
Project Code 9>
##$TILT= no
##$TM1= 0
##$TM2= 0
##$TOPLEV= 0
##$USERP1= <user>
##$USERP2= <user>
##$USERP3= <user>
##$USERP4= <user>
##$USERP5= <user>
##$WDW= 1
##$XDIM= 32768
##$YMAX_p= 356231893
##$YMIN_p= -598193
$$ End of Bruker specific parameters
$$ ---------------------------------
##NTUPLES= NMR SPECTRUM
##VAR_NAME=  FREQUENCY,     SPECTRUM/REAL,   SPECTRUM/IMAG
##SYMBOL=    X,             R,               I
##VAR_TYPE=  INDEPENDENT,   DEPENDENT,       DEPENDENT
##VAR_FORM=  AFFN,          ASDF,            ASDF
##VAR_DIM=   32768,         32768,           32768
##UNITS=     HZ,            ARBITRARY UNITS, ARBITRARY UNITS
##FACTOR=    0.157963299565203, 1,           1
##FIRST=     4132.6476996994, 0,             0
##LAST=      -1043.33573715361, 0,           0
##MIN=       -1043.33573715361, -598193,     0
##MAX=       4132.6476996994, 356231893,     0
$$ Real data points
##PAGE= N=1
##DATA TABLE= (X++(R..R)), XYDATA
$$ [...]
$$ plain form
19323 12153245 10713433 9602222 8667829 7954150 7482361 7056227 6732215 6397633 6038396
19314 6038396 5697110 5308551 4860722 4376739 4037656 3785794 3608245 3477090 3300108
19305 3300108 3260835 3308956 3315946 3317335 3320749 3263394 3070473 2747944 2485883 2270632 2148990
19294 2148990 1927384 1813633 1750329 1643339 1474744 1371603 1315847 1216946 1210200 1294090
19284 1294090 1252792 1161294 1068681 1062415 1149135 1224765 1188227 1118759 1021879 984074 980236 886583
19272 886583 996221 1074958 1131476 1108650 1090792 1206158 1148598 1141710 1147828 1079971 1078513 1060650
19260 1060650 998747 1118296 1329472 1389018 1344002 1379829 1418539 1449488 1398262 1358059 1368262
19249 1368262 1367309 1359880 1429711 1472598 1411188 1388072 1455114 1590895 1659152 1743813 1837863 1828677
$$ packed form
19323A2153245j439812j111211r34393p13679m71789m26134l24012l34582l59237
19314F038396l41286l88559m47829m83983l39083k51862j77549j31155j76982
19305C300108l9273M8121O990J389L414n7355j92921l22529k62061k15251j21642
19294B148990k21606j13751o3304j06990j68595j03141n5756r8901o746Q3890
19284A294090m1298r1498r2613o266Q6720P5630l6538o9468r6880l7805l838r3653
19272H86583J09638P8737N6518k2826j7858J15366n7560o888O118o7857j458j7863
19260A060650o1903J19549K11176N9546m5016L5827L8710L0949n1226m0203J0203
19249A368262r53p429O9831M2887o1410k3116O7042J35781O8257Q4661R4050r186
$$ plain form
19237 1828677 1770975 1857219 1894597 2015211 2058137 2108897 2177393 2297933 2399481 2396612 2408070
19226 2408070 2478871 2665745 2863218 2921761 2934196 2952100 2977195 3099205 3298364 3419595
19216 3419595 3565644 3652045 3724299 3834085 3987911 4297703 4536556 4821438 5131405 5408696
19206 5408696 5840174 6403343 7000308 7658698 8362955 9052605 9607255 10115002 10702960
19197 10702960 11414143 12228318 13205717 14263983 15520916 17064139 18953993 21224418
19189 21224418 23894037 27200233 31449474 36773806 43750990 52847421 65007058 81126429
19181 81126429 101958931 126645178 151805311 171612965 179979777 173786351 154747554
19174 154747554 128290848 100950154 77316733 58989306 45513122 35666565 28611006
$$ packed form
19237A828677n7702Q6244L7378J20614M2926N0760O8496J20540J01548k869J1458
19226B408070P0801J86874J97473N8543J2435J7904K5095J22010J99159J21231
19216C419595J46049Q6401P2254J09786J53826L09792K38853K84882L09967K77291
19206E408696M31478N63169N96965O58390P04257O89650N54650N07747N87958
19197A0702960P11183Q14175R77399J058266J256933J543223J889854K270425
19189B1224418K669619L306196M249241N324332O977184R096431J2159637J6119371
19181H1126429K0832502K4686247K5160133J9807654Q366812o193426j9038797
19174A54747554k6456706k7340694k3633421j8327427j3476184r846557p055559
$$ plain form
19167 28611006 23409641 19387894 16252979 13833578 12024575 10610469 9439590 8569661
19159 8569661 7827101 7189017 6599884 6228926 5726623 5378886 5046395 4628623 4186133
19150 4186133 3829662 3430247 3061000 2770115 2542517 2412866 2395223 2346877 2253293 2092031
19140 2092031 2028981 2094107 2189973 2160447 2087360 1998748 1931460 1850127 1844807 1788351 1738955
19129 1738955 1738383 1673113 1518655 1399054 1392650 1306154 1200502 1065677 1017939 948418 948073
19118 948073 943390 875647 792542 719382 660593 704560 752496 724646 613205 555612 648058
19107 648058 723629 723050 763970 826346 819276 787462 685873 605357 516919 445305 404292 488081
19095 488081 543712 533503 501710 534174 532245 490789 460354 423301 406281 407918 409321 385266
$$ packed form
19167B8611006n201365m021747l134915k419401j809003j414106j170879q69929
19159H569661p42560o38084n89133l70958n02303l47737l32491m17772m42490
19150D186133l56471l99415l69247k90885k27598j29651j7643m8346r3584j61262
19140B092031o3050O5126R5866k9526p3087q8612o7288q1333n320n6456m9396
19129A738955n72o5270j54458j19601o404q6496j05652j34825m7738o9521l45
19118I48073m683o7743q3105p3160n8789M3967M7936k7850j11441n7593R2446
19107F48058P5571n79M0920O2376p070l1814j01589q0516q8438p1614m1013Q3789
19095D88081N5631j0209l1793L2464j929m1456l0435l7053j7020J637J403k4055
$$ plain form
19083 385266 330211 351159 474008 483285 429597 426919 434982 345296 303639 300440 302602 292430
19071 292430 292176 229006 196973 254779 272792 190456 185464 218988 295307 398481 374213 291827
19059 291827 180076 151456 147565 145023 158204 186115 145936 134933 155466 229351 261998 237837
19047 237837 183768 208368 177051 190627 186522 181430 160020 173745 169928 121130 99936 120303
19035 120303 130955 109956 130684 193642 279191 202132 109299 151974 132743 73642 89854
19024 89854 152151 161172 64731 28982 6684 15295 41366 138189 211758 130563 114906 124177
19012 124177 63721 36761 -13251 -46719 -28204 5037 7207 121240 173741 186844 231797
19001 231797 220284 176460 234895 219026 134866 91969 19932 18001 -3128 -92831 -197347
$$ packed form
19083C85266n5055K0948J22849R277n3688k678Q063q9686m1657l199K162j0172
19071B92430k54o3170l2033N7806J8013q2336m992L3524P6319J03174k4268q2386
19059B91827j11751k8620l891k542J3181K7911m0179j1003K0533P3885L2647k4161
19047B37837n4069K4600l1317J3576m105n092k1410J3725l817m8798k1194K0367
19035A20303J0652k0999K0728O2958Q5549p7059r2833M2675j9231n9101J6212
19024H9854O2297R021r6441l5749k2298Q611K6071R6823P3569q1195j5657R271
19012A24177o0456k6960n0012l3468J8515L3241K170J14033N2501J3103M4953
19001B31797j1513m3824N8435j5869q4160m2897p2037j931k1129q9703j04516
$$ plain form
18990 -197347 -201153 -184415 -169403 -63203 -53989 -13735 -17841 17692 49942 45435 71098 165430
18978 165430 221182 188233 178206 134587 27957 126401 177263 121323 72261 34554 94808
18967 94808 76384 127053 206928 216639 197196 193751 196406 225072 209395 218686 238475 242249 257238
18954 257238 137671 62432 137290 302731 333711 341706 331468 351995 312861 254818 194859
18943 194859 241548 250185 299223 347691 348174 333781 361274 395849 388272 456721 435401 505318
18931 505318 588005 660914 687350 691895 651773 661234 611598 557140 517775 497181 505698 513770
18919 513770 541828 447614 320165 225162 180829 112646 135479 110330 69033 108418 89028
18908 89028 129371 150551 155832 155841 93195 59909 57838 127036 110681 -7563 -36192 -106654 -105428
$$ packed form
18990a97347l806J6738J5012J06200R214M0254m106L5533L2250m507K5663R4332
18978A65430N5752l2949j0027m3619j06630R8444N0862n5940m9062l7707O0254
18967I4808j8424N0669P9875R711j9443l445K655K8666j5677R291J9789L774J4989
18954B57238j19567p5239P4858J65441L0980P995j0238K0527l9134n8043n9959
18943A94859M6689Q637M9038M8468M83j4393K7493L4575p577O8449k1320O9917
18931E05318Q2687P2909K6436M545m0122R461m9636n4458l9365k0594Q517Q072
18919E13770K8058r4214j27449r5003m4333o8183K2833k5149m1297L9385j9390
18908H9028M0343K1180N281Ro2646l3286k071O9198j6355j18244k8629p0462J226
$$ plain form
18895 -105428 -71887 -61395 -24788 -945 8698 -8840 -63614 37589 72549 -2155 -8418 43632
18883 43632 145705 69461 64726 158924 140863 104189 104970 88470 127302 127363 155979 216045 282889
18870 282889 275549 287237 229212 251261 231323 185649 174651 226156 222255 127041 118121 121407
18858 121407 108269 171152 248109 280712 283323 311453 211918 173779 204556 187056 150523 170958
18846 170958 251021 305054 238843 277793 346048 367853 356529 363262 374105 292175 202288 172372
18834 172372 164130 230261 242058 263396 279427 276937 329081 409488 375004 313191 347587 348818
18822 348818 284576 176476 129714 142423 104316 77498 94586 121485 184536 195787 172634
18811 172634 46645 -25242 66779 193164 135653 75742 122306 98504 94410 159216 255129
$$ packed form
18895a05428L3541J0492L6607K3843R643j7538n4774J01203L4960p4704o263N2050
18883D3632J02073p6244m735R4198j8061l6674P81j6500L8832O1K8616O0066O6844
18870B82889p340J1688n8025K2049j9938m5674j0998N1505l901r5214q920L286
18858A21407j3138O2883P6957L2603K611K8130r9535l8139L0777j7500l6533K0435
18846A70958Q0063N4033o6211L8950O8255K1805j1324O733J0843q1930q9887k9916
18834A72372q242O6131J1797K1338J6031k490N2144Q0407l4484o1813L4396J231
18822C48818o4242j08100m6762J2709l8107k6818J7088K6899O3051J1251k3153
18811A72634j25989p1887R2021J26385n7511n9911M6564k3802m094O4806R5913
$$ plain form
18800 255129 256645 231319 191242 103423 46615 83626 132661 117625 110464 173552 261188 314590
18788 314590 340355 281162 238076 305086 344380 382774 497802 650147 827342 839942 762076
18777 762076 719113 689470 646802 608855 567850 489285 490005 584689 634519 923235 1254467
18766 1254467 1282511 1010889 672511 516497 394701 297202 301549 421142 481236 517089
18756 517089 467423 366515 244666 259675 226536 223717 239333 269927 279641 290104 282531 287635
18744 287635 232147 260439 299392 235189 248961 221580 180450 112793 188689 381909 462337
18733 462337 551390 527645 471308 514962 538336 577257 641845 631369 512189 376588 362965
18722 362965 310831 303184 344458 382315 360536 410051 439059 355912 261290 227066 241912 247483
$$ packed form
18800B55129J516k5326m0077q7819n6808L7011M9035j5036p161O3088Q7636N3402
18788C14590K5765n9193m3086O7010L9294L8394J15028J52345J77195J2600p7866
18777G62076m2963k9643m2668l7947m1005p8565P20R4684M9830K88716L31232
18766A254467K8044k71622l38378j56014j21796r7499M347J19593O0094L5853
18756E17089m9666j00908j21849J5009l3139k819J5616L0594R714J0463p573N104
18744B87635n5488K8292L8953o4203J3772k7381m1130o7657P5896J93220Q0428
18733D62337Q9053k3745n6337M3654K3374L8921O4588j0476j19180j35601j3623
18722C62965n2134p647M1274L7857k1779M9515K9008q3147r4622l4224J4846N571
$$ plain form
18710 247483 296795 416190 407165 353512 472006 454638 385338 382715 377030 248197 81966
18699 81966 25391 80014 59647 54234 91399 120782 164340 216477 215430 199024 184724 111004
18687 111004 137806 226851 344951 297477 212399 273961 375087 336909 337421 454558 562496
18676 562496 570594 612382 700130 866335 983981 1042869 1020895 920419 743783 590007 537682
18665 537682 442242 323414 257339 219666 161255 58089 117365 184047 167961 105645 151360
18654 151360 179914 181648 172038 243669 323213 248708 183745 212230 313484 333192 341259 384203
18642 384203 458112 452640 476989 491958 450962 329170 316908 308342 341314 420503 547844
18631 547844 586246 588435 660782 718430 702806 685611 691905 685890 692357 708462 678360 511598
$$ packed form
18710B47483M9312J19395r025n3653J18494j7368o9300k623n685j28833j66231
18699H1966n6575N4623k0367n413L7165K9383M3558N2137j047j6406j4300p3720
18687A11004K6802Q9045J18100m7474q5078O1562J01126l8178N12J17137J07938
18676E62496Q098M1788Q7748J66205J17646N8888k1974j00476j76636j53776n2325
18665E37682r5440j18828o6075l7673n8411j03166N9276O6682j6086o2316M5715
18654A51360K8554J734r610P1631P9544p4505o4963K8485J01254J9708Q067M2944
18642C84203P3909n472K4349J4969m0996j21792j2262q566L2972P9189J27341
18631E47844L8402K189P2347N7648j5624j7195O294o015O467J6105l0102j66762
$$ plain form
18619 511598 442811 387999 313406 284079 306385 344086 346693 368102 296193 275565 248497 255408
18607 255408 299826 255233 171420 181793 211269 227383 189850 143472 185216 277554 343680
18596 343680 318687 280431 307007 346454 381592 366018 269690 180213 142416 181323 294502
18585 294502 313597 227083 245131 341374 394964 429757 441079 406433 349191 269674 236339
18574 236339 109710 96276 83405 97528 185220 196557 223183 149207 126788 109370 116043
18563 116043 191940 234437 223261 226238 173446 172866 253343 368524 389104 450623 534792 537834
18551 537834 504209 463335 483372 568247 528160 465813 431257 445197 433247 503023 596420
18540 596420 657405 545278 512420 502323 477559 534921 577404 574078 659165 693124 662278
$$ packed form
18619E11598o8787n4812p4593k9327K2306L7701K607K1409p1909k0628k7068O911
18607B55408M4418m4593q3813J0373K9476J6114l7533m6378M1744R2338O6126
18596C43680k4993l8256K6576L9447L5138j5574r6328q9477l7797L8907J13179
18585B94502J9095q6514J8048R6243N3590L4793J1322l4646n7242p9517l3335
18574B36339j26629j3434j2871J4123Q7692J1337K6626p3976k2419j7418O673
18563A16043P5897M2497j1176K977n2792n80Q0477J15181K0580O1519Q4169L042
18551E37834l3625m0874K0037Q4875m0087o2347l4556J3940j1950O9776R3397
18540E96420O0985j12127l2858j0097k4764N7362M2483l326Q5087L3959l0846
$$ plain form
18529 662278 625810 569028 479410 365010 336747 363357 454150 535502 697661 860583 940122
18518 940122 1041404 1172300 1262807 1326635 1336014 1229266 1028344 889406 846964 859994 745708
18507 745708 595126 582929 593903 602165 556847 579421 544541 452434 484110 535317 552569
18496 552569 567285 637041 648295 588193 607851 619276 575350 513999 546878 564232 519260
18485 519260 540518 576844 561809 542780 523179 506520 501154 497869 529163 551991 576391 572675
18473 572675 603269 654567 627665 565394 550535 490388 553843 602779 595862 599508 570618 575251
18461 575251 560807 560514 657772 637598 556128 479906 477871 501364 565555 550392 537189 497182
18449 497182 453173 431307 536323 589582 617692 540273 461336 490125 540580 578527 609123
$$ packed form
18529F62278l6468n6782q9618j14400k8263K6610R0793Q1352J62159J62922P9539
18518I40122J01282J30896R0507O3828R379j06748k00922j38938m2442J3030j14286
18507G45708j50582j2197J0974Q262m5318K2574l4880r2107L1676N1207J7252
18496E52569J4716O9756J1254o0102J9658J1425m3926o1351L2879J7354m4972
18485E19260K1258L6326j5035j9029j9601j6659n366l285L1294K2828K4400l716
18473E72675L0594N1298k6902o2271j4859o0147O3455M8936o917L646k8890M633
18461E75251j4444k93R7258k0174q1470p6222k035K3493O4191j5163j3203m0007
18449D97182m4009k1866J05016N3259K8110p7419p8937K8789N0455L7947L0596
$$ plain form
18438 609123 624221 738147 938393 1067011 1084401 1099129 1136151 1109815 1182537 1227459 1131302
18427 1131302 1075530 1097703 1126614 1029403 894383 818543 783047 771447 711031 668107 692448
18416 692448 657904 625325 755116 866330 892227 936606 945088 827732 751928 831195 840537
18405 840537 871967 866779 886156 864674 781857 713425 656963 556928 584111 688606 681832
18394 681832 619256 720970 770402 890147 946863 1043244 1077787 1038114 1025917 1048899 1062590
18383 1062590 988798 994460 952436 992504 1002009 1018146 1149749 1218348 1246977 1291041 1292830 1268591
18371 1268591 1307960 1284003 1243048 1265944 1287487 1211701 1183136 1259868 1320718 1237539 1257981
18360 1257981 1346922 1364350 1408120 1474385 1531699 1619489 1618043 1605140 1644318 1679275 1686210 1728731
$$ packed form
18438F09123J5098J13926K00246J28618J7390J4728L7022k6336P2722M4922r6157
18427A131302n5772K2173K8911r7211j35020p5840l5496j1600o0416m2924K4341
18416F92448l4544l2579J29791J11214K5897M4379Q482j17356p5804P9267R342
18405H40537L1430n188J9377k1482q2817o8432n6462j00035K7183J04495o774
18394F81832o2576J01714M9432J19745N6716R6381L4543l9673j2197K2982J3691
18383A062590p3792N662m2024M0068R505J6137J31603O8599K8629M4064J789k4239
18371A268591L9369k3957m0955K2896K1543p5786k8565P6732O0850q3179K0442
18360A257981Q8941J7428M3770O6265N7314Q7790j446j2903L9178L4957O935M2521
$$ plain form
18348 1728731 1721680 1772862 1982743 2113380 2226587 2402874 2605801 2951903 3384660 3905774
18338 3905774 4633467 5762868 7510088 9973001 12603486 14372240 14856695 14739377 14876645
18329 14876645 14901491 13861663 11575400 8855008 6704766 5298648 4435323 3977325 3777424
18320 3777424 3608156 3498724 3460804 3403650 3475006 3589030 3683353 3793245 4101674 4425104
18310 4425104 4758577 5006545 5256039 5541795 5861613 6071998 6238233 6376397 6483098
18301 6483098 6816048 7273706 7838329 8616505 9713490 11185554 12683005 13788794 14748186
18292 14748186 16423696 19202035 23523946 29624561 37048142 46869930 59188261 70177968
18284 70177968 74996225 74259403 73123589 73325529 70875268 62075637 49189628 37130688
$$ packed form
18348A728731p051N1182K09881J30637J13207J76287K02927L46102M32757N21114
18338C905774P27693J129401J747220K462913K630485J768754M84455j17318J37268
18329A4876645K4846j039828k286263k720392k150242j406118q63325m57998j99901
18320C777424j69268j09432l7920n7154P1356J14024R4323J09892L08429L23430
18310D425104L33473K47968K49494K85756L19818K10385J66235J38164J06701
18301F483098L32950M57658N64623P78176J096985J472064J497451J105789R59392
18292A4748186J675510K778339M321911O100615P423581R821788J2318331J0989707
18284G0177968M818257p36822j135814K01940k450261q799631j2886009j2058940
$$ plain form
18276 37130688 28602519 23437224 20723578 19674426 19689848 20135564 21038687 22641037 25417902
18267 25417902 29692891 35083470 40718141 45800013 50077872 53412454 55237552 55309283
18259 55309283 54860485 54616560 55292403 57290327 60713217 65089476 70290344 76191602
18251 76191602 82541100 90459982 104048748 127695752 159740495 181003763 176394133
18244 176394133 160760902 148691539 147897516 156931099 157635168 139585135 120574828 108706191
18236 108706191 100339047 90039680 76316401 61413083 47373963 35685361 26910178
18229 26910178 21145305 17646203 15391597 13861612 12874997 12124748 11293909 10515010 10061886
18220 10061886 9979786 10117304 10424164 10826692 11388653 12069602 12810994 13314699 13400810 13307073
$$ packed form
18276C7130688q528169n165295k713646j049152J5422M45716R03123J602350K776865
18267B5417902M274989N390579N634671N081872M277859L334582J825098P1731
18259E5309283m48798k43925O75843J997924L422890M376259N200868N901258
18251G6191602O349498P918882J3588766K3647004L2044743K1263268m609630
18244A76394133j5633231j2069363p94023R033583P04069j8050033j9010307j1868637
18236A08706191q367144j0299367j3723279j4903318j4039120j1688602q775183
18229B6910178n764873l499102k254606j529985r86615p50249q30839p78899m53124
18220A0061886q2100J37518L06860M02528N61961O80949P41392N03705Q6111r3737
$$ plain form
18210 13307073 13181095 13373922 13755093 14481937 15427517 16333349 17082137 17366704 16688709
18201 16688709 15147353 13361840 11481749 9625278 8052832 6772743 5838260 5140384
18193 5140384 4709631 4523474 4572613 4721232 5010646 5260996 5432092 5513677 5347285 5006781
18183 5006781 4561006 4154220 3909122 3862275 3751079 3797703 3893246 4054936 4193987 4176855
18173 4176855 4181913 4343307 4547955 4821646 5047387 5263602 5595424 5979871 6368271 6726006
18163 6726006 7216850 7752044 8138420 8557232 9073334 9740122 10615661 11620150 12999895
18154 12999895 14621209 16603679 18897134 21714506 25539878 30089361 34127639 37676070
18146 37676070 42397709 48378579 53180842 55512956 58244187 63207875 68049351 70251673
$$ packed form
18210A3307073j25978J92827L81171P26844R45580R05832P48788K84567o77995
18201A6688709j541356j785513j880091j856471j572446j280089r34483o97876
18193E140384m30753j86157M9139J48619K89414K50350J71096Q1585j66392l40504
18183E006781m45775m06786k45098m6847j11196M6624R5543J61690J39051j7132
18173D176855N058J61394K04648K73691K25741K16215L31822L84447L88400L57735
18163F726006M90844N35194L86376M18812N16102O66788Q75539J004489J379745
18154A2999895J621314J982470K293455K817372L825372M549483M038278L548431
18146C7676070M721639N980870M802263K332114K731231M963688M841476K202322
$$ plain form
18138 70251673 72039257 75342599 79140919 82502059 85663798 87979653 89158216 90651037
18130 90651037 92374747 91779720 89329095 86739313 83557922 79373025 75518243 71440835
18122 71440835 66046154 60499812 56551130 53851367 50837134 46972827 44156221 43586713
18114 43586713 44897852 47944407 55227153 72318836 106956962 161726777 194446839
18107 194446839 150904778 91928823 53974818 33512221 22550892 16556758 13015662
18100 13015662 10596550 8781924 7449390 6387758 5543939 4883362 4437866 4099095 3762492
18091 3762492 3462131 3155152 2940342 2748154 2573582 2518209 2390683 2277115 2141213 2049768
18081 2049768 1904097 1918955 1853033 1738313 1582481 1529147 1584902 1532615 1429161 1417540
$$ packed form
18138G0251673J787584L303342L798320L361140L161739K315855J178563J492821
18130I0651037J723710n95027k450625k589782l181391m184897l854782m077408
18122G1440835n394681n546342l948682k699763l014233l864307k816606n69508
18114D3586713J311139L046555P282746J7091683L4638126N4769815L2720062
18107A94446839m3542061n8975955l7954005k0462597j0961329n994134l541096
18100A3015662k419112j814626j332534j061632q43819o60577m45496l38771l36603
18091C762492l00361l06979k14810j92188j74572n5373j27526j13568j35902r1445
18081B049768j45671J4858o5922j14720j55832n3334N5755n2287j03454j1621
$$ plain form
18071 1417540 1431101 1348523 1294384 1328647 1247873 1162798 1146607 1136368 1044010 1099983 1311947
18060 1311947 1430452 1494601 1493537 1659636 1791425 1828746 1810262 1842925 1956676 2107292
18050 2107292 2358509 2749774 3253992 3902817 4795628 6008801 7173838 7612328 6991102
18041 6991102 6116084 5487838 5209505 5418866 6130719 6833854 6898958 6276422 5501754 4982172
18031 4982172 4707487 4578683 4595617 4725264 4954876 5331926 5610385 5904636 6263175 6782902
18021 6782902 7524633 8645464 10004750 11899191 14312641 17119447 20579996 24763274
18013 24763274 28297421 30705271 33334789 35459303 35150348 33667288 32799469 31751308
18005 31751308 30144089 29195040 29585547 31068245 32652294 34325363 36990396 40043676
$$ packed form
18071A417540J3561q2578n4139L4263q0774q5075j6191j0239r2358N5973K11964
18060A311947J18505O4149j064J66099J31789L7321j8484L2663J13751J50616
18050B107292K51217L91265N04218O48825Q92811J213173J165037M38490o21226
18041F991102q75018o28246k78333K09361P11853P03135O5104o22536p74668n19582
18031D982172k74685j28804J6934J29647K29612L77050K78459K94251L58539N19727
18021F782902P41731J120831J359286J894441K413450K806806L460549M183278
18013B4763274L534147K407850K629518K124514l08955j483060q67819j048161
18005C1751308j607219r49049L90507J482698J584049J673069K665033L053280
$$ plain form
17997 40043676 42207519 44494245 47265044 48883866 48083680 45077645 40710918 35586631
17989 35586631 30826835 27567145 26255403 26800869 28855817 31451332 33618433 34419529
17981 34419529 33257567 30692809 27864539 25883556 25003024 23817715 21947602 21109224
17973 21109224 22107303 24044005 24288652 22661490 21691150 22250954 23019932 22559895 21798252
17964 21798252 22415571 23964466 24872914 25337448 27154925 30689641 33793969 34168918 33641725
17955 33641725 34361748 34799674 32631631 29429237 26869897 24465655 22213085 20524206
17947 20524206 19913531 20018195 19960106 19931235 20414243 20272491 18665573 16836859 15137629
17938 15137629 12754451 10260059 8298651 6734643 5445802 4417926 3725898 3274219
$$ packed form
17997D0043676K163843K286726K770799J618822q00186l006035m366727n124287
17989C5586631m759796l259690j311742N45466K054948K595515K167101Q01096
17981C4419529j161962k564758k828270j980983q80532j185309j870113q38378
17973B1109224R98079J936702K44647j627162r70340N59804P68978m60037p61643
17964B1798252O17319J548895R08448M64534J817477L534716L104328L74949n27193
17955C3641725P20023M37926k168043l202394k559340k404242k252570j688879
17947B0524206o10675J04664n8089k8871M83008j41752j606918j828714j699230
17938A5137629k383178k494392j961408j564008j288841j027876o92028m51679
$$ plain form
17930 3274219 2906564 2755759 2672361 2506137 2353060 2197341 2087435 2119640 2183414 2143184
17920 2143184 1971366 1678442 1440524 1488857 1627889 1657173 1676273 1610849 1569251 1423575
17910 1423575 1357833 1300550 1177695 1192553 1282589 1309855 1145534 972256 823047 890312
17900 890312 1000028 964586 960700 969043 918173 912914 883671 840834 732251 695106 632464 552092
17888 552092 526868 579896 554746 524700 588350 658689 605100 628626 694716 741571 740310 706023
17876 706023 660268 550087 593103 498371 459470 440323 388371 386093 388871 411465 454734 460003
17864 460003 399930 357894 351392 258350 208816 211424 352573 407934 320460 325712 333329 345544
17852 345544 364641 407019 435948 407902 324574 407019 460000 473449 505380 484122 467797
$$ packed form
17930C274219l67655j50805q3398j66224j53077j55719j09906L2205O3774m0230
17920B143184j71818k92924k37918M8333J39032K9284J9100o5424m1598j45676
17910A423575o5742n7283j22855J4858R0036K7266j64321j73278j49209O7265
17900H90312J09716l5442l886Q343n0870n259k9243m2837j08583l7145o2642q0372
17888E52092k5224N3028k5150l0046O3650P0339n3589K3526O6090M6855j261l4287
17876G06023m5755j10181M3016r4732l8901j9147n1952k278K778K2594M3269N269
17864D60003o0073m2036o502r3042m9534K608J41149N5361q7474N252P617J2215
17852C45544J9097M2378K8929k8046q3328Q2445N2981J3449L1931k1258j6325
$$ plain form
17841 467797 436588 495537 431640 334032 310774 360377 317418 301703 271269 210161 224076
17830 224076 246503 230696 192990 195695 162172 155506 118721 136490 140420 56498 20519 -2571
17818 -2571 2618 -5265 -43514 -14329 35111 72658 43354 76206 60728 120246 170664 210449
17806 210449 312275 265645 289060 263805 292232 322184 226508 170545 175870 151058 108878
17795 108878 33676 -12086 -44231 -16268 -16839 -78137 -70018 -66769 -68274 -4166 7582 -21375
17783 -21375 4276 -3495 14517 55354 53305 9450 17321 12294 2019 -14838 -50623 -7166
17771 -7166 -67171 -129794 -75300 27459 118338 142410 207084 197429 318107 412758 444238 535716
17759 535716 621979 694199 737041 688412 720706 743406 712349 600784 491089 401972 302610
$$ packed form
17841D67797l1209N8949o3897r7608k3258M9603m2959j5715l0434o1108J3915
17830B24076K2427j5807l7706K705l3523o666l6785J7769L930q3922l5979k3090
17818b571N189p883l8249K9185M9440L7547k9304L2852j5478N9518N0418L9785
17806B10449J01826m6630K3415k5255K8427K9952r5676n5963N325k4812m2180
17795A08878p5202m5762l2145K7963n71o1298Q119L249j505O4108J1748k8957
17783b1375K5651p771J8012M0837k049m3855P871n027j0275j6857l5785M3457
17771g166o0005o2623N4494J02759R0879K4072O4674r655J20678R4651L1480R1478
17759E35716Q6263P2220M2842m8629L2294K2700l1057j11565j09695q9117r9362
$$ plain form
17748 302610 203760 157949 104009 132801 167499 177114 107827 45697 77426 81241 35883 60091
17736 60091 97719 91779 168227 157395 145540 155779 82547 14365 -11984 -3415 5799 38155
17724 38155 98123 82076 115367 144030 146058 196326 177118 159999 210964 199954 235386 305187
17712 305187 297378 404128 437460 452741 400618 427705 467069 525708 408620 348145 317156
17701 317156 334883 338159 355885 327235 288923 281358 240045 115991 78810 8000 -104288
17690 -104288 -82828 -2716 49150 54841 78973 14592 -65151 -72519 -69471 -2487 -10223 -30639
17678 -30639 -61453 40215 29413 -34160 -99515 -104081 -78562 -69703 -25924 113407 178120 152145
17666 152145 115543 111985 104468 156133 187636 194157 156149 113178 95221 65821 117684 101209
$$ packed form
17748C02610r8850m5811n3940K8792L4698R615o9287o2130L1729L815m5358K4208
17736F0091L7628n940P6448j0832j1855J0239p3232o8182k6349Q569R214L2356
17724C8155N9968j6047L3291K8663K028N0268j9208j7119N0965j1010L5432O9801
17712C05187p809J06750L3332J5281n2123K7087L9364N8639j17088o0475l0989
17701C17156J7727L276J7726k8650l8312p565m1313j24054l7181p0810j12288
17690a04288K1460Q0112N1866N691K4132o4381p9743p368L048O6984p736k0416
17678c0639l0814J01668j0802o3573o5355m566K5519Q859M3779J39331O4713k5975
17666A52145l6602l558p517N1665L1503O521l8008m2971j7957k9400N1863j6475
$$ plain form
17654 101209 61453 93243 136728 177278 121073 63022 93355 158860 183614 266932 420395
17643 420395 380470 303916 373097 455569 464813 535064 578437 543869 489601 523259 551767 505200
17631 505200 545139 518771 451678 432188 376032 340796 345041 310478 186797 155240 195210
17620 195210 156058 119562 107992 102267 97005 51553 50477 48231 56034 15208 10411 63307 93254
17607 93254 38661 -14119 -61654 -53474 -7624 -45841 -85870 -114521 -44274 -56912 -135240 -173778
17595 -173778 -257168 -205675 -73810 -58614 1483 73224 35425 -26562 129 22865 78222
17584 78222 74357 -59635 -116858 -34294 7505 -12312 32911 103530 87994 70432 57387 21042
17572 21042 -95295 -116355 -135015 -60109 -75730 -105741 -96901 -96348 -20369 -24159 -35014 12687
$$ packed form
17654A01209l9756L1790M3485M0550n6205n8051L0333O5505K4754Q3318J53463
17643D20395l9925p6554O9181Q2472R244P0251M3373l4568n4268L3658K8508m6567
17631E05200L9939k6368o7093j9490n6156l5236M245l4563j23681l1557L9970
17620A95210l9152l6496j1570n725n262m5452j076k246P803m0826m797N2896K9947
17607I3254n4593n2780m7535Q180M5850l8217m0029k8651P0247j2638p8328l8538
17595a73778q3390N1493J31865J5196O0097P1741l7799o1987K6691K2736N5357
17584G8222l865j33992n7223Q2564M1799j9817M5223P0619j5536j7562j3045l6345
17572B1042j16337k1060j8660P4906j5621l0011Q840N53P5979l790j0855M7701
$$ plain form
17560 12687 -47063 -82549 -215576 -222494 -162620 -140306 -158112 -96817 -17325 26597 -22758 -71076
17548 -71076 -105982 -58394 29290 10711 -72667 -73837 -135007 -181116 -182155 -141163 -46076 8396
17536 8396 11117 151 -17012 -14189 -6393 -70331 -145933 -144182 -92043 -79910 -63267 -37532 -137691
17523 -137691 -107236 1988 126622 127526 35750 -30258 -23076 53960 93453 18361 -63176 -29228
17511 -29228 6053 -10238 2934 38115 42588 50433 7695 2460 56171 128637 87023 116640
17499 116640 63828 60921 51468 23400 84970 162251 252559 204978 176109 73551 70899 172270
17487 172270 197567 164258 99330 134516 151438 256454 219811 150469 133768 96924 84033
17476 84033 34777 -46866 38065 102715 80547 39798 30800 -31210 -70763 -95545 9123 75623
$$ packed form
17560A2687n9750l5486j33027o918N9874K2314j7806O1295P9492M3922m9355m8318
17548g1076l4906M7588Q7684j8579q3378j170o1170m6109j039M0992R5087N4472
17536H396K721j0966j7163K823P796o3938p5602J751N2139J2133J6643K5735j00159
17523a37691L0455J09224J24634R04r1776o6008P182P7036L9493p5092q1537L3948
17511b9228L5281j6291J3172L5181M473P845m2738n235N3711P2466m1614K9617
17499A16640n2812k907r453k8068O1570P7281R0308m7581k8869j02558k652J01371
17487A72270K5297l3309o4928L5186J6922J05016l6643o9342j6701l6844j2891
17476H4033m9256q1643Q4931O4650k2168m0749q998o2010l9553k4782J04668O6500
$$ plain form
17464 75623 28535 5870 23937 41057 -561 -78089 -29528 95493 97450 83415 80461 103317
17452 103317 163903 170845 130296 241902 326730 371369 393056 386605 490509 790271 1075395
17441 1075395 1054807 752616 505941 280423 199731 209991 93464 -26324 35180 47881
17431 47881 -24060 -66051 -34571 38213 -1080 -116230 -53543 -68116 -68610 -26023 -31550 -1578
17419 -1578 -62791 -194638 -211814 -123043 -70950 -87524 -186808 -198261 -161774 -113962 -55761 48260
17407 48260 83682 47894 -38317 -63056 -80715 -144629 -171801 -165096 -149323 -198201 -173573 -97510
17395 -97510 -92599 -142564 -85312 6224 -79725 -92665 -115139 -84017 -41193 -64152 -106921 -73059
17383 -73059 9969 -24876 -13655 -1697 -25173 38959 135394 85059 85530 84650 75058 93566 76254
$$ packed form
17464G5623m7088k2665J8067J7120m1618p7528M8561J25021J957j4035k954K2856
17452A03317O0586O942m0549J11606Q4828M4639K1687o451J03904K99762K85124
17441A075395k0588l02191k46675k25518q0692J0260j16527j19788O1504J2701
17431D7881p1941m1991L1480P2784l9293j15150O2687j4573m94M2587n527K9972
17419a578o1213j31847j7176Q8771N2093j6574r9284j1453L6487M7812N8201J04021
17407D8260L5422l5788q6211k4739j7659o3914k7172O705J5773m8878K4628P6063
17395i7510M911m9965N7252R1536q5949j2940k2474L1122M2824k2959m2769L3862
17383g3059Q3028l4845J1221J1958k3476O4132R6435n0335M71q80r592J8508j7312
$$ plain form
17370 76254 76973 -75092 -145987 -27409 -41598 -51651 -41725 17103 74725 -27983 -52537 -114296
17358 -114296 -157500 -206692 -199214 -146748 -105459 -131325 -84631 -33995 -22858 -10806 -29393 -20416
17346 -20416 -50640 -71056 -152689 -134084 -86675 -34958 -12797 -63715 -112680 -83079 -156567 -204268
17334 -204268 -132360 -23003 -29662 -111654 -68151 16915 -11997 5595 69836 42947 -54823
17323 -54823 -30210 -28230 -37988 -77453 -98393 -90847 -91961 -91207 -42507 -19722 43261 -6255 -19383
17310 -19383 -31124 -51689 -41035 -77712 -42012 10873 -1812 -42583 -21985 -41458 -152616
17299 -152616 -129615 36522 44887 12766 120057 65093 -31082 -86143 -53093 -48612 -48438 -84062
17287 -84062 -108346 -75799 -123479 -116831 -138153 -73467 -70096 -28832 -95575 -103689 -36257 -9729
$$ packed form
17370G6254P19j52065p0895J18578j4189j0053R926N8828N7622j02708k4554o1759
17358a14296m3204m9192P478N2466M1289k5866M6694N0636J1137J2052j8587Q977
17346b0416l0224k0416q1633J8605M7409N1717K2161n0918m8965K9601p3488m7701
17334b04268P1908J09357o659q1992M3503Q5066k8912J7592O4241k6889r7770
17323e4823K4613J980r758l9465k0940P546j114P54M8700K2785O2983m9516j3128
17310a9383j1741k0565J0654l6677L5700N2885j2685m0771K0598j9473j11158
17299a52616K3001J66137Q365l2121J07291n4964r6175n5061L3050M481J74l5624
17287h4062k4284L2547m7680O648k1322O4686L371M1264o6743q114O7432K6528
$$ plain form
17275 -9729 -112794 -106197 -73538 -116311 -110702 -110652 -36985 -24322 -21362 -22258 -105495 -135094 -155385
17262 -155385 -243721 -307385 -253901 -227850 -174931 -154294 -149270 -82782 18974 -43555 6647
17251 6647 -49178 -141914 -164080 -165035 -82096 16341 -12535 -51510 -72044 -16042 -48434 -108805
17239 -108805 -123250 -84209 -27960 11502 -21924 -30649 3278 -50271 -88044 23564 -15314
17228 -15314 -22851 -42243 -74766 -57307 -10810 47049 84027 127871 8497 -23652 19799 -23224
17216 -23224 -18208 -11438 -20410 -62920 -33464 -56399 -142693 -180685 -177813 -177184 -126811 -143587 -159070
17203 -159070 -106874 -133075 -83045 -139195 -161217 -73514 -42077 -41334 -81736 -80552 -15354 7636
17191 7636 38097 37672 -68972 -80991 -60379 -32376 -85968 -49117 47812 58995 -32854 -58692
$$ packed form
17275i729j03065O597L2659m2773N609N0P3667J2663K960q96q3237k9599k0291
17262a55385q8336o3664N3484K6051N2919K0637N024O6488J01756o2529N0202
17251F647n5825r2736k2166r55Q2939R8437k8876l8975k0534N6002l2392o0371
17239a08805j4445L9041N6249L9462l3426q725L3927n3549l7773J11608l8878
17228a5314p537j9392l2523J7459M6497N7859L6978M3844j19374l2149M3451m3023
17216b3224N016O770q972m2510K9456k2935q6294l7992K872O29N0373j6776j5483
17203a59070N2196k6201N0030n6150k2022Q7703L1437P43m0402J184O5198K2990
17191G636L0461m25j06644j2019K0612K8003n3592L6851R6929J1183r1849k5838
$$ plain form
17179 -58692 17108 20482 43738 23839 -30917 -110537 -84397 -116380 -131939 -32249 -13042 -19672
17167 -19672 -90657 -70401 -92540 -102457 -77027 -109628 -206314 -181154 -149299 -48819 57209
17156 57209 -79537 -116696 -72521 20275 110607 22176 -158809 -232004 -211832 -123925 -82564
17145 -82564 -82221 -111646 -59944 48780 -662 -40997 -77497 -39460 -48976 -74080 -62373 -12999
17133 -12999 -25490 -39882 -68142 -70204 -88019 -180873 -161603 -140108 -151597 -110846 -92801 -68415
17121 -68415 -109495 -164921 -112329 -26896 -6770 -9338 -7041 57415 135402 149186 65962 -59095
17109 -59095 -86572 33045 65862 70119 68781 62207 25745 -72639 -120507 -81448 -82877 -103358
17097 -103358 -45064 16942 -14831 -2527 7364 6550 37295 3185 -102160 -38680 41377 -3482
$$ packed form
17179e8692P5800L374K3256j9899n4756p9620K6140l1983j5559R9690J9207o630
17167a9672p0985K0256k2139r917K5430l2601r6686K5160L1855J00480J06028
17156E7209j36746l7159M4175R2796R0332q8431j80985p3195K0172Q7907M1361
17145h2564L43k9425N1702J08724m9442m0335l6500L8037r516k5104J1707M9374
17133a2999j2491j4392k8260k062j7815r2854J9270K1495j1489M0751J8045K4386
17121f8415m1080n5426N2592Q5433K0126k568K297O4456P7987J3784q3224j25057
17109e9095k7477J19617L2817M257j338o574l6462r8384m7868L9059j429k0481
17097a03358N8294O2006l1773J2304R891q14L0745l4110j05345O3480Q0057m4859
$$ plain form
17085 -3482 -82839 -50626 15156 -71722 -97199 -27438 -23728 52431 154077 88820 77020 14873
17073 14873 -57341 -44814 373 51338 77492 49847 23028 44833 38347 30564 -11626 -41892
17061 -41892 21255 13349 -59983 -111202 -135564 -174293 -212596 -196443 -53259 -27083 -37721 -34102
17049 -34102 -87856 -125733 -128373 -179950 -177405 -157993 -118046 -133959 -135973 -117280 -184245 -251322
17037 -251322 -209017 -214446 -186570 -201773 -185531 -104703 -90169 -78322 -49428 -63964 -40371 -29471
17025 -29471 -87469 -13468 -19169 -20828 -13447 -15157 -39179 -64198 -120875 -61377 749 10047 -7835
17012 -7835 -34062 -71839 -102425 -48313 -39699 -176164 -196511 -153492 -45940 4425 65773 84430
17000 84430 35152 -7791 57065 -4122 -47782 -76069 -39057 -74958 -141807 -129694 -93331 -64131
$$ packed form
17085c482p9357L2213O5782q6878k5477O9761L710P6159J01646o5257j1800o2147
17073A4873p2214J2527M5187N0965K6154k7645k6819K1805o486p783m2190l0266
17061d1892O3147p906p3332n1219k4362l8729l8303J6153J43184K6176j0638L619
17049c4102n3754l7877k640n1577K545J9412L9947j5913k014J8693o6965o7077
17037b51322M2305n429K7876j5203J6242Q0828J4534J1847K8894j4536K3593J0900
17025b9471n7998P4001n701j659P381j710k4022k5019n6677N9498O2126R298j7882
17012g835k6227l7777l0586N4112Q614j36465k0347M3019J07552N0365O1348J8657
17000H4430m9278m2943O4856o1187m3660k8287L7012l5901o6849J2113L6363K9200
$$ plain form
16988 -64131 -61077 -64217 -72308 -14669 11683 19217 15493 25286 51313 58444 25789 -36058 -46679
16975 -46679 -74765 -65390 -136992 -133244 -51670 8778 -10040 -73754 -16062 54887 15258 -42066
16963 -42066 -73672 -99022 -150028 -121807 -113859 -152380 -149624 -94931 -128313 -232199 -201727 -100006
16951 -100006 -87913 -195223 -206226 -121396 -47352 -35301 -22237 -35175 -8993 -17285 -63658
16940 -63658 -41663 -113901 -114787 -90304 -24266 12635 -64415 -162930 -142785 -94171 -20782 20623
16928 20623 36883 34010 102575 78716 7720 -62282 -41975 -87168 -60497 -12067 -18916 -25714
16916 -25714 -26448 -55018 -41230 -22837 -37811 -36048 -102959 -201836 -186251 -171201 -192477 -110862
16904 -110862 -74721 -16964 -28972 -38188 -28830 -109567 -123548 -38595 -31587 -109663 -93206 -4383
$$ packed form
16988f4131L054l140q091N7639K6352P534l724R793K6027P131l2655o1847j0621
16975d6679k8086R375p1602L748Q1574O0448j8818o3714N7692P0949l9629n7324
16963d2066l1606k5350n1006K8221P948l8521K756N4693l3382j03886L0472J01721
16951a00006J2093j07310j1003Q4830P4044J2051J3064j2938K6182q292m6373
16940f3658K1995p2238q86K4483O6038L6901p7050r8515K0145M8614P3389M1405
16928B0623J6260k873O8565k3859p0996p0002K0307m5193K6671M8430o849o798
16916b5714p34k8570J3788J8393j4974J763o6911r8877J5585J5050k1276Q1615
16904a10862L6141N7757j2008r216R358q0737j3981Q4953P008p8076J6457Q8823
$$ plain form
16892 -4383 -30743 -42612 -28737 -46572 -36798 -50726 -64216 -94209 -147567 -179040 -162489 -81228
16880 -81228 -18475 -44746 -67688 -42965 -28783 -21995 -80682 -161371 -100915 56215 -24974 -106212
16868 -106212 -40783 -41588 -70602 -67215 -22980 -2903 108718 40158 -56688 -143656 -140889 -100900
16856 -100900 -31233 6230 -25774 -11938 39386 54126 -32086 -157718 -197335 -147355 -111564
16845 -111564 -123446 -51689 -49596 -60770 -7694 33579 44415 40305 -49516 -83242 45167 17836
16833 17836 -25383 -49004 30672 33966 77675 139351 78601 18657 1343 61062 25920 -5059
16821 -5059 34502 7140 -74361 -102152 -56762 -90485 -115770 -70068 -38456 -32962 -109103 -135252
16809 -135252 -119658 -79280 -101116 -117994 -14382 17561 -10294 -110273 -47905 -10224 47333
$$ packed form
16892d383k6360j1869J3875j7835R774j3928j3490k9993n3358l1473J6551Q1261
16880h1228O2753k6271k2942K4723J4182O788n8687q0689O0456J57130q1189q1238
16868a06212O5429q05k9014L387M4235K0077J11621o8560r6846q6968K767L9989
16856a00900O9667L7463l2004J3836N1324J4740q6212j25632l9617M9980L5791
16845a11564j1882P1757K093j1174N3076M1273J0836m110q9821l3726J28409k7331
16833A7836m3219k3621P9676L294M3709O1676o0750n9944j7314N9719l5142l0979
16821e059L9561k7362q1501k7791M5390l3723k5285M5702L1612N494p6141k6149
16809a35252J5594M0378k1836j6878J03612L1943k7855r9979O2368L7681N7557
$$ plain form
16798 47333 24233 -17223 -43640 -24574 -46225 -73471 -16088 38554 7387 -30340 -90254 -110215
16786 -110215 -75126 -83390 -63267 -64621 -34354 59181 27745 16709 30589 -48198 -79491 1915
16774 1915 158613 132422 74502 34151 5148 17481 46822 -4044 -20280 24645 33029 14393
16762 14393 -33263 -40382 -30677 -24526 48207 29503 906 19968 6525 -9505 44430 98669
16750 98669 149991 92481 36050 -51669 -129706 -122825 -86425 26997 34401 36234 12569 -105755
16738 -105755 -127719 -139359 -66770 -99019 -121171 -102676 -33999 -59718 -30774 1197 43877
16727 43877 45182 23459 23048 113543 135523 139216 1838 -85275 -22068 38889 110964 51573
16715 51573 11303 57317 90839 76202 23686 4307 15267 92270 102644 -31877 -90160
$$ packed form
16798D7333k3100m1456k6417J9066k1651k7246N7383N4642l1167l7727n9914j9961
16786a10215L5089q264K0123j354L0267R3535l1436j1036J3880p8787l1293Q1406
16774A915J56698k6191n7920m0351k9003J2333K9341n0866j6236M4925Q384j8636
16762A4393m7656p119R705O151P2733j8704k8597J9062j3443j6030N3935N4239
16750I8669N1322n7510n6431q7719p8037O881L6400J13422P404J833k3665j18324
16738a05755k1964j1640P2589l2249k2152J8495O8677k5719K8944L1971M2680
16727D3877J305k1723m11R0495K1980L693j37378q7113O3207O0957P2075n9391
16715E1573m0270M6014L3522j4637n2516j9379J0960P7003J0374j34521n8283
$$ plain form
16704 -90160 -79094 6588 15669 34882 -3266 -28088 24822 20865 -39319 -11578 37760 53898
16692 53898 -16537 -93575 -132629 -134830 -106784 -65667 -39606 -29197 10936 -29523 -113560 -119111
16680 -119111 -63902 -16868 -18401 17248 12772 -5567 -35265 -21755 -21303 -82495 -157286 -201765
16668 -201765 -199845 -147784 -11463 11988 -68045 -88801 -37984 -61682 -138111 -105846 -86836
16657 -86836 -99277 -24491 -15806 3767 20694 -32175 -74931 -79410 -22500 -30408 -52216 12838
16645 12838 68527 38643 7897 -17271 -68076 -98920 -77509 -52768 -31919 27413 17774 3938
16633 3938 13793 34642 26270 -71690 -71800 23418 9333 -43729 -4854 6600 -25004 -30202 -62828
16620 -62828 -154745 -203113 -169990 -74798 -72932 -174017 -69020 -40166 -142498 -138763 -93086
$$ packed form
16704i0160J1066Q5682R081J9213l8148k4822N2910l957o0184K7741M9338J6138
16692E3898p0435p7038l9054k201K8046M1117K6061J0409M0133m0459q4037n551
16680a19111N5209M7034j533L5649m476j8339k9698J3510M52o1192p4791m4479
16668b01765J920N2061J36321K3451q0033k0756N0817k3698p6429L2265J9010
16657h6836j2441P4786Q685J9573J6927n2869m2756m479N6910p908k1808O5054
16645A2838N5689k9884l0746k5168n0805l0844K1411K4741K0849N9332r639j3836
16633C938R855K0849q372r7960j10R5218j4085n3062L8875J1454l1604n198l2626
16620f2828r1917m8368L3123R5192J866j01085J04997K8854j02332L735M5677
$$ plain form
16609 -93086 -48206 -48568 1174 -47260 -77281 -126523 -121700 -126740 -95251 -37367 7004 -79854
16597 -79854 -62213 23891 86679 49830 -31162 -76255 -131369 -143559 -85548 -100701 -197868 -228226
16585 -228226 -189678 -124101 -41324 47243 187077 129622 75707 19340 -124119 -150239 -98232
16574 -98232 -65410 -176194 -188043 -116162 -124468 -96000 -84186 -122340 -41332 6819 -39316 -51267
16562 -51267 -47560 -96268 -113072 -63170 -83653 -73094 30434 110037 78731 70789 146078 150883
16550 150883 42952 68440 65954 34639 -69001 -140413 -44061 -13281 -37300 -10207 -15393
16539 -15393 -68925 -51667 45352 67053 63281 94302 16896 3597 7813 -58851 -4147 24359
16527 24359 3110 -70837 -115234 -122822 -127959 -96629 -47612 -11683 -8184 -17498 -111046 -149774
$$ packed form
16609i3086M4880l62M9742m8434l0021m9242M823n040L1489N7884M4371q6858
16597g9854J7641Q6104O2788l6849q0992m5093n5114j2190N8011j5153r7167l0358
16585b28226L8548O5577Q2777Q8567J39834n7455n3915n6367j43459k6120N2007
16574i8232L2822j10784j1849P1881q306K8468J1814l8154Q1008M8151m6135j1951
16562e1267L707m8708j6804M9902k0483J0559J03528P9603l1306p942P5289M805
16550A50883j07931K5488k486l1315j03640p1412R6352L0780k4019K7093n186
16539a5393n3532J7258R7019K1701l772L1021p7406j3299M216o6664N4704K8506
16527B4359k1249p3947m4397p588n137L1330M9017L5929L499r314r3548l8728
$$ plain form
16515 -149774 -169579 -143223 -90462 -24816 -19341 23238 53791 18381 -57086 -79799 -33070 -67416
16503 -67416 -82818 -108568 -102083 -28179 34956 14440 -48677 -62683 -57194 -95750 -111003 -56876
16491 -56876 -61787 -51172 -80205 -32657 -51320 -101259 -57274 -64547 -80246 -59888 -102138 -90096
16479 -90096 3939 8087 -113614 -86249 4781 24023 -7662 -8767 -49215 -116216 -74948 -63355
16467 -63355 -75096 -95648 -160350 -117102 -45598 7495 10787 9138 -27933 -49110 -15471 -180594
16455 -180594 -233066 -212241 -167602 -139862 -130215 -84342 -72604 -79780 -16221 10737 -32282 -60229
16443 -60229 8699 85022 140155 69058 -32907 -64595 -60016 -116384 -157307 -155648 -65823 -23989
16431 -23989 71913 68066 1147 18669 -31902 -46816 -51256 -53367 -46098 -30718 25603 8640
$$ packed form
16515a49774j9805K6356N2761O5646N475M2579L0553l5410p5467k2713M6729l4346
16503f7416j5402k5750O485P3904O3135k0516o3117j4006N489l8556j5253N4127
16491e6876m911J0615k9033M7548j8663m9939M3985p273j5699K0358m2250J2042
16479i0096R4035M148j21701K7365R1030J9242l1685j105m0448o7001M1268J1593
16467f3355j1741k0552o4702M3248P1504N3093L292j649l7071k1177L3639j65123
16455a80594n2472K0825M4639K7740R647M5873J1738p176O3559K6958m3019k7947
16443f0229O8928P6323N5133p1097j01965l1688M579n6368m0923J659Q9825M1834
16431b3989R5902l847o6919J7522n0571j4914m440k111P269J5380N6321j6963
$$ plain form
16419 8640 -16905 4305 11577 -44621 -111310 -112992 -69578 41713 108192 -22111 -75475 11053
16407 11053 47825 22337 -22039 -17062 -8216 -96082 -171624 -96147 -66315 -108995 -80298 -53846
16395 -53846 -55004 -14086 -18992 -102960 -118494 -56547 -76814 -40688 22373 61361 82061 83512
16383 83512 125945 226645 164084 49298 -31488 -36710 19370 60329 43560 92587 124481
16372 124481 75491 -18803 -1543 -91742 -58202 -7043 13818 12418 15207 -29477 -52175 -104580
16360 -104580 -52068 -26408 -112262 -145040 -192015 -76963 -32839 -100958 -89514 -32608 -31675 -133330
16348 -133330 -179896 -141698 -121719 -15465 -5938 -68479 -80135 -141048 -183165 -274922 -175612
16337 -175612 -86015 -80870 -55193 -24340 -146978 -225479 -178055 -104094 -115721 -108114 -154523 -117828
$$ packed form
16419H640k5545K1210P272n6198o6689j682M3414J11291O6479j30303n3364Q6528
16407A1053L6772k5488m4376M977Q846q7866p5542P5477K9832m2680K8697K6452
16395e3846j158M0918m906q3968j5534O1947k0267L6126O3061L8988K0700J451
16383H3512M2433J00700o2561j14786q0786n222N6080M0959j6769M9027L1894
16372A24481m8990r4294J7260r0199L3540N1159K0861j400K789m4684k2698n2405
16360a04580N2512K5660q5854l2778m6975J15052M4124o8119J1444N6906R33j01655
16348a33330m6566L8198J9979J06254R527o2541j1656o0913m2117r1757R9310
16337a75612Q9597N145K5677L0853j22638p8501M7424P3961j1627P607m6409L6695
$$ plain form
16325 -117828 -60191 -59057 -91760 -119352 -79718 1075 26749 16236 2965 44745 17831 49665
16313 49665 65330 134860 128166 38615 27800 73854 70909 49768 33182 -60265 -66384 -40198
16301 -40198 9183 -1048 -54853 -101241 -110820 -99145 -51129 65114 106801 43739 -23000 49233
16289 49233 71801 88185 -21658 -69020 -58835 -64669 -79827 -119152 -123513 -158062 -165655 -192482
16277 -192482 -176625 -104742 -87125 -78377 -43768 29584 35865 -4423 -40865 -73086 -15238 8293
16265 8293 3032 -62432 -93753 -132668 -133904 1642 126484 84600 37607 -19778 -46509 -162766
16253 -162766 -154054 -165490 -122707 -106345 -152063 -128720 10761 69355 9897 70775 64629 17975
16241 17975 -35029 -73552 -47751 -22211 -13515 -3948 -69704 -66716 -21384 -18919 -6425 -23021
$$ packed form
16325a17828N7637J134l2703k7592L9634Q0793K5674j0513j3271M1780k6914L1834
16313D9665J5665O9530o694q9551j0815M6054k945k1141j6586r3447o119K6186
16301d0198M9381j0231n3805m6388r579J1675M8016J16243M1687o3062o6739P2233
16289D9233K2568J6384j09843m7362J0185n834j5158l9325m361l4549p593k6827
16277a92482J5857P1883J7617Q748L4609P3352O281m0288l6442l2221N7848K3531
16265H293n261o5464l1321l8915j236J35546J24842m1884m6993n7385k6731j16257
16253a62766Q712j1436M2783J6362m5718K3343J39481N8594n9458O0878o146m6654
16241A7975n3004l8523K5801K5540Q696R567o5756K988M5332K465J2494j6596
$$ plain form
16229 -23021 -60444 -25088 -53782 -72365 -26893 -38217 -128817 -123482 -2277 2244 -121758 -218550
16217 -218550 -225829 -142879 6951 89155 123970 30369 -56415 -31460 -33931 -108217 -120121 -154581
16205 -154581 -127631 -52403 -72469 -18748 -112159 -194141 -135945 -19360 56736 93125 33086
16194 33086 13168 -101807 -73206 -48225 -62346 -98920 -121101 -104724 4279 35060 -9083
16183 -9083 6046 26337 -17645 -80114 -30026 32031 -27164 -96394 -38515 24367 -1484 -5359
16171 -5359 -41943 -140769 -169222 -137865 -146239 -188285 -10436 6180 -59347 -16868 41678 92290
16159 92290 120363 157669 162294 87621 35441 49729 36376 69350 136774 171194 178299 64174
16147 64174 46971 78809 120532 122152 106644 103804 110379 97971 113267 132747 64751 13292
$$ packed form
16229b3021l7423L5356k8694j8583M5472j1324r0600N335J21205M521j24002r6792
16217b18550p279Q2950J49830Q2204L4815r3601q6784K4955k471p4286j1904l4460
16205a54581K6950P5228k0066N3721r3411q1982N8196J16585P6096L6389o0039
16194C3086j9918j14975K8601K4981j4121l6574k2181J6377J09003L0781m4143
16183i083J5129K0291m3982o2469N0088O2057n9195o9230N7879O2882k5851l875
16171e359l6584r8826k8453L1357q374m2046J77849J6616o5527M2479N8546N0612
16159I2290K8073L7306M625p4673n2180J4288j3353L2974O7424L4420P105j14125
16147F4174j7203L1838M1723J620j5508k840O575j2408J5296J9480o7996n1459
$$ plain form
16135 13292 -24122 -5909 16200 -53924 -67211 71247 62079 24193 -29875 -4533 21376 495
16123 495 -40312 -34084 -61406 -33258 22305 33663 23688 -47890 -107100 -199055 -249531 -183527
16111 -183527 -76691 -2898 53995 25590 -29058 39162 75516 69428 50124 23347 -11288
16100 -11288 -35262 1270 27371 1075 -31383 -52527 -29113 36115 -43349 -24929 -43169 -88622
16088 -88622 -88983 -154123 -151647 -128812 -54909 62731 78528 -6359 -2451 12067 -42421 -112695
16076 -112695 -100443 -62866 -32110 6418 -19962 -57961 -133154 -177410 -98755 9146 57269
16065 57269 9764 11959 -27527 -34659 -67513 -28031 -11192 -8266 -7220 -35030 -14610 21762
16053 21762 6240 60463 91660 55948 -4127 -18535 5997 -31245 32945 37356 64296 138119
$$ packed form
16135A3292l7414J8213K2109p0124j3287J38458r168l7886n4068K5342K5909k0881
16123D95m0807O228k7322K8148N5563J1358r975p1578n9210r1955n0476O6004
16111a83527J06836P3793N6893k8405n4648O8220L6354o088j9304k6777l4635
16100a1288k3974L6532K6101k6296l2458k1144K3414O5228p9464J8420j8240m5453
16088h8622l61o5140K476K2835P3903J17640J5797q4887L908J4518n4488p0274
16076a12695J2252L7577L0756L8528k6380l7999p5193m4256P8655J07901M8123
16065E7269m7505K195l9486p132l2854L9482J6839K926J046k7810K0420L6372
16053B1762j5522N4223L1197l5712o0075j4408K4532l7242O4190M411K6940P3823
$$ plain form
16041 138119 139021 106872 84392 100222 86688 102874 63350 -14830 -105300 -102789 -42566 18420
16029 18420 91438 -11868 -3996 82631 75811 75829 13951 -51787 -93334 -136496 -118444 -69241
16017 -69241 -60296 -94170 -140904 -64334 -44449 -24563 22409 113572 134761 158910 102847 109861
16005 109861 -7680 -65442 -145409 -109332 -43770 -70884 -65523 -93294 -96500 -11309 -19898 -8981
15993 -8981 -22025 -89613 -54221 -49202 -22458 885 65201 96395 -25160 -51558 -130280 -140110
15981 -140110 -90886 -41397 29814 120442 79461 98613 56753 30802 -6896 4355 -25209
15970 -25209 -107774 -135893 -60344 -75243 35060 65617 70321 79939 39002 18859 -38150 -84
15958 -84 -69 -11157 22571 39258 19329 39172 -8838 -112033 -146844 -119514 19589 154863
$$ packed form
16041A38119R02l2149k2480J5830j3534J6186l9524p8180r0470K511O0223O0986
16029A8420P3018j03306P872Q6627o820J8o1878o5738m1547m3162J8052M9203
16017f9241Q945l3874m6734P6570J9885J9886M6972R1163K1189K4149n6063P014
16005A09861j17541n7762p9967L6077O5562k7114N361k7771l206Q5191q589J0917
15993h981j3044o7588L5392N019K6744K3343O4316L1194j21555k6398p8722r830
15981a40110M9224M9489P1211R0628m0981J9152m1860k5951l7698J1251k9564
15970b5209q2565k8119P5549j4899J10303L0557M704R618m0937k0143n7009L8066
15958h4J5j1088L3728J6687j9929J9843m8010j03195l4811K7330J39103J35274
$$ plain form
15946 154863 127848 56149 52778 27980 81093 98721 110643 74647 81918 -20911 -61873 -32524
15934 -32524 -102556 -189191 -125187 -65980 -31431 53937 122946 -22472 -116487 -96401 -44957
15923 -44957 -18659 61382 110905 84630 44416 101234 145753 60100 29247 -2928 -65031 -92527
15911 -92527 -55687 -8101 -8354 -28438 23594 82743 100536 98438 127942 92615 67004 23891
15899 23891 62800 86592 77260 48759 28952 21382 76239 80877 95573 51894 -22882 -84459
15887 -84459 -33305 -40349 -28075 32384 -70953 -113834 -90535 -58929 -46829 -43111 -48085 -93425
15875 -93425 -123980 -45570 -5691 19059 18739 -37764 -95963 -87073 -108677 -133652 -207833 -225002
15863 -225002 -174499 -135972 -128254 -150418 -56112 -38482 -102365 -82278 -3065 -7154 -25666 -46435
$$ packed form
15946A54863k7015p1699l371k4798N3113J7628J1922l5996P271j02829m0962K9349
15934c2524p0032q6635O4004N9207L4549Q5368O9009j45418r4015K0086N1444
15923d4957K6298Q0041M9523k6275m0214N6818M4519q5653l0853l2175o2103k7496
15911i2527L6840M7586k53k0084N2032N9149J7793k098K9504l5327k5611m3113
15899B3891L8909K3792r332k8501j9807p570N4857M638J4696m3679p4776o1577
15887h4459N1154p044J2274O0459j03337m2881K3299L1606J2100L718m974m5340
15875i3425l0555P8410L9879K4750l20n6503n8199Q890k1604k4975p4181j7169
15863b25002N0503L8527P718k2164R4306J7630o3883K0087P9213m089j8512k0769
$$ plain form
15851 -46435 -14621 -94482 -106378 -123357 -108353 -103211 -149281 -153218 -149066 -65161 -29959 -121604
15839 -121604 -151907 -127264 -26540 73990 97424 24730 -94234 -159447 -142244 -205887 -147964
15828 -147964 -83754 -102248 -106542 -126086 -154339 -173559 -162963 -197192 -175200 -78838 -106393 -94421
15816 -94421 -100470 -58311 -4483 44604 75555 97399 107969 80012 38393 31912 -20873 -124954
15804 -124954 -40895 35750 54781 54269 28389 26285 -41152 -25847 -28467 -42654 -45467 -43081 -25976
15791 -25976 -74299 -69685 -66 25075 -16193 -14579 57276 56419 -27914 -87766 -152693 -151590 -136942
15778 -136942 -112730 -10761 47368 9712 13665 -65052 -89786 -52149 -40883 -55809 -85919
15767 -85919 -28686 37940 73379 119427 55275 9676 85215 123396 43966 -85364 -97145
$$ packed form
15851d6435L1814p9861j1896j6979J5004N142m6070l937M152Q3905L5202r1645
15839a21604l0303K4643J00724J00530K3434p2694j18964o5213J7203o3643N7923
15828a47964O4210j8494m294j9544k8253j9220J0596l4229K1992R6362k7555J1972
15816i4421o049M2159N3828M9087L0951K1844J0570k7957m1619o481n2785j04081
15804a24954Q4059P6645J9031n12k5880k104o7437J5305k620j4187k813K386J7105
15791b5976m8323M614O9619K5141m1268J614P1855q57q4333n9852o4927J103J4648
15778a36942K4212J01969N8129l7656L953p8717k4734L7637J1266j4926l0110
15767h5919N7233O6626L5439M6048o4152m5599P5539L8181p9430j29330j1781
$$ plain form
15756 -97145 -47213 -30200 53793 97012 95319 17092 -10762 67371 25381 -20572 -32004 11893
15744 11893 37177 -17428 37853 60397 1733 -377 -53 -65748 -100279 -44383 -41267 -106160
15732 -106160 -144294 -140307 -99162 -93690 -51055 -86926 -127310 -41789 20269 5895 25607 83107
15720 83107 67194 48270 73596 28949 -12359 -91438 -61189 -18364 -78277 6123 155745
15709 155745 140866 48495 -63768 -110869 -15965 -85315 -57776 81713 100621 77226 30461
15698 30461 34646 9344 -27471 -84942 -187089 -137440 -65323 23461 50273 33070 86997 62116
15686 62116 98046 80138 71230 55693 32186 -24764 -48789 -74141 -20287 -5919 22634 -82396
15674 -82396 -60582 35410 53915 36955 -56259 -38358 21888 -7801 -18657 13865 64542 146579
$$ packed form
15756i7145M9932J7013Q3993M3219j693p8227k7854P8133m1990m5953j1432M3897
15744A1893K5284n4605N5281K2544n8664k110L24o5695l4531N5896L116o4893
15732a06160l8134L987M1145N472M2635l5871m0384Q5521O2058j4374J9712N7500
15720H3107j5913j8924K5326m4647m1308p9079L0249M2825n9913Q4400J49622
15709A55745j4879r2371j12263m7101R4904o9350K7539J39489J8908k3395m6765
15698C0461M185k5302l6815n7471j02147M9649P2117Q8784K6812j7203N3927k4881
15686F2116L5930j7908q908j5537k3507n6950k4025k5352N3854J4368K8553j05030
15674h2396K1814R5992J8505j6960r3214J7901O0246k9689j0856L2522N0677Q2037
$$ plain form
15662 146579 100664 4956 54101 39819 -29055 -76019 -99820 -25684 13853 49299 -2534
15651 -2534 -58217 -47090 43808 96121 109279 30025 -96166 5964 64229 22307 -16944
15640 -16944 -61673 13415 44460 96962 71965 48286 21721 -1051 36343 46854 261 8970
15628 8970 77300 54413 11885 -20058 3168 -36311 -141480 -180845 -136778 -78865 -70892 -96105
15616 -96105 -112738 -102774 -78824 -9496 3769 -131213 -210159 -209563 -104369 14725 35538 10088
15604 10088 -71448 -142080 -204259 -118315 -117495 -167163 -80054 22374 29764 19368 68488 48266
15592 48266 37772 68965 11546 -51428 21507 3705 17761 123419 203716 149692 86669
15581 86669 110725 61257 18433 -43402 -95803 -68409 -48412 -67259 -48808 -12869 -54278 -10164
$$ packed form
15662A46579m5915r5708M9145j4282o8874m6964k3801P4136L9537L5446n1833
15651b534n5683J1127R0898N2313J3158p9254j26191J02130N8265m1922l9251
15640a6944m4729P5088L1045N2502k4997k3679k6565k2772L7394J0511m6593Q709
15628H970O8330k2887m2528l1943K3226l9479j05169l9365M4067N7913P973k5213
15616i6105j6633R964K3950O9328J3265j34982p8946N96J05194J19094K0813k5450
15604A0088q1536p0632o2179Q5944Q20m9668Q7109J02428P390j0396M9120k0222
15592D8266j0494L1193n7419o2974P2935j7802J4056J05658Q0297n4024o3023
15581H6669K4056m9468m2824o1835n2401K7394J9997j8847J8451L5939m1409M4114
$$ plain form
15569 -10164 58992 75524 51851 11634 12126 40408 9738 92412 77985 -3201 65829 84866
15557 84866 39988 33974 78530 100206 27937 29029 53654 75314 48011 633 -7897 23378
15545 23378 31921 74893 140924 139339 112579 17142 -28842 41951 2986 -65044 -70047 -56872
15533 -56872 -75190 -21034 -17869 36503 112326 55760 -32331 -106801 -103597 -77347 26838 22971
15521 22971 58915 60618 54068 44047 120107 196482 211277 212874 212981 200596 202030 250996 240116
15508 240116 113948 166758 303649 338834 391335 512400 709198 942729 1287640 1505222
15498 1505222 1705999 1801039 1838027 1802623 1648057 1463590 1341866 1122491 929132 710181
15488 710181 501191 471288 424518 324883 176891 119384 166335 156406 152110 170833 164344 192719
$$ packed form
15569a0164O9156J6532k3673m0217M92K8282l0670Q2674j4427q1186O9030J9037
15557H4866m4878o014M4556K1676p2269J092K4625K1660k7303m7378q530L1275
15545B3378Q543M2972O6031j585k6760r5437m5984P0793l8965o8030n003J3175
15533e6872j8318N4156L165N4372P5823n6566q8091p4470L204K6250J04185l867
15521B2971L5944J703o550j0021P6060P6375J4795J597J07j2385J434M8966j0880
15508B40116j26168N2810J36891L5185N2501J21065J96798K33531L44911K17582
15498A505222K00777R5040L6988l5404j54566j84467j21724k19375j93359k18951
15488G10181k08990k9903m6770r9635j47992n7507M6951r929m296J8723o489K8375
$$ plain form
15476 192719 148024 83880 31799 -31458 -46894 -98409 -61339 -10044 -36668 -108847 -70485
15465 -70485 29409 42530 36609 -32716 -39163 45733 68155 96764 91051 78530 125051 68198
15453 68198 47993 65386 38095 99023 110080 76292 112307 95370 57719 99887 124646 109118
15441 109118 91403 130883 115416 141225 72853 24912 -40283 -78874 3367 65100 66924 12355
15429 12355 78583 114276 21681 -17776 31488 28621 74447 94856 102266 151440 101994 18263
15417 18263 108112 82715 2439 -92819 -143081 -79630 -62243 -91818 -137393 -55117 136795
15406 136795 204715 225391 208373 139635 32109 12436 -33755 -82597 -108812 -62756 -51201
15395 -51201 59928 152527 155754 150745 119732 150493 191686 157453 112343 119464 40541 -51410
$$ packed form
15476A92719m4695o4144n2081o3257j5436n1515L7070N1295k6624p2179L8362
15465g0485R9894J3121n921o9325o447Q4896K2422K8609n713j2521M6521n6853
15453F8198k0205J7393k7291O0928J1057l3788L6015j6937l7651M2168K4759j5528
15441A09118j7715L9480j5467K5809o8372m7941o5195l8591Q2241O1733J824n4569
15429A2355O6228L5693r2595l9457M9264k867M5826K0409P410M9174m9446q3731
15417A8263Q9849k5397q0276r5258n0262O3451J7387k9575m5575Q2276J91912
15406A36795O7920K0676j7018o8738j07526j9673m6191m8842k6215M6056J1555
15395e1201J11129R2599L227n009l1013L0761M1193l4233m5110P121p8923r1951
$$ plain form
15383 -51410 -45250 -83036 -77944 -36920 65913 121263 62622 10704 -51373 -49524 -32105 -37536
15371 -37536 -82747 -114430 -79811 -73955 -129273 -110936 8289 -25155 -74005 -58521 -22407 -102225
15359 -102225 -45336 -10341 -32082 -25297 26883 47266 -7781 47901 90024 114503 154963 164519
15347 164519 160491 175360 188117 136006 109083 160234 238280 163656 77271 26697 -15295 -83246
15335 -83246 6233 43018 71027 41312 77522 122579 85203 25887 72448 72794 38115 66924
15323 66924 78934 44761 39823 45466 34109 60154 96333 149771 190832 216269 296697 287379
15311 287379 222919 298479 346848 395706 327749 236603 249389 281692 297943 254585 273288
15300 273288 340549 335106 280730 201436 191774 174012 136218 150277 233964 193518 172394 200687
$$ packed form
15383e1410O160l7786N092M1024J02833N5350n8641n1918o2077J849J7419n431
15371c7536m5211l1683L4619N856n5318J8337J19225l3444m8850J5484L6114p9818
15359a02225N6889L4995k1741O785N2180K0383n5047N5682M2123K4479M0460R556
15347A64519m028J4869J2757n2111k6923N1151P8046p4624q6385n0574m1992o7951
15335h3246Q9479L6785K8009k9715L6210M5057l7376n9316M6561L46l4679K8809
15323F6924J2010l4173m938N643j1357K6045L6179N3438M1061K5437Q0428r318
15311B87379o4460P5560M8369M8858o7957r1146J2786L2303J6251m3358J8703
15300B73288O7261n443n4376p9294r662j7762l7794J4059Q3687m0446k1124K8293
$$ plain form
15288 200687 196282 222621 209702 246027 283375 161369 95837 132730 187922 225209 255218
15277 255218 252565 265325 259651 185231 113973 117657 213540 233589 183961 153560 199459 279138
15265 279138 267158 217276 228945 154877 42565 -27743 2284 19861 37071 74120 55317
15254 55317 80958 77501 -55370 -73640 91229 190933 203110 388997 524369 572504 624589
15243 624589 720927 767672 771993 703224 654584 673468 674126 625902 563693 507034 516213 508761
15231 508761 553330 560133 531296 503805 504056 464066 436138 406909 392699 444984 401388 466927
15219 466927 519718 508705 579003 632652 689112 769675 855252 897840 935947 900414 860156
15208 860156 854230 868917 906135 755707 612384 564443 555888 520694 498844 496910 437329 445242
$$ packed form
15288B00687m405K6339j2919L6325L7348j22006o5532L6893N5192L7287L0009
15277B55218k653J2760n674p4420p1258L684R5883K0049m9628l0401M5899P9679
15265B79138j1980m9882J1669p4068j12312p0308L0027J7577J7210L7049j8803
15254E5317K5641l457j32871j8270J64869R9704J2177J85887J35372M8135N2085
15243F24589R6338M6745M321o8769m8640J8884O58m8224o2209n6659R179p452
15231E08761M4569O803k8837k7491K51l9990k7928k9229j4210N2285m3596O5539
15219D66927N2791j1013P0298N3649N6460Q0563Q5577M2588L8107l5533m0258
15208H60156n926J4687L7218j50428j43323m7941q555l5194k1850j934n9581P913
$$ plain form
15196 445242 447669 344937 248222 254840 367736 372278 368730 417186 409690 332442 356155 501577
15184 501577 593856 548211 506076 475154 394594 378513 379798 530318 616159 503427 406886
15173 406886 431714 513695 560334 533009 401397 422574 477625 453468 462359 504123 405984
15162 405984 348788 378820 360558 380500 400423 446298 468473 453187 430630 367816 422204
15151 422204 440591 485265 591531 652604 603302 593882 644145 734233 770704 801150 785982
15140 785982 814835 855345 1019571 1047334 1020040 1013236 973211 875764 868151 910493 987408 1172020
15128 1172020 1381333 1579584 1720459 1819609 1903133 2057590 2152871 2167607 2150623 2149650 2075054
15117 2075054 1939185 1812793 1729248 1748567 1763870 1757907 1823729 1914676 2008247 2013187 2191963
$$ packed form
15196D45242K427j02732r6715O618J12896M542l548M8456p496p7248K3713J45422
15184E01577R2279m5645m2135l0922q0560j6081J285J50520Q5841j12732r6541
15173D06886K4828Q1981M6639k7325j31612K1177N5051k4157Q891M1764r8139
15162D05984n7196L0032j8262J9942J9923M5875K2175j5286k2557o2814N4388
15151D22204J8387M4674J06266O1073m9302r420N0263R0088L6471L0446j5168
15140G85982K8853M0510J64226K7763k7294o804m0025r7447p613M2342P6915J84612
15128A172020K09313J98251J40875R9150Q3524J54457R5281J4736j6984r73p4596
15117B075054j35869j26392q3545J9319J5303n963O5822R0947R3571M940J78776
$$ plain form
15106 2191963 2282992 2389553 2455600 2542490 2606040 2710214 2820477 2987510 3154458 3334931
15096 3334931 3505734 3685923 3897521 4102974 4366163 4652566 4917892 5210684 5461051
15087 5461051 5656071 5952461 6457177 7008408 7525721 8079318 8681268 9318280 10123569
15078 10123569 11118560 12354704 13685930 15168783 16926126 19002163 21490699 24228012
15070 24228012 27214039 30459133 33915942 37963335 42672430 48318469 55585473 65512435
15062 65512435 79856577 100843220 130027439 166495589 207351532 250412311 293016969
15055 293016969 328703261 350367870 356231893 347316715 324003399 287752021 243900193
15048 243900193 198780594 156730041 120028448 89919334 66884783 50640693 39784438
$$ packed form
15106B191963R1029J06561O6047Q6890O3550J04174J10263J67033J66948J80473
15096C334931J70803J80189K11598K05453K63189K86403K65326K92792K50367
15087E461051J95020K96390N04716N51231N17313N53597O01950O37012Q05289
15078A0123569R94991J236144J331226J482853J757343K076037K488536K737313
15070B4228012K986027L245094L456809M047393M709095N646039P267004R926962
15062F5512435J4344142K0986643K9184219L6468150M0855943M3060779M2604658
15055B93016969L5686292K1664609N864023q915178k3313316l6251378m3851828
15048B43900193m5119599m2050553l6701593l0109114k3034551j6244090j0856255
$$ plain form
15041 39784438 32472739 27404577 23611670 20556462 18083332 15808849 13802328 11931625
15033 11931625 10316269 8932379 7684152 6600588 5712502 5083659 4483414 4030751 3786108
15024 3786108 3476197 3186758 2885025 2693983 2481861 2332231 2180899 2015122 1842652
15015 1842652 1793277 1625816 1519074 1422836 1419658 1349829 1321397 1343763 1301354 1258832 1294344
15004 1294344 1300694 1239159 1154955 1052169 1032252 994843 941864 838156 807780 785184 727431
14993 727431 645622 655466 613120 681432 631045 576633 673004 759820 730883 713074 725592 724339
14981 724339 621108 549023 574214 473563 446738 476087 508075 514621 447374 301713 204761
14970 204761 194499 244752 280202 262832 256720 250429 270626 241060 251034 260424 254787 308271
$$ packed form
15041C9784438p311699n068162l792907l055208k473130k274483k006521j870703
15033A1931625j615356j383890j248227j083564q88086o28843o00245m52663k44643
15024C786108l09911k89439l01733j91042k12122j49630j51332j65777j72470
15015A842652m9375j67461j06742r6238l178o9829k8432K2366m2409m2522L5512
15004A294344O350o1535q4204j02786j9917l7409n2979j03708l0376k2596n7753
14993G27431q1809R844m2346O8312n0387n4412R6371Q6816k8937j7809J2518j253
14981G24339j03231p2085K5191j00651k6825K9349L1988O546o7247j45661r6952
14970B04761j0262N0253L5450j7370o112o291K0197k9566R974R390n637N3484
$$ plain form
14958 308271 319919 247112 252132 162771 24216 -79062 -48156 21516 77251 40604 75606
14947 75606 170066 151371 38225 -23589 66526 96878 82559 32173 82685 170044 122451
14936 122451 125696 108252 46655 46465 68326 50302 90891 102885 127366 211220 150632 92091
14924 92091 34492 19759 18761 -96289 -117149 -83820 -42790 -13736 -8155 -77895 -63951 12627
14912 12627 34877 88107 94241 45669 -34596 13544 12216 33482 72376 27014 -49233 -45147
14900 -45147 -89166 -124619 -142080 -37666 34026 30588 -19165 -16818 -60848 -114169 -16812 43205
14888 43205 2151 -37043 -22245 51870 60441 69494 24925 6407 -41257 -49085 -3602 -111952
14876 -111952 -195559 -285020 -300508 -280144 -291647 -370956 -446676 -519413 -547136 -536358 -598193
$$ packed form
14958C08271J1648p2807N020q9361j38555j03278L0906O9672N5735l6647L5002
14947G5606R4460j8695j13146o1814R0115L0352j4319n0386N0512Q7359m7593
14936A22451L245j7444o1597j90K1861j8024M0589J1994K4481Q3854o0588n8541
14924I2091n7599j4733r98j15050k0860L3329M1030K9054N581o9740J3944P6578
14912A2627K2250N3230O134m8572q0265M8140j328K1266L8894m5362p6247M086
14900d5147m4019l5453j7461J04414P1692l438m9753K347m4030n3321R7357O0017
14888D3205m1054l9194J4798P4115Q571R053m4569j8518m7664p828M5483j08350
14876a11952q3607q9461j5488K0364j1503p9309p5720p2737k7723J0778o1835
$$ plain form
14865 -598193 -526006 -493989 -497180 -447043 -325700 -237911 -101211 23167 110244 165723 174910
14854 174910 190170 258244 341807 282627 291545 313949 293952 324445 297434 332175 370376 305347
14842 305347 159464 108654 87345 102270 256549 325092 310498 316111 235927 211341 223601
14831 223601 182784 254358 244642 147393 112146 82843 136432 150060 144807 125614 113230 156587
14819 156587 216589 239383 222873 245395 369326 338487 281105 298084 395467 442584 465673
14808 465673 442933 512938 576214 600624 620356 719950 747514 821323 1000667 1256441 1513976
14797 1513976 1859474 2296138 2802249 3273788 3664033 3799493 3736010 3469071 3124648 2699682
14787 2699682 2280316 1875067 1579590 1275674 998681 780145 682204 596200 442208 415205
$$ packed form
14865e98193P2187L2017l191N0137J21343Q7789J36700J24378Q7077N5479R187
14854A74910J5260O8074Q3563n9180Q918K2404j9997L0493k7011L4741L8201o5029
14842C05347j45883n0810k1309J4925J54279O8543j4594N613q0184k4586J2260
14831B23601m0817P1574r716r7249l5247k9303N3589J3628n253j9193j2384M3357
14819A56587O0002K2794j6510K2522J23931l0839n7382J6979R7383M7117K3089
14808D65673k2740P0005O3276K4410J9732R9594K7564P3809J79344K55774K57535
14797A513976L45498M36664N06111M71539L90245J35460o3483k66939l44423m24966
14787B699682m19366m05249k95477l03916k76993k18536r7941q6004j53992k7003
$$ plain form
14777 415205 358745 275583 238391 220291 126704 142321 113801 5607 -12379 -10478 46351
14766 46351 113375 119737 68225 54956 61015 -15528 -61858 -51012 17715 9706 43342 124994
14754 124994 91969 19129 -2782 48604 88637 153019 200819 135074 66375 104603 92037
14743 92037 -16987 34990 17647 26858 82782 12707 -27252 48627 36177 83851 132690 182837
14731 182837 212140 118540 52396 -46104 -73171 -45237 23553 60095 37098 -63241 -143906
14720 -143906 -206022 -215155 -168428 -114429 -90592 -76995 -77553 -62714 -28364 4684 -3865 -24883
14708 -24883 -61272 -32914 51438 -10216 -73300 -98986 -8668 34810 39667 75999 47670 4126
14696 4126 -54573 -76824 -174868 -109239 -31327 11823 45607 -47224 -104240 -15129 -6887 -11928
$$ packed form
14777D15205n6460q3162l7192j8100r3587J5617k8520j08194j7986J901N6829
14766D6351O7024O362n1512j3269O059p6543m6330J0846O8727q009L3636Q1652
14754A24994l3025p2840k1911N1386M0033O4382M7800o5745o8699L8228j2566
14743I2037j09024N1977j7343R211N5924p0075l9959P5879j2450M7674M8839N0147
14731A82837K9303r3600o6144r8500k7067K7934O8790L6542k2997j00339q0665
14720a43906o2116r133M6727N3999K3837J3597n58J4839L4350L3048q549k1018
14708b4883l6389K8358Q4352o1654o3084k5686R0318M3478M857L6332k8329m3544
14696D126n8699k2251r8044O5629P7912M3150L3784r2831n7016Q9111Q242n041
$$ plain form
14684 -11928 -45057 -49479 -61684 -122266 -164412 -172906 -181797 -122134 -54955 41917 78200 111994
14672 111994 105385 -11857 -89597 -115051 -130468 29787 147364 143015 123283 110980 101369
14661 101369 63246 31191 23753 -10359 -31303 -10115 -705 -6223 29819 -13578 -97062 -86271
14649 -86271 -730 19529 -38958 -29214 18453 87402 135166 140437 107807 76031 123033 164162
14637 164162 98281 131054 105182 154283 188546 59148 66322 118504 100740 120925 183463
14626 183463 139537 20156 35870 114597 120187 96983 126762 142926 262236 289664 272122
14615 272122 355816 386494 309415 389449 656680 846121 1097663 1294845 1473086 1643344
14605 1643344 1792791 1768289 1749329 1778334 1732905 1555271 1222621 895771 634373 463578
$$ packed form
14684a1928l3129m422j2205o0582m2146q494q891N9663O7179R6872L6283L3794
14672A11994o609j17242p7740k5454j5417J60255J17577m349j9732j2303r611
14661A01369l8123l2055p438l4112k0944K1188R410n518L6042m3397q3484J0791
14649h6271Q5541K0259n8487R744M7667O8949M7764N271l2630l1776M7002M1129
14637A64162o5881L2773k5872M9101L4263j29398P174N2182j7764K0185O2538
14626A83463m3926j19381J5714P8727N590k3204K9779J6164J19310K7428j7542
14615B72122Q3694L0678p7079Q0034K67231J89441K51542J97182J78241J70258
14605A643344J49447k4502j8960K9005m5429j77634l32650l26850k61398j70795
$$ plain form
14595 463578 423754 382385 367351 305569 251944 131439 33694 18064 112221 117853 49282
14584 49282 -49688 5793 145778 126467 162493 128334 56772 56310 51698 52873 166361 235601
14572 235601 198805 129514 106843 100101 49436 11007 42895 127311 145398 33013 23956 34239
14560 34239 60788 59915 -3860 25735 95132 110851 101268 105676 58030 35482 5750 11317 62837
14547 62837 43655 23992 -96884 -112030 -54449 -79153 -25688 49994 95208 72103 38111
14536 38111 -47372 -57758 -20889 17882 -59992 36805 167806 175959 156983 125821 134322 126772
14524 126772 66508 12079 19253 78754 104263 154342 186246 202852 219816 196031 112854 56287
14512 56287 -102 6683 23968 57124 125014 79029 126208 125685 118784 222897 283736 205044
$$ packed form
14595D63578l9824m1369j5034o1782n3625j20505r7745j5630R4157N632o8571
14584D9282r8970N5481J39985j9311L6026l4159p1562m62m612J175J13488O9240
14572B35601l6796o9291k2671o742n0665l8429L1888Q4416J8087j12385r057J0283
14560C4239K6549q73o3775K9595O9397J5719r583M408m7646k2548k9732N567N1520
14547F2837j9182j9663j20876j5146N7581k4704N3465P5682M5214k3105l3992
14536C8111q5483j0386L6869L8771p7874R6797J31001Q153j8976l1162Q501p550
14524A26772o0264n4429P174N9501K5509N0079L1904J6606J6964k3785q3177n6567
14512E6287n6389O785J7285L3156O7890m5985M7179n23o901J04113O0839p8692
$$ plain form
14500 205044 214581 288079 373052 477170 533437 485273 547347 683075 873523 1058208 1340571
14489 1340571 1514541 1652068 1755698 1834265 1850736 1828832 1690987 1493254 1225548 985951
14479 985951 863808 812407 645566 536875 528489 379485 262132 145984 85453 116528
14469 116528 86571 102567 173835 147062 119613 61542 82563 192226 207833 181039 116345
14458 116345 12083 13214 -39750 -87298 -105929 -71703 -52524 -62247 -10687 63673 68272 107164
14446 107164 105555 77931 132053 154410 138320 104350 61928 15843 -12387 35878 37311 51465
14434 51465 106948 57169 20558 29701 21847 -13382 -41683 -49774 -20645 -17563 20885 50577
14422 50577 64514 25421 10281 -34876 -55601 -11912 51058 135646 123966 37697 11472 38262
$$ packed form
14500B05044R537P3498Q4973J04118N6267m8164O2074J35728J90448J84685K82363
14489A340571J73970J37527J03630P8567J6471k1904j37845j97733k67706k39597
14479I85951j22143n1401j66841j08691q386j49004j17353j16148o0531L1075
14469A16528k9957J5996P1268k6773k7449n8071K1021J09663J5607k6794o4694
14458A16345j04262J131n2964m7548j8631L4226J9179r723N1560P4360M599L8892
14446A07164j609k7624N4122K2357j6090l3970m2422m6085k8230M8265J433J4154
14434E1465N5483m9779l6611R143p854l5229k8301q091K9129L082L8448K9692
14422E0577J3937l9093j5140m5157k0725M3689O2970Q4588j1680q6269k6225K6790
$$ plain form
14410 38262 77506 82591 69550 58453 114003 177012 150760 116101 134567 143407 144800 195765
14398 195765 231855 284676 249456 238251 142141 56697 38050 -25368 -138371 -126759 -24979
14387 -24979 21263 -49998 -30905 -64437 81197 188573 224357 182378 145849 110020 48891
14376 48891 53535 111549 112284 182948 196204 100356 -5438 14498 38632 150381 171112 33923
14364 33923 -67081 -77331 -11677 -3933 -29832 -14175 51728 97961 -47591 -127163 -77338
14353 -77338 -72221 -20638 -63047 -25706 47003 19157 -45006 -30860 -32525 28876 40616 45236
14341 45236 -18288 -51441 -47484 30397 144747 166898 168833 139194 191381 217470 212036 133138
14329 133138 110159 84703 119938 131245 86903 109409 106155 79525 85875 100752 78996 60224
$$ packed form
14410C8262L9244N085j3041j1097N5550O3009k6252l4659J8466Q840J393N0965
14398A95765L6090N2821l5220j1205r6110q5444j8647o3418j13003J1612J01780
14387b4979M6242p1261J9093l3532J45634J07376L5784m1979l6529l5829o1129
14376D8891M644N8014P35P0664J3256r5848j05794J9936K4134J11749K0731j37189
14364C3923j01004j0250O5654P744k5899J5657O5903M6233j45552p9572M9825
14353g7338N117N1583m2409L7341P2709k7846o4163J4146j665O1401J1740M620
14341D5236o3524l3153L957P7881J14350K2151J935k9639N2187K6089n434p8898
14329A33138k2979k5456L5235J1307m4342K2506l254k6630O350J4877k1756j8772
$$ plain form
14317 60224 -94 45726 104209 68833 40684 32119 42128 67240 98184 120551 129919 132069
14305 132069 162963 98119 114252 180812 199784 218959 253044 328761 328983 329241 387754 374286
14293 374286 370921 376237 319356 313346 373311 400164 406380 431574 432294 285951 256273 262748 225324
14280 225324 191256 130652 144656 171201 172035 218504 254036 223952 164162 39741 -64249
14269 -64249 -54355 858 117123 209362 188249 111087 87373 71166 104 29063 83933 105991
14257 105991 147823 159417 198246 200704 184891 124892 117546 122141 170524 146353 56985 35426
14245 35426 -27334 -100696 -117654 -39440 -54878 21545 144283 163570 186393 232424 277919
14234 277919 457929 536989 566539 634014 798450 901405 883752 860803 808291 779355 785785
$$ packed form
14317F0224o0318M5820N8483l5376k8149q565J0009K5112L0944K2367R368K150
14305A32069L0894o4844J6133O6560J8972J9175L4085P5717K22K58N8513j3468
14293C74286l365N316n6881o010N9965K6853O216K5194P20j46343k9678O475l7424
14280B25324l4068o0604J4004K6545Q34M6469L5532l0084n9790j24421j03990
14269f4249R894N5213J16265R2239k1113p7162k3714j6207p1062K8959N4870K2058
14257A05991M1832J1594L8829K458j5813n9999p346M595M8383k4171q9368k1559
14245C5426o2760p3362j6958P8214j5438P6423J22738J9287K2823M6031M5495
14234B77919J80010P9060K9550O7475J64436J02955j7653k2949n2512k8936O430
$$ plain form
14223 785785 915094 874665 777385 781525 796449 762547 678660 657778 577455 541884 502140
14212 502140 489810 414572 361375 302067 361597 370990 374330 390016 463089 486773 510762 552541
14200 552541 572616 568565 590851 647969 662695 663670 692488 772036 810878 761355 704609 656884
14188 656884 663241 704822 666045 559366 481840 503040 564522 660997 662567 576799 518010 486703
14176 486703 505789 588204 595271 644425 605276 606653 679593 725304 780034 843341 878076 811950
14164 811950 664773 535737 535803 557574 558686 490487 513537 500733 452964 517849 595877 626524
14152 626524 581575 562730 688103 709731 696455 707968 755567 787591 801398 800394 896760
14141 896760 871178 858986 859043 918105 973416 1021398 990437 1061841 1065048 1102247 1175860 1440721
$$ packed form
14223G85785J29309m0429r7280M140J4924l3902q3887k0882q0323l5571l9744
14212E02140j2330p5238n3197n9308N9530R393L340J5686P3073K3684K3989M1779
14200E52541K0075m051K2286N7118J4726R75K8818P9548L8842m9523n6746m7725
14188F56884O357M1581l8777j06679p7526K1200O1482R6475J570q5768n8789l1307
14176D86703J9086Q2415P067M9154l9149J377P2940M5711N4730O3307L4735o6126
14164H11950j47177j29036O6K1771J112o8199K3050j2804m7769O4885P8028L0647
14152F26524m4949j8845J25373K1628j3276J1513M7599L2024J3807j004R6366
14141H96760k5582j2192N7N9062N5311M7982l0961P1404L207L7199P3613K64861
$$ plain form
14129 1440721 1714230 1949943 2303226 2875486 3669518 4671338 5620562 5779310 4931366
14120 4931366 3778224 2874078 2292259 1938620 1778479 1617010 1476888 1448818 1443532 1462606
14110 1462606 1576418 1690053 1821493 1866800 1944762 1938738 1992422 2120464 2213306 2228439 2266243
14099 2266243 2352413 2464950 2472360 2559006 2624673 2597909 2600278 2661308 2725976 2853639 2898728
14088 2898728 2943595 3053687 3174416 3339615 3506613 3644935 3834354 4046360 4237873 4430586
14078 4430586 4662346 4934602 5324945 5733598 6101843 6517554 6968501 7409550 7971509
14069 7971509 8541592 9071211 9783423 10602953 11436852 12303603 13316188 14464735 15649710
14060 15649710 16952190 18520559 20449944 22639388 25203358 28398693 32100234 36231344
$$ packed form
14129A440721K73509K35713L53283N72260P94032J001820R49224J58748q47944
14120D931366j153142r04146n81819l53639j60141j61469j40122k8070n286J9074
14110A462606J13812J13635J31440M5307P7962o024N3684J28042R2842J5133L7804
14099B266243Q6170J12537P410Q6646O5667k6764K369O1030O4668J27663M5089
14088B898728M4867J10092J20729J65199J66998J38322J89419K12006J91513J92713
14078D430586K31760K72256L90343M08653L68245M15711M50947M41049N61959
14069G971509N70083N29619P12212Q19530Q33899Q66751J012585J148547J184975
14060A5649710J302480J568369J929385K189444K563970L195335L701541M131110
$$ plain form
14052 36231344 40787949 45884441 51747291 58764007 67486671 78846775 94402216 116198961
14044 116198961 146230382 184404636 225996168 264570285 295888510 318053827 331793311
14037 331793311 336727476 327674909 300212437 259138253 216243114 178026373 143714786
14030 143714786 112593639 86460778 66549378 52364677 42416748 35349728 30017855
14023 30017855 25832829 22460783 19584894 17031094 14806902 12927290 11459134 10158566
14015 10158566 9056134 8154761 7303321 6632133 6119125 5596881 5137624 4746591 4462008
14006 4462008 4275471 4003837 3721906 3527199 3340341 3210296 3071757 2852838 2671736
13997 2671736 2607951 2613842 2537669 2384241 2233117 2093870 1990539 1943940 2035893 2131626 2076579
$$ packed form
14052C6231344M556605N096492N862850P016716Q722664J1360104J5555441K1796745
14044A16198961L0031421L8174254M1591532L8574117L1318225K2165317J3739484
14037C31793311M934165r052567k7462472m1074184m2895139l8216741l4311587
14030A43714786l1121147k6132861j9911400j4184701r947929p067020n331873
14023C0017855m185026l372046k875889k553800k224192j879612j468156j300568
14015A0158566j102432r01373q51440o71188n13008n22244m59257l91033k84583
14006D462008j86537k71634k81931j94707j86858j30045j38539k18919j81102
13997B671736o3785N891p6173j53428j51124j39247j03331m6599R1953R5733n5047
$$ plain form
13986 2076579 2069311 2159349 2053628 1929908 1811000 1648041 1457579 1348961 1357918 1267248
13976 1267248 1203601 1208888 1281255 1346674 1206332 1078608 1015228 983085 942608 1005413 1023647
13965 1023647 939698 903039 954237 924326 871875 771043 714717 723512 689336 647568 605337
13954 605337 532647 457757 381005 402853 466157 480053 435185 475129 472780 402401 437335 542880
13942 542880 569721 491367 465172 470379 441267 449675 392187 338443 323766 283517 409693 451937
13930 451937 346537 348054 378232 374206 364402 412737 345019 428827 483275 424922 276209 207670
13918 207670 145096 107989 93490 160154 156072 53721 30303 159948 179066 117233 43599
13907 43599 55290 41026 97983 163500 107504 73506 113295 140151 183720 236362 240579 225270
$$ packed form
13986B076579p268R0038j05721j23720j18908j62959j90462j08618Q957r0670
13976A267248o3647N287P2367O5419j40342j27724o3380l2143m0477O2805J8234
13965A023647q3949l6659N1198k9911n2451j00832n6326Q795l4176m1768m2231
13954F05337p2690p4890p6752K1848O3304J3896m4868L9944k349p0379L4934J05545
13942E42880K6841p8354k6195N207k9112Q408n7488n3744j4677m0249J26176M2244
13930D51937j05400J517L0178m026r804M8335o7718Q3808N4448n8353j48713o8539
13918B07670o2574l7107j4499O6664m082j02351k3418J29645J9118o1833p3634
13907D3599J1691j4264N6957O5517n5996l3998L9789K6856M3569N2642M217j5309
$$ plain form
13895 225270 306104 278747 260274 242997 251200 257172 261734 221248 225543 245622 181298 176609
13883 176609 90911 -12556 -53568 3178 21986 -48174 -94734 -108460 -139145 -114415 -74271
13872 -74271 -89743 -92413 -61965 -75587 -99997 -79951 -104517 -125873 -110367 -137160 -124097 -110338
13860 -110338 -154216 -150743 -149484 -193211 -210894 -266330 -307224 -365462 -497971 -581652 -538339 -468706
13848 -468706 -454112 -384955 -343974 -231819 -97327 3846 46537 36114 75050 164873 228912
13837 228912 173041 200701 187611 120221 66771 105848 138553 125878 128187 101502 75199 74309
13825 74309 58855 76479 138664 104523 37902 -17628 -64623 2389 13666 17876 55329 87237
13813 87237 99490 123481 115042 118719 58702 19647 13667 -48617 -149485 -173331 -73405 1693
$$ packed form
13895B25270Q0834k7357j8473j7277Q203N972M562m0486M295K0079o4324m689
13883A76609q5698j03467m1012N6746J8808p0160m6560j3726l0685K4730M0144
13872g4271j5472k670L0448j3622k4410K0046k4566k1356J5506k6793J3063J3759
13860a10338m3878L473J259m3727j7683n5436m0894n8238j32509q3681M3313O9633
13848d68706J4594O9157M0981J12155J34492J01173M2691j0423L8936Q9823O4039
13837B28912n5871K7660j3090o7390n3450L9077L2705j2675K309k6685k6303q90
13825G4309j5454J7624O2185l4141o6621n5530m6995O7012J1277M210L7453L1908
13813H7237J2253K3991q439L677o0017l9055n980o2284j00868k3846R9926P5098
$$ plain form
13801 1693 -38277 5539 63619 17788 -7234 29984 82159 138018 117612 195372 208903 140724
13789 140724 150353 165790 152948 167615 140009 98153 74528 98446 107917 102269 130466 129142
13777 129142 89984 26565 44265 25417 42760 36777 -41485 -63841 -25002 32105 61823 21601
13765 21601 66678 53043 40058 3251 -19734 -36176 -45326 2776 20838 44378 6443 -59490
13753 -59490 -1437 71228 102730 77348 9019 -22777 -40043 -22166 -96926 -95174 -114731 -130979
13741 -130979 -86762 -68444 45578 116862 186066 133644 27005 65299 97258 123185 264758
13730 264758 307166 276225 245289 219061 284694 306418 286827 258997 234988 258392 275225
13719 275225 288635 371924 320072 161695 202696 166026 163516 192023 191181 149125 92687 52893
$$ packed form
13801A693l9970M3816N8080m5831k5022L7218N2175N5859k0406P7760J3531o8179
13789A40724R629J5437j2842J4667k7606m1856k3625K3918R471n648K8197j324
13777A29142l9158o3419J7700j8848J7343n983p8262k2356L8839N7107K9718m0222
13765B1601M5077j3635j2985l6807k2985j6442r150M8102J8062K3540l7935o5933
13753e9490N8053P2665L1502k5382o8329l1796j7266J7877p4760J752j9557j6248
13741a30979M4217J8318J14022P1284O9204n2422j06639L8294L1959K5927J41573
13730B64758M2408l0941l0936k6228O5633K1724j9591k7830k4009K3404J6833
13719B75225J3410Q3289n1852j58377M1001l6670k510K8507q42m2056n6438l9794
$$ plain form
13707 52893 -6969 -40761 -359 24998 51787 61045 -7461 6717 -61701 -57849 -15772 53822
13695 53822 133003 134620 57589 41271 138673 161043 132018 146439 86467 98772 73056 100960
13683 100960 90782 -16061 -51674 -31385 -26997 -92640 -81680 -73634 -56277 -47399 -84463 -118677
13671 -118677 -42496 9242 47089 -10498 -15875 11387 -1239 -19661 -10886 52536 89793 66515
13659 66515 175354 200398 161307 102188 5391 -45879 -43842 5776 -23793 -34194 -82624 -133537
13647 -133537 -150307 -134734 -96718 -22466 5600 24235 139886 49767 28762 62256 58526
13636 58526 103173 182644 246702 213552 81480 29068 -7285 86176 77236 80760 110089 114967
13624 114967 107887 125824 83406 102532 109516 114436 134959 88675 44354 54630 66092 68401
$$ packed form
13707E2893n9862l3792M0402K5357K6789R258o8506J4178o8418L852M2077O9594
13695E3822P9181J617p7031j6318R7402K2370k9025J4421n9972J2305k5716K7904
13683A00960j0178j06843l5613K0289M388o5643J0960Q046J7357Q878l7064l4214
13671a18677P6181N1738L7847n7587n377K7262j2626j8422Q775O3422L7257k3278
13659F6515J08839K5044l9091n9119r6797n1270K037M9618k9569j0401m8430n0913
13647a33537j6770J5573L8016P4252K8066J8635J15651r0119k1005L3494l730
13636E8526M4647P9471O4058l3150j32072n2412l6353R3461q940L524K9329M878
13624A14967p080J7937m2418J9126O984M920K0523m6284m4321J0276J1462K309
$$ plain form
13612 68401 -356 -14225 58044 89652 80243 134857 151375 137898 150709 69402 23412 91250
13600 91250 67101 61786 89122 146813 244441 280306 360304 530189 613927 724623 812446
13589 812446 919364 1049122 1205066 1467697 1643137 1703721 1805855 1777649 1754875 1562688
13579 1562688 1284990 1047166 908035 755194 610681 520646 418464 289432 177340 186025
13569 186025 196458 61706 65367 115417 186361 254435 230429 202954 153469 87745 43439
13558 43439 115259 216312 154052 73947 127262 88890 -23957 7933 79130 108863 87882
13547 87882 52428 -38895 -26483 24766 -71304 -133008 -151634 -170335 -149368 -59719 -35235 -22831
13535 -22831 -50468 -73908 -65752 -39350 12884 25559 6640 -14311 26903 60505 7852 -40224
$$ packed form
13612F8401o8757j3869P2269L1608r409N4614J6518j3477J2811q1307m5990O7838
13600I1250k4149n315K7336N7691R7628L5865P9998J69885Q3738J10696Q7823
13589H12446J06918J29758J55944K62631J75440O0584J02134k8206k2774j92187
13579A562688k77698k37824j39131j52841j44513r0035j02182j29032j12092Q685
13569A86025J0433j34752L661N0050P0944O8074k4006k7475m9485o5724m4306
13558D3439P1820J01053o2260q0105N3315l8372j12847L1890P1197K9733k0981
13547H7882l5454r1323J2412N1249r6070o1704j8626j8701K0967Q9649K4484J2404
13535b2831k7637k3440Q156K6402N2234J2675j8919k0951M1214L3602n2653m8076
$$ plain form
13523 -40224 -99259 -123908 -111134 -48548 -73295 -88183 -128427 -131460 -92365 -70158 -45296 -7532
13511 -7532 -22123 -31946 -64554 -75640 -14893 14734 12168 -22721 17804 84529 110785 -8123
13499 -8123 -74709 -50109 -56201 -83154 -56897 5147 -2991 4437 55995 75657 29742 2079
13487 2079 68519 88574 3101 -44728 -66176 -24926 -2139 20087 70934 60043 41096 -27586
13475 -27586 -64889 -1105 -31175 75593 61312 48179 19772 -19129 4563 11791 25648 47622
13463 47622 82533 28190 -62029 -132244 -102121 -10071 16146 14451 33234 24869 -23538 -31692
13451 -31692 -62779 63645 106696 35623 36978 11627 12807 10674 -33975 -33022 -16262 -37334
13439 -37334 -5198 -75804 -53813 -135049 -130289 -133147 -210950 -198467 -86396 -30792 -43509 -43385
$$ packed form
13523d0224n9035k4649J2774O2586k4747j4888m0244l033L9095K2207K4862L7764
13511g532j4591r823l2608j1086O0747K9627k566l4889M0525O6725K6256j18908
13499h123o6586K4600o092k6953K6257O2044q138P428N1558J9662m5915k7663
13487B079O6440K0055q5473m7829k1448M1250K2787K2226N0847j0891j8947o8682
13475b7586l7303O3784l0070J06768j4281j3133k8407l8901K3692P228J3857K1974
13463D7622L4911n4343r0219p0215L0123R2050K6217j695J8783q365m8407q154
13451c1692l1087J26424M3051p1073J355k5351J180k133m4649R53J6760k1072
13439c7334L2136p0606K1991q1236M760k858p7803J2483J12071N5604j2717J24
$$ plain form
13427 -43385 6017 10426 -62880 -133233 -88457 -61135 -117782 -66497 10838 -28623 -78578 -112061
13415 -112061 -57656 6524 26395 -43767 -82973 -60023 17677 20435 -27429 4392 11974 -60355
13403 -60355 -170107 -230607 -137180 -190972 -183875 -197025 -303197 -294375 -187398 -52415 -6111
13392 -6111 -72202 -52953 -53631 -63963 -10842 8298 -90684 -156763 -75223 -16721 -40876 14306
13380 14306 -41566 -58768 -63956 -81618 -83646 56435 45353 1939 26029 12079 -23431 18411
13368 18411 65941 118526 123959 123019 14297 -85870 -52468 -27374 -2350 -39850 -88129 -72257
13356 -72257 -61913 40457 26607 21197 -27907 -63606 -43002 42718 36976 99212 126465 79505
13344 79505 47670 105244 121044 147423 127671 73866 17360 7524 77672 11742 51362 134384
$$ packed form
13427d3385M9402M409p3306p0353M4776K7322n6647N1285P7335l9461m9955l3483
13415a12061N4405O4180J9871p0162l9206K2950P7700K758m7864L1821P582p2329
13403f0355j09752o0500R3427n3792P097j3150j06172Q822J06977J34983M6304
13392f111o6091J9249o78j0332N3121J9140r8982o6079Q1540N8502k4155N5182
13380A4306n5872j7202n188j7662k028J40081j1082m3414K4090j3950l5510M1842
13368A8411M7530N2585N433r40j08722j00167L3402K5094K5024l7500m8279J5872
13356g2257J0344J02370j3850n410m9104l5699K0604Q5720n742O2236K7253m6960
13344G9505l1835N7574J5800K6379j9752n3805n6506r836P0148o5930L9620Q3022
$$ plain form
13332 134384 143344 52830 25575 83418 38513 26395 -18007 34923 49608 67096 33914 6453
13320 6453 90998 17455 -29243 -11607 -21519 -57160 42386 73745 -961 17285 -19358 -132426
13308 -132426 -159897 -173223 -165949 -95817 -21503 -34626 -125206 -83052 -33815 -86566 -124265 -138558
13296 -138558 -71043 -49195 -95340 -55300 -83719 -88605 -18698 18510 5537 23709 -21775 68953
13284 68953 -11801 -180184 -202802 -126407 -166277 -90228 45847 76119 52311 -109220 -184418
13273 -184418 -199241 -210724 -97071 -34417 -53570 10539 3546 -79449 -91390 -76756 -119159
13262 -119159 -118780 -111293 -35087 107421 86375 50151 31154 36944 6697 -60378 -78812 -149043
13250 -149043 -151448 -147931 -145041 -133887 17474 132779 116171 25251 -89902 -106891 -14847
$$ packed form
13332A34384Q960r0514k7255N7843m4905j2118m4402N2930J4685J7488l3182k7461
13320F453Q4545p3543m6698J7636r912l5641R9546L1359p4706J8246l6643j13068
13308a32426k7471j3326P274P0132P4314j3123r0580M2154M9237n2751l7699j4293
13296a38558O7515K1848m6145M0040k8419m886O9907L7208j2973J8172m5484R0728
13284F8953q0754j68383k2618P6395l9870P6049J36075L0272k3808j61531p5198
13273a84418j4823j1483J13653O2654j9153O4109o993q2995j1941J4634m2403
13262a19159L79P487P6206J42508k1046l6224j8997N790l0247o7075j8434p0231
13250a49043k405L517K890J1154J51361J15305j6608r0920j15153j6989R2044
$$ plain form
13239 -14847 -38877 8890 29632 29122 -81729 -38260 59926 100976 183266 151384 26761 -57119
13227 -57119 -75952 -6280 12518 11338 25503 29750 19656 70553 125947 79984 -3940 -59193
13215 -59193 17704 82997 16184 43210 92657 160213 78904 43827 -18035 16832 52468 -20848
13203 -20848 -25735 -15694 -30544 -41704 -64479 -124446 -146935 -48864 8370 48617 87017 99249
13191 99249 37106 44917 7907 -47362 -77272 -104889 -186744 -185389 -194329 -155598 -85139 -39834
13179 -39834 -65702 -53832 -52802 -81752 -149434 -184783 -140114 -134279 -117112 -84338 -75453 -114401
13167 -114401 -137096 -92768 -27968 13092 -33273 -53675 -104045 -111632 -153202 -89852 -64266 -128939
13155 -128939 -93624 33691 20254 -19134 43719 56936 -16824 -42709 23799 40480 -2320
$$ packed form
13239a4847k4030M7767K0742n10j10851M3469R8186M1050Q2290l1882j24623q3880
13227e7119j8833O9672J8798j180J4165M247j0094N0897N5394m5963q3924n5253
13215e9193P6897O5293o6813K7026M9447O7556q1309l5077o1862L4867L5636p3316
13203b0848m887J0041j4850j1160k2775n9967k2489R8071N7234M0247L8400J2232
13191I9249o2143P811l7010n5269k9910k7617q1855J355q940L8731P0459M5305
13179c9834k5868J1870J030k8950o7682l5349M4669N835J7167L2774Q885l8948
13167a14401k2695M4328O4800M1060m6365k0402n0370p587m1570O3350K5586o4673
13155a28939L5315J27315j3437l9388O2853J3217p3760k5885O6508J6681m2800
$$ plain form
13144 -2320 -25206 1303 -43521 -60038 -113446 -135220 -74600 -66824 -83571 -82609 -116533 -202469
13132 -202469 -149045 -92200 -99890 -109421 -125381 -117283 -23263 -34457 -32430 -34011 -35091 -67222 -87617
13119 -87617 -28188 -14734 -36218 31672 137557 189823 110112 30216 31410 32326 -41539 -132927
13107 -132927 -113307 -41635 31903 63330 29172 18420 71342 91253 59903 89215 104516
13096 104516 96861 82209 7365 -81473 -101132 -78913 -79452 -46405 12280 41020 76376 80074
13084 80074 58418 57335 20925 -52059 -123531 -92393 -49416 -8991 -112230 -194298 -135990 -60086
13072 -60086 -38892 -29108 -13739 -49274 -63497 -2425 64844 78019 3499 26830 -44406 -82831
13060 -82831 -41607 -15147 18529 149179 138319 101716 17114 -8207 -37104 -8366 57173
$$ packed form
13144b320k2886K6509m4824j6517n3408k1774O0620P776j6747R62l3924q5936
13132b02469N3424N6845p690r531j5960Q098R4020j1194K027j581j080l2131k0395
13119h7617N9429J3454k1484O7890J05885N2266p9711p9896J194R16p3865r1388
13107a32927J9620P1672P3538L1427l4158j0752N2922J9911l1350K9312J5301
13096A04516p655j4652p4844q8838j9659K2219n39L3047N8685K8740L5356L698
13084H0074k1656j083l6410p2984p1472L1138M2977M0425j03239q2068N8308P5904
13072f0086K1194R784J5369l5535j4223O1072O7269J3175p4520K3331p1236l8425
13060h2831M1224K6460L3676J30650j0860l6603q4602k5321k8897K8738O5539
$$ plain form
13049 57173 177940 222204 143926 23229 -80329 -134380 -80571 -25031 -38067 10812 33085
13038 33085 -19515 -3511 -14801 -18303 17662 -34331 -65495 -69011 -46515 8699 14997 -14404
13026 -14404 62594 71433 24177 23339 60170 67870 -4697 -13724 45199 14663 -55376 -86267 -45056
13013 -45056 -95838 -144101 -64217 -45550 -54494 13870 -8822 -60528 -147521 -128385 -55554 -52518
13001 -52518 -47857 -65133 -33692 1527 -3890 -11045 9787 -58174 -47513 47373 102046 87839
12989 87839 78600 38634 -26781 -40051 -44171 -67736 -84564 -19952 40533 10579 61889 69463
12977 69463 21270 -18477 -23661 -72795 -68016 -78810 -112797 9248 58273 -2393 -19749 -21190
12965 -21190 -3143 -81039 -73806 8178 68655 75242 34781 -65424 -111752 -37074 -26207 -108765
$$ packed form
13049E7173J20767M4264p8278j20697j03558n4051N3809N5540j3036M8879K2273
13038C3085n2600J6004j1290l502L5965n1993l1164l516K2496N5214O298k9401
13026a4404P6998Q839m7256q38L6831P700p2567r027N8923l0536p0039l0891M1211
13013d5056n0782m8263P9884J8667q944O8364k2692n1706q6993J9136P2831L036
13001e2518M661j7276L1441L5219n417p155K0832o7961J0661R4886N4673j4207
12989H7839r239l9966o5415j3270m120k3565j6828O4612O0485k9954N1310P574
12977F9463m8193l9747n184m9134M779j0794l3987J22045M9025o0666j7356j441
12965b1190J8047p7896P233Q1984O0477O587m0461j00205m6328P4678J0867q2558
$$ plain form
12953 -108765 -194452 -144941 -55411 -36574 -55502 -34726 9536 122279 259394 234545 154377
12942 154377 101218 108871 17831 -55458 -29284 17824 51803 77362 112437 77886 74637 29644
12930 29644 -35925 -89633 -93334 54867 112027 105123 56294 -49157 -88312 -38484 20534 -23396
12918 -23396 55427 80864 30708 6304 -60080 -104643 -101474 -55756 -30388 39202 83244 108161
12906 108161 108875 33661 34571 15728 28636 6569 -72006 -56730 -85044 -240555 -278554 -174339
12894 -174339 -76603 -61210 -110224 -176175 -198388 -217400 -264258 -272200 -251202 -147493 -168690
12883 -168690 -261279 -197160 -66607 34826 84669 29600 -21441 19925 68181 47310 16698
12872 16698 -2779 -37941 -70446 -91523 -112612 -141755 -88523 -39599 -43223 -103298 -39147 37062
$$ packed form
12953a08765q5687M9511Q9530J8837j8928K0776M4262J12743J37115k4849q0168
12942A54377n3159P653r1040p3289K6174M7108L3979K5559L5075l4551l249m4993
12930B9644o5569n3708l701J48201N7160o904m8829j05451l9155M9828N9018m3930
12918b3396P8823K5437n0156k4404o6384m4563L169M5718K5368O9590M4042K4917
12906A08161P14p5214R10j8843J2908k2067p8575J5276k8314j55511l7999J04215
12894a74339R7736J5393m9014o5951k2213j9012m6858p942K0998J03709k1197
12883a68690r2589O4119J30553J01433M9843n5069n1041M1366M8256k0871l0612
12872A6698j9477l5162l2505k1077k1089k9143N3232M8924l624o0075O4151P6209
$$ plain form
12860 37062 57641 51990 84308 77011 4579 -22118 -25639 -60108 -107051 -39179 -85420 -81944
12848 -81944 -7390 12069 -62596 -57457 -41687 -66520 -114208 -127725 -64741 -5900 33491 127682
12836 127682 28275 -74822 -168279 -104618 -12268 37188 23321 33383 -60254 -86064 9589
12825 9589 36604 22448 23361 3618 17402 20337 3851 26773 58384 16318 88985 129369
12813 129369 124263 69363 91338 68541 22331 -34189 -13993 -45325 -71715 -64683 -43304 -37550
12801 -37550 -43362 14033 43128 65083 40932 9389 -24996 6824 24158 -24556 17338 46367
12789 46367 47450 6955 -3775 -14729 -60072 -86280 -129339 -95618 -90463 -88275 -59642 -5231
12777 -5231 -48568 -53430 -8893 -42172 54252 41043 55121 141930 149188 47631 -41701 -12544
$$ packed form
12860C7062K0579n651L2318p297p2432k6697l521l4469m6943O7872m6241L476
12848h1944P4554J9459p4665N139J5770k4833m7688j3517O2984N8841L9391R4191
12836A27682r9407j03097r3457O3661R2350M9456j3867J0062r3637k5810R5653
12825I589K7015j4156R13j9743J3784K935j6486K2922L1611m2066P2667M0384
12813A29369n106n4900K1975k2797m6210n6520K0196l1332k6390P032K1379N754
12801c7550n812N7395K9095K1955k4151l1543l4385L1820J7334m8714M1894K9029
12789D6367J083m0495j0730j0954m5343k6208m3059L3721N155K188K8633N4411
12777e231m3337m862M4537l3279R6424j3209J4078Q6809P258j01557q9332K9157
$$ plain form
12765 -12544 45187 -4734 -22639 -58457 -28167 1367 -6249 -133813 -121080 -137243 -135225 -109125
12753 -109125 -48794 -78539 -120626 -70205 -12716 -18633 26814 125928 90834 -9494 -16159 58268
12741 58268 124991 76271 39759 103588 71622 -69636 -45554 8176 44871 26160 14256
12730 14256 -30371 -31629 -68027 -45958 -31520 -61869 -107332 -66531 -70795 -51118 8 -20708
12718 -20708 -81315 -28004 53821 2110 -72668 -100049 -58942 -12884 -3338 78044 61721 1238
12706 1238 -21847 -39734 5801 -13168 51665 69493 2284 -46437 -63954 40809 70561 23265
12694 23265 39215 100250 117586 115157 117325 76510 54875 54904 6586 24376 59758 49062 49780
12681 49780 126054 110151 -51423 -60210 24752 -14603 -48593 -46310 -104571 -128979 -224097 -224915
$$ packed form
12765a2544N7731m9921j7905l5818L0290K9534p616j27564J2733j6163K018K6100
12753a09125O0331k9745m2087N0421N7489n917M5447R9114l5094j00328o665P4427
12741E8268O6723m8720l6512O3829l1966j41258K4082N3730L6695j8711j1904
12730A4256m4627j258l6398K2069J4438l0349m5463M0801m264J9677N1126k0716
12718b0708o0607N3311Q1825n1711p4778k7381M1107M6058R546Q1382j6323o0483
12706A238k3085j7887M5535j8969O4833J7828o7209m8721j7517J04763K9752m7296
12694B3265J5950O1035J7336k429K168m0815k1635K9m8318J7790L5382j0696P18
12681D9780P6274j5903j61574q787Q4962l9355l3990K283n8261k4408r5118q18
$$ plain form
12669 -224915 -123633 -23071 8440 63098 66666 57107 -29054 -66106 15291 34939 -56391
12658 -56391 -41672 -27938 47436 65622 28714 40678 72901 87554 133439 83405 -2014 -71239
12646 -71239 -131614 -123635 -47859 13353 109971 112331 141486 148090 51365 18555 10112 7563 -47546
12633 -47546 30094 161838 203749 107362 53470 38987 88479 102967 133747 132323 203971 317696
12621 317696 356744 347953 320767 312775 287364 309239 322977 219246 222649 199976 150624 -8903
12609 -8903 -72497 11441 43723 87850 97192 55273 -14436 -31289 19854 30002 7727 -41052
12597 -41052 -42037 -11504 -11475 -124237 -188718 -141432 -31602 6023 15496 16524 -45819 -88611 -70566
12584 -70566 -46326 -571 55097 71784 -28662 -86010 -41315 12434 46492 57670 1869
$$ packed form
12669b24915J01282J00562L1511N4658L568r559q6161l7052Q1397J9648r1330
12658e6391J4719J3734P5374J8186l6908J1964L2223J4653M5885n0034q5419o9225
12646g1239o0375P979P5776O1212R6618K360K9155O604r6725l2810q443k549n5109
12633d7546P7640J31744M1911r6387n3892j4483M9492J4488L0780j424P1648J13725
12621C17696L9048q791k7186p992k5411K1875J3738j03731L403k2673m9352j59527
12609h903o3594Q3938L2282M4127R342m1919o9709j6853N1143J0148k2275m8779
12597d1052r85L0533K9j12762o4481M7286J09830L7625R473J028o2343m2792J8045
12584g0566K4240M5755N5668J6687j00446n7348M4695N3749L4058J1178n5801
$$ plain form
12573 1869 -9186 -17646 40302 219470 234076 130142 -2019 -6434 85620 94159 51826 54994
12561 54994 66133 71389 137711 192008 196837 75674 66569 136199 125717 142172 135555 172120
12549 172120 117157 92768 17186 -3341 68398 -40348 -60874 -26727 -1750 44289 72824
12538 72824 46525 41333 11380 -44129 -54448 -8781 6621 91489 91019 9809 72699 159174
12526 159174 137967 65235 47690 33531 -26898 -25360 -19672 -36224 -145602 -155850 -78334 -87320
12514 -87320 -108123 -98336 21952 84186 77654 -79025 -137359 -28953 42528 33241 -38801 -22895
12502 -22895 -10184 59950 35216 2065 63390 61904 26222 13544 54468 72063 33600 -115552
12490 -115552 -145550 -144429 -102105 -44688 -20732 14999 4958 -43773 -52411 -10088 -26636 -93443
$$ packed form
12573A869j1055q460N7948J79168J4606j03934j32161m415R2054Q539m2333L168
12561E4994J1139N256O6322N4297M829j21163r105O9630j0482J6455o617L6565
12549A72120n4963k4389p5582k0527P1739j08746k0526L4147K4977M6039K8535
12538G2824k6299n192k9953n5509j0319M5667J5402Q4868m70q1210O2890Q6475
12526A59174k1207p2732j7545j4159o0429J538N688j6552j09378j0248P7516q986
12514h7320k0803R787J20288O2234o532j56679n8334J08406P1481r287p2042J5906
12502b2895J2711P0134k4734l3151O1325j486l5682j2678M0924J7595l8463j49152
12490a15552k9998J121M2324N7417K3956L5731j0041m8731q638M2323j6548o6807
$$ plain form
12478 -93443 -136434 -72391 -106058 -58585 88228 151771 183125 153982 112288 147061 140593 136296
12466 136296 140522 87599 50086 49873 69720 87303 56256 48394 51093 85346 41657 29441
12454 29441 66600 52487 47243 29786 15991 74689 48918 31744 51753 11164 24044 117294
12442 117294 61681 30908 16683 11084 7768 -7360 -11667 -3611 44056 123088 239494 220711
12430 220711 212188 203197 83540 71966 90952 110957 165534 161686 243522 314166 282115 265304
12418 265304 137888 72654 -6230 -35884 -17103 7271 -43464 -56577 -46703 -67876 -93002
12407 -93002 -47068 -4634 -6446 -104022 -75747 -31395 -7291 -11146 -22093 -26173 25553 -5211
12395 -5211 11766 -6545 -28127 -1277 15857 25831 95169 102078 58098 -6655 -13667 -34342
$$ packed form
12478i3443m2991O4043l3667M7473J46813O3543L1354k9143m1694L4773o468m297
12466A36296M226n2923l7513k13J9847J7583l1047p862K699L4253m3689j2216
12454B9441L7159j4113n244j7457j3795N8698k5771j7174K0009m0589J2880R3250
12442A17294n5613l0773j4225n599l316j5128m307Q056M7667P9032J16406j8783
12430B20711q523q991j19657j1574J8986K0005N4577l848Q1836P0644l2051j6811
12418B65304j27416o5234p8884k9654J8781K4374n0735j3113R874k1173k5126
12407i3002M5934M2434j812r7576K8275M4352K4104l855j0947m080N1726l0764
12395e211J6977j8311k1582K6850J7134R974O9338O909m3980o4753p012k0675
$$ plain form
12383 -34342 26271 23331 -50955 -79769 -91191 -31527 -3675 41288 78225 6350 42478 76517
12371 76517 71512 71567 95140 39062 59749 54139 -61397 -87426 14541 91854 37980 -16937
12359 -16937 10926 29033 20095 -97749 -127484 19750 96458 31600 -12894 41988 60668
12348 60668 38695 36342 63127 45156 -7834 -58402 -76330 51127 141789 131100 38352 29098
12336 29098 -126 -29345 -21231 4517 87138 102739 82935 36586 77162 74848 15937 -30078
12324 -30078 -11925 -18249 -44320 37380 71182 53780 87208 89936 48666 -21390 -32125 17264
12312 17264 -13417 -18126 30426 55180 62627 89921 122443 129781 115845 42956 1015 9687
12300 9687 31968 111904 101524 149072 131270 58299 -18360 -85064 -86168 -76922 -12708 -88026
$$ packed form
12383c4342O0613k940p4286k8814j1422N9664K7852M4963L6937p1875L6128L4039
12371G6517n005N5K3573n6078K0687n610j15536k6029J01967P7313n3874n4917
12359a6937K7863J8107q938j17844k9735J47234P6708o4858m4494N4882J8680
12348F0668k1973k353K6785j7971n2990n0568j7928J27457R0662j0689r2748r254
12336B9098k9224k9219Q114K5748Q2621J5601j9804m6349M0576k314n8911m6015
12324c0078J8153o324k6071Q1700L3802j7402L3428K728m1270p0056j0735M9389
12312A7264l0681m709M8552K4754P447K7294L2522P338j3936p2889m1941Q672
12300I687K2281P9936j0380M7548j7802p2971p6659o6704j104R246O4214p5318
$$ plain form
12288 -88026 -109482 -55970 15154 101210 147704 82389 12496 28901 62756 117648 118380 104922
12276 104922 52530 25969 -60641 -13276 -12067 -27301 -34769 -10796 19091 20384 120709 151508
12264 151508 102870 66779 102888 126293 109777 43240 35739 66655 91917 65590 53931 107807
12252 107807 171041 167198 89497 148440 119504 72545 88344 66945 162878 167605 114465 68741
12240 68741 45969 110923 158327 177583 92303 24607 25899 63662 60778 34864 64926 12818
12228 12818 -27460 -36962 -39810 -86633 -129808 -47985 99824 111611 154478 91727 40038 115105
12216 115105 68341 -10146 -59463 -51125 -12277 -27933 -56893 -38039 -23703 19622 49340 26321
12204 26321 -8488 34818 66478 112233 52115 25463 49271 41563 -48891 -137774 -169365 -124890
$$ packed form
12288h8026k1456N3512P1124Q6056M6494o5315o9893J6405L3855N4892P32j3458
12276A04922n2392k6561q6610M7365J209j5234p468K3973K9887J293J00325L0799
12264A51508m8638l6091L6109K3405j6516o6537p501L0916K5262k6327j1659N3876
12252A07807O3234l843p7701N8943k8936m6959J5799k1399R5933M727n3140m5724
12240F8741k2772O4954M7404J9256q5280o7696J292L7763k884k5914L0062n2108
12228A2818m0278r502k848m6823m3175Q1823J47809J1787M2867o2751n1689P5067
12216A15105m6764p8487m9317Q338L8848j5656k8960J8854J4336M3325K9718k3019
12204B6321l4809M3306L1660M5755o0118k6652K3808p708r0454q8883l1591M4475
$$ plain form
12192 -124890 40761 87994 54740 11414 75461 128170 101365 70348 -17797 49732 83156
12181 83156 121649 84930 117796 86552 48169 9118 -54513 -56871 -77381 -81104 -49246 28726
12169 28726 60738 69902 52503 5349 3656 -49137 -80761 -18301 2446 59061 120345 164990
12157 164990 173728 178082 106739 6036 8929 107228 125040 76653 96894 36556 29471 55966
12145 55966 95225 48410 -45626 -93081 -51887 -19463 70737 61882 -90596 -58861 32563 70638
12133 70638 49148 40918 76327 32962 -21037 11479 22508 18700 16914 -26144 -7639 127137
12121 127137 216975 210878 146876 125108 117480 62404 36095 30802 41694 121353 82894 78706
12109 78706 34095 -64406 -163808 -177557 -117400 -93805 -89673 -41033 21202 5594 -8814 32320
$$ packed form
12192a24890J65651M7233l3254m3326O4047N2709k6805l1017q8145O7529L3424
12181H3156L8493l6719L2866l1244l8383l9051o3631k358k0510l723L1858P7972
12169B8726L2012R164j7399m7154j693n2793l1624O2460K0747N6615O1284M4645
12157A64990Q738M354p1343j00703K893R8299J7812m8387K0241o0338p085K6495
12145E5966L9259m6815r4036m7455M1194L2424R0200q855j52478L1735R1424L8075
12133G0638k1490q230L5409m3365n3999L2516J1029l808j786m3058J8505J34776
12121A27137Q9838o097o4002k1768p628n5076k6309n293J0892P9659l8459m188
12109G8706m4611r8501r9402j3749O0157K3595M132M8640O2235j5608j4408M1134
$$ plain form
12097 32320 10482 -99524 -36086 60181 25924 -53954 -97293 -85445 -85210 -206036 -185647 -93168
12085 -93168 -114426 -123763 -123837 -84214 -118383 -74889 -42201 -70978 -90617 -123475 -98395 -107509 -79440
12072 -79440 -5314 36067 7022 -68296 -38378 71140 110184 74314 14056 84585 206068
12061 206068 210504 176675 78677 6789 -4812 -48733 -30073 -15535 -51677 -27961 87525
12050 87525 56993 11358 2809 -65592 -106784 -76016 -1805 -2173 -109414 -179218 -119803 -47754
12038 -47754 -112821 -95710 -84351 -68244 -10326 43045 -2332 -16212 45024 45927 12630 6201
12026 6201 32223 -11299 -122718 -66099 3244 -13798 27711 83387 27533 -3845 31714 -4062
12014 -4062 30213 97143 77751 46996 22353 -11677 -44488 -64182 -62511 93648 143397 138925
$$ packed form
12097C2320k1838j10006O3438R6267l4257p9878m3339J1848K35j20826K0389R2479
12085i3168k1258r337p4L9623l4169M3494L2688k8777j9639l2858K5080r114K8069
12072g9440P4126M1381k9045p5318K9918J09518L9044l5870o0258P0529J21483
12061B06068M436l3829r7998p1888j1601m3921J8660J4538l6142K3716J15486
12050H7525l0532m5635q549o8401m1192L0768P4211l68j07241o9804N9415P2049
12038d7754o5067J7111J1359J6107N7918N3371m5377j3880O1236R03l3297o429
12026F201K6022m3522j11419N6619O9343j7042M1509N5676n5854l1378L5559l5776
12014d062L4275O6930j9392l0755k4643l4030l2811j9694J671J56159M9749m472
$$ plain form
12002 138925 51210 66955 107037 91566 23691 19246 -62447 -135463 -149820 -64721 36260
11991 36260 83118 122354 167902 236954 188268 13108 -59127 14618 50249 35705 19610
11980 19610 6 -35976 -7624 -25369 -38603 -61123 -56616 -19162 -33094 -105734 -58307 -20495
11968 -20495 -84377 -115745 -74231 -114428 -96346 -52166 -3864 13633 90210 42418 -8965 -12529
11956 -12529 2607 -24389 -58776 -76606 -105586 -63873 17144 -38772 -22292 17132 -6945 26578
11944 26578 -64976 -119972 -20866 4744 -70805 -99820 -90300 -103233 -47097 -30404 13699 69930
11932 69930 56928 62184 80364 2770 -31430 -86920 -76070 -24644 -4679 49060 7830 -9491
11920 -9491 9494 44579 99263 104051 -28883 -56439 -94004 -89916 -93196 -93457 43128 168242
$$ packed form
12002A38925q7715J5745M0082j5471o7875m445q1693p3016j4357Q5099J00981
11991C6260M6858L9236M5548O9052m8686j75160p2235P3745L5631j4544j6095
11980A9610j9604l5982K8352j7745j3234k2520M507L7454j3932p2640M7427L7812
11968b0495o3882l1368M1514m0197J8082M4180M8302J7497P6577m7792n1383l564
11956a2529J5136k6996l4387j7830k8980M1713Q1017n5916J6480L9424k4077L3523
11944B6578r1554n4996R9106K5610p5549k9015R520j2933N6136J6693M4103N6231
11932F9930j3002N256J8180p7594l4200n5490J0850N1426J9965N3739m1230j7321
11920i491J8985L5085N4684M788j32934k7556l7565M088l280k61J36585J25114
$$ plain form
11908 168242 95990 30120 9634 70473 130485 150773 85438 32223 -11969 -48289 -158857
11897 -158857 -207151 -171952 -121151 -102449 -85018 -36937 -24382 18281 -13299 -55187 10963
11886 10963 27666 -5257 -32525 -54557 -2884 -29303 23612 -56817 -83878 16822 -22859
11875 -22859 -29027 -10154 -38577 -40041 17099 -9644 14495 14399 -36597 -97078 -86079 -127338 -137150
11862 -137150 -175246 -183058 -157833 -118527 -99308 14950 134529 226408 243639 211756 84920
11851 84920 -31284 29279 116323 112256 29970 23909 79396 8076 -8487 20297 5501 -19016
11839 -19016 88495 100680 32527 37464 -71842 -115961 -90188 -43060 -104876 -145710 -108462
11828 -108462 720 136208 83285 -49358 -118058 -148071 -104268 -120976 -121953 -36893 64394
$$ packed form
11908A68242p2252o5870k0486O0839O0012K0288o5335n3215m4192l6320j10568
11897a58857m8294L5199N0801J8702J7431M8081J2555M2663l1580m1888O6150
11886A0963J6703l2923k7268k2032N1673k6419N2915q0429k7061J00700l9681
11875b2859o168J8873k8423j464N7140k6743K4139r6n0996o0481J0999m1259r812
11862a37150l8096p812K5225L9306J9219J14258J19579R1879J7231l1883j26836
11851H4920j16204O0563Q7044m067q2286o061N5487p1320j6563K8784j4796k4517
11839a9016J07511J2185o8153M937j09306m4119K5773M7128o1816m0834L7248
11828a08462J09182J35488n2923j32643o8700l0013M3803j6708r77Q5060J01287
$$ plain form
11817 64394 75661 38014 11345 14089 4822 -3579 -20915 29942 80669 106692 20922 -91432
11805 -91432 -97233 -150312 -219468 -168301 -150 113342 89519 93216 108916 96247 52081 25175
11793 25175 551 12141 -66797 -58967 -6661 65882 28124 -97426 -73082 -8188 26255 74851
11781 74851 78698 69461 27486 -22906 -953 78330 73447 44712 46397 81854 110482 31332
11769 31332 46492 91145 109730 24825 31633 72460 -6385 36284 54035 29763 35263 -22335
11757 -22335 -15572 85562 152803 174503 143690 104201 70370 12527 36495 21997 13400 -37576
11745 -37576 -15013 -30782 -60000 -48519 -41313 -124317 -171023 -123882 -66355 41234 68457 33541
11733 33541 59654 -17498 -117103 -102502 -14296 -4610 -18794 35906 25188 6436 -30434 -91598
$$ packed form
11817F4394J1267l7647k6669K744r267q401j7336N0857N0727K6023q5770j12354
11805i1432n801n3079o9156N1167J68151J13492k3823L697J5700j2669m4166k6906
11793B5175k4624J1590p8938P830N2306P2543l7758j25550K4344O4894L4443M8596
11781G4851L847r237m1975n0392K1953P9283m883k8735J685L5457K8628p9150
11769C1332J5160M4653J8585q4905O808M0827p8845M2669J7751k4272N500n7598
11757b2335O763J01134O7241K1700l0813l9489l3831n7843K3968j4498q597n0976
11745c7576K2563j5769k9218J1481P206q3004m6706M7141N7527J07589K7223l4916
11733C3541K6113p7152r9605J4601Q8206R686j4184N4700j0718j8752l6870o1164
$$ plain form
11721 -91598 -58309 -40999 21960 76689 91318 24226 -23844 -16941 -39047 -64521 7404 138304
11709 138304 89892 -63289 -102951 -103871 12747 97077 81701 -4081 -43782 52038 178335
11698 178335 153030 73715 23239 12455 65217 43244 45218 46123 22146 -77806 -137562 -95911
11686 -95911 -48333 -64606 -48834 -47195 -94565 -45842 18377 111548 97212 122955 110646 74654
11674 74654 46836 80892 23459 24964 56040 27034 -37109 -22511 60256 143491 174544 157925
11662 157925 188635 103493 43261 -84522 -98147 11854 83449 98249 43151 -30777 -24041
11651 -24041 48840 88323 -9868 86137 23647 -56284 -58303 -28030 -32607 32627 -5223 -21863
11639 -21863 47065 113823 100719 83796 19811 32339 53505 152398 207011 140103 75639 85613
$$ packed form
11721i1598L3289J7310O2959N4729J4629o7092m8070O903k2106k5474P1925J30900
11709A38304m8412j53181l9662r20J16618Q4330j5376q5782l9701R5820J26297
11698A78335k5305p9315n0476j0784N2762k1973J974R05k3977r9952n9756M1651
11686i5911M7578j6273J5772J639m7370M8723O4219R3171j4336K5743j2309l5992
11674G4654k7818L4056n7433J505L1076k9006o4143J4598Q2767Q3235L1053j6619
11662A57925L0710q5142o0232j27783j3625J10001P1595J4800n5098p3928O736
11651b4041P2881L9483r8191R6005o2490p9931k019L0273m577O5234l7850j6640
11639b1863O8928O6758j3104j6923o3985J2528K1166R8893N4613o6908o4464R974
$$ plain form
11627 85613 36855 102252 242183 233262 185988 193142 111485 57102 44094 -51677 -95573 -51549
11615 -51549 -17080 -23061 4111 11146 2660 -21297 -42790 -16767 26557 35877 57206 -14784
11603 -14784 -62294 -9151 -3439 25801 67083 5910 -20872 37900 53379 302 -45497 -23889
11591 -23889 38794 42821 43514 17437 -52938 -62988 -84877 -72450 -72389 -116923 -135123 -131915 -135408
11578 -135408 -96241 -3215 42879 88964 133127 107288 136016 86049 91800 102540 171132 134720
11566 134720 40127 -5517 -8348 -7975 -6617 -32546 -49289 -53712 -84337 -73058 -79869 -61439 -118028
11553 -118028 -113020 -69171 -18816 -6283 48205 4853 -56194 -9007 5921 -55641 -63657 -69320
11541 -69320 -58637 51551 63585 146727 131658 58000 95714 107250 134848 202905 151304
$$ packed form
11627H5613m8758O5397J39931q921m7274P154q1657n4383j3008r5771m3896M4024
11615e1549L4469n981K7172P035q486k3957k1493K6023M3324R320K1329p1990
11603a4784m7510N3143N712K9240M1282o1173k6782N8772J5479n3077m5799K1608
11591b3889O2683M027O93k6077p0375j0050k1889J2427O1m4534j8200L208l493
11578a35408L9167R3026M6094M6085M4163k5839K8728m9967N751J0740O8592l6412
11566A34720r4593m5644k831L73J358k5929j6743m423l0625J1279o811J8430n6589
11553a18028N008M3849N0355J2533N4488m3352o1047M7187J4928o1562q016n663
11541f9320J0683J10188J2034Q3142j5069p3658L7714J1536K7598O8057n1601
$$ plain form
11530 151304 92295 84031 118320 162269 146641 150403 101673 52619 11747 104685 151283 126863
11518 126863 86417 122551 60686 -41306 -60621 -71593 22045 43967 -35588 -40193 -40634 -57901
11506 -57901 -28997 88652 55117 36785 16252 -24717 -37435 84267 55162 -20050 -33279
11495 -33279 2933 8130 -59917 -48124 -34169 -32078 24749 -4861 15302 54305 -21780 -28500
11483 -28500 -20059 33824 82608 74189 96082 169591 156502 206758 115312 69434 154288 157710
11471 157710 85202 69368 81752 42905 -32131 11380 92414 117159 69291 90266 151950
11460 151950 136874 141239 165498 205796 139167 31669 23785 -1206 -20319 31782 23112 95846
11448 95846 102026 64914 70874 91416 134860 52519 -69935 -86054 -41025 -11032 98797 77627
$$ packed form
11530A51304n9009q264L4289M3949j5628L762m8730m9054m0872R2938M6598k4420
11518A26863m0446L6134o1865j01992j9315j0972R3638K1922p9555m605m41j7267
11506e7901K8904J17649l3535j8332k0533m0969j2718J21702k9105p5212j3229
11495c3279L6212N197o8047J1793J3955K091N6827k9610K0163L9003p6085o720
11483b8500Q441N3883M8784q419K1893P3509j3089N0256r1446m5878Q4854L422
11471A57710p2508j5834J2384l8847p5036M3511Q1034K4745m7868K0975O1684
11460A51950j5076M365K4259M0298o6629j07498p884k4991j9113N2101q670P2734
11448I5846O180l7112N960K0542M3444q2341j22454j6119M5029K9993J09829k1170
$$ plain form
11436 77627 24717 49387 43234 25532 53714 45254 9672 3278 47776 83294 99622 89004
11424 89004 62859 42146 38539 36475 41141 78202 36527 -26295 5154 103340 187294 129588
11412 129588 75057 159817 160780 104440 66731 1919 -120240 -124443 -99426 -83350 34129 50512
11400 50512 2209 -73104 -76720 31634 50943 82749 24624 -12504 -3713 -23824 15370 -85291
11388 -85291 -132972 -65211 7395 -1771 -5135 61204 169027 111377 -31602 -24276 47759 28130
11376 28130 56141 89396 168130 188813 187116 179298 206491 227177 225999 56361 -12645 45631
11364 45631 196425 268160 226255 83176 68417 162646 175097 126431 85384 82522 83792 59143
11352 59143 63921 81396 1448 -36051 -29657 28250 35970 -1955 -63842 -33900 8140 -49833
$$ packed form
11436G7627n2910K4670o153j7702K8182q460l5582o394M4498L5518J6328j0618
11424H9004k6145k0713l607k064M666L7061m1675o2822L1449R8186Q3954n7706
11412A29588n4531Q4760R63n6340l7709o4812j22159m203K5017J6076J17479J6383
11400E0512m8303p5313l616J08354J9309L1806n8125l7128Q791k0111L9194j00661
11388h5291m7681O7761P2606r166l364O6339J07823n7650j42979P326P2035j9629
11376B8130K8011L3255P8734K0683j697p818K7193K0686j178j69638o9006N8276
11364D5631J50794P1735m1905j43079j4759R4229J2451m8666m1047k862J270k4649
11352E9143M778J7475p9948l7499O394N7907P720l7925o1887K9942M2040n7973
$$ plain form
11340 -49833 -19311 54441 31453 36707 91881 58682 136609 162589 231349 251547 198411 148317
11328 148317 87711 17231 112619 82718 31978 60160 90352 135342 226296 166864 75104
11317 75104 55627 113272 44519 15945 34390 -30592 -47824 -41959 -61654 -84615 -120053 -90459
11305 -90459 21957 38341 84050 91039 59123 -54141 -101465 -37827 -6993 -30876 66793
11294 66793 182479 200782 163271 133584 197795 246148 173321 123278 133512 83042 50349
11283 50349 46050 137543 113381 56478 90496 54258 -39506 -48752 36151 37254 69497 124170
11271 124170 146428 143907 170885 209998 193649 83634 -39286 -34707 -18474 10849 37536
11260 37536 3756 -4288 67963 72559 52270 64667 147476 167414 117155 -24528 -39237 -1437
$$ packed form
11340d9833L0522P3752k2988N254N5174l3199P7927K5980O8760K0198n3136n0094
11328A48317o0606p0480R5388k9901n0740K8182L0192M4990R0954n9432r1760
11317G5104j9477N7645o8753k8574J8445o4982j7232N865j9695k2961l5438K9594
11305i0459J12416J6384M5709O989l1916j13264m7324O3638L0834k3883R7669
11294F6793J15686J8303l7511k9687O4211M8353p2827n0043J0234n0470l2693
11283E0349m299R1493k4162n6903L4018l6238r3764r246Q4903J103L2243N4673
11271A24170K2258k521K6978L9113j6349j10015j22920M579J6233K9323K6687
11260C7536l3780q044P2251M596k0289J2397Q2809J9938n0259j41683j4709L7800
$$ plain form
11248 -1437 40346 111584 136402 153301 147186 130026 161565 232340 160898 169567 146199 164065
11236 164065 133990 128414 105442 122131 92525 101707 67251 55352 27889 11333 44595 60302
11224 60302 66179 41650 21711 271 75517 93612 132452 149653 68369 -25483 -65885 -14136
11212 -14136 40760 87591 87205 17774 -67641 14822 70677 56672 94777 156718 147371 152324
11200 152324 166567 197850 129126 16744 82533 135578 119445 -38551 -49254 -47326 34741
11189 34741 76190 102629 157419 203693 162634 111623 110977 70153 6353 52612 136781 202902
11177 202902 211025 152227 76542 30172 47085 135066 74228 33476 9174 -31414 -55636 2084
11165 2084 19526 147926 145157 90778 179221 261696 165996 98858 102781 56604 51453 95150
$$ packed form
11248a437M1783P1238K4818J6899o115j7160L1539P0775p1442Q669k3368J7866
11236A64065l0075n576k2972J6689k9606R182l4456j1899k7463j6556L3262J5707
11224F0302N877k4529j9939k1440P5246J8095L8840J7201q1284r3852m0402N1749
11212a4136N4896M6831l86o9431q5415Q2463N5855j4005L8105O1941r347M953
11200A52324J4243L1283o8724j12382O5789N3045j6133j57996j0703J928Q2067
11189C4741M1449K6439N4790M6274m1059n1011o46m0824o3800M6259Q4169O6121
11177B02902Q123n8798p5685m6370J6913Q7981o0838m0752k4302m0588k4222N7720
11165B084J7442J28400k769n4379Q8443Q2475r5700o7138L923m6177n151M3697
$$ plain form
11153 95150 29352 62999 108340 184832 273108 249475 189807 201613 161255 233202 287875 180905
11141 180905 120175 89213 107972 133644 166039 144945 176549 167915 129523 141565 86686 70422
11129 70422 86696 139522 109533 75604 39316 73396 144462 105990 11099 19713 41558 18073
11117 18073 54529 60578 91702 104505 104266 81311 147657 162253 226485 236423 157880 146187
11105 146187 102621 120423 63620 71998 168673 167324 156289 111126 86535 102331 133172 76747
11093 76747 148778 234527 263008 205811 164157 241023 305375 175807 115557 157932 130613
11082 130613 129308 229246 287091 289087 263505 212536 171223 102173 80016 125877 214302 228379
11070 228379 157393 135589 216513 230863 217223 173531 90257 152135 226833 207788 130579
$$ packed form
11153I5150o5798L3647M5341P6492Q8276k3633n9668J1806m0358P1947N4673j06970
11141A80905o0730l0962J8759K5672L2395k1094L1604q634l8392J2042n4879j6264
11129G0422J6274N2826k9989l3929l6288L4080P1066l8472r4891Q614K1845k3485
11117A8073L6456O049L1124J2803k39k2955O6346J4596O4232R938p8543j1693
11105A46187m3566J7802n6803Q378R6675j349j1035m5163k4591J5796L0841n6425
11093G6747P2031Q5749K8481n7197m1654P6866O4352j29568o0250M2375k7319
11082A30613j305R9938N7845J996k5582n0969m1313o9050k2157M5861Q8425J4077
11070B28379p0986k1804Q0924J4350j3640m3692q3274O1878P4698j9045p7209
$$ plain form
11059 130579 138864 219390 217094 253106 225220 175314 163058 175186 232348 188056 161765 99786
11047 99786 136254 220444 315988 324043 296273 206651 151420 107773 104592 81774 109214 147393
11035 147393 283786 312302 373767 412711 303255 234333 180872 204742 228345 181174 153894
11024 153894 165180 173250 161463 156011 73341 37801 75750 19467 -36718 -1289 22130 -14928
11012 -14928 53534 101451 157204 226682 238843 200071 146939 238759 300124 275725 222264 213154
11000 213154 172648 199862 172820 193687 166966 228611 160189 127947 113446 114607 186555 231863
10988 231863 280352 280600 287467 247196 215574 287079 320761 251944 263671 194662 226604 229835
10976 229835 209128 188355 228803 275556 202762 144167 109404 95460 69676 56667 164378
$$ packed form
11059A30579Q285Q0526k296L6012k7886m9906j2256J2128N7162m4292k6291o1979
11047I9786L6468Q4190R5544Q055k7770q9622n5231m3647l181k2818K7440L8179
11035A47393J36393K8516O1465L8944j09456o8922n3461K3870K3603m7171k7280
11024A53894J1286Q070j1787n452q2670l5540L7949n6283n6185L5429K3419l7058
11012a4928O8462M7917N5753O9478J2161l8772n3132R1820O1365k4399n3461r110
11000B13154m0506K7214k7042K0867k6721O1645o8422l2242j4501J161P1948M5308
10988B31863M8489K48O867m0271l1622P1505L3682o8817J1727o9009L1942L231
10976B29835k0707k0773M0448M6753p2794n8595l4763j3944k5784j3009J07711
$$ plain form
10965 164378 205970 197439 250682 255500 265992 239632 204989 189690 276535 272567 362234 372542
10953 372542 341762 273015 290688 322681 213851 224061 272228 225278 222837 219238 180165 186154
10941 186154 215840 230284 259833 261663 212580 142056 178799 243717 272247 251573 231222 148732
10929 148732 90479 58068 21296 73763 112022 233829 272099 243382 271086 294323 332452
10918 332452 275841 277714 192978 84141 76345 139153 189313 156556 107726 154725 205158 214607
10906 214607 215028 189992 201549 232805 272782 261300 224704 253459 197990 204655 207502 192944
10894 192944 184726 145092 117849 120594 286877 336131 217951 170313 268862 249705 157182
10883 157182 167037 210444 329235 238017 207275 288434 399553 376188 326568 316908 271297
$$ packed form
10965A64378M1592q531N3243M818J0492k6360l4643j5299Q6845l968Q9667J0308
10953C72542l0780o8747J7673L1993j08830J0210M8167m6950k441l599l9073N989
10941A86154K9686J4444K9549J830m9083p0524L6743O4918K8530k0674k0351q2490
10929A48732n8253l2411l6772N2467L8259J21807L8270k8717K7704K3237L8129
10918C32452n6611J873q4736j08837p796O2808N0160l2757m8830M6999N0433R449
10906B14607M21k5036J1557L1256L9977j1482l6596K8755n5469O665K847j4558
10894A92944q218l9634k7243K745J66283M9254j18180m7638R8549j9157r2523
10883A57182R855M3407J18791r1218l0742Q1159J11119k3365m9620r660m5611
$$ plain form
10872 271297 282613 296562 249473 303779 253027 198001 236494 265713 229541 159397 152042 162602
10860 162602 170017 177465 197751 190895 283693 341710 293430 349135 327423 284439 284105 282786 276599
10847 276599 245982 313434 349262 392260 342206 351133 311660 344095 348566 347782 286759 299672
10835 299672 295702 267918 328520 332729 274948 279972 342197 315864 323393 299241 323771 310409
10823 310409 330428 369529 414150 374031 359756 375702 400489 371602 338128 304668 367878
10812 367878 475922 473176 394939 316189 346670 434595 455634 369102 408406 411905 480557 474402
10800 474402 361296 353608 350566 413390 388190 277606 262455 195486 186710 179399 222463 276419
10788 276419 325807 426728 423696 369643 300966 387716 418909 463049 490762 445298 426375
$$ packed form
10872B71297J1316J3949m7089N4306n0752n5026L8493K9219l6172p0144p355J0560
10860A62602P415P448K0286o856R2798N8017m8280N5705k1712m2984l34j319o187
10847B76599l0617O7452L5828M2998n0054Q927l9473L2435M471p84o1023J2913
10835B99672l970k7784O0602M209n7781N024O2225k6333P529k4152K4530j3362
10823C10409K0019L9101M4621m0119j4275J5946K4787k8887l3474l3460O3210
10812C67878J08044k746p8237p8750L0481Q7925K1039q6532L9304L499O8652o155
10800D74402j13106p688l042O2824k5200j10584j5151o6969q776p311M3064N3956
10788B76419M9388J00921l032n4053o8677Q6750L1193M4140K7713m5464j8923
$$ plain form
10777 426375 474679 498921 462557 523675 519626 435641 399484 377714 421111 518597 487221 438548
10765 438548 433866 333196 326681 298060 336428 303049 356528 389261 379344 390288 418768 432030
10753 432030 460885 427868 383164 429252 418034 438307 485890 407802 412656 532602 533784 524620
10741 524620 545192 545651 444558 425318 451956 541307 459889 432132 341656 337575 369382 407208
10729 407208 418350 422179 355302 415266 494928 462264 442836 537715 548127 522274 514181 471965
10717 471965 409650 491297 553740 631807 725855 786699 831778 786186 744506 740670 718974 655554
10705 655554 541340 450345 395122 480569 612776 598656 533325 414941 403393 384418 413052
10694 413052 464341 502056 505203 549642 601591 646312 738197 727462 624763 562362 594652
$$ packed form
10777D26375M8304K4242l6364O1118m049q3985l6157k1770M3397R7486l1376m8673
10765D38548m682j00670o515k8621L8368l3379N3479L2733r917J0944K8480J3262
10753D32030K8855l3017m4704M6088j1218K0273M7583p8088M854J19946J182r164
10741E24620K0572M59j01093j9240K6638Q9351q1418k7757r0476m081L1807L7826
10729D07208J1142L829o6877N9964P9662l2664j9428R4879J0412k5853q093m2216
10717D71965o2315Q1647O2443P8067R4048O0844M5079m5592m1680l836k1696o3420
10705F55554j14214r0995n5223Q5447J32207j4120o5331j18384j1548j8975K8634
10694D13052N1289L7715L147M4439N1949M4721R1885j0735j02699o2401L2290
$$ plain form
10683 594652 635543 665834 716192 694469 665722 590466 575099 573562 645925 633039 702862 756795
10671 756795 739960 695653 673957 631836 610409 659707 652827 668465 686128 709052 731303 813450
10659 813450 887371 836537 757179 679766 691856 771258 854860 880885 798247 710909 726025
10648 726025 789048 829152 860081 847101 802731 776583 725319 662469 746173 833279 839199 876253
10636 876253 926886 881317 814137 739493 760458 776264 795486 819252 839153 755904 819274
10625 819274 942597 956801 933125 941974 937306 916755 816233 806472 902535 968896 951692 903035
10613 903035 902217 884138 873018 948740 1038839 1073284 1102891 997408 927802 987154 1077775 1077234
10601 1077234 1007421 989030 1038330 1047682 1079432 1086826 1086514 1108373 1138028 1191814 1259794 1277723
$$ packed form
10683E94652M0891L0291N0358k1723k8747p5256j5367j537P2363j2886O9823N3933
10671G56795j6835m4307k1696m2121k1427M9298o880J5638J7663K2924K2251Q2147
10659H13450P3921n0834p9358p7413J2090P9402Q3602K6025q2638q7338J5116
10648G26025O3023M0104L0929j2980m4370k6148n1264o2850Q3704Q7106N920L7054
10636H76253N0633m5569o7180p4644K0965J5806J9222K3766J9901q3249O3370
10625H19274J23323J4204k3676Q849m668k0551j00522r761R6063O6361j7204m8657
10613I03035q18j8079j1120P5722R0099L4445K9607j05483o9606N9352R0621n41
10601A077234o9813j8391M9300R352L1750P394l12K1859K9655N3786O7980J7929
$$ plain form
10589 1277723 1261477 1184307 1140814 1133574 1052986 1081763 1146241 1126387 1152580 1194495 1207686
10578 1207686 1227868 1215311 1189641 1243046 1252256 1270928 1239519 1213674 1266501 1254353 1252697 1336346
10566 1336346 1413153 1379391 1297176 1385961 1368257 1358666 1379180 1313357 1358684 1402895 1410787 1404461
10554 1404461 1463511 1451604 1385611 1368699 1422355 1486147 1503547 1469562 1472411 1568036 1619733
10543 1619733 1557187 1481087 1432089 1416447 1417421 1459311 1491054 1548752 1676869 1695414 1620027
10532 1620027 1597746 1612951 1638032 1561134 1544707 1526381 1622360 1732936 1811862 1799122 1819545
10521 1819545 1771676 1754987 1750304 1716537 1657934 1733402 1792478 1816657 1890494 1975236 2076189
10510 2076189 2078629 2055169 1909356 1882175 1964531 2035620 2043461 2002939 2047056 2046918 2048430 2090010
$$ packed form
10589A277723j6246p7170m3493p240q0588K8777O4478j9854K6193M1915J3191
10578A207686K0182j2557k5670N3405R210J8672l1409k5845N2827j2148j656Q3649
10566A336346P6807l3762q2215Q8785j7704r591K0514o5823M5327M4211P892o326
10554A404461N9050j1907o5993j6912N3656O3792J7400l3985K849R5625N1697
10543A619733o2546p6100m8998j5642R74M1890L1743N7698J28117J8545p5387
10532A620027k2281J5205K5081p6898j6427j8326R5979J10576P8926j2740K0423
10521A819545m7869j6689m683l3767n8603P5468N9076K4179P3837Q4742J00953
10510B076189K440k3460j45813k7181Q2356P1089P841m0522M4117j38J512M1580
$$ plain form
10498 2090010 2154824 2171529 2180208 2213249 2243902 2234542 2231889 2277229 2348988 2401476 2392129 2340046
10486 2340046 2389159 2395438 2341938 2420236 2484377 2536815 2545398 2519510 2535031 2644036 2732264
10475 2732264 2787794 2773448 2675109 2722891 2837732 2796001 2722715 2680866 2609704 2562626 2675279
10464 2675279 2811376 2922230 2998421 3003072 2891482 2860876 2864454 2945735 3047188 3071936 3074825
10453 3074825 3100157 3101080 3115515 3139024 3105348 3167413 3197414 3300788 3221075 3239798 3305305
10442 3305305 3326757 3405138 3411583 3353329 3366731 3417097 3456540 3488133 3589864 3577304 3585723
10431 3585723 3685444 3672132 3636632 3767246 3889203 3938982 3841758 3831671 3814036 3802257 3836221
10420 3836221 3901505 3928187 4055583 4175649 4158322 4142942 4115595 4160276 4152465 4152792 4206162
$$ packed form
10498B090010O4814J6705Q679L3041L0653r360k653M5340P1759N2488r347n2083
10486B340046M9113O279n3500P8298O4141N2438Q583k5888J5521J09005Q8228
10475B732264N5530j4346r8339M7782J14841m1731p3286m1849p1162m7078J12653
10464B675279J36097J10854P6191M651j11590l0606L578Q1281J01453K4748K889
10453C074825K5332R23J4435K3509l3676O2065L0001J03374p9713J8723O5507
10442C305305K1452P8381O445n8254J3402N0366L9443L1593J01731j2560Q419
10431C585723R9721j3312l5500J30614J21957M9779r7224j0087j7635j1779L3964
10420C836221O5284K6682J27396J20066j7327j5380k7347M4681p811L27N3370
$$ plain form
10409 4206162 4320335 4464511 4455323 4414492 4490704 4553759 4526958 4561512 4570445 4655140 4737759
10398 4737759 4747655 4673893 4675409 4775648 4755369 4773326 4806670 4872651 4901798 4901565 4978645 5023187
10386 5023187 5059312 5116870 5140790 5160992 5199367 5349029 5372332 5360463 5432597 5521197 5444417
10375 5444417 5347768 5434383 5501599 5513359 5558058 5539142 5511320 5576193 5693290 5842120 5906349
10364 5906349 5865890 5837316 5872495 5883406 5986340 6077298 6172551 6190402 6149175 6101316 6206391
10353 6206391 6239840 6270121 6405467 6579355 6639946 6693082 6705545 6726053 6888098 7037023
10343 7037023 7117224 7206606 7417221 7600063 7740038 7956092 8181899 8383910 8495155 8463461
10333 8463461 8387134 8233993 8020480 7821456 7667718 7582280 7528852 7542932 7459057 7280012
$$ packed form
10409D206162J14173J44176r188m0831P6212O3055k6801L4554Q933Q4695Q2619
10398D737759R896p3762J516J00239k0279J7957L3344O5981K9147k33P7080M4542
10386E023187L6125N7558K3920K0202L8375J49662K3303j1869P2134Q8600p6780
10375E444417r6649Q6615O7216J1760M4699j8916k7822O4873J17097J48830O4229
10364E906349m0459k8574L5179J0911J02934R0958R5253J7851m1227m7859J05075
10353F206391L3449L0281J35346J73888O0591N3136J2463K0508J62045J48925
10343G037023Q0201Q9382K10615J82842J39975K16054K25807K02011J11245l1694
10333H463461p6327j53141k13513j99024j53738q5438n3428J4080q3875j79045
$$ plain form
10323 7280012 7148850 7178147 7159357 7146329 7087745 6993079 6986987 6981959 6934064 6929856 7000975 7014772
10311 7014772 7057267 7140046 7151426 7118903 7051426 7097845 7122891 7076651 7099093 7059049 7066546
10300 7066546 7094523 7056195 7026931 7044931 7047763 7132651 7114682 7033342 7129272 7184415 7069642
10289 7069642 6991006 6978852 7061226 7135244 7022276 6966069 6931169 6944618 7022263 7033049 7039938
10278 7039938 7036919 7008681 6955003 6890903 6848975 6824598 6909974 6894041 6835292 6787496 6818146
10267 6818146 6900019 6928554 6840638 6747347 6651447 6636242 6617089 6550904 6565762 6547467 6565755
10256 6565755 6520212 6505099 6506411 6496518 6483977 6440188 6360442 6371850 6425309 6410433 6313420 6260244
10244 6260244 6252355 6227435 6203146 6092600 5990508 5999040 5980611 6003321 5992528 5907441 5819987
$$ packed form
10323G280012j31162K9297j8790j3028n8584r4666o092n028m7895m208P1119J3797
10311G014772M2495Q2779J1380l2523o7477M6419K5046m6240K2442m0044P497
10300G066546K7977l8328k9264J8000K832Q4888j7969q1340R5930N5143j14773
10289G069642p8636j2154Q2374P4018j12968n6207l4900J3449P7645J0786O889
10278G039938l019k8238n3678o4100m1928k4377Q5376j5933n8749m7796L0650
10267F818146Q1873K8535q7916r3291r5900j5205j9153o6185J4858j8295J8288
10256F565755m5543j5113J312r893j2541m3789p9746J1408N3459j4876r7013n3176
10244F260244p889k4920k4289j10546j02092Q532j8429K2710j0793q5087q7454
$$ plain form
10233 5819987 5840600 5876244 5858867 5758664 5693170 5617417 5589572 5571174 5578907 5551525 5517326
10222 5517326 5564638 5546425 5450995 5432370 5377504 5371691 5341463 5289604 5312090 5329218 5338427 5257929
10210 5257929 5196292 5213540 5173951 5171611 5090281 5113913 5103561 5068781 5044843 5048472 5021041 5019813
10198 5019813 4977721 4930991 4924255 4855265 4763497 4698516 4657612 4599757 4633802 4660912 4637392
10187 4637392 4554546 4497904 4418753 4377465 4371656 4388103 4320492 4266432 4269202 4304540 4331068 4295108
10175 4295108 4221686 4208815 4189092 4102055 4110132 4094586 4053440 4018446 3992594 3966525 3922922
10164 3922922 3866144 3751400 3710757 3683144 3676026 3654676 3751627 3769238 3764666 3716157 3695006
10153 3695006 3707981 3721566 3690112 3604570 3666987 3701163 3643087 3529843 3434407 3432284 3316010
$$ packed form
10233E819987K0613L5644j7377j00203o5494p5753k7845j8398P733k7382l4199
10222E517326M7312j8213r5430j8625n4866n813l0228n1859K2486J7128R209q0498
10210E257929o1637J7248l9589k340q1330K3632j0352l4780k3938L629k7431j228
10198E019813m2092m6730o736o8990r1768o4981m0904n7855L4045K7110k3520
10187D637392q2846n6642p9151m1288n809J6447o7611n4060K770L5338K6528l5960
10175D295108p3422j2871j9723q7037Q077j5546m1146l4994k5852k6069m3603
10164C922922n6778j14744m0643k7613p118k1350R6951J7611m572m8509k1151
10153C695006J2975J3585l1454q5542O2417L4176n8076j13244r5436k123j16274
$$ plain form
10142 3316010 3337076 3394526 3361715 3336337 3313764 3266307 3291554 3315228 3181825 3091478 3105030
10131 3105030 3082505 3115894 3086622 3003360 2961332 3038553 3072245 2993542 2983144 2988597 2952458
10120 2952458 2920125 2957681 2993952 2933807 2914333 2911830 2852160 2814223 2767556 2801648 2839482
10109 2839482 2795749 2743472 2770366 2788192 2789017 2691390 2683787 2698736 2684049 2643735 2606873 2605878
10097 2605878 2667918 2711752 2751534 2716991 2733203 2623614 2647539 2621038 2550129 2469070 2459765
10086 2459765 2534168 2580241 2524441 2494504 2511861 2554519 2476780 2453058 2443044 2437475 2345257
10075 2345257 2268540 2284439 2342491 2432075 2436971 2336268 2261528 2234914 2232784 2183133 2084789
10064 2084789 2050555 2164933 2274381 2278265 2238931 2231123 2213038 2223806 2141881 2115035 2071912
$$ packed form
10142C316010K1066N7450l2811k5378k2573m7457K5247K3674j33403r0347J3552
10131C105030k2525L3389k9272q3262m2028P7221L3692p8703j0398N453l6139
10120B952458l2333L7556L6271o0145j9474k503n9670l7937m6667L4092L7834
10109B839482m3733n2277K6894J7826Q25r7627p603J4949j4687m0314l6862r95
10097B605878O2040M3834L9782l4543J6212j09589K3925k6501p0909q1059r305
10086B459765P4403M6073n5800k9937J7357M2658p7739k3722j0014n569r2218
10075B345257p6717J5899N8052Q9584M896j00703p4740k6614k130m9651r8344
10064B084789l4234J14378J09448L884l9334p808j8085J0768q1925k6846m3123
$$ plain form
10053 2071912 2075690 2093233 2083437 2103139 2089073 2092499 2177971 2129319 2135440 2082125 2014575 1990026
10041 1990026 1969379 1984910 1973257 1964992 1929092 1889011 1851405 1827966 1855779 1935542 1937550 1885362
10029 1885362 1890411 1941483 1951354 1896162 1795679 1734812 1776513 1805306 1894282 1846518 1853506 1883136
10017 1883136 1791566 1772448 1812447 1794938 1748151 1630615 1673312 1790255 1847123 1816581 1777999
10006 1777999 1703160 1722422 1776472 1803787 1779429 1772403 1714231 1706762 1786664 1755010 1699927 1767561
9994 1767561 1763716 1672460 1605753 1618553 1666912 1644724 1631784 1625423 1677781 1745888 1783071 1758712
9982 1758712 1695858 1647361 1600973 1554139 1564893 1576200 1500581 1455898 1412299 1426991 1376509
9971 1376509 1317298 1331582 1415314 1576956 1633559 1583018 1605595 1617771 1587399 1604860 1603482
$$ packed form
10053B071912L778J7543r796J9702j4066L426Q5472m8652O121n3315o7550k4549
10041A990026k0647J5531j1653q265l5900m0081l7606k3439K7813P9763K008n2188
10029A885362N049N1072R871n5192j00483o0867M1701K8793Q8976m7764O988K9630
10017A883136r1570j9118L9999j7509m6787j17536M2697J16943N6868l0542l8582
10006A777999p4839J9262N4050K7315k4358p026n8172p469P9902l1654n5083O7634
9994A767561l845r1256o6707J2800M8359k2188j2940o361N2358O8107L7183k4359
9982A758712o2854m8497m6388m6834J0754J1307p5619m4683m3599J4692n0482
9971A376509n9211J4284Q3732J61642N6603n0541K2577J2176l0372J7461j378
$$ plain form
9960 1603482 1576819 1601509 1519312 1487411 1528130 1488317 1452155 1505873 1534132 1469717 1473384 1494658
9948 1494658 1533198 1504639 1452180 1484733 1463173 1324900 1363074 1437379 1502786 1511012 1391538
9937 1391538 1280415 1297579 1329833 1387352 1523214 1545611 1536513 1542668 1500428 1367734 1270080
9926 1270080 1271762 1303561 1319301 1363305 1364461 1305049 1301560 1251941 1187743 1270708 1256689 1262153
9914 1262153 1394769 1370921 1301507 1313788 1334212 1302766 1183376 1182317 1239458 1249247 1201340
9903 1201340 1205907 1172395 1144990 1182853 1218617 1197504 1217767 1239471 1268628 1295494 1197737 1192352
9891 1192352 1187294 1207458 1255172 1220956 1223110 1224051 1218327 1201733 1159231 1154844 1178925 1160832 1141846
9878 1141846 1127760 1170150 1151119 1178653 1117748 1092855 1118346 1187356 1198661 1220920 1316023
$$ packed form
9960A603482k6663K4690q2197l1901M0719l9813l6162N3718K8259o4415L667K1274
9948A494658L8540k8559n2459L2553k1560j38273L8174P4305O5407Q226j19474
9937A391538j11123J7164L2254N7519J35862K2397r098O155m2240j32694r7654
9926A270080J682L1799J5740M4004J156n9412l489m9619o4198Q2965j4019N464
9914A262153J32616k3848o9414J2281K0424l1446j19390j059N7141R789m7907
9903A201340M567l3512k7405L7863L5764k1113K0263K1704K9157K6866r7757n385
9891A192352n058K0164M7714l4216K154R41n724j6594m2502m387K4081j8093j8986
9878A141846j4086M2390j9031K7534o0905k4893K5491O9010J1305K2259R5103
$$ plain form
9867 1316023 1386370 1411420 1362594 1283706 1248019 1180961 1154807 1115488 1137639 1160413 1161711 1142085
9855 1142085 1059411 1085931 1077345 1080676 1151693 1151065 1066812 1089604 1125430 1073558 1029148 1066787
9843 1066787 1012260 947291 1023794 1056259 1029473 1018594 956548 985514 1081004 1019450 1084422
9832 1084422 1131613 1084908 998918 1057130 1135038 1140906 1129963 1067673 998263 911541 924958 978861
9820 978861 1074235 1083015 1073706 1060839 1044557 1054554 1136699 1225225 1165868 1089872 1015044 940235
9808 940235 854016 838498 859191 922050 1048862 1077663 1042888 1023068 975129 977713 965428 1017824
9796 1017824 1043547 1083989 1077923 1084041 1031080 972932 996056 927391 888182 895357 915802 945532
9784 945532 1001585 977171 977649 1002649 967904 934483 963638 966797 992055 983852 990959 1014583 999377
$$ packed form
9867A316023P0347K5050m8826p8888l5687o7058k6154l9319K2151K2774J298j9626
9855A142085q2674K6520q586L331P1017o28q4253K2792L5826n1872m4410L7639
9843A066787n4527o4969P6503L2465k6786j0879o2046K8966R5490o1554O4972
9832A084422M7191m6705q5990N8212P7908N868j0943o2290o9410q6722J3417N3903
9820I78861R5374Q780r309j2867j6282R997Q2145Q8526n9357p5996p4828p4809
9808I40235q6219j5518K0693O2859J26812K8801l4775j9820m7939K584j2285N2396
9796A017824K5723M0442o066O118n2961n8148K3124o8665l9209P175K0445K9730
9784I45532N6053k4414M78K5000l4745l3421K9155L159K5258q203P107K3624j5206
$$ plain form
9771 999377 936018 933135 853505 804210 867603 941858 907640 922908 971700 943055 917341 943732
9759 943732 988539 949875 933272 879751 891232 960552 935332 902312 916727 931582 1031283 953589
9747 953589 878349 850127 789974 802548 897154 916442 894778 977992 1016604 1052621 1064810 973333
9735 973333 972383 1003928 1030402 944517 944946 952861 970597 1018487 945143 900388 954740 1037202 1052481
9722 1052481 1065304 1016768 1047554 996381 1012076 1027895 976457 952143 931769 897813 917830
9711 917830 953689 918094 951329 974031 939840 941812 936840 969390 897120 834695 807173 795271
9699 795271 737923 697617 722055 813925 834463 859718 885893 989078 1010187 1020454 924132
9688 924132 916230 979484 918658 930712 954210 889417 873855 818785 844392 786125 733401 735680
$$ packed form
9771I99377o3359k883p9630m9295O3393P4255l4218J5268M8792k8645k5714K6391
9759I43732M4807l8664j6603n3521J1481O9320k5220l3020J4415J4855R9701p7694
9747I53589p5240k8222o0153J2574R4606J9288k1664Q3214L8612L6017J2189r1477
9735I73333r50L1545K6474q5885M29P915J7736M7890p3344m4755N4352Q2462J5279
9722A052481J2823m8536L0786n1173J5695J5819n1438k4314k0374l3956K0017
9711I17830L5859l5595L3235K2702l4191J972m972L2550p2270o2425k7522j1902
9699G95271n7348m0306K4438R1870K0538K5255K6175J03185K1109J0267r6322
9688I24132p902O3254o0826J2054K3498o4793j5562n5070K5607n8267n2724K279
$$ plain form
9676 735680 844187 825065 809263 886542 880061 890021 869348 880079 916168 919889 908777 810238
9664 810238 821700 845148 860285 920060 927170 841783 808975 874533 804594 795859 889529 949277
9652 949277 1003123 968916 902414 820928 776047 770542 809586 866042 935392 935847 920176 816749
9640 816749 797334 898484 916343 862302 898554 867427 819005 812295 852216 893745 898086 904069
9628 904069 865068 806431 849175 870253 776913 703530 717253 803253 892998 916270 849788 876644
9616 876644 922411 827940 797023 807838 834084 964805 907107 918981 907466 916576 905870 910813
9604 910813 896723 879414 836248 850485 854860 873332 827772 842999 904863 900557 914994 903068
9592 903068 814178 799417 735516 743077 759995 683012 743960 866117 951362 1004236 924275 819995
$$ packed form
9676G35680J08507j9122j5802P7279o481R960k0673J0731L6089L721j1112r8539
9664H10238J1462K3448J5137N9775P110q5387l2808O5558o9939q735R3670N9748
9652I49277N3846l4207o6502q1486m4881n505L9044N6456O9350M55j5671j03427
9640H16749j9415J01150J7859n4041L6252l1127m8422o710L9921M1529M341N983
9628I04069l9001n8637M2744K1078r3340p3383J3723Q6000Q9745K3272o6482K6856
9616H76644M5767r4471l0917J0815K6246J30721n7698J1874j1515R110j0706M943
9604I10813j4090j7309m3166J4237M375J8472m5560J5227O1864m306J4437j1926
9592I03068q8890j4761o3901P561J6918p6983O0948J22157Q5245N2874p9961j04280
$$ plain form
9580 819995 885340 895694 935784 941930 905158 888173 837646 926772 894526 810567 790362 777960
9568 777960 796921 841403 867637 910605 895095 896500 829708 737252 711755 719198 744824 872399
9556 872399 920454 950604 945965 877015 876919 888102 845410 788972 750289 775130 830102 851279
9544 851279 741941 633666 703130 793470 786946 755819 689419 710305 708028 721477 799753 747359
9532 747359 654064 641624 666043 733046 778935 755651 689314 724192 770159 778402 814064 766480
9520 766480 839033 843710 871167 858648 830937 811259 778473 791306 762497 748786 740581 760853
9508 760853 810291 848245 855475 842201 765628 753369 730200 684677 655886 666377 624572 645486
9496 645486 725371 757875 766056 772873 769025 731244 747301 762757 734726 754296 788547 784913
$$ packed form
9580H19995O5345J0354M0090O146l6772j6985n0527Q9126l2246q3959k0205j2402
9568G77960J8961M4482K6234M2968j5510J405o6792r2456k5497P443K5626J27575
9556H72399M8055L0150m639o8950r6J1183m2692n6438l8683K4841N4972K1177
9544H51279j09338j08275O9464R0340o524l1127o6400K0886k277J3449P8276n2394
9532G47359r3295j2440K4419O7003M5889k3284o6337L4878M5967Q243L5662m7584
9520G66480P2553M677K7457j2519k7711j9678l2786J2833k8809j3711q205K0272
9508G60853M9438L7954P230j3274p6573j2259k3169m5523k8791J0491m1805K0914
9496F45486P9885L2504Q181O817l848l7781J6057J5456k8031J9570L4251l634
$$ plain form
9484 784913 773884 826872 828391 837489 833512 774791 731504 716515 718821 720549 749280 797861 782775
9471 782775 709188 690955 741639 760273 813912 808694 723297 698106 749612 749505 691066 742685
9459 742685 824070 855673 733893 643780 633391 690484 688700 647016 692169 734574 671486 710093
9447 710093 787140 698169 643364 576548 553329 647451 734870 747548 723802 818337 821932 738735
9435 738735 648207 722283 826446 812539 682283 601929 687586 716233 672225 678142 725927
9424 725927 669367 712044 690640 641462 644048 746323 795920 712375 582248 567971 576193 568236
9412 568236 572146 583859 674980 714423 697505 686036 593460 580935 591913 626405 654024 624699
9400 624699 701487 714704 604695 573301 584280 622908 604305 585191 595907 570615 534666
$$ packed form
9484G84913j1029N2988J519R098l977n8721m3287j4989K306J728K8731M8581j5086
9471G82775p3587j8233N0684J8634N3639n218q5397k5191N1506j07n8439N1619
9459G42685Q1385L1603j21780r0113j0389N7093j784m1684M5153M2405o3088L8607
9447G10093P7047q8971n4805o6816k3219R4122Q7419J2678k3746R4535L595q3197
9435G38735r0528P4076J04163j3907j30256q0354Q5657K8647m4008N917M7785
9424G25927n6560M2677k1404m9178K586J02275M9597q3545j30127j4277Q222p957
9412E68236L910J1713R1121L9443j6918j1469r2576j2525J0978L4492K7619k9325
9400F24699P6788J3217j10009l1394J0979L8628j8603j9114J0716k5292l5949
$$ plain form
9389 534666 617615 687242 716568 654805 752050 761351 614751 568826 653090 743523 692952 734392
9377 734392 755433 728920 694370 633164 608119 560693 549881 552660 589358 648129 650291 494206
9365 494206 417733 493577 607744 622614 696468 717946 723336 706906 667657 622305 539133 632809
9353 632809 637640 689989 661317 673399 722912 786550 722942 639189 571133 465829 518720 589848
9341 589848 597299 551140 531876 508075 560673 638805 661507 664999 650871 554961 508117 483451
9329 483451 479910 499760 563203 546939 598329 599399 645236 662427 631183 537766 559780 529504
9317 529504 558517 589200 529570 516010 508162 473350 457543 538587 579632 616882 562283 519896
9305 519896 476171 521113 610382 605324 607407 581273 542698 625093 697370 630782 571419 593165
$$ packed form
9389E34666Q2949O9627K9326o1763R7245R301j46600m5925Q4264R0433n0571M1440
9377G34392K1041k6513l4550o1206k5045m7426j0812K779L6698N8771K162j56085
9365D94206p6473P5844J14167J4870P3854K1478N390j6430l9249m5352q3172R3676
9353F32809M831N2349k8672J2082M9513O3638o3608q3753o8056j05304N2891P1128
9341E89848P451m6159j9264k3801N2598P8132K2702L492j4128r5910m6844k4666
9329D83451l541J9850O3443j6264N1390J070M5837J7191l1244r3417K2014l0276
9317E29504K9013L0683n9630j3560p848l4812j5807Q1044M1045L7250n4599m2387
9305E19896m3725M4942Q9269n058K083k6134l8575Q2395P2277o6588n9363K1746
$$ plain form
9293 593165 639504 593271 559876 517715 403995 304082 310349 360769 438913 484338 524865 566471
9281 566471 596289 538893 531421 464273 371937 352934 374525 409417 460568 536646 596694 601517
9269 601517 602156 534287 507042 545174 538370 567361 598763 596218 639857 669125 679941 529756
9257 529756 500332 518609 538798 566121 552669 669180 627886 516091 448548 470316 421770
9246 421770 361581 316512 436034 506300 509835 467375 444184 381458 413918 356965 331671 283174
9234 283174 266183 341358 389619 436738 422856 486661 543699 477857 410751 457238 482627 540747
9222 540747 451258 498121 484787 447396 523978 483125 440694 324690 371491 422821 481039
9211 481039 457634 415457 337326 375421 436385 514377 540618 482357 408082 342663 394612 499133
$$ packed form
9293E93165M6339m6233l3395m2161j13720r9913O267N0420P8144M5425M0527M1606
9281E66471K9818n7396p472o7148r2336j9003K1591L4892N1151P6078O0048M823
9269F01517O39o7869k7245L8132o804K8991L1402k545M3639K9268J0816j50185
9257E29756k9424J8277K0189K7323j3452J16511m1294j11795o7543K1768m8546
9246D21770o0189m5069J19522P0266L535m2460k3191o2726L2460n6953k5294m8497
9234B83174j6991P5175M8261M7119j3882O3805N7038o5842o7106M6487K5389N8120
9222E40747q9489M6863j3334l7391P6582m0853m2431j16004M6801N1330N8218
9211D81039k3405m2177p8131L8095O0964P7992K6241n8261p4275o5419N1949J04521
$$ plain form
9199 499133 457206 407149 436848 450510 414280 378295 408279 399538 396572 333171 394382 487498
9187 487498 459550 508006 548164 465468 425828 410876 352379 383361 325937 265698 258509 408579
9175 408579 453530 433984 358355 334575 344261 334919 291846 310198 243367 277596 246555 252184
9163 252184 300516 362610 318329 350662 451538 530839 533713 512531 472153 389178 281147
9152 281147 264941 209120 134019 113365 141999 240798 341673 370533 341783 308610 353161
9141 353161 384807 358625 309317 266998 278546 209578 150689 174047 248314 228481 231018 232406
9129 232406 308822 360921 327960 281947 205456 202416 248405 243077 162100 112266 109400 155128
9117 155128 152916 147597 241212 217630 210472 268712 308046 363272 302514 244943 230506 167116
$$ packed form
9199D99133m1927n0057K9699J3662l6230l5985K9984q741k966o3401O1211R3116
9187D87498k7948M8456M0158q2696l9640j4952n8497L0982n7424o0239p189J50070
9175D08579M4951j9546p5629k3780R686r342m3073J8352o6831L4229l1041N629
9163B52184M8332O2094m4281L2333J00876P9301K874k1182m0378q2975j08031
9152B81147j6206n5821p5101k0654K8634R8799J00875K8860k8750l3173M4551
9141C53161L1646k6182m9308m2319J1548o8968n8889K3358P4267j9833K537J388
9129B32406P6416N2099l2961m6013p6491l040M5989n328q0977m9834k866M5728
9117A55128k212n319R3615k3582p158N8240L9334N5226o0758n7571j4437o3390
$$ plain form
9105 167116 152064 221205 291523 314455 199896 142106 158218 197434 205298 156164 169152 294786
9093 294786 334343 257662 306828 358012 295165 202407 205274 186649 198252 292417 380603 339628
9081 339628 245431 223152 209981 223268 221530 178569 166126 151592 88437 38633 75212 238883
9069 238883 357688 279327 192083 155686 162177 186678 178968 196993 177700 132263 101665 97648
9057 97648 212667 252485 229211 216643 106259 59762 99320 177917 280750 243753 289586
9046 289586 362227 256641 177284 144946 136010 91853 233031 296075 274425 242851 144220
9035 144220 95212 80167 47417 45086 52342 191942 311677 324394 226451 74224 25706
9024 25706 35491 76433 124581 202826 196636 153487 91301 103572 175468 170160 111358 179278
$$ packed form
9105A67116j5052O9141P0318K2932j14559n7790J6112L9216P864m9134J2988J25634
9093B94786L9557p6681M9166N1184o2847r2758K867j8625J1603R4165Q8186m0975
9081C39628r4197k2279j3171J3287j738m2961j2443j4534o3155m9804L6579J63671
9069B38883J18805p8361q7244l6397O491K4501p710J8025j9293m5437l0598m017
9057I7648J15019L9818k3274j2568j10384m6497L9558P8597J02833l6997M5833
9046B89586P2641j05586p9357l2338q936m4157J41178O3044k1650l1574r8631
9035A44220m9008j5045l2750k331P256J39600J19735J2717r7943j52227m8518
9024B5706R785M0942M8148P8245o190m3149o2186J2271P1896n308n8802O7920
$$ plain form
9012 179278 178394 234598 258418 198503 195076 225409 293915 261814 265133 309293 311405 206829
9000 206829 102761 92662 176578 222727 276859 265777 258604 212008 142845 113437 80057 16468
8988 16468 16315 29461 96688 113479 102818 119186 113961 183036 143836 109363 54761 117638
8976 117638 181799 150865 109461 151162 128383 123875 182762 238762 235502 195561 173293 170767
8964 170767 187227 169383 129343 94099 159125 209508 170338 162065 200325 250607 256674 240939
8952 240939 244612 243734 150334 114157 171816 213908 240749 258626 201579 46897 -18682 9681
8940 9681 -22972 -33712 -51743 -6650 28174 70852 51817 107747 232670 300041 211050 136685
8928 136685 145240 73849 14429 -33549 -23614 5028 92200 157943 178882 133630 33013 17389
$$ packed form
9012A79278q84N6204K3820n9915l427L0333O8506l2101L319M4160K112j04576
9000B06829j04068j0099Q3916M6149N4132j1082p173m6596o9163k9408l3380o3589
8988A6468j53J3146O7227J6791j0661J6368n225O9075l9200l4473n4602O2877
8976A17638O4161l0934m1404M1701k2779m508N8887N6000l260l9941k2268k526
8964A70767J6460j7844m0040l5244O5026N0383l9170q273L8260N0282O067j5735
8952B40939L673q78r3400l6177N7659M2092K6841J7877n7047j54682o5579K8363
8940I681l2653j0740j8031M5093L4824M2678j9035N5930J24923O7371q8991p4365
8928A36685Q555p1391n9420m7978R935K8642Q7172O5743K0939m5252j00617j5624
$$ plain form
8916 17389 118638 176367 163991 144370 160537 95662 186035 207057 101747 40841 50375 -2224
8904 -2224 40757 41783 48670 80761 84240 159460 196338 154923 119966 83888 117899 131773 115633
8891 115633 64699 41274 174565 139965 153093 86892 38888 166158 216706 246916 263557
8880 263557 226294 154905 122555 95860 40271 89594 134546 204764 183545 150594 207487 239057
8868 239057 174086 140737 104456 146717 168684 168491 66617 43096 53970 50119 94966 104095
8856 104095 132497 126838 139349 134592 97034 89876 31660 26975 174608 259060 279653 287374
8844 287374 324859 217647 113440 80136 119056 212345 276405 102041 37106 103531 166319
8833 166319 142785 52252 -10915 77548 72929 28241 -25746 21916 21302 10636 -32862 -75551
$$ packed form
8916A7389J01249N7729j2376j9621J6167o4875R0373K1022j05310o0906R534n2599
8904b224M2981J026O887L2091L479P5220L6878m1415l4957l6078L4011J3874j6140
8891A15633n0934k3425J33291l4600J3128o6201m8004J27270N0548L0210J6641
8880B63557l7263p1389l2350k6695n5589M9323M4952P0218k1219l2951N6893L1570
8868B39057o4971l3349l6281M2261K1967j93j01874k3521J0874l851M4847R129
8856A04095K8402n659J2511m757l7558p158n8216m685J47633Q4452K0593P721
8844B87374L7485j07212j04207l3304L8920R3289O4060j74364o4935O6425O2788
8833A66319k3534r0533o3167Q8463m619m4688n3987M7662o14j0666m3498m2689
$$ plain form
8821 -75551 -108085 -48696 77126 61996 -102606 -133617 -114888 -134013 -135242 -106782 -89889 -37896
8809 -37896 -70973 -53315 -3652 42534 661 -54201 -51525 -47951 -54497 -3537 13270 -33433
8797 -33433 -39026 -51703 14055 146956 201641 163451 141239 60324 31683 96335 125258 166902
8785 166902 85911 73081 33465 -28354 -15211 29523 -24287 -56154 -125303 -230142 -110761
8774 -110761 -13314 33630 63895 73673 66588 38039 66621 87556 160267 167393 121181 35433
8762 35433 -22850 -30782 54040 31801 -5138 -78517 -122511 -98360 -86240 -103877 -31010 48211
8750 48211 89481 16466 53235 87658 20891 -59571 -137280 -162620 -58106 6271 62 -28862
8738 -28862 -104600 -89668 -55596 -48593 12406 25902 -11756 -40431 -2760 74936 96322 128852
$$ packed form
8821g5551l2534N9389J25822j5130j64602l1011J8729j9125j229K8460J6893N1993
8809c7896l3077J7658M9663M6186m1873n4862K676L574o546N0960J6807m6703
8797c3433n593j2677O5758J32901N4685l8190k2212q0915k8641O4652K8923M1644
8785A66902q0991j2830l9616o1819J3143M4734n3810l1867o9149j04839J19381
8774a10761R7447M6944L0265R778p085k8549K8582K0935P2711P126m6212q5748
8762C5433n8283p932Q4822k2239l6939p3379m3994K4151J2120j7637P2867P9221
8750D8211M1270p3015L6769L4423o6767q0462p7709k5340J04514O4377o209k8924
8738b8862p5738J4932L4072P003O0999J3496l7658k8675L7671P7696K1386L2530
$$ plain form
8726 128852 153590 127805 69481 -33599 -107629 -96405 -77113 -52322 10596 -18594 25630
8715 25630 57807 103170 46849 -63222 -38748 9283 27151 33233 -60028 -133508 -142135 -188720
8703 -188720 -141745 -101914 -61452 8225 200436 171899 119005 115578 99326 11793 -102875
8692 -102875 -106978 -121406 -69615 -38770 -6099 -85646 -86989 -34089 87166 103514 94532 85091
8680 85091 81061 199415 171294 102005 35014 15133 -4621 12581 52508 -3757 13532 25653
8668 25653 -29227 -1816 71299 69749 64588 61263 -9399 -36510 -27735 -3180 31403 59276 81584
8655 81584 96146 9311 -26903 -4292 37981 42517 44923 11218 24351 62785 39034 96468
8643 96468 97048 818 20612 100906 152564 224712 224940 217925 159523 79465 40805 -1747 17245
$$ packed form
8726A28852K4738k5785n8324j03080p4030J1224J9292K4791O2918k9190M4224
8715B5630L2177M5363n6321j10071K4474M8031J7868O082r3261p3480q627m6585
8703a88720M6975L9831M0462O9677J92211k8537n2894l427j6252q7533j14668
8692a02875m103j4428N1791L0845L2671p9547j343N2900J21255J6348q982r441
8680H5091m030J18354k8121o9289o6991j9881j9754J7202L9927n6265J7289J2121
8668B5653n4880K7411P3115j550n161l325p0662k7111Q775K4555L4583K7873K2308
8655H1584J4562q6835l6214K2611M2273M536K406l3705J3133L8434k3751N7434
8643I6468N80r6230J9794Q0294N1658P2148K28p015n8402q0058l8660m2552J8992
$$ plain form
8630 17245 20686 -6846 8966 72941 82746 36395 -69783 -85738 17955 71792 103519 -7135
8618 -7135 20788 78419 65313 7981 10542 5164 -44453 20785 38648 80352 46960 -46307
8606 -46307 -8302 86407 81455 172311 242983 221957 199735 248041 229569 196518 169370 165478
8594 165478 152300 184795 228768 174714 128742 88900 102841 130218 33245 49118 66632 43584
8582 43584 5096 37233 63380 82999 103916 65380 72044 48915 -53058 -72435 -21101 43616
8570 43616 76023 54125 106945 197154 176659 112036 76605 23424 -3685 -7785 -26353 -27720
8558 -27720 -32254 16383 91860 71574 74673 203555 229098 164584 29416 20623 30418 -11707
8546 -11707 73725 115417 40446 -18932 -66683 -20304 79631 100382 47357 57384 -6945 -85173
$$ packed form
8630A7245L441k7532J5812O3975R805m6351j06178j5955J03693N3837L1727j10654
8618g135K7923N7631j3106n7332K561n378m9617O5238J7863M1704l3392r3267
8606d6307L8005R4709m952R0856P0672k1026k2222M8306j8472l3051k7148l892
8594A65478j3178L2495M3973n4054m5972l9842J3941K7377r6973J5873J7514k3048
8582D3584l8488L2137K6147J9619K0917l8536O664k3129j01973j9377N1334O4717
8570D3616L2407k1898N2820R0209k0495o4623l5431n3181k7109m100j8568j367
8558b7720m534M8637P5477k0286L099J28882K5543o4514j35168q793R795m2125
8546a1707Q5432M1692p4971n9378m7751M6379R9935K0751n3025J0027o4329p8228
$$ plain form
8534 -85173 -136986 -87209 -46172 -46845 -9584 39811 11437 -3489 -31785 -46751 -16541 -10236
8522 -10236 21175 62271 58758 74306 35492 64088 39379 22323 -16906 -90412 -127795 -106440
8510 -106440 -60744 -76328 -101087 -99595 -122434 -38343 43673 45867 7225 -45297 -65828 -87860
8498 -87860 -97111 49489 54971 59716 28947 -11033 14676 100826 43057 -27307 9155 41712
8486 41712 71471 42663 39461 -11557 18729 106236 143378 135158 105427 94103 4543 -42854
8474 -42854 -162591 -174641 -56278 -78966 -22077 -7243 9390 53343 112244 187434 156761
$$ packed form
8534h5173n1813M9777M1037o73L7261M9395k8374j4926k8296j4966L0210O305
8522a0236L1411M1096l513J5548l8814K8596k4709j7056l9229p3506l7383K1355
8510a06440M5696j5584k4759J492k2839Q4091Q2016K194l8642n2522k0531k2032
8498h7860r251J46600N482M745l0769l9980K5709Q6150n7769p0364L6462L2557
8486D1712K9759k8808l202n1018L0286Q7507L7142q220k9731j1324q9560m7397
8474d2854j19737j2050J18363k2688N6889J4834J6633M3953N8901P5190l0673
$$ [...]
##END NTUPLES=NMR SPECTRUM
##END=
