##TITLE=Analysis number 313932
Compound Code cc 45414
Book Reference 397/88/2
Project Code adrs
Chemist Name brucer
##JCAMPDX= 6.0         $$ Bruker NMR JCAMP-DX V2.0
##DATA TYPE= NMR SPECTRUM
##DATA CLASS= NTUPLES
##ORIGIN= Bruker BioSpin GmbH
##OWNER= NMR
$$ XWIN-NMR		Version 3.5
$$ Fri Sep 30 15:04:56 2005 GMT Daylight Time (UT+1h)  MAYBRIDGE\NMR@NMR_250MHZ
##.OBSERVE FREQUENCY= 250.131544655141
##.OBSERVE NUCLEUS= ^1H
##.ACQUISITION MODE= SIMULTANEOUS (DQD)
##.ACQUISITION SCHEME= undefined
##.AVERAGES= 16
##.DIGITISER RES= 18
##SPECTROMETER/DATA SYSTEM= dpx250
##.PULSE SEQUENCE= zg30
##.SOLVENT NAME= CDCl3
##.SHIFT REFERENCE= (INTERNAL, CDCl3, 0, 16.522)
##AUDIT TRAIL= $$ (NUMBER, WHEN, WHO, WHERE, WHAT)
$$ ##TITLE= Audit trail, XWIN-NMR		Version 3.5
$$ ##JCAMPDX= 5.01
$$ ##ORIGIN= Bruker BioSpin GmbH
$$ ##OWNER= NMR
$$ C:\u/data/dgb/nmr/ADRS/10150/pdata/1/auditp.txt
$$ ##AUDIT TRAIL=  $$ (NUMBER, WHEN, WHO, WHERE, WHAT)
(   1,<2005-09-30 15:04:39.23 +100>,<MAYBRIDGE\NMR>,<NMR_250MHZ>,
      <created by zg, POWCHK disabled, PULCHK disabled
       configuration hash MD5:
       62 19 C7 07 E1 42 D1 B7 37 6C 3D D0 77 39 F9 E6
       data hash MD5: 64K
       6A 4C CB 74 FB C4 A4 CE 49 AD 2E 0A 03 B2 3A 42>)
(   2,<2005-09-30 15:04:49.41 +100>,<MAYBRIDGE\NMR>,<NMR_250MHZ>,
      <Start of raw data processing
       ef LB = 0.3 FT_mod = 6 PKNL = 1 SI = 32K 
       data hash MD5: 32K
       1C D6 61 48 C3 51 AF 89 10 37 F6 24 BA DF 12 E9>)
(   3,<2005-09-30 15:04:51.20 +100>,<MAYBRIDGE\NMR>,<NMR_250MHZ>,
      <apk 
       data hash MD5: 32K
       0C FF B0 90 01 B5 06 11 2C 75 34 6F 99 AD 9E 6A>)
(   4,<2005-09-30 15:04:51.93 +100>,<MAYBRIDGE\NMR>,<NMR_250MHZ>,
      <abs ABSG = 5 
       data hash MD5: 32K
       41 58 19 D5 AC 2A B7 04 4F 93 10 2A 12 18 12 0A>)
$$ ##END=
$$ 
$$ hash MD5
$$ 9C 21 FB 21 F8 2B 90 F7 8E 98 FC AC 74 6A 4F 79
##$RELAX= 
##$RELAX= 
##$RELAX= 
##$RELAX= 
##$RELAX= 
##$RELAX= 
##$RELAX= 
$$ Bruker specific parameters
$$ --------------------------
##$DU= <C:\u>
##$EXPNO= 10150
##$NAME= <ADRS>
##$PROCNO= 1
##$TYPE= <nmr>
##$USER= <dgb>
##$AMP= (0..31)
100 100 100 100 100 100 100 100 100 100 100 100 100 100 100 100 100 100 
100 100 100 100 100 100 100 100 100 100 100 100 100 100 
##$AQSEQ= 0
##$AQ_mod= 3
##$AUNM= <au_zg>
##$AUTOPOS= <57 >
##$BF1= 250.13
##$BF2= 250.13
##$BF3= 250.13
##$BF4= 250.13
##$BF5= 500.13
##$BF6= 500.13
##$BF7= 500.13
##$BF8= 500.13
##$BYTORDA= 1
##$CFDGTYP= 0
##$CFRGTYP= 5
##$CHEMSTR= <none>
##$CNST= (0..31)
1 1 145 1 1 1 1 1 1 1 1 1 1 1 1 1 1 1 1 1 1 1 1 1 1 1 1 1 1 1 1 1 
##$CPDPRG= <>
##$CPDPRG1= <>
##$CPDPRG2= <>
##$CPDPRG3= <>
##$CPDPRG4= <mlev>
##$CPDPRG5= <mlev>
##$CPDPRG6= <mlev>
##$CPDPRG7= <mlev>
##$CPDPRG8= <mlev>
##$CPDPRGB= <>
##$CPDPRGT= <>
##$D= (0..31)
0 1 0 0 0 0 0 0 0 0.06 0 0 0 0 0 0 0.0002 0 0 0 0 0 0 0 0 0 0 0 0 0 0 
0 
##$DATE= 1128089078
##$DBL= (0..7)
120 120 120 120 120 120 120 120 
##$DBP= (0..7)
150 150 150 150 150 150 150 150 
##$DBP07= 0
##$DBPNAM0= <>
##$DBPNAM1= <>
$$ [...]
##$SUBNAM7= <"">
##$SUBNAM8= <"">
##$SUBNAM9= <"">
##$SW= 20.6930455092707
##$SWIBOX= (0..15)
0 0 3 0 0 0 0 0 0 0 0 0 0 0 0 0 
##$SW_h= 5175.983436853
##$TD= 65536
##$TD0= 1
##$TE= 295.16
##$TE2= 300
##$TE3= 300
##$TEG= 300
##$TL= (0..7)
0 120 120 120 120 120 120 120 
##$TP= (0..7)
150 150 150 150 150 150 150 150 
##$TP07= 0
##$TPNAME0= <>
##$TPNAME1= <>
##$TPNAME2= <>
##$TPNAME3= <>
##$TPNAME4= <>
##$TPNAME5= <>
##$TPNAME6= <>
##$TPNAME7= <>
##$TPOAL= (0..7)
0.5 0.5 0.5 0.5 0.5 0.5 0.5 0.5 
##$TPOFFS= (0..7)
0 0 0 0 0 0 0 0 
##$TUNHIN= 0
##$TUNHOUT= 0
##$TUNXOUT= 0
##$USERA1= <user>
##$USERA2= <user>
##$USERA3= <user>
##$USERA4= <user>
##$USERA5= <user>
##$V9= 5
##$VALIST= <valist>
##$VCLIST= <CCCCCCCCCCCCCCC>
##$VD= 0
##$VDLIST= <DDDDDDDDDDDDDDD>
##$VPLIST= <PPPPPPPPPPPPPPP>
##$VTLIST= <TTTTTTTTTTTTTTT>
##$WBST= 1024
##$WBSW= 4
##$XGAIN= (0..3)
0 0 0 0 
##$XL= 0
##$YL= 0
##$YMAX_a= 388781
##$YMIN_a= -351307
##$ZGOPTNS= <>
##$ZL1= 120
##$ZL2= 120
##$ZL3= 120
##$ZL4= 120
##$ABSF1= 16.522
##$ABSF2= -4.171173
##$ABSG= 5
##$ABSL= 3
##$ALPHA= 0
##$AQORDER= 0
##$ASSFAC= 0
##$ASSFACI= 0
##$ASSFACX= 0
##$ASSWID= 0
##$AUNMP= <proc_1d>
##$AZFE= 0.1
##$AZFW= 0.1
##$BCFW= 0
##$BC_mod= 0
##$BYTORDP= 0
##$COROFFS= 0
##$CY= 12.5
##$DATMOD= 1
##$DC= 0
##$DFILT= <>
##$DTYPP= 0
##$F1P= 14.0000005364418
##$F2P= -0.99999901652339
##$FCOR= 0.5
##$FTSIZE= 32768
##$FT_mod= 6
##$GAMMA= 0
##$GB= 0
##$INTBC= 1
##$INTSCL= 1
##$ISEN= 128
##$LB= 0.3
##$LEV0= 0
##$LPBIN= 0
##$MAXI= 10000
##$MC2= 0
##$MEAN= 0
##$ME_mod= 0
##$MI= 0
##$NCOEF= 0
##$NC_proc= -4
##$NLEV= 6
##$NOISF1= 0
##$NOISF2= 0
##$NSP= 0
##$NTH_PI= 0
##$NZP= 0
##$OFFSET= 16.522
##$PC= 1
##$PHC0= -71.19303
##$PHC1= 18.42941
##$PH_mod= 1
##$PKNL= yes
##$PPARMOD= 0
##$PSCAL= 4
##$PSIGN= 0
##$REVERSE= no
##$SF= 250.13
##$SI= 32768
##$SIGF1= 0
##$SIGF2= 0
##$SINO= 400
##$SIOLD= 32768
##$SREGLST= <1H.CDCl3>
##$SSB= 0
##$STSI= 32768
##$STSR= 0
##$SW_p= 5175.98343685301
##$SYMM= 0
##$S_DEV= 0
##$TDeff= 65536
##$TDoff= 0
##$TI= <Analysis number 999999
Compound Code 99
Book Reference 9
Project Code 9>
##$TILT= no
##$TM1= 0
##$TM2= 0
##$TOPLEV= 0
##$USERP1= <user>
##$USERP2= <user>
##$USERP3= <user>
##$USERP4= <user>
##$USERP5= <user>
##$WDW= 1
##$XDIM= 32768
##$YMAX_p= 379267787
##$YMIN_p= -318270
$$ End of Bruker specific parameters
$$ ---------------------------------
##NTUPLES= NMR SPECTRUM
##VAR_NAME=  FREQUENCY,     SPECTRUM/REAL,   SPECTRUM/IMAG
##SYMBOL=    X,             R,               I
##VAR_TYPE=  INDEPENDENT,   DEPENDENT,       DEPENDENT
##VAR_FORM=  AFFN,          ASDF,            ASDF
##VAR_DIM=   32768,         32768,           32768
##UNITS=     HZ,            ARBITRARY UNITS, ARBITRARY UNITS
##FACTOR=    0.157963299565203, 1,           1
##FIRST=     4132.6476996994, 0,             0
##LAST=      -1043.33573715361, 0,           0
##MIN=       -1043.33573715361, -318270,     0
##MAX=       4132.6476996994, 379267787,     0
$$ Real data points
##PAGE= N=1
##DATA TABLE= (X++(R..R)), XYDATA
$$ [...]
24915 10125 -1018 -1770 16545 11669 32690 41640 34747 18964 20384 20014 35589 29804 22022 10210
24901 10210 9706 27635 8687 -19937 -24113 -10516 14396 31291 12932 -16025 19262 29082
24889 29082 31373 22757 10514 -2682 2642 5622 1586 19319 -1302 -25372 -7855 29683 56737
24876 56737 20820 -15455 6645 47801 31025 -20519 -12230 21296 7810 -9129 -15327 -30899
24864 -30899 -39403 -7744 22434 38697 12606 5258 -4850 -15500 -17213 -25302 -37563 -16681
24852 -16681 -30063 -36107 -58233 -23408 -21299 -30480 -35540 5311 -9380 -16452 9399 6311 -8051
24839 -8051 -7434 29238 28902 20441 20475 10169 3800 8458 34687 37081 25718 42543 42599 20500 28580
24824 28580 19598 5269 7319 -13409 7651 17254 -20417 -29203 -8989 -32542 -25526 -17762 -19836
24811 -19836 -39374 -72489 -56423 -16080 -10248 472 -12821 -20931 -29022 -25531 -382 -13511
24799 -13511 -14566 -22939 -12432 3681 6728 15722 35666 33502 2419 -3852 -2631 21602 60130
24786 60130 62662 24219 35177 34217 44610 51026 18373 17707 -9147 -12942 9002 3922 -551
24773 -551 -23894 -24305 7883 10400 -7118 -4161 12111 -12880 -14904 -4405 548 10416 15161 5389
24759 5389 17994 41834 19358 27123 17740 32501 42254 35913 29762 38070 47626 29201 12379
24746 12379 -3761 1984 1235 -11542 -2876 16788 920 -18630 -30142 -38656 -5330 12422 -10401
24733 -10401 -25943 -6971 -15240 -9096 -11827 22258 65482 77396 49588 35642 19369 -3572
24721 -3572 -30850 -16014 -18613 -19824 -15372 -12900 -39219 -22209 -18415 -39739 -11538 10587 15946
24708 15946 14717 6767 32529 39721 40046 14227 -13242 -22863 -37314 -37340 -20404 -21116 -19545 -9309
24694 -9309 -21575 -25448 -29176 -19102 -22296 -5542 -7525 3919 61 -12584 -7416 16866 44426
24681 44426 18958 1325 3899 -5079 -14166 6958 14072 -8087 -19928 -14892 6620 5852 -18985
24668 -18985 -2056 -6130 -20610 -41736 -63375 -37260 -18602 -9394 6459 -12008 -24054 -3388
24656 -3388 -2094 117 11148 28594 14553 12978 30746 27403 12634 17663 -11107 4039 -2094
24643 -2094 -44549 -34412 3286 -809 -5300 -14775 -21880 -11658 14234 14896 15594 -4751 -36928
24630 -36928 -48879 -48117 -41151 -19199 -51982 -56510 -31610 -20533 -8494 -4081 -10372 -25338 -43410
24617 -43410 -37282 -3072 -3497 -5289 -10849 -28727 -20590 -13240 1124 -6492 -3500 18858 9928 14536
24603 14536 24690 35439 19980 -2867 5718 4235 6308 16665 -11594 -29310 -30971 -28201 6734
24590 6734 -3200 -9080 -18184 -11427 -9689 656 -1393 -14005 -12325 -9065 1948 11688 25838 31716
24576 31716 27365 28471 41688 1260 13669 29993 34459 27125 -5214 -1288 -14441 -17029 -14606
24563 -14606 -14872 -30046 -31910 -34806 -25429 -16142 -8845 -1544 -10038 25418 36380 39208 31510 10246
24549 10246 4543 -14965 -25807 -19950 -4759 -6485 -12645 3252 20261 10551 2786 -13700 -11957
24536 -11957 31433 63644 67892 73507 60846 46300 38856 62061 43617 1866 -2147 -5028 -18127
24523 -18127 -33246 -11038 -4710 -1039 1619 421 8262 -15601 -34282 -29397 860 12335 -4759
24510 -4759 -38690 -68939 -40662 5218 2517 3247 20790 5649 -13993 4013 22560 9397
24498 9397 -12534 -17217 13339 45458 49929 28071 11052 -13327 -38690 -39965 -25653 -25364 -20690
24485 -20690 -38585 -31268 3881 8377 -2181 -10561 -3613 3309 15007 18273 7974 494 10318
24472 10318 7446 28425 20787 -12641 -22022 -30478 -17785 -14913 -13411 2415 -11090 -30233 -44430
24459 -44430 -26933 -22886 -42232 -44691 -4334 -9154 -7782 7433 11470 3279 -11384 -1516 -12510
24446 -12510 3258 45904 21651 7040 48959 89769 63147 34438 30843 34576 21021 20678
24434 20678 11293 20989 16806 -24953 -48180 -63386 -51987 -36919 -22263 -11954 -15422 -6173 -7342
24421 -7342 -14132 -2659 15584 14942 -12141 -33229 -32876 -14495 -15392 6419 1185 -10429 -13239 -26964
24407 -26964 -6738 19106 17754 27191 21510 8774 28 14553 10400 29906 49071 60109 52494
24394 52494 22437 -18457 -37173 -29639 -48931 -58911 -46146 -9813 10303 9808 29380 12483
24382 12483 -2256 14719 10151 4728 -7470 -18582 -41236 -42591 -34701 -10623 -25844 -42076
24370 -42076 -11576 26971 19317 -16461 6696 22291 11861 19724 25616 32621 38464 17857 -21401
24357 -21401 -17464 -22796 -7857 -6095 -32591 -34863 -28233 10050 17211 2334 -23859 -19896 8538
24344 8538 1716 -12153 -19708 -6979 6221 20763 34623 36103 55449 45284 49391 14474 -24837
24331 -24837 -43284 -20808 -3076 5305 24061 24419 17081 -27370 -28987 8709 -4985 -8192 -7581
24318 -7581 -35347 -1315 23068 15131 14824 7606 12548 25720 -7638 -6153 10914 6291 -4229
24305 -4229 -2527 -14196 14638 70 -37154 -31271 -15410 -39758 -62843 -48177 -17780 5083
24293 5083 28949 25592 6527 -7270 -5272 8746 22356 9557 12268 10975 22648 15383 16829
24280 16829 40313 39730 44027 40756 14034 18557 21647 28237 5011 6698 4519 17309 36943
24267 36943 29962 -7624 -26801 -30736 -19962 -12979 -18851 -20073 -2888 28618 9840 7770 31292
24254 31292 30004 -44 -43935 -213 23917 30558 39609 32465 18123 -227 6393 15350 14848
24241 14848 -5692 -16869 -16447 14085 33194 45304 55879 -82 3759 31742 28745 18457
24229 18457 10551 -6087 -10957 -5296 16107 26031 25713 38409 16830 12623 20335 17010 2214
24216 2214 -1250 4208 -14175 10763 18161 1429 -19470 6532 22408 10014 4857 -14526 -17430
24203 -17430 218 958 21742 21965 15714 27864 51902 41647 57958 38458 25077 17454 15479
24190 15479 32195 19157 -1609 -2303 1276 8282 17834 7806 -22264 -36224 -21195 -23322 -19232
24177 -19232 -28691 -32700 -3057 -10660 4131 -12936 -24819 -19526 -25948 -42775 -14761 -3148 7588
24164 7588 41326 72498 88365 67585 7015 8524 10879 8880 6510 -5674 12485 60946 58477
24151 58477 56581 35749 10079 -541 -30852 -46581 -40326 -28568 -14837 21016 16939 -11473
24139 -11473 -9136 1451 -388 5028 -3531 -8991 -14428 -28021 -42733 -24263 15232 20569 13750
24126 13750 -12191 -19138 2375 11421 -579 -14149 10191 23883 10527 4692 2814 -1343 -4625
24113 -4625 13876 36588 43064 46385 28688 4003 -22306 -52749 -48686 -7669 44176 48419 23746
24100 23746 -27263 -19331 -12170 -24344 -27254 -34655 -35925 13530 44456 45213 20538 19392 -15861
24087 -15861 -44296 -34538 -10686 5243 29243 17104 2952 2093 27769 35461 14974 2166
24075 2166 -2839 14140 5954 4181 -6939 -30508 -33320 -16209 -9161 -20900 -62911 -56996 -43318
24062 -43318 -20187 -24373 -51126 -48499 -16078 14157 16716 11045 18293 40917 45905 19190 21096
24049 21096 26581 13292 9708 7585 19876 18005 15912 18240 7952 -4183 -4892 -4722 4160 -957
24035 -957 -14769 -6547 10307 15425 18281 18706 2769 5739 22799 36915 35842 -257 -39966
24022 -39966 -64834 -63323 -26351 18731 13161 -13175 -38337 -47422 -23169 15319 42348 31950
24010 31950 -2349 2041 11768 -4570 -21917 -22970 -11906 6121 38977 35700 -3355 -18069
23998 -18069 -32788 -22235 -9475 -23579 -20840 -1470 -11784 -15370 -22457 -29514 -37126 -26796 -24531
23985 -24531 -21769 -62902 -76122 -45271 -6565 4624 17148 32071 12218 5683 3304 10746
23973 10746 43891 63733 59791 51058 34768 -4753 -14049 -1665 -8236 -24588 -4934 20520
23961 20520 2579 -42496 -53210 -41571 -25230 -3493 -11946 -41359 -66725 -53848 -32925 -39267
23949 -39267 -41218 -47033 -38008 -31038 -22375 -7953 29337 37138 45903 35911 28429 45203 36407 34829
23935 34829 41435 9821 -5166 -22742 -28758 4363 18250 13613 -3718 -6059 5999 -7765
23923 -7765 -21035 -13370 -1277 28476 11432 -22283 -28781 -24857 -6532 -5005 -1544 -8874 -27357
23910 -27357 -40384 -21343 -7999 -3191 -3374 19219 31992 28542 62592 47665 15253 3752
23898 3752 5678 24145 1093 -38506 -49164 -6982 -5860 -18866 -20653 -9999 -27427 -47434
23886 -47434 -38680 -27554 -16570 -5227 4009 -12214 -3896 -252 -10250 13157 16515 43303 48958
23873 48958 39004 17536 16941 4448 -25912 -32823 -16673 16097 28539 18440 -1451 -29853
23861 -29853 -12610 -10302 -23908 -20395 -23679 -8718 25546 27082 7476 -10321 -18596 -3418 14343
23848 14343 51191 41268 41649 17127 -4462 -7241 4572 27352 15538 1036 7190 -11919 -7351
23835 -7351 -13327 -47329 -41948 -11278 20188 15341 1190 16514 14224 -2851 -19039 -41002 -42135
23822 -42135 -51137 -58887 -22598 9794 4365 -11943 -9655 -6085 2771 -1213 1990 -8562 -30740
23809 -30740 -34166 -13496 -36653 -37061 -31159 -16477 -12899 -6402 11971 2951 -15726 -8209 14603
23796 14603 3898 2822 11410 -12976 -8276 11080 18530 18852 14910 1567 -3937 11965 3087
23783 3087 -9338 -43790 -59522 7149 41867 31322 18585 18227 7951 5010 -26992 -48043
23771 -48043 -13512 16155 -9819 2042 11957 9799 7708 17931 -6210 -7606 19743 9512
23759 9512 -14692 -18821 -22685 -18659 -7465 -5699 7867 22853 1377 -13828 -7811 -15439 -8088
23746 -8088 176 11296 24730 27870 42965 25308 16571 36991 34495 16952 2943 21172 20238
23733 20238 -22249 -61809 -84772 -78579 -49403 -20442 -16942 4322 22636 45901 33559 4481
23721 4481 -21526 -16381 4164 12911 13631 24418 12413 1069 -4945 -16952 3345 -10352 -18794
23708 -18794 -9041 -2055 15363 39334 34914 41733 33597 34659 7777 -8570 3755 -8720 -6332
23695 -6332 -6040 296 183 -12481 -9136 -29062 -13607 5423 -14071 -15559 -13459 -12135 -1723 15542
23681 15542 3766 389 20032 26867 24595 6190 1674 -4388 2615 4663 -3229 -33881 -40604
23668 -40604 -14938 10672 38396 56995 25710 29465 42526 36856 27349 11641 -945 -5300
23656 -5300 14052 27655 22352 -15732 18335 3232 -2496 9749 21740 35114 22024 25032
23644 25032 33798 38566 28004 25533 19451 8843 -2984 36646 66861 60598 38398 28144 18060
23631 18060 152 277 -4634 -5779 -3083 13597 3635 -15922 11980 17402 6762 -11435 -15408
23618 -15408 -523 20087 15166 5112 10930 22504 -3552 6831 12213 -6387 -21171 -32738
23606 -32738 -51300 -41143 -2881 2866 -18416 1407 28913 21242 -1774 -309 9247 -10284
23594 -10284 -30884 -36566 -27954 -11609 -6514 2000 34030 39968 18432 8868 13412 34047 22189
23581 22189 -10015 -23835 4246 -1232 570 11429 -13365 -6056 25579 20225 21600 6502 1905
23568 1905 5516 -13439 -17080 3292 20058 6934 -8374 18295 32394 43887 34188 6047
23556 6047 16634 16004 14061 -10071 -12188 604 -991 -8125 -3371 -28644 -29846 -3313 4623 3730
23542 3730 18340 36900 47233 29837 19643 420 -2470 -4097 -17219 -18137 3310 -30939 -36004
23529 -36004 -26838 -32111 -22665 -12452 -6122 -1134 8042 6038 2568 -1563 -1394 6340 29190 57771
23515 57771 35631 -21524 -57850 -45999 -54716 -39604 4072 15054 20626 25925 12779 11462
23503 11462 13901 2782 1282 1362 -23243 -27043 -588 -1018 -2696 3129 26423 30780 25511 -4877
23489 -4877 -7284 -13617 -39690 -29126 -19139 -33418 -8361 21081 15738 9742 4505 -3112 16865
23476 16865 24649 -7210 -30842 -28529 -3530 12030 39425 24516 14001 -17154 -16927 -39145
23464 -39145 -47853 -4805 3197 17580 37053 41732 52820 48860 31718 13902 -19823 -36724
23452 -36724 -39946 -51509 -51312 -42108 -32437 -12158 878 21118 15789 11608 30663 32299 23672
23439 23672 34624 9570 -14680 7725 40661 53350 46527 30749 32832 30129 38918 38279 20281
23426 20281 613 -3245 9025 1005 -143 12500 16593 -1563 -26019 -34130 -36742 -40635 -18513
23413 -18513 1245 -2366 -25606 -13696 -6174 -4110 -9818 -17703 15692 10935 -8033 1870 1509
23400 1509 -1879 444 13517 -2494 -26407 -58549 -45758 -26702 -13412 -24950 -48240 -52027
23388 -52027 -45629 -26424 -14960 5630 12090 17250 4737 6046 -2734 15340 25636 -6247 4122
23375 4122 8719 28627 25373 27867 17435 457 -531 17515 -3143 -12018 -16556 -33466 -23200
23362 -23200 -2105 12188 14708 10830 7712 35415 42193 64787 79309 31253 553 -137 23667
23349 23667 11528 -10461 13413 22960 5944 -2317 2900 557 -23834 -5549 15581 29928
23337 29928 5628 7742 24047 18299 11873 20167 8944 22566 42452 14998 12081 37775 21985
23324 21985 6877 22796 -8963 -32844 -25489 -23950 -15290 -2882 -3812 5626 -8186 -29041 -19342
23311 -19342 -21356 -3794 8117 -14626 -11840 -15436 -5296 -27907 -10400 6997 32674 19254
23299 19254 -6151 -11152 5817 19615 15603 18389 6515 -5289 -24849 -29801 -40422 -29195
23287 -29195 -16144 7123 -8157 -25048 -42220 -24557 -24304 -36166 -11676 21196 22969 21471
23275 21471 2511 -23007 2591 17897 48072 52830 35691 39556 18118 1906 7503 20277
23263 20277 31913 54655 36972 27761 45415 27047 17474 17214 -10807 -41871 -50136 -13922 4375
23250 4375 -7489 -3977 -3848 11187 3551 -15025 -10954 6963 -6302 -27850 -3154 -4045 -5475
23237 -5475 -5707 14156 13465 -7984 -8164 3308 15495 33120 43883 52952 32403 -6583 -25724
23224 -25724 -16489 -3900 7105 -9183 -15365 -6016 7657 -12746 -29119 -20185 -6619 -156 -6092
23211 -6092 -12494 -3565 -20023 -19119 11269 17662 -1505 -14448 -3082 -16994 -10604 -5365 -8519
23198 -8519 -3382 11915 29808 7462 7472 16777 42332 20390 -27457 -34215 7090 27804 37498
23185 37498 20878 15150 39882 31873 42285 28675 8878 -18837 -27501 -41150 -615 10331
23173 10331 -4275 -16304 -31974 -12419 15506 -5173 -28873 -15673 15145 13374 -9965 -23015
23161 -23015 -34485 -50037 -37785 -12971 -617 -27671 -32250 -37458 -42009 -16483 -18459 -14374 -11948
23148 -11948 -33210 -45944 -26727 15244 22060 44472 35791 4145 -14241 -26883 -24446 -17661
23136 -17661 -7894 8231 20018 18953 -19755 -55467 -43663 -35767 -32863 -44079 -38537 -10309 987
23123 987 5531 22652 20796 -9551 -7442 -6274 -6871 -17781 -47093 -61523 -67653 -54736 -37911
23110 -37911 -36942 -44910 -50667 -24690 -7111 -9124 -19997 -11998 9488 10202 12493 8065 1052 -5302
23096 -5302 4826 24035 49301 34221 15656 10372 12061 13206 2559 -13521 -23928 -39861
23084 -39861 -32431 -49789 -66961 -52705 -54605 -80885 -63761 -35792 -12889 413 -6887 -3425
23072 -3425 -23972 -34230 -28253 -7279 -5581 17959 16584 5036 -14392 -20083 -20243 -28940 -26448
23059 -26448 -6736 -867 4016 -6030 -16915 -15547 14544 37929 45830 17613 8279 38357 41939
23046 41939 50658 55100 28420 1516 27803 6445 4484 -3082 -43378 -65925 -32925 -18057
23034 -18057 -10040 -37500 -37724 -49879 -28026 4301 -546 -1095 6805 9524 17519 2019 -11737
23021 -11737 -16792 -14738 9283 18159 2402 -21544 -45061 -65144 -34780 -2051 -4883 -33779
23009 -33779 -12796 8288 -9667 -30680 -28417 -7747 -9325 -5161 26214 23148 -1625 -20938
22997 -20938 -53939 -57066 -34446 -27681 -17878 -34303 -38185 -13842 347 18540 12989 2829 3956
22984 3956 8369 13161 17784 13347 -10306 -11822 21507 26323 8400 -25254 -38702 -13940 -2513
22971 -2513 -7234 -11429 -7844 18054 29616 -4445 -25751 -13090 -8824 -3393 -5787 -33854 -30265
22958 -30265 -25651 -6701 -15192 -34290 -42199 -47729 -38668 -15077 -32676 -49077 -43894 -47828 -36519
22945 -36519 -43064 -35003 -12480 -8872 -4739 -392 6717 12102 2356 11947 -10783 -59168 -64336 -37828
22931 -37828 -20899 -16880 11915 14475 -24305 -37645 -57698 -49218 -49872 -42517 -25096 -6667 9738
22918 9738 -9744 3961 21111 5040 725 -620 -39766 -59131 -42638 -26616 -23240 -8734
22906 -8734 -1538 -25392 -31331 -25184 -28492 -11926 4557 17805 22986 14168 1320 12806 4559
22893 4559 -1656 -821 -6748 -12781 -9403 -11688 -15968 -9454 9685 10114 -10 317 4210 7605 11688
22878 11688 -12113 -16263 -18439 -43404 -69804 -65339 -31185 -19781 1097 -7357 -19336 -25519 -16767
22865 -16767 -27331 -31049 -38652 -29794 9486 21416 14806 2079 -683 -5568 25379 34624 29409
22852 29409 20711 21557 24144 8017 18284 -1653 -15880 -23213 4624 22272 18246 17401 11580
22839 11580 24243 21160 3142 -24164 -31465 -14200 -8258 17137 40871 -6716 -39887 -56889
22827 -56889 -52626 -4075 4268 -39382 -43784 -48625 -51573 -43498 -24821 -5171 -11289 -5944 -11116
22814 -11116 7782 -2150 -19591 -29773 -26871 -20166 -37729 -51052 -15198 23652 30847 15281
22802 15281 -7590 2386 -13789 -38373 -1778 25974 24886 18110 32253 23549 31688 26886 1741
22789 1741 12705 5866 -8613 -5687 18579 18009 -8878 -23986 -20233 611 28416 25306 1722
22776 1722 -10282 722 14945 10840 -12688 428 13195 1513 -13659 -13565 -3555 -3928 6303
22763 6303 10250 11260 -11927 -22720 -14189 17237 43688 49402 39208 29819 19314 -2498 -24215
22750 -24215 -13431 12013 3260 -19951 -41057 -17519 -3674 -25783 -49989 -42106 -19792 -14257
22738 -14257 -12971 -1907 12765 31581 28376 27036 -11979 -13726 -15427 548 17938 -4084 -6767
22725 -6767 17635 30705 15454 -21429 -19668 919 1416 -8552 -27954 -15395 -17557 -34071 -61387
22712 -61387 -75466 -63625 -11961 20206 24264 38754 1240 -7170 6219 -22466 -41187 -67149
22700 -67149 -69887 -64578 -28842 -4642 -17901 -6536 -396 16412 14368 10792 -32037 -63872 -52581
22687 -52581 -55196 -77306 -76001 -76577 -57255 -12438 11239 -1488 6090 3868 -7746 -15065 -49949
22674 -49949 -55293 -56887 -61134 -63823 -63095 -69020 -54039 -61124 -40992 -27618 -17532 -2669 19658
22661 19658 25407 39855 69584 43807 17499 36967 12478 -10823 -44021 -64000 -55482 -66783
22649 -66783 -60497 -23669 -6416 -23043 -11146 -6295 6314 3804 800 -5751 2717 19104 23310
22636 23310 4197 7495 -2978 -10721 -17449 -18207 -32399 -26794 4063 -495 -4890 40497 38094
22623 38094 1273 -7509 -29953 -42962 -14042 15092 19292 29278 17681 -529 -16750 -7777
22611 -7777 -10344 -11803 -3785 31094 38115 40602 47292 40637 -2039 -26550 -18536 -2404 3248 17040
22597 17040 19905 -8879 -27173 -11760 -3133 17702 18338 8127 32076 17430 -15307 -17189 -29419
22584 -29419 -14264 13135 14252 -23730 -31405 -58350 -32348 5902 4399 -14181 -28113 -39905
22572 -39905 -32250 4293 13193 -7606 -20787 9465 18541 11368 1901 -8651 -5287 -3988 -19243
22559 -19243 -6549 445 21122 12769 -16391 -18784 -21973 -16360 -8793 14094 10582 -18370 -5687
22546 -5687 -13337 -35884 -33042 -26585 -39011 -28838 -10611 25274 8957 -11969 -7091 -27882 -43633
22533 -43633 -45279 -30691 -14777 -2325 594 -17559 -15929 -1443 14780 13859 3851 -3174 2285
22520 2285 12047 13563 -20070 -40439 -24880 -5620 -6026 -28787 4033 24890 11020 -12127 -55854
22507 -55854 -76331 -64296 -31482 -21040 -1200 1361 -17737 -16719 -22344 -6177 -15699 -16565 -29044
22494 -29044 -30357 -18847 -2797 3906 3434 -6838 11085 5302 21132 17932 34100 40242 46518
22481 46518 37344 30524 3010 -15816 20227 31083 30402 29353 16398 -8552 -50546 -56302 -23631
22468 -23631 -19175 -4361 -19790 -16600 31404 64523 43839 9975 -21142 -33279 -21404 -476
22456 -476 16992 6016 -13494 -34100 -23033 -21261 -8818 302 -7827 2719 34792 51097 38469
22443 38469 13299 -1536 -25976 -84818 -88442 -50800 -39246 -4399 -2589 -17051 -22855 -24898
22431 -24898 -36352 -17380 11976 17053 -3966 -36326 -21358 -22437 1509 12290 -6222 -12674
22419 -12674 -15511 -22083 -27137 -41677 -43755 -24871 -43803 -27385 -41080 -73484 -74122 -35605 -23082
22406 -23082 -34095 -24201 -14222 -27411 -36089 -40354 -41235 -26262 -47883 -69397 -50346 -21249 -28362
22393 -28362 -14830 -14971 -11019 -6959 -15562 -28308 -50459 -38354 -3381 -14379 -7720 2276 -708
22380 -708 22459 39800 7723 -12545 -12201 -742 -10641 -2868 24004 19060 -9279 -32263 -29181
22367 -29181 -15024 -17604 -23548 -37578 -64150 -53224 -20959 -3441 1810 -16363 6580 38432
22355 38432 41622 27511 50903 56983 49571 55031 42323 21303 -11349 -29612 -293 10533
22343 10533 -9674 -11091 -12633 -22787 -27078 -35043 -14323 28805 45485 48154 35720 26500 -82
22330 -82 -10779 -38719 -40320 -21417 -15958 -34544 -33397 -30832 -23624 -36076 -35271 -6641 911 15053
22316 15053 37832 59362 39261 -2811 6440 498 -14987 -12377 9490 17098 9959 15148 -6927
22303 -6927 -31977 1127 25744 28221 33870 -3911 -35894 -47552 -31689 -16793 -2229 20344
22291 20344 16561 22562 31172 13535 4370 -15849 -43015 -47978 -23495 -6161 -471 802 -8720
22278 -8720 -2828 712 -8519 -2202 -248 1836 -17428 8829 42381 20034 17639 47711 51020
22265 51020 25806 16006 -10109 -25884 -2013 3854 -2786 -14834 -1043 34444 23910 13426
22253 13426 1846 -11066 -11671 -18734 -14898 -8900 -7566 -41392 -26389 4731 -11224 -10283 2301
22240 2301 -2394 -12387 -25529 -21200 -32743 -35038 -21974 -12877 -8825 -6883 20374 27054 24915 17554
22226 17554 6670 -6941 -7376 -142 105 24196 27905 39678 22182 1089 11138 -3081 -11207
22213 -11207 -21162 -39879 -38259 -20409 -20488 -31966 -45324 -28627 -15475 -21821 -12050 1822 6920
22200 6920 7851 -23130 -36541 -24139 -1889 -3551 2634 11763 -15775 -34232 1527 -1848 -368
22187 -368 8076 5358 15063 55 -30143 -24938 -21487 -47032 -31023 -8624 -28656 -22565 -31434
22174 -31434 -2936 26923 1677 -11541 -15485 -19046 -23767 11928 45565 37295 31376 12385 -2407
22161 -2407 4756 -9869 -18391 -19153 -26976 -29459 -9356 -26328 -27006 -19909 -39601 -42805 -12197 10650
22147 10650 -5631 4933 24833 10138 -7674 -14357 -8085 11422 5203 -6801 -1080 -3423 -1832
22134 -1832 -4654 -14232 5580 25355 -584 -2033 -4091 -5392 -2042 -15348 -27433 -18985 -7770
22121 -7770 -7726 -3122 17462 28187 13477 8484 -11658 -8900 -13015 -20016 -8229 22572 39793
22108 39793 23194 8648 -20871 -27721 -5216 8929 43513 20855 -25244 -34491 -42320 -24099
22096 -24099 -27933 -42325 -39717 -50558 -27005 -23681 -26834 -29077 -48786 -26377 -30622 -50209 -63850
22083 -63850 -31951 -14492 -5131 13080 17016 16852 11659 -16310 -44436 -45682 -50545 -52639 -29270
22070 -29270 -28236 -4798 -5009 13438 24315 12096 2809 13412 16813 18120 16880 5627 4716
22057 4716 2242 28717 45555 35405 5367 4322 19364 28462 32041 33713 23001 -6291 12685
22044 12685 37073 57162 11957 -33794 -22488 1051 -17387 -32310 -20121 -2377 -9284 -8860
22032 -8860 -27497 -52265 -45484 -33570 -15264 6911 13911 20152 145 -24991 -34288 -42530 -53093
22019 -53093 -48372 -14451 -20395 -8225 -21802 -16183 -32235 -38273 -36028 -39617 -31079 -18178 -11113
22006 -11113 -34486 -48557 -47053 -45882 -38340 -38205 -41874 -31158 -50008 -70491 -57508 -24293 -26729
21993 -26729 -29809 -30004 -25978 -23946 -23015 -15911 3047 15196 19171 11952 14773 -19821 -39432 -78314
21979 -78314 -87231 -69444 -65863 -52744 -35873 -47505 -53926 -48982 -30564 -32993 -46720 -41423 -32012
21966 -32012 -51685 -61854 -72439 -40623 -27728 -38974 -20302 9357 8991 -17893 -28922 -10641
21954 -10641 2496 18213 20025 12857 -1000 5043 947 25476 32794 11918 20507 44024 51241
21941 51241 22671 -15466 -29271 -9161 -26895 -38568 -28023 -47273 -43834 -29576 7441 20538
21929 20538 14322 22724 40206 38399 25280 -6011 2597 21654 13804 29015 26978 7657 -14880
21916 -14880 12775 6272 1912 10367 -46036 -59419 -29187 3622 -15910 -18588 3818 28823
21904 28823 24467 -3233 -22723 -39387 -59030 -58511 -31409 -7865 -8973 -17271 -3739 -2618 -5327
21891 -5327 -416 -7629 -1394 7707 2804 11135 1860 -5336 -16931 -22003 -28784 2516 22192 33981
21877 33981 17125 -4161 20194 27741 -8874 -31667 -7322 -16351 -47631 -17546 10677 34199
21865 34199 1344 -18181 -12196 -12904 -6533 -3595 -4074 -56 5546 -2498 -7838 -8623 -12645 -14950 -10895
21850 -10895 -14750 -11063 -15037 -32181 -8577 18762 41185 51566 49262 12065 -2813 -29969
21838 -29969 -51624 -56310 -55319 -47350 -50341 -42364 -58210 -30682 -12337 -61173 -59155 -48064 -31524
21825 -31524 -14007 20729 -10915 -28799 -37923 -38015 -23095 -4016 13094 8985 -34436 -41392 -27897
21812 -27897 -24228 -24626 -28349 -37510 -31981 -17403 -47692 -46908 -18345 -7396 -6893 13499 19439 9762
21798 9762 13131 31289 12067 -13036 -12078 12782 11268 -11150 -9026 371 -406 8214 -18371 -29324
21784 -29324 -12960 -13545 8773 2704 -26437 -48522 -24184 -21300 -35152 -18626 -20980 -35975 -37378
21771 -37378 -23857 -2426 -14207 -69825 -51243 -42209 -74339 -59337 -44647 -42537 -64455 -60032
21759 -60032 -55825 -36955 -20413 -4329 -18096 -51543 -69023 -81046 -57975 -45049 -54654 -82677
21747 -82677 -62477 -34426 -9129 -30872 -65506 -64234 -25374 12993 16837 292 5215 18416
21735 18416 11689 -13846 -28443 -4480 12055 13041 -416 -2201 -10790 18474 11990 820 -14884
21722 -14884 -36484 -56920 -41137 -6742 -2766 20811 14273 -4862 -17357 10702 24444 31417
21710 31417 31391 7625 11308 14475 -6919 -34773 -51025 -61928 -48112 -12740 14982 12477 -1208
21697 -1208 -17277 -14604 -21154 -10160 7561 18552 7902 -350 -10911 17179 3004 -10162
21685 -10162 -6985 -34977 -50215 -56415 -17962 2261 2442 -11465 -52666 -81157 -96522 -72255
21673 -72255 -43651 -32288 -27056 -38455 -37639 -25192 -15203 6807 21301 -2903 -7984 -11098 -4284
21660 -4284 -4758 6169 1981 2661 4374 -8535 -9051 -1136 911 -14213 -13795 -2405 -22025 -32795
21646 -32795 -14983 -21995 -29674 -30314 -8738 1766 19046 46365 43139 23258 -6908 -37623 -32346
21633 -32346 -46978 -43908 -12045 -11837 -15751 -28292 -17888 -38973 -69743 -69517 -38714 -6820 3967
21620 3967 -3346 -48657 -42137 -57590 -57743 -63396 -64472 -31710 -58 -20912 -19821 -24849 2722
21607 2722 -4280 -13163 -16685 -25795 -26363 -53406 -46458 -27141 -12518 -23342 -46875 -51360 -24021
21594 -24021 -14628 -30075 -24704 6010 4442 -28754 -38652 2961 2944 -29325 -52031 -26447 -5059
21581 -5059 19410 19458 18795 1693 9465 17047 30330 -18813 -42953 -25701 493 27482 17805
21568 17805 -6698 -1582 21298 12262 -12126 -5903 48239 47689 41726 45310 28642 2435 -11936
21555 -11936 -47813 -31441 -24147 -29468 -187 -20486 -28722 1053 9126 10701 3614 -15239 -21101
21542 -21101 -35757 -14473 -10548 -15103 346 8233 4451 -14426 -22599 -9746 19718 -3368 -22242
21529 -22242 6201 -16587 -43478 -46738 -43861 -31206 -40896 -27035 -2020 467 -20821 -13358 -22410
21516 -22410 -40985 -38287 -53557 -50588 -31975 -17059 -21512 -19948 -8286 -5075 -8729 -7129 2752
21503 2752 2973 10676 2919 -24673 -20117 -8251 -15687 -14314 -20559 -41359 -58733 -61150 -20947 -11545
21489 -11545 -6161 -8981 -31790 -44013 -32582 -32337 -40597 -38787 -61075 -42102 -25261 -16913 -11798
21476 -11798 -27536 -33240 -17950 -12054 -7121 -22923 -24512 -20847 -16478 -12930 2284 37823 54311
21463 54311 42226 53593 34492 23985 27947 5188 6483 -8864 -15288 15958 35397 36931
21451 36931 19799 -8169 -22304 -15750 -4784 13129 41555 -10089 -44499 -14240 6499 18895
21439 18895 10102 -11219 1120 10121 59 -4000 12920 36192 9092 -19383 -16159 -57
21427 -57 3884 -4079 -20349 -24245 -34924 -50624 -66768 -75936 -28607 -17345 4565 16419 2713
21414 2713 12315 9720 -657 12401 13089 19265 24611 37401 18619 979 -5056 -27999 -41541
21401 -41541 -56995 -48363 -22869 -24407 -29537 -25031 30210 18057 -13785 -12181 1950 17740 -1833
21388 -1833 -2777 16784 26746 26979 15711 7749 -8089 -40539 -11827 1224 12350 28931 17166
21375 17166 -24489 -15047 -4048 -1707 -24470 -38535 -19207 -10568 -15676 -30155 -30375 -28656 -32272
21362 -32272 -40545 -16966 3277 3576 -9932 -17532 -13882 8243 28084 26014 2347 -30703 -25235
21349 -25235 -31527 -30176 -21212 6878 13397 8670 15547 18449 5117 -24307 -43640 -23283 -19246
21336 -19246 -8248 -1068 -23277 -35552 -8286 3359 17751 6354 -1392 -16296 -26343 -39174
21324 -39174 -23703 -26514 -38660 -25545 -21298 -7962 6391 24522 37708 36181 23102 24629
21312 24629 21739 -15100 -42889 -28602 -21481 10123 13282 -19568 1962 10890 10211 3302 1196
21299 1196 -4411 4589 21934 17307 17489 34919 33849 16222 -11357 -19356 -8737 -13757 -21955 -34259
21285 -34259 -34987 -29914 -18210 -42157 -50913 -61917 -57438 -48820 -52384 -41989 -38302 -35258 -28040 -36190
21271 -36190 -45803 -29461 -34777 -35735 -25781 -20683 -40879 -12011 1408 6839 13584 15450 14874 -12481
21257 -12481 -14638 -19808 -15996 -15303 -9114 9683 -6768 -6186 -18200 -26160 -44099 -42758 -33041 -18313
21243 -18313 4593 -8453 -10484 -1738 -9509 -1711 680 1125 4472 3752 -6049 -14463 -42624 -44277
21229 -44277 -20839 -31525 -24924 -28957 -39007 -43170 -52120 -60559 -46931 -48355 -34041 -16794 -4554
21216 -4554 10220 -2180 -28371 -28716 -36084 -29134 -36164 -23523 -25162 -28332 -11912 -26357 -49052
21203 -49052 -57298 -23631 7520 12518 -9957 -18055 -17507 -30000 -15200 -35075 -32198 -11915 -4195
21190 -4195 -4158 -1291 -6553 -28846 -14703 9455 38406 40188 41029 35472 10156 6420 3876 -14663
21176 -14663 -9690 10124 -18556 -47598 -43947 -28542 -37356 -45565 -60564 -46031 -27157 -30819 -23820
21163 -23820 -25121 -32262 -38765 -27217 -3717 -8058 -29508 -16591 -14522 -29552 -24975 -30380 -21737
21150 -21737 -20603 -27897 -45899 -45127 -58006 -50770 -35522 -36984 -53973 -37977 -4409 -4922 -6732
21137 -6732 -39412 -62556 -47444 -28420 -26679 -29344 8765 41521 16045 3838 16559 -8150
21125 -8150 -28961 -26830 -43906 -56141 -47885 -25135 -30771 -16078 -30313 -30085 -18782 -34570 -38370
21112 -38370 -31423 -14691 -16219 -16292 -15238 -16476 5347 17754 4692 -24729 -46898 -52087 -28374
21099 -28374 -16422 -17185 -20831 -25471 -16069 8180 37131 36003 11004 8299 1549 4334 22252
21086 22252 3139 -6244 2938 -6776 -21544 -9340 -27234 -18201 -13345 -7428 7518 9626 -26121
21073 -26121 -47148 -38046 -34501 -35546 -34474 -44448 -35076 -23173 -36987 -18989 -30135 -36166 -24255
21060 -24255 -6865 -4577 -27041 -35076 -53185 -26027 -14528 -32565 -36085 -49493 -61183 -55692
21048 -55692 -50607 -51208 -37046 -11036 25226 38734 30341 -6814 -37279 5708 11570 -16111 -28366
21035 -28366 -23518 -17322 -27297 -39453 -14820 -638 11782 -18286 -43246 -46731 -29796 -18008
21023 -18008 3194 -710 25729 17604 -6837 -17278 -14841 -12904 -1519 1301 -3636 -244 14715
21010 14715 -2111 -21488 -13458 -20838 -40093 -53740 -54428 -64933 -61921 -58410 -38040 -6376 -8861
20997 -8861 4299 16617 5113 7835 26902 28653 35414 27706 5253 3801 13939 -5548 -9292
20984 -9292 -19494 -23863 -9054 -7774 12088 17482 39960 42176 35011 21497 -7510 -6677 -4973
20971 -4973 -6005 -7152 22990 33275 33949 25080 17818 -1287 -7507 12337 6698 -2022 -5182 -24961
20957 -24961 -33300 -48165 -27771 2418 32169 31053 -1305 -9092 -16908 -26907 -11634 -2520 21365
20944 21365 33404 17060 8830 -26627 -40656 -42038 -15875 -13583 -5279 14668 3736 10091 6150
20931 6150 -12882 -30532 -23764 -47754 -43726 -18744 -5309 9884 -10498 -16327 -3798 -1150 5318
20918 5318 1417 -11984 -41047 -39207 -61560 -64255 -73702 -43730 -30577 -28094 -25818 2962 25489
20905 25489 21215 -5490 -16064 -4373 18586 46657 54694 28229 -2748 -17585 -22332 -41599
20893 -41599 -61941 -54878 -48885 -26238 -19655 -10321 10746 -4759 -1383 -12242 742 23349 -8944
20880 -8944 -62022 -60678 -42138 -22997 12012 10934 25378 9348 -10501 -11341 -21903 -47277 -48829
20867 -48829 -8568 1192 24972 2955 -3951 23795 38145 19493 4305 7731 8630 -16095 -15667
20854 -15667 -4148 -7263 9275 -1720 -19620 -28339 -58089 -49219 -39503 -19783 -6019 -6618 -7629
20841 -7629 -1934 -29165 -39342 -7526 -10265 -21966 -27642 -41640 -36773 -45943 -31225 -17820 -16772
20828 -16772 -24167 -36959 -20093 -17888 -40760 -25993 -8169 -9574 -11084 -14419 -12801 -11276 -22580
20815 -22580 -28804 -27376 -41222 -15781 5737 -8656 -34983 -19801 -8951 -7233 -21203 -11311
20803 -11311 -17196 -11734 -8700 -6912 -8364 -5418 593 13388 22247 -755 11469 17127 28138
20790 28138 10688 -31296 -13915 20866 31055 13684 914 18757 32425 13740 8687 -8806
20778 -8806 -16947 -32131 -24147 24287 25104 6763 -23960 -20418 -4598 9455 17007 15194 12995
20765 12995 5880 -1414 -33926 -39469 -18282 161 -7028 -10284 -23023 -23259 -42685 -49582 -4855
20752 -4855 -1124 3587 -12985 -33097 -22653 16572 14053 2232 23239 24440 11781 7849 17503
20739 17503 15595 31868 30655 13472 11205 -467 -7829 -38975 -50985 -51575 -48559 -30854 -8356
20726 -8356 15097 45436 47210 24656 31431 8608 -18644 -13122 -44562 -58538 -65597 -48725 -27420
20713 -27420 -19437 6254 -5610 -34131 -35717 -47066 -13848 -8022 -39807 -43491 -42282 -43121 -22483
20700 -22483 -2463 -15011 -16867 -13434 -13484 2424 17371 -3013 -15860 -28670 -11957 4928 7232
20687 7232 -3391 23732 44154 52571 26826 8771 7067 17403 9101 -4246 -34700 -35188 -51566
20674 -51566 -30826 -9232 -896 -9983 -21109 -26804 -34517 -40891 -40028 -2471 25551 37888 47226
20661 47226 45149 45448 41110 -4267 -27499 -4100 -6754 -23224 -28764 -14898 -15190 7746 -2076
20648 -2076 -9590 -29348 -45683 -43490 -19969 -12753 -56124 -57851 -66789 -68734 -25599 -601 -5158
20635 -5158 -16818 -26923 -20762 -21585 -8320 -22373 -26968 -13098 -21088 -49155 -25432 4789 15922
20622 15922 5198 27871 23020 -2771 -1758 -8087 20357 23851 16189 19572 3208 -8750 -32619
20609 -32619 -15406 -16442 -21343 -11445 -22912 -25251 5091 29203 14757 -10549 -23748 -36076
20597 -36076 -4746 -12630 -18543 -23189 -25611 -27801 -3529 -16288 -32045 -43168 -25927 -6585 -1561
20584 -1561 -25042 -26687 -48038 -40011 -52900 -44006 -33271 2114 4160 27414 3894 -1021 2056
20571 2056 12341 10330 8028 31333 31742 16849 -8846 -4289 4780 9860 -2851 2699 -13508
20558 -13508 -28233 -54828 -44481 -36535 -36531 -11722 2153 3040 -10650 -25276 -17968 2846 2350 -13900
20544 -13900 7903 23920 31963 13558 18673 19523 8114 3441 25064 32814 38268 12209 13749
20531 13749 1627 -19809 -25828 -28457 -13778 -17148 -52480 -58679 -46746 4730 33492 24923 -4849
20518 -4849 -24716 -42143 -22653 -41 13988 21679 -2929 -9215 4132 7339 5120 -5358 -3900
20505 -3900 -8696 -23823 -22395 -48842 -44684 -21659 7096 28030 46405 45121 47022 56205 41174
20492 41174 34052 30146 34887 19889 7223 -8708 -18411 -4078 30267 30141 7169 -16028 -3666
20479 -3666 -30118 -21784 -14189 -1733 -18786 -29316 -1161 -9047 -14751 11858 24424 2246 7439
20466 7439 -12697 -9448 -23818 -46776 -56064 -49021 -24974 2862 15720 10690 -24661 -22837 12102
20453 12102 55099 29857 9727 29436 61967 44837 24558 20478 9953 -20537 -2494 41944
20441 41944 45687 47457 57475 55579 41171 31696 48391 65647 33917 12884 22072 9558 -12183
20428 -12183 9482 36467 40800 39826 27578 35798 51567 52040 48905 31840 21763 27974 26921
20415 26921 -9285 -23393 -20893 4299 -2080 -3359 -6422 18449 17535 3273 -11767 -16790 -43742
20402 -43742 -52430 -43912 -22345 -25489 -31748 -27205 -33226 -7113 9431 29798 16525 -6087 -21272
20389 -21272 -29039 -27057 -7619 -12687 6909 28214 692 -18637 -29609 -30123 -11470 10982 26803
20376 26803 25378 5869 -36845 -41503 -35318 -23544 -21153 4572 31197 25197 774 -61318 -85087
20363 -85087 -57924 -34415 -24649 -12658 -9028 -9072 -9755 31070 48571 21155 4535 -12770 -3046
20350 -3046 -4255 7663 29393 39284 39594 42267 50937 26478 7077 35322 39350 7703 16781
20337 16781 42082 30292 34347 33806 38901 59229 57092 48443 20802 5743 13193 2853 -12666
20324 -12666 23069 15865 5340 28037 21041 -2903 -19099 -11307 2483 227 -13023 -3746 -6616
20311 -6616 -24574 -18577 9552 15817 -3742 -14852 -14243 -19530 -9259 73 -12757 -3312 -9422
20298 -9422 -12574 -13811 1919 25165 26992 23837 13037 -21304 -30201 -17584 -2574 -38949 -21490
20285 -21490 -21780 -36936 -23486 -22770 -18367 -21031 -38158 -40242 -36837 1252 -877 -1971 18752 -4895
20271 -4895 -30111 -20092 -16736 -32434 -1623 25157 25095 -11307 -31323 -40346 -64871 -68759 -37373
20258 -37373 -5115 -10914 -36881 -46645 -39489 -27063 -10905 14299 9425 10804 40455 33987 25170
20245 25170 26295 5625 -15722 -31463 -25067 -20129 -6616 -11827 3741 -15499 -26770 -40388
20233 -40388 -31792 -10486 -25598 -46828 -34844 -10385 -217 10532 -8076 -31274 -52512 -39290
20221 -39290 -17747 -4561 7 -13462 -43464 -28170 -29339 -18480 2578 26751 41661 30399
20209 30399 21046 18350 7720 7949 -7573 1356 28284 38192 30548 49650 57038 22639 -638
20196 -638 21144 38109 19399 6774 4183 10356 -3985 -31104 -41405 16384 37908 500
20184 500 -4994 4334 -11334 719 17157 -1322 15016 24700 6669 -10299 -6083 -7939 -8390
20171 -8390 5513 24428 34178 28589 24186 -4772 -5065 9945 33109 31402 34020 34152 15382 2855
20157 2855 -1514 2780 7200 -17932 -12691 -13959 -22974 -4441 35522 43450 35163 8633 -13589
20144 -13589 -1278 12381 20562 29958 35077 40037 14881 12983 -2941 9977 7230 2484 33546
20131 33546 6810 -2842 -6519 -21294 -16035 -16881 -221 -2230 9177 5509 -4303 -2574 7467
20118 7467 14546 14446 -7715 1345 -8210 4339 20848 -2680 -9319 -7758 -29600 -25723 -12765
20105 -12765 6169 27036 24119 15871 16932 -167 6658 14299 35040 33910 38082 68337 61199
20092 61199 30728 17314 42151 65917 40086 17519 17072 20680 26685 -1881 1405 26363 24424
20079 24424 33706 36847 246 -1367 -13461 -30828 -17994 -3496 622 -10484 -9300 7133 10170
20066 10170 13623 -18940 -32777 -39623 -24455 -46590 -4878 19658 9444 22572 38809 38635
20054 38635 58490 43252 45089 65297 39121 24633 13412 4947 6418 26057 26024 26893 31945
20041 31945 54443 54547 11063 4886 -18781 -16272 -11638 -5091 1679 2987 35303 72239 86903
20028 86903 73288 53927 80999 87813 89528 79538 92857 76497 72131 55754 59658 55939 49391
20015 49391 43906 68171 96374 103638 80852 71139 70699 79409 103901 92591 86230 80144 69599
20002 69599 84006 108968 117498 132163 159445 165826 210788 272486 362462 441854 496381 553780
19990 553780 624807 745567 880057 969879 981282 921345 841518 746077 640613 531081 447318
19979 447318 372527 302077 274365 233036 208152 183693 158040 119712 98879 74989 56828
19968 56828 68800 71477 51039 68187 66324 56114 47764 65409 59856 54812 64918 44473 9268
19955 9268 9003 37538 61419 50293 51299 37548 27309 23530 33358 39892 33495 10319 -12228
19942 -12228 -4130 3964 28870 38913 26399 12675 31254 46171 40101 41571 52936 68769
19930 68769 80015 39174 25294 28163 39525 24960 -458 -6318 10446 45108 -327 -31460
19918 -31460 -20464 -692 50954 75348 76581 73306 50359 20284 3187 -29028 -33892 -23041
19906 -23041 -24064 -14344 783 27450 37732 42063 28368 22255 18160 14441 45668 61139 61387
19893 61387 71273 72990 85017 88931 62523 74185 52767 39401 36196 39904 60890 69664 87733
19880 87733 87195 69928 81657 89478 94269 106748 124497 113960 91757 61693 49646 55675 56537
19867 56537 88676 102045 91549 92325 114656 154619 181258 191551 233139 273711 312570 399710
19855 399710 467365 553015 663655 772771 874748 969943 995586 954057 890510 784070 677928
19844 677928 579558 482609 380981 295858 237971 199792 185548 188114 179737 176576 154129 146432
19832 146432 131409 118713 108326 103199 91425 75609 61092 49726 69366 74879 65551 71109
19820 71109 75945 77823 103818 80922 57581 46703 66757 57693 39315 71316 89143 68491
19808 68491 49067 42565 56506 69386 55226 49172 59424 53206 73534 64196 31196 45235
19796 45235 70785 58259 24769 15223 37244 48716 30085 7412 47706 91546 88861 99902
19784 99902 82525 74546 67055 60578 73061 106446 135513 126092 124290 150945 139884 129556 130652
19771 130652 139242 117406 127526 142689 131090 125523 146736 195629 256995 301102 337767 415416
19759 415416 487093 511279 495596 475281 403555 339914 265812 193823 149780 119185 104364
19748 104364 92709 89817 75475 50077 54285 29618 29527 31124 37463 32069 35134 38717 47822 34452
19734 34452 15468 26546 13462 -13939 -20038 -27454 -14148 4979 27954 24661 25568 14021 28855
19721 28855 60830 78227 86939 61564 39724 35081 56816 61026 35360 32007 62067 44707
19709 44707 59651 67123 87182 85089 87178 88983 52606 33114 30823 21100 28487 56140 48308
19696 48308 42797 41815 56384 72436 61797 58459 55719 52833 75492 88897 68782 46174 34715
19683 34715 31035 30907 45663 51012 60277 40436 68301 79719 86582 96690 80196 77606 94661
19670 94661 79349 50447 57176 54660 48955 56557 60371 49199 61835 86434 104254 87276 85542
19657 85542 66331 30999 45891 69311 75847 86668 100138 120807 104274 84054 78929 84806
19645 84806 92669 102908 111464 81197 70024 62683 91850 105668 97316 78024 70586 107929 141046
19632 141046 141845 127744 98437 96950 113147 113384 131185 128246 108569 65779 48328 63790 64566
19619 64566 66652 74092 61772 34793 38591 77016 68353 67923 71987 88209 64427 81314 117336
19606 117336 126082 105208 104160 126683 90507 73220 78639 108007 115028 91201 91766 124491 134118
19593 134118 121600 138244 159568 161649 150977 161722 165868 187000 193648 219726 236651 232767
19581 232767 226001 218000 221519 223234 236348 215931 161439 129485 163640 176060 175077 153811 125870
19568 125870 117203 152219 146999 132993 126676 122082 116607 113705 112248 133541 140665 132518 111880
19555 111880 104648 127956 137372 142037 139595 148492 153220 168624 180106 176694 176085 171791 163282 188741
19541 188741 218580 215165 235785 212384 204146 207050 193318 171141 160559 205974 256444 249485
19529 249485 252609 293442 320349 353269 401585 403596 426169 438391 471232 531391 620522 752565
19517 752565 915775 1107601 1387653 1766006 2236702 2748098 3246835 3604079 3786591 3738730
19507 3738730 3494050 3121722 2708306 2299229 1950778 1664958 1434577 1288905 1209781 1151770
19497 1151770 1116287 1112114 1102479 1044871 972148 887563 806707 726750 654099 584811 505309 447432
19485 447432 406260 383500 363806 357928 336909 326284 319338 321569 294998 262520 270929 272860
19473 272860 296103 317981 320304 349755 356045 356548 378440 392409 368099 370572 401346 444911
19461 444911 458379 486352 561838 629205 674858 714168 740171 735656 728447 733040 720388 676423
19449 676423 625480 603931 587049 555518 536112 532740 505107 508540 518960 492665 496474 490544
19437 490544 495118 489742 504453 511995 526765 514414 503339 499298 505872 486131 505465 521015
19425 521015 504421 501050 524985 529926 558933 590528 604782 602984 623416 644089 658034 703011
19413 703011 766601 833541 902837 959213 1002905 1042089 1065313 1064725 1049090 1045181 1035543 1022965
19401 1022965 1000169 960905 931951 937516 942406 959093 966142 974559 958109 965730 959748 970198
19389 970198 1003417 1019921 1087789 1114373 1167562 1252324 1318061 1380536 1430437 1503225 1570409
19378 1570409 1665138 1764959 1850980 1970902 2094534 2230764 2391364 2565980 2755135 2991465
19368 2991465 3253333 3504303 3741252 3944031 4107471 4255635 4360958 4417637 4532243 4680528
19358 4680528 4833783 5037038 5259969 5505451 5807485 6139050 6538294 6997232 7548188
19349 7548188 8209066 8995299 9910505 10997206 12263259 13787159 15604206 17748289 20393390
19340 20393390 23663139 27754740 32927344 39599991 48286479 59624526 74017227 91370573
19332 91370573 110853433 131083472 149761606 164134278 172269088 173025576 166291915 153491442
19324 153491442 136628460 117683208 98654971 81084822 65848454 53195259 43008492
19317 43008492 35011300 28820921 24025517 20258856 17299604 14936636 13064870 11533369
19309 11533369 10272393 9235380 8411268 7695663 7100300 6590092 6136817 5765731 5477696
19300 5477696 5215186 4998956 4790960 4635222 4534245 4440680 4351868 4291575 4288167 4267482
19290 4267482 4188694 4066810 3877918 3670766 3486004 3274144 3065650 2853226 2664789 2499735
19280 2499735 2373690 2275636 2217955 2155217 2091488 2030695 2004613 2014877 2062373 2100305 2158966
19269 2158966 2231432 2278446 2304555 2284625 2213720 2144733 2066760 1979266 1897710 1843585 1822317
19258 1822317 1815783 1821757 1827008 1846115 1886061 1932312 2007075 2075800 2098609 2152199 2248045 2320165
19246 2320165 2434278 2542300 2625547 2694193 2748992 2810242 2902113 3011429 3131623 3249677
19236 3249677 3389138 3535394 3689422 3881613 4105950 4371053 4625348 4861759 5107486
19227 5107486 5396191 5760106 6175322 6621440 7112398 7672376 8246755 8829108 9513079
19218 9513079 10267201 11121035 12109718 13278282 14698072 16392032 18398223 20838621 23861404
19209 23861404 27599867 32307452 38318251 46074246 56221040 69560141 86719608 107726283
19201 107726283 131174561 153720742 171024074 179598308 178076285 167547605 150688718
19194 150688718 130595817 109779878 90189277 73041376 58904731 47728637 39027455
19187 39027455 32276204 27081838 22997062 19753287 17260327 15304758 13757812 12503453
19179 12503453 11461764 10538252 9735574 9044217 8442122 7912356 7387120 6886980 6385645
19170 6385645 5902946 5440185 4976410 4579267 4223236 3901559 3648038 3451518 3305477
19161 3305477 3192856 3101583 3030844 2953572 2845939 2724073 2608419 2491013 2390245 2281105
19151 2281105 2208595 2158176 2100133 1995818 1915142 1839971 1722941 1635483 1581293 1531981 1485947
19140 1485947 1445055 1397178 1382966 1367188 1338615 1275955 1209730 1150815 1081740 1054062 1053188 1037144
19128 1037144 997255 962380 960891 930791 926186 908186 880351 842060 828896 798265 755205 737130
19116 737130 696631 670843 674601 673412 628591 631105 634254 580672 562286 539491 486392 444231
19104 444231 466471 458239 441414 435617 422885 423778 424485 391784 371110 367231 371109 399976 432708
19091 432708 459906 444719 427324 432801 406959 391070 376752 389732 405883 428678 432980 420220
19079 420220 415364 417303 395334 377844 358380 314484 276788 279841 276711 264308 281944 302120
19067 302120 303012 304269 314335 325046 319728 358836 430144 471316 541948 599082 577953 532172
19055 532172 493026 444216 397269 361402 325073 293844 266701 254042 235226 221265 241089
19044 241089 262320 254042 263740 263352 238033 220637 198232 172141 147582 117601 100895 89871
19032 89871 80442 83064 90603 79107 114114 125097 127226 135581 135209 151726 150344 127328 124818
19019 124818 124548 115807 129703 161953 175672 175959 205900 233506 258037 275072 257029 234178
19007 234178 253674 257940 244047 219263 181172 146281 181588 176651 147579 125225 103940 101572
18995 101572 94741 90472 103170 89256 113473 113512 86261 91156 80195 73170 81012 89975 88790
18982 88790 113651 127136 123641 105156 87551 48075 49287 66590 93313 115256 109739 113434
18970 113434 107233 103652 121803 130121 157250 205777 210059 223412 251246 271237 297991 288782
18958 288782 264675 248711 245620 292223 309278 317150 334767 331117 321311 325329 311593 298954
18946 298954 286889 270829 262656 243705 232793 208634 187738 195048 212098 209760 200140 191397
18934 191397 189278 185588 151333 120002 104307 90493 49914 24432 29757 23293 32168 53860
18922 53860 76374 60564 53582 25906 16473 23032 44738 62394 56429 24232 7223 10302 17966
18909 17966 36889 25995 46055 54419 41441 11579 14492 43491 29863 17331 25888 9621
18897 9621 2613 -1052 19556 45313 22642 7893 16430 7566 7396 30231 22879 15585 -1395
18884 -1395 -19965 -18216 -26197 -6264 3468 -185 -2974 -17677 -43898 -42361 -35965 -18417 -5578
18871 -5578 13005 3085 23991 19689 -1205 -3455 -9940 5169 37628 32582 29434 21678 15158
18858 15158 -13358 -19493 -30605 -29317 -524 -11152 -39439 -29476 -32120 -13516 4371 -4131 -10004
18845 -10004 5383 19832 18479 27360 46466 52862 6015 515 -3530 -7207 -18396 544 20789
18832 20789 21483 -396 -9196 -22147 -36850 -4770 -5769 -10839 -3101 -18136 -21999 -26575 -45946
18819 -45946 -57347 -59744 -68750 -79383 -44494 -31858 -24085 -9365 526 -1948 -10950 -2692 -29242
18806 -29242 -30557 -758 -7973 -3515 -12028 -40425 -47384 -28765 3202 11475 -5961 -5585 27443
18793 27443 23101 20549 6678 6698 -2268 -4666 -13067 -4102 -2394 -17636 -22784 -14838 -14777 -2848 -28218
18778 -28218 -20771 -19103 -12984 -26578 -44489 -17875 -10241 -10039 -4580 -3027 20228 69990 97914
18765 97914 170865 253180 240575 175438 145549 147201 103399 37249 35345 14930 31431 42481
18753 42481 27803 15571 4857 -1775 3154 -18429 -41603 -23906 -18989 -28920 -24568 -23758 -19302
18740 -19302 -3438 2047 -10146 -7033 -8536 -11869 -3648 19006 13225 -6522 -30824 -29254 -7169
18727 -7169 -14553 -23478 -41007 -29211 -26563 -5156 19751 -24737 -38786 -17387 -18383 -16730 -6798
18714 -6798 -18015 -18464 -10101 -9941 -3629 -10916 -17209 -1030 -23799 -27789 -13012 -34228 -53792 -52818
18700 -52818 -9652 15667 -8151 -33708 -15200 12177 -858 -12297 -30553 -11921 8496 -9867
18688 -9867 -27398 -7298 652 -3450 -17005 -23467 -1803 -7375 11498 31318 24907 33104 55522
18675 55522 64183 63766 72479 93034 107648 122871 173450 241057 305283 390848 510773 625795
18663 625795 755146 842308 870034 861181 852387 804018 720069 612351 556259 439035 343247
18652 343247 288379 242752 182946 146461 124148 87491 83457 68048 40728 28562 38653 20135
18640 20135 -9801 13663 21591 16446 4353 -22645 -38246 -16059 -28432 -43620 -67362 -73601
18628 -73601 -66742 -51126 -50955 -69691 -62890 -55915 -53471 -38288 -28548 -18466 -5856 11616 -1519
18615 -1519 -2746 -6493 1641 -4463 3661 2564 -1703 31271 24071 -3114 -28357 -66827 -78917
18602 -78917 -57673 -53751 -48143 -29201 -17544 -5511 9518 7030 3139 -26216 -42920 -32092
18590 -32092 -58870 -46782 -36516 -19368 -9148 -7291 26288 41877 66898 82448 94966 123016
18578 123016 135922 142715 137416 101047 74231 62250 63631 83416 68099 56794 52934 53083 55580
18565 55580 79134 72937 54368 37439 19955 7884 33945 47843 56696 56354 61207 55236 80224
18552 80224 122715 118113 116279 109333 135145 170437 212357 241658 285561 374969 465106 599762
18540 599762 729924 830003 932828 976290 961151 956927 908072 876170 814569 723951 669981
18529 669981 610593 525480 439283 375699 312159 234927 188239 167505 140685 116939 83317
18518 83317 79642 57118 49243 57184 50680 45057 56341 65653 70257 54366 26863 48689 60072
18505 60072 52173 9621 -14982 -3725 7840 16671 12069 14582 9607 3492 -11529 -24 14214
18492 14214 55180 60970 32528 8118 15977 31216 29555 36803 50587 73343 112146 137769
18480 137769 142663 162938 174164 126281 81495 36037 22270 19192 19110 17104 28032 50908 33505
18467 33505 23601 13838 -11872 -23737 -58508 -40852 845 12269 30954 37110 53553 67191
18455 67191 66204 68915 72188 91112 101733 161167 211683 253785 267561 257777 232567 186776 154354
18442 154354 141234 104672 60671 24122 5342 5940 19198 26775 23732 10816 53011 45281
18430 45281 29814 21645 19220 -18955 -8474 26431 33858 44055 31228 6098 3099 8242 23383
18417 23383 21042 6363 30300 40792 62714 50715 30097 36461 60006 78156 63406 77922
18405 77922 138104 205853 267940 334966 377731 425543 471055 512930 545944 541609 519040 480606
18393 480606 400494 327723 268185 186889 140380 96158 60004 55901 56748 35177 35398 22741
18381 22741 28259 48244 30507 6920 8716 20677 23833 41843 51007 21435 6880 -3491
18369 -3491 -5422 8500 18249 19627 31097 59555 52452 58198 57505 29088 25882 65344 84853
18356 84853 77214 84921 123312 147673 213172 258016 292839 332096 356085 362313 366229 328685
18344 328685 293037 271507 236827 215373 180885 124049 85457 71046 58772 63368 55569 20122
18332 20122 9100 1709 3788 25866 48020 47246 44993 35544 29403 48194 83099 74285 79122
18319 79122 101607 128561 161225 175264 147782 131907 140301 158986 181341 190083 209124 198933
18307 198933 178558 181296 194016 198023 203370 194466 173083 160110 141404 185298 225825 217103
18295 217103 241518 268282 257503 250069 224367 195454 161090 106227 85376 72742 69597 73700
18283 73700 65826 50163 19308 13030 28949 28237 16748 20770 13620 17493 20055 22670 29569 73373
18269 73373 71930 67822 99586 131876 141335 99136 66176 88464 95981 103737 115241 124564 132268
18256 132268 124763 97254 97652 92277 84398 109999 121439 134638 164872 178617 192724 197418 195566
18243 195566 178827 147239 132719 104701 86799 104552 96769 68905 59790 73489 91376 95744
18231 95744 78438 82832 40208 16163 15223 -12314 -23190 -11544 11162 47720 50804 27789
18219 27789 -10376 -21670 -16849 -30523 -20922 -23106 637 15385 23656 23235 14453 22316 28867
18206 28867 26560 39082 60415 58015 56098 68735 76070 66959 40201 6655 -17580 -5885 8078
18193 8078 30743 62512 68914 38704 32628 46115 45196 30947 16277 19640 15487 4203 -12287
18180 -12287 -19056 -1250 9690 23551 57438 48826 29898 42094 85386 112440 114850 101254
18168 101254 93383 68099 49114 45946 43129 52677 74169 50690 56011 63469 51284 38799 74995
18155 74995 97191 84017 86252 115835 118761 112544 122050 130632 137800 126862 165180 205542 161519
18142 161519 104440 79882 112008 140037 175751 163367 160261 170330 182931 191353 236422 282578
18130 282578 337055 369510 383679 454289 517299 578814 670268 742671 777499 838210 979526
18119 979526 1131910 1278690 1452619 1706519 2050212 2433248 2915427 3564519 4466208 5816757
18109 5816757 7960172 11707822 18785962 32374227 47637514 45811322 36457040 31060053
18101 31060053 27070528 20511153 13237507 8614988 6071246 4529525 3503633 2770452
18093 2770452 2221331 1817300 1544964 1337182 1157533 1008567 926806 851968 766494 681721
18083 681721 617058 584121 596687 586126 613202 621002 604122 589492 582410 555778 480198 434130
18071 434130 418944 384381 337322 306891 287475 260118 240036 225398 212766 211542 215699 220557
18059 220557 206821 175511 131160 105784 106299 127329 142848 114509 113229 137459 137452 131441 119642
18046 119642 128843 130615 177220 206690 168492 152598 164825 160998 160961 173635 180054 219306 260823
18033 260823 311034 331138 350193 397897 450472 491166 521349 516808 514938 520916 446622 387930
18021 387930 361554 348659 315995 283120 267835 251382 232446 240004 220469 207418 221860 216684
18009 216684 246134 274659 285239 275221 302167 301078 278573 315717 355272 350245 307422 300754
17997 300754 349041 363170 334170 311179 318555 367645 409063 473853 494098 500114 506341 538205
17985 538205 625614 669406 705023 754766 861702 957637 1071315 1216563 1345031 1426360 1477622
17974 1477622 1520165 1522913 1518733 1510786 1516294 1545307 1633934 1762044 1930702 2144547 2355720
17963 2355720 2578381 2858007 3191944 3568711 4050259 4660542 5507251 6735899 8495639
17954 8495639 11050499 14891581 20592217 28228221 36866046 44716416 50292378 53110886
17946 53110886 52445784 48140253 41475913 34171372 27201868 20981665 15836537 11920497
17938 11920497 9121577 7195505 5866159 4936166 4286916 3851132 3551445 3398956 3365574
17929 3365574 3393797 3422165 3493145 3553642 3645047 3769133 3858028 3955654 4063854 4192150 4375189
17918 4375189 4600643 4875264 5227998 5668824 6156752 6733263 7438781 8308986 9474068
17909 9474068 11087699 13374225 16677874 21587931 28802048 38717275 50731101 63358650
17901 63358650 75423326 86702609 95883737 100966861 101279874 97692335 90679641 80079313
17893 80079313 67248009 54381843 42907838 33172984 25223925 19064863 14577528 11442146
17885 11442146 9242145 7687149 6533018 5721657 5157107 4808496 4594675 4446009 4378321
17876 4378321 4355222 4348352 4299827 4267814 4236916 4230827 4262332 4294256 4333215 4386192 4475943 4597795
17864 4597795 4749919 4946876 5221013 5632952 6217871 7063151 8299888 10101677 12775179
17855 12775179 16795893 22835575 31417632 41942823 52603302 61141866 66463863 67807153
17847 67807153 64293403 56864700 47596877 38341659 29865817 22558918 16741532 12457342
17839 12457342 9451750 7346782 5848215 4729120 3926176 3376721 2961232 2652879 2404119
17830 2404119 2190252 2042912 1952003 1881858 1848113 1839772 1838555 1817524 1799926 1742034 1644690
17819 1644690 1535525 1369699 1216564 1044791 939667 884951 831669 776441 755004 737431
17809 737431 691702 664482 661431 652633 632216 634918 683133 720276 705932 678674 631698 624647
17797 624647 646554 682171 710574 720882 703973 730463 763681 755396 736466 711020 675930 656391
17785 656391 641071 606043 536746 497904 487211 477659 449235 453442 472747 418975 374755 358616
17773 358616 342395 301632 252936 215214 189614 165720 166215 190824 189075 177920 185044 213881
17761 213881 229601 255031 253487 235811 222577 229813 266085 275176 280308 307934 304553 271975
17749 271975 284631 306025 343523 422746 465128 510303 567868 619314 602984 561850 506080
17738 506080 447480 405317 372208 315260 250145 209231 210613 223321 178032 135330 115263 113082
17726 113082 111037 82276 80903 71268 42964 18152 -4366 9188 39088 58526 56775 65824
17714 65824 77966 73907 95702 135409 165326 192405 212781 214485 202244 188940 190875 188416
17702 188416 172355 196398 209902 200666 217117 234383 268087 321512 371275 390517 383921 361260
17690 361260 329815 309888 279390 249899 202645 167340 146497 156372 139363 79294 75707 88600
17678 88600 101883 61409 41733 49653 62088 70507 65271 53690 66504 31728 26231 42700
17666 42700 54922 60983 58343 73504 102216 109980 102940 114077 115490 106755 103655 99990 94948
17653 94948 76830 83764 104965 114446 128267 115748 97163 119466 127441 115679 102076 124877
17641 124877 113599 84306 117336 161486 201059 206266 244101 282259 361423 420560 452443 501396
17629 501396 529682 553306 614515 646230 658045 673599 690702 691562 647372 660391 693985 694732
17617 694732 689948 700375 704296 656453 607465 597538 577403 529879 485400 453245 423262 374428
17605 374428 305032 243559 175255 128615 104435 105709 97908 115774 118801 106674 104981 92963
17593 92963 88579 85938 87908 105241 109078 134953 166478 203572 246597 269978 283409 301120
17581 301120 341352 387792 444311 458814 460317 473143 510554 523384 519871 515380 520093 502923
17569 502923 484720 475982 477510 459276 458278 425750 398474 394892 388321 370799 336813 285216 274243
17556 274243 226422 166135 131487 74203 19262 -7027 -767 14317 17216 29225 33520 20582
17544 20582 11161 2638 526 16222 24093 14552 19935 37801 20978 9710 -10568 -25395 -17250
17531 -17250 -11499 -37087 -60038 -62525 -56632 -40806 -6900 22106 14740 9047 22090 8200 20475
17518 20475 23919 21718 22223 4399 -7794 6178 24539 11998 428 7621 -10948 -20252 -7625
17505 -7625 -14176 -56276 -86371 -69435 -27453 -21691 -30009 -21292 6190 24374 30765 12255 3283
17492 3283 -19180 -26446 -4973 20034 16428 -12546 8405 25771 12763 -2286 4744 -38467
17480 -38467 -60438 -62266 -58783 -62571 -40379 -10924 -6680 -10806 -19485 -26721 -8744 7309 33790
17467 33790 49157 48983 5886 -23850 -38520 -28579 -1468 10184 12206 24553 38788 49644
17455 49644 50609 45256 63288 67536 43491 78727 124550 134028 148504 181790 226925 260473 274071
17442 274071 287136 296222 341993 393565 443899 403390 337888 280744 233972 191648 147414 111574
17430 111574 110626 121824 142126 155309 166543 203338 253028 284504 308044 308832 313408 324346
17418 324346 339902 348031 381021 403662 412442 459751 540077 567505 603837 642194 666348 686984
17406 686984 649893 627763 646862 661858 658258 645845 701298 763173 825719 854480 888908 905148
17394 905148 920678 903124 850772 790045 726477 650249 574712 471186 396954 342406 301439
17383 301439 243720 205863 201515 194565 182955 144752 113933 132148 127636 123294 124348 83255
17371 83255 60341 89446 86110 58410 51454 51933 107198 147261 123369 107369 115685 106786 113933
17358 113933 84075 78156 88616 122638 156263 158484 178921 228957 261837 318347 426959 504041
17346 504041 530179 531423 510355 475361 426736 371890 301113 262250 243510 220262 187088 163483
17334 163483 158178 153240 135496 141747 134181 103202 79665 56013 56285 57234 10396 -7754 -18280
17321 -18280 -11798 3704 -12686 -7591 9905 -17131 -41582 -30166 -11334 -6912 -25393 -48282
17309 -48282 -48530 -84108 -79919 -38376 -17455 -12149 -43601 -46947 -11477 28151 32521 44860 53390
17296 53390 22990 31022 38093 16780 29884 59405 60373 70097 70039 57040 27050 14733 8776
17283 8776 -2377 -10485 -18486 9497 29498 13160 -6640 -1274 -22508 -91161 -79144 -86831 -87737
17270 -87737 -58737 -54668 -54170 -32252 -38501 -7729 32923 31500 16486 48889 53248 69135 78981
17257 78981 87461 135076 174719 194427 199561 216985 245890 271378 282424 311459 346249 330871
17245 330871 324043 318246 328002 339404 331503 335280 333628 331396 287663 251011 230788 229433 211579
17232 211579 193430 212334 206714 205838 190059 181539 167515 147785 134471 126610 157821 187854
17220 187854 166780 168181 194817 211647 194737 205325 227349 240401 243402 263476 299166 310576
17208 310576 334209 350312 354538 362569 386258 398797 380786 399306 410543 398745 420430 476025
17196 476025 484948 513048 529975 556706 579182 584671 600611 610885 606162 604377 638167 657876
17184 657876 646982 638946 675864 696955 715441 736533 738362 759302 771682 788807 805579 834221
17172 834221 887916 932614 946944 966632 1019473 1095868 1177446 1212488 1280941 1366279 1468030
17161 1468030 1588874 1708781 1866383 2057392 2276615 2518193 2793472 3076191 3373166
17152 3373166 3748166 4175560 4606098 5104423 5668913 6350338 7196252 8299747 9890409
17143 9890409 12193444 15249993 18841960 23048769 27568923 31799189 36840219 43271737
17135 43271737 50000278 56782716 63705355 67588093 69130189 70900428 72133537 72120301
17127 72120301 73410006 78347136 83139031 84670639 88068226 95273693 102200935 108600228
17119 108600228 117257368 123106537 123150655 120865269 118317292 113523878 102798859 90374776
17111 90374776 80577245 71101869 60342916 50659208 42858241 36104171 30567493 26261150
17103 26261150 22529234 19375240 17104093 15511963 14310084 13454067 12941602 12754585
17095 12754585 12891702 13418343 14441595 16125462 18689984 21937738 25701574 29993320
17087 29993320 33950011 38119795 43787625 50852820 58965094 67834226 74148548 77308360
17079 77308360 80824704 82425507 79360911 75958136 75011085 74964458 75678519 79948718 88309123
17070 88309123 97801995 106141626 116969487 126594266 124163647 114631913 105014434 93148482
17062 93148482 77700473 62792716 50734502 40645158 32540388 26440423 21572107
17055 21572107 17578574 14552536 12298105 10506346 9064308 7985342 7192243 6614458
17047 6614458 6159840 5759186 5337291 4966086 4667791 4367750 4109047 3863656 3641859
17038 3641859 3431982 3231451 3038431 2839753 2695548 2575611 2494675 2390544 2270643 2137985
17028 2137985 2033591 1958030 1898354 1822552 1758300 1734523 1712600 1671024 1587014 1514292 1460161
17017 1460161 1380136 1303007 1272357 1259950 1246140 1205901 1190196 1160959 1168633 1185441 1204691
17006 1204691 1199754 1200640 1232222 1276752 1302822 1334329 1324390 1352960 1371173 1355494 1351342 1326089
16994 1326089 1281935 1286347 1324339 1349267 1346668 1297557 1293805 1305174 1270431 1252951 1244114 1222010
16982 1222010 1190840 1143985 1110161 1083802 1058604 1037071 1057336 1099994 1112682 1099750 1073935
16971 1073935 1082363 1111359 1141701 1187491 1236938 1251175 1293381 1347716 1388497 1465694 1565494
16960 1565494 1657597 1805928 1967846 2163391 2414915 2686772 2978398 3294063 3644635 3983306
16950 3983306 4338290 4763060 5280320 5863883 6548837 7414711 8564161 10110489 12285166
16941 12285166 15469771 20109828 26061792 32451724 40030072 49512169 57734591 62376470
16933 62376470 66834622 71019005 70710077 67858260 66556815 66626572 66747643 68590869 74293410
16924 74293410 81871937 88253169 95057303 101937522 103514234 101053820 98252827 92579754
16916 92579754 83380588 74776143 68558331 63127389 58524538 56932594 57842695 57579962
16908 57579962 56032413 55606857 53984469 48980724 42988591 37671001 31981510 25852454
16900 25852454 20526378 16442202 13216245 10619432 8680576 7310414 6357307 5628486
16892 5628486 5082879 4649554 4305222 3990658 3688438 3426976 3173279 2944242 2748014
16883 2748014 2582066 2442288 2309421 2214569 2137856 2068822 2030203 1989172 1887901 1821518
16873 1821518 1757838 1673539 1582689 1511038 1441058 1382980 1356502 1329252 1312028 1288705 1257249
16862 1257249 1236291 1208822 1198721 1171708 1148704 1107317 1061440 1021661 994092 949641 904620
16851 904620 892307 886708 898858 892156 876429 824634 783172 747480 716706 682532 682878 654537
16839 654537 633852 647153 655978 622032 591624 576153 563443 557219 533310 523203 501929 471002
16827 471002 454951 437946 445871 438627 446540 456815 456215 457489 444060 438948 436035 407528 385608
16814 385608 408816 428831 407442 400087 399870 388914 365937 344896 332396 308256 319634 298547
16802 298547 307729 347827 324428 317693 264430 253208 257016 278992 295514 266215 206538 200466
16790 200466 221207 223941 244804 261304 264698 235763 229410 261077 273630 269139 232013 223809
16778 223809 236139 251495 273516 263560 266348 267164 292204 296809 270187 271687 298894 316151 293387
16765 293387 309111 305116 300469 284581 301500 292841 317173 318813 294395 267467 237077 236563 241788
16752 241788 265579 263079 256964 262631 264771 267953 254253 241899 241373 267228 279216 280507 288775
16739 288775 323426 317904 312399 341015 346997 332435 383171 444629 488097 569136 646132 711132
16727 711132 768037 821968 873468 914470 908653 891481 876076 870854 879127 887505 950607 996295
16715 996295 1011252 1051674 1149773 1185872 1168199 1153506 1126811 1034870 927584 856331 799016
16704 799016 728997 715379 708642 715326 726304 738810 716418 657875 599424 537523 504913 463059
16692 463059 391464 357044 345556 288053 253873 262085 236874 256853 263248 266054 249016 224069
16680 224069 215796 220636 207977 235674 223366 221459 209878 183306 192003 194468 180354 173329 164275
16667 164275 164440 183907 174394 156667 162935 161806 140948 144883 132831 109856 97260 126599 152457
16654 152457 147087 146261 141089 144853 148236 117043 112090 126578 108222 106674 135545 156742 179823
16641 179823 208871 222936 262173 301663 327368 334011 351530 373672 387817 395949 369068 351055
16629 351055 337847 326419 299506 292629 334226 368227 384216 388731 395220 417165 459361 509521
16617 509521 538214 533605 523124 504926 520297 542445 518105 509083 476211 466480 463561 435173
16605 435173 397529 395519 361276 349338 334004 288505 278851 256430 244632 221199 226190 192439
16593 192439 150238 156565 163833 160634 182026 212643 230688 280843 303196 293476 279683 300735
16581 300735 327568 320021 314501 309880 314525 315124 277295 292575 340571 357720 364822 400869 463520
16568 463520 488373 490468 493083 536452 540096 510893 502137 487240 478548 435097 394107 361887
16556 361887 333851 315736 306488 298635 282393 260646 244945 237742 263355 258230 213579 157988
16544 157988 152888 141058 133453 99026 53417 34782 47605 59945 60174 64571 53537 62999 63939
16531 63939 25683 4258 -7972 -4316 3851 12344 8626 36217 72683 85013 97923 95282 81731
16518 81731 76722 52501 52108 42551 60327 63321 43960 27230 -7049 -6259 -15935 -17667 -2899
16505 -2899 23462 34424 25997 51089 34871 8404 -3549 -9474 -11715 -10838 -6310 19574 37625
16492 37625 23208 11775 7068 14054 37966 24283 13925 -5371 27467 42560 45128 52034
16480 52034 19272 896 10349 43419 31448 14304 18168 23515 33658 11460 -1706 19157
16468 19157 36700 55630 61257 60747 73251 102265 66662 27008 14352 12593 28339 27017 29318
16455 29318 49427 54532 43010 39997 42829 71092 91469 145496 128797 126618 172523 210448
16443 210448 237414 280969 305004 338545 357775 372598 380941 381902 367803 349023 375952 409910
16431 409910 441750 469792 517253 566834 546209 526279 515397 477634 415307 390907 393057 363322
16419 363322 350833 359153 369218 369671 376033 355104 313963 260360 233602 210325 188116 142224
16407 142224 89315 87078 84151 41299 23279 16272 9077 16368 7570 2689 21194 45763 48259
16394 48259 23840 1147 7167 7776 10267 -16624 -34600 -22961 -30942 -36615 -41769 -14838 -11077
16381 -11077 -31921 -56629 -19925 -1885 -20575 -18194 -33999 -10162 8836 -20023 -22256 -2515
16369 -2515 -12613 -37587 -38843 -32399 -34912 -8583 -24039 -32056 7139 31692 25789 27447 11805
16356 11805 -5343 -11885 -31844 -26504 -6595 8938 32234 44620 29468 20467 22999 20703 -7108
16343 -7108 -20273 -48528 -30990 -17782 -13557 -308 14716 -713 3577 38913 38070 10180 28963
16330 28963 53709 65414 57138 14988 -570 29831 46551 50626 54603 41647 21220 23420
16318 23420 10677 -3423 -9845 -27027 -19505 -4302 -6388 -9816 8702 -11730 -22715 -12608
16306 -12608 7237 2824 20787 22569 30697 13252 -7357 10509 -6164 -2277 -3017 -11922 -26571
16293 -26571 -16634 -26648 -22939 -17197 -38141 -53204 -16567 32447 46327 39497 17270 7821 -3966
16280 -3966 -16482 -19515 -30985 -14459 -2797 5364 18467 -17128 -34101 -38362 -10035 10559
16268 10559 648 -7374 -28021 -2029 -208 -3043 8919 -4150 -24053 -43777 -50988 -28090 -4299
16255 -4299 -10677 -17897 -7330 -4300 13847 12153 -13627 -19909 -28697 -26309 -24065 -21156 -31574 -50357
16241 -50357 -39068 -36531 -11900 4437 -13072 -3641 5877 -24879 -42470 -39511 -48206 -36467 -1190
16228 -1190 -13875 4368 36266 35244 8456 -9471 -7879 26456 18979 11867 18584 1332 -27910
16215 -27910 -36950 -49564 -46217 -47306 -54803 -12542 168 -25038 -18564 -18699 -13424 507 15140
16202 15140 28208 -13085 -45582 -36828 -36068 -43678 -52310 -48340 -35901 -41167 -46359 -7700 -8305 -27230
16188 -27230 -31132 -43357 -28157 -31015 -53056 -29187 -18331 -6385 -12106 3377 -17905 -8523
16176 -8523 9184 -16607 -22589 -30356 -29605 -47771 -49234 -34173 -45800 -56359 -48740 -36938 -18591
16163 -18591 -25756 -33236 -44535 -48761 -44995 -46574 -54703 -80919 -78901 -54995 -62974 -71241 -63273 -40813
16149 -40813 -18182 -28811 -42291 -57510 -69557 -76137 -73420 -60634 -38062 -37005 -21502 -21371 -30337
16136 -30337 -25014 -11773 -22866 -27917 -33173 -40171 -46936 -61783 -87696 -89167 -68213 -46057 -37591
16123 -37591 -22633 -7275 -20663 -33055 -37367 -31532 -30219 -5258 -6724 1728 -24166 -38496 -34324
16110 -34324 -34144 -68295 -64672 -70617 -79266 -49884 -62287 -67666 -71636 -66304 -45700 -27244 4897
16097 4897 -5510 -6966 -22525 -44894 -42179 -36588 -40485 -60896 -62958 -41263 -24576 -9088 -11017
16084 -11017 -24478 -27697 -33502 -42785 -44337 -36248 -32947 -37936 -48471 -36352 -22923 -24896 -26519
16071 -26519 -26755 -18318 -20966 -21942 -27424 -852 -22420 -37305 -31716 -36519 -44735 -38182 -34595 -34146
16057 -34146 -47665 -35246 -15413 -20494 -52844 -58160 -53210 -59794 -65650 -48791 -43599 -2665 10638
16044 10638 -15059 -18676 -22880 -69796 -71245 -55076 -35484 -23264 -29612 -31909 -11961 4717 -22958
16031 -22958 -52881 -45867 -31198 -52835 -77625 -66033 -53093 -43859 1441 -14791 -2999 2301
16019 2301 -13406 -28612 -28664 -37684 -38999 -31256 -5512 -15409 -7196 4028 11557 4539 -24352 -48972
16005 -48972 -33544 -23071 -47691 -72023 -65707 -90401 -86435 -42267 -45541 -54105 -60030 -60725 -62861
15992 -62861 -90218 -75712 -43421 -32555 -60481 -40733 -58077 -71106 -66554 -71480 -66696 -61269
15980 -61269 -63799 -49423 -18094 -41082 -34391 -18828 -12861 -23147 -5962 9758 4476 6490 14579
15967 14579 7543 8767 -10675 -54067 -67251 -50310 -57936 -71861 -79996 -69308 -68631 -40245 -43502
15954 -43502 -58083 -83961 -93037 -93669 -77838 -72002 -71922 -90254 -98335 -93730 -69631 -44970 -34001
15941 -34001 -47837 -63306 -21048 -34831 -32406 -20448 -32069 -62718 -81037 -69229 -70707 -47266
15929 -47266 -37770 -60362 -87695 -71924 -54118 -46048 -35615 -57273 -63460 -57827 -53384 -21416 -1838
15916 -1838 -15490 -15004 -2509 -3771 -13086 -32437 -28977 -26696 -20328 -39786 -15084 9805 -25695
15903 -25695 -45979 -64071 -62020 -32953 -27265 -16933 -12313 -40373 -59534 -37885 -40423 -57541
15891 -57541 -46668 -38457 -43139 -26409 -12929 -2215 8400 30877 27380 -13795 -24685 -21563
15879 -21563 -18392 -30035 -55169 -59654 -58734 -57833 -51920 -57813 -74692 -72415 -69542 -64567 -52404 -49817
15865 -49817 -40883 -37260 -39870 -51220 -42973 -32795 -48970 -42009 -37759 -39923 -39544 -40256 -33631 -33570 -18949
15850 -18949 -20473 -42432 -51662 -50858 -62393 -73781 -71873 -72964 -59007 -47194 -52684 -50077 -65646
15837 -65646 -63951 -75334 -90382 -80543 -61282 -40048 -44824 -24000 805 7388 -8740 -45717
15825 -45717 -94404 -108841 -96344 -82485 -82547 -46205 -30829 -49383 -49818 -20778 -25588 -36918 -63773
15812 -63773 -76232 -75807 -67714 -53060 -66395 -69131 -71217 -62741 -62298 -73111 -34361 -4571 -23863
15799 -23863 -19117 -5287 3799 -692 -3005 11880 11447 18562 36385 46297 47185 54104 87378 107775
15785 107775 114920 95360 98625 118592 98661 70099 53070 54303 62104 38831 37391 12719
15773 12719 -16815 -33239 -66523 -41382 -17369 -25786 -16362 -11588 -21841 -25324 -11177 -25964
15761 -25964 -60997 -55310 -27422 -6805 -15047 -25691 -16465 -31729 -59793 -82288 -93530 -75708
15749 -75708 -57041 -67264 -53163 -21165 -29003 -69157 -99956 -130032 -132898 -115883 -102642 -70375
15737 -70375 -65530 -76862 -73799 -67121 -60009 -54809 -38774 -28049 -33204 -30368 -58178 -82341 -93076
15724 -93076 -88786 -43441 -10309 -11141 -63142 -86762 -102244 -92084 -88779 -66039 -62953 -34106 -34066
15711 -34066 -18027 -6733 -25193 -30190 -29534 -19604 -41157 -77076 -89750 -52201 -43776 -68288 -81420
15698 -81420 -89736 -64942 -65234 -84681 -84363 -109832 -106453 -109742 -125164 -108142 -107145 -84379 -79385 -58421
15684 -58421 -21130 -13375 -25084 -46267 -60040 -78723 -84063 -75346 -62397 -58602 -54937 -37476 -32276
15671 -32276 -51398 -90445 -91419 -91687 -84185 -61973 -10281 -7982 -27404 -51430 -61332 -70694 -78672
15658 -78672 -76577 -66660 -73859 -68797 -60836 -36635 -36539 -62381 -63525 -39542 -49483 -55582 -46960 -38357
15644 -38357 -40940 -66611 -73070 -78811 -67681 -44904 -31757 -23261 -13006 -37892 -51809 -27013
15632 -27013 -18990 -31766 -57397 -76657 -78561 -67833 -28549 -18275 -43941 -45245 -31838 -22289
15620 -22289 -50713 -73785 -98923 -80966 -64346 -71518 -74175 -75406 -56137 -39680 -64889 -67761
15608 -67761 -32492 -41113 -62605 -49849 -68451 -86712 -94147 -68447 -60447 -73588 -64721 -56413 -24345
15595 -24345 -57818 -83104 -95497 -73346 -46011 -37773 -32078 -45867 -70452 -58521 -42179 -26940
15583 -26940 -39155 -36407 -36093 -40215 -77521 -79311 -68649 -93023 -73959 -70508 -83085 -102090 -121545
15570 -121545 -129303 -121658 -131636 -129936 -125344 -155263 -155549 -129076 -104496 -94330 -92498 -71753 -60738
15557 -60738 -71814 -56025 -60411 -81033 -68769 -79834 -85308 -82556 -61603 -69526 -100724 -114242
15545 -114242 -120061 -96809 -71668 -61128 -63513 -61015 -53067 -52680 -51234 -63880 -49106 -48833 -63646
15532 -63646 -66164 -79475 -82008 -98887 -118280 -106451 -97229 -81431 -96140 -115532 -120486 -106676
15520 -106676 -103375 -92309 -110720 -108716 -93909 -65459 -54525 -51597 -57997 -47633 -61877 -69962
15508 -69962 -70628 -87230 -86644 -84728 -76708 -61414 -57637 -63631 -67707 -39685 -60730 -70119 -60407 -60198
15494 -60198 -47307 -46586 -50778 -65836 -69223 -101528 -126342 -133673 -148960 -165015 -157541 -125750 -99247
15481 -99247 -93490 -109587 -110752 -89041 -102916 -92756 -105471 -111199 -109946 -119194 -110727 -83171 -88938
15468 -88938 -92312 -72911 -67068 -84273 -83736 -75196 -74894 -91567 -103869 -82845 -56276 -42250 -56027
15455 -56027 -84168 -117053 -114142 -126000 -110779 -70501 -83286 -83822 -75710 -73805 -86335 -63734 -59580
15442 -59580 -73838 -70964 -61467 -76577 -95790 -80069 -66399 -70475 -71508 -104421 -92622 -52031
15430 -52031 -41183 -59282 -57156 -54135 -70512 -69467 -59317 -49539 -61251 -79355 -78518 -113856 -139339
15417 -139339 -135436 -121138 -91363 -67392 -92316 -109550 -108426 -105295 -96169 -110259 -119009 -87108
15405 -87108 -88206 -109442 -105581 -96451 -107355 -90939 -63819 -59707 -64694 -50564 -59245 -55871 -24260
15392 -24260 -27111 -32623 -41661 -29809 -45064 -71116 -39306 -22456 -44614 -76595 -59142 -52761
15380 -52761 -54176 -58053 -51993 -43699 -40795 -47650 -52919 -45460 -60947 -90724 -74857 -72713 -38191
15367 -38191 -28389 -39278 9843 13037 -12577 -47656 -53600 -38395 -43865 -72047 -71683 -62866 -54529
15354 -54529 -49774 -53472 -50029 -24777 -23769 -15737 -406 -949 3681 4089 -16588 -37244 -56583 -44341
15340 -44341 -50305 -66287 -64149 -58945 -49131 -38891 2853 34572 41367 47633 67921 118442 182555
15327 182555 273121 374725 501921 668353 877643 1096575 1336420 1549315 1731063 1858660
15317 1858660 1934305 1906662 1785555 1618244 1417874 1215417 1010146 819313 658553 503781
15307 503781 363219 275697 182806 145325 108854 60383 -7600 -16487 28064 46864 40738 677
15295 677 -20135 -43634 -74500 -83465 -61797 -36586 -51778 -64655 -44977 -49098 -45621 -44253 -40338
15282 -40338 -53625 -78195 -109350 -109392 -114637 -102954 -95511 -101897 -110937 -112943 -104215 -110091 -149272 -156150
15268 -156150 -133685 -138546 -125593 -94384 -74907 -75447 -72671 -55335 -58860 -62177 -78637 -99595 -77696
15255 -77696 -64201 -58135 -56171 -70736 -70200 -79169 -82278 -71197 -57311 -63231 -44476 -26312 -6386
15242 -6386 -13581 -28164 -47261 -21693 18373 10957 20231 4075 -260 2014 -16320 -14759 3584
15229 3584 26943 52031 108851 166021 253738 356420 441833 542937 656759 752401 823735
15218 823735 849826 876274 885895 838177 762442 683802 559636 423211 341029 247820 171958
15207 171958 139922 131866 84460 40225 25229 1339 13575 16872 -11864 -25765 1157 -5923
15195 -5923 -32389 -47058 -62768 -60336 -52709 -63543 -65913 -95838 -111126 -106977 -92407 -97975 -110350
15182 -110350 -108105 -111595 -106150 -110552 -107974 -74330 -71735 -99094 -95809 -80654 -90573 -82445 -113333
15169 -113333 -125484 -132188 -116065 -106231 -131823 -155077 -140437 -134875 -117361 -111525 -131735 -127463
15157 -127463 -131404 -158782 -157760 -151264 -167982 -149420 -127333 -146563 -130931 -123620 -122425 -99522
15145 -99522 -67074 -54644 -67322 -75230 -56014 -30494 -24336 -28913 -5742 5894 45871 78580
15133 78580 78819 118763 163134 170229 188276 206871 234673 247527 230029 207069 181499 153040
15121 153040 117963 83827 49082 27834 22605 26914 30570 21197 338 -28219 -44559 -26316
15109 -26316 -6511 -19924 -9258 14621 68744 89925 107122 131640 151463 192568 268213 328872
15097 328872 418247 508856 586782 690220 741613 781726 805278 789610 750932 708698 633634
15086 633634 556265 492063 413211 319429 243109 165586 98132 70436 42556 4817 -44523
15075 -44523 -72663 -69906 -88664 -98343 -141509 -200862 -235611 -256385 -289115 -316807 -318270 -303565
15063 -303565 -308898 -283718 -256137 -223327 -175188 -116247 -80359 -65369 -61365 -21488 5893 -5126
15051 -5126 -6576 -4043 -10737 -19491 -15886 -25981 -40400 -36750 -27313 -29790 -28415 -38694 -55001 -48553
15037 -48553 -64192 -92267 -126947 -141450 -186350 -228155 -245518 -265561 -248700 -221832 -192925 -194805
15025 -194805 -203824 -194462 -183433 -148898 -124800 -118242 -102451 -96180 -97090 -73261 -57611 -45445 4740
15012 4740 31944 79820 127160 176330 242989 301184 368121 460091 550665 626789 678223 714561
15000 714561 704141 673002 607015 504688 415045 333953 250273 168856 98753 54145 17063
14989 17063 -9946 -27930 -32460 -30653 -16760 19694 29243 10242 5331 17620 -10403 -19896 -26390
14976 -26390 -6507 -9931 -30673 -27590 -16954 -2898 -3076 -16457 -6681 22150 38320 8254 -36099
14963 -36099 -40544 -46016 -41719 -18943 -18283 -21534 -27670 -45651 -33204 665 34711 55621 79079
14950 79079 93286 107430 137628 158246 162064 177787 213789 258844 279436 306734 306926 298531
14938 298531 301647 295095 271896 272716 289031 291277 303348 343888 387301 387491 407382 464613 500381
14925 500381 500301 509078 553973 587140 618000 687494 749763 782453 843067 900258 976285 1091437
14913 1091437 1214434 1355349 1542582 1762615 1977084 2214734 2513056 2816526 3095346
14904 3095346 3439548 3811284 4229437 4703196 5309248 5990382 6846490 7916944 9223627
14895 9223627 10799476 12692333 14886041 17366720 20176566 23337687 26927734 31088952
14887 31088952 36200911 42850568 52028349 65210895 83859339 108647177 140194577
14880 140194577 178799593 222402660 266908641 308544996 343950466 368774131 379267787
14873 379267787 374923904 357418368 328440441 290582026 248459803 206588685 167518862
14866 167518862 133039920 104652159 82604872 65909895 53447116 44287942 37495922
14859 37495922 32302530 28136124 24679662 21736877 19188307 16967249 15006362 13285647
14851 13285647 11843327 10647064 9621941 8757449 8032443 7439011 6915848 6469119 6070676
14842 6070676 5740699 5455546 5176347 4930074 4736614 4569427 4421825 4265566 4067149
14833 4067149 3912227 3759130 3598140 3458813 3308294 3186358 3061046 2929047 2821161
14824 2821161 2717129 2634667 2524609 2413870 2331415 2243485 2158512 2096107 2053142 1999324 1914329
14813 1914329 1852109 1795208 1755434 1716962 1675410 1594052 1558850 1486663 1438456 1413310 1401898
14802 1401898 1393655 1392542 1365967 1333379 1328180 1325856 1285824 1271023 1259719 1226733 1201197 1163043
14790 1163043 1145339 1133295 1090544 1053472 1007600 989602 984827 950635 940301 959942 943938
14779 943938 921899 896411 864996 835611 837510 859202 875576 839443 811850 793837 788032 768223
14767 768223 762137 742078 716864 712485 698855 703641 707508 685831 639944 619511 620780 601964
14755 601964 606570 604270 561815 520231 462424 415956 361839 297719 278750 278664 254418 214806
14743 214806 242231 279382 289962 296376 317955 360129 407491 452949 471657 484938 491102 484799
14731 484799 490445 505707 538148 534613 526832 525429 529403 576830 607314 577897 562718 566256 601166
14718 601166 644954 637218 623266 594291 593999 602497 583323 563667 516820 457496 420715 409799
14706 409799 388863 383401 372318 338155 310614 297404 283561 298500 301085 317781 338773 316598
14694 316598 307131 362025 377812 406947 466242 499054 512020 533706 557496 589951 629783 661668
14682 661668 660820 638948 632302 599117 574357 564496 543233 540811 517427 494897 458001 423437
14670 423437 394381 397743 421685 404894 394121 374558 367187 348778 323994 308046 318768 324855
14658 324855 326771 332952 320880 305746 292890 277130 286689 303116 300191 310656 298893 285198
14646 285198 292317 290969 281206 274198 295571 281794 259659 253206 254341 234973 221375 228611 229669
14633 229669 213988 199345 186175 178504 162459 182188 185765 202326 228000 269230 304033 291893
14621 291893 285750 259147 262189 288659 292760 284796 315111 376486 381831 392932 430715 446184
14609 446184 474914 477243 458775 485266 517988 600636 709638 850443 1037379 1264828 1546563
14598 1546563 1907667 2296289 2686175 3032415 3285029 3464506 3562624 3548194 3385913 3122175
14588 3122175 2796239 2427760 2052939 1734472 1441547 1154683 956168 811471 680434
14579 680434 587693 538002 510289 444359 389141 356182 325983 301196 276914 267432 276506 260950
14567 260950 242167 257394 272513 275461 260777 241120 233905 227588 235750 242012 232767 194084 176563
14554 176563 182756 198684 195709 171819 161998 156055 165328 179380 197609 186518 157061 149789 136201
14541 136201 143639 159735 150939 151218 134000 133563 125318 106039 119516 150875 148657 127716 128411
14528 128411 139474 131006 124303 157788 150214 132386 157999 189893 194062 200255 228045 217094
14516 217094 206303 190238 168703 200623 222321 203679 172989 172313 168878 163050 137024 93047
14504 93047 103388 122259 101955 90332 76161 55987 71017 93935 100652 104028 113599 127003
14492 127003 137308 124825 122888 129482 137948 100440 86965 94281 106755 108583 124229 136505
14480 136505 156664 153589 136637 119756 122287 120233 131701 149763 132452 133213 106361 90720
14468 90720 114266 127581 98924 93727 119532 152041 186245 188623 177437 147582 148716 155416
14456 155416 172207 170081 170681 176530 169464 172457 171435 173758 177022 169227 170975 184240 204107 224233
14442 224233 237424 258247 266348 258294 264140 331944 408918 489756 552880 641683 788406 980207
14430 980207 1209922 1455050 1676522 1864847 1995310 2080012 2097371 2032586 1902931 1717968
14420 1717968 1523977 1289781 1056466 873940 710382 556846 439420 390885 367713 336940
14410 336940 292840 244011 208278 200472 176871 150343 131600 134225 167371 139510 95837 90677
14398 90677 99552 101096 111551 138952 123635 116703 84869 78935 76930 48445 36860 51610 45693
14385 45693 54189 72525 72521 40560 59461 77979 102330 116614 110771 99055 105652 84244 51950
14372 51950 33139 49120 83668 68859 67572 71101 59134 82074 93423 55616 31059 20544
14360 20544 9250 15867 40588 40981 60436 76074 57069 50778 71275 80436 85033 68139 53005
14347 53005 57339 44934 52668 67712 75242 70573 56193 45505 57746 98452 131279 107172
14335 107172 84055 85373 111169 108246 91546 75913 71380 61960 74568 109338 129298 139431
14323 139431 143211 126852 135457 88213 50184 49319 60396 66677 67659 26610 20103 30184 52017
14310 52017 51854 75266 84573 71925 56147 65633 91935 103477 127861 187929 215895 195831
14298 195831 171035 169576 162855 181087 186407 184204 145246 95824 86211 100667 86984 64158
14286 64158 68186 85859 91322 101533 84083 41410 17244 20561 22943 23358 26579 25812 -1114
14273 -1114 10780 29408 24935 38323 21036 9156 15601 26911 49269 39958 45435 52808 38185
14260 38185 41142 42318 24519 18900 17411 11266 41584 53445 70950 63780 65192 64404 66460 22476
14246 22476 22499 48026 17484 36359 41950 70953 91022 74573 36816 11026 45118 43557 30455
14233 30455 14129 32197 43290 55944 67002 53909 61423 51683 28281 7484 -1213 1235
14221 1235 28317 12663 11778 32219 41595 34822 29979 33370 11334 42723 37814 32768 54893
14208 54893 63606 46583 21605 15449 25580 31016 60176 73976 85972 71030 52264 64465
14196 64465 49302 14716 -26234 -24926 14104 58413 59599 59420 66376 40464 56808 72695 58242
14183 58242 19585 -747 10167 43252 50679 35113 15712 18482 33481 18688 25427 41865
14171 41865 54836 90512 99836 65459 41382 43174 52463 64459 53142 49880 40332 30206 24754
14158 24754 42023 77747 43598 31080 56706 63037 81411 75533 52790 52851 48758 43791 49872
14145 49872 48364 67259 87023 80088 49181 29055 20046 35969 34231 53315 76013 71286 75050
14132 75050 43229 17623 35400 43207 19372 28377 936 14519 22431 17286 25582 -566 -24432
14119 -24432 -29069 -22965 -16047 -25081 -6720 4087 1884 25779 56398 33098 -5990 24239 20812
14106 20812 -3339 -3686 15421 41467 39631 33341 34477 20581 26971 28185 37202 47708 47323 36622
14092 36622 63762 63989 54611 43173 33726 9140 15006 18508 23246 -4360 -15330 -7299 24336
14079 24336 47411 33765 24041 16307 10782 35342 43899 22446 -7528 -15450 -23596 -2386 -3640
14066 -3640 -28547 -41797 -58341 -26167 617 24579 20545 18801 43580 44987 18465 19461 22254
14053 22254 45995 65526 60632 26121 34122 25650 53238 40007 33485 36828 67168 76824 88432
14040 88432 113241 114037 79465 50060 33969 41304 58773 48448 16780 7977 -10727 -12866 8496
14027 8496 34928 51962 22322 10494 29175 39738 35177 28746 7734 29343 41867 46283
14015 46283 40979 20764 4654 22635 37051 33018 34490 1441 -19735 8398 13154 14033 39324
14002 39324 73000 102801 106390 103749 114199 147800 155016 147471 139653 125347 129383 121835 114218
13989 114218 87437 89671 116928 106373 67754 32347 28499 34228 36227 45631 59185 45661
13977 45661 54042 42397 43927 59190 71505 57384 59034 63545 42745 42063 51622 43875 53921
13964 53921 56740 29991 32 -2173 -5546 -13330 -4095 7284 16519 28714 41010 29516 11095
13951 11095 2948 24834 43559 33857 31887 8285 10003 21144 26861 32394 29702 44324 73972
13938 73972 75875 52028 10093 -9815 8636 26463 29677 30869 23137 2511 6499 18023 37514
13925 37514 45939 58005 44554 26188 25814 29217 20831 33970 58005 66081 76452 100083 106557
13912 106557 113151 141907 115200 94964 97262 112002 122448 125651 150879 147762 113575 90348
13900 90348 110161 96827 88351 79887 89825 72372 69117 72946 56071 29264 9950 23111 54465
13887 54465 77392 103647 101700 79925 90294 74387 60570 73357 81025 122592 151158 164718
13875 164718 168417 201371 214097 216021 259752 252105 226784 229837 208877 201111 186385 165125
13863 165125 148855 107182 87987 108352 146414 141182 135348 128589 99835 83755 70890 47911
13851 47911 77394 125143 106268 61629 29885 43382 69197 123070 142781 175733 154630 141831
13839 141831 174944 202956 210967 213089 220325 224912 229245 246118 234038 228619 223614 195726 175838
13826 175838 181688 212106 235194 266402 296232 310211 327386 349948 370231 386880 399525 418141
13814 418141 440659 473704 487418 528806 565562 573576 592862 608269 590926 596407 612133 606505
13802 606505 579892 562085 561641 547167 521037 494029 458168 404675 377372 354039 324303 306739
13790 306739 313900 290262 289424 265851 234578 188369 150803 139514 148093 149978 139805 130124 126004
13777 126004 93185 91771 94447 91589 94587 70097 70701 74799 83287 73346 66680 68107 76734 35976
13763 35976 21673 27927 42990 45244 46938 45777 42718 49447 51659 46099 40046 44315 72632 102223
13749 102223 57770 4917 -3070 7724 27675 40116 61755 78769 89917 55352 41995 46067
13737 46067 36963 51154 67719 84130 65949 54465 46598 29336 59943 85652 65485 48019
13725 48019 35906 12108 10652 23678 32554 41240 63285 82257 81006 65114 60180 41978 6240
13712 6240 15986 17653 7659 18073 20720 30987 38184 33613 56490 61126 46495 20716 22551
13699 22551 43529 45456 54073 69859 75495 57725 62369 55029 72585 60827 46351 17366 4925
13686 4925 24588 12471 30499 64765 40981 26344 77921 128362 118068 99569 86383 83093
13674 83093 75325 74070 57796 37706 32578 23372 27778 44364 77802 75754 76620 68626 51197
13661 51197 34516 12322 5064 19394 32052 59555 74357 66948 23498 23685 46009 56516
13649 56516 48002 87040 106367 102035 103693 101271 84876 82198 85577 54514 19828 5698 28951
13636 28951 66196 85091 73913 77170 50269 18835 46294 58329 31537 28497 27484 21618
13624 21618 16799 45026 74468 85064 104885 134324 139388 113838 117700 110066 92401 95766 82703
13611 82703 82844 82167 56153 37413 40808 72684 92509 92766 108601 98043 82125 86508 72254
13598 72254 53175 66875 68070 78558 65406 58137 95565 112586 120327 119686 86928 92618 76857
13585 76857 69248 87646 108672 123138 121149 128787 130526 134198 151932 136402 116167 147563 159205
13572 159205 145492 138891 140430 100725 50991 47260 45790 81264 75987 65109 64959 80583 79174
13559 79174 88140 49474 35093 15386 14228 52514 62438 39043 41810 65094 70436 49393 60039
13546 60039 96255 124591 128217 127456 126939 118711 104030 86436 90523 95185 84696 45326 10488
13533 10488 9179 36665 44858 34165 48490 47424 36145 41041 66990 83958 82793 62722 54706
13520 54706 72220 67536 76800 65648 54472 45721 45208 52110 49045 48078 55818 52960 47320 52534
13506 52534 57843 58761 44381 21662 44474 65630 62056 61283 75174 65239 54278 53187 64278
13493 64278 39514 25623 71882 66555 49081 36554 9310 -4077 35423 50064 44543 30685
13481 30685 34476 24937 21453 25499 49470 49530 17314 4861 35309 32396 48476 52238 24193
13468 24193 4118 3875 16232 15166 25104 22535 -778 10431 25516 32620 37315 23298 22755
13455 22755 9011 26262 49914 52291 45275 33247 29564 63178 76202 58533 46440 49754
13443 49754 38963 25517 20821 21970 28748 20133 29771 39523 23247 -2544 10580 34875 31572
13430 31572 27690 9997 12960 18021 40156 69622 52517 27749 48225 35986 65163 63774
13418 63774 52160 67741 73334 68314 58353 69099 70023 79442 79445 73067 45583 23053 2239 11733
13404 11733 32437 63864 46277 21094 16763 12209 17327 59057 79520 70923 62800 37790 25589
13391 25589 42121 68522 78909 67421 51612 45993 40962 6426 -6328 -8227 18239 38124
13379 38124 27047 11405 1377 29670 71695 48582 35980 22183 39435 50853 43414 47868
13367 47868 36249 50588 43803 38513 49303 33160 16868 30174 40286 51934 35245 10075
13355 10075 9243 19194 27665 29957 39850 26211 28546 26479 13215 7510 32670 44460 34108
13342 34108 37724 45684 54661 74124 74438 62003 38144 27200 17117 19055 25270 16057 5660
13329 5660 1692 20491 40006 59208 36252 5250 9653 34021 57318 54851 31654 5934
13317 5934 20462 45950 69061 67708 62010 63141 35861 25564 38877 60990 36281 8223
13305 8223 16435 30234 52834 45325 50229 64510 67076 61165 62098 42907 45895 70243 34513
13292 34513 29945 26275 61 29750 38164 27485 33467 41232 19061 24096 35808 45628 57671
13279 57671 47435 6713 -7478 -21150 -22310 -29184 -21229 -15696 1300 38153 66376 91284
13267 91284 76813 52709 66656 33582 21498 24676 18190 8586 15354 13529 -4594 -12372 -2471
13254 -2471 20863 37321 27352 13695 42873 48165 36516 54710 30729 21243 48813 54544 52022
13241 52022 59515 60366 70256 70378 54192 56798 58929 71451 47986 42464 48522 56346 53862 14744
13227 14744 -10203 -10435 10674 53167 85568 45873 43804 64044 69003 43894 23807 43689
13215 43689 86763 84047 66296 47401 24116 19124 35264 50086 59717 54400 54235 41424 55709
13202 55709 57747 54312 40398 35746 51995 53591 35668 24842 56796 50393 28052 7944 29090
13189 29090 41542 39827 52763 76648 43811 26636 53436 46907 51975 49256 42865 53484 41169
13176 41169 38929 34553 9025 2233 33201 61027 69322 95443 101607 67847 65551 81732 98459
13163 98459 103421 90632 86740 97346 104962 98231 89269 79469 61560 70804 94516 112951 116677
13150 116677 118635 94414 69746 68236 99111 97142 93666 80359 86539 89052 75732 76286 66914
13137 66914 64299 59383 62294 56130 50798 68823 65207 82204 108314 107382 101581 88905 62234
13124 62234 75083 99299 70989 59268 82676 125236 138645 119847 104324 103606 73827 52860
13112 52860 53231 78992 108405 96158 98657 73892 78972 93268 98967 96174 68438 51125 43966
13099 43966 49327 49892 51828 50574 76922 119952 117553 116869 112659 102690 104984 108354 124684 126503
13085 126503 135803 135887 112825 98063 104387 106401 95235 87744 99457 123392 128171 133850 113657
13072 113657 104951 86319 92079 97173 120581 126054 109805 114796 112099 82186 75565 93192 95203
13059 95203 94596 107433 108970 106221 96479 122162 116536 102028 93804 116937 153742 141209 130265
13046 130265 119809 114842 97581 120115 150632 159728 158764 150225 156203 142249 109061 92597 115038
13033 115038 135782 154362 145217 138039 141243 132556 137687 145667 139186 118923 143529 154712 133217
13020 133217 123271 123400 118887 158419 181202 140370 130123 131592 118278 105556 105679 87409 83630
13007 83630 114736 157616 154997 141366 147988 149527 138054 133377 139719 125934 137619 127124 136158
12994 136158 131273 123885 149830 122758 139887 188722 215657 218205 186472 171474 186007 202469
12982 202469 193032 187534 183493 167853 147627 143752 147616 156305 141299 124441 121963 157519 173523
12969 173523 155121 160984 181643 202310 196802 178726 172424 175186 219971 209374 204276 214270 201896
12956 201896 194412 198923 193505 190403 172451 175441 201269 218941 226706 252920 245586 221140 180021
12943 180021 160402 163420 168954 168576 207331 238806 229175 212791 234360 236360 225577 215027 231400
12930 231400 220226 199512 187139 180053 185121 202875 205411 194784 214139 251324 255992 272180
12918 272180 256958 239758 252515 261231 270328 264630 264045 268423 272839 297994 269153 254643 239455
12905 239455 239866 252012 251684 245951 242032 238229 216180 206888 223762 239461 252912 256939 250459
12892 250459 257574 275520 271910 295309 302613 272262 284845 276906 268399 295751 284995 293796 292831
12879 292831 301343 273667 266704 270863 268797 280560 319749 347567 372935 350802 347702 360142
12867 360142 337273 333977 349658 345379 327727 315062 332409 354566 387819 394022 374470 360966
12855 360966 346739 347236 343148 327589 329027 358942 380939 382901 384101 381619 382992 393897 381011
12842 381011 387568 406577 415299 411568 421183 416355 417456 428455 461025 467988 445528 420305 441264
12829 441264 469502 477484 452688 491497 530902 515660 498144 504069 486262 495579 500925 489433
12817 489433 512633 542917 562710 564252 551285 521813 502428 504793 508403 525197 520198 536776
12805 536776 550262 582688 606731 607509 627035 638539 615996 631973 648274 677583 703722 709319
12793 709319 716509 744828 734762 731291 758023 757939 747375 776316 821947 873332 925563 931443 958728
12780 958728 1029067 1098470 1141917 1185121 1250497 1279891 1282437 1272518 1251544 1193440 1136067 1089394
12768 1089394 1071148 1054470 1016202 994892 949209 926756 930880 949106 974099 985500 996625
12757 996625 1007353 1005915 973094 940076 954720 954140 951093 961323 968768 975764 970122 982405 998483
12744 998483 1029982 1054810 1041412 1048746 1038175 1029942 1013527 1040983 1050273 1056453 1103264 1080394
12732 1080394 1083400 1117590 1142949 1142985 1161517 1197396 1231259 1238425 1237857 1216254 1237123 1267034 1277907
12719 1277907 1266218 1279803 1287058 1322516 1338940 1373583 1372378 1366321 1381219 1416075 1424050 1458841
12707 1458841 1471471 1504066 1527196 1540829 1558500 1588498 1608131 1635049 1657197 1659792 1668336 1672283
12695 1672283 1695013 1717277 1751937 1778767 1829705 1873442 1914358 1984588 2026851 2026462 2016899 2044714
12683 2044714 2081026 2107780 2139001 2194315 2214677 2244986 2308227 2343478 2390502 2434242 2479043
12672 2479043 2540065 2570585 2586608 2616588 2662901 2719172 2767260 2836375 2899633 2922136 2983266
12661 2983266 3038315 3059111 3085043 3137468 3184733 3233995 3294406 3355295 3401248 3455091 3496861
12650 3496861 3565857 3615841 3662493 3710877 3780621 3847101 3900453 3977305 4011077 4062100 4142523
12639 4142523 4205678 4270947 4346392 4442637 4510520 4584161 4683393 4762418 4839035 4919228 5004456
12628 5004456 5080581 5169139 5277040 5390207 5489752 5567763 5676850 5801531 5922025 6061247
12618 6061247 6183950 6309424 6431031 6556497 6710781 6871896 7016349 7156354 7308194
12609 7308194 7450968 7608191 7771435 7927779 8113053 8297135 8487119 8650312 8834574
12600 8834574 9023448 9203407 9393542 9615655 9859945 10092897 10329244 10552956 10791105
12591 10791105 11067067 11341806 11592974 11864442 12140934 12436964 12761235 13102162 13466765
12582 13466765 13823662 14150301 14495917 14872222 15274101 15692112 16117285 16561581 17048386
12573 17048386 17539112 18005010 18541732 19087713 19676631 20286386 20899624 21526996 22137961
12564 22137961 22813904 23505523 24225510 24980249 25771548 26568032 27387205 28209002 29071289
12555 29071289 29993061 30936952 31855116 32799072 33774358 34802270 35853907 36895815 37979626
12546 37979626 39060904 40145016 41234754 42312728 43427751 44546068 45636890 46708084
12538 46708084 47729306 48751527 49741281 50696660 51591456 52420283 53188370 53901019 54538279
12529 54538279 55087377 55559068 55962691 56243792 56378881 56422509 56418979 56313085 56107351 55810861
12519 55810861 55416803 54920141 54342778 53711403 52996540 52238978 51417389 50552934 49607972
12510 49607972 48642130 47671395 46680257 45605768 44551239 43479051 42423508 41423710 40374875
12501 40374875 39289663 38254761 37247647 36281127 35319968 34339111 33375369 32457720 31565239
12492 31565239 30674956 29815873 29011840 28218607 27427402 26692372 26013472 25320767 24644856
12483 24644856 24030821 23425599 22802890 22186291 21571503 20952353 20357518 19832831 19304112
12474 19304112 18758297 18260810 17788641 17334294 16899103 16457346 16042291 15667341 15269729
12465 15269729 14889057 14529083 14165764 13839235 13528488 13251151 12975060 12683075 12399158
12456 12399158 12117223 11853185 11614489 11389590 11184194 10942867 10707186 10509089 10298290
12447 10298290 10079079 9878682 9678400 9510284 9357831 9228429 9111413 8957628 8775670
12438 8775670 8640251 8483773 8344305 8204412 8026648 7834386 7656535 7489295 7338130
12429 7338130 7186363 7046583 6935538 6820249 6694476 6560281 6424620 6335656 6243514 6136231
12419 6136231 6024661 5925143 5824175 5755961 5689368 5607113 5488086 5366682 5295653 5216961
12409 5216961 5134813 5073257 5000050 4890162 4803123 4739356 4686572 4636509 4586699 4569502 4518866
12398 4518866 4455201 4397850 4338352 4259199 4219148 4170379 4099885 4045203 4002995 3979289 3948269
12387 3948269 3897781 3835190 3785435 3704671 3637662 3602824 3565960 3524531 3472562 3425873 3378850
12376 3378850 3351838 3287656 3222000 3202011 3178637 3167335 3121084 3033832 2985864 2980516 2956100
12365 2956100 2942396 2906024 2869877 2879575 2863354 2809980 2757231 2739558 2730772 2696895 2643981 2585036
12353 2585036 2598891 2555808 2514969 2510805 2504619 2503994 2505942 2484850 2420360 2361040 2343003 2352100
12341 2352100 2324503 2284587 2249090 2229578 2216898 2188338 2165592 2184771 2181308 2139547 2092042
12330 2092042 2058408 2066652 2055073 2043346 2006486 1973555 1955651 1967655 1975511 1952726 1950064 1941040
12318 1941040 1922590 1904505 1901056 1866671 1821431 1818642 1830023 1815305 1775921 1760081 1730867 1723882
12306 1723882 1729558 1723043 1707219 1693844 1671123 1629043 1613332 1600093 1595455 1587931 1592573 1593574
12294 1593574 1605351 1586127 1578017 1578986 1550425 1524526 1508442 1515473 1525706 1530476 1496160 1508399
12282 1508399 1540937 1554914 1553286 1550345 1588302 1654250 1687280 1723148 1760798 1812321 1815269 1833886
12270 1833886 1822242 1795173 1766020 1705659 1620368 1576582 1522470 1466148 1422409 1381485 1353371
12259 1353371 1333693 1291281 1277688 1272073 1265682 1237971 1207986 1187810 1173646 1169743 1139047 1120888
12247 1120888 1104806 1090980 1093973 1088366 1100446 1109165 1092341 1092949 1058947 1028409 1025594 1053119
12235 1053119 1043823 1030380 1001208 998592 995093 1000049 1000093 1015320 1024480 1009169 998164 971306 968316
12222 968316 980312 985448 983272 962257 958308 949535 934267 921113 925995 920503 927800 899693 866806
12209 866806 851025 857634 865979 861886 873751 874394 831727 794418 800254 790322 779447 788332 812954
12196 812954 790364 763323 773310 778420 764690 802457 822601 819732 796720 788317 810196 798162
12184 798162 772131 759187 734180 731871 739575 750784 755843 748716 735550 724234 726990 740036
12172 740036 756944 743552 747934 728408 705984 688012 679248 663455 663279 672395 694704 671770
12160 671770 655509 662054 699262 726917 691484 668414 677168 685372 654127 669312 678589 681123
12148 681123 675259 639657 644094 662100 648030 628428 645276 647506 655399 670468 656933 637103
12136 637103 628635 622875 607972 599292 626064 624345 617582 623759 636827 633470 598948 584576 580122
12123 580122 593033 594280 592863 592071 584816 554793 552483 551195 559705 547832 550553 545511 545740 560895
12109 560895 552278 557462 549628 540524 535667 546670 548466 509663 497275 500791 527262 522261 508531
12096 508531 499452 497121 514516 513793 495863 479931 461351 443682 453912 488808 528764 548633
12084 548633 539038 542983 517125 531923 559527 565023 561290 543071 543559 531542 523497 479320 436170
12071 436170 436902 457866 473674 454241 433094 449539 460907 481458 484195 493733 479766 470445
12059 470445 466361 468304 437322 427362 405462 394127 387715 401986 416062 429450 432065 412854
12047 412854 416913 435598 425509 402384 391339 389058 381577 393456 361415 368097 383861 375271
12035 375271 357587 361981 382496 428717 412431 393143 399483 394266 390050 403906 391507 384217
12023 384217 339208 322661 352321 373467 392589 378608 373155 354600 368805 387520 381281 358284
12011 358284 343512 350423 367169 379597 352314 368814 381986 386608 375377 368143 358872 334091
11999 334091 335094 366845 390330 383531 393898 394797 415319 390499 355300 323337 335203 350577
11987 350577 330241 314756 293346 322199 342244 335239 302706 305390 328818 326085 311632 303666
11975 303666 311177 321302 306227 295361 266618 300225 314978 312217 321335 323995 323454 324129 306178
11962 306178 301321 304310 305515 286017 272808 284561 274340 259037 272835 291602 303971 302938
11950 302938 290844 282970 283806 306933 313892 320617 313880 287766 261644 249412 255098 262767 275835
11937 275835 280665 303246 299930 281546 276294 275916 260743 267326 270645 285952 302288 334158 354921
11924 354921 340850 312239 288953 277996 268991 261878 263662 290630 288579 280891 261961 247467
11912 247467 261796 265658 273357 269470 286256 276855 257033 241165 252874 265726 268896 267971 253479
11899 253479 252099 243661 259842 278542 264507 260738 254756 253894 273937 274837 278500 285780 270787
11886 270787 240754 223286 207088 205084 223343 237543 233499 246040 249078 217524 193312 213306
11874 213306 219158 224960 233209 200373 177270 197654 219607 208743 184069 213276 228792 223614
11862 223614 190341 180343 186056 200155 220697 246340 258266 258613 224439 221857 213931 219749 269527
11849 269527 289163 290232 265956 264834 243867 240533 209171 190673 194875 192841 191814 196586 201229
11836 201229 177964 193688 227187 238740 223350 205718 213174 229772 252839 256595 249518 224503
11824 224503 219640 229565 229017 237092 225411 202626 201233 193886 195589 197769 192628 201512 196912 195314
11810 195314 206168 201665 208467 188398 190772 205261 219111 208989 196990 203651 203324 185058 199258
11797 199258 192364 184503 168380 169595 187759 190656 178320 189678 200970 203740 179358 182673 185956
11784 185956 181056 183796 180484 168531 180788 166406 171966 175983 163188 123964 108477 125651
11772 125651 137673 137081 141064 116700 126399 139210 173727 188112 183157 175215 171538 169619 155039
11759 155039 155146 148415 126101 167784 178426 162554 136604 146570 151932 142979 147198 179356 208296
11746 208296 232378 237437 208034 203143 199056 221836 213687 215636 207395 203146 192602 200766 230181
11733 230181 226949 237532 244365 246533 242480 208749 197111 184474 133921 100309 112025 127956
11721 127956 159259 183352 179489 168925 178583 171500 160839 139002 138435 150002 156044 163194 165836
11708 165836 154859 171259 175715 170662 192355 215138 209459 184663 177006 142904 114501 107979
11696 107979 128453 150468 145053 158197 151569 152971 145591 134494 141758 166256 172667 173444 159250
11683 159250 160311 126044 96664 120751 112610 101180 101007 114108 107868 128159 143317 133181
11671 133181 134973 134353 147411 159005 147415 128764 124023 119717 110885 117805 141687 130130 133485
11658 133485 131902 127192 131248 120352 124266 120808 118293 148284 136284 123676 125762 143527 149055
11645 149055 161258 166031 161203 161958 147649 125833 122390 124196 117993 103504 91108 106763 125806
11632 125806 134892 119028 123439 111048 115512 101343 103029 112910 121449 124506 112166 82596 73742
11619 73742 89323 117963 159110 154814 147446 154960 158090 145551 129961 155468 158472 167087 182078
11606 182078 154204 133194 139394 132036 122738 118903 106966 118051 132718 118545 104302 103118
11594 103118 85519 71380 62196 81826 83226 82955 76124 80299 93873 128386 146291 143623 157812
11581 157812 136189 107189 120071 146930 148258 146529 142605 130616 137610 128640 115400 132902
11569 132902 127725 111009 104822 124717 123377 88281 75592 87014 94381 115223 123197 113249 102123
11556 102123 100022 102326 117426 131625 116455 89338 94374 102901 107404 111384 113492 83993 56653
11543 56653 65164 79772 49265 43026 38512 83476 114809 134361 139691 100222 90717 86830 77848
11530 77848 86248 88427 109422 118629 104621 87843 96330 91425 71263 55941 70163 94768 79872
11517 79872 74696 82338 104118 101275 69591 67238 74355 91585 111074 118503 124039 119429 102798
11504 102798 99778 108064 115488 102579 101002 87230 50554 78525 76011 59225 54972 80944 88429
11491 88429 97848 111553 104852 70058 91642 97396 107147 113829 103243 114425 91868 103484 125345
11478 125345 100286 82749 76480 81452 82363 79956 78262 90746 89535 73947 73243 93183 110738
11465 110738 117681 119318 124006 116781 101979 104273 79251 68352 94582 104353 97268 85513 82029
11452 82029 87765 102757 80799 73747 91874 102269 105733 111611 124740 107398 105596 116324 99256
11439 99256 90131 130698 113241 90065 100693 68225 43193 59594 74501 97597 100891 69705
11427 69705 34683 24739 61830 97503 110916 109408 76632 86401 83670 60998 80962 100389
11415 100389 85282 95702 105533 86738 75626 80139 86878 97450 91179 78409 79897 91033
11403 91033 92289 75542 69642 63895 77184 101053 110216 100321 90412 101901 114034 120392 104556
11390 104556 74050 72858 69015 46953 39020 48786 46327 58571 57681 51807 58636 60545 64172 58537
11376 58537 17299 20755 37534 63517 93309 74426 68837 93635 106819 107183 89369 77674
11364 77674 81424 92157 88582 100677 100080 86061 70265 70866 81111 100299 86528 70404 88181
11351 88181 88756 115486 133862 130863 136434 127125 112821 81334 60850 63300 57837 35488 43158
11338 43158 75619 78428 59720 28647 23833 24511 25258 45926 49392 30691 45438 62225 68513
11325 68513 57182 60544 47311 58462 53204 41416 48675 32685 50804 76027 73714 61809
11313 61809 74335 69489 47678 49509 53670 36100 53883 52442 44336 39096 56436 65116 61197
11300 61197 90965 122357 136126 115317 95400 81278 59417 61332 68543 93485 78627 50589
11288 50589 34470 29823 31872 29555 56475 87280 79641 76493 83347 87289 55001 51306 45049
11275 45049 62690 76631 20325 21490 22210 24970 48852 60165 71048 82500 72449 71243 39133
11262 39133 22528 31892 30118 63249 90666 84355 57149 50856 68980 80708 60391 73430
11250 73430 99691 108169 142310 139483 94474 61582 57942 45977 46900 37268 20000 23301 39666
11237 39666 31084 8265 4284 3416 42873 84090 83053 91306 85286 73634 92781 82260 53826
11224 53826 20224 9005 32930 14762 22727 54584 77689 99359 104574 86951 80063 123090
11212 123090 137738 152888 145612 100013 63014 50351 58822 46130 28100 55333 81198 66362
11200 66362 42405 25043 25883 12750 25275 28690 58319 88952 95485 95687 76461 56402 53826
11187 53826 61227 74943 56168 34589 47864 81359 98132 89898 68484 41489 46340 49634
11175 49634 35064 39683 50556 65629 81587 99353 76717 71416 59634 51412 62931 50581
11163 50581 30801 18832 4145 30080 57046 58725 66920 64695 84345 97480 109587 107672
11151 107672 63157 36119 19630 11518 54207 46944 30416 17213 -1492 6377 3647 8517
11139 8517 18453 33562 25256 2862 23449 56207 78637 57934 65462 69506 72412 75554 50346
11126 50346 21940 14031 39548 84789 77178 72549 78829 41582 22680 42153 51002 46847 40261
11113 40261 31610 40418 42399 35277 26494 50810 59705 42400 12966 38264 54474 78887 87568
11100 87568 91808 72163 67641 88241 80854 74253 56109 55834 42195 18386 45455 44337 45926
11087 45926 82203 91781 66924 60608 59319 36339 35331 73999 88841 75901 65067 55609 37968
11074 37968 26202 28789 15179 15131 44366 69845 104373 104714 38120 1426 21488 40562 63039
11061 63039 43364 17636 37302 62432 37584 24575 44309 59533 48337 27785 27173 9040
11049 9040 -12920 -17056 18574 39262 26470 25809 19371 25045 17025 21748 21779 42534 69707 76558
11035 76558 45486 19520 23858 35605 27822 46097 86341 83558 54566 23912 9346 21385
11023 21385 48888 41945 35002 30826 41480 37679 48146 33131 -7236 13883 26435 28334 39295
11010 39295 50764 52876 56981 51846 77695 99234 105748 93978 91883 93119 70999 79437 115221
10997 115221 101257 80523 60383 62184 91985 85749 42732 25668 26792 14864 2492 -8134
10985 -8134 11243 17256 9102 27315 34485 40985 45086 68318 88890 75623 63951 75749 64778
10972 64778 67348 63563 53338 59212 50837 22497 27078 49689 29910 23606 25337 16476 27530
10959 27530 37363 42684 48710 64781 64591 40228 36778 24226 610 -27 5600 -14271 -3727
10946 -3727 26812 38432 29853 44539 75163 75361 54050 22048 26244 8230 13944 51221 57561
10933 57561 28919 50352 39539 27341 20468 59063 44964 19328 35344 72438 66163 37888
10921 37888 39188 44808 46912 43271 71527 70543 59506 23436 5783 13596 28205 34448 20638
10908 20638 9517 17347 45673 53048 45695 68936 76688 71855 97622 88967 84123 77185 77190 59728
10894 59728 27652 -2753 2151 -10202 1324 -6090 1154 5009 36406 41385 33662 25209 28534
10881 28534 70576 68398 49492 14414 10808 31533 42323 21223 -5930 22233 38257 27537
10869 27537 30156 33989 28044 30239 16047 14505 26632 58630 64199 36263 32771 13681 23547
10856 23547 37869 47839 45380 47560 42933 39964 32921 27043 39293 35063 39131 51902 44541 18583
10842 18583 13407 13019 1658 28144 38493 50961 57930 58635 52538 57858 69257 55479 50698
10829 50698 37612 34978 37597 45268 82550 77380 59375 50451 66028 51852 53508 69651 50009
10816 50009 7776 2925 9445 11614 10428 23929 37265 21275 5302 -1577 -22072 -13563 4883
10803 4883 13534 10258 9533 23225 28352 45251 59173 21921 29282 10841 24979 50725 82777
10790 82777 77254 50798 39596 23355 -5628 -7099 -1772 -8357 10116 45655 57531 30321
10778 30321 14455 31057 28648 31778 47597 44258 2283 816 26348 25075 4747 14276 34696
10765 34696 35551 2582 2608 45621 62705 61286 88983 68252 38288 44059 53637 58535 51982 29583
10751 29583 25677 10770 -4409 -3809 -300 11845 20283 40027 39291 22187 72770 99326 90116
10738 90116 96648 88503 80005 90920 68777 55160 66506 81992 94747 79863 44174 24298
10726 24298 8050 22264 70708 84130 59084 37741 40410 23645 21265 50061 73545 83422
10714 83422 83073 92088 65691 25972 34086 20585 35220 64182 34715 12120 5374 19177 26260
10701 26260 14769 -14930 -6944 15835 28979 20830 44279 55540 38662 49458 85638 69774
10689 69774 28947 9861 2085 -5945 453 21319 -7851 -41952 -29494 -6698 18550 43763
10677 43763 62666 56267 36688 29686 22618 28179 375 -12924 16277 713 22783 59798
10665 59798 51009 35770 25860 33408 12507 -2804 17630 40597 41465 48669 66019 45746 28456
10652 28456 22855 17734 35552 63788 70641 68921 68888 45052 13620 12368 11532 -8828 -20757 -15848
10638 -15848 -1049 -9002 5365 32647 41296 17338 13530 25578 37827 28141 31292 31298 1282
10625 1282 -3084 9685 34868 59906 45438 2305 1040 28210 29983 32588 59210 60343 59137
10612 59137 42733 20088 3091 -5350 -27802 -37484 -23876 -14705 -24240 -7362 -25833 -17729 -3524
10599 -3524 1373 -24129 -30136 -13971 -13929 -16 24203 51881 39118 26197 -1138 -5909 30663
10586 30663 24936 15843 24593 18360 -6123 31168 56139 63550 52020 62016 72643 71157 64197
10573 64197 76620 85022 70960 65331 67130 66511 46710 18058 19383 10622 -15698 -25203 -2116
10560 -2116 -1551 -10175 4460 8078 27169 37747 41997 60992 70895 72946 72806 40752 26459 11176
10546 11176 17501 38602 34654 11153 -12062 -26009 -25968 -52055 -46471 -28693 -29723 -37741 -11987
10533 -11987 21171 22099 19888 18924 29692 27084 17680 1464 18612 20712 14845 15043 11754 5922
10519 5922 31755 30303 -13491 -23257 -36063 -24169 -19813 -21584 -2969 4797 2094 3903 5797
10506 5797 23464 37435 30850 -7380 -38013 -16822 11710 34739 23235 4553 25226 37400
10494 37400 49138 30819 35376 15900 2586 18668 38059 50496 53575 41762 70681 70904
10482 70904 50515 39420 15227 14237 22342 29768 33366 22628 -16987 -11456 15635 16862 30574
10469 30574 19735 4358 25635 25266 -6171 -7594 1276 16259 8882 25824 33506 2029 15016
10456 15016 11120 14532 24211 30900 33635 38353 37260 64099 109274 89175 58882 48749 36415
10443 36415 -11511 -26275 -33916 -41856 -39154 -39909 -26655 -14357 -23883 -34073 -24388 -20678 -15863
10430 -15863 2327 12155 15330 23473 25260 46324 36985 42222 66529 75629 75259 50034 39650
10417 39650 18137 -9134 -29207 -13383 12035 16968 -15718 -35324 -32594 -8984 23705 13447
10405 13447 16347 22735 20314 -7726 25805 59868 50739 23655 9123 2997 -16199 20505 47548
10392 47548 54380 58282 56547 61521 57883 46858 54799 62060 37669 18226 42348 37356 -15186
10379 -15186 -13734 1258 28191 40721 59288 21550 2214 27722 25299 -2850 5901 3187
10367 3187 -15985 7738 19908 6176 9083 23660 34971 18848 40902 24923 4693 21882
10355 21882 41492 59527 18019 28560 44443 46322 46473 31602 7413 703 6531 -8260 -8879
10342 -8879 35548 49627 42611 9268 1273 26907 22937 22003 19559 32411 30399 35853 31120 4873
10328 4873 8226 39678 45931 32092 14523 16850 25260 28838 1634 -1016 8021 20219 52197
10315 52197 52514 49260 53219 25640 27274 61342 49992 40353 52349 74484 73039 76551 74578
10302 74578 54259 67309 72877 71030 72152 89843 45896 5047 -6018 -24738 -16055 7849
10290 7849 22334 12458 -174 -5779 -5693 -1366 30600 75075 75008 63265 40481 26232 35507 62948
10276 62948 56910 32510 39360 26757 16851 8428 2380 -6956 -5542 20873 63349 81657 77528
10263 77528 69796 36643 -5612 3832 32815 5484 -43958 -66960 -64177 -34579 -19602 -45684
10251 -45684 -31764 -16884 -4376 -15972 20003 31789 22778 34382 52871 84787 61074 38954
10239 38954 26577 34897 31683 31071 40791 36229 17153 -3789 -45348 -40172 -32409 1458 34441
10226 34441 24065 34855 36837 4071 -10842 -21536 549 8568 21567 7190 -5198 16246
10214 16246 54603 50125 36867 32247 40352 52282 56823 39121 11451 12283 22872 32651 58430
10201 58430 58507 40088 20549 19531 34960 16570 14696 -2178 3862 10969 6938 8559 25978
10188 25978 17955 29425 25989 40249 19507 21671 16532 5137 6447 7188 13873 28609 47300
10175 47300 16936 -16929 -31439 -30729 -23909 -22535 8458 -17483 -14214 8965 13521 5231 -7486
10162 -7486 -10021 2242 -7632 -4069 5154 7502 -9256 -8130 -22309 -25448 -25747 -11089 29025 44986
10148 44986 57880 49719 40993 20605 2152 967 -4766 -9943 8088 6906 -1003 9651 36017
10135 36017 45901 71985 85171 83073 71455 44450 30071 17134 14948 13673 7990 20334 30984
10122 30984 17816 14489 14920 32607 56666 30678 16766 41898 47905 38153 18900 13841 22378
10109 22378 18525 26219 38998 21507 45000 41665 48672 55604 62517 50263 54817 57367 64171
10096 64171 58841 52123 53230 32653 6060 24390 26738 42262 28678 14666 15599 25810 29114
10083 29114 -2059 -9996 7270 -23205 -21205 -42600 -57970 -34075 -4987 -910 22267 41915
10071 41915 48023 35510 11169 22178 -4991 -3827 8153 23467 51703 54594 42682 43358 50872
10058 50872 46581 32690 51017 73700 32907 18418 23001 24339 50962 73992 85761 67421
10046 67421 69472 61126 34112 14680 35259 37853 32241 -1289 -28081 -20377 -107 -32739 -38020
10033 -38020 -42822 -32921 -24492 -23373 8111 27219 37768 12638 1698 38047 54398 65113
10021 65113 69880 86354 95031 79360 73167 72316 76765 69341 34886 16714 25849 43349 54726
10008 54726 32044 28745 39073 23906 19250 52256 74642 75097 56702 37298 25267 40198
9996 40198 47233 27152 22877 -3884 452 -1387 6795 29834 -1264 2107 6736 11612 -1593
9983 -1593 13838 11685 -16788 -10049 25660 26110 51559 56061 53690 44569 78754 96925 94216 66559
9969 66559 66481 61983 68094 68586 38916 41569 56659 80854 62354 53226 64568 84278 82532 69164
9955 69164 81130 82684 80791 89558 85596 69160 33790 10590 21885 51666 58839 42980 47346
9942 47346 72395 65283 45613 42832 63472 57530 75595 72275 54326 63735 89804 93967 99348
9929 99348 125057 118983 109175 91024 91899 115960 119644 134726 121019 94115 77429 86053 98478
9916 98478 113484 128893 121898 130782 156412 147434 157826 128411 101092 131488 140519 162880 173810
9903 173810 153052 134399 157238 165789 155709 157966 169407 149438 144236 172516 175852 149274
9891 149274 128244 138209 150956 152633 173641 194175 216056 188863 183842 205225 229351 237360
9879 237360 250756 260868 226819 231975 238064 198990 197822 240869 246069 249335 257427 240503 249415
9866 249415 282599 308969 334319 367490 377335 369017 374000 374678 391628 403277 387705 380226 377508
9853 377508 392336 395491 402194 418034 440254 472869 499919 559997 577525 598505 603012 603399 629823
9840 629823 654111 638658 624642 631779 661855 686344 727324 765847 797815 839405 843702 856341
9828 856341 892337 939124 988146 1066611 1116009 1142603 1180854 1207582 1242363 1320670 1402424 1437441
9816 1437441 1456408 1494778 1546489 1619672 1699079 1768161 1850898 1960912 2054898 2129991 2233374
9805 2233374 2313541 2429021 2536557 2629313 2766186 2888090 3011434 3125822 3258021 3403567
9795 3403567 3518578 3645414 3762967 3843362 3942586 4072754 4208089 4295213 4373741 4433541
9785 4433541 4466232 4482597 4490176 4485124 4463873 4440998 4385815 4310697 4210643 4126787 4040741 3941294
9773 3941294 3833628 3700990 3594140 3466922 3341018 3232647 3105001 2982531 2838366 2712267
9763 2712267 2619895 2536117 2436791 2349578 2283317 2167565 2088410 1998710 1903946 1839321 1771299
9752 1771299 1692525 1614196 1551256 1498458 1473181 1418445 1380524 1350480 1295421 1227910 1151297
9741 1151297 1120763 1102215 1071789 1048199 1010181 971174 937299 905714 860054 819690 809255
9730 809255 807721 799714 792739 765714 744445 702791 645281 618184 596586 591288 594293 571191 551004
9717 551004 552351 547455 528233 505706 476295 461310 451190 463649 500462 482694 447503 448597
9705 448597 454018 459330 415059 384206 377118 395440 376166 366678 366595 345138 343001 332237 350872
9692 350872 379852 413171 399665 356068 344027 331587 307446 307518 304613 303452 313527 306690 299637
9679 299637 299585 255188 230541 217661 218137 233601 251042 285751 277250 233982 182287 185844 198635
9666 198635 196016 194371 226148 225553 207232 197452 177689 201201 203879 211854 210478 197537 206266
9653 206266 188439 167228 161737 177013 181850 175276 164191 151533 146094 145881 133639 123504 135096
9640 135096 126166 130159 129808 145216 147901 156891 180808 156676 118375 108062 133904 134884 126292
9627 126292 135664 148217 147546 106010 80118 84354 105743 108875 119127 117118 101006 111979 124411
9614 124411 140025 140204 133834 110626 129205 124009 122850 127332 139886 148216 116666 87413 87926
9601 87926 112434 121455 101622 88770 78394 83921 78006 91256 78987 65261 81030 82995 70755
9588 70755 68577 71798 107958 99466 93699 74740 71915 76568 77023 80314 96087 117571 96159 96201
9574 96201 104746 110709 87577 65151 26769 52093 49227 36555 57657 82635 102044 97910 105293
9561 105293 101692 92670 94791 81764 88885 85376 70074 92857 116353 120132 101454 77548 72462
9548 72462 78706 73583 72211 66724 76919 111559 89964 60330 60133 59449 68032 72107 70201 90243
9534 90243 112992 96264 99331 107398 124423 127125 87364 86957 83283 80373 69071 86422 64334
9521 64334 48419 57919 57977 43162 54594 78921 92431 91224 105672 87327 28937 39671 51173
9508 51173 61311 63145 56484 68653 96595 106080 111130 103625 96642 95723 80803 36968 17375
9495 17375 48309 64160 88883 109513 120280 125740 104902 87553 75158 75050 67519 81994 107934
9482 107934 119821 116707 108666 106119 86174 86008 101362 106111 90167 88491 86557 89400 100262
9469 100262 86404 65482 60940 68452 88759 91537 76788 87169 63782 59077 89781 123641
9457 123641 105924 72980 66699 67826 78511 66113 74647 80603 84210 82044 68197 26732 22449
9444 22449 67363 109418 108948 80522 90922 83805 96001 111413 115793 102745 102917 100718 80791
9431 80791 74620 71662 71505 50761 18163 -2324 5348 3773 9153 30371 74902 86715 62875
9418 62875 30710 15487 32425 44277 48416 64284 40399 14487 37400 72743 70320 46541
9406 46541 21683 21297 24395 14313 16984 46285 53678 50609 27144 4847 -858 23815 45830
9393 45830 57910 81510 54253 37439 41559 63101 85064 70754 70654 57681 80950 99708
9381 99708 81441 56729 54133 68860 44400 45399 46814 52470 64197 61170 53913 47813 34224
9368 34224 26421 48920 38314 50065 46471 14604 25965 21001 4020 -1950 -3358 676 27723
9355 27723 55549 61708 52528 53139 59730 57705 48442 17521 -2302 9538 12891 2914 346 -8316
9341 -8316 1937 -6930 -6477 10514 20194 1966 -2835 2250 10051 28253 40636 42727 13970 -12972
9327 -12972 7470 13569 11649 8572 2567 13454 23295 21765 21186 40278 41361 13438 29768 63689
9313 63689 59052 61295 35832 15828 12843 1678 4522 22450 26813 12779 16271 27320 -3964
9300 -3964 2191 1565 -27449 2360 33921 36368 42265 15680 2563 -15912 -1103 26754 44634
9287 44634 39211 30838 25711 16112 1722 -2796 13782 13289 20148 8786 13768 33214 26029 39278
9273 39278 56028 41767 21950 -960 -8568 1050 16910 20696 33188 19973 2507 24833
9261 24833 14086 -13099 -36520 -23162 1025 2287 464 3722 37938 46992 32560 26768 20055
9248 20055 14361 25483 26221 847 23967 31093 29045 50111 60841 52964 54343 28935 17553
9235 17553 15614 29940 39503 41488 45086 40236 24847 20690 26282 35516 56228 59997 27386 -9154
9221 -9154 -1309 857 -3013 62 6290 29415 34655 20430 18669 41197 31186 23415 34568 34941
9207 34941 37302 -3567 -29155 -19404 -30849 -24437 -13098 -13044 -3063 -6210 9518 28690 6260
9194 6260 -1528 -2046 4326 -6541 -2874 10865 612 -31640 -58531 -60717 -46035 -11426 19793
9181 19793 -538 -15587 -8953 -34365 -14304 25516 3873 -13192 382 -6995 -29803 -18519
9169 -18519 -14519 9584 18382 -3000 7374 39361 37880 19216 -17091 -41393 -57008 -59278 -42145
9156 -42145 -553 15884 13292 -2888 -1328 14012 37943 19560 23285 21932 11323 22103 37048
9143 37048 62264 51389 30139 35485 36052 16533 6633 6559 -11697 -12472 -24640 -13954 -8074 -5874
9129 -5874 -8513 -31815 -41383 -31906 -26354 2389 8258 8621 -17428 -14654 3209 -1036 -9854 -15954
9115 -15954 -24738 -48685 -47950 -44535 -48742 -39601 -25137 -1654 12242 1507 7013 24575 13432
9102 13432 -5068 -13652 -7487 27173 18881 20330 7199 -3591 -15544 -34370 -30018 -28687 -7459
9089 -7459 -2300 -24660 2435 12466 -1476 -5158 -4348 1 -3359 4100 2473 6329 4723 -3113
9075 -3113 -11361 -6495 -112 25290 57387 49651 36033 31282 17463 22136 15302 -5286 -11180 3450
9061 3450 7403 593 -3898 17373 28229 32709 10662 -1048 -14297 23739 49107 45995 36406
9048 36406 23482 10205 151 18003 42972 30580 26490 24263 9472 35486 40018 18416
9036 18416 2771 17782 46936 65074 56930 33979 20922 6363 -921 25845 69143 50269
9024 50269 1647 -43047 -39991 -30664 -7359 15578 27299 37668 48252 27640 10801 25071
9012 25071 32069 16528 12323 7890 10153 -23004 -40526 -28478 -2662 12427 7988 -3550 624
8999 624 19563 15734 17388 5898 -3619 12506 25433 24042 2671 -27887 -65375 -43949 -5511
8986 -5511 -1786 -6752 -5638 -3852 -2657 -18066 -19729 -10253 -11306 -24333 -45997 -46103 -20705 7630
8972 7630 2297 -16063 -32490 -34457 -54546 -29052 5031 9016 40629 32541 5743 15023 16878
8959 16878 14537 10348 2206 -2632 -22939 -19818 5772 7872 -25974 -33687 -2328 7624 6339 15655
8945 15655 13447 -9162 -21736 -22068 -13042 -20581 -2742 12353 -6683 -13049 -4639 -15916 -24198
8932 -24198 -917 17361 40701 83033 63589 37094 66818 59680 47194 18022 20921 20993 -20578
8919 -20578 -21577 6107 8707 11500 15685 25265 33846 13521 7503 15587 17244 12743 6320 -22552
8905 -22552 -19615 -20177 -17793 -25613 -53567 -50420 -42941 -23137 -16447 -40351 -55387 -25852 442
8892 442 10020 2735 -17981 -15176 -29805 -20132 -5097 -26602 -51408 -64108 -42590 -23293 -5305
8879 -5305 10312 -10142 -17489 9347 19244 9166 8624 4732 10197 8222 -7137 9362 13006 -8840
8865 -8840 22766 37185 25608 16818 -5729 -7089 2957 26096 14373 8469 16486 29180 22047
8852 22047 31624 32340 26601 21409 17074 18065 28998 42447 32535 16159 23123 29374 27069 36055
8838 36055 25409 -1369 -18713 -9041 7157 12666 10174 -6365 -33924 -27994 -34806 -16188 10126
8825 10126 -4866 -9475 -12417 -22880 -12513 18098 11887 2429 8576 13359 38112 40288 36452
8812 36452 55600 28861 5385 -10448 -2999 25961 40719 11020 -13916 -35257 -48900 -39375
8800 -39375 -17948 829 6095 -6787 -22241 -16103 -8861 7871 17736 16725 -16235 -26540 -40752
8787 -40752 -49874 -59144 -73702 -49839 316 23658 16277 12226 -16127 -43926 -69122 -52863 -47948
8774 -47948 -59762 -54209 -36236 -36994 -49832 -44185 -40993 -37752 -39728 -29694 -5079 9916 9053 25988
8760 25988 6485 -4387 -31171 -45638 -34149 -3788 -9940 -7687 -15039 -8269 -13731 12886 14208
8747 14208 -16298 -7530 -3442 -10196 11814 10130 -10984 -4021 7122 17937 5079 12141 15860
8734 15860 14826 -1977 2645 -5035 -23577 6039 30622 29176 7254 14386 24604 23369 15160
8721 15160 11210 23601 27339 22899 9267 -15395 -30184 -1110 -5065 -14631 3584 8616 -26931
8708 -26931 -12949 200 -22089 -24757 10720 6076 -22499 -23502 -12315 2118 7593 15613 43464
8695 43464 43932 14999 13275 2393 -35030 -25505 -30243 -16203 -5697 -5688 -24485 -1508 23508 9050
8681 9050 -19114 -17581 -29030 -26703 -25814 -40632 -42469 -41616 -21984 -13038 -2571 10964 14471 12213
8667 12213 31832 24753 24781 43554 48599 29612 14647 13080 5948 17 -15692 -17019 7845 7904
8653 7904 34408 47130 41496 15713 -6041 -34751 6963 41013 13530 2329 -17366 -50965
8641 -50965 -35949 -12834 -3884 -11435 -17015 1617 10664 -8390 -22548 -15499 30598 41576 53140
8628 53140 57837 43888 -2990 -27884 -34534 -10062 -20271 -19769 4061 31078 14474 24765 41080
8615 41080 46278 58094 62676 63428 76039 71945 53780 31317 38337 50610 44911 24162 10199
8602 10199 25147 21373 41245 54205 45561 57642 63347 64455 60711 72478 89137 65856 70710
8589 70710 91578 116174 158621 260940 445522 684992 692877 607476 533621 446716 382779
8578 382779 313933 263051 220081 174092 123245 100120 61553 29568 -3506 9778 44456 49882
8566 49882 71034 95829 61462 49311 46091 30952 16598 12686 33724 61070 42597 28283
8554 28283 31135 34916 22646 21040 54706 83646 96012 106134 142626 199116 225192 309977
8542 309977 451018 713363 1157145 1409337 1248710 1031433 897062 781003 573259 405939
8532 405939 308390 238144 193886 153679 144746 132083 145526 142828 107467 96895 113612 115521
8520 115521 132925 108268 83172 100458 106513 103108 82058 52668 75252 105821 86081 69615
8508 69615 69423 49203 28356 44602 40621 46745 64131 82855 123873 159198 211314 299257 461073
8495 461073 661665 691833 584503 509005 479587 377151 274259 200892 165291 141198 112518
8484 112518 77205 39930 30573 61497 78798 64625 47756 55529 71303 94188 107708 100058
8472 100058 68209 45566 35151 42885 63411 68461 81229 80379 65335 40823 35325 32382 56172
8459 56172 66053 53702 27723 23179 45450 9801 9568 1692 17261 19875 15745 10614 29710
8446 29710 27581 -2193 -4001 19838 39918 24471 15421 29710 26804 18393 8612 10733 6623
8433 6623 21909 12843 -25370 -35122 -7172 17682 25546 27004 26369 57336 56808 2608 -41444 -36218
8419 -36218 -10348 -5763 2283 11342 -9633 8612 -6745 -21378 -30237 -29244 -7718 -3839 11978
8406 11978 29232 17449 -83 -3153 7599 22905 4035 -822 3031 27119 5279 -23333
8394 -23333 -35280 -18032 22992 19652 5835 -18791 -35685 -24341 26917 41238 48419 43266
8382 43266 29202 -11243 -6396 7045 23485 21337 8797 28099 16178 -13734 -26678 -16898
8370 -16898 -5262 -11888 11338 23093 10268 -15353 -27018 -32114 -33033 -20677 -1707 -7530 -21450
8357 -21450 -19631 -3432 7138 24562 20829 2320 -3939 -541 -24875 -36998 -33546 -40927 -40487
8344 -40487 -18424 -21237 16043 7292 -2954 -20219 -28654 -15120 -30204 -55477 -59016 -62402 -54840
8331 -54840 -45632 -18213 417 6322 755 -8115 -18893 -37382 -46626 -25469 8495 38926 48809
8318 48809 46191 48866 28723 15308 1666 -21822 -13199 19358 15003 -24666 -36934 -29790 -25639
8305 -25639 -3148 9941 -1351 3316 17284 24139 3614 -21283 -27023 -48623 -18360 -2540
8293 -2540 27602 37959 33611 -4714 -37756 -43103 -72430 -96785 -87121 -57954 -52227 -47927 -37070
8280 -37070 -24634 -24404 11619 34404 21032 -2432 25955 58313 45355 3180 -2143 -35985
8268 -35985 -53706 -49314 -22428 -13916 -7192 -18204 2933 27569 36764 11313 -4973 -11696 -14109
8255 -14109 309 9976 9353 -391 -4310 -22373 -47790 -34043 -14005 -7337 3555 8430 -8656
8242 -8656 -3836 462 20800 38144 20747 -3575 -13446 -13191 -7239 2591 16989 4268 -11918
8229 -11918 -28252 -14308 1162 -50 -12228 6560 40652 39205 29094 22151 -7653 -4281 20774
8216 20774 43482 33789 25986 26899 13550 16036 13303 -15854 -7502 15174 59297 58894 13125 -10863
8202 -10863 -15186 -4102 6583 41842 58278 17174 14736 12457 -309 10089 19827 25666 11788
8189 11788 5455 -12305 -39818 -35171 -11168 10757 11624 9583 -2156 7545 33476 29193 14710
8176 14710 15767 38081 1410 -30720 -40459 -23053 -24398 -35534 -37509 -22572 -21410 -34934 -17779
8163 -17779 -3068 13695 26928 44045 58702 47259 52629 41656 5806 -31756 -38504 -48041
8151 -48041 -47478 -27520 -17487 -14400 -24913 -33535 -40580 -55958 -43265 -7860 -3021 24734 41624
8138 41624 1264 -23176 -13001 41823 40688 18202 -5585 6715 25820 7427 -13562 -27732
8126 -27732 -21710 -19246 -10422 -10539 -34093 -58396 -48276 -25314 -24444 -38541 -38004 -23119 -42249 -55201
8112 -55201 -21462 -2755 -26047 -36607 -21839 -1036 3031 5155 -15221 -28718 -25121 -14325
8100 -14325 -12687 91 9399 -16306 -20479 2447 13975 27479 14395 -29641 -34828 -18211 -32478
8087 -32478 -38869 -42065 -40906 -22542 -28938 -44079 -40640 -40340 -15432 2669 -14453 -5412 5008
8074 5008 -4044 3036 -3146 -23152 -15556 -16918 -23492 -41874 -31063 -15891 -15514 -15014 -17398 -34800
8060 -34800 -38729 -7373 -16024 -22349 -360 2602 -14652 -35174 -26227 -15733 8573 -3664 -40552
8047 -40552 -39335 -24200 -21605 -24611 -8328 4357 3099 -5535 -4556 -18216 -7797 51 -3255 -7752
8033 -7752 -3961 -12136 -20136 -344 -2614 6782 4235 698 -4916 -5041 -10005 11410 15434 -3693
8019 -3693 5712 16240 8720 6368 17452 11677 -18588 -13792 3979 12346 1458 -1594 5284 -21723
8005 -21723 -21545 -5321 1275 32792 52207 30306 -5675 1114 1340 3681 -6896 27993 42103
7992 42103 22655 14239 -1477 -6532 20814 29577 10934 -197 15133 26890 15670 22575 47293
7979 47293 38579 28674 15183 9528 20159 23195 24043 20655 22063 22660 29530 14721 5525 22088
7965 22088 38477 40647 13597 23705 36767 34983 30648 56586 61661 37372 8793 -12315 14187
7952 14187 28166 29877 27270 40749 35844 -5123 -36027 -30138 -6286 13221 25524 25086 27930
7939 27930 815 -82 414 10255 39299 41027 32605 34975 42158 1819 16045 18854 10167 21892
7925 21892 15985 -30853 -65551 -50307 -48486 -26608 -21862 -18134 9790 7929 -3472 -21089 8629
7912 8629 33966 51053 36468 27781 28746 16183 -10677 -18237 -42126 -22401 -7067 8346 1361
7899 1361 30385 48176 45174 20669 4373 -19252 -26211 2237 25392 23207 23372 25651 21554
7886 21554 6999 -11958 -16377 -15173 -23113 -18501 -4872 9609 15876 29557 21129 4174 -9745
7873 -9745 -486 19870 28874 -3265 -22249 -8738 -14797 -34797 4525 19234 20282 29457 24994
7860 24994 -1115 -12436 -24036 -15161 15265 38251 5385 -33927 -30850 -27046 3276 5766 15570
7847 15570 12105 19115 24644 1831 -46872 -50472 -9434 10058 1731 20532 14634 -708 -373
7834 -373 -37604 -48263 7878 -278 -27742 -32418 -18176 10308 10217 14452 8976 7954 14239 18782
7820 18782 31868 39647 10767 5365 -20170 -29304 7852 27636 42985 28249 18628 3322 994
7807 994 8721 -12632 -40262 -20688 8817 18289 20958 5575 -19971 -11810 7822 19670 6143
7794 6143 5009 -7207 3394 -3176 -9118 6555 2096 -6889 -17016 -2028 20011 12804 -4677
7781 -4677 -8879 3152 30123 32129 6855 4265 18870 14866 49684 46858 12004 -8394 -9039
7768 -9039 -25851 -14665 11276 33649 35068 34645 59930 77749 43145 -3240 -14952 -51140 -60392
7755 -60392 -47378 -31189 -35131 -25974 -30153 -51330 -48465 -37654 -10755 -15697 7324 21725 11548
7742 11548 15005 -3585 -15931 -24378 -17745 -14428 15361 34911 23233 -10172 -4974 32486 32183
7729 32183 20621 25259 21105 -8162 6571 -14869 -14963 -6363 -27189 -41167 -8743 8530 28934
7716 28934 31561 7367 -5976 -29903 -9013 26766 9645 4011 -11621 -12436 -7263 29411 20768
7703 20768 5131 7773 -31812 -51012 -37171 -14182 10 21454 8669 21633 23029 29470
7691 29470 15897 -17629 -34250 -31522 -20997 -7205 -6762 -27891 -17193 -19389 -10354 -523 31934
7678 31934 21823 -19134 -47455 -40203 -25640 -22277 -10830 5131 6075 -4548 -5449 -37378 -27026
7665 -27026 -17806 -8627 11193 45629 30919 26318 21415 -26081 -34309 -40713 -41572 -33773 -9524 -3149
7651 -3149 12582 15974 8434 -4208 -15415 -6366 -434 36803 53478 41208 33424 46586 51361
7638 51361 42407 25476 -2063 -26650 -39894 -49809 -58457 -39383 -25853 -3348 43152 51803 84509
7625 84509 71525 33974 9897 14714 8457 -8639 -22133 -37347 -30373 -32015 -16761 -28462 -24107
7612 -24107 -7720 -15983 -17235 1738 26450 34604 37761 25965 12240 -4460 7530 20909 32430
7599 32430 40296 10605 22078 26563 7044 6348 18373 18427 6216 -19245 -25434 -6718 8841
7586 8841 3116 -5440 -13521 -8347 -10849 -1056 -1071 -17145 -28053 -6031 8068 -19877 -33559 -8821
7572 -8821 -24216 -27032 -9740 -31209 -41681 -40165 -26808 -6144 -1743 19620 -6470 -28442 -21951
7559 -21951 -16681 -31526 -12650 47410 72251 68316 19982 -12913 -61705 -79197 -81409 -71193
7547 -71193 -66461 -64660 -31466 -2602 -8236 -29919 -33116 -49692 -62317 -53798 -55416 -29770 -21388
7534 -21388 -9034 -15093 -21640 -26340 -31206 -23384 -13399 -16209 -14969 3082 -16882 -27599 -20136 12863
7520 12863 18303 -13115 -32707 -25801 -11457 6138 -4907 -28482 -46176 -29088 -9918 -4629
7508 -4629 -28152 -50351 -34430 -27376 -4784 -27725 -4905 506 2869 9796 9112 6172 4872 3019
7494 3019 -8225 -3031 18581 39404 48994 60173 25861 285 -11241 -5943 7823 11040 7545
7481 7545 -2106 -38756 -52380 -15251 16420 24376 23793 13144 -6598 -30699 -24665 -13608 -626
7468 -626 -6747 -31218 -71781 -93733 -84369 -46646 -17913 -34372 -50080 -53464 -63630 -60201 -54201
7455 -54201 -50460 -43584 -13080 3457 -29429 -10602 10310 6296 14640 -30089 -37163 -53828 -50782
7442 -50782 -50077 -50415 -41560 -13854 2891 -1159 -16703 -16487 -28514 -37817 -27974 -19846 25532 23215
7428 23215 -24381 -37851 -9264 -14478 -9431 15038 23088 27619 41209 11858 -316 6284 1924
7415 1924 1203 4448 -6806 -12788 -4621 14774 11444 -10570 -28145 -3981 6868 -20889 -33698
7402 -33698 -19218 -10608 8703 36430 36097 28461 20752 7975 -5382 -14371 -3181 343 -2502
7389 -2502 -4769 -1210 -4708 13424 23613 13935 1087 -10783 3067 4564 -18779 175 -3919
7376 -3919 -16561 -4500 -3447 -2587 -12818 -27417 -7727 -5908 -28495 -21217 -4937 -20156 -22498
7363 -22498 -28447 -21087 -5189 -393 855 -7125 -15918 -16710 6749 7130 -17034 -9529 -9146 -23111
7349 -23111 -30516 -7016 10337 -12192 -32436 -56747 -12108 13397 447 -2606 -221 -4103 -21912
7336 -21912 -35682 -22929 11872 10247 16864 21509 2289 -5263 10172 7239 -4072 -5929 -35575
7323 -35575 -33643 -25734 -30833 -20709 -28304 -39360 -36393 -28865 -16540 -10192 -4867 -55 4895 16679
7309 16679 14524 4140 10524 20751 5250 14424 32271 20678 8159 -6027 -24044 -11753
7297 -11753 11354 -7517 -42782 -40351 -3085 4240 5533 -4784 -34590 -48130 -33301 -15555
7285 -15555 -24646 -49397 -19493 6336 7275 5829 -164 -14909 -17489 -10345 -23946 -19614 -5306
7272 -5306 4394 -3115 4859 27305 22505 12700 7071 -19016 -12422 -1634 -2848 -3699 -25814 -30144
7258 -30144 -31292 -26578 -19634 -28127 -33628 -21252 -1485 17247 25526 12480 5502 -979 -22637
7245 -22637 -29914 -15119 10514 6164 -7644 10749 41311 37475 49984 65606 49499 20850
7233 20850 15623 -14365 -24708 -15962 -18692 -17547 -14572 -8081 -1427 -13070 -23937 -12201 -13130 -23690
7219 -23690 -36143 -55648 -57892 -57809 -49111 -21314 6799 37746 38867 21286 -16892 -44938 -17790
7206 -17790 13667 22188 18549 5854 5663 2494 -12399 1294 15578 29078 15795 -25147 -26859
7193 -26859 -5921 -14489 -40745 -19474 -18325 -49247 -57628 -34772 -4162 -12355 -20557 -35618 -29283
7180 -29283 -10778 -21635 -22698 -37688 -44491 -28851 -25284 -35042 -22499 -23358 -28073 -35277 -50239
7167 -50239 -22798 -1645 11500 28880 3507 -34116 -16383 -17275 -10346 -16018 -11676 517 10311
7154 10311 11528 -8849 -25987 -47881 -46877 -60735 -48317 -7399 8470 19340 6488 -1848
7142 -1848 12019 -4882 -9992 -12785 -22010 -17458 -4444 2115 1764 -7168 -1819 10908 -36129 -24356
7128 -24356 -3457 8253 -10144 -30113 -23922 -20258 -8887 -33183 -27313 8828 606 8001 193
7115 193 -13794 -7027 -342 10969 23955 40233 55315 31323 8334 -3133 9806 5985 -910
7102 -910 14172 4264 -17059 -14394 -13427 -11147 4615 4910 -4229 4303 17689 13159 957 -2311
7088 -2311 -23913 -35142 -29103 -33841 -38916 -41832 -41013 -20062 8158 -2309 -29954 -36669 -28047 -23137
7074 -23137 -32806 -19296 9973 -6226 -17266 -14551 -2630 -3735 -2893 13437 14120 7042 14903 15696
7060 15696 5580 4451 1299 -7831 -9120 -11623 -8629 -472 16357 23811 7799 6867 -21560 -41119
7046 -41119 -12012 -12388 -37069 -9073 4373 -16915 12563 45328 29325 2195 20963 16081
7034 16081 -9908 -12563 -17517 -22974 -34670 -47888 -63809 -65537 -20012 -11624 -23738 -46627 -34225
7021 -34225 -28930 -35151 -12380 11642 8075 -4264 -17395 6258 -452 -29419 -29767 -44806 -51864
7008 -51864 -20674 -9923 -3560 -4235 -13244 -25384 -44876 -70077 -83807 -50685 -29509 -3709 3525
6995 3525 -25500 -45175 -36088 -6277 18090 6377 -11935 -13124 -13102 -12209 3409 -20691 -20343 -13823
6981 -13823 -6419 -5600 -20007 -32246 -9967 -6689 -27139 -28706 -29412 -22164 -20138 -19123 -11724 -22214
6967 -22214 -9002 32439 56127 48340 36249 37428 29684 17801 33644 33465 18477 9989 -7302
6954 -7302 7079 29411 20171 17154 12310 15298 13940 22195 9672 1716 -7756 -37545 -43944 -44537
6940 -44537 -23276 -3183 30389 38589 12681 -24115 -29978 -15775 10152 35655 40635 44053 44977
6927 44977 31378 11372 -5194 -21323 -57915 -42402 -9192 1569 546 17947 -838 -4093
6915 -4093 -30931 -60019 -79828 -73065 -76098 -70917 -52454 -52470 -44700 -60975 -65084 -42869 -57149 -65679
6901 -65679 -80563 -63097 -57127 -36162 -16550 -29284 -42615 -40360 -23839 -11679 -7365 -487 -18036
6888 -18036 -51247 -42596 -37573 -50287 -47439 -34561 -21639 -13895 14713 24957 7899 -6143 -31073
6875 -31073 -69205 -89820 -76219 -52959 -28573 -41815 -19527 -9136 -21930 -2785 9419 4507
6863 4507 -12605 -19340 9838 52385 54942 46005 51843 28566 16280 18612 -4548 -10879 10071
6850 10071 -2891 -3741 18587 36775 45514 20705 -1420 -14567 -14408 -5054 -7745 -12979 -1169
6837 -1169 5116 28455 27725 17431 12466 28997 26167 23047 2279 2458 -7745 -819 -16348 -24227
6823 -24227 -14526 17730 42219 26440 21384 23431 -1230 -921 -29132 -4501 -1340 20668 32821
6810 32821 5996 -1729 -1336 -7799 -12906 -19796 -37019 -19186 -6565 6882 7404 -42314 -43234 -40274
6796 -40274 -62779 -35858 8188 -1532 -5730 -15570 -19720 -10515 -32722 -14767 7313 -8524 -11312
6783 -11312 5757 1283 10042 -1572 -9367 -884 30770 8513 -16312 -21229 -11891 -9863 -38874
6770 -38874 -50432 -27228 -16032 -25264 -18331 4784 30946 27335 19269 1301 -8331 -29990 -26109
6757 -26109 -24939 -29562 -15025 -22095 -22888 -32361 -34409 6551 16208 -33388 -31584 -13735 -16347 -28535
6743 -28535 -27397 -25501 -60366 -47955 -3579 8753 -38287 -24437 -21096 -13395 -4001 3752 22013
6730 22013 40915 16683 14037 1993 -19608 -3187 5081 -38961 -40340 -22785 -18909 -38725 -53739
6717 -53739 -53616 -55650 -49037 -40343 -8265 16315 35275 23506 15936 3587 8359 62990 86634
6704 86634 76887 56678 43938 42541 18040 -15086 -20188 -21833 -28750 -12739 4874 9701 -14774
6691 -14774 -14375 -9794 -14244 -2620 -9078 -18279 -46801 -57334 -56665 -53799 -53890 -20525 -11301 -18073 -33998
6676 -33998 -25871 -7188 1702 -9197 -17378 -17345 -27623 -31811 -41879 -44603 -33968 -7579 8167
6663 8167 -8456 -20055 28846 48484 33222 34136 35010 31302 25136 21860 48618 28364 12847
6650 12847 6104 -1696 14482 25392 26335 5958 -35483 -44766 -24969 -35837 -18094 3267 13585
6637 13585 2508 18980 25267 -2764 -5752 -7584 -28906 -30967 -23679 9368 35895 33343 29540
6624 29540 23469 31537 33601 17193 6324 9048 11506 -14528 -26377 -47231 -65368 -26644 1083
6611 1083 -15434 -8827 -5598 -29194 -47432 -54059 -30458 7286 10785 6796 -7204 -36270 -53703
6598 -53703 -36578 -39012 -47308 -25063 10102 19642 14837 7675 -9102 -16329 -9249 -957 786 2506
6584 2506 -8445 -40094 -36407 -13793 5323 -20139 -26236 -7053 -14584 -16600 -25 10592 7479
6571 7479 -39925 -40069 -39269 -13087 -8170 -16690 9509 14059 -5518 -7214 -7455 13599 8980 8874 4590
6556 4590 1077 -17610 -36115 -24689 -22313 -31341 -23561 -24616 -28432 -32477 -40621 -22872 -30505 -19704
6542 -19704 -24195 -20501 -11350 -32293 -2540 10384 -29768 -30079 -30299 -46861 -38721 -37357 -33991 -23849
6528 -23849 10485 3052 -7643 5037 -23841 -11269 -11496 -13626 -3446 2533 6066 -4279 -14923
6515 -14923 -13890 -13153 2437 7639 3981 28938 22108 7746 10462 -7858 -5760 7372 10657 1560
6501 1560 -4544 -20883 -5935 9414 18167 15300 -6874 -2397 1203 18286 28349 23339 13062
6488 13062 727 -1185 3531 -8797 -23047 155 -8700 -23415 -41519 -30047 -23806 -28297 -25727
6475 -25727 -27606 -41459 -41960 -32422 -42151 -40704 -21811 -20247 -22639 -39543 -39511 -28564 -21936 -34833
6461 -34833 -41113 -40075 -37565 -38267 -33494 2646 33821 46371 30895 16080 -7770 5140 -6779
6448 -6779 -10237 -4663 -18972 -23506 -34012 -31890 -29896 2227 -3110 -21324 -45048 -67422 -38941
6435 -38941 -12770 -20870 -38228 -27857 3213 -4617 -45380 -60418 -14198 3641 2356 -30275
6423 -30275 -60909 -72525 -54519 -32854 -9729 -3185 -13621 -19106 -23118 -7275 3250 14335
6411 14335 -3930 -34381 -56056 -20085 -20926 -28425 -46596 -59186 -65537 -65566 -57461 -28728 -8197
6398 -8197 10313 16774 17067 4794 -7182 -9193 -1900 590 -22417 -8218 -4903 -14461 -14060 -1820
6384 -1820 26827 34925 1461 -35270 -32828 -19786 -7554 2599 -10239 -24546 -36463 -27141 -16535
6371 -16535 3661 24571 19770 -27300 -45144 -33994 -39169 -62865 -51595 -26854 -28867 -53342
6359 -53342 -62825 -38452 -13067 -30709 -16793 4886 -18133 -32814 -5283 24888 9987 -12339
6347 -12339 -7563 -18288 4830 1844 -20637 -45436 -66619 -104247 -95077 -43756 2677 18473
6335 18473 8841 13201 21756 -1844 -3200 -14790 -19062 -38668 -32529 -31600 -23425 -32323 -42158 -39891
6321 -39891 -55276 -55879 -34159 -21556 -21432 -17345 -1211 3661 -10652 -6892 -13302 -38082 -27455
6308 -27455 -1914 2597 -24301 2413 -18362 -35979 -39161 -38126 -31425 -19833 -29272 -31376 -36269
6295 -36269 -31898 -15270 -3629 -4982 13901 7543 2965 -1313 -2386 -6230 6376 22092 36443
6282 36443 38718 43152 18537 -7794 -31315 -26883 -18653 -18771 -13913 -24562 -45541 -53825 -48686 -46066
6268 -46066 -44293 -30598 -42458 -63594 -46398 -17825 -19805 -20819 -1821 658 -25759 -45601 -59936
6255 -59936 -38101 -15946 -14477 1506 33152 42765 4821 -37055 -19024 27803 24051 21381 34949
6242 34949 48357 65376 53033 45415 34253 13496 -6104 -10680 -10896 -35075 -29089 -19231 4272
6229 4272 2184 16469 22255 2164 -6148 4849 -27617 -52506 -41392 -32019 -1792 14832 25139
6216 25139 16568 -5227 -23216 -6926 15737 31536 3538 -11428 5107 -13782 -16852 -32643
6204 -32643 -39141 -25412 -27371 -21642 -14388 -40610 -55511 -43988 -35049 -52304 -64248 -50502 -33394
6191 -33394 -31177 -16751 9809 10026 12750 22607 -3210 -34436 -46418 -44675 1281 14771 3017
6178 3017 2822 -12945 -7135 -15400 -26927 -36389 -62195 -70688 -22340 -6518 -20500 -17284 -11738 -15430
6164 -15430 -5804 -25497 -34386 -21471 -17949 -16622 -35970 -24647 -22879 -20423 1717 -7393 -31243
6151 -31243 -26971 1969 10881 8868 4866 33603 20511 16402 3868 -3183 14207 9555 -16986
6138 -16986 -41930 -45752 -21389 -42157 -46209 -7416 -16105 -5865 -12183 -36065 -30381 -1728 6371
6125 6371 -5921 -15107 -53419 -73717 -50064 -24874 -4503 27072 40185 20328 -6259 2511
6113 2511 4311 -1039 1924 -9303 -42877 -44577 -43793 -60627 -71034 -43374 -47607 -66801 -72463 -42952
6099 -42952 -35923 -13951 -14892 -37215 -34335 -42235 -1900 19305 42025 37138 23306 7966 -18864
6086 -18864 -29108 -13450 -13798 -26527 5228 5523 2372 -28897 -49769 -42993 -19171 -9029 -29665
6073 -29665 -33890 -4316 -4059 -24102 -1027 4954 -14845 -1182 8897 -920 -24326 -38025 -62009
6060 -62009 -75716 -40481 -21629 -13918 -16782 -7911 -1897 4552 28062 20727 36381 18091 -5687
6047 -5687 -5836 6472 129 -7343 -4814 -7708 35 10181 6603 24753 26143 19615 7413 18310
6033 18310 2401 -30953 -16112 32138 33236 18175 3609 31804 22845 -4714 -16348 3232
6021 3232 -16800 -44365 -45641 -33854 -42001 -23770 -11877 -13443 146 16605 -9136 -35745 -10
6008 -10 39069 27452 19973 5056 10442 25982 -8994 -21596 -18765 -21713 -38871 -5824 -14187
5995 -14187 -19314 -24034 -7963 -32732 -36753 -29508 -32278 -42653 -43545 -28071 -24046 -36422 -35028 -29799
5981 -29799 -27471 -33134 -44705 -43456 -54760 -64923 -62823 -84971 -92748 -77382 -47502 -56222 -64191
5968 -64191 -65953 -56395 -17125 5218 5095 -23107 -54511 -38366 -20786 -19238 -30979 -35047 -17429
5955 -17429 -19401 -25480 -17097 -13363 -11546 -24868 -7590 9716 -2614 6081 -3591 -36911 -49603
5942 -49603 -44716 -43598 -25903 -23365 -20922 -45041 -53078 -72070 -86466 -51610 -38452 -28081 -37497
5929 -37497 -20042 -26427 -3924 -10502 -21976 -24179 -10948 -11236 -20850 -10131 -3370 -3039 -15457 -8277
5915 -8277 -40731 -32233 -15419 -18284 -27979 -38345 -34564 -14355 12164 24813 11125 -9791 -27142
5902 -27142 -2020 16810 8173 22835 34282 -2234 -29424 -28152 -38584 -30165 -32403 -31021 -676
5889 -676 26701 -2393 -13931 -19973 -27741 -58381 -69425 -60180 -31163 -27401 -25852 -33884 -36884 -25445
5875 -25445 -13335 -17539 -4881 -3089 -5661 3967 6966 19142 32005 9755 -7826 13593 9881
5862 9881 -24168 -34118 -15638 8202 1849 -11174 -9657 -32377 -4384 24406 27903 29735 7291
5849 7291 -20734 -36405 -14666 -26859 -38615 -13230 9236 9571 -17533 -40007 -39042 -28189 6430
5836 6430 14418 22548 15124 -27185 -41886 -43325 -41321 -26715 -16179 -3881 -4394 -30095 -23333 -7400
5822 -7400 3785 -1756 852 7309 22479 24608 21922 3767 4778 5759 11980 36912 31134 26365
5808 26365 10924 -24557 -19991 -2934 -13926 -42352 -51287 -52738 -56886 -37081 -44308 -40691 -30188
5795 -30188 -22026 -13677 4997 1954 7979 -17900 -43417 -47595 -42124 -13608 10567 16979 26575
5782 26575 18775 -3246 13865 16029 -11616 -3244 -10002 -38498 -34789 -21008 -19143 -9765 -13889
5769 -13889 -13571 -32346 -39574 -35295 -10750 -8105 5248 8344 -1989 -16915 -43206 -51249 -45317
5756 -45317 -42048 -46819 -64080 -45583 -43120 -26987 -23002 -44468 -32293 -2293 -5370 -29645 -29638 -14580
5742 -14580 -15340 -25245 -19234 -21043 -29863 -47427 -70612 -82195 -67482 -46442 7387 17112 -16785
5729 -16785 -27653 -19108 -4439 25958 54576 37685 832 -12505 -4874 -12184 -13095 19095 27785
5716 27785 -2503 -44854 -51504 -43541 -26816 -20299 -15763 -6644 -3454 -6606 9920 1898 -29340
5703 -29340 -29852 -11242 -8225 -1043 1697 23894 14843 -7038 -5043 -2190 3846 -5598 -10077 -31529
5689 -31529 6290 16781 -2511 -1610 -7915 -8636 -9761 -19755 -10466 -12708 -35307 -38592 -23212 4523
5675 4523 17481 4222 15441 34322 10282 -19 -5139 -39060 -65731 -75382 -62913 -43916
5663 -43916 -20656 -28439 -27738 -14518 23556 8623 -48300 -57389 -33682 -9821 390 -17352 -24546
5650 -24546 -11144 28243 16594 -12657 -21565 -41734 -41064 -26533 -20850 -46038 -74207 -54517 -44890
5637 -44890 -51864 -58218 -28492 -45176 -53936 -31999 -7705 518 2000 19828 25514 29309 43381
5624 43381 55113 48815 3987 24131 57181 21801 -5435 -7483 -11468 -51169 -76111 -51639
5612 -51639 -34182 -9341 -10011 -12557 -2541 -2437 -11833 -12020 -6214 -15944 -16156 -1794 -9121 -19033 -28958
5597 -28958 -11962 -24392 -31926 -26511 -15957 3360 13125 15147 518 -22686 -42341 -26376 -18264
5584 -18264 -2582 19078 1129 -9315 -4819 3917 21636 16775 -10364 -19242 -521 -4351 992
5571 992 -17741 -9270 13449 28042 70389 70401 26465 9463 -38187 -43067 -25628 -5814 -2268
5558 -2268 -14206 -26879 -43543 -32747 -3371 -4202 -4765 -6645 -7482 -13116 10253 35273 16059 16711
5544 16711 8189 -17352 -27396 -29460 -26214 -20161 -38396 -67176 -63200 -69371 -79189 -51136 -36402
5531 -36402 -28012 -45712 -40320 -40221 -4648 30866 12363 21333 14169 -1225 -14390 -21484 -12802 12555
5517 12555 17992 -30362 -51065 -57136 -39742 9796 8241 14043 402 4731 17878 -26825 -66597
5504 -66597 -88839 -51528 -40823 -55175 -29236 -35299 -33924 -37668 -14904 8368 -16283 -15133 13403
5491 13403 23494 3874 7881 40810 72476 55921 44970 27547 7720 -8203 -9349 -20460
5479 -20460 -18667 -23437 -33711 -32584 -26743 -38129 -49022 -35295 -55076 -47320 -30681 -50578 -59420
5466 -59420 -37891 -9806 4732 -17917 -15946 -30471 -32620 -33529 -23871 -13587 -9393 1442 12594
5453 12594 4094 -20477 -24560 -1202 15905 13387 12376 3296 -17503 -38962 -46636 -58112 -44610
5440 -44610 -54232 -54222 -40098 -37715 -19455 -10314 -7473 9151 -1394 -13974 7649 10701 1375 11003
5426 11003 -10481 -26525 -31469 -40132 -31108 403 -15461 -31785 -23083 -6656 -9686 -12351 -10218
5413 -10218 -2160 6996 4972 -12080 -22519 -34808 -41950 -22223 1699 -20323 -41255 -45623 -45345
5400 -45345 -15338 8776 -6300 -7078 -525 785 7656 -1621 -10432 7797 5767 4999 -12583 -43855
5386 -43855 -53835 -63850 -46309 -16715 -26094 -15214 -18585 -30132 -33563 -34870 -28636 -10651 -27221
5373 -27221 -13958 -2535 12485 30597 3570 -10214 7324 21514 -1104 -1822 18298 21426
5361 21426 17124 34802 26465 -16672 -40435 -17999 1076 9304 17284 36097 49002 45823 19187
5348 19187 9506 12689 15030 -591 -23044 -32919 -38809 -4700 -10426 -27495 -10028 -4563 -8656
5335 -8656 -26331 -36337 -17965 -34577 -66789 -51255 -32757 -16770 3762 -4055 -17501 -4735
5323 -4735 4668 7834 13119 -9251 -5956 1992 10129 -13423 -27485 -10101 8058 -11508 -27939
5310 -27939 -32876 -36016 -7248 15118 15612 24021 30478 45712 9581 2835 3106 -4317 -13806 -21056
5296 -21056 -28969 -37671 -10464 21385 43902 13059 -13482 -23110 -938 20702 16924 1616 -27596
5283 -27596 -19735 -7567 8803 -4037 -33674 -11452 -22692 -25954 -10321 -9979 6751 -14811 -50641
5270 -50641 -54156 -58797 -41144 -51922 -68653 -77224 -77553 -75916 -36800 -14691 664 5259 -18059
5257 -18059 -35082 -38703 -16144 -33057 -42693 -44562 -29504 -16410 9331 17204 -3005 -30825 -23077
5244 -23077 -21085 -38302 -56525 -74151 -62947 -53983 -44056 -48253 -51631 -25572 -48635 -78670 -36151
5231 -36151 -537 2707 -8212 -27413 -28732 -19492 -35262 -54184 -68507 -67501 -44442 -39571 -7266
5218 -7266 -31162 -49752 -37995 -20616 -32727 -52138 -60135 -43663 -13465 7478 35302 77087
5206 77087 95942 61398 22060 -6530 -710 14828 4294 20536 17497 15293 -5327 4068 31395
5193 31395 46464 32660 34381 34224 19566 10500 9994 -12246 -36730 -28211 -16051 -12433 -29294
5180 -29294 -45647 -37585 -6774 -12943 -6436 -6414 -1973 23657 4248 -25467 -14658 -9111 -8910 46
5166 46 -3135 -8060 2883 -27479 -20720 -17270 -33450 -45803 -45314 -36238 -35005 -29371 12082 35818
5152 35818 33224 31124 14321 18234 22555 14713 -21201 -49020 -57763 -29693 7562 -2380 -3772
5139 -3772 -5201 -16755 -6238 -2310 -22040 -12917 -11674 1773 -4207 -8219 -16255 -6036 -13022 -3601
5125 -3601 -16691 -12618 -9448 15026 4661 -14768 -60 4852 -22233 -23548 -18583 -31363 -17599
5112 -17599 12044 11483 -6846 -22183 -25715 -7294 -2320 -847 24575 30977 5242 -26013 -3054
5099 -3054 14573 15317 7503 14105 38788 37243 30257 3144 -3114 19053 31986 2290 -12990
5086 -12990 -14366 -15445 -13610 -13960 -15121 -2904 13324 14151 3556 -19350 -50626 -37371 -32909 -14281
5072 -14281 -556 12992 37309 17417 8052 -4903 9557 15913 28644 12564 -19131 -40616
5060 -40616 -36153 -11187 -8860 1048 -2599 -12548 -12873 -13450 -37410 -47039 -55415 -57764 -38358 -58418
5046 -58418 -47013 -44204 -52064 -20283 -23627 -16857 -6529 -10416 16792 25857 18769 7545 -19398
5033 -19398 -5864 3130 -17354 2666 25665 9474 18715 5675 13089 -5292 -20686 -21753 -24801
5020 -24801 -21766 -28688 -44611 -61060 -73280 -58055 -39724 -29194 -29822 -12859 -10243 -35479 -41751
5007 -41751 -44197 -44435 -17172 -22878 -21777 -16385 -13718 -11484 -16674 -8444 -18777 -51827 -35955 -15804
4993 -15804 -20627 -8025 -7971 -18888 -12615 -5219 1230 -25991 -24258 -1719 -14369 -26847 -6060
4980 -6060 11371 11155 14469 14778 2783 -6691 -26673 -26103 2823 4863 -41359 -44399 -26884 -22562
4966 -22562 -21060 -1162 15559 3304 -9547 11368 46537 18484 -22177 -12367 3835 -12453
4954 -12453 -20139 -21740 -24812 -52641 -59496 -37704 -30671 -19563 -5238 8791 22519 -8134 -21998
4941 -21998 -21175 -8873 -1084 -3455 -21882 -34846 3781 6889 -16932 -29526 -15096 -14371 -21826
4928 -21826 -28614 -25311 -19877 -16088 1357 11016 27566 26257 11197 1639 19266 6164 4602
4915 4602 3276 -6799 901 11182 8352 5495 7295 20704 29389 19066 -15436 -27833 -12947
4902 -12947 -6871 -5847 -5872 -4204 9578 25613 12954 -3953 6626 -3611 -2598 4560 7018 30956
4888 30956 24353 34190 10618 -2899 -7144 -11098 -22805 -21996 -19529 -17208 -27589 -29913 -27434 -24634
4874 -24634 -16893 -30911 -29222 -25946 -8009 -25071 -22619 -11713 16754 15146 -1407 -27257 -25691
4861 -25691 -18483 -43701 -27786 -11505 10629 10698 -12968 -12222 -34642 -24962 -29006 -31599 -30868 -33588
4847 -33588 -55985 -57561 -40522 -41870 -54296 -63034 -50009 -37436 -32349 -44459 -77102 -69932 -60909
4834 -60909 -33355 -34336 -12389 9466 27389 47089 44625 7947 -10007 -10602 -4506 10165 -8011
4821 -8011 -6127 -6886 -6136 1801 530 -7410 -7524 -6205 -16412 -35681 -40363 -32376 -16522 -25050 -21064
4806 -21064 -10422 15533 31726 38583 20999 15799 -25622 -37891 -24432 -38773 -29902 -20184 -21800
4793 -21800 -9094 -4416 5046 33331 35779 21710 5785 4436 38646 65146 35613 18863 10760
4780 10760 -2735 -8894 -6135 -11587 -21819 -22373 -42212 -13524 -1777 -9240 1387 18345 12120
4767 12120 17170 9430 -18413 -7882 -4005 12678 23207 26822 23193 28445 35098 23320 15166
4754 15166 35632 34236 16875 -1653 -21965 -483 3298 -12699 9734 21051 -1060 4133
4742 4133 22613 -498 -11033 -1487 -6118 -13701 -6054 10337 -14325 -48594 -40538 -28708 -38917
4729 -38917 -42267 -23022 1706 21171 12990 6410 -8402 -22609 -27060 -3215 16993 27964 12138
4716 12138 -6327 3215 -4535 22306 12322 2872 -475 -10101 -17377 -17009 -32126 -33213 -44501 -54988
4702 -54988 -45851 -33539 -4541 6067 -37079 -47815 -26996 -19178 -18202 -20226 -27890 -62763 -89922
4689 -89922 -68222 -56505 -53460 -21591 13377 16591 -27353 -51076 -41125 -22159 -28507 -19383 -13081
4676 -13081 -50523 -63016 -44209 -29874 -10999 -14804 -44900 -60152 -19418 16769 20975 44205
4664 44205 39132 -1198 -25551 -32428 -42579 -36125 -34983 -40786 -58858 -31808 3574 -4353 -19161
4651 -19161 -19472 -21025 -14389 -23985 -10355 5523 -18297 -39068 -40894 -39486 -14908 -4341 -11597
4638 -11597 -18194 -23648 -40043 -46504 -25778 1772 -5059 -5627 -199 26763 31797 25314 10753 -23036
4624 -23036 -24055 -8864 6950 2148 19980 19552 -661 -17056 -39169 -33511 174 -6199 -25220
4611 -25220 -29038 -32692 -13559 12574 19551 21260 20821 42263 62137 53496 44660 21791 -6898
4598 -6898 -22841 -13134 -12749 -3443 36787 58995 47456 50523 40988 32135 3070 -2968 -17408 -14874
4584 -14874 -18374 -39087 -24274 -17053 -30713 -14358 520 -8852 -15730 -16258 5186 11187 31497
4571 31497 -1596 -29166 -33860 -39536 -44403 -41462 -27705 -5146 -2347 7711 14747 -1177 -18130
4558 -18130 -22022 -12634 -21057 -18391 -11827 -3891 398 -10999 -36047 -18625 3818 5531 -18269
4545 -18269 -25545 -24571 -9576 4763 2409 2732 4488 -22218 -22576 -8997 -19982 -13618 -1908 7074
4531 7074 15934 8448 -10529 -32033 -38495 -40613 11437 43208 74078 73730 44937 47357 48402 16243
4517 16243 10891 9101 6274 -16274 -13839 -7763 -11573 -22455 -26421 -12709 3969 4226 30991 45997
4503 45997 41503 35615 24238 27624 40438 17702 -4066 -7325 6160 -3434 -19904 -26853 -5413
4490 -5413 34650 35865 26954 444 -18035 -22471 -27773 -13830 -5856 -46162 -38661 -15110 -38507
$$ [...]
##END NTUPLES=NMR SPECTRUM
##END=
