##TITLE=Analysis number 318349
Compound Code cc 45506
Book Reference 464/24/4
Project Code adrs
Chemist Name chrisr
##JCAMPDX= 6.0         $$ Bruker NMR JCAMP-DX V2.0
##DATA TYPE= NMR SPECTRUM
##DATA CLASS= NTUPLES
##ORIGIN= Bruker BioSpin GmbH
##OWNER= nmr
$$ XWIN-NMR		Version 3.5
$$ Fri Mar 24 09:53:04 2006 GMT Standard Time (UT+0h)  MAYBRIDGE\nmr@NMR_250MHZ
##.OBSERVE FREQUENCY= 250.131544655141
##.OBSERVE NUCLEUS= ^1H
##.ACQUISITION MODE= SIMULTANEOUS (DQD)
##.ACQUISITION SCHEME= undefined
##.AVERAGES= 16
##.DIGITISER RES= 18
##SPECTROMETER/DATA SYSTEM= dpx250
##.PULSE SEQUENCE= zg30
##.SOLVENT NAME= CDCl3
##.SHIFT REFERENCE= (INTERNAL, CDCl3, 0, 16.522)
##AUDIT TRAIL= $$ (NUMBER, WHEN, WHO, WHERE, WHAT)
$$ ##TITLE= Audit trail, XWIN-NMR		Version 3.5
$$ ##JCAMPDX= 5.01
$$ ##ORIGIN= Bruker BioSpin GmbH
$$ ##OWNER= nmr
$$ C:\u/data/dgb/nmr/ADRS/1410/pdata/1/auditp.txt
$$ ##AUDIT TRAIL=  $$ (NUMBER, WHEN, WHO, WHERE, WHAT)
(   1,<2006-03-24 09:52:02.06 +000>,<MAYBRIDGE\nmr>,<NMR_250MHZ>,
      <created by zg, POWCHK disabled, PULCHK disabled
       configuration hash MD5:
       84 BC 41 DB A1 6E 1D 46 DA 25 12 A5 C1 ED C5 3A
       data hash MD5: 64K
       D7 A0 40 55 2D 32 BC 05 0B 93 E3 C3 19 53 F3 03>)
(   2,<2006-03-24 09:52:24.92 +000>,<MAYBRIDGE\nmr>,<NMR_250MHZ>,
      <Start of raw data processing
       ef LB = 0.3 FT_mod = 6 PKNL = 1 SI = 32K 
       data hash MD5: 32K
       82 A6 CD 79 97 89 46 76 11 6F 98 C4 FD 48 86 95>)
(   3,<2006-03-24 09:52:34.52 +000>,<MAYBRIDGE\nmr>,<NMR_250MHZ>,
      <apk 
       data hash MD5: 32K
       29 A2 17 CC AD A8 88 B4 00 B0 0C 69 E9 60 48 37>)
(   4,<2006-03-24 09:52:38.52 +000>,<MAYBRIDGE\nmr>,<NMR_250MHZ>,
      <abs ABSG = 5 
       data hash MD5: 32K
       BF 2B 4C 56 2A 3F 25 9C 82 6E 11 16 33 FF FA 3B>)
$$ ##END=
$$ 
$$ hash MD5
$$ 1A 98 5A 2C D6 C7 DB 07 6E 2C CD 20 3C 69 5A 23
##$RELAX= 
##$RELAX= 
##$RELAX= 
##$RELAX= 
##$RELAX= 
##$RELAX= 
##$RELAX= 
$$ Bruker specific parameters
$$ --------------------------
##$DU= <C:\u>
##$EXPNO= 1410
##$NAME= <ADRS>
##$PROCNO= 1
##$TYPE= <nmr>
##$USER= <dgb>
##$AMP= (0..31)
100 100 100 100 100 100 100 100 100 100 100 100 100 100 100 100 100 100 
100 100 100 100 100 100 100 100 100 100 100 100 100 100 
##$AQSEQ= 0
##$AQ_mod= 3
##$AUNM= <au_zg>
##$AUTOPOS= <5 >
##$BF1= 250.13
##$BF2= 250.13
##$BF3= 250.13
##$BF4= 250.13
##$BF5= 500.13
##$BF6= 500.13
##$BF7= 500.13
##$BF8= 500.13
##$BYTORDA= 1
##$CFDGTYP= 0
##$CFRGTYP= 5
##$CHEMSTR= <none>
##$CNST= (0..31)
1 1 145 1 1 1 1 1 1 1 1 1 1 1 1 1 1 1 1 1 1 1 1 1 1 1 1 1 1 1 1 1 
##$CPDPRG= <>
##$CPDPRG1= <>
##$CPDPRG2= <>
##$CPDPRG3= <>
##$CPDPRG4= <mlev>
##$CPDPRG5= <mlev>
##$CPDPRG6= <mlev>
##$CPDPRG7= <mlev>
##$CPDPRG8= <mlev>
##$CPDPRGB= <>
##$CPDPRGT= <>
##$D= (0..31)
0 1 0 0 0 0 0 0 0 0.06 0 0 0 0 0 0 0.0002 0 0 0 0 0 0 0 0 0 0 0 0 0 0 
0 
##$DATE= 1143193919
##$DBL= (0..7)
120 120 120 120 120 120 120 120 
##$DBP= (0..7)
150 150 150 150 150 150 150 150 
##$DBP07= 0
##$DBPNAM0= <>
##$DBPNAM1= <>
$$ [...]
##$SUBNAM7= <"">
##$SUBNAM8= <"">
##$SUBNAM9= <"">
##$SW= 20.6930455092707
##$SWIBOX= (0..15)
0 0 3 0 0 0 0 0 0 0 0 0 0 0 0 0 
##$SW_h= 5175.983436853
##$TD= 65536
##$TD0= 1
##$TE= 294.16
##$TE2= 300
##$TE3= 300
##$TEG= 300
##$TL= (0..7)
0 120 120 120 120 120 120 120 
##$TP= (0..7)
150 150 150 150 150 150 150 150 
##$TP07= 0
##$TPNAME0= <>
##$TPNAME1= <>
##$TPNAME2= <>
##$TPNAME3= <>
##$TPNAME4= <>
##$TPNAME5= <>
##$TPNAME6= <>
##$TPNAME7= <>
##$TPOAL= (0..7)
0.5 0.5 0.5 0.5 0.5 0.5 0.5 0.5 
##$TPOFFS= (0..7)
0 0 0 0 0 0 0 0 
##$TUNHIN= 0
##$TUNHOUT= 0
##$TUNXOUT= 0
##$USERA1= <user>
##$USERA2= <user>
##$USERA3= <user>
##$USERA4= <user>
##$USERA5= <user>
##$V9= 5
##$VALIST= <valist>
##$VCLIST= <CCCCCCCCCCCCCCC>
##$VD= 0
##$VDLIST= <DDDDDDDDDDDDDDD>
##$VPLIST= <PPPPPPPPPPPPPPP>
##$VTLIST= <TTTTTTTTTTTTTTT>
##$WBST= 1024
##$WBSW= 4
##$XGAIN= (0..3)
0 0 0 0 
##$XL= 0
##$YL= 0
##$YMAX_a= 334817
##$YMIN_a= -565249
##$ZGOPTNS= <>
##$ZL1= 120
##$ZL2= 120
##$ZL3= 120
##$ZL4= 120
##$ABSF1= 16.522
##$ABSF2= -4.171173
##$ABSG= 5
##$ABSL= 3
##$ALPHA= 0
##$AQORDER= 0
##$ASSFAC= 0
##$ASSFACI= 0
##$ASSFACX= 0
##$ASSWID= 0
##$AUNMP= <proc_1d>
##$AZFE= 0.1
##$AZFW= 0.1
##$BCFW= 0
##$BC_mod= 0
##$BYTORDP= 0
##$COROFFS= 0
##$CY= 12.5
##$DATMOD= 1
##$DC= 0
##$DFILT= <>
##$DTYPP= 0
##$F1P= 14.0000005364418
##$F2P= -0.99999901652339
##$FCOR= 0.5
##$FTSIZE= 32768
##$FT_mod= 6
##$GAMMA= 0
##$GB= 0
##$INTBC= 1
##$INTSCL= 1
##$ISEN= 128
##$LB= 0.3
##$LEV0= 0
##$LPBIN= 0
##$MAXI= 10000
##$MC2= 0
##$MEAN= 0
##$ME_mod= 0
##$MI= 0
##$NCOEF= 0
##$NC_proc= -4
##$NLEV= 6
##$NOISF1= 0
##$NOISF2= 0
##$NSP= 0
##$NTH_PI= 0
##$NZP= 0
##$OFFSET= 16.522
##$PC= 1
##$PHC0= 170.2718
##$PHC1= 5.910562
##$PH_mod= 1
##$PKNL= yes
##$PPARMOD= 0
##$PSCAL= 4
##$PSIGN= 0
##$REVERSE= no
##$SF= 250.13
##$SI= 32768
##$SIGF1= 0
##$SIGF2= 0
##$SINO= 400
##$SIOLD= 32768
##$SREGLST= <1H.CDCl3>
##$SSB= 0
##$STSI= 32768
##$STSR= 0
##$SW_p= 5175.98343685301
##$SYMM= 0
##$S_DEV= 0
##$TDeff= 65536
##$TDoff= 0
##$TI= <Analysis number 999999
Compound Code 99
Book Reference 9
Project Code 9>
##$TILT= no
##$TM1= 0
##$TM2= 0
##$TOPLEV= 0
##$USERP1= <user>
##$USERP2= <user>
##$USERP3= <user>
##$USERP4= <user>
##$USERP5= <user>
##$WDW= 1
##$XDIM= 32768
##$YMAX_p= 342868586
##$YMIN_p= -114297
$$ End of Bruker specific parameters
$$ ---------------------------------
##NTUPLES= NMR SPECTRUM
##VAR_NAME=  FREQUENCY,     SPECTRUM/REAL,   SPECTRUM/IMAG
##SYMBOL=    X,             R,               I
##VAR_TYPE=  INDEPENDENT,   DEPENDENT,       DEPENDENT
##VAR_FORM=  AFFN,          ASDF,            ASDF
##VAR_DIM=   32768,         32768,           32768
##UNITS=     HZ,            ARBITRARY UNITS, ARBITRARY UNITS
##FACTOR=    0.157963299565203, 1,           1
##FIRST=     4132.6476996994, 0,             0
##LAST=      -1043.33573715361, 0,           0
##MIN=       -1043.33573715361, -114297,     0
##MAX=       4132.6476996994, 342868586,     0
$$ Real data points
##PAGE= N=1
##DATA TABLE= (X++(R..R)), XYDATA
$$ [...]
17905A96746l784j7895K1305J2953J3994K4543p941P453J8359k1688k465k5972
17893B15608j689K4746N6752M6792j0500k1448n173j2063j6400K097m715J226
17881B75233j5688k420j9734K5126l509O650K4011J2112j2860j3118q490j993
17869B65320j3007L341K3304J3492L571Q463k0742J9080N8428N1122K0867R127
17857D42366J4404J2578o180O060J0601J2571M0376J6965M5277P2218J50601K28552
17845A046389K67241K35987J23203P545j18872j84084k24975k32888j65773o9088
17835F84685m9507p804J3307L8446N3047L4689j6474o5204o2671k4984n3225m5900
17823D98405j2892Q008J5795K3118J2937m3180j5474K0108M7100K5547K2944K3043
$$ y = [196746, 192962, 175067, 196372, 209325, 223319, 247862, 239921, 247374, 265733, 244045, 241580, 215608, 213919, 238665, 295417, 342209, 331709, 310261, 305088, 293025, 276625, 278722, 274007, 275233, 259545, 257125, 237391, 262517, 259008, 265658, 289669, 301781, 288921, 275803, 267313, 265320, 252313, 255654, 278958, 292450, 296021, 304484, 283742, 302822, 361250, 412372, 433239, 442366, 456770, 469348, 463168, 469228, 479829, 492400, 532776, 549741, 595018, 667236, 817837, 1046389, 1313630, 1549617, 1672820, 1680365, 1561493, 1377409, 1152434, 919546, 753773, 684685, 635178, 627374, 640681, 679127, 732174, 766863, 750389, 685185, 622514, 597530, 544305, 498405, 485513, 493521, 509316, 532434, 545371, 502191, 486717, 506825, 553925, 579472, 602416, 625459]
17811F25459N668J1983O190M2467N4361O3190P7496J24854J27562J06700O2591
17800A308521K393l639L4457L4128Q6414J63016J74476J98997J85662J73248J83451
17789B541124J58810Q7790M0618O766J11425K28381L24252M43418N31174N54458
17779E028216N53824N68677Q70848J431894K345518L545177M352454M195368K339705
17770B5231681j77640j883618k211410j272252K14905J810146L537409N758801
17762C1008022R305204J5215026K4085076L3358034L8308309L2282807J3804191
17755A97366669n479570k1011990k8266295k9064268k5119943j9063945j2585783
17748E6774875o794317j743372K563288N275399N215229J236789m516375q706929
$$ y = [625459, 631127, 643110, 649300, 691767, 746128, 809318, 886814, 1011668, 1139230, 1245930, 1308521, 1310914, 1307275, 1341732, 1375860, 1462274, 1625290, 1799766, 1998763, 2184425, 2357673, 2541124, 2699934, 2787724, 2828342, 2835108, 2946533, 3174914, 3499166, 3942584, 4473758, 5028216, 5582040, 6150717, 7021565, 8453459, 10798977, 14344154, 18696608, 22891976, 25231681, 25054041, 23170423, 20959013, 19686761, 19901666, 21711812, 25249221, 31008022, 40313226, 55528252, 79613328, 112971362, 151279671, 183562478, 197366669, 191887099, 170875109, 142608814, 113544546, 88424603, 69360658, 56774875, 49980558, 48237186, 50800474, 56075873, 61291102, 62527891, 58011516, 49304587]
17740D9304587r992088q671033o381574m268122k755996j797754j275079j042065
17732A3120876r27551p90270o37096m41363k42449m8968J01882K17420M04444
17723A0756925P74422J316636K123910L419671N417012P622868Q921726P778519
17715D8131689L393360j527351m541149m424485j817660K318962P306713J2422162
17707F1262241J6945878J9567156K0311013J7906610J1820429j776002j6582933
17700A29454392k5476978k6588132k1418825j4815440r406076n855180l729440
17693B2164321k471780j494882n14101M98707J108652R91874k63817j734337k609002
17684A5675635k731879k299222j652951j109631q04984o75758o65205o66088o22289
$$ y = [49304587, 39312499, 30641466, 24259892, 19991770, 17235774, 15438020, 14162941, 13120876, 12193325, 11403055, 10765959, 10324596, 10082147, 10033179, 10135061, 10352481, 10756925, 11531347, 12847983, 14971893, 18391564, 23808576, 31431444, 40353170, 48131689, 51525049, 49997698, 45456549, 41032064, 39214404, 41533366, 48840079, 61262241, 78208119, 97775275, 118086288, 135992898, 147813327, 146037325, 129454392, 103977414, 77389282, 55970457, 41155017, 31748941, 25893761, 22164321, 19692541, 18197659, 17683558, 18182265, 19290917, 20282791, 20018974, 18284637, 15675635, 12943756, 10644534, 8991583, 7881952, 7076968, 6401210, 5736005, 5069917, 4447628]
17675D447628m95069l89750l65857k98920k08368j43197j54734j01771r1103r5987
17665B102872q5206j06803j06547j02416j23592j25229r4561p9168p1737o3038
17655A144575n9909l6689m9238m6078j1537l0943n2042m0396l2298l7244l423
17644G44778l8256k0108k4870R203l812J7670N905q441o083P821N0049M4664N3331
17631H31851N7246N2056R833L0227K0758K5934j1393k2652m1210j0360k2949p425
17619I11916J227M3971M8234L4838K0469k7699J177j9754n7998r2152q2408n3988
17607G27833n1954m0962k3671k868j1277j3528J4539j4884n3319o3726n2433k3006
17595C90744P243l6783j9632o641p760L418j5930J0853K6077k637j0862J6828
$$ y = [4447628, 3952559, 3562809, 3196952, 2898032, 2689664, 2546467, 2391733, 2289962, 2198859, 2102872, 2017666, 1910863, 1804316, 1701900, 1578308, 1453079, 1358518, 1279350, 1207613, 1144575, 1084666, 1047977, 998739, 952661, 941124, 910181, 858139, 817743, 785445, 748201, 744778, 706522, 686414, 661544, 670747, 666935, 684605, 690510, 682069, 675986, 683807, 733856, 778520, 831851, 889097, 941153, 950986, 981213, 1001971, 1027905, 1016512, 993860, 952650, 942290, 919341, 911916, 913143, 957114, 1005348, 1040186, 1060655, 1032956, 1034133, 1014379, 956381, 864229, 781821, 727833, 675879, 634917, 611246, 608378, 597101, 583573, 598112, 583228, 529909, 466183, 413750, 390744, 397987, 361204, 341572, 334931, 327171, 330589, 314659, 325512, 351589, 348952, 338090, 354918]
17583C54918L8308M5850N051L093r099L802J520j8789J1580L398L0642J1538K6159
17570E07971k034J5972N0004J0617m219n2767p4584l4900j198p990q201P251P342
17557D13264J8008K2993k2229k6736n3936j4968l161j120k3120l0612m689j9588
17545B54106m7301o597j6910j9800J2027o405q12k131j1488P157K0407p753q745
17532A65755J7940J7913L018k7088k2390J6749k5024j6458J4906j5865j5990R095
17520A22561L6335j556k7887j2259J7059M365K5290K679l1456P666r390J627J5020
17507A50054L051J3021j6080j4364n164R505M803o588p908O72N310j9165j9427
17494I7720q15N194jn996j095r672N529J2302m512j6488J6678J6885o37J2802
$$ y = [354918, 393226, 439076, 444127, 447220, 438121, 441923, 443443, 424654, 436234, 439632, 470274, 481812, 507971, 505937, 521909, 571913, 582530, 578311, 525544, 450960, 416060, 414862, 406872, 398671, 405922, 413264, 431272, 454265, 432036, 405300, 351364, 336396, 333235, 332115, 308995, 278383, 273694, 254106, 206805, 200208, 183298, 163498, 175525, 169120, 168308, 166177, 154689, 161846, 182253, 174500, 165755, 183695, 201608, 204626, 177538, 155148, 171897, 146873, 130415, 145321, 129456, 113466, 122561, 158896, 157340, 129453, 117194, 134253, 138618, 163908, 166587, 135131, 142797, 133407, 135034, 150054, 153105, 166126, 150046, 135682, 130518, 140023, 144826, 138238, 130330, 131002, 136312, 117147, 97720, 96905, 102099, 102098, 96102, 95007, 85335, 90864, 103166, 98654, 82166, 98844, 115729, 115092, 127894]
17480A27894k0717o271j6670K7528P141j5173k1389J2626K179N472k8686o646
17468F7288l38N765J2098p983k6703n683K891j8744j9563L9090J0802K6210j5356
17455F9774n37L1066k562J2337J3214j043k504j9154r213K6256r339o506M8444
17442A50233L2077J7744O0774P5317K9132k8214q1399n2920l8100k1293k7393
17431A15958l1539L949K0613k870j3789j9796J7142K4222J616Q131j6445m1698
17419F5494K4430M6737N909j8671m9357k6391q252j209J5842o23j89r42j3598
17406C9180K693o688K4018J0037j0457m6242Q204J9868M492K468M472P720j4665
17393D5100k7168K9860J7947L038K237p28j8035o480m765K5324J2539j4415k4869
$$ y = [127894, 107177, 100906, 84236, 111764, 118905, 103732, 82343, 94969, 97148, 102620, 73934, 67288, 66950, 72715, 84813, 76830, 50127, 44444, 47335, 28591, 9028, 48118, 58920, 85130, 69774, 69237, 100303, 97741, 110078, 123292, 122249, 119745, 100591, 91378, 117634, 108295, 101789, 150233, 182310, 200054, 260828, 336145, 365277, 337063, 255664, 202744, 164644, 143351, 115958, 84419, 88368, 108981, 106111, 92322, 72526, 89668, 113890, 115506, 123637, 107192, 65494, 89924, 136661, 142570, 123899, 74542, 48151, 39899, 38690, 54532, 53909, 53720, 52778, 39180, 41873, 35185, 59203, 69240, 58783, 12541, 20745, 40613, 45105, 47573, 52045, 59765, 45100, 17932, 47792, 65739, 68777, 71014, 70286, 52251, 45771, 41006, 66330, 78869, 64454, 39585]
17380C9585j0640M5569Q556k8452p65k445j0176j50R05J0100Q79n966M1134M3844
17366A31978M043k1703p75k6325k7939K0936Q993K5308N463r328k7498k1882J558
17353F2829J7928J1500j5365j9726j0857p674k2639k9607K6842K1102J1827K2108
17341F8268K4972J368k4767j0913m484J0712O347K2233O938K508n735k1651J105
17328G6901l199j185l4943J471O420K3122j6773j5250J7396n347m016L3052N684
17315H3333o842J7056R954j2478q994l2513j524L5679k161m9700K5185L3695p
17302I0683n592p47J4133j3159j6730k5896n891k236r931N825p079q157L275J7845
17288C6343K3015j0335k6703k5722P049K941Q828J752Q792K189J7951m491r078
$$ y = [39585, 28945, 74514, 83070, 54618, 53853, 51408, 41232, 41082, 41987, 52087, 52966, 47000, 88134, 131978, 136021, 114318, 113543, 87218, 59279, 80215, 89208, 114516, 119979, 110651, 83153, 61271, 62829, 80757, 92257, 76892, 57166, 46309, 38635, 15996, -13611, 13231, 34333, 46160, 68268, 93240, 94608, 69841, 58928, 54444, 65156, 71503, 93736, 100674, 103182, 97447, 75796, 76901, 73702, 72517, 37574, 39045, 45465, 68587, 51814, 36564, 53960, 48613, 44597, 77649, 83333, 76491, 93547, 103501, 91023, 82029, 49516, 47992, 83671, 81510, 31810, 56995, 90690, 90683, 85091, 84344, 98477, 85318, 68588, 42692, 36801, 34565, 24634, 30459, 23380, 15223, 18498, 36343, 59358, 49023, 22320, -3402, 3647, 6588, 15416, 17168, 25960, 28149, 46100, 41609, 32531]
17275C2531M17J7361Kj2506K1314p599l095J8327m278j2923L2920L5142J5636
17262A33249j621Q265r37l9235j5974K2009K5968N9725O9794O7099O8731P4029
17250D71102Q4739J9666J082n339l716J5101n5558p1968n6558n724L4415N3017
17238D80259R1291O4093r596m0099m0639r0486j00662r0011p6835m5902j2022
17227A29391K549k671L2597K3698l2040j3328K8074O835J8399k7191k8638l8832
17215I8843J1784J112k3678K0514K4549K1941R289Q398J1521J0052N6254M6008
17203B96587O3853O0139M6989K5607K8960J6941J8643k0418q4963p3525o3587
17192C15226n2320n2125k0893P535J579l902J1622N2319L2415O4096J15860P3118
$$ y = [32531, 32948, 50309, 50311, 37805, 59119, 51520, 48425, 66752, 62474, 49551, 82471, 117613, 133249, 131628, 139893, 138956, 99721, 83747, 105756, 131724, 191449, 261243, 328342, 397073, 471102, 555841, 575507, 576589, 571250, 567534, 582635, 527077, 455109, 398551, 392827, 427242, 480259, 571550, 635643, 626047, 585948, 545309, 454823, 354161, 264150, 187315, 141413, 129391, 131940, 129269, 161866, 185564, 153524, 140196, 168270, 175105, 193504, 166313, 137675, 98843, 110627, 111739, 88061, 108575, 133124, 155065, 164354, 172752, 184273, 194325, 250579, 296587, 360440, 420579, 467568, 493175, 522135, 539076, 557719, 537301, 452338, 378813, 315226, 262906, 210781, 189888, 197423, 199002, 195100, 206722, 259041, 291456, 355552, 471412, 544530]
17180E44530m425n6024p7952j19187o1465n9181k2407j3290j6527k1262k9075
17169F3735K8134J9099P730P519j1838J085q321k844N230o146l8764K080L3385
17156A00084K0978j8025p747K981M091Q561l693j070M9276N9019K8489L7774q780
17143B71938m6723j4885k3234l4810m3735J7206k1533j1700p521K598k0738Q001
17131G4864j942j0688k086j0166r988m014J6672J7476J554j6642o80N383J9416
17118G9159P705j8457R662K2851K7563j2637k1050J0194M660J249K5476k0782
17106A15593k7341J3742M0277K0913j4717k590R837j2893J749J6721J4968M4274
17094B20533K9495K2790L0142M9222j7863j4370l5526l5900p887j8598R235N120
$$ y = [544530, 540105, 484081, 406129, 286942, 225477, 166296, 143889, 130599, 114072, 92810, 63735, 91869, 110968, 118698, 126217, 114379, 115464, 107143, 104299, 109529, 103383, 64619, 66699, 100084, 121062, 103037, 95290, 98271, 102362, 110923, 107230, 106160, 155436, 214455, 242944, 280718, 271938, 225215, 210330, 187096, 152286, 108551, 125757, 104224, 92524, 85003, 87601, 66863, 74864, 72922, 62234, 60148, 49982, 39994, 35980, 52652, 70128, 71682, 55040, 54360, 59743, 79159, 86864, 68407, 78069, 100920, 128483, 115846, 94796, 104990, 109650, 110899, 136375, 115593, 88252, 101994, 142271, 163184, 148467, 145877, 155714, 142821, 144570, 161291, 176259, 220533, 250028, 272818, 302960, 352182, 334319, 319949, 284423, 248523, 240636, 222038, 231273, 236393]
17082B36393R553K3817K2290L5421J7797J8385K9445N7952N2632J5846L1182N841
17070E56554j0584n450k19k0803l7404k8416l1261j3477k133j7247m4106k7001
17058C18453k9744l3746k4728r301Q815L496j0572k1366j4652j7421k814k1192
17046A45228N801M307l0211k6452j9585j3527L8616J2606l0671o677K8661L292
17034A11388k0990j2516j933j3636j037M256k4363j0388K5113K9746M575J1682
17022A01897l852R054R3l0666k6165l9142q298K4809L7872J4801n204o071j8347
17009E0781R516K492k1830q402l382o601j3971K735r120N0J1575J0361N206J3516
16995D2926j2643m281l7135k9308J4070J5171K9050K7654J1964J8881j720j1185
$$ y = [236393, 245946, 269763, 292053, 327474, 345271, 363656, 393101, 451053, 503685, 519531, 550713, 556554, 545970, 540520, 540301, 519498, 482094, 453678, 422417, 408940, 406807, 389560, 345454, 318453, 288709, 254963, 230235, 220934, 229749, 233245, 222673, 201307, 186655, 169234, 166420, 145228, 151029, 155336, 125125, 98673, 79088, 65561, 104177, 116783, 86112, 79435, 108096, 111388, 90398, 77882, 75949, 62313, 61276, 65532, 41169, 30781, 55894, 85640, 90215, 101897, 98045, 107099, 107192, 76526, 50361, 11219, 2921, 27730, 65602, 80403, 75199, 69128, 50781, 60297, 62789, 40959, 32557, 29175, 22574, 8603, 11338, 2218, 2268, 13843, 24204, 29410, 42926, 30283, 26002, -11133, -40441, -26371, -11200, 17850, 45504, 57468, 76349, 74629, 63444]
16983F3444R20k4474j3877n866J4139J884j4234K2726J3560j5479k2483J963l589
16970A8634J3017R947j2914o120j4418k0146p771K2333k64R108r963J7641P669
16957B6753J1878J2736o888k8173N452J7337o515j1751q780l056k2115P991K4529
16944A9398L0516r158k9945M092J6669j5526j0141P471m598O833L2694k4298k3114
16931H93q489J4817K2453J2427J2287m3743j6407K3913O136J2354p598L210l0533
16918A720k996K6389J0023L835j7635Q964J985k4785j9852p801l095L9524M2093
16905E8369j4428l9139l363K7260J3929L442K0356j1832P76j0088J032k5247k035
16892A9032J6878k1425j0645J3706o95l79R43J1171K0120j2953j4469j3234j3763
$$ y = [63444, 64364, 39890, 26013, 20147, 34286, 36170, 21936, 44662, 58222, 42743, 20260, 22223, 18634, 31651, 41598, 28684, 22564, 8146, -12000, -19771, 2562, 2298, 11406, 1443, 19084, 26753, 38631, 51367, 44479, 16306, 21758, 39095, 32580, 20829, 12049, 8993, -13122, -5131, 19398, 49914, 40756, 10811, 14903, 31572, 16046, 5905, 13376, 8778, 15611, 48305, 24007, 893, -7596, 7221, 29674, 42101, 54388, 10645, -5762, 18151, 24287, 36641, 29043, 32253, 1720, -1276, 25113, 35136, 38971, 21336, 30300, 32285, 7500, -12352, -20153, -23248, 16276, 58369, 43941, 4802, 1439, 28699, 42628, 46070, 66426, 54594, 55370, 45282, 46314, 21067, 19032, 35910, 14485, 3840, 17546, 16851, 16472, 17415, 28586, 48706, 35753, 21284, 8050, -5713]
16879e713p965L571K1749J7777K5k5606K3039L0284J7287q961j6771M017P306
16866F0039k3355k8389l974j7417K3842K7059J325l7650j2011m146P602K4194
16854A7119o890m170K1390m125p869O466R236n213j8837m182o340k249k01p114
16840a2979J658L1612J4814l938k1304m7082J5310L4485J0895K2202J9195p714
16828E7154p365J3915j1006l3962k8534N050K0001o104o333P532j0893j0145L622
16815g068k376K3257K0442k2026J5195L31j0517L1405j9378k2446m27R323L056
16802A8771j096m678O620N339l8631N785K7503J1450L663N297l713K8839j2310
16789E2839j5916J217J3486j9533j0086O463J5927K578k3725l0201k4412j4443
$$ y = [-5713, -13678, -10107, 11642, 29419, 29444, 3838, 26877, 57161, 74448, 65487, 48716, 52733, 60039, 36684, 8295, 4321, -13096, 10746, 37805, 39130, 1480, -10531, -14677, -7075, 17119, 10229, 6059, 27449, 23324, 15455, 21921, 31157, 25944, 7107, 2925, -3415, -5664, -5865, -12979, -11321, 20291, 35105, 31167, 9863, -37219, -21909, 12576, 23471, 45673, 64868, 57154, 49789, 63704, 52698, 18736, -9798, -4748, 15253, 9149, 2816, 10348, -545, -10690, -7068, -9444, 13813, 34255, 12229, 27424, 27755, 17238, 48643, 29265, 6819, 6392, 15715, 18771, 17675, 12997, 19617, 24956, -13675, -7890, 19613, 31063, 34726, 40023, 36310, 65149, 52839, 36923, 38140, 51626, 32093, 22007, 28470, 44397, 46975, 23250, -6951, -31363, -45806]
16777d5806j3374M1689L9911o766p048L7333J9736k6345R942K978J6275j8695
16765D9830l8709R559j2877N042m533l962K5725k590m877J0216K4436J2529j0104
16752E9685j5784j4009r912J7626p415l0785j8749j6224P647k097K9469M031j5112
16739a1629m602l3245J32K1651J1002J2282K4723Q917j5489m256J956p659J9943
16726B3726j1754l3206K009Q614N288k5660l8905K8684L1899L262J3409j6483
16714i117k0522j5887J278L126J7885K1866K7178J3216l0984j0136L5539J6473
16702D9915l3544J1339P445l178M879L888j5105j345p401J6217k9577l5429L7273
16689E377J7384q333q536K748J40l737N655L1282k6651l2889J3954k4784O998
$$ y = [-45806, -59180, -17491, 22420, 15654, 8606, 45939, 65675, 39330, 49272, 52250, 68525, 49830, 11121, 20680, 7803, 12845, 8312, 4350, 30075, 27485, 22608, 32824, 57260, 69789, 59685, 43901, 29892, 19980, 37606, 30191, -594, -19343, -35567, -27920, -30017, -548, 3483, -11629, -16231, -49476, -49344, -27693, -16691, -4409, 20314, 29231, 13742, 9486, 11442, 3783, 23726, 11972, -21234, -19225, -10611, -5323, -30983, -69888, -41204, -9305, -6043, 7366, -9117, -29639, -45526, -44248, -41122, -23237, -1371, 25807, 39023, 8039, -2097, 33442, 49915, 16371, 27710, 35155, 31977, 36856, 40744, 25639, 24294, 16893, 33110, 3533, -31896, 5377, 22761, 14428, 5892, 8640, 8780, 5043, 10698, 41980, 15329, -17560, -3606, -28390, -21392]
16676b1392J9969J875J4053L703K950R229n446r439J6902J3116l74j1438K0746
16663E4454K5902m988j7882j4199j3132n795o726N372k2270q42J8411K1563l450
16650C6418m0343k0221J5238j7377J6334L1589K8664o608j4671k0969j1332o582
16638i860J498J8391N601n421M875o259j0255Q774k5945J0761K5257j4545j2712
16625i840m735l02j0589q945q176j1604L914P269J2388k1458j758j2895j6702
16612h3433M1752K8055J1851O442J7185L0771J5990J8724k0417k9915L015J1287
16600E1307l800k0880l2870l776J9739J9875J6143n897k1385j1807J382j3721
16588e690j9312J0671L3806K523j1799k1457n828J8626j512K407n601N641q303
$$ y = [-21392, -1423, 452, 14505, 18208, 21158, 30387, 24941, 15502, 32404, 45520, 45146, 33708, 54454, 80356, 75368, 57486, 43287, 30155, 24360, 17634, 23006, 736, -106, 18305, 39868, 36418, -3925, -24146, -8908, -26285, -9951, 21638, 50302, 43694, 29023, 8054, -3278, -9860, -8362, 10029, 15630, 10209, 15084, 8825, -1430, 7344, -18601, -7840, 17417, 2872, -9840, -14575, -14877, -25466, -34411, -42587, -54191, -50277, -43008, -30620, -52078, -53836, -66731, -83433, -41681, -13626, -1775, 4667, 21852, 52623, 68613, 87337, 66920, 37005, 40020, 51307, 47507, 26627, -6243, -10019, 9720, 29595, 45738, 39841, 18456, 6649, 8031, -5690, -25002, -14331, 19475, 21998, 10199, -11258, -17086, 1540, 28, 2435, -3166, 2475, -5828]
16575e828l365J5671j5448k1605K1310J9990o314o057J3002n831j6724j1490P716
16562a4973O069p4j2326o589J2866O1137P268l4646O681J4695j1682k0900m816
16549B710q036Q202j026j3629k2041K2558M3859J434l0586k0049K3255o641j395
16536a385n697L535Q845M25k5375k3178J6870K45o751J4201J425L6690J7074q024
16522B8900j6880l7717J9013N114N99k1532K7013L6846l5514l058j627j0252L503
16509e592j554m968j0555K2027M926L299N110o57o968J6387k7235q536M1801j2919
16495A4566L277M166j3809l3126Q837K5996P045J7277j5386j8470j538Q545N626
16482A3006k1567J3739n025M308l33J8735J3926k2393k2352N290K6949r771M646
$$ y = [-5828, -9193, 6478, -8970, -30575, -9265, 10725, 4411, -1646, 11356, 5525, -11199, -22689, -14973, -8904, -8978, -21304, -27893, -15027, 46110, 53378, 18732, 25413, 40108, 28426, 7526, 2710, -5326, 2876, 1850, -11779, -33820, -11262, 32597, 34031, 3445, -16604, 6651, 10, -1385, -7082, -3547, 5298, 5723, -19652, -42830, -25960, -25715, -32466, -18265, -16840, 19850, 36924, 28900, 12020, -25697, -6684, -1570, -971, -22503, 4510, 41356, 5842, 2784, 1157, -9095, -5592, -7146, -12114, -22669, -642, 4284, 7583, 12693, 12036, 5068, 21455, -5780, -14316, 27485, 14566, 17843, 22009, 8200, -24926, -16089, 9907, 16952, 34229, 18843, 373, -1165, 7380, 13006, -8561, 5178, 153, 4461, 4128, 22863, 36789, 14396, -7956, -2666, 24283, 14512, 19158]
16469A9158j057k4575q009J4295l97O531M085J791r965q96K5842J865k2891P474
16455A3251J9418k5091k9298M368j038Q531m168J185N918l5866J0672K1589N572
16442d957j1405l308J3766J6432K398J5384L273k3961q967N839J9334R693J7656
16429E1177r567J0828O554K1l5194o778j1145l0346K0808l499J3226P619k3197
16416i493N607k6098q659P824K2180K4493N042k767j5549J8099k2543l2049j4753
16403d8666q259K2948O6657J8854q967m7960J5014k707j4334J0399J5838q216
16391A0601l1653k151J1861K4477R690l5766j1667J4094J1890o496K6464Q227
16379B9571J7547J089L710J3978r569k3525j477j8197k0044K5492K0080J6067
$$ y = [19158, 18101, -6474, -14483, -188, -585, 5946, 10031, 11822, 1857, 961, 26803, 28668, 5777, 13251, 32669, 7578, -21720, -17352, -18390, -9859, -14027, -12842, -6924, -42790, -32118, -10529, -4957, -16362, -19670, -5904, 10528, 12926, 28310, 31583, 7622, -1345, 4494, 23828, 33521, 51177, 41610, 52438, 58992, 59013, 23819, 17041, 5896, -24450, -3642, -7141, 6085, 13704, -9493, -3886, -29984, -38643, -30819, -8639, 15854, 20896, 18129, 2580, 20679, -1864, -33913, -48666, -56925, -33977, 32680, 51534, 42567, -5393, 9621, 6914, -7420, 2979, 18817, 10601, -21052, -23203, -11342, 13135, 22825, -12941, -24608, -10514, 1376, -5120, 21344, 29571, 47118, 48207, 51917, 65895, 56326, 32801, 31324, 13127, -6917, 18575, 38655, 54722]
16367E4722q125l8977l1039p036O427K1482M057l621J564j9365l4587j7670J9810
16354e2358J1771N367N267Q505j3155j849J4079m137q13K7004N027r861l3050
16341c8203j4883Q490M7636L0197j0809J4980J8280k2005j4398k7367j7917M7598
16329B1599N3277l7533m0542j2940m2829r18M1326L1231J7256j0668q032l953
16317G274j6960J2394j046j2529J533n566j0961J744M253L4598K6914k1911j196
16304A8541k5794N905J9119K5104q640l3028j3738K7468M743k0291k4751K2115
16292c247J6649j4036j5311j534K2397j1255J6442j7171m8921J6313K1450j951
16280b0175l174O181J5117j7583k0771K6219o164J2449M205K456K6296j8284j3927
$$ y = [54722, 46597, 7620, -23419, -30455, -24028, -2546, 1511, -2110, -546, -19911, -54498, -72168, -52358, -40587, -35220, -29953, -21448, -34603, -36452, -22373, -26510, -27323, -319, 4708, -5153, -38203, -53086, -44596, 3040, 33237, 22428, 37408, 55688, 33683, 19285, -8082, -25999, 21599, 74876, 37343, -3199, -16139, -58968, -59886, -18560, 12671, 29927, 19259, 11227, 7274, -9686, 2708, 1662, -10867, -9334, -14900, -25861, -24117, -19864, 14734, 41648, 19737, 18541, -7253, -1348, 17771, 42875, 34235, 1207, -12531, 14937, 19680, -611, -25362, -3247, 13402, -634, -15945, -17479, 4918, -6337, 10105, -7066, -55987, -39674, -18224, -20175, -23349, -17168, -2051, -19634, -40405, -14186, -20350, -7901, -3696, -1240, 25056, 6772, -7155]
16267g155k1761J1695M082k243j6121N617J9193K615j1538K110J5047K3106J1290
16254C5937J3639j3853M243O82l5816j1747r58K2882Q096J3081j8337q505R123
16241A8467M511j5333J2183j9027k1507J6486O386o202P093k756J3335J3462j1136
16228A5962K55m0763l4332K9632J0746J9046J6030k0367j4355L453J239m87K97
16215a3644o377K9924N682j7077j749j194K557j2012L969k243J8832j3748k8118
16202c5198j6362n588K2492j7551j4434M013P156P200L0289O744N941j1510J4040
16189b768k421l4552P408K136k4793J2287J977Q721J0804J2031K8080J082q784
16176A1208j7753k2618j7869J9253K4970L4940o109k0237j1201n395j8351m340
$$ y = [-7155, -28916, -17221, -13139, -15382, -31503, -25886, -6693, -4078, -15616, -13506, 1541, 24647, 35937, 49576, 35723, 39966, 40648, 4832, -6915, -7873, 15009, 23105, 36186, 17849, 9344, 18467, 22978, 7645, 19828, 801, -20706, -4220, 2166, -4036, 3057, 301, 13636, 27098, 15962, 16217, -24546, -58878, -29246, -18500, 546, 16576, -3791, -18146, -14693, -13454, -13941, -13644, -20021, 9903, 15585, -1492, -3241, -4435, -1878, -13890, -9921, -12164, 6668, -7080, -35198, -51560, -57148, -34656, -52207, -66641, -62628, -55472, -48272, -17983, -11239, -5298, -16808, -2768, -5189, -39741, -32333, -30197, -54990, -42703, -40726, -32005, -21201, -9170, 18910, 19992, 11208, -6545, -29163, -47032, -27779, -2809, 32131, 26022, 5785, -5416, -10811, -29162, -33502]
16164c3502L4839j021J6492L458J3515k021J007j5001o007k3340k636O103J8043
16151I929n018J0092j1599m2160o0L7421p367j7238l903n870J5382L7930O986
16138B4525k4484j6061P606j9178K1197R719j2303P584K6810k9845P007O646j1243
16125b020j8139j2356k317K7688J0604L426j6623M707J1646m258k176k2186k1300
16112d3304n94J3696Q82q535k1630j2230K2984K4832q807M664K5390P541r621
16099d732L6005N460k7203k4928k7981J3563J1947j3364k24P00P177K3331M345
16086D096r353m406J8452J2203j7026k8230J2519L8392J2488M891o224K215L310
16073D3327p657j8123j1341J72k4012m394L7989J1940k8499k0562k3156k894J8673
$$ y = [-33502, 1337, 316, 16808, 20266, 33781, 31760, 32767, 17766, 11759, -11581, -14217, -8114, 9929, 4911, 15003, 3404, -38756, -38816, -1395, -8762, -26000, -29903, -35773, -20391, 17539, 24525, 41, -16020, -8414, -27592, -6395, 3324, -8979, -1395, 25415, -4430, 2577, 9223, -2020, -20159, -32515, -34832, -7144, 3460, 6886, -9737, -5030, 6616, 2358, 182, -22004, -43304, -43898, -30202, -29320, -37855, -59485, -71715, -48731, -23899, -32706, -28042, -2652, 4889, -4732, 31273, 36733, 9530, -15398, -43379, -29816, -17869, -31233, -31457, -30757, -23580, -249, 4096, -5257, -9663, 8789, 20992, 3966, -24264, -11745, 26647, 39135, 44026, 37802, 40017, 43327, 35670, 17547, 6206, 6378, -17634, -22028, 15961, 27901, -598, -21160, -44316, -47210, -28537]
16060b8537J8215J8218J2670j246j2347R63l455o12J9650K4687P541j255l4546
16047A9946n347J2478l6745J1023J4010K9321J4304j446j5260j8705K4392N02
16035D8473l3660j191o325j2952J6513k7789k3916J0602K2934K349J9918k238
16023A2718O688k838k2040o216p636n437L5619K0461j0908k5469k040J5820K022
16010A0744k0367l7288j1272J1361r09o550J3778l124O513L3277J7408K830O669
15997B3070j2229q47j0742j5727j3673K8904J4523k8963k478R027k102J9827j1933
15984c343m5747k4432J7278L5570L3227K487J915M503J1550L138n551j5498P451
15971B2548R46j0143J0204r473l767k1882J9381K4088O030o149k894k0604j4914
$$ y = [-28537, -10322, 7896, 20566, 19320, 6973, 7936, 4481, 3869, 23519, 48206, 55747, 54492, 19946, 14599, 27077, -9668, 1355, 15365, 44686, 58990, 57544, 42284, 23579, 47971, 48473, 14813, 13622, 7297, -5655, 10858, -16931, -40847, -30245, -7311, -4962, 14956, 12718, 19406, 16568, -5472, -11688, -19324, -24761, 10858, 31319, 20411, -5058, -7098, 8722, 10744, -9623, -46911, -58183, -46822, -47731, -54281, -40503, -43627, -37114, -3837, 13571, 16401, 23070, 10841, 9994, -748, -16475, -30148, -1244, 13279, -15684, -18162, -9135, -11237, 8590, -3343, -49090, -73522, -56244, -20674, 12553, 15040, 16955, 21458, 33008, 36146, 30595, 15097, 22548, 23494, 13351, 23555, 14082, 10315, -11567, 7814, 31902, 37932, 31783, 28889, 8285, -6629]
15958f629m176K263k7881K8623k243q781n83o36k375k810Q517p839j7295m39L1086
15943a1198J2521j7388j7523J0917j6816K2987O573q336l261R241J2821p097K8324
15930B1765J9393j2994o975J0316j6011j9902q51R620j7093L133J7196J9124Q113
15917C4834m922K839k0442l735j841k2059j0929J8927m323o746J204J2336J4656
15904I799j433r162l948N098j2507j5200m423L624O914O388O500k7528K2159L2172
15890A8453J0436K115p499r398l5660j8330L6060L1691j0195J109j0l437q825
15877F510p225j6338j2316n767L1888M0684j6021j8276k4340l0672J9715K3956
15865h202J4604K1481j3855o2680J7028J9445P765J4326K975r0J703J9956q336
$$ y = [-6629, -10805, -8542, -36423, -7800, -10043, -18824, -19407, -20043, -22418, -25228, -16711, -24550, -41845, -42284, -11198, 1323, -16065, -33588, -22671, -39487, -16500, -9927, -18263, -21524, -12283, 538, -6559, 21765, 41158, 28164, 21189, 31505, 15494, -4408, -5259, 4361, -12732, -9599, 7597, 26721, 34834, 29912, 32751, 12309, 8574, 6733, -15326, -26255, -7328, -11651, -18397, -17193, -4857, 9799, 8366, -796, -4744, 354, -12153, -27353, -31776, -28152, -21238, -14850, -8350, -35878, -13719, 18453, 28889, 31004, 23505, 14107, -21553, -39883, -3823, 27868, 17673, 18782, 18772, 15335, 6510, -715, -17053, -29369, -35136, -3248, 37436, 21415, 3139, -21201, -51873, -32158, -8202, 6402, 27883, 14028, -48652, -31624, -12179, -4414, 9912, 12887, 12797, 14500, 34456, 26120]
15852B6120P99N85J0871p67j9575L743M223J6104j6604j9498n221J5940J5674
15839C2394j945k3570j1773K7712K406M170O531k996Q724j6511Q636o255j8174
15826I349Q37j5474k955K6242K7137P423p515k1325k1016n718j0135j1826L1359
15813F383N359q922j5077P501N855j9420K8455K0223r614j3009K2565J3716k0699
15800B3316n0144l5827P435k0195K4015N2553M3336J5581l19k7626j3446k3651
15788d972p521J2241K9172J800J0512k0740k6256o536L261q05P644J2663j948
15775H515p429l345j0159Q318J4994j8730j502J4524K0714l5416j4587m510N127
15762b3486J8000m7865k7965J5417J0682P818K4594J9900k6415M99q926k1989
$$ y = [26120, 26919, 27504, 38375, 37608, 18033, 21776, 25999, 42103, 25499, 6001, 780, 16720, 32394, 30449, 6879, -4894, 22818, 25224, 29394, 35925, 32929, 41653, 25142, 33778, 27523, 9349, 10186, -5288, -8243, 17999, 45136, 52559, 45044, 23719, 2703, -3015, -13150, -24976, 6383, 11742, 2820, -12257, -4756, 1099, -18321, 10134, 30357, 20743, 7734, 30299, 44015, 23316, -26828, -62655, -55220, -75415, -51400, 1153, 44489, 60070, 59751, 32125, 18679, -4972, -12493, -252, 28920, 30720, 41232, 20492, -5764, -12300, -9039, -9844, -2200, 10463, 8515, 1086, -2259, -12418, -4100, 10894, -7836, -9338, 5186, 25900, -9516, -24103, -28613, -23486, -5486, -53351, -81316, -65899, -55217, -47399, -22805, -2905, -29320, -28821, -37747, -59736]
15750e9736P894j9913K8117K7138j8639j9092J5450Q080L3040K4395M51m0476
15738a3291k2773K1985j7192j7879K0278J7153J1022m973N783q849o53l1463j4297
15725e5149J708K8033K8930N718p461n448k0037k366k57K2781j2084M248j1537
15712b2921k890K4265K8326N702l0946j7373M621n268j0415J9165K6103j4600
15700C769P131J3403l669K456R099p290j0348J4604J6940k0915K491m1194j9598
15687c3121J5268m541Nk822K710K0533q87l4051r619n371J0316L4167J7009K9930
15673C9526l369l7844j549k324J3079Q307j398J0393K689R44j0444J4536O875
15660C9421q331J2773j0797k1650k9314p883j2216j4978J7969J9129J9262m152
$$ y = [-59736, -51842, -71755, -43638, -16500, -35139, -54231, -38781, -30701, 2339, 26734, 27185, -13291, -36064, -14079, -31271, -49150, -28872, -11719, -697, -5670, 113, -8736, -9389, -40852, -55149, -53441, -25408, 3522, 9240, 1779, -3669, -23706, -26072, -26329, -3548, -15632, -11384, -22921, -25811, -1546, 26780, 32482, 1536, -15837, -11216, -16484, -26899, -7734, 18369, 3769, 10900, 24303, 20634, 23090, 32189, 24899, 14551, 29155, 46095, 25180, 27671, -13523, -33121, -17853, -22394, -22389, -25211, -22501, -1968, -2855, -36906, -46525, -51896, -41580, -7413, 9596, 39526, 36157, -1687, -3236, -5560, 7519, 15826, 14428, 24821, 27510, 28454, 18010, 32546, 39421, 31090, 43863, 33066, 11416, -17898, -25781, -37997, -52975, -35006, -15877, 3385, -767]
15648g67l769j8240j5832Q517J5669K277k2852j7374J3003K7016O831j2992j6955
15635c5468r141L2412M4407k1661j8286L0598n79k0948n335J6036J9008J0771
15623D1814n2179l1520J6696J6179K3013M040j0184k1151m619K1594J7986O357
15611B8026j6057j1298l652n178k1706j7984Q670L1249K8655N195k399R242j6689
15598A6074Q34R233l762j6203k465M203R956j6109k9743Q68K238O690J1357J8736
15584A1907K320j2072k1342j7378J6406O470j1634R243K14J974K125P503j6168
15571b0432j8600k6196N795L7983J3936J7492J1290j2744k6397j6994J2391K059
15559b0417N885L2788N292k382p183j7088q057n20K0488l916J7117P880J1885
$$ y = [-767, -4536, -22776, -38608, -30091, -14422, -12145, -34997, -52371, -39368, -12352, -5521, -18513, -35468, -44609, -12197, 32210, 10549, -7737, 22861, 22282, 1334, -4001, 12035, 31043, 41814, -10365, -41885, -25189, -9010, 14003, 18043, 7859, -13292, -17911, 3683, 21669, 28026, 11969, 671, -2981, -8159, -29865, -47849, -39179, -7930, 20725, 25920, 23521, 32763, 16074, 16908, 26141, 22379, 6176, 3711, 7914, 17870, 1761, -27982, -27114, -24876, -18186, -6829, 11907, 14227, 2155, -19187, -36565, -20159, -13689, -25323, -16080, -15866, -13892, -11767, -4264, -20432, -39032, -65228, -59433, -21450, -7514, 9978, 21268, 8524, -17873, -34867, -22476, -20417, -14532, 18256, 23548, 21166, 13983, -3105, -11162, -11682, 8806, 4890, 22007, 29887, 41772]
15546D1772N893k05j1787j8599l1242j4643J6132j79p781L718J0588k0054O509
15533a9878j4237o116K0191J4918r507k517L18P443N543R726K326j0694r83k6342
15519b9809l354J1586K0330L6034k0229j6877k0724k4116P912m387J1251J0137
15507b2246K2593P138o899j1885k0197k0769L439L6360L3981j8264j2247R785
15495G89K747J6380j3198k1496j425J6445j5125J6066O768P524K1493K0184r485
15482D7667o496j6516j987j707j976j1792Q935l0520m053N93j5500J4908J4629
15469c815J0248r379m625J0061l316l656J5963n942j492K4635J2087m0978k5102
15456b5311J2320J3722j4962o183K1450M377j7827O339m077L23J3108j0489O202
$$ y = [41772, 47665, 47460, 35673, 17074, -14168, -28811, -12679, -12858, -20639, -16921, -6333, -26387, -19878, -34115, -40231, -20040, -5122, -14629, -17146, -16828, -9385, -3842, 5884, 8210, -2484, -3467, -29809, -33163, -21577, -1247, 34787, 14558, -2319, -23043, -47159, -39247, -43634, -32383, -22246, 347, 7485, 586, -11299, -31496, -52265, -48826, -12466, 21515, 3251, -8996, 789, 3536, 19916, 6718, -14778, -16203, 242, -14883, 1183, 7951, 15475, 36968, 57152, 47667, 41171, 24655, 22668, 20961, 18985, 7193, 16128, -14392, -18445, -17852, -33352, -18444, -3815, 6433, -2946, -7571, 2490, -826, -4482, 11481, 5539, 4047, 28682, 40769, -209, -25311, -12991, 731, -14231, -20414, 1036, 5413, -12414, -6075, -10152, -9829, 3279, -7210, -1008]
15443a008J2501Q550j4680j3577k8919K511j1676j7659K7159L8800J1630k3808
15431a0176K076J1316M378J4362J1943l1886j5084l1795j1806J9516R522J0712
15419a6922m461m565q111K247o43J7806J8912J5072J2318k9822K6446L2077R576
15406F9930k8213n6374J1231L104m53P579o696q134j0390j6287J0249J507J0340
15393a2607O920n054k7831J912K097l0823Q688k5058J238K3036K6518L8267J6123
15380B3426n939j7464j8644J206P632K579K670j5537m850J8121j403J970j6365
15367b2598k116L7971K1712j8481k7597L0490M8566j2131k8181l1097j3125L395
15355a3192N390N720j998r434j9685Q921J1873M524q093q027J9119K1041l414
$$ y = [-1008, 11493, 20043, 5363, -8214, -37133, -34622, -46298, -63957, -36798, 2002, 13632, -10176, -8100, 3216, 7594, 21956, 33899, 2013, -13071, -44866, -56672, -37156, -27634, -16922, -21383, -25948, -34059, -31812, -32455, -14649, 4263, 19335, 31653, 1831, 28277, 60354, 69930, 41717, -14657, -3426, -322, -775, 6804, 108, -8026, -18416, -34703, -24454, -22947, -12607, -5687, -10741, -38572, -36660, -34563, -65386, -56698, -81756, -80518, -57482, -30964, 7303, 23426, 17487, 23, -18621, -17415, -9783, -7204, -4534, -20071, -24921, -6800, -8203, -6233, -22598, -24714, 13257, 34969, 16488, -11109, 19381, 67947, 55816, 27635, -3462, -16587, -13192, -7802, -2082, -4080, -13514, -33199, -24278, -12405, -7881, -15974, -24001, -4882, 16159, 12745]
15342A2745m2383m1390K0808K2013J5169M3614J5697k2288n1704k575J878M298
15330b4118K4047J8430k0347q466Q071R225J4100R082k938J6462j196k3881l0076
15317a1605K5771K165p070K1369k927j1757n761J1046p748k5593k3019j0591L4057
15304a1663K4395J565j7190q047m860j8233k5211r38K8471J6314j7365J1634J3361
15291g767J3616O708k8860l2814q992Q74l203N533m139N095Q579p030J8352j4733
15277d8781l3721K9968L5260j5261L793j364J088J702m465K3679R724n811p142
15264a1331j6593k5029L691R814J6211J1755R08k1633l19R226K0300M4762K0934
15251F2696o414l9781l5395N208O21J8176K3870K96J2405l201q911K860o481j3407
$$ y = [12745, -29638, -71028, -50220, -28207, -13038, 30576, 46273, 23985, -27719, -30294, -28416, -24118, -71, 18359, -1988, -10454, -2383, 6842, 20942, 30024, 27086, 43548, 42352, 18471, -11605, 14166, 16331, 9261, 30630, 27703, 15946, 10185, 21231, 13483, -12110, -35129, -45720, -11663, 12732, 14297, -2893, -10940, -15800, -34033, -59244, -60182, -31711, -15397, -32762, -21128, -7767, 5849, 12557, -16303, -49117, -58109, -57235, -60438, -54905, -59044, -53949, -45370, -52400, -34048, -48781, -82502, -52534, -17274, -32535, -28742, -30106, -29018, -27316, -31781, -8102, 1622, -4189, -11331, -27924, -52953, -49262, -39448, -23237, -11482, -10574, -32207, -32526, -23300, -3000, 41762, 62696, 56282, 16501, -18894, -13686, -13065, 5111, 28981, 29277, 41682, 38481, 29570, 32430, 25949, 12542]
15237A2542p214j6962L964K1774l68m827K2763J3479l655k3507q814j7869J3771
15224E077m70m7765q407J8021N426N804q061J8328L0008k2281l3091J3963L6499
15211A3051k7598p359k731Q960K667j5986k9191o046M825K1992K5725j1205J8522
15198d374k591j9867j0302J9165k6774R788j250j4366J9957L0551j7364k497L194
15185a6730j872P062m968J221p077J3178K9161K502l613k9299k6829P652J9807
15172i805J5072K314p634J3812k5746n839J3661J5820O447l2588j9183J7023J3046
15159c600q278m34k1488r901K0883n169L185J42Q440K5241o155l3476l3119J7466
15145d6263L2264M6051Q454j7853P422K8386k8039k5464P097J7566n330k5216
$$ y = [12542, 5328, -11634, -7670, 14104, 13736, 8909, 31672, 45151, 41496, 17989, 9175, -8694, 5077, 4607, -43158, -51565, -33544, -28118, -22314, -30375, -12047, 17961, -4320, -37411, -23448, 13051, -14547, -21906, -24637, -15677, -13010, -28996, -58187, -64233, -59408, -37416, -11691, -22896, -4374, -6965, -26832, -37134, -17969, -44743, -34955, -36205, -50571, -30614, -63, -17427, -19924, -16730, -18602, -11540, -16508, -15287, -22364, -9186, 19975, 22477, 18864, -10435, -37264, -29612, -9805, 5267, 7581, -53, 13759, -11987, -17826, -4165, 11655, 18102, -14486, -33669, -16646, -3600, -11878, -12312, -33800, -43701, -22818, -27987, -24802, -24660, -16220, 9021, 2866, -30610, -63729, -46263, -13999, 32052, 40506, 22653, 30075, 58461, 30422, 4958, 12055, 29621, 24291, -925]
15133i25r734l972n814j7008j3183l760J2218R857J3530j0609p853L1285K5135
15120A9167l942M581j7965k7736R769O754j4796P272L901J3099J5942m725j0957
15107C64l0523q433K1065J1380M765J1303K0813K3045j9363k6717k9947M193K0345
15094B290N164j6928o153o087k6875j1225K2539Q628O404J1814J5670R99o709
15081d69j9129N959K403j3750k0125m1978J1847K4817j6165j0677L3637M6919
15069C289l395J0271L1190J3880l843j0298j9969r617q087j4839Q532K118j0854
15056a1622k6714k778P417O883J5472J5189k726k1656j0497r484q81Q468J8280
15043a4649J5381k0221n357L260J1617P736J9853J2787L960j3638r086k4870n451
$$ y = [-925, -10659, -14631, -20445, -37453, -50636, -54396, -42178, -32321, -18791, -29400, -37253, -5968, 19167, 15225, 19806, 1841, -25895, -16126, -9372, -24168, -16896, -12995, 104, 16046, 11321, 364, -30159, -38592, -17527, -6147, -1382, 9921, 30734, 53779, 34416, 7699, -22248, -18055, 2290, 7454, -9474, -15627, -21714, -48589, -59814, -37275, -28647, -22243, -10429, 5241, 6240, -469, -19598, -13639, -11236, -24986, -45111, -87089, -75242, -50425, -66590, -77267, -43630, 3289, -106, 10165, 41355, 55235, 51392, 41094, 21125, 11508, 3421, -11418, -2886, -768, -11622, -38336, -41114, -33697, -26814, -11342, 3847, 1121, -20535, -31032, -40516, -41397, -32929, -14649, 732, -19489, -24846, -21586, -9969, -2233, 17620, 30407, 34367, 20729, 11643, -13227, -18678]
15030a8678p693j6903l1368o977P902p345J8061L7704q248j7931q746J690j038
15017e9570L3162K2799j4162J0310K4617J4703j5479l872K913k4208j4644J1905
15005a1526j1828j1421M1283J0285j0670L772j741q006l2104o731K7869J3174
14993B356j8700m74j3236P679L8194L80k2754m9458k0738J6607K3003K0264J2750
14980d127L1393n582l8546J1860L525l623p524K851K1008k323k8285n790r740
14967c4903J1379m074j2601n248k0015K0828L2994p713K6598j3678k1987q627
14955c7047J1159K2636K56k905m39j3522O829K0424J0762M731K5673n289k2139
14942B1129K304K2653l525k7085J041l702m706q009j0401J8610k1764R698O944
$$ y = [-18678, -26371, -43274, -74642, -81619, -73717, -81062, -63001, -25297, -33545, -51476, -60222, -58532, -59570, -26408, -3609, -17771, -7461, 17156, 31859, 16380, 12508, 15421, -8787, -23431, -11526, -23354, -34775, 6508, 16793, 6123, 9895, 8154, 148, -31956, -38687, -10818, 2356, -16344, -16818, -30054, -22375, 15819, 16199, -6555, -56013, -76751, -60144, -37141, -16877, -4127, 27266, 21684, -16862, -5002, -1477, -5100, -12624, -9773, 11235, 8912, -19373, -25163, -34903, -23524, -27598, -40199, -45447, -65462, -44634, -11640, -19353, 7245, -6433, -28420, -37047, -25888, -3252, -2996, -5901, -6340, -19862, -13033, 7391, 18153, 22884, 48557, 43268, 21129, 23433, 46086, 42561, 15476, 16517, 12815, 8109, 100, -10301, 8309, -13455, -3757, 3187]
14929C187P62j0702j7214q400J963p38j2492J8585L5851r273l51K590K1498L3900
14915E9166l1359j6080J3059L1427k6665j2270n943k2316J0818j676N811J0797
14903A4769k3539k0017m068L5318L1573l2014j0177J7790j9342j690n275q09j701
14890a9182k948l330K0576K3451K4302j8202o885R974p631O28l1979j1327j2412
14877c4965o648L7755K4506O241r637m766J1209L2121l588k6037k3835k8261k2040
14864d7945K717K2328Q947k2377O206O91j6907M917j1366q384K630K7075K1335
14851a0133j4625k863q496o919K6996j7316j229K3275j0232k3582N559J1138q819
14838c7246l0281K5624K2149k3872k9449K379J0677M0711M6248k5986l6577M203
$$ y = [3187, 3949, -6753, -23967, -32367, -30404, -31142, -43634, -25049, 10802, 1529, 1178, 3768, 25266, 59166, 27807, 11727, 24786, 56213, 29548, 17278, 11335, -10981, -163, -1839, 3972, 14769, -8770, -28787, -32855, 2463, 34036, 2022, -8155, 9635, -9707, -11397, -16672, -17481, -19182, -22130, -25460, -4884, 18567, 42869, 24667, 17782, 27756, 20125, 20753, -11226, -22553, -34965, -41613, -3858, 20648, 26889, 17252, 12486, 23695, 55816, 52228, 26191, 2356, -25905, -47945, -45228, -22900, -13953, -36330, -30124, -29433, -46340, -41423, -52789, -61173, -58543, -31468, -10133, -24758, -27621, -36117, -43036, -16040, -33356, -34585, -11310, -21542, -45124, -39565, -28427, -37246, -67527, -41903, -19754, -43626, -73075, -70696, -60019, -19308, 26940, 954, -35623, -31420]
14826c1420K6567K078M772J8806K715J8010j2547m745J3520l8118l8395N022K9299
14813d436j1275l6328q345J8922J7034J8202M9007M1907l1792l0409j0429r356
14801B702j5664j4478l0313Q787K6598K7556M545n941m930j37J5872p417l7842
14788c0662j1408j2502O613J1734n031L331J6124J581j1647j8040J5686K3095
14776a1126K306k8042j2062J1239O264l985J6489J6562K1042n793l991N817k1579
14763f859j5223j2553J3563m496J2802J3161j679J0868L43J2743J2585k8314l2215
14750b5274j9269J3133J5168M582J2558N053Q763j3823j6078K678j2494l851L672
14737b5182J8151M327q604k739M5128n652o587R711k8475k4077J2128K638J4559
$$ y = [-31420, -4853, -2775, 1997, 20803, 23518, 41528, 28981, 24236, 37756, -362, -38757, -33735, -4436, -15711, -52039, -60384, -41462, -24428, -6226, 42781, 84688, 52896, 22487, 12058, 2702, -12962, -27440, -57753, -48966, -22368, 5188, 9733, 3792, -1138, -1275, 14597, 7180, -30662, -42070, -54572, -47959, -36225, -41256, -37925, -21801, -20220, -31867, -49907, -34221, -11126, -8820, -36862, -48924, -37685, -31421, -35406, -18917, -2355, 18687, 12894, 8903, 14720, -6859, -22082, -34635, -21072, -25568, -12766, 395, -1284, 9584, 9927, 22670, 35255, 6941, -25274, -44543, -31410, -16242, -11660, 898, 5951, 14714, 891, -15187, -12509, -25003, -28854, -25182, -7031, -2704, -11308, -14047, 31081, 25429, 18842, 28553, 78, -23999, -11871, -9233, 5326]
14724E326O557K687k8086j8088q155j9130N912K5316Q567l86k573P463K578j1754
14710b3766q202Q945J5226K3002K4148k3780j2422L2373K9096l6610l6307J2643
14698D346Q174k9212q705K8023K9797j2531j2832j0863j3392l1808k8851Q525
14686f9329J5792O829r754J6385r019O41L978K254J7208L3541j4568l4832K0032
14673b0842L504p377m907j1287j0641p529L0226K7416J5491J6847J8394j7199
14661C2096k7702J434n585n806j6211j0567R809O535k614r904k250l592J6383
14648a7974K7828K2900j5220k2155k8837k0591L94j5849J2650J8548K0584K0165
14636B443J0699K1500o17J822P429j0198O606j687q73j0441m7259j4828P588J0407
$$ y = [5326, 11883, 14570, -13516, -31604, -39759, -58889, -52977, -27661, -19094, -19480, -22053, -14590, -12012, -23766, -31968, -23023, -7797, 15205, 39353, 15573, 3151, 35524, 64620, 28010, -8297, 4346, 12520, -16692, -25397, 2626, 32423, 19892, 7060, -3803, -17195, -49003, -77854, -69329, -53537, -46708, -56462, -40077, -49096, -48455, -44477, -42223, -25015, 8526, -6042, -40874, -20842, -17338, -24715, -29622, -40909, -51550, -59079, -28853, -1437, 14054, 30901, 49295, 32096, 4394, 5828, 243, -5563, -21774, -32341, -22532, -15997, -18611, -28515, -30765, -34357, -17974, 9854, 32754, 17534, -4621, -33458, -54049, -53655, -69504, -56854, -38306, -17722, 2443, 13142, 34642, 34025, 35847, 43276, 33078, 39684, 37997, 37124, 26683, -20576, -35404, -27816, -17409]
14622a7409N225L1155J285j608j6539O503j4151R64J6704n042n4779J3240j678
14609c6130P90J8138j0106j3982J5831J9806Q775j2207k9187M002l157K337K817
14596c2273L0291L9248J2895l6142o640k0346J7598j9196k2830J4487K8939P68
14584F799l3253N233Q673J7430p612k965J6596k8635p237j7860j2823J3664P359
14571c4631J3423J3915L605R198j3280j6436K3061K2195j6509L385k9193j8876
14559d0143J8590J9979j194P181k8965J4594J9585k507r06J4130l902j724K2896
14546C7614k3133k4165k0126j6028k1934m392K3252R771j5575J4786L9815O49
14534E34j0415K0416j0314j7605N261j6981M545J8393J0004K485j0274R884L830
$$ y = [-17409, -12184, 18971, 20256, 18648, 2109, 8612, -5539, -4575, 12129, 7087, -47692, -34452, -36130, -35340, -17202, -27308, -41290, -25459, -5653, 3122, -9085, -38272, -34270, -37427, -35090, -32273, -1982, 37266, 50161, 14019, 7379, -12967, 4631, -14565, -37395, -22908, 6031, 6799, -26454, -21221, -12548, 4882, -2730, -5695, 10901, -17734, -24971, -42831, -55654, -41990, -34631, -21208, -7293, -3688, 5510, -7770, -24206, -1145, 21050, 4541, 7926, -21267, -40143, -21553, -1574, -2768, 4413, -24552, -9958, 9627, 7120, 6214, 20344, 16442, 14718, 37614, 14481, -9684, -29810, -45838, -67772, -72164, -48912, -39141, -54716, -39930, -115, 534, -9881, 10535, 221, -17384, -12123, -29104, -24559, -6166, 3838, 6323, -3951, 5933, 9763]
14521I763r558M872K834k3510o487Q799K082J8809L0416O247J5371k8786k2601
14508H251N600k3229j1713N606K0414L1439J5037m1990j4337K5573K687l558j4703
14495E077k9632j5952l780N323J7280J7705q22k423l1591N971R747l645k2012
14482d8754P167J4699P250N239K3930J1062k2195k1974k4058j626p08J999J0708
14469c7261j7557n712J6710P551J8839J4525J1701J6952j0414j4109j4265l0195
14457d3235r619M2524K883j9252J4868J8812J5628J5711j3912k899K938k5547
14445a100j3830k189K9713M774P039o437l248j0426p6J2079j5161o158m429k4937
14431c4386l0071r655l419l475K1524L683J5834K9548K801j3119k571J578k318
$$ y = [9763, 205, 5077, 7911, -15599, -22086, -13287, -11205, 7604, 38020, 44267, 59638, 30852, 8251, 13851, -9378, -21091, -15485, 4929, 36368, 51405, 9415, -4922, 20651, 23338, 19780, 5077, -24555, -40507, -44287, -38964, -21684, -3979, -4801, -7224, -38815, -32844, -23097, -26742, -48754, -41587, -26888, -19638, -14399, 9531, 20593, -1602, -23576, -47634, -49260, -49968, -47969, -37261, -54818, -60530, -43820, -36269, -17430, -2905, 8796, 25748, 15334, 1225, -13040, -43235, -52854, -10330, -7447, -26699, -11831, 6981, 22609, 38320, 24408, 21509, 24447, -1100, -14930, -17119, 12594, 17368, 24407, 17970, 14722, 4296, 4220, 16299, 1138, -5020, -9449, -34386, -64457, -74112, -77531, -81006, -59482, -55799, -39965, -10417, -7616, -20735, -23306, -21728, -24046]
14418b4046n849l6856O34K8399O260K7523K8972o752o225J2882K2905k6119k2668
14405i40L904J8914o064m916J1851j8M430k4200J7756N136o532j9127r377k3822
14391c3005l0211R099J6451l17m304N269K3168O289l218K9804L1804l5356n0816
14378c5343r963K1387K4369Q156l9566j2309J0719m615l187k912J7838K5305k5181
14365b5302k4199m062K1889K1474J2214r1N727l40k8487N751Q144j831J9180j1689
14351a622m937l787J191k611p043J3589j3423j9621J2447Q094K6283J911l0936
14338b0465p127j6458k75K7103K1086N328k3329j1363J0598K819k2651R988K5333
14325E87j2521P794K1257j0692q778m168p891j0479r753l740J310K2635J0323
$$ y = [-24046, -29895, -66751, -66117, -37718, -31458, -3935, 25037, 18285, 12060, 24942, 47847, 21728, -940, 2964, 21878, 15814, 10898, 22749, 22731, 27161, 2961, 20717, 25853, 19321, 194, -9183, -33005, -63216, -54117, -37666, -37983, -42287, -37018, -13850, -7561, -10779, 19025, 50829, 15473, -35343, -45306, -23919, 450, 8606, -30960, -43269, -32550, -37165, -40352, -43264, -25426, -121, -25302, -49501, -53563, -31674, -10200, 2014, 1923, 7650, 7310, -21177, -15426, -7282, -9113, 10067, -1622, -6559, -10346, -9155, -11766, -18809, -5220, -18643, -38264, -25817, -17723, 8560, 10471, -20465, -27592, -44050, -44325, -17222, 3864, 9192, -14137, -25500, -14902, -12083, -34734, -24746, 587, -11934, -4140, 17117, 6425, -2353, -6521, -14412, -24891, -34644, -38384, -37074, -14439, -4116]
14312d116K1507J0496P562O385n7959m2131P368J8371J773J1787K2085K8136j717
14299B9547k2727k2505L642K5728p046k2860m808j3077J6044k4746N874M662O281
14286b5991J6603K9000j778k1255j2143J4066K1654J8778K5705j697j2000k5930
14274B5012j4526K2790N606j6961J0309k6377r896j2768j8009j8049J4725m611
14262d2755J1595M924J6957Q492L314q262q238K2479j4029k3667J2793K6016N431
14249A5050o562k050l1428m7796n627K1756L2567l195r316O012J9103R901n184
14236f769r136J3343l551O726j2860l0462j7170J4336J7898M694J56J2661J0632
14223D98M49l8414r902J7745R471J6787K3569j4981j7752m564J427J8010J786
$$ y = [-4116, 17391, 27887, 35449, 41834, -16125, -58256, -50888, -32517, -30744, -18957, 3128, 31264, 29547, 6820, -15685, -12043, 13685, 6639, -16221, -21029, -34106, -18062, -42808, -36934, -32272, -25991, -9388, 19612, 17834, -3421, -15564, -1498, 20156, 38934, 64639, 62942, 50942, 25012, 10486, 33276, 38882, 21921, 32230, 5853, -4043, -16811, -34820, -52869, -38144, -42755, -31160, -26236, -9279, -787, 2527, -5735, -13973, 8506, -5523, -29190, -16397, 9619, 15050, 8488, 6438, -24990, -72786, -78413, -56657, -24090, -27285, -36601, -30589, -11486, -1585, -6769, -15905, -2562, -6113, 613, -12247, -42709, -59879, -45543, -27645, -22951, -22795, -10134, 498, 947, -37467, -47369, -29624, -20153, -3366, 20203, 5222, -12530, -17094, -15667, 2343, 4129]
14210D129o295N45J1818J5034j3453j722J2032L85q042k716k3555r895L8636k2026
14196e125k1371J4832o753j5528Q05p236J6374J6415J4404m50J5558o299k7219
14183a1593k7626q660L6970K7364N116K945j0076j1897k5226k667l175r191J3327
14170b4389R965K762j6001k0943o264J7989K9914J5982q865J5114K042m833J2800
14157B5273j6545k8637O917M635k787j3626j1400k8896J7985M4405K6695m877
14145A9142m4124o579J2191K3512k2641m8865K0115K1589K8987K2568j9645k032
14133D218J5140K4262l1083k2696J2280J7413j6745Q819J1238J5583l3079j9277
14121a3927M454q257m741J7468R141k5905P160L1808O12m8993j988L88j1151M66
$$ y = [4129, -2166, -1621, 10197, 25231, 11778, 10056, 22088, 22473, 14431, 11715, -11840, -21735, 16901, -5125, -26496, -11664, -18417, -33945, -33140, -40376, -24002, -7587, 6817, 6367, 21925, 15626, -11593, -39219, -47879, -10909, 16455, 21571, 24516, 14440, 2543, -22683, -25350, -28525, -37716, -24389, -14424, -11662, -27663, -48606, -54870, -36881, -6967, 9015, 150, 15264, 17306, 12473, 25273, 8728, -19909, -12992, -8357, -11144, -24770, -36170, -65066, -47081, -2676, 24019, 19142, -24982, -31561, -19370, 4142, -18499, -67364, -47249, -25660, 3327, 25895, 6250, 4218, 19358, 43620, 12537, -10159, 2121, 19534, 2789, 11608, 22846, 38429, 5350, -13927, -9473, -17730, -22471, -5003, 4138, -21767, -14607, 17201, 17813, -31180, -33168, -32780, -43931, -43465]
14107d3465M1804l044K867K482j8601j352J0335K5162J2113j6563j2292K676p496
14094e374m746k935r743k019K7958J7652M075K8947m9134j5693L2045J2936j8287
14081A5682l0329l4178O696J0117L8367j0192k4839r434o65R822J0829J106N513
14068a1505L2323J5077q177J2212j9649k041k377J9658q896l7872k4552r439R935
14055c5303j9934J154K2695L3489R078o954O096K2396K2639r133j4470j1558k9551
14042i356J9826K8791K2407j8458m0015j3093R816P832j8944j6690O752j6026
14030c7158n880r182Q824K9908k227m574j1983K395o665j6018P114K3761J4247
14017g438q193K0977J334k3670k495K3079k6263k6656p509k59M831K62M249j137
$$ y = [-43465, -1661, -4705, -1838, 644, -17957, -19309, -8974, 16188, 28301, 11738, -554, 2122, -5374, -10120, -13055, -22798, -24817, 3141, 20793, 24868, 53815, 4681, -11012, 21033, 33969, 15682, -14647, -48825, -42129, -32012, 6355, -3837, -28676, -38110, -38775, -28953, -18124, -17018, -11505, 20818, 35895, 27718, 39930, 20281, 18240, 15863, 35521, 26625, -11247, -35799, -45238, -35303, -55237, -54083, -31388, 2101, 11179, 4225, 10321, 32717, 55356, 46223, 31753, 20195, -9356, 10470, 39261, 61668, 43210, 3195, -9898, -82, 7750, -11194, -27884, -21132, -37158, -43038, -52220, -43396, -13488, -15715, -20289, -32272, -29877, -36542, -52560, -45446, -21685, -7438, -15631, 5346, 6680, -16990, -19485, 3594, -22669, -49325, -56834, -57093, -52262, -52000, -47751, -48888]
14003d8888j8837N486O601J1303N836n664j9381N323K1998j5981J1529J6254J0636
13990a3785K5203j1035j5841M890j168k750J2968J3896k798j5601j5465J1220
13978a0266K0106o778k1360Q845K3239j2899l758L0993L673k5467j9190k170L784
13965a1248L122K8468j3084P291k442k3725j8284l169N187J1242J6618K0751k218
13952A8509j1309o853K403N420j2132k6561n905Q774K6304L5286k4306n1123p562
13939d9055L9463P977j646J65J5278p327p744m165M357O083O708J2933k0476l7578
13925c5027p119J0121k1098N270J8301J3373k98l4529k2269P421O8116K8373j7229
13912A3406j1593n99L213K4236l2222j8261L761L0115K6131J269j3825j7971j2775
$$ y = [-48888, -67725, -62239, -55638, -44335, -38499, -44163, -63544, -58221, -36223, -52204, -40675, -24421, -13785, 11418, 383, -15458, -10568, -11736, -14486, -1518, 12378, 9580, -6021, -21486, -10266, 9840, 3062, -18298, -9453, 13786, 887, -2871, 28122, 31795, 6328, -12862, -15032, -11248, -8126, 20342, 7258, 14549, 12107, -11618, -29902, -33071, -27884, -16642, -24, 20727, 18509, 7200, 347, 2750, 8170, -3962, -30523, -36428, -27654, -1350, 33936, 9630, -41493, -49055, -9592, -1615, -3261, -3096, 12182, 4855, -2889, -7054, -2697, 3386, 10094, 23027, 2551, -35027, -42146, -32025, -53123, -47853, -29552, -16179, -16477, -51006, -73275, -65854, 2262, 30635, 13406, 1813, 1214, 4427, 28663, -3559, -21820, -18059, 12056, 38187, 39456, 25631, 7660, -5115]
13899e115J7856K8233r769m3119j981J5766k5468P11j8874k3700J1712J6308j8193
13886e5633K7898L9798J8155K3367k772l6629k5555P483J7904M999k9563l3892
13874d4440J7351K7985n842n798m34J1888Q557J0049o339l470J969j355R852o819
13860A3154l819L072J075L893J2669P694Q442k7259j9519n412P588L0849j0668
13847B1759j2569J4285J2394k52M355l975K4698K8126J7607p951j5571N629K2301
13834A10836N490J9666P132L2519R3739J74785K41559L41646M12306M46447M28258
13823B314383L61972K10133j4840k34866m04280m52063m13614l45306k58648k04990
13813E57881j24749p7192n8084l1164l0685k0736k2142Q309j7037k5053l8676
$$ y = [-5115, 12741, 40974, 31205, -11914, -13895, 1871, -23597, -22886, -41760, -65460, -53748, -37440, -55633, -27735, 12063, 30218, 53585, 50813, 14184, -11371, -3888, 14016, 19015, -10548, -44440, -27089, 896, -4946, -10744, -11178, 710, 9267, 19316, 12977, 9507, 11476, 10121, 19973, 13154, 9335, 12407, 13482, 17375, 30044, 37738, 46180, 18921, -598, -6010, 1578, 32427, 21759, 9190, 23475, 35869, 35617, 39972, 35997, 60695, 88821, 106428, 98477, 82906, 88535, 110836, 116326, 135992, 143124, 175643, 269382, 444167, 685726, 1027372, 1439678, 1886125, 2314383, 2676355, 2886488, 2871648, 2636782, 2232502, 1780439, 1366825, 1021519, 762871, 557881, 433132, 355940, 297856, 266692, 236007, 215271, 193129, 201438, 184401, 159348, 120672]
13802A20672j5118k260j9954k0414J5394p714j7653p370j7573K033j5810j7530
13790c297J1518j5868k6001P185L9911K7536p571k3075Q041k4383K791J4925r016
13777B696k0701k855j9455J4636J1713K1378O378L764k7215m957J8230q479N483
13764F16J4716k2203k865L846k5130j1615O494R517j215j5566j6946J8757K4536
13751a7058L546j4891k078l90j8688J5312J3356l663L3350L268N25j6670j9832
13738b3913K3604j883j7684J0897j9139m7262J6514M5107J2015P495j3685q099
13726a6033J5159K791J8607J115j3027j879j5509j4076J1832K016l2501L484J5000
13713b3021J3311o179l0309k1932L1826Q991l215O522O488P098M687K706k356
$$ y = [120672, 105554, 103294, 83340, 62926, 78320, 70606, 52953, 45583, 28010, 30043, 14233, -3297, 8221, -7647, -33648, -26463, 13448, 40984, 33413, 10338, 18379, -6004, -3213, 11712, 2696, -18005, -20860, -40315, -25679, -13966, 7412, 13790, 17554, -9661, -14618, 3612, -4867, 616, 15332, -6871, -9736, -5890, -31020, -42635, -36141, -26624, -27839, -43405, -60351, -41594, -17058, -13512, -28403, -30481, -30871, -49559, -34247, -20891, -24554, 8796, 12064, 12589, -4081, -23913, -309, -2192, -19876, -8979, -28118, -75380, -58866, -13759, -1744, 5751, -7934, -16033, -874, 1917, 20524, 21639, 8612, 6733, -8776, -22852, -11020, -9004, -41505, -38021, -23021, -9710, -15889, -46198, -68130, -36304, -27313, -30528, -24006, -17518, -10420, -5733, -3027, -5383]
13700e383j3455m649J6858j012q277j0222J8413K0131K393j230j6379j4951j7053
13687c4816K2798k0289k5313j0388J3248J4127K45J7000M9923j4749l3242L686
13675a7770J5969J1777k2829J847l762j8458L366J9939p856o885Q352k317J5933
13662b694j5953r210J1355j2156k2052J9094L0931m539m1487j8401J5924j2544
13650f1732Q083N749j998k174J1778K1715r537j7605J9107L6303K446n851m042
13637B242J324K890p221j2763K090J1932j7320J9691L2521p813j6796R458L687
13624B3922l4160q006j3870J7830J8256p508k8422R510K5749J7993J1826l5878
13612b758k3485k3499J3333j305L633N081m264M570n817r734K3906j1893L983
$$ y = [-5383, -18838, -23487, -6629, -7641, -15918, -26140, -7727, 12404, 14797, 13567, -2812, -17763, -34816, -12018, -32307, -57620, -68008, -54760, -40633, -40388, -23388, 26535, 11786, -21456, -17770, -1801, 9976, -12853, -11006, -14768, -33226, -29860, -9921, -17777, -24662, -16310, -18627, -2694, -18647, -27857, -16502, -28658, -50710, -31616, -685, -5224, -46711, -65112, -49188, -61732, -53649, -47900, -49898, -52072, -40294, -18579, -28116, -45721, -26614, 9689, 12135, 6284, 2242, 3566, 6456, -765, -13528, -11438, 494, -16826, 2865, 35386, 27573, 10777, 20235, 23922, -10238, -18244, -32114, -14284, 3972, -3536, -31958, -22448, 3301, 21294, 33120, -2758, -26243, -49742, -36409, -37714, -34081, -29000, -33264, -28694, -34511, -44245, -20339, -32232, -28249]
13599b8249K0902K8582l356j2574k263O258p177m3032j5050J1850k420j0232K1073
13586c5688L5060R442N759j7165k7563j0346P232j2929n375M1881L2740r326k3748
13573a0026k7779J9496J4130k5289p062j0311J0170L4313L4941O924k2101k3160
13561e754j8988J4903J3207j3949p128K1092k2192l1585m281J3272J1995J8507
13549a0901J7514o89j1298Q882P499k1795k24N266l4807j5948j0744J6850K8560
13536b1835K7456Q906J1417j3193J5833k6325k0964j074k2000J8972J2260K765
13524g782K4508N65k7570M424K3123J2984j1415k1312J4450J0777K7745j2230
13512C8267l4932l4122r601L2445M829o135J0071j4604q854O527l2792k6415K8418
$$ y = [-28249, -7347, 21235, 17879, 5305, 3042, 9300, 2123, -40909, -55959, -44109, -46529, -56761, -35688, -628, 8814, 14573, -2592, -30155, -40501, -33269, -46198, -51573, -9692, 23048, 13722, -10026, -37805, -18309, -4179, -29468, -36530, -46841, -36671, -2358, 32583, 39507, 17406, -5754, -24742, -9839, 3368, -10581, -17709, 3383, -18809, -50394, -54675, -41403, -29408, -10901, 6613, 5924, -5374, 3508, 11007, -10788, -11012, -5746, -40553, -56501, -67245, -50395, -21835, 5621, 14527, 25944, 12751, 28584, 2259, -18705, -19779, -41779, -22807, -10547, -7782, 16726, 17291, -10279, -5855, 17268, 30252, 18837, -2475, 11975, 22752, 50497, 38267, 3335, -30787, -40388, -7943, -3114, -9249, 822, -13782, -22636, -16109, -48901, -75316, -46898]
13499d6898J9207j1957n882M574J3730K0913P876Q238K188k5685n5047k4579L855
13486h9467O023Q040L2156q147J2299J4515J1506q139k5834O876P462j5332j1143
13473e9185N579j5621M982L2508J0171J3568R581o005q168l358L6905J2719J1015
13460D4691k5228J163K6439L58k1432p148j6271l0542J5344K5913J257k8870k0079
13447c4405k4896K7812J5109J9411Q723p858R898r073k066O506q94j5782j1388
13434a8903J7377N693q218j2322J7664j5068o812R394P750K403k1451Q573L0979
13421A7059j1180l67o365k7711j0009m640n269J6236K6191M755N66j4472l394
13408a8600J3563j104k7490J3161o220k1738m337p051J4004j1223m730J1207L0692
$$ y = [-46898, -27691, -39648, -45530, -40956, -27226, -6313, 1563, 9801, 11989, -13696, -68743, -93322, -89467, -83444, -75404, -43248, -51395, -39096, -24581, -13075, -21214, -47048, -40172, -32710, -48042, -59185, -53606, -69227, -64245, -31737, -21566, -7998, 1583, -4422, -12590, -15948, 20957, 33676, 44691, 19463, 20626, 47065, 47423, 25991, 18843, 2572, -27970, -12626, 13287, 14544, -14326, -34405, -59301, -31489, -16380, 3031, 11754, 3896, 13794, 4721, 2655, 9161, 8267, -7515, -18903, -1526, 4167, -4051, -16373, 1291, -13777, -20589, -11195, -3445, -1042, -22493, -13920, 17059, 5879, 5512, -853, -28564, -38573, -43213, -48482, -32246, -6055, -1300, -734, -15206, -18600, -5037, -6141, -33631, -20470, -26690, -48428, -52765, -59816, -45812, -57035, -61765, -50558, -19866]
13395a9866J0904k9951P398m508j2215L1263J9552j2161r974l009Q836K4893k6286
13382a5124l0460j1820Q293L559o816J0985K3718L9012J119m7090P053J2232l006
13369h345l5271K0709m940j3005j4716n272L229J1617k971j8798n453M1654M465
13356b7097k0104k239l579K3530J2966j6535n702J4941l209j3625k2116K2161
13344d0608K0056R158L2954K7464n129j2611J2177o269j4418n368k5629j4658
13332b2881n247k0142J769M4125L0643j8816k3684q531J8548l64J5710J6205q978
13319A8357j8333l1234L563j2502p822k012j553j3831K8831J423K366p778J073
13306c9452j5165R093O109o231L1228J4318l950j7304k7345k4505Q096J5143J6530
$$ y = [-19866, -8962, -38913, -31515, -36023, -48238, -16975, 2577, -9584, -19558, -22567, -13731, 11162, -15124, -45584, -57404, -49111, -45552, -52368, -41383, -17665, 21347, 22466, -24624, -17571, -5339, -8345, -43616, -22907, -27847, -40852, -55568, -60840, -57611, -45994, -48965, -67763, -73216, -31562, -27097, -47201, -49440, -53019, -29489, -16523, -33058, -38760, -23819, -27028, -40653, -62769, -40608, -20552, -11394, 21560, 49024, 43895, 31284, 43461, 37192, 22774, 17406, -8223, -22881, -28128, -48270, -46501, -2376, 28267, 9451, -14233, -22764, -4216, -4580, 11130, 27335, 18357, 24, -31210, -27647, -40149, -47971, -49983, -51536, -65367, -36536, -35113, -32747, -40525, -39452, -54617, -45524, -39415, -45646, -14418, -100, -4050, -21354, -48699, -73204, -65108, -49965, -33435]
13293c3435N949k164N130P368j7281j2409J7657K3142j3595p733K4283J2504N960
13280A5376J0897j2811j306J3105j1507j1113O831k1985j0697J4165j1489N924
13268a4610K4683k9552j6511M813n34J7219K863j0302M821l890j3885J0291R436
13255a5158N784j6748j5560J1545J7846j546j983l778P989o838j1525j7754J5735
13242c1991K3003N495J1839L111q679J3822r638k2080k3684j4959L54Q549K3295
13229b1563p164K0079Q888k3530J1060J6902P303k2615r871K3572K3049k155k3993
13216c8o715j7607j9576k2606R643K9472n381k9961q580K2489J2983Q647M873
13203b2357j968p085j1092O345J2161M994J6541m75k3812K3478j297q690Q863
$$ y = [-33435, -27486, -29650, -24520, -17152, -34433, -46842, -29185, -6043, -19638, -27371, -3088, 9416, 15376, 26273, 13462, 12156, 25261, 13754, 2641, 9472, -12513, -23210, -9045, -20534, -14610, 10073, -19479, -35990, -31177, -31711, -14492, -11629, -21931, -17110, -21000, -34885, -24594, -15158, -9374, -26122, -41682, -30137, -12291, -13837, -15820, -19598, -11609, -18447, -29972, -47726, -31991, -8988, -3493, 8346, 11457, 2778, 16600, 6962, -15118, -38802, -53761, -53407, -44858, -21563, -28727, -8648, 240, -23290, -12230, 4672, 11975, -10640, -20511, 3061, 26110, 23955, -38, -6753, -24360, -43936, -66542, -56899, -27427, -32808, -62769, -71349, -48860, -35877, -27230, -22357, -24325, -31410, -42502, -36157, -23996, -19002, -2461, -2936, -26748, -3270, -4567, -13257, -4394]
13190d394J2166l366k5819O548J3777k6075n883O762J2625J5745O718j7257n189
13177a3642r929L476K6560M037j0284j9834Q102R50j288j1991j1401l919P562
13164c1601L1537J1222P559j0718K0580M1509O841j9179k8211n0209j2513O328
13152b6855J285k3296j677j6399K7060J4158J2595J3437J1663m154n956k1856
13140a9995j3914O655N074j9292K901J9102r080j3842j6651q154L810L0102r119
13127d2403J9701N215j0363j2132O698o922j2928n280J0135J6347J4072k216n976
13114b6052j0347j0231j86K5348o659k431O656q496N179L8552J8806J3184l7968
13101E355k6530K994O792m213l6394l1820J7512K5102J9822M372K0390J4748k6217
$$ y = [-4394, 7772, 4406, -21413, -14865, -1088, -27163, -33046, -26284, -13659, 2086, 8804, -8453, -13642, -23571, -20095, 6465, 10502, 218, -19616, -11514, -10564, -11852, -23843, -35244, -39163, -31601, -64, 11158, 18717, 7999, 28579, 70088, 76929, 57750, 29539, -20670, -33183, -26855, -25570, -48866, -50543, -66942, -39882, -25724, -13129, 308, 11971, 7817, 1861, -19995, -33909, -27254, -22180, -41472, -38571, -19469, -28549, -42391, -59042, -67196, -63386, -33284, -42403, -22702, -17487, -27850, -39982, -33284, -40206, -53134, -58414, -48279, -31932, -17860, -20076, -26052, -36399, -46630, -46816, -21468, -28127, -30558, -23902, -32398, -27219, 11333, 30139, 43323, 5355, -21175, -18181, -11389, -15602, -51996, -83816, -66304, -41202, -21380, -17008, 3382, 18130, -8087]
13088h087N345J2760j9218k2460k0437j5010l692K2878n363j2178J8164J476K6080
13075a9742J3751J3561P443l2220j7963J6390J8818k597l6049Q528J5194n500
13063b0386K4159K7129J2448j6676m690j9384k4633J4704K5254r926j7525j4889
13051b4415M082j2508J1226O068j777M358q544M725j4516N796J9049k2182j2553
13038d1191N82J2099j6189k550J894L505k7088j9896J2453J5975m576M355j9024
13025g9651J1438J3189N215J1283K1267k7521m556J9921K9412Q130k2383j6194
13013c0450n185K3838K0859j5534k544K2270j5254l0389l0699J044J3064J4358
13001c4622l151k5457L704J3672o04J7932K4453K7676L334o551J2598k489M441
$$ y = [-8087, -2742, 10018, -9200, -31660, -52097, -67107, -70799, -47921, -53284, -65462, -47298, -45822, -19742, -5991, 7570, 15013, -17207, -35170, -18780, 38, -2559, -38608, -30080, -14886, -20386, 3773, 30902, 43350, 26674, 21984, 2600, -22033, -7329, 17925, 7999, -9526, -24415, -20333, -32841, -21615, -15547, -17324, -12966, -21510, -16785, -31301, -25505, -6456, -28638, -41191, -40609, -28510, -44699, -47249, -45355, -41850, -68938, -88834, -76381, -60406, -64982, -60627, -79651, -68213, -55024, -49809, -38526, -17259, -44780, -49336, -29415, -3, 8127, -14256, -30450, -35635, -11797, 9062, -6472, -9016, 13254, -2000, -32389, -63088, -62044, -48980, -34622, -37773, -63230, -59526, -45854, -46458, -28526, -4073, 23603, 26937, 20386, 32984, 30495, 34936]
12988C4936j2609l4864p343J1550o559K579Q027j3087k836L502l8016k9351J3389
12975g0682j196J071M117L2673J5915l396q874n192J6722M968j868k4772Q186
12962c2328j7539k848n871l02L1083J1504n176j6999P006J401j4545J1960P200
12949b5454K0592J3960J0303j7818l3436l499R844J1403P16k7470j1006J9549
12937c2316K5055J335k816L5162j0190J2373k866m852k2162m4481m908L0407J0230
12924a0029L4800l161k2841k8324j0729K022J3229J9379K4787K4758K639k4961
12912B1569k9650k698Q976o341K330k8351K099K4696k4148j8346k4059K6696L9971
12899g256j5710l6132q211J667J6829L4165L2878J3296r59j9732j0042Q311n54
$$ y = [34936, 22327, -12537, -19880, -8330, -14889, -12310, -4283, -17370, -20206, -16704, -54720, -84071, -70682, -71878, -70807, -66690, -34017, -18102, -21498, -30372, -35564, -18842, -13874, -15742, -40514, -32328, -49867, -52715, -58586, -58888, -27805, -16301, -21477, -38476, -31470, -30069, -44614, -32654, -25454, -4862, 9098, 19401, 1583, -31853, -35352, -25508, -14105, -13389, -40859, -51865, -32316, -7261, -5926, -8742, 26420, 16230, 28603, 25737, 20885, -1277, -45758, -50666, -20259, -10029, 24771, 21610, -1231, -29555, -40284, -38262, -25033, -5654, 19133, 43891, 46530, 21569, -8081, -10779, -1803, -8144, -5814, -34165, -32066, -7370, -31518, -49864, -73923, -47227, -7256, -22966, -59098, -67309, -65642, -48813, -14648, 18230, 31526, 30567, 10835, 793, 9104, 8550]
12886H550j9054n150N703l1761k3121J541K501M3788J5677j6338j5240o106j2
12873c9022k1493o600M0620J1651J8456J2544k376P606o052K324k2309j4356l880
12860b2887n605k741J72M358K710N16j2092k309m37q48R510M5492K2544K19k9908
12845H694j2184J3701J5622O393k4895o885j3940k6675k9833K4055p438R216J5224
12832b8945j4206K9340J5330j8743k0842j5927K3495J9515P836M300l282M959
12820B830p181Q078j2941l1859q577K5257Q968m714J0835J3038K626K1068J264
12807B8692j8007j0006k1047r949m142k5474J2820m317J0035o263r352k953L0161
12794b9802L2068K5484M214j0538j1318n198j677j0470m109k630k5401K1071R878
$$ y = [8550, -10504, -15654, -9951, -41712, -64833, -63292, -60791, -17003, -1326, -17664, -32904, -39010, -39022, -60515, -67115, -26495, -14844, 3612, 16156, 13780, 21386, 15334, 17658, -4651, -19007, -22887, -28492, -31233, -31061, -26703, -23993, -23477, -35569, -37878, -38315, -39163, -29653, 15839, 38383, 38602, 8694, -3490, 10211, 25833, 32226, 7331, 446, -13494, -40169, -70002, -45947, -53385, -44169, -28945, -43151, -13811, 1519, -17224, -38066, -53993, -30498, -10983, -3147, 1153, -2129, 2830, -4351, 3727, -9214, -41073, -49650, -24393, -15425, -20139, -9304, 3734, 6360, 27428, 28692, 10685, 679, -20368, -30317, -34459, -59933, -47113, -51430, -41395, -47658, -57010, -59963, -29802, 2266, 27750, 31964, 21426, 10108, 4910, 3233, -7237, -11346, -13976, -39377, -18306, -8428]
12781h428k0467j3403j4490J5590R246k637J5387L7378O512j6928L022Q329k0810
12768a699l7355l45j1941j6917n764P8M518O966K9328J2510J693o107j1537J569
12754c5003R216K1719L358j4105L0944J8108m9860l501j2674p493j9897k7092
12742h6280J0203P200r842J1875K2507j7457J0958L841J8989j5532k1776M2292
12730b3022M5482J4101j1793q610l477j5618k8045n231K287J604J832J2668L0136
12717A2314k6894j2852J2355j0169p754k815n213K6068K8329N822q542K32j902
12704H979J9757J5105J0141N871j5015k0339k0848j9286m389J0360p30J5321j1590
12691f663j7141J056K1179l292p356o983J7830K5577n5306k3662J8947K4481L9666
$$ y = [-8428, -28895, -42298, -56788, -41198, -31952, -34589, -19202, 18176, 24688, 7760, 10782, 19111, -1699, -39054, -39399, -51340, -68257, -74021, -73943, -69425, -62459, -33131, -20621, -18928, -25035, -36572, -35003, -25787, -4068, -710, -14815, 16129, 34237, -15623, -19124, -31798, -39291, -59188, -86280, -76077, -68877, -78719, -66844, -44337, -61794, -50836, -46995, -28006, -43538, -65314, -23022, 22460, 36561, 24768, 16158, 12681, -2937, -30982, -36213, -33926, -32322, -30490, -17822, 12314, -14580, -27432, -15077, -25246, -33000, -35815, -41028, -14960, 13369, 19191, 10649, 10881, 8979, 28736, 43841, 53982, 59853, 44838, 24499, 3651, -15635, -20024, -9664, -10394, 4927, -6663, -23804, -22748, -1569, -4861, -12217, -19200, -1370, 24207, -31099, -54761, -35814, -11333, 28333]
12678B8333j5750j5569J4300k2149l2219j3801K3505K8388m396m243j8343J6415
12666a5529M0275l10n98L480r2O074J8411k7843r691J448K9803r25n0612k8223
12652c4332K807L1341j969j5355m236M62J975j1175L876j7989P017N282L613O738
12638b1945m182L2467k04M880J079j4722l1339j8056P895M627j4951k528L2783
12625b4196q121l65J4392j1597J4274M596j7699l9406J3842M17J9126O822J013
12612b6902K5815J3819j0735j8762j4020J9862n372j7880o039O334l244n935J7323
12599b5736p968o425l173M222K217K2640L564j2299k8990n466K742M6942J9184
12586A1454j6633N375j107q842j1281j5917J0011L7566k876K917r491O547P591
$$ y = [28333, 12583, -2986, 11314, -10835, -43054, -56855, -33350, -4962, -9358, -13601, -31944, -15529, 24746, 24436, 23838, 27318, 27226, 33300, 51711, 23868, 14177, 15625, 45428, 44503, -6109, -34332, -31525, -184, -2153, -17508, -21744, -21282, -19307, -30482, -26606, -44595, -37578, -32296, -28683, -21945, -26127, 6340, 6136, 11016, 12095, -2627, -33966, -52022, -44127, -39500, -54451, -56979, -24196, -32317, -32682, -18290, -29887, -15613, -11017, -28716, -68122, -54280, -53863, -34737, -27915, -26902, -1087, 12732, 1997, -16765, -30785, -10923, -16295, -34175, -40214, -33880, -37124, -43059, -25736, -33704, -40129, -43302, -39080, -36863, -14223, -10659, -22958, -51948, -57414, -54672, -7730, 11454, -5179, 196, -911, -9753, -21034, -36951, -26940, 10626, 7750, 10667, 1176, 7723, 15314]
12573A5314k032k1909K577j6251k5961j4505L8214K4069j1182p357l807L836M614
12560a4380j1101j8364J733P523J7929K0285J9489K2298k5271Q965M2422J1913
12548H3441k6711k0779k4158K422j4920r78K1006L0913o204j2726Q591R853k0882
12535B8868j4247J7316K5896k1383r464J7228L0797n379j4978k6748k005l3076
12523g175K036O815K3313K5160j7382j5621j827J7000j6716p900j8403n679J6636
12510B57J8145J6071k126j0357O883l964K7816K2813q759m078J536J275j0442
12497E5070j6046J803N723l37j3616l129j9536l855J3004K2485j0385K114k15
12484C3080K8663K0238j3109k23J3545K1824P265L644j6384P849J3811J692Q894
$$ y = [15314, 13282, -8627, -6050, -22301, -48262, -62767, -24553, -484, -11666, -19023, -22830, -18994, -14380, -25481, -43845, -42112, -34589, -16660, 3625, 23114, 45412, 20141, 29106, 71528, 83441, 56730, 35951, 11793, 14215, -705, -1683, 19323, 50236, 44032, 31306, 39897, 49750, 28868, 14621, 31937, 57833, 36450, 26986, 44214, 75011, 69632, 54654, 27906, 25901, -7175, -5139, 1676, 24989, 50149, 32767, 17146, 15319, 32319, 15603, 7703, -10700, -16379, 257, 18402, 34473, 32347, 21990, 28873, 24909, 52725, 75538, 66779, 62701, 64237, 65512, 55070, 39024, 40827, 46550, 46213, 32597, 29468, 9932, 6077, 19081, 41566, 31181, 33295, 33080, 61743, 81981, 68872, 68649, 82194, 104018, 111283, 114927, 98543, 106392, 120203, 121895, 130789]
12471A30789K3404J1941K4750k6558J6803K7764K767J4420L1492K5653K4441L7882
12459C45548R0245N7502K2580P216L4426P7657J10371R1846J13392J62083K27284
12448A340150K51497K64885K84067K67985K84772K24031J73704O7877l5345o0888
12438C062735j20685j40689j35976j17000p9135p6193q3348m6883l0074m1392
12428B191360p1946n1972k250k2073k0707O001K2314R491J9606L9301q541l832
12416B106752K7377N9088O4225N7478Q2963O1900P1724P5629J09638J09534O8103
12405B894411M2538L3314M1402L2661J2679J8189P893j0925l0754l9153j9402
12394B982853k8764l1858P53m822m4181k0724J537o2190k8695k5292m6091o3341
$$ y = [130789, 154193, 166134, 190884, 164326, 181129, 208893, 211660, 226080, 257572, 283225, 307666, 345548, 435793, 493295, 515875, 523091, 557517, 635174, 745545, 837391, 950783, 1112866, 1340150, 1591647, 1856532, 2140599, 2408584, 2693356, 2917387, 3091091, 3158968, 3123623, 3062735, 2942050, 2801361, 2665385, 2548385, 2469250, 2393057, 2309709, 2262826, 2232752, 2191360, 2119414, 2067442, 2065192, 2043119, 2022412, 2028413, 2050727, 2060218, 2079824, 2119125, 2110584, 2106752, 2134129, 2193217, 2257442, 2314920, 2397883, 2459783, 2531507, 2607136, 2716774, 2826308, 2894411, 2936949, 2970263, 3011665, 3044326, 3057005, 3075194, 3083087, 3072162, 3041408, 3002255, 2982853, 2954089, 2922231, 2922984, 2918162, 2873981, 2853257, 2854794, 2792604, 2763909, 2738617, 2692526, 2629185]
12382B629185n2766j9047j9263j3775j5778J7645k7414o1292o3381m0230n3127
12371B280757o0750l9480n7726p5294r3205o6666n9606n1677n2625j03997j14389
12360A505342j07167q6285k8085n1064n8557l5129j3329k4870l0710l0706m8883
12349I90557o0472K292l5485n5621l7253j5348k2825l0695L2996L6721J3479l3003
12337G85343k3645K327L3374M4792L4407J0192L5617J1732J2264O932K5009J1221
12325I89565J2748L9353N8108J07835Q3935O9680M3066N4232J08231J04719J17225
12314A788697Q2455P8481P5106J21488R4818N0183N8610K0791K4535J5298q988
12303B401474l890k9237n0025m1431m9806n0733k7243k4193K2254M9740J1749
$$ y = [2629185, 2576419, 2557372, 2538109, 2524334, 2508556, 2526201, 2498787, 2437495, 2374114, 2333884, 2280757, 2220007, 2180527, 2122801, 2047507, 1954302, 1887636, 1828030, 1776353, 1723728, 1619731, 1505342, 1398175, 1311890, 1283805, 1232741, 1174184, 1139055, 1125726, 1100856, 1070146, 1039440, 990557, 930085, 932377, 896892, 841271, 804018, 788670, 765845, 735150, 768146, 804867, 818346, 785343, 761698, 764025, 797399, 842191, 876598, 886790, 922407, 934139, 946403, 953335, 978344, 989565, 1002313, 1041666, 1099774, 1207609, 1291544, 1361224, 1404290, 1458522, 1566753, 1671472, 1788697, 1871152, 1949633, 2024739, 2146227, 2241045, 2291228, 2349838, 2370629, 2395164, 2410462, 2401474, 2397584, 2368347, 2318322, 2276891, 2227085, 2176352, 2149109, 2124916, 2147170, 2196910, 2208659]
12292B208659r686K1993L0431O7090O2692P1039N7117P6354Q8923R7897J11290
12281B883799J04448Q7774N1321M7960K5399M1585J065l2341j4685m626p070k8677
12269C155952m1895n2317m7575l6180n9931p2963n9065n0531o3823n1532k6802
12258B593338l1705l3077l7816m4604j0731k4776k0723k7442l5735l0358m9421
12247B246950n7858l8939q227m8144p7523n7710n4508o7371p4089o8134r4483
12236A599964j14034q5320p8838j06136q9282r6239j02444o8293l6093l0753n0248
12225G42284l6539m7185l3396j7183n901j9157m8891n3518l864K4737j970K9930
12213E29347k8691l7783K1178l861p874K294j0492j7298L31r704N694L9625k4886
$$ y = [2208659, 2198973, 2220966, 2251397, 2318487, 2381179, 2452218, 2509335, 2585689, 2674612, 2772509, 2883799, 2988247, 3076021, 3127342, 3175302, 3200701, 3242286, 3243351, 3211010, 3196325, 3191699, 3184629, 3155952, 3114057, 3061740, 3014165, 2977985, 2918054, 2845091, 2786026, 2735495, 2671672, 2620140, 2593338, 2561633, 2528556, 2490740, 2446136, 2435405, 2410629, 2389906, 2362464, 2326729, 2296371, 2246950, 2189092, 2150153, 2141926, 2093782, 2016259, 1958549, 1904041, 1836670, 1762581, 1694447, 1599964, 1485930, 1400610, 1321772, 1215636, 1126354, 1030115, 927671, 859378, 823285, 792532, 742284, 705745, 658560, 625164, 607981, 602080, 582923, 534032, 480514, 476650, 501387, 499417, 529347, 500656, 462873, 484051, 480190, 472316, 474610, 464118, 446820, 447151, 437447, 443141, 482766, 457880]
12200D57880l1486K239k3497k9616m168j6899l4658k3349J6138J193j8184J8914
12188C14507J3938l0197l2858l4731k4985j3709m507l5577l1625N144K2078N2940
12176B00418K8363j3401r520O792K5264J1599k1449j0019j2078k182J0200M1245
12164B55232K6858J2273j8457k371r926j1868j9120j1249m348k5691N414L425
12152B00172k79j1002L8487M4949q254k0359J5676k3429Q71R246K2938Q0146K1325
12139C70487K2806K1509M5962L7302K5777K4676M1611N6979O7731L7678J8724
12128G71242K2244j2303n0315l7385l4073m0878p4260o5309j4233r761j739n2461
12116D00769l1201P913L1470L7824k4492m9683K793K2924j6558q048J4301k0304
$$ y = [457880, 426394, 428633, 405136, 375520, 371352, 354453, 319795, 296446, 312584, 313777, 295593, 314507, 328445, 298248, 265390, 230659, 205674, 191965, 187458, 151881, 120256, 125400, 147478, 200418, 228781, 215380, 205860, 212652, 237916, 249515, 228066, 218047, 205969, 203787, 213987, 255232, 282090, 294363, 275906, 273535, 263609, 251741, 232621, 221372, 217024, 191333, 196747, 200172, 199893, 188891, 227378, 272327, 264073, 243714, 259390, 235961, 236832, 246078, 269016, 349162, 370487, 393293, 414802, 460764, 498066, 523843, 548519, 590130, 647109, 714840, 752518, 771242, 793486, 781183, 730868, 693483, 659410, 618532, 544272, 478963, 464730, 454969, 453230, 400769, 369568, 377481, 408951, 446775, 422283, 372600, 375393, 398317, 381759, 373711, 388012, 367708]
12104C67708K5301N5538L0382J8621J3053L3548K1246k5960m844J807M4222L0380
12092F11002K9633K2197M8410J3795L1737N7704M5177N5213M8016J6651L1159
12081A010694M7504K0664L6091M8977N3563L9318L8987L9726N3542Q7212R6246
12070A572524J09920J00391J14804J28651J02240J28768J27222J65927K08003
12061B758450K00541K17365K50592K57461K77678L25602L59810M05684M21949
12052E475132N19141O53800Q65856J151332J513983J879352K222874K582781K825239
12043A9689490L045545L138192L075438L174657L774246N240599P953270J2550263
12035F1641700J9769675K8698074L6280834M1357260M2744255M1332577L5711104
$$ y = [367708, 393009, 448547, 478929, 497550, 510603, 544151, 565397, 539437, 534593, 536400, 580622, 611002, 640635, 662832, 711242, 725037, 756774, 814478, 859655, 914868, 962884, 979535, 1010694, 1058198, 1078862, 1114953, 1163930, 1217493, 1256811, 1295798, 1335524, 1389066, 1476278, 1572524, 1682444, 1782835, 1897639, 2026290, 2128530, 2257298, 2384520, 2550447, 2758450, 2958991, 3176356, 3426948, 3684409, 3962087, 4287689, 4647499, 5053183, 5475132, 5994273, 6648073, 7513929, 8665261, 10179244, 12058596, 14281470, 16864251, 19689490, 22735035, 25873227, 28948665, 32123322, 35897568, 41138167, 49091437, 61641700, 81411375, 110109449, 146390283, 187747543, 230491798, 271824375, 307535479]
12028C07535479K5644111R688996p407891k2363063l2648697l8944279m1589147
12021A99915509m0807698l6182387k8417171k0262982j3607784r110007o303300
12014D5224180m642893l674723l248092l059087k919993k859907k772468k573071
12006A9473946k330718k038546j717947j442555j167422r74215q25461p44426
11998H232656o99637n75968m89577m25422m03779l69085l30054k94726k54605
11989D389803k20118k11176k17924k22327k18890k02515j97370j51197j23629
11980B624657j51041j39153j18946j15041j11253q8173j03342r4715p7126p4000
11970A551867p3080q6907o9438p1773k9291k1361j5281j6110l2280j2984P040
$$ y = [307535479, 333179590, 342868586, 335460695, 313097632, 280448935, 241504656, 199915509, 159107811, 122925424, 94508253, 74245271, 60637487, 51527480, 45224180, 40581287, 36906564, 33658472, 30599385, 27679392, 24819485, 22047017, 19473946, 17143228, 15104682, 13386735, 11944180, 10776758, 9802543, 8977082, 8232656, 7533019, 6957051, 6467474, 6042052, 5638273, 5269188, 4939134, 4644408, 4389803, 4169685, 3958509, 3740585, 3518258, 3299368, 3096853, 2899483, 2748286, 2624657, 2473616, 2334463, 2215517, 2100476, 1989223, 1901050, 1797708, 1702993, 1625867, 1551867, 1478787, 1391880, 1322442, 1250669, 1221378, 1200017, 1184736, 1168626, 1136346, 1123362, 1130402]
11959A130402k7309p5459m7508l3127j5487K0167O866j4876n6099n7121J4792
11948H45241J9738j1288l1079J0514j905p888J0772j9905M0845L1911L8270M324
11936I29550J3893M6126R955j5973m8899o1121r2844m6934m8277n8321o5058j9732
11924E42365k0927j1262k3707l4270l5880M645J4838j4779J7100J1220j6108m0457
11912C92778N457J9006N535n209n0666J2304K0850J2721m6375M349M2899K539
11900D16188k7908n866m354k1030j1550j5075l7345j4416m144k1617m091J0094
11888B58886j097K578N289j4587L024k4923o858Q280J5039j4017r276K9359j5777
11875B35920j0075Q45O103m5388J1578P530k2772K28r216L754n225l3371j2547
$$ y = [1130402, 1103093, 1027634, 980126, 946999, 931512, 951679, 958545, 943669, 887570, 830449, 845241, 864979, 853691, 822612, 833126, 831221, 823333, 834105, 814200, 855045, 886956, 925226, 929550, 943443, 989569, 999524, 983551, 934652, 873531, 780687, 733753, 685476, 627155, 562097, 542365, 521438, 510176, 486469, 452199, 416319, 420964, 435802, 421023, 438123, 449343, 433235, 392778, 398235, 417241, 422776, 417567, 366901, 379205, 400055, 412776, 366401, 370750, 413649, 416188, 388280, 382414, 378060, 357030, 345480, 330405, 293060, 278644, 274500, 252883, 248792, 258886, 257789, 260367, 265656, 251069, 254093, 229170, 222312, 230592, 245631, 231614, 222338, 251697, 235920, 225845, 226690, 232793, 187405, 198983, 206513, 183741, 183969, 174753, 178507, 173282, 139911, 127364]
11862A27364j079M43L7630k051J8829K9856j7366Q735K9771j5251j2133l9980
11850A64768m6216j2480Q407M562q844K7109k140o290j5371J0904K3980L0951
11838A79340L6593P309j6158l884O625O928J4403n217n113j2716P656K0790j2671
11825B23885k8558m005k143k1044j5587M4J5845p368m158n847J47o387r892j1137
11811A23795k1008M56K220k0282j1312j0608J4447K2985Q754J6923p326l7086
11799H1958l5415J008L3538N0042J2410q981j7115o837K5557o362L88J8931K0959
11786A70081j4148l2036l1654k227J2135o647J6158N044n82p201k0528l853n094
11773G9448Q27J8323p214j677P605J1051K2049l9710j3387R927L851R238J4312
$$ y = [127364, 126285, 126728, 164358, 162307, 181136, 210992, 193626, 202361, 232132, 216881, 204748, 164768, 118552, 106072, 114479, 119041, 110197, 137306, 135166, 128876, 113505, 124409, 148389, 179340, 215933, 223242, 207084, 203200, 209825, 216753, 231156, 225939, 220826, 208110, 215766, 236556, 223885, 195327, 191322, 189179, 168135, 152548, 152592, 168437, 161069, 156911, 151064, 151211, 144824, 134932, 123795, 102787, 103243, 105463, 85181, 73869, 63261, 77708, 100693, 109447, 126370, 119044, 81958, 46543, 47551, 81089, 131131, 143541, 134560, 117445, 110608, 136165, 129803, 130191, 149122, 170081, 155933, 123897, 92243, 90016, 102151, 95504, 111662, 116706, 116124, 108923, 88395, 84542, 79448, 80275, 98598, 91384, 89707, 97312, 108363, 130412, 90702, 77315, 87242, 91093, 100331, 114643]
11760A14643L503l1413l138o953j6083K1237M236r470L8239J2124k6463l8803
11748F1659k641j0323k0708R498J2818Q631j1173R12L816L75k3898k8053J2596
11735A3509P871L2270n19Q435j754J2104J3239K9456j2184k1078n805l1790k3566
11722B0188J441J739r197N888n074k1209O443R466K3153K86j0461j6405m253L6459
11708C8464J794J2185J8701J0980l166J8042J4115j100j3090j3828q180j6809
11696E8108l1876j0725L1573N1819J316m0434l0699K4965j6324k6163R209Q874
11684B9643K0784j5418m208J5120M0985k654L600K1398j8649j7476l6200J0126
11672D7051K0356j5577J6471L4267L4167O740n6l171J5712L603l363K6843L6534
$$ y = [114643, 118146, 86733, 83595, 76642, 60559, 81796, 86032, 76562, 114801, 126925, 100462, 61659, 59018, 48695, 27987, 37485, 50303, 58934, 47761, 48673, 52489, 52864, 28966, 913, 13509, 21380, 53650, 53131, 61566, 59812, 71916, 85155, 114611, 102427, 81349, 75544, 43754, 20188, 21629, 23368, 14171, 20059, 14985, -6224, 219, 9685, 32838, 33124, 22663, 6258, 2005, 38464, 40258, 52443, 71144, 82124, 78958, 97000, 111115, 110015, 96925, 83097, 74917, 58108, 26232, 15507, 47080, 98899, 100215, 59781, 29082, 54047, 37723, 11560, 20769, 29643, 50427, 35009, 30801, 45921, 86906, 84252, 87852, 109250, 90601, 73125, 36925, 47051, 67407, 51830, 68301, 102568, 136735, 143475, 143419, 140248, 155960, 159563, 156200, 183043, 219577]
11659B19577J0274J3824M656O635r586K0599K6057j3114J3719J1456o878j6336
11647B80883k9427j011j2506l6781n835K576N89K8595p597R570J8670l206J2774
11634B57294J8127N742l108J1780J8751J511J4643Q125J6005J2778K9921M0040
11622D31609K8122L5850Q48p221N964K4329N6420M8473N5811J11427J70549K10242
11610A172423K06869J74522J62524J52753J03212L5104p7976j48869j82136j81148
11600A417278j94136k23820j68459j13481r9281n1541p0638o8062k9491l453K4213
11589D19129k9596p3544n5181l0063N401L575j6022m6659l2046P442K4556M93
11577A77485m5128j8487Q439K947j3371l2873P445N1959K0034j5866o621l5225
$$ y = [219577, 229851, 243675, 248331, 254966, 245380, 265979, 292036, 278922, 292641, 304097, 297219, 280883, 251456, 250445, 237939, 201158, 195323, 197899, 198488, 227083, 219486, 229056, 247726, 244520, 257294, 275421, 281163, 278055, 289835, 308586, 310097, 324740, 332865, 348870, 361648, 391569, 431609, 459731, 495581, 496429, 489208, 495172, 519501, 575921, 624394, 680205, 791632, 962181, 1172423, 1379292, 1553814, 1716338, 1869091, 1972303, 2007407, 1929431, 1780562, 1598426, 1417278, 1223142, 999322, 830863, 717382, 618101, 566560, 495922, 427860, 398369, 394916, 419129, 389533, 315989, 260808, 230745, 236146, 239721, 223699, 177040, 144994, 152436, 176992, 177485, 132357, 113870, 122309, 125256, 111885, 79012, 86457, 138416, 158450, 142584, 135963, 100738]
11565A00738n946K3156J0731l3332k5132q020J2296m690j6457k2975k946l585
11553B3838j9625J9779J6738m852J5936q932r923K1796j321p254J0315N939J5227
11540G7661k7301k097K2818m830k542k1969j6518J7186j7092j6112j5013n041
11528a0850J6821J8253j3057k164l526N73J1803K9000J0635K244r736j55N559
11515E5400J9180P152k0518r363Q643j0908J4073k403M131k214j1506k020j2699
11502C6948r584K030K4340p443j7914q729J0977n355k822R710J9780L840j9345
11489C6433O357k0587J8128K085o030J0071j8314J2259J1314K0214Q718n0702
11477B9946n3820p584J7658J4046L7137j4258k2656P050K7036K7054j2523j3775
$$ y = [100738, 94792, 117948, 128679, 95347, 70215, 62195, 74491, 69801, 53344, 30369, 27423, 23838, 4213, 23992, 40730, 35878, 51814, 42882, 32959, 54755, 53434, 46180, 56495, 62434, 77661, 50360, 48263, 71081, 66251, 63709, 41740, 25222, 42408, 25316, 9204, -5809, -10850, 5971, 24224, 11167, 9003, 5477, 6050, 17853, 46853, 57488, 59732, 49996, 49841, 55400, 74580, 81732, 61214, 51851, 60494, 49586, 63659, 61256, 65387, 63173, 51667, 49647, 36948, 27364, 29394, 53734, 46291, 28377, 19648, 30625, 25270, 22448, 32158, 51938, 55778, 36433, 42790, 22203, 40331, 42416, 36386, 46457, 28143, 40402, 51716, 71930, 80648, 29946, -23874, -31458, -13800, 246, 37383, 23125, 469, 7519, 34555, 61609, 49086, 35311]
11465C5311j7752m825K0124l5388j0858K9783m765k117k7002o781J5389Q308J460
11452H87J2369j6046j59r107j0127o102K7637J6327j763k1481k2212l572j2786
11439d6135J2974L2753j5625j4150K0453R207N384L0246J8327k4151k3180J974
11427H077j9995k2204J3388J5684J0060J4348J0747J4828k825J9435o189k3105
11415C2249l4748J3001K6482K571j2794l3689j8260K6656L506R794K9282P061
11403E1111k8389k7775q323j0423J0544M298j5853J3054L3540m752o879J1326
11391B1479j9315O01J7849j9812k0628J7730J7981p397l542j1038L3023J895o659
11378B2167j806J0332q722j5038K2393J1299r52k4542R550K2203q048J525J4268
$$ y = [35311, 17559, 12734, 32858, -2530, -13388, 16395, 11630, 9513, -17489, -24270, -8881, -573, 887, 13256, -2790, -2949, -12056, -22183, -28285, -648, 15679, 13916, -7565, -29777, -33349, -46135, -33161, -408, -16033, -30183, -9730, -523, 4861, 35107, 53434, 29283, 6103, 8077, -11918, -34122, -20734, -5050, 5010, 19358, 30105, 44933, 42108, 61543, 55354, 32249, -2499, 10502, 36984, 39555, 26761, -6928, -25188, 1468, 4974, 14768, 44050, 51111, 22722, -5053, -13376, -23799, -13255, -8957, -24810, -11756, 21784, 17032, 10153, 21479, 2164, 2765, 20614, 802, -19826, -2096, 15885, 8488, 4946, -6092, 26931, 28826, 22167, 20361, 30693, 21971, 6933, 29326, 40625, 39673, 15131, 24681, 46884, 38836, 40361, 54629]
11365E4629j7139m692r825j2270j6833J864J7282J2873M990J8357n422j5985o760
11352B1069q719k2140K4193M08J286J5068M468r009m8J447K1393J7121k1535r313
11338C5689J5275k2476m8872j4701J8825r449L007L9790K5102J2517J3143k1304
11326D6546l2194J1051J6101j870J9721L793J9555l6928k3384k4400N64J7988
11314A6543r23j751l133j4870J4794P219J1334j9653l2057R847J1641L0434q120
11301B1305q09L16j6933J7118J7982O676l200N548j3063L842j041l5309k2336
11288a9904J8479o350j5641j6735M6556M6565j2631l2040n212p651P690o502K3158
11275A9782O294K7888J2907j4255j9326J1030n113M52j7701j3764L2205j5050
$$ y = [54629, 37490, 32798, 22973, 10703, -6130, -4266, 13016, 25889, 30879, 49236, 43814, 27829, 21069, 12350, -9790, 14403, 14811, 16097, 31165, 35633, 26624, 26576, 28023, 49416, 66537, 45002, 35689, 50964, 28488, -20384, -35085, -16260, -25709, -22702, 17088, 42190, 54707, 67850, 46546, 14352, 25403, 41504, 39634, 59355, 63148, 82703, 45775, 22391, -2009, -1445, 16543, 15620, 13869, 10736, -4134, 10660, 17879, 29213, 9560, -22497, -12650, -1009, 29425, 21305, 20496, 20812, 3879, 20997, 38979, 45655, 42455, 48003, 34940, 38782, 37741, 2432, -19904, -1425, -7775, -23416, -40151, 6405, 52970, 40339, 8299, 3087, -4564, 3126, -3376, 19782, 26076, 53964, 66871, 52616, 33290, 44320, 39207, 39659, 21958, 8194, 40399, 25349]
11263B5349m3583j5479K0462K5057J6996R945Q59k5119j9913j6761r650J2015
11251a9822K247Q279K0214p908k6623n01K4094J0960J1421l765j9071O425J6401
11238B2351k1448j1557K1850J0584J4720j0292k7883j6830R655J7628q541j0827
11226a0590L0935j6990o653K0438r975j3880L691p41j6181m495J9686j3305r638
11213b7698K4743K5426k2129k3369K4487L1150P629m477O537l2002j9682j2605
11201b1990r145L3508K6300j9562j4438J246j3254j617J2909J4107J1718r839
11189I943K0228J7023J8913j0645k0644p552n029r200l621l0435j4049J0552J2793
11176a1723L9915K2688j2464K630J3117J2244j159Q122k0082k0592R524Q435j3264
$$ y = [25349, -18234, -33713, -13251, 11806, 28802, 38747, 39606, 14487, -5426, -22187, -31837, -19822, -17575, -9296, 10918, 3010, -23613, -24114, -20, 10940, 22361, 18596, -475, 5950, 22351, 903, -10654, 11196, 21780, 36500, 26208, -1675, -18505, -8850, 8778, 237, -10590, 20345, 3355, -3298, 17140, 7165, -6715, -3024, -3765, -19946, -24441, -4755, -18060, -27698, -2955, 22471, 342, -23027, 1460, 32610, 40239, 35762, 42299, 10297, -9385, -21990, -31135, 2373, 28673, 9111, -5327, -4081, -17335, -18952, -6043, 8064, 19782, 9943, 30171, 47194, 66107, 55462, 34818, 27266, 22237, 13037, 9416, -21019, -35068, -24516, -11723, 28192, 50880, 38416, 41046, 54163, 66407, 65248, 73370, 53288, 32696, 42220, 50655, 37391]
11163C7391n562J755j0532n609K2665P077k1863L565M280k4896M723r447J7734
11150B1281q55k6636N810K749J5730L242M898L5300J1924k6022j7075K774j8104
11137A5016K5518J4651l4491j2353R274K262k3925l411K0497j860K617J7405Q491
11124C9691L865J0820j7205k9489k9500K3605K8668J0991k5760J7044J9563J0000
11112F2293P557l1882Q432j1945L70P756o763p334J6531J2610N158l6647j3586
11099A2550o585R86J009r132K689N040J2942L0736J863J847l4415m0999J8526
11086b943K2846J0343o883k9302J716L2097K7734j2857j6028j3869r555j483Q713
11073A0529j897R94R234J5232N047j7957O81K9434O548N748q109O129R451m685
$$ y = [37391, 31829, 33584, 23052, 17443, 40108, 47185, 25322, 28887, 33167, 8271, 12994, 3547, 21281, 20426, -6210, -400, 2349, 18079, 21321, 26219, 61519, 73443, 47421, 30346, 33120, 15016, 40534, 55185, 20694, 8341, 17615, 19877, -4048, -7459, 13038, 11178, 13795, 31200, 39691, 43556, 54376, 37171, 7682, -21818, 1787, 30455, 41446, 15686, 32730, 52293, 62293, 69850, 37968, 46400, 34455, 34825, 42581, 35818, 28484, 45015, 57625, 62783, 26136, 12550, 5965, 6951, 7960, -1172, 1517, 6557, 19499, 50235, 52098, 53945, 19530, -21469, -2943, 19903, 30246, 23363, -5939, -4223, 27874, 55608, 42751, 26723, 12854, 3299, 1816, 10529, 8632, 9626, 18860, 34092, 39139, 21182, 21863, 51297, 57845, 63593, 55484, 61613, 71064, 66379]
11059F6379k6760k9695O273j0658J3865L4459q144k0575o666J0302J9674O446
11047E4900k8289L612P317p114l141p223L3854N457j2077k1052j2949K3754R793
11034D6842k2001j3408J5580K3342O327q424l179J7365j611l3569l323N556r209
11021B0288k0677O938K4840L2929J0046j5591n296M916k1500j2269m3901M325
11009a4952M2068K4137j3212J268N817p214q618j0894p433q001o545j295J8110
10996A3236M3248J1082l399Q293k0183r261k1098L29n523R302j0093l0061o60
10983a4788J0585J3229J5229K0977j0725R62K7576O62p211j8018O591M797p660
10970D2206K2240R630L858l9190J4863L3718m530l0795q939M3231J9081O626R752
$$ y = [66379, 39619, 9924, 16197, 5539, 19404, 53863, 45719, 25144, 18478, 28780, 48454, 54900, 26611, 30223, 37540, 30426, 27285, 20062, 53916, 59373, 47296, 26244, 13295, 37049, 46842, 24841, 11433, 27013, 50355, 56682, 48258, 45079, 62444, 60833, 27264, 23941, 29497, 20288, -389, 6549, 31389, 64318, 74364, 58773, 53477, 58393, 36893, 24624, -19277, -14952, 27116, 51253, 38041, 39309, 45126, 37912, 29294, 18400, 10967, 2966, -3579, -4874, 13236, 56484, 67566, 64167, 72460, 52277, 43016, 21918, 22247, 16724, 26026, 15933, -14128, -14788, -4203, 9026, 24255, 45232, 34507, 35469, 63045, 63707, 56496, 38478, 45069, 49866, 42206, 64446, 74076, 77934, 38744, 53607, 87325, 82795, 52000, 43061, 86292, 105373, 111999, 121751]
10957A21751k3404r503k0579n746J6982o480L0419J7340l8570l8006J3572J6102
10945G3878J270j1952L886J0250J2455O731l617m926N005J214k497J0759j2297
10932I0159l9448k2152M4918K9287j737j3922j2730j274j999p190k8020J6147
10920E2039K6186K2600j4890k3711j403J5738J1841j7847j4205J4709K022J8716
10908I1795j831l1355N601J1698J2891p904O831P391L149m520k0770n72L0636
10895A03040k2760l2787j2439N669J6037J7706J4652l454j1058j0248L4152J8842
10883A17352p957p412J037k4567l0533J4300L5678J7620J8146J4754j3165l591
10871A31662q368j6781J0001O465j6318j3205J8641Q020j2455p262K5048J8351
$$ y = [121751, 98347, 88844, 68265, 62519, 79501, 73021, 103440, 120780, 82210, 44204, 57776, 73878, 75148, 63196, 67082, 77332, 89787, 96518, 92901, 87975, 92980, 94194, 91697, 102456, 90159, 50711, 28559, 73477, 102764, 101027, 87105, 74375, 73101, 71102, 63912, 35892, 52039, 78225, 100825, 85935, 62224, 60821, 76559, 88400, 70553, 56348, 71057, 73079, 91795, 89964, 58609, 64210, 75908, 88799, 80895, 87726, 95117, 98266, 93746, 72976, 72404, 103040, 80280, 47493, 35054, 40723, 56760, 74466, 89118, 85664, 74606, 64358, 98510, 117352, 109395, 101983, 103020, 78453, 47920, 62220, 97898, 115518, 133664, 148418, 135253, 131662, 123294, 106513, 116514, 122979, 106661, 93456, 112097, 120117, 107662, 100400, 125448, 143799]
10859A43799M910K155M702r681n264m5018n433M271O008J9531K3182k1702j4267
10846A07193j5245j7982J1703K7107K0856j8479j7948O335K6033j5257j2927p123
10834I4266k772j3827K0306P949j273m07j542k4049k080p299L3287K5112J6351
10821A44022o478K073P712J6045j5419j5206o90j1411J3852l516j2328r985J8755
10808A27426P432L158J6895O309j0748j309J683L5617N6576K2719N65k9834l7934
10795A98555p535P881K6267J7274J5669k0920k9118N148K0117K729K7639J0124
10783B73830M5592K898k1203J0255J8122L9173K4890M197L250J0349K8860j0923
10771D29290J0956O523k2573j2824K0441O5057N0960j3694J5136K7053m783j7591
$$ y = [143799, 148709, 150864, 155566, 145885, 140621, 95603, 90170, 94441, 100449, 119980, 143162, 121460, 107193, 91948, 73966, 85669, 112776, 133632, 115153, 97205, 103540, 129573, 114316, 101389, 94266, 91494, 77667, 97973, 105922, 104649, 104242, 102700, 78651, 76571, 69272, 102559, 127671, 144022, 137544, 139617, 147329, 163374, 147955, 132749, 132059, 120648, 134500, 130984, 118656, 108671, 127426, 134858, 138016, 154911, 161220, 150472, 149163, 150846, 186463, 243039, 265758, 266323, 236489, 198555, 191020, 198901, 225168, 242442, 258111, 237191, 208073, 213221, 233338, 236067, 263706, 273830, 319422, 322320, 301117, 311372, 329494, 368667, 393557, 397754, 401004, 411353, 440213, 429290, 440246, 446769, 424196, 411372, 431813, 496870, 547830, 534136, 549272, 576325, 571542, 553951]
10759E53951O430J5738K6025J1578J0884J5586j7765n813l823o802n843O373J0393
10746F16912K2266L5732L8128J7326j231K6951j2269N501j065N597J5171K352
10734G71371K095j6265m19J7523p315q775k1038k6880k8067j3366Q58j6000R832
10721F63554L1153r79J0887K1025l8037k0539K0917p394j1761K6972k3391l4897
10709F37510L1469L1165J2307j425k4842k2780j7215K7057K6259L648j1100r121
10697F82932q036p4j8768k5984j1877n215q805k9850k8914r122N43J1628n03m8950
10683D99005l0294m1853J3545K4148n113j5369J7540K2950k6560k9937r747j0301
10671D08014Q344j885L661o592j8871j1684J3791k8372k9627P566K5075K8519
$$ y = [553951, 560381, 576119, 602144, 613722, 624606, 640192, 622427, 616614, 612791, 605989, 600146, 606519, 616912, 639178, 674910, 713038, 730364, 729133, 756084, 743815, 749316, 748251, 753848, 769019, 771371, 773466, 757201, 756782, 774305, 766990, 758215, 737177, 710297, 682230, 668864, 669722, 653722, 663554, 694707, 693728, 704615, 725640, 687603, 667064, 687981, 680587, 668826, 695798, 672407, 637510, 668979, 700144, 712451, 711026, 686184, 663404, 646189, 673246, 699505, 703153, 692053, 682932, 674896, 674822, 656054, 630070, 618193, 612978, 604173, 574323, 545409, 536287, 536830, 548458, 547955, 499005, 468711, 426858, 440403, 464551, 459438, 444069, 461609, 484559, 457999, 428062, 418315, 408014, 416358, 414473, 418134, 411542, 392671, 380987, 394778, 366406, 336779, 344345, 369420, 397939]
10659C97939j2960J5836J0315n0232J1976J0029p665P341J3158J276j1175N127
10647C90965j8188j4816L573M680l523J8453L4264m585j4363J644J0448J8580
10635D27132M0537q038k8219o996O058J2213J0437r798k6745q413j858J9257m117
10622D21450N82j692L3405L8907j5581j8610k1521j9058p176J7724L2002L1008
10610D91440O634J7059R022J0776k6825r931P562J0850l667k7890Q509J4996j4126
10597D94409j0079j4174K6002O1613l262j0016K1362J5122j5119J1084K613n912
10585E73643M014K2702P643Q61O919L2880K0422K4287j8226j3678J9933m1849
10573F39551j6279N8054J5025k7618j047m611M028l34j0964o935J406J7335K4143
$$ y = [397939, 384979, 400815, 411130, 360898, 372874, 382903, 375238, 382579, 395737, 397013, 385838, 390965, 372777, 357961, 361534, 366214, 362691, 381144, 415408, 410823, 396460, 398104, 408552, 427132, 467669, 459631, 431412, 424416, 430474, 442687, 453124, 443326, 416581, 408168, 406310, 425567, 421450, 422032, 420340, 453745, 492652, 477071, 458461, 436940, 417882, 410706, 428430, 460432, 491440, 498074, 515133, 524155, 534931, 508106, 498175, 505737, 516587, 512920, 485030, 493539, 508535, 494409, 484330, 470156, 496158, 557771, 554509, 544493, 565855, 580977, 565858, 576942, 579555, 573643, 577657, 600359, 608002, 608863, 615782, 648662, 669084, 693371, 675145, 661467, 681400, 639551, 623272, 681326, 696351, 668733, 667686, 663075, 667103, 666769, 655805, 648870, 650276, 667611, 691754]
10560F91754o418p846o453L1908K4971k0503k0014J0068M078K4306L7000k0551
10548G42300r720L1116K1901j033K5672J5848J5484l437j7720l3785q145J1345
10536G89826J35N035K4310N239J4555J9137J0381R75j633Q628K0472P777k2795
10523H82042j4753J705K2571R301L4532K3279J5859L4861J4397r731K3722L7904
10511A075689J2948j0679R110p425P759P521R644K9709K5289j1410R161K5086
10499A182402K9767K4076M188N42L207j0935K1949M7721J2060L7181K6106L068
10487A381332L469M1008M4317L6783N1565L4290K2293J3180m672O864L9075M4517
10475A714021K5545K2568j5159j192K1351K8589L0507J2863L1420o15K6566L5654
$$ y = [691754, 685336, 677490, 671037, 702945, 727916, 707413, 687399, 697467, 701545, 725851, 762851, 742300, 732580, 763696, 785597, 784564, 810236, 826084, 841568, 838131, 820411, 786626, 778481, 789826, 789961, 794996, 819306, 824545, 839100, 858237, 868618, 869593, 867960, 876588, 897060, 904837, 882042, 867289, 868994, 891565, 900866, 935398, 958677, 974536, 1009397, 1023794, 1014063, 1037785, 1075689, 1088637, 1077958, 1087068, 1079643, 1087402, 1094923, 1104567, 1134276, 1159565, 1148155, 1157316, 1182402, 1212169, 1236245, 1240433, 1240975, 1244182, 1233247, 1255196, 1302917, 1314977, 1352158, 1378264, 1381332, 1384801, 1425809, 1470126, 1506909, 1558474, 1592764, 1615057, 1628237, 1623565, 1630429, 1669504, 1714021, 1739566, 1762134, 1746975, 1745783, 1767134, 1795723, 1826230, 1839093, 1870513, 1869898, 1896464, 1932118]
10463A932118L0539N4321O3219L7638j6882R582K5904R901L4184M2616L4253L3149
10451B290542N0412N4508M4853K7378L5907K0666L0297N5691K6557R377L6574
10440B682762P0592Q2933L2660M5199O2283N2435M4695N4832R7121Q6656P8687
10429C390855N5327M7782O7624M8662R6439P3627R0466O8312Q0104J23683Q6926
10418D229807O4258Q4180R6117J09675J28125J40510J31776J40816J44090J41956
10408E411310J45089J69725J61468J45780K08451K16099J87220J88267K15409
10399G048818K25980K65663K73928K90736K98701L28596L39837L52661L80982
10390I805902L69601L96326M42399M90334N43040N62438N75252O05618O43359
$$ y = [1932118, 1962657, 2016978, 2080197, 2117835, 2100953, 2110535, 2136439, 2146340, 2180524, 2223140, 2257393, 2290542, 2340954, 2395462, 2440315, 2467693, 2503600, 2524266, 2554563, 2610254, 2636811, 2646188, 2682762, 2753354, 2836287, 2868947, 2914146, 2976429, 3028864, 3073559, 3128391, 3225512, 3312168, 3390855, 3446182, 3493964, 3561588, 3610250, 3706689, 3780316, 3870782, 3939094, 4019198, 4142881, 4229807, 4294065, 4378245, 4474362, 4584037, 4712162, 4852672, 4984448, 5125264, 5269354, 5411310, 5556399, 5726124, 5887592, 6033372, 6241823, 6457922, 6645142, 6833409, 7048818, 7274798, 7540461, 7814389, 8105125, 8403826, 8732422, 9072259, 9424920, 9805902, 10175503, 10571829, 11014228, 11504562, 12047602, 12610040, 13185292, 13790910, 14434269]
10381A4434269P12665P73031Q25356Q86856R52936J019819J097420J166792J300604
10372B3169748J393216J517154J633284J791585J911687K046282K205380K392869
10364C8061205K533637K676886K791119K947540L000383L033513L054314L003677
10356F1102274K890296K717301K443003K189754J885667J571772J210812Q88419
10348G6899298O39486L70451J69370Q7991K8259J058O6037J87774L75845N45967
10338G9371536P34937R72140J231869J471673J693203J891123K120763K276933
10330I1764177K376079K433870K450311K393978K285799K110750J835314J524274
10322A09174552J199435Q34201M39401O4771k84349o58719r97029j252868j518286
$$ y = [14434269, 15146934, 15919965, 16745321, 17632177, 18585113, 19604932, 20702352, 21869144, 23169748, 24562964, 26080118, 27713402, 29504987, 31416674, 33462956, 35668336, 38061205, 40594842, 43271728, 46062847, 49010387, 52010770, 55044283, 58098597, 61102274, 63992570, 66709871, 69152874, 71342628, 73228295, 74800067, 76010879, 76899298, 77538784, 77909235, 78078605, 78166596, 78194855, 78195913, 78261950, 78449724, 78825569, 79371536, 80106473, 81078613, 82310482, 83782155, 85475358, 87366481, 89487244, 91764177, 94140256, 96574126, 99024437, 101418415, 103704214, 105814964, 107650278, 109174552, 110373987, 111208188, 111647589, 111712360, 111428011, 110769292, 109772263, 108519395, 107001109]
10313A07001109j743284j925156k076002k151236k196589k224770k188643k115412
10305I0380017j989755j817244j640397j456099j218725r34487o93064m69047
10297H0161199j99036N5330K73966M87163O41372P31294P91618P52490O23877
10288H4319273M32735J72570k14414o12361j069487j556627k039308k431593k745947
10279G4254841l013526l240124l328625l322731l317760l222148l110545k980674
10271D8718708k848280k688239k553036k397078k222659k056639j913172j763689
10263C0275916j660163j563478j457816j389839j279678j153369j075138j020545
10255A9675890r30442q51125q10065p53118o87536o68906o41093o27887n64820
$$ y = [107001109, 105257825, 103332669, 101256667, 99105431, 96908842, 94684072, 92495429, 90380017, 88390262, 86573018, 84932621, 83476522, 82257797, 81323310, 80630246, 80161199, 79962163, 80017493, 80291459, 80778622, 81419994, 82151288, 82942906, 83695396, 84319273, 84752008, 84924578, 84710164, 84097803, 83028316, 81471689, 79432381, 77000788, 74254841, 71241315, 68001191, 64672566, 61349835, 58032075, 54809927, 51699382, 48718708, 45870428, 43182189, 40629153, 38232075, 36009416, 33952777, 32039605, 30275916, 28615753, 27052275, 25594459, 24204620, 22924942, 21771573, 20696435, 19675890, 18745448, 17894323, 17084258, 16331140, 15643604, 14974698, 14333605, 13705718, 13140898]
10246A3140898n28476m77645m43262m41431m50906l55709l20922l61499l62577
10237I398471k97929k78407k64260k45910k76725k70153k76292k46406k32219
10228G010170k13788j71280j61521j53803j88406j82288j27948j48457j19678
10219E543001j25638j19755j12530j02967j20627j21282j14734j39802j10608
10210D475058q6786q6945o3267p9926r2050q7704o6025p7264r0198q3587m0572
10199C620734p5622p3157o6836l7967m9883m7100p2725o1602n8822l7999l0668
10188C008353n4562l7469n8849o1865k9137j0414m9175n4429k8449l6258l4902
10177B552844k4364k0540m6996m1628m6870j1726r829q831j4413l0386l9331l5810
$$ y = [13140898, 12612422, 12134777, 11691515, 11250084, 10799178, 10443469, 10122547, 9761048, 9398471, 9100542, 8822135, 8557875, 8311965, 8035240, 7765087, 7488795, 7242389, 7010170, 6796382, 6625102, 6463581, 6309778, 6121372, 5939084, 5811136, 5662679, 5543001, 5417363, 5297608, 5185078, 5082111, 4961484, 4840202, 4725468, 4585666, 4475058, 4388272, 4301327, 4238060, 4158134, 4066084, 3978380, 3912355, 3835091, 3744893, 3661306, 3620734, 3545112, 3471955, 3405119, 3367152, 3317269, 3270169, 3197444, 3135842, 3077020, 3039021, 3008353, 2953791, 2916322, 2857473, 2795608, 2766471, 2756057, 2706882, 2652453, 2624004, 2587746, 2552844, 2528480, 2507940, 2460944, 2419316, 2372446, 2360720, 2350891, 2342060, 2327647, 2297261, 2257930, 2222120]
10165B222120k7027l3621k3747j8615k0501k8317k5756m7842k5771j5950q934
10154A946039n3571n0051k3366k1124m719o738k9969l7783j5119r205l2185m9538
10142A612671m7453j21j3351k2517m178J2007k3273m3605l5617k9609k1036j1254
10130A372664l326j6930k5344j1400k1902n2088k6382J2276L996l3757k202M533
10118A200138k1344k8386l179l7709M497M386J0415K563n5056O566p26j4420j7840
10105A049905k496j261q806j8203j2476j511j5719k656K2160L487l3872k6271
10093I52281j349j8548N129j671n792R30J424j2298O495j1487m8593k4226r530
10080H32765J0109j3637k4275R823J3316k0934O062j7433m564j1740j6470J2793
$$ y = [2222120, 2195093, 2161472, 2137725, 2119110, 2098609, 2070292, 2044536, 1996694, 1970923, 1954973, 1946039, 1892468, 1842417, 1819051, 1797927, 1793208, 1786470, 1756501, 1718718, 1703599, 1694394, 1662209, 1612671, 1565218, 1565097, 1551746, 1529229, 1525051, 1537058, 1513785, 1470180, 1434563, 1404954, 1383918, 1372664, 1369338, 1352408, 1327064, 1315664, 1293762, 1241674, 1215292, 1227568, 1231564, 1197807, 1195605, 1200138, 1178794, 1150408, 1147229, 1109520, 1114017, 1118403, 1128818, 1131381, 1076325, 1082891, 1082165, 1067745, 1049905, 1047409, 1046148, 1037342, 1019139, 1006663, 1005152, 989433, 986777, 1008937, 1012424, 978552, 952281, 950932, 932384, 937513, 935842, 930050, 930980, 932404, 920106, 926601, 915114, 866521, 842295, 832765, 842874, 829237, 804962, 814785, 828101, 807167, 813229, 795796, 791232, 779492, 763022, 775815]
10068G75815k3684j5351R449K2167l3111j9107R927l162k164j3559P239l023J36
10055G11572k960M4669Q7034J23184K44369L14712M5702j69668k69069k30341
10045H99204j13095m9878n5880k8558L682N519m1423o1325K511K3828K3443M522
10033F12550j7795j7264o609k1513j5032l730J6438L2139P516k6109n3651k4297
10021D82643K1833k148K9929K198j07j988n50k4907m583l8803j9390o517j987
10008D35623J7011P084M2202J6745k3707J5383K5882k7693k2425j4970l2060J6026
9996D55101J0905k1507O777L007J2535j665m939j3702q27j8233k247Q323K4860
9983D58388m914k5711O087O24j1434J0586J762L077j1629k9593K2643R026J0274
$$ y = [775815, 752131, 736780, 746229, 768396, 735285, 716178, 726105, 722943, 720779, 707220, 714459, 711436, 711572, 708612, 753281, 840315, 963499, 1207868, 1522580, 1568282, 1398614, 1129545, 899204, 786109, 736231, 680351, 651793, 655475, 660994, 619571, 558246, 560757, 584585, 608028, 612550, 594755, 577491, 570882, 549369, 534337, 530607, 547045, 579184, 586700, 560591, 506940, 482643, 504476, 502328, 532257, 534455, 534348, 532360, 531810, 506903, 502320, 463517, 444127, 437610, 435623, 452634, 459718, 501920, 518665, 494958, 510341, 536223, 508530, 486105, 471135, 439075, 455101, 466006, 444499, 451276, 454283, 466818, 465153, 460214, 446512, 445685, 427452, 425205, 433528, 458388, 453474, 427763, 433850, 434474, 423040, 433626, 435388, 438465, 426836, 397243, 419886, 428912, 439186]
9970D39186j1005J8166K3669k3660m704m607l1135k2708J93J7065K7967L4558
9958D62985J4470j1976j1081K6103J4669q092M032j1731p703j6115Q225q986K6198
9945D80998N5935L0208m231J1228J651K1939L6168P601k359q988m079L0306M8801
9932G05178K0351j0503r511l259K0589J0810J3175j0995k0918m5309k1918l541
9920F44149K9421J0202O189k1527L490R251L2694L4446J8941o69J3485L9877J2243
9907H32192L2762K6116P547j874j5410k0534k0691K954M8367m476l7517r945J5671
9894H55162j813L056m889j9028l0155l6588j948N545k2580m884j492j559L0333
9881G69160R963k1724n8114j5624O511j5274J4394m754m494j0816M747L3062Q356
$$ y = [439186, 428181, 446347, 470016, 446356, 441652, 437045, 405910, 383202, 383395, 400460, 428427, 462985, 477455, 465479, 454398, 480501, 495170, 487078, 491110, 479379, 471676, 455561, 463786, 454800, 480998, 536933, 567141, 562910, 574138, 575789, 597728, 633896, 641497, 639138, 630150, 626071, 656377, 705178, 725529, 715026, 705515, 702256, 722845, 733655, 746830, 735835, 714917, 669608, 647690, 644149, 673570, 683772, 689961, 668434, 671924, 681175, 713869, 748315, 767256, 766587, 780072, 819949, 832192, 864954, 891070, 898617, 896743, 881333, 860799, 840108, 843062, 891429, 886953, 849436, 839491, 855162, 853349, 856405, 851516, 832488, 802333, 765745, 763797, 769342, 746762, 741878, 740386, 738827, 769160, 779123, 757399, 699285, 683661, 690172, 674898, 689292, 684538, 680044, 669228, 673975, 707037, 715393]
9868G15393k4996j8750K800J0312k5263k3808k0061l9905j6964J8997J3434j4405
9856E76784j9081j3955J8565K640l1643n7523l8778j6601J9607O126m3271l2381
9844C70489L0633m324l4064J3734O567l1160j1251J0428j7055j7796q924k4601
9832B82676k8144L1602N2017J6840k1120j4748j8371j2802n43k8050j0610J4291
9820B63038J8109k7798j5491m685J8017J7421j4326K936j3428o075L710M3584
9808B85012J3807j4921k3159k053P814J856j0281k504j0007M124Q900j4356r912
9795B34320k4029M115J9251J3741n628k3600O843P595j3397j3845J0400J7776
9783B33542k62j0588P043j6157l141j9960M221K7807Q116k6436l6258k4455M4392
$$ y = [715393, 690397, 671647, 674447, 684759, 659496, 635688, 615627, 575722, 558758, 577755, 591189, 576784, 557703, 543748, 562313, 564953, 533310, 475787, 437009, 420408, 440015, 446141, 402870, 370489, 401122, 396798, 362734, 376468, 383035, 351875, 340624, 351052, 333997, 316201, 307277, 282676, 254532, 286134, 338151, 354991, 333871, 319123, 300752, 287950, 287407, 259357, 248747, 263038, 281147, 253349, 237858, 233173, 251190, 268611, 254285, 257221, 243793, 237718, 241428, 285012, 298819, 283898, 260739, 258686, 266500, 268356, 258075, 255571, 245564, 249688, 258588, 244232, 234320, 210291, 214406, 233657, 247398, 241770, 218170, 225013, 232608, 219211, 205366, 215766, 233542, 233280, 222692, 229735, 213578, 210437, 190477, 194698, 222505, 230621, 204185, 167927, 143472, 187864]
9770A87864J3144J6302K2842J3591j7547R961j032P886j3612p577n662J83p401
9757B18942J8244J3880o133j7990M157L490J068K7214o340K7884R130O592L0305
9744C30443m075L906k9962j0130K3342M092J9703J8534N2230K7849K3085k6046
9732D32971r576q201N350K5088P629M5845M5931L3858L6410M0714J0738M4026
9720G10783O3091R6047Q1289O4722J04168J26723J61697J53910J77000K60909
9710B000339L21291L65465M22633N28231O23211P26315P43901P12086N45194K81645
9700G270311q3801l82133n96148p02043p07453o56368n67225m89097m13454l36477
9690B336112k76983k26893j49533j55904j34597j40168j21660q1989p6905o7302
$$ y = [187864, 201008, 217310, 240152, 253743, 236196, 246157, 245125, 253011, 239399, 231822, 226160, 226343, 218942, 237186, 251066, 244933, 226943, 231100, 234590, 235658, 262872, 256532, 284416, 293546, 300138, 330443, 326368, 330274, 300312, 290182, 313524, 317616, 337319, 355853, 408083, 435932, 459017, 432971, 423395, 415194, 420544, 445632, 453261, 499106, 545037, 578895, 615305, 656019, 666757, 710783, 773874, 869921, 951210, 1015932, 1120100, 1246823, 1408520, 1562430, 1739430, 2000339, 2321630, 2687095, 3109728, 3637959, 4261170, 4987485, 5731386, 6443472, 6988666, 7270311, 7186510, 6804377, 6208229, 5506186, 4798733, 4142365, 3575140, 3086043, 2672589, 2336112, 2059129, 1832236, 1682703, 1526799, 1392202, 1252034, 1130374, 1048385, 971480, 904178]
9680I04178q1988o3748r551k3072n8082o2884n2095n2889l169K626k5336o2460
9668D11530k7575J5739l4146j1178K897J6217J4627j7895l2438j9833K0786P53
9656C39484j7889k3189o427l0232r528n102J07J4351O977P020J7616J7690L738
9643C14616j1020m2033l2655j567o695m367m240K4728M714l1002j0131R318L3338
9630B43004l1003k9539J6677M210k786J0J7694K0159r583k0970r382j8343M606
9617A84754j4756L894K2083q07J660J9294J2688k9609N680J9880j3479j8416p041
9604A85825j273R204R645j7286j6563J2163j2436n354K0369J1137m7987k0012
9592A27432P148K3231M0380J7824k0450K932J865k541Q883K4248m833l2487k1628
$$ y = [904178, 822190, 758442, 748891, 725819, 667737, 604853, 552758, 499869, 496700, 499326, 473990, 411530, 383955, 399694, 365548, 354370, 357267, 373484, 388111, 370216, 337778, 317945, 338731, 339484, 321595, 298406, 291979, 261747, 252219, 247117, 247224, 261575, 268552, 275572, 293188, 310878, 314616, 303596, 261563, 228908, 227341, 220646, 216279, 212039, 236767, 241481, 210479, 200348, 209666, 243004, 212001, 182462, 199139, 203349, 200563, 200573, 218267, 238426, 228843, 207873, 198491, 180148, 184754, 169998, 173892, 195975, 195168, 196828, 216122, 228810, 199201, 204881, 224761, 211282, 192866, 185825, 184552, 193756, 203401, 186115, 169552, 181715, 169279, 163925, 184294, 195431, 147444, 127432, 134580, 157811, 198191, 216015, 195565, 198497, 200362, 197821, 206704, 230952, 226119, 193632, 172004]
9579A72004k8067r887J6691K7143J0813J16r845k6460J7791J6702O753j7945o329
9566A69480j2238O739L660J2348J1684p565j6788N250K3740J271j8177J6436M2570
9553B38410K7797M0122L7369J4703Q237k15j4508k5153l6982j0426k6032J4851
9541B68173q088k2299m395j4246k5974J3211Q788r315J7741Q757J8152J9755L9444
9528C09704K0693p635j3676J4281K9830K6964L4172K8895P1535J2501M429L2319
9516E64012L9611M2320J9976R048J705M9084n800n5840l5994n4558o4668l2900
9504D75996m6613l0074m878J9062J5101j0385j2310r647L895k2658k931K0710
9492C95268K8523K4176J1681J7068K9089J4963J6226L0694O5837L8234M1201M7311
$$ y = [172004, 143937, 134050, 150741, 177884, 188697, 188813, 178968, 152508, 170299, 187001, 193754, 175809, 169480, 157242, 163981, 167641, 179989, 191673, 184108, 167320, 172570, 196310, 197581, 179404, 195840, 238410, 266207, 306329, 343698, 358401, 366638, 366423, 351915, 326762, 289780, 279354, 253322, 268173, 260085, 237786, 233391, 219145, 193171, 206382, 215170, 205855, 223596, 232353, 250505, 270260, 309704, 330397, 322762, 309086, 323367, 353197, 380161, 414333, 443228, 514763, 527264, 531693, 564012, 603623, 645943, 665919, 674967, 676672, 725756, 719956, 664116, 628122, 573564, 508896, 475996, 429383, 399309, 394431, 413493, 428594, 418209, 405899, 396252, 400147, 377489, 374558, 395268, 423791, 447967, 459648, 476716, 505805, 520768, 536994, 567688, 633525, 671759, 712960, 760271]
9480G60271K4554K2044L9272J7815Q704q264k0977j4084l4708n3673l6405k0413
9468F84136l1907m6861k1401k5815r506k4316k2692j1083J3966Q09j3335J461
9456D93456p421j7436M893K2864n036J3411L3840K6175J5098q605J1244K9432
9444F11915L1816K1257p386M3243K3089N167l4522l8394j8857m5991o7771j8368
9432E05198J3991k5112l9745l6805q2l101k6302m2538l3151o900K1083j5197l9494
9419B71845J1552j1967l4527J2319K0760J8130J9298j2339M8590N0875j5446r420
9407C69670K4588O089k4488k8114Q014k7963m8039n503O309j5272j5477k6244
9395B23570j168J3151J5406j7634m0588n291K1466j1069q076J6589L4154m05r317
$$ y = [760271, 784825, 806869, 846141, 863956, 872660, 864396, 843419, 829335, 794627, 740954, 704549, 684136, 652229, 605368, 583967, 558152, 548646, 524330, 501638, 490555, 504521, 505330, 491995, 493456, 486035, 468599, 473492, 496356, 491320, 504731, 538571, 564746, 579844, 571239, 582483, 611915, 643731, 664988, 657602, 700845, 723934, 729101, 694579, 656185, 637328, 591337, 523566, 505198, 519189, 494077, 454332, 417527, 417445, 414344, 388042, 345504, 312353, 305453, 326536, 311339, 271845, 283397, 271430, 236903, 249222, 269982, 288112, 307410, 295071, 343661, 394536, 379090, 369670, 394258, 400347, 375859, 347745, 355759, 327796, 279757, 274254, 280563, 265291, 249814, 223570, 222402, 235553, 250959, 233325, 192737, 187446, 208912, 197843, 189767, 206356, 240510, 240105, 230788]
9382B30788J7696J4309J1264Q920j5761k7625k736j9130L4676L3431ML357O125
9369B95318m011q740p103j3270R205N495J0352n375j8091q073J3093m507O315
9356B70608o58l2294P905J1764J9984N188K86L383O926j760p197n888L8387K9227
9342C45861J8699K5678L0883L277N766R901J041N814k077n2537O40J7139r858
9329D00227k6097j3976M137J1240N3139K0688Q862J7874q525K1475O7555M4378
9317F00977O7056J8041l0215k8734R853K239Q91m501L76J8860K5995J9833K8274
9304G28945K4814j9387j5127J1125J4147R757j5253k6121q34J7450K1816M1728
9292G93060R297k0546p579M3476M4679M3041J0980J0730R617K1797K3928L3936
$$ y = [230788, 248484, 262793, 274057, 282977, 267216, 239591, 236855, 217725, 252401, 285832, 285836, 289193, 295318, 291307, 282567, 275464, 262194, 271399, 276894, 287246, 281871, 263780, 255707, 268800, 264293, 270608, 269950, 237656, 245561, 257325, 277309, 282497, 282783, 286166, 293092, 291332, 284135, 278247, 316634, 345861, 364560, 390238, 421121, 424398, 430164, 440065, 441106, 446920, 444843, 392306, 392946, 410085, 400227, 374130, 360154, 364291, 375531, 428670, 449358, 458220, 476094, 467569, 489044, 556599, 600977, 668033, 686074, 655859, 627125, 636978, 639217, 640108, 635607, 635983, 654843, 680838, 700671, 728945, 753759, 734372, 719245, 730370, 744517, 754274, 739021, 712900, 712066, 729516, 751332, 793060, 802357, 781811, 774232, 817708, 862387, 905428, 916408, 927138, 936755, 958552, 982480, 1016416]
9280A016416O9497O6866N3826N6027L1813N5085M6332Q9877N6383J5299J5135
9269A572556q655m7070l1332P075J9787K4048J7063L0867M5677L8253J7557L0962
9257A716788L4376K0340J9679L5474N5412K5557K5218M3337P8488J15640J32704
9246B303013J69009K09867J94954J78291J74023J83538J40815Q3929N8300N2212
9236C747951J10261K16072L80967M83675N94856N73864O05284O25202N27717M68010
9226H333859M77494L92537K86725J75448K21968M02131O22848O73642N94779L69171
9216A2550602L5985l37872n66006n89032m89532l65558k70081j81026j18023l3823
9206I635634K9885Q5163R6453M0528o3324j49724k06113k35814j89615j45438
$$ y = [1016416, 1085913, 1152779, 1206605, 1262632, 1294445, 1349530, 1395862, 1485739, 1542122, 1557421, 1572556, 1563901, 1516831, 1485499, 1492574, 1512361, 1536409, 1553472, 1584339, 1630016, 1668269, 1685826, 1716788, 1751164, 1771504, 1791183, 1826657, 1882069, 1907626, 1932844, 1976181, 2054669, 2170309, 2303013, 2472022, 2681889, 2876843, 3055134, 3229157, 3412695, 3553510, 3637439, 3695739, 3747951, 3858212, 4074284, 4455251, 4938926, 5533782, 6107646, 6712930, 7338132, 7865849, 8333859, 8811353, 9203890, 9490615, 9666063, 9888031, 10290162, 10913010, 11586652, 12181431, 12550602, 12586587, 12248715, 11682709, 11093677, 10604145, 10238587, 9968506, 9787480, 9669457, 9635634, 9665519, 9750682, 9847135, 9887663, 9824339, 9674615, 9468502, 9232688, 9043073, 8897635]
9196H897635j80924k03297j89158j85276k02513k00613k20751k35673k86579k61454
9186F731397j87963j32600r7642p1680l3617j7473R330O6995J41695J89624J87212
9175F785278J68798J07090J54263K28630L26995L56820L52735L30296L36274M19031
9165I566210N86652P97749R72236J080384J243923J467996J727273J954130K116061
9156B1512614K173440K231864K237765J920697J231591K84049p31920j513605
9148B9346495k016086k086041j829228j535192j272438j067375q59266n70543
9140A8110326j87139J50046N18817Q30273J181907J470509J758780J964733K156630
9131B7954882K383174K721954L159876L639953M078787M341936M413644M298911
$$ y = [8897635, 8716711, 8513414, 8324256, 8138980, 7936467, 7735854, 7515103, 7279430, 6992851, 6731397, 6543434, 6410834, 6313192, 6241512, 6207895, 6190422, 6199752, 6266747, 6408442, 6598066, 6785278, 6954076, 7061166, 7215429, 7444059, 7771054, 8127874, 8480609, 8810905, 9147179, 9566210, 10152862, 10950611, 11922847, 13003231, 14247154, 15715150, 17442423, 19396553, 21512614, 23686054, 25917918, 28155683, 30076380, 31307971, 31592020, 30860100, 29346495, 27330409, 25244368, 23415140, 21879948, 20607510, 19540135, 18680869, 18110326, 17923187, 18073233, 18592050, 19422323, 20604230, 22074739, 23833519, 25798252, 27954882, 30338056, 33060010, 36219886, 39859839, 43938626, 48280562, 52694206, 56993117]
9123E6993117L982690L483797K897872K422023K055628J748703J523346J288519
9115G6395695J016148M98193k39747j112826j888511k414966k674829k735031
9107F6844126k682119k577402k364878j964250j386512p36840n6196N58715J143482
9098E6778126J661609K074299K435885K760230L137530L561562L981497M383954
9090H0774692M749353N124209N392346N477358N410324N232223N055416M823401
9082A22039322M340155L324511J596660n64928k788390m561243n688330o362856
9074A11334901o648548o588601o226397n606243m899429m189689l468378k763965
9066G0943651k169549j593391j022424m90234M0315N41004J082361J607876K132376
$$ y = [56993117, 60975807, 64459604, 67357476, 69779499, 71835127, 73583830, 75107176, 76395695, 77411843, 77910036, 77670289, 76557463, 74668952, 72253986, 69579157, 66844126, 64162007, 61584605, 59219727, 57255477, 55868965, 55132125, 55075929, 55634644, 56778126, 58439735, 60514034, 62949919, 65710149, 68847679, 72409241, 76390738, 80774692, 85524045, 90648254, 96040600, 101517958, 106928282, 112160505, 117215921, 122039322, 126379477, 129703988, 131300648, 130735720, 127947330, 123386087, 117697757, 111334901, 104686353, 98097752, 91871355, 86265112, 81365683, 77175994, 73707616, 70943651, 68774102, 67180711, 66158287, 65668053, 65708368, 66249372, 67331733, 68939609, 71071985]
9057G1071985K700655L257557L733922M131603M318037M291792M087925L671550
9049A01265026L047044K168553J067200k36192j673992l059881m281113n141497
9041I3155148n631055n784477n614896n264669m862113m440309l962647l542934
9033E4052048l110778k714367k331190k013550j775482j490675j201187r21641
9025C8493178n89574k70513Q6070M28714Q20470J128141J299080J303831J180704
9016D3880101R71358P48249N07984L0457p43318j622325k328557k800655k895687
9007C5747607k756186k422651j982084j644310j491771j406164j443959j516655
8999B1083827j569712j574287j516646j353490j225349j101709r74055q27986
$$ y = [71071985, 73772640, 77030197, 80764119, 84895722, 89213759, 93505551, 97593476, 101265026, 104312070, 106480623, 107547823, 107311631, 105637639, 102577758, 98296645, 93155148, 87524093, 81739616, 76124720, 70860051, 65997938, 61557629, 57594982, 54052048, 50941270, 48226903, 45895713, 43882163, 42106681, 40616006, 39414819, 38493178, 37903604, 37633091, 37719161, 38147875, 38968345, 40096486, 41395566, 42699397, 43880101, 44851459, 45599708, 46107692, 46138149, 45394831, 43772506, 41443949, 38643294, 35747607, 32991421, 30568770, 28586686, 26942376, 25450605, 24044441, 22600482, 21083827, 19514115, 17939828, 16423182, 15069692, 13844343, 12742634, 11768579, 10940593]
8991A0940593p44815o40085n28203m43411m08529m02738l54015l35649k82586
8982F800562k90061k71743k66946k20448j81559j16625r9933p8698m3044R017
8972E240522R060L8320K5093L6497N3292Q1144J03736R5103J05770J30835J25977
8961F045349J40388J55819J56980J68978J81241K15239K34245K75896L13759L90445
8951H278339M58716M95125N29892N86309O88776O66129P12169P45178P34893P50644
8941A4646170P33856P10643O89730O64990O86765O82403O82185P06392P95883
8932B0999017R34968J023349J122489J148030J074218Q09408N42092J87521j31826
8923B7709266l78851n02347m59890l14920j33863J00883L30883N41804O72435
$$ y = [10940593, 10195778, 9555693, 9027490, 8584079, 8175550, 7772812, 7418797, 7083148, 6800562, 6510501, 6238758, 5971812, 5751364, 5569805, 5453180, 5353247, 5274549, 5231505, 5240522, 5249582, 5287902, 5312995, 5349492, 5402784, 5483928, 5587664, 5682767, 5788537, 5919372, 6045349, 6185737, 6341556, 6498536, 6667514, 6848755, 7063994, 7298239, 7574135, 7887894, 8278339, 8737055, 9232180, 9762072, 10348381, 11037157, 11703286, 12415455, 13160633, 13895526, 14646170, 15380026, 16090669, 16780399, 17445389, 18132154, 18814557, 19496742, 20203134, 20999017, 21933985, 22957334, 24079823, 25227853, 26302071, 27111479, 27653571, 27841092, 27709266, 27330415, 26828068, 26368178, 26053258, 25919395, 26020278, 26351161, 26892965, 27565400]
8914B7565400P71113P11768N88386M91972K99015J89417J44696J82977K40960
8905C1185704L91049N56639P36874R28002J116548J290897J489434J666849J733810
8896D1095806J699197J573454J382308J083883P40047M28733J42393j31431l47858
8887D7666532m79886n86020o28122p33156q13721q95653r97190j067850j157122
8878D0307812j225992j215497j165108r74658p48893n34966k68010M3668L49570
8869C4567926O14548R11847J209484J511571J695363J758501J688286J573683
8861D5531209J279439R20004M66037K1918k86561n81145q61401j056913j151877
8852D4280710j226200j265879j246062j262458j253233j224529j200870j133597
$$ y = [27565400, 28336513, 29048281, 29636667, 30128639, 30427654, 30617071, 30761767, 30944744, 31185704, 31576753, 32133392, 32870266, 33798268, 34914816, 36205713, 37695147, 39361996, 41095806, 42795003, 44368457, 45750765, 46834648, 47574695, 48003428, 48145821, 48014390, 47666532, 47186646, 46600626, 45972504, 45239348, 44425627, 43529974, 42532784, 41464934, 40307812, 39081820, 37866323, 36701215, 35726557, 34977664, 34442698, 34174688, 34218356, 34567926, 35182474, 36094321, 37303805, 38815376, 40510739, 42269240, 43957526, 45531209, 46810648, 47730652, 48196689, 48218607, 47932046, 47350901, 46489500, 45432587, 44280710, 43054510, 41788631, 40542569, 39280111, 38026878, 36802349, 35601479, 34467882]
8844C4467882j038255q98323p03283n95093n11867m88585n46515o29570o78309
8835B8378082p53567q05308p01680n51183m48966l37868j83276j29681n1688j154
8825B4413711j6191j03585j76921k23000k78671k85274k75569k38727k11640j95676
8815B2408457j91073k36917l45330m90317o38647q03174r73278j080226j135692
8806A6513803j142567j112733j035024r06225p91450o91261n64637m60167l36536
8797I473203k41898j34791j09144m3129L8924J4976l8661j18058j81573k44407
8787H415442k98217k84903k05491j65444j41805q7417o5349j09360j62102k29210
8777F666144l26272l83998m20638m07268l78165l38835l28989k84645k78467k16379
$$ y = [34467882, 33429627, 32531304, 31828021, 31232928, 30721061, 30232476, 29685961, 29056391, 28378082, 27624515, 26819207, 26117527, 25566344, 25117378, 24779510, 24596234, 24466553, 24414865, 24413711, 24397520, 24293935, 24117014, 23894014, 23615343, 23330069, 23054500, 22815773, 22604133, 22408457, 22217384, 21980467, 21635137, 21144820, 20506173, 19702999, 18729721, 17649495, 16513803, 15371236, 14258503, 13223479, 12317254, 11525804, 10834543, 10269906, 9809739, 9473203, 9231305, 9096514, 8987370, 8944241, 8983165, 8998141, 8959480, 8841422, 8659849, 8415442, 8117225, 7832322, 7626831, 7461387, 7319582, 7232165, 7166816, 7057456, 6895354, 6666144, 6339872, 5955874, 5535236, 5127968, 4749803, 4410968, 4081979, 3797334, 3518867, 3302488]
8767C302488j94627j73659j56649j26863j21463j18225q2257r1380r0911q5631
8757B060823o8418q6827n7233p3280n6552l6296n4471n6901l7005k2670j3642
8746A497528o690k485k8651j4932q875n515r38j4158k3140j076k7606k9203k0049
8733A314210l7661k5114l9358k1467r886k9562J445J0484j8472k1084q05j7698
8721A105032j0934l0539P43k1841J1351J9517Q188o873L3804M2617K8525L2800
8709A212390K680J7838K4417J0739p063j3774k8390n416k3905l0690q598k3530
8697A126698l8819k0160m7551N030M59j6931k7895l0093l1472k5638J4461L0920
8685I39009J481m953j7517k8926J7488J5050L3765K7917M3375J8031K0614L2694
$$ y = [3302488, 3107861, 2934202, 2777553, 2650690, 2529227, 2411002, 2328745, 2237365, 2146454, 2060823, 1992405, 1905578, 1848345, 1775065, 1718513, 1682217, 1627746, 1570845, 1533840, 1511170, 1497528, 1490838, 1488353, 1459702, 1444770, 1435895, 1430380, 1429442, 1415284, 1392144, 1391068, 1363462, 1334259, 1314210, 1276549, 1251435, 1212077, 1190610, 1180724, 1151162, 1152607, 1163091, 1144619, 1123535, 1122730, 1105032, 1094098, 1063559, 1064302, 1042461, 1053812, 1073329, 1081517, 1074644, 1108448, 1151065, 1179590, 1212390, 1215070, 1232908, 1257325, 1268064, 1261001, 1247227, 1218837, 1213421, 1189516, 1158826, 1150228, 1126698, 1087879, 1067719, 1020168, 1025198, 1025657, 1008726, 980831, 950738, 919266, 893628, 908089, 939009, 940490, 935537, 918020, 889094, 906582, 921632, 955397, 983314, 1026689, 1044720, 1065334, 1098028]
8673A098028K0754o189q001k232J8604j3250k9058l1151k0878q335m9291m5730
8661I23271k734O65l8878o4753r336j1383k4060p598l1729l6323L584K452k6248
8648F76930K784J5576R707j277J1151J5659J991K3j2158o65q570L292J8554K532
8634G35529k2820l5485o384N153j9092k1881j4094j0330j3647j1040m1067l8210
8622E06632j522K048L755k2063m7548l2252M617O804j8943k440J2637j5395j1698
8609C84632K733q791Q103J5855L0089j0389p322m499j782M139N03k261j4963k5267
8595C70780J0141K4226l2918k5077j533l3840J5796m914J74K289K276r822N530
8582C23108j203l3937k2399r171p018K156p90j0636N702Q674J156j6580K3708
$$ y = [1098028, 1118782, 1112593, 1104592, 1102360, 1120964, 1107714, 1078656, 1047505, 1026627, 1018292, 969001, 923271, 920537, 921202, 882324, 817571, 808235, 796852, 772792, 765194, 733465, 697142, 700726, 703178, 676930, 679714, 695290, 704997, 703720, 714871, 730530, 732521, 732544, 720386, 719721, 711151, 714443, 732997, 735529, 712709, 677224, 670840, 675993, 656901, 635020, 620926, 610596, 596949, 585909, 544842, 506632, 505110, 507158, 510913, 488850, 441302, 409050, 413667, 420471, 401528, 399088, 411725, 396330, 384632, 387365, 378574, 386677, 402532, 432621, 422232, 414910, 410411, 408629, 412768, 413271, 411010, 396047, 370780, 380921, 405147, 372229, 347152, 345619, 311779, 327575, 322661, 322835, 325124, 327400, 317578, 323108, 321905, 287968, 265569, 256398, 249380, 251536, 250746, 240110, 245812, 254486, 255642, 239062, 262770]
8569B62770K1817k618l0590L110j7498l7577R461l351K2730J7314O877J929l35
8556B54039j1658q726l879J123M422n006L626J199k2702l1606j2235J4167L6094
8543B18858K3273k46Q202J2480l611K4454K9702M280P091P018j1248j5076k5945
8530B79232l5020P311n91k3724J999J8345K551M761L1900L7734j7276j7699N622
8517B95145Q784l866k4544j3573J1852L7650K6052R000l3674j1283J4590M710
8505C20843j4110K0210j423m551l331P611K3502K7089L4465j6310j3256L927k4569
8492C60097j3471J9827L3577K426l3672j1169j9130J476j570r350K5972O126k7869
8479C33270j3958j5374L0114J7288J005k8234l6447l7820j0765L9694Q082K4789
$$ y = [262770, 284587, 281969, 251379, 254489, 236991, 199414, 208875, 205524, 228254, 245568, 252445, 254374, 254039, 242381, 233655, 229776, 230899, 235321, 230315, 233941, 235140, 212438, 180832, 168597, 182764, 218858, 242131, 241885, 250087, 262567, 258956, 283410, 313112, 317392, 324483, 331501, 320253, 305177, 279232, 244212, 251523, 250932, 227208, 229207, 247552, 250103, 254864, 286764, 324498, 307222, 289523, 295145, 303929, 300063, 275519, 261946, 273798, 311448, 337500, 346500, 312826, 301543, 316133, 320843, 306733, 326943, 325520, 320969, 317638, 325249, 348751, 375840, 410305, 393995, 380739, 384666, 360097, 346626, 366453, 400030, 402456, 368784, 357615, 338485, 339961, 338391, 329041, 355013, 361139, 333270, 319312, 303938, 334052, 351340, 352345, 324111, 287664, 249844, 239079, 278773, 286855, 311644]
8467C11644K7715p327M047K3516Q996K8607K9258J4299l941r317l202R415o784
8454D26926m0026j3854k802l5269Q28J2486j7849r349P050K119M420q050k2776
8441C03854K8P939j1331l2440r320K4380k1644m390L9963J399l1792j2934n35
8428B53177J9734j9820m155L0333M2805K9279k1441j3594k8552J8839l781o737
8416B96087k6709m473Q989m11l890M113J3044N931k9633k0780p287k0439k3980
8403A90562m781J5326J2305Q166J480j0146l1744l2629j8990q585M31O158J5221
8390A42774q513K728J5656j565P762J6957j5935r181R914J7838J2031K99J8034
8377B08799j2821j5137J4905p208m447Q760M424m1352l9125n955j4199J6409L564
$$ y = [311644, 339359, 332032, 336079, 359595, 368591, 397198, 426456, 440755, 436814, 427497, 424295, 433710, 426926, 386900, 373046, 370244, 334975, 335803, 348289, 330440, 321091, 328141, 330260, 334680, 326630, 303854, 303882, 311821, 300490, 268050, 258730, 283110, 261466, 257076, 297039, 298438, 266646, 253712, 253177, 272911, 253091, 248936, 279269, 322074, 351353, 329912, 316318, 287766, 306605, 302824, 296087, 269378, 264905, 273894, 273483, 269593, 273706, 286750, 292681, 263048, 242268, 234981, 214542, 190562, 185781, 201107, 213412, 221578, 223058, 212912, 181168, 148539, 129549, 120964, 121395, 127553, 142774, 134261, 136989, 152645, 151080, 158842, 175799, 159864, 150683, 160597, 178435, 190466, 190765, 208799, 195978, 180841, 195746, 188538, 184091, 192851, 197275, 155923, 116798, 110843, 96644, 113053, 116617]
8364A16617j88K609j9587N585l976L0919J6371k4423l6264j9232K845J3366k3510
8351F1132J9518K9030k549J5581J6418q368J4108K4116j8596j1739q354o458j6659
8338A07180j0263Q591J1216J5041j2540r95j7038j713K700j7289k247m359n611
8325G2673R378J3924N856n504j8721q180j4691J1433K6273M355O606n790k6730
8312G0882K0627K2433j6163k9363R776O030j4314j7802J4305L5402L0561K734
8300A35108n347R01k2415j2310M646Q675J2527J1420j8892j5916q835p768j3400
8287F8394J0355L582J0046J4891J9594p658k5287k7917n607k2787k5463O652K0408
8274C9203J6956J4583j851J8185n70O8J1695K636j5826m329O785J68J0528j6264
$$ y = [116617, 116429, 119038, 99451, 105036, 101060, 131979, 148350, 123927, 87663, 68431, 71276, 84642, 61132, 80650, 109680, 107131, 122712, 139130, 130762, 144870, 168986, 150390, 138651, 130297, 123839, 107180, 96917, 105508, 116724, 131765, 119225, 118230, 101192, 99479, 102179, 84890, 82643, 78284, 72673, 82051, 95975, 101831, 96327, 77606, 69426, 54735, 66168, 92441, 96796, 103402, 97612, 70882, 91509, 113942, 97779, 68416, 78192, 84222, 69908, 52106, 66411, 101813, 132374, 135108, 129761, 130662, 108247, 95937, 100583, 109258, 121785, 133205, 114313, 98397, 89562, 81794, 68394, 78749, 82331, 92377, 107268, 126862, 119204, 93917, 66000, 60393, 37606, 12143, 18795, 39203, 56159, 70742, 68891, 87076, 86506, 86574, 98269, 100905, 85079, 80750, 87535, 87703, 98231, 81967]
8260H1967l3160J4997q241Q384J9959J121j5712J4900r390p940Q159J5083j1916
8247G8211J938O57J6084k2165k5114k882J2213j3336m867J4227K5992J5038K695
8234I8691J0031R477J669K0797n206l1232k3044j0096J2427J0375j4637J8232
8222I7484r538j0676j9318j436j5820J5476J104Q931J3925n900K010r66N908j6889
8208F4295n239R645Q268m680l662R671j3002n200J0858J0468L1924j4468m144
8195I4734p859J4899K1160k1407j6308K251j7028l0721J6470J7912J001k2059
8183E3045m183q47k1565M886r975j6627L6120M062k423k501j5073J7693R712K8023
8169H0347O212j7538j8728q670j028L018N357k1727O956l281j4142p318O418r209
$$ y = [81967, 48807, 63804, 55563, 63947, 83906, 85027, 69315, 84215, 74825, 66885, 75044, 90127, 78211, 80149, 80806, 96890, 74725, 49611, 46729, 58942, 45606, 40739, 54966, 80958, 95996, 98691, 108722, 118199, 119868, 140665, 135459, 104227, 81183, 71087, 83514, 93889, 79252, 97484, 87946, 77270, 57952, 56516, 40696, 56172, 57276, 66207, 80132, 74232, 76242, 75276, 81184, 64295, 59056, 68701, 76969, 72289, 68627, 78298, 65296, 60096, 70954, 81422, 113346, 98878, 94734, 86875, 101774, 122934, 101527, 85219, 87470, 70442, 39721, 56191, 74103, 75104, 53045, 48862, 48015, 26450, 31336, 21361, 4734, 40854, 44916, 42493, 39992, 24919, 42612, 52324, 80347, 86559, 69021, 50293, 41623, 40595, 43613, 48970, 27243, 34199, 30918, 16776, 9458, 15876, 6667]
8155F667K3859J9655j25j658k9363k7023n110K4065K4693N991K2280J4082l9613
8142C8400j979N711k6045j233j4595J4471J7587Q329J2579k679R857J523K2730
8129H4656k500l3313n628K3317J3790J7941j5931k4035j2063L782M814L0904j7955
8116F7779k6479j9175j72R098K1785J8902j6222j2390o847k6437P053K1690K4452
8103F3037k4599k6756J6486O566J3267P345j0957L465o475K035J125K8703Q764
8090H2006m866l001p384K01n015j5273k9586J0383O188j6808K4623L5811J6637
8077I3916J0473Q338n052k500k3062l0369J8595j4346m4L090m155R870L390p476
8063F0668K225K127j1252m3252m1599K25K2185K7830M1654l0442k7107J114Q349
$$ y = [6667, 30526, 50181, 50056, 48398, 19035, -7988, -13098, 10967, 35660, 41651, 63931, 78013, 38400, 36421, 42132, 16087, 14854, 259, 14730, 32317, 40646, 53225, 50546, 60403, 61926, 84656, 82156, 48843, 43215, 66532, 80322, 98263, 82332, 58297, 46234, 50016, 54830, 85734, 67779, 41300, 22125, 21953, 31051, 52836, 71738, 55516, 43126, 36279, 9842, 16895, 38585, 63037, 38438, 11682, 28168, 34734, 48001, 55346, 44389, 47854, 41379, 43414, 44539, 73242, 82006, 77140, 74139, 66755, 66956, 61941, 46668, 17082, 27465, 33653, 16845, 41468, 77279, 93916, 104389, 112727, 107675, 105175, 82113, 51744, 70339, 55993, 55949, 59039, 54884, 64754, 68144, 60668, 62893, 65020, 53768, 10516, -31083, -30858, -8673, 19157, 60811, 30369, 3262, 4376, 12725]
8050A2725R349K0912j5559k3873J1588K8151L1389j3002k1919L696j5840j3039
8038A4578k458J8610J4020K1497O867j8543J7458j5623K818N757m942k7850K9
8025C2218K6946k2629k312j0205M103J3159J6631J7890q374j7877j9599P740J1413
8012D9104j791l784J1394K0787N847J2726K7m0487l598K8417P043r188J906M930
7998H3333k7018k7083l215J0324K0530m912j4446k0187J1775L3759q096j4478
7986D0286j122J53j7136J0624M2984K3065J231k618J0580K637J1849l320J243
7973A20456j190m9211k8694k054K3632J0054J4648j3219j1650Q706P057k7783
7961E0752r558J2263K1301O786J439j6685j1920m955q596k486J5878L8836J2221
$$ y = [12725, 22074, 42986, 27427, 3554, 15142, 43293, 74682, 61680, 39761, 43457, 27617, 14578, 12120, 30730, 44750, 66247, 73114, 54571, 72029, 56406, 59224, 64981, 60039, 32189, 32218, 59164, 36535, 34223, 24018, 28121, 41280, 57911, 75801, 67427, 49550, 29951, 37691, 49104, 47313, 43529, 54923, 75710, 81557, 94283, 94310, 53823, 50225, 78642, 85685, 76497, 78403, 83333, 56315, 29232, 26017, 36341, 56871, 51959, 37513, 17326, 29101, 62860, 54764, 40286, 39164, 39317, 22181, 32805, 75789, 98854, 100085, 97467, 108047, 110684, 122533, 119213, 120456, 119266, 70055, 41361, 39307, 62939, 72993, 87641, 74422, 62772, 71478, 78535, 50752, 41194, 53457, 74758, 81544, 82983, 66298, 54378, 49423, 40827, 38341, 54219, 93055, 105276]
7948A05276q316N518j1371k060J9983j6095j7445k147l848J395l702m4487m2394
7935a9693J5734l71k2657M3858M2304K4508M876J2490J7333k378n9649n990j1800
7922C8565J2095K1071J8216j0873j8923R795j6534J4461P952J301P294J0208J9137
7909A13765j0560m1577p359r426J5130L2866k6962m078L8633K0739j4359n0472
7897E6340l5869K26R792j0884N170j6035o676Q618P465R606K7579j6895j3414
7884B5023Q409j1017M722k5161j4794K5343n899l22Q154N712r822r946J9798O487
7870B6687J3664J8752J21k2728j87m173j0547L987K8900P181p793j3622j2500
7857B7742O78J5834j1477m499K5331q871m4605l460Q133L6752L0718k7605j9873
$$ y = [105276, 96960, 102478, 91107, 89047, 109030, 92935, 75490, 73343, 69495, 70890, 67188, 22701, -19693, -3959, -4330, -26987, 16871, 59175, 83683, 88559, 101049, 118382, 116004, 56355, 50365, 38565, 50660, 71731, 89947, 79074, 60151, 69946, 53412, 67873, 75825, 77126, 84420, 94628, 113765, 103205, 61628, 54269, 44843, 59973, 92839, 65877, 61799, 100432, 121171, 106812, 56340, 20471, 20697, 30489, 19605, 24775, 8740, 2064, 10682, 18147, 27753, 55332, 38437, 25023, 33432, 22415, 27137, 1976, -12818, 12525, 6626, 6304, 14458, 20170, 10348, 402, 20200, 26687, 40351, 59103, 59224, 36496, 36309, 32136, 21589, 25576, 54476, 61657, 53864, 40242, 27742, 28420, 44254, 32777, 28278, 53609, 44738, 133, -3327, 4806, 41558, 72276, 44671, 24798]
7844B4798j3414N771K1870J8224K408q800j3984j1529K0553J8823K104L041J2826
7831H2691k4869l9710J140K0368j3637q727j598k9707M712J8481J1427K0695j6349
7818B4917k1940j783k9848k427L5600r379k1841m749J0138o892J1158L3935J1301
7805B8190K8093O003P375j5879l9958j832j2126O800j1766o471J91R554L1688
7792B9862j0301J4565L4660m627r159k2385k9J9942R156j1105k3625k9071j2718
7779a4835L1162L5697M427k7516j3548k9948k418L5263K6977j5687p864j9783
7767A927J4266M958o995P186j4812l1685l929K720K1381O736n229m809n217L4403
7753B0901J9205J5900J322k6630j9323l260J5798K633q132k4820k1966K9392K8206
$$ y = [24798, 11384, 17155, 39025, 57249, 59657, 50857, 36873, 25344, 45897, 64720, 66824, 69865, 82691, 57822, 18112, 19252, 39620, 25983, 17256, 15658, -14049, -9337, 9144, 20571, 41266, 24917, 2977, 1194, -28654, -31081, 4519, -4860, -26701, -31450, -21312, -28204, -17046, 16889, 28190, 56283, 62286, 69661, 53782, 13824, 11992, -134, 6666, -5100, -11571, -11380, -1826, 29862, 19561, 34126, 68786, 64159, 55000, 32615, 32586, 52528, 61684, 50579, 26954, -2117, -14835, 16327, 52024, 56451, 28935, 15387, -14561, -16979, 18284, 45261, 29574, 21710, 1927, 16193, 21151, 14156, 21342, 6530, -25155, -29084, -26364, -4983, 1753, -3476, -8285, -13502, 20901, 40106, 56006, 57328, 30698, 11375, 8115, 23913, 26546, 18414, -6406, -28372, 1020, 29226]
7740B9226K7667K201j3984r864O049n173m986q643j9015q39P786O219n82n153
7726A0909K934J9010R520k930q567j0042P378n136j9131K0536J348j0667j1301
7713C861o535k81K6953K232q68K476O077j0918j3446J3901k889j7900j9970k3321
7699d0628J2091K0025m741M378O899M41K7977J9104j727o198l2795J3889K7379
7686D6094l6483k0302J4789l0910P350o214q753J6597K4596J821J5207j644m070
7673A8078M154j3682j7733J8794L3719k8377R30k557J258j182j6277O553L5332
7660C9010M903J0749l203l6539q391r857K8258M197j7309J469J0718o439r504
7647H062l1368j458q674j2770M6013J4624K359j1786l352o994J8923j566k963
$$ y = [29226, 56893, 59094, 45110, 35246, 41295, 36122, 31136, 22493, 3478, 2639, 10425, 16644, 16062, 10909, 13843, 32853, 42373, 39443, 30876, 20834, 28212, 23076, 3945, 24481, 25829, 15162, 3861, -2674, -2955, 23998, 26230, 25362, 27838, 33915, 22997, 9551, 23452, 20563, 2663, -17307, -40628, -28537, -8512, -13253, -8875, -1976, -1535, 26442, 45546, 43819, 37621, 4826, 18715, 46094, 9611, -10691, 4098, -26812, -19462, -25676, -34429, -17832, 6764, 8585, 23792, 22148, 18078, 22232, 8550, -9183, 9611, 43330, 14953, 15883, 13326, 14584, 13402, -2875, 3678, 39010, 43913, 54662, 51459, 14920, 6529, -3328, 24930, 29127, 11818, 13287, 24005, 17566, 8062, -23306, -24764, -33438, -46208, -195, 14429, 16788, 5002, 1650, -5344, 13579, 12013, 9050]
7634I050J4129q55m0650K4750L2483P640k2118l4893k3660N368J5603L6148n013
7621A7982j580N491m522J3100j9250j4928O616M1567L7535j6971J0211k117k9796
7608D3338j778n14J7755n63j5158n240J2777K4353k1607L500j0640j4970k558
7595B8695j0825j1398K5146J3132j2344j7331j6753j0637J1319J2908l3620N506
7583a6202J0136J6753J8365K3175m24n317K514J1483N39j5133j3272j3756K482
7570B1343K8822j4426o753l122J8670j1389k3975L350O858K7364L5329J5588k213
7557I5446l3630n3341N325K1751q695p061k478j3574L01J2573L209p909R078n419
7543A5576q467k3352J2920J0796J7560R403m024k7369j5382L4855R762r638K119
$$ y = [9050, 23179, 22324, -18326, 6424, 38907, 46547, 24429, -10464, -34124, -28756, -13153, 22995, 17982, 16402, 21893, 17371, 30471, 11221, -3707, 2909, 44476, 82011, 65040, 75251, 73134, 43338, 41560, 41046, 58801, 58238, 43080, 37840, 50617, 74970, 53363, 56863, 46223, 31253, 28695, 17870, 6472, 31618, 44750, 32406, 15075, -1678, -12315, -996, 11912, -21708, -16202, -6066, 10687, 29052, 52227, 51803, 46486, 49000, 60483, 61022, 45889, 32617, 18861, 21343, 50165, 35739, 28986, 25864, 44534, 33145, 9170, 12520, 19378, 46742, 82071, 97659, 95446, 61816, 8475, 13800, 35551, 26856, 19795, 17317, 3743, 4044, 16617, 19826, 11917, 20995, 15576, 7109, -16243, -3323, 7473, 25033, 34436, 30412, 3043, -12339, 22516, 32278, 22640, 24759]
7530B4759k2028j4900L6376J5380q430L368k6511k215J4689r110n021J5819N143
7517B7319j5090Q876M0715k1469j9981k6766k291l110J3203J1203n333N125K2223
7504C4624j0443j3489J301Q430l3823k7823M7719K5373n515J078r507j7904L723
7491C744L078j8201k0608J5126K6417K076m129p434n584J3812K3851J882n808
7478B8222k8835J9132K0545j561r6J370M297P98Q05k2632k1846l4648k4709J731
7464e7427L3688J6151o80M090L6785K1194l6983j7946j919j9740J0129L9125R396
7451C5863j6216l666k2291j9500K8029o467j9473K0168K6250J0676l1774P939
7439I538Q584j7347n189k645J607l176l023J3467J7884Q466R265j0797O714l20
$$ y = [24759, 2731, -12169, 24207, 39587, 31157, 34525, 8014, 5799, 20488, 11378, 6357, 22176, 27319, 12229, 21105, 61820, 40351, 20370, -6396, -8687, -11797, 1406, 12609, 7276, 12401, 34624, 24181, 10692, 11993, 20423, -13400, -41223, 6496, 31869, 26354, 27432, 17925, 21, 3744, 6822, -11379, -31987, -16861, 9556, 11632, 7503, 69, -5515, 8297, 32148, 34030, 28222, -613, 18519, 39064, 37503, 37407, 38777, 43074, 43872, 44677, 22045, 199, -34449, -59158, -57427, -23739, -7588, -8268, -4178, 32607, 53801, 16818, -1128, -3047, -22787, -12658, 26467, 35863, 19647, 15981, -6310, -25810, 2219, -4248, -23721, -3553, 22697, 33373, 1599, 9538, 18122, 775, -4414, -7059, -5452, -8628, -11651, 1816, 19700, 28166, 37431, 26634, 33348, 33028]
7425C3028n940o808J8128Q509q892K0467j977q801k3715j3316k35L49j4309R18
7411b594j7119j7016J9933K9518L3089k9781j5215J3729K392K2009R743j7018
7399C1670j4425O029o283P369K0529R581o767k2393j9731o849J8961p291p796
7386B604k9619J0509N192K7792j819j7888k1382K141K5486m819N749J8462L0867
7373E3275K8342j2469j4093j9726j3032L3890J4904l949j4088l4840p332J3994
7361B4876K283N473q620J1701N321j0203j3175J5442q566k3081n007r58J9522
7348A5008J9216L2546P338p551j4972l4649j3597M619o159K8415O908K0658j3238
7335D4542k0521j3594o679p186Q052O386j5536Q278K3909L3282N9m0003R082K0298
$$ y = [33028, 27088, 20280, 38408, 46917, 38025, 58492, 56515, 47714, 23999, 10683, 10448, 10797, -3512, -2594, -19713, -36729, -16796, 12722, 45811, 16030, 815, 14544, 16936, 38945, 48688, 31670, 17245, 23274, 16991, 24360, 44889, 54470, 47703, 25310, 5579, -1270, 17691, 10400, 2604, -27015, -16506, -11314, 16478, 14659, -3229, -24611, -22470, 3016, -1803, 3946, 22408, 53275, 81617, 69148, 55055, 35329, 22297, 56187, 71091, 67142, 53054, 18214, 10882, 24876, 27159, 32632, 24012, 35713, 41034, 30831, 17656, 33098, 24532, 1451, -3556, -4514, 15008, 34224, 66770, 74108, 66557, 51585, 16936, 3339, 7958, 1799, 30214, 37122, 57780, 44542, 24021, 10427, 3748, -3438, 4614, 11000, -4536, 3742, 27651, 60933, 60992, 20989, 30071, 50369]
7321E0369o05P530m196j3088j3474l382k0754j3904O481l91J3824Q328L303k2745
7307b704j5114J1269J8976j3906p792lP665L3476O826j5642p534j4893J7254j129
7293A6749J74o936J428J7379N209j8459k2574k4656J5567P421j8114O122M856
7280a5834K1819J9005J8238R92k5815k2184O565l960j786J9808m945k3418q546
7267b0061j4040O750O265L056J2958j145r414L0272K0652k1129j9792j692P655
7254C35N654L4376R875J3427J299J1431Q554m1377l5161k6321L027P49j1075m752
7240b9959J6520L58j5214M644J2571K5463J7075p390m4803p338L8267J5886k3044
7227C036l4922j7365M2249K5913K0117L3181m5538l518J8467k9242j9909K1009
$$ y = [50369, 49764, 57294, 53098, 40010, 26536, 23154, 2400, -11504, -5023, -5414, 8410, 16738, 20041, -2704, -17818, -6549, 12427, -1479, -9271, -9274, -1609, 31867, 38693, 23051, 15517, 624, 17878, 16749, 16923, 9987, 11415, 28794, 34003, 15544, -7030, -31686, -16119, -8698, -26812, -20690, -15834, 5985, 24990, 43228, 44220, 18405, -3779, 2786, -1174, -2960, 16848, 11903, -11515, -20061, -34101, -27351, -21086, -18030, -5072, -6217, -15631, 14641, 35293, 14164, -5628, -7320, 335, 5989, 40365, 50240, 63667, 64966, 76397, 84951, 43574, 8413, -17908, -14881, -14132, -25207, -29959, -13439, -13081, -28295, -23651, -11080, 14383, 31458, 24068, -20735, -28073, 10194, 26080, 3036, -31886, -49251, -7002, 18911, 39028, 72209, 26671, 23153, 41620, 12378, -7531, 13478]
7215A3478L6234p299k6902j843J7241J8173k8239k1882o492j369J6329J5940O643
7202C0012P505q778p462P212J8099k6553k6720k1668N979K93j3294L2099K8653
7189B5377J6916j0030l5356J1614N553p119M282j1446m667R405O006K265j4575
7176a775K6575L0347k6935l9010J225J411J4985j1492J594k4859J032J912R072
7163a5918k0895J966M0661J7168J8351K450o631j419J1851o388R880k7686l0245
7150f855k97n95M0778K0542P978Q995K1293q695m1115k8363J0775J2729K2548
7137E9718q1k831K398l3902j5495k1193J5582K5921J6443n499j1106J292o898
7124B4349J7402p854J5923j937l25J483k0670L854K7820j3916k4329L795O210
$$ y = [13478, 49712, 42413, 15511, 13668, 30909, 49082, 20843, -1039, -7531, -8900, 7429, 23369, 30012, 37517, 28739, 21277, 28489, 46588, 20035, -6685, -28353, -22374, -22081, -35375, -3276, 25377, 42293, 32263, -3093, 8521, 14074, 6955, 11237, -209, -4876, 4529, 10535, 12800, -1775, 24800, 55147, 28212, -10798, -9573, -8162, 6823, -4669, -3075, -27934, -26902, -24990, -15918, -36813, -34847, 5814, 22982, 41333, 43783, 37152, 35733, 47584, 41196, 51076, 23390, -6855, -7152, -7747, 33031, 53573, 61551, 70546, 91839, 83144, 42029, 13666, 24441, 37170, 59718, 59637, 56806, 59204, 25302, 9807, -11386, 4196, 30117, 46560, 41061, 29955, 31247, 24349, 41751, 33897, 49820, 47883, 47558, 49041, 28371, 32225, 60045, 46129, 21800, 25595, 31805]
7111C1805p031k2224n470q827j450j894j0318j758N472j3593K4381J0445J3812
7098A3350M016p817m859K9106J0208m015l3339j693J9039j8615j7804J894m360
7085a4889M35k081q254L7001K1763l7912k4240J8505L5296n261n047J5059r861
7072B0514N547J20l9732k0255J4306J9751K8031J628j1278l0985o030j2960J8150
7059a3193j8730r2K2397K0240j8477o563J2522O174K1862l874K7100M807j4170
7046D0003k2306l4553j439K7372J0787J2349L8717o497k6163k6542J798r013N300
7033I813J4136N582j492J650M4571J4549n3611m1642K049P439N22o936l4160K2642
7019a4888Q966j0061k0560J6105K3315J2139j0615j999K0756J9207P620o249j7206
$$ y = [31805, 24774, 2550, -2920, -11747, -13197, -15091, -25409, -27167, -21695, -35288, -10907, -462, 13350, 17366, 9549, 4690, 33796, 44004, 39989, 6650, 4957, 23996, 5381, -12423, -10529, -14889, -14454, -16535, -24789, 12212, 33975, -3937, -28177, -9672, 25624, 20363, 15316, 30375, 20514, 26061, 26181, -13551, -33806, -19500, 251, 28282, 29910, 18632, -12353, -18383, -31343, -13193, -31923, -32015, -9618, 10622, -7855, -14418, -1896, 4278, 26140, 22266, 49366, 54173, 40003, 17697, -16856, -18295, 9077, 19864, 32213, 70930, 64433, 38270, 11728, 13526, 4513, 9813, 23949, 29531, 28039, 29689, 74260, 88809, 35198, -6444, -4395, 3044, 3566, -3370, -37530, -14888, -5922, -15983, -36543, -20438, 2877, 15016, 4401, 2402, 23158, 42365, 49985, 43736, 26530]
7006B6530J6318k688n0239j1159j905r726j0265K3381M903j880k2035K1869M2675
6993B5779k6312l4368Q475J7267K6252J9884j1933j5073L431K1160K1985j2164
6981D4383j6313l2877j1470M106K239R444L432j745P406Q490r289m5065r378K9834
6967a6803L0270O567J0477M747k9361J2719j1420m3217j5611K1712K1140K8046
6955A9266n732J9919J010k0811k5521j4196R472L846K5275J4479J7459Q296j1429
6942D1333M73k3193j294r022o780r740j308P224l494J5296l777o293J1752J6124
6928B7301l759K954j4949J4057K8996N253k0339l7105J708K8519L508k4376K0672
6915C2440K6164k7228j8037p73n104k0406K3949L0065P003j0622J2664K205K773
$$ y = [26530, 42848, 40160, -10079, -21238, -23143, -32869, -43134, -19753, -14850, -16730, -38765, -16896, 25779, -533, -34901, -26426, -9159, 17093, 36977, 25044, 9971, 13402, 34562, 56547, 44383, 28070, -4807, -16277, -12171, -9932, -488, 2944, 1199, 8605, 17095, 7806, -37259, -46637, -16803, 13467, 20034, 30511, 35258, 5897, 18616, 7196, -36021, -51632, -29920, -8780, 19266, 13534, 33453, 34463, 13652, -11869, -26065, -16593, -12747, 12528, 27007, 44466, 52762, 41333, 41806, 18613, 17319, 8297, 1517, -8223, -9531, -2307, -5801, 9495, 5718, -575, 11177, 27301, 23542, 26496, 11547, 25604, 54600, 59853, 39514, 2409, 4117, 32636, 36144, 11768, 32440, 58604, 31376, 13339, 12566, 7462, -12944, 11005, 41070, 48073, 37451, 50115, 52320, 55093]
6902E5093J2090P213o741l9209k6439J5596N355n783L472L794K5098P353k0157
6889C6735m5176l895N985n100J3509j1354J4315K8984m249j5238l387j4225L3947
6876C0851K5393k7695j7490l458k833J1827k9039l563J0803j3162m36L1931o789
6863F340M827j1874L470m997j6108p565J6881q07k4695j8708J5700J937J3246
6850b2353J4830J724P338M008j1025p354K949m728P340J1190n995j5634N901N499
6836f310l504J1341L160R089m369J574k8978q712L4270k347r060J6285J8798k1857
6822I380j6028K293J4972K0970o210j4861J6748N913K4829l3268k7686K2019J4822
6809C3893L380O11J1478n004m3647p626J1185L1042k528P928J6629l1823k8235
$$ y = [55093, 67183, 74396, 67655, 28446, 2007, 17603, 22958, 17175, 20647, 24441, 49539, 56892, 36735, -8441, -12336, -6351, -11451, 2058, -9296, 5019, 34003, 29754, 14516, 11129, -3096, 30851, 56244, 28549, 11059, 7601, 4768, 16595, -12444, -16007, -5204, -18366, -18802, 13129, 6340, 11167, -707, 2763, -2234, -18342, -25907, -9026, -9833, -34528, -53236, -37536, -35599, -22353, -7523, -5799, 1539, 5547, -5478, -12832, -9883, -14611, -7271, 3919, -2076, -17710, -11809, -6310, -9814, 1527, 4687, 13776, 9407, 10981, -17997, -26709, 7561, 5214, -3846, 12439, 31237, 9380, -6648, -4355, 10617, 31587, 25377, 10516, 27264, 33177, 58006, 24738, -2948, 19071, 33893, 37273, 37884, 49362, 44358, 711, -6915, 4270, 35312, 32784, 40712, 57341, 25518, -2717]
6796b717o025l229R67K7014n32N620q251m988n828o198J4045j5900m7023J5308
6782c7737M1452K4766k4115j0403q329Q038O257n605m5168k0156K4996P063J1563
6769b7378K1461n825n554Q369L699n455R784K2677J6269q504q618K039J3115j6419
6755A9660l1827j897J4685k569j8867k55M5172J9890j4024p382j1553R985k186
6742A8832J1827J1342K025j2920O088P00Q263l548O232k223l2769J1071J4125
6729C9045k6048l0867m410P908J5984j2401n496m873k2391J2439J9424P131L5556
6716C1001j687l1388k4683K8405K0124j4474k334N589n786k0466j7948M285K7057
6703b305J7916N064k380O79p213l271J6245K1867j5218p598r144Q762K3539l4246
$$ y = [-2717, -8742, -11971, -11004, 16010, 15478, 21098, 12847, 7859, 2031, -4167, 9878, -6022, -53045, -37737, 3715, 28481, 4366, -6037, -14366, -6328, -71, -5676, -50844, -71000, -46004, -38941, -27378, -5917, -11742, -17296, -8927, -5228, -10683, -899, 21778, 38047, 29543, 20925, 22964, 36079, 19660, -12167, -14064, 621, -1948, -20815, -21070, 24102, 43992, 29968, 22586, 11033, 21018, 18832, 30659, 42001, 44026, 31106, 37194, 37894, 46157, 42609, 48841, 46618, 13849, 24920, 39045, 12997, -17870, -22280, -14372, 1612, -10789, -16285, -21158, -43549, -31110, -11686, -4555, 31001, 29314, -2074, -26757, 1648, 21772, 7298, 4964, 10553, 4767, -15699, -33647, -29362, -2305, 15611, 20675, 18295, 18974, 11761, 8490, 24735, 46602, 31384, 23786, 14642, 23404, 46943, 12697]
6689A2697k9711j7146M291J9465L5914K2476j0757j461J5948N30Q151l1285l1098
6676a986J3065j4174j3038J7882L0596j7562j9447j6683j1558J1545L566J9214
6664A420J2260L849q081j6259k8712J0589M645k425J8532N033J5125j0525K211
6651G662j9826l750J350k3182r07J8409L719J2619J9563K606l2718r773J1136
6638a3092j679M019O338K5886L539N97J4039n716o524k8877j5889j2564P7J8181
6624a1665j2051k4245J278K7848N226J2409J0988P182k1638J334j2O116M704K8816
6610C6290r901m3375J2575j0514j343K40o974j7936L997J1638J1670o901L677
6597a6857K0616Q652K79K0133P311k5016j4334j3874k3293Q241j623o98L8160
$$ y = [12697, -17014, -34160, -29869, -10404, 25510, 47986, 37229, 35768, 51716, 52246, 60397, 29112, -1986, 11079, -3095, -16133, 1749, 32345, 14783, -4664, -21347, -32905, -21360, -17794, 1420, 13680, 17529, 9448, -6811, -35523, -24934, -20289, -22714, -4182, 851, 15976, 5451, 7662, -12164, -15914, -14564, -37746, -38653, -20244, -16525, -3906, 15657, 18263, -14455, -24228, -13092, -14771, -10752, -4414, 21472, 25011, 25608, 39647, 33931, 27407, -1470, -17359, -29923, -29846, -11665, -23716, -47961, -46683, -18835, -13609, -1200, 9788, 16970, -4668, -3334, -3346, 2770, 7474, 36290, 26389, -16986, -4411, -14925, -16268, -16028, -23002, -40938, -36941, -25303, -13633, -20534, -16857, 3759, 12411, 12690, 32823, 40134, 15118, 784, -13090, -36383, -28142, -29765, -30463, 7697]
6584G697K5011n0902m153J4854J2081N375n900J3318K7988j8036l6684j8036j0509
6571c7896K6173L1501J9448m545Q820k3788l0053k4875j2886K7160L4362j0954
6559B467q288O040j4498l7291p869K9044K0954p507J473K116l096k1657K837m693
6545c9968M04J3841J6149j752l0377o196M346K0464j5026J0292K8578p408j0796
6532a7449j3741L911K4613J3708j6228j0380p213N378J0946J0918J5444l738j620
6519A4549M659k0509k4398J1644j2987J6260R64k9770J0882K2974O242r928P796
6506a622j1186J0564j3883J5357L530L550J3625j6118m0057q46j0686K077L0354
6493a5341L6718j4219j3732J4642L4533L5754k008n5960m7471M582k4355l237
$$ y = [7697, 32708, -18194, -22347, -7493, 4588, 9963, 4063, 17381, 45369, 27333, -9351, -27387, -37896, -11723, 19778, 39226, 34681, 43501, 19713, -10340, -35215, -48101, -20941, 13421, 2467, -5821, 219, -14279, -51570, -59439, -30395, -9441, -16948, -15475, -13359, -16455, -38112, -35275, -39968, -39564, -25723, -9574, -11326, -41703, -47899, -43553, -23089, -38115, -27823, 755, -6653, -17449, -31190, -27279, -2666, 11042, -5186, -15566, -22779, -17401, -6455, 4463, 19907, 16169, 14549, 19208, -1301, -25699, -14055, -27042, -10782, -9818, -39588, -28706, -5732, 510, -9418, -1622, -12808, -2244, -16127, -770, 2760, 6310, 19935, 3817, -36240, -37086, -47772, -45695, -15341, 21377, 7158, -6574, 8068, 42601, 78355, 76347, 20387, -27084, -22502, -46857, -50094]
6481e0094L5398K5488o650K1305J0543j3678l1278J0172J156n483j2782m725o819
6468b7447J7485J1737J0493Q598K8557j5293P25L0864l515L327k6579j5602j6373
6455F977R643K14L174J3685j9159k1722l866L661K0873r497Q411q831k2808K0856
6441A611J3641l8734L951l546j0866L2397J1444Q482j8780j0460K0139j0588K5065
6428B3756J437M265k1176k1439m779k295K2742K1794l9083r559J60k3900j4156
6415f2233N836J6587J9202N161j7094j0905Q498O088K294K4525K8421p828L353
6402B1905k7588N235J2320j537j0279k368q475j0065K559O419k0536J319o25R535
6388b2181L074p877O22R925L874J1726J8026l3409j8190O400K8371J1131r957
$$ y = [-50094, -14696, 10792, 4142, 25447, 35990, 22312, -8966, 1206, 2362, -3121, -15903, -20628, -27447, -9962, 1775, 12268, 20866, 49423, 34130, 34855, 65719, 62204, 65531, 38952, 23350, 6977, 16620, 16834, 20008, 33693, 14534, -7188, -11054, -7393, 13480, 3983, 12394, 3563, -19245, 1611, 15252, -23482, -19531, -23077, -33943, -1546, 9898, 18380, -400, -10860, 9279, -1309, 23756, 25193, 29458, 8282, -13157, -17936, -20231, 2511, 24305, -14778, -24337, -24177, -48077, -62233, -56397, -39810, -20608, -15447, -32541, -43446, -34948, -28860, -26566, -2041, 26380, 18552, 21905, -5683, -448, 11872, 10335, 56, -2312, -10787, -20852, -18293, -11874, -32410, -31091, -31716, -22181, -19107, -26984, -26362, -16437, -12563, -837, 17189, -16220, -34410, -28010, 361, 11492, 1535]
6375A535j3211N437O097J3527J1970q146L343j4507m057K2756j4518k0874l81
6362a1029n177m259m362J0645M723n830n014l0415P060J7505L0642L851R481k1272
$$ y = [1535, -11676, -6239, -142, 13385, 25355, 17209, 20552, 6045, 1988, 24744, 10226, -10648, -11029, -16206, -20465, -24827, -14182, -9459, -15289, -20303, -50718, -43658, -26153, 4489, 8340, 17821, -3451]
$$ [...]
##END NTUPLES=NMR SPECTRUM
##END=
