##TITLE=Analysis number 314878
Compound Code cc 45511
Book Reference 382/132
Project Code adrs
Chemist Name simons
##JCAMPDX= 6.0         $$ Bruker NMR JCAMP-DX V2.0
##DATA TYPE= NMR SPECTRUM
##DATA CLASS= NTUPLES
##ORIGIN= Bruker BioSpin GmbH
##OWNER= NMR
$$ XWIN-NMR		Version 3.5
$$ Fri Oct 28 12:27:23 2005 GMT Daylight Time (UT+1h)  MAYBRIDGE\NMR@NMR_250MHZ
##.OBSERVE FREQUENCY= 250.131544655141
##.OBSERVE NUCLEUS= ^1H
##.ACQUISITION MODE= SIMULTANEOUS (DQD)
##.ACQUISITION SCHEME= undefined
##.AVERAGES= 16
##.DIGITISER RES= 18
##SPECTROMETER/DATA SYSTEM= dpx250
##.PULSE SEQUENCE= zg30
##.SOLVENT NAME= CDCl3
##.SHIFT REFERENCE= (INTERNAL, CDCl3, 0, 16.4294)
##AUDIT TRAIL= $$ (NUMBER, WHEN, WHO, WHERE, WHAT)
$$ ##TITLE= Audit trail, XWIN-NMR		Version 3.5
$$ ##JCAMPDX= 5.01
$$ ##ORIGIN= Bruker BioSpin GmbH
$$ ##OWNER= NMR
$$ C:\u/data/dgb/nmr/ADRS/11560/pdata/1/auditp.txt
$$ ##AUDIT TRAIL=  $$ (NUMBER, WHEN, WHO, WHERE, WHAT)
(   1,<2005-10-28 12:26:57.00 +100>,<MAYBRIDGE\NMR>,<NMR_250MHZ>,
      <created by zg, POWCHK disabled, PULCHK disabled
       configuration hash MD5:
       62 19 C7 07 E1 42 D1 B7 37 6C 3D D0 77 39 F9 E6
       data hash MD5: 64K
       72 A7 A7 9C 57 DD 9E 51 8E EB 10 28 BD DA A8 AD>)
(   2,<2005-10-28 12:27:15.88 +100>,<MAYBRIDGE\NMR>,<NMR_250MHZ>,
      <Start of raw data processing
       ef LB = 0.3 FT_mod = 6 PKNL = 1 SI = 32K 
       data hash MD5: 32K
       5D 5D B5 2C B6 CC 5D 04 D2 C8 9A BE 74 49 C7 B2>)
(   3,<2005-10-28 12:27:18.32 +100>,<MAYBRIDGE\NMR>,<NMR_250MHZ>,
      <apk 
       data hash MD5: 32K
       A3 BF 0A 20 22 4D 31 8D 66 FD 29 EE CB C1 99 83>)
(   4,<2005-10-28 12:27:19.14 +100>,<MAYBRIDGE\NMR>,<NMR_250MHZ>,
      <abs ABSG = 5 
       data hash MD5: 32K
       FA 3B 76 02 0E E3 9D 73 02 55 F1 5B C2 B6 B9 BA>)
$$ ##END=
$$ 
$$ hash MD5
$$ D3 D8 81 A2 36 6B BE F2 AC C0 53 89 50 B2 99 F5
##$RELAX= 
##$RELAX= 
##$RELAX= 
##$RELAX= 
##$RELAX= 
##$RELAX= 
##$RELAX= 
$$ Bruker specific parameters
$$ --------------------------
##$DU= <C:\u>
##$EXPNO= 11560
##$NAME= <ADRS>
##$PROCNO= 1
##$TYPE= <nmr>
##$USER= <dgb>
##$AMP= (0..31)
100 100 100 100 100 100 100 100 100 100 100 100 100 100 100 100 100 100 
100 100 100 100 100 100 100 100 100 100 100 100 100 100 
##$AQSEQ= 0
##$AQ_mod= 3
##$AUNM= <au_zg>
##$AUTOPOS= <22 >
##$BF1= 250.13
##$BF2= 250.13
##$BF3= 250.13
##$BF4= 250.13
##$BF5= 500.13
##$BF6= 500.13
##$BF7= 500.13
##$BF8= 500.13
##$BYTORDA= 1
##$CFDGTYP= 0
##$CFRGTYP= 5
##$CHEMSTR= <none>
##$CNST= (0..31)
1 1 145 1 1 1 1 1 1 1 1 1 1 1 1 1 1 1 1 1 1 1 1 1 1 1 1 1 1 1 1 1 
##$CPDPRG= <>
##$CPDPRG1= <>
##$CPDPRG2= <>
##$CPDPRG3= <>
##$CPDPRG4= <mlev>
##$CPDPRG5= <mlev>
##$CPDPRG6= <mlev>
##$CPDPRG7= <mlev>
##$CPDPRG8= <mlev>
##$CPDPRGB= <>
##$CPDPRGT= <>
##$D= (0..31)
0 1 0 0 0 0 0 0 0 0.06 0 0 0 0 0 0 0.0002 0 0 0 0 0 0 0 0 0 0 0 0 0 0 
0 
##$DATE= 1130498816
##$DBL= (0..7)
120 120 120 120 120 120 120 120 
##$DBP= (0..7)
150 150 150 150 150 150 150 150 
##$DBP07= 0
##$DBPNAM0= <>
##$DBPNAM1= <>
$$ [...]
##$SUBNAM7= <"">
##$SUBNAM8= <"">
##$SUBNAM9= <"">
##$SW= 20.6930455092707
##$SWIBOX= (0..15)
0 0 3 0 0 0 0 0 0 0 0 0 0 0 0 0 
##$SW_h= 5175.983436853
##$TD= 65536
##$TD0= 1
##$TE= 295.16
##$TE2= 300
##$TE3= 300
##$TEG= 300
##$TL= (0..7)
0 120 120 120 120 120 120 120 
##$TP= (0..7)
150 150 150 150 150 150 150 150 
##$TP07= 0
##$TPNAME0= <>
##$TPNAME1= <>
##$TPNAME2= <>
##$TPNAME3= <>
##$TPNAME4= <>
##$TPNAME5= <>
##$TPNAME6= <>
##$TPNAME7= <>
##$TPOAL= (0..7)
0.5 0.5 0.5 0.5 0.5 0.5 0.5 0.5 
##$TPOFFS= (0..7)
0 0 0 0 0 0 0 0 
##$TUNHIN= 0
##$TUNHOUT= 0
##$TUNXOUT= 0
##$USERA1= <user>
##$USERA2= <user>
##$USERA3= <user>
##$USERA4= <user>
##$USERA5= <user>
##$V9= 5
##$VALIST= <valist>
##$VCLIST= <CCCCCCCCCCCCCCC>
##$VD= 0
##$VDLIST= <DDDDDDDDDDDDDDD>
##$VPLIST= <PPPPPPPPPPPPPPP>
##$VTLIST= <TTTTTTTTTTTTTTT>
##$WBST= 1024
##$WBSW= 4
##$XGAIN= (0..3)
0 0 0 0 
##$XL= 0
##$YL= 0
##$YMAX_a= 463465
##$YMIN_a= -668271
##$ZGOPTNS= <>
##$ZL1= 120
##$ZL2= 120
##$ZL3= 120
##$ZL4= 120
##$ABSF1= 16.42941
##$ABSF2= -4.26376
##$ABSG= 5
##$ABSL= 3
##$ALPHA= 0
##$AQORDER= 0
##$ASSFAC= 0
##$ASSFACI= 0
##$ASSFACX= 0
##$ASSWID= 0
##$AUNMP= <proc_1d>
##$AZFE= 0.1
##$AZFW= 0.1
##$BCFW= 0
##$BC_mod= 0
##$BYTORDP= 0
##$COROFFS= 0
##$CY= 12.5
##$DATMOD= 1
##$DC= 0
##$DFILT= <>
##$DTYPP= 0
##$F1P= 14.0000005364418
##$F2P= -0.99999901652339
##$FCOR= 0.5
##$FTSIZE= 32768
##$FT_mod= 6
##$GAMMA= 0
##$GB= 0
##$INTBC= 1
##$INTSCL= 1
##$ISEN= 128
##$LB= 0.3
##$LEV0= 0
##$LPBIN= 0
##$MAXI= 10000
##$MC2= 0
##$MEAN= 0
##$ME_mod= 0
##$MI= 0
##$NCOEF= 0
##$NC_proc= -4
##$NLEV= 6
##$NOISF1= 0
##$NOISF2= 0
##$NSP= 0
##$NTH_PI= 0
##$NZP= 0
##$OFFSET= 16.42941
##$PC= 1
##$PHC0= -78.21075
##$PHC1= 4.631863
##$PH_mod= 1
##$PKNL= yes
##$PPARMOD= 0
##$PSCAL= 4
##$PSIGN= 0
##$REVERSE= no
##$SF= 250.130023158543
##$SI= 32768
##$SIGF1= 0
##$SIGF2= 0
##$SINO= 400
##$SIOLD= 32768
##$SREGLST= <1H.CDCl3>
##$SSB= 0
##$STSI= 32768
##$STSR= 0
##$SW_p= 5175.98343685301
##$SYMM= 0
##$S_DEV= 0
##$TDeff= 65536
##$TDoff= 0
##$TI= <Analysis number 999999
Compound Code 99
Book Reference 9
Project Code 9>
##$TILT= no
##$TM1= 0
##$TM2= 0
##$TOPLEV= 0
##$USERP1= <user>
##$USERP2= <user>
##$USERP3= <user>
##$USERP4= <user>
##$USERP5= <user>
##$WDW= 1
##$XDIM= 32768
##$YMAX_p= 361137658
##$YMIN_p= -49129
$$ End of Bruker specific parameters
$$ ---------------------------------
##NTUPLES= NMR SPECTRUM
##VAR_NAME=  FREQUENCY,     SPECTRUM/REAL,   SPECTRUM/IMAG
##SYMBOL=    X,             R,               I
##VAR_TYPE=  INDEPENDENT,   DEPENDENT,       DEPENDENT
##VAR_FORM=  AFFN,          ASDF,            ASDF
##VAR_DIM=   32768,         32768,           32768
##UNITS=     HZ,            ARBITRARY UNITS, ARBITRARY UNITS
##FACTOR=    0.157963299565203, 1,           1
##FIRST=     4109.48893751476, 0,            0
##LAST=      -1066.49449933825, 0,           0
##MIN=       -1066.49449933825, -49129,      0
##MAX=       4109.48893751476, 361137658,    0
$$ Real data points
##PAGE= N=1
##DATA TABLE= (X++(R..R)), XYDATA
$$ [...]
18252A82203q439k655n35k0143j1019k495r107q902r92l031J244l533P68L010
18238A16374p475l047N184N316J299m167r866m831L492n232r631r219o195j96
18224G1806L942l790o34j467j182J168J377P975O436K965O675p991j845Q172M990
18209I8597n249L747k731o893m676l603P121J2735J0364j787l386Q123R604O951
18195A28917K89L461l109L430J3553R085K828L84l032N809M23l979P394J4872
18181A80325K4732L5445M4989O1637O6273M7581L6217K9986K7557K3539J0290
18170E88571N063J1487P657J9725K5977P919j3142k7179m0301o4390p0603n9744
18158C91040o2045m9734k7424j0948j4262j6575J272J1622J9358J7029P774O392
$$ y = [182203, 173764, 171109, 170574, 150431, 139412, 136917, 127810, 118908, 117916, 114885, 116129, 112596, 113364, 116374, 108899, 105852, 111036, 116352, 117651, 113484, 103618, 98787, 102279, 97047, 87416, 78197, 72002, 71806, 75748, 71958, 71324, 69857, 68675, 69843, 71220, 79195, 85631, 88596, 95271, 87280, 85435, 93607, 98597, 93348, 97095, 94364, 87471, 82795, 79192, 86313, 99048, 109412, 107625, 104239, 112362, 121966, 128917, 129206, 132667, 129558, 132988, 146541, 155626, 158454, 158838, 155806, 161615, 162038, 158059, 165453, 180325, 205057, 240502, 285491, 347128, 413401, 460982, 497199, 527185, 554742, 578281, 588571, 593634, 605121, 612778, 632503, 658480, 666399, 653257, 626078, 585777, 521387, 450784, 391040, 328995, 279261, 251837, 240889, 226627, 210052, 211324, 222946, 242304, 259333, 267107, 273499]
18146B73499L765K545m138l680j1401k1313j8209m178O130j56L142J8110K4355
18133B68471K6554M2060N8009O8649Q3879R5013Q6883P0482O4548N9810L1176
18122I55534q337l0516m0790l8510l6171k1416J6714N9308J06989J87528K90069
18111A440402L84959N43451Q70507J540503K710933K578642M35577l86702j025194
18102I093078p81043j648068k233904j464901q51075n21884l37262k25188j65172
18093H64581j30488j03157p3161m9748m9212m5692l2778k4322k4882j9350j7138
18082B94653j2286o123K464k356o939r010J249p695M727P102l526n247J3228K712
18068B72953j2793r893j7796r535l557j4522j6280m387O293j450m501m267l960
$$ y = [273499, 277264, 279809, 275671, 271991, 260590, 239277, 221068, 216890, 223020, 222864, 226006, 244116, 268471, 295025, 337085, 395094, 463743, 547622, 642635, 729518, 800000, 864548, 924358, 955534, 947197, 916681, 875891, 837381, 801210, 779794, 796508, 855816, 962805, 1150333, 1440402, 1825361, 2368812, 3239319, 4779822, 7490755, 10069397, 10504974, 10118272, 9093078, 8312035, 6663967, 4430063, 2965162, 2114087, 1592203, 1254941, 1029753, 864581, 734093, 630936, 557775, 508027, 458815, 413123, 380345, 356023, 331141, 311791, 294653, 282367, 276244, 278708, 276352, 269413, 260403, 261652, 253957, 258684, 265786, 262260, 257013, 270241, 272953, 260160, 250267, 232471, 222936, 219379, 204857, 188577, 184190, 190483, 189033, 184532, 180265, 176305]
18055A76305P19J2737Q609l000M534R039Q040O784J0317N547Q592K520J0899K2532
18041B84174J8610L1509M4263N7086N3262N7035N9867N9994M0861K9515K8361
18030G64537J1553J4959L9576R1435J53712K35838L17029L45581M11166M78193
18020B863579M59285K96588J69047N4085p4235k50744l65043l65042l61119l32756
18010B093645k81173j97195j22970o7819o9094q7318q6625p7872j04566j28255
18000H70758j13310r4423q2076p1292n5632l7590k3656j4418r100m37M262J2578
17988C85664J5595K0214K9545M1175O2399P8160R0339P7531Q4807R8855Q5942
17977A070226M3817L2619L1802M7094O5089R1496J49529K17283K62412K42625
$$ y = [176305, 177024, 189761, 198370, 195370, 199904, 208943, 216983, 223767, 234084, 239631, 248223, 250743, 261642, 284174, 302784, 334293, 378556, 435642, 488904, 545939, 605806, 665800, 706661, 736176, 764537, 776090, 791049, 830625, 922060, 1075772, 1311610, 1628639, 1974220, 2385386, 2863579, 3322864, 3619452, 3788499, 3842584, 3768349, 3517605, 3152562, 2787520, 2426401, 2093645, 1812472, 1615277, 1492307, 1424488, 1355394, 1268076, 1181451, 1103579, 999013, 870758, 757448, 663025, 580949, 509657, 454025, 416435, 392779, 378361, 369261, 368824, 373086, 385664, 401259, 421473, 451018, 492193, 554592, 632752, 723091, 800622, 885429, 984284, 1070226, 1114043, 1146662, 1178464, 1225558, 1290647, 1382143, 1531672, 1748955, 2011367, 2253992]
17967B253992K20504K25818J23577m4269j57667j90076k39015l43060l56110k83949
17957A209745k21108j88463j48815r9534n2453l4570k1936j8800j8970j5937k8978
17946C60181j6593j9831k1467j4755j6905j8179k4770k1552j1260l14p04j04q339
17933A85408P063J4029Q486R81M506O52j470j7222j5486j4811j5923j5369L661
17920A44505J849J0375P466P965N913L365l699N895Q829L01n391o757P489L858
17906A91963K3Q001M987M500M571J4735m099Q320J0624R275L302M321K0103K3826
17892C04452J6603J2434J2280J4631O991J4298Q769J6492K3226K8900M3833M1690
17880E44599L9856L0503L2691N6430M2183M2735N2593N4209M6356L7554L8130
$$ y = [2253992, 2474496, 2700314, 2823891, 2779622, 2621955, 2431879, 2192864, 1849804, 1493694, 1209745, 988637, 800174, 651359, 551825, 499372, 464802, 442866, 424066, 405096, 389159, 360181, 343588, 323757, 302290, 287535, 270630, 252451, 227681, 206129, 194869, 194555, 193851, 193747, 185408, 192471, 206500, 214986, 215967, 220473, 221125, 219655, 202433, 186947, 172136, 156213, 140844, 144505, 146354, 156729, 164195, 172160, 178073, 181438, 177739, 183634, 192463, 192764, 187373, 180616, 188105, 191963, 191986, 199987, 204974, 209474, 214045, 228780, 224681, 233001, 243625, 252900, 256202, 260523, 280626, 304452, 321055, 333489, 345769, 360400, 367391, 381689, 390458, 406950, 430176, 459076, 502909, 544599, 584455, 614958, 647649, 704079, 746262, 788997, 841590, 895799, 942155, 979709, 1017839]
17869A017839M8767N7434O4334Q1773J14653J42901J65668J90274K11301K42883
17859B337827K60045K32048J92518J63662J51904J44208J19875J24799J49816
17850C876702K04753K60910L50524M66083O45207R06312J298519J779625K065075
17841A1853710K133341K401229K844658K698272J752636J207397J219742J430318
17833B7541303J361837J985303M054195P475975J1661248J4453794J5547779J8176070
17825A02257504K1899880K0205332J1619562N420917J785024k336419j0486888
17818A50364912j5614267j5239973j3438637j3120624j1473758p716321m511891
17811F9249441m027278m552794m366389m054847m713852o090297o211224n366051
$$ y = [1017839, 1066606, 1124040, 1188374, 1270147, 1384800, 1527701, 1693369, 1883643, 2094944, 2337827, 2597872, 2829920, 3022438, 3186100, 3338004, 3482212, 3602087, 3726886, 3876702, 4081455, 4342365, 4692889, 5158972, 5804179, 6710491, 8009010, 9788635, 11853710, 13987051, 16388280, 19232938, 21931210, 23683846, 24891243, 26110985, 27541303, 28903140, 30888443, 34942638, 42418613, 54079861, 68533655, 84081434, 102257504, 124157384, 144362716, 155982278, 161403195, 163188219, 160851800, 150364912, 134750645, 119510672, 106072035, 92951411, 81477653, 73761332, 69249441, 65222163, 60669369, 56302980, 52248133, 47534281, 41443984, 35232760, 29866709]
17803B9866709m626229m110377l351048k459749j744240j208152p81082m47776
17795A1138056j79320N7669L11638O16723J026734J548998K293552L290336M126512
17786B4230898M393488M764455N656901N973896M425794K950159K955539L954884
17778E9306014M501557N137299P950657J1807126J3232639J2143489J2593667
17771A26672448J3073726Q204300j142574o384717q765875j1413818j7033194
17764A03210296j8598406j5722865j2525925j0685526q466983n715003l373909
17757B8121679j715629j136635j442911j592136j563709j658841k162874k389116
17749A4459828k108035j740577j541293j310514r91347p23559n49320m10683l12102
$$ y = [29866709, 25240480, 21130103, 17779055, 15319306, 13575066, 12366914, 11585832, 11138056, 10958736, 11016405, 11328043, 11944766, 12971500, 14520498, 16814050, 20104386, 24230898, 28624386, 33388841, 39045742, 45019638, 49445432, 52395591, 55351130, 59306014, 63807571, 68944870, 76895527, 88702653, 101935292, 114078781, 126672448, 139746174, 147950474, 146807900, 140423183, 131657308, 120243490, 103210296, 84611890, 68889025, 56363100, 45677574, 37210591, 31495588, 28121679, 26406050, 25269415, 23826504, 22234368, 20670659, 19011818, 16848944, 14459828, 12351793, 10611216, 9069923, 7759409, 6768062, 6044503, 5495183, 5084500, 4772398]
17740D772398k64831k51476k13705j80245j86449k30360k40716k13012k10554
17731B781050k22842k10104j72837j38948j21072j04180q3891o6158n4029m7074
17721A559915n5749m8646n5995n0549m0824l7725l4266l2484k3199j3393j9573
17710A147512l838k513j1632j1593q19N094n277L363M849m364j3074j9263j2678
17697A075767l940k4391l1470k8926j9314j6359k7250k4453k3670j7211j9367
17686H39416j0130j4668k6421k2447k7149k8340k3999j4156m398o715M88k266
17674F59215J836M606l632j1497j3532j3553j4541j8644j3129j7168j6113j3482
17662E30366q908m298m409M948J1245O259N491J3732P542n163n17L741J2866L166
$$ y = [4772398, 4507567, 4256091, 4042386, 3862141, 3675692, 3445332, 3204616, 2991604, 2781050, 2558208, 2348104, 2175267, 2036319, 1915247, 1811067, 1727176, 1661018, 1606989, 1559915, 1504166, 1455520, 1399525, 1348976, 1308152, 1270427, 1236161, 1203677, 1180478, 1167085, 1147512, 1143674, 1141161, 1129529, 1117936, 1117117, 1122211, 1116934, 1120297, 1125146, 1120782, 1107708, 1088445, 1075767, 1071827, 1047436, 1015966, 987040, 967726, 951367, 924117, 899664, 875994, 858783, 839416, 829286, 814618, 788197, 765750, 738601, 710261, 686262, 672106, 667708, 660993, 661481, 659215, 661051, 665657, 662025, 650528, 636996, 623443, 608902, 590258, 577129, 559961, 543848, 530366, 521458, 517160, 512751, 517699, 528944, 535203, 540694, 554426, 561968, 556805, 556288, 560029, 572895, 576061]
17648E76061K89L22L994p095o574k848n846n556r991j2528k5419k1358j1950j2216
17634D59285k3064j1602p919l054k053j7987k0311j2233j0991j3501j2779m587
17622C19204m140p687m855l682r768j4234j4622j6223j3375j9494j6535j2488
17610A82101j6561p122j749M179L843J917O48q75R948J3903M822N481j333k088
17596A97114K272L184Q397J4107J9638J0126J6610J8005K6646K7033K8431J8954
17584C90517M538L292J2973K038j8033k6844j2462r484k3287k4577k0707k0317
17572B57647j7365j9273j3829q993j6314j6590j1859o629m079j1503r665l180
17560A18368q753l558K65P921o844n145L113P525M73J1926R024P018k954P900
$$ y = [576061, 576350, 576672, 580666, 573571, 566997, 564149, 558303, 552747, 542756, 530228, 504809, 483451, 471501, 459285, 436221, 424619, 416700, 413646, 411593, 393606, 373295, 361062, 350071, 336570, 323791, 319204, 315064, 307377, 302522, 298840, 289072, 274838, 260216, 243993, 230618, 211124, 194589, 182101, 165540, 158418, 156669, 160848, 164691, 166608, 167256, 166381, 176329, 190232, 195054, 200535, 199202, 197114, 199386, 202570, 210967, 225074, 244712, 254838, 271448, 289453, 316099, 343132, 371563, 390517, 395055, 398347, 411320, 413358, 395325, 368481, 356019, 346535, 323248, 298671, 277964, 257647, 240282, 221009, 207180, 198187, 181873, 165283, 153424, 146795, 142716, 131213, 121548, 118368, 109615, 106057, 106322, 114243, 107399, 102254, 105367, 112892, 113365, 125291, 134315, 141333, 138379, 146279]
17546A46279J6938J2062O044N417Q550R766J4978M754O715K1448K3805J5518J4026
17533C06300J0647J1725M099m947l84j155j5946j7285j7517j2717j5804k2026
17521B24990j3002j5888j3869n181j0526p661l192j1463p754r434j4113o83m356
17508A07868N53L824p931p70O46n459K459L932k586K758M582J330l122k657J787
17493A07214J371j601N68J764o445m428J316O677l796K599q02l735p97M15L128
17478A03448K007m695l848m544J53o684o286J679J8335J3675L798q134k719l861
17464A02324q478n407o08J400J039l372K568n964j1692l326K987O91p178O125
17450G1109P061L628k403k565m173o942M559L715L89J5736J6641P773J005l770
$$ y = [146279, 163217, 175279, 181323, 186740, 195290, 205056, 220034, 224788, 231503, 252951, 276756, 292274, 306300, 316947, 328672, 332771, 327824, 327440, 326285, 310339, 293054, 275537, 262820, 247016, 224990, 211988, 196100, 182231, 177050, 166524, 158863, 155671, 144208, 136454, 127020, 112907, 112224, 107868, 108421, 112245, 104314, 103544, 104190, 98731, 101190, 105122, 102536, 105294, 109876, 111206, 108084, 105427, 107214, 108585, 106984, 107552, 109316, 102871, 98443, 99759, 106436, 102640, 105239, 104437, 100702, 99905, 100320, 103448, 105455, 100760, 96912, 92368, 92521, 85837, 79551, 81230, 99565, 113240, 117038, 108904, 106185, 102324, 93846, 88439, 87831, 89231, 90270, 86898, 89466, 83502, 71810, 68484, 71471, 72162, 64984, 71109, 78170, 81798, 79395, 76830, 72657, 65715, 70274, 73989, 74378, 90114, 106755, 114528, 115533, 111763]
17436A11763j1835j210k746q669r341o015n478M35K500n565m486Q18r01L426n427
17421E7269j459O493J434K418P78O466l896o761P01K844j166L706m585m499K98
17406F0041k56R950M206l607k844q756mR155J39o380J763n175l95J008k742r708
17390D6395O0O074J3L14Q836m25p23J235J255q236o100m61R666m649o216J0151
17374E7189J5709l740j1833k195p472K945L080Q447j367l022L244L138m799J963
17360F1287O028O86q380q514J535q355k037m285Q8M018R541N267J887q33O269
17345F4202M249n554o788L793O071K56M701M745M018K053Q250J1769J5753K0811
17331A38329J1401J1137J0088K6194L4436L4709L2108M6764N7984N2366L2991
$$ y = [111763, 99928, 98718, 95972, 87303, 77962, 71947, 66469, 66904, 69404, 63839, 59353, 60171, 59270, 62696, 57269, 55810, 62303, 63737, 66155, 66933, 73399, 69503, 62742, 63443, 66287, 65121, 68827, 64242, 59743, 60041, 59785, 69735, 73941, 70334, 67490, 58734, 58730, 67885, 68024, 61644, 63407, 58232, 57837, 58845, 56103, 46395, 46455, 52529, 52542, 52856, 61692, 61267, 60544, 61779, 63034, 54798, 48698, 48237, 57903, 53254, 47038, 57189, 72898, 69158, 57325, 55130, 47658, 50603, 53683, 62130, 60763, 57741, 60985, 64123, 59324, 61287, 67315, 68001, 59621, 51107, 52642, 44287, 42250, 37965, 38053, 42071, 51612, 56879, 58766, 57933, 64202, 68451, 62897, 56109, 59902, 65973, 66229, 70930, 75675, 79693, 81746, 89996, 101765, 117518, 138329, 149730, 160867, 170955, 197149, 231585, 266294, 298402, 345166, 403150, 455516, 488507]
17320D88507L6146L3123L8560O772o911r947K477Q253J472M170J0378J265p845
17307F06420k3564k9656l9659m4084n7311o3484n2668l3373k5315j4218j3120
17296B09968m610j323o162p313r299m351m760j2477j2514n103q333q912J818L426
17282A30055P077N087L470K5954L3554L5126L5082M6691O0530M7260L2691L4116
17270D96693M3578L4450R423r749k6211k2989l2617l3993m2202l4251k1758M520
17258C64894J2307K0236L0722L7289K4941J6303K435j1394k7235m7676n4555n3551
17246C14716n1598m5616m5452l2295j6673j2830j2578j2428j4370p837L078N432
17234G1549k065l808k384l285J717m62m594n220J077l614l944M959N509l562l147
$$ y = [488507, 524653, 557776, 596336, 603108, 596197, 586250, 588727, 596980, 598452, 602622, 613000, 614265, 606420, 582856, 553200, 513541, 469457, 412146, 348662, 295994, 262621, 237306, 223088, 209968, 205358, 204035, 197873, 190560, 181261, 176910, 172150, 159673, 147159, 142056, 133723, 124811, 126629, 130055, 137132, 142219, 145689, 171643, 205197, 240323, 275405, 322096, 382626, 429886, 462577, 496693, 540271, 574721, 584144, 574395, 548184, 525195, 492578, 458585, 416383, 382132, 360374, 364894, 377201, 397437, 428159, 465448, 490389, 506692, 509127, 497733, 470498, 422822, 368267, 314716, 263118, 217502, 172050, 139755, 123082, 110252, 97674, 85246, 70876, 63039, 66117, 71549, 69484, 65676, 63292, 60007, 61724, 61262, 56668, 51448, 52525, 48911, 44967, 49926, 55435, 51873, 48726]
17219D8726J739K541J786J242m053j2295r163O25N134O773n282j271K877k50p228
17204C1901l271M838L23K5K767K937P09m57m450K980L61m133j780J331J974J903
17188C7958N823j07r63K577L824n043l898J874j123K950J2375M445k773p445p663
17173D2811k100k997j266j122o62L093j2l625o925J468p76J75M486R193n10j4306
17157B6925j856K973J531m329q4M118P879M712m66K468J972K881k36L94l703K592
17141D7771l363p72m297k171n69J76l522l211j130M101l854L035N358m51j3390
17126B3711o499p147L857M833J0894L009Q414m022l35N068O38j564m735J449o297
17111C1274p096N593l05K938p05L403p80m244q322l844J890P69M176k846m012
$$ y = [48726, 50465, 53006, 54792, 56034, 51981, 39686, 30523, 31148, 36282, 43055, 37773, 36502, 39379, 39129, 31901, 28630, 33468, 33791, 33816, 36583, 39520, 40229, 39772, 35322, 38302, 38663, 34530, 32750, 34081, 36055, 37958, 43781, 43674, 42711, 45288, 49112, 44069, 40171, 42045, 40922, 43872, 56247, 60692, 57919, 50474, 42811, 40711, 37714, 36448, 35326, 34664, 37757, 37745, 34120, 27195, 28663, 27887, 28062, 32548, 41741, 41231, 26925, 25069, 28042, 29573, 25244, 25160, 29278, 37157, 41869, 41403, 43871, 45843, 48724, 48488, 48882, 45179, 47771, 44408, 43636, 39339, 37168, 36599, 36775, 33253, 30042, 28912, 33013, 29159, 32194, 37552, 37101, 23711, 17212, 10065, 13922, 18755, 29649, 32658, 41072, 37050, 36715, 41783, 42421, 40857, 36122, 37571, 31274, 24178, 29771, 29466, 32404, 31699, 35102, 34322, 30078, 21756, 17912, 19802, 20571, 24747, 21901, 17889]
17096A7889o765J16K601J134N293r39K275N936M509o39n755Q006r020p837J828
17081A8632M601m348J439n259n111O720N605l500l667k035N041Q071O900R043
17067D2132j67n586o067k873j1115K36J1449L38k400k277n500j503l774J644R995
17052B4532l504p382K221J022o96K277n092n398q9l740j135k71O952O577k382
17037A3892L255J795M052L376k509n218o694N935O528n380k651O949N334q764
17023A9900l610l048k326M379O807Q565J267k761l588n476o260k527J061J666
17009A4049N86J554O409m782L021K250M370K034l180o349o011n8J1026K02p504
16994A7617L001M710L268L597j729j53o768j3406K589M763p95Q705l895M137O134
$$ y = [17889, 11124, 11240, 13841, 14975, 20268, 19329, 21604, 27540, 32049, 31410, 25655, 33661, 24641, 16804, 18632, 23233, 18885, 20324, 15065, 9954, 16674, 22279, 18779, 15112, 13077, 18118, 26189, 33089, 42132, 41965, 36379, 30312, 27439, 16324, 16560, 28009, 28347, 25947, 23670, 18170, 16667, 12893, 14537, 24532, 21028, 13646, 15867, 16889, 16193, 18470, 13378, 7980, 7891, 4151, 3016, 2745, 9697, 16274, 13892, 17147, 18942, 22994, 26370, 23861, 18643, 11949, 17884, 24412, 19032, 16381, 23330, 28664, 19900, 16290, 13242, 10916, 15295, 22102, 30667, 31934, 29173, 25585, 20109, 13849, 11322, 12383, 14049, 14635, 16189, 22598, 17816, 20837, 23087, 27457, 29491, 26311, 19962, 13951, 13893, 24919, 25121, 17617, 20618, 25328, 28596, 32193, 30464, 30311, 23543, 10137, 12726, 17489, 16694, 25399, 21504, 25641, 31775]
16979C1775k654j195K406q515o472N74N87L717L703K440p864n509Q194L831k275
16964B2743j599K734n741j2398o053K39j86K202N47j787L291J6540O046o713L270
16949B3135P421N104o670o920k383p325o247M380N335L700K514Q654j706r140
16935A9852q96M793J635m980k606j410k133l449k585r331P08K575M972Q238k4
16920A5359k294l590q394r136K101Q556L083O184J3319N926J038p685n590k835
16906A6042K04r17o716k910J866M162O168N933k610J339k196R35L52P51K163o428
16890A8138q198j628R738J620L907L653l331M942l426q554K229M854j774M328
16876B6498K160p569j1888r331o621p40M378N336J1972j310m907P477L779Q37
$$ y = [31775, 29121, 27926, 30332, 21817, 15345, 15919, 16506, 20223, 23926, 26366, 18502, 12993, 21187, 25018, 22743, 21144, 23878, 18137, 5739, -314, -75, -261, 1941, 2488, 701, 3992, 20532, 26578, 19865, 23135, 30556, 35660, 28990, 22070, 19687, 12362, 6115, 10495, 15830, 19530, 22044, 30698, 28992, 19852, 18956, 23749, 25384, 20404, 17798, 16388, 14255, 10806, 8221, -1110, -402, 2173, 7145, 15383, 15359, 13065, 9475, 1081, -8055, -5954, 2602, 5685, 11869, 25188, 31114, 32152, 24467, 18877, 16042, 16246, 15329, 8613, 5703, 7569, 11731, 17899, 23832, 21222, 22561, 20365, 21300, 21652, 22403, 24566, 18138, 9940, 8312, 18050, 19670, 23577, 27230, 23899, 28841, 25415, 16861, 19090, 23944, 22170, 26498, 28658, 21089, 9201, -130, -6751, -7491, -3113, 2223, 14195, 12885, 7978, 15455, 19234, 20071]
16862B0071M261k10n210m303j951M209P813K987q116m600j411P180l654j271L247
16847A9042L785j954j774n934n341M427m420K451M2J056l500k09P202J185m741
16832A1317r218r09j764N508L150m201j903j709m66P333M414K663R383j428N22
16817B2692j04p145n788L305J000m477M49Ll41n371l912J956J333m306l214K571
16801a349N638O074j034j189J973K640l438p652L031k099J51O288j232K23j038
16786F987o055N890J1984M359j3747l411P823o267r591K595M209R082M367J412
16772A9637o818n775l452Q843L78o454N369K423P43k528L37p615j4895j564J2550
16757A179M773O300N46r933N88J66m130j154K706Q188j260j489K098M79k58j189
$$ y = [20071, 24332, 24122, 18912, 14609, 12658, 16867, 24680, 27667, 19551, 14951, 13540, 20720, 17066, 15795, 19042, 22827, 20873, 19099, 13165, 7824, 12251, 7831, 10282, 10324, 11380, 7880, 7671, 14873, 16058, 11317, 2099, 1190, -574, 4934, 8084, 3883, 1980, 271, -195, 7138, 11552, 14215, 23598, 22170, 22692, 22588, 15443, 9655, 12960, 13960, 9483, 9932, 9935, 9594, 4223, 311, 2267, 3600, -706, -3920, -1349, 4289, 10363, 9329, 8140, 10113, 12753, 9315, 1663, 4694, 2595, 2746, 9034, 7802, 8025, 6987, 932, 6822, 18806, 23165, 9418, 6007, 13830, 7563, -2028, 567, 4776, 13858, 18225, 19637, 12819, 7044, 3592, 12435, 12813, 6359, 11728, 14151, 14894, 12366, 12703, 5088, -9807, -11371, 1179, 5952, 12252, 12798, 2865, 3453, 3619, -511, -1665, 1041, 9229, 7969, 6480, 8578, 9057, 8799, 7610]
16741G610j651n14p67K313J683R28K298L536m772q712l027J2977K539o190k435
16726E816k006L918n349o151O377j218J46L958J272K433j606o607M035L421K627
16711A1066p644j24J698j845M007j0204n624N110P935J2158K550l845m181n524
16697E533k305o184N960N866M052Q70N402P296J933q816o598j049l885M999j965
16682A1109J829q026j298J1648p088m609m138L683O837J66k205L612l715m482
16668C323j233P97N178J976l122p550M187K719m055k144J1286M043R89P526K074
16653B5994J63p343k045m472K415K343L603p605o644k900M860M464n791k975K518
16638F585N420L64l669k875L446m330L741K549l533m596J582L429K043k969K382
$$ y = [7610, 5959, 5445, 4678, 6991, 8674, 9602, 11900, 15436, 10664, 1952, -1075, 11902, 14441, 8251, 5816, 3810, 7728, 2379, -3772, 2605, 1387, 1533, 5491, 6763, 9196, 7590, 983, 5018, 8439, 11066, 3422, 3298, 4996, 3151, 7158, -3046, -8670, -3560, 4375, 16533, 19083, 15238, 11057, 5533, 3228, -2956, 3004, 8870, 12922, 13792, 19194, 26490, 28423, 19607, 13009, 11960, 8075, 13074, 11109, 12938, 4912, 3614, 15262, 8174, 3565, -573, 3110, 9947, 10113, 7908, 11520, 7805, 3323, 2090, 2887, 8065, 10041, 6919, -631, 3556, 6275, 2220, 76, 11362, 15405, 16394, 23920, 25994, 26157, 18814, 16769, 12297, 14712, 17055, 20658, 13053, 6409, 3509, 8369, 12833, 7042, 4067, 6585, 12005, 12369, 8700, 5825, 9271, 4941, 8682, 11231, 7698, 3102, 4684, 8113, 10156, 7187, 9569]
16623I569N269J507m685p37n042l495K763K111m138L299M240J251K619l00J516
16608A5747k373o307l060K278o251o171K970L739J1809K054j954Q13l517j003
16594H774o7q54N925o64j061N209k104J468m927r248M549M91k9M378K992J714
16578A6546n200k282R095j587p064l309j02N251N044K682N714j26K578n158j0122
16563A1960k506L964j250o970k504j450l736P534L881K491P061k1n799r771J997
16548D881L144O441m311J596k800r827l003m225j036O463O582o833K209P715j091
16533E905K112P166n058k839J410K828q938k199M936K339m124l65j792L129R22
16518E432L293j3040p585J1911M076k945k498P44J283R452L485m935k969K965
$$ y = [9569, 14838, 16345, 11660, 10923, 5881, 2386, 5149, 7260, 3122, 6421, 10661, 11912, 14531, 14231, 15747, 13374, 7067, 4007, 6285, 34, -6137, -3167, 572, 12381, 14435, 12481, 13294, 9777, 8774, 8707, 7853, 13778, 13114, 12053, 17262, 15158, 16626, 11699, 2451, 7000, 7491, 7462, 11840, 14832, 16546, 11346, 9064, 18159, 16572, 9508, 6199, 6097, 11348, 16392, 19074, 24788, 24662, 27240, 22082, 11960, 9454, 13418, 12168, 5198, 2694, 1244, -2492, 5042, 8923, 11414, 18475, 18454, 12655, 2884, 4881, 8025, 14466, 10155, 11751, 8951, -876, -3879, -8104, -9140, -2677, 3905, -2928, -719, 6996, 5905, 8017, 15183, 10125, 7286, 8696, 11524, 2586, 387, 5323, 7662, 3538, 3173, 1381, 4510, 5432, 8725, -4315, -11900, 11, 4087, 1142, -1356, -612, 671, 10123, 13608, 8673, 5704, 8669]
16504H669M59k485o429Q91L967J133k481P934J119O00k678J512L19p307m120j963
16488h60m611N141K288N099K383l350n789J0268L064j0107M620m36l964o098l738
16473f090m09l384n475J618j392J535P06L768K507M599K850M18M266N169L602
16458A4288L500k422J13M68K32r42o436J894L623j438K171m805Q38l662l54L117
16442A0185r4L883k727o42o321p368k884Q533Q993J1224p335j6207j1923m857
16428a7540N235J2430M184n736L25j074m689L726l39k915J526N712N169P621j2986
16413F49j2652J2130N701k540k037L946K087O061j512r024P6J072j997l22m2K329
16397C925j879O033k391j258J0015k826n174K580N465j89N4o88K260j705o513
$$ y = [8669, 9128, 6643, 214, 1105, 5072, 6205, 3724, 11658, 12777, 13377, 10699, 12211, 12530, 5223, 1103, -860, -5471, -330, 1958, 7057, 9440, 6090, 301, 10569, 13633, 3526, 8146, 7710, 3746, -2352, -6090, -6499, -9883, -15358, -13740, -15132, -13597, -12891, -9123, -6616, -2017, 833, 1251, 5517, 10686, 14288, 17788, 15366, 15479, 15947, 16179, 15237, 8801, 10695, 14318, 12880, 15051, 10246, 11084, 7422, 7068, 10185, 10091, 13974, 11247, 10605, 4284, -3084, -5968, 2565, 11558, 22782, 15447, -760, -12683, -17540, -12305, 125, 4309, -1427, -1102, -2176, -6865, -3139, -3478, -6393, -4867, 845, 6014, 13635, 649, -12003, 127, 5828, 3288, 1251, 5197, 7284, 13345, 11833, 2809, 2885, 3957, 1960, 1638, 1596, 3925, 2046, 8079, 5688, 4430, 14445, 11619, 6445, 9025, 14490, 14301, 14355, 13667, 15927, 14222, 7709]
16382G709M016L331m399n066k872K305L622l385p550j562K526K78P29M974J837
16367F493M404K089k520n565j833J132q15k161j755J451K081j085M307J297n870
16352A650j0055l970K418L261J003k353J90r65n37J164j550m441K550L806P144
16337f85N56j882l619o68j175N093l078j452L312J1445M815N19q22l978n567m69
16321B345o720j49L255N73J0231K199n415l455j772m952M239L768L48R71n639
16306a73j339j568j43m21o471m614Q606J0232J626n868p02l479L817M54K66N863
16290F086K319j085n155n827n809M790k50K415P876m165J076M135M41L963M623
16275A5433j0473r738N310l607r878L621K036o24m15L530J0189J586k464K9m772
$$ y = [7709, 11725, 15056, 10657, 5591, 2719, 5024, 8646, 5261, -2289, -3851, -1325, -1047, -318, 4656, 6493, 10897, 12986, 10466, 4901, 3068, 4200, 3385, 1224, -531, 920, 3001, 1916, 6223, 7520, 1650, -8405, -12375, -9957, -6696, -5693, -8046, -7856, -8821, -9358, -8194, -9744, -14185, -11635, -7829, -685, -129, -2011, -5630, -6298, -7473, -2380, -5458, -6910, -3598, 7847, 12662, 13181, 12359, 8381, 2814, 2345, -4375, -4524, -1269, -696, 9535, 11734, 6319, 2864, 1092, -3860, 379, 4147, 4495, 5466, -173, -1512, -3080, -3223, -3644, -10115, -14729, -6123, 4109, 5735, -133, -835, -4314, -497, -43, 223, 6086, 8405, 7320, 2165, -3662, -9471, -4681, -4931, -2516, 5360, 1195, 2271, 6406, 6847, 10810, 15433, 4960, -4778, 532, -3075, -12953, -9332, -7296, -7920, -8335, -4805, 5384, 6970, 4506, 4535, -237]
16260b37q166n311Q398Q462m050M173n532k474r6Q506M282K673q805n268N72O074
16244C201N329p77q15N01J602k503K73k274l988K517L178J737q011L998L256K84
16228G508o470l733L755L091N62q495J700k528K214k584j0376l370N602j655L392
16213a1387J0768Q312n943o821n377k797L828N619Q009J0029o604m956P24j839
16199A565l162m648M9J687L330M06l142k636k18l218j0716j617Q474J634M840
16184g372M558l564p934n330R43Q926J285K383m775K206O672L206j865n472M04
16169e729j958p703q054o463O688L035j445J0114K897N08J1427k366k633R15q1
16154h48J06J029k821k564m467L582M775K083l3O2J740M642J83N495L131m436
$$ y = [-237, -8403, -13714, -5316, 3146, -904, 3269, -2263, -4737, -4833, 3673, 7955, 10628, 1823, -3445, -2873, 3201, 8530, 7753, 6938, 7439, 9041, 6538, 6811, 4537, 549, 3066, 6244, 7981, -30, 3968, 7224, 7508, 1038, -2695, 1060, 4151, 4713, -3782, -2082, -4610, -2396, -4980, -15356, -18726, -13124, -14779, -11387, -619, 7693, 1750, -5071, -10448, -13245, -9417, -3798, 4211, 14240, 7636, 2680, 3404, 1565, -1597, -6245, -6196, -4509, -1179, -773, -3915, -6551, -6769, -9987, -20703, -22320, -13846, -12212, -7372, -2814, -6378, -14312, -19642, -18699, -9773, -8488, -6105, -10880, -8674, -2002, 1204, -661, -6133, -5729, -7687, -15390, -23444, -29907, -23219, -20184, -21629, -11515, -8618, -8110, 3317, 951, -1682, -767, -848, -742, 287, -2534, -5098, -9565, -5983, -1208, 875, 842, 904, 2644, 7286, 7469, 12964, 16095, 11659]
16138A1659k616J199j614K230n407M40m85M343K670m110n94l290J437j451j65
16123D246l717m195j030P147P245P349M004j1340j2427q105K210N48J0743J4564
16109A7242L008o939J551J817K854r072r696j535R469q710j8944j562M600J3686
16095b231M473k651p655l271l327l543N488k094j709M083N129l96m11k852R02
16080a0065J451M569Q052n53L233J327p964k966M39k513o482M383J0192J188P33
16065E024k998J505l606R310j400m993J362M98J284p043m441j319r90O638O977
16050E808k044p715l318J212p012l736L784M536L119J125R06L843n31j766J276
16035e13M413j297l804j0743j400P282P02p406R393P096R9R38j0518J775N479
$$ y = [11659, 9043, 10242, 8628, 10858, 5451, 5891, 5406, 9749, 12419, 8309, 7715, 4425, 5862, 4411, 4246, 529, -3666, -4696, 2451, 9696, 17045, 21049, 9709, -2718, -10823, -8613, -8065, 2678, 17242, 20250, 13311, 14862, 16679, 19533, 10461, 765, -770, 8699, -11, -18955, -20517, -15917, -2231, 2242, -409, -8064, -11335, -14662, -18205, -12717, -14811, -16520, -12437, -7308, -7704, -8115, -10967, -10065, -8614, -4045, 4007, 3454, 6687, 8014, 50, -2916, -2477, -4990, -11472, -7089, 3103, 4291, 5024, 2026, 3531, -75, 9235, 7835, 2842, 4204, 4702, 5986, -1057, -5498, -6817, -7807, -1169, 5808, 3764, -3951, -7269, -6057, -13069, -16805, -13021, -8485, -5366, -4241, -3335, 508, -23, -1789, -513, 3900, 2603, -1201, -11944, -13344, -6062, -5360, -12766, -3373, 3723, 3822, 4760, -5758, -3983, 1496]
16020A496K946n34M143N919j594p707r103n435j250K725Q041O963j617p241J516
16005g32L075l152m01R52j108j342r137k090n270J201P690J0846M819n162n632
15990e443m826m31m957l027Q351P514l04K49r165k142K84K665j053j286O537L95
15974f639q902M44q28Q11M999J755k673K221M353l416m668m134N68L695N618M675
15958b121q30l127l218R237J792l023p753K149M03K097M681K855l678q274p370
15943a6180K497L093J895j064K594J4918K64o307M799M65m433l169Q48P015p290
15928e5q990j201M57O958N420R35p941n832l650n41J998r81p6k580K130J0584
15912c365n12M603l285j859k327l46p982m227O262J0610M277j124p046p76o84
$$ y = [1496, 4442, 3908, 8051, 13970, 12376, 4669, -4434, -9869, -11119, -8394, -353, 6610, 4993, -2248, -732, 2343, -809, -1210, -258, -1366, -2708, -11845, -13935, -19205, -18004, -10314, 532, 5351, 189, -5443, -10269, -10700, -15657, -18684, -10333, -2819, -3123, -2874, -12039, -14181, -13897, -11232, -12285, -13571, -7034, -6639, -15541, -15097, -15925, -15114, -10115, -8360, -11033, -8812, -4459, -7875, -12543, -16677, -16109, -12414, -6796, -2121, -2951, -6078, -9296, -59, 1733, -1290, -9043, -6894, -6491, -4394, 287, 3142, -536, -8810, -16180, -13683, -10590, -8695, -9759, -7165, 7753, 8017, 1710, 6509, 6974, 2541, -628, 220, 7235, -55, -9045, -10246, -9789, -2831, 2589, 3524, -4417, -10249, -13899, -14440, -12442, -13423, -13499, -16079, -13949, -3365, -3877, 726, -2559, -4418, -6745, -7091, -15073, -19300, -13038, -2428, 1849, 725, -6321, -7097, -7781]
15897g781k47o50l700J240N482N099Q209l08l094j685m367m972l936O325K284
15882b101O029l168n469N000j710J151J547r59q647m58J034M433L532L23j028
15867d91o471N815L601O831m711j0747k873l489J943r12k133m684R033K570m21
15852g139J520L300K289J254M17k550r512o721O13L288l868m918O560O253L888
15837e326l693k695k01m5n404m815M122N001M931J251j381m71J865J012l007j505
15821a0361P416O761l090j977k287r067M63P205Q882n445k868n755M810O336J939
15806B962m907l135N96m198j125L62p063m274j386J1514R3q27Q821P709o738j464
15790c060j714n414n144n187q216K023m69j131J0829J3752M180m921o795j614
$$ y = [-7781, -8028, -8678, -12378, -11138, -5656, -557, 7652, 7344, 4250, 2565, -1802, -6774, -10710, -4385, -2101, 3928, 760, -4709, 291, -1419, -268, 1279, 320, -8327, -8785, -7751, -3318, 214, 537, -491, -6962, -1147, 2454, 9285, 4574, -6173, -9046, -12535, -10592, -11504, -13637, -18321, -9288, -6718, -7139, -5619, -2319, -30, 1224, 1641, -909, -10421, -17142, -16529, -13241, -17109, -22027, -15467, -9214, -5326, -9019, -11714, -11915, -11960, -17364, -22179, -18057, -13056, -8125, -6874, -8255, -8726, -6861, -5849, -8856, -10361, -2945, 3816, 726, -1251, -3538, -12605, -12142, -4937, 3945, -1500, -4368, -10123, -5313, 1023, 2962, -1945, -5080, -4484, -8682, -9807, -9445, -16508, -20782, -22168, -10654, -10561, -11388, -2567, 5142, -1596, -3060, -4774, -10188, -15332, -20519, -28735, -26712, -27181, -28312, -17483, -3731, 449, -4472, -11267, -12881]
15776a2881L769M371N560p989n800O107K026K94j872k68K202R394M980m722o129
15761i58J396L611l580J368J526m952j0343j0096Q252J2285m29p770k804m468
15747a6962l35l59j857L270J879J575N48L33P826M777k862n006O28P88R821P88
15731D852j5551m717M181j806J557N710O715k809p276k301P066J1389n370r620
15717g980m742Q87j928L054k206q09l834r82P917j774O96l680j20r0J1812N077
15701A298l66q249r493m523J597M915Q49l952M565M665O187n78n438J177L088
15686d258n914j362k389J809k1n022M363J1089l004j705l958j003M950K404J457
15671b564k365M620P151k280l682l590n980P13K628L783K820p197m775J322K439
$$ y = [-12881, -9112, -4741, 819, -7170, -12970, -6863, -4837, -4543, -6415, -6683, -4481, 4913, 9893, 5171, -958, 438, 4049, 469, 1837, 3363, -1589, -11932, -22028, -13776, -1491, -1920, -9690, -12494, -16962, -17297, -17656, -19513, -16243, -14364, -12789, -12241, -11908, -4082, 695, -2167, -7173, -6545, -5757, 4064, 4852, -10699, -15416, -11235, -13041, -11484, -5774, 941, -1868, -9144, -11445, -4379, 7010, 1640, -7980, -12722, -11835, -13763, -10709, -12915, -13724, -17558, -18540, -10623, -12397, -11701, -15381, -15501, -15591, -3779, 1298, 932, -7317, -16810, -21333, -19736, -14821, -13972, -17924, -13359, -8694, -2507, -3085, -8523, -7346, -4258, -10172, -11534, -13923, -12114, -12135, -17157, -12794, -1705, -4709, -6414, -10372, -11375, -6425, -4021, -2564, -4929, -309, 6842, 4562, 880, -2710, -8690, -7977, -5349, -1566, 1254, -5943, -10718, -9396, -6957]
15656f957p536p222J803J670J940Q131R36J884O800P576j2986n024N463j66Q72
15641b816N178K647r160r440N89J0641J0267r397r958o7n754J159N462K422q86
15626i113O27L238L223n963K82J498m474j032l733L11P912L69m441o39K1M75M88
15609a0951M740J260R54m94m906r49N367j209O087m70j338J921o86P53L941p038
15593c018q866n393K364P042m924k999P853M437o261j0280L232L578K061o388
15579a7562n250M603P945m359M728q25p410l808K318M525o67L274J127J700L800
15564e861j362K442L560l283k699R55q53m161p829L850J083J786K308n449L924
15549a1589r70n530L70R15K771M330P974p75m122N399k420n839j562O034n213
$$ y = [-6957, -14493, -21715, -19912, -18242, -16302, -8171, -7235, -5351, 1449, 9025, -3961, -8985, -3522, -3688, -2816, 2362, 5009, -4151, -13591, -13002, -2361, 7906, -1491, -11449, -11516, -17270, -16111, -10649, -8227, -9113, -8486, -5248, -2025, -7988, -7706, -6208, -10682, -11714, -15447, -15136, -7224, -6855, -11296, -11935, -11914, -11439, -10951, -6211, -4951, -3997, -4491, -9397, -10346, -4979, -6188, -101, -571, -1909, 12, -674, 79, 4020, -3018, -11884, -17277, -14913, -7871, -12795, -15794, -7941, -3504, -9765, -20045, -16813, -13235, -11174, -17562, -22812, -18209, -10264, -14623, -9895, -10720, -18130, -21938, -19620, -15095, -15762, -12488, -11361, -9661, -5861, -7223, -4781, -1221, -4504, -7203, -6248, -7101, -11262, -19091, -15241, -14158, -12372, -10064, -15513, -11589, -12559, -18089, -17719, -16804, -14033, -9703, -1729, -2504, -6626, -1227, -3647, -9486, -11048, -5014, -10227]
15534a0227p662j387o6O986J0807N648n79m209k682l818k778j580M962N00l60
15519f445K2R25L439l934r50L917j780K343m090j590k240J648M302J102Q65m658
15503g124r39l499J073J930o031k420k574L60K19P54R62J853k795P461O857p188
15487a1101j0743m18r4l784M445P2l298K946Q781P12R65R854O034m705q549r803
15471a8686o386k067N315L465M700N333O946K938p987l242J814j188O507K188
15457c50j912J202J566M218k729o17j0963J425L995j46M51j3346m468K269N08
15442a8897M781m885O83M342L754j137R91M863k041L602J698l652R27M298r61
15427a634k139j634n387n556J932L397L566p25k597j134M186m113m353J853L892
$$ y = [-10227, -17889, -19276, -19342, -12356, -1549, 4099, 3520, -689, -3371, -7189, -9967, -11547, -6585, -6085, -6445, -6423, -5498, -2059, -5993, -6943, -3026, -4806, -2463, -6553, -8143, -10383, -8735, -4433, -3331, -2466, -7124, -8063, -11562, -10489, -8559, -14590, -17010, -19584, -19224, -19005, -18251, -17289, -15436, -18231, -10770, -3913, -11101, -21844, -22262, -22356, -26140, -21695, -21623, -24921, -21975, -13194, -12482, -11517, -1663, 4371, -334, -8883, -18686, -25072, -27139, -21824, -18359, -13659, -8326, -1380, 1558, -6429, -9671, -7857, -9045, -2538, -350, -2262, -1060, 506, 4724, 1995, 1378, -9585, -8160, -4165, -4311, -3860, -17206, -21674, -19405, -18897, -14116, -19001, -18318, -13976, -10222, -11359, -10368, -5505, -7546, -3944, -2246, -5898, -4971, -673, -1634, -3773, -5407, -10794, -16350, -14418, -11021, -7455, -8180, -10777, -11911, -7725, -11838, -16191, -14338, -10446]
15412a0446k322l346M186M856j900N80N668j699r400k373L640O072N500O633j218
15397D431j0626k553K224l2k082K164m633p285k592N777K795l409N175M750P098
15382A202J794j704q024j4538P143Q158j438M992l458r328l261n07P675M56l772
15367a4610O28l390O052K802k59k926P276o181L658L240o131O6K26m984p321q59
15351b2713P923N141q27l538K162j687K670O462K866m647k866k409k381m48L741
15336a0551L974N541J251p571k482n754k204N571N315L941J750L275q996j0422
15322a7362l221j460J282M535M79j999o098L404N547N317M951j131l409p001k646
15307a8812O848k750k6n036L824J0131M438l374l668k727l612n213m60L008L491
$$ y = [-10446, -12768, -16114, -11928, -7072, -8972, -8392, -2724, -4423, -13823, -16196, -12556, -6484, -984, 5649, 4431, -6195, -8748, -6524, -6556, -8638, -6474, -11107, -18392, -20984, -15207, -12412, -15821, -10646, -5896, 1202, 2996, 1292, -6732, -21270, -14127, -5969, -7407, -2415, -5873, -15201, -18462, -18969, -11294, -10838, -14610, -13982, -17372, -11320, -8518, -8777, -11703, -4427, -10608, -6950, -3710, -9841, -9775, -9549, -14533, -21854, -22713, -14790, -9649, -10476, -14014, -11852, -13539, -10869, -4407, -1541, -6188, -9054, -11463, -13844, -14292, -10551, -6577, -1036, 215, -7356, -9838, -15592, -17796, -12225, -6910, -2969, -1219, 2056, -6940, -17362, -20583, -22043, -20761, -16226, -15747, -17746, -23844, -20440, -14893, -9576, -4625, -5756, -9165, -16166, -18812, -11964, -14714, -14740, -19776, -15952, -5821, -1383, -4757, -8425, -11152, -14764, -19977, -20437, -17429, -13938]
15292a3938P727k01j948P603m10j0648M732M410j836k711q726p674O207L050l005
15277a7368J849p34l21K949L829L240J491j0879j198j434o681L576R309j106j147
15262a4625K256K631n481K053K992J384J806k864L043l813r769k565P173N967
15248i812O597J61r962o951k935j608O07J7348O504j95Q58k049l924k306M559
15233c108j261k206q18k111l61L993n225J587J1197j633p452O490J591n0n535
15218d902j5497k213O466O550l660k143K558L392j650q308R024L302l505L662
15204f924R198K870n567M05m012q476M34M691r767K67K835J780L810L56j429L749
15188e780J907m363n908j398j383q39l409R91M989j698O40O408R156L406q096
$$ y = [-13938, -6211, -6412, -8360, -757, -1167, -11815, -7083, -2673, -4509, -7220, -15946, -23620, -17413, -14363, -17368, -15519, -16253, -16574, -13625, -9796, -6556, -5065, -15944, -17142, -18576, -25257, -21681, -12372, -13478, -14625, -12369, -9738, -15219, -13166, -10174, -8790, -6984, -9848, -6805, -10618, -20387, -22952, -15779, -9812, -3215, -3054, -13016, -19967, -22902, -24510, -23903, -6555, -51, -246, 612, -1437, -5361, -7667, -3108, -4369, -6575, -7393, -9504, -9865, -5872, -11097, -9510, 1687, 54, -7398, -908, 683, 633, -4902, -20399, -22612, -16146, -9596, -13256, -15399, -12841, -9449, -11099, -19407, -10383, -7081, -10586, -6924, 2274, 5144, -423, -18, -4030, -12506, -12072, -7381, -17148, -16881, -14046, -12266, -8456, -8100, -9529, -5780, -3873, -8236, -14144, -15542, -16925, -17764, -21173, -20182, -15193, -16891, -16251, -9843, -687, 2719, -5377]
15173e377n469K230o415L326N346N326L10l165l318l121K540k260n036o053k804
15158b3940L949N072n3r824m934l602M998j007n175j387L055N641J3266L082k672
15143a3531l570K057j0088k303P00R667K876M541L842m863n308K378K417m566
15129a5751P785j0515o703M683j554L575L682l55k17M607n59J742M939N958p95
15114E22k942m292N05K322j686M89N89N516J0443o0o210m092l042J173n155J882
15098d038J482j607o708o828j0299o559K155M309J1916Q38n843j114j07J006L773
15083a7624L172J657M574O240m922m735n734k731m733Q636N652K759k687j211
15069a1687l30L479j033k359j34L195Q168m968r870J956J048J16P592L046p776
$$ y = [-5377, -10846, -8616, -15031, -11705, -6359, -1033, -723, -3888, -7206, -10327, -7787, -10047, -15083, -21136, -23940, -19991, -14919, -14972, -24796, -29730, -33332, -28334, -29341, -34516, -35903, -32848, -27207, -13941, -10859, -13531, -17101, -15044, -25132, -27435, -26735, -17068, -14192, -9651, -5809, -10672, -15980, -13602, -11185, -15751, -7966, -18481, -25184, -20501, -22055, -18480, -14798, -15153, -15370, -10763, -11322, -9580, -4641, 1317, 522, -2420, -6712, -6207, -3885, -5571, -5082, -4493, 1023, 11466, 11406, 5196, 1104, -1938, -765, -5920, -4038, -2556, -4163, -10871, -17699, -27998, -34557, -32402, -28093, -16177, -15339, -21182, -22296, -22403, -21397, -17624, -14452, -12795, -8221, -1981, -6903, -11638, -17372, -20103, -24836, -16200, -10548, -7789, -10476, -11687, -12017, -8538, -9571, -11930, -12064, -8869, -701, -5669, -15539, -13583, -12535, -12419, -4827, -1781, -9557]
15054i557n422m65n310l54L955J91O21l896K243M767k816m022j996K802k491q63
15038b2613j299L181K650k810L784k583l103l046R85P569j777k089K841K078j427
15023a7659r12o074m333P221O231j536L382K637m414k113o553K84l12k014O849
15008a9316L268R86l077j054K316N205M913l767O096o954l362M50l984M077k135
14993a6338J623J1102k68q383j507k440o330q830N396J4273L895l34o608r77N570
14978a0156p780j386j98l07L662J1997Q913n13M625L27K057k79J956p679J600
14963F839N789q34r967P274O531L413K838P31N798R921M266J2917K1313K4181
14949A01010K8792K2282K2470J8824Q704k748r275q979j6967k3988k6112k4414
$$ y = [-9557, -14979, -15444, -20754, -21108, -17153, -16962, -16341, -20237, -17994, -13227, -16043, -20065, -22061, -19259, -21750, -22613, -23912, -20731, -18081, -20891, -17107, -19690, -22793, -25839, -24854, -17285, -19062, -21151, -18310, -16232, -17659, -18571, -24645, -28978, -21757, -15526, -17062, -13680, -11043, -15457, -17570, -24123, -23839, -24151, -26165, -19316, -16048, -15062, -18139, -19193, -16877, -11672, -6759, -10526, -4430, -11384, -14746, -14296, -18280, -14203, -16338, -14715, -3613, -3881, -12264, -13771, -16211, -22541, -31371, -25975, -11702, -7807, -8141, -14749, -15726, -10156, -17936, -19322, -19520, -19827, -16165, -4168, 4745, 4232, 8857, 9184, 11241, 10962, 12918, 5239, 6839, 12628, 11794, 1827, 9101, 15632, 19045, 21883, 22614, 28412, 38333, 42599, 55516, 76829, 101010, 129802, 152084, 174554, 193378, 202082, 199334, 190059, 181080, 164113, 140125, 114013, 89599]
14937H9599k1135j6589j8104j5836p046p409p401j05J443p806m399p93m698p664
14923b7943K547N923K352M540q42J618L657N260Q035L278M233J238m022N43N929
14908A6346M811n669j1917j191l043p38N26J898k169o520m585o919l508q93M454
14893a9117q064q421N38k223L722K071R278J0326J203O218k11l316J0797L665
14879F466O384L403M086k533o199o680m074L162Q5j014j1934j3034R35k186m93
14864b3626J1469l971j6468j4125k408O972R83k03j49L844J0525R174J394j266
14850a7855k498L471J885P70R925R926k936j0520M768n63m604k872J200J5340
14836E437M395q596m359l723L32m903j0539o999K683J805J96k241o26p545N326
$$ y = [89599, 68464, 51875, 33771, 17935, 10889, 3480, -3921, -4026, -2583, -10389, -14788, -15581, -20279, -27943, -25396, -19473, -17121, -12581, -13423, -11805, -8148, -2888, 5147, 8425, 12658, 13896, 9874, 10417, 16346, 21157, 15488, 3571, 2380, -663, -1401, -875, 1023, -1146, -7666, -12251, -19170, -22678, -23571, -19117, -27181, -35602, -35064, -37287, -33565, -31494, -22216, -11890, -10687, -4469, -4680, -7996, 2801, 6466, 12850, 16253, 20339, 17806, 11607, 4927, 853, 4015, 4100, 3086, -8848, -21882, -20947, -23133, -23626, -12157, -16128, -32596, -46721, -49129, -42157, -41174, -41377, -41526, -37682, -27157, -17983, -16589, -17855, -20353, -16882, -14997, -14227, -4302, 5624, 2688, -7832, -3064, -3627, -8231, -11103, -9903, 5437, 9832, 1236, -3123, -6846, -6514, -11417, -21956, -28955, -26272, -24467, -24271, -26512, -27138, -34683, -29357]
14821b9357O574M696L439K26p380K081L379L122P7N683P800J673r456l987j257
14806a2687k427L149J197l868K332M550o695q34p85j502j531J161L704J997r660
14791b1899j293M036q304j934l594O040K879k428k79n359J725R422M049k999l241
14776b3179L580j82Q844J4984m126j1662m093O764N301K571j1330l786P048q21
14762a0087j61J151J304l197n355J155l866j886J0787P498k040L747l90m8N36
14747h52m274j841K298l208q701K193J2900L871l299o984J590N921m1l024o750
14732a0201k356j525n941n377l228O762N18n994N523J3208K104p985kJ1922K171
14717d01n413j031o511o533r127N760O923P949R939j681o366r33K354l747m92
$$ y = [-29357, -22783, -18087, -14648, -14422, -21802, -19721, -16342, -13220, -13143, -7460, 340, 2013, -7443, -11430, -12687, -15114, -11965, -10768, -14636, -12304, -7754, -14449, -15283, -16068, -17570, -19101, -17940, -14236, -12239, -21899, -23192, -19156, -27460, -29394, -32988, -26948, -24069, -26497, -26776, -32135, -30410, -20988, -16939, -19938, -23179, -19599, -19781, -10937, 4047, -79, -11741, -15834, -9070, -3769, -1198, -12528, -16314, -9266, -10087, -10248, -9097, -7793, -10990, -16345, -15190, -19056, -20942, -10155, -2657, -4697, -950, -1340, -1388, -852, -5126, -6967, -4669, -7877, -16578, -14385, -1485, 2386, -913, -7897, -6307, -386, -427, -3451, -10201, -12557, -14082, -20023, -25400, -28628, -21866, -21348, -27342, -21819, -8611, -6507, -14492, -14494, -2572, -401, -5814, -6845, -13356, -19889, -29016, -23256, -16333, -8384, 1555, -126, -6492, -7425, -5071, -8818, -9310]
14702i310J648l914n974m897K100N316J1574J281p671k540K051j2095R89J3740
14688g702L022o681q721l147j046J318N651p28k101P468P742j1006k532J570K945
14673a3948n140K589K053J564p1m838n254P72Q8P063L376K523k596j337j1566
14658b4722K533N866l234N954k5j099p864n529O983Q354l915R0J1658l63p743
14643a3056k444O301m250m668o516J424M278M748J2583L019k390p288J154L683
14629c422K209n421J042l05k997K067k018j377o568k888o727O573r23l794M060
14614b0489Q001R568O474M982l962k517k945K193M283n226p721L852J23r937j3735
14599b7056o022P744K194Q905K289o228N251N495J564l623L488M37L699N246N088
$$ y = [-9310, -7662, -11576, -17550, -22447, -20347, -15031, -3457, -2176, -9847, -12387, -10336, -22431, -21442, -7702, -4680, -11361, -20082, -23229, -24275, -22957, -17306, -18034, -20135, -12667, -4925, -15931, -18463, -16893, -13948, -19088, -16499, -14446, -12882, -12953, -17791, -23045, -22273, -22185, -15122, -11746, -9223, -11819, -13156, -24722, -22189, -16323, -19557, -13603, -13628, -14727, -22591, -28120, -21137, -12783, -16698, -16608, -4950, -5313, -13056, -15500, -9199, -13449, -18117, -24633, -23209, -18931, -14183, -1600, 1419, -971, -8259, -7105, -3422, -1213, -6634, -5592, -5897, -8894, -6827, -8845, -10222, -16790, -19678, -26405, -19832, -20755, -24549, -20489, -12488, -2920, 3554, 8536, 4574, 2057, -888, 1305, 5588, 362, -7359, -3507, -3384, -13321, -27056, -33078, -25334, -23140, -14235, -11946, -18174, -12923, -7428, -5864, -9487, -5999, -5562, -1863, 3383, 8471]
14584H471K372M264P48J2778J2619K0363J9806L7645M8944O7325P0893O2863K7616
14571C96707k871j8041l6176n9291o7126n3150l9311k8129j6086j9074r996q660
14559C8796j3956m326k817j1791j884l912o385n880m315M563m485L877N120J796
14545e599K347k254o47l572j813k189J023N907N976J179K879n419n313p240k523
14530a7258O99m154J344j073O05J779n69Q9m240M757L011p22J393K156M551K267
14514e365M25o99q203o95k058l335k972l67O94L882Q232L214J200k295n740J602
14498a2480R367N420l042m498l66L600q64O312J6035J2950J113j1674j612J0239
14484C0500n214j6781m133n412p366N406J248q305j3759q706J1700J646j296K369
$$ y = [8471, 10843, 15107, 15855, 28633, 41252, 61615, 81421, 119066, 168010, 235335, 306228, 369091, 396707, 393836, 375795, 339619, 280328, 213202, 160052, 120741, 92612, 76526, 57452, 47456, 38796, 24840, 20514, 17697, 5906, 4022, 110, -6275, -12155, -16470, -11907, -16392, -12515, -7395, -5599, -3252, -5506, -6153, -9725, -11538, -13727, -12704, -6797, -821, 358, 3237, -2182, -7495, -14735, -17258, -16559, -20713, -19369, -20442, -19837, -18058, -18627, -18538, -22778, -18021, -15010, -15732, -14339, -12183, -7632, -5365, -4940, -5639, -13842, -14537, -16595, -19930, -22902, -23269, -22575, -18693, -10461, -7247, -6047, -8342, -14082, -12480, -3113, 2307, -735, -5233, -5599, -1999, -2863, 3449, 19484, 32434, 33547, 21873, 20261, 30500, 25286, 8505, 4372, -1040, -8406, -3000, -1752, -10057, -23816, -32522, -20822, -19176, -20472, -18103]
14470a8103N65l81O36J966N646J033p659n448M526l911o438q87n997k944J620
14455c5776K401N394J109R558K63j485k175k500J275k607j358J301J957L967L213
14440a5463o63O342J3274k621m011l080k405k903o663J250K294K139J495r683
14426b0698n232N190l605j269O184N244J81N520k523r096q091O195P121j148q827
14411b4854M309R67j177N19m893j219M741K956P974K882k256l504M482K628r31
14396g376m80j188m750n945Q564M875m182K673j1333j6312N880J5311L135J211
14382i917O05q101Q32J603k094K697l345J32M375J997K631r017O494K405p52n772
14366a5227J751L401j0771J118J517K720K04j033K401J813J414m59K031k446K571
$$ y = [-18103, -17538, -17919, -17283, -15317, -9671, -8638, -16297, -21745, -17219, -21130, -27568, -28455, -34452, -37396, -35776, -33375, -27981, -26872, -17314, -17051, -18536, -20711, -23211, -21936, -24543, -25901, -24600, -22643, -18676, -15463, -16126, -9784, 3490, 869, -3142, -6222, -8627, -11530, -18193, -16943, -14649, -12510, -11015, -20698, -25930, -20740, -24345, -25614, -19430, -14186, -14005, -8485, -11008, -20104, -28195, -22000, -14879, -16027, -24854, -20545, -19578, -20755, -20236, -25129, -26348, -21607, -18651, -10677, -7795, -10051, -13555, -9073, -6445, -7376, -7856, -9044, -13794, -19739, -11175, -6300, -10482, -7809, -19142, -35454, -29574, -14263, -11128, -9917, -9312, -17413, -16581, -14978, -17072, -14375, -17720, -17588, -13213, -11216, -8585, -17602, -11108, -8703, -9455, -15227, -13476, -10075, -20846, -19728, -18211, -15491, -15287, -16320, -13919, -12106, -10692, -11151, -9120, -11566, -8995]
14351h995l969r37M18j158J685L718l362K557M763k215J846J209n153l015n730
14336a8338r9J397m27N0M009N686k075r774j874q26q928j448J196J09P18O474
14320b4150J2477K519r76j365m006J583N055k396Q153k3M122q963o740M489p315
14305a7536o807J661Q41P354M153j816j270P00k467L105r14Q54K75Q195O244O851
14289I423k735p903J745j365L659j984l208k658j0065j012L736Q812P201k452
14275A194j5372n335j991J901J869N703N231K425K787K756o165l776K236P908
14261A371O415J1245M454P224K824K114n760j8699j4435q469J280O152L720P5
14247d89k635j2018k657J799K067J093k631k728l325J505M008o346j575l17l700
$$ y = [-8995, -12964, -13901, -13483, -14641, -12956, -9238, -12600, -10043, -5280, -7495, -5649, -4440, -9593, -12608, -18338, -18437, -17040, -17467, -17417, -13408, -7722, -9797, -19571, -21445, -22271, -31199, -32647, -31451, -31342, -30624, -24150, -11673, -9154, -10130, -11495, -15501, -13918, -8863, -11259, -3106, -3129, 993, -7970, -14710, -10221, -17536, -24343, -22682, -21841, -14487, -10334, -12150, -13420, -12720, -15187, -12082, -12996, -12142, -11867, -3672, 2572, 9423, 6688, -1215, 530, -835, 2824, 840, -2368, -5026, -15091, -16103, -12367, -3555, 3646, 1194, -14178, -19513, -21504, -19603, -17734, -12031, -6800, -4375, -1588, 1168, -4997, -8773, -6537, 1371, 7786, 19031, 23485, 30709, 33533, 35647, 29887, 11188, -3247, -11716, -10436, -4284, -564, -489, -3124, -15142, -17799, -16000, -13933, -12840, -15471, -18199, -21524, -20019, -16011, -22357, -23932, -24249, -27949]
14232b7949L149L949M59K750R973j054p564k267k194L236O508R006j669j1121
14218a4788k651N361J645j729j966k61j282M386r877K267Q033J176r513k146l903
14203b5248P353M641J192J688J110L915l504o866l375J306K672N827l91l818k095
14188a5593r40l043m304k079o178K396O058j197k920O762J485j238o520k402L075
14173b6638O957N154m928p289L789J736O9j328L572k118K8m728M965N667N2j0226
14157b5266n638r12O822l812l372o597L951J4489J428k291M685n001o0M036r10
14142a8448K61m817J799J67n929O998K293N799R921j729n242Q68M445j3696l030
14127b0340Q532L98l084N89j880j1065m808O766N807L370j630m728J735R711k80
$$ y = [-27949, -24800, -20851, -20392, -17642, -7669, -8723, -16287, -18554, -20748, -17512, -11004, -1998, -3667, -14788, -17439, -12078, -10433, -12162, -14128, -14389, -15671, -11285, -21162, -18895, -10862, -9686, -19199, -21345, -25248, -17895, -13254, -12062, -10374, -9264, -5349, -8853, -15719, -19094, -17788, -15116, -9289, -9680, -13498, -15593, -16533, -19576, -23880, -25959, -32137, -29741, -23683, -24880, -27800, -21038, -19553, -20791, -27311, -29713, -26638, -19681, -14527, -19455, -26744, -22955, -21219, -21150, -22478, -18906, -21024, -20996, -25724, -20759, -15092, -15040, -25266, -30904, -31816, -24994, -28806, -32178, -38775, -34824, -20335, -18907, -21198, -16513, -21514, -21574, -17538, -18448, -18187, -23004, -21205, -21038, -26967, -19969, -17676, -11877, -1956, -3685, -8927, -8059, -3614, -17310, -20340, -11808, -11410, -14494, -13905, -15785, -26850, -31658, -24892, -19085, -15715, -17345, -22073, -20338, -10627, -10907]
14112a0907l289N770k500M6J253J743n06M098J1006K13l283j257n973r574n972
14097a9132L895q517l709k184Q353j935m970M852O678L799N64p421N22j731K959
14082a7977k89K39K560n4m566k90R01J831J831l884m245L706P164M641p128j752
14066a7312J060O191k731k667r71J421l192p343j306L619K261M966K368p275j364
14051b2275k990N267N10l579L630J88n80k042n01N50m198L659Q351P588N099L818
14035B495o224l555K300P51l441J719r98k090M505J643j569m470j922k531m354
14020a7741L39K743O749k743q646l879N144J351P312n660r121K851j533M584j65
14005a8415n406J684L590Q826J2623O221m568j4567q609l722P269M323j361o045
$$ y = [-10907, -14196, -8426, -10926, -10880, -9627, -7884, -8390, -4292, 6714, 6927, 3644, 2387, -3586, -13160, -19132, -15237, -23754, -27463, -29647, -21294, -23229, -28199, -23347, -16669, -12870, -12306, -19727, -19205, -20936, -17977, -18266, -18027, -15467, -15521, -20087, -20377, -19476, -17645, -15814, -19698, -23943, -20237, -13073, -8432, -15560, -17312, -16252, -10061, -12792, -15459, -16430, -15009, -18201, -25544, -26850, -23231, -20970, -16004, -13636, -20911, -22275, -25265, -19998, -19488, -23067, -19437, -19249, -19829, -21871, -22372, -21822, -26020, -22361, -14010, -6422, -1323, 2495, -3729, -7284, -4984, -4233, -7674, -5955, -6953, -9043, -4538, -2895, -4464, -8934, -10856, -13387, -17741, -17402, -14659, -7910, -10653, -19299, -23178, -18034, -16683, -9371, -15031, -24152, -21301, -22834, -18250, -18415, -23821, -22137, -18547, -9721, 2902, 9123, 4555, -10012, -18621, -22343, -15074, -10751, -12112, -18157]
13991a8157K864J568M644K567M167q78o876n478k253l697M961q03P754M953k897
13976g561n47J19J173k65j0024O4K896l502o165J222L044M021K70J45M6K405M963
13959g696m22k351k424k464k510j111P071R49q81M951k097o389o619L100Q979
13944i914K363j473o101o19K649m94m47%J224N56o816p511L994J159n573l099
13928c0102R5L97N287n583n047M482P445O582O100K626p897k391J320n56L52R874
13912g016O812R60j0805o512M085K495l898k511J928K902J332l573J285J1460
13898a056O399j600j726k823J325R141J672n845n955n064M933k296l216m065n727
13883a5903j0421Q240M934L953K385O251L358m189r965L869m898m971M731M085
$$ y = [-18157, -15293, -13725, -9081, -6514, -2347, -3225, -10101, -15579, -17832, -21529, -16568, -17371, -9617, -4664, -7561, -8108, -7989, -6816, -7081, -17105, -17041, -14145, -17647, -23812, -22590, -19546, -15525, -15255, -15110, -15064, -12659, -7696, -8118, -10469, -12893, -15357, -17867, -18978, -11907, -10958, -11839, -6888, -8985, -15374, -21993, -18893, -9914, -7551, -9024, -15125, -15744, -13095, -13589, -14036, -14036, -12812, -12256, -19072, -26583, -22589, -21430, -27003, -30102, -30007, -29610, -24323, -29906, -34953, -30471, -23026, -16444, -10344, -7718, -15615, -18006, -16686, -17242, -16890, -7016, -204, 756, -10049, -16561, -12476, -9981, -13879, -16390, -14462, -11560, -10228, -13801, -12516, -1056, 5343, 3743, 2017, -806, 519, 9660, 11332, 5487, -468, -5532, -599, -2895, -6111, -10176, -15903, -26324, -18084, -13150, -9197, -6812, -561, 2797, -1392, -11357, -7488, -12386, -17357, -12626, -8541]
13869h541L173L086o41k813j263p180j017p74o20J630Q451L483l531k562n950
13854a5069l69J910M427k571O21J792j127N79j116q670l105K213J0064k53L233
13839g441J0312k916j122j063k521r1J0031N90p82n279R51j4514j3617K052K875
13824b2535k049o78J559L515R662o361J805j616n438p83L538K471M437M55m579
13809a6597R2K115q642k483m22L424R784Q370o136J019O619p069q502l882l181
13794b5491M633J1783l456q915j904j929K125L640J179J092J83J24m55N837Q1
13779a1473L367J970m158m791Q65O554m133p589N120J777O8l60M110j383L215
13764f841L766P30M51n248k846P041m890l222J869M369K367J297N50P36N907p63
$$ y = [-8541, -5368, -2282, -2923, -5736, -6999, -14179, -15196, -15970, -16590, -14960, -6509, -3026, -6557, -9119, -15069, -15438, -13528, -9101, -11672, -11051, -9259, -10386, -9807, -10923, -19593, -22698, -20485, -10421, -10674, -7441, 2871, -45, -1167, -2230, -4751, -4842, 5189, 5779, 4997, -282, 669, -13845, -27462, -25410, -22535, -24584, -25262, -23703, -20188, -10526, -16887, -15082, -16698, -22136, -22919, -19381, -16910, -12473, -12018, -16597, -16505, -14390, -23032, -25515, -25937, -22513, -12729, -4359, -10495, -9476, -2857, -9926, -18428, -22310, -25491, -20858, -9075, -12531, -21446, -23350, -25279, -23154, -19514, -18335, -17243, -17060, -16936, -17391, -11554, -11473, -8106, -6136, -10294, -15085, -14220, -7666, -11799, -19388, -14268, -12491, -12423, -12783, -8673, -10056, -6841, -3075, -2345, -1894, -7142, -9988, -2947, -7837, -11059, -9190, -4821, -2454, -1157, -607, 129, 6036, 5273]
13748E273j019j137k985l05K607l799K419J2341P078J738M68L168j74j1640l319
13733A0714o840j257r04p622O478J0669O28j213m264j2658m482n792j2996m392
13719c3931O522J852M83M164J1119Q049M733L8J73m217j82Q88J773m50K677Q641
13703A2332J0845J5626J9957K2873J3686J5236J2162J0200q863k2624k9865j9614
13691E1951j1161q091j1784j0726J172m944j1781l256N876R1m900m029M742N835
13677a005O425K848n740J271P48j227j065r048J835J0874M698k277k687j356J778
13662F072K711j326J771J3124M368o881o313P991O484m56m75Q216L771L66M208
13647D3631R748J5104R751Q168J1841J3595K7633L4089L7221M2131L9085K3274
$$ y = [5273, 4254, 3117, 132, -173, 2434, -1365, 1054, 13395, 20473, 22211, 22679, 25847, 25673, 14033, 10714, 3874, 2617, 1713, -5909, 569, 11238, 11866, 10653, 6389, -6269, -10751, -16543, -29539, -33931, -27409, -25557, -25074, -20910, -9791, -1742, 2991, 3029, 3202, -1015, -1197, -309, 1464, 1014, 3691, 12332, 23177, 38803, 58760, 81633, 95319, 110555, 122717, 132917, 124054, 101430, 71565, 51951, 40790, 32699, 20915, 10189, 11361, 6417, -5364, -8620, -2744, -2653, -7553, -11582, -6840, -1005, 5420, 8268, 2528, 3799, 4547, 3320, 2255, -6793, -4958, 5916, 10614, 8337, 5650, 4294, 6072, 8783, 7457, 9228, 22352, 26720, 19839, 13526, 21517, 28001, 27545, 27070, 35286, 39057, 39423, 43631, 53379, 68483, 78234, 86402, 98243, 111838, 139471, 173560, 210781, 252912, 291997, 315271]
13635C15271K9011L8006K5843K3992K2796K5720M1099P2238J39693K30453L32127
13624A296249M12257L98363K75585Q2046r3651k10585l04229l63014l54561k86205
13614H52255k09178j48488r3716p2893n9173m8964k9616r866j8402k4914j5292
13603A21753j5199j9080k1918j3751j017n734K54J83l466m041j7485p577L49L543
13589A6814Q25j508J922l36l633L46m278k819J070n130j353m373R26R562R321
13574A7356L105M373r264m073O70K921L490j290j0556k430j20j156K245m598j829
13559a156k298J718q798n76J618n495N322P864R485n059j722Q168L180m469l279
13544D503N163L883j767p37k909q114L504J518O59l186m069J02j080J0329P59
$$ y = [315271, 344282, 382288, 408131, 432123, 454919, 480639, 521738, 593976, 733669, 964122, 1296249, 1708506, 2106869, 2382454, 2464500, 2370849, 2160264, 1856035, 1493021, 1138460, 852255, 643077, 494589, 400873, 327980, 268807, 219843, 190227, 180361, 161959, 137045, 121753, 106554, 87474, 65556, 51805, 50788, 45054, 45308, 45491, 42025, 37984, 20499, 12922, 13271, 16814, 17639, 16131, 18053, 17717, 14084, 14430, 10152, 7333, 8403, 3273, 1920, -2453, -1527, 8035, 17356, 20461, 24834, 15570, 11497, 12167, 15088, 18578, 17288, 6732, 4302, 4182, 3026, 5271, 673, -1156, -3454, -1736, -10534, -11110, -9492, -14987, -9665, -1801, 7684, 2625, 903, 9071, 12251, 7782, 4503, 9666, 13549, 11782, 11045, 8136, 22, 3526, 5044, 5703, 2517, -1552, -1450, -2530, 7799, 8558]
13529H558L959J882l052M416Q43l916p839mn685o540n698j054P472N990m573O293
13513A052m786J259P5q887q733K229J0034J303l318k57R775M4m832j781n896L435
13497i284O16K082k983j0367J0502L710m679j338P811n235j2935O450K061P4K559
13482a0956M151P764K572m151n715k687j917l341j180o425M210l916m500L357
13468b2734N457p133m606J904N619j780P242j908l615J535J372k274R878O21m389
13453a4811n11k336O619l748J0459J0584j644n078m290k832n150K531J5864O014
13439A1671j0911o115o612k337k458k261k236J917N312O501L054l622J217k333
13425i213J33p327k357N685P615L636k24m293K246p148k908J903L125j641k863
$$ y = [8558, 12517, 14399, 11347, 15763, 16606, 12690, 4851, 4847, -838, -7378, -13076, -14130, -6658, -668, -5241, 1052, -3734, -2475, -2400, -11287, -20020, -17791, -7757, -6454, -9772, -10029, -254, -210, -5042, -6823, -12719, -9284, -8668, -6586, -9569, -19936, -9434, -5724, -10403, -11741, -3930, -9165, -22100, -15650, -13589, -13515, -10956, -6805, 959, 3531, -620, -6335, -9022, -10939, -14280, -15460, -21885, -17675, -21591, -26091, -22734, -17277, -24410, -29016, -27112, -21493, -23273, -16031, -17939, -21554, -20019, -18647, -20921, -11043, -10422, -14811, -15322, -17658, -11039, -14787, -4328, 6256, 4612, -466, -4756, -7588, -12738, -10207, 5657, 11671, 760, -5355, -11967, -14304, -16762, -19023, -21259, -19342, -14030, -7529, -4475, -8097, -6880, -9213, -9080, -16407, -18764, -13079, -5464, -1828, -2052, -6345, -4099, -11247, -14155, -12252, -9127, -10768, -13631]
13410a3631L099O936J4437m66J932l758P75o96k39L532K023p750r727k638R575
13395C404K335o732o653q98R982K397n859m819k799P306j176o141L238L712J728
13380i75j198J137O9J220K985L087P072o652K935O744R94m317o000K446R582O833
13364B5962n188m786m288K793L357p798j451l370o830p235L909O768j723J365
13350A485P218N309m987n593o3N043O494l169L746Q908K165N233J7338R387K2999
13335H1513J8030J8188L183K555m723j6170q687r035j8844n791p393j1871N51
13322D1506J5243J1826J3127K1462K7498J9167J961j0561r206j0882k3250k6481
13310G1410j9777p028o258M319J772j0174P360P835R007K0718J5592J2295K2379
$$ y = [-13631, -10532, -3596, 10841, 10375, 12307, 8549, 9324, 8628, 8389, 11921, 13944, 6194, -3533, -6171, 3404, 5739, -993, -7646, -8544, 1438, 3835, -2024, -6843, -9642, -2336, -3512, -9653, -6415, -2703, -975, -2173, -1036, -967, 253, 3238, 6325, 13397, 6745, 9680, 16424, 17418, 13101, 7101, 9547, 19129, 25962, 20774, 15988, 11700, 14493, 17850, 10052, 8601, 5231, -1599, -8834, -4925, 1843, 120, 1485, 8703, 14012, 9025, 3432, 3369, 8412, 14906, 11737, 15483, 24391, 26556, 31789, 49127, 58514, 81513, 99543, 117731, 120914, 123469, 118746, 102576, 93889, 84854, 66010, 60219, 52826, 40955, 41506, 56749, 68575, 81702, 103164, 130662, 149829, 151790, 141229, 132023, 121141, 97891, 71410, 51633, 44605, 38347, 42666, 44438, 34264, 41624, 49459, 58466, 79184, 94776, 107071, 129450]
13297A29450J9695J713j7227k1043j6222j8236k4661m366k928o331K141k063j250
13284C8672J1603J5721J5562J2921J7108K1133R36j2728m801p293k0552k1372
13272F6910j6952q853j829m779j1952j0107N857J985o358j1578K100K258Q26l306
13258D222J900j026l616k32n50P137J3873m905p198R52r00O022P216O557M428
13243C3880r152K5J907j2829j1892k286J0144k861j3436K52L506J766L539O58
13229C221N468J1316J6693J4282K174L636q320p089O02P459N799J0100J4365Q785
13215H8491M392O753J2896J7391K8492L6203M6485O0121J09994J80142K42338
13204H33698K74554K24899R9511j4170j02122j65630k10251k30456j94230j32245
$$ y = [129450, 149145, 150858, 133631, 112588, 96366, 78130, 53469, 49103, 46175, 39844, 41985, 39922, 38672, 50275, 65996, 81558, 94479, 111587, 132720, 133656, 120928, 116127, 108834, 88282, 66910, 49958, 41105, 39276, 34497, 22545, 12438, 18295, 20280, 13922, 2344, 4444, 6702, 7528, 4222, 6122, 5096, 1480, 1248, 698, 7835, 21708, 16803, 9605, 10557, 9657, 15679, 22895, 29452, 33880, 24728, 24753, 26660, 13831, 1939, -347, 9797, 6936, -6500, -6248, -2742, -976, 2563, 3221, 8689, 20005, 36698, 50980, 53154, 56790, 48470, 41381, 41983, 49442, 55241, 65341, 79706, 88491, 92883, 99636, 112532, 129923, 158415, 194618, 241103, 301224, 411218, 591360, 833698, 1108252, 1333151, 1432662, 1418492, 1316370, 1150740, 940489, 710033, 515803, 383558]
13194C83558r0906n8172m0435k8915k7812k7059j4984m606p390j3768J4N712l072
13181G2165N357K236P14P963Q970J5482J4586J4168J2978J3358J3871K1735K4686
13168B28269L9662N4947O7559P7648J15896J78168K83042M62322O93756Q69430
13158C070699Q04321M66639M2527k59867m61223o25092p07823o40141m72039l09107
13148I08894k00013j41465j06278p5171n8649m4662l8748k7952j2642j6682j4133
13137A72499j5899n286m810p269J689L660J9119J9592R481J2932K0469Q080J7642
13124B51899J7862L1504M2191O4087Q4510J10050J69698K50802M10639O51813
13114B085055Q59383Q63066N69116J36335k04602m34041o14735p34547o89899
$$ y = [383558, 292652, 234480, 194045, 165130, 137318, 110259, 95275, 90669, 83279, 69511, 69525, 75237, 72165, 77522, 79758, 80472, 88435, 97405, 112887, 127473, 141641, 154619, 167977, 181848, 203583, 228269, 267931, 322878, 390437, 468085, 583981, 762149, 1045191, 1507513, 2201269, 3070699, 3875020, 4341659, 4384186, 4124319, 3663096, 3038004, 2330181, 1690040, 1218001, 908894, 708881, 567416, 461138, 385967, 327318, 282656, 243908, 215956, 203314, 186632, 172499, 156600, 151314, 146504, 139235, 140924, 144584, 163703, 183295, 192776, 205708, 226177, 234257, 251899, 269761, 301265, 343456, 407543, 492053, 602103, 771801, 1022603, 1433242, 2085055, 2944438, 3807504, 4376620, 4512955, 4308353, 3874312, 3259577, 2525030, 1835131]
13105A835131n22680l57708k30398j48906j04844p4192o6908n4935m6687l1656
13095A96217k5153k3773q828j3087j4804j275j298o72N871o722q694L158P929
13082A08869P321N693l254m174P120J9998J5157K3485L7523N1130P5471J25254
13070D69593K05336K84029K90084K03645P9892m4149j32982j94053k27171k32385
13060G01839k00194j38559q1813n4547m0754l1878j9961j7504k0138r689p385
13049G9417j2961n910j0256J523K412j0234j1555n667m514n241n747N061L889
13036B0217l479j833Q214O535L382n077L21R218P654K438P96P092Q478J4843J4002
13021I2801J2195O821k779o379j5205j6721j4093j5152L940N793J4108J7683R542
$$ y = [1835131, 1312451, 954743, 724345, 575439, 470595, 396403, 329495, 274560, 227873, 196217, 171064, 147291, 138463, 125376, 110572, 109297, 107999, 107327, 113198, 106476, 97782, 100940, 108869, 116190, 121883, 118629, 114455, 121575, 141573, 156730, 180215, 217738, 268868, 344339, 469593, 674929, 958958, 1249042, 1452687, 1532579, 1488430, 1355448, 1161395, 934224, 701839, 501645, 363086, 281273, 226726, 185972, 154094, 134133, 116629, 96491, 86802, 79417, 66456, 60546, 50290, 51813, 54225, 43991, 32436, 26769, 22255, 17014, 11267, 16328, 20217, 16738, 14905, 23119, 29654, 33036, 27959, 28280, 37498, 45152, 47590, 48386, 55478, 63956, 78799, 92801, 104996, 111817, 109038, 102659, 87454, 70733, 56640, 41488, 45428, 51221, 65329, 83012, 92554]
13008I2554k863j034j0223j6104j9723r479k875L178K095j475l526r580j0816
12995A0129l175K797N660M020L36J612O043L498j328P078Q205M957J3753o72q789
12980E4124m494o599r279m727j994M236J1238J9536J5139J922M984l499q994o637
12966F4956m863j2910j0410l646J256K415l324l274j0545o353k740m85K53p367
12952B963l191K947o70J04L921L304K519j37m259K225R269Q440J187M099L01o077
12936B6945Q632m647j3560q642M278N32j830l446j006N913K591J797l159j47o52
12921A3599m369P630m0j547l402l657q914J16M827l244m294M50p097q639O126
12906a2455K023M294K084P673L628P32J761L423l747o904J506m448M469M455p012
$$ y = [92554, 89691, 88657, 78434, 62330, 42607, 33128, 30253, 33431, 35526, 34051, 30525, 20945, 10129, 6954, 9751, 15411, 19431, 19767, 21379, 27422, 30920, 29592, 36670, 44875, 49832, 63585, 62913, 54124, 49630, 43031, 33752, 29025, 27031, 31267, 42505, 62041, 77180, 79102, 84086, 80587, 71593, 64956, 60093, 47183, 36773, 33127, 34383, 36798, 33474, 30200, 19655, 13302, 10562, 10077, 10330, 2963, -228, 2719, 2049, 2153, 6074, 9378, 11897, 11760, 7501, 9726, 18995, 27435, 28622, 32721, 33022, 26945, 35577, 30930, 17370, 8728, 13006, 13538, 11708, 8262, 7256, 13169, 15760, 17557, 14398, 14251, 13599, 9230, 16860, 16820, 15273, 11871, 8214, -700, -584, 4243, 999, -3295, -2845, -9942, -18581, -12455, -10432, -6138, -4054, 3619, 7247, 7979, 9740, 13163, 9416, 2512, 4018, -430, 4039, 8494, 1482]
12891A482L732Q13m241L70M935J587M844k78q330j797m017k439q187n440p273
12876b4239q11O723L372K995O804K285l033k18K795J442m208n166O426J981m245
12861g097o884O13J656o39M997R487l4k365J842P298J6581J4177R770J225Q076
12846E8703P535n826j273j0929k2973j5944o336m764q860J910N009L800P026L264
12832A0342J724j0771J624R752N733r072o105j2436k315M316m873J0446K478O61
12818A504N716K831J903o046P08n32K83m807O880J5525K039M524M255m62N350
12803C9671l987r158j0367j361J2572J1107N515Q077O194R50l27q802o652j5164
12789B8268r575Q6O55q60r413Q590K089o173k232L792K462m54j240L961J217k949
$$ y = [1482, 5214, 6027, 1786, 2156, 7091, 8678, 13522, 13244, 4914, 3117, -900, -3339, -11526, -16966, -24239, -25050, -18327, -14955, -11960, -5156, -2871, -5904, -6122, -3327, -1885, -6093, -11259, -4833, -2852, -7097, -13981, -13368, -11712, -12351, -7354, 2133, 2099, -266, 1576, 8874, 25455, 39632, 49402, 50627, 58703, 66238, 60412, 59139, 48210, 25237, 9293, 2957, -1807, -10667, -8757, -3748, 52, 7078, 10342, 12066, 1295, 2919, 12671, 18404, 9332, 3227, -9209, -11524, -7208, -12081, -1635, 843, 1504, 7220, 10051, 11954, 5908, 6616, 6084, 6367, 1560, 8440, 23965, 26004, 30528, 34783, 34321, 39671, 35684, 26526, 16159, 14798, 27370, 38477, 43992, 52069, 58263, 59213, 58886, 50084, 43432, 28268, 18693, 18779, 19434, 18574, 9161, 17751, 19840, 13667, 11435, 15227, 17689, 17235, 15995, 19956, 21173, 18224]
12773A8224k047j359l835j541L574M071K988q864j1518j134P897K921p230k510
12759c63L651K826P656K991q190m894K417J0711K925J942P9m013o441m568M487
12744A1216M249L866k150J321L247n77l229L74M061J923J299L049J1228J2246
12730E2123Q683r91j6899j9100o281Q60L47K162R867J858n270K346j0998o096
12716A2611j676j662Q618J436k85J428j430p640J113N782N014P645M261k705q360
12701B4150N222J145j2026n696j893l224M813O772L792l451J0092J1319L749J453
12687D6217J804o927k293n783p354p904K238j918r556l401L99P584P790K103P731
12672C0730q120j6938m708M769l593k914K932Q829p955l845L945N729j296M926
$$ y = [18224, 16177, 14818, 10983, 9442, 13016, 17087, 20075, 11211, -307, -1441, 6456, 9377, 2147, -363, 3288, 6114, 13770, 16761, 8571, 3677, 6094, 16805, 19730, 21672, 21751, 17738, 11297, 6729, 11216, 15465, 19331, 17181, 18502, 21749, 21172, 17943, 18317, 22378, 24301, 25600, 28649, 39877, 52123, 60806, 59815, 42916, 23816, 17535, 18395, 18742, 20904, 30771, 32629, 27359, 29705, 18707, 12611, 10935, 9273, 17891, 19327, 19042, 20470, 19040, 11400, 12513, 18295, 23309, 30954, 35215, 32510, 24150, 29372, 30517, 18491, 12795, 10902, 7678, 12491, 19263, 23055, 19604, 29696, 41015, 44764, 46217, 48021, 41094, 38801, 33018, 25664, 17760, 19998, 18080, 8524, 5123, 5522, 13106, 20896, 22999, 30730, 22610, 5672, 964, 5733, 2140, -774, 2158, 10987, 3032, -813, 3132, 8861, 7565, 12491]
12658A2491j803K382N645J908N201k856o193r07O419L579l451n430J786O009J0376
12643C5156L773p0l478m672N193L09j1892l454m01r76o087l635P558K952m884
12628A5392j159k45M029K246n357l603K307j059k139N216R02L980Q707n689o854
12613A6674M271J929K19M202J913q569P366M986Q96k368m80m683K97J0458k537
12598C4574n585J987L163m78J281n262m073N298n584M907j709q313k392k776n184
12583I854J3169J3786l963j1338o968k395M25N986O173M849n723p559J875o638
12569A1533L863M206j44p14K575J644k637N540M419Q779k530j3485K441M964j597
12554B8857K122M557L949q379p183l30K00n99K974l451k109r55k726k367k75N862
$$ y = [12491, 10688, 13070, 18715, 20623, 25824, 22968, 16775, 15868, 22287, 25866, 22415, 16985, 18771, 24780, 35156, 38929, 38859, 35381, 30709, 35902, 36211, 24319, 20865, 20464, 19488, 13401, 9766, 17324, 20276, 15392, 14233, 13988, 18017, 20263, 14906, 11303, 13610, 12551, 10412, 15628, 16530, 20510, 29217, 23528, 16674, 20945, 22874, 23093, 27295, 29208, 20639, 28005, 32991, 33887, 31519, 31039, 26356, 26653, 37111, 34574, 28989, 30976, 34139, 33661, 34942, 29680, 25607, 30905, 25321, 30228, 28519, 20206, 17814, 15038, 9854, 23023, 36809, 32846, 21508, 14540, 12145, 12570, 18556, 24729, 29578, 23855, 16296, 18171, 11533, 15396, 19602, 19458, 18744, 21319, 22963, 20326, 25866, 30285, 39064, 36534, 23049, 25490, 30454, 28857, 30979, 35536, 39485, 31106, 23923, 23593, 23793, 23194, 26168, 22717, 20608, 19653, 16927, 14560, 14285, 20147]
12538B0147m157R54N690N970K424L361n052n534j090P335J066k017N392K71j0696
12523B4064k953l150P168P580J675N926L512l954L527N370J297r253l799O83L14
12508C8007m789n250j293M069J2963J704p030q48K123j03K871j025o10K63L067
12493D4119q67M829l57k424M271M761j059M368k295n536J099N231m145r710n060
12478C7225j807r8O667j720k051Q82P798J0520n666n705k21j641o792O176R690
12463E3257R13l739j517M865k404Q459J489l947K048n109J684M637Q995L50J222
12448G1203M090L830L334K849L428L048K901j063j0215j8126j2692l873j228m268
12434D3218Q99Q933L053K792O342R972O496K139O322J332J220k215p260o591l579
$$ y = [20147, 15990, 16944, 22634, 28604, 31028, 34389, 29337, 23803, 22713, 30048, 31114, 29097, 34489, 34760, 24064, 21111, 17961, 25129, 32709, 34384, 40310, 43822, 39868, 43395, 48765, 50062, 40809, 37010, 37693, 38007, 33218, 27968, 26675, 30744, 43707, 45411, 38381, 37533, 39656, 39553, 42424, 41399, 40789, 41052, 44119, 43252, 48081, 47724, 45300, 49571, 54332, 53273, 57641, 55346, 49810, 50909, 56140, 51995, 42285, 37225, 35418, 35320, 41987, 40267, 38216, 39098, 46896, 57416, 51750, 46045, 45824, 44183, 37391, 43567, 53257, 54170, 50431, 48914, 53779, 51375, 59834, 61323, 57376, 59424, 54315, 55999, 60636, 69631, 69981, 71203, 75293, 79123, 82457, 85306, 88734, 91782, 94683, 93620, 83405, 65279, 52587, 48714, 47486, 43218, 44117, 53050, 56103, 58895, 65237, 75209, 81705, 83844, 90166, 91498, 92718, 90503, 83243, 76652, 73073]
12419G3073M412L316J0410K600O161P596J7766P200J3819J1340J2146K0533J8492
12406B08864K1109J8826K3036J8002L0318M3389N2843P2120J01946J36288J69207
12395H95948J99174K11458K02773J90448J56361Q9713K2532n2924j15085j61700
12385A638698j91121k01993j99340j84375j61698j36296r9996o7320m4421l8046
12375C14092k9273j6978k5825k2443j4985l673j0674j7433j0051o8m392j4712
12363A43585p329k912r499p551L056r3m238j414P14R73J101P75k726k290K271
12348A14423k714j1916k879j809M92Q12n276o731N18k476M573P82L150O359J324
12333I8632k970m927o872m264P484M384j305r06l063p191j84O666j501j616j2336
$$ y = [73073, 77485, 80801, 91211, 93811, 99972, 107568, 125334, 132534, 146353, 157693, 169839, 190372, 208864, 229973, 248799, 271835, 289837, 320155, 363544, 416387, 488507, 590453, 726741, 895948, 1095122, 1306580, 1509353, 1699801, 1856162, 1945875, 1968407, 1915483, 1800398, 1638698, 1447577, 1245584, 1046244, 861869, 700171, 563875, 463879, 396559, 352138, 314092, 284819, 267841, 242016, 219573, 204588, 200915, 190241, 172808, 162757, 162689, 158297, 143585, 136256, 133344, 123845, 116294, 119350, 119257, 115019, 113605, 114319, 115292, 116393, 117168, 114442, 112152, 114423, 111709, 99793, 96914, 95105, 95597, 96409, 91133, 84402, 84920, 82444, 87017, 87799, 90949, 97308, 98632, 95662, 90735, 83863, 79599, 87083, 91467, 90162, 89256, 86193, 79002, 78818, 85484, 83983, 82367, 70031]
12318G0031p047P283P839K455L060M254l065K020O673J027J683m25K697J0199
12304A08684J0740p808p371P557Q324L436j272l611p104N855Q054L736o929j2359
12290A09932M437M106l986M215O221K526M674l413j2668q676o751m654q274J759
12276H9448k930l795O519R662K319l186J887J1390J217m302o667j177K194r000
12262I3579n554m97Q45q909l183j272M692L890M94P876J2746L851O720J3034J4614
12247A42926j945K088P924J4529J3488N191O59N51J3543J0337Q927R735P229R190
12233B44372R277J5295R616P706K336J0621J5899J4298J5017J7987n064o171k989
12220C48200o477j2087j1877k9931k1254j6444j0963m834J936l104q03Q668L3152
$$ y = [70031, 62984, 70267, 78106, 80561, 83621, 87875, 84810, 86830, 93503, 94530, 96213, 95788, 98485, 108684, 119424, 111616, 104245, 111802, 120126, 123562, 122290, 118679, 111575, 117430, 125484, 129220, 122291, 109932, 114369, 118475, 114489, 118704, 124925, 127451, 132125, 128712, 116044, 107368, 100617, 95963, 87689, 89448, 86518, 82723, 89242, 98904, 101223, 98037, 99924, 111314, 112531, 108229, 101562, 100385, 102579, 93579, 88025, 87528, 88373, 79464, 76281, 75009, 79701, 83591, 84085, 91961, 104707, 108558, 115278, 128312, 142926, 140981, 143069, 150993, 165522, 179010, 184201, 184860, 185411, 198954, 209291, 218218, 227953, 235182, 244372, 253649, 268944, 278560, 286266, 288602, 299223, 315122, 329420, 344437, 362424, 357360, 351189, 348200, 341723, 329636, 317759, 287828, 266574, 250130, 239167, 234333, 236269, 233165, 232362, 241030, 274182]
12207B74182K6115N184j1224j050j652o446j0267r301j3041l547m85l023M633
12194B50078j025j0933m299n34J1724L371L278j349j352J68M890R877Q223N601
12180B77718J6713Q782O752P058J049k923J655K163m919j1559o338q376k539j511
12166B83725j921J22M749K628j1075k2770l1486k2051j8199k5604j0513M445Q574
12153A60624J8249J7038J5741J2922J2992N233N434m580j4113j0496J359L537
12141B23940J4234J2753J5632J4349Q140R66K567o043j5490l1026l0161k4722
12129A85139k2268k5845k3240j9050q373k487N651J4856K0625K2266K3762L2226
12117B03262J4961M831Q63j0383l510j3076j3716L133R648J950k203P844k467
$$ y = [274182, 300297, 305481, 294257, 293207, 291555, 285109, 274842, 265541, 252500, 248953, 248468, 245445, 250078, 249053, 238120, 233821, 233287, 245011, 248382, 251660, 250311, 248959, 249127, 254017, 263894, 272117, 277718, 294431, 303213, 309965, 317023, 318072, 315149, 316804, 318967, 314048, 302489, 296151, 287775, 285236, 283725, 281804, 281926, 286675, 289303, 278228, 255458, 223972, 201921, 183722, 158118, 147605, 152050, 160624, 178873, 195911, 211652, 224574, 237566, 242799, 248233, 243653, 229540, 219044, 220403, 223940, 238174, 250927, 266559, 280908, 289048, 290014, 292581, 286538, 271048, 240022, 209861, 185139, 162871, 137026, 113786, 94736, 86363, 83876, 89527, 104383, 125008, 147274, 171036, 203262, 218223, 223054, 223917, 213534, 210024, 196948, 183232, 186365, 196013, 197963, 195760, 203604, 201137]
12104B01137P83N602n109p168j5248j9480o591m205l73Q104L966l707j845J102
12090A56968j285J0283J4656M711J4368J6673K6401L7636K8852K2267K4892J8087
12078C74509Q943J2637P563K276J190N248k899l448J1928K0051J5992J151N414
12065D60555J5828J3324Q566J3690J6842J6081J6278J2889R805O915J450M578
12053E96801Q161L79R454J3006K2201K4887K6580L5339L6652L7713L6532M0693
12041H88398M3919N6348M9238L9489N1150M6634M6214M6888N7083O1439P0183
12030A456983Q2650P8765Q1501P5646P5883O2183N8616P2331Q7853J02695J17535
12019B352641J32351J54453J66765J92380J96813J98491K05402K21171K27105
$$ y = [201137, 201920, 207522, 202413, 195245, 179997, 160517, 153926, 149721, 149348, 157452, 161418, 157711, 155866, 156968, 155683, 165966, 180622, 185333, 199701, 216374, 242775, 280411, 309263, 331530, 356422, 374509, 383452, 396089, 403652, 405928, 407118, 412366, 409467, 406019, 417947, 437998, 453990, 455141, 460555, 476383, 489707, 498273, 511963, 528805, 544886, 561164, 574053, 583858, 590773, 592223, 596801, 604962, 605341, 614795, 627801, 650002, 674889, 701469, 736808, 773460, 811173, 847705, 888398, 932317, 988665, 1037903, 1077392, 1128542, 1175176, 1221390, 1268278, 1325361, 1386800, 1456983, 1539633, 1618398, 1699899, 1775545, 1851428, 1913611, 1972227, 2044558, 2132411, 2235106, 2352641, 2484992, 2639445, 2806210, 2998590, 3195403, 3393894, 3599296, 3820467, 4047572]
12010D047572K26646K44501K65637K89020L28901L67294M29727N19150O36558
12001G355006P77383R69525J243258J604459J995925K418912K818633L186819
11993B2369920L444682L615396L633521L619551L629608L865583M510684N856625
11985E4545570Q323165J2457152J8552187K5479261L1842997L6995140L9840564
11978B28036036M0595271L7164063L0156084J8673874O512330o121177j7163343
11971C37853138k7254148l5030888l9302503l9735514l6680660l2023080k6353271
11964A01473074k0766830j5315147j0876331p849675n952011m796384m069286
11957C1847410l612272l284799k999851k724073k415689k086348j767440j476966
$$ y = [4047572, 4274218, 4518719, 4784356, 5073376, 5402277, 5769571, 6199298, 6718448, 7355006, 8132389, 9101914, 10345172, 11949631, 13945556, 16364468, 19183101, 22369920, 25814602, 29429998, 33063519, 36683070, 40312678, 44178261, 48688945, 54545570, 62868735, 75325887, 93878074, 119357335, 151200332, 188195472, 228036036, 268631307, 305795370, 335951454, 354625328, 361137658, 355016481, 337853138, 310598990, 275568102, 236265599, 196530085, 159849425, 127826345, 101473074, 80706244, 65391097, 54514766, 46665091, 40713080, 35916696, 31847410, 28235138, 24950339, 21950488, 19226415, 16810726, 14724378, 12956938, 11479972]
11949A1479972j215294r91781q32628p15215o29141n63826n14279m77758m25031
11940E115019l78788l47485l16089k75420k39305k05271j71682j42475j21116
11931B917388r5543r3647q7753p6237q2722q4439q7997p8254p4080p6055p1657
11920B009004o4961n9199n3255n8800n9327n3858n1813m2199l8524l3410k2112
11909A471546j0157j1482j5566j3428k3853l1197l4227l5756l3299l0509l8865
11898A193207k8873k9875k4465k2570k9389l7941l4104k9971m0230k6394j6901
11887H72494j7046k6133j5312j0076p287r832o948p804p770m657r843j1048r305
11874G29433r402j4220j1997m412M240R164n76p930l273J0764J1609J3279J3563
$$ y = [11479972, 10264678, 9272897, 8440269, 7725054, 7095913, 6532087, 6017808, 5540050, 5115019, 4736231, 4388746, 4072657, 3797237, 3557932, 3352661, 3180979, 3038504, 2917388, 2821845, 2728198, 2640445, 2564208, 2481486, 2397047, 2309050, 2230796, 2156716, 2080661, 2009004, 1944043, 1884844, 1831589, 1772789, 1713462, 1659604, 1607791, 1565592, 1527068, 1493658, 1471546, 1461389, 1449907, 1434341, 1420913, 1397060, 1365863, 1331636, 1295880, 1262581, 1232072, 1193207, 1164334, 1134459, 1109994, 1087424, 1058035, 1020094, 985990, 956019, 915789, 889395, 872494, 855448, 829315, 814003, 803927, 796640, 786808, 779860, 772056, 764286, 759629, 749786, 738738, 729433, 720031, 705811, 693814, 689402, 693642, 702806, 702230, 694300, 691027, 701791, 713400, 726679, 740242]
11861G40242J1860J1421P822R656O163N172J5466N765P819P456J3609J1561J0991
11848H65003j734l358n455j5355k1256j7583j6887j6504k2945j4793k1229k5273
11836F82631k2139j5673j9725k0806j5252j0350r337p921L929O132J2325J0957
11824E94771j406l193j3170k1497l3156l2150l8076m2433l6831l0656j7464j5781
11812C08958n198R330P795M668Q347J2490R927k758l28j277M498j643J3047O259
11798C74115O079O203p23N02j022M360k506m982m993j3939k0971k1237j7232k1553
11784B82101k9173k3542j6876j4567j6511j3141n932m064n776p185j1952l910
11772A29472J025k429M226m830j0876o388K618M072l757j0279k482K678J344K509
$$ y = [740242, 752102, 763523, 771345, 781001, 787164, 792336, 807802, 813567, 821386, 828842, 842451, 854012, 865003, 863269, 859911, 854456, 839101, 817845, 800262, 783375, 766871, 743926, 729133, 707904, 682631, 660492, 644819, 625094, 604288, 589036, 578686, 569349, 561428, 565357, 571489, 583814, 594771, 593365, 590172, 577002, 555505, 522349, 490199, 452123, 409690, 372859, 342203, 324739, 308958, 303760, 313090, 320885, 325553, 333900, 346390, 356317, 353559, 353231, 351954, 356452, 354809, 367856, 374115, 380194, 386397, 385674, 386176, 385154, 389514, 387008, 382026, 377033, 363094, 342123, 320886, 303654, 282101, 252928, 229386, 212510, 197943, 181432, 168291, 162359, 158295, 152519, 145334, 133382, 129472, 130497, 128068, 132294, 127464, 116588, 110200, 112818, 116890, 113133, 102854, 100372, 103050, 104394, 106903]
11758A06903L182Q298M281k952m871q646o182O82J296P524J3805M980n542J069
11744A23827J6624J5569J890p638j484J991j72N142J0381n47q438r051N8o104
11730A42048J485l701o105J538k754k826J1433N321L342J404j0197K908K210j999
11716A44107o199l383M546p437Q40J915J579N373M358L357K829l408l655N827
11702A50649J3048J1633K027M606j150o836M450L474J842K411N778l98m747q046
11688A78741q786m629p764J075q057r599J121R883m227J361R682Q791r89q182
11674A58421J393N191J02O339p022j1862j1077j370l281j1556o463J771M677M059
11660A29322L193j210K063L938L347p246n063m782K57R518J888L357K207P786
$$ y = [106903, 110085, 118383, 122664, 119712, 114841, 106195, 100013, 100695, 101991, 109515, 123320, 128300, 122758, 123827, 140451, 156020, 157910, 150272, 148788, 150779, 150607, 155749, 166130, 165583, 157145, 148094, 148152, 142048, 143533, 139832, 133727, 135265, 132511, 129685, 141118, 146439, 149781, 151185, 140988, 143896, 146106, 144107, 137908, 134525, 139071, 131634, 132474, 134389, 135968, 141341, 145699, 149056, 151885, 148477, 144822, 150649, 163697, 175330, 177357, 181963, 180813, 173977, 178427, 181901, 183743, 186154, 191932, 191534, 186787, 178741, 169955, 165326, 157562, 158637, 150580, 140981, 142102, 151985, 147758, 149119, 158801, 167592, 166603, 158421, 159814, 165005, 165107, 171446, 164424, 152562, 141485, 140115, 136834, 125278, 118815, 120586, 125263, 129322, 132515, 131305, 133368, 137306, 140653, 133407, 128344, 123562, 123819, 133337, 135225, 138582, 140789, 148575]
11646A48575O879N274n284Q45O185P736Q966K323N58m424n586R881N699L526o084
11631A85069n768o532q755o703l633j138J1139J299j5147k053N692l513k670j253
11617A46034K536k076j889k9m074m086J0256P613L353R958L599k239J964J526
11603A72446k36l310k124n242j4905j4269k443j149p764M20k17m60K65o054n531
11588A09427J508l971j814N830j919K385l376J298P195Q931Q818P356J0328P525
11574A59521N013J8775J2678K1622K8933K5380K8870K4070J9668K0441L3713N7426
11562D56110P7086J00971J35142J68865J97463K10423K13300J93992J51216Q5295
11552A989863P391n4180j17982j63102j94715k16076k08835j81729j52617j25517
$$ y = [148575, 155454, 160728, 155444, 156289, 162474, 170210, 179176, 181499, 182057, 177633, 172047, 181928, 187627, 191153, 185069, 179301, 172769, 164014, 157311, 153678, 152540, 163679, 164978, 149831, 147778, 153470, 149957, 147287, 146034, 148570, 146494, 144605, 144576, 140502, 136416, 146672, 154285, 157638, 167596, 171195, 168956, 170920, 172446, 172210, 168900, 166776, 161534, 146629, 132360, 129917, 128768, 121004, 121424, 121207, 120747, 121012, 114958, 109427, 110935, 106964, 105150, 110980, 109061, 111446, 108070, 109368, 116563, 125494, 134312, 141668, 151996, 159521, 164534, 183309, 195987, 217609, 246542, 271922, 300792, 324862, 344530, 364971, 398684, 456110, 533196, 634167, 769309, 938174, 1135637, 1346060, 1559360, 1753352, 1904568, 1989863, 1997254, 1943074, 1825092, 1661990, 1467275, 1251199, 1042364, 860635, 708018, 582501]
11542E82501r4419o2411m3525l8688l8177k7755k5708k1410j8527k8615q764n787
11530A68715q690r189m518q126l673o775n012l526q242l392l987J130J212j82
11516A05745p11l930k205L50p286p335j23l99n14m173m388m867L99O11l78N936
11500G6732J6809M249K643O059L430k500j501K800j518k531L242o950q483r77
11486I1504J625K214O563j289n680k617Q26M305j377O602M406J0792k824j800
11472A13250q018j0211M93O462N900J560n896p07m766J0818P400J778L375j1088
11458A10350j2040L66m324l436r55J225l026r52J459M965M852O368Q458k619r619
11443A01072j2225o226k088q7j883O352m49J937L631P05J647O297K385j635k156
$$ y = [582501, 488082, 425671, 382146, 343458, 305281, 277526, 251818, 230408, 211881, 183266, 174502, 168715, 160025, 150836, 146318, 138192, 134519, 127744, 122732, 119206, 110964, 107572, 103585, 104715, 105927, 105745, 105034, 101104, 98899, 99249, 91963, 84628, 84505, 84106, 83592, 79419, 75031, 70164, 70563, 71174, 70796, 76732, 93541, 97790, 100433, 106492, 109922, 107422, 105921, 108721, 107203, 104672, 107914, 100964, 92481, 91504, 93129, 95343, 101906, 100617, 94937, 92320, 93146, 97451, 96074, 102676, 107082, 117874, 115050, 113250, 105232, 95021, 95514, 101976, 107876, 109436, 103540, 102833, 98067, 108885, 116285, 118063, 121438, 110350, 98310, 98676, 94352, 90916, 89961, 91186, 88160, 87208, 88667, 93632, 98484, 104852, 113310, 110691, 101072, 88847, 82621, 80533, 80446, 78563, 84915, 84466, 86403, 90034, 90739, 92386, 98683, 101068, 99433, 97277]
11428I7277R595m26k070j281K897j925K02M455j151N949j137n025k353J321K822
11413A09150K554o580l571L763q555m445j049N11K307M121N997l911m804k906
11399I2582N35q26K572j442k003j79o743j452N886M099k71k005p390n482N637
11384H3518O716K103n746o426n809k988L756L329n41K323n617j844P54P571N650
11369H6749J278K83K347j284K269l866o292j496P266J569k305j519R39J237L711
11354I0886N604m90o432J850o085k957k256m548J726P164J919J071n53p637j0000
11339F9262L284P629O155J769K252o165K093N642l810j863K987O997l584m390
11325H8258J648P369L649k145j057m107l89N66k602j0405n18P806O69j4311o868
$$ y = [97277, 106872, 106446, 104376, 103095, 105992, 104067, 104269, 108724, 107573, 113522, 112385, 107360, 105007, 106328, 109150, 111704, 105124, 101553, 105316, 96761, 92316, 91267, 91778, 94085, 98206, 104203, 100292, 95488, 92582, 93117, 92291, 94863, 93421, 91418, 91239, 84496, 83044, 88930, 93029, 92758, 90753, 83363, 77881, 83518, 90234, 92337, 86591, 80165, 74356, 71368, 75124, 78453, 77912, 80235, 74618, 72774, 73528, 81099, 86749, 88027, 88310, 90657, 89373, 91642, 87776, 81484, 79988, 87254, 88823, 86518, 84999, 85938, 87175, 90886, 96490, 96000, 89568, 91418, 85333, 82376, 80120, 75572, 77298, 84462, 86381, 87452, 86899, 79262, 69262, 72546, 80175, 86330, 88099, 90351, 84186, 86279, 91921, 88111, 86248, 89235, 96232, 92648, 88258, 89906, 97275, 100924, 98779, 97722, 93615, 93226, 93792, 91190, 80785, 80267, 88073, 88742, 74431, 67563]
11310F7563l112K680Q247J1311o085j227N345K474o09n234l595M799k143j505
11296G8909P324L324Q100n214l316O255p89j0405K390j131k977n712p151l556
11282F6051J763N619Q017M544K984O192r46P466L775k193k158n754j18P703R036
11267A11981R562J0003N50J3730J9180P187R447L9372O2687R3562J24681J23582
11255F25524R9513Q2123L5932l3193j00738j06242r6867j04553r0354p0914l9311
11244B00920k8669k7870j2267m941l720n378l83j0882r889n93K280j453j676L422
11230I8901j246J214N331m432m224m075o61N102J188Q204K281l354l124k452j749
11215I6904K916M772m83L419N58J641m184q867p58m857K055O152o284n336K8n615
$$ y = [67563, 64451, 67131, 75378, 86689, 80604, 79377, 84722, 87196, 86587, 81353, 77758, 82557, 80414, 78909, 86233, 89557, 97657, 92443, 89127, 95382, 94593, 84188, 86578, 85447, 82470, 76758, 69607, 66051, 67814, 73433, 81450, 85994, 88978, 95170, 94224, 101690, 105465, 103272, 101114, 95360, 95242, 102945, 111981, 121543, 131546, 132096, 145826, 165006, 172193, 181640, 221012, 283699, 377261, 501942, 625524, 725037, 807160, 843092, 809899, 709161, 602919, 506052, 401499, 311145, 240231, 200920, 172251, 144381, 132114, 127173, 123453, 118075, 117692, 106810, 96921, 96328, 98608, 97155, 95479, 98901, 97655, 98869, 104200, 99768, 95544, 91469, 90808, 95910, 97098, 105302, 107583, 104229, 101105, 98653, 96904, 99820, 104592, 104109, 107528, 108086, 109727, 105543, 96676, 95918, 91061, 93116, 99268, 92984, 87648, 87676, 82061]
11199H2061M812J1313j266l658n087r059k292N050O216L981K717M46L938J987
11185A01159k149l55k369k674R013M43K254K886J2581P762O943J305l511j836
11171A31452N755J3894J2923J4195J9040L5942O1922J02080J25326R1575O4125
11160F78229P3732N9388j892p0648r3087q2658q0989r0016q5280o1043m0177l3151
11148A72408k2194m599m503o902Q87J780q68r385k641J14J659m609k243l903l291
11133A11710k395m16J804J018n952k316j539m198j511N693K91Q09M561p4L615
11118A11100K954l852m917n881r68l376K165J211j915L293R977J9320Q693J2237
11104A50041J2926P422L43p691j1581j0527p142q14q809j7552j0894R65J2408
$$ y = [82061, 86873, 98186, 96920, 93262, 88175, 79116, 76824, 81874, 88090, 92071, 94788, 95234, 99172, 101159, 99010, 98655, 96286, 93612, 102625, 103068, 105322, 108208, 120789, 128551, 135494, 136799, 133288, 131452, 137207, 151101, 164024, 178219, 197259, 233201, 295123, 397203, 522529, 614104, 678229, 751961, 811349, 809457, 738809, 645722, 563064, 482075, 392059, 306779, 245736, 205559, 172408, 150214, 145615, 141112, 134210, 135097, 136877, 136009, 126624, 123983, 124097, 125756, 121147, 118904, 115001, 111710, 109315, 108899, 110703, 111721, 105769, 103453, 101914, 97716, 96205, 101898, 102189, 102998, 107559, 107485, 111100, 114054, 110202, 105285, 99404, 98436, 95060, 97225, 98436, 96521, 99814, 109791, 129111, 137804, 150041, 162967, 170389, 170732, 163041, 151460, 140933, 133791, 132977, 124168, 106616, 95722, 96687, 109095]
11091A09095J3273m895J13J1618M947j0433j6875Q834J001l615j068j512k421
11078A08062J074r933m906M422P846J295K172J245j731l149N453L7M102r09j952
11063A13128k367K051J0098O440k562J520k097O775L473M102O136M081o566k149
11049A42063K420k66j0727p362r1r488r915M496P217J0218l542n279n356R209
11035A23597P782l069L119k13K596N580N737n773k733l422l326M809K627n902
11021A31409P079m8n713l341q917L95P409k55l315j005J91R916J764N033Q338
11006A48940j360k504j899R08o520k033J0980L215n610p119j250Q2m673J298J0707
10991A43162m431L667M048J0426L328K649l902J806n60n20o19m578J817L136K150
$$ y = [109095, 122368, 117473, 117586, 129204, 134151, 123718, 106843, 115677, 116678, 113063, 111995, 110483, 108062, 109136, 99203, 94297, 98719, 106565, 107860, 110032, 111277, 109546, 106397, 111850, 111887, 115989, 115080, 113128, 110761, 112812, 122910, 129350, 126788, 128308, 126211, 132986, 136459, 140561, 146697, 150778, 144212, 142063, 144483, 144217, 133490, 126128, 126037, 116549, 106634, 111130, 118347, 128565, 125023, 119744, 114388, 123597, 131379, 128310, 131429, 131216, 133812, 139392, 145129, 139356, 136623, 133201, 129875, 134684, 137311, 131409, 138488, 138440, 132727, 129386, 120469, 120864, 128273, 128018, 124703, 123698, 123889, 133805, 135569, 140602, 148940, 147580, 145076, 143177, 144085, 137565, 135532, 146512, 149727, 144117, 136998, 135748, 135830, 131157, 132455, 143162, 138731, 142398, 146446, 156872, 160200, 162849, 158947, 160753, 160193, 159673, 159054, 154476, 156293, 159429, 161579]
10976A61579k421K400n742K720k361R74O639Q951L457k788r37r48K655J235P25
10961A76138M954K591K753j339l598M834r30n863P048J1915L314P904J408Q133
10947B19262L80k768o19N303M865P789J0129O743l176R82R639Q619P117R870J2609
10932B96744J2837J8088K4324K0941J6365J5918K4679L4604M1700M7044N7637
10921F10881Q4254J13795J73088K43882L54330N38009Q29753J078439R88893N04703
10911E520027J8877k94306m76959o85959q20350p11861m80109k95673j43666k3524
10901A606497Q6968J98619L61013O22219J068970J640430J658491P11520m8573
10892G906154n13996o66458j031506j400583j144737p63275m79883l06384j83296
$$ y = [161579, 159158, 161558, 155816, 158536, 156175, 157149, 163788, 172739, 176196, 173408, 172471, 171523, 174178, 175413, 176138, 181092, 183683, 186436, 185097, 181499, 186333, 185403, 179540, 186588, 198503, 201817, 209721, 211129, 219262, 219642, 216874, 216255, 221558, 226423, 234212, 244341, 251084, 247908, 248890, 258529, 267148, 274265, 284135, 296744, 309581, 327669, 351993, 372934, 389299, 405217, 429896, 464500, 506200, 553244, 610881, 695135, 808930, 982018, 1225900, 1580230, 2118239, 2947992, 4026431, 5015324, 5520027, 5538904, 5244598, 4767639, 4081680, 3261330, 2549469, 2069360, 1773687, 1630021, 1606497, 1693465, 1892084, 2253097, 2875316, 3944286, 5584716, 7243207, 7954727, 7906154, 7392158, 6725700, 5694194, 4293611, 3148874, 2385599, 1905716, 1599332, 1416036]
10883A416036j20635j09905j06190r3401q1356r4921j05341r0450o5773m7776
10873E00288l5221l0647j9905j7473j1262j2507j0446k806j4528o560p886j5812
10861C15235p153N1J590R444k495q197q624R95P432Q74J510k873O880J5538J3595
10846C43802J2121J5273K4424L1366N7379R5941J41235J65636J31575N0565j1076
10835A058241n2404p9140j16307j34059j14565p6635m8733l1398q536r554p456
10824C79454J988q445j0933j2687n955o993P363J158q240l357L751P317M479M926
10810C53826O72k183m498m121k421K629N287l931L932R152O497n15P151j528l274
10795C66675L228N761O638J1222l02P735L730P31R86O117O906P468L666R195J5209
$$ y = [1416036, 1295401, 1185496, 1079306, 985905, 904549, 809628, 704287, 613837, 548064, 500288, 465067, 434420, 414515, 397042, 385780, 373273, 362827, 360021, 345493, 338933, 331047, 315235, 308082, 308133, 309723, 319167, 316672, 308475, 299851, 300846, 308278, 309152, 310662, 307789, 314669, 330207, 343802, 355923, 371196, 395620, 426986, 484365, 580306, 721541, 887177, 1018752, 1069317, 1058241, 1005837, 926697, 810390, 676331, 561766, 485131, 436398, 405000, 396464, 386910, 379454, 381442, 372997, 362064, 349377, 343422, 336429, 343792, 344950, 336710, 333353, 337104, 344421, 348900, 353826, 354498, 352315, 347817, 343696, 341275, 343904, 349191, 345260, 349192, 358344, 364841, 364326, 371477, 369949, 366675, 369903, 375664, 382302, 393524, 393222, 400957, 404687, 405418, 406404, 412521, 419427, 426895, 430561, 439756, 454965]
10780D54965Q376R717R201J7896O511O008J0565J2491J5145K1529J4040J6301
10768F02745J9551J7549J8780K9405K7274J4428J5816J7699K0148J0833J1935
10757H06163M356J458O762K411L414j399R49l89L005Q363P542J3719J689L082
10743H61125O580O965Q099J5113J5004J4292L685J5678J5695K0814J8614J8382
10731A020046J7070J0966J1436j625O5j577j0904j941O63r809j4978q947j2437
10718I98028j1746m467j5610j5323j3393k0192n453l411r400o94l529m407q557
10705H81846m80k817M463L406K444N814K310Q896R770K616j948J4340N697j361
10691I34996j1279j2147o696j2158r396j7542j9204j4399k3164k2043p859q064
$$ y = [454965, 463341, 473058, 482259, 500155, 506666, 512674, 523239, 535730, 550875, 572404, 586444, 602745, 622296, 639845, 658625, 688030, 715304, 729732, 745548, 763247, 783395, 794228, 806163, 810519, 811977, 818739, 821150, 824564, 823165, 824114, 823725, 826730, 835093, 842635, 856354, 858043, 861125, 867705, 874670, 882769, 897882, 912886, 927178, 930863, 946541, 962236, 983050, 1001664, 1020046, 1037116, 1048082, 1059518, 1057893, 1057958, 1056381, 1045477, 1043536, 1044199, 1034390, 1019412, 1010465, 998028, 986282, 981815, 966205, 950882, 937489, 917297, 911844, 908433, 899033, 898339, 894810, 890403, 881846, 881366, 878549, 883012, 886418, 888862, 894676, 896986, 905882, 915652, 918268, 916320, 930660, 936357, 934996, 923717, 911570, 904874, 892716, 883320, 865778, 846574, 832175, 809011, 786968, 779109, 771045]
10679G71045j2932q430j0421o447j864M722k424o772m301K454R358J2450K3617
10666G70055K6827L2151M1226L9985M5423M4887N2660N2775M4710K5844J6421
10655A192964N894q879j7378k9879l0177l1781l6345k7599k5655l1018j9993r481
10643I30673j1339n409L112J2086J4967J8797L1197K4830K2931L3647M4949M5691
10631A166132N1270N1652M5549N3220M7988M5685L1038J8465N190j497r339k6890
10619A478463k8899l6168l6461k7550k6951k7171m2193l6617l0936k3663k7659
10608A134195k3624k0681j6095j7424j0773n267m848R213K0252J9051K4782K5495
10596A134276K3679L8952N1329M3680M4063N0702L9327L2660K0680K115k5938
$$ y = [771045, 758113, 749683, 739262, 732815, 730951, 735673, 733249, 726477, 722176, 724630, 733988, 746438, 770055, 796882, 829033, 870259, 910244, 955667, 1000554, 1053214, 1105989, 1150699, 1176543, 1192964, 1198858, 1189979, 1172601, 1142722, 1112545, 1080764, 1044419, 1016820, 991165, 960147, 940154, 930673, 919334, 913925, 917037, 929123, 944090, 962887, 994084, 1018914, 1041845, 1075492, 1120441, 1166132, 1217402, 1269054, 1314603, 1367823, 1415811, 1461496, 1492534, 1510999, 1516189, 1514692, 1505353, 1478463, 1449564, 1413396, 1376935, 1349385, 1322434, 1295263, 1253070, 1216453, 1185517, 1161854, 1134195, 1110571, 1089890, 1073795, 1056371, 1045598, 1040331, 1035483, 1044696, 1064948, 1083999, 1108781, 1134276, 1157955, 1196907, 1248236, 1291916, 1335979, 1386681, 1426008, 1458668, 1479348, 1481463, 1455525]
10585A455525l4524n4658n9523n1280n3357n2238m7362k6859j7372j5031j7543
10574A025778k3885j7342j755q064k403k800M99j651k543J378n351O870P985L80
10560I77096n047l178M089O161q62m71M351J0282R763N377K45O435J0919N777
10546A030937J0054M113O624J0167J6848R846L538O246Q841o748P01Q143L927
10533A113237M189J1455J2208J0450L118P314O203J6353Q171L477J1685J5789
10521A223649J2105j08M921N550J092O181J1183Q461J0335Q248o75L993J0947
10508A305882O443K086M440R991L112J842J0494J3124J3555O983R15J249O729
10495A386845R944J1947J7931J9324J5074J8522J9871J2698J3455K1940K4749
$$ y = [1455525, 1421001, 1366343, 1306820, 1255540, 1202183, 1149945, 1102583, 1075724, 1058352, 1043321, 1025778, 1001893, 984551, 982796, 974732, 972329, 969529, 970028, 968377, 965834, 967212, 961861, 968731, 976716, 977096, 972049, 968871, 972960, 979121, 978259, 977788, 982139, 992421, 1002184, 1007561, 1007806, 1014241, 1025160, 1030937, 1040991, 1045104, 1051728, 1061895, 1078743, 1088589, 1092127, 1098373, 1107214, 1100466, 1101167, 1109310, 1113237, 1117426, 1128881, 1141089, 1151539, 1154657, 1161971, 1168174, 1184527, 1192698, 1196175, 1207860, 1223649, 1235754, 1235646, 1240567, 1246117, 1247209, 1253390, 1264573, 1273034, 1283369, 1291617, 1290942, 1294935, 1305882, 1312325, 1314411, 1318851, 1328842, 1331954, 1333796, 1344290, 1357414, 1370969, 1377952, 1378867, 1380116, 1386845, 1396789, 1408736, 1426667, 1445991, 1461065, 1479587, 1499458, 1512156, 1525611, 1547551, 1572300]
10484A572300J7879K3289K1196J3374J7864J7406K7429J7895K9266K4531J9688
10473A802117J3125J1287J4975J8540K0283J9211J9131K5729K5166J7630Q701
10462A995895J4893J7491L2952K5445K1300K9457K5406L0948L0253K5519L0939
10451B280498L7448L3476L3739L5895L6386L4378M3735L9639L8082L6066L1018
10440B680360L3169M9759N1733M8464N2408M6998M3662N5706O0285N0261N6168
10429C228973O6590O5530N8381O5855P4878P4660O8119P4648P9926R1555R9118
10418D048233J01781J03364R8810R5183R8755J05694J20418J21843J29396J30601
10408E154078J39808J36468J44241J56000J61309J75889J64415J76534J87595
$$ y = [1572300, 1590179, 1613468, 1634664, 1648038, 1665902, 1683308, 1710737, 1728632, 1757898, 1782429, 1802117, 1815242, 1826529, 1841504, 1860044, 1880327, 1899538, 1918669, 1944398, 1969564, 1987194, 1995895, 2010788, 2028279, 2061231, 2086676, 2107976, 2137433, 2162839, 2193787, 2224040, 2249559, 2280498, 2317946, 2351422, 2385161, 2421056, 2457442, 2491820, 2535555, 2575194, 2613276, 2649342, 2680360, 2713529, 2763288, 2815021, 2863485, 2915893, 2962891, 3006553, 3062259, 3122544, 3172805, 3228973, 3295563, 3361093, 3419474, 3485329, 3560207, 3634867, 3702986, 3777634, 3857560, 3949115, 4048233, 4150014, 4253378, 4352188, 4447371, 4546126, 4651820, 4772238, 4894081, 5023477, 5154078, 5293886, 5430354, 5574595, 5730595, 5891904, 6067793, 6232208, 6408742, 6596337]
10399F596337J98568K06975K23885K30636K35590K53010K64282K83969K92264
10390H785516L16471L36265L52087L69892L99385M10086M32238M70269N05379
10381A2377588N31760N66957N97600O46041O97197P49591Q02180Q65671R37336
10372A8771921J013046J091150J176023J273649J386158J511891J645171J771787
10364B9640796J923355K102969K266256K445243K643030K837434L046454L246012
10356E0151549L439866L623044L766327L861051L908465L880345L776977L600670
10348H0008294L348413L014332K608915K170187J708180J246220Q22774M45010
10340I5372325J42243q1120k13790k61738k24337j17015O2447K94827N67859Q73642
$$ y = [6596337, 6794905, 7001880, 7225765, 7456401, 7691991, 7945001, 8209283, 8493252, 8785516, 9101987, 9438252, 9790339, 10160231, 10559616, 10969702, 11401940, 11872209, 12377588, 12909348, 13476305, 14073905, 14719946, 15417143, 16166734, 16968914, 17834585, 18771921, 19784967, 20876117, 22052140, 23325789, 24711947, 26223838, 27869009, 29640796, 31564151, 33667120, 35933376, 38378619, 41021649, 43859083, 46905537, 50151549, 53591415, 57214459, 60980786, 64841837, 68750302, 72630647, 76407624, 80008294, 83356707, 86371039, 88979954, 91150141, 92858321, 94104541, 94927315, 95372325, 95514568, 95433448, 95219658, 94957920, 94733583, 94616568, 94679015, 94973842, 95541701, 96415343]
10330I6415343J191990J527404J849309K163201K460608K703076K911313L064833
10322A14287077L150947L138258L049631K878121K613358K267518J854266J391589
10314A34630765R13175M05523r4092n75428j035336j449244j830817k139232k406547
10305A26418767k621349k784695k881523k932310k922516k846531k732987k552538
10297A04144318k329109k076368j779967j469873j136019p72662m26841o6508
10289I4086971K57730N73034Q60775J070915J202286J252380J212653J054316
10281A01571060P60368L56930j38537p25743j362693k004187k600033l140463
10273I2716702l616040l965352m201851m315056m345062m293027m175677m004250
$$ y = [96415343, 97607333, 99134737, 100984046, 103147247, 105607855, 108310931, 111222244, 114287077, 117438024, 120576282, 123625913, 126504034, 129117392, 131384910, 133239176, 134630765, 135543940, 135949463, 135855371, 135279943, 134244607, 132795363, 130964546, 128825314, 126418767, 123797418, 121012723, 118131200, 115198890, 112276374, 109429843, 106696856, 104144318, 101815209, 99738841, 97958874, 96489001, 95352982, 94580320, 94153479, 94086971, 94344701, 94917735, 95778510, 96849425, 98051711, 99304091, 100516744, 101571060, 102331428, 102688358, 102549821, 101824078, 100461385, 98457198, 95857165, 92716702, 89100662, 85135310, 80933459, 76618403, 72273341, 67980314, 63804637, 59800387]
10265E9800387l804516l592166l368902l138840k899809k687993k485205k301303
10257C5521653k133146j966700j811212j660143j525463j412387j312787j226519
10249B2473296j148499j066732r96780r31685q58070p87212p24557o70179o29629
10240A4659953n85966n47006n03796m71523m49350m12900l66739l29840k97344
10231A0695489k54679k14265j97423j77471j57870j53426j55523j92407j99898
10222H992527k39837k56374k83177k87741k84413k86949k67585k41485k24314
10213F620652k00537j73575j51821j39860j38118j28017j24241j22852j11788
10204E329843j15370j08366r6888q9143q7703q7520q2522p7995p4967p1839o9246
$$ y = [59800387, 55995871, 52403705, 49034803, 45895963, 42996154, 40308161, 37822956, 35521653, 33388507, 31421807, 29610595, 27950452, 26424989, 25012602, 23699815, 22473296, 21324797, 20258065, 19261285, 18329600, 17471530, 16684318, 15959761, 15289582, 14659953, 14073987, 13526981, 13023185, 12551662, 12102312, 11689412, 11322673, 10992833, 10695489, 10440810, 10226545, 10029122, 9851651, 9693781, 9540355, 9384832, 9192425, 8992527, 8752690, 8496316, 8213139, 7925398, 7640985, 7354036, 7086451, 6844966, 6620652, 6420115, 6246540, 6094719, 5954859, 5816741, 5688724, 5564483, 5441631, 5329843, 5214473, 5106107, 5009219, 4920076, 4832373, 4744853, 4662331, 4584336, 4509369, 4437530, 4368284]
10193D368284p0416n4799m0616m0558l9173k6666l1595m3936n2785p3888p2296
10182C821556q1010q1708q2095p8566o3877n5003n3691m1626l7659l3441m1947
10171C170933m3599k9408l3213l7446k7615l6700l8210l8019k3512k8507l3880
10160B800824l6487l2211l6536l9018l3059l1335l1823l0294l9180m3093m2273
10149B405515m5284m6133l9743l9483l6320l9670l7708l8148l8715l4490k7180
10138A982641k6304k4971k9674l2090k2692k9869k5583k0299k5743k7736k9636
10127A688044k4834k7458k1891k5898l7149k5746k9071k7348k7241l2792k1744
10116A386872j9573j9139k1359k5070j8720k3062k2288j0237j6583j6793j1410
$$ y = [4368284, 4297868, 4243069, 4202453, 4161895, 4122722, 4096056, 4064461, 4020525, 3967740, 3893852, 3821556, 3740546, 3658838, 3576743, 3498177, 3434300, 3379297, 3325606, 3283980, 3246321, 3212880, 3170933, 3127334, 3097926, 3064713, 3027267, 2999652, 2962952, 2924742, 2886723, 2863211, 2834704, 2800824, 2764337, 2732126, 2695590, 2656572, 2623513, 2592178, 2560355, 2530061, 2490881, 2447788, 2405515, 2360231, 2314098, 2274355, 2234872, 2198552, 2158882, 2121174, 2083026, 2044311, 2009821, 1982641, 1956337, 1931366, 1901692, 1869602, 1846910, 1817041, 1791458, 1771159, 1745416, 1717680, 1688044, 1663210, 1635752, 1613861, 1587963, 1550814, 1525068, 1495997, 1468649, 1441408, 1408616, 1386872, 1367299, 1348160, 1326801, 1301731, 1283011, 1259949, 1237661, 1227424, 1210841, 1194048, 1182638]
10105A182638j8652j9783m942r704j1734j3791n283j5353j7755p499r273q602
10093A040267j1124p097o205j5006n347j2608j4443j5135j1468q934j4238q296
10081I10366j1764j5710J471j1736j7682m767q020j1699o804j1829r783k848q405
10068G90790p805K279k09j2145q945J352l176R62q796k058j1972r316m405n298
10054G21258j094L079k62J375m94p483r366p456m093k592o580k567L636L971l018
10039F88314n782j1908p569j5497p868j169k795j661n140q177k369m638r935j6645
10025E87161P773K489k323k184r868j542O786l457j1969o393r593m477q633m34
10011E43336O21n270k543k201n553k595l554J040p209R19j578K018O30j0848m802
$$ y = [1182638, 1163986, 1144203, 1139261, 1129557, 1117823, 1104032, 1098749, 1083396, 1065641, 1058142, 1048869, 1040267, 1029143, 1022046, 1015841, 1000835, 995488, 982880, 968437, 953302, 941834, 932900, 918662, 910366, 898602, 882892, 884363, 872627, 854945, 850178, 842158, 830459, 823655, 811826, 802043, 799195, 790790, 782985, 785264, 785055, 772910, 763965, 765317, 762141, 763103, 754307, 752249, 740277, 730961, 726556, 721258, 720164, 723243, 722981, 724356, 723862, 716379, 707013, 699557, 695464, 692872, 686292, 683725, 687361, 691332, 688314, 682532, 670624, 663055, 647558, 639690, 638521, 635726, 634065, 628925, 620748, 618379, 613741, 603806, 587161, 594934, 597423, 595100, 592916, 583048, 581506, 588292, 584835, 572866, 566473, 556880, 552403, 543770, 543336, 543957, 538687, 536144, 533943, 528390, 525795, 522241, 523281, 516072, 516991, 515413, 517431, 518061, 507213, 502411]
9996E02411m458r826q84J08j2918o980N280P638k615Q435n149p404M084J301j3230
9981D65793P05M750n330j4838n803N143L003o199j235l21j818l466l191L082O00
9966D40875p197n313O281M909j94j545J448l58p729l029J5411N310o597L199R739
9951D55210M758l58Q035P228L388J0295R061J6678J3737P521K0260J0054J0837
9938E76704J7252J2024J5044K5044K1712J9925J1869J1582J6825K3764J8980J6562
9926G87287P111P756O759N236J323m983K01m398J917M013L031Q320J3059K2083
9912H58715J4181N581j119k930K105N716K841Q723K0304K4661J1099J7017K0474
9899I87368J5681K2741J9601J7134J4975J953J393L691n479j5181o436J174o915
$$ y = [502411, 497953, 488127, 487243, 487351, 474433, 467453, 472733, 480371, 477756, 486191, 481042, 473638, 477722, 479023, 465793, 466498, 471248, 465918, 451080, 445277, 450420, 453423, 447224, 445989, 445668, 443850, 440384, 437193, 440275, 440875, 433678, 428365, 434646, 439555, 439361, 437816, 439264, 438906, 431177, 428148, 443559, 448869, 442272, 445471, 455210, 459968, 459610, 467645, 474873, 478261, 488556, 497617, 514295, 528032, 535553, 555813, 565867, 576704, 593956, 605980, 621024, 646068, 667780, 687705, 699574, 711156, 727981, 751745, 770725, 787287, 794398, 802154, 808913, 814149, 815472, 810489, 810690, 806292, 808209, 812222, 815253, 823573, 836632, 858715, 872896, 878477, 877358, 874428, 876533, 882249, 885090, 893813, 914117, 938778, 949877, 966894, 987368, 1003049, 1025790, 1045391, 1062525, 1077500, 1079453, 1080846, 1084537, 1079058, 1063877, 1057441, 1058615, 1051700]
9886A051700n930l181j0472K196p488j9715l2235k3188r306j1100m895l194r92
9873I22200Q821J8313K5591L1451K7564M7443N4344L8735K7252L0313L3481L4869
9861A300377M4472N2243O4489Q2751R7718J21535J56706K13541L15859M46678
9851B896369O40571R64081J620839K863033M219823M265709K340732J14713j239055
9842A8686815j921082k785133l510477l205932k213951j365019q63372n71929
9834B249920l98208k88136k15428j63281j25630j00658p5958o8647m8173l2508
9824G33293k6020j9098j8907k2402k5226k5218l8588m4459k8630k0535j3025q932
9812D42253k1537k0541k1683j7827q028r344j1784r950r895p56k254q46N915K482
$$ y = [1051700, 1045770, 1042589, 1032117, 1034313, 1026825, 1007110, 974875, 951687, 942381, 931281, 926386, 923192, 922200, 931021, 949334, 974925, 1006376, 1033940, 1081383, 1135727, 1174462, 1201714, 1232027, 1265508, 1300377, 1344849, 1397092, 1461581, 1544332, 1642050, 1763585, 1920291, 2133832, 2449691, 2896369, 3536940, 4501021, 6121860, 8984893, 13204716, 17470425, 19811157, 19925870, 18686815, 16765733, 13980600, 10470123, 7264191, 5050240, 3685221, 2821849, 2249920, 1851712, 1563576, 1348148, 1184867, 1059237, 958579, 882621, 813974, 765801, 733293, 707273, 688175, 669268, 646866, 621640, 596422, 557834, 513375, 484745, 464210, 451185, 442253, 420716, 400175, 378492, 360665, 352637, 343293, 331509, 321559, 311664, 310908, 308654, 307808, 313723, 316205]
9798C16205l225j958r103r564j1765r505L00K359M26j671L448m41o118j957j627
9783B65804J993l615k598k432j538K346M169j529P967K358O93J24n853r353p738
9768B50798o29k255P36j243k619k562l108m459L17m539j919j955rM848P60P188
9752B39350r62k190r69n713J45M3l790k566j549P816j817j0156K382l979J874
9737B17919M990k984p10O340L00N222J056K383K267m033n811o34K424j123q143
9722B19463k016j323Q464J079L892Oj201O63J15q007J866O675m164j712o249l04
9706B17247l884j029N941J70p449n897n187k684J210K895N826k21r49j842J020
9691B05167O522n835j1787P65l545l605n296J218p45L638M626P753O60n529M27
$$ y = [316205, 312980, 311022, 301919, 292355, 280590, 271085, 271385, 273744, 274170, 272499, 275947, 275506, 269388, 267431, 265804, 267797, 264182, 261584, 259152, 257614, 259960, 264129, 262600, 270567, 272925, 273618, 273742, 267889, 258536, 250798, 250169, 247914, 248650, 247407, 244788, 242226, 239118, 234659, 234976, 230437, 228518, 226563, 226554, 231402, 232162, 239350, 238388, 236198, 235229, 229516, 229661, 229704, 225914, 223348, 221799, 229615, 227798, 217642, 220024, 216045, 217919, 222909, 219925, 219215, 225555, 225855, 231077, 232133, 234516, 236783, 232750, 226939, 226305, 228729, 227606, 219463, 217447, 216124, 224588, 225667, 229559, 229565, 228364, 229027, 229142, 221135, 223001, 229676, 225512, 223800, 217551, 217247, 213363, 212334, 218275, 218445, 210996, 205099, 199912, 197228, 198438, 201333, 207159, 206938, 205989, 204147, 205167, 211689, 205854, 194067, 194832, 191287, 187682, 182386, 183604, 182859, 186497, 191123, 198876, 199536, 194007, 194434]
9676A94434m877k903l004k855N308r06n855M665o52l226k489L476Q301N163p17
9661A93863j0105K965R94p617o55L554o162o250j94Q323M820N179M122j873j3137
9646A77827m857k638Q182N703k334p210m492o63M023q202k121N539L842O683O510
9631A85792j0738m552l796P825K969Q95K714j829O090N935K829j2533p625O893
9617A80869J070l653j595M096K17J821K623j976L7n890L735k63K73o93L292O421
9601A90384M55J209J746N018k86m954K10L728n97l152Q87L399k903o72l189N161
9585A96444j471k153k4l495J399k093q2m737j828J0294L979K51L314M313n256
9570A98855j2083j025m820n842K277P726R494R896N894j500q19L180j366M696
$$ y = [194434, 189557, 186654, 183650, 180795, 186103, 185197, 179342, 184007, 183355, 180129, 177640, 181116, 189417, 194580, 193863, 183758, 186723, 187717, 180100, 179445, 182999, 176837, 170587, 170393, 178716, 183536, 188715, 192837, 190964, 177827, 172970, 170332, 178514, 184217, 181883, 174673, 170181, 169518, 173541, 165339, 163218, 168757, 172599, 179282, 185792, 175054, 170502, 166706, 174531, 177500, 178395, 181109, 179280, 185370, 191305, 194134, 181601, 173976, 180869, 181939, 178286, 176691, 180787, 181004, 182825, 185448, 183472, 183509, 177619, 181354, 181091, 181364, 180671, 183963, 190384, 190839, 192048, 193794, 198812, 198526, 193572, 193782, 197510, 196913, 193761, 194648, 198047, 195144, 194472, 191283, 196444, 194973, 192820, 192796, 189301, 190700, 188607, 188525, 183788, 181960, 192254, 196233, 196484, 199798, 204111, 198855, 186772, 185747, 180927, 175085, 177362, 185088, 194582, 204478, 210372, 208872, 208053, 211233, 209867, 214563]
9556B14563N540J161k445l276L882o84N751J3665K0686J4834Q156K4069K0277
9543C26179K6349K8287K0014J2154R853l511j2981j2029k5074j8175j7105j2690
9531C21271j2225n744J988j2157m251J5814R584M917p40K000K4001K1142J6253
9518C81853J1897J3596K5808L4443L5262L1869M4568K7709K7952L7237L0044K5442
9506G27680K6156K4341J0820Q671K454q334j1739k8403k5289k4263l1065l5003
9494F36026k0846j0598j3123j2924m595m651m135k349K735P047M076P533K3279
9481F07475K8607K2916L1199L8138L2086L3041L6757N3582N3274M5031L4817K5943
9469A042866K6026K0271L850j5188k6148l1760l1370l7212l7026m7485l6313l9183
$$ y = [214563, 220103, 221264, 218819, 215543, 219425, 218741, 224492, 238157, 258843, 273677, 281833, 305902, 326179, 352528, 380815, 400829, 412983, 422836, 419325, 406344, 394315, 369241, 351066, 333961, 321271, 309046, 303302, 305290, 293133, 288882, 304696, 314280, 319197, 318457, 320457, 344458, 365600, 381853, 393750, 407346, 433154, 467597, 502859, 534728, 579296, 607005, 634957, 672194, 702238, 727680, 753836, 778177, 788997, 797668, 800122, 791788, 780049, 751646, 726357, 702094, 671029, 636026, 615180, 604582, 591459, 578535, 573940, 569289, 565154, 562805, 565540, 572587, 576663, 584196, 607475, 636082, 658998, 690197, 728335, 760421, 793462, 830219, 883801, 937075, 982106, 1016923, 1042866, 1068892, 1089163, 1093013, 1077825, 1051677, 1019917, 988547, 951335, 914309, 866824, 830511, 791328]
9457G91328l8792l3768k7070k3306k2256j5561j5332j0148K244n394q004R624
9445F03565J5218K1117J8440J3166K6201K8735K4607L3146L8688M0925L9930L6992
9433I40730K6476J9767j69k4193l5760m4769m6290l9918m0783m4686m7033k9923
9421F33449k6354k7847l3850l0868l1873k2953r073j4207j0829P5M12m510l118
9408D18454M876M513N021P648J8925J2166J1139K3539J4936J6110J5461M066m995
9395E51859m619j7270k1595j6243k4672j7889j6231k1230j3909j2116j1802j0031
9383C64252j1402M549k178O700j769J207N701j313j078K671P988J3087K938j376
9369C89977L690q915K056J3268P613J2428M223L593N943o03l982L608J952M118
$$ y = [791328, 752536, 718768, 691698, 668392, 646136, 630575, 615243, 605095, 607339, 601945, 593941, 603565, 618783, 639900, 658340, 671506, 697707, 726442, 751049, 784195, 822883, 863808, 903738, 940730, 967206, 986973, 986804, 962611, 926851, 882082, 835792, 795874, 755091, 710405, 663372, 633449, 607095, 579248, 545398, 514530, 482657, 459704, 450631, 436424, 425595, 425670, 426082, 421572, 418454, 423330, 427843, 432864, 440512, 459437, 471603, 482742, 506281, 521217, 537327, 552788, 556854, 551859, 547240, 529970, 508375, 492132, 467460, 449571, 433340, 412110, 398201, 386085, 374283, 364252, 352850, 357399, 355221, 361921, 360152, 361359, 367060, 365747, 364669, 367340, 375328, 388415, 391353, 389977, 393667, 384752, 386808, 400076, 407689, 420117, 424340, 427933, 433876, 433273, 429291, 432899, 434851, 438969]
9355D38969O010K234l469M08Q450J0361O200P380P212Q034R861P520J0460j40
9341E19490O047Q342N867N483J3334J2293j773P341J0909R827J3069J503J888
9328F13620P101Q063R645L207L398N753l715m757J2715J1682R902M658L819R731
9314F94822J5044J9050P983Q041N587N838P826R190O352j705O69J3858J9488J1436
9300H23479L868o94Q248R238J796J418J0171J1476M415J1996L122J154M280L22
9286H94289J0376J2469N708M894J0480J0917Q706J1203N981J0836J0970J0550
9274A007379P50M600J3131J3204M033Q393M211P157M935R667N86K237P553P07
9260A088543j932n726J256j0894q600n580j1868j7924k726M095R439K928N878
$$ y = [438969, 444979, 447213, 443744, 444152, 452602, 462963, 469163, 476543, 483755, 491789, 501650, 509170, 519630, 519490, 525537, 533879, 539746, 545229, 558563, 570856, 569083, 576424, 587333, 597160, 610229, 611732, 613620, 620721, 628784, 638429, 641636, 645034, 650787, 647072, 642315, 655030, 666712, 676614, 681272, 685091, 694822, 709866, 728916, 736899, 744940, 750527, 756365, 764191, 773381, 779733, 778028, 778697, 792555, 812043, 823479, 827347, 826653, 834901, 844139, 845935, 847353, 857524, 869000, 873415, 885411, 888533, 889687, 893967, 894289, 904665, 917134, 922842, 927736, 938216, 949133, 957839, 969042, 975023, 985859, 996829, 1007379, 1008129, 1012729, 1025860, 1039064, 1043097, 1051490, 1055701, 1062858, 1067793, 1077460, 1078046, 1080283, 1087836, 1088543, 1086611, 1080885, 1082141, 1071247, 1062647, 1057067, 1045199, 1027275, 1024549, 1028644, 1038083, 1041011, 1046889]
9247A046889Q168J3943P725l392N962K2321J6649J2385N431Q888M705P892Q044
9234A165610L072M575R275M381n48o035j0407r607j625j2129j0030j6253j3623
9221A106656q911o776m740j31o70J380O290J9521J4203K0945J7815K5596K0139
9208A211317L166Q398K3845J3714R490J3752K5165J8497J8704K2784J6355J7371
9196A402558J6577J0113O949J1963P784J0326J5907J6850J9278K8220L2523L1970
9184A611018L1544M1949M0435M6857N1942N4366N0097N4371P1979O8112P2829
9173B195499Q3697J02632J03735J17379J30733J49255J81635J99930K29033K61485
9163C755013L05863L62196M30534N08407O16607P45778R02298J081798J246520
$$ y = [1046889, 1055057, 1069000, 1076725, 1073333, 1079295, 1101616, 1118265, 1130650, 1136081, 1144969, 1149674, 1157566, 1165610, 1168682, 1173257, 1182532, 1186913, 1186365, 1180330, 1169923, 1160316, 1158691, 1146562, 1136532, 1120279, 1106656, 1097745, 1090969, 1086229, 1086098, 1085428, 1086808, 1093098, 1112619, 1126822, 1147767, 1165582, 1191178, 1211317, 1214483, 1222881, 1246726, 1260440, 1269930, 1283682, 1308847, 1327344, 1346048, 1368832, 1385187, 1402558, 1419135, 1429248, 1436197, 1448160, 1455944, 1466270, 1482177, 1499027, 1518305, 1546525, 1579048, 1611018, 1642562, 1684511, 1724946, 1771803, 1823745, 1878111, 1928208, 1982579, 2054558, 2122670, 2195499, 2279196, 2381828, 2485563, 2602942, 2733675, 2882930, 3064565, 3264495, 3493528, 3755013, 4060876, 4423072, 4853606, 5362013, 5978620, 6724398, 7626696, 8708494, 9955014]
9154I955014J403191J570739J775640K011494K220368K355101K454321K530937
9146B6276805K495774K232438J706424R97029K05553n81219j244702j708446j942697
9137B8436959j980647j837277j558999j186238p82243l80177K2170M31109Q39327
9128B2003984J228843J588497J910210K217089K492616K788206L151131L533017
9120D0913593L951136M340063M669268M867525M876610M690273M336962L879537
9112G6524967L365554K858010K399158J977269J602898J209044P34674J41752
9104I0813326n45216j237337j865876k339326k663658k819326k824655k641921
9096G3876011k306331j849194j284200o62601j1039O45586J278961J850860K385585
$$ y = [9955014, 11358205, 12928944, 14704584, 16716078, 18936446, 21291547, 23745868, 26276805, 28772579, 31005017, 32711441, 33708470, 33914023, 33332804, 32088102, 30379656, 28436959, 26456312, 24619035, 23060036, 21873798, 21091555, 20711378, 20733548, 21164657, 22003984, 23232827, 24821324, 26731534, 28948623, 31441239, 34229445, 37380576, 40913593, 44864729, 49204792, 53874060, 58741585, 63618195, 68308468, 72645430, 76524967, 79890521, 82748531, 85147689, 87124958, 88727856, 89936900, 90671574, 90813326, 90268110, 89030773, 87164897, 84825571, 82161913, 79342587, 76517932, 73876011, 71569680, 69720486, 68436286, 67773685, 67762646, 68408232, 69687193, 71538053, 73923638]
9087G3923638K859463L307371L752738M188279M614903N021225N388367N668748
9079A08724732N823137N858914N780649N631010N382001M855711L951801K584031
9071A48591986Q89455r40008k719886m321621n637121o566090p006677p017001
9063A15273037o712573o197161n547205m796988m012939l247133k519104j821978
9055H0417956j157228n14970R9669P05349J316690J936998K543508L119115L636657
9046I2103744M060718M323405M420128M332549M036166L529250K807396J832750
9038A21446106O81375n92725j915875l172602m266507n129657n710223n997013
9030I5342879o019393n844602n523630n103888m642312m161936l704437l263323
$$ y = [73923638, 76783101, 80090472, 83843210, 88031489, 92646392, 97667617, 103055984, 108724732, 114547869, 120406783, 126187432, 131818442, 137200443, 142056154, 146007955, 148591986, 149481441, 148541433, 145821547, 141499926, 135862805, 129296715, 122290038, 115273037, 108560464, 102363303, 96816098, 92019110, 88006171, 84759038, 82239934, 80417956, 79260728, 78745758, 78845427, 79550776, 80867466, 82804464, 85347972, 88467087, 92103744, 96164462, 100487867, 104907995, 109240544, 113276710, 116805960, 119613356, 121446106, 122127481, 121534756, 119618881, 116446279, 112179772, 107050115, 101339892, 95342879, 89323486, 83478884, 77955254, 72851366, 68209054, 64047118, 60342681, 57079358]
9022E7079358k856177k481445k098324j751027j406133j046263o69198k85840
9014D4484951R3074M81365Q32689J102615J241009J263721J208541J086541Q23911
9005E2618417L31218l29537j035197j718161k291537k733080k953427k936376
8997C8952320k726241k461281k208045j994197j849638j779093j768734j755084
8989B2410007j729844j677248j564322j441321j306252j138350r93406q66159
8981A1693105p40821o37313n59349n08344m63506m25074l87576l45410l07888
8972G317824k76409k50064k16987j73128j30973r1824o4333m0526j6519K1815
8962F078876N5012P6164R7756J28074J37428J52213J65263J72485J69910J69891
$$ y = [57079358, 54223181, 51741736, 49643412, 47892385, 46486252, 45439989, 44770791, 44484951, 44578025, 45059390, 45892079, 46994694, 48235703, 49499424, 50707965, 51794506, 52618417, 52949635, 52620098, 51584901, 49866740, 47575203, 44842123, 41888696, 38952320, 36226079, 33764798, 31556753, 29562556, 27712918, 25933825, 24165091, 22410007, 20680163, 19002915, 17438593, 15997272, 14691020, 13552670, 12559264, 11693105, 10952284, 10314971, 9755622, 9247278, 8783772, 8358698, 7971122, 7625712, 7317824, 7041415, 6791351, 6574364, 6401236, 6270263, 6178439, 6114106, 6073580, 6057061, 6078876, 6133888, 6210052, 6307808, 6435882, 6573310, 6725523, 6890786, 7063271, 7233181, 7403072]
8952G403072J80832J90424K12658K22832K45539K78785L25233L61320M12028M75001
8942A0307724N40056O15222O81315P43762P92418Q33375Q74230Q99341Q93793
8933A7181236Q89566Q82693Q60012Q38588Q20421Q16453Q21803Q62733R24656
8924B4898161J007039J108598J191735J251814J220543J081232Q51842N52737
8916C3163701K30896p4354l09974m33523m36369l37333j54113Q8172L42412N55467
8906C2634982P09442P79761P66609O73620N56772M39566L36029K82907K98563
8897C7478251L59107M93152O70242Q74740J103601J334567J543369J731009J874078
8888D7462116J926212J885095J733295J497319J196116Q51655N25549K12976p4157
$$ y = [7403072, 7583904, 7774328, 7986986, 8209818, 8455357, 8734142, 9059375, 9420695, 9832723, 10307724, 10847780, 11463002, 12144317, 12888079, 13680497, 14513872, 15388102, 16287443, 17181236, 18070802, 18953495, 19813507, 20652095, 21472516, 22288969, 23110772, 23973505, 24898161, 25905200, 27013798, 28205533, 29457347, 30677890, 31759122, 32610964, 33163701, 33394597, 33320243, 33010269, 32576746, 32140377, 31803044, 31648931, 31737103, 32079515, 32634982, 33344424, 34124185, 34890794, 35564414, 36121186, 36560752, 36896781, 37179688, 37478251, 37837358, 38330510, 39000752, 39875492, 40979093, 42313660, 43857029, 45588038, 47462116, 49388328, 51273423, 53006718, 54504037, 55700153, 56551808, 57077357, 57290333, 57216176]
8879E7216176l10389n11873o79745q20124r45209j043760j150138j254910j351627
8870D9148401j422382j445872j402042j299690j139337q99744o08044k88196N1472
8861D0694566M15765P78201J124969J452514J740087J933852K006184J947182
8853E2093320J749516J419014J017578N63405J10036l22774o95523r98214j221610
8844E3714748j363325j470653j521323j540138j542924j527037j462382j396448
8836D1890518j308144j189966j046682r01126p73812o94410o54545o77003p29194
8827C3915636p87738q28002q29236p61869o63681n31858l88515k63175j57323
8818B8704239q1407n6751q3782j13418j67979k25171k62809k89275k76110k51554
$$ y = [57216176, 56905787, 56393914, 55714169, 54894045, 53948836, 52905076, 51754938, 50500028, 49148401, 47726019, 46280147, 44878105, 43578415, 42439078, 41539334, 40931290, 40643094, 40694566, 41110331, 41888532, 43013501, 44466015, 46206102, 48139954, 50146138, 52093320, 53842836, 55261850, 56279428, 56842833, 56952869, 56630095, 55934572, 54936358, 53714748, 52351423, 50880770, 49359447, 47819309, 46276385, 44749348, 43286966, 41890518, 40582374, 39392408, 38345726, 37444600, 36670788, 35976378, 35321833, 34644830, 33915636, 33127898, 32299896, 31470660, 30708791, 30045110, 29513252, 29124737, 28861562, 28704239, 28622832, 28566081, 28482299, 28368881, 28200902, 27975731, 27712922, 27423647, 27147537, 26895983]
8808B6895983k30765k22833k59144l19577m32737n87833p67020r55033j127068
8799B1993973j247855j305707j330834j286754j211984j093425r58927q25355
8791A2733132o79155n43660l93930k62530j59400p4482j6739J1694k895n7396
8781A0554639j28458j98992k39758k82229k84650k55763k00218j53922j28642
8772H682007j13853j40398j99730k74419l48193l99232m47565m63369m45890m12216
8762E437142l74251l25731k90318k54551k23439k01831j83367j66454j56397j37869
8752C122934j18442j25730j15483r9757r0089p2751o4075o5612n7304m9440m5799
8741B218452l8710k5229k5798k4369q925o200j2197j2867j6181m408p533q885
$$ y = [26895983, 26665218, 26442385, 26183241, 25863664, 25430927, 24843094, 24076074, 23121041, 21993973, 20746118, 19440411, 18109577, 16822823, 15610839, 14517414, 13558487, 12733132, 12053977, 11510317, 11116387, 10853857, 10694457, 10619975, 10603236, 10614930, 10612035, 10554639, 10426181, 10227189, 9987431, 9705202, 9420552, 9164789, 8964571, 8810649, 8682007, 8568154, 8427756, 8228026, 7953607, 7605414, 7206182, 6758617, 6295248, 5849358, 5437142, 5062891, 4737160, 4446842, 4192291, 3968852, 3767021, 3583654, 3417200, 3260803, 3122934, 3004492, 2878762, 2763279, 2663522, 2573433, 2500682, 2436607, 2370995, 2313691, 2264251, 2218452, 2179742, 2154513, 2128715, 2104346, 2095421, 2089221, 2077024, 2064157, 2047976, 2043568, 2036035, 2027150]
8729B027150j1780r183j1557j5126k6206k6953k4610k1624l2636k0325j6026k0393
8717A790731j0263L55q176j1094q921j0944j0753q064j3274q282L581J5887O430
8704A727213o970L830J0090M401Q871K513j210m744j1458j7095k0740k0467l3763
8691A640471l2855k2493k4590l5750l2713k9102k9740j8923j5982k1764k6247
8680A350312j9507j6182j1042k498M2j2949j2130O471P433J9150K7636L5144K9124
8667A401004K3758L0049K9396L2329K6916J2714q73M778j017q461n301L688K7929
8654A576909L5608P1718J39791K16143L66410O66434J116737J222267M94207n3439
8644E852785l65752m22816o79328r80942p85245n00554l23816k02453j33396q2763
$$ y = [2027150, 2015370, 2006187, 1994630, 1979504, 1953298, 1926345, 1901735, 1880111, 1847475, 1827150, 1811124, 1790731, 1780468, 1780823, 1772647, 1761553, 1752632, 1741688, 1730935, 1722871, 1709597, 1701315, 1704896, 1720783, 1727213, 1720243, 1724073, 1734163, 1738564, 1747435, 1749948, 1748738, 1743994, 1732536, 1715441, 1694701, 1674234, 1640471, 1607616, 1585123, 1560533, 1524783, 1492070, 1462968, 1433228, 1414305, 1398323, 1376559, 1350312, 1330805, 1314623, 1303581, 1301083, 1301125, 1288176, 1276046, 1282517, 1289950, 1309100, 1336736, 1371880, 1401004, 1424762, 1454811, 1484207, 1516536, 1543452, 1556166, 1555293, 1560071, 1559054, 1550593, 1545292, 1548980, 1576909, 1612517, 1684235, 1824026, 2040169, 2406579, 3073013, 4189750, 5412017, 5906224, 5852785, 5487033, 5064217, 4384889, 3403947, 2618702, 2118148, 1794332, 1591879, 1458483, 1375720]
8634A375720n5376m6879k9983r091p669q623l411j0156l613R336M195N801J7582
8621A237833K4190K3464K1353L4102L4093N6526P7571O0439M6748L6928M5282
8610A698529P2196R6310J42829K28418L65653O32406J149036K054883K636598
8601I076858J284382O5769o54250q10221j128796j957402j706338j103104p00548
8592B366350m55378l04287k17919j55747j06346q5342o9980p2062o1207m7618
8582G90464m0317m6516m0496k3873j3801K464J2132J283Q233K5880M8742N6777
8570G80972L0301N422O88K112n53j3264N460N1409J05824J74162K95112N11629
8558A949274Q88224J248993Q84504J61702k19913m02668m79628q56605r04305
$$ y = [1375720, 1320344, 1273465, 1243482, 1234391, 1226722, 1218099, 1214688, 1204532, 1200919, 1210255, 1214450, 1220251, 1237833, 1262023, 1285487, 1306840, 1340942, 1375035, 1431561, 1509132, 1569571, 1616319, 1653247, 1698529, 1770725, 1867035, 2009864, 2238282, 2603935, 3236341, 4385377, 6440260, 9076858, 10361240, 10427009, 9772759, 8962538, 7833742, 5876340, 4170002, 3066898, 2366350, 1910972, 1606685, 1388766, 1233019, 1126673, 1041331, 971351, 899289, 838082, 790464, 750147, 703631, 663135, 639262, 625461, 627925, 640057, 641340, 649573, 675453, 724195, 780972, 811273, 816695, 817383, 819495, 818942, 805678, 811138, 862547, 968371, 1142533, 1437645, 1949274, 2837498, 4086491, 4970995, 5132697, 4912784, 4510116, 4030488, 3173883, 2269578]
8549B269578o17915l86540k44234j63136j13712q0866n2727m1823l7487k9303
8539E01835k4721j7616j8839k0651o189l115M140O038P377J8374K2071K4991K6977
8526E20672J1427L534j2536k2365k7915l5307l8557k4710j4801n267j2549j3555
8514C28071j2715n421N359K63O961J8207O232R483K474q133o68L165J2003R536
8500C74817M857P537M299P394N192J761N953Q130P587R861J0546O997J8694R914
8486D83539n282j3258j4450l314m724n213p41n179k138l917k508q445j3920q788
8472C91662m963L68N15j453J0973L23k072M303o254L682J1005M749j334P938Q247
8457D27689O861R957N533K7013J7554K0939J7619L684l925r674q089o302k6327
$$ y = [2269578, 1651663, 1265123, 1020889, 857753, 744041, 663175, 610448, 568625, 531138, 501835, 477114, 459498, 440659, 420008, 413819, 410704, 414844, 420882, 428259, 446633, 468704, 493695, 520672, 532099, 535633, 523097, 500732, 472817, 437510, 398953, 374243, 359442, 354175, 341626, 328071, 315356, 309935, 315294, 315557, 322518, 340725, 346957, 356440, 358914, 350781, 350113, 353278, 365281, 374817, 379674, 387211, 391510, 398904, 404096, 405857, 411810, 419940, 427527, 437388, 447934, 454931, 473625, 483539, 478257, 464999, 450549, 447235, 442511, 437298, 436557, 431378, 429240, 425323, 422815, 414370, 400450, 391662, 386699, 387067, 387582, 386129, 397102, 397425, 395353, 399656, 393402, 397084, 408089, 412838, 411504, 419442, 427689, 434550, 444507, 450040, 477053, 494607, 515546, 533165, 536849, 532924, 523250, 515161, 508859, 482532]
8444D82532k8994j6562j0924j6339p327O125P754N167N200m128l115j3659j0322
8431C95408j5987j5135j0311p020K538P657l127r966m983k249P977K408J7900
8418C65110K6718J8653J0615L402m776j1012p586j4950j7065j5776j1922j2507
8406C28904l517m087r257m466q788K151N477M084K039m048k547j9131k4587j6188
8392B46039j8019j7001j3046p146m646o524k682J038O03j408K818J2222L651k433
8378A93466K939J664l569O162j705j316L02m379K45K405p548l563J848l908n497
8363A77546p570q684r671m166q829j3690p315L405P074J712m89L04j533n305p74
8348A22015J602j862N772p12j1557q101k389l303Q452N523l88m711m840K272L588
$$ y = [482532, 453538, 436976, 426052, 409713, 402386, 408511, 416265, 421432, 426632, 422504, 419389, 405730, 395408, 379421, 364286, 353975, 346955, 349493, 357150, 354023, 344057, 339074, 336825, 344802, 347210, 365110, 391828, 410481, 421096, 424498, 419722, 408710, 401124, 386174, 369109, 353333, 341411, 328904, 325387, 321300, 312043, 307577, 298789, 300940, 306417, 310501, 312540, 308492, 305945, 286814, 262227, 246039, 228020, 211019, 197973, 190827, 186181, 179657, 176975, 178013, 178616, 177208, 180026, 192248, 195899, 193466, 196405, 198069, 194500, 200662, 198957, 197641, 197943, 193564, 193809, 196214, 188666, 185103, 186951, 183043, 177546, 169976, 161292, 151621, 147455, 138626, 124936, 117621, 121026, 128100, 129812, 129323, 129627, 128094, 122789, 122015, 123617, 121755, 127527, 126815, 115258, 107157, 104768, 101465, 109917, 115440, 115052, 110341, 105501, 107773, 111361]
8333A11361J269p235j168l165o51P186l092p009l703J0189J0742J932q752o81
8319A07223O156m351r315l628j158m936N61k047o936j201l20M195K460K260j2932
8304G6031p742L859L952n19K095J1240P569p813r07M181n945j936m416j08M191
8289H3732J507k733j3089P10J1824K809j310m378k143M363l51p567n179M097L236
8274G5528p639o538O172R743K24N174K460O31p757l568J535M57j081L122N86L630
8258H2679j0110j4r094l204J0786P656l76L356Q60l147q219o056m481M317J44
8243F5097M501P619K457R232R150K588m914j1680j09k042k932k761K453N030L324
8228H7013J1544N858L253j546l135q161q779r005N33j7J595m050N594R310l570
$$ y = [111361, 112630, 105395, 104227, 101062, 100411, 107597, 104505, 97496, 93793, 103982, 114724, 116656, 107904, 107223, 113379, 109028, 99713, 96085, 94927, 89991, 90552, 88505, 81569, 80368, 80048, 84243, 86703, 88963, 76031, 68289, 72148, 76100, 75581, 77676, 88916, 96485, 88672, 87765, 91946, 86001, 84065, 79649, 79541, 83732, 85239, 82506, 69417, 70127, 81951, 84760, 83450, 79072, 76929, 81292, 80941, 73374, 68195, 72292, 75528, 67889, 61351, 67523, 77266, 77490, 82664, 85124, 85755, 77998, 74430, 75965, 76422, 75341, 78463, 79049, 82679, 72569, 72555, 63461, 60257, 71043, 78699, 78323, 81679, 82539, 79392, 71173, 65117, 60636, 64953, 65097, 69598, 77217, 79674, 88906, 98056, 100644, 95730, 84050, 83941, 81899, 78967, 76206, 78659, 83689, 87013, 98557, 104415, 107668, 106122, 102987, 94826, 86047, 77042, 77575, 77558, 79153, 75103, 80697, 90007, 86437]
8213H6437p808R62r25n630o029L306k100n796Q465k324j473J0696R725N215j930
8198I0791J6940J6102q387Q28m202q346K00m581o394P460nm21o739K136J041P132
8182A03555k027l523j2229j1781j68K317o225n0M950M030L31N6N62k455j464N495
8166H1374J832j976L149j622j193R63K96l968k069j006m833o47K0787J4024J1407
8151A16518J4263L123M16L246p765j6836J264N585j2l373l279o342j65p82K436
8136A08297M601O888j452n322J5384K1380K4687K1589K7021K4544K4198K0256
8124B92071J3280J893j0072j8026k5164k8796k2555j5799k0361j2322K332J4347
8112A70828Q885J0427J0217L853J126k931j69k514l01P05o391p488o766j8759
$$ y = [86437, 78629, 79591, 78666, 73036, 67007, 70313, 68213, 62417, 70882, 68558, 67085, 77781, 87506, 92721, 90791, 107731, 123833, 115446, 116274, 112072, 103726, 103926, 99345, 92951, 100411, 100406, 99985, 93246, 95382, 96423, 103555, 101528, 98005, 85776, 73995, 73827, 76144, 69919, 69869, 74819, 78849, 79180, 79236, 79798, 77343, 75879, 81374, 83206, 81230, 84379, 82757, 81564, 82527, 82823, 78855, 76786, 75780, 70947, 70300, 91087, 105111, 116518, 130781, 133904, 134320, 137566, 129801, 112965, 114229, 119814, 119802, 116429, 113150, 106808, 106643, 105861, 108297, 112898, 119786, 118334, 113012, 128396, 149776, 174463, 196052, 223073, 247617, 271815, 292071, 305351, 307244, 297172, 279146, 253982, 225186, 202631, 186832, 166471, 154149, 156481, 170828, 179713, 190140, 200357, 204210, 205336, 202405, 202236, 199722, 199421, 200126, 193735, 186247, 179481, 160722]
8098A60722p597p522j319N019J528J4325J9779P844k677J248N472R015J6155J2531
8084B34523K3378L4995N0125O7737P4455P6001N8949K6826P55j9116m5234o6354
8072E17040o8662n0896l0772j4551k928k258j8202k0963j4704p529j3516q849
8060B63210o202J07K83J401J0264M318k313M915L620M64L585N360O066J106N783
8045C01967M146R229J3471Q446J0555L3310M2358M2729K0397l365P367J978r301
8032D83287l56l10j1431j5849j6150j9443j6644k3870k3392j6291k1169k1628
8020B96754p088J229O783j699L133Q547J044M489o94L85m481m185r042j7444n808
8005B71923j829r172o861q431o004J571J642o407o146q368r068K406L187L98j005
$$ y = [160722, 153125, 145603, 144284, 149303, 150831, 165156, 184935, 192779, 190102, 191350, 196822, 205837, 221992, 234523, 257901, 292896, 343021, 410758, 485213, 561214, 620163, 646989, 647744, 628628, 583394, 517040, 448378, 397482, 366710, 352159, 349231, 346973, 328771, 307808, 293104, 285575, 272059, 263210, 257008, 257115, 257398, 258799, 269063, 273381, 271068, 275983, 279603, 280067, 283652, 289012, 295078, 296184, 301967, 306113, 315342, 328813, 337259, 347814, 381124, 423482, 466211, 486608, 483243, 490610, 492588, 483287, 482931, 482621, 471190, 455341, 439191, 419748, 403104, 379234, 355842, 339551, 318382, 296754, 289666, 290895, 297678, 295979, 299112, 307659, 308703, 313192, 312498, 312883, 308402, 304217, 295175, 277731, 271923, 270094, 260922, 254061, 245630, 239626, 241197, 242839, 236432, 230286, 221918, 212850, 215256, 218443, 218841, 217836]
7990B17836m568j393l804r70n388n799q214k298j660j0336L05n381O793N348K570
7975A83041Q896J2341n602m169k290n375J047J0045J0307M970l402r026r390n251
7961A86142j2564n387j3760q623m451q432o264m245j727J375l280n078n904k831
7947A04971k209L485p722l333k719L713O999J770K098r08M93K856k079k880M376
7932A08911J242o513O845N094k314J181P255K351l619k279r286m225l195n548
7918I5900r587j536K85o980l999L179p356j2082k62N565O993k597L718K365P001
7903H0607N850J421j1975j2625l053m259j367J637O846o38n631q618N324N093
7889E8612J161l32n639m558k539O614P645j449n655n125J783J990N410K412n085
$$ y = [217836, 213268, 211875, 208071, 207101, 201713, 195914, 187700, 185402, 183742, 173406, 173711, 168330, 175123, 180471, 183041, 191937, 204278, 198676, 194507, 192217, 186842, 187889, 197934, 208241, 213211, 209809, 200783, 191393, 186142, 173578, 168191, 154431, 145808, 141357, 132925, 126661, 122416, 120689, 122064, 118784, 113706, 107802, 104971, 102762, 106247, 98525, 95192, 92473, 96186, 103185, 104955, 107053, 106145, 106638, 109494, 107415, 104535, 108911, 110153, 103640, 110485, 115579, 113265, 114446, 121701, 124052, 120433, 118154, 108868, 104643, 101448, 95900, 86313, 84777, 85062, 78082, 74083, 77262, 69906, 57824, 57562, 63127, 70120, 67523, 71241, 73606, 80607, 86457, 87878, 75903, 63278, 60225, 55966, 54599, 56236, 63082, 62444, 56813, 48195, 53519, 58612, 59773, 59441, 53802, 49244, 46705, 53319, 60964, 59515, 53860, 48735, 50518, 52508, 57918, 60330, 55245]
7874E5245o092q535q99P008J161P180R98n394o04j895J139J741q066j023k542
7859C9422n166J935J811K116O23m766l754L200O057L58o280J71M663L71n389j0796
7843B4576L881J1327j345m043l891N462p00J532M574K223q130m662M820P100j53
7828D2571l864J892O9M246l245N13j474l201o376P41P593K1n536O175o105O755
7812D0775K173j226p64j0122p762J791J934R89o993k670J62l738j134L930L050
7797B0395M225q955n823J721J708k96Q670J974j554M06K127K650R588O055j1877
7782C1014k861K201J709K035n615o088P628j910J30Q64j973L083r70o576l483
7767A9188k892K108N143j274L610Q366N82P003Q567Q84m935j758n456L475m190
$$ y = [55245, 49153, 40618, 39719, 46727, 47888, 55068, 56066, 50672, 50068, 48173, 49312, 51053, 42987, 41964, 39422, 34256, 36191, 38002, 40118, 40741, 35975, 32221, 35421, 41478, 41836, 35556, 35727, 40390, 40761, 35372, 24576, 28457, 39784, 38439, 34396, 30505, 35967, 35267, 36799, 41373, 43596, 35466, 30804, 35624, 42724, 42571, 38707, 40599, 40668, 44914, 41669, 42182, 40708, 37507, 31131, 31872, 39465, 39486, 33950, 40125, 34020, 40775, 42948, 41722, 40958, 30836, 23074, 24865, 26799, 27788, 20795, 18125, 18287, 14549, 13415, 17345, 20395, 24620, 15665, 9842, 11563, 13271, 12975, 21645, 23619, 22065, 22471, 24598, 27248, 36836, 42891, 31014, 28153, 30354, 32063, 34098, 28483, 22395, 30023, 28113, 28243, 29107, 27134, 30217, 29247, 22671, 19188, 16296, 18404, 23547, 22273, 25883, 34249, 34831, 41834, 50401, 51285, 46350, 44592, 39136, 42611, 38421]
7752C8421j15k871l202N17k907L9M099l033O05P972l367n228K847j836k599J149
7736C0491J286r662j264L233R356k816k698k439O822m001p85J193L787p252j858
7721B3393M546L509M420j079n700j369j418k934j842n964L452l005o594K104q60
7706A0659k531Q616nl196K831L48K736K994J826j626K508K130j562l157l557M650
7690B3664k99m456r49K811j2030j744P657L387K766j0946j878m90M250R614r03
7675B0454N265K995k849l682m352m400j0064L952M834L870J997m221j066l139
7661I594n917q5K721N837K064K123J899k681o630M713N138M417p696j259k730
7646A1508M86L17K793J966P055q21k740L008l840n686J071j51q34O3n164O925
$$ y = [38421, 38306, 35435, 32233, 32750, 29843, 29882, 33981, 30948, 31553, 39525, 36158, 30930, 33777, 31941, 29342, 30491, 31777, 22115, 20851, 24084, 33440, 30624, 27926, 25487, 32309, 28308, 27523, 28716, 32503, 25251, 23393, 27939, 31448, 35868, 34789, 29089, 27720, 26302, 23368, 21526, 15562, 19014, 16009, 9415, 11519, 10659, 8128, 16744, 16739, 13543, 16374, 16722, 19458, 22452, 24278, 22652, 25160, 27290, 25728, 22571, 19014, 23664, 23365, 18909, 17960, 20771, 8741, 6997, 14654, 18041, 20807, 9861, 7983, 7493, 11743, 21357, 20454, 25719, 28714, 25865, 22183, 17831, 13431, 3367, 7319, 12153, 16023, 18020, 13799, 12733, 9594, 3677, 3592, 6313, 12150, 14214, 16337, 18236, 15555, 8925, 13638, 18776, 23193, 15497, 14238, 11508, 11994, 12311, 15104, 17070, 24125, 23304, 20564, 23572, 19732, 14046, 15117, 14966, 14132, 14195, 9031, 15956]
7630A5956N595J12P437l921j2383j189P737N519p782m942j497j347n758J766N908
7615A1211R91j844O477L347n854m821P81K373J975K957j801j841L766Q538N13
7600B6768m341l238L538N778o19l170r745p967K992P454M449p82m483m806J709
7585A3537J1393m019p899j0078r80l773O873L073j978K139m82L022M897m984m380
7570F361n493M478J403Q974n26p350K80O233Q990K632l919J507k49j2443p790
7555C088J828K590Q816j407q579n503L096J248M452O532j722n652j638o1R182
7540A6270o415L16R035m303r216J953N103L648o212k735L896L388j1347o242K704
7525a57Q250R70L32O457k943j755M103j958p42L546m335l445J769m688j211Q514
$$ y = [15956, 21551, 21663, 29100, 25179, 12796, 11607, 19344, 24863, 17081, 12139, 10642, 9295, 3537, 5303, 11211, 12202, 10358, 16835, 20182, 14328, 9507, 10288, 12661, 14636, 17593, 15792, 13951, 17717, 26255, 26768, 22427, 19189, 22727, 28505, 27886, 24716, 14971, 7004, 9996, 17450, 21899, 21117, 16634, 11828, 13537, 24930, 20911, 13012, 2934, 1954, -1819, 5054, 8127, 6149, 8288, 7806, 10828, 15725, 10741, 6361, 868, 5346, 6749, 15723, 15197, 7847, 8127, 14360, 23350, 25982, 22063, 23570, 23321, 10878, 3088, 4916, 7506, 16322, 14915, 6336, 833, 3929, 5177, 9629, 16161, 14439, 8787, 7149, 7088, 16270, 9855, 10171, 19206, 14903, 5687, 7640, 12743, 16391, 10179, 7444, 11340, 14728, 3381, -2861, -157, 8093, 9063, 9395, 15852, 12909, 11154, 15257, 13299, 12557, 16103, 11768, 8323, 10092, 5404, 4193, 12707]
7509A2707j93o202Q48K478K39q0L288J592n65N61N428N852q905r421K107J666
7493A1400L418q175m152M665N463M97j782q09N063k928n598n407n550k988L084
7478c799Q459O636l135J810k36L642l405p230k40J657k265r46m047L699K138j221
7462A517k432k774o540M093K528J5773N123r847n235l619j51M111R614K745j25
7447A4781p858j625P81m979j808l050M154j521m251k35J176J826M50K111K158
7432B110o32j577j220j905l462N625O418J606O239P831j66n516m812J69J817n542
7416F983n762j458j274K28Q596Q116K239r348j0613R265k91r187j340N081M016
7401E251J052M009j444P319j914r157L929m47Q122J241k050j2560L972J085L091
$$ y = [12707, 12514, 6312, 7160, 9638, 9877, 9797, 13085, 14677, 14112, 14673, 20101, 25953, 17048, 7627, 9734, 11400, 14818, 6643, 2491, 7156, 12619, 13116, 11334, 10525, 15588, 12660, 7062, 1655, -3895, -6883, -3799, 4660, 11296, 8161, 9971, 9735, 13377, 9972, 2742, 2502, 4159, 1894, 948, -3099, 600, 2738, 1517, -915, -3689, -10229, -6136, -3608, 12165, 17288, 7441, 2206, -1413, -1564, 2547, 12161, 14906, 14781, 6923, 5298, 6079, 1100, -708, -3758, 396, -1125, -5376, -5611, -4435, -2609, -2159, -48, 2110, 1478, -99, -1319, -3224, -6686, -1061, 5357, 6963, 13202, 21033, 20867, 15351, 10539, 10708, 12525, 6983, 1221, -237, -1511, -1283, 7313, 15429, 17668, 8320, -2293, 6972, 6681, -2506, -3846, 1235, 5251, 6303, 10312, 8868, 16187, 14273, 5116, 9045, 8598, 16720, 17961, 15911, 3351, 7323, 8408, 11499]
7386A1499M68J703L564N46n337J37j248o944L579j769J681J225q20j219N215J467
7370A3747j899l804p137L530L086R09k722p95o525q656M271N841n321P68L51K160
7354b196k107k313Q352O74O138O269J970k506k179n343m162j072j095O036M748
7339A1214R95M838j253m527j169j503k121j027o377j1153j218Q471M331K138K041
7324C680n486M428N426K211p826m584J950J761K339o013k041j466M61P34j275
7309e701M133K357p61K227J0408J452m772k980N363j986j711K965J256m276K893
7294A0867K133j205m520M421L457J408l871l181n504p290l704N384K765q85N038
7279E313k032L225Q87m581m361M421J330K869L312l853l102j481j85P597K73k189
$$ y = [11499, 11967, 13670, 17234, 17780, 12443, 12580, 11332, 4388, 7967, 6198, 7879, 9104, 8284, 7065, 12280, 13747, 11848, 8044, 907, 4437, 7523, 8432, 5710, 4915, -1610, -10266, -5995, -154, -5475, -4707, -4356, -2196, -4303, -6616, 1736, 2410, 8548, 14817, 16787, 14281, 12102, 6759, 2597, 1525, 430, 6466, 11214, 12209, 17047, 15794, 11267, 10098, 8595, 6474, 5447, -930, -12083, -13301, -4830, -499, 1639, 3680, -1806, 2622, 8048, 10259, 2433, -2151, -201, 1560, 3899, -2114, -4155, -5621, -5160, -4426, -5701, -1568, 789, 28, 2255, 12663, 14115, 9343, 6363, 11726, 9740, 8029, 10994, 12250, 7974, 10867, 13000, 11795, 7275, 11696, 15153, 16561, 12690, 9509, 4005, -3285, -6989, -1605, 1160, 275, 5313, 3281, 6506, 7393, 2812, -1549, 2872, 4202, 7071, 10383, 6530, 3428, 1947, 1762, 9359, 9632, 7443]
7263G443j74j1780r70L51Q69J971k684N361l44K550M502j373Q930M445q491m057
7247F549l291J906K682L945J16j0874m279O850J278L246K833l847j815L461R483
7232A8243r450j657j214j913J04m527n208O482N468l946N454O237p84k629K031
7217A2691k067j1038L122J514n041o749J509N529M069m850N232P490J051l636
7203H826j0321K989K614k577p02l147k607m142N613O820p55l252K673N941j615
7188F358j384O798N986k585L79n801j2556k506N598K167O545j455R5O34n678n246
7172b651N468N149j69k638O235J10p388j659N79l275O24L193k852k914K007N478
7156E297J670J647M50M585k445k418m743k499q676L29N749Q524J0819m810k079
$$ y = [7443, 7269, -4511, -5481, -5130, -4261, -2290, -4974, 387, 43, 2593, 7095, 5722, 14652, 19097, 10606, 6549, 3258, 5164, 7846, 11791, 11907, 1033, -3246, 3604, 4882, 8128, 10961, 7114, 5299, 8760, 18243, 8793, 7136, 5922, 4009, 4113, -414, -5622, 860, 6328, 2382, 7836, 14073, 13289, 10660, 12691, 10624, -414, 2708, 4222, -819, -7568, -6059, -530, 3539, -1311, 3921, 11411, 12462, 8826, -1495, 1494, 4108, 1531, 829, -2318, -4925, -9067, -3454, 3366, 2611, -641, 2032, 7973, 6358, 4974, 11772, 17758, 15173, 15552, 9751, -2805, -5311, 287, 2454, 8999, 7544, 7639, 8273, 2595, -2651, 2817, 7966, 7797, 5159, 11394, 11504, 4116, 2457, 3036, -239, 385, 3578, 726, -2188, -181, 5297, 6967, 8614, 9064, 13649, 11204, 8786, 4043, 1544, -7132, -6803, -1054, 7470, 18289, 13479, 11400]
7141A1400J788K398o528k066N351L1j688n398j451M995n644j950o534K207L480
7126C91O277J0468n182p042R90j643k2J169n992K04l440O066J524m448Q94m935
7110d721j449L457K276K704P364P68j780m974k079k600l729j732o783J289K110
7095i879l446J914O638K83M377m800j061M66L88J770m89m783K847P250l773n148
7079g446K710J252P788K291n444k90m858j006N493L383n466j604R007O723J1917
7064B4450O35j0268j0546r942j16L410p76o645q220P387L245l028n137k93L330
7049a2514M690K225k24j461J802J842K720O986J147K604M804k670r165j761J1118
7034A2143q53k902K661L368J652o913q59n469L841M452M9J1283j111M64K462l614
$$ y = [11400, 13188, 15586, 9058, 6992, 12343, 12374, 10686, 5288, 3837, 8832, 3188, 1238, -5296, -3089, 391, 6668, 17136, 11954, 4912, 5902, 4259, 4237, 5406, -586, -382, -3822, 2244, 3768, -680, 214, -4721, -6170, -2713, -437, 2267, 9631, 10399, 8619, 3645, 1566, -1034, -4763, -6495, -13278, -11989, -9879, -13325, -11411, -4773, -4490, -113, -4913, -5974, -5508, -5120, -3350, -3839, -8622, -5775, 1475, -2298, -7446, -4736, -3484, 4304, 6595, 1151, 861, -3997, -5003, 490, 3873, -1593, -3197, 5810, 12533, 24450, 25085, 14817, 4271, -5671, -5787, -2377, -3153, -9798, -18018, -10631, -7386, -10414, -15551, -15844, -12514, -7824, -5599, -5823, -7284, -5482, -3640, -920, 6066, 7213, 9817, 14621, 11951, 2786, 1025, 12143, 11290, 8388, 11049, 14417, 16069, 9156, 8297, 2828, 6669, 11121, 11170, 22453, 21342, 21806, 24268, 20654]
7018B0654l528p809J769n670L401Q402J067m363r071q94l478p987j1209J589K387
7003a4740k729J481l84j978J781L85r16M266M437j593j255J0466O845O72p859
6988a121k619k689l679M875J3251N799l104l181K710k20M99N342r77j393m037
6973I456o103l064L472k353l496n873L452L934Q36K748K269j527K979j426o370
6958a066n929K487K093n219o919l739l288Q913J3912N955o258J543q10j937Q219
6943G957M251p026o183l988o570K700O70r244l599R868J1740j650l616R495J164
6928E969n902j616k916O42J302L148J640M732m744n850q746j664n31L845j135
6913a1826R488M336j938L53l854L393O169N467l870p387j353J688k333P447M824
$$ y = [20654, 17126, 9317, 11086, 5416, 8817, 17219, 18286, 13923, 4852, 3958, 480, -7507, -18716, -17127, -14740, -17469, -15988, -16372, -18350, -16569, -16184, -17100, -12834, -8397, -9990, -11245, -779, 6066, 6738, -1121, -3740, -6429, -10108, -5233, 8018, 13817, 10713, 7532, 10242, 10022, 10521, 15863, 14886, 13493, 9456, 3353, 289, 3761, 1408, -2088, -7961, -4509, -575, 261, 3009, 5278, 3751, 6730, 5304, -1066, -6995, -4508, -2415, -7634, -14553, -18292, -21580, -12667, 1245, 7200, 942, 2485, 1675, -262, 7957, 12208, 5182, -1001, -4989, -11559, -8859, -8189, -17433, -21032, -11164, 576, -1074, -4690, 4805, 5969, 67, -1549, -4465, -3823, -2521, 627, 2267, 6999, 2255, -3595, -12341, -14005, -14536, -10691, -11826, -2338, 1998, 60, 413, -3441, -48, 6121, 11588, 7718, 331, -1022, 666, -1667, 5780, 10604]
6898A0604l728j089N147k226K483l594n040O12n500n185L037j679j204O916J80
6883b66m138r86k462J0j988Q46L492k771J702J2476j38o047k846j77k176P50K990
6866a729O92K60J77O157K525o956P853P721k619m356m527o541k634m355m685j218
6850a4235M320Q337O552N077l970j1091K129N800P22M660k020m031l408L269L810
6835E921K636l765k127K439k795l509K316M661M551R812l417n340L282J1770K3048
6820D9483L5346L0173P131q267l568p460j3693j3918j9350j5993q808q54r136
6807B1086Q79Q180J995l976q548O85N89N314j0385J626J4492j068L409Q19l403
6792C1694j503j905J714M940R087O503K110j959L454j583l654m61K957J2766J2480
$$ y = [10604, 6876, 5787, 10934, 8708, 11191, 7597, 2557, 3169, -2331, -7516, -4479, -6158, -7362, -446, -266, -4404, -5390, -7852, -7842, -9830, -8984, -5492, -8263, -6561, 5915, 5777, -270, -3116, -3293, -5469, -4719, -1729, -1037, -777, -600, 5557, 8082, 1126, 8979, 16700, 14081, 9725, 5198, -1343, -3977, -8332, -13017, -14235, -9915, -1578, 4974, 10051, 6081, -5010, -2881, 2919, 3641, 8301, 6281, 2250, -1158, 2111, 5921, 8557, 4792, 2665, 5104, 2309, -1200, 1116, 5777, 10328, 20140, 16723, 11383, 14665, 26435, 49483, 84829, 115002, 122133, 113866, 110298, 102838, 89145, 75227, 55877, 39884, 31076, 30222, 21086, 21965, 30145, 32140, 28164, 19616, 20301, 20890, 26204, 15819, 17445, 31937, 30869, 34278, 35097, 31694, 30191, 28286, 30000, 34940, 44027, 50530, 52640, 50681, 54135, 52552, 48898, 48437, 51394, 64160, 76640]
6777G6640J4017R414O071J4389J6893K2172J5442J8037L2295M5187L5577M5105
6765C51239M1363K5479m66j9710o1Q669K2258L0113M6359P9532J19093J50315
6753H54183J18295M8778j5763o0120j03237j28735j46604j36310j05091q7204
6743B38192o8398l7374k0022j6167j7936j0434o657q296n125m27M286o207k983
6730D2452R851O008m686j1620n316q057J207J53l91n399j0379o645K163M057q1
6715A3317j220l362m318K877K976J2058L05J289l14M030k508o618L212j258o017
6700A4449K445L396q99j4097q425O59J1441R8p230k122K177O7p370O811J3618
6685A5018k459m014n029j1848K325L812L580j329L534K217k682R80J0029K311
$$ y = [76640, 90657, 100071, 106142, 120531, 137424, 159596, 175038, 193075, 225370, 270557, 306134, 351239, 392602, 418081, 417615, 397905, 397844, 406513, 428771, 458884, 505243, 584775, 703868, 854183, 972478, 1021256, 1005493, 945373, 842136, 713401, 566797, 430487, 325396, 238192, 169794, 132420, 112398, 96231, 78295, 67861, 61204, 52908, 47783, 47356, 51642, 45435, 42452, 52303, 58311, 53625, 42005, 36689, 28632, 29839, 29992, 29601, 24202, 13823, 7178, 9341, 13398, 13317, 12097, 8735, 4417, 7294, 10270, 22328, 22633, 23922, 23608, 27638, 25130, 18512, 21724, 20466, 14449, 16894, 20290, 19391, 5294, -3131, -2472, 8969, 9067, 1837, -285, 1892, 1959, -5411, 1400, 15018, 12559, 8545, 3516, -8332, -6007, -2195, 1385, 56, 3590, 5807, 3125, 4105, 14134, 16445]
6671A6445l797r229p727O05m842r66j336L023J4993K585r054l178L108N81n130
6656c919k00L326j882k181R294K178k572k357m587L470K444r64k237K405n874
6641c656L094M935m83J625l013L136n473N89k767q197L859J0388J306m323N344
6626F364j210n585R42J2263l060K257L207j713K596M860l600M46m408K066o906
6611H519o569n814L587J835J711L015o158M216M773M095q937J438k191O0N404
6596H984N031k479o032k194j362N748K818p840J325l976n277N892N811j170J679
6581F958k395o417o045j054O440k365j222o31J521L144p91j824L4l495j250N260
6565d132P708O475R51L82O3j0170k839J949p328q670K110r4L398N793M833J663
$$ y = [16445, 12648, 3419, -4308, -3703, -8545, -9511, -10847, -7824, 7169, 9754, 700, -2478, 630, 1211, -3919, -4119, -793, -2675, -4856, 4438, 6616, 4044, 1687, -2900, 570, 3014, 2050, -187, 2218, -3656, -562, 4373, 3890, 5515, 2502, 5638, 165, 754, -2013, -10210, -6351, 4037, 5343, 1020, 6364, 5154, -431, 511, 12774, 9714, 11971, 15178, 13465, 16061, 20921, 17321, 17767, 13359, 15425, 8519, 1950, -3864, -277, 1558, 3269, 6284, 126, 4342, 9115, 13210, 4273, 5711, 3520, 3580, 8984, 14015, 11536, 5504, 3310, 1948, 7696, 10514, 2674, 3999, 23, -5254, 638, 6449, 5279, 6958, 4563, -1854, -7899, -8953, -2513, -4878, -6100, -6731, -5210, -2066, -2857, -4681, -4647, -8142, -9392, -4132, 3576, 10051, 11002, 11384, 11447, 1277, -1562, 387, -6941, -15611, -13501, -13595, -10197, -4404, 429, 2092]
6549B092L593m671k877M446J285k017K553j336K34j0005n514J467l070j080M234
6534a0666K190K23k074K864N517j140k393o36L482M983P587n725l121n531R26
6519c514l367l135L666L092K645r52k534n88o873r370j333Q476N703k108o59K839
6503h012j27m92K37j417K21j914Q21R00l627J593L860O686l98k648L89J0206L696
6486I974j215o576n731j554L424o160N556J0721L641m030q16K84k04m307l072
6471f5m967N205K355j368J749K03k467j690k960l585J010j855L887M15L122L586
6455B575N71m328n6J941J712K59j1155m502R4J774L594R468Q681p149n4R55j0057
6438e677J342j142l413K3O57o78K226O885r210j1025o85N017M102K551L996N313
$$ y = [2092, 5685, 1014, -1863, 2583, 3868, 1851, 4404, 3068, 3302, -6703, -12217, -10750, -13820, -14900, -10666, -8476, -8253, -10327, -7463, -1946, -3086, -5479, -6115, -2633, 2350, 9937, 4212, 1091, -4440, -3514, -6881, -10016, -6350, -3258, -613, -1565, -4099, -4687, -11560, -20930, -22263, -13787, -8084, -10192, -10851, -8012, -8139, -8631, -8394, -9811, -9590, -11504, -10683, -9783, -13410, -11817, -7957, -1271, -1669, -4317, -3928, 6278, 9974, 8759, 2183, -3548, -5102, -1678, -7838, -2282, 8439, 12080, 8050, 7234, 7518, 7314, 3007, -65, -5032, 173, 2528, 1160, 2909, 3112, 645, -1045, -4005, -7590, -6580, -8435, -4548, -4133, -1011, 2575, 3146, -1182, -1238, 703, 2415, 2674, -8481, -12983, -12889, -11115, -7521, 1947, 10628, 3479, 3425, 4380, -5677, -4335, -5477, -8890, -8867, -8210, -8888, -6662, 223, -8987, -20012, -20697, -15680, -11578, -9027, -5031, 282]
6422B82j695r777q99N680k204m524N147O40k08O207k00j4p070m763J129J471J724
6405i074M618j280n08L672J95L57k352n814K416J745l238j54K646M581R63k185
6389c412Q52J0415J714j0908M38N033L136j953L520n614M50l397k41M394J317
6374E744n346K708N935o638p157J468J072m22o714k732N573l448l790q377J0537
6359a1587J5290r06q417r353M340o781j692k398L693J0666J956j405q85R906J009
6344C436q51o774J871K02J207j525q841m517J4355l87J208k492j546l226k290
6329a0170k847L649k87k538q764j472L209J718n814O25O757N937q2L062Q779N686
6313G448j1919p851k824o498O945K043k331J6508N925J857pL850m650o133r19
$$ y = [282, -1413, -11190, -12089, -6409, -8613, -13137, -7990, -7350, -7558, -1351, -1551, -1565, -8635, -13398, -12269, -10798, -9074, -4456, -5736, -6244, -2572, -2377, -2020, -4372, -10186, -7770, -6025, -9263, -9417, -6771, -2190, -1227, -3412, -2560, 7855, 9569, -1339, -901, 4132, 7268, 5315, 8835, 3221, 3671, 274, 33, 4427, 5744, 398, 3106, 9041, 2403, -4754, -3286, -2214, -2636, -9350, -12082, -6509, -9957, -13747, -22124, -11587, 3703, 2797, -5620, -14973, -10633, -17414, -19106, -21504, -17811, -7145, -5189, -6594, -7479, 2427, 3436, 2585, -4189, -2318, -2116, -909, -2434, -11275, -15792, -1437, -1824, -616, -3108, -4654, -7880, -10170, -13017, -9368, -9655, -12193, -20957, -22429, -19220, -17502, -23316, -22691, -15934, -9997, -10079, -7017, 1762, 7448, -4471, -12322, -15146, -21644, -14699, -12656, -14987, 1521, 7446, 9303, 9296, 13146, 8496, 2363, 1444]
6298A444l384o810o279m239k502P329N475K403P580L194O2j312n337M39N474j500
6282B037l335R688K953q191k562M081K265r283l950k810M715N594Q598K869p173
6267E496j1796l582o582N634o94J1458N278K809o881l563L459J671K156m892p182
6252g211K859N507j212K969J791j716k340O125k181p244o241K068L110n87O602
6237B299J33l637l902m271r422k668N107L164m437m692L856O218L333L168O542
6222G91q34m140l239O327L916l744M260K302O62R020J850n727p064j4971m190
6207a4781J1156R382o082L403L067J773m12R086l38j0156j3083l51O9l915Q2p880
6191a8980m807P445L984K179M731K989N474P944O130l408P350J0654o652r251
$$ y = [1444, -1940, -8750, -15029, -19268, -21770, -14441, -8966, -6563, 1017, 4211, 4273, 2961, -2376, -1937, 3537, 2037, -1298, 8390, 11343, 3152, 590, 4671, 6936, -2347, -6297, -9107, -4392, 1202, 9800, 12669, 5496, -6300, -9882, -16464, -10830, -11524, -66, 5212, 8021, 1140, -2423, 1036, 2707, 4863, -29, -7211, -4352, 1155, -57, 2912, 4703, 2987, 647, 6772, 4591, -2653, -8894, -6826, -3716, -4303, 2299, 2432, -1205, -5107, -9378, -18800, -21468, -16361, -13197, -17634, -22326, -18470, -12252, -8919, -5751, 791, -43, -4183, -7422, -1095, 2821, -923, 3337, 5639, 6301, 15321, 17171, 11444, 4380, -10591, -14781, -3625, 5757, -325, 3078, 6145, 7918, 7506, 16592, 16254, 6098, -6985, -7336, -7267, -11182, -11100, -18980, -23787, -16342, -12358, -10179, -5448, -2459, 3015, 10959, 17089, 13681, 21031, 31685, 25033, 15782]
6177A5782p035n75k996r759j3292N031J1896l10j166k122M97q291j0948l138P157
6162a9269L738j578k326K399r99J0143J2009K591m698j2470j0025M879P683Q198
6148B75J877R76n58j251m0r395k092O977k10N177P655J631J649J392k624J159
6132A2598O295O285N511k927J77o74n112l073j676n328N996J207p212o158o158
$$ y = [15782, 8747, 8172, 5176, -4583, -17875, -12844, -948, -1258, -2424, -4546, -4049, -12340, -23288, -26426, -19269, -15531, -17109, -19435, -17036, -18035, -7892, 4117, 6708, 2010, -10460, -20485, -15606, -7923, 275, 2152, 3128, 2570, 1319, 1279, -8116, -10208, -3231, -3441, 1736, 9391, 11022, 12671, 14063, 11439, 12598, 18893, 25178, 30689, 27762, 27939, 27265, 22153, 19080, 17404, 12076, 18072, 19279, 12067, 5909, -249]
$$ [...]
##END NTUPLES=NMR SPECTRUM
##END=
