##TITLE=Analysis number 314741
Compound Code cc 45513
Book Reference 440/86
Project Code adrs
Chemist Name craigr
##JCAMPDX= 6.0         $$ Bruker NMR JCAMP-DX V2.0
##DATA TYPE= NMR SPECTRUM
##DATA CLASS= NTUPLES
##ORIGIN= Bruker BioSpin GmbH
##OWNER= NMR
$$ XWIN-NMR		Version 3.5
$$ Wed Oct 26 09:41:27 2005 GMT Daylight Time (UT+1h)  MAYBRIDGE\NMR@NMR_250MHZ
##.OBSERVE FREQUENCY= 250.131544655141
##.OBSERVE NUCLEUS= ^1H
##.ACQUISITION MODE= SIMULTANEOUS (DQD)
##.ACQUISITION SCHEME= undefined
##.AVERAGES= 16
##.DIGITISER RES= 18
##SPECTROMETER/DATA SYSTEM= dpx250
##.PULSE SEQUENCE= zg30
##.SOLVENT NAME= CDCl3
##.SHIFT REFERENCE= (INTERNAL, CDCl3, 0, 16.522)
##AUDIT TRAIL= $$ (NUMBER, WHEN, WHO, WHERE, WHAT)
$$ ##TITLE= Audit trail, XWIN-NMR		Version 3.5
$$ ##JCAMPDX= 5.01
$$ ##ORIGIN= Bruker BioSpin GmbH
$$ ##OWNER= NMR
$$ C:\u/data/dgb/nmr/ADRS/11380/pdata/1/auditp.txt
$$ ##AUDIT TRAIL=  $$ (NUMBER, WHEN, WHO, WHERE, WHAT)
(   1,<2005-10-26 09:40:52.08 +100>,<MAYBRIDGE\NMR>,<NMR_250MHZ>,
      <created by zg, POWCHK disabled, PULCHK disabled
       configuration hash MD5:
       62 19 C7 07 E1 42 D1 B7 37 6C 3D D0 77 39 F9 E6
       data hash MD5: 64K
       9E BA 79 98 0A F3 3E 25 4E EE DC D0 AB 98 81 5E>)
(   2,<2005-10-26 09:41:08.47 +100>,<MAYBRIDGE\NMR>,<NMR_250MHZ>,
      <Start of raw data processing
       ef LB = 0.3 FT_mod = 6 PKNL = 1 SI = 32K 
       data hash MD5: 32K
       EC 66 24 B6 40 42 BD 3B 30 FB EB FE 20 3F B2 AC>)
(   3,<2005-10-26 09:41:12.02 +100>,<MAYBRIDGE\NMR>,<NMR_250MHZ>,
      <apk 
       data hash MD5: 32K
       A8 64 FF 08 3F B0 69 C7 2B 33 4B 19 D5 51 02 8B>)
(   4,<2005-10-26 09:41:13.58 +100>,<MAYBRIDGE\NMR>,<NMR_250MHZ>,
      <abs ABSG = 5 
       data hash MD5: 32K
       3E D0 E8 6A F6 DC 29 C9 3A 73 B7 57 A0 BA 50 2C>)
$$ ##END=
$$ 
$$ hash MD5
$$ 5C 6D 56 9F AE EA 3C 0F 8B 85 33 6D EF 5D 8C FB
##$RELAX= 
##$RELAX= 
##$RELAX= 
##$RELAX= 
##$RELAX= 
##$RELAX= 
##$RELAX= 
$$ Bruker specific parameters
$$ --------------------------
##$DU= <C:\u>
##$EXPNO= 11380
##$NAME= <ADRS>
##$PROCNO= 1
##$TYPE= <nmr>
##$USER= <dgb>
##$AMP= (0..31)
100 100 100 100 100 100 100 100 100 100 100 100 100 100 100 100 100 100 
100 100 100 100 100 100 100 100 100 100 100 100 100 100 
##$AQSEQ= 0
##$AQ_mod= 3
##$AUNM= <au_zg>
##$AUTOPOS= <40 >
##$BF1= 250.13
##$BF2= 250.13
##$BF3= 250.13
##$BF4= 250.13
##$BF5= 500.13
##$BF6= 500.13
##$BF7= 500.13
##$BF8= 500.13
##$BYTORDA= 1
##$CFDGTYP= 0
##$CFRGTYP= 5
##$CHEMSTR= <none>
##$CNST= (0..31)
1 1 145 1 1 1 1 1 1 1 1 1 1 1 1 1 1 1 1 1 1 1 1 1 1 1 1 1 1 1 1 1 
##$CPDPRG= <>
##$CPDPRG1= <>
##$CPDPRG2= <>
##$CPDPRG3= <>
##$CPDPRG4= <mlev>
##$CPDPRG5= <mlev>
##$CPDPRG6= <mlev>
##$CPDPRG7= <mlev>
##$CPDPRG8= <mlev>
##$CPDPRGB= <>
##$CPDPRGT= <>
##$D= (0..31)
0 1 0 0 0 0 0 0 0 0.06 0 0 0 0 0 0 0.0002 0 0 0 0 0 0 0 0 0 0 0 0 0 0 
0 
##$DATE= 1130316050
##$DBL= (0..7)
120 120 120 120 120 120 120 120 
##$DBP= (0..7)
150 150 150 150 150 150 150 150 
##$DBP07= 0
##$DBPNAM0= <>
##$DBPNAM1= <>
$$ [...]
##$SUBNAM7= <"">
##$SUBNAM8= <"">
##$SUBNAM9= <"">
##$SW= 20.6930455092707
##$SWIBOX= (0..15)
0 0 3 0 0 0 0 0 0 0 0 0 0 0 0 0 
##$SW_h= 5175.983436853
##$TD= 65536
##$TD0= 1
##$TE= 296.16
##$TE2= 300
##$TE3= 300
##$TEG= 300
##$TL= (0..7)
0 120 120 120 120 120 120 120 
##$TP= (0..7)
150 150 150 150 150 150 150 150 
##$TP07= 0
##$TPNAME0= <>
##$TPNAME1= <>
##$TPNAME2= <>
##$TPNAME3= <>
##$TPNAME4= <>
##$TPNAME5= <>
##$TPNAME6= <>
##$TPNAME7= <>
##$TPOAL= (0..7)
0.5 0.5 0.5 0.5 0.5 0.5 0.5 0.5 
##$TPOFFS= (0..7)
0 0 0 0 0 0 0 0 
##$TUNHIN= 0
##$TUNHOUT= 0
##$TUNXOUT= 0
##$USERA1= <user>
##$USERA2= <user>
##$USERA3= <user>
##$USERA4= <user>
##$USERA5= <user>
##$V9= 5
##$VALIST= <valist>
##$VCLIST= <CCCCCCCCCCCCCCC>
##$VD= 0
##$VDLIST= <DDDDDDDDDDDDDDD>
##$VPLIST= <PPPPPPPPPPPPPPP>
##$VTLIST= <TTTTTTTTTTTTTTT>
##$WBST= 1024
##$WBSW= 4
##$XGAIN= (0..3)
0 0 0 0 
##$XL= 0
##$YL= 0
##$YMAX_a= 363093
##$YMIN_a= -344185
##$ZGOPTNS= <>
##$ZL1= 120
##$ZL2= 120
##$ZL3= 120
##$ZL4= 120
##$ABSF1= 16.522
##$ABSF2= -4.171173
##$ABSG= 5
##$ABSL= 3
##$ALPHA= 0
##$AQORDER= 0
##$ASSFAC= 0
##$ASSFACI= 0
##$ASSFACX= 0
##$ASSWID= 0
##$AUNMP= <proc_1d>
##$AZFE= 0.1
##$AZFW= 0.1
##$BCFW= 0
##$BC_mod= 0
##$BYTORDP= 0
##$COROFFS= 0
##$CY= 12.5
##$DATMOD= 1
##$DC= 0
##$DFILT= <>
##$DTYPP= 0
##$F1P= 14.0000005364418
##$F2P= -0.99999901652339
##$FCOR= 0.5
##$FTSIZE= 32768
##$FT_mod= 6
##$GAMMA= 0
##$GB= 0
##$INTBC= 1
##$INTSCL= 1
##$ISEN= 128
##$LB= 0.3
##$LEV0= 0
##$LPBIN= 0
##$MAXI= 10000
##$MC2= 0
##$MEAN= 0
##$ME_mod= 0
##$MI= 0
##$NCOEF= 0
##$NC_proc= -5
##$NLEV= 6
##$NOISF1= 0
##$NOISF2= 0
##$NSP= 0
##$NTH_PI= 0
##$NZP= 0
##$OFFSET= 16.522
##$PC= 1
##$PHC0= 137.6873
##$PHC1= 5.960046
##$PH_mod= 1
##$PKNL= yes
##$PPARMOD= 0
##$PSCAL= 4
##$PSIGN= 0
##$REVERSE= no
##$SF= 250.13
##$SI= 32768
##$SIGF1= 0
##$SIGF2= 0
##$SINO= 400
##$SIOLD= 32768
##$SREGLST= <1H.CDCl3>
##$SSB= 0
##$STSI= 32768
##$STSR= 0
##$SW_p= 5175.98343685301
##$SYMM= 0
##$S_DEV= 0
##$TDeff= 65536
##$TDoff= 0
##$TI= <Analysis number 999999
Compound Code 99
Book Reference 9
Project Code 9>
##$TILT= no
##$TM1= 0
##$TM2= 0
##$TOPLEV= 0
##$USERP1= <user>
##$USERP2= <user>
##$USERP3= <user>
##$USERP4= <user>
##$USERP5= <user>
##$WDW= 1
##$XDIM= 32768
##$YMAX_p= 470553540
##$YMIN_p= -483344
$$ End of Bruker specific parameters
$$ ---------------------------------
##NTUPLES= NMR SPECTRUM
##VAR_NAME=  FREQUENCY,     SPECTRUM/REAL,   SPECTRUM/IMAG
##SYMBOL=    X,             R,               I
##VAR_TYPE=  INDEPENDENT,   DEPENDENT,       DEPENDENT
##VAR_FORM=  AFFN,          ASDF,            ASDF
##VAR_DIM=   32768,         32768,           32768
##UNITS=     HZ,            ARBITRARY UNITS, ARBITRARY UNITS
##FACTOR=    0.157963299565203, 1,           1
##FIRST=     4132.6476996994, 0,             0
##LAST=      -1043.33573715361, 0,           0
##MIN=       -1043.33573715361, -483344,     0
##MAX=       4132.6476996994, 470553540,     0
$$ Real data points
##PAGE= N=1
##DATA TABLE= (X++(R..R)), XYDATA
$$ [...]
18440E8428J4474K8048J3253j5359o08J169K1134M383K9086K5748r016k7940j5659
18427A27141p339J97k3029O182R19J192n560n08J280O726k3899o182K1804l302
18413I5622L264P339J751J5301L7467m943l5558j2438L661j1770O030j1708J8614
18400A12632J3195P483j221n426o544J7653J8971K311m7314l7610J8024m803O381
18387I3732Q918J7218L1385n450L7373J3423k9830l6890m4244j2455J7446R866
18375A00492P362R33J7775J0044J6563M6026J6856M0966L7431J1141k642J8228
18363C21175K9356j9230m3241m5308k3243k1590L770J4641L3485K7219P820R794
18351B94648K2163N0316L7485J2379j1168r800n1094o2154n5897n8898j6101r994
$$ y = [58428, 72902, 100950, 114203, 98844, 98236, 99405, 120539, 124922, 154008, 179756, 170740, 142800, 127141, 119802, 119999, 96970, 103152, 104071, 105263, 99703, 99195, 100475, 107201, 83302, 77120, 98924, 95622, 98886, 106225, 107976, 123277, 160744, 155801, 120243, 107805, 111466, 99696, 105726, 94018, 112632, 125827, 133310, 132089, 126663, 120119, 137772, 156743, 159054, 111740, 74130, 92154, 87351, 93732, 102650, 119868, 151253, 145803, 183176, 196599, 166769, 129879, 85635, 73180, 90626, 100492, 107854, 108787, 126562, 136606, 153169, 199195, 216051, 257017, 294448, 305589, 302947, 321175, 350531, 331301, 288060, 242752, 219509, 197919, 201689, 216330, 249815, 277034, 284854, 294648, 316811, 367127, 404612, 416991, 405823, 396023, 344929, 282775, 226878, 167980, 151879, 141885]
18339A41885j6636j8421j4750L2613J2766k1609N292L0017K6949k6667j9052m2082
18327I0305j9755R356K3171P77J2492j425J2450M135R913j482K295n488j4490
18314A22254J6826K7216n16J0216K5240J3171O861K2268J8092K4925L3403M1931
18302C61887L8608L8729K1253J3639K0518J7277K0505M7395L7625J0986L0625
18291F59047M7780O2727N8851M8451L1434J3549j7576l6386k6967l4520j0905
18280G95485O624k2129k3061j3474q413J1966k4573k5227n6249l699j6324J0822
18268F31748J4589q658j1069K0262J6914l6318p272J1615J7253K8108O008M6403
18256G29583M3774L6287N0932K7243N4068O6312M2567M5608M3195M7304K9800
$$ y = [141885, 125249, 106828, 92078, 124691, 137457, 115848, 121140, 151157, 178106, 151439, 132387, 90305, 70550, 79906, 103077, 103854, 116346, 114921, 127371, 131506, 141419, 139937, 142232, 136744, 122254, 139080, 166296, 165780, 175996, 201236, 214407, 221268, 243536, 261628, 286553, 319956, 361887, 400495, 439224, 460477, 474116, 494634, 511911, 532416, 579811, 617436, 628422, 659047, 706827, 769554, 828405, 876856, 908290, 921839, 904263, 867877, 840910, 806390, 795485, 802109, 779980, 756919, 743445, 735032, 746998, 722425, 697198, 640949, 637250, 620926, 631748, 646337, 637679, 626610, 646872, 663786, 627468, 620196, 631811, 649064, 677172, 683180, 729583, 773357, 809644, 860576, 887819, 941887, 1008199, 1050766, 1096374, 1139569, 1186873, 1216673]
18245A216673L3436n111j0664j5913k9924n403K1715K3034M2509K4812J9258P190
18233A321612j3404k2776J1239Q358o0605l6345l2491m5688K0489j030q303K1467
18221A162523L604j2929j6792J0318K9823K6329M0885M1938M2231P6073N3940
18210A457943P4791O3519O8638Q1835O4880P2767Q3474P1720J15826J27068J61599
18199B444060J82373K09745K15457K31736K31202K15354J95577J58938J31387
18190D215829J08515J07692J11227J39689J94263K14184K50979L26206L52613
18181F021197M19204N31550O45774Q10287J004898J205133J438746J664952J930373
18172A5672114K306850K873606L724965M784195N743333O153472N706372M146417
$$ y = [1216673, 1250109, 1244998, 1234334, 1218421, 1188497, 1183094, 1204809, 1227843, 1270352, 1295164, 1314422, 1321612, 1308208, 1285432, 1296671, 1305029, 1244424, 1208079, 1175588, 1129900, 1150389, 1149359, 1141056, 1162523, 1166127, 1153198, 1136406, 1146724, 1176547, 1202876, 1243761, 1285699, 1327930, 1404003, 1457943, 1532734, 1596253, 1664891, 1746726, 1811606, 1884373, 1967847, 2039567, 2155393, 2282461, 2444060, 2626433, 2836178, 3051635, 3283371, 3514573, 3729927, 3925504, 4084442, 4215829, 4324344, 4432036, 4543263, 4682952, 4877215, 5091399, 5342378, 5668584, 6021197, 6440401, 6971951, 7617725, 8428012, 9432910, 10638043, 12076789, 13741741, 15672114, 17978964, 20852570, 24577535, 29361730, 35105063, 41258535, 46964907, 51111324]
18164E1111324J534849j185407k859671l114243k784726k492727k644053l098908
18156C4466438l222048k694282j784719p55981J66406P58661Q11003L39957m80590
18147B7604845j368802j932694k078486j925208j547821r87980m47676P3160M89240
18138A7878578Q36497J180784J564752K035095K662397L503712M574695N748387
18130C9984897O545087O538981N288345L089330R23418j03159M56360K167910
18122F4891169M505682P289026J0817527J5698060K2462080L0829682L9555194
18115A96048420M6925765N1173065M9699143M0688197K6290602J0834764n077927
18108D16582029k6011731m4200318n1912172m5340487l4683450k3572287j0846887
$$ y = [51111324, 52646173, 51460766, 48601095, 45486852, 42702126, 40209399, 37565346, 34466438, 31244390, 28550108, 26765389, 26009408, 26175814, 26934475, 27745478, 28085435, 27604845, 26236043, 24303349, 22224863, 20299655, 18751834, 17763854, 17316178, 17389338, 17878578, 18715075, 19895859, 21460611, 23495706, 26158103, 29661815, 34236510, 39984897, 46529984, 53068965, 58357310, 61446640, 62370058, 62266899, 62723259, 64891169, 69396851, 76685877, 87503404, 103201464, 125663544, 156493226, 196048420, 242974185, 294147250, 343846393, 384534590, 410825192, 421659956, 416582029, 390570298, 346369980, 294457808, 249117321, 214433871, 190861584, 180014697]
18101A80014697K353149J4596371K4539143L0735885L4000843L4540323L0842101
18094C51622512K0488068N172227j1890502k8496432m2403831m9136349m7860769
18087A97494924m2396444l5227064k6974519j8939822j2542364p965184m606843
18080D8842684j966968j0605J059186R69129n13370k693566m556627n469507n450381
18071C0209975m769140l672478k634752j842817j260838q11107m15822o2630L24782
18062A5065173P79211J253491J698246K010173K124359K130101J849875J243568
18054B8154197L64944l70041m69833j49558M07766J088501J812749K478967K863164
18045C6180856K774321K451337K326010K411994K243693J438880l88321k816221
$$ y = [180014697, 182367846, 196964217, 221503360, 252239245, 286240088, 320780411, 351622512, 372110580, 377282807, 365392305, 336895873, 294492042, 245355693, 197494924, 155098480, 119871416, 92896897, 73957075, 61414711, 53449527, 48842684, 46875716, 46865111, 47924297, 48893426, 48380056, 45686490, 41129863, 35660356, 30209975, 25440835, 21768357, 19133605, 17290788, 16029950, 15218843, 14803021, 14740391, 15065173, 15844384, 17097875, 18796121, 20806294, 22930653, 25060754, 26910629, 28154197, 28519141, 28149100, 27679267, 27529709, 27937475, 29025976, 30838725, 33317692, 36180856, 38955177, 41406514, 43732524, 46144518, 48388211, 49827091, 49438770, 46622549]
18037D6622549m847749n637102n723475n447736m610955l491436k607950j940808
18029A2315338j539820j261069j112482q87730o64261m74119l09099j86121j00395
18020E780242p411J25212J87788K03704L39948M85134O42651M28922j89353q60060
18010G136777j202893j080301q16698n42633l64975k72868j64917j06026p7084
18001B508382o9078o0240k3239k6926j7919k1394m6037n2241n2534l1633k8918
17990B078223l0596k1532L1037J04171J59786J72689J45791J38781J07625Q2132
17980B968107L8407o5798j50675k06526k05918k17468k21103j40069j38163r1310
17970A569484k1623m3887l8961n0857r4689p7831l9017n4934l8126n2866o5146
$$ y = [46622549, 41774800, 36137698, 30414223, 24966487, 20355532, 16864096, 14256146, 12315338, 10775518, 9514449, 8401967, 7514237, 6849976, 6375857, 6066758, 5880637, 5780242, 5772831, 5898043, 6085831, 6289535, 6629483, 7114617, 7757268, 8186190, 7996837, 7136777, 5933884, 4853583, 4036885, 3494252, 3129277, 2856409, 2691492, 2585466, 2508382, 2439304, 2379064, 2355825, 2328899, 2310980, 2289586, 2243549, 2191308, 2138774, 2107141, 2078223, 2047627, 2026095, 2057132, 2161303, 2321089, 2493778, 2639569, 2778350, 2885975, 2968107, 3006514, 2940716, 2790041, 2583515, 2377597, 2160129, 1939026, 1798957, 1660794, 1569484, 1547861, 1503974, 1465013, 1414156, 1319467, 1241636, 1202619, 1147685, 1109559, 1056693, 991547]
17959I91547o8186m8129m3554k4235j6310K3291j2891R931J6915N1929N2388J7391
17947I50087L0094P2707P0124M7576M5197Q2545Q3965R2062J20697J32201J37417
17936A864672J10540Q8770L5552M276n7281p9179j21020j55875j42345j60443
17926A387667j45185j18448p4984m3735m7002j3158n674k1386n4219l8088o798
17915H18990k9827n6195l7300o1315k4355q241j2938j1748l11j0449k2359J914
17903E45866J1625J0266K2198K9329M0149L3468M5101K2001J7253L0306M0066
17892H47628K8234q498j108k341J0129J4442K8097K5996K9784Q331P783l342p994
17879I77141j2561n9559o2841m1457m3897p1650o7704m8987k7381k0792k7337
$$ y = [991547, 923361, 875232, 831678, 807443, 791133, 814424, 801533, 811464, 828379, 880308, 932696, 950087, 980181, 1052888, 1123012, 1170588, 1215785, 1298330, 1382295, 1474357, 1595054, 1727255, 1864672, 1975212, 2063982, 2099534, 2103810, 2046529, 1967350, 1846330, 1690455, 1548110, 1387667, 1242482, 1124034, 1049050, 1005315, 958313, 945155, 939481, 918095, 863876, 825788, 818990, 789163, 732968, 695668, 634353, 609998, 601757, 588819, 577071, 576760, 566311, 543952, 545866, 557491, 567757, 589955, 619284, 659433, 692901, 738002, 760003, 777256, 807562, 847628, 875862, 867364, 866256, 863915, 874044, 888486, 916583, 942579, 972363, 980694, 988477, 985135, 977141, 964580, 905021, 842180, 800723, 756826, 685176, 617472, 568485, 541104, 520312, 492975]
17868D92975l563p835l163O416k0371Q871K1634K3021n140m4533m0553k9668j7295
17855C80796N64J1905J3208q89p841R882K9323K0508j4366K7166m520j0591k5281
17842D29864l7085l5206m9616j5300J5271L3849O916L10q093j6736R450J9378
17830C53002J1807k1220l3212k8113r876j2462l9616k2214r493k3223K1745L2957
17818B20082L269J2777M0383K7653J5988k6058l2940k8948r357J1617k8423o901
17806A99142Q42j0102J4356M1333K5127K0709j5272j5583Q827k8635j7434j4856
17794B08454j3509r254j1407K0222M1293K5262j8339l7436P522N250j0109k1907
17782A86042J7758J6991J8210l871K034j4518l416q787m3195q245q969J155o450
$$ y = [492975, 489412, 481577, 478414, 484830, 464459, 473330, 494964, 517985, 512845, 468312, 427759, 398091, 380796, 381360, 393265, 406473, 405584, 397743, 407625, 436948, 457456, 443090, 470256, 465736, 455145, 429864, 392779, 357573, 307957, 292657, 307928, 341777, 348693, 349003, 340910, 324174, 333624, 353002, 364809, 343589, 310377, 282264, 272388, 259926, 220310, 198096, 188603, 165380, 187125, 220082, 223351, 236128, 276511, 304164, 320152, 294094, 261154, 232206, 222849, 234466, 206043, 199142, 199984, 189882, 204238, 245571, 270698, 291407, 276135, 260552, 269379, 240744, 223310, 208454, 194945, 185691, 174284, 194506, 235799, 261061, 242722, 205286, 212808, 218058, 207949, 186042, 203800, 220791, 239001, 235130, 237164, 222646, 219230, 210443, 167248, 159003, 150034, 151189, 144739]
17769A44739m694o509K0212J7709J2071J0957K91p014J1510j1709R729j1934K021
17756A87379j7752j2237k231J2876J4176q246k883N27P106J1606k0652j3866K813
17743A58616J4864k6323K545J6010o18j468j0086J1508j348M123l2797j9231J0130
17730A25925J3019j3285j2029j1217J2248R294K0952l964J3786M787J705n121
17718A56100K230j5098J981m908P378K326p143K061j141j8907j4348N892J1883
17705A28306K296l058K6803r440k0943K198q654j5315j3437L165J850K7622P284
17692A28677P549O063l783R287J0926N276J4045k6063J5193J6796k1265j5102
17680A47599p023j3085J0885J5384J5074j6627j337J5287M768L0513L0197J0599
$$ y = [144739, 140045, 133536, 153748, 171457, 183528, 194485, 194776, 187762, 199272, 187563, 197292, 185358, 187379, 169627, 157390, 155159, 168035, 182211, 173965, 171082, 171609, 178715, 190321, 169669, 155803, 158616, 173480, 147157, 149702, 165712, 165094, 163626, 153540, 165048, 163700, 167823, 135026, 115795, 125925, 138944, 125659, 113630, 102413, 114661, 123955, 144907, 140943, 154729, 159516, 161221, 156100, 158330, 143232, 145213, 140305, 147683, 150009, 142866, 144927, 143786, 124879, 110531, 116423, 128306, 130602, 127544, 154347, 144907, 123964, 126162, 117508, 102193, 88756, 91921, 93771, 121393, 128677, 136226, 142289, 138506, 147793, 158719, 163995, 178040, 151977, 167170, 183966, 162701, 147599, 140576, 127491, 138376, 153760, 168834, 152207, 150870, 166157, 170925, 201438, 231635, 242234]
17668B42234J094N354L9517L1597K8134M6034N6540M5021Q1056Q9277N8704L5552
17656G60114J8014l79M238O229k913k1325J1732J2267J3054J952p965m8952o4771
17643F81295k2403m590k267l4228j8470m8111o5661m4014n4357r444k5034p113
17631C45603r970k9944k2921r344q043O745J2235J3107P125Q143N0483N8549K8378
17618D50146L6643P7691P5240M2326K1203N0165O9612O5440O0151L4368O8899
17607A051884J07863J16775Q8118Q1767P4662J6864o171l8425q3540j12235j16821
17596A180741r0556r2985q6260p9000p3334o8412o4296n9393o3807o0070m1369
17585D01259l3962l1686k5883M488J2114P489k6706N779r091L857J2845r805R618
$$ y = [242234, 243328, 248682, 288199, 319796, 347930, 393964, 450504, 495525, 576581, 665858, 724562, 760114, 778128, 777749, 781987, 788216, 785303, 763978, 775710, 787977, 801031, 802983, 795018, 746066, 681295, 658892, 654302, 652035, 617807, 599337, 551226, 485565, 441551, 387194, 377750, 352716, 345603, 335633, 305689, 282768, 273424, 265381, 272126, 284361, 297468, 304593, 312736, 363219, 421768, 450146, 486789, 564480, 639720, 682046, 703249, 753414, 823026, 888466, 948617, 982985, 1051884, 1159747, 1276522, 1364640, 1446407, 1521069, 1537933, 1531762, 1493337, 1409797, 1297562, 1180741, 1090185, 997200, 910940, 831940, 758606, 690194, 625898, 566505, 502698, 442628, 401259, 367297, 335611, 309728, 314216, 326330, 333819, 307113, 312892, 303801, 307658, 320503, 310698, 320316]
17572C20316K7613O777P085L5178K4415L5138M8391L6200N0900R167K545J9095
17560F22820q776m417l705k6676m7967k7802r17J3021K140M632J201O9N321l83
17546E28561J7974k4790n0152n0129m3778o0085m1703l9616l5914k1336l5245
17535A43787l2784k6500k4508j0451M1317P777q110j2238n971J3270J5643L6121
17523A37353j5242J550P606l77o529J1950l479j0204n693k9757n5796O509j011
17510C6880j5229K0372K4779j896j293J65q57k4865R954l605j3891q029m745K7050
17496D4790K4696L4385J1234L0160L2332m205m07J3356j0647j9445j7342j3242
17484A25665j8538l0073l7396j0809J8992J5334l360K4250L5175L2320K1174J9198
$$ y = [320316, 347929, 354706, 361791, 396969, 421384, 456522, 504913, 541113, 592013, 601180, 603725, 622820, 614044, 609627, 605922, 579246, 531279, 503477, 502560, 515581, 517721, 522353, 523554, 523623, 528944, 528561, 546535, 521745, 471593, 421464, 377686, 317601, 275898, 236282, 200368, 179032, 143787, 111003, 84503, 59995, 49544, 90861, 98638, 90528, 78290, 72319, 85589, 101232, 137353, 122111, 123661, 131267, 130890, 124361, 136311, 132832, 122628, 116935, 87178, 31382, 37891, 36880, 21651, 42023, 66802, 64906, 63613, 63778, 62921, 38056, 48010, 44405, 30514, 22485, 17740, 44790, 69486, 103871, 115105, 145265, 177597, 173392, 172985, 186341, 175694, 156249, 138907, 125665, 107127, 77054, 39658, 28849, 47841, 63175, 59815, 84065, 119240, 151560, 172734, 191932]
17472A91932p968k0416k8066m6199k8608l6345q988j4682k0761k1882J9144J1380
17460a1459K8882K4928j1366k4028j0412l851j9149J1176o764J1425K3904K6142
17448C9428P360J2570k733L6584M8552O4303Q9786P020p1041n8498l3128l9783
17436A00420Q846r653k0522j2361M104j3070r352l491P447J0682j4747Q153p781
17423D8675k5872J1327K2757R306j8658k3596L344m354J0419J3693j6261j1967
17411A8813r153J2466J2656r312j2738j224J1031K7332N392J9182N166l415j3480
17398F2716l3943j6854K3928J3337j2897j8003R654M461J247k7606L518J1402
17386B0960j21K180q135O868O897J8745K4328n627k0096J895J9463j4638k1790
$$ y = [191932, 183964, 163548, 135482, 89283, 60675, 24330, 15342, 660, -20101, -41983, -22839, -11459, 17423, 42351, 30985, 6957, -3455, -7306, -26455, -15279, -22043, -10618, 13286, 39428, 46788, 59358, 56625, 93209, 141761, 206064, 295850, 302870, 231829, 173331, 140203, 100420, 109266, 99613, 79091, 66730, 70834, 57764, 48412, 44921, 52368, 63050, 48303, 56456, 48675, 22803, 34130, 56887, 66193, 47535, 23939, 27283, 22929, 33348, 47041, 30780, 18813, 9660, 22126, 34782, 25470, 12732, 11508, 22539, 49871, 55263, 74445, 79611, 76196, 62716, 28773, 11919, 35847, 49184, 36287, 18284, 27938, 32399, 33646, 6040, 9558, 20960, 20839, 23019, 14884, 21752, 28649, 47394, 71722, 66095, 45999, 47894, 67357, 52719, 30929]
17373C0929m219j5297l162O037j1919j1557K864n070J8967J8515M365p365n578
17360A7510q282o693j3066o887R575J9737p482j5156L8717M679j0951k888Q108
17347B6921j985j6186m130L264K0103J3641j3776j8413q810J6757L4391K4729
17335G6506n895k274L556k9269j9782K320m65j9134K1111L6973n157l9114k3736
17322d360K4282K3387q759n584J8210k3589j38K3483M5364m857k6729j3652N549
17309E2607J8605k7542j77J240L650p491k7258L949R713N572K096J4021J1464
17296F0449J8845R226j7166k1844k8542j9993K2655L736l6489J9544J3905j8852
17284E474j0859J0199L6044J3398k552O925J4156n473P464J4165j0361j9346R773
$$ y = [30929, 26710, 11413, 8251, 14288, 2369, -9188, -6324, -11394, 7573, 26088, 30453, 23088, 17510, 9228, 2535, -10531, -17418, -7843, 11894, 4412, -10744, 27973, 32652, 21701, 18813, 26921, 24936, 8750, 4620, 7884, 27987, 41628, 27852, 9439, 629, 17386, 51777, 76506, 70611, 68337, 71893, 42624, 22842, 25162, 24697, 5563, 26674, 63647, 58490, 19376, -4360, 19922, 43309, 34550, 28966, 47176, 23587, 23449, 46932, 92296, 87439, 60710, 47058, 52607, 71212, 43670, 43493, 44733, 48383, 40892, 13634, 17583, 27296, 32868, 34964, 48985, 60449, 79294, 88520, 71354, 49510, 20968, 975, 23630, 27366, -9123, 10421, 24326, 5474, -5385, 4814, 40858, 54256, 51704, 58629, 72785, 67312, 74776, 88941, 78580, 59234, 69007]
17271F9007j8364J0816L6342L9398n272j2578K7133J1360M818N2230J112k0213
17259A95789n717n329K1941K1929J0037j1566P05J2019r36J600j0523k5592J1416
17246B15773j959j2482r31j9714k2633L2330K2906N464j2000p812j7845k463m998
17233A73636J7733m879p127J9948J092k0132j7948j7215o225j8986k6693m34p046
17220H5724m558k4278Q879R01j9766q895j7522J6327j9404k0627L1810O920p753
17207B7758N854k1698r457J9030J8361j2506j760j934J1519J7034l508n178k5048
17194A8467r089j455J5372J1318k9161m505K2307J2005j7647k1466k4655n20J3313
17181a5716j0674j062K2442J135J7988J8229J4257k3681j2847n447J0018q601
$$ y = [69007, 50643, 61459, 97801, 137199, 131927, 119349, 146482, 157842, 162660, 214890, 216002, 195789, 190072, 184743, 206684, 228613, 238650, 227084, 227789, 239808, 238872, 240472, 229949, 204357, 215773, 213814, 201332, 200401, 180687, 158054, 190384, 213290, 218754, 206754, 198942, 181097, 178634, 173636, 191369, 186490, 179363, 199311, 200403, 180271, 162323, 145108, 138883, 119897, 93204, 92770, 85724, 81166, 56888, 65767, 66668, 46902, 38007, 20485, 36812, 17408, -3219, 28591, 35511, 27758, 33612, 11914, 2457, 21487, 39848, 27342, 25582, 23648, 35167, 52201, 48693, 43515, 18467, 9378, 7923, 23295, 34613, 5452, 947, 23254, 35259, 17612, -3854, -28509, -29029, -15716, -26390, -27452, -5010, -3875, 14113, 32342, 46599, 22918, 10071, 4624, 14642, 6041]
17169F041K9363J6954j6289l842k8330k7335J6171L5169P716j4123k3144J12j0635
17156a2172P561K1368K4541J7636J1710K973r497j51l664k6742k38j4838k3623
17143e136j3004N524j0005J9640J5845j3272j0824r535j034M4697K9800L6448
17131H9144j5807k8298k4506k9916J0677J9733R838J9452L0592k7520k4674J0143
17119C8858O447k2299O490q938R03p475L636l426k805j398J2959K1431j2592k0811
17105A0980J4771N9751M111L772k4160k1774K975j5898K2021j7958m4262j2127
17093a7798K0586K3931j8656l0222j0187j0788J5671R005J1098L5729K0448L0544
17081G9361P964j9678N615j6077l5047j2409l746J6707m75j8770j056J2451j5560
$$ y = [6041, 35404, 52358, 36069, 32227, 3897, -23438, -7267, 27902, 35618, 21495, -1649, -1537, -12172, -4611, 16757, 41298, 58934, 70644, 73617, 64120, 63969, 60305, 33563, 33325, 18487, -5136, -18140, -12616, -22621, -2981, 12864, -408, -11232, -20767, -21801, 22896, 52696, 89144, 73337, 45039, 20533, -9383, 1294, 21027, 30865, 50317, 80909, 53389, 28715, 38858, 45305, 23006, 29496, 20558, 21461, 13986, 17622, 14196, 11391, 9993, 22952, 44383, 31791, 10980, 25751, 85502, 89613, 93385, 69225, 47451, 50426, 34528, 56549, 38591, -5671, -17798, 2788, 26719, 8063, -22159, -32346, -43134, -27463, -18458, -7360, 28369, 48817, 79361, 87325, 67647, 73262, 57185, 22138, 9729, 5983, 22690, 22215, 3445, 2389, 14840, -720]
17068g20O119l281j9313J2340J3087O82K1315J4687j3648j5931j3888K137J2442
17055A6028O941J7710k0059k528p932k883N1638p401l1256k0947n654l954J1737
17042A440L6537O047k1734k2805j4179q326J1303j3310r547k0491R136K0641K6541
17029A253R844N671o723l9742K5037J4827J1167j7284k2155j1191K1981Q423J834
17016B942k7021n953K0817j741J911K6213J1341j4756l392K9431j3596l0221q685
17003a2710k482K5373K8591k432J4020j450k4777m0817o725J7511J6172q072L4591
16990C6793L9625j2047l3837j0013r896K2470R560k4477m4864k4625o321N329
16978e2303J0404K6778L2339L749j8230j2557J0781M226k2939L2762K1402o403
$$ y = [-720, 5399, 2118, -17195, -4855, 8232, 8914, 30229, 44916, 31268, 15337, 1449, 3586, 16028, 22969, 40679, 20620, 18092, 10160, 7277, 58915, 51514, 20258, -689, -6343, -10297, 1440, 37977, 44024, 22290, -515, -14694, -23020, -11717, -25027, -34574, -55065, -45929, -25288, 1253, 11097, 16768, 10045, -29697, -4660, 10167, 21334, 4050, -18105, -29296, -7315, 1108, 2942, -24079, -30032, -9215, -10956, -9045, 17168, 28509, 13753, 10361, 39792, 26196, -4025, -12710, -15192, 10181, 38772, 36340, 50360, 48910, 24133, -16684, -23409, -5898, 10274, 2202, 36793, 76418, 64371, 30534, 20521, 10625, 33095, 42655, 18178, -26686, -51311, -57632, -52303, -41899, -15121, 17218, 20967, 2737, -9820, 961, 5187, -17752, 15010, 36412, 30009]
16966C0009m2829R466J4653k0141j4174k507J5813j412l063n865k8739q570M1456
16953a5903J5677K803l000j7308l3296j9483K9459K779J7703J6779N210K1145
16941B2565k2074k8582n18K5871K9012O486j860k3815R49J8263l38l3523j2462
16928b0026K1434J7561J7656r033M729J4327l942j3977q754j0844J0415J6045
16916C5591K7809L783j6700k5098l3527Q290Q467k1542p930K572K5995K4818J9893
16903E2421j0230M097j3564m4973J4880lR634J3207J6967k310Q127j6760j6332
16890A5161j1266Q818o841J9797j519p121O009J1500K6058P343j8497k4909k8923
16877d390k0458J6022j273j8821q62K7229J1761j9972j2886p387M77K4206L2811
$$ y = [30009, -12820, -3354, 11299, -8842, -23016, -25523, -9710, -11122, -14185, -20050, -48789, -57359, -15903, -226, 2577, -423, -17731, -51027, -70510, -41051, -38272, -20569, -3790, 1420, 22565, 491, -28091, -28609, -2738, 26274, 32760, 30900, 7085, 8034, 26297, 25959, -7564, -20026, 1408, 18969, 36625, 27592, 32321, 46648, 42706, 28729, 19975, 9131, 19546, 35591, 63400, 67183, 50483, 25385, -8142, 148, 8615, -12927, -20857, -18285, 7710, 32528, 52421, 42191, 46288, 32724, -12249, 2631, 2628, 12262, 25469, 42436, 40126, 48253, 31493, 15161, 3895, 12713, 5872, 25669, 24150, 17029, 23038, 34538, 60596, 67939, 49442, 24533, -4390, -24848, -8826, -10099, -28920, -29782, -2553, 9208, -10764, -23650, -31037, -30560, -6354, 26457]
16864B6457J2082q224J443R358K5675l200j0906J5085Q636j8800m5555l0386K1718
16851C383N141j2925j5903j2600j0544k6487Q813K7159J6534K8140k5907p948
16839b3144M3068J9158P430k0003m919J4513J1239l7213j7547K3233P823k3764
16827a26k6496k2955O926Q811j3819J8057R702L383j2304J0955J4840L611l611
16814c026N983J758o281k2120J4529J6572n481Q042k486P377l3148M817m029M069
16800a3424k0646m550K0481J8613j9144K6334L3231j1313J4432l469k7830n053
16788G662j4241j4514r142K3729J1388o727K596J0721M941N083o957j3234k942
16775a637M266q361K524o75L684m917q682L113J029K249J7225j0963q924j5769
$$ y = [26457, 38539, 30315, 31758, 41116, 66791, 63591, 52685, 67770, 76406, 57606, 12051, -18335, 3383, 8524, -4401, -20304, -32904, -43448, -69935, -61122, -33963, -17429, 10711, -15196, -23144, 19924, 39082, 46512, 26509, 21590, 36103, 47342, 10129, -7418, 15815, 23638, -126, -26622, -49577, -42651, -33840, -47659, -29602, -19900, -16517, -28821, -17866, -3026, 585, -3026, 2957, 4715, -1566, -23686, -9157, 7415, 1934, 9976, 7490, 14867, -18281, -13464, -17493, -13424, -34070, -38620, -18139, 474, -18670, 7664, 40895, 29582, 44014, 40545, 12715, 7662, -6579, -21093, -30235, -6506, 4882, -1845, 751, 11472, 16413, 21496, 14539, 1305, -1637, 2629, -5732, -3208, -3883, -199, -5116, -13798, -10685, -9656, -7407, 9818, -1145, -10069, -25838]
16761b5838n879M171k647K29K4693J4129p451m600J6715o165j798J9258m806l2088
16747a2077J2370N039J3788J3888r225r943K0382q851j1884q084R700j0359j6
16734D728J4631k475j5432j3573J885j3176J99k673K9606J6774l017k0938M099
16721F38j4666j4326j3915K5639J4351r58J0419K4809m287R000k9137k0206J3606
16708I67j1505J77j6367J3695J7691N483J0041l2563K071J6966N90m482n1355
16695d8591K158M6491J3005k6811R161K650J991J2313k099q634m808p384j8347
16682b8905J9042N594Q857L465J7563O603L730j9601j4945o219Q318J1142l1227
16669a6583j4411J050q764M831Q359j0239P141J7164K1945J2926l0609j8351J035
$$ y = [-25838, -31717, -27546, -30193, -29964, -5271, 8858, 1407, -3193, 13522, 7357, 5559, 24817, 20011, -12077, 293, 5332, 19120, 33008, 23783, 13840, 34222, 25371, 13487, 5403, 15103, 4744, 4728, 19359, 16884, 1452, -12121, -10236, -23412, -23213, -25886, 3720, 20494, 17477, -3461, 638, -14028, -28354, -42269, -16630, -2279, -3237, 7182, 31991, 27704, 36704, 7567, -12639, 967, -10538, -10361, -26728, -13033, 4658, 10141, 20182, -12381, -10310, 6656, 7246, 2764, -48591, -46433, 58, 13063, -13748, -4587, -1937, 54, 12367, 10268, 1634, -3174, -10558, -28905, -9863, -4269, 4588, 8053, 25616, 32219, 35949, 16348, 1403, -4816, 3502, 14644, -16583, -30994, -29944, -38708, -33877, -25518, -35757, -28616, -11452, 10493, 23419, -7190, -25541, -24506]
16656b4506q503R378J5872J3324K0727q486K879j2779l6962J6006J5612J8073
16644B0635J30N363N917p89o459m3478j0391J7363K1947K9792j0340j4922r436
16631E332j5243j9049o838J0956K3271K6578L1993k6679j9639j9279l0674p453
16619d6724J0124L7962M474p622J4577J1800L81L679J7648L68L389M699J0331
16606F5086J9959K5312N1515K3961J6702J7601K7911K0346K0831P538j9236l0639
16594B46887k717L634j5671k0569l503k1746j9586j4940N775j2098J1825L063
16582A60354K415K1447J6725J1571J5300R449k6867o401o881K172l522k0561l1487
16569A43714k365k3970j0927j3275j5369m5744k860k78k169l1706q791J7808q502
$$ y = [-24506, -33009, -23631, -7759, 5565, 26292, 17806, 20685, 7906, -29056, -13050, 2562, 20635, 20765, 26128, 32045, 31256, 24797, -18681, -29072, -11709, 10238, 40030, 29690, 14768, 5332, -9911, -28960, -35798, -24842, -1571, 25007, 57000, 30321, 10682, -8597, -39271, -46724, -36600, 1362, 5836, -1786, 12791, 24591, 24972, 28651, 46299, 46667, 50056, 54755, 65086, 85045, 110357, 161872, 185833, 202535, 220136, 248047, 268393, 289224, 296762, 277526, 246887, 244170, 247804, 232133, 211564, 208061, 186315, 166729, 151789, 157564, 145466, 157291, 160354, 162769, 184216, 200941, 212512, 227812, 237261, 210394, 203993, 197112, 199284, 195762, 175201, 143714, 141349, 117379, 106452, 93177, 77808, 32064, 29204, 28926, 26757, -4949, -13740, 4068, -4434]
16556d434P994j3502J0957j2797j4550J3229n121n623L2836n963q853R271R160
16543A2604q314J0931J8204r72M462K274l2192l3329K3106j249j1310k0362m583
16530d0730M555J6646K1395J1695j9439l1471p453J1536r87M546L1477k9916k8578
16517e6724J2205J6700J2489M652J5481K7052K4087O141m3783n3000q753p605
16505e1058K5830p32J3962J1605l0697n573J1473M81K6651k6137j8610o74M427
16492c9052J5248l277k6914j1055M2382K0836J119J0342j6751j636J9307P279
16480A7828k1398J6338K5632l087j4729k924j7428l4050j1242J4202L001l830
16468c1687j954n739J4870J0932j3088J633M814J3057K9507l1386k0946M690J0748
$$ y = [-4434, 3560, -9942, 1015, -11782, -26332, -13103, -18224, -23847, 8989, 3026, -5827, 3444, 12604, 4290, 15221, 33425, 32453, 36915, 39189, 6997, -26332, -3226, -4475, -15785, -36147, -40730, -36175, -19529, 1866, 13561, -5878, -37349, -44802, -33266, -34253, -29707, 1770, -28146, -56724, -44519, -27819, -15330, -10678, 4803, 31855, 55942, 62083, 18300, -34700, -43453, -51058, -25228, -25960, -11998, -393, -31090, -36663, -25190, -24709, 1942, -24195, -42805, -43479, -39052, -23804, -27081, -53995, -65050, -22668, -1832, -713, 9629, -7122, -8758, 10549, 17828, -3570, 12768, 38400, 35313, 20584, 17660, 232, -33818, -45060, -30858, -27857, -31687, -33641, -39380, -24510, -13578, -26666, -25033, -20219, -7162, 22345, -9041, -29987, -25297, -14549]
16455a4549K659L742j7350p459M259J1729N0781O966j6347k482q63k624k3581
16442e119k3878k502J6666Q367o141N424k7139k3458J8413J9938p084J284J8583
16429f646m990k0522K439p08o431J4144k235L670J4996o916k212R273Q932k6481
16415b3687O55k882N375K305p457l1559K212M6443L937K363K0050k6324j1445
16402b0014K464J1773O709j754J1938J6926k5459k1170J5397l999N335M242j6900
16389a4512K477j0079J6604OJ3700m037j8090K3246J1034p861k4212l518k826
16376a8068J099J2233R519K6540j470j7658O782k3676q801j8701j0367J6044J884
16363b4640N79J9775Q658J7361k4871k0516m821L1227J5131J5548m038m48j3436
$$ y = [-14549, -11890, -8148, -25498, -32957, -28698, -16969, 33812, 40778, 24431, 21949, 21086, 18462, -5119, -28997, -31499, -14833, -6466, -12607, -7183, -34322, -57780, -39367, -19429, -26513, -25229, -6646, -11636, -32158, -29719, -30427, -36858, -22714, -24949, -21279, -6283, -13199, -15411, -6138, 2794, -23687, -23032, -25914, -20539, -18234, -25691, -57250, -55038, -8595, -4658, -2295, 17755, -8569, -20014, -17550, -5777, 932, -822, 11116, 28042, 2583, -18587, -3190, -7189, -1854, 2388, -14512, -12035, -22114, -5510, -5504, 8196, 4159, -13931, 9315, 20349, 12488, -11724, -15242, -18068, -16969, -4736, 4783, 31323, 29853, 12195, 18977, -4699, -13500, -32201, -42568, -26524, -24640, -24061, -4286, 4372, 21733, -3138, -23654, -28475, 2752, 17883, 33431, 29393, 28945, 15509]
16350A5509j8842j8963o975j326J5493J1331j574j1031L385j3509j1053K2289
16338a5266L5859K534r359J0746k730J6760J417o947J490K608k8669J051N382
16325A4876p52j2037N386k582k4787K3325K9430M603j8457n745j55r131M521k225
16311F270k3962k5665l3341J2478L7484J8651j1129j3251j6518J2270J6155j1896
16299c2454k4613K3293M1978r237j3914Q02K3871J9837k889l6540m8234j1546
16287f9646J351J2264Q739L0495L0890P874l5630l1299m616l960K797J9255J3783
16274a7703k1004j3873k311q713j1138j2462p567N153k675K3683r250J1963q377
16261g4274L4904L3722r74j3692j459K1845Q92m775j6985N358l307k768q15n699
$$ y = [15509, -3333, -22296, -29271, -30597, -15104, -3773, -5347, -16378, -12993, -26502, -37555, -15266, 20593, 23127, 13768, 24514, 21784, 38544, 39961, 33014, 34504, 37112, 8443, 9494, 14876, 14124, 2087, 7473, 4891, -19896, 3429, 32859, 37462, 19005, 13260, 13105, 3974, 8495, 6270, -17692, -43357, -76698, -64220, -26736, -8085, -19214, -32465, -48983, -36713, -20558, -32454, -57067, -33774, 8204, -1033, -14947, -14145, 9726, 29563, 26674, -9866, -58100, -69646, -68295, -56031, -47292, -16797, 14093, 21967, -13663, -44962, -49578, -53538, -50741, -31486, -17703, -38707, -52580, -54891, -63604, -74742, -87204, -94771, -89618, -92293, -68610, -77860, -65897, -74274, -39370, -5648, -6622, -20314, -21773, 72, 964, -3811, -20796, -15438, -18745, -21513, -22328, -28027]
16247b8027j7557K3121J8531j4432m0451J2732J8592L076J733k4124K458J6442
16235b7906K5636P063O287R062p302J2832k3890k9374k569J874p287j4665j0292
16222f0531r010J8098m788L904J8919K8348j6532k7365j516J2519R211k7891J7453
16209c9181J7528j8086K9652L2886j8046j8163l931R174L5212K0998O555j4012
16197D0586j7210m2386r508L1997J1836j8519n257n942J2587j8817j861m149Q336
16184a8307j5650k4601k0670L3116K3693J4710L605l573J226j2465K4305O513
16172A1902j7635N117J236P315p179k2982R693J3605k795l5825j5044K1717m972
16159c5847J0064R374l2078j0584J332J5510L3754J3156R416n872k2956l714j760
$$ y = [-28027, -45584, -22463, -3932, -18364, -58815, -46083, -27491, -24415, -22682, -46806, -44348, -27906, -2270, 4793, 11080, 20142, 12840, 25672, 1782, -27592, -30161, -28287, -35574, -50239, -60531, -69541, -51443, -56231, -52327, -33408, -5060, -21592, -48957, -50473, -37954, -28743, -56634, -39181, -21653, -39739, -10087, 22799, 4753, -13410, -17341, -8167, 27045, 48043, 54598, 40586, 23376, -19010, -28518, 3479, 15315, -3204, -8461, -14403, -1816, -20633, -22494, -26643, -18307, -33957, -58558, -79228, -46112, -22419, -7709, -4104, -7677, -6451, -18916, 5389, 11902, -5733, -616, 620, 7935, 756, -22226, -12533, 1072, -1723, -37548, -52592, -30875, -35847, -25783, -16409, -48487, -59071, -57739, -42229, -8475, 4681, 14097, 8225, -14731, -18445, -20205]
16146b0205k086j8387j746J0304L8637K0763j2080k2339m1903K1594R875J1516
16134f057L557p928m960j4642O049j3677k0001p543p81K8584O3846J7884j5108
16121B9223q280o861m06j5476j8335j0354J4201K8315J3647q678k5665j4077N099
16108a7647L4272k0336l2818k5806K706J7520J8649L802J1920J4347j4458j9939
16096b7788P438J8296j2116j2003J0871M777p478N472M4090m881q105K4420K3775
16083F6768j2218l5033q048j1421K145J3679K3913k866j1123K880K2886M709m0623
16070A5648j3854r589l726r565J4735L305P127M606o19P934l654j135K407j0977
16056B643j493J4451P261M607J526l4296L886J9171k239j909m373N900K420j0810
$$ y = [-20205, -22291, -40678, -42424, -32120, 6517, 27280, 15200, -7139, -49042, -27448, -17573, -6057, -2500, -10428, -15388, -30030, -23981, -37658, -57659, -65202, -65983, -37399, 26447, 44331, 29223, 20943, 14082, 13676, -1800, -20135, -30489, -16288, 12027, 25674, 16996, -8669, -22746, -17647, 16625, -3711, -36529, -62335, -59629, -42109, -23460, -19658, -7738, 6609, -7849, -27788, -20350, -2054, -14170, -26173, -15302, -10525, -18003, -12531, 31559, 26678, 18573, 42993, 66768, 54550, 19517, 11469, 48, 2193, 15872, 39785, 36919, 25796, 28676, 51562, 56271, 15648, 1794, -7795, -11521, -21086, -6351, -3046, 4081, 8687, 8068, 16002, 12348, 11213, 13620, 2643, 1150, 15601, 22862, 27469, 28995, -5301, -1415, 17756, 15517, 13608, 9235, 15135, 17555, 6745]
16042F745o7L867K6963J8643q017l9946j3697K8044J2199j6425k2192j0384K0132
16029E865J5380K0644M902k26j346l144l025k0812j7163q828P331N478J3894M649
16015B3599K3288J5380j936j130j1467R665k9139j0088J6458R939M362J4182Q501
16002G1614p141k9396r684R26J238j0330q313M350k0467j6519K1493K5670p555
15989A5886k278J3810j2278j2441k4632j0292K8673J7562J0840l200j9558j6583
15977a4491j8818J979J884O906L0446J8744L416j642o973Q059O678j6300k0295
15964d07K18K9246J3006j1511k1826j8Q420P789j1186K437m305J0178K812l6163
15950a1310j1395q867K188L1617p716M568j4251J1875n136K9313J3559r507k8475
$$ y = [6745, 6678, 10545, 37508, 56151, 48134, 8188, -5509, 22535, 34734, 18309, -3883, -14267, 5865, 21245, 41889, 46791, 46565, 45219, 42075, 39050, 18238, 1075, -7753, -422, 5056, 18950, 23599, 46887, 62267, 60331, 59201, 47734, 57399, 28260, 18172, 34630, 44569, 48931, 63113, 71614, 64473, 35077, 25393, 26319, 27557, 17227, 8914, 13264, -7203, -23722, -2229, 23441, 15886, 13608, 27418, 15140, 2699, -21933, -32225, -3552, 14010, 24850, 21650, 2092, -14491, -33309, -31330, -29446, -22540, 7906, 26650, 30066, 28424, 21451, 29510, 36188, 19888, -407, -189, 29057, 42063, 30552, 8726, 8708, 17128, 24917, 13731, 16168, 11863, 22041, 24853, -11310, -22705, -31572, -29384, 2233, -5483, -915, -15166, -3291, -8427, 20886, 34445, 24938, -3537]
15937c537K322J0721j9194P43K5276J5856J4216L62j5840q899n147J643P20m2391
15923b3149o934K1180J3197J0850p555k8306J2j4430L6571J8039k6712l803j9506
15910c0546k0983O6J0975L551j0151k1059P300K1564R797p872j1042K3082M794
15897b0524k0828O28O902J0553N903r900J5143k96k5963R40J4987k1803J8357
15884b5901J4721L3037k52j2137k4186p068p568O936j2362O894J2898K0886n131
15871G67R18J5022k671j9255r517j5321O599Q93q142L382J6540j9420J6832L7187
15857B3814J4263q768j0950l2301l7974L6502L7621J1631k831k351K1167l1416
15845A8407j7759r816k7074J2399m624q993O664K8496J7662N747k8681k3703k8838
$$ y = [-3537, -1215, 9506, -9688, -8945, 16331, 32187, 46403, 46765, 30925, 22026, 16879, 18522, 19242, -23149, -30083, -8903, 4294, 15144, 7589, -20717, -20705, -35135, 1436, 19475, -7237, -11040, -30546, -51529, -51463, -40488, -36937, -47088, -68147, -60847, -39283, -29486, -37358, -48400, -25318, -20524, -41352, -40724, -33822, -23269, -17366, -27266, -12123, -12419, -38382, -37442, -22455, -44258, -25901, -11180, 21857, 21605, 9468, -14718, -21786, -29354, -22418, -34780, -27886, -14988, 5898, 767, 1685, 16707, 14036, -5219, -14736, -30057, -23458, -22565, -30707, -27325, -10785, -30205, -13373, 23814, 38077, 29309, 18359, -13942, -51916, -15414, 22207, 33838, 31007, 28656, 49823, 18407, 648, -9168, -36242, -23843, -28467, -37460, -30796, -2300, 15362, 21109, -7572, -31275, -60113]
15832f0113j436M4875P913j1700J3650k582k7530r520j2419J8248J7295j9145
15820d2464r313j4860k275L3927M304L120l698j1856M604J4937J0150k830j80
15807a6434l513j532j1973j4026j730Q002J1897J0339j3286j5851L925J9566L6804
15794A2188K1549r765k7852m510K590j1501m054j836R114p199J923R908N901Q03
15780b741n629J608J158m589q369j1485k717K564j453J5977k939j6881K8798K9413
15766B2715n340k6823K285J954j5083m306j5582q710K5714J4076L0382o397r057
15753E828p282l398J980m460k0580Q0L462j3747j879K8279j626k0274r127l1900
15739g4644K0117L2058K2926o485j0345J2338Q791r128q337J5358j6968k975K957
$$ y = [-60113, -61549, -16674, -8761, -20461, -6811, -9393, -36923, -46443, -58862, -40614, -23319, -42464, -51777, -66637, -68912, -34985, -30681, -27561, -31259, -43115, -38511, -23574, -13424, -16254, -16434, -19947, -21479, -33452, -47478, -49208, -41206, -29309, -18970, -32256, -48107, -44182, -24616, 12188, 33737, 23972, -3880, -8390, -5800, -17301, -21355, -23191, -14077, -21276, -19353, -9445, -3544, -2741, -8370, -6762, -5604, -10193, -18562, -30047, -32764, -30200, -31653, -15676, -18615, -35496, -6698, 22715, 17375, -9448, -7163, -5209, -20292, -24598, -40180, -48890, -23176, -9100, 21282, 14885, 5828, -1454, -4852, -2872, -7332, -27912, -27832, -24370, -38117, -39996, -11717, -13343, -33617, -42744, -74644, -54527, -22469, 457, -6028, -16373, -4035, 4756, -4372, -12709, 2649, -14319, -17294, -14337]
15726a4337m313k8983K690L5938K794p525r242m19K0037j9558N533K0754q62o607
15712d100j8093o352j521n773J1208m877J995r809j6123k3378n264J8916K0669
15699d2502j3754q472J7615K8431j5988m689K5351N754L1419j1618k7390q392
15687b4235j3947P544K2328r645J7830P410j8151j4544J2688p304l1789m0890
15675i2705J0780K9259J4251j6980k1825J1154L6175K6477J6803j936j0038j6940
15663a5525j6740p792N066k544k1549R676K9879j1257Q97J953J6952J0591l493
15650c886K0628J8811j0247j0272q534j7723j3669n355J7023N838r872j10j7275
15637c4643j7056l189J0481j9140j8702l956J1228N582K0092j7874n26K3522j056
$$ y = [-14337, -18650, -47633, -44943, -9005, -6211, -13736, -22978, -23397, -3360, -22918, -17385, 3369, 2507, -4100, -22193, -28545, -30066, -35839, -24631, -29508, -27513, -37322, -53445, -76823, -82087, -63171, -42502, -56256, -64728, -47113, -18682, -34670, -39359, -14008, -8254, 23165, 11547, -15843, -24235, -38182, -30638, -8310, -17955, -125, 7285, -10866, -25410, -12722, -20026, -51815, -92705, -81925, -52666, -38415, -55395, -77220, -66066, -29891, -3414, 13389, 11453, 1415, -15525, -32265, -40057, -34991, -37535, -59084, -49408, -19529, -30786, -29889, -27936, -10984, -393, -3886, 16742, 35553, 25306, 15034, 6500, -11223, -24892, -30247, -13224, -7386, -17258, -17368, -34643, -51699, -54888, -44407, -63547, -82249, -86205, -74977, -69395, -49303, -67177, -67703, -44181, -45237]
15624d5237j1073J245O31K1973K8163L5726k9608k7676l887R899J1823k4639l5433
15611f8093k5688K4352J3849L928J0602j641N670K3490K4336o563l2958J8771
15599i945J4866q885k3021r983Q604j611o300K325M5691P810l2665j9950j9024
15586e2088j4461O453O211r918l837O693R828J3207J4904L699N411J1905L114
15573A121J7924o205k8691m2226o952J3727L10J1529N367P683O00l678J0938K0640
15559B087R372k4501j4229N306J7892m899p056o069J1797p493J5524J9817l1559
15546a4011k452k8955m734K2054J3378r0j5632O585K0213n227j983n792N397J3870
15532B621n60l6669q438p354j83O190J0259j9671j0604L443M687K1721K0972L569
$$ y = [-45237, -56310, -55065, -54434, -32461, -4298, 31428, 1820, -25856, -29743, -19844, -8021, -32660, -68093, -93781, -69429, -55580, -51652, -41050, -42691, -37021, -13531, 10805, 4242, -28716, -9945, 4921, -3964, -26985, -36968, -28364, -29975, -36275, -33950, 11741, 19551, -13114, -33064, -52088, -66549, -60096, -53885, -63803, -67640, -60947, -51119, -37912, -23008, -19309, -13898, -1993, 1121, 19045, 12840, -15851, -58077, -65029, -51302, -50992, -39463, -34096, -26413, -25813, -29491, -18553, 2087, 11459, -13042, -27271, -21965, -4073, -8972, -16028, -22097, -10300, -17793, -2269, 17548, -14011, -16463, -45418, -50152, -28098, -14720, -14810, -30442, -23857, -3644, -8871, -10854, -16646, -11249, 2621, 2061, -34608, -43046, -50400, -50583, -44393, -34134, -53805, -64409, -60966, -56279, -34558, -13586, -10017]
15518a0017k3028k0756K492j0689M545R550j8772j1301J6505K2581J0040K0696
15506h154L1480j4316m0272N72K5728J1896j1768o210k9649k0067k069J2881N294
15493d4654k935l0985L446J8856k4570J661J3909J09J6621L0538m965k4848p118
15480e4935M4502P251j3183m1742j0283Q843L315r832P357k172K6267J3111K4884
15467C383J53l1625k8002K3784L3270j1540m928j7150j5747K661N615M006o199
15454d2319J3601j4828j2596K0395K0938N717J0993j7162J0274n978K409K5199
15442A6643p448j2889j993N11J9885j6912l036n689k3672j5639K184K6459K7959
15429F363o526K379l891n115k548j2334l843j3097m835L293n340J6235n559k0478
$$ y = [-10017, -33045, -53801, -51309, -61998, -57453, -47903, -66675, -77976, -61471, -38890, -28850, -8154, 23326, 9010, -31262, -30690, -4962, 6934, -4834, -11044, -40693, -60760, -62829, -49948, -44654, -47589, -78574, -75128, -56272, -80842, -79181, -65272, -65163, -48542, -18004, -22969, -47817, -54935, -10433, -3182, -16365, -58107, -68390, -59547, -56232, -66064, -58707, -60879, -34612, -21501, 3383, 3536, -28089, -56091, -32307, 963, -10577, -15505, -32655, -48402, -45741, -40126, -36120, -42319, -28718, -43546, -56142, -35747, -14809, -9092, 1901, -15261, -4987, -10965, -8556, 16643, 9195, -3694, -5687, -5176, 14709, -2203, -5239, -10928, -34600, -50239, -48055, -21596, 6363, -163, 2216, -1675, -6790, -9338, -21672, -25515, -38612, -43447, -40154, -45494, -29259, -34818, -55296]
15415e5296P366J1725M749j1795J3250R715o396J680N324k7629j5500K0343P131
15402c5333J1374j2570l002P652J6068J2123q908q561J3884J1806j6706p062L63
15389a8872k6590n400l032J822K1976N401j863L517J637K2131j0949m7669l563
15376f1454J8854J0429p073k5926j4057J0805K4750j283k4899p506L9623K1410
15364a6327K308p430m682k1234n89k891j3268p090L454K3043j5854p648L6477
15351c1731k739j0780J5521j4719j8428K600o419j7595R50L8818n172j3724L1731
15338c1687k985l3027k594L7240K7525j4538k2737j9760K0901p007J3419J3564
15326b1686o959j1958K04k875L651Q526K2489j275J3365m593K1373j4033j3719
$$ y = [-55296, -47930, -36205, -31456, -43251, -30001, -20286, -26682, -25002, -19678, -47307, -62807, -42464, -35333, -23959, -36529, -39531, -31879, -15811, -3688, -12596, -21157, -7273, 4533, -12173, -19235, -18872, -45462, -50862, -53894, -52072, -30096, -24695, -26558, -23041, -21404, 727, -10222, -57891, -61454, -42600, -32171, -39244, -65170, -79227, -68422, -43672, -44955, -69854, -77360, -37737, -16327, -14019, -21449, -26131, -47365, -47954, -50845, -64113, -71203, -67749, -44706, -60560, -68208, -31731, -34470, -45250, -29729, -44448, -62876, -60276, -66695, -84290, -83340, -44522, -49694, -63418, -31687, -34672, -67699, -70293, -33053, -5528, -20066, -42803, -62563, -41662, -48669, -35250, -21686, -28645, -40603, -40399, -43274, -39623, -31097, -8608, -9883, 3482, -1111, 20262, 6229, -7490]
15313g490r180j3656O882J2916J1356p078r864l6214k175J6616l5266k209J6839
15300e8523N649k176J5572O495J4670j1984k6127r689N580k529P729k950j8670
15287g6953J4146j0451l029L279K1010j1217j8710J5257L33L1302J6709j2993
15275c1317K9502J4725k2574k4667k2792R849K74J2796J7891J6648R343k0445
15263a0767k4860j316j1898r98M271p345L681J6141j3089M946J1519R191p130
15250b7654J5007q060j5139J2849K611j5508j8482J1534K7158P089j830j9241
15238b9666j618K5286J7278j7381k3606k30J8456O975p652m147J0313K0429K4664
15225C9101n619j9777j1361j3931j0610l5M109k6111j7686j8545j3006N5050M3269
$$ y = [-7490, -16670, -30326, -23444, -10528, 828, -6250, -16114, -52328, -54503, -37887, -73153, -75362, -58523, -52874, -55050, -39478, -32983, -18313, -30297, -56424, -66113, -60533, -63062, -55333, -58283, -76953, -62807, -73258, -76287, -73008, -51998, -63215, -81925, -66668, -66335, -35033, -18324, -31317, -1815, 12910, -9664, -34331, -57123, -47274, -47000, -34204, -16313, 335, 9678, -10767, -35627, -36943, -48841, -49839, -45568, -52913, -49232, -33091, -46180, -41234, -29715, -20524, -27654, -12647, -20707, -35846, -22997, -20386, -35894, -54376, -42842, -15684, -8595, -10425, -29666, -31284, -5998, 11280, -6101, -29707, -29937, -11481, -4506, -12158, -16305, -5992, 14437, 39101, 33482, 13705, 2344, -11587, -22197, -22232, -18123, -44234, -61920, -80465, -93471, -38421, 4848]
15212D848j1234n908K1214K4567K5166o854p147l4319k9405L369j1124o500K5097
15199h230M06J5384J1875n324j4101q439q844Q721o656m961K833j6011j9516r632
15185f2495q036J4968O572J0012O704k065m216j5084J4397M995l0542p605J8582
15172e3813J9017l677O729j627j6684j6194K0712k429j1621j0574L8542K8018
15160c601j166o50l899R549k5743K4371J7928j2506l5120l2498k3520N612K2418
15147e8825Q57k276J4604N688K9182K870k2570p844Q867O006Q419l188L035j1641
15133b6816J152l3621J7178O326m838J7342N024j0316N336j9233j2473Q562n884
15120e2261j4821k123J2636K566j0503J605J6706L3838k4073j520k105k3935q703
$$ y = [4848, -6386, -12294, 8920, 33487, 58653, 51799, 44652, 10333, -19072, -15703, -26827, -33327, -8230, -7824, 7560, 19435, 14111, 10, -8429, -17273, -8552, -15208, -20169, -17336, -33347, -52863, -62495, -70531, -55563, -48991, -38979, -32275, -34340, -38556, -53640, -39243, -34248, -64790, -72395, -53813, -34796, -38473, -31744, -33371, -50055, -66249, -45537, -47966, -59587, -70161, -31619, -3601, -4767, -5417, -9316, 233, -25510, -1139, 16789, 4283, -30837, -63335, -86855, -81243, -58825, -57968, -60244, -45640, -39952, -10770, -7900, -30470, -38314, -29447, -23441, -15022, -18210, -15175, -26816, -25664, -59285, -42107, -35781, -40619, -23277, -18253, -28569, -23233, -42466, -54939, -46377, -52261, -67082, -69205, -56569, -54003, -64506, -62901, -46195, -12357, -36430, -37950, -40055, -63990, -72693]
15107g2693K774L3598K5366l5848j8535L7530J6981j4164k106N026R324K8362
15095A5615K3660j7756j9593l760q732r739j0272J2854K0377o693K0415O933m0006
15082a6697k2840q577J1450J7916R36O627j2509j6581Q402K3768k6524o89J8845
15069a6473R698k0675k1603O154J9621L12l0472j5689N109J2002k3459N969r890
15056g9396J0211Q916j467O920J842q39j511r272J0473K4606J3345k021J2784
15043e409K257q326M327R145l67J716j2037j0367r128o82k2362j4205P903J0994
15029d6541p771j892j0364J2760M462k750r259r547k4341J4279Q258L1903J8733
15016b2070P672L37k763k6334k3669q851O506m562j5286M782R295L1352J2606
$$ y = [-72693, -69919, -36321, -10955, -46803, -65338, -27808, -10827, -24991, -27097, -22071, -12747, 15615, 39275, 21519, 1926, -1834, -10566, -20305, -30577, -17723, 2654, -4039, 16376, 23309, -16697, -39537, -48114, -36664, -18748, -17812, -11185, -23694, -40275, -31873, -8105, -34629, -35318, -16473, -6775, -27450, -49053, -42899, -23278, -22966, -53438, -69127, -64018, -52016, -75475, -69506, -79396, -69185, -60269, -61736, -54816, -52974, -53813, -55324, -64596, -54123, -29517, -16172, -18193, -5409, -3152, -11478, -7151, 1994, 1627, 3343, -8694, -19061, -28189, -28871, -51233, -65438, -57535, -46541, -54312, -56204, -66568, -53808, -49346, -52096, -61355, -70902, -95243, -80964, -72706, -40803, -22070, -14398, -14061, -16824, -43158, -66827, -75678, -69172, -73734, -89020, -84238, -74943, -43591, -30985]
15003c0985M362J5001n983j3694J7287K7088l849R43k660k0052K6583Q665k0278
14990B428p88K5187O202J6437j595N976O133L2473M5685M7451M4114J31289K33801
14977E94793K88267J93103m4151k95970l34743j83526q0893p7976j4817p351k1393
14966A5343n106n11l3249l6532p179P655P575J7022J3144K6652n255o306L946
14953b801r075j7447m96q50k4996J0516N1954J7655J1334j8300l5962k0836l0441
14940f9745J192J0072N19J269J4134L925qJ3118N894O729j0891J189J209L2917
14926A1523m237N807j5028k2998k4616q480q1K7169L4955J3881k3145j5247k7923
14913d8420q468J1815j2588J6116M128j6409L1240q313k7127k8087J4484L4625
$$ y = [-30985, -26623, -11622, -17605, -31299, -14012, 13076, 9227, 10170, 7510, -12542, 14041, 22706, 2428, 1640, 26827, 33029, 49466, 47871, 53847, 59980, 92453, 138138, 185589, 229703, 360992, 594793, 883060, 1076163, 1032012, 736042, 401299, 217773, 136880, 58904, 44087, 36736, 15343, 10237, 9726, -23523, -60055, -67234, -59579, -52004, -34982, -21838, 4814, -441, -6747, -2801, -11876, -29323, -29819, -30669, -55665, -45149, 6805, 24460, 35794, 17494, -18468, -39304, -69745, -68553, -58481, -57962, -56693, -42559, -38634, -38642, -25524, -19630, -12901, -23792, -22603, -21394, 11523, 7286, 13093, -1935, -24933, -49549, -58029, -58110, -30941, 4014, 17895, -5250, -20497, -48420, -56888, -45073, -57661, -41545, -37417, -53826, -22586, -30899, -58026, -86113, -71629, -37004]
14901c7004J9794O365l283j1117l5893Q134J3089k7201n097L9047M496J6580j2070
14888b4160p348k665J1901K8950K633m7800k3336n457N758L0711L1674R588j681
14875H768l1093j4108n553n074J891Q433O316J6432L003j2950j3972J0982j569
14862b8494k0132o596j1673N239J4784O677l693m919O30K878k6519j310J7640
14849e5488l1267q256L8672k097m036R701J3083J1081J3506l4114J856R603N404
14836c2352L3650J4231j1256l6557l1746J7001N879j7771M903K632j4785k360
14824f8531L7604q638O176j1665J1339l686j4815l1050k0126K0686K0806J5593
14812d6307N80M320J2418R80M94l422k1863m413o133j0342j0910K2612M562K831
$$ y = [-37004, -17210, -10845, -14128, -25245, -61138, -53004, -39915, -67116, -72213, -33166, -28670, -12090, -24160, -31508, -34173, -22272, 6678, 9311, -38489, -61825, -67282, -61524, -30813, 861, 10449, 8768, -22325, -36433, -41986, -47060, -45169, -36736, -30420, -13988, -10985, -23935, -37907, -26925, -28494, -48626, -55222, -66895, -61656, -46872, -40195, -43888, -48807, -48177, -45299, -71818, -73128, -55488, -86755, -95011, -56339, -58436, -62472, -52771, -39688, -28607, -15101, -49215, -47359, -37756, -32352, 1298, 15529, 4273, -32284, -64030, -47029, -41150, -58921, -54018, -51386, -66171, -68531, -30927, -39565, -33389, -45054, -33715, -37401, -52216, -83266, -103392, -82706, -61900, -46307, -45727, -41407, -28989, -28009, -27515, -30937, -52800, -57213, -63346, -73688, -84598, -61986, -57424, -54593]
14798e4593J2683J710N647k478n156j0208J9100L7409m185j6518p916j9610j0135
14785e4250r865K8876J7928J0458p670k0831j6599k0968K852n078Q285K5783K696
14772c8383L513K1824j4962p468Q726k6588L069J707o476K7324K7874J814k0209
14759a8235M707J578l155p141l877o82Q721l511L823j1749n89Q016j0590j2008
14745d4692j7793J2450J3290k7901N77o90r368J4646J3933j756L293K5155J5023
14732c833J9387p56k2991j6326L209J1922k1232N81k2571O835J8183J9316l1856
14719d0132k3642P709O5041J9141l153j7679l5671k913J2750J2575o608k159l252
14706a7993l370k0141j2795L1206K1638r652m37k4339m67R70R151k397P379k512
$$ y = [-54593, -41910, -40200, -34553, -37031, -42187, -52395, -33295, 4114, -71, -16589, -24505, -44115, -54250, -64115, -35239, -17311, -6853, -14523, -35354, -51953, -72921, -70069, -75147, -66862, -41079, -38383, -34870, -13046, -28008, -35476, -26750, -53338, -50269, -48562, -55038, -27714, 160, 1974, -18235, -13528, -11950, -15105, -22246, -26123, -26805, -18084, -21595, -17772, -29521, -30110, -22094, -32684, -44692, -62485, -50035, -36745, -64646, -64069, -64759, -74127, -59481, -45548, -47304, -44011, -18856, -3833, 15554, 14798, -8193, -24519, -21310, -9388, -30620, -30039, -52610, -45775, -27592, -8276, -40132, -63774, -56065, 8976, 28117, 24964, 7285, -28386, -31299, -18549, -5974, -12582, -14741, -17993, -21363, -41504, -54299, -23093, -1455, -11107, -11544, -35883, -36350, -35380, -26229, -28626, -21247, -23759]
14692b3759J076l7064k4488L5782J9075m398K44N925P712J751L968J4903q566
14679g839L991l438K397q136j3493j4579j0531j386K3101P566n90O018J1274j538
14665g183j3795o567q63k6841P565Q391J2289j0928j434j7930J139o983K539J345
14651e9256j3830j5268L2616L5333m674j1417K3021K1218P718O588j3002l0241
14639b1194j9520Q091J8211q986k4958j3273O981J2693K4495J581j2423l5482
14627f3784r07p137J5790J9793M876j7797k6598J1090J2330J5408J4911L090l0648
14614d9583J6446L4904q310j1134j7244J4616J4615j4015k1844j142J7467J377
14602b3847Q167o792r987j7848K703L1886m220k4501j2872O014q719k585J0370
$$ y = [-23759, -22683, -59747, -84235, -48453, -29378, -33776, -33532, -27607, -19895, -18144, -14176, 727, -7839, -3848, -7286, -4889, -13025, -26518, -41097, -51628, -53014, -29913, -22347, -22937, -16919, -5645, -7183, -20978, -27545, -28408, -55249, -47684, -39293, -27004, -37932, -39366, -57296, -56157, -63140, -60601, -59256, -73086, -88354, -55738, -20405, -25079, -36496, -13475, 7743, 15461, 22049, 9047, -21194, -40714, -32623, -14412, -23398, -48356, -61629, -54648, -41955, -17460, -15879, -28302, -63784, -64691, -71828, -56038, -36245, -31369, -49166, -75764, -64674, -52344, -36936, -22025, -18935, -49583, -33137, 1767, -6543, -17677, -34921, -20305, -5690, -19705, -41549, -42691, -25224, -23847, -15680, -22472, -32459, -50307, -47604, -15718, -19938, -44439, -57311, -51297, -60016, -62601, -52231]
14589e2231R888L4544J7097j8928n3645m278K9164J2005l165p027J3225K0445
14577b906j836k1327j8934j5292j0606J2458K3932j073N664M489K7284O109j429
14564F533j7347p326L420m6656j7501J8584j1517J0918j5717J9689K7534J1864
14552a7522O22k986m5778r463K780J4053R6N352K849k6561J4436p298l2250k3302
14538a24972K8655K5755Q142j089P692j273k6601Q943M675m84J1106M793j1803
14525f6461Q201J1974k4779j9762L3010J2707J2512j0385J2189m697O899K339
14513b6253j1459J313k1802o246P322j2404o19l108j6301k1414J0385K5159R805
14500f5622R932J2462J7738J2783k7581n075J5570m308j0451l184n904m382J616
$$ y = [-52231, -42343, -7799, 9298, -9630, -63275, -67553, -38389, -26384, -29549, -36576, -23351, -2906, -4742, -26069, -45003, -60295, -70901, -58443, -34511, -35584, -29920, -25431, 1853, 7962, 6533, -10814, -18140, -14720, -61376, -78877, -60293, -71810, -60892, -76609, -56920, -29386, -17522, -16900, -19886, -65664, -75127, -72347, -58294, -58198, -52846, -49997, -76558, -62122, -69420, -101670, -124972, -96317, -70562, -62420, -63509, -55817, -57090, -83691, -74748, -70073, -70557, -59451, -54658, -66461, -58260, -46286, -71065, -90827, -57817, -45110, -32598, -42983, -30794, -35491, -28592, -26253, -37712, -36399, -58201, -64447, -57125, -69529, -70148, -73256, -89557, -110971, -100586, -75427, -65622, -55690, -43228, -25490, -12707, -40288, -45363, -29793, -34101, -44552, -47736, -53640, -58022, -56406]
14487e6406J0976j5292K0287J936k6008k2432J4821L3701j08k3043N409J0812
14475d5347l644m829j2800K0026J6761k2313K727L8311K7110P735p328j8717l0037
14462c2345j9460j0443p989k8189j7934Q374K8064K9827K5439Q019j4270j5084
14450d5991J2781Q528k4148k3675j2676K7830m97j9534K868J3634o15j5687N366
14437g1816Q397K1231j4725J1223L4210j4783k6368K1725P996j3435p267R097
14425c4515m303k9531P743J5115j399J503J5670p385n231j4380J2612J2052k2219
14412e4268K027J4415K2129L61j264k7843l5439M659K3387P810k9455l180J0094
14399f6567K3924L065j0530J815p304k3003k7154K0503K5255R67m85j42K0873
$$ y = [-56406, -45430, -60722, -40435, -38499, -64507, -86939, -72118, -38417, -38525, -61568, -56159, -45347, -48991, -53820, -66620, -46594, -29833, -52146, -49419, -11108, 16002, 23737, 16409, -2308, -32345, -51805, -62248, -70237, -98426, -116360, -107986, -79922, -50095, -24656, -16637, -30907, -45991, -33210, -24682, -48830, -72505, -85181, -57351, -57848, -77382, -74514, -60880, -61495, -77182, -71816, -63419, -42188, -56913, -45690, -11480, -26263, -52631, -30906, -22910, -36345, -43612, -34515, -38818, -68349, -60606, -45491, -46890, -45387, -29717, -37102, -42333, -56713, -44101, -32049, -54268, -52241, -37826, -15697, -15336, -16600, -44443, -79882, -75223, -51836, -44026, -73481, -76661, -66567, -42643, -39578, -50108, -48293, -55597, -78600, -105754, -85251, -59996, -59029, -59514, -59656, -38783]
14386c8783J0301P300R429l2755m7361p152q844n657L3028Q339q420j3986K0162
14373g4399O281R473O290j0642M706j203K7890n834m675k5447J6531r302j3374
14360g3705L592J1452J5929L328q874k4472L1611L0848N383j4661l2444p023J4544
14347d4492O073J2501j0727N677K6353j6411J933k0100n005P59N717K5845j987
14334a3864m3147j1314J1036L399P800J6886q617l0674J0438L131J9216N299k1697
14321e2108n037R181j2289R234j725J8184L3102J5104k1404K750N317j5600Q967
14308f324o093k4709k0729P125J704j2423J8851J8541R448j5723j327N799o582
14295c2442l645K1539m121j212m532O819N545N593Q619l981j5830J2351k1051
$$ y = [-38783, -28482, -21182, -11753, -44508, -91869, -99021, -107865, -113522, -80494, -72155, -80575, -94561, -74399, -68118, -58645, -52355, -62997, -58291, -59494, -31604, -37438, -42113, -67560, -51029, -60331, -73705, -70113, -58661, -42732, -39404, -48278, -72750, -41139, -10291, -4908, -19569, -52013, -59036, -44492, -38419, -25918, -36645, -30968, -4615, -21026, -19093, -39193, -44198, -43439, -37722, -11877, -13864, -57011, -68325, -57289, -53890, -46090, -29204, -37821, -68495, -58057, -54926, -35710, -30411, -52108, -57145, -47964, -60253, -51019, -52744, -34560, -1458, 13646, -7758, -5008, 309, -15291, -6324, -12417, -37126, -57855, -50730, -49026, -61449, -42598, -24057, -14609, -30332, -31659, -25860, -32442, -36087, -14548, -18669, -19881, -24413, -17594, -12049, -6456, 2163, -1818, -17648, -5297, -26348]
14282b6348k608j0512J3297J4948k7906N367N447m64k5709j3073j2543J6621K717
14269f0766j289J4111K3685R600l9061l3631J9582r366Q692J1375J6423o188L0864
14256a5969p990J8870J2784j1409k4261j0759o060r17j1282j2960J4393M667K2005
14243b8888k0119J1559K4416q023J1968L0239J5590J4726R472j854r402m0682
14231I002l2606n457J9217m87n887k6775Q962K0501J7799J7349m933r534k2978
14218a5827j5859J6673J6207J3924L7980K6456m268j2130K6899J0094K9098L0796
14206A60043L9426J1479J6377J0749L4969J6507K3416O8611J11934Q8915O9426
14195F51852R1632M2789J1909j879r978k9603k5430J6162j5717J1838k4009l6207
$$ y = [-26348, -28956, -39468, -26171, -11223, -39129, -33762, -28315, -28779, -54488, -67561, -80104, -63483, -60766, -62055, -47944, -24259, -14659, -53720, -87351, -67769, -77135, -68443, -57068, -40645, -46833, -15969, -23959, -5089, 7695, -3714, -27975, -38734, -44794, -45711, -56993, -69953, -55560, -50893, -28888, -49007, -37448, -13032, -21055, -9087, 21152, 36742, 51468, 60940, 59086, 49684, 9002, -23604, -29061, -9844, -10331, -16218, -42993, -34031, -13530, 4269, 21618, 16685, 7151, -15827, -31686, -15013, 1194, 15118, 53098, 79554, 75286, 63156, 90055, 100149, 129247, 160043, 199469, 210948, 227325, 238074, 273043, 289550, 312966, 381577, 493511, 582426, 651852, 743484, 786273, 798182, 796303, 786325, 756722, 731292, 747454, 731737, 743575, 719566, 683359]
14183F83359l4321p8735r9731n9416r2669r0257m7751l626j2310k6971k8578l4529
14171G4465L729K6300M332k406j2040j6170j8601k8774P88J9962m554r451L343
14158D0923j2728q862Q578l779o716k5563k499K185j6302j7923l200K6399Q188
14145a1299l9057P130J4556L5015o732j1997r464L479P467O102N52j9893L981
14132b0160J0033M255R13l880j3397m797k55R09k2201J6707j1694J5961J8746
14119h860L554K1589J43m412l0397l0148k3754R884J520P214J9525M037k5756
14106e5861k2170L521R516J3414J1444k0721j587J901J2422J1730Q389Q006j1713
14093c1709O32K1148j0522l670J9600J2735P306j5492j8078m467k033O41J1370
$$ y = [683359, 649038, 570303, 470572, 411156, 318487, 228230, 180479, 176853, 164543, 137572, 108994, 74465, 78194, 104494, 108826, 106420, 94380, 78210, 59609, 30835, 31623, 51585, 47031, 37580, 40923, 28195, 19333, 27911, 24132, 17416, -8147, -10646, -8461, -24763, -42686, -45886, -19487, -11299, -50356, -43226, -28670, 6345, -387, -12384, -21848, -18369, -10902, -4800, -4248, -24141, -20160, -10127, -5872, -4959, -8839, -22236, -27033, -27288, -26379, -48580, -31873, -43567, -27606, -8860, -5306, 16283, 16426, 12014, -18383, -48531, -72285, -62401, -60881, -53667, -34142, -30105, -55861, -78031, -74510, -64994, -51580, -40136, -60857, -62444, -60543, -48121, -36391, -28002, -19996, -31709, -31077, -9929, -20451, -24121, -4521, 8214, 15520, 28, -18050, -22517, -24550, -23909, -12539]
14080a2539L944k0159o959m214J5602J214J5170q025j2012j2104o598J258k106
14067d7528J4038K3486N569l0901q582O297N970J3733J204r514k5956J1272m952
14054d5864k3604L2j829J1423J3488p550k5454N747J4582K8719R57p122O29J3564
14040b2282J5631J0505R394q732j4732N21j8292j16j9171q198J7160J7827k358
14027b2843k5636J3771J8483k0629j0582j4117o480l170J0643J0175J7703o912
14015c9594j6773k787M7804N224m125j3864J0475J3229Q433k0726j9719j1035
14003d3458n889J0966K4569j9470J4584K3561K3145K2542l0097q134J4079l4603
13991h205k0910O670K6132m809j7859j2542o595k072J0503K9704K184j481m548
$$ y = [-12539, -8595, -28754, -35713, -39927, -24325, -23111, -7941, -15966, -27978, -40082, -46680, -45422, -47528, -33490, -10004, -4435, -35336, -43918, -37621, -31651, -17918, -16714, -26228, -52184, -40912, -45864, -69468, -69436, -71265, -59842, -46354, -53904, -79358, -73611, -59029, -30310, -29353, -36475, -35846, -22282, -6651, 3854, 13248, 4516, -10216, -9695, -27987, -28103, -47274, -55472, -38312, -20485, -22843, -48479, -34708, -16225, -36854, -47436, -61553, -68033, -71203, -60560, -50385, -32682, -39594, -56367, -59154, -11350, -6126, -10251, -24115, -13640, -411, 8022, -12704, -32423, -43458, -49347, -38381, -13812, -33282, -18698, 4863, 28008, 50550, 20453, 12319, 26398, -8205, -29115, -22445, 3687, -1122, -18981, -31523, -38118, -40190, -29687, 17, 2201, 720, -3828]
13978c828k982L7044N9076K0465K1835O5274P5992R2652P5870O2577K1038N792
13966E30805k8266l3509n8438o1678p7441n7258m6435m3761n5257k6252j9981
13955B2529J808K491j0689p709p551P235K4459J0123j4735j3709m750j6010k8827
13942c5335p445n790n489P009K165J8909Q143J2887j1380r681j9100L6975J0213
13929B081k7320j0293K1446J9207L4552k798k0236k1178n562J51J9165R258j8321
13916A52o776P135K1461j0829J6116J4579m2188o1379J0364J5265K6001j9199
13904b9298k0442L237r20K3342J9581k1937j3001j4430k2256Q138L5479l358p442
13891d3307q681j9346K3929N0542J8818k3194l9157n535K3687Q587k0633j7070
$$ y = [-3828, -6810, 30234, 89310, 109775, 131610, 196884, 272876, 365528, 441398, 503975, 525013, 530805, 502539, 469030, 410592, 348914, 271473, 214215, 167780, 124019, 68762, 42510, 22529, 24337, 26828, 16139, 8430, 879, 8114, 32573, 42696, 27961, 14252, 9502, -6508, -35335, -42780, -48570, -54059, -47050, -44885, -25976, -17833, -4946, -16326, -26007, -45107, -8132, 2081, -25239, -35532, -14086, 5121, 39673, 36875, 16639, -4539, -10101, -9950, 9215, 18473, 152, -6624, 511, 21972, 11143, 27259, 41838, -350, -61729, -51365, -36100, -10099, -29298, -49740, -46503, -47423, -24081, -4500, -26437, -39438, -53868, -76124, -67986, -32507, -35865, -43307, -51988, -71334, -47405, 3137, 21955, -1239, -40396, -45931, -22244, -13657, -34290, -51360]
13879e1360k434m984K1254J1942m91L516l232k3080K1966K075k8095J5370M3278
13866E725Q10l2016q570K0509J6679P233J5866l361k7955l799J618j4499O206
13853a5554M816K0838r506j9596J3221J3478J5933l024O165J8534L0348L5637
13841A11290K0000o798K7369N1023N2231Q6930Q7786Q1869J16442J19457O7829
13830H15428P6306Q7666M5708k8630L77k5446p4154r6861j10632r7309r5315r2452
13818D04686p6343q9782m1832o8329l8494k7186k2469N989J3087l7171n989M412
13806B0579K0023r20j0797J3953J3372j0670J816k0419k2673L03N0872M4859j2251
13793H8047j3526m651M856M443j3984j6206J5623L018j4521j4865J0683K2330
$$ y = [-51360, -53794, -58778, -37524, -25582, -26073, -22557, -25789, -48869, -26903, -24828, -52923, -37553, 5725, 6535, -25481, -34051, -13542, 3137, 10370, 26236, 22875, -5080, -8879, -7261, -21760, -15554, -10738, 10100, 594, -19002, -5781, 7697, 23630, 20606, 26771, 45305, 75653, 111290, 131290, 124492, 151861, 202884, 255115, 342045, 429831, 511700, 628142, 747599, 815428, 891734, 979400, 1025108, 996478, 996855, 971409, 897255, 800394, 689762, 592453, 497138, 404686, 328343, 238561, 196729, 128400, 89906, 62720, 40251, 46240, 59327, 22156, 16167, 20579, 40602, 39682, 28885, 42838, 56210, 45540, 47356, 26937, 4264, 4567, 55439, 100298, 88047, 74521, 69870, 74726, 79169, 65185, 48979, 64602, 67620, 53099, 38234, 48917, 71247]
13781G1247k5563k4077K64k9196j2400K7377p024j5294j9259L576j935j9829j1260
13768f3373k61J9894j1351k1526k5934J8033J7097j0531K5265K2214k2426k4211
13756g7110k725J1483k8676J9438K2805L223j8980j526L5026K6017L2857k2925
13744a093j0895R166J938j7382q765J5452o029k6384k1693P928M6973j8871j2242
13731d1897L5976O806m971J5323m190N700j8129k4542j4550R486K0469l468m725
13718b2712k268p145p797j0919L886K3235J3062j573Q428k3274j4604J4395q649
13705c5935M382P415j647J9202J9814R468j7978n096k7048m841J3178Q786J8215
13692G915M84j7372J2296K2202j1524r020J5050j1052m263J380k812k005j7057
$$ y = [71247, 45684, 21607, 21871, -7325, -19725, 7652, 628, -14666, -33925, -30349, -32284, -52113, -63373, -63634, -43740, -55091, -76617, -102551, -84518, -67421, -77952, -52687, -30473, -52899, -77110, -79835, -68352, -97028, -77590, -54785, -51562, -70542, -72068, -37042, -11025, 21832, -1093, -11988, -2822, -884, -18266, -27031, -11579, -17608, -43992, -65685, -57757, -10784, -29655, -41897, -5921, 885, -4086, 11237, 7047, 12747, -5382, -29924, -44474, -34988, -14519, -17987, -22712, -24980, -32125, -39922, -50841, -46955, -23720, -10658, -12231, -3803, -27077, -41681, -27286, -35935, -31553, -24138, -25785, -6583, 13231, 22699, 4721, -375, -27423, -32264, -19086, -10300, 7915, 8399, -8973, 3323, 25525, 14001, 4981, 20031, 8979, 4716, 6096, 3284, 1279, -15778]
13679a5778m325J3732j6886r96J6827N888k713m089L623P809J11l474J0363O079
13665A6171K0418K4427J881l0666J459q47J851J0611N950k241k7440k2739J8896
13652A7731J9563n84q362J2203P902K872m262n679J5816K5130J7650q652Q478
13639I9806j939j3598l066K2801J4368M810L5143K3880R666J9781K7336K7296
13627B66284L9221L0206K1550L2339M3357P7711N6071M5941N2848M0436O7822
13616G73786Q9845K6711o452J4245L1979k6482R884m793K843L0948k8853l9167
13604H74494j7144j6082l4296p239J0499M763L1287o392m0426k0961n7999n6868
13592F63636n4658r1428o8403p0701o7625n3332p3493m8480p187l853k3395k0688
$$ y = [-15778, -20103, -6371, -23257, -24253, -7426, -1538, -4251, -8340, -4717, 3092, 3203, -271, 10092, 16171, 36589, 61016, 62897, 32231, 33690, 32843, 34694, 45305, 51255, 49014, 21574, -1165, 17731, 37294, 36710, 28348, 40551, 48453, 51325, 47063, 41384, 57200, 82330, 99980, 91328, 99806, 97867, 84269, 81203, 104004, 118372, 123182, 158325, 182205, 191871, 211652, 238988, 266284, 305505, 335711, 357261, 389600, 432957, 510668, 566739, 612680, 665528, 705964, 773786, 863631, 890342, 883890, 898135, 930114, 903632, 913516, 908723, 911566, 942514, 913661, 874494, 857350, 841268, 806972, 799733, 810232, 814995, 846282, 839890, 799464, 778503, 720504, 663636, 608978, 517550, 449147, 378446, 310821, 257489, 183996, 135516, 128329, 124476, 101081, 80393]
13580H0393o858j2353O818k392J0681J1129J2118J6686K5716L7632P29R847K3676
13567B13822K4957P0628L7001L2149J5149M3137L5141k260j1959j3488l7544n5308
13555C51425m5530m0384o1045m1963m1464j3557j6330j5575k6802j6454p507Q13
13543B5627P278j724j6661q494N866M612r913K2489K2742L116k3454o015J2534
13530C8003K1092J3000M704k0083k3827p167M100P271r780m4139k157M303L4351
13517A9671J018o702O850R361M00J2095k4727p631R374J5099J0489l064J8453
13504F0686J4990j2028l4634p661j0149o835j7599J4160K0969R533K3373j0935
13492D3870n155l166j6260j1729k791k5060K601P172N694j2227j965M125j4421
$$ y = [80393, 73535, 61182, 68000, 65608, 76289, 87418, 99536, 116222, 141938, 179570, 180299, 190146, 213822, 238779, 309407, 346408, 378557, 393706, 436843, 471984, 469724, 457765, 444277, 406733, 351425, 305895, 265511, 204466, 162503, 121039, 107482, 91152, 75577, 48775, 32321, 24814, 25627, 32905, 31181, 14520, 6026, 11892, 16504, 6591, 29080, 51822, 54938, 31484, 25469, 38003, 59095, 72095, 76799, 56716, 32889, 25722, 29822, 37093, 27313, -16826, -18983, -14680, 19671, 20689, 13987, 20837, 30198, 30598, 42693, 17966, 10335, 19709, 34808, 45297, 42233, 60686, 75676, 63648, 29014, 21353, 11204, 4369, -13230, 930, 21899, 31432, 54805, 43870, 38715, 35549, 19289, 7560, 4769, -20291, -17690, -10518, -4824, -17051, -19016, -14891, -29312]
13479b9312J0022P185P922K853r505n381O219J2749k36l216k2393P382K0057j2619
13465h273j8288k734k3046k907N207J659K0942M552k8347J7229P60l598J3664
13452b3180j6083n260J0688m731r873J5184J2152J2959k5060m5900J6068L917
13440e9119j6641J3802K6727K2008k9819j3264k052J1514K4331j2638n3857k0575
13428a09583J1957Q500L3082J3679j641L140J8293J813j2106k0286O312K488J0179
13415c4173O315n179k832j2102J6507Q237R416R262k0896J142L424M918q966k4140
13401d9067N931r321p916k189J6197J5002r33k3961L19R224L5762j18j96o313
13387a7579Q105j4630j7718J0670r995k4090L0583Q413M140K955M113j7849l84
$$ y = [-29312, -19290, -12105, -4183, -1330, -10835, -16216, -9997, 2752, 2516, -700, -23093, -15711, 4346, -8273, -26561, -29295, -52341, -55248, -50041, -48382, -27440, -22888, -51235, -34006, -33246, -36844, -23180, -39263, -44523, -33835, -38566, -48439, -33255, -21103, -8144, -33204, -79104, -63036, -59119, -75760, -61958, -35231, -13223, -43042, -56306, -58358, -46844, -22513, -35151, -89008, -109583, -97626, -89126, -56044, -42365, -44006, -40866, -22573, -20760, -32866, -53152, -46840, -44352, -34173, -27858, -33037, -35869, -47971, -31464, -23227, -13811, -4549, -25445, -24303, -20879, -15961, -24927, -49067, -43136, -52457, -60373, -62562, -46365, -31363, -32296, -56257, -55938, -46714, -10952, -11070, -11266, -17579, -9474, -24104, -41822, -31152, -41147, -65237, -34654, -26241, -22101, -19146, -15033, -32882, -33266]
13374c3266K87k337Q492k441j803j4633j5073Q409J3905N232M25j6812p062J5974
13360d0703K1110K1578K7867j9589k3386q60L3413J7045k0841m0537k2097o33
13348d7633K8062J4532K8349R772r806J1525K553k0109l0985j1422J3385J2986
13336A209k556k2864J3032J8265p666o769N964j0626k8829j1755J1917L4991L3301
13323B7614J8733O4275O9352O5029M4440L0214j8292o4354j8553j7755l2896j1329
13311A56478q930K82m4184m0105m1074m0654n119j3011l0088j398K9980N425J4704
13298a7694K733R567k0419J1753J4751K166l539q398q213J1837M211j688M9086
13285D6153L830k084n568l506J8317M861J1858l0036k8065j3193J1193N569k153
$$ y = [-33266, -32979, -35316, -26824, -29265, -31068, -45701, -60774, -52365, -38460, -33228, -32803, -49615, -56677, -40703, -19593, 1985, 29852, 10263, -13123, -13983, 19430, 36475, 15634, -24903, -47000, -47633, -19571, -5039, 23310, 33082, 23276, 34801, 37354, 17245, -13740, -25162, -11777, 1209, -1347, -24211, -11179, 7086, -580, -7349, -1385, -12011, -40840, -52595, -40678, -5687, 27614, 46347, 110622, 179974, 245003, 289443, 319657, 301365, 237011, 218458, 200703, 167807, 156478, 147548, 147830, 103646, 63541, 22467, -18187, -23306, -36317, -66405, -67803, -37823, -32398, -17694, -14961, -5394, -25813, -14060, 691, 2857, -682, -9080, -17293, -5456, -1245, -2933, 46153, 49983, 47899, 42331, 38825, 57142, 62003, 73861, 43825, 15760, 2567, 13760, 19329, 17176]
13272A7176l102L886k765k4248K66O940J9994r005j9180j9297j3580J3425p317
13259c6807R293J0012j3127p583k5753R746K8583p21Q059M484R883l3600K625
13246c4906M635j0011K5525k064J6342K2507K605l9769k5148J4956P861K9754
13234A2287j1403j0491j1605m471M6129K9697N77j2391j3585k8570r757L6112
13222B2529J8568N503j0050J3267j5424L857K0722K2119N5381K2604j4960l4238
13210A09878n8981p048p921j6680j7829J7186l927r136j2454K166k220M4P531
13197F09J1251n478j7341k0371N716L0020j1843k2636P395L6J3184m523j4706
13184b8687J052j1983K4693J7808q920L396K9027K9273J3733j9691J2667J9547
$$ y = [17176, 14074, 17960, 15195, -9053, -8787, -1847, 18147, 9142, -10038, -29335, -42915, -29490, -36807, -27514, -17502, -30629, -38212, -63965, -54219, -25636, -26357, -18298, -13814, -3931, -37531, -34906, -30271, -40282, -14757, -16821, -479, 22028, 24633, -15136, -40284, -25328, -17467, 12287, 884, -9607, -21212, -25683, 20446, 50143, 50720, 38329, 24744, -3826, -13583, 22529, 41097, 46600, 36550, 49817, 34393, 38250, 58972, 81091, 136472, 159076, 144116, 109878, 50897, 43849, 35928, 19248, 1419, 18605, 14678, 5542, -6912, -4746, -6966, -6922, 609, 11860, 6382, -10959, -31330, -25614, 4406, -7437, -30073, -22678, -22642, -9458, -13981, -28687, -27635, -39618, -14925, 2883, -6037, -2641, 26386, 55659, 69392, 49701, 62368, 81915]
13172H1915K3015J6774k4916l3856k9639n772k1807k7572k0655Q711J2486K2928
13160A612o386J1647J7869Q975K6137J7528k7722r889J210J1774K4288K4026O042
13147A07111j3623k3176L003k8152n5648J1395J1119J9489K1959M2440k477n020
13135H8420L9089M2626J5356L3343O3291K8702L2198L3333O9918P3408M8988Q9392
13123F58064J30644J88133K58667L42008L87076L21638K29167J01237o0207j95711
13113B360716k92745l64358l83265l15864k53700j96310j29933q5014m8942l9502
13103B51083m8779p783j2166j7285p233r226J1695J9904J0729k735N930P186J6348
13090B17668J2289R200K4873K7873j5809n7378k2645J0877J4894k0355r446j857
$$ y = [81915, 104930, 121704, 96788, 62932, 33293, 27521, 5714, -21858, -42513, -33802, -21316, 1612, -4774, 6873, 24742, 33717, 59854, 77382, 49660, 39771, 40981, 52755, 77043, 101069, 107111, 93488, 70312, 73315, 45163, -10485, 910, 12029, 31518, 53477, 95917, 93440, 88420, 127509, 170135, 185491, 218834, 282125, 310827, 343025, 376358, 446276, 519684, 568672, 658064, 788708, 976841, 1235508, 1577516, 1964592, 2286230, 2515397, 2616634, 2556427, 2360716, 2067971, 1703613, 1320348, 1004484, 750784, 554474, 424541, 339527, 290585, 251083, 202304, 194521, 182355, 165070, 157837, 148611, 160306, 180210, 190939, 188204, 194134, 201320, 217668, 229957, 239157, 264030, 291903, 276094, 218716, 196071, 206948, 221842, 201487, 192041, 190184]
13078A90184l4233k4893J8422j558l555k157K1658j2455k7797J326k152J1104
13066A33894r948l4816P898J7681J2052R585L1981L4486J0809m080J9883M2251
13054B71676P0922O9837P0999J03572J32010J65770J99749J51769J8248n4766
13044A199786j59207k29479j99377j46746j04658n3624n3208k8746l6724l7528
13034A50489l1567l7359r92j8059o391n947l0859R177K8340m498r290r334k839
13021C0871j1346J1516o476J9737R768J4868K7888k5709j1541Q234k341m264p193
13008E4012j3650k0090l2755j7481K1290K0747n142o662l6162K918L3286J7409
12996A7720k4736J2767K2457o759J7695j4217j5504r126N558K930O55q7L995J3148
$$ y = [190184, 155951, 131058, 149480, 147922, 144367, 142210, 163868, 151413, 123616, 124942, 122790, 133894, 123946, 89130, 97028, 114709, 126761, 136346, 168327, 202813, 213622, 209542, 229425, 271676, 342598, 412435, 483434, 587006, 719016, 884786, 1084535, 1236304, 1254552, 1199786, 1040579, 811100, 611723, 464977, 360319, 306695, 253487, 224741, 188017, 150489, 118922, 81563, 80571, 62512, 56121, 50174, 19315, 28492, 56832, 52334, 43044, 33710, 30871, 19525, 31041, 24565, 44302, 54070, 68938, 96826, 71117, 59576, 67810, 65469, 61205, 54012, 40362, 20272, -12483, -29964, -8674, 12073, 6931, 269, -35893, -32975, 311, 17720, -7016, 5751, 28208, 21449, 39144, 24927, 9423, 297, 5855, 8785, 9440, 9353, 13348, 26496]
12982B6496K932K0818J5437j7182k7023l645J3215j1475k5992j0677M626J1065
12970a405J8752o821K467K4042J1938Q701L5622J36q661k287J0290k4499k6966
12957D1309r442Q026j1247J3219O9733N4730M0450M8419O4406J6641j5019l5987
12945B85238n3614n6717m4371l4911O640l092j2327Q47J6524j3473j6714J8692
12933I2722J1629n848J1972J024l7968l5752j9111J8374l569j3131J3996K1072
12921E5410j4982L66K7227K3282q219r199J4736k4837j448K1056J8006N370K4585
12908A31353J6039N1104N2275O6129N7243P4272R2550J05300O9950K8502p0695
12897F74022j12370j02534j08177q1007n7161m0565m2627m7283o804L6445K4632
$$ y = [26496, 29428, 50246, 65683, 48501, 21478, 17833, 31048, 19573, -6419, -17096, -12470, -1405, 17347, 10526, 12993, 37035, 48973, 57674, 93296, 93432, 84771, 82484, 92774, 68275, 41309, 31867, 39893, 28646, 41865, 111598, 166328, 206778, 255197, 319603, 336244, 321225, 285238, 231624, 174907, 130536, 95625, 102265, 99173, 86846, 87693, 104217, 90744, 74030, 92722, 104351, 98503, 110475, 111499, 73531, 37779, 18668, 37042, 33473, 20342, 34338, 55410, 40428, 40794, 68021, 91303, 83084, 73885, 88621, 63784, 62336, 83392, 101398, 106768, 131353, 147392, 198496, 250771, 316900, 374143, 448415, 540965, 646265, 716215, 744717, 674022, 561652, 459118, 350941, 269934, 212773, 172208, 129581, 82298, 75494, 111939, 136571]
12886A36571M3675L0679r035j3666j2380J3645L1892J2592p754K8895K9060R369
12874B93543J2907J0155m0390o5505k7706n8077p2981r068J5013o814k2840M304
12862C2541L1314M3000K5291j3027l502j179K3647L2070L5214N9704J5494M7868
12850C28435Q0001L1114l3524q582k9971k6418j1059m854j4516k9088k8900j432
12838B51206N673J7620j467j1495Q876K0789J6115Q780J0048j1974k86k934m418
12825C06533k1957k9846k3698M739m723K363j130k8912K450L0096K0162J6658
12813B72735K9879M7831K6522L539J9415L2553K3126J4477K2614N970k6418l593
12801D68650M447K8861L0780L45j5437j755J4768M7015K3809L0254J8775L2869
$$ y = [136571, 180246, 210925, 201890, 188224, 175844, 189489, 221381, 233973, 226219, 255114, 284174, 293543, 306450, 316605, 276215, 210710, 183004, 124927, 51946, 42878, 57891, 51077, 28237, 32541, 63855, 106855, 132146, 119119, 115617, 114438, 138085, 170155, 205369, 265073, 280567, 328435, 408436, 439550, 406026, 397444, 367473, 341055, 329996, 325142, 310626, 281538, 252638, 251206, 256879, 274499, 273032, 261537, 270413, 291202, 307317, 316097, 326145, 314171, 313885, 310951, 306533, 284576, 254730, 231032, 235771, 231048, 233411, 232281, 203369, 205819, 235915, 256077, 272735, 302614, 350445, 376967, 380506, 399921, 432474, 455600, 470077, 492691, 498661, 472243, 468650, 473097, 501958, 532738, 533083, 517646, 515891, 530659, 577674, 601483, 631737, 650512, 683381]
12789F83381L8712N1260N9550K2454J4497J1729O452L8409K4632M544j3019M463
12777I47064M598l92K7049J6613J6720P601J5528L1604N5318P9070M4931P524
12765A253228L198J6258L1416M8287N0636N1213O3663O8044N0109N4995M0292
12754A731339J6736M577j3473J1438P0099O9952N6010L3928O0618R7149J05833
12743B244206J19847J04719J03373J58549J54389J26280J51798J95433K57117
12734C615711K26891J94522K16481K38021K94108L15475L46858M10185M57413
12725F315665N28094O07238O44115P33735Q04000R17987J014456J078587J256702
12716A3900579J421651J643720J934706K266698K733554L265906L775866M228498
$$ y = [683381, 722093, 773353, 832903, 855357, 869854, 881583, 888035, 926444, 951076, 955620, 942601, 947064, 951662, 951270, 978319, 994932, 1011652, 1019253, 1034781, 1066385, 1121703, 1200773, 1245704, 1253228, 1256426, 1272684, 1304100, 1352387, 1403023, 1454236, 1517899, 1585943, 1636052, 1691047, 1731339, 1748075, 1752652, 1739179, 1750617, 1820716, 1890668, 1946678, 1980606, 2041224, 2138373, 2244206, 2364053, 2468772, 2572145, 2730694, 2885083, 3011363, 3163161, 3358594, 3615711, 3842602, 4037124, 4253605, 4491626, 4785734, 5101209, 5448067, 5858252, 6315665, 6843759, 7450997, 8095112, 8828847, 9632847, 10550834, 11565290, 12643877, 13900579, 15322230, 16965950, 18900656, 21167354, 23900908, 27166814, 30942680, 35171178]
12708C5171178M590002M898071N319729O071972P344612R412957J2794206J8227146
12700A03829873K6528742L7849102N0643398O1126188O4617997N8684765M4118479
12693D47398544K3154996j609060k6799964m7632512o1032838o5607392o2179093
12686B05692681n2492221m0227033k8651722j9336972j2806505q611650o025931
12679C7540647m436532l532051l065482k775851k582310k423998k200897j960300
12671A4563226j688551j374646j039743p75803n87626n68506o27083o09061n14928
12662F777279l35723k00919r7860k2121N0608O9622O4769K7014m3078j14158k02386
12651E973047l12971l58532l99278l88915l50257l05346k58619j74254m3077K5252
$$ y = [35171178, 39761180, 44659251, 49978980, 56050952, 63395564, 72808521, 85602727, 103829873, 130358615, 168207717, 218851115, 279977303, 344595300, 403280065, 447398544, 470553540, 468944480, 442144516, 394512004, 333479166, 267871774, 205692681, 153200460, 112973427, 84321705, 64984733, 52178228, 43566578, 37540647, 33104115, 29572064, 26506582, 23730731, 21148421, 18724423, 16523526, 14563226, 12874675, 11500029, 10460286, 9684483, 9096857, 8528351, 7901268, 7292207, 6777279, 6441556, 6240637, 6142777, 6120656, 6171264, 6240886, 6305655, 6332669, 6289591, 6175433, 5973047, 5660076, 5301544, 4902266, 4513351, 4163094, 3857748, 3599129, 3424875, 3381798, 3407050]
12641C407050N8483O3697J5778m4179q5744j03022j16473n1152J908J6230j3711
12630C148865j23682j74490k31532k40265k37743k16580j97409j36778r2813q0796
12620A416777n5313l1272m7862l6704l5470n1045l5055j3650k2646K412l6963
12609A053209m9101l7112L094J9509K860j7893J1543L1998M5957K7926M0103R3517
12597A225610J74892K19755J53278K801j98445k41871j83424j57231j10198p5584
12587H09583k2205k4344j9861j3795k9740j9353n1553j7804K8839J7913K6426
12576F84106J8392L0786J5756J4758K7348m29n0557p161l375k4624J239Q822o0512
12563F54549j5172j1477j3242l9523j6430l6832r329K060J9084j1436l3142m433
$$ y = [3407050, 3465533, 3529230, 3545008, 3500829, 3415085, 3312063, 3195590, 3144438, 3146346, 3162576, 3148865, 3025183, 2850693, 2619161, 2378896, 2141153, 1924573, 1727164, 1590386, 1497573, 1416777, 1361464, 1330192, 1282330, 1245626, 1210156, 1159111, 1124056, 1110406, 1087760, 1090172, 1053209, 1004108, 966996, 970090, 989599, 992459, 974566, 986109, 1018107, 1064064, 1091990, 1132093, 1225610, 1400502, 1620257, 1773535, 1776336, 1577891, 1336020, 1152596, 995365, 885167, 809583, 787378, 763034, 743173, 729378, 699638, 680285, 628732, 610928, 639767, 657680, 684106, 702498, 733284, 749040, 763798, 791146, 790717, 740160, 732999, 729624, 705000, 706239, 715061, 654549, 639377, 627900, 614658, 575135, 558705, 521873, 512544, 514604, 533688, 522252, 489110, 484677]
12551D84677P75j8256l2562k4919q138m3432m0806l9816j7664k4267m1502k4397
12539A69693r223n850J055k963R910L0873J8607L4899J9676K0086J6582J6398
12527C19743K7244K7569r244K5168L1740N3851K3310K4701J2320j1902l742O756
12515E27514J0856Q936L2833N9442Q1801Q7150M4821k5893o1577l8403J0902N6508
12503G94890R3481Q6134O2334L2752J4659j5609k3640L4399N9010P0115J32080
12492A340605K38092K57601K52831K67503K22620J22495j6623j52168k55588k94763
12482A982605l10707l02086k52403k07676j16653r0068r5976m4542m6675l8226
12472D77593k8540j3599j1105k9478J738O440O579k1754j4691k9574k0172P604
$$ y = [484677, 485452, 467196, 434634, 409715, 401577, 358145, 317339, 277523, 259859, 235592, 194090, 169693, 160470, 154620, 155675, 152712, 162622, 193495, 212102, 247001, 266677, 286763, 303345, 319743, 346987, 374556, 365312, 390480, 422220, 476071, 499381, 524082, 536402, 524500, 520758, 527514, 538370, 547306, 580139, 639581, 721382, 808532, 853353, 827460, 765883, 727480, 738382, 794890, 888371, 974505, 1036839, 1069591, 1084250, 1068641, 1045001, 1079400, 1138410, 1208525, 1340605, 1578697, 1836298, 2089129, 2356632, 2579252, 2701747, 2685124, 2532956, 2277368, 1982605, 1671898, 1369812, 1117409, 909733, 793080, 703012, 607036, 562494, 515819, 477593, 449053, 435454, 424349, 394871, 396609, 403049, 409628, 387874, 373183, 343609, 323437, 331041]
12460C31041j1146k1677j9358l7298k9895L406J2249J1405R885J0203L5021k2696
12448B71140J3585N0418q0m953J2553l7311j8583L855q309r901j6872L572j1306
12435B47808p234r664L4752J5717K0179J776o713j780j0544m2559l2185j9749
12423A89804L643p092m019L7239J2436K7451M5272O7291K2274L8963K1627K1282
12411D76171j5282q027q321l0165j7742K572L4549K8902M0342J00131Q3058M3873
12399G30061P640M3865R4935J25587J67247K55235K72483K12726M7341j66796
12389A790324k49940k40211j40281j06197o7739k5367m337K1878K9027O2276P2705
12378A142138P9593N3540L0392M1443N9848P0407J10024P4655K9100K0256j5n1505
$$ y = [331041, 319895, 298218, 278860, 241562, 211667, 215073, 227322, 238727, 248612, 258815, 293836, 271140, 284725, 335143, 335063, 330110, 342663, 305352, 286769, 290624, 282315, 272414, 255542, 259114, 247808, 240574, 230910, 265662, 281379, 301558, 303334, 296621, 294841, 284297, 241738, 209553, 189804, 193447, 186355, 182336, 219575, 232011, 259462, 304734, 372025, 394299, 433262, 454889, 476171, 460889, 452862, 444541, 414376, 396634, 399206, 433755, 462657, 502999, 603130, 686188, 730061, 737701, 781566, 876501, 1002088, 1169335, 1424570, 1697053, 1909779, 1957120, 1790324, 1540384, 1300173, 1159892, 1053695, 985956, 960589, 956252, 978130, 1007157, 1069433, 1142138, 1221731, 1275271, 1305663, 1347106, 1406954, 1477361, 1587385, 1662040, 1691140, 1711396, 1711381, 1659876]
12366A659876l9973J8018O5365Q9737J29893J70173K52977L41292M53639N20238
12356C661235M48701K37162q5175l67464n53080n61694m78048l24436k17101j20947
12346A639153p7864j3324L6730N4898P7188J7602l7398q3351j06887j19299p2953
12335A314495j5211K0867J5956L4337J1766m1546l9348o20q249J7893K5119l382
12323A332077K3572P7348J52206K42230K19635M9612j65279l07145l51679k79662
12313I92915j98722j66663r1156q4206m0240n3412l3373l4447n4593k0322j1563
12302B04218M027K9076L7103J3892p01m913Q002k960K66m451m4452J527J854J9798
12288B62286p62k4230j5856K9934K7933K4934J5691L0371J3123K3691N5267Q190
$$ y = [1659876, 1619903, 1637921, 1703286, 1793023, 1922916, 2093089, 2346066, 2687358, 3140997, 3661235, 4109936, 4347098, 4261923, 3894459, 3341379, 2779685, 2301637, 1977201, 1760100, 1639153, 1561289, 1547965, 1584695, 1639593, 1716781, 1734383, 1696985, 1613634, 1506747, 1387448, 1314495, 1299284, 1320151, 1336107, 1370444, 1382210, 1340664, 1301316, 1300696, 1292447, 1310340, 1335459, 1332077, 1355649, 1432997, 1585203, 1827433, 2047068, 2096680, 1931401, 1624256, 1272577, 992915, 794193, 627530, 536374, 452168, 411928, 358516, 325143, 290696, 236103, 215781, 204218, 208245, 237321, 274424, 288316, 287615, 282702, 290704, 287744, 288010, 283559, 239107, 240634, 242488, 262286, 261524, 237294, 221438, 251372, 279305, 304239, 319930, 350301, 363424, 387115, 442382, 450572]
12276D50572o247J6800M7358M3338J04862J44132J92642K30677K83731L28833
12266A836698L69750L08862J60197O5040m9859j70414k84506k92057k67895k59767
12256A416049k90842j90227r7598o5214j02529p9765q5302o7883o5058l7337n7840
12245B76454k1764j7661O221k9360K0366M1140L4860j0329J1567j3464j7071n325
12233B75634M0061O4587L1248K8021K2936K6445L6218O660k8007k3711k5245j7286
12221D37561k4850k6973r244k0821K7115p437l4356R2j4813j4528q989J6871J0841
12208C30469J0459j1415N491m99r848j0406K3333L1186j4492p977q119j7490j5771
12195C04921J5192K7940J6813n459K2980K4264J5787L812O5K6994L9044J3874
$$ y = [450572, 444325, 461125, 508483, 551821, 656683, 800815, 993457, 1224134, 1507865, 1836698, 2206448, 2515310, 2675507, 2740547, 2690688, 2520274, 2235768, 1943711, 1675816, 1416049, 1125207, 934980, 837382, 772168, 669639, 589874, 504572, 436689, 371631, 334294, 276454, 254690, 237029, 243250, 213890, 234256, 275396, 310256, 299927, 311494, 298030, 280959, 275634, 315695, 380282, 411530, 439551, 462487, 488932, 525150, 531810, 503803, 480092, 454847, 437561, 412711, 385738, 376494, 355673, 382788, 375351, 340995, 341087, 326274, 311746, 302757, 319628, 330469, 340928, 329513, 335004, 334505, 324657, 314251, 337584, 368770, 354278, 346301, 338182, 320692, 304921, 320113, 348053, 364866, 359407, 382387, 406651, 422438, 426250, 426315, 453309, 492353, 506227]
12183E06227J0119M5240j7704j0921J6475j5029P884J3882J0525q688L3571K2847
12171F14428j7477L7077O3680L3530N510n896J328K4544N7935M8142K3452K3499
12159I09752j17J8307M4472J3845J4951q148Q781J572K8555P6565Q4676O8459
12147A261670L7436L8573O1352N1986N6400P7623M6939N2658O5341N1246L3864
12136A835088M9923Q3242J03072J01572J14353J24287J41997J51518J74700J45311
12126C025063J15168Q3368R4863Q1192P1605K8054K1324N7307M5786O0586J18633
12115C802949J70367J90846K08838K22744K50724K79854L15746L78782M45426
12106F266276M66970N10455N79644O26656P13978Q15231Q90769R83025J105604
$$ y = [506227, 516346, 561586, 543882, 532961, 549436, 534407, 542291, 556173, 566698, 558010, 591581, 614428, 596951, 634028, 697708, 731238, 736748, 730852, 732180, 756724, 814659, 862801, 886253, 909752, 909635, 927942, 972414, 986259, 1001210, 993062, 1001843, 1003415, 1031970, 1108535, 1193211, 1261670, 1299106, 1337679, 1399031, 1451017, 1507417, 1585040, 1631979, 1684637, 1749978, 1801224, 1835088, 1885011, 1968253, 2071325, 2172897, 2287250, 2411537, 2553534, 2705052, 2879752, 3025063, 3140231, 3223599, 3318462, 3399654, 3471259, 3499313, 3520637, 3577944, 3623730, 3684316, 3802949, 3973316, 4164162, 4373000, 4595744, 4846468, 5126322, 5442068, 5820850, 6266276, 6733246, 7243701, 7823345, 8450001, 9163979, 9979210, 10869979, 11853004, 12958608]
12097A2958608J272232J505764J821795K201216K651993L162854L713869M199939
12089C3488270M575055M833544M968576N162174N510023O236496P704273J0246802
12081H2725213J4379872K0773208K9604395M0304743N1318954N9664069O1597397
12074C60367851N4880168L8978992J5934246j0656393l5825758n5270373o6051721
12067C02357012o6883765n8810675m5803513l2439244k1622775j4108683r268733
12060E3419624o241630m384751l398345l047198l057689l281284l477250l475229
12052B3056248l269134k830770k312939j840889j491433j200910r67859p94307
12044H348007o35905n37075m52978l82675l29460k83266k57029k29761k05114
$$ y = [12958608, 14230840, 15736604, 17558399, 19759615, 22411608, 25574462, 29288331, 33488270, 38063325, 42896869, 47865445, 53027619, 58537642, 64774138, 72478411, 82725213, 97105085, 117878293, 147482688, 187787431, 239106385, 298770454, 360367851, 415248019, 454227011, 470161257, 459504864, 423679106, 368408733, 302357012, 235473247, 176662572, 130859059, 98419815, 76797040, 62688357, 53419624, 47177994, 42793243, 39394898, 36347700, 33290011, 30008727, 26531477, 23056248, 19787114, 16956344, 14643405, 12802516, 11311083, 10110173, 9142314, 8348007, 7712102, 7175027, 6722049, 6339374, 6009914, 5726648, 5469619, 5239858, 5034744]
12035E034744j64799j67157j67751r2661l9794k320P3279J24986J13469M1930
12025D753926q9964k10486k74558k86426k78745k26712j89394j73838j84263k04817
12015B634723j79714j70009j67960j41211q5328p0435q8782n9188p1120m5907
12005A555069o7871m0666l9087n3257k8518m0226m3495n1757m4713k7448j2554
11994A105477j7244n7106m3692l5447l2344j1532o505M020l6896l9125k3153l8306
11982G68147o44M7058L2004J5247J3540n7476o1653l6547j5188j1753l530j9191
11970F70014j9413n079j8681L65k761Q885j5166m7597m8604k742J4140L4860J7397
11957E85618j7033Q390R680k457p712M471J5880J2030l235m101K5908M2503L3933
$$ y = [5034744, 4869945, 4702788, 4535037, 4442376, 4402582, 4400262, 4473541, 4598527, 4711996, 4753926, 4663962, 4453476, 4178918, 3892492, 3613747, 3387035, 3197641, 3023803, 2839540, 2634723, 2455009, 2285000, 2117040, 1975829, 1890501, 1820066, 1731284, 1672096, 1600976, 1555069, 1487198, 1446532, 1407445, 1354188, 1325670, 1285444, 1241949, 1190192, 1145479, 1118031, 1105477, 1088233, 1031127, 987435, 951988, 919644, 908112, 901607, 905627, 868731, 829606, 806453, 768147, 767503, 814561, 846565, 861812, 875352, 817876, 756223, 719676, 704488, 692735, 689205, 670014, 650601, 645522, 626841, 627206, 624445, 633330, 618164, 570567, 521963, 519221, 533361, 568221, 585618, 568585, 576975, 586655, 584198, 576486, 580957, 596837, 608867, 605632, 601531, 627439, 669942, 703875]
11944G03875j602p948m0314k2553l2888o4436l0874m304k3515l8829j7615j1869
11932D07128J6786K2600K9570J122l5727n2079n5289k6583k3768k6291l1739k9044
11920A96686l3257m3320l2074j465K3787K9475M9380L1298j631K0641Q605K6226
11908B74351K6507K3251K385K8384P852j4413j1498Q213j3643k376j7594l4152
11896B77267l7633l3782j3123k9882n3632o2753l1420K5835K7221L5583N27k0948
11884H3260r673J0338L2920j5292R774M3675L2388K8174L7285K8536K5875k079
11872C05181J357j8518q432j8142l052L0037l0806n6399L1788J3401L910j1834
11860B38491j436j7032J2908l4227J0128L0478p695J4577J5015M735j4644k2645
$$ y = [703875, 702273, 694325, 654011, 631458, 598570, 534134, 503260, 498956, 475441, 436612, 418997, 407128, 423914, 446514, 476084, 477206, 441479, 389400, 334111, 307528, 283760, 257469, 225730, 196686, 163429, 120109, 88035, 86570, 110357, 139832, 189212, 220510, 218879, 239520, 248125, 274351, 300858, 324109, 326494, 354878, 362730, 348317, 336819, 345032, 331389, 329013, 311419, 277267, 239634, 205852, 192729, 162847, 109215, 46462, 15042, 40877, 68098, 103681, 104208, 83260, 73587, 83925, 116845, 101553, 111327, 155002, 187390, 215564, 252849, 281385, 307260, 305181, 306538, 288020, 279588, 261446, 258394, 288431, 257625, 201226, 233014, 246415, 250325, 238491, 237055, 220023, 232931, 198704, 208832, 239310, 231615, 246192, 261207, 265942, 251298, 228653]
11848B28653m038p460p907L420K2917M401J5940J7216j199k7494J874l4691l6096
11835A75536k3457L0203k0931m0365L762L9329J8029J69J9965K9029N916O0K0259
11822B57504K184l295q529l2146l2879r825J1286q865l896J092k016j7252P011
11809A60374P408K1728Q886j9976l3442j4969j1261o61m4934j4803N919J3429
11797G7698L2399M1637J6377j9365k8325Q465j4023j4068O408k5554l1769o002
11785D3878J0192N708l363J7307R238j6417o414O069L512m366r681k2515K27m216
11771B9159L681K515L2748K8932P19n337J7211K4415O583l1429q523k4597j5101
11758F0976J5152k252j1344L6p078k0685J2863J1433l508p816k6424Q617L5691
$$ y = [228653, 224615, 217155, 209248, 212668, 235585, 239986, 255926, 273142, 271943, 244449, 246323, 211632, 175536, 152079, 182282, 161351, 120986, 124748, 164077, 182106, 182275, 202240, 231269, 237185, 237245, 257504, 259688, 256393, 247864, 215718, 182839, 173014, 184300, 175435, 171539, 172631, 170615, 153363, 160374, 167782, 189510, 198396, 178420, 144978, 130009, 118748, 118087, 73153, 58350, 64269, 77698, 110097, 151734, 168111, 148746, 120421, 128886, 114863, 100795, 107203, 81649, 49880, 43878, 54070, 59778, 56415, 73722, 82960, 66543, 60129, 66198, 69710, 65344, 55663, 33148, 33375, 29159, 32840, 35355, 68103, 97035, 97754, 92417, 109628, 134043, 140626, 109197, 100674, 76077, 60976, 76128, 73876, 62532, 62568, 55490, 34805, 47668, 59101, 55593, 47777, 21353, 29970, 65661]
11745F5661K7184R913Q883j8164j4092r577K771o742k8012m099J3137J0771K1920
11732G9554j7342L1079p211J730m961k4643Q717K1614J3822J6499J0218l8912
11720I0164M431J1693K256j2301j7292J1848j5001j7529J4116J3377l946K4667
11708A06483l203k5542k3745J1268J4119J6136o072j4865n93M726q553K1298j8003
11695G3454j7157M4202L0149k0352k4664l882O772K1476L645L072k335K8000J8902
11682A61282J93k773k5658l4093K1872K2152n546J5579J3097n646L3092J4478
11670B08029J8265J8163P010M0682J2667M5018M1648K8432L7276L2088Q2955R6059
11658F68292J51888K02892K80584L30490L29986K64589J93235Q7797n5069k05776
$$ y = [65661, 92845, 102758, 111641, 93477, 79385, 69808, 72579, 65837, 37825, 33726, 46863, 57634, 79554, 62212, 93291, 86080, 87810, 82849, 58206, 66923, 88537, 102359, 118858, 129076, 90164, 94595, 106288, 108544, 96243, 78951, 90799, 75798, 58269, 72385, 85762, 81816, 106483, 103280, 77738, 53993, 65261, 79380, 95516, 89444, 74579, 73986, 78712, 70159, 91457, 73454, 56297, 100499, 130648, 110296, 85632, 81750, 88522, 109998, 113643, 116715, 114380, 142380, 161282, 161475, 158702, 133044, 98951, 120823, 142975, 137429, 153008, 166105, 160459, 193551, 208029, 226294, 244457, 251467, 292149, 304816, 349834, 391482, 419914, 457190, 489278, 572233, 668292, 820180, 1023072, 1303656, 1634146, 1964132, 2228721, 2421956, 2509753, 2454684, 2248908]
11648B248908l07938l66912l32161k67141k33180j79341j20167o4504o238k3183
11638C48143n7320j8902k9514k6638j7528r38j775j1291q396q34l3382k5829p306
11625A08490r162P221M886J4487K5334j4970k5923l1170k4572j2172J4773N072
11613F2294p609l54M312q663K3527k38J1664l124Q79k0510j2670l1814R21K6954
11599D5569L1924K2666m46l660k4505j3949n527J6693j2192m530k535k4826n683
11586A8999N28J5505J0393l498M696p928J0712N646J2381K9154Q41l9658J600
11573E9371K0148J0376l4968M209l330J2542j6372k401o68L3138K916j1766R461
11560H2656j8901l6244j4896L818R089Q969p842P077N721k48J6027O425J7106
$$ y = [2248908, 1940970, 1574058, 1241897, 974756, 741576, 562235, 442068, 377564, 371326, 348143, 290823, 271921, 242407, 215769, 198241, 197303, 195528, 184237, 175841, 175007, 141625, 115796, 108490, 99328, 106549, 111435, 125922, 151256, 136286, 110363, 79193, 54621, 42449, 57222, 62294, 54685, 54331, 58643, 49980, 73507, 73269, 84933, 81809, 82688, 62178, 49508, 17694, 18615, 45569, 77493, 100159, 99713, 96053, 71548, 57599, 52072, 68765, 56573, 52043, 49508, 24682, 18999, 19527, 35032, 45425, 41927, 46623, 38695, 49407, 55053, 67434, 96588, 97429, 57771, 59371, 79519, 89895, 54927, 59136, 55806, 68348, 51976, 49575, 48907, 82045, 84961, 73195, 82656, 63755, 27511, 12615, 16433, 25522, 34491, 26649, 33726, 39447, 39199, 55226, 61651, 78757]
11547G8757P599k4803j4949q038R48J6187j2970q313L604K610o157L2756L3732
11534A00963J4012m429j9405m061k6521J1826p47J0096k1571l0466N106k689R777
11521D1891q632p15m757j7602n528R592M972J2754K0427j9617j9134R848J5487
11508C8986R611N352J2651k715j1409l822j4676j6991N12L6973J588m3853p169
11495E038K6608J2043j4324J1961L517J5156J6998l6473j7424q210l284J516L3137
11482D6259N0733p859l903j6404l5963k6852r645Q430J0398n644k112P600J0231
11469B5269r972p366j2335k3641J0593K4740N40J2804R638M796L6820L5318J2952
11456A20156q352j8311r345j726j7916k0989K2778o664r270J0515k5543J5850
$$ y = [78757, 86356, 61553, 46604, 38566, 39514, 55701, 42731, 34418, 38022, 40632, 34475, 67231, 100963, 114975, 110546, 91141, 87080, 60559, 72385, 71638, 81734, 60163, 29697, 34803, 32114, 41891, 33259, 32544, 27787, 10185, 4657, 14249, 19221, 31975, 52402, 32785, 13651, 23499, 38986, 48597, 53949, 66600, 63885, 52476, 48654, 33978, 16987, 17499, 54472, 56060, 12207, 5038, 31646, 43689, 29365, 41326, 44843, 59999, 76997, 40524, 23100, 14890, 11606, 13122, 46259, 96992, 89133, 85230, 68826, 32863, 6011, -3634, 4796, 15194, 9550, 7438, 15038, 25269, 15297, 7931, -4404, -28045, -17452, 7288, 7828, 20632, 30270, 35066, 71886, 107204, 120156, 111804, 93493, 84148, 82422, 64506, 43517, 66295, 59631, 50361, 60876, 35333, 51183]
11444E1183J4850j6600j8068o775k9970j4898K7304J8950J0827M258J4437j1276
11432D4222l7425J8948l228l652j4236K723K7553M0640J1185N148l0152k6788
11420C4938P120R026k3752j7045j6508p665L8673L2132l096N214M54k0529k2300
11407A6662k1405M790J1814K4211l895N622M107k7834L640M95j2859K8058O954
11394D0360j1651j7025p085J9087j399l4470M864K1967J6932o075j750J565j8613
11381F707j1510l726J0576J9662j154l331n042J2311J2936j0979j9402q83J5928
11368B2093K7559K7885L5094p063l8380j3286R683m1j1954K5179j9426k2731M767
11355C9379j742N845j0361q593M124o764M252L747j5870j953K7826J5755n105
$$ y = [51183, 66033, 49433, 31365, 24590, -5380, -20278, 7026, 25976, 36803, 41061, 55498, 44222, 6797, 25745, 22517, 18865, 4629, 7352, 34905, 75545, 86730, 91878, 61726, 34938, 42058, 51084, 27332, 10287, -6221, -13886, 24787, 56919, 53823, 59037, 59491, 38962, 16662, -4743, 47, 11861, 36072, 32177, 37799, 41906, 14072, 17712, 18207, 5348, 33406, 40360, 28709, 11684, 4599, 23686, 22287, -12183, -7319, 14648, 31580, 25505, 23755, 25320, 6707, -4803, -8529, 2047, 21709, 20555, 17224, 12182, 24493, 37429, 26450, 7048, 6165, 22093, 49652, 77537, 112631, 105568, 67188, 53902, 63585, 63544, 51590, 76769, 57343, 34612, 39379, 37637, 43482, 33121, 24528, 28652, 21888, 26140, 29887, 14017, 12064, 39890, 55645, 50540]
11342E0540j146k3276j0303Q994R105J5026j1441p537P565k1964R430J027K022
11329B8042p022j5334j0066Q995K1475K877l651J1665L6195q733n1822l875J3656
11316B2402M898K0456K6877k0878k7857l0461J8433R614L4496J3463J7082N814
11304I4339j8385l3659j6199J3818K0936J7668l151k2924j805J2163k723j1120
11292D8958J721n978Q058j0006P884o176q997J1111L036j2456o276k236j6824
11279A1819Q738Q669K9776K2328J7085J1077J963m131m690q584J6274o453k6281
11266G7590j8010J3058j185n227M476k5621l926P761k7692r172P604L5597O378
11253F1631p76j9842k8308j056K4535J9788k9515j4988J3065P095L1353K1230
$$ y = [50540, 49394, 26118, 15815, 24809, 33914, 48940, 37499, 29962, 37527, 15563, 24993, 26020, 28042, 21020, 5686, -4380, 4615, 26090, 28967, 25316, 36981, 73176, 64443, 12621, 8746, 22402, 27300, 47756, 74633, 53755, 25898, -4563, 13870, 23484, 57980, 71443, 88525, 94339, 75954, 42295, 26096, 39914, 60850, 78518, 75367, 52443, 50638, 62801, 60078, 48958, 50679, 44701, 52759, 42753, 50637, 44461, 35464, 46575, 49611, 37155, 30879, 28643, 11819, 20557, 29226, 59002, 81330, 98415, 109492, 111455, 107324, 102634, 94050, 110324, 103871, 77590, 59580, 72638, 71453, 66226, 70702, 45081, 41155, 48916, 21224, 12052, 19656, 55253, 61631, 60855, 41013, 12705, 11649, 36184, 55972, 26457, 11469, 24534, 31629, 62982, 84212]
11241H4212k967j6748k86l208r371j7217K5403K4834j4043k7230l2053J2793J1126
11228C5245J1776L112j1950l2577L857K0481M595j1745k1664k6352P934M8160
11216C0872L233l2177O349J6680j4506J6199J1963J2629J0146l1915n960K0986
11204D4499J7830R835l063n807J3363J4086j5609R42o429p874Q166J1466m126
11191G7279q841j8986k6733R338K77J1835m348J6021j0044R792m134p740r59K6042
11177F8799j990j2206l4863j2711J1500K6718J1752j379j6033j407K2788K4327
11165H5295M806l4267L24m90n938p477J019j4903J1537O329O054Q568J3192J5062
11151H9111L45p368n585r490k0949N889J9727M068K016j0001j708P959j4941N14
$$ y = [84212, 81245, 64497, 64211, 61003, 51632, 34415, 59818, 84652, 70609, 43379, 11326, 24119, 35245, 47021, 50133, 38183, 5606, 9463, 29944, 34539, 22794, 1130, -25222, -17288, 30872, 34105, 1928, 8277, 24957, 10451, 26650, 38613, 51242, 61388, 29473, 23513, 44499, 62329, 72164, 69101, 63294, 76657, 90743, 75134, 76076, 69647, 61773, 69939, 81405, 77279, 68438, 49452, 22719, 32057, 32334, 44169, 39821, 55842, 45798, 55590, 51456, 43716, 42757, 68799, 66809, 54603, 19740, 7029, 18529, 45247, 56999, 55620, 39587, 38180, 60968, 85295, 90101, 55834, 56158, 55668, 49730, 42253, 43272, 28369, 39906, 46235, 52289, 60857, 74049, 89111, 89456, 82088, 76503, 67013, 46064, 51953, 71680, 75748, 77764, 67763, 66055, 74014, 59073, 59587]
11137E9587R764N395M261j044n445R04p108P830J3779j3337l6108p042K8877R695
11123G0008k5499k4302J0935J5133n643k346k132K3656K1773j1596j537j3549
11111E4901j3268J081K2769m457k7255n907K1355M7399n156j3385J9454J4382
11099A11913J679q198k607j1461o770n564j3848j3399J2822J1250J2276j1910
11087G6183l320P044J2153N744k981p653J644L024J6868m2000j9875Q912K2007
11074G7750L6102N865j2481j6219l013J4501R884j8822r270N447m691O185p421
11061H3817L0041p049k800k1459O758o018j9947J1596j1049j26M118j1267J7550
11048G4165K8894j9074J2243L0351K4603j0075j4836k417m441n326l9142O987
$$ y = [59587, 69351, 74746, 79007, 77963, 72518, 73422, 66314, 74144, 87923, 74586, 38478, 31436, 60313, 70008, 44509, 20207, 31142, 46275, 40632, 38286, 36154, 59810, 81583, 69987, 68450, 54901, 41633, 42714, 65483, 61026, 33771, 27864, 49219, 96618, 91462, 78077, 97531, 111913, 113592, 105394, 102787, 91326, 84556, 78992, 65144, 51745, 64567, 75817, 88093, 76183, 72863, 79907, 92060, 97804, 94823, 87170, 88814, 91838, 108706, 66706, 46831, 55743, 77750, 113852, 119717, 107236, 91017, 88004, 102505, 112389, 93567, 84297, 89744, 85053, 91238, 83817, 113858, 106809, 104009, 82550, 89308, 83290, 63343, 74939, 63890, 63764, 67882, 56615, 74165, 103059, 83985, 96228, 126579, 151182, 141107, 126271, 123854, 119413, 114087, 74945, 81932]
11036H1932K3760M2194m557O307R026r755k5032j9659Q470J7389J2578j3205k2846
11023A06602k4756Q364j0114N625L1586K554o005k700j4589l841K17J941J4180
11010A09064r496R882K4802J6361K1113j8115L420k2675Q943K783O643k4613P562
10997A35674J5770j9855n360P910j421j8666K2616K0881j8939k6506l192K3165
10985A32077J9409J1411j3479k1069k373r673j1207K8670j8555n718K5387j395
10973A33485j3459j045J4656J7162k1820q522j3454J53J7026K0777L9095k4170
10961A59884k7300m311L308k0753p282N821j9659J9381P395L721Q32k0737p99
10948I9501K2741K8815l572p955k797j7125K2610R480J6642J5024k126J2775J1424
$$ y = [81932, 105692, 147886, 143329, 149636, 158662, 148907, 123875, 104216, 112686, 130075, 142653, 129448, 106602, 81846, 90210, 80096, 85721, 117307, 119861, 113856, 111156, 96567, 92726, 92943, 94884, 109064, 99568, 109450, 134252, 150613, 171726, 153611, 157031, 134356, 143299, 146082, 152725, 128112, 135674, 151444, 131589, 126229, 134139, 132718, 114052, 136668, 157549, 138610, 112104, 108912, 132077, 151486, 162897, 149418, 128349, 125976, 116303, 105096, 133766, 115211, 109493, 134880, 133485, 120026, 118981, 133637, 150799, 128979, 120457, 107003, 107156, 124182, 144959, 184054, 159884, 132584, 128273, 131581, 110828, 103546, 109367, 89708, 109089, 116484, 120205, 121037, 100300, 99501, 122242, 151057, 147485, 139530, 136733, 119608, 142218, 151698, 168340, 183364, 181238, 194013, 205437]
10935B05437j1098l4134j7087J0877J1944m494q064k3638J5549K10p573l7353
10923A00576k5945L4459L8707L2641j879n946K39J0820R548m197p575r773J108
10910A72783j847K5599J4433L7292Q725r552j1279l285j2981o305o684j5309P60
10897A92350k9573k0542P244n352j1155J7053N376J7881k4974l1674J2020L7931
10885A66585Q203N3695L780k533m162r608O832K9192p035M654M553j0405Q011
10872B51762J1657J1913k6255o917J7159k769j8895l4547k4051l9072k1265n461
10860A13259K1512L1444r79Q365M9160O885k4923K2634J6671j1520K798K2647
10848B57953l017q832m070J9485j770j5613k3507j5234N971J459q666j7696J3278
$$ y = [205437, 194339, 160205, 143118, 153995, 165939, 161445, 153381, 129743, 145292, 145502, 137929, 100576, 74631, 109090, 147797, 180438, 178559, 172613, 172852, 183672, 193220, 189023, 181448, 171675, 172783, 170936, 196535, 210968, 248260, 256985, 247433, 236154, 232869, 219888, 213583, 206899, 191590, 192350, 162777, 142235, 149479, 144127, 132972, 150025, 155401, 173282, 148308, 116634, 128654, 166585, 174788, 228483, 232263, 229730, 225568, 215960, 222792, 251984, 244949, 249603, 254156, 243751, 251762, 263419, 275332, 249077, 242160, 259319, 256550, 237655, 203108, 179057, 139985, 118720, 113259, 134771, 166215, 165236, 173601, 222761, 229646, 204723, 227357, 244028, 232508, 235306, 257953, 254936, 246104, 242034, 261519, 259749, 244136, 220629, 205395, 211366, 212825, 204159, 186463, 199741]
10835A99741J5100M1226K1521o42P425K9563M5057n50l671k1402n348j0791R00
10822C18129l220L559K5807N126j4246j6915m37K2853K9387J7991k8862q018M3600
10809C94754J1395K6156J7815J1524P521P821Q305K665K9754l821K1354O0709
10797E95952L4084K3292M189K9251J8414J5575L6019K0885Q906J4766M865J8155
10785H24353P653Q266l473K00j150Q799p09m14q69p074P687J6858q905P642J3642
10770H72506K2796K9348N040J7010J6618L5720K0247J1113L2796J5066k6341r319
10758A042600J8790r640j8757l1395n994P769k604K5941P764k3032k8479j7557
10746I65406j7313q474q227l6460q244l078j4549m7646k774N227J3072K6775K1467
$$ y = [199741, 214841, 256067, 277588, 276946, 284371, 313934, 358991, 358441, 354770, 333368, 328020, 317229, 318129, 314909, 318468, 344275, 349401, 335155, 318240, 317803, 340656, 370043, 388034, 359172, 351154, 394754, 406149, 432305, 450120, 461644, 469165, 476986, 485291, 487956, 517710, 513889, 535243, 595952, 630036, 653328, 657517, 686768, 705182, 720757, 756776, 777661, 786567, 801333, 806198, 824353, 832006, 840272, 836799, 836999, 835849, 844648, 843939, 843525, 842656, 835582, 843269, 860127, 851222, 858864, 872506, 895302, 924650, 929690, 946700, 963318, 999038, 1019285, 1030398, 1063194, 1078260, 1051919, 1042600, 1061390, 1051750, 1032993, 1001598, 995604, 1003373, 1000769, 1026710, 1034474, 1011442, 982963, 965406, 948093, 939619, 931392, 894932, 886688, 883610, 869061, 821415, 818641, 823868, 836940, 863715, 885182]
10733H85182J1754r415N142J5363M182L370J2412R044O314L051j2061k2850j1135
10720I00353o975k3506j6476n3220j3350O634m799j2824j9906l4842k0013j6333
10708F84743R661j9041l2374p109O123j1040l1152k1690O89J6380l830j3503j210
10695E76647L507k858m703l202k0579m125j1081j6060k9929N136k482K568O696
10682D99535l301j9483N482j1782K0647j0716n248L1200Q255J357j2286R799R74
10669E14433k5392p157K448K7466n037j7482J4872Q679Q029L228j5921J4890M565
10656E27621j0173Q607Q682L895R069q878J4912J1390n993J0824J1201K6246k2617
10643E84786k2471j3171r752K1139K2999J8623J3630J3942J0110p910K1505O708
$$ y = [885182, 896936, 887521, 892663, 908026, 912208, 915578, 927990, 937034, 943348, 946399, 934338, 911488, 900353, 893378, 869872, 853396, 800176, 786826, 793460, 788661, 775837, 755931, 721089, 701076, 684743, 694404, 675363, 642989, 635880, 642003, 630963, 599811, 578121, 578810, 595190, 591360, 577857, 576647, 580154, 577296, 572593, 569391, 548812, 544687, 533606, 517546, 487617, 492753, 490271, 492839, 499535, 496234, 476751, 482233, 470451, 491098, 480382, 475134, 506334, 514589, 515946, 503660, 513459, 514433, 489041, 481884, 484332, 511798, 506761, 489279, 504151, 512830, 520859, 524087, 508166, 523056, 527621, 517448, 526055, 534737, 538632, 547701, 538823, 553735, 565125, 559132, 569956, 581157, 607403, 584786, 562315, 549144, 539392, 560531, 583530, 602153, 615783, 629725, 639835, 631925, 653430, 660138]
10631F60138n257K8237J0669J3682K6401N280k6904M574J7488k365k9432l3396
10619F69115J1577j882N41J533J9617j746k1733J7653M7964J6121o28r18j1068
10606G46146k6229p316L9773K4670J0923R414L5731N362k8770j1254K2923M704
10594H26077K6373L8335J5344j9035k0696k1719K765K4374O576L799K1994J0406
10582I14593k6744m552K5704L9994l456j5904K250p569R567K6589K1497R81J721
10569I84671J8643q718J7132O417j4825K7116K7900Q723J6498K7695J4564M897
10557A130713j139J0351K6579M4519N402l803K8441j0448j0621l205K4883J3882
10545A255554K9140J3564o078L1816J8618J5684K4268K1625N542M570K6613N6234
$$ y = [660138, 654881, 683118, 693787, 707469, 733870, 739150, 712246, 716820, 734308, 731943, 702511, 669115, 680692, 678810, 679351, 680884, 700501, 698755, 677022, 694675, 742639, 758760, 758132, 757214, 746146, 719917, 712601, 752374, 777044, 787967, 797381, 833112, 838474, 809704, 798450, 821373, 826077, 852450, 890785, 906129, 887094, 866398, 844679, 847444, 871818, 878394, 882193, 904187, 914593, 887849, 883297, 909001, 948995, 945539, 929635, 931885, 924316, 933883, 960472, 981969, 982950, 984671, 1003314, 994596, 1011728, 1018145, 1003320, 1030436, 1058336, 1067059, 1083557, 1111252, 1125816, 1130713, 1129574, 1139925, 1166504, 1211023, 1216425, 1212622, 1241063, 1230615, 1219994, 1216789, 1241672, 1255554, 1284694, 1298258, 1292180, 1323996, 1342614, 1358298, 1382566, 1404191, 1409733, 1414303, 1440916, 1497150]
10533A497150J5220j3235J1231M0607L1077J612p02K5522M4209K5757Q835Q676
10521A695959K5846L9188K6857K8413J4013O875K8333J3787M7782M7331K8064
10510B002448J6426L1215L7539L4000N0365M3872O6005P3658K3154J7175M7785
10499B443642M7211M0254M2003M0147K3900M5019M9742O1947Q3693J32190J64918
10488C174666K57657K79213J92796k0620k07471k32190j60168r7735l5608J2233
10478C162773K6724N9873M2777L7998M2811K3760N1298L0511M3769O8831N6552
10467C647677N7730Q0545Q9963P9944P9114O6852O6169P6852P7140Q9823P2665
10456D484474N7810Q2060R6790J25816J40406R1657O2068J11865J28621J22319
$$ y = [1497150, 1512370, 1499135, 1510366, 1550973, 1582050, 1583662, 1582960, 1608482, 1652691, 1678448, 1687283, 1695959, 1721805, 1760993, 1787850, 1816263, 1830276, 1837151, 1865484, 1879271, 1927053, 1974384, 2002448, 2018874, 2050089, 2087628, 2121628, 2171993, 2215865, 2281870, 2355528, 2378682, 2395857, 2443642, 2490853, 2531107, 2573110, 2613257, 2637157, 2682176, 2731918, 2793865, 2877558, 3009748, 3174666, 3432323, 3711536, 3904332, 3883712, 3676241, 3444051, 3283883, 3186148, 3150540, 3162773, 3189497, 3249370, 3292147, 3330145, 3372956, 3396716, 3448014, 3478525, 3522294, 3591125, 3647677, 3705407, 3785952, 3875915, 3955859, 4034973, 4101825, 4167994, 4244846, 4321986, 4411809, 4484474, 4542284, 4624344, 4721134, 4846950, 4987356, 5079013, 5141081, 5252946, 5381567, 5503886]
10446E503886J35740J23071J30546J47486J56603J47508J51943J52866K04520
10437F854169K09632J85711K13374J95060K00810J77463J98087K41568K77269
10428H753143K85055K84526K82014K95517L08213L59893L53601L69268M33135
10419A1724365M44792M43560M77542N14606N44841N88493O01817O38877O86467
10410A6665360P24093P87486Q37942R04890R75254J063736J120417J175409J283016
10401B5537603J396720J488132J578394J708559J871660K046957K147433K294887
10393D0070345K478506K661520K854531L073710L262978L476574L635900L821373
10385F5335437L976956M090916M167903M169730M077159L929890L668638L324820
$$ y = [5503886, 5639626, 5762697, 5893243, 6040729, 6197332, 6344840, 6496783, 6649649, 6854169, 7063801, 7249512, 7462886, 7657946, 7858756, 8036219, 8234306, 8475874, 8753143, 9038198, 9322724, 9604738, 9900255, 10208468, 10568361, 10921962, 11291230, 11724365, 12169157, 12612717, 13090259, 13604865, 14149706, 14738199, 15340016, 15978893, 16665360, 17389453, 18176939, 19014881, 19919771, 20895025, 21958761, 23079178, 24254587, 25537603, 26934323, 28422455, 30000849, 31709408, 33581068, 35628025, 37775458, 40070345, 42548851, 45210371, 48064902, 51138612, 54401590, 57878164, 61514064, 65335437, 69312393, 73403309, 77571212, 81740942, 85818101, 89747991, 93416629, 96741449]
10377I6741449K900860K405525J887385J339272Q89850M83370J30097q8233k06472
10368A06483103k18589j45732k2897J74287M04376O84975R84444J289386J654711
10359A11288064J979654K245582K545731K824505L001225L110730L196011L216470
10351A33407972L147422K951566K715468K392293J991257J512476R93985N26215
10343A49638654l6209n22208r99714j454709j862752k165480k456528k696281
10335A37444773k868691l023570l042154l011659k962505k822573k655380k425223
10327A14633018k190139j909585j567490j235186r16981n85297k97860N9336L78990
10318A06368806O44147Q28367R79098J026092J019659Q84505O50077L28930j19454
$$ y = [96741449, 99642309, 102047834, 103935219, 105274491, 106164341, 106647711, 106777808, 106689575, 106483103, 106264514, 106118782, 106095885, 106270172, 106674548, 107359523, 108343967, 109633353, 111288064, 113267718, 115513300, 118059031, 120883536, 123884761, 126995491, 130191502, 133407972, 136555394, 139506960, 142222428, 144614721, 146605978, 148118454, 149112439, 149638654, 149602445, 149080237, 148080523, 146625814, 144763062, 142597582, 140141054, 137444773, 134576082, 131552512, 128510358, 125498699, 122536194, 119713621, 117058241, 114633018, 112442879, 110533294, 108965804, 107730618, 106813637, 106228340, 105930480, 105989816, 106368806, 107012953, 107841320, 108820418, 109846510, 110866169, 111750674, 112400751, 112729681, 112610227]
10309A12610227o16372j192279j776771k375195k912469l422967l864212m184775
10301I2265187m421888m627610m735055m725202m707554m514221m281795m036935
10293E6214927l753588l452042l154797k889683k591765k385764k231266k029925
10285C3726097j857627j707048j585667j510736j415660j254935j171228j080364
10277B2142832r99492r44821q89950q15367p65952p34767o59066o06014n97622
10268A5129781n73134n19328n20531m73249m44114m42792m25190l81708l60634
10259A0989101l52937l41098l18641k97495k69370k59353k64079k41231k36544
10250H408353k17192k05398k38155k01838j90649j80286j81472j74573j63182
$$ y = [112610227, 111993855, 110801576, 109024805, 106649610, 103737141, 100314174, 96449962, 92265187, 87843299, 83215689, 78480634, 73755432, 69047878, 64533657, 60251862, 56214927, 52461339, 49009297, 45854500, 42964817, 40373052, 37987288, 35756022, 33726097, 31868470, 30161422, 28575755, 27065019, 25649359, 24394424, 23223196, 22142832, 21143340, 20198519, 19308569, 18493202, 17727250, 16992483, 16333417, 15727403, 15129781, 14556647, 14037319, 13516788, 13043539, 12599425, 12156633, 11731443, 11349735, 10989101, 10636164, 10295066, 9976425, 9678930, 9409560, 9150207, 8886128, 8644897, 8408353, 8191161, 7985763, 7747608, 7545770, 7355121, 7174835, 6993363, 6818790, 6655608]
10241F655608j54384j64634j55479j22748j07051j24746j49638j48222j10048
10232E418658r5055j18116j05468j07047q8669q1614r7492j06249r0415o0985
10222D467548o5092p1531q3650p2911r3771n9407l4533l9344o0483m9561l1782
10211C805483l2978p0135p4508q4632n5606m8981n4586m4981n4816l2304k7240
10200C224716n4066j4202l1190m1962m5297k3232k2318l8895m0957n2756k5420
10189B834421j5302l9982k6127k9761q229k2095p4996j6375j8293l3025k3050
10178B527186l5099l8451l0350n0700j8483j3971o0796n7336m2856o0612l8657
10167B079875j5566k3407k8434k8156j8101k4202j7785k1691k9309k2258j671
$$ y = [6655608, 6501224, 6336590, 6181111, 6058363, 5951312, 5826566, 5676928, 5528706, 5418658, 5323603, 5205487, 5100019, 4992972, 4904303, 4822689, 4725197, 4618948, 4528533, 4467548, 4402456, 4330925, 4247275, 4174364, 4080593, 4021186, 3986653, 3947309, 3886826, 3837265, 3805483, 3772505, 3702370, 3627862, 3543230, 3487624, 3438643, 3384057, 3339076, 3284260, 3251956, 3224716, 3170650, 3156448, 3125258, 3083296, 3037999, 3014767, 2992449, 2953554, 2912597, 2859841, 2834421, 2819119, 2779137, 2753010, 2723249, 2715020, 2692925, 2617929, 2601554, 2583261, 2550236, 2527186, 2492087, 2453636, 2423286, 2372586, 2354103, 2340132, 2279336, 2222000, 2179144, 2118532, 2079875, 2064309, 2040902, 2012468, 1984312, 1966211, 1942009, 1924224, 1902533, 1873224, 1850966, 1849295]
10156A849295J1629l1872n2539l3274k2942j9794j2940O336j6210m7029j6058
10145A614602q579j2697J7630o789l9570m6403l9353K667k149K5707n606k4170
10133A475290m8192r991r751r190J2436J0465k2475n6206q962m079l684n151k9972
10120A290538j6099K4511J740J5881p977n2101j4050K264N781k3629j1339j0806
10108A204714j1656J5095k8805m319P985j3427k0133k907j5899o60j6172k8836
10096A084980N338r813k3019o527J8815J8282k6238l4386Q473K969L212n534k7474
10083A009078j7489O178j4497k1557K1423K1699K3465k1842j3617l1718k7927
10072I33196p484j6404j8987J8152l0420k9504P747l073Q104j5462K235J4220
$$ y = [1849295, 1860924, 1829052, 1776513, 1743239, 1720297, 1700503, 1687563, 1693899, 1677689, 1630660, 1614602, 1606023, 1593326, 1610956, 1604167, 1564597, 1518194, 1478841, 1481508, 1479359, 1505066, 1499460, 1475290, 1427098, 1417107, 1407356, 1398166, 1410602, 1421067, 1398592, 1342386, 1333424, 1329345, 1325661, 1320510, 1290538, 1274439, 1298950, 1300690, 1316571, 1308594, 1256493, 1242443, 1244707, 1250488, 1226859, 1215520, 1204714, 1193058, 1208153, 1179348, 1175029, 1183014, 1169587, 1149454, 1146547, 1130648, 1129988, 1113816, 1084980, 1090318, 1080505, 1057486, 1050959, 1069774, 1088056, 1061818, 1027432, 1035905, 1038874, 1042086, 1036552, 1009078, 991589, 997767, 983270, 961713, 983136, 1004835, 1028300, 1006458, 992841, 961123, 933196, 925712, 909308, 890321, 908473, 878053, 848549, 856296, 853223, 861327, 845865, 848100, 862320]
10060H62320j1713q315o139l18K1924O513j2227r608l7907j8254M928J3576j841
10047H02939j6139j3181P071j8975J017o806j9752Q720J1050L613K290K2278P696
10034G91821K9890L6714j069m5567n9673l9498m1331J4485j455q161o173k9374
10022F40609m505n260j3257J3894J6771j2495l7453l77J8615J5381L7438o357
10010F63004l3829j3760M411L305J0351Q065p261j9063l0596O788Q899M6727o833
9997F40208k0974J3684q630J6371k082J6597O801m548o871L4248N855k9535P581
9984F68705K2289O329k49l6401j6037J4698P007J1343J073M022J1021L1721M1229
9971G66750R764j1573o686K6610K9816K0429M4137J1753L862Q040N658L7890L1086
$$ y = [862320, 850607, 842292, 836153, 835835, 857759, 864272, 852045, 842437, 804530, 786276, 791204, 804780, 802939, 786800, 773619, 780690, 761715, 762732, 755926, 736174, 744894, 755944, 759557, 761847, 784125, 791821, 821711, 858425, 857356, 811789, 752116, 712618, 671287, 685772, 684317, 676156, 669983, 640609, 636104, 630844, 617587, 631481, 648252, 635757, 598304, 597927, 616542, 631923, 669361, 663004, 629175, 615415, 619826, 623131, 633482, 641547, 634286, 615223, 584627, 591415, 600314, 647041, 640208, 619234, 632918, 624288, 640659, 638577, 655174, 661975, 657427, 650556, 684804, 690659, 661124, 668705, 690994, 697323, 697074, 660673, 644636, 659334, 666341, 677684, 678757, 682779, 693800, 725521, 766750, 776514, 764941, 758255, 784865, 814681, 835110, 879247, 891000, 894862, 902902, 908560, 946450, 977536]
9958I77536j307l545j4983L0503L7162L1023K3108p286j4510j2067l776r628j6392
9945A015838l40m583L2919L3536k3094P964R977L8817J1755J9321L1412L2352
9933A205874N952k6396o389M215L3927L3268K8032J7022L0013J6950Q456K8382
9921A379306L7838J4209j896J4407K7113M355P0155J02352J18036J76050J70741
9910B112666J25755O7850p9197j16260l6934R7244K27263L30970K76484R1230
9900C097071k12760l76447l10692j41912n4142K1119Q2204M330j35048j86966
9890A786757j89982j61922j29127q3448n1490l0032p3683n6374m4099j5458J7172
9879I68314m715l9412n5048m0682m6970l2013l0082k3779L334K256p514M794l3810
$$ y = [977536, 976229, 972684, 957701, 988204, 1025366, 1056389, 1079497, 1072211, 1057701, 1045634, 1041858, 1032230, 1015838, 1015498, 1010915, 1043834, 1077370, 1054276, 1062240, 1072217, 1111034, 1122789, 1142110, 1173522, 1205874, 1211826, 1185430, 1179041, 1183256, 1217183, 1250451, 1278483, 1295505, 1325518, 1342468, 1350924, 1379306, 1417144, 1431353, 1429457, 1443864, 1470977, 1475332, 1545487, 1647839, 1765875, 1941925, 2112666, 2238421, 2306271, 2227074, 2110814, 2073880, 2171124, 2398387, 2729357, 3005841, 3097071, 2884311, 2507864, 2197172, 2055260, 2001118, 2022237, 2104441, 2108771, 1973723, 1786757, 1596775, 1434853, 1305726, 1222278, 1170788, 1140756, 1067073, 1010699, 966600, 951142, 968314, 963599, 924187, 869139, 828457, 781487, 749474, 719392, 695613, 698947, 701203, 693689, 698483, 664673]
9866F64673k7648K6331L0341L6912R4205J06113L7332l8903m0451j6044O447q54
9854H78454J1380K7897R0923J25184J26772N0789r6545j29161j48624p6117J167
9843H62119R3790J74236J50096K4789j25256j91100j43501r0302r6311n1849n0712
9832E55999l2918l182J2130J7763M711L7419N4498M0963J0284l7885n6065n2916
9820E50801n7280l3307k7648Q716L6817M133j4960l1246p230J1854j171k6861
9808D12618j5111n566m132K7394J4268j486J3242n490M573q040J1934L8755M7283
9795E30242J1019l3411l27q533J1578N1351M5067K8749L5869M1598Q9618J40280
9783I43100J98746K73812L73131M30190L44288J02131j45744l70484m51827l81593
$$ y = [664673, 637025, 663356, 693697, 730609, 824814, 930927, 968259, 929356, 888905, 872861, 879308, 878454, 889834, 917731, 1008654, 1133838, 1260610, 1311399, 1214854, 1085693, 937069, 860952, 862119, 955909, 1130145, 1280241, 1305030, 1179774, 988674, 845173, 754871, 658560, 606711, 555999, 523081, 519899, 532029, 549792, 554503, 591922, 646420, 687383, 697667, 659782, 603717, 550801, 493521, 460214, 432566, 441282, 478099, 482232, 467272, 436026, 428796, 440650, 439479, 412618, 397507, 391941, 387809, 415203, 429471, 427985, 441227, 435737, 440310, 432270, 444204, 482959, 530242, 541261, 507850, 507523, 498990, 510568, 561919, 606986, 635735, 671604, 713202, 802820, 943100, 1141846, 1415658, 1788789, 2218979, 2563267, 2665398, 2519654, 2149170, 1697343, 1315750]
9773A315750l13485k03600j15822o5688k1216m6877n5284n0662k0062j2898K1438
9762D31594k009j7118o053j0218k861k1479k4426j1375J5055J6881p84k5769J1496
9749C52934q018L408j1113k1585L938K784m354Q823K8639k869j5546R364J7103
9736C63508j2153n356J1602Q036k5246L304J3521N525O20l224r740j0039k756
9723C37602K4798L2682N32j7829J8499J1827l2212j6803N084N887l7908J2626
9711C44785M2343J4784j8881k5890M273J284J2067K0701L3283l5033j4170j0248
9699C69298j7683j2503j4129n147M0468K2314l756j3198k7147n273j051K7795
9687C59988L3357p905n864L412J8563R382M5297K9410q015k453K8307M8657L9933
$$ y = [1315750, 1002265, 798665, 682843, 617155, 595939, 549062, 493778, 443116, 423054, 410156, 431594, 429585, 412467, 406414, 396196, 393335, 371856, 347430, 336055, 351110, 367991, 367207, 341438, 352934, 344916, 348324, 337211, 315626, 319564, 322348, 317994, 326817, 355456, 352587, 337041, 346405, 363508, 351355, 345999, 357601, 365637, 340391, 343695, 357216, 362741, 363361, 360137, 350397, 340358, 337602, 362400, 395082, 395614, 377785, 396284, 408111, 375899, 359096, 364180, 370067, 332159, 344785, 387128, 401912, 383031, 357141, 361414, 362698, 374765, 395466, 428749, 393716, 379546, 369298, 351615, 339112, 324983, 319836, 360304, 382618, 378862, 365664, 338517, 333244, 332193, 359988, 393345, 385440, 379576, 382988, 401551, 410933, 456230, 485640, 477625, 475172, 503479, 552136, 592069]
9674E92069K2453k253J6546R6479J45924J50757K23820K96051K90497K51116K38899
9663B322358K31174K56052J69445r5155k95691l09539k37907k43468l14740l33921
9653A148608k72907j53281q8688p6544p9284j2697r83K3396l142m4062m6646k3374
9641C70396K431K976J7042J4543j185j128n128M391l179k0236j5423L2843J9877
9628D18220P305r565l3659l1383P185L669p390J341L2658j3138Q28K8560j2545
9615C92086j986o05P453Q315Q403q856N224j2522k423J036q687M382M943J4216
9601D10979j6538K565j2697j5542J3611R776K4072r71l2512k7592J3845K5250
9589C94246P177j1979k516Q574J8605K4386j5640j9731n895R012L2713N439K603
$$ y = [592069, 614522, 612269, 628815, 725294, 871218, 1021975, 1245795, 1541846, 1832343, 2083459, 2322358, 2553532, 2809584, 2979029, 2883874, 2588183, 2278644, 2040737, 1797269, 1482529, 1148608, 875701, 722420, 633732, 557188, 477904, 465207, 464224, 487620, 484478, 440416, 393770, 370396, 372827, 375803, 392845, 407388, 406203, 405075, 399947, 404338, 401159, 380923, 365500, 398343, 418220, 425525, 415960, 382301, 350918, 358103, 361772, 354382, 355723, 388381, 375243, 376071, 404631, 392086, 390100, 389495, 396948, 405263, 413666, 404810, 410034, 397512, 395089, 396125, 387438, 391820, 396763, 410979, 394441, 397006, 384309, 368767, 382378, 392154, 416226, 415255, 382743, 355151, 368996, 394246, 401423, 389444, 386928, 395502, 414107, 438493, 422853, 403122, 397227, 406239, 438952, 444391, 446994]
9576D46994J8212j5279l3879l685n820j9746K4881K0595M43J5071j9113J7260
9564D45934J3322J1345j6313J6617K2211l966p754j5846J5141J9255M3950K1026
9552E64922K3878L5063L5616K5738K8830K3419K2527j5372j3478j6795l6795n8238
9540F19315j2218m4462n6197M975K0252J6040J3338m381Q428J4845m593P356K3014
9527F05712K8250K3174K9406L9734J6094J8651J4606J7208O0507L0828N6249N7042
9515I97461L6096J2087l477K9850K2084j3734q138L4534J1265j836J9424k5987
9503A109629n0308l2419k1623k3597j9329k354k900J0646j4768N634O29J3503
9491I72743m157k5599L463O215K8159L3689M0325K5551K6481N3933M8005N0440
$$ y = [446994, 465206, 449927, 416048, 412363, 406543, 386797, 411678, 432273, 432716, 447787, 428674, 445934, 459256, 470601, 454288, 470905, 493116, 489150, 481396, 465550, 480691, 499946, 543896, 564922, 588800, 623863, 659479, 685217, 714047, 737466, 759993, 744621, 731143, 714348, 677553, 619315, 607097, 562635, 506438, 511413, 531665, 547705, 561043, 556662, 565090, 579935, 575342, 582698, 605712, 633962, 657136, 686542, 726276, 742370, 761021, 775627, 792835, 853342, 884170, 940419, 997461, 1033557, 1045644, 1042167, 1072017, 1094101, 1080367, 1072229, 1106763, 1118028, 1116192, 1135616, 1109629, 1059321, 1026902, 1005279, 981682, 962353, 959999, 957099, 967745, 952977, 958611, 959240, 972743, 968586, 942987, 946450, 952665, 980824, 1014513, 1054838, 1080389, 1106870, 1160803, 1208808, 1259248]
9479A259248N9501L6318L7841M3183K6279J1589k3062l9068m9408l0152m574j3835
9467A313860l8453m4196k0323J5266M0335N4063Q988Q627n866l9143n5454m7490
9455A190214q0905m9751k8702k6558J7441L6114J9491j6510M531L8974L0256L4180
9443A168775K1661J4258J6156K059k57l803J1206J2319J1699l9452k8665K4136
9431A210092O78k0604l5940p438n83J2122M8390L7320j565l8215n4713q1995o4068
9418A003481m6335l9326q942m6910l0630k3998q45J0050p805k3080K3025N4682
9406H63367M3908l480j1392Q97O113p782j8432l0739m3054j6297M543n958lL823
9392G85514L0678N4386N9510J8886J8462J4543q956l3653l9898l1769m8048m8592
$$ y = [1259248, 1318749, 1355067, 1392908, 1436091, 1462370, 1473959, 1450897, 1411829, 1362421, 1332269, 1327695, 1313860, 1275407, 1231211, 1210888, 1226154, 1266489, 1320552, 1329540, 1338167, 1332301, 1293158, 1237704, 1190214, 1109309, 1059558, 1030856, 1004298, 1021739, 1057853, 1077344, 1060834, 1065365, 1104339, 1134595, 1168775, 1190436, 1204694, 1220850, 1222909, 1222652, 1218849, 1230055, 1242374, 1254073, 1214621, 1185956, 1210092, 1210770, 1190166, 1154226, 1146788, 1146205, 1158327, 1206717, 1244037, 1242472, 1204257, 1149544, 1067549, 1003481, 957146, 917820, 908878, 861968, 831338, 807340, 806495, 816545, 808740, 785660, 808685, 863367, 907275, 903795, 892403, 893300, 899413, 891631, 873199, 842460, 799406, 783109, 787652, 781694, 781691, 785514, 816192, 870578, 930088, 948974, 967436, 981979, 973023, 939370, 899472, 867703, 819655, 771063]
9380G71063k1780k0527L10j1479J521R272K3013K440K8325l602p768o905J5483
9367G79366K4532r372k1747j2929J9025L726r972N900j3780m364k023J5549K4648
9354G98559M5554O7418M0154j3203k0342j4046R37R996n625n956J9204M489J6125
9341I43264J7275J2442Q193K1398J5583j3194K1329J0898K2720j0673o376L923
9329A046782j1530K2354J8331O357k494l7455k1639M538K9148j2328P443J0450
9317A059957q872M2741K5622j0156M4368L3288K0866L2625K555J0795L8785L4887
9305A327461L3312M1456R875j6977J09j1879k4943j9919l710L0774J2834J6857
9293A395250k5292P17J8640Q783L8631K0376o458J2194L8210M4123K7526K7184
$$ y = [771063, 749283, 728756, 729066, 717587, 719108, 728380, 751393, 753833, 782158, 778556, 770788, 763883, 779366, 803898, 794526, 772779, 759850, 778875, 782601, 772629, 778529, 764749, 760385, 758362, 773911, 798559, 844113, 911531, 951685, 938482, 918140, 904094, 905031, 915027, 909402, 903446, 922650, 927139, 943264, 960539, 972981, 981174, 1002572, 1018155, 1004961, 1026290, 1037188, 1059908, 1049235, 1042859, 1046782, 1035252, 1057606, 1075937, 1082294, 1079800, 1042345, 1020706, 1025244, 1054392, 1042064, 1049507, 1059957, 1051085, 1093826, 1119448, 1109292, 1153660, 1186948, 1207814, 1240439, 1242994, 1253789, 1292574, 1327461, 1360773, 1402229, 1412104, 1395127, 1395236, 1383357, 1358414, 1338495, 1334785, 1365559, 1378393, 1395250, 1369958, 1370675, 1389315, 1398098, 1436729, 1457105, 1450647, 1462841, 1501051, 1545174, 1572700, 1599884]
9281A599884J1738M4008N3955O5309P4243O4453P4842J19211J63756K16413K57559
9270B745371K89246K71479J87136R571j38686k55802k42204j86978j18313l3346
9260B527474j3921J4431N9935Q9267J66468K06252J92527J95662J32506M6931
9250C617532L728o8691m5311n8578n9745k2138j3775j9805J8960N3138P1396Q9605
9238C566316J22673J95432L07702M77873O38996P33984N94223K26225k32762o02480
9228F028182p33830o14915m55120l12158j72677l9590K969j3422j0281q951N1686
9217C721893Q7723R6786J03645Q9521J04076J11316O9884l0308j51835j95696
9207D007005j81793j80099p5157j7915O097L0775P6735J22043J78968K23941L10291
$$ y = [1599884, 1611622, 1655630, 1709585, 1774894, 1849137, 1913590, 1988432, 2107643, 2271399, 2487812, 2745371, 3034617, 3306096, 3493232, 3502803, 3364117, 3108315, 2866111, 2679133, 2560820, 2527474, 2513553, 2527984, 2587919, 2677186, 2843654, 3049906, 3242433, 3438095, 3570601, 3617532, 3621260, 3552569, 3507258, 3448680, 3388935, 3366797, 3353022, 3333217, 3352177, 3405315, 3476711, 3566316, 3688989, 3884421, 4192123, 4669996, 5308992, 6042976, 6637199, 6863424, 6630662, 6028182, 5294352, 4679437, 4224317, 3912159, 3739482, 3699892, 3702861, 3689439, 3679158, 3670207, 3721893, 3809616, 3906402, 4010047, 4099568, 4203644, 4314960, 4384844, 4354536, 4202701, 4007005, 3825212, 3645113, 3569956, 3552041, 3558138, 3588913, 3665648, 3787691, 3966659, 4190600, 4500891]
9196D500891L20282K09219N5584j39233k53758k24859j64089j22627p5697k4640
9186D081073R601M9443O4498J02793P7575J19366J85201J40407J34005K01177
9176E165139K06445K17271K61675K88779L05986L57426M09699M74393N62168O25713
9166H874694P15834Q37042J033500J234251J467555J707922J855757K008525K196027
9157B1931107K476926K756529K892139K935250K862347K630915K101777J152986
9149D1739976k0064j216682k093011k536785k559081k275841j865583j461102
9141B7711827j016558n46824n4920L58206P86937J189544J605953K022777K402160
9132C4459102K783248L095384L364298L648463L982431M411178M912403N375243
$$ y = [4500891, 4821173, 5030392, 5085976, 4946743, 4692985, 4468126, 4304037, 4181410, 4105713, 4081073, 4090674, 4140117, 4204615, 4307408, 4384983, 4504349, 4689550, 4829957, 4963962, 5165139, 5371584, 5588855, 5850530, 6139309, 6445295, 6802721, 7212420, 7686813, 8248981, 8874694, 9590528, 10427570, 11461070, 12695321, 14162876, 15870798, 17726555, 19735080, 21931107, 24408033, 27164562, 30056701, 32991951, 35854298, 38485213, 40586990, 41739976, 41719912, 40503230, 38410219, 35873434, 33314353, 31038512, 29172929, 27711827, 26695269, 26148445, 26093525, 26451731, 27238668, 28428212, 30034165, 32056942, 34459102, 37242350, 40337734, 43702032, 47350495, 51332926, 55744104, 60656507, 66031750]
9124F6031750N690346N775317N552223N007758M285353L527610K829603K228391
9116A00928351J784318J438464J080628N93482m8209q73985j768678k547725l077284
9107I7509362l314919l241054l111983k839839k416919j871161j225857m56855
9099G9030775L26428J088787J826470K521349L061425L585012M072646M545313
9091A00058205N046554N526416O000019O427591O741249O815784O702903O407505
9083A49726226N922150N359625M800881M055023K847016J014569j325740l798529
9075A68601221n945290p413764q167737q443509q313582p774188o935829n985554
9067A09621768m994171m064565l176079k364885j592004q71276j83991N24911
$$ y = [66031750, 71722096, 77497413, 83049636, 88057394, 92342747, 95870357, 98699960, 100928351, 102712669, 104151133, 105231761, 105825243, 105777034, 104903049, 103134371, 100586646, 97509362, 94194443, 90953389, 87841406, 85001567, 82584648, 80713487, 79487630, 79030775, 79357203, 80445990, 82272460, 84793809, 87855234, 91440246, 95512892, 100058205, 105104759, 110631175, 116631194, 123058785, 129800034, 136615818, 143318721, 149726226, 155648376, 161008001, 165808882, 169863905, 172710921, 173725490, 172399750, 168601221, 162655931, 155242167, 147074430, 138630921, 130317339, 122543151, 115607322, 109621768, 104627597, 100563032, 97386953, 95022068, 93430064, 92558788, 92374797, 92899708]
9059I2899708J220514J856960K476083L061509L637977M170619M647554M974248
9051A18945172N128973N033769M660862M055666L211270K114505P96262p72816
9043A43173663k485054m092429n430099o412283p017261p218681p092955o696121
9035I6728780o173796n585383m991886m458513l984853l491591l056149k615278
9027F2371331k175216j746323j320613q46724m04891R2577O07245J164644J681846
9018E9423876K159201K459510K542830K276972J777143J187914O06031n0558q78723
9009G1504196j866649k722449l302089l617249l595030l322255k875152k345939
9001D7857384j874268j509944j256256j063505r14743q52555q42584p66467o92892
$$ y = [92899708, 94120222, 95977182, 98453265, 101514774, 105152751, 109323370, 113970924, 118945172, 124074145, 129107914, 133768776, 137824442, 141035712, 143150217, 143946479, 143173663, 140688609, 136596180, 131166081, 124753798, 117736537, 110517856, 103424901, 96728780, 90554984, 84969601, 79977715, 75519202, 71534349, 68042758, 64986609, 62371331, 60196115, 58449792, 57129179, 56282455, 55877564, 55970141, 56577386, 57742030, 59423876, 61583077, 64042587, 66585417, 68862389, 70639532, 71827446, 72433477, 72382919, 71504196, 69637547, 66915098, 63613009, 59995760, 56400730, 53078475, 50203323, 47857384, 45983116, 44473172, 43216916, 42153411, 41238668, 40386113, 39543529, 38777062, 38084170]
8992C8084170o16135n15787l99493l13449j87455n8698N4973K16619L29599M16955
8982C7011299M79093N41969O44185P15170P73251Q20896Q65029R33417R79465
8973D3763774J001433J020895J056251J067630J115394J172407J216721J258896
8965E2673401J261489J271828J302343J326142J355491J317326J290475J307589
8957F3106084J262511J213192J171430J084920J048426R92209R37709Q67425Q23931
8948G2507837Q01446P15554O54474N64125M63176M02333L34219K76284K32428
8939G6951876J43191O8316K6737n7074j19001j41096j92276k67139l07384l43137
8929G5763013l44770l36568l48022l64012l38623l29661l01100k28439j33198
$$ y = [38084170, 37468035, 36952248, 36552755, 36239306, 36051851, 35993153, 36048126, 36264745, 36594344, 37011299, 37490392, 38032361, 38676546, 39391716, 40164967, 40985863, 41850892, 42784309, 43763774, 44765207, 45786102, 46842353, 47909983, 49025377, 50197784, 51414505, 52673401, 53934890, 55206718, 56509061, 57835203, 59190694, 60508020, 61798495, 63106084, 64368595, 65581787, 66753217, 67838137, 68886563, 69878772, 70816481, 71683906, 72507837, 73309283, 74024837, 74679311, 75243436, 75706612, 76108945, 76443164, 76719448, 76951876, 77095067, 77163383, 77190120, 77133046, 77014045, 76872949, 76680673, 76413534, 76106150, 75763013, 75418243, 75081675, 74733653, 74369641, 74031018, 73701357, 73400257, 73171818, 73038620]
8920G3038620o7292Q4529K53976L43246L55196K42855p1740n56217j061841j449238
8910G1112094j695308j775734j659546j372331j079387p49470l87750m6692J67699
8901F2513575L49491L84590L39950J99508K4943j32328k34081k21001j35467K6091
8891F3115271J82344M31828P13144J014711J284078J504531J711452J856502J869091
8882G3682952J729808J436819J011576N36616J24979k17122m68853o92134r03899
8873G6240742j078438j280538j453815j547421j624728j751409j834867j915768
8865F3753758j927022j844911j663457j420780j078713o86578l84230r776L88017
8856E5126308P83113J156464J487018J838737K127153K321033K352653K182874
$$ y = [73038620, 72971328, 73055857, 73309833, 73653079, 74008275, 74251130, 74179390, 73623173, 72561332, 71112094, 69416786, 67641052, 65981506, 64609175, 63529788, 62780318, 62392568, 62345876, 62513575, 62863066, 63247656, 63587606, 63787114, 63812057, 63679729, 63445648, 63224647, 63089180, 63115271, 63297615, 63729443, 64442587, 65457298, 66741376, 68245907, 69957359, 71813861, 73682952, 75412760, 76849579, 77861155, 78397771, 78522750, 78305628, 77836775, 77144641, 76240742, 75162304, 73881766, 72427951, 70880530, 69255802, 67504393, 65669526, 63753758, 61826736, 59981825, 58318368, 56897588, 55818875, 55132297, 54748067, 54738291, 55126308, 55909421, 57065885, 58552903, 60391640, 62518793, 64839826, 67192479, 69375353]
8848F9375353J820270J250354O02943o5056o91316j225966j606532j893817k084035
8839F5482198k114603k062367k015167j934494j834342j747061j653081j575424
8831E0545659j436248j264662j085580r06981p56853o72945o92482p72377r23648
8822D2033883r94638j052456j014685q27673o63746m89093k72393j08765m2956
8813C6567478m5892p8617j23371k16601l27278m25987m35536m30808m31399l87281
8803C3664708l46450l73511m40144n82583p44229r48103j165225j419873j560621
8794B6083969j635288j626590j570803j419563j250118j106384r12278p34034
8786A5828911n78326m61637l34389k02708j15380j4760P8069O6193J8082j04595
$$ y = [69375353, 71195623, 72445977, 73048920, 72983864, 72292548, 71066582, 69460050, 67566233, 65482198, 63367595, 61305228, 59290061, 57355567, 55521225, 53774164, 52121083, 50545659, 49109411, 47844749, 46759169, 45852188, 45095335, 44422390, 43729908, 42957531, 42033883, 41039245, 39986789, 38972104, 38144431, 37480685, 36991592, 36719199, 36610434, 36567478, 36521586, 36442969, 36319598, 36102997, 35775719, 35349732, 34914196, 34483388, 34051989, 33664708, 33318258, 32944747, 32504603, 31922020, 31177791, 30229688, 29064463, 27644590, 26083969, 24448681, 22822091, 21251288, 19831725, 18581607, 17475223, 16562945, 15828911, 15250585, 14788948, 14454559, 14251851, 14136471, 14121711, 14199780, 14265973, 14284055, 14179460]
8776A4179460k55687l43942l87622l73290l47108k85433j72850j49862j32763
8767A1730903j82998k40020l62495m91155n58033n90734o06742n52701m93279
8758G652746m37228m11688l59526k85382k71405k37623k14474j74174j17440j33461
8748E010345j29329j20321j23291j22844q2886r0835q9374r5013p7475l0494m8977
8737C999506n1356n3840m8984m3595p5437q2821n6647o2103n7967o7902q6603
8726C312251n0643l631p028J2961p117k1575j9199m6280N046K6406n423j7967
8714C177801n3402l6309J6945M0570M6385J0132J4574k4662p70J7660J3408l3310
8702C189022n0190m3960n7842m4762n6615n1028l8481k4577o7329m7098l6199
$$ y = [14179460, 13923773, 13579831, 13192209, 12818919, 12471811, 12186378, 12013528, 11863666, 11730903, 11547905, 11307885, 10945390, 10454235, 9896202, 9305468, 8698726, 8146025, 7652746, 7215518, 6803830, 6444304, 6158922, 5887517, 5649894, 5435420, 5261246, 5143806, 5010345, 4881016, 4760695, 4637404, 4514560, 4431674, 4340839, 4251465, 4156452, 4078977, 4048483, 3999506, 3948150, 3894310, 3845326, 3801731, 3726294, 3643473, 3586826, 3524723, 3466756, 3398854, 3312251, 3261608, 3257977, 3250949, 3263910, 3256793, 3235218, 3216019, 3169739, 3174785, 3201191, 3195768, 3177801, 3124399, 3088090, 3105035, 3145605, 3191990, 3202122, 3216696, 3192034, 3191264, 3208924, 3222332, 3189022, 3138832, 3094872, 3037030, 2992268, 2935653, 2884625, 2846144, 2821567, 2754238, 2707140, 2670941]
8691B670941j2247J364j1046l2414j9546l1694o623o491r364J1071N945j9862
8679B540034K7529L9654j1845M29L8358L8431K7221k499k296j6143j1165k6313
8667B641395m8103o0355k2886n2303l4065k8000k4456o165k4751n8529o4337m9973
8655B167472m9876k2873j3356k2861k4907j8676k7882j2737l349q249j0829k7652
8643A924225j0522J9799L755M887K3556K5522p334k9130r711J981k1584q891k0647
8630A895906l1723k4986l4666l6772m3495k0185l2062l3263k9464n2077j8965
8619A538248R287K0423m1845n1147j0854k0052l0132k1521j4282j3938j2244J736
8607A353679J4360J8152J2560J9584R627k7570q5K2283j2251q546K4234o088j9782
$$ y = [2670941, 2658694, 2660058, 2649012, 2616598, 2597052, 2565358, 2558735, 2552244, 2542880, 2553951, 2559896, 2540034, 2567563, 2607217, 2595372, 2595801, 2634159, 2672590, 2699811, 2697312, 2695016, 2678873, 2667708, 2641395, 2593292, 2532937, 2510051, 2457748, 2423683, 2395683, 2371227, 2365062, 2340311, 2281782, 2217445, 2167472, 2117596, 2094723, 2081367, 2058506, 2033599, 2014923, 1987041, 1974304, 1970955, 1962706, 1951877, 1924225, 1913703, 1933502, 1937257, 1942144, 1965700, 1991222, 1983888, 1954758, 1945047, 1947028, 1925444, 1916553, 1895906, 1864183, 1839197, 1804531, 1767759, 1724264, 1704079, 1672017, 1638754, 1609290, 1557213, 1538248, 1547535, 1567958, 1526113, 1474966, 1464112, 1444060, 1413928, 1392407, 1378125, 1364187, 1351943, 1353679, 1368039, 1386191, 1398751, 1418335, 1427962, 1400392, 1400307, 1422590, 1410339, 1401793, 1426027, 1419939, 1400157]
8594A400157q972N459j3372j4001j2808J6765l8018l8850m8365l6488k8420j9484
8582A163603l1455m4245k4035l4241L3951J1271k008n320j3060N522q408K198
8570A053773j8845k7206l9832q887K503j6056J2057K256l9170J2651K5364j5098
8558I43510k2171L57L6812L596k1501o297j9087k4660p071j6682p401j1094O553
8545H54864Q30k3492n575P289L8750K4910O685j5957k656O898k1774k5875k3699
8532H21198J7937J8827m390n994n037K3584L2992L878p064J699j705n671j8383
8519H71871m7491l0825L120k2081J6710J6665N18N366q800k8548j2413j3892q755
8506G41445M0639K4755M1063M210k4302J6450R820R217K6355Q107j3723j9300
$$ y = [1400157, 1391185, 1396644, 1383272, 1369271, 1356463, 1373228, 1335210, 1296360, 1247995, 1211507, 1183087, 1163603, 1132148, 1087903, 1063868, 1029627, 1063578, 1074849, 1072841, 1067521, 1054461, 1059983, 1051575, 1053773, 1034928, 1007722, 967890, 959003, 961506, 945450, 957507, 959763, 920593, 933244, 958608, 943510, 921339, 921696, 958508, 962104, 940603, 934306, 915219, 890559, 883488, 866806, 859405, 848311, 854864, 855694, 832202, 826627, 833916, 872666, 897576, 904261, 888304, 885648, 892546, 870772, 844897, 821198, 839135, 857962, 853572, 847578, 842541, 866125, 899117, 902995, 895931, 897630, 895925, 890254, 871871, 824380, 793555, 796675, 774594, 791304, 807969, 808487, 813853, 805053, 776505, 764092, 750200, 741445, 782084, 806839, 847902, 852112, 827810, 844260, 854080, 863297, 889652, 897759, 884036, 864736]
8494H64736j7427K3229K3338o978J2544k022K6401M304j3371k436K2164K3450
8482I57932O780m5837j291k140o908L455J4595r480p003r156J931j0271l990J8591
8468I07208j7282k3725j324j6372j35K3978l3947j0443J1590k2826k233o790K2383
8455H30082K2559l048K8897M5153J7442P753J7897J3543J6220M984k4233l691
8443I73558k0269m3606m2333r752l488n212K6028J2082J5271J0275j4593p977
8431H89984j966m4350l9280j8314j5704j3162K8204N262l7630j3328J8349l760
8419G54305k3224J854L0063k3249j1360k8497k4696j4615m381J9767K5708J8299
8407G19974j5350j3428j6540l8287k3129j3568m904j5204j4271J5086N937n076
$$ y = [864736, 847309, 870538, 893876, 886898, 899442, 897420, 923821, 928125, 914754, 912318, 934482, 957932, 964712, 918875, 917584, 915444, 908536, 911991, 926586, 917106, 910103, 900947, 902878, 892607, 888617, 907208, 889926, 866201, 864877, 848505, 848370, 872348, 838401, 827958, 839548, 816722, 814489, 807699, 830082, 852641, 849593, 878490, 923643, 941085, 948838, 966735, 980278, 996498, 1001482, 977249, 973558, 953289, 909683, 867350, 857598, 854110, 848898, 874926, 887008, 902279, 912554, 897961, 889984, 888018, 843668, 804388, 786074, 770370, 757208, 785412, 790674, 753044, 739716, 758065, 754305, 731081, 732935, 762998, 739749, 728389, 699892, 675196, 660581, 656200, 675967, 701675, 719974, 704624, 691196, 674656, 636369, 613240, 599672, 594768, 579564, 565293, 580379, 586316, 581240]
8395E81240K6592K6073O415K8483J7197m772l7425m6888l6079j9340j5015j1111
8383E15370j9470R7J4524J7639j6568K997j2235j8685K2000J1380q378r569j2714
8370D86388j0678k1819N79o322J2374m635r196R005l599Q04l828m596n361l447
8356D35669m041k1380j9088L406j4281p689O360J9300p679J8720L324J0037J8579
8343D41237j0538j8175P175j5362j0432j4853J8983J1689k5871p157r82M334M147
8330C84195j7093p600l453j4089J70J1870J319J2098L168K125L264m68q318K3282
8316C90470j2715j783J9998k5487l5228k483O360J330j2055M4j1924l609J0169
8303C23087k356k1097k1857k74K7244J5270k577p9K272j4297j8000k1321j3193
$$ y = [581240, 607832, 633905, 640320, 668803, 686000, 681228, 643803, 596915, 560836, 541496, 526481, 515370, 495900, 495997, 510521, 528160, 511592, 514589, 502354, 483669, 505669, 517049, 508671, 499102, 486388, 475710, 453891, 454470, 448148, 460522, 455887, 446691, 455696, 452097, 452901, 449073, 444477, 439116, 435669, 431628, 410248, 391160, 394566, 380285, 372596, 378956, 398256, 390577, 409297, 412621, 422658, 441237, 430699, 412524, 419699, 404337, 393905, 379052, 398035, 409724, 383853, 376696, 375714, 380048, 384195, 367102, 359502, 356049, 341960, 342130, 354000, 355319, 367417, 370585, 372710, 375974, 375506, 367188, 390470, 377755, 375972, 395970, 370483, 335255, 332772, 339132, 340462, 328407, 328451, 316527, 312918, 323087, 320731, 299634, 277777, 277503, 304747, 320017, 317440, 317361, 319633, 305336, 287336, 266015, 252822]
8290B52822j7380K7980Q765j094n336R208k449r721J5296O462J520K196O530J634
8276B96433K4619Q572j6923j1999k1711k1063J6800K6898j9734M73k4933l0156
8264B27276M2965M913R893m836j344P773K2669K0143j1407n129j530k7675R369
8251B93080l416j8063l691L93J1544j2770k4225k7918K0143J5653J7099l103k9395
8238B35331K4604K3836k9789j253K675k0075J991l668k3624n016m925J8593J1487
8225B30167J1109J5796K1107J573k813J6562J9498J1581l2298k0876N992l042
8213B74356j4089L845R157N135p17j5192j3800l7402j7107k7993p382L507P853
8200A70171M3733K1819J8934j0265Q59K5208P168k245j0882j7950j2396J3788
$$ y = [252822, 235442, 263422, 272187, 271093, 265757, 274965, 272516, 262795, 278091, 284553, 286073, 288269, 294799, 296433, 321052, 329624, 312701, 300702, 278991, 257928, 274728, 301626, 281892, 282365, 257432, 227276, 270241, 275154, 285047, 280211, 278867, 286640, 309309, 329452, 318045, 312916, 311386, 283711, 293080, 289664, 271601, 267910, 268303, 279847, 267077, 242852, 214934, 235077, 250730, 267829, 264726, 235331, 259935, 283771, 253982, 252729, 255404, 235329, 237320, 233652, 210028, 205012, 200087, 218680, 230167, 241276, 257072, 278179, 279752, 276939, 293501, 312999, 324580, 292282, 271406, 277398, 274356, 260267, 264112, 273269, 278404, 277687, 262495, 248695, 211293, 194186, 166193, 158811, 162318, 170171, 213904, 235723, 254657, 244392, 245251, 270459, 277627, 275382, 264500, 246550, 234154, 247942]
8188B47942J1883n018Q566J117m88j5937k4192k4617n675J1205K7517q711j0800
8175B12792j4675K5781J1384j2598o698J5629j153j0966j748j2110p262j8039
8163A80337N181J8932L5660n237m459P615n321m404j0018l0034o308J115K393
8150A85452M9872P693k1093K4039j5986r311l641j0224J2204j240q384l1145l9574
8137A38662K5281L5861N217M311j843q546j8061n616J7040J2333K8703n879j9313
8124B08150O152n35J4131J0431J8915K0459j5626k5103k2384j8378l936K0060
8112B12336J2071k345j3176j4236j583P354K365L731k050O886q390L9529J7349
8099B59841r380k8700j6127K0179q27l7413k3548K4657R523n401k5465l075J3863
$$ y = [247942, 259825, 254807, 263373, 264490, 264002, 248065, 223873, 199256, 193581, 204786, 232303, 223592, 212792, 198117, 223898, 235282, 222684, 215986, 231615, 230462, 219496, 217748, 205638, 198376, 180337, 185518, 204450, 240110, 234873, 230414, 238029, 232708, 228304, 218286, 188252, 181944, 183059, 185452, 235324, 243017, 221924, 245963, 229977, 220666, 217025, 206801, 219005, 217765, 209381, 178236, 138662, 163943, 199804, 205021, 209332, 207489, 198943, 180882, 175266, 192306, 204639, 233342, 227463, 208150, 214302, 213767, 227898, 238329, 257244, 277703, 262077, 236974, 214590, 196212, 192276, 212336, 224407, 222062, 208886, 194650, 193067, 200421, 202786, 206517, 204467, 211353, 202963, 242492, 259841, 250461, 221761, 205634, 225813, 224986, 187573, 164025, 188682, 198205, 192804, 167339, 164264, 178127]
8086A78127k614m258J8097J7389P091o1o032J0197m072J8895L1033p274q542j617
8072B46359k1060m226q263j7639J5698N337j5251K9176L4930j8217o874Q723J7379
8059B66072J3522l4056j3307j3580K958L9636J2516m179L90j3442j7582P397j0778
8046B35567k3280J8728L4632Q802M381J894j4636j7561l289J4432J20J2958j0688
8033B62060j1306N290j0324N838K394J6213P704O809k252L472j5502j5554j7052
8020B37790k696j713l5074r061M5414K4233O378M30j7467Q000J449q853k0161
8007B28669M596R023L286k214m911j5824r201L8176M3643R409K4885l0270j1601
7994B87666j690l722J565r623j5250r76k0697m2P284o705k6826m01N436l683L664
$$ y = [178127, 175513, 171255, 189352, 206741, 213832, 213771, 207739, 217936, 213864, 232759, 263792, 256518, 247976, 246359, 225299, 221073, 212810, 195171, 210869, 216206, 200955, 230131, 265061, 246844, 239970, 248693, 266072, 279594, 245538, 232231, 218651, 221609, 261245, 273761, 269582, 269972, 256530, 238948, 246345, 235567, 212287, 231015, 265647, 274449, 278830, 280724, 266088, 248527, 245238, 259670, 259790, 272748, 262060, 250754, 256044, 245720, 251558, 253952, 270165, 277869, 284678, 282426, 285898, 270396, 254842, 237790, 235094, 233381, 198307, 189246, 234660, 258893, 265271, 265701, 248234, 256234, 257683, 248830, 228669, 233265, 242288, 245574, 243360, 238449, 222625, 213424, 251600, 295243, 304652, 329537, 299267, 287666, 285976, 282254, 283819, 274196, 258946, 257970, 237273, 237231, 244515, 237810, 210984, 210583, 216019, 212336, 216000]
7979B16000l914k4449j5317J7187N397j175q641Q121J0211L5543l516J6205K7874
7966B79526j2145l0477o202K5748J3623k1897j0870r388J5963j8550j2480j5055
7954A97796J7102L0128k461k8100K0806K9319j2344l3965j7282j7146L133L744
7942A90730q729j3673o578j2075L673N566J2174O476j6421l1670j0165K3226R920
7929A52454K3361J1879j2190k1478j2835j2594J6605K7915K376J8626p003l9843
7917A47273j6878k187l605m738K1292j767K235p168O419O677j1866j0988K3147
7904A47846j1164j3314N760m565p743J0988J7948k9277L170L662Jn311O138p0
7890A24069L506j6690L743R029R842J2305l0077K201j7204o202J6681J3148K289
$$ y = [216000, 212086, 187637, 172320, 189507, 194904, 193729, 185088, 193209, 203420, 238963, 235447, 251652, 279526, 267381, 236904, 230702, 256450, 270073, 248176, 237306, 227918, 243881, 225331, 212851, 197796, 214898, 245026, 242565, 214465, 235271, 264590, 252246, 218281, 200999, 183853, 186986, 190730, 182001, 168328, 161750, 149675, 153348, 158914, 171088, 177564, 161143, 129473, 119308, 142534, 152454, 175815, 187694, 175504, 154026, 141191, 128597, 145202, 173117, 175493, 194119, 187116, 147273, 130395, 128208, 124603, 119865, 141157, 139390, 141625, 134457, 140876, 147553, 135687, 124699, 147846, 136682, 123368, 129128, 124563, 116820, 127808, 145756, 116479, 119649, 123311, 123312, 118001, 124139, 124069, 127575, 110885, 114628, 123657, 133499, 145804, 115727, 117928, 100724, 94522, 111203, 124351, 126640]
7877A26640l929J0830N612J1144m685j0707j7321j127J2524J04R435N784J0275
7864A54579j0334k104q82j2420k746K4214L126j0144j7650k5165R714M0425J0462
7851A61075p478l8032j0904J5231J4589N561p854j030l0016k7294K537N916J7198
7838I9499j7619k1190K5524K1311p851q159N363j2596p768K8842R21J0809r570
7825A07516j2423K818K498K5675P995R41r454M073j7327j0041r631M421n204J72
7811I2029K4220k070j8309j0451r530j172l296O294N088J0670j734j7282N35l458
7797G1534k6952j384J7075J8424K55K8634K1946k9986k4374R527j9250j0514m170
7784E0765K6982L2516k0233j7604M658r897Q773K937J7386p269j1929J796j6277
$$ y = [126640, 122711, 133541, 139153, 150297, 145612, 134905, 117584, 116457, 128981, 129085, 138520, 144304, 154579, 144245, 142141, 141259, 128839, 126093, 150307, 153433, 143289, 125639, 100474, 110188, 150613, 161075, 153597, 115565, 104661, 119892, 134481, 140042, 132188, 131158, 101142, 73848, 76385, 82301, 99499, 81880, 60690, 86214, 107525, 99674, 91515, 96878, 84282, 76514, 105356, 106277, 117086, 107516, 95093, 97911, 100409, 126084, 134079, 135020, 125566, 129639, 112312, 102271, 92640, 97061, 91857, 92029, 116249, 114179, 95870, 85419, 75889, 74717, 71421, 77715, 82803, 93473, 91739, 74457, 74992, 71534, 44582, 43198, 60273, 78697, 78952, 107586, 129532, 99546, 75172, 84699, 65449, 54935, 50765, 77747, 110263, 90030, 72426, 77084, 67187, 75960, 78897, 96283, 89014, 77085, 78881, 62604]
7771F2604j9522J9929K8942K9543l040k917q419j4253k1890k6042M377j5123k54
7758C3935N857K2549K9543J7228J4691o257K894J2252o946j0482j2769o515j3279
7745H2701k0053m901M16R895K3470k5619m639Q736j348l635N302R959m852o236
7731F9196K3899j8279k87L534j7439q603K6606Q790j6076R448M672j2472N283
7718G8272K5338j5359j6337j1268K264n942q07K0935L2267J7395q247j2706j0268
7705I5537m013J6342J0182k2559p937j5634K666j0903J3707J3080j2228J8082
7693I6322K6487j4564j112j1200j4828m317L318K8328J5506j329J882j8056k3578
7680H2859l5733j4595K4592J229j0303k3697p75M3288L4998M789q022j7996k0901
$$ y = [62604, 43082, 63011, 91953, 121496, 118456, 115539, 107120, 92867, 70977, 44935, 49312, 34189, 33935, 39792, 62341, 91884, 109112, 123803, 117546, 120440, 132692, 125746, 115264, 102495, 95980, 82701, 62648, 57747, 58163, 68058, 91528, 65909, 61270, 70006, 68658, 65023, 70325, 80284, 75432, 69196, 93095, 74816, 74529, 78063, 60624, 52021, 78627, 87417, 71341, 80789, 85461, 72989, 78272, 103610, 88251, 71914, 60646, 62910, 56968, 56161, 77096, 109363, 126758, 118511, 105805, 95537, 91524, 107866, 118048, 95489, 87552, 71918, 74584, 63681, 77388, 90468, 78240, 96322, 122809, 108245, 107133, 95933, 81105, 76788, 80106, 108434, 123940, 122611, 124493, 106437, 82859, 47126, 32531, 57123, 58352, 48049, 24352, 23577, 66865, 101863, 106652, 98630, 80634, 59733]
7667E9733l66Q486p756l3849N182L4089K1212k7419L864J8412K2697N979R57J528
7653A12749j3112l1777K8507P470K611M277M514j5468k0554k685K0334k1723j8430
7640E6713k6160J3500J6696J3239M039k519J3199K3587n4009k6589M693M5585
7628H1974K0839j2561O744k4546j3383R259N96L1154K043l6062k9419R253K1775
7615F7666J5229J314j6576L004k0453J972R869K1183j5430q247j0385j555O607
7602E4198J2699j9327M36K0629K0275J3187n637k4803k9858k169J7568N149N119
7589F7466n713K085R469M210j0526m104J2251K3028K8017l1640j9701J3460J1431
7576I9733j0335k8349r145Q835Q637Q725J3952m79m239k8970n845J4583l110q240
$$ y = [59733, 59367, 67853, 60097, 26248, 31430, 65519, 86731, 59312, 63176, 81588, 104285, 110264, 111221, 112749, 99637, 67860, 96367, 103837, 106448, 110725, 115239, 99771, 79217, 76532, 96866, 75143, 56713, 30553, 44053, 60749, 73988, 78027, 75508, 88707, 112294, 58285, 31696, 36389, 81974, 102813, 90252, 96996, 72450, 59067, 68326, 68922, 100076, 102119, 66057, 36638, 45891, 67666, 82895, 84209, 67633, 70637, 50184, 52156, 62025, 83208, 67778, 59531, 49146, 47591, 54198, 66897, 47570, 48006, 68635, 88910, 102097, 96460, 71657, 41799, 39630, 57198, 62347, 67466, 61753, 63838, 73307, 77517, 66991, 62887, 75138, 98166, 126183, 94543, 74842, 88302, 99733, 89398, 61049, 51904, 60739, 69376, 78101, 92053, 91574, 87335, 58365, 52520, 67103, 63993, 55753]
7562E5753m706l034J1676J4664j0075q997N128n199R710J2325k3307L980o229
7549E1689J1233j4156Q891L254j9104j5792J3151J3310K155L0607Q008j2884o210
7536G4152j4506j6925j2803j0032o667k0166O311L7263K3970j0410k9147o425
7524A4615Q008J4517j5391J7652j639L360J1235n247j6029J7884k493l639l137
7511C9696j757K5362k1280K967J7427k6801j5442J652Q412J63J3507L2276O355
7498H2537j5320M712L893O07l4940o292J8563J0426J8215J9684j8506n3709k1054
7485H816J3388L1967L832L612r851j7750n349l228K5110K1472j2930k0332J4833
7472E3590M340R202k2071J6741j0708l214j2761O008P60k2314l905j4725j175
$$ y = [55753, 51047, 48013, 59689, 74353, 64278, 55281, 60409, 55210, 64920, 77245, 53938, 57918, 51689, 62922, 48766, 57657, 60911, 41807, 26015, 39166, 52476, 54631, 85238, 93246, 80362, 74152, 59646, 42721, 29918, 19886, 13219, -6947, -636, 36627, 60597, 50187, 21040, 14615, 22623, 37140, 21749, 39401, 37762, 41122, 52357, 47110, 31081, 48965, 46472, 42833, 39696, 37939, 63301, 42021, 44988, 62415, 35614, 20172, 21824, 30236, 30399, 43906, 76182, 82537, 67217, 71929, 75822, 76429, 41489, 35197, 53760, 64186, 82401, 102085, 83579, 29870, 8816, 22204, 54171, 58003, 61615, 51764, 34014, 28665, 25437, 50547, 72019, 59089, 38757, 53590, 57930, 67132, 45061, 61802, 51094, 47880, 35119, 41127, 41887, 19573, 15668, 943, -232]
7459b32K7377P447O293N241l2675k0347j3823R737K9606M6307J4468p434j0278
7446F1687L10j0265J7507J4491J0604k0005m013N634p949n573p527P510J4137
7433G6548j1442J7201J0652j5653k0838j5542k7676J0978R322p294N717K3968
7421E5941n103k1933J3455k6636p79r551n657K1994L2152p760n703J4578p54k485
7407E1759J9484j9264j7116L567j869n283j1708k9309L5046J5577r14J1857R924
7394F1751j7485p763l001o194J390j5409j0957M956j0282J115K8199R122P899
7381D3341J3347l830L86k8441J61P894N609n796J761r895J8134K4386Mr492j2525
7366D5044O986j3574J830j5224m237J7569K9344j2088j0159L1871L9921j5289
$$ y = [-232, 27145, 34592, 40885, 46126, 13451, -6896, -20719, -10982, 18624, 64931, 79399, 71965, 61687, 61997, 51732, 69239, 83730, 94334, 74329, 70316, 75950, 68001, 62428, 54901, 62411, 76548, 65106, 82307, 92959, 77306, 56468, 40926, 13250, 24228, 33550, 26256, 31973, 55941, 50838, 28905, 42360, 15724, 14945, 5394, -263, 21731, 53883, 46123, 40420, 54998, 54244, 51759, 71243, 51979, 34863, 38430, 36561, 31278, 19570, -9739, 25307, 40884, 39970, 51827, 61751, 44266, 36503, 33502, 27308, 28698, 13289, 2332, 7288, -2994, -1879, 26320, 35442, 43341, 56688, 52858, 53244, 24803, 24964, 32858, 38467, 32671, 34432, 24537, 42671, 67057, 67061, 57569, 45044, 52030, 38456, 40286, 25062, 20825, 38394, 67738, 55650, 45491, 77362, 117283, 101994]
7354A01994n0102k6246M434K021j845J300K0759j0315k0384j2232J960j1564K467
7341B247K1961K7044l98j6467J4481J2069p42r670J4978k3111r537j4979J2504
7328C0380K2724P615k4069l0993n720L1002k0847j9428L3382K0712k899n842j2061
7315B3956j1758M334k741r108m636o142J4143R251m313J0728P383P181L173J3452
7301E4903M468j751q439q917J5486N140Q666j4468O87j021J840j0188p17j8378
$$ y = [101994, 51892, 25646, 30080, 32101, 30256, 31556, 52315, 42000, 21616, 9384, 11344, -220, 2247, 24208, 51252, 50854, 34387, 48868, 60937, 60195, 50525, 65503, 42392, 32855, 17876, 30380, 53104, 60719, 36650, 5657, -63, 30939, 10092, -9336, 24046, 44758, 41859, 36017, 23956, 12198, 16532, 13791, 4683, 47, -6095, 8048, 17299, 12986, 23714, 31097, 38278, 41451, 54903, 59371, 57620, 49181, 40264, 55750, 60890, 69556, 55088, 55775, 54754, 56594, 46406, 45689, 27311]
$$ [...]
##END NTUPLES=NMR SPECTRUM
##END=
