##TITLE=Analysis number 314742
Compound Code cc 45611
Book Reference 382/136/1
Project Code adrs
Chemist Name simons
##JCAMPDX= 6.0         $$ Bruker NMR JCAMP-DX V2.0
##DATA TYPE= NMR SPECTRUM
##DATA CLASS= NTUPLES
##ORIGIN= Bruker BioSpin GmbH
##OWNER= NMR
$$ XWIN-NMR		Version 3.5
$$ Wed Oct 26 09:50:05 2005 GMT Daylight Time (UT+1h)  MAYBRIDGE\NMR@NMR_250MHZ
##.OBSERVE FREQUENCY= 250.131544655141
##.OBSERVE NUCLEUS= ^1H
##.ACQUISITION MODE= SIMULTANEOUS (DQD)
##.ACQUISITION SCHEME= undefined
##.AVERAGES= 16
##.DIGITISER RES= 18
##SPECTROMETER/DATA SYSTEM= dpx250
##.PULSE SEQUENCE= zg30
##.SOLVENT NAME= CDCl3
##.SHIFT REFERENCE= (INTERNAL, CDCl3, 0, 16.4539)
##AUDIT TRAIL= $$ (NUMBER, WHEN, WHO, WHERE, WHAT)
$$ ##TITLE= Audit trail, XWIN-NMR		Version 3.5
$$ ##JCAMPDX= 5.01
$$ ##ORIGIN= Bruker BioSpin GmbH
$$ ##OWNER= NMR
$$ C:\u/data/dgb/nmr/ADRS/11390/pdata/1/auditp.txt
$$ ##AUDIT TRAIL=  $$ (NUMBER, WHEN, WHO, WHERE, WHAT)
(   1,<2005-10-26 09:49:27.89 +100>,<MAYBRIDGE\NMR>,<NMR_250MHZ>,
      <created by zg, POWCHK disabled, PULCHK disabled
       configuration hash MD5:
       62 19 C7 07 E1 42 D1 B7 37 6C 3D D0 77 39 F9 E6
       data hash MD5: 64K
       88 88 79 49 79 DA C0 34 50 FA 05 C7 C6 C9 25 9F>)
(   2,<2005-10-26 09:49:45.17 +100>,<MAYBRIDGE\NMR>,<NMR_250MHZ>,
      <Start of raw data processing
       ef LB = 0.3 FT_mod = 6 PKNL = 1 SI = 32K 
       data hash MD5: 32K
       56 05 DD 44 9D 66 8B 54 77 A0 CE BB D6 BC 47 E5>)
(   3,<2005-10-26 09:49:49.96 +100>,<MAYBRIDGE\NMR>,<NMR_250MHZ>,
      <apk 
       data hash MD5: 32K
       DF 47 F8 FB AE 33 3D 3B D1 6B BE FB 6E E6 5A 0D>)
(   4,<2005-10-26 09:49:51.52 +100>,<MAYBRIDGE\NMR>,<NMR_250MHZ>,
      <abs ABSG = 5 
       data hash MD5: 32K
       BF FE F1 1D 64 68 D8 11 C9 7D 53 CE F3 59 DB C6>)
$$ ##END=
$$ 
$$ hash MD5
$$ 47 A5 4F 78 FA 9B E1 24 4E A3 48 18 AD 3E EC 54
##$RELAX= 
##$RELAX= 
##$RELAX= 
##$RELAX= 
##$RELAX= 
##$RELAX= 
##$RELAX= 
$$ Bruker specific parameters
$$ --------------------------
##$DU= <C:\u>
##$EXPNO= 11390
##$NAME= <ADRS>
##$PROCNO= 1
##$TYPE= <nmr>
##$USER= <dgb>
##$AMP= (0..31)
100 100 100 100 100 100 100 100 100 100 100 100 100 100 100 100 100 100 
100 100 100 100 100 100 100 100 100 100 100 100 100 100 
##$AQSEQ= 0
##$AQ_mod= 3
##$AUNM= <au_zg>
##$AUTOPOS= <41 >
##$BF1= 250.13
##$BF2= 250.13
##$BF3= 250.13
##$BF4= 250.13
##$BF5= 500.13
##$BF6= 500.13
##$BF7= 500.13
##$BF8= 500.13
##$BYTORDA= 1
##$CFDGTYP= 0
##$CFRGTYP= 5
##$CHEMSTR= <none>
##$CNST= (0..31)
1 1 145 1 1 1 1 1 1 1 1 1 1 1 1 1 1 1 1 1 1 1 1 1 1 1 1 1 1 1 1 1 
##$CPDPRG= <>
##$CPDPRG1= <>
##$CPDPRG2= <>
##$CPDPRG3= <>
##$CPDPRG4= <mlev>
##$CPDPRG5= <mlev>
##$CPDPRG6= <mlev>
##$CPDPRG7= <mlev>
##$CPDPRG8= <mlev>
##$CPDPRGB= <>
##$CPDPRGT= <>
##$D= (0..31)
0 1 0 0 0 0 0 0 0 0.06 0 0 0 0 0 0 0.0002 0 0 0 0 0 0 0 0 0 0 0 0 0 0 
0 
##$DATE= 1130316566
##$DBL= (0..7)
120 120 120 120 120 120 120 120 
##$DBP= (0..7)
150 150 150 150 150 150 150 150 
##$DBP07= 0
##$DBPNAM0= <>
##$DBPNAM1= <>
$$ [...]
##$SUBNAM7= <"">
##$SUBNAM8= <"">
##$SUBNAM9= <"">
##$SW= 20.6930455092707
##$SWIBOX= (0..15)
0 0 3 0 0 0 0 0 0 0 0 0 0 0 0 0 
##$SW_h= 5175.983436853
##$TD= 65536
##$TD0= 1
##$TE= 295.16
##$TE2= 300
##$TE3= 300
##$TEG= 300
##$TL= (0..7)
0 120 120 120 120 120 120 120 
##$TP= (0..7)
150 150 150 150 150 150 150 150 
##$TP07= 0
##$TPNAME0= <>
##$TPNAME1= <>
##$TPNAME2= <>
##$TPNAME3= <>
##$TPNAME4= <>
##$TPNAME5= <>
##$TPNAME6= <>
##$TPNAME7= <>
##$TPOAL= (0..7)
0.5 0.5 0.5 0.5 0.5 0.5 0.5 0.5 
##$TPOFFS= (0..7)
0 0 0 0 0 0 0 0 
##$TUNHIN= 0
##$TUNHOUT= 0
##$TUNXOUT= 0
##$USERA1= <user>
##$USERA2= <user>
##$USERA3= <user>
##$USERA4= <user>
##$USERA5= <user>
##$V9= 5
##$VALIST= <valist>
##$VCLIST= <CCCCCCCCCCCCCCC>
##$VD= 0
##$VDLIST= <DDDDDDDDDDDDDDD>
##$VPLIST= <PPPPPPPPPPPPPPP>
##$VTLIST= <TTTTTTTTTTTTTTT>
##$WBST= 1024
##$WBSW= 4
##$XGAIN= (0..3)
0 0 0 0 
##$XL= 0
##$YL= 0
##$YMAX_a= 478138
##$YMIN_a= -526192
##$ZGOPTNS= <>
##$ZL1= 120
##$ZL2= 120
##$ZL3= 120
##$ZL4= 120
##$ABSF1= 16.45392
##$ABSF2= -4.239252
##$ABSG= 5
##$ABSL= 3
##$ALPHA= 0
##$AQORDER= 0
##$ASSFAC= 0
##$ASSFACI= 0
##$ASSFACX= 0
##$ASSWID= 0
##$AUNMP= <proc_1d>
##$AZFE= 0.1
##$AZFW= 0.1
##$BCFW= 0
##$BC_mod= 0
##$BYTORDP= 0
##$COROFFS= 0
##$CY= 12.5
##$DATMOD= 1
##$DC= 0
##$DFILT= <>
##$DTYPP= 0
##$F1P= 14.0000005364418
##$F2P= -0.99999901652339
##$FCOR= 0.5
##$FTSIZE= 32768
##$FT_mod= 6
##$GAMMA= 0
##$GB= 0
##$INTBC= 1
##$INTSCL= 1
##$ISEN= 128
##$LB= 0.3
##$LEV0= 0
##$LPBIN= 0
##$MAXI= 10000
##$MC2= 0
##$MEAN= 0
##$ME_mod= 0
##$MI= 0
##$NCOEF= 0
##$NC_proc= -4
##$NLEV= 6
##$NOISF1= 0
##$NOISF2= 0
##$NSP= 0
##$NTH_PI= 0
##$NZP= 0
##$OFFSET= 16.45392
##$PC= 1
##$PHC0= -69.45213
##$PHC1= 4.496931
##$PH_mod= 1
##$PKNL= yes
##$PPARMOD= 0
##$PSCAL= 4
##$PSIGN= 0
##$REVERSE= no
##$SF= 250.130017027471
##$SI= 32768
##$SIGF1= 0
##$SIGF2= 0
##$SINO= 400
##$SIOLD= 32768
##$SREGLST= <1H.CDCl3>
##$SSB= 0
##$STSI= 32768
##$STSR= 0
##$SW_p= 5175.98343685301
##$SYMM= 0
##$S_DEV= 0
##$TDeff= 65536
##$TDoff= 0
##$TI= <Analysis number 999999
Compound Code 99
Book Reference 9
Project Code 9>
##$TILT= no
##$TM1= 0
##$TM2= 0
##$TOPLEV= 0
##$USERP1= <user>
##$USERP2= <user>
##$USERP3= <user>
##$USERP4= <user>
##$USERP5= <user>
##$WDW= 1
##$XDIM= 32768
##$YMAX_p= 517557672
##$YMIN_p= -192998
$$ End of Bruker specific parameters
$$ ---------------------------------
##NTUPLES= NMR SPECTRUM
##VAR_NAME=  FREQUENCY,     SPECTRUM/REAL,   SPECTRUM/IMAG
##SYMBOL=    X,             R,               I
##VAR_TYPE=  INDEPENDENT,   DEPENDENT,       DEPENDENT
##VAR_FORM=  AFFN,          ASDF,            ASDF
##VAR_DIM=   32768,         32768,           32768
##UNITS=     HZ,            ARBITRARY UNITS, ARBITRARY UNITS
##FACTOR=    0.157963299565203, 1,           1
##FIRST=     4115.61938091099, 0,            0
##LAST=      -1060.36405594202, 0,           0
##MIN=       -1060.36405594202, -192998,     0
##MAX=       4115.61938091099, 517557672,    0
$$ Real data points
##PAGE= N=1
##DATA TABLE= (X++(R..R)), XYDATA
$$ [...]
15733G357m0055k5364N962J8433j8167k7671K1916L8225J606l0511M5711P684
$$ 7357 -32698 -58062 -52100 -33667 -51834 -79505 -57589 -19364 -17758 -48269 -2558 5126
15721E126J7189K3552j6176Q941L198k6595j3275N8899q390l5455K9013J710j0290
$$ 5126 22315 45867 29691 38632 41830 15235 1960 60859 52469 17014 46027 47737 37447
15708C7447n7429m535N0274L5059l9831r978k1729k8792K031m574n517m2108j5964
$$ 37447 -19982 -24517 25757 60816 20985 11007 -10722 -39514 -37483 -42057 -47574 -89682 -105646
15695a05646K1059L3922k4486k750M3076L4197J8567m66J872p956k7351l8951
$$ -105646 -84587 -50665 -75151 -77901 -34825 -628 17939 17473 19345 11389 -15962 -54913
15683e4913K8116M0593j9403k3339M2860L8269j4713K3651J0069l4562o4309L0615
$$ -54913 -26797 13796 -5607 -28946 13914 52183 37470 61121 71190 36628 -27681 2934
15671B934L0352l6519K5073K8387p2275o0338o422k3275N3448J03831J9916J2570
$$ 2934 33286 -3233 21840 50227 -22048 -82386 -88808 -112083 -58635 45196 65112 77682
15659G7682o901m9604q701j2353Q633j4675k113Q920J2198J4848j6323K2945j6953
$$ 77682 70781 21177 12476 123 8756 -5919 -8032 888 13086 27934 11611 34556 17603
15646A7603k939N5515Q550o8951m1366j4095K63n3559M1233K9699l1452l7853
$$ 17603 14664 70179 78729 9778 -31588 -45683 -45420 -98979 -57746 -28047 -59499 -97352
15634i7352l6648L4574L9309J3299N8534k124M7726P435n8958l4675m0777n5491
$$ -97352 -134000 -99426 -60117 -46818 11716 9592 57318 64753 5795 -28880 -69657 -125148
15622a25148K7559K0402K6127L8941L3321n2675j315M4159K5709l2427m5078N5491
$$ -125148 -97589 -77187 -51060 -12119 21202 -31473 -32788 11371 37080 4653 -40425 15066
15610A5066K7236K6873j2703q1547j3200L6774L639l107L232k323j056p115j1953
$$ 15066 42302 69175 56472 -25075 -38275 -1501 2138 -969 2263 -60 -1116 -8231 -20184
15597b0184P197K862n1516L0550M5508N2915q499r44K2185o9257j4620N5782P0649
$$ -20184 -12987 -10125 -61641 -31091 14417 67332 58833 57889 80074 10817 -3803 51979 122628
15584A22628j3990n5240l3671J871N798L1311K5584R726l6587m5807r2991k2576
$$ 122628 108638 53398 19727 21598 27396 58707 84291 94017 57430 11623 -81368 -103944
15572a03944L2906L5916Q1175K2450j9640k8738m2653J0585k060J9337R360J0506
$$ -103944 -71038 -35122 46053 68503 48863 20125 -22528 -11943 -14003 5334 14694 25200
15560B5200l23k8967l0032M1776K6724L1532j691j8267l7935o347n0728o9019
$$ 25200 24877 -4090 -34122 7654 34378 65910 64219 45952 8017 1670 -49058 -118077
15548a18077K0632k5326K246J9259M0519L9110M1255j9796m773R53N262l9132
$$ -118077 -97445 -122771 -120525 -101266 -60747 -21637 19618 -178 -4951 -3998 1264 -37868
15536c7868j4278l543j4127L9452J8561M051k4777j6104k5160m316L0192j573
$$ -37868 -52146 -55689 -69816 -30364 -11803 -7752 -32529 -48633 -73793 -78109 -47917 -49490
15524d9490k107j0055n2376J2375K5623J2387M3682N0278N843O634m2886j6854
$$ -49490 -51597 -61652 -114028 -101653 -76030 -63643 -19961 30317 36160 42794 -92 -16946
15512a6946J8215L7451K0693K4201O17P153l4900n5587N042L6628L2358q002o6883
$$ -16946 1269 38720 59413 83614 84231 91384 56484 897 5939 42567 74925 66923 40
15499D0o5541l4088J9202N8211O0610R384J0006m528N1692m6122m5738k3338r240
$$ 40 -65501 -99589 -80387 -22176 38434 47818 57824 53296 104988 58866 13128 -10210 -19450
15486a9450j0642l873L3359l4268J5141l2279k4252J0345Q075K7492N7803K2122
$$ -19450 -30092 -33965 -606 -34874 -19733 -52012 -76264 -65919 -57844 -30352 27451 49573
15474D9573k7908k0781m706J8846J8028K1303j1614j8693r510q684L1545K8378
$$ 49573 21665 884 -3822 15024 33052 54355 42741 24048 14538 5854 37399 65777
15462F5777L62l8888r0024J7740K4944m792N994J5014o2411k5141n196L785N2681
$$ 65777 66139 27251 -62773 -45033 -20089 -24881 -18887 -3873 -66284 -91425 -96621 -92836 -40155
15449d0155M2932J9038j7208j7293J3885N8682P481K9298k6616n8458q1401k543
$$ -40155 2777 21815 4607 -12686 1199 59881 67362 96660 70044 11586 -69815 -72358
15437g2358N019L9498L3918l1446k5625k823p179N797M1357K5775l5739k0301
$$ -72358 -67339 -27841 6077 -25369 -50994 -53817 -60996 -55199 -13842 11933 -23806 -44107
15425d4107J2056n054J1763K3904o869j3230K1517K0209K3732p148J1850J2093
$$ -44107 -32051 -37105 -25342 -1438 -8307 -21537 -20 20189 43921 36773 48623 60716
15413F0716K2821o0246j1731k8955k8023M4977N1694M7193N019M419l8165J732
$$ 60716 83537 23291 11560 -17395 -45418 -441 51253 98446 103465 107884 69719 71451
15401G1451k6471n9762l2546M6904L705L4553M7123n5212l8007k2568k2078j0283
$$ 71451 44980 -14782 -47328 -424 3281 37834 84957 29745 -8262 -30830 -52908 -63191
15389f3191N6477M6060j7571j1939k1498J1560K2964N158J2761J6520l7624q0321
$$ -63191 -6714 39346 21775 9836 -11662 -102 22862 28020 40781 57301 19677 -60644
15377f0644K8582J5727k4574M1072J7791J3187L927l4392O0146K8061K6450j1595
$$ -60644 -32062 -16335 -40909 163 17954 31141 35068 676 60822 88883 115333 103738
15365A03738k7132p910L6714M119m2045m2759k4317L3541J2014o0480j870K0947
$$ 103738 76606 68696 105410 109529 67484 24725 408 33949 45963 -14517 -16387 4560
15353D560L1859o148K9062K3195m7982j2991m3547l873Q568o108J786J8252j0218
$$ 4560 36419 30271 59333 82528 34546 21555 -21992 -25865 -17297 -23405 -21619 -3367 -13585
15340a3585j363m540p4016k9800L2963O6301L2868m7668n2640K2247O2673K5106
$$ -13585 -14948 -19488 -93504 -123304 -90341 -24040 8828 -38840 -91480 -69233 -6560 18546
15328A8546J7506J6784l1577N967j0232l472j3139n1936J0015J9619K6943k851
$$ 18546 36052 52836 21259 27226 16994 13522 383 -51553 -41538 -21919 5024 2173
15316B173j9097K3165N1421M5749k4464o5395p2786n6778O3164L8417k219k3119
$$ 2173 -16924 6241 57662 103411 78947 13552 -59234 -116012 -52848 -14431 -16650 -39769
15304c9769m7605K112L0442O6773N86p250N7825n7236k0338k439L024J2701j4067
$$ -39769 -87374 -85262 -54820 11953 12539 5289 63114 5878 -14460 -16899 -13875 -1174 -15241
15291a5241l2816L605Q084k7219R932j7013N6788J7278m2763o0971M548M7120
$$ -15241 -48057 -44452 -36368 -63587 -53655 -70668 -13880 3398 -39365 -100336 -95788 -48668
15279d8668q867K6666M762L4908K550j4574j2087k6836R828J9072k0369L0825
$$ -48668 -57535 -30869 -26107 8801 11351 -3223 -15310 -42146 -32318 -13246 -33615 -2790
15267b790J0529P543K2633O295j094l2255J1493K7934K2495M7051k0532j7688
$$ -2790 7739 15282 37915 44210 43116 10861 22354 50288 72783 119834 99302 81614
15255H1614Q436l6792n7964O285K6837j963J950m5693l153O6231L9378r4211m4440
$$ 81614 90050 53258 -4706 1579 28416 26453 28403 -17290 -20443 45788 85166 -9045 -53485
15242e3485M986L1430M235o086l7361m036Q256L4123j105K9007l1118J8759o351
$$ -53485 -48499 -17069 -12834 -18920 -56281 -60317 -52061 -17938 -19043 9964 -21154 -2395 -8746
15229h746p3273M1902K4016j1942L9428J4158j8833l2367j5599k3427l2074O4783
$$ -8746 -82019 -40117 -16101 -28043 11385 25543 6710 -25657 -41256 -64683 -96757 -31974
15217c1974M6472n8260j1663L1055o4948m1493p975N9151K2200J4474N7258j8499
$$ -31974 14498 -43762 -55425 -24370 -89318 -130811 -138786 -79635 -57435 -42961 14297 -4202
15205d202m189j7304J9277k07l9999m5674m179N5526J9166n967K2367M1340N4649
$$ -4202 -8391 -25695 -6418 -6625 -46624 -92298 -96477 -40951 -21785 -27752 -5385 35955 90604
15192I0604k7498q1643O316J1084L021k33J9927m1130j6808m3612k3002n3018
$$ 90604 63106 -18537 -12221 -1137 1884 1651 21578 -19552 -36360 -79972 -102974 -155992
15180a55992j6902L4746N9177J00334o155n7549l9047R979K4779O9676P0220m749
$$ -155992 -172894 -138148 -78971 21363 15208 -42341 -81388 -71409 -46630 23046 93266 88517
15168H8517p575j7217o9653K4451j138L6070k0568q6787k8057Q080J4256L9572
$$ 88517 80942 63725 -5928 18523 17385 53455 32887 -53900 -81957 -73877 -59621 -20049
15156b0049K278k2894k6074J5570K8400N1041P0798K3999j0895k7534j3607o9512
$$ -20049 -17771 -40665 -66739 -51169 -22769 28272 99070 123069 112174 84640 71033 1521
15144A521o1623P2831K1030k0080M789K9050k8103q240K9705O6973j4900m5321
$$ 1521 -60102 12729 33759 13679 18468 47518 19415 11175 40880 107853 92953 47632
15132D7632o3547j0871k1513j8553N5146O9725M291m396q6915l2444M859P753
$$ 47632 -15915 -26786 -48299 -66852 -11706 58019 62310 57914 -29001 -61445 -56586 -48833
15120d8833J299L5180J1325L0109k5482j0404Q006Q113M395r832M096J5210n1898
$$ -48833 -47534 -12354 -1029 29080 3598 -6806 1200 9313 13708 3876 7972 23182 -28716
15107b8716l446K1147L2187J4598P352l3843m0282M972J8324O921J772N567J1200
$$ -28716 -32162 -11015 21172 35770 43122 9279 -31003 -26031 -7707 -786 986 6553 17753
15094A7753l0073k2568n4237j4629M1524M6602K8548k6329N073j041k1142k4031
$$ 17753 -12320 -34888 -89125 -103754 -62230 -15628 12920 -13409 -8336 -9377 -30519 -54550
15082e4550J5731N7991j7494l4447m5543o84P6011r539l3155N3181N9831j0508
$$ -54550 -38819 19172 1678 -32769 -78312 -78996 -2985 -12524 -45679 7502 67333 56825
15070E6825o0239k0485J0918M4328m365m2801P42j9259j2103K8454M000n0182
$$ 56825 -3414 -23899 -12981 31347 26982 -15819 -15077 -34336 -46439 -17985 -13985 -64167
15058f4167n6926J6614K8166k241J6679J4759k5496O56M8482N8033j8171Q544
$$ -64167 -121093 -104479 -76313 -78554 -61875 -47116 -72612 -71956 -23474 34559 16388 24932
15046B4932L1790j9926n7890l2205M8929J9716J0203L8842p988n790K4450L6156
$$ 24932 56722 36796 -21094 -53299 -4370 15346 25549 64391 56403 50613 75063 111219
15034A11219j7895j6660k6717l6790n1860N2665N0579n2807l743J7070L2278K5211
$$ 111219 93324 76664 49947 13157 -38703 13962 64541 11734 7991 25061 57339 82550
15022H2550k1306n0108n0045J2190j6859m5657L0747K2534K1895o8244n6855K9354
$$ 82550 61244 11136 -38909 -26719 -43578 -89235 -58488 -35954 -14059 -82303 -139158 -109804
15010a09804R8972P0998k496l7988O6560K9873j1538k3356O3341P4488M4490Q0148
$$ -109804 -10832 60166 57670 19682 86242 116115 104577 81221 144562 219050 263540 343688
14998C43688J20712K25862K44824R1150r5163k26649k78257k02675q9046j2007
$$ 343688 464400 690262 935086 1026236 931073 704424 426167 223492 134446 122439
14988A22439l7658k117J760j4551k3055j9354K257N6825J6408m8385o8945L2728
$$ 122439 84781 82664 84424 69873 46818 27464 29721 86546 102954 54569 -14376 18352
14976A8352K8577k0303M0106j2553m1753m6849Q24J0957N6150K9292M6134m8710
$$ 18352 46929 26626 66732 54179 12426 -34423 -33599 -22642 33508 62800 108934 60224
14964F0224k7596j3376K3997J9780N398k5882m0753p098k2439m6454O039k247
$$ 60224 32628 19252 43249 63029 68427 42545 1792 -5306 -27745 -74199 -68160 -70407
14952g0407K9310L3241k6938k0948p485j491K6075O0810j8643k1815k0557K9206
$$ -70407 -41097 -7856 -34794 -55742 -63227 -64718 -38643 22167 3524 -18291 -38848 -9642
14940i642K280m8361L8830l1102J2275N2983P5282K3449l2523l3101l4837l4169
$$ -9642 -7362 -55723 -16893 -47995 -35720 17263 92545 115994 83471 50370 15533 -18636
14928a8636N0301K1395n0371L795j1556m5261j8276K3573L2676N3548l6938l4630
$$ -18636 31665 53060 2689 6484 -5072 -50333 -68609 -45036 -12360 41188 4250 -30380
14916c0380o310K9059l90R518K2987J464J0603j4993K2347N3432K2q9809p9632
$$ -30380 -36690 -7631 -8021 1497 24484 25948 36551 21558 43905 97337 97359 7550 -72082
14903g2082J843J7534N5658L4743m5643l7246N5385O8045J1684K2256j4223p7910
$$ -72082 -70239 -52705 2953 37696 -7947 -45193 10192 78237 89921 112177 97954 20044
14891B0044K3022m7878m7065J2427K5877j5299n6742L1483J5677M053k5509Q358
$$ 20044 43066 -4812 -51877 -39450 -13573 -28872 -85614 -54131 -38454 -34401 -59910 -51552
14879e1552L9209k5237J5427L9929R273l9383J9214J2740j532R061l638j5975
$$ -51552 -12343 -37580 -22153 17776 27049 -12334 6880 19620 18088 27149 23511 7536
14867G536L160M518l7630l6165K0738k229K959j7803K5333K6850l1689j7942K5331
$$ 7536 10696 15214 -22416 -58581 -37843 -40072 -37113 -54916 -29583 -2733 -34422 -52364 -27033
14854b7033M3882j3885n5306P607L7327K0568M6K864m7k6652m846R391J8340J3235
$$ -27033 16849 2964 -52342 -44735 -7408 13160 13206 16070 16023 -10629 -15475 -6084 12256 25491
14840B5491O926P992l4692p0998l6871O936N4130O3062k7574k0416J9129N5047
$$ 25491 32417 40409 5717 -65281 -102152 -95216 -41086 21976 -5598 -26014 -6885 48162
14828D8162j702k6427m8095K2012j030m135K0966L0332k8811n0078j5030k4904
$$ 48162 46460 20033 -28062 -6050 -7080 -11215 9751 40083 11272 -38806 -53836 -78740
14816g8740l7784j6252M7112M5306k9019K6641N3020K662m4480J99J4114m613
$$ -78740 -116524 -132776 -85664 -40358 -69377 -42736 10284 12946 -31534 -31335 -17221 -21834
14804b1834j0825k0758J314L2617L4761O542m1693n6859k2630l357L6820k3473
$$ -21834 -32659 -53417 -52103 -19486 15275 21817 -19876 -76735 -99365 -102722 -65902 -89375
14792h9375J5427Q8332O4264l2255k0708m8615k2562M977J0934J8363L3077L1558
$$ -89375 -73948 14384 78648 46393 25685 -22930 -45492 -40515 -29581 -11218 21859 53417
14780E3417k2314k5720k0496j6596J1696M6708N4127j7418m3064j8446L5385L2291
$$ 53417 31103 5383 -15113 -31709 -20013 26695 80822 63404 20340 1894 37279 69570
14768F9570j8433k7244k0418m380K6622J0708j0764J2407L5272L814j2216R021
$$ 69570 51137 23893 3475 -905 25717 36425 25661 38068 73340 77154 64938 73959
14756G3959m4683l3815r871K650k4432L61N4777K0516l6080j9368M3384K8850
$$ 73959 29276 -4539 -14410 -11760 -36192 -35831 18946 39462 3382 -15986 27398 56248
14744E6248J3231m4593L130J1701j7737k4326L9587J5369O468n4648l9555j2216
$$ 56248 69479 24886 28016 39717 21980 -2346 37241 52610 59078 4430 -35125 -47341
14732d7341J2566K3612n67r61J3691P0564K1141j8329k7918q644N16K561R327
$$ -47341 -34775 -11163 -11730 -12691 1000 71564 92705 74376 46458 37814 38330 40891 50218
14719E0218K9371k552n7512J7988P263N7882q97J9712l1181m4044l8401j4783
$$ 50218 79589 77037 19525 37513 44776 102658 101761 121473 90292 46248 7847 -6936
14707f936j7142n1245k4734J6558L5409l1565N5642N6895j2697J6313K9014k4235
$$ -6936 -24078 -75323 -100057 -83499 -48090 -79655 -24013 32882 20185 36498 65512 41277
14695D1277j5595k8620q2695K0751K3037R569m1607l3620P92m5303J9641M0199
$$ 41277 25682 -2938 -85633 -64882 -41845 -32276 -73883 -107503 -106711 -152014 -132373 -92174
14683i2174M4375L836j6024Q371K8632k2529q619l8937N2446R7012K5038j7456
$$ -92174 -47799 -43963 -59987 -51616 -22984 -45513 -54132 -93069 -40623 56389 81427 63971
14671F3971K5553j9940m582k2452l0332K639K1774m424k8448L938O913N42J2135
$$ 63971 89524 69584 65002 42550 12218 14857 36631 32207 3759 7697 14610 15152 27287
14658B7287K2952O629J0226j7875r353l5108l6074N057R078j1114m1507k2357
$$ 27287 50239 56868 67094 49219 39866 4758 -31316 -26259 -17181 -28295 -69802 -92159
14646i2159M6386M8429j498m922r449N517k1545j093K5290O127L5318k1945n8975
$$ -92159 -45773 2656 1158 -3764 -13213 -7696 -29241 -30334 -5044 1083 36401 14456 -44519
14633d4519Q435M3725M5553o8215j3946L7360q621K6975L8661K3747R160m3628
$$ -44519 -36084 7641 53194 -15021 -28967 8393 -228 26747 65408 89155 98315 54687
14621E4687l5203k905J7158P437j475l6725K5256k2385Q712J1046p101m9432j923
$$ 54687 19484 16579 33737 41174 39699 2974 28230 5845 14557 25603 18502 -30930 -32853
14608c2853M445j0781m1801J0680P3819J1809J1599L3044K8784l5702n2258j2767
$$ -32853 -28408 -39189 -80990 -70310 3509 15318 26917 59961 88745 53043 785 -11982
14596a1982j4496j5578l1449J8765K6156n9977j5804M2278L9939J8646j552N7607
$$ -11982 -26478 -42056 -73505 -54740 -28584 -88561 -104365 -62087 -22148 -3502 -5054 52553
14584E2553J0692j4055k5096n787l1393l965O914j4519L515J8003N375O2943l644
$$ 52553 63245 49190 24094 18307 -13086 -17051 -10137 -24656 -21141 -3138 2237 65180 61536
14571F1536m2850j6858M0667J9816j8021j00755J0961K1551m595k6215J6278L6018
$$ 61536 18686 1828 42495 62311 44290 -56465 -45504 -23953 -28548 -54763 -38485 -2467
14559b467M1747k1112j9601K1982K2916K9339P311Q813l2890l7019N2009J9966
$$ -2467 39280 18168 -1433 20549 43465 72804 80115 88928 56038 19019 71028 90994
14547I0994n4693p550k5876l3775L2262L7045n579o3692P784J6250q045J6718
$$ 90994 36301 28751 2875 -30900 1362 38407 32828 -30864 -23080 -6830 -14875 1843
14535A843m4682N6842J9454l8391j0343j3450o227Q222K1395K3632K535j1502
$$ 1843 -42839 14003 33457 -4934 -15277 -28727 -34954 -26732 -5337 18295 20830 9328
14523I328m5835R607k697m1476k542N619N1304K6827L0877k5320J0875L2305j2420
$$ 9328 -36507 -26900 -29597 -71073 -73615 -67996 -16692 10135 41012 15692 26567 58872 46452
14510D6452j7809m7144m1213J7466O2442J2027j2050n428j8862K2333j963o412
$$ 46452 28643 -18501 -59714 -42248 20194 32221 20171 14743 -4119 18214 16251 9839
14498I839L1724m2846o8759K9682L2705K2557m0504J4602M5990k2165m8392j1145
$$ 9839 41563 -1283 -70042 -40360 -7655 14902 -25602 -11000 34990 12825 -35567 -46712
14486d6712K4997N2503L4925M3525l278p0866l8627M2846K2985O15j0634K6335
$$ -46712 -21715 30788 65713 109238 105960 35094 -3533 39313 62298 62913 52279 78614
14474G8614J4592k5153k0480q1l401n463L780L2020o3165m4205j6651L8093L0327
$$ 78614 93206 68053 47573 47492 44091 38628 42408 74428 11263 -32942 -49593 -11500 18827
14461A8827J4161k2669N299K1836q587l8170J3250N8640K3770K5451l0123l8306
$$ 18827 32988 10319 15618 37454 28867 -9303 3947 62587 86357 111808 81685 43379
14449D3379n1718l1100K0429J3279K0683R337m4676j5074K3489N8286k7489p3850
$$ 43379 -8339 -39439 -19010 -5731 14952 24289 -20387 -35461 -11972 46314 18825 -55025
14437e5025j8082L5120K6529O179n4439N710L9124m1918r660M3851k140K0306
$$ -55025 -73107 -37987 -11458 -5279 -59718 -54008 -14884 -56802 -66462 -22611 -24751 -4445
14425d445j0423j2266k575j5451L376K9044k8175q953L096n603L9879L816K181
$$ -4445 -14868 -27134 -29709 -45160 -41784 -12740 -40915 -49868 -46772 -52375 -12496 -8680 -6499
14412f499M357Q238j336J438l617J2694J8651N2701j2861J0947L3035l8776n3249
$$ -6499 -2142 6096 4760 6198 2581 15275 33926 86627 73766 84713 117748 78972 25723
14399B5723j5837l8181K8993K835j7085O445J7563j2427n8648j5749L2460n276
$$ 25723 9886 -28295 698 3533 -13552 -7107 10456 -1971 -60619 -76368 -43908 -49184
14387d9184L847K3783J166K0177M5951J8524o7311m4738M4751L3168P471q2294
$$ -49184 -45337 -21554 -20388 -211 45740 64264 -3047 -47785 -3034 30134 37605 -44689
14375d4689m9264L5389K6516R606p498k2672o542L3219k1519k13L506j1394j6062
$$ -44689 -93953 -58564 -32048 -22442 -29940 -52612 -59154 -25935 -47454 -47667 -44161 -55555 -71617
14362g1617N2350L5298l9853J3053N876L6893k5824R759K3493l1398l2476o236
$$ -71617 -19267 16031 -23822 -10769 -4893 32000 6176 15935 39428 8030 -24446 -30682
14350c0682k3858M9248M0984m9243l7837N9067J1540j764N178M900j614J5180
$$ -30682 -54540 -5292 35692 -13551 -51388 7679 19219 17455 22633 27533 25919 41099
14338D1099M6310k3691k1163L581m951J8439l1518k0126n618j2511M3531M9444
$$ 41099 87409 63718 42555 46136 41185 59624 28106 7980 2362 -10149 33382 82826
14326H2826q906n1090k8446J7211O5426j4294o5237n4385L5491R014o170M3299
$$ 82826 73920 22830 -5616 11595 77021 62727 -2510 -56895 -21404 -12390 -18560 24739
14314B4739L2505l2471l3405L0768J7873m6459j4786q748k1722l7547L4555P7622
$$ 24739 57244 24773 -8632 22136 40009 -6450 -21236 -29984 -51706 -89253 -54698 22924
14302B2924j6648l0960J3178k5970Q539K8646r327J1318J1224P304M0605O39k0543
$$ 22924 6276 -24684 -11506 -37476 -28937 -291 -9618 1700 12924 20228 60833 61472 40929
14289D0929j1318R880j5612k098k6820j6958l665J685j1795n9642m3959L8927
$$ 40929 29611 39491 23879 21781 -5039 -21997 -25662 -23977 -35772 -95414 -139373 -100446
14277a00446O4824J5267P0698J3119m0276M6796N1240m9595m4684L4796l4260
$$ -100446 -35622 -20355 50343 63462 23186 69982 121222 71627 26943 61739 27479
14266B7479j1597K1355k1088l0711l0101K8138m595o951l9264K9237K1475K7673
$$ 27479 15882 37237 16149 -14562 -44663 -16525 -21120 -28071 -67335 -38098 -16623 11050
14254A1050j575N2982p271J1276l0362m2245K4585M5774K0692l7036m1809J7199
$$ 11050 9475 62457 55186 66462 36100 -6145 18440 64214 84906 47870 6061 23260
14242B3260K5399l1707l4119m8330K8001K011k1672j2734j3371M0025N2401N0686
$$ 23260 48659 16952 -17167 -65497 -37496 -35485 -57157 -69891 -83262 -43237 9164 59850
14230E9850M532n5088K738M5479K9961k774q4756p6095m031N8031O7423K2188
$$ 59850 64382 9294 12032 57511 87472 84698 -58 -76153 -80184 -22153 45270 67458
14218F7458p542p4226J0953j3997J7519L1136L6541O2162Q948q1673L0701l4574
$$ 67458 59916 -14310 -3357 -17354 165 31301 67842 130004 138952 57279 87980 53406
14206E3406m1251K539L1111m2335k8490M1358J0244r786k1338M6717k2124J269
$$ 53406 12155 14694 45805 3470 -25020 16338 26582 16796 -4542 42175 20051 21320
14194B1320N1932L988k0757o0767m1687j5108k6919n78P1834L1039j1601P434
$$ 21320 73252 77240 56483 -4284 -45971 -61079 -87998 -88576 -16742 14297 2696 10130
14182A0130M5898r980j6361k1626K0218j0183j7164J6588J5262p894o1920l0629
$$ 10130 56028 46048 29687 8061 28279 18096 932 17520 32782 24888 -37032 -67661
14170f7661Q911P25l7108J9837O488m303L4126J9422M7451R9165K4235j07787
$$ -67661 -58750 -58025 -95133 -75296 -68808 -73111 -38985 -19563 27888 127053 151288 43501
14158D3501n7912j5990L4847M030J3425J2025L700n1019k7332K1373L901j7809
$$ 43501 -14411 -30401 4446 8476 21901 33926 37626 -13393 -40725 -19352 -15451 -33260
14146c3260l3231J6435N1216J657K6107K6101p2805n1988K0374R837q075n8617
$$ -33260 -66491 -50056 1160 2817 28924 55025 -17780 -69768 -49394 -39557 -47632 -106249
14134a06249k9229K6519P5659J9730l0210j5268O3101O4730K9827n063J979l044
$$ -106249 -135478 -108959 -33300 -13570 -43780 -59048 4053 68783 98610 93547 95526 92482
14122I2482K119j6820j5454j5820n19q104j2286m7926O360o788j0309k5678N2001
$$ 92482 94601 77781 62327 46507 45988 37884 25598 -22328 -15968 -22756 -33065 -58743 -6742
14109f742L2204k3838k9975k2329L5608N0530L2290J406k4658R481J2135l3947
$$ -6742 25462 1624 -28351 -50680 -15072 35458 67748 69154 44496 53977 66112 32165
14097C2165J242m0823j715J5472m3844j3620k518n6195l947J1078O3992O0501
$$ 32165 33407 -7416 -9131 6341 -37503 -51123 -53641 -109836 -113783 -102705 -38713 21788
14085B1788N975k6653J22J9292l916j5293K7001j4749r1922l0619K386K5118K9926
$$ 21788 27763 1110 1232 20524 16608 1315 28316 13567 -78355 -108974 -106588 -81470 -51544
14072e1544N5764O8265M0097o159m4718J0469l5575j3846m1042k5238J0162J6936
$$ -51544 4220 72485 112582 106423 61705 72174 36599 22753 -18289 -43527 -33365 -16429
14060a6429l2268M0703K1122l8274R253j4215r459K9917K27k612k0229J6256J0638
$$ -16429 -48697 -7994 13128 -25146 -15893 -30108 -39567 -9650 -9423 -12035 -32264 -16008 -5370
14047e370L212k388J9078P064K1769M711m5682k7588J53l9344L3926K8662N449
$$ -5370 -2158 -4546 14532 21596 43365 48076 2394 -25194 -25041 -64385 -30459 -1797 3652
14034C652J841J4072J4226j6607l5046m3800l765R021K1952N6977M3798m9339
$$ 3652 5493 19565 33791 17184 -17862 -61662 -65427 -56406 -34454 22523 66321 16982
14022A6982Q823k1905q842N554N064l4992l1482j4017L5282R108J4464K5408J3508
$$ 16982 25805 3900 -4942 612 5676 -29316 -60798 -74815 -39533 -30425 -15961 9447 22955
14009B2955M4561J307l2393P009l3055p481N7054j5407k5946L6443K9812k8873
$$ 22955 67516 68823 36430 43439 10384 2903 59957 44550 18604 55047 84859 55986
13997E5986n652M5798q633k6216P82J3467k0421l0770n0360M3263O3499j7635
$$ 55986 50334 96132 87499 61283 62065 75532 55111 24341 -26019 17244 80743 63108
13985F3108p9701J6192Q133J5434q432L579M9433l5230r463J8496M8261J080n3141
$$ 63108 -16593 -401 7732 23166 14734 18313 67746 32516 23053 41549 89810 90890 37749
13972C7749n5217J983K3760m3785l6119M1844L5764J7080o566k6030K2521J9637
$$ 37749 -17468 -15485 8275 -35510 -71629 -29785 5979 23059 16493 -9537 12984 32621
13960C2621L2616k2328j0043l7676n1056p025L0680L2169N6060j0741j6221J3132
$$ 32621 65237 42909 32866 -4810 -55866 -62891 -32211 -42 56018 45277 29056 42188
13948D2188M4005j4494m1367K586J7494J0541r038l1998K3163L5209P9999j8615
$$ 42188 86193 71699 30332 32918 50412 60953 51915 19917 43080 78289 158288 139673
13936A39673n6631o1990p2508k2199N4196L1270l818K4567l9416j0627j8919O097
$$ 139673 83042 21052 -51456 -73655 -19459 11811 7993 32560 -6856 -17483 -36402 -30305
13924c0305m4182j1320k037k1239M4871M8428K5100k1728k2303m34N863L3515
$$ -30305 -74487 -85807 -87844 -109083 -64212 -15784 9316 -12412 -34715 -35149 -29286 4229
13912D229L272j5713k9507l2077J2657M4390l7796K6200P1815k1909l2646l6493
$$ 4229 7501 -8212 -37719 -69796 -57139 -12749 -50545 -24345 47470 25561 -7085 -43578
13900d3578K7561J7604o6805J2438R6791k9701k2025J3539O663M7689k3697m9206
$$ -43578 -16017 1587 -65218 -52780 44011 14310 -7715 5824 12487 60176 36479 -12727
13888a2727l8098L098P779k1511L2221J9999L549J76P515J0583j2496J9361J5309
$$ -12727 -50825 -47727 -39948 -61459 -29238 -9239 -5690 -5514 2001 12584 88 19449 34758
13875C4758j6892P296n3212l636j6772M1809j8414q465K9384l1526k4819k4418
$$ 34758 17866 25162 -28050 -31686 -48458 -6649 -25063 -33528 -4144 -35670 -60489 -84907
13863h4907J0307L622N741N729P486R011M0866K8181K5580m356M86m3955O173
$$ -84907 -74600 -70978 -65237 -59508 -52022 -43011 -2145 26036 51616 47260 47746 3791 9964
13850I964L9535j2866l276k2229J6568J6257o7809j916k5787k4954M4671K7087
$$ 9964 49499 36633 33357 11128 27696 43953 -23856 -25772 -51559 -76513 -31842 -4755
13838d755J849N3759L7967n3389m2244k6528N485J920N2941J02861m8589o7125
$$ -4755 -2906 50853 88820 35431 -6813 -33341 -27856 -25936 27005 129866 81277 14152
13826A4152n1234q301K6439K8317R1496J3839p3600n6077k5831M0362k4376M6319
$$ 14152 -37082 -45383 -18944 9373 100869 114708 41108 -14969 -40800 -438 -24814 21505
13814B1505K0593j2222J6468o338L0985l4343k2425n110K6894O453o810J3890
$$ 21505 42098 29876 46344 40006 70991 36648 14223 9113 36007 42460 35650 49540
13802D9540k5140K631K3710M9161k4890p2733k3932N0641M1786P6280M944o0666
$$ 49540 24400 27031 50741 99902 75012 2279 -21653 28988 70774 147054 151998 91332
13790I1332o1072l8205j1191Q5753M5470K2019j1192q1648n6150M722J3280p91
$$ 91332 30260 -7945 -19136 66617 112087 134106 122914 41266 -14884 -10162 3118 2327
13778B327l0333J6657J4224L4172L2244L1168o3099l1073J2962K5845m178N217
$$ 2327 -28006 -11349 2875 37047 69291 100459 37360 6287 19249 45094 40916 46133
13766D6133O3744O518l338k7894n7191k0517M7845K086K6874j2510j8646K8941
$$ 46133 109877 116395 113057 85163 27972 7455 55300 57386 84260 71750 53104 82045
13754H2045l3165q1398l8516j874l049K7811M4400L8368J3403k3404p640j1703
$$ 82045 48880 -32518 -71034 -72908 -75957 -48146 -3746 34622 48025 24621 16981 5278
13742E278k2096N58o1L2563J6250K2261j8211P917L9073M3669m9639m3210j7995
$$ 5278 -16818 -16260 -16321 16242 32492 54753 36542 44459 83532 127201 77562 34352 16357
13729A6357n9926J0976N4250o891k7963N477L8016J3593P293L3899m5906o3937
$$ 16357 -43569 -32593 21657 14766 -13197 -7720 30296 43889 51182 85081 39175 -24762
13717b4762J1926N7127j9702J6004J837j7163N709R179M1021l4009m5130l0039
$$ -24762 -12836 44291 24589 40593 42430 25267 30976 40155 81176 47167 2037 -28002
13705b8002j1285L5525K493J8319j1933L3279l8175m0278l2267j4829J6757K9430
$$ -28002 -39287 -3762 -1269 17050 5117 38396 221 -40057 -72324 -87153 -70396 -40966
13693d0966K7845l968K2058L7317l8125l491J0901m2102n7382j1883O6739L3201
$$ -40966 -13121 -17089 4969 42286 4161 670 11571 -30531 -87913 -99796 -33057 144
13681A44j9976K0860L0025K6457M27n120K807N985m5250k0815K7258l5216l9495
$$ 144 -19832 1028 31053 57510 57937 52817 55624 61609 16359 -4456 22802 -12414 -51909
13668e1909M4622O4816J6870J279J8344j0854m721q874j5700n25n7990l6342J9057
$$ -51909 -7287 57529 74399 75678 94022 83168 78447 69573 53873 53348 -4642 -40984 -21927
13655b1927m272j666J4895M2585m484K870L8740L1161j5955K3833N1550N8785
$$ -21927 -26199 -27865 -12970 29615 25131 28001 66741 97902 81947 105780 157330 216115
13643B16115J6810n1804l2331j4715l8590k0477m794k6741j1738J5364O1506R3439
$$ 216115 232925 181121 148790 134075 95485 75008 70214 43473 31735 47099 108605 202044
13631B02044l9182m3580m5509n512J9593j8445m3445J915K7810L4193L7993m325
$$ 202044 162862 119282 73773 68261 87854 69409 25964 27879 55689 89882 127875 123550
13619A23550l9072n569M8115j8120l4028l5371J7122J751n1601l3485q643K3420
$$ 123550 84478 78909 127024 108904 74876 39505 56627 58378 6777 -26708 -35351 -11931
13607a1931L0833J7984L4281k5224k5220j8629L9187Q171K848R747l7656P338
$$ -11931 18902 36886 71167 45943 20723 2094 41281 49452 52300 62047 24391 31729
13595C1729J3148J079j6877j1970l8906L9496M0520j730m6649q126j6388p989
$$ 31729 44877 45956 29079 17109 -21797 17699 58219 56489 9840 1714 -14674 -22663
13583b2663m491K5918M8917q523l6338M6033J8077j7830j4636l1358k5842l501
$$ -22663 -27154 -1236 47681 39158 2820 48853 66930 49100 34464 3106 -22736 -26237
13571b6237K3210j8515J9980K6873O364o066l4521n2699j2859Q630J7292N6637
$$ -26237 -3027 -21542 -1562 25311 31675 25609 -8912 -61611 -74470 -65840 -48548 8089
13559H089k0706L073M5996k1591L6436l4529l7626Q515N515L9679N6578K2738
$$ 8089 -12617 -9544 36452 14861 51297 16768 -20858 -12343 -6828 32851 89429 112167
13547A12167K3641l1543n5668l784k8922k8999J9525j759k5164q483M1183J5879
$$ 112167 135808 104265 48597 44813 15891 -13108 6417 4658 -20506 -28989 12194 28073
13535B8073L8474k3055k5864N718j4479N771L1704l6309n4183J7851K8463n1329
$$ 28073 66547 43492 17628 23346 8867 14638 46342 10033 -44150 -26299 2164 -49165
13523d9165q363L6400J1810L903K4805J5591K2792r276n3452m6378L6466N0646
$$ -49165 -57528 -21128 -9318 -5415 19390 34981 57773 48497 -4955 -51333 -14867 35779
13511C5779L2656m230q242K0318K7989l6000k7504N2053R977N621k37j6439l4769
$$ 35779 68435 64205 55963 76281 104270 68270 40766 92819 102796 108417 108180 91741 56972
13498E6972J9664J1619l5817J853K1798p78K9555l5261K1624K5627J2137r559
$$ 56972 76636 88255 52438 54291 76089 75311 104866 69605 91229 116856 128993 119434
13486A19434k2663k58k5810j9048j7381l8572j4246L2254l3274m1102l9507M8042
$$ 119434 96771 96513 70703 51655 34274 -4298 -18544 13710 -19564 -60666 -100173 -52131
13474e2131M6835K8817J8366m1269r077L0880k0790L0537O3241o6628m6700k2529
$$ -52131 -5296 23521 41887 618 -8459 22421 1631 32168 95409 28781 -17919 -40448
13462d0448M993J0230N049j2888L7223L4446K4827L134J27L927n0528j2126J8689
$$ -40448 -35455 -25225 -20176 -33064 4159 38605 63432 66566 66693 70620 20092 7966 26655
13449B6655L8869J715J2366M037k5942K4296O040j0281k5122L5805o192m3923
$$ 26655 65524 67239 79605 83642 57700 81996 88036 77755 52633 88438 82246 38323
13437C8323r334O3466m4334m7407k6900N6504N8332k4504J2254J2234j0488K1022
$$ 38323 28989 92455 48121 714 -26186 30318 88650 64146 76400 88634 78146 99168
13425I9168M547n3645m3909J9969r090J5254l7763j7831q598L3811J9013m206
$$ 99168 103715 50070 6161 26130 17040 32294 -5469 -23300 -31898 1913 20926 16720
13413A6720K3738k1930J5738p7283k5690N3841L897l0032K0387J4223j434l7284
$$ 16720 40458 18528 34266 -43017 -68707 -14866 -10969 -41001 -20614 -6391 -7825 -45109
13401d5109L8392M7097P381O374m2657R90q213k8796m8980K6380N0749K7649M867
$$ -45109 -6717 40380 47761 54135 11478 12468 4255 -24541 -73521 -47141 3608 31257 36124
13388C6124O605k7356O0771K8270R327L7783m0066p2230m3581l4843J2332J9352
$$ 36124 42729 15373 76144 104414 113741 151524 111458 39228 -4353 -39196 -26864 -7512
13376g512N346L4729k9514J7281N1230J3731q438K2578J4247k5202J0215p230
$$ -7512 -2166 32563 3049 20330 71560 85291 76853 99431 113678 88476 98691 91461
13364I1461m8816M494m108K5626R74j4200j284l4232N2215m1760J812K2168Q262
$$ 91461 42645 47139 43031 68657 69631 55431 54147 19915 72130 30370 32182 54350 62612
13351F2612j2150R466j676k0012j1375M3496p112n095l2785M662K3839n944K8824
$$ 62612 50462 59928 58252 38240 26865 70361 63249 58154 25369 30031 53870 47926 76750
13338G6750J2947o6391k3185q8000j1030Q8755K6552K1891J8189M8138j6879k775
$$ 76750 89697 23306 121 -87879 -98909 -10154 16398 38289 56478 104616 87737 84962
13326H4962n3551L0923Q155K172O4616m586n731j590m7219k5172N9140j3942K6234
$$ 84962 31411 62334 70489 72661 137277 132691 126960 125370 78151 52979 112119 98177 124411
13313A24411K4349J7803J2119J3642J8474j359j7911m6094j6355j8793j6071m3050
$$ 124411 148760 166563 178682 192324 210798 209439 191528 145434 129079 110286 94215 51165
13301E1165l36r997k5406k2817M7052M0872l7051j294M3534K4081L1212l6041
$$ 51165 50829 40832 15426 -7391 39661 80533 43482 42188 85722 109803 141015 104974
13289A04974n4463l311l993J5941k995K2474J3731r394k8726j0831J0267M5454
$$ 104974 50511 47200 43207 59148 56153 78627 92358 82964 54238 43407 53674 99128
13277I9128N3327L7313L9547l4187p49Q44m4444m502m6598n2754L1694j5931R317
$$ 99128 152455 189768 229315 195128 194379 195223 150779 146277 99679 46925 78619 62688 72005
13264G2005J2364l6573P619l1468j1295M5901N1318O4937Q3790O232o9832j2894
$$ 72005 84369 47796 55415 23947 12652 58553 109871 174808 258598 264830 194998 182104
13252A82104M2202l3860m2146L486K0281j0904m3324N054j3133j9295k2920m0793
$$ 182104 224306 190446 148300 151786 172067 161163 117839 122893 109760 90465 67545 26752
13240B6752j2463L7540K2140k5527j8974j9618N2794K4558Q919k5653J3187j9573
$$ 26752 14289 51829 73969 48442 29468 9850 62644 87202 96121 70468 83655 64082
13228F4082l7874j7447L2650P3707K5532R471k2985N95K886o465J0703m3401L3284
$$ 64082 26208 8761 41411 115118 140650 150121 127136 127731 130617 124152 134855 91454 124738
13215A24738M8850n751p7034j1262l005n2056J8140P213R144k3691M605J2446
$$ 124738 173588 167837 90803 79541 76536 24480 42620 49833 58977 35286 39891 52337
13203E2337m0679J1649K5615M892K038l1337p523J0222q955L4572K2464M3790
$$ 52337 11658 23307 48922 53814 55852 24515 16992 27214 18259 52831 75295 119085
13191A19085m0924n508j7119k930K3755K7177N1292k3923n1298n9589p572q772
$$ 119085 78161 72653 55534 52604 76359 103536 154828 130905 79607 20018 12446 3674
13179C674N760k2841K7620M5467J6172K9008j3796n8705J5796M3414m0589o2462
$$ 3674 9434 -13407 14213 59680 75852 104860 91064 32359 48155 91569 50980 -11482
13167a1482m410J2511j772j7397M024K5208j5487k7915K1487M5036J2226J0780
$$ -11482 -15892 -3381 -5153 -22550 -18526 6682 -8805 -36720 -15233 29803 42029 52809
13155E2809l0204k0105L0333m564J0620j2924J0665L9363n2738k2363n6291J6094
$$ 52809 22605 2500 32833 28269 38889 25965 36630 75993 23255 892 -55399 -39305
13143c9305N1015L6117L6092j2886n4599k019m674J9430n581J9014M1353j7200
$$ -39305 11710 47827 83919 71033 16434 14415 9741 29171 23590 42604 83957 66757
13131F6757n220l7812m1118K4879k2682k5990l0579J0281k5773J6058K4373M1015
$$ 66757 61537 23725 -17393 7486 -15196 -41186 -71765 -61484 -87257 -71199 -46826 -5811
13119e811J9527r044j1053o814K3127J450J4324N4116O2628M7927n051q6595l5057
$$ -5811 13716 4672 -6381 -13195 9932 11382 25706 79822 142450 190377 185326 98731 63674
13106F3674l4011q817L4605O90k8764L5802N2141M092n2992L1087K095j4362K9690
$$ 63674 29663 20846 55451 56141 27377 63179 115320 119412 66420 97507 99602 85240 114930
13093A14930M1134l9309q0672O769J3308J1433K1283L5675n5980m392k3632N508
$$ 114930 156064 116755 36083 42852 56160 67593 88876 124551 68571 64179 40547 46055
13081D6055K0746J1926l5304o2242K3069R704L0296k2232N7779K9235l0925j0231
$$ 46055 66801 78727 43423 -18819 4250 13954 44250 22018 79797 109032 78107 67876
13069F7876l4615k9474J3729K2791K2504L505r075o0834j4267N0509J0251k2938
$$ 67876 33261 3787 17516 40307 62811 66316 57241 -3593 -17860 32649 42900 19962
13057A9962J0048j0040J1398M9670P843K1947m6397k7935r95M4336L4191k756
$$ 19962 30010 19970 31368 81038 88881 110828 64431 36496 35501 79837 114028 111272
13045A11272o0552k5768K5393J6843k1806K3509L4129j8914m9208n052m105o703
$$ 111272 50720 24952 50345 67188 45382 68891 103020 84106 34898 29846 25741 19038
13033A9038L4291j9314k4596r102J4932J355m3481J1474N4805M1366l9359J994
$$ 19038 53329 34015 9419 317 15249 16604 -26877 -15403 39402 80768 41409 43403
13021D3403L393J7941J5763n4434o1763L1801O1428L0628j5156q8062j6262L5730
$$ 43403 46796 64737 80500 26066 -35697 -3896 57532 88160 73004 -15058 -31320 4410
13009D410J2131j2933L8316K5429J318L2677l7914j3474K4398q428k6907K8976
$$ 4410 16541 3608 41924 67353 68671 101348 63434 49960 74358 65930 39023 67999
12997F7999j9149J6140n285l8087K9356m5495m486j535L5278o83q16J0068J5853
$$ 67999 48850 64990 59705 21618 50974 5479 993 -542 34736 34053 33237 43305 59158
12984E9158L4343N8105p8173l6461j0915j355n9625l328K8379R3290P1559L486
$$ 59158 93501 151606 73433 36972 26057 24702 -34923 -38251 -9872 83418 154977 158463
12972A58463n3484n3088k8708J3594j2366L3532L5548l1825p2931K3240N1070
$$ 158463 104979 51891 23183 36777 24411 57943 93491 61666 -11265 11975 63045
12961F3045L387q528L3162j3048l0726L5487k1273l693N3480J9285k5044m483
$$ 63045 66432 57904 91066 78018 47292 82779 61506 57813 111293 130578 105534 101051
12949A01051m3333n0332J7826K6658L3596j6108l4737j2244K8240m1393R7250
$$ 101051 57718 7386 25212 51870 85466 69358 34621 22377 50617 9224 106474
12938A06474M886m6908l1456l392M5903j8403J2954l6243K0470l8444r971L6988
$$ 106474 111360 64452 32996 29604 75507 57104 70058 33815 54285 15841 5870 42858
12926D2858M5132o5856K3901m184n5184J7239M7489n618k3720j3043J05461P8601
$$ 42858 87990 22134 46035 41851 -13333 3906 51395 45777 22057 9014 114475 193076
12914A93076k4100l6842n9292k9901l9913j0762N386k0860l7271J8158J590J634
$$ 193076 168976 132134 72842 42941 3028 -7734 -2348 -23208 -60479 -42321 -40731 -39097
12902c9097L2877P1292O1744j4440k7145J3412q75p6959l231M3902L4156l2753
$$ -39097 -6220 65072 126816 112376 85231 98643 97768 20809 17578 61480 95636 62883
12890F2883K2932K8580j1097j2403n5596o0549n2824M9051K4684L5559L5188l5586
$$ 62883 85815 114395 103298 90895 35299 -25250 -78074 -29023 -4339 31220 66408 30822
12878C0822J7107q451q062j0162j8594J0863L0893M0259M4750L58l1775m7246
$$ 30822 47929 39478 31416 21254 2660 13523 44416 84675 129425 129783 98008 50762
12866E0762n0650M7262N1560m2695j3300L6692m878K6695K385K5409j3376l7582
$$ 50762 112 47374 98934 56239 42939 79631 74753 101448 103833 129242 115866 78284
12854G8284k4592L7882J7906k7199k9346K9493O22Q101J8944J7766j2861n7771
$$ 78284 53692 91574 109480 82281 52935 82428 83050 91151 110095 127861 115000 57229
12842E7229k042l0438r790O313k4279n3729J1840L5029L1569L6388M7201m9257
$$ 57229 55187 24749 14959 21272 -3007 -56736 -44896 -9867 21702 58090 105291 56034
12830E6034J01L0859M0934k3714k7842j1911k1347J1140L373K1950K2454L3757
$$ 56034 56135 86994 127928 104214 76372 64461 43114 54254 57627 79577 102031 135788
12818A35788K3875j7759k2637n0939J012K4729R311j4185r0508J7711M7117K1843
$$ 135788 159663 141904 119267 68328 69340 94069 103380 89195 -1313 16398 63515 85358
12806H5358j8425q241L6953P503l1755k9102j3786M2160R0652M0168j9502q306
$$ 85358 66933 58692 95645 103148 71393 42291 28505 70665 161317 201485 181983 173677
12794A73677j9776m4475m1418k0577J2582Q003p690k415K0158M9748P3717q902
$$ 173677 153901 109426 68008 47431 60013 68016 60326 57911 78069 127817 201534 192632
12782A92632o5565n1877k2127n287j2187M3476P393m0397J2732M3667k9326n3242
$$ 192632 127067 75190 53063 47776 35589 79065 86458 46061 58793 102460 73134 19892
12770A9892k82J7867P047K8765k1204n8646n81K0531K9715N9215J0391N7114k5435
$$ 19892 19610 37477 44524 73289 52085 -6561 -7142 13389 43104 102319 112710 169824 144389
12757A44389m5841M0192k1532n2770P057o5793K9351R3477K2819j5589R657k9079
$$ 144389 98548 138740 117208 64438 71495 5702 35053 128530 151349 135760 145417 116338
12745A16338M710J9323N791k6173o5127M922M9629K191J4127l7266l3105J674
$$ 116338 121048 140371 146162 119989 54862 59784 109413 111604 125731 88465 55360 57034
12733E7034K9891n387O485J5738K2305L6562l3589J4890N3654o8096l8258m484
$$ 57034 86925 81538 88023 103761 126066 162628 129039 143929 197583 129487 91229 86745
12721H6745l452J6513m9070J2627j5282K5766r408m452O8401O373M006q199K9969
$$ 86745 83293 99806 50736 63363 48081 73847 64439 59987 128388 134761 138767 130568 160537
12708A60537J5433o3040o0104q789p30j0361j1785O9957N3162M0373j3059r7129
$$ 160537 175970 112930 52826 44037 43307 32946 21161 91118 144280 184653 171594 74465
12696G4465j09171L884R8937O5548K765j0885l6536j5875m9916K9355J4204k7557
$$ 74465 -34706 -30822 68115 133663 136428 125543 89007 73132 23216 52571 66775 39218
12684C9218j6463R964J1298j6312O6848L6489O008j7933l5505o9637n404K1527
$$ 39218 22755 32719 44017 27705 94553 131042 137050 119117 83612 13975 8571 30098
12672C0098K20K4386L196R949J2854l73j2553M2510M3359P922O634k5394j1566
$$ 30098 30318 54704 57900 67849 80703 80330 67777 110287 153646 161568 168202 142808 131242
12659A31242N245l8334j9867j8048K976l3525k884M3370L0627M9437o56j3966
$$ 131242 136487 98153 78286 60238 63214 29689 26805 70175 100802 150239 149583 135617
12647A35617r08Q5918M2651n0327k8793o0003J6647J7244L6168J1226n2208o7635
$$ 135617 134709 220627 263278 212951 184158 124155 140802 158046 194214 205440 153232 85597
12635H5597l1057P209J0027r178j3231K0001Q689M1521K1709K1948j4750k2310
$$ 85597 54540 61749 71776 62598 49367 69368 78057 119578 141287 163235 148485 126175
12623A26175k4340K7089O390j7903j2555k535M9730j540J3656j0439k7116L791
$$ 126175 101835 128924 135314 117411 104856 102321 152051 150511 164167 153728 126612 130403
12611A30403n1391k7112k006p643J0201m8942O7523N6115K8323m2568K082K6148
$$ 130403 79012 51900 49894 42251 52452 3510 71033 127148 155471 112903 114985 141133
12599A41133o904o0793r193j1282M266M2333m051l9201N09N4149K1881m5405R536
$$ 141133 134229 73436 64243 52961 57227 99560 95509 56308 56817 110966 132847 87442 96978
12586I6978R885L5592M304k5555K8801M3471r571r530m0303m7333K9642J7895
$$ 96978 106863 142455 146759 121204 150005 193476 183905 174375 134072 86739 116381 134276
12574A34276M716n9183m7839Q1763J4456k4262k601J2920j5162P3879J9305Q487
$$ 134276 138992 79809 31970 113733 128189 103927 101326 114246 99084 172963 192268 200755
12562B00755m8757m5729O30M5980R254j9461o891K737k9810l2216J395l1699J5118
$$ 200755 151998 106269 106899 152879 162133 142672 135781 138518 108708 76492 77887 46188 61306
12549F1306J8518L97O745L5350K1872k3657l1588L1099L76l2159J8145j073O889
$$ 61306 79824 80221 86966 122316 144188 120531 88943 120042 120418 88259 106404 105331 112220
12536A12220p59O3152N4659m1329j6327m9738l4006k0331L0272N8256k7879J6502
$$ 112220 111461 174613 229272 187943 171616 121878 87872 67541 97813 156069 128190 144692
12524A44692J9591o832m2820J5282n0877j0167P4785P721j844K2943k5535k6432
$$ 144692 164283 157451 114631 129913 79036 68869 143654 151375 149531 172474 146939 120507
12512A20507K4255k4032N999O280J5014M1287O271n7213j9245M0997j3817K381
$$ 120507 144762 120730 126729 133009 148023 189310 195581 138368 119123 160120 146303 148684
12500A48684k9973O403K9379L5178J7852L5587K5398l9982k466j6916K4052q337
$$ 148684 118711 125114 154493 189671 207523 243110 268508 228526 226060 209144 233196 224859
12488B24859o0593l5785J4855J32J3503L542J5418L8537M4673l581K9972L71r574
$$ 224859 164266 128481 143336 143468 156971 160513 175931 214468 259141 255560 285532 285903 276329
12475B76329O835K7162j4817O6957P1637N0249Q9965Q9314Q5502J23228J90188
$$ 276329 283164 310326 295509 362466 434103 484352 574317 663631 749133 872361 1062549
12464A062549J41678Q4595P5976O6459k1224r8032m5014q7631j48182j72418j57540
$$ 1062549 1204227 1288822 1364798 1431257 1410033 1312001 1266987 1179356 1031174 858756 701216
12453G01216q1771m5008n7054k1357j6572l8597o5594n8452k9389M08j6873k9081
$$ 701216 619445 574437 517383 496026 479454 440857 375263 316811 287422 287830 270957 241876
12441B41876j15859j6120K5544o022n816L185m4722J0957L3827L1653j3359j2587
$$ 241876 126017 109897 135441 129419 123603 126788 82066 93023 126850 158503 145144 132557
12429A32557K1168K8869K5269P774m492j8950n010J8438L3486j5940l2966r749
$$ 132557 153725 182594 207863 215637 211145 192195 187185 205623 239109 223169 190203 180454
12417A80454k525m3870k1731L0074Q263o357M7720k2160j9085J0226j8002P5588
$$ 180454 177929 134059 112328 142402 150665 144308 192028 169868 150783 161009 143007 218595
12405B18595M1175k5217j4687J6995j301m2177J6261N754o8872r357M9363m2589
$$ 218595 259770 234553 219866 236861 235560 193383 209644 215398 146526 137169 186532 143943
12393A43943J1089k418l9790O984L6661P4825Pl5971M914J781k0254M296K1J0451
$$ 143943 155032 152614 112824 119808 156469 231294 231301 195330 200244 202025 181771 186067 186088 196539
12379A96539j1397O3929L4402n7708p2149l0762O1582L4895L1605q904l0265n9980
$$ 196539 185142 249071 283473 225765 153616 122854 184436 219331 250936 242032 211767 151787
12367A51787K4779L0503j9894P044M3598L5439J0169j3034l1370J8967p520J0613
$$ 151787 176566 207069 187175 194219 237817 273256 283425 270391 239021 257988 250468 261081
12355B61081n114n5907k0179K536j4786p820k6666m0034J2071J3837K4501M9047
$$ 261081 255967 200060 179881 182417 167631 159811 133145 93111 105182 119019 143520 192567
12343A92567N5504l1976j0939M843L3431K8608m6235j5430K7793M4738J1695l2496
$$ 192567 248071 216095 205156 209999 243430 272038 225803 210373 238166 282904 294599 262103
12331B62103l3151L9488J6334o2099L9944K0306N3134J9948k6931k7284p3122
$$ 262103 228952 268440 284774 222675 262619 282925 336059 356007 329076 301792 228670
12320B28670N385Q3891k1020J2598K6211j7928q73m5147L6669P994R627J2330
$$ 228670 234055 317946 296926 309524 335735 317807 316934 271787 308456 316450 326077 338407
12308C38407k806J6755M397J3896J5428n777l0603M8208K1380k0747n346L7114
$$ 338407 335601 352356 356753 370649 386077 380300 349697 397905 419285 398538 393192 430306
12296D30306j3606j3289K220J6493l346k3682n8118J2392k2834l2021l8461J6053
$$ 430306 416700 403411 405631 422124 418778 395096 336978 349370 326536 294515 256054 272107
12284B72107j078J7868K935M058m7118J5169K0788k022k8050k8013p792K1711
$$ 272107 271029 288897 291832 295890 248772 263941 284729 282707 254657 226644 218852 240563
12272B40563j6237K4735j1266q9421K184L9672K2768j5488L2028J4588M076M994
$$ 240563 224326 249061 237795 148374 150558 190230 212998 197510 229538 244126 248202 253196
12260B53196l250j2205k0874N5548J8875J568P564k2777j6391L6912k2597l2404
$$ 253196 249946 237741 216867 272415 291290 292858 300422 277645 261254 298166 275569 243165
12248B43165O5174k9302R29O978j5987J0931j476n0921J0448Q7347J16888O074
$$ 243165 308339 279037 279966 286944 270957 281888 280412 229491 239939 327286 444174 450248
12236D50248m1585P821K5759N5402N6766L9277J3855K8503j7433l1589J1605m3793
$$ 450248 408663 416484 442243 497645 554411 593688 607543 636046 618613 587024 598629 554836
12224E54836q5613p1983J7004l65j9896K088J0066M0192M6874L2342M3639L5677
$$ 554836 469223 397240 414244 413879 393983 396071 406137 446329 493203 525545 569184 604861
12212F04861J2827k1647k5597J5424M1183m6838j03455j5453k4018m2443k2211
$$ 604861 617688 596041 570444 585868 627051 580213 476758 461305 437287 394844 372633
12201C72633k874J2652M8033O7872j896r802m4718J9386N4414l3381j0753J8021
$$ 372633 369759 382411 430444 498316 496420 486618 441900 461286 515700 482319 471566 489587
12189D89587L0723K670j9025J2002J2512M441N0777m721q9615l8199P998R168
$$ 489587 520310 522980 503955 515957 528469 532910 583687 578966 489351 451152 459150 468318
12177D68318L8567N561j00707J473j8877p2633L017L9239n1127J9347M1422J8560
$$ 468318 506885 512446 411739 413212 394335 321702 324719 363958 312831 332178 373600 392160
12165C92160J7456N2609L2295J3766J1566J9420M470m1940j5431j0833k3416J6609
$$ 392160 409616 462225 494520 508286 519852 539272 543742 501802 486371 475538 452122 468731
12153D68731L4746M9388K1258k5438k6825R273J2551K1870O0496k7025l0482M1809
$$ 468731 503477 552865 574123 548685 521860 531133 543684 565554 626050 599025 568543 610352
12141F10352k784J7959M1747K5528L4271m5121M123K6344Q3538N1900K9447j1092
$$ 610352 607568 625527 667274 692802 727073 681952 686075 712419 795957 847857 877304 866212
12129H66212l6081m5230n2372N164O7884M1788m568j7436L7426j8406q869P0886
$$ 866212 830131 784901 732529 737693 805577 847365 842797 825361 862787 844381 835512 906398
12117I06398J2054k3409N2754K1072N0611M2243R0594P7747L9053J3054L3813
$$ 906398 918452 895043 947797 968869 1019480 1061723 1152317 1230064 1269117 1282171 1315984
12106A315984L4225O2080R7587O3028M1413P6198Q1340O0655N1603P6795L9664
$$ 1315984 1350209 1412289 1509876 1572904 1614317 1690515 1771855 1832510 1884113 1960908 2000572
12095B000572P340O0087R6642J26593J41079J45499J11583J32509J22577J45354
$$ 2000572 2007912 2067999 2164641 2291234 2432313 2577812 2689395 2821904 2944481 3089835
12085C089835J21788J29666J57938K18782J76134J65545K49192L68688L73346
$$ 3089835 3211623 3341289 3499227 3718009 3894143 4059688 4308880 4677568 5050914
12076E050914M19687M50257M50854M64453O04213P01906Q25069Q75408J075071
$$ 5050914 5470601 5920858 6371712 6836165 7440378 8142284 8967353 9842761 10917832
12067A0917832J334762J638199J907808K260077K523048K721293K886345L029540
$$ 10917832 12252594 13890793 15798601 18058678 20581726 23303019 26189364 29218904
12059B9218904L189854L307909L693545M250840N306135O953309R447038J2969514
$$ 29218904 32408758 35716667 39410212 43661052 48967187 55920496 65367534 78337048
12051G8337048J7191031K1195658K4263223K5681342K5073362K1995362J6380709
$$ 78337048 95528079 116723737 140986960 166668302 191741664 213737026 230117735
12044B30117735Q421868q00727j0109761j8161556k3835941k6803665k7407117
$$ 230117735 238539603 237738876 227629115 209467559 185631618 158827953 131420836
12037A31420836k5763997k2409182j8154102j3707769r810704o925271m933514
$$ 131420836 105656839 83247657 65093555 51385786 41575082 34649811 29716297
12030B9716297l679377k930572k464909k201700k030903j822978j698278j615138
$$ 29716297 26036920 23106348 20641439 18439739 16408836 14585858 12887580 11272442
12022A1272442j424987j214063j023998q14146o86563n15357m38450m20277l47049
$$ 11272442 9847455 8633392 7609394 6795248 6108685 5593328 5154878 4734601 4387552
12013D387552l22463k25318k25230j60960j40813k15996j89827k14611j98815
$$ 4387552 4065089 3839771 3614541 3453581 3312768 3096772 2906945 2692334 2493519
12004B493519r9628j27842j33177n9122l2275n7991r7588j21045p4666m3648k3963
$$ 2493519 2393891 2266049 2132872 2073750 2041475 1983484 1885896 1764851 1690185 1646537 1622574
11993A622574l0049j14838j03198m8032j6751j4688j8693n2517o3548j9683J3986
$$ 1622574 1592525 1477687 1374489 1326457 1309706 1295018 1276325 1223808 1160260 1140577 1154563
11982A154563N6008k4074R440m0229l6495q9810n3030M9822j6406k4804M3619
$$ 1154563 1210571 1186497 1195937 1155708 1119213 1029403 976373 1026195 1009789 984985 1028604
11971A028604p8148n3016l6284L9695j3627j3963l8285p5852p3284J4581K2228
$$ 1028604 950456 897440 861156 900851 887224 873261 834976 759124 685840 700421 722649
11960G22649N952j29o9818r101l604j09733J1483r627j0964j2243k8635R975M4205
$$ 722649 728601 728472 658654 649553 645949 536216 547699 538072 527108 514865 486230 496205 540410
11947E40410L8428r333k2430J2771l315k0226M6737R707m9385j9j4110j1223k8457
$$ 540410 578838 569505 547075 559846 556531 536305 583042 592749 543364 543345 529235 518012 489555
11934D89555k6243K1615l5402j4185j2333k3395M5421J04744N7171n1460o935
$$ 489555 463312 484927 449525 435340 423007 399612 445033 549777 606948 555488 548553
11923E48553K6069j7428j9665l012J958n712J216M8460o0577m4345m1713k2397
$$ 548553 574622 557194 537529 534517 536475 530763 531979 580439 519862 475517 433804 411407
11911D11407l3017P228J146m2631n121m4808o811O184J9958q58l4895l9734l2480
$$ 411407 378390 385618 386764 344133 339012 294204 287393 293577 313535 312677 277782 238048 205568
11898B05568j6252K4448J0872K8032j6020r467N0083N705o5290m9899Q477K3054
$$ 205568 189316 213764 224636 252668 236648 227181 277264 282969 217679 167780 176257 199311
11886A99311N024J928N046k9431J1018K627K3808P114N2559k0745l0801k5720
$$ 199311 204335 206263 211309 181878 192896 195523 219331 226445 279004 258259 227458 201738
11874B01738l5456M6245j225j9274J7935n527n3506L6931K6477P995l8907J1127
$$ 201738 166282 212527 211302 192028 209963 204436 150930 187861 214338 222333 183426 194553
11862A94553j5104m3637K8188L3229m1507j2644j791j0705j410n027j1361O1125
$$ 194553 179449 135812 164000 197229 155722 143078 141287 130582 129172 124145 112784 173909
11850A73909J6869J461M2189Q554Q792M9167L7151p991l9039K527o0727j1388
$$ 173909 190778 192239 234428 242982 251774 300941 338092 330101 291062 293589 232862 221474
11838B21474P9812M8117j195M0428K5373j4805p7274l6981m052R394J9731L4934
$$ 221474 301286 349403 348208 388636 414009 399204 321930 284949 280897 290291 310022 344956
11826C44956m158K7816k414M189k9935k9551J287K2346k0662P449K1434o3951
$$ 344956 340798 368614 366200 370389 340454 310903 312190 334536 313874 321323 342757 278806
11814B78806j4674K9243L9258J0531j936j9008K275J9856K228l22k2730J6910
$$ 278806 264132 293375 332633 343164 341228 322220 324495 344351 346579 346257 323527 340437
11802C40437j7016o216j0976O148j2817J598J0550j7229J294k7727K3767J8352
$$ 340437 323421 317205 306229 312377 299560 301158 311708 294479 295773 268046 291813 310165
11790C10165N319l1448k7293j666q355R798l940j4393n214M4604L0641L176J1450
$$ 310165 315484 284036 256743 255077 246722 256520 252580 238187 232973 277577 308218 311394 322844
11777C22844L0365l8540j2874K2903m1380k2791L1096j7358q194K8188j697K0851
$$ 322844 353209 314669 301795 324698 283318 260527 291623 274265 266071 294259 292562 313413
11765C13413p7791q0222J8600R7802j0073K2339l866J911l2335j303Q538N5074
$$ 313413 235622 155400 174000 271802 261729 284068 280202 282113 249778 248475 257013 312087
11753C12087m6300m3746J4221P959J578L8576J0903O076J9511M6156j382n3297
$$ 312087 265787 222041 236262 244221 245799 284375 295278 301354 320865 367021 365639 312342
11741C12342l2211P496k1010Q242q547J4392p465k5304k1215j5143O776J496j7032
$$ 312342 280131 287627 266617 274859 266312 280704 273239 247935 226720 211577 218353 219849 202817
11728B02817p003P317O4436L556k8469J2655L0370M5613N757m7635m0286n7312
$$ 202817 195814 203131 267567 271123 242654 255309 285679 331292 337049 289414 249128 191816
11716A91816K8647L7449n0268L3930K1100N1701m1251m2015m28K7259l6703k7066
$$ 191816 220463 257912 207644 241574 262674 314375 273124 231109 230681 257940 221237 194171
11704A94171K6695N9229p114M9290j9726p1667j5371N3073M867o8246m7908Q256
$$ 194171 220866 280095 272981 322271 302545 230878 215507 268580 273447 205201 157293 165549
11692A65549J0640o737L6947J5195r541Q908P06K6494o580O4302j5073n0787m245
$$ 165549 176189 169452 206399 221594 212053 220961 221667 248161 241581 305883 290810 240023 235778
11679B35778K8192J687m6524l2959P3155O6823l5235l0339j0094M3254L0249j9558
$$ 235778 263970 265657 219133 186174 259329 326152 290917 260578 250484 293738 323987 304429
11667C04429O412k664n538l7473P668J7655L830m123k4586n0934j1576K288n567
$$ 304429 310841 308177 302639 265166 272834 290489 294319 290196 265610 214676 203100 205388 199821
11654A99821N5697M3527k8905P139P1890k8874j5316M3697K1263l2865m4183N2437
$$ 199821 255518 299045 270140 277279 349169 320295 304979 348676 369939 337074 292891 345328
11642C45328L2198m7242p673J8553J7759J2495K7499j1142P165L6502N4282L8522
$$ 345328 377526 330284 322611 341164 358923 371418 398917 387775 394940 431442 485724 524246
11630E24246Q6681N5867J58337R5777J09325R8878J41003J22409J00697L0276
$$ 524246 610927 666794 825131 920908 1030233 1129111 1270114 1392523 1493220 1523496
11620A523496k6101p8712j20915j41742j62896r5785o6027o8756o0820q9573n1016
$$ 1523496 1497395 1418683 1297768 1156026 993130 897345 831318 762562 701742 612169 561153
11609E61153n8585m9919m6197l5565p740K6034j840J0917J8313r233j8426L1896
$$ 561153 502568 452649 406452 370887 363147 389181 387341 398258 416571 407338 388912 420808
11597D20808k3226l0350l6107j4727j2202J2861L0156K6238q263p1230J2494O3045
$$ 420808 397582 367232 331125 316398 304196 317057 347213 373451 365188 293958 306452 369497
11585C69497K6389J667k5600r424O3670K8279o7748l3493K0099K6994l1833k1346
$$ 369497 395886 397553 371953 362529 426199 454478 386730 353237 373336 400330 368497 347151
11573C47151j2501K533Q3942J0640k4624l3404M8572Q36m8862o7536M2375P247
$$ 347151 334650 337183 421125 431765 407141 373737 422309 423145 374283 306747 349122 356369
11561C56369q868o6051K1332j5083J5217K343j6366J3888M0172m810k050j8664
$$ 356369 347501 281450 302782 287699 302916 305259 288893 302781 342953 338143 336093 317429
11549C17429n903J9744l0207j0325l1573k8854K3207K7583P991n4806L7406n945
$$ 317429 311526 331270 301063 290738 259165 230311 253518 281101 289092 234286 271692 265747
11537B65747o1617k1721J381O2598J7654O499K6563K3106Q653l9352j4271J2026
$$ 265747 204130 182409 183790 246388 264042 270541 297104 320210 328863 289511 275240 287266
11525B87266k1804K7917O3015l4689k1706Q318K2175j6410k448l7470l1659j5274
$$ 287266 265462 293379 356394 321705 299999 308317 330492 314082 311634 274164 242505 227231
11513B27231J4224o46Q812K1171j0128l3297N0708L6593M5280r954l259O289m0798
$$ 227231 241455 240809 249621 270792 260664 227367 278075 314668 359948 349994 346735 353024 312226
11500C12226r416l281K3970l638K4k9068j1441J7037N296J5218J9151r474m4179
$$ 312226 302810 299529 323499 319861 319885 290817 279376 296413 301709 316927 336078 326604 282425
11487B82425q143J1146K0938M3512K1020j1105Q662k9834n7677K500l1264K7443
$$ 282425 274282 285428 306366 349878 370898 359793 368455 338621 280944 283444 252180 279623
11475B79623O5991k4288k4960L0051k439J1399p700J722L5485k947n1429j167
$$ 279623 345614 321326 296366 326417 323978 335377 327677 329399 364884 361937 310508 309341
11463C09341M0426m241j346k072o969k77j3235N5300K7824K511K8723k1564o7619
$$ 309341 349767 345526 344180 342108 335139 334862 321627 376927 404751 407262 435985 414421 346802
11450C46802k2544n6323k7195L6852N7022N926l6142j0599M5559o846j7481J2002
$$ 346802 324258 267935 240740 277592 334614 340540 304398 293799 339358 332512 315031 327033
11438C27033K5412L5363J4808M9093k4043m7367j0031p541J0970n482M4563J052
$$ 327033 352445 387808 402616 451709 427666 380299 370268 362727 373697 368215 412778 413830
11426D13830p70m6532m9023L2134K9057J0067o098k8728k8903J0464N350J9963
$$ 413830 413060 366528 317505 349639 378696 388763 382665 353937 325034 335498 340848 360811
11414C60811J3009n1158P569M8530J0134O1871L4209k8985k4587K4688j9927J4096
$$ 360811 373820 322662 330231 378761 388895 450766 484975 455990 431403 456091 436164 450260
11402D50260J8116l9518j0855j0047l251j500M2532L6881N848o5644j5237k210
$$ 450260 468376 428858 418003 407956 404705 403205 445737 482618 488466 422822 407585 405375
11390D05375L8221K4960O7883k6115j6595J2326j4036l7339L1140m5720N6315
$$ 405375 443596 468556 536439 510324 493729 506055 492019 454680 485820 440100 496415
11379D96415k2851o5963n7375N7042O4979k2360k6153j2758J2672l9020l2946
$$ 496415 473564 407601 350226 407268 472247 449887 423734 410976 423648 384628 351682
11368C51682L2256J3422j9209N4668r138r795L9052n2605k4324K9085j569L1277
$$ 351682 383938 397360 378151 432819 423681 413886 452938 400333 376009 405094 403525 434802
11356D34802L196L776j3947l093l478L341K0725L3461l7821k5717O36l0359N0825
$$ 434802 437998 441774 427827 424734 421256 424597 445322 478783 440962 415245 415881 385522 436347
11343D36347L3532l880q060O1884O688k6803o5573P282l65P1982k4644K7632j1947
$$ 436347 469879 465999 457939 519823 526511 499708 434135 441417 441052 513034 488390 516022 504075
11330E04075p5486m9678j2305J7427M4279N3264R731l2981J7581K787l1841P727
$$ 504075 428589 378911 366606 384033 428312 481576 491307 458326 475907 478694 446853 454580
11318D54580q595n4816K3369M8745K5189j4179n3868l1479O3365J3532N0198R7459
$$ 454580 445985 391169 414538 463283 488472 474293 420425 388946 452311 465843 516041 613500
11306F13500l5114j5771L342k6329j4877k3589j3281N3324Q3949J3705R323q4348
$$ 613500 578386 562615 565957 539628 524751 501162 487881 541205 625154 638859 648182 563834
11294E63834m4285j65O2496p29o7382j663L4724N7082L7426J3721K2806o4043
$$ 563834 519549 519384 581880 581151 513769 512106 546830 603912 641338 655059 677865 613822
11282F13822j10003P589L5413k1464q250K6422O705J0164L3993L327j1952K3381
$$ 613822 503819 511408 546821 525357 517107 543529 550234 560398 594391 597718 585766 609147
11270F09147k8519N1597J4459k2l3873K0695R543l391M4151J7177p919r057m3837
$$ 609147 580628 632225 646684 646662 612789 633484 643027 639636 683787 700964 693045 683988 640151
11257F40151N349M1058N3845M1935K2967R0428L860N37N5285N3415K8706O6362
$$ 640151 645500 686558 740403 782338 805305 895733 899593 900130 955415 1008830 1037536 1103898
11245A103898J23816J40379J67173J54864L13021L44589J75341M2632q9618j86068
$$ 1103898 1227714 1368093 1535266 1690130 2003151 2347740 2523081 2565713 2476095 2290027
11235B290027k23431k31390j34492L1529K6930Q2872J70706J65718J87834K51150
$$ 2290027 2066596 1835206 1700714 1732243 1759173 1842045 2012751 2178469 2366303 2617453
11225B617453K46735K74796L66725L80830K08799j827r5865j45265k24786k98251
$$ 2617453 2864188 3138984 3505709 3886539 4095338 4093511 3997646 3852381 3627595 3329344
11215C329344k39850k38935j70004j63448j52322n5074p3087o6190m0109J0642
$$ 3329344 3089494 2850559 2680555 2517107 2364785 2309711 2236624 2170434 2130325 2140967
11205B140967K1583O4109J40581J57692J51714J92651J55715K96404L20309L65118
$$ 2140967 2162550 2226659 2367240 2524932 2676646 2869297 3025012 3321416 3641725 4006843
11195D006843M42862M75529M04976L15153K78977K07710J06845l2319k13307l64941
$$ 4006843 4449705 4925234 5330210 5645363 5924340 6132050 6238895 6206576 5993269 5628328
11185E628328l79314m31435m70499m13172l47699k64563k52936k65746j58499
$$ 5628328 5249014 4817579 4347080 3933908 3586209 3321646 3068710 2802964 2644465
11176B644465j28766r1303j05265m6754M825j3886k3716M9747J02444M5709J68931
$$ 2644465 2515699 2424396 2319131 2272377 2277202 2263316 2239600 2289347 2391791 2437500 2606431
11165B606431J87103K13943K70932K96391L31100L11575K34060R1146q9247k36167
$$ 2606431 2793534 3007477 3278409 3574800 3905900 4217475 4451535 4542681 4453434 4217267
11155D217267l05602l77598l73419l54062l51024k65991j95214j76087j26424
$$ 4217267 3911665 3534067 3160648 2806586 2455562 2189571 1994357 1818270 1691846
11146A691846r5636j04073j00961q6439r526k8486n0341o5688l0607n7763n1445
$$ 1691846 1596210 1492137 1391176 1304737 1295211 1266725 1216384 1150696 1120089 1062326 1010881
11135A010881l4861K4953N8368J0863j5868k8331J4347l7090j673Q791k108o684
$$ 1010881 976020 1000973 1059341 1070204 1054336 1026005 1040352 1003262 1001589 1010380 1008272 1001588
11123A001588l0247J928L0566q632j833k2858l4398K5241l8840K0415q997k3660
$$ 1001588 971341 973269 1003835 995203 993370 970512 936114 961355 922515 942930 933933 910273
11111I10273l4562J1219M958K553K4502K1568m031n2578n7431Q7723N323k327
$$ 910273 875711 886930 891888 894441 918943 940511 936480 883902 826471 914194 919517 917190
11099I17190j5528M1174l4562j2662n170r450J2557l5231k8167K4810n991N0647
$$ 917190 901662 942836 908274 895612 890442 880992 893549 858318 830151 854961 848970 899617
11087H99617L3369p699k8968m2226M4544L8037l4831k6329L6211O7504M7199j1621
$$ 899617 932986 925287 896319 854093 898637 936674 901843 875514 911725 979229 1026428 1014807
11075A014807k9576p5619l7751R958J5248K0986K2854O4332K988K5395l6061l6271
$$ 1014807 985231 909612 871861 881819 897067 918053 940907 1005239 1008227 1033622 997561 961290
11063I61290l8154k9N1279J240l0126l844M154p794J6249j0666N0211L5531k4356
$$ 961290 923136 923107 974386 975626 945500 941656 945810 938016 954265 943599 993810 1029341 1004985
11050A004985L420N8703J3856k0929j5132q690N0417J8121k5088n7384K1548L4510
$$ 1004985 1008405 1067108 1080964 1060035 1044903 1036213 1086630 1104751 1079663 1022279 1043827 1078337
11038A078337M3463L9098l6072l7495K4987J5899J3070O613n5123k6357L682P646
$$ 1078337 1121800 1160898 1124826 1087331 1112318 1128217 1141287 1147900 1092777 1066420 1070102 1077748
11026A077748k6306R590l3043k0906k347J7643J3368O7606M8710l6838j1912j1209
$$ 1077748 1051442 1061032 1027989 1007083 1004736 1022379 1035747 1103353 1152063 1115225 1103313 1092104
11014A092104r347M4664j3109k1403o260L9571Q4482M6263Q129n3194r128J2223
$$ 1092104 1082757 1127421 1114312 1092909 1086649 1126220 1210702 1256965 1265094 1211900 1202772 1214995
11002A214995N0729J0050j4892j8688J6953J2270j1780o255m6515n4494j2925
$$ 1214995 1265724 1275774 1260882 1242194 1259147 1271417 1259637 1253382 1206867 1152373 1139448
10991A139448K5601K3806J4399j3053J4459j4148j8637L5798O1896N8915j3907
$$ 1139448 1165049 1188855 1203254 1190201 1204660 1190512 1171875 1207673 1269569 1328484 1314577
10980A314577L4281R831l4950M0885L0928N1395P274m7955k8545L1387K368M0680
$$ 1314577 1348858 1358689 1323739 1364624 1395552 1446947 1454221 1406266 1377721 1409108 1411476 1452156
10968A452156J9840J714J8824k088K3735O5237j8964j0208o4421L5147J2323m5825
$$ 1452156 1471996 1473710 1492534 1490446 1514181 1579418 1560454 1550246 1485825 1520972 1533295 1487470
10956A487470o7127l247L7651L79k6439L2416K4152O4504K7015R841o375k8140
$$ 1487470 1420343 1417096 1454747 1455126 1428687 1461103 1485255 1549759 1576774 1586615 1580240 1552100
10944A552100Q688L9406p151K3204O052K3801L3693L846k0069o522K9727q68P3094
$$ 1552100 1560788 1600194 1593043 1616247 1622299 1646100 1679793 1683639 1663570 1657048 1686775 1685907 1759001
10931A759001N9244j6994m6251j5331M5315M5454M250M7030K0230K4463l2178
$$ 1759001 1818245 1801251 1755000 1739669 1784984 1830438 1834688 1881718 1901948 1926411 1894233
10920A894233l5825K7094J5911K918r975j0806L7943K9678L7693k0609J3463L7855
$$ 1894233 1858408 1885502 1901413 1904331 1894356 1883550 1921493 1951171 1988864 1968255 1981718 2019573
10908B019573L0139k9685m8807k5266J4184Q118k32K2612L1902J8875q304j8972
$$ 2019573 2049712 2020027 1971220 1945954 1960138 1968256 1968024 1990636 2022538 2041413 2033109 2014137
10896B014137p269m3656M1451L3909N9187K1363K314L834J2273k210L9729p092
$$ 2014137 2006868 1963212 2004663 2038572 2097759 2119122 2121436 2125270 2137543 2135333 2175062 2167970
10884B167970M1339M2708l0043q9473k3824J4497M411K6929K9332L57N3381M6241
$$ 2167970 2209309 2252017 2221974 2132501 2108677 2123174 2127585 2154514 2183846 2184203 2237584 2283825
10872B283825m4373n1109o592N053M4267O9403K6670P055M1616j129k969j3022
$$ 2283825 2239452 2188343 2181751 2186804 2231071 2300474 2327144 2334199 2375815 2374686 2371717 2358695
10860B358695M4278K6905K129l9057l6274j4480j8082n3045J7680L4403L8014
$$ 2358695 2402973 2429878 2432007 2392950 2356676 2342196 2324114 2271069 2288749 2323152 2361166
10849B361166o4734k8754n65J0994J4256N1485R9733K0467n2788N909L22O4338
$$ 2361166 2296432 2267678 2267113 2278107 2292363 2343848 2443581 2464048 2411260 2417169 2417491 2481829
10837B481829L1423m878L6812p190k8142m891q709n105q249l3187j2652P0493
$$ 2481829 2513252 2508374 2545186 2537996 2509854 2504963 2496254 2491149 2482900 2449713 2437061 2507554
10825B507554P0065M6494k0513j7237K2437j1260J8005l189N508J2193N4944L7662
$$ 2507554 2577619 2624113 2603600 2586363 2608800 2597540 2615545 2612356 2617864 2630057 2685001 2722663
10813B722663J366j8365o720r274L0496N2466n1800J2179L9381Q77L2939J9126
$$ 2722663 2724029 2705664 2698944 2689670 2720166 2772632 2720832 2733011 2772392 2773269 2806208 2825334
10801B825334k1690J8031M7761L8410K2572r534k2756k3425Q786J7454M7120j0143
$$ 2825334 2803644 2821675 2869436 2907846 2930418 2920884 2898128 2874703 2883489 2900943 2948063 2937920
10789B937920k3408K1423M8060J6445J7779K0736K5397K6339k5776O169O5665
$$ 2937920 2914512 2935935 2983995 3000440 3018219 3038955 3064352 3090691 3064915 3071084 3136749
10778C136749N7534M7689J6619K9432L3827m4912m0959l8304K0624M8064L9533
$$ 3136749 3194283 3241972 3258591 3288023 3321850 3276938 3235979 3197675 3218299 3266363 3305896
10767C305896L9166M3184L8101O2272K3602J3126l380q581n75L6021K8046M9013
$$ 3305896 3345062 3388246 3426347 3488619 3512221 3525347 3521967 3513386 3512811 3548832 3576878 3625891
10755C625891P8156M639n1988n77L4234N5153N2727N7358j922K5866K3944K3003
$$ 3625891 3704047 3708686 3656698 3656121 3690355 3745508 3798235 3855593 3853671 3879537 3903481 3926484
10743C926484j9375J5065K4805M0427K0727L6192k028L0796M6426M1122K6375
$$ 3926484 3907109 3922174 3946979 3987406 4008133 4044325 4042297 4073093 4119519 4160641 4187016
10732D187016M9308O0736L0621M3085L2207L3325N2825k1034K7798N8218J8204
$$ 4187016 4236324 4297060 4327681 4370766 4402973 4436298 4489123 4468089 4495887 4554105 4572309
10721D572309K5566K2324M3965M5664L390m395k045Q4842O3679K9674L8484O6785
$$ 4572309 4597875 4620199 4664164 4709828 4713218 4708823 4706778 4791620 4855299 4884973 4923457 4990242
10709D990242J9950O8902P1946J9286K1575N3066N9155J5756M375N6792Q7705
$$ 4990242 5010192 5079094 5151040 5170326 5191901 5244967 5304122 5319878 5324253 5381045 5468750
10698E468750K3527J12230N6884J9559L1535K7698N0989O8743R0832k1389O3217
$$ 5468750 5492277 5604507 5661391 5680950 5712485 5740183 5791172 5859915 5950747 5929358 5992575
10687E992575M5526L3076O0069P2765L8325M0356O2321N0120O1455N9496N9092
$$ 5992575 6038101 6071177 6131246 6204011 6242336 6282692 6345013 6395133 6456588 6516084 6575176
10676F575176L0373O4685P9240R3558P1455P507P6162N4736O2207L6933N1823
$$ 6575176 6605549 6670234 6749474 6843032 6914487 6921994 6998156 7052892 7115099 7152032 7203855
10665G203855J02114R6840J22245R5953R5127J29168J09812O2265P9505Q6592
$$ 7203855 7305969 7402809 7525054 7621007 7716134 7845302 7955114 8017379 8096884 8183476
10655H183476K4297P6187J17972J22048R8141P1057J03997J30466J09638J47192
$$ 8183476 8207773 8283960 8401932 8523980 8622121 8693178 8797175 8927641 9037279 9184471
10645I184471J49573R4047J33070J65126J87062J44879J68212K20443K39308K67296
$$ 9184471 9334044 9428091 9561161 9726287 9913349 10058228 10226440 10446883 10686191 10953487
10635A0953487K97801L17146L85137N34814M53409K70235N3616j23411k16503
$$ 10953487 11251288 11568434 11953571 12488385 12941794 13212029 13265645 13142234 12925731
10626A2925731k12324j43223j02941j01794k8554N8022J14173J50485J52795J52594
$$ 12925731 12713407 12570184 12467243 12365449 12336895 12394917 12509090 12659575 12812370 12964964
10616A2964964J32734J61728J86929R6174J13909J53178J26069J54848J23774
$$ 12964964 13097698 13259426 13446355 13542529 13656438 13809616 13935685 14090533 14214307
10607A4214307J32000J75575K31413K11987K14057K30930K13830K29596K05301
$$ 14214307 14346307 14521882 14753295 14965282 15179339 15410269 15624099 15853695 16058996
10598A6058996J73836K34566K73655K30111K50688K62716K48437J97274K18253
$$ 16058996 16232832 16467398 16741053 16971164 17221852 17484568 17733005 17930279 18148532
10589A8148532K65166K35236K51544L08921K59640L27350M17953L32171K63589
$$ 18148532 18413698 18648934 18900478 19209399 19469039 19796389 20214342 20546513 20810102
10580B0810102K97217L57243L59467L48066K80595L89455L66972L61991M17148
$$ 20810102 21107319 21464562 21824029 22172095 22452690 22842145 23209117 23571108 23988256
10571B3988256L27264L24122M06640M74781L94720M67856M44932M73952M40917
$$ 23988256 24315520 24639642 25046282 25521063 25915783 26383639 26828571 27302523 27743440
10562B7743440M75504N15838M84253M78986N15334N08490M93636N47585O23718
$$ 27743440 28218944 28734782 29219035 29698021 30213355 30721845 31215481 31763066 32386784
10553C2386784O08129N85523N85953O35566O09117O04144O40616O09735O56429
$$ 32386784 32994913 33580436 34166389 34801955 35411072 36015216 36655832 37265567 37921996
10544C7921996O62920O14825O69590P23544P49691P23549P98570P90744P59805
$$ 37921996 38584916 39199741 39869331 40592875 41342566 42066115 42864685 43655429 44415234
10535D4415234P52318Q15944Q44726Q01689P75414Q10109Q62362Q67333Q46128
$$ 44415234 45167552 45983496 46828222 47629911 48405325 49215434 50077796 50945129 51791257
10526E1791257Q39166Q96319R21464R23600Q94235R06628R07942R57623R78016
$$ 51791257 52630423 53526742 54448206 55371806 56266041 57172669 58080611 59038234 60016250
10517F0016250R71294J032802J023285R81409J026028J004936R80589J033966
$$ 60016250 60987544 62020346 63043631 64025040 65051068 66056004 67036593 68070559
10509F8070559J071574J031710J037832J013881J053642J035012J038321J026126
$$ 68070559 69142133 70173843 71211675 72225556 73279198 74314210 75352531 76378657
10501G6378657J022475J021468R61116R92178R93121R38828R29829R42835R87714
$$ 76378657 77401132 78422600 79383716 80375894 81369015 82307843 83237672 84180507 85168221
10492H5168221Q83813Q63190P96988P00113P64133P70813P26448O10759N90963
$$ 85168221 86052034 86915224 87712212 88412325 89176458 89947271 90673719 91284478 91875441
10483I1875441N78689N75233M88326M24675M01138K85118K13812J93999J49715
$$ 91875441 92454130 93029363 93517689 93942364 94343502 94628620 94842432 95036431 95186146
10474I5186146R0289Q5744L6501l8031j32170j62893k55996l14153l36137l37417
$$ 95186146 95276435 95362179 95398680 95360649 95228479 95065586 94809590 94495437 94159300 93821883
10464I3821883m57606n40175n69054o52573o57987p32744q53303q33707q11697
$$ 93821883 93364277 92824102 92255048 91602475 90944488 90211744 89358441 88524734 87713037
10455H7713037q36543q45489q66094r10113r68475j000585r53090r92790j037534
$$ 87713037 86876494 86031005 85164911 84254798 83286323 82285738 81332648 80339858 79302324
10446G9302324j054488j074923j062144j023149j039574j017449j060073j058884
$$ 79302324 78247836 77172913 76110769 75087620 74048046 73030597 71970524 70911640
10438G0911640j106220j075305j054643j100337j039173j037812j018142r58611
$$ 70911640 69805420 68730115 67675472 66575135 65535962 64498150 63480008 62521397
10430F2521397r22477r90726r70533r43233r55216r61954r78497r40976q63053
$$ 62521397 61598920 60608194 59637661 58694428 57739212 56777258 55798761 54857785 53994732
10421E3994732r01533q86284q29759q29193q42711q27005q47124p60976q09884
$$ 53994732 53093199 52206915 51377156 50547963 49705252 48878247 48031123 47270147 46460263
10412D6460263q23282p46548p50197o96469o62635o81211o24132o00979n28686
$$ 46460263 45636981 44890433 44140236 43443767 42781132 42099921 41475789 40874810 40346124
10403D0346124n48025n83280n35033n36022o44491o62386n85303n78129o55834
$$ 40346124 39798099 39214819 38679786 38143764 37499273 36836887 36251584 35673455 35017621
10394C5017621o00497n71622n86966n58798m62121m73585m61428m40335m64014
$$ 35017621 34417124 33845502 33258536 32699738 32237617 31764032 31302604 30862269 30398255
10385C0398255m10124m45341m70233m26451m15322m06755m39447l80374l92667
$$ 30398255 29988131 29542790 29072557 28646106 28230784 27824029 27384582 27004208 26611541
10376B6611541m07932l74646l71059m11830l86321l66222l48210k73781k83018
$$ 26611541 26203609 25828963 25457904 25046074 24659753 24293531 23945321 23671540 23388522
10367B3388522l17655l15956k70945l36181l22651k44154k60332k62133k35686
$$ 23388522 23070867 22754911 22483966 22147785 21825134 21580980 21320648 21058515 20822829
10358B0822829k67376l22390k59435k38863k82211k57172k23782k50157k21241
$$ 20822829 20555453 20233063 19973628 19734765 19452554 19195382 18971600 18721443 18500202
10349A8500202k51826k88747k61431k24477k41401k70299k18944j86777j71178
$$ 18500202 18248376 17959629 17698198 17473721 17232320 16962021 16743077 16556300 16385122
10340A6385122j19554j11702j16581j22389j89416k03837j15229j36075j29949
$$ 16385122 16265568 16153866 16037285 15914896 15725480 15521643 15406414 15270339 15140390
10331A5140390j38251j85148k49282k75572k95017k31078k32065k48174k01058
$$ 15140390 15002139 14816991 14567709 14292137 13997120 13766042 13533977 13285803 13084745
10322A3084745j85034j68282j14681j72908j58300j57689j52886j69684k10532
$$ 13084745 12899711 12731429 12616748 12443840 12285540 12127851 11974965 11805281 11594749
10313A1594749j04799n1293j34500r5463r0489j33709r9918q8123j12510p1828
$$ 11594749 11489950 11438657 11304157 11208694 11118205 10984496 10884578 10796455 10683945 10612117
10303A0612117j34814j47118j49493n2811l9931r3748j29527j21006j10200j20752
$$ 10612117 10477303 10330185 10180692 10127881 10087950 9994202 9864675 9743669 9633469 9512717
10293I512717p6973j05106r9451n4712j8712k2401n4302j9785m4340q1777j8126
$$ 9512717 9435744 9330638 9231187 9176475 9157763 9135362 9081060 9061275 9016935 8935158 8917032
10282H917032l6553k2622k2580P711j5996k0328k3349l804L6098O7860p37l1458
$$ 8917032 8880479 8857857 8835277 8842988 8826992 8806664 8783315 8779511 8815609 8883469 8882732 8851274
10270H851274M4820N1556O2143L1115Q1300J2401m4242O2768P4576Q1942Q0179
$$ 8851274 8896094 8947650 9009793 9040908 9122208 9134609 9090367 9153135 9227711 9309653 9389832
10259I389832J45363J39686J21187J88731J77289J60289J66168J92761J47241
$$ 9389832 9535195 9674881 9796068 9984799 10162088 10322377 10488545 10681306 10828547
10250A0828547K19858K50198K19049L52783M00559N04871N95806N93088N82795
$$ 10828547 11048405 11298603 11517652 11870435 12270994 12775865 13371671 13964759 14547554
10241A4547554O69086P12894P53227Q65158J059728J351372J524958J761192K056926
$$ 14547554 15216640 15929534 16682761 17547919 18607647 19959019 21483977 23245169 25302095
10232B5302095K433076K886366L283800L536149L618947L825671M383464N260760
$$ 25302095 27735171 30621537 33905337 37441486 41060433 44886104 49269568 54530328
10224E4530328O504130Q229819J0405726J3206662J6947642K2438079L0530846
$$ 54530328 61034458 69264277 79670003 92876665 109824307 132262386 162793232
10217A62793232M2515080N9538679P9875035R0279797O6432050J6123799l3537065
$$ 162793232 205308312 264846991 344722026 435001823 501433873 517557672 484020607
10210D84020607p6230555r4400860q2173557n9659711m0901138k7986396j9315503
$$ 484020607 407790052 313389192 231215635 171555924 130654786 102668390 83352887
10203H3352887j3171157q455535m566234j636171j525981k817267l931084n462061
$$ 83352887 70181730 61726195 57159961 55523790 53997809 51180542 47249458 41787397
10195D1787397n822707n006188m127514l482459k849437k343754j846188j474845
$$ 41787397 35964690 30958502 26830988 23348529 20499092 18155338 16309150 14834305
10187A4834305j216359r53584q21116o77913n74489m70340l81593m19931l81547
$$ 14834305 13617946 12664362 11843246 11165333 10590844 10120504 9738911 9318980 8937433
10178H937433l56987l64235l01439l04590k82446k83416k93298k27376j79528
$$ 8937433 8580446 8216211 7914772 7610182 7327736 7044320 6751022 6523646 6344118
10169F344118j58316j55867j62908j35287j06034q1129p9187j22166q0512m3512
$$ 6344118 6185802 6029935 5867027 5731740 5625706 5544577 5465390 5343224 5262712 5219200
10159E219200j22258j05565p7538m4468L0902J10452Q0639m0535n8050o8710j21759
$$ 5219200 5096942 4991377 4913839 4869371 4900273 5010725 5091364 5050829 4992779 4924069 4802310
10148D802310j56561j36053r3060j22166r0286p1239q5906l1128n9776k9334K1789
$$ 4802310 4645749 4509696 4416636 4294470 4204184 4132945 4047039 4015911 3956135 3926801 3948590
10137C948590m6473n9093l3132o1252j04464o0734n8388j06862j14471j8503m8205
$$ 3948590 3902117 3843024 3809892 3748640 3644176 3583442 3525054 3418192 3303721 3285218 3237013
10126C237013l9172P335r1441n9087q901l1699p0929R712L8026n2320l4043j758
$$ 3237013 3197841 3205176 3113735 3054648 3045747 3014048 2943119 2952831 2990857 2938537 2904494 2902736
10114B902736J907k8497M386k3953P404N964j2274k8211J874k0466p0270p4986
$$ 2902736 2904643 2876146 2880532 2856579 2863983 2869947 2857673 2829462 2831336 2810870 2740600 2665614
10102B665614j8092M4024k3628j285J605j4281M2963K5564k4337k884L8738N4095
$$ 2665614 2647522 2691546 2667918 2666633 2668238 2653957 2696920 2722484 2698147 2695263 2734001 2788096
10090B788096k0481j7414k54l9202p2329k5781N0395P4054k9274j38158o3366
$$ 2788096 2767615 2750201 2749947 2710745 2638416 2612635 2663030 2737084 2707810 2569652 2506286
10079B506286n6421M5454k7803n0280q009m2922r4897p1140O307L794k1615K0261
$$ 2506286 2449865 2495319 2467516 2417236 2409227 2366305 2271408 2200268 2206575 2210369 2188754 2209015
10067B209015L903k4060Q900n537J5159l3486k2907k3648o316M5287L0002o8707
$$ 2209015 2212918 2188858 2197758 2192221 2207380 2173894 2150987 2127339 2121023 2166310 2196312 2127605
10055B127605n0340J0478M8415K5344K4294P3814J3376j6776R4170K42851L12942
$$ 2127605 2077265 2087743 2136158 2161502 2185796 2259610 2272986 2256210 2350380 2593231 2906173
10044B906173K40474P532j41781k55156l38243j94954j39345l8050o196r793n2814
$$ 2906173 3146647 3154179 3012398 2757242 2418999 2224045 2084700 2046650 2040454 2030661 1977847
10033A977847r5314q7317l0891p2447m1953q853l7596j19675k8208n7030k1806
$$ 1977847 1882533 1795216 1764325 1691878 1649925 1641072 1603476 1483801 1455593 1398563 1376757
10022A376757Q8630P1690J51849N9495M6387P1756J5320m9425k2446l0899m1841
$$ 1376757 1465387 1537077 1688926 1748421 1794808 1866564 1881884 1832459 1810013 1779114 1737273
10011A737273r373k7546J3719N3967J3848l9901j7688J5303k6955m3205n1512
$$ 1737273 1727900 1700354 1714073 1768040 1781888 1741987 1724299 1739602 1712647 1669442 1617930
10000A617930P895K9629l3500l7042K4173K804l6238n5869K6691K8802j6193L3145
$$ 1617930 1625825 1655454 1621954 1584912 1609085 1611889 1575651 1519782 1546473 1575275 1559082 1592227
9988A592227j5781p4785k3036n130L844n41J2899O896k1137n2416j0125m6349
$$ 1592227 1576446 1501661 1478625 1473495 1477339 1476798 1489697 1496593 1475456 1423040 1412915 1366566
9976A366566k7456N969J9700m4466K0223L6198l2590p90j2458m7368k2499m810
$$ 1366566 1339110 1345079 1364779 1320313 1340536 1376734 1344144 1343354 1330896 1283528 1261029 1256219
9964A256219l307n471J3518j2646j662L8161j0808M138k575q2164o6500J627r311
$$ 1256219 1252912 1247441 1260959 1248313 1246651 1284812 1274004 1278142 1275567 1193403 1126903 1128530 1119219
9951A119219P030L8396K4674m1244n986J4393j9005L622r8748j4817P8667J0366
$$ 1119219 1126249 1164645 1189319 1148075 1142089 1156482 1137477 1141099 1042351 1027534 1106201 1116567
9939A116567Q591L1338K6002l2752m0279k2057k7426O483k0850l260j0454j2225
$$ 1116567 1125158 1156496 1182498 1149746 1109467 1087410 1059984 1066467 1045617 1042357 1031903 1019678
9927A019678k0385m4198r524N0260P5399r026l1029l8560l3227J1325l2703Q101
$$ 1019678 999293 955095 945571 995831 1071230 1062204 1031175 992615 959388 970713 938010 946111
9915I46111o6679m1324N0657J3124J8172L0725P987j321J2094j1351k2983l4002
$$ 946111 879432 838108 888765 901889 920061 950786 958773 957452 969546 958195 935212 901210
9903I01210J7539L4860n2332n847j9658k6953L1165L3266L724k7769J2997m4345
$$ 901210 918749 953609 901277 895430 875772 848819 879984 913250 916974 889205 902202 857857
9891H57857p6379L443M7078M9736m2629m9497J1152k886l6331L387O3891l2212
$$ 857857 781478 784921 831999 881735 839106 789609 800761 797875 761544 764931 828822 796610
9879G96610p1774K0761N2910J2085K1179O163o1729j3920J0615N069M6775K4207
$$ 796610 724836 745597 798507 810592 831771 837934 776205 762285 772900 777969 824744 848951
9867H48951r460j1911m4410K4305J5693P7164j1169q7338n2456O3633M2671K7798
$$ 848951 839491 827580 783170 807475 823168 900332 889163 801825 749369 813002 855673 883471
9855H83471r9l5376m8204J4435K7840J3435k3956k6069O003m6485m1919L0977
$$ 883471 883372 847996 799792 814227 842067 855502 831546 805477 811480 764995 723076 754053
9843G54053L7635P946M9174k4273n8460l6314r367k711k4127l7392O561L0682
$$ 754053 791688 799634 848808 824535 766075 729761 720394 717683 693556 656164 662725 693407
9831F93407J737p947j224J8042K8317l479m95K9805o521l5562n3093p794M5601
$$ 693407 695144 687197 685973 704015 732332 728853 728358 758163 751642 716080 662987 655193 700794
9818G00794p514l4706K2569J7054J2526M8010Q569l6868j9273N3033m657J2458
$$ 700794 693280 658574 681143 698197 710723 758733 767302 730434 711161 764194 759537 771995
9806G71995L8485O35J3624O9210O78J0475N1597J33884R4796M2019O9670R0694
$$ 771995 810480 811115 824739 893949 894627 905102 956699 1090583 1185379 1227398 1297068 1387762
9794A387762J11072J81423L19935L92931L82104K64492Q7690j26856l04359l88615
$$ 1387762 1498834 1680257 2000192 2393123 2775227 3039719 3127409 3000553 2696194 2307579
9784B307579l87999l10591k14714j00376p9754o7865q1404q7524J6050p49n285
$$ 2307579 1919580 1608989 1394275 1293899 1214145 1146280 1064876 977352 993402 992653 987368
9773I87368l4215m4589m8126n0748m1756k3374K484o89K9348n3170k5856J7403
$$ 987368 953153 908564 860438 809690 767934 744560 747044 746355 775703 722533 696677 714080
9761G14080j6747J9525o807L967J237K7224K7180O984l6340j2867m7572k2536
$$ 714080 697333 716858 710051 714018 715255 742479 769659 776643 740303 727436 679864 657328
9749F57328n631J1352n158o138M824j1670K7284n530k7422J2818L4790q63J7230
$$ 657328 651697 663049 657891 651753 656577 644907 672191 666661 639239 652057 686847 685984 703214
9736G03214k5076k8921K8584j4503n519K5922L1221J6256M8431r0530r0588N3886
$$ 703214 678138 649217 677801 663298 657779 683701 714922 731178 779609 689079 598491 652377
9724F52377M9142M93K1745J3601o6770n2086L9363j1710m7930J2036J4218K761
$$ 652377 701519 702012 723757 737358 670588 618502 657865 646155 598225 610261 624479 627240
9712F27240M5898K9169L1559r705k3289k1430k7038L6925L2331j9463k849J2197
$$ 627240 673138 702307 733866 724161 700872 679442 652404 689329 721660 702197 699348 711545
9700G11545r458K4289K3707N738L7047M6635K2192K9039n9754n8006O232L0026
$$ 711545 702087 726376 750083 755821 792868 839503 861695 890734 830980 772974 779206 809232
9688H09232M4337J5647j039j5476M7569O3995l464l3856k1421K5836R343N863
$$ 809232 853569 869216 868177 852701 900270 964265 960801 926945 905524 931360 940703 946566
9676I46566M6459N8908L250k9013o5114Q158K4651J0726j6373Q2709P0200k3824
$$ 946566 993025 1051933 1055183 1026170 961056 969214 993865 1004591 988218 1070927 1141127 1117303
9664A117303r799K9248K8854j022K8488N4281O2581K2868N4033J8134K1854O48
$$ 1117303 1107504 1136752 1165606 1164584 1193072 1247353 1309934 1332802 1386835 1404969 1426823 1427471
9652A427471K9089K3522J9046N2842N3698J08724N2134K2834L2571N9943Q0114
$$ 1427471 1456560 1480082 1499128 1551970 1605668 1714392 1766526 1789360 1821931 1881874 1961988
9641A961988J20005J29129J15947O4898N9322R4243P2769O1172J13978P3553J09626
$$ 1961988 2081993 2211122 2327069 2391967 2451289 2545532 2618301 2679473 2793451 2867004 2976630
9630B976630J94867J48231J81288J89292K17418J54258J33740K95613L05480K04567
$$ 2976630 3171497 3319728 3501016 3690308 3907726 4061984 4195724 4491337 4796817 5001384
9620E001384K93139L47257M08540M33655N09353N04884N52641O81366P78846Q08119
$$ 5001384 5294523 5641780 6050320 6483975 6993328 7498212 8050853 8732219 9511065 10319184
9610A0319184Q80860J014425J182829J403858J587885J732666J977340K277271
$$ 10319184 11200044 12214469 13397298 14801156 16389041 18121707 20099047 22376318
9602B2376318K580020K898231L305195L775247M145321M425820M586379M522008
$$ 22376318 24956338 27854569 31159764 34935011 39080332 43506152 48092531 52614539
9594E2614539M029272L228009J881816K05806j375296k914556m024045m715762
$$ 52614539 56643811 59871820 61753636 61959442 60584146 57669590 53645545 48929783
9586D8929783m894701m801979m506375m056114l580861l044101k654177k348259
$$ 48929783 44035082 39233103 34726728 30670614 27089753 24045652 21391475 19043216
9578A9043216k003802j775847j527484j300448j154058r71684q05176p83831o57566
$$ 19043216 17039414 15263567 13736083 12435635 11281577 10309893 9504717 8720886 8063320
9569H063320n93127n86077m97795m12157l43862l19326l33845k82755l03573k69823
$$ 8063320 7470193 6884116 6386321 5974164 5630302 5310976 4977131 4694376 4390803 4120980
9559D120980j75418j36213k06104k05166r6264j48796j63734j41575j87170j36380
$$ 4120980 3945562 3809349 3603245 3398079 3301815 3153019 2989285 2847710 2660540 2524160
9549B524160j22804j00570q7088p2940l5559n7964r3966q4009j14362q7128r472
$$ 2524160 2401356 2300786 2213698 2140758 2105199 2047235 1953269 1869260 1754898 1667770 1658298
9538A658298j407l8790j7389m9601j177m1536q925J3606n5938o6299j01319K1505
$$ 1658298 1656891 1618101 1600712 1551111 1549934 1508398 1499473 1513079 1457141 1390842 1289523 1311028
9526A311028K5080p770k6052o6283l9029N479k7987k1171k8636k9069l3004k2378
$$ 1311028 1336108 1328338 1302286 1236003 1196974 1202453 1174466 1153295 1124659 1095590 1062586 1040208
9514A040208J4989j3505k8392o8854j1160k6355p1140o1256k2443J3241l1439
$$ 1040208 1055197 1041692 1013300 944446 933286 906931 835791 774535 752092 765333 733894
9503G33894J3777J9127k176m7257o5250k1563p71k1414N83R813k2794J7777l0859
$$ 733894 747671 766798 764622 717365 652115 630552 629781 608367 608950 618763 595969 613746 582887
9490E82887k8558J5611j6532J3578K3731q288j3462n9248k887K1276k1818j1914
$$ 582887 554329 569940 553408 566986 590717 582429 568967 509719 506832 528108 506290 494376
9478D94376k4532m1505m892N5159P3652j7621l200J5589R119M704J0671M0434
$$ 494376 469844 428339 423447 478606 552258 534637 531437 547026 556145 560849 571520 611954
9466F11954l2631k0090j1922q513l932j1056K880k4471k7361M1264L2336k3237
$$ 611954 579323 559233 547311 538798 534866 523810 526690 502219 474858 516122 548458 525221
9454E25221m8255m3386L300J9615j8786j0221R77M9898o3102l5216l0179M5718
$$ 525221 476966 433580 436880 456495 437709 427488 428465 478363 415261 380045 349866 395584
9442C95584O694j3006R487m7990l1672M8000k351l6246j8382K3688J9434l6909
$$ 395584 402278 389272 398759 350769 319097 367097 364746 328500 310118 333806 353240 316331
9430C16331n481L1219L360L6066R836n260m4128r3807L3687L2294M543p6508j6936
$$ 316331 310850 342069 345429 381495 391331 386071 341943 248136 281823 314117 318660 242152 225216
9417B25216R9198K8666j6438K953J3493l0521M1665M3060l937j7173n0876p2761
$$ 225216 324414 353080 336642 339595 353088 322567 364232 407292 403355 386182 335306 262545
9405B62545J0184N2376J1269j6847k0298N7192K1531p903m8567L525Q8058q862
$$ 262545 272729 325105 336374 319527 299229 356421 377952 370049 321482 325007 413065 404203
9393D04203j4666k8909J5905m795k6650m286N382L48L821j2671n3158O006q963
$$ 404203 389537 360628 376533 371738 345088 340802 346184 346532 350353 337682 284524 290530 281567
9380B81567K161l1012J9218O780M51O1354L7778K323p608j7869m101m6289j12814
$$ 281567 283728 252716 271934 278714 279165 340519 378297 380620 373012 355143 351042 304753 191939
9367A91939j5680L7665L7769M1557k1740o8892j7408J7232O1062J3850O167J6950
$$ 191939 176259 213924 251693 293250 271510 202618 185210 202442 263504 277354 283521 300471
9355C00471n1727j887J3657J4559O4023l7027j3597l1702l787M754K4271J5403
$$ 300471 248744 246857 260514 275073 339096 302069 288472 256770 252983 257737 282008 297411
9343B97411j7186j2826L7289J2604R150k8072l9529n0909L4912m3674j6600J5875
$$ 297411 280225 267399 304688 317292 326442 298370 258841 207932 242844 199170 182570 198445
9331A98445Q0651J5013l3465l6804L3912K1226m1030q012k1586j7206o109M251
$$ 198445 279096 294109 260644 223840 257752 278978 237948 229936 208350 191144 185035 189286
9319A89286L3646M9963k6611l4861k5616r396k767K0460J7506j3801p0078j0979
$$ 189286 222932 272895 246284 211423 185807 176411 173644 194104 211610 197809 127731 116752
9307A16752J2737N0188J3093j6513M1138j0615L522j0824l247J2144o337K8219
$$ 116752 129489 179677 192770 176257 217395 206780 210302 199478 196231 208375 202038 230257
9295B30257K7056k9847J5439J9068j070l4879p1173K6269O4979J6694M913j9293
$$ 230257 257313 227466 242905 261973 260903 226024 154851 181120 246099 262793 267706 248413
9283B48413j0138k0107K9821K59J3897Q283k7930j2861L7947k2710Q434J967L2133
$$ 248413 238275 218168 247989 248248 262145 270428 242498 229637 267584 244874 253308 255275 287408
9270B87408o184n3557l4946O458l7887j1956j9252n80L6708J7337L788j4283J3068
$$ 287408 281224 227667 192721 199179 161292 149336 130084 129504 166212 183549 187337 173054 186122
9257A86122L3342l715l0426R407l8331K3070J2864k3960l6067J3596J1054N687
$$ 186122 219464 215749 185323 194730 156399 179469 192333 168373 132306 145902 156956 162643
9245A62643N0332m970n2902j7724L2254K2584L2229j6939m3157N615K5376J2222
$$ 162643 212975 208005 155103 137379 169633 192217 224446 207507 164350 169965 195341 207563
9233B07563j5979k2563j7306o579l4772O8908P0244J7514o1557L525k4697M1889
$$ 207563 191584 169021 151715 145136 110364 179272 249516 267030 205473 208998 184301 226190
9221B26190N1863j2265K6244j9525l6505M8805l5533k2618r830j4300m847k2502
$$ 226190 278053 265788 292032 272507 236002 284807 249274 226656 216826 202526 197679 175177
9209A75177M3169J9465j353k8403m5546J7276K1679M9764j2563k9453J0077K1455
$$ 175177 218346 237811 236458 208055 162509 179785 201464 251228 238665 209212 219289 240744
9197B40744R212J6876l3389j2889j2424R529m0981l7601Q981K9258K0162o8895
$$ 240744 249956 266832 233443 220554 208130 217659 176678 139077 148058 177316 197478 128583
9185A28583k0816J3540k963k8703M9805K7364L2686M6860n7209n5568p816L5707
$$ 128583 107767 121307 118344 89641 139446 166810 199496 246356 189147 133579 125763 161470
9173A61470K3850k8064k6661M2505l32O684Q074K626o8007n7418k1888j0741l382
$$ 161470 185320 157256 130595 173100 172768 179452 187526 190152 122145 64727 42839 32098 28716
9160B8716k9881O401K5460N1523L0800K7505O499N130J7946J8762K1034l6894
$$ 28716 -1165 5236 30696 82219 113019 140524 147023 152153 170099 188861 209895 173001
9148A73001l4170k3479r762N7066k7700j5891j8762P98N0140L5600J3196l9800
$$ 173001 138831 115352 105590 162656 134956 119065 100303 101101 151241 186841 200037 160237
9136A60237j7943M1294n979n112k2813k7313K7473k8538j3410j6747j4069J0831
$$ 160237 142294 183588 177609 172497 149684 122371 149844 121306 107896 91149 77080 87911
9124H7911K3796M168M1738J564n3979m5488j7836m1471N7053p516j0228K7613
$$ 87911 111707 115875 157613 159177 105198 59710 41874 403 57456 49940 39712 67325
9112F7325O7220l1846M702J00112L1627n1695n8257q044L378r408L997l0453L918
$$ 67325 134545 102699 107401 207513 239140 187445 129188 121144 124522 115114 119111 88658 92576
9099I2576m4210k6652N3161M3047M1112K6622p878m2885K5144N6633J6199l7573
$$ 92576 48366 21714 74875 117922 159034 185656 177778 134893 160037 216670 232869 195296
9087A95296k3872J9307p658o71m7446k3909k271J118M2366N7251l468k3087O242
$$ 195296 171424 190731 183073 182402 134956 111047 108776 109894 152260 209511 206043 182956 189198
9074A89198J686k6963q7508k2297M741j8182K0229K0600M7954N324K3708O694
$$ 189198 190884 163921 76413 54116 58857 40675 60904 81504 129458 134782 158490 165184
9062A65184j2706o973p169o924m1797p671N5920O3705L0286l9015j0062k7204
$$ 165184 152478 145505 138336 131412 89615 81944 137864 201569 231855 192840 182778 155574
9050A55574L594p886k4462l3587k7592m0506R6180l6310n3062L3193M9150R2139
$$ 155574 159168 151282 126820 93233 65641 25135 121315 85005 31943 65136 114286 206425
9038B06425K6736n4392j0238N4303o048j5798k5845M321j5350j7907m6883k1572
$$ 206425 233161 178769 168531 222834 216786 200988 175143 179464 164114 146207 99324 77752
9026G7752L5008K2296k5695K3884L4700l489k6132K2156j0256N292K2253M549
$$ 77752 112760 135056 109361 133245 167945 164456 138324 160480 150224 155516 177769 182318
9014A82318k0982J7833M59r893j0885P605m5691j7281J1371Q20l1292n198L4466
$$ 182318 161336 179169 179628 169735 158850 166455 120764 103483 114854 115674 84382 79184 113650
9001A13650p830k1463J3031K6068n611m1388J1292O492J1802J0463N7986l3404
$$ 113650 105820 84357 97388 123456 117845 76457 87749 94241 106043 116506 174492 141088
8989A41088J8559M1234l3106q7093m4236k3670q254M0674L4704j4157J2802P9944
$$ 141088 159647 200881 167775 80682 36446 12776 4522 45196 79900 65743 78545 158489
8977A58489K6072m8405q701k8645l0252n871L9393J5801n2007j0617M7358J4460
$$ 158489 184561 136156 127455 98810 68558 62687 102080 117881 65874 55257 102615 117075
8965A17075O9005L9920J7260l46k2056j0232K226L6612j3555n578r556n1676K1993
$$ 117075 186080 226000 243260 242914 220858 210626 212852 249464 235909 230331 220775 169099 191092
8952A91092k3969m9764O7434j6135K6085J5603l2836K3505M4821k0937o8220l0996
$$ 191092 167123 117359 184793 168658 194743 210346 177510 201015 245836 224899 156679 125683
8940A25683j2093k1208O7090L5382L1542J677J1977M3795P5420P6074m578r305
$$ 125683 113590 92382 159472 194854 226396 228073 240050 283845 359265 435339 430761 421456
8928D21456l2803n5716m4840n6836l4905r96J0112N526J9843n7250p3927m0021
$$ 421456 388653 332937 288097 231261 196356 195360 205472 210998 230841 173591 99664 59643
8916E9643N5243M3498N6150M3479o4666m9063L0057M3528j0606l8643o4050j5969
$$ 59643 114886 158384 214534 258013 193347 144284 174341 217869 207263 168620 104570 88601
8904H8601M4223j7655l6802R919N2425L7852J3141Q775j5200j3381L9072K8294
$$ 88601 132824 115169 78367 88286 140711 178563 191704 200479 185279 171898 210970 239264
8892B39264k6920j7290J0231j626J0487K6536l8802n50M3102O8025q797l6211
$$ 239264 212344 195054 205285 203659 214146 240682 201880 201330 244432 312457 303660 267449
8880B67449k1910K363q5503M351K2354K3150M9872j2396k6834k1683j110J6857
$$ 267449 245539 247902 162399 166750 189104 212254 262126 249730 222896 201213 200103 216960
8868B16960p1102l9086Q9024O2565l3944j9986J300M2546K5512q947o0206j3577
$$ 216960 145858 106772 195796 258361 224417 204431 205731 248277 273789 264842 204636 191059
8856A91059L0241k2479m3856l5385k1426O7411Q1612n994m4619J7921M2361j5342
$$ 191059 221300 198821 154965 119580 98154 165565 247177 241183 196564 214485 256846 241504
8844B41504j4467M053j4606J3260M9334n0421k6088L0584J4501o1663q968O8812
$$ 241504 227037 231090 216484 229744 279078 228657 202569 233153 247654 185991 177023 245835
8832B45835J7889p239o157o2553j720l95l1302n4180K6388Q0614k7450n0682p060
$$ 245835 263724 256485 250328 187775 186055 185660 154358 100178 126566 207180 179730 129048 121988
8819A21988p12j4186M2194K1593L437J7077Q3409M9423k2062o3475k3401m2887
$$ 121988 121276 107090 149284 170877 174314 191391 274800 324223 302161 238686 215285 172398
8807A72398L3705O101k6908K9550j9622M705k1760j258M4794j8761n832j264j1476
$$ 172398 206103 212204 185296 214846 195224 199929 178169 176911 221705 202944 197112 195848 184372
8794A84372J3041K141L3805L2536q1579j9817L6945L9750J2225l9127l3541L0708
$$ 184372 197413 199554 233359 265895 184316 164499 201444 241194 253419 214292 180751 211459
8782B11459m2911m3034l2K1885J2217K4879j3589J2503J4139k8338p668L9099
$$ 211459 168548 125514 125482 147367 159584 184463 170874 183377 197516 169178 161510 200609
8770B00609N7100j499k7179N992K7957L3640M4596k2847m5207n4383m7421O294
$$ 200609 257709 256210 229031 235023 262980 296620 341216 318369 273162 218779 171358 177652
8758A77652M0069M5106L6502m2190j8556J9262m660k6167k8428R572K419j2628
$$ 177652 217721 262827 299329 257139 238583 257845 253185 227018 198590 208162 210581 197953
8746A97953J1279K427M5255L0912Q151o3887k061N3874M5408k1048n8455o193
$$ 197953 209232 211659 256914 287826 295977 232090 230029 283903 329311 308263 249808 243615
8734B43615Q292K3589r763l9989Q287M3676o122K5904K8761N339L1917J8684j396
$$ 243615 251907 275496 265733 225744 234031 277707 271585 297489 326250 331589 363506 382190 380794
8721C80794N661l029j6561m5228J8827j995K682M9056O1831J6168j8031m3310
$$ 380794 386455 383426 366865 321637 340464 338469 341151 390207 452038 468206 450175 406865
8709D06865l3724L98J9618K58J8589J9399J5563J5085o626K7014K2744J2204q446
$$ 406865 373141 373539 393157 393415 412004 431403 446966 462051 455425 482439 505183 517387 508941
8696E08941k2391P74l4890P042K2019j9596q5355q9857M1155j0689k383J8315
$$ 508941 486550 487324 452434 459476 481495 461899 376544 286687 327842 317153 314770 333085
8684C33085k0451m6656L3399M5759J6425l4190P75r159O747K1556j2770J8834
$$ 333085 312634 265978 299377 345136 361561 327371 328146 318987 325734 347290 334520 353354
8672C53354J6938K2247N3209J5310k9162o9045k0182o723M3773J1059J7724m932
$$ 353354 370292 392539 445748 461058 431896 362851 342669 335946 379719 390778 408502 403570
8660D03570l1111k5049n1338n312M5042J1797k4739k9485k3811o405k4240M186
$$ 403570 372459 347410 296072 290760 335802 347599 322860 293375 269564 263159 238919 243105
8648B43105k8257M2961n59J7724M0536k6329k6984J1793M8540l8484O2199K8832
$$ 243105 214848 257809 257250 274974 315510 289181 262197 273990 322530 284046 346245 375077
8636C75077k8022j4262J5365M3906P91m4673k2741L5668J2326n6493m2850L028
$$ 375077 347055 332793 348158 392064 392855 348182 325441 361109 373435 316942 274092 277120
8624B77120r372j6376J9240L8234M5158L7489p829l8028J5054J1705m3750M555
$$ 277120 267748 251372 270612 308846 354004 391493 383664 345636 360690 372395 328645 333200
8612C33200n9528Q80P4506O387l9501K0635L3550p0380m9255L2573K5717J5458
$$ 333200 273672 274552 349058 355445 315944 336579 370129 299749 250494 283067 308784 324242
8600C24242K874l1833L4346L6141j1687K2303R210J0943j9743K46K4061l413l7116
$$ 324242 327116 295283 329629 365770 354083 376386 385596 396539 376796 377042 401103 397690 360574
8587C60574o0772m5569k9739Q103P0070O540o9022o0175J4602L9660L2943K3346
$$ 360574 299802 254233 224494 232597 302667 309207 240185 180010 194612 234272 267215 290561
8575B90561l1809M188L7196O889l0345n706j4807L9723K0842J0240K5367P6745
$$ 290561 258752 262940 300136 307025 276680 270974 256167 295890 316732 326972 352339 429084
8563D29084K7795k4159q8639r1887p7646Q60Q156j5350m1779j9929j6704R804
$$ 429084 456879 432720 344081 252194 174548 175408 183564 168214 126435 106506 89802 99606
8551I9606J8354k1570j7968M3262k0482J6202K4196j415k7820R340l069M9152
$$ 99606 117960 96390 78422 121684 101202 117404 141600 140185 112365 121705 118636 167788
8539A67788O6872M514o548m6774k5089r215k6952p13J2076L988k783p3651j3389
$$ 167788 234660 239174 232626 185852 160763 151548 124596 123883 135959 139947 137164 63513 50124
8526E0124K8162K9714J08q898L0805O2901J8576j4465K161m9976n801k84l4887
$$ 50124 78286 108000 108108 99210 130015 192916 211492 197027 199188 149212 143411 143127 108240
8513A08240k6256J04672p961j8574J2857j6369P679k6033l9164o26L8588j0266
$$ 108240 81984 186656 178695 160121 172978 156609 164288 138255 99091 98465 137053 126787
8501A26787k3586k6451J9726M1350k9955o645m9381K0777M9518q792n4465K6710
$$ 126787 103201 76750 96476 137826 107871 101226 51845 72622 122140 113348 58883 85593
8489H5593K1341J7234k9555m2008N321L0397J7941p658j8916l1170N856l2147
$$ 85593 106934 124168 94613 52605 57926 88323 106264 98606 79690 48520 54376 22229
8477B2229j7905L3854N6808M0994k1586l5185k945o545l807l0929J4391J71N6041
$$ 22229 4324 38178 94986 135980 114394 79209 76264 69719 65912 34983 49374 49545 105586
8464A05586L4849j0002o5870j3371l765p3320l7176N1462M8041J8928K9856J4736
$$ 105586 140435 130433 64563 51192 47427 -25893 -63069 -11607 36434 55362 85218 99954
8452I9954M2039k5316n6497j1712L7525L1189j56J442j8379q802q7844L699L3553
$$ 99954 141993 116677 60180 48468 85993 117182 117026 118468 100089 91287 3443 7142 40695
8439D0695k4453m542L195J1981K2016j1139J6206P991J335p962J1232O991J8252
$$ 40695 16242 11700 14895 26876 48892 37753 53959 61950 63285 55323 66555 73546 91798
8426I1798j8192L4416K1185l5363J050k9001L69j6993P00L2088m409k9938j1913
$$ 91798 73606 108022 129207 93844 94894 65893 66262 49269 49969 82057 77648 47710 35797
8413C5797j5756L7952j0376M0582R752m1925P785m484j0600k1972J4920N1811
$$ 35797 20041 57993 47617 88199 97951 56026 63811 59327 48727 26755 41675 93486
8401I3486j8699N723j0651k1294K4465j3930P319P0876J4026q1409k3453l015
$$ 93486 74787 80510 69859 48565 73030 59100 66419 137295 151321 69912 46459 43444
8389D3444l572M1959k003K2785N2202K4398j1824k7700L196j7734j0875k4652
$$ 43444 39872 81831 79828 102613 154815 179213 167389 139689 142885 125151 114276 89624
8377H9624j4217J0767n5957k5435J9089j082j7382m3282L3210J1081L0909k947
$$ 89624 75407 86174 30217 4782 23871 22789 5407 -37875 -4665 6416 37325 34378
8365C4378k0584j3278J1197k5704J7649Q21k8199K2638Q814k5012j0560M8486
$$ 34378 13794 516 11713 -13991 3658 4479 -23720 -1082 7732 -17280 -27840 20646
8353B0646M3411K1304m523k0217o616n505o6938J445j2442Q732Q3167J4364j3418
$$ 20646 64057 85361 80838 60621 54005 48500 -18438 -16993 -29435 -20703 62464 76828 63410
8340F3410j9870j2325r931N52K2389R703k3009L4246L0257m5700m1921l9546k3410
$$ 63410 43540 31215 21284 21836 44225 53928 30919 65165 95422 49722 7801 -31745 -55155
8327e5155M0027M5632l3323K01N0199m103K7840j6779l8447j3441J7310L2313
$$ -55155 -15128 30504 -2819 -2618 47581 43478 71318 54539 16092 2651 19961 52274
8315E2274L2415L1563r7191n2555J3166K1600o048j4728K1561K7951P268j8743
$$ 52274 84689 116252 19061 -33494 -20328 1272 -4776 -19504 2057 30008 37276 18533
8303A8533n1851p085N8900J6187J4920r210j4076m3455J2494n731J2989P9647
$$ 18533 -33318 -40403 18497 34684 49604 40394 26318 -17137 -4643 -10374 2615 82262
8291H2262k3891L5830j597l5061j2245L3565J3945l8321n6819J0336O595n453
$$ 82262 58371 94201 92604 57543 45298 78863 92808 54487 -2332 8004 14599 9146
8279I146L7888N2632K238l2268K2781o089n363L3849l8439j8270j7788k7830p545
$$ 9146 47034 99666 101904 69636 92417 86328 80965 114814 76375 58105 40317 12487 4942
8266D942J6020j5004N110j8156O154O220J8469J8551l4753k8187j0392K0036L4578
$$ 4942 20962 5958 11068 -7088 -934 5286 23755 42306 7553 -20634 -31026 -10990 23588
8253B3588O5410M6331K0891m2838j2649K2367o425l3077j2797k9126l8933n105
$$ 23588 88998 135329 156220 113382 100733 123100 116675 83598 70801 41675 2742 -2363
8241b363L2320M1231m168K8491M2335O135m0516m2403J5860K3444j6893p921l7866
$$ -2363 29957 71188 67020 95511 137846 143981 103465 61062 76922 100366 83473 75552 37686
8228C7686l0522q06L3102K1674N8970k2842n3828l4810M1516O0532j2434l6649
$$ 37686 7164 6358 39460 61134 120104 97262 43434 8624 50140 110672 98238 61589
8216F1589k2653m9239j4803k2541k5152L0611J8916J2223m2848L9050L7522O4763
$$ 61589 38936 -10303 -25106 -47647 -72799 -42188 -23272 -11049 -53897 -14847 22675 87438
8204H7438L1394j9248k9621k8103m4832o0627K2490M4316L4091l2096l7087j5747
$$ 87438 118832 99584 69963 41860 -2972 -63599 -41109 3207 37298 5202 -31885 -47632
8192d7632j0874L4355N5588J376m1901j3397K6514j3122M194J169J7687L3042
$$ -47632 -58506 -24151 31437 32813 -9088 -22485 4029 -9093 -4899 -3730 13957 46999
8180D6999j7088k900q439l669j1913k7633K9989P0724K4251J5221m9413o0973
$$ 46999 29911 27011 18572 14903 2990 -24643 5346 76070 100321 115542 66129 5156
8168E156Q158N2537O061K5401r582m9940l4496Q544K1818j1620k0483o421j7910
$$ 5156 13314 65851 71912 97313 87731 37791 3295 11839 33657 22037 1554 -4867 -22777
8155b2777K7136l4889K4700K3679O0467K4061q2775j4775L855K1105K2361K0687
$$ -22777 4359 -30530 -5830 17849 78316 102377 19602 4827 8682 29787 52148 72835
8143G2835J5224K4037J2562l034n1534L9N0695k0906p2326p1893j6630K7670o
$$ 72835 88059 112096 124658 121624 70090 70129 120824 99918 27592 -44301 -60931 -33261 -33267
8130c3267j3499o67L5669O7021K4623K0200N6843J3010n9485q5014K861L7729
$$ -33267 -46766 -47433 -11764 55257 79880 100080 156923 169933 110448 25434 28295 66024
8118F6024M6513L2847j1694o2494l605J9910R949j9014M169O3095O4447K6983
$$ 66024 112537 145384 133690 71196 67591 87501 97450 78436 82605 145700 210147 237130
8106B37130P432l3972k6026q580k2907k2243j0187l6754k685l9757m662o791K2791
$$ 237130 244562 210590 184564 175984 153077 130834 120647 83893 81208 41451 36789 29998 52789
8093E2789J2898r730l1239k6749l6553J8331K3094L7329M7744J3165k5150j5663
$$ 52789 65687 55957 24718 -2031 -38584 -20253 2841 40170 87914 101079 75929 60266
8081F0266K7593Q26m7873L0223L4261j439k4605R892P638k498O386o223K3909
$$ 60266 87859 88685 40812 71035 105296 103857 79252 89144 96782 94284 100670 94447 118356
8068A18356P633K296j0697J319O4413N0091O9387O0546Q2654Q6885j268p6932
$$ 118356 125989 128285 117588 118907 183320 233411 302798 363344 445998 532883 531615 454683
8056D54683l6762O401k4524j00228q6838J5687J0429p727L3243k1619q9658K5601
$$ 454683 417921 424322 399798 299570 212732 228419 238848 231121 264364 242745 153087 178688
8044A78688K7048l8161k444K2471K4227K4285l9281o4941N9936l9181k6042J6576
$$ 178688 205736 167575 165131 187602 211829 236114 196833 131892 191828 152647 126605 143181
8032A43181J0002l0028j8895k3818L8937R3754K5908L3530O6486L1200O7169J2547
$$ 143181 153183 123155 104260 80442 119379 213133 239041 272571 339057 370257 437426 449973
8020D49973m7070l1594q987l7005l5888n3453l213O547L3379L1257N481k4755
$$ 449973 402903 371309 362322 325317 289429 235976 232763 239310 272689 303946 309427 284672
8008B84672o2840J5576J6474l5469k7128K419j193J1837J3690J6844k6761o6878
$$ 284672 221832 237408 253882 218413 191285 193704 192511 204348 218038 234882 208121 141243
7996A41243k1904J5756N1357j3787l0835K3552N875k027o057o522l893j5492o164
$$ 141243 119339 135095 186452 172665 141830 165382 171257 169230 163173 156651 152758 137266 131102
7983A31102m2261J4693j8273m2432o861L8190K8381m818k8568M2253L3529p104
$$ 131102 88841 103534 85261 42829 35968 74158 102539 97721 69153 111406 144935 137831
7971A37831J4205q677k6591j8503L336p7571n0580N756L1756M3105J5842K1827
$$ 137831 152036 143359 116768 98265 101601 24030 -26550 -20794 10962 54067 69909 91736
7959I1736J3939N887L2854j6807n1007K5276Q716K007k979j0925m1572n8967P932
$$ 91736 105675 111562 144416 127609 76602 101878 110594 112601 109622 98697 57125 -1842 6090
7946F090j5613k6449K7654n587L0988J3142J7054k6420j2903K8570L6078j0712
$$ 6090 -9523 -35972 -8318 -13905 17083 30225 47279 20859 7956 36526 72604 61892
7934F1892q4047M7112K0594j7750k2332J7045j2046j7749k8443O9881L4092j8361
$$ 61892 -22155 24957 45551 27801 5469 22514 10468 -7281 -35724 34157 68249 49888
7922D9888j1810l147j7191P109M3960L5127p01k2026k9184j067j2048l1772K5779
$$ 49888 38078 34931 17740 24849 68809 103936 103235 81209 52025 50958 38910 7138 32917
7909C2917O514p386Q918l0969p4164k4033O9824O1591N9145m537l0998N1135M2134
$$ 32917 39431 32045 40963 9994 -64170 -88203 -18379 43212 102357 97820 66822 117957 160091
7896A60091k4255m3260K1839m313q8220m3221L4277N5946K5004K6555J1177m9357
$$ 160091 135836 92576 114415 110102 21882 -21339 12938 68884 93888 120443 131620 82263
7884H2263m6244J3291l881k0565j6873O1011P2052O418M602M1284l8727p1827
$$ 82263 36019 49310 45429 24864 7991 69002 141054 147472 152074 193358 154631 82804
7872H2804k0334k7257l5542M295L0499L8150J6627k3707q7839k5501M4367Q1855
$$ 82804 62470 35213 -329 3966 34465 72615 89242 65535 -22304 -47805 -3438 78417
7860G8417M5316j8484n701L0014M933o977p2247m2925J8533j063o6792n9941N9503
$$ 78417 123733 105249 99548 129562 134495 127518 55271 12346 30879 29816 -36976 -96917 -37414
7847c7414K1197N796M4586m4977M665k1745m4282K9039L5430k8523O319j588L2173
$$ -37414 -16217 -10421 34165 -10812 -6147 -27892 -72174 -43135 -7705 -36228 -29909 -31497 676
7834F76M0511J2984j7691l6787J1260K8336J0413o259l7865k4023N8535L7196
$$ 676 41187 54171 36480 -307 10953 39289 49702 43443 5578 -18445 40090 77286
7822G7286l3366j8533K4138J9470j1947l0673p867K1587L3276L3732n0338o0325
$$ 77286 43920 25387 49525 68995 57048 26375 18508 40095 73371 107103 56765 -3560
7810c560j3827J5137l7125k4791n709L2982M0497J7336q232m586k4482j9965l7595
$$ -3560 -17387 -2250 -39375 -64166 -69875 -36893 3604 20940 12708 8122 -16360 -36325 -73920
7797g3920N47K3717O8661O227j1749j1536j8435l2080M543J2585J2456O1m3255
$$ -73920 -73373 -49656 19005 25232 13483 1947 -16488 -48568 -44025 -31440 -18984 -18923 -62178
7784f2178K0305o2969J8997M1845N7276J6850j7062n3944R07M4676R502n726j8844
$$ -62178 -41873 -104842 -85845 -44000 13276 30126 13064 -40880 -39973 4703 14205 8479 -10365
7771a0365Q107J2275j5329k8943m7054l279N0135J1134m4107m989j8638K4292
$$ -10365 -2258 10017 -5312 -34255 -81309 -84588 -34453 -23319 -67426 -72415 -91053 -66761
7759f6761Q2918m0060o5468K1438K2729P895M6348J6595M4554J1988l8312l8656
$$ -66761 16157 -23903 -89371 -67933 -45204 -37309 9039 25634 70188 82176 43864 5208
7747E208m2006M5338Q5060n5711o0771O102P761m483Q970j7103j2110J9992R600
$$ 5208 -36798 8540 93600 37889 -22882 -16780 -9019 -13502 -4532 -21635 -33745 -13753 -4153
7734d153K99m3019J4062N77j0470n643M2568J4678k8031j5963j0482l8713p453
$$ -4153 -3854 -46873 -32811 -32234 -42704 -48347 -5779 8899 -19132 -35095 -45577 -84290 -91743
7721i1743J2750L5380k866j4750k4678k003J4784N707J3351k5391k264M1501P2270
$$ -91743 -78993 -43613 -46479 -61229 -85907 -87910 -73126 -67419 -54068 -79459 -81723 -40222 32048
7708C2048M0263N2700N391n0556m0905k6864n1998r0363J4696O6357O1442K2125
$$ 32048 72311 125011 130402 79846 38941 12077 -39921 -130284 -115588 -49231 12211 34336
7696C4336q7774n4906j801J9696K618j2477K1320L4202J5628J8286J3010k394
$$ 34336 -53438 -108344 -110145 -90449 -87831 -100308 -78988 -44786 -29158 -10872 2138 -256
7684b56j5366k1192L264L6512K8439j3562k3800r0691r569Q7940L7744m343J2137
$$ -256 -15622 -36814 -33550 2962 31401 17839 -5961 -96652 -106221 -18281 19463 15120 27257
7671B7257K8552j0320l1215J5578o007j7666k525k1584K7026l020o6503k5529
$$ 27257 55809 45489 14274 29852 23845 6179 3654 -17930 9096 6076 -60427 -85956
7659h5956N428O2142j067m4511k0597M618Q110Q3898J4414o0320j9766L6572L4359
$$ -85956 -80528 -18386 -19453 -63964 -84561 -79943 -71833 12065 26479 -33841 -53607 -17035 17324
7646A7324l4790J466K2900N36M240Q70L3768J4549m6947l925J872j3959J913K6364
$$ 17324 -17466 -16000 6900 7436 11676 12546 46314 60863 13916 9991 11863 -2096 -183 26181
7632B6181J1401Q919k3751M1065J9403l3281n8845R959j3885L2237n566l3232
$$ 26181 37582 46501 22750 63815 83218 49937 -8908 1051 -12834 19403 13837 -19395
7620a9395J3890j2762k4336j0700M4779J5226L204k6607K6770L1872j5469j8493
$$ -19395 -5505 -18267 -42603 -53303 -8524 6702 9906 -16701 10069 41941 26472 7979
7608G979p408j2877K2488M3438M7607p010j7157n1107J2532j8002k1609l433J5587
$$ 7979 571 -12306 10182 53620 101227 94217 77060 25953 38485 20483 -1126 -4559 11028
7595A1028j3836r265L6692L8594j5447k2943K8844L3884m3531m2693N815M7618
$$ 11028 -2808 -12073 24619 63213 47766 24823 53667 87551 44020 1327 7142 54760
7583E4760j7265l9673j6565l3834K3464k7540J0213L9200l039K7230J4505l4814
$$ 54760 37495 -2178 -18743 -52577 -29113 -56653 -46440 -7240 -10279 16951 31456 -3358
7571c358M4150J7603r794N833l289j2961L2082j9921M5475l1027l7847j6243O8852
$$ -3358 40792 58395 48601 54434 51145 38184 70266 50345 95820 64793 26946 10703 79555
7558G9555J9797k1008J1166J4950n6683K3706N2842k470k2303p0348l0231j3658
$$ 79555 99352 78344 89510 104460 47777 71483 124325 121855 99552 29204 -1027 -14685
7546a4685n0289q543K4474n263K3812M545J191J965K372o9116j03461K6245O6057
$$ -14685 -64974 -73517 -49043 -54306 -30494 -25949 -24758 -22793 -20421 -89537 -192998 -166753 -100696
7533a00696J4179N64J10M3470O7490j7531k8216p7385J0487O7665M0810p355J261
$$ -100696 -86517 -85953 -85843 -42373 25117 7586 -20630 -98015 -87528 -19863 20947 13592 14853
7520A4853Q4406J5615m5519k8423J4135K0946m4604l8577n4286p671j3447M1892
$$ 14853 99259 114874 69355 40932 55067 76013 31409 -7168 -61454 -69125 -82572 -40680
7508d0680P9098L3627j9710j4077n1634L181O430n304K4239r339K1775k9970p0511
$$ -40680 38418 72045 52335 38258 -13376 -10195 -3765 -9069 15170 5831 27606 -2364 -72875
7495g2875j3850K9810O3R038J4314M8633L6574J1436M0350p968n2094O445O7524
$$ -72875 -86725 -56915 -56852 -47814 -33500 15133 51707 63143 103493 95525 43431 49876 117400
7482A17400k5321l1232k947n8079p817j6441j6531M5665l4991J960j1713O769
$$ 117400 92079 60847 57900 -179 -7996 -24437 -40968 4697 -30294 -28334 -40047 -33278
7470c3278N463L7018J1641k2836m4203Q229O8837R816k6411q8267n8551O4191
$$ -33278 -27815 9203 20844 -1992 -46195 -37966 30871 40687 14276 -73991 -132542 -68351
7458f8351L8010k9704L6066P31K3845J2995K424O053M077l7006p5387J7440j0595
$$ -68351 -30341 -60045 -23979 -23248 597 13592 16016 22069 26146 -10860 -86247 -68807 -79402
7445g9402o211l38J3784J9428n4713m3735O2293R840r895J0249M0831P2310q173
$$ -79402 -85613 -85951 -72167 -52739 -107452 -151187 -88894 -79054 -88949 -78700 -37869 34441 26268
7432B6268J0509J0356K4008m0459m5036n4685K9279P2863p596k9746N487j4017
$$ 26268 36777 47133 71141 30682 -14354 -69039 -39760 33103 25507 -4239 1248 -12769
7420a2769k221O146N4267J6734k1386n4340o1425R774M4624N35J21J3345N0957
$$ -12769 -14990 -8844 45423 62157 40771 -13569 -74994 -65220 -20596 -20061 -19940 -6595 44362
7407D4362p7596m3785J9143j1234j9436M9903J7612K0981j1592j7518l0054k6829
$$ 44362 -33234 -77019 -57876 -69110 -88546 -38643 -21031 -50 -11642 -29160 -59214 -86043
7395h6043J7596L6125l0443J9605K6968r652Q192r409K2446r037J4044m3606p5774
$$ -86043 -68447 -32322 -62765 -43160 -16192 -25844 -17652 -27061 -4615 -13652 392 -43214 -118988
7382a18988l5620N1903P0702R4409m8650r111k1908K9901j7410j5515J3688J1139
$$ -118988 -154608 -102705 -32003 62406 13756 4645 -17263 12638 -4772 -20287 -6599 4540
7370D540K2512J8046m1051k9571M5973J2717N27q039Q774P990l5155j6425j9529
$$ 4540 27052 45098 4047 -25524 20449 33166 33693 25654 34428 42418 7263 -9162 -28691
7357b8691J0681J5181J6508L0606m0621j4352J5571j2185k5499p801R392k0869
$$ -28691 -18010 -2829 13679 44285 3664 -10688 4883 -7302 -32801 -40602 -31210 -52079
7345e2079K5520L1200M9873j639j2217J060l5230j6455O139J0480l2451K7896
$$ -52079 -26559 4641 54514 52875 40658 41718 6488 -9967 -3828 6652 -25799 2097
7333B097O6088j4223r101k5393l9531K5264J0122n6225k1143k0658j6422J7517
$$ 2097 68185 53962 44861 19468 -20063 5201 15323 -40902 -62045 -82703 -99125 -81608
7321h1608L2023O0890N2647J5032l4619K0368K5361j64l0647Q834m6095l22k8899
$$ -81608 -49585 11305 63952 78984 44365 64733 90094 89930 59283 68117 22022 21700 -7199
7308g199l5541J5276M28n5661k6485r097K8893J8484K0859k5628j1008M076k5352
$$ -7199 -42740 -27464 -27036 -82697 -109182 -118279 -89386 -70902 -50043 -75671 -86679 -82603 -107955
7295a07955L6676L0554r947o119J4364K433l2741K588P3232L6309J999k1318j522
$$ -107955 -71279 -40725 -50672 -56791 -42427 -39994 -72735 -70147 3085 39394 41393 20075 18553
7282A8553k4426K3828j1960J6423m1719k2657j3095Q946J2464j1483k3216j3240
$$ 18553 -5873 17955 5995 22418 -19301 -41958 -55053 -46107 -33643 -45126 -68342 -81582
7270h1582l3765K4785k129K4227R158l009M1406j4498o0501K726n734O0144P2471
$$ -81582 -115347 -90562 -92691 -68464 -59306 -62315 -20909 -35407 -95908 -93182 -98916 -38772 33699
7257C3699M1089K5949l3658k4920o205l9449k4935j8177R084N9101j5869J818
$$ 33699 74788 100737 67079 42159 35954 -3495 -28430 -46607 -37523 21578 5709 7527
7245G527n161q532J3459J555l8636k7683l4266L1319P568j5823l46j2738J4764
$$ 7527 2366 -6166 7293 8848 -29788 -57471 -91737 -60418 -52850 -68673 -69019 -81757 -66993
7232f6993K2015K0735j5461J0844K7078L8017K9347j1115Q596m7988k9254j1396
$$ -66993 -44978 -24243 -39704 -28860 -1782 36235 65582 54467 63063 15075 -14179 -25575
7220b5575n361K7395M3854m2677k9466k176J3958l7333n5064J9760M5757L7850
$$ -25575 -30936 -3541 40313 -2364 -31830 -34006 -20048 -57381 -112445 -92685 -46928 -9078
7208i078J3522O108J7790k632k2141k9994l872N007K3802p400m1144k7343O68
$$ -9078 4444 10552 28342 25710 3569 -26425 -30297 -25290 -1488 -8888 -50032 -77375 -76707
7195g6707L3594K6658l259K1615m390k5138P0226M4640q422n4551m4635j2392
$$ -76707 -43113 -16455 -19714 1901 -2489 -27627 42599 87239 78817 24266 -20369 -32761
7183c2761P6871j4205n6169q201J4757K2181K0210O81l4817J791M2216M165p9315
$$ -32761 44110 29905 -26264 -34465 -19708 2473 22683 23364 -11453 -9662 32554 36719 -42596
7170d2596j6512N3753J1766p6176N497J7774N3440M7897K9977n5260l3705K6760
$$ -42596 -59108 -5355 6411 -69765 -64268 -46494 6946 54843 84820 29560 -4145 22615
7158B2615K7231m5804R635j3938k1759K9159K6703M3654l3828m6364j1630J5175
$$ 22615 49846 4042 13677 -261 -22020 7139 33842 77496 43668 -2696 -14326 849
7146H49p888J3363m3080l8384m0521K8754K3518q803L3109L1638m473M831j8947
$$ 849 -7039 6324 -36756 -75140 -115661 -86907 -63389 -72192 -39083 -7445 -11918 -7087 -26034
7133b6034j3989J0983L1146K2174j6416j8790M8328J8216l9357k5065K7740N2259
$$ -26034 -40023 -29040 2106 24280 7864 -10926 37402 55618 16261 -8804 18936 71195
7121G1195j4122J3473J2145L052n9918l3237j3629O3065j7850n6075l7658N5621
$$ 71195 57073 70546 82691 85743 25825 -7412 -21041 42024 24174 -31901 -69559 -13938
7109a3938K3517k2154J2030O509l2264l3430K9977j5133k5489M2757K0953j113
$$ -13938 9579 -12575 -545 5964 -26300 -59730 -29753 -44886 -70375 -27618 -6665 -7778
7097g778K169J7258l4711j8224P729R238r07j4942K5007M6782k009k1385j0815
$$ -7778 -5609 11649 -23062 -41286 -33557 -24319 -25226 -40168 -15161 31621 29612 8227 -2588
7084b588j125K682O518k0241n1207J8310J1163m6550N014R500K6746M0396m6329
$$ -2588 -3713 -1031 5487 -14754 -65961 -47651 -36488 -83038 -78024 -68524 -41778 -1382 -47711
7071d7711n3655p2667J5980L5338o420P2789P4835L6350j8528l9038n344k3023
$$ -47711 -101366 -174033 -158053 -122715 -129135 -56346 18489 54839 36311 -2727 -8071 -31094
7059c1094J8429N2134j0666j5841o9988m0346L632M0489L4587J9739M7325K0106
$$ -31094 -12665 39469 28803 12962 -57026 -97372 -93740 -53251 -18664 1075 48400 68506
7047F8506p0284k5512N626k6875M7826K3275R649J803k535j3364m0416K5823L7663
$$ 68506 -1778 -27290 -21664 -48539 -713 22562 32211 34014 31479 18115 -22301 3522 41185
7034D1185q396k0618l8310k8026j965N8250p597m4697l2770N5360P5767J3596
$$ 41185 32789 12171 -26139 -54165 -56130 2120 -5477 -50174 -82944 -27584 48183 61779
7022F1779o6693j814J5559k9507l7003k514J9163r356K1090P0757L9338m4918
$$ 61779 -4914 -6728 8831 -20676 -57679 -60193 -41030 -50386 -29296 41461 80799 35881
7010C5881L3235m1074o2390l0007m992L9420M0493m57P261p074K442K2265L9375
$$ 35881 69116 28042 -34348 -64355 -69347 -29927 10566 10109 17370 10296 12738 35003 74378
6997G4378L5800l4962m9574R776Q323l6529m1683q236j5741r788K0839J5647J2149
$$ 74378 110178 75216 25642 35418 43741 7212 -34471 -42707 -58448 -68236 -47397 -31750 -19601
6984a9601k9696M3908K5753n7412l0978m64j8654J5064N003M39O1168L1627J4605
$$ -19601 -49297 -5389 20364 -37048 -68026 -68490 -87144 -72080 -67077 -66638 -5470 26157 40762
6971D0762j9436q3918k7539L6339J3490j6517o26r93K5744M0517p9N6530O0152
$$ 40762 21326 -62592 -90131 -53792 -40302 -56819 -57445 -58438 -32694 7823 7744 64274 124426
6958A24426K2891p038n3979p4344K5303O646n9437Q909K4471J9461k5793k8766
$$ 124426 147317 140279 86300 11956 37259 43905 -15532 -6623 17848 37309 11516 -17250
6946a7250L1662N5578K1121l2070m5917L2471K3140j5125k5056K1718Q082j9371
$$ -17250 14412 69990 91111 59041 13124 45595 68735 53610 28554 50272 58354 38983
6934C8983k3131k8659J7457M1188l6008m0298K8885k5478k2711J4072M0871Q91
$$ 38983 15852 -12807 4650 45838 9830 -30468 -1583 -27061 -49772 -35700 5171 6062
6922F062o961J7309L803j6582O8388P3051k4268o5495N975M377r4356o254J1020
$$ 6062 -899 16410 20213 3631 72019 145070 120802 55307 61282 65659 -28697 -34951 -23931
6909b3931L6214K9620K0235m5252l6882j3551l0111N4715P2849M6882P550n4421
$$ -23931 12283 41903 62138 16886 -19996 -33547 -63658 -8943 63906 110788 118338 63917
6897F3917k9190j7433p036J2951M7268r112m9638p196R238L4023L1669O4564N1280
$$ 63917 34727 17294 10258 23209 70477 61365 11727 4531 13769 47792 79461 144025 195305
6884A95305N2641R156p1369k2489k9229l0494p4711o8476J3513J2799j213J1366
$$ 195305 247946 257102 185733 163244 134015 103521 28810 -39666 -26153 -13354 -14567 -3201
6872c201L6287K4127K7347L1815j9429o2997l3945M9349l7651j7037N0697K0015
$$ -3201 33086 57213 84560 116375 96946 33949 4 49353 11702 -5335 45362 65377
6860F5377q0273m1438M6269O4256N5350n5162o3433l0551R6198M188k026k1977
$$ 65377 -14896 -56334 -10065 54191 109541 54379 -9054 -39605 56593 60781 58755 36778
6848C6778j5083j2210L7044o70j1259k3767n7262M0219O0518K0418N6748k269
$$ 36778 21695 9485 46529 45859 34600 10833 -46429 -6210 54308 74726 131474 129205
6836A29205j0607m8396p3703j6086N1187n908l7757o1755L0474L3071L5427M7454
$$ 129205 118598 70202 -3501 -19587 31600 25692 -12065 -73820 -43346 -10275 25152 72606
6824G2606P871j6638l6845l5430L3192N3211N636O202J0949o181P754J0855p840
$$ 72606 80477 63839 26994 -8436 24756 77967 83603 89805 100754 94573 102327 113182 105342
6811A05342J1691j5761l7310k6818k4152k8929J0978N0093j0695K513J7919M6002
$$ 105342 117033 101272 63962 37144 12992 -15937 -4959 45134 34439 36952 54871 100873
6799A00873Q421R236l7027o6893j6018L0219K189M7803N3571J9300n1385l1627
$$ 100873 109294 118530 81503 14610 -1408 28811 31000 78803 132374 151674 100289 68662
6787F8662l2828k7427J6864K1870L9572J5410j6165l3259K262M7135J1066O6961
$$ 68662 35834 8407 25271 47141 86713 102123 85958 52699 54961 102096 113162 180123
6775A80123l2473q1170j2790L379m0056j2051K2754O4787K6173J7241m0008L715
$$ 180123 147650 66480 53690 57069 17013 4962 27716 92503 118676 135917 95909 99624
6763I9624m5227k7600J8519N2635P1850J7656l4070L044L8201M1289k6617j5418
$$ 99624 54397 26797 45316 97951 169801 187457 153387 156431 194632 235921 209304 193886
6751A93886J691M3815P7843Q8453J8078k75J6161J6119r16K9364N2971O5885J24946
$$ 193886 195577 239392 317235 405688 423766 423491 439652 455771 454855 484219 537190 603075 728021
6738G28021R9777P7441l313n4466n6736k8640l4672N3260R5296J32213J00096
$$ 728021 827798 905239 901926 847460 790724 762084 727412 780672 875968 1008181 1108277
6727A108277J56580J39350J31769K37732K68185L34256M30977N74194Q32493J163180
$$ 1108277 1264857 1404207 1535976 1773708 2041893 2376149 2807126 3381320 4213813 5376993
6717E376993J559790K262807K919853K669897R64036p27032k222951l214965k915394
$$ 5376993 6936783 9199590 12119443 14789340 15753376 15026344 12803393 9588428 6673034
6708F673034j961880j278830q19056o01738m59399l20909k18137j70265j13078
$$ 6673034 4711154 3432324 2613268 2011530 1552131 1231222 1013085 842820 729742
6699G29742j00643j02270p4276n3767n042M1131J5390L3203J7744k7896K1158
$$ 729742 629099 526829 452553 398786 393744 434875 450265 483468 501212 473316 494474
6688D94474K8535p7846q0020o2694p6225m9856L404m527j67k7746J5092Q202J8524
$$ 494474 523009 445163 365143 302449 226224 176368 179772 175245 175078 147332 162424 170626 189150
6675A89150N6242j8523k2997l7432q900N758N21m1482k3524l2256l9671L0218
$$ 189150 245392 226869 203872 166440 157540 163298 163819 122337 98813 66557 26886 57104
6663E7104J3757J2922K4761J7531j16n7552j0146J2232q177j0928l4320r408j8130
$$ 57104 70861 83783 108544 126075 125959 68407 58261 70493 62316 51388 17068 7660 -10470
6650a0470k035k962P3379J6257l9692K7034j6019p2391J149L8495M0614m4165
$$ -10470 -12505 -15467 57912 74169 34477 61511 45492 -26899 -25750 12745 53359 9194
6638I194J5166j645J7200j3949j1641j9641l275k9056o0818j6567O8839M8057
$$ 9194 24360 22715 39915 25966 14325 -5316 -8591 -37647 -98465 -115032 -46193 1864
6626A864j9963L3301k340n1448k9492M8207m185K7241Q5097O833p9208p0996k712
$$ 1864 -18099 15202 12862 -38586 -68078 -19871 -24056 3185 88282 95115 15907 -55089 -57801
6613e7801j5000k5139K5638L2284L841M6943M7034N3574m3171r3730l4034N8232
$$ -57801 -72801 -97940 -72302 -40018 -36177 10766 57800 111374 68203 -25527 -59561 -1329
6601a329j0764m394L4899J7555j2130k3586J1320J1362j184j4656k3013j261j8373
$$ -1329 -12093 -16487 18412 35967 23837 251 11571 22933 21749 7093 -15920 -17181 -35554
6588c5554J0433k02J6407p7m729j0606N495L9267L0798p987L5796l2841n8741
$$ -35554 -25121 -25323 -8916 -8993 -13722 -24328 -18833 20434 51232 43245 79041 46200 -12541
6575a2541l1302m1092k3502K221O714o678N2340O1378J7943n5866l2624K5447
$$ -12541 -43843 -84935 -108437 -106216 -99502 -106180 -53840 7538 25481 -30385 -63009 -37562
6563c7562n785K107L989K6393j3210r991o877l6356O091R294J988o2727L408P9993
$$ -37562 -43347 -41240 -37251 -10858 -24068 -34059 -40936 -77292 -71201 -61907 -59919 -122646 -119238 -39245
6549c9245O9784K0153k0475J551q5968l3530J7879k3244J2005m5144L1594N3388
$$ -39245 30539 50692 30217 31768 -54200 -87730 -69851 -93095 -81090 -126234 -94640 -41252
6537d1252O9839K0385J061n8210j1685N5569Q77k9380l5679L0951K4165l7156
$$ -41252 28587 48972 50033 -8177 -19862 35707 36584 7204 -28475 2476 26641 -10515
6525a0515q559J6665k2345r710j653K3724M6045N9314P43p5079k1040K5143l0744
$$ -10515 -19074 -2409 -24754 -34464 -36117 -12393 33652 92966 93709 18630 -2410 22733 -8011
6512h011p919K6005J4529k6002n4847j6109O6647P1126J7884N5723j3280m7362
$$ -8011 -15930 10075 24604 -1398 -56245 -72354 -5707 65419 83303 139026 125746 78384
6500G8384j7117n9616o8658q208l078L2208k5209K3953K5346L0530K5377j8411
$$ 78384 61267 1651 -67007 -75215 -78293 -46085 -71294 -47341 -21995 8535 33912 15501
6488A5501l0476k024j0246K0330Q785m451K9118l6081K2514L6224j2220j1838
$$ 15501 -14975 -16999 -27245 -6915 1870 -2581 26537 -9544 12970 49194 36974 25136
6476B5136K6928O58m9438n8751L1425J6232l433j223j7233j347J9695j0725m510
$$ 25136 52064 52722 3284 -55467 -24042 -7810 -11243 -12466 -29699 -31046 -11351 -22076 -26586
6463b6586n575n312o062n776k2281k273L7505J5432R565R903j131L2157J2865
$$ -26586 -32161 -37473 -43535 -49311 -71592 -73865 -36360 -20928 -11363 -1460 -2591 29566 42431
6450D2431k6661J998p465J2625M572p206r012j7115K5848L1623m6081j3367P0018
$$ 42431 15770 17768 10303 22928 27500 20294 11282 -5833 20015 51638 5557 -7810 62208
6437F2208l857k2233K3247l6533l6524Q690K3525j0831j7967N2081j2376k027
$$ 62208 58351 36118 59365 22832 -13692 -5002 18523 7692 -10275 41806 29430 27403
6425B7403J9821n6053l5541K7528j6781J1263L5921L6400l064K9092p1318o2318
$$ 27403 47224 -8829 -44370 -16842 -33623 -22360 13561 49961 46897 75989 4671 -57647
6413e7647J5847L535O731k7371n2196J2528O4884O8198K6395m6241O637k0383
$$ -57647 -41800 -38265 -31534 -58905 -111101 -98573 -33689 34509 60904 14663 21300 917
6401I17J0269M601l981n9354k7132o6k972N0423K5277J4191M433q099L6902P7932
$$ 917 11186 15787 11806 -47548 -74680 -74746 -77718 -27295 -2018 12173 16606 8507 45409 123341
6387A23341M8940l0575n7630K2390m6325l5950L528M1611l0866m5916J2820J6005
$$ 123341 172281 141706 84076 106466 60141 24191 27719 69330 38464 -7452 5368 21373
6375B1373m4646k9149M4507L9115O4847j3970o2561p9869J919L5720J4049j4535
$$ 21373 -23273 -52422 -7915 31200 96047 82077 19516 -60353 -58434 -22714 -8665 -23200
6363b3200L0179j4236K635n6762R735P1833K8213l5150J6294j8142j6081n14l5193
$$ -23200 6979 -7257 -4622 -61384 -51649 20184 48397 13247 29541 11399 -4682 -5196 -40389
6350d0389J9551K9996k4068j7188m3183m1505L2294L2655K1165o3269K792M6692
$$ -40389 -20838 9158 -14910 -32098 -75281 -116786 -84492 -51837 -30672 -93941 -91149 -44457
6338d4457Q3825L7831k2406K4428l2582m8155r679k9816K159l9975j6055l3098
$$ -44457 39368 77199 54793 79221 46639 -1516 -11195 -41011 -38852 -78827 -94882 -127980
6326a27980O271K1795j7472m909P7272K9085m4078J2426K8499m3273J400N697
$$ -127980 -121709 -99914 -117386 -122295 -45023 -15938 -60016 -47590 -19091 -62364 -60964 -55267
6314e5267m027K0503K2416l6405L803L3900j1694q16m6468N8013J0174p5850j1160
$$ -55267 -59294 -38791 -16375 -52780 -48977 -15077 -26771 -27587 -74055 -16042 -5868 -81718 -92878
6301i2878L0260M2759K2738k7908n0207K924J9245m404K9897l2089j4080n672
$$ -92878 -62618 -19859 2879 -25029 -75236 -72312 -53067 -57471 -27574 -59663 -73743 -79415
6289g9415p082J6727L1664M8385R056j3877j7842j0876J146m0936o140M844M9975
$$ -79415 -86497 -69770 -38106 10279 19335 5458 -12384 -23260 -22114 -63050 -69190 -64346 -14371
6276a4371L9046M896L5933k9098k0172m0385L904K1250j176j0537K5251j2303
$$ -14371 24675 29571 65504 36406 16234 -24151 -20247 1003 -173 -10710 14541 2238
6264B238J1251J9071k0264n6112l0764k7813M0573M3330m8278n915J2562l9109
$$ 2238 13489 32560 12296 -43816 -74580 -102393 -61820 -18490 -66768 -72683 -60121 -99230
6252i9230L355Q448N4303k0217o513M6316K5112M4554O5877N282o643n1242n7431
$$ -99230 -95875 -87427 -33124 -53341 -59854 -13538 11574 56128 122005 127287 120644 69402 11971
6239A1971m3462j6851M7746M9866l5166M4153k0664m6163m6256k2511P8218N883
$$ 11971 -31491 -48342 -596 49270 14104 58257 37593 -8570 -54826 -77337 881 6764
6227F764m1658R583o8669j0149J0541N0002R2557K5086r372k8070l1244n8258
$$ 6764 -34894 -25311 -93980 -104129 -93588 -43586 48971 74057 64685 36615 5371 -52887
6215e2887L9616p57j2243l8415j871N851k9746N3648O4596m2207j9973K7621q991
$$ -52887 -13271 -14028 -26271 -64686 -66557 -60706 -90452 -36804 27792 -14415 -34388 -6767 -15758
6202a5758J2030j5770l8433l300M2469L8652n9380m6170j5638Q125k879N9071
$$ -15758 -3728 -19498 -57931 -61231 -18762 19890 -39490 -85660 -101298 -93173 -96052 -36981
6190c6981P5010j4561K2817l366l5482l6304L5132N7284k7366o8748j7936j785
$$ -36981 38029 23468 46285 42919 7437 -28867 6265 63549 36183 -32565 -50501 -52286
6178e2286K9420L553l4948L3600k133N3444J025k1888J8983K1780K7633j4018
$$ -52286 -22866 -19313 -54261 -20661 -22794 30650 31675 9787 28770 50550 78183 64165
6166F4165n5072q0117K2303N5146L8269k1790k3498J1026k0704k2659J3669K9158
$$ 64165 9093 -71024 -48721 6425 44694 22904 -594 10432 -10272 -32931 -19262 9896
6154I896l9896L4584J3236k132L5994L1182Q493N623m6143n7741m0413J9971j4488
$$ 9896 -30000 4584 17820 15688 51682 82864 91357 96980 50837 -6904 -47317 -27346 -41834
6141d1834K4083M5629l2334j751k4172l322k4442K0561j7002R704j5622k1445
$$ -41834 -17751 27878 -4456 -6207 -30379 -33701 -58143 -37582 -54584 -44880 -60502 -81947
6129h1947L2715J6978J8414L4609l1170j247N1473L635l0411p1625j7890J8986
$$ -81947 -49232 -32254 -13840 20769 -10401 -11648 39825 43460 13049 -58576 -76466 -57480
6117e7480L0194N6653J2122j6843n4013j5618M7518K6836J134k1777k0194J9114
$$ -57480 -27286 29367 41489 24646 -29367 -44985 2533 29369 30503 8726 -11468 7646
6105G646M3465o2546J5508J7658j1385k8838j7976J1154o419j634j4931m044M66
$$ 7646 51111 -11435 4073 21731 10346 -18492 -36468 -25314 -31733 -33367 -48298 -52342 -51876
6092e1876P326j443J1649J5884J7275N290k630L8305J8081L4450q62p473j8490
$$ -51876 -44550 -45993 -34344 -18460 -1185 4105 1475 39780 57861 92311 91449 83976 65486
6079F5486K5060K3045n3796m1995K1678m506k9211l8851j8011K782k1248m7666
$$ 65486 90546 113591 59795 17800 39478 34972 5761 -33090 -51101 -48319 -69567 -117233
6067a17233j3670k5634L1340Q4001P3172K3177o5819k55P927k3926L3910m2560
$$ -117233 -130903 -156537 -125197 -41196 31976 55153 -10666 -10921 -2994 -26920 6990 -35570
6055c5570k2487J6865n301J110J6627j8065L9037J0083l7965j4104l0155K8516
$$ -35570 -58057 -41192 -46493 -45383 -28756 -46821 -7784 2299 -35666 -49770 -79925 -51409
6043e1409M8171M7005Q182n2890j8734o7231j9879N6887P6656L1789k53j6883
$$ -51409 -3238 43767 51949 -941 -19675 -86906 -106785 -49898 26758 58547 58294 41411
6031D1411j1952j4431J4139m8534l1254q04m236J5304k5304J8817J4663K3440
$$ 41411 29459 15028 29167 -19367 -50621 -51425 -55661 -40357 -65661 -46844 -32181 -8741
6019h741j2993l4518L1916L5622j3136l2062L688M323l534N317l6617q006O960
$$ -8741 -21734 -56252 -24336 11286 -1850 -33912 -30224 -25901 -29435 -24118 -60735 -68741 -61781
6006f1781K8282O6684M2427l1023j9978j6308L0582J1095M079K995n057J1052
$$ -61781 -33499 33185 75612 44589 24611 8303 38885 49980 54059 57054 51997 63049
5994F3049j5792k9843l0910k4317k1797P331Q113K7199K1687j6373j0368k8636
$$ 63049 47257 17414 -13496 -37813 -59610 -52279 -44166 -16967 4720 -11653 -22021 -50657
5982e0657q01R039j2189r642n4467O1275L7841N8309O08k3005m1498k2866M8377
$$ -50657 -51458 -42419 -54608 -64250 -118717 -57442 -19601 38708 39316 16311 -25187 -48053 324
5969C24M9101m103L2261k0214P03L8867J5349l6642J1117o9146l5450l2875K7266
$$ 324 49425 45322 77583 57369 58072 96939 112288 75646 86763 17617 -17833 -50708 -23442
5956b3442N3327l3601l2873k0640n2036K2378J10628L8892J2472l2477l4495n1784
$$ -23442 29885 -3716 -36589 -57229 -109265 -86887 23741 62633 75105 42628 8133 -43651
5944d3651n4431j1889K4731K796m853L596q941j324M5396m281j7798k3353J0398
$$ -43651 -98082 -109971 -85240 -82444 -87297 -83701 -92642 -93966 -48570 -52851 -70649 -94002 -83604
5931h3604O7435N3188M0740k9291l2374j1923j4311Q44l6925n887M3034j1884
$$ -83604 -16169 37019 77759 48468 16094 4171 -10140 -9296 -46221 -52108 -9074 -20958
5919b0958l2973m640M1048K6792M3393j4148n1267R581L5931k5629l3638N85k479
$$ -20958 -53931 -58571 -17523 9269 52662 38514 -12753 -3172 32759 7130 -26508 -25923 -28402
5906b8402R824l4290n1218M2734M5324k5712J1598M3920p6n5106m1200K3827L450
$$ -28402 -18578 -52868 -104086 -61352 -16028 -41740 -30142 13778 13702 -41404 -82604 -58777 -55327
5893e5327P048o442J5107K5339k940L0311K4047n5401k5603k6100J103J3152K7837
$$ -55327 -48279 -54721 -39614 -14275 -17215 13096 37143 -18258 -43861 -69961 -68858 -55706 -27869
5880b7869m75N933K4246J1374J6533O306l5839J259K1321L2871K9417K9676j1640
$$ -27869 -28344 -22411 1835 13209 29742 36048 209 1468 22789 55660 85077 114753 103113
5867A03113n5980j4487l9315p738P266K5382J685m0692N085R88K6022L6501k2061
$$ 103113 47133 32646 -6669 -14407 -7141 18241 19926 -20766 -15681 -14693 11329 47830 25769
5854B5769M547l5296N4412j1938l0486K2302K6545q544L0765m1082n4942O820
$$ 25769 30316 -4980 49432 37494 7008 29310 55855 47311 78076 36994 -17948 -11128
5842a1128J302L1921M2655J3011m7091n5957K8411K382m277L1332P705l6364j9089
$$ -11128 -9826 22095 64750 77761 30670 -25287 3124 5506 1229 32561 40266 3902 -15187
5829a5187o4871j6391k9239o488M6045L1259K9657K150Q095j9160k3547O0156
$$ -15187 -80058 -96449 -125688 -132176 -86131 -54872 -25215 -23065 -14970 -34130 -57677 2479
5817B479q98k6999K7250J8916o6081o194L8879K5428J6622J409J5157J079n3236
$$ 2479 1581 -25418 1832 20748 -45333 -51527 -12648 12780 29402 30811 45968 47047 -6189
5804f189r728J9269j3092o3L2354K6253k1983j06022p2911O3390L4773l9544K1607
$$ -6189 -15917 3352 -9740 -9803 22551 48804 26821 -79201 -152112 -88722 -53949 -93493 -71886
5791g1886K5623K0839j6091J3550M6028k2942k0020L9725M1701o792o0952q1103
$$ -71886 -46263 -25424 -41515 -27965 18063 -4879 -24899 14826 56527 49735 -11217 -92320
5779i2320k0762M3102M8345k767o217l1577j6999J6237K3239m8866K6303J5091
$$ -92320 -113082 -69980 -21635 -24402 -30619 -62196 -79195 -62958 -39719 -88585 -62282 -47191
5767d7191J8075k714K3572L5161l295m2696m531Q079k3613J2275N7653j8529n4837
$$ -47191 -29116 -31830 -8258 26903 23608 -19088 -23619 -15540 -39153 -26878 30775 12246 -42591
5754d2591l5141q865N7879L0237K0340r677K8558n4004l0670j1439j2531K5377
$$ -42591 -77732 -86597 -28718 1519 21859 12182 40740 -13264 -43934 -55373 -67904 -42527
5742d2527M9452j6147k4987l3161l000m2062J7147M7026K2807R430K276m780l3782
$$ -42527 6925 -9222 -34209 -67370 -70370 -112432 -95285 -48259 -25452 -16022 -13746 -18526 -52308
5729e2308K3967L4384m8604J8265M7558M9190o1080m6638K036j0243J6502J6352
$$ -52308 -28341 6043 -42561 -24296 23262 72452 11372 -35266 -33230 -43473 -26971 -10619
5717a0619J4029q072n9055p2371N2852R3038j7351o465k3714k086J7399N0866
$$ -10619 3410 -4662 -63717 -136088 -83236 9802 -7549 -14014 -37728 -39814 -22415 28451
5705B8451o2205m1987N668N3141J8967J271j162j6538l3772j2715j5541L8724
$$ 28451 -33754 -75741 -70073 -16932 2035 3306 2144 -14394 -48166 -60881 -76422 -37698
5693c7698L4005Q9650l5040l3771J3105l2164k715k3397L8383K973n9045m5266
$$ -37698 -3693 85957 50917 17146 30251 -1913 -4628 -28025 10358 13331 -45714 -90980
5681i0980o451Q4804O4436l7456k6455L2238j7900j9074m887k0506J6246P4362
$$ -90980 -97431 -12627 51809 14353 -12102 20136 2236 -16838 -21725 -42231 -25985 48377
5669D8377J9301k2289p8907k4298O324O804j9649N6817K3513n7069M569Q486l2521
$$ 48377 67678 45389 -33518 -57816 -51492 -44688 -64337 -7520 15993 -41076 -36507 -28021 -60542
5656f0542o892Q783J4278M7378N6012Q105j7288k1594q297j4293k1612n1851l9949
$$ -60542 -67434 -58651 -44373 3005 59017 67122 49834 28240 19943 5650 -15962 -67813 -107762
5643a07762K0161J367p936N3711M3031J2409k2041K7559N1304m3366k484J7818
$$ -107762 -87601 -86234 -94170 -40459 2572 14981 -7060 20499 71803 28437 25953 43771
5631D3771K0752k7588m853k76j9130L2823J7516O331M5516L1709m6428o8565j5322
$$ 43771 64523 36935 32082 31806 12676 45499 63015 69346 114862 146571 100143 31578 16256
5618A6256J4216m038J9268M9062o009m5388q938J5715j3191k7748q506K0309k3340
$$ 16256 30472 26434 45702 94764 88755 43367 34429 50144 36953 9205 699 21008 -2332
5605b332l1592m338l3012j6524n85Q3122j3643k2890o746M9079M1495M722J0058
$$ -2332 -33924 -38262 -71274 -87798 -88383 -5261 -18904 -41794 -48540 539 42034 46756 56814
5592E6814k9806o813l4440k0477k213l8661l126r638R003N5491K0894j0469m642
$$ 56814 27008 20195 -14245 -34722 -36935 -75596 -78722 -88360 -79357 -23866 -2972 -13441 -18083
5579a8083l0123k2146N0616N9671N052j5724m9740j2479k0011l4851n612M4919
$$ -18083 -48206 -70352 -19736 39935 44987 29263 -20477 -32956 -52967 -87818 -93430 -48511
5567d8511M6770j3867k0521l5791J7323l479j1389J1212k0810K6732K7803P7333
$$ -48511 -1741 -15608 -36129 -71920 -54597 -58076 -69465 -58253 -79063 -52331 -24528 52805
5555E2805K6889m9936o3652J0165K3459M30m1492l3794K8090K1785n6355j1974
$$ 52805 79694 29758 -33894 -23729 -270 160 -41332 -75126 -47036 -25251 -81606 -93580
5543i3580J7726n896l158j178L4135K7510p50N0005J4075k9779k3048L0395M0621
$$ -93580 -75854 -81750 -84908 -86086 -51951 -24441 -25191 24814 38889 9110 -13938 16457 57078
5530E7078L0342O841l3080n1366L5503O812o8002o333k5815K4133N3885M019L7321
$$ 57078 87420 94261 61181 9815 45318 52130 -15872 -22205 -48020 -23887 29998 34017 71338
5517G1338k6539p1806j0942M004N468k1915m3612J4810j8418M5025P9383k4729
$$ 71338 44799 -27007 -37949 -33945 -28477 -50392 -94004 -79194 -97612 -52587 26796 2067
5505B067o4593o786P8561k2607j7879J4387J6177J5148L6647k1126o0710l3118
$$ 2067 -62526 -69312 9249 -13358 -31237 -16850 -673 14475 51122 29996 -30714 -63832
5493f3832k2052J769K3463N1220l733j9083k0399K4869K2571k3076j6258L9264
$$ -63832 -85884 -84115 -60652 -9432 -13165 -32248 -52647 -27778 -5207 -28283 -44541 -5277
5481e277K9283M6877j2137k6742L714M933n5469j4637M543J5417L9037J5418j1306
$$ -5277 24006 70883 58746 32004 35718 40651 -14818 -29455 -24912 -9495 29542 44960 33654
5468C3654j76J372l1924l4348J0000o4399r42L387j0190L8776R521l4169j6794
$$ 33654 33478 34850 2926 -31422 -21422 -85821 -86763 -83376 -93566 -54790 -45269 -79438 -96232
5455i6232j241K3778q628J1895J682M2910k7809k2753r809m970K5644M0469J3918
$$ -96232 -97473 -73695 -82323 -70428 -68746 -25836 -53645 -76398 -86207 -91177 -65533 -25064 -11146
5442a1146K813k4845M7962L0624m3351K0371l3320j0398P833l531m5988K8179
$$ -11146 -8333 -33178 14784 45408 2057 22428 -10892 -21290 -13457 -16988 -62976 -34797
5430c4797m4440O511Q840k1331K4096N6270L2009p157J421p0487j5107O3340J4803
$$ -34797 -79237 -72726 -63886 -85217 -61121 -4851 27158 20001 21422 -49065 -64172 -832 13971
5417A3971j2155M7915o421j6366j8835m0126K685l1205p775P0963M1346n524Q032
$$ 13971 1816 49731 43310 26944 8109 -32017 -29332 -60537 -68312 2651 43997 38473 46505
5404D6505n3593k5809j1876K9830Q2878m4852K3635n565L8103n369l9074l2436
$$ 46505 -7088 -32897 -44773 -14943 67935 23083 46718 41153 79256 73887 34813 2377
5392B377j0371K221L6510J2892k3694Q750J1972j9377p6961k1056P0769l6337
$$ 2377 -7994 -5773 30737 43629 19935 28685 40657 21280 -55681 -76737 -5968 -42305
5380d2305k5953l1371j4495N649p177P127O3014L5107N0217L351n9572M2145N4962
$$ -42305 -68258 -99629 -114124 -108475 -115652 -108525 -45511 -10404 39813 43164 -16408 25737 80699
5367H0699L524q020m6115n1520k0570J1054L529L2787j459p0843j5687O8555N1525
$$ 80699 84223 76203 30088 -21432 -42002 -30948 -27419 5368 3909 -66934 -82621 -14066 37459
5354C7459K0100m7430n2134k0605L4241k4299N307L3277J8917p8421J0921p665
$$ 37459 57559 10129 -42005 -62610 -28369 -52668 -47361 -14084 4833 -73588 -62667 -70332
5342g0332J9741J2754J6478J9479j9344j1877L1890j4443M269J6036M0827J806
$$ -70332 -50591 -37837 -21359 -1880 -21224 -33101 -1211 -15654 -11385 4651 45478 47284
5330D7284r052k0373l6067J2581K6612K7963J5630j9059j5951N50k9766j1302
$$ 47284 38232 17859 -18208 -5627 20985 48948 64578 45519 29568 30118 352 -10950
5318a0950K9707l2467p7596K6493M2118K7685j401K5001k0814n7422M2104K5361
$$ -10950 18757 -13710 -91306 -64813 -22695 4990 3589 28590 7776 -49646 -7542 17819
5306A7819J8019Q584p1261k1042o797k4728q567R735L0243K7829j0808L4492k3791
$$ 17819 35838 44422 -26839 -47881 -54678 -79406 -87973 -78238 -47995 -20166 -30974 3518 -20273
5293b0273m4394J433K2743Q264j0845N762J4135k4883J3555k2101l2152l655J8191
$$ -20273 -64667 -63234 -40491 -32227 -43072 -37310 -23175 -48058 -34503 -56604 -88756 -92411 -74220
5280g4220K3722N596P6290L6445o571n857k2110J0831l6712o76l2841m444J8231
$$ -74220 -50498 -44902 31388 67833 61262 55405 33295 44126 7414 6738 -26103 -30547 -12316
5267a2316K1238O634K222K5006J0926L4563k3190j9392k673L4963j1512n3263
$$ -12316 8922 15556 17778 42784 53710 88273 65083 45691 43018 77981 66469 13206
5255A3206l9396k1593k9630j3295m586J760J8002m114n3698K2761O1113O5026
$$ 13206 -26190 -47783 -77413 -90708 -95294 -93534 -75532 -79646 -133344 -110583 -49470 15556
5243A5556L439k4965m614m280J7266q336q716Q266L6257m0686j121J9006l5061
$$ 15556 18995 -5970 -10584 -14864 2402 -5934 -14650 -6384 29873 -10813 -11934 7072 -27989
5230b7989o754J9652Q406L0216K4714r995M6637L8050j059o3994n2554k0065O2889
$$ -27989 -34743 -15091 -6685 23531 48245 38250 84887 122937 121878 57884 5330 -14735 48154
5217D8154P498j0832m476p446J3062l3692J643M0929l8121K4605k839r302L604
$$ 48154 55652 44820 40344 32898 45960 12268 13911 54840 16719 41324 38485 29183 32787
5204C2787J8983J2375K2076L0682j6647K560j0304n9530j8483M4492o7985k8795
$$ 32787 51770 64145 86221 116903 100256 102816 92512 32982 14499 58991 -8994 -37789
5192c7789Q920L7398K5817m921q909l3094j4711j2355J7061K3204j0377q021o17
$$ -37789 -28869 8529 34346 29425 20516 -12578 -27289 -39644 -22583 621 -9756 -17777 -18394
5179a8394L4496j1101k4003q358L6281L4061O8505l5366n5368q440k3779k7657
$$ -18394 16102 5001 -19002 -27360 8921 42982 111487 76121 20753 12313 -11466 -39123
5167c9123j050J0894o873P728L0169N152M2809J5936J0996n6796p4218m1913O1831
$$ -39123 -40173 -29279 -36152 -28424 1745 6897 49706 65642 76638 19842 -54376 -96289 -34458
5154c4458q240J9641K7136J4860j2879k221l5685k4395n6712M679N1510l6336
$$ -34458 -42698 -23057 4079 18939 6060 3839 -31846 -56241 -112953 -108274 -56764 -93100
5142i3100l8158P90R469M9027M8630m2402P811R0843J2958q2178m9353K2887K2546
$$ -93100 -131258 -130468 -120999 -71972 -23342 -65744 -57933 32910 45868 -36310 -85663 -62776 -40230
5129d0230J2460k8194K047J592Q149k5831M4179L9979n802K5976p4530l7531l9544
$$ -40230 -27770 -55964 -53917 -52325 -44176 -70007 -25828 14151 8349 34325 -40205 -77736 -117280
5116a17280m105K8281J8362J0673L2650L4490J90l2469k9890J5113n014j1118
$$ -117280 -121385 -93104 -74742 -64069 -31419 3071 3261 -29208 -59098 -43985 -48999 -60117
5104f0117l9703o489M3443K7737J0912k9021m0799L7376O8018J6235n9458k9998
$$ -60117 -99820 -106309 -62866 -35129 -24217 -53238 -94037 -56661 11357 27592 -31866 -61864
5092f1864J1861j2074O906L0679L703P916L3823M0224l9972j8539K5895K2590
$$ -61864 -50003 -62077 -55171 -24492 -20789 -12873 20950 61174 21202 2663 28558 51148
5080E1148m914l3596j4550j2962J8119K8050L0747K4743K9204q104p4111l7894
$$ 51148 46234 12638 -1912 -14874 3245 31295 62042 86785 115989 107885 33774 -4120
5068d120l42J0011K7511K689M692m025J240k1178p1682o391l2872M194k1644j1983
$$ -4120 -4462 5549 33060 35749 40441 36416 37656 16478 -55204 -61595 -94467 -90273 -111917 -123900
5054a23900L2246k1952J2301M983L0831l228K656J9759N2854M3105j3901q1533
$$ -123900 -91654 -113606 -101305 -96322 -65491 -68719 -66063 -46304 6550 49655 35754 -45779
5042d5779j9134n4086L3546O287L174K53J132L3942M7988K532j6854l247k3624
$$ -45779 -64913 -118999 -85453 -79166 -75992 -75739 -74607 -40665 7323 9855 -6999 -10246 -33870
5029c3870m0746l6228M188M6820O210m0145k3030J6903R8866l2300l24O6229K0597
$$ -33870 -74616 -110844 -106656 -59836 -53626 -93771 -116801 -99898 -1032 -33332 -33656 32573 53170
5016E3170k3287j554k6286l4677j8647M8592J0605J1381Q559k6593l8139K942
$$ 53170 29883 28329 2043 -32634 -51281 -2689 7916 19297 27856 1263 -36876 -33934
5004c3934M4102J5937n4229r202P634R2163j0965m5084J1542j975k4820k2208
$$ -33934 10168 26105 -28124 -37326 -29692 62471 51506 6422 17964 15989 -8831 -31039
4992c1039L327l097j0505j2120j5070n494J9923j0130K2501Q5111K0217k1472
$$ -31039 -27712 -30809 -41314 -53434 -68504 -73998 -54075 -64205 -41704 43407 63624 42152
4980D2152K4256K1966k1233j928p6665l8928M2173Q0718n0762o1990M465K057
$$ 42152 66408 88374 67141 65213 -11452 -50380 -8207 72511 21749 -40241 -35776 -33719
4968c3719M293q908M1540P222j8830N0463O9761k7944k9770J8110m2749m0778
$$ -33719 -29426 -38334 3206 10428 -8402 42061 111822 83878 54108 72218 29469 -11309
4956a1309N516N759k4282q390N86j2565J1299L5375O834m2081J9653J7765r611
$$ -11309 -5793 -34 -24316 -32706 -32120 -44685 -33386 1989 8823 -33258 -13605 4160 -5451
4943e451k2210O4525M156j7857K4035Q0223l0453j2267K2771L1642R312k6204
$$ -5451 -27661 36864 41020 23163 47198 127421 96968 84701 107472 139114 148426 122222
4931A22222q7614j8873k3824M7522J7949K8425k620k5630o0749m6399l3306L5514
$$ 122222 34608 15735 -8089 39433 57382 85807 83187 57557 -3192 -49591 -82897 -47383
4919d7383L5370M4740p873j0524K314K4834k3549j7545j8453L0159O2916j4407
$$ -47383 -12013 32727 24854 14330 16644 41478 17929 384 -18069 12090 75006 60599
4907F0599j13111o2081L6533Q4484R9471l1273n7450k1578J474n0736m849q533
$$ 60599 -52512 -114593 -78060 6424 105895 74622 17172 -4406 -2932 -53668 -58517 -67050
4895f7050k6091j8808L3017M2366J5100Q367k075j5943L6465L74J062q290M897
$$ -67050 -93141 -111949 -78932 -36566 -21466 -13099 -15174 -31117 5348 5722 6784 -1506 3391
4882C391k3975m4386k873m051J3690m940j9658M0411K1240J5021q277k1177k9472
$$ 3391 -20584 -64970 -67843 -71894 -58204 -63144 -82802 -42391 -21151 -6130 -14407 -35584 -65056
4869f5056m868J9913N4093J1492k6437n0224k5511m8183l2758O3020Q6969M3380
$$ -65056 -69924 -50011 4082 15574 -10863 -61087 -86598 -134781 -167539 -104519 -17550 25830
4857B5830J3680J6746j3203n4562p2552K5335M454k7503K3039J6291K0051J860
$$ 25830 39510 56256 43053 -11509 -84061 -58726 -54272 -81775 -58736 -42445 -22394 -20534
4845b0534k3177O641j0773N0106M889k7585j00263M73J7401P1539K6904n2148
$$ -20534 -43711 -37070 -47843 2263 7152 -20433 -120696 -120223 -102822 -31283 -4379 -56527
4833e6527l804J3794M8096J8693m3133p524K7532j856k3694L4558J8242L118l6897
$$ -56527 -60331 -46537 1559 20252 -22881 -30405 -2873 -4729 -28423 6135 24377 27495 -9402
4820i402k6538K8540k0672K6103K1434L8654l5056l1996q075J2244M546L2067
$$ -9402 -35940 -7400 -28072 -1969 19465 58119 23063 -8933 -17008 -4764 -218 31849
4808C1849N366m1690K9562L8064m8046k9392K4203L8729L902n0311k6832K5648
$$ 31849 37215 -4475 25087 63151 15105 -14287 9916 48645 52547 2236 -24596 1052
4796A052K8470J462j8972j3025K1368k8M9038n74j9749q242k1832K014J8487j4697
$$ 1052 29522 30984 12012 -1013 20355 20327 69365 68791 49042 40800 18968 20982 39469 24772
4782B4772p5889J0928l888J8281L1778p939k8339M085K2069K6212m7507l6337
$$ 24772 -51117 -40189 -44077 -25796 5982 -1957 -30296 -26211 -4142 22070 -25437 -61774
4770f1774K1592n755j8908L8712M994Q206M7766M8298l7626J0197j9121k4118
$$ -61774 -40182 -45937 -64845 -26133 -21139 -12933 34833 83131 45505 55702 36581 12463
4758A2463J3086m532l5519k8535k7503k1982l122K1052M4920L4915k5443l2501
$$ 12463 25549 21017 -14502 -43037 -70540 -92522 -95644 -74592 -29672 5243 -20200 -52701
4746e2701M4202l653k1441O936N0976K498m5070k4372L9346K1854K7071K9592
$$ -52701 -8499 -12152 -33593 -26657 24319 26817 -18253 -42625 -3279 18575 45646 75238
4734G5238l7174N872J4461o2037o2823k9897K112k3142R558O8501L2010N2743
$$ 75238 38064 43936 58397 -3640 -66463 -96360 -94248 -117390 -107832 -39331 -7321 45422
4722D5422J5209l2899l0804N6240N495k1402M2348L9468p7953l6267O7819K4024
$$ 45422 60631 27732 -3072 53168 58663 37261 79609 119077 41124 4857 72676 96700
4710I6700N85k0963q9160l2486M8822L1159o516m2183j8463o031J2587M7916q537
$$ 96700 97285 76322 -12838 -45324 3498 34657 28141 -14042 -32505 -38536 -25949 21967 13430
4697A3430j8513o105l9566l464M0365M1792K5963K4343l7356k7023K5061K6196
$$ 13430 -5083 -11188 -50754 -54218 -13853 27939 53902 78245 40889 13866 38927 65123
4685F5123k107k2504j0754M2571N390r654j4628k0375k4867r549P45j0466k5715
$$ 65123 63016 40512 29758 72329 77719 68065 53437 33062 8195 -1354 -609 -11075 -36790
4672c6790l4906k519N6992M0868J0517R355l645j9496p9225m3962L2924K1321
$$ -36790 -71696 -74215 -17223 23645 34162 43517 39872 20376 -58849 -102811 -69887 -48566
4660d8566M0042J9171K890l2090M3545M761K089l5053r450K2260L8277L9494m5879
$$ -48566 -8524 10647 13537 -18553 24992 29753 31842 -3211 -12661 9599 47876 87370 41491
4647D1491m6796L692j1010k7731j634m173l0961k5090L1516J7324p9997K2124
$$ 41491 -5305 -1613 -12623 -40354 -41988 -46161 -77122 -102212 -70696 -53372 -133369 -111245
4635a11245L6349J3691M9618j9557k8283P856P796K4189m205L557j0021j6237
$$ -111245 -74896 -61205 -11587 -31144 -59427 -51571 -43775 -19586 -23791 -20234 -30255 -46492
4623d6492M5338L2414O9401N571m0265j8897Q953k5824l6011n8968j7118M3035
$$ -46492 -1154 31260 100661 106232 65967 47070 56023 30199 -5812 -64780 -81898 -38863
4611c8863M6552J0806j9383R560O3300j5703o1928j6821k022N497J8237J2335
$$ -38863 7689 18495 -888 8672 71972 56269 -5659 -22480 -24502 -19005 -768 11567
4599A1567p217j1178j2866k141j9137k3239K1167J5089M0407j2673Q84N6752K4474
$$ 11567 4350 -6828 -19694 -21835 -40972 -64211 -43044 -27955 12452 -221 663 57415 81889
4586H1889j4171o3390q0304M1953L8205J9743k0865l1155o3545l3502M8841L5682
$$ 81889 67718 4328 -75976 -34023 4182 23925 3060 -28095 -91640 -125142 -76301 -40619
4574d0619Q029O5321j8961o539N212r322J4470M5968J8524k3392l7232m6342l6716
$$ -40619 -32590 32731 13770 7231 12443 3121 17591 63559 82083 58691 21459 -24883 -61599
4561f1599O0779L6249l2712J7283K072p4158Q048N2816J5998j1497j9560K2732
$$ -61599 -820 35429 2717 20000 22072 -52086 -44038 8778 24776 13279 -6281 16451
4549A6451K2183L5175j6287J9174r386l5691j3292j3224q756J1474P0026l8962
$$ 16451 38634 73809 57522 76696 67310 31619 18327 5103 -3653 7821 77847 38885
4537C8885l4259J0912M95J809K6625N696k1216j7627J1469j4455k7668J4900j6000
$$ 38885 4626 15538 16033 17842 44467 50163 28947 11320 22789 8334 -19334 -4434 -20434
4524b0434k4902J063L4292k0485K5666j4215L3392r276O886j2909L6333K3002
$$ -20434 -45336 -44273 -9981 -30466 -4800 -19015 14377 5101 11987 -922 35411 58413
4512E8413J9227m2460m5466p637j0699l0672N2061O545j7741m9234k4418k2914
$$ 58413 77640 35180 -10286 -17923 -28622 -59294 -7233 -688 -18429 -67663 -92081 -114995
4500a14995J5186O1753j9015J1110M2899R710N081k1087l5137k985J1802j4997
$$ -114995 -99809 -38056 -57071 -45961 -3062 6648 11729 -9358 -44495 -47480 -35678 -50675
4488e0675j9031j3678k6467q740M8985R8752K5491o7131l6718k7330J1510N325
$$ -50675 -69706 -83384 -109851 -118591 -69606 29146 54637 -12494 -49212 -76542 -65032 -59707
4476e9707K990J4390J1969N3824J7071j2024j6325o0349l7285J0074j3500K9906
$$ -59707 -56717 -42327 -30358 23466 40537 28513 12188 -48161 -85446 -75372 -88872 -58966
4464e8966L0944j0395k0243J8073J2513J190l0737M2658l794o2290J8310J1542
$$ -58966 -28022 -38417 -58660 -40587 -28074 -26884 -57621 -14963 -18757 -81047 -62737 -51195
4452e1195L4724M7946k481K2756R970P888q9757m5415J07036N2890o4154j0950
$$ -51195 -16471 31475 28994 51750 61720 69608 -20149 -65564 41472 94362 30208 19258
4440A9258j3647l360q996n001K227K3591m3026l3071k6377l1695P572N6442j2404
$$ 19258 5611 2251 -6745 -11746 -9519 14072 -28954 -62025 -88402 -120097 -112525 -56083 -68487
4427f8487j9430K4859J8903J8604P0508J1598k3297m8212K278k6863k2375J4773
$$ -68487 -87917 -63058 -44155 -25551 44957 56555 33258 -14954 -12676 -39539 -61914 -47141
$$ [...]
##END NTUPLES=NMR SPECTRUM
##END=
