##TITLE=Analysis number 314952
Compound Code cc 45613
Book Reference 440/90
Project Code adrs
Chemist Name craigr
##JCAMPDX= 6.0         $$ Bruker NMR JCAMP-DX V2.0
##DATA TYPE= NMR SPECTRUM
##DATA CLASS= NTUPLES
##ORIGIN= Bruker BioSpin GmbH
##OWNER= NMR
$$ XWIN-NMR		Version 3.5
$$ Mon Oct 31 15:03:14 2005 GMT Standard Time (UT+0h)  MAYBRIDGE\NMR@NMR_250MHZ
##.OBSERVE FREQUENCY= 250.131544655141
##.OBSERVE NUCLEUS= ^1H
##.ACQUISITION MODE= SIMULTANEOUS (DQD)
##.ACQUISITION SCHEME= undefined
##.AVERAGES= 16
##.DIGITISER RES= 18
##SPECTROMETER/DATA SYSTEM= dpx250
##.PULSE SEQUENCE= zg30
##.SOLVENT NAME= CDCl3
##.SHIFT REFERENCE= (INTERNAL, CDCl3, 0, 16.522)
##AUDIT TRAIL= $$ (NUMBER, WHEN, WHO, WHERE, WHAT)
$$ ##TITLE= Audit trail, XWIN-NMR		Version 3.5
$$ ##JCAMPDX= 5.01
$$ ##ORIGIN= Bruker BioSpin GmbH
$$ ##OWNER= NMR
$$ C:\u/data/dgb/nmr/ADRS/11670/pdata/1/auditp.txt
$$ ##AUDIT TRAIL=  $$ (NUMBER, WHEN, WHO, WHERE, WHAT)
(   1,<2005-10-31 15:02:21.93 +000>,<MAYBRIDGE\NMR>,<NMR_250MHZ>,
      <created by zg, POWCHK disabled, PULCHK disabled
       configuration hash MD5:
       62 19 C7 07 E1 42 D1 B7 37 6C 3D D0 77 39 F9 E6
       data hash MD5: 64K
       90 7C 69 A3 C0 10 20 3B 66 64 29 FA 23 DC 32 E3>)
(   2,<2005-10-31 15:02:39.18 +000>,<MAYBRIDGE\NMR>,<NMR_250MHZ>,
      <Start of raw data processing
       ef LB = 0.3 FT_mod = 6 PKNL = 1 SI = 32K 
       data hash MD5: 32K
       07 1B B8 55 A5 0B E1 FC F0 08 5A 87 5B AB BD 42>)
(   3,<2005-10-31 15:02:42.69 +000>,<MAYBRIDGE\NMR>,<NMR_250MHZ>,
      <apk 
       data hash MD5: 32K
       B0 BF DC 9F 3E 5F CF 06 57 CC F9 69 21 90 05 B3>)
(   4,<2005-10-31 15:02:44.52 +000>,<MAYBRIDGE\NMR>,<NMR_250MHZ>,
      <abs ABSG = 5 
       data hash MD5: 32K
       94 E4 D9 09 8E 84 2B AE A3 6C 27 88 0D 3E 4A BF>)
$$ ##END=
$$ 
$$ hash MD5
$$ 78 F3 A0 1C 7D 03 2C F3 C8 EE DF 84 07 C3 DF 7B
##$RELAX= 
##$RELAX= 
##$RELAX= 
##$RELAX= 
##$RELAX= 
##$RELAX= 
##$RELAX= 
$$ Bruker specific parameters
$$ --------------------------
##$DU= <C:\u>
##$EXPNO= 11670
##$NAME= <ADRS>
##$PROCNO= 1
##$TYPE= <nmr>
##$USER= <dgb>
##$AMP= (0..31)
100 100 100 100 100 100 100 100 100 100 100 100 100 100 100 100 100 100 
100 100 100 100 100 100 100 100 100 100 100 100 100 100 
##$AQSEQ= 0
##$AQ_mod= 3
##$AUNM= <au_zg>
##$AUTOPOS= <41 >
##$BF1= 250.13
##$BF2= 250.13
##$BF3= 250.13
##$BF4= 250.13
##$BF5= 500.13
##$BF6= 500.13
##$BF7= 500.13
##$BF8= 500.13
##$BYTORDA= 1
##$CFDGTYP= 0
##$CFRGTYP= 5
##$CHEMSTR= <none>
##$CNST= (0..31)
1 1 145 1 1 1 1 1 1 1 1 1 1 1 1 1 1 1 1 1 1 1 1 1 1 1 1 1 1 1 1 1 
##$CPDPRG= <>
##$CPDPRG1= <>
##$CPDPRG2= <>
##$CPDPRG3= <>
##$CPDPRG4= <mlev>
##$CPDPRG5= <mlev>
##$CPDPRG6= <mlev>
##$CPDPRG7= <mlev>
##$CPDPRG8= <mlev>
##$CPDPRGB= <>
##$CPDPRGT= <>
##$D= (0..31)
0 1 0 0 0 0 0 0 0 0.06 0 0 0 0 0 0 0.0002 0 0 0 0 0 0 0 0 0 0 0 0 0 0 
0 
##$DATE= 1130770941
##$DBL= (0..7)
120 120 120 120 120 120 120 120 
##$DBP= (0..7)
150 150 150 150 150 150 150 150 
##$DBP07= 0
##$DBPNAM0= <>
##$DBPNAM1= <>
$$ [...]
##$SUBNAM7= <"">
##$SUBNAM8= <"">
##$SUBNAM9= <"">
##$SW= 20.6930455092707
##$SWIBOX= (0..15)
0 0 3 0 0 0 0 0 0 0 0 0 0 0 0 0 
##$SW_h= 5175.983436853
##$TD= 65536
##$TD0= 1
##$TE= 296.16
##$TE2= 300
##$TE3= 300
##$TEG= 300
##$TL= (0..7)
0 120 120 120 120 120 120 120 
##$TP= (0..7)
150 150 150 150 150 150 150 150 
##$TP07= 0
##$TPNAME0= <>
##$TPNAME1= <>
##$TPNAME2= <>
##$TPNAME3= <>
##$TPNAME4= <>
##$TPNAME5= <>
##$TPNAME6= <>
##$TPNAME7= <>
##$TPOAL= (0..7)
0.5 0.5 0.5 0.5 0.5 0.5 0.5 0.5 
##$TPOFFS= (0..7)
0 0 0 0 0 0 0 0 
##$TUNHIN= 0
##$TUNHOUT= 0
##$TUNXOUT= 0
##$USERA1= <user>
##$USERA2= <user>
##$USERA3= <user>
##$USERA4= <user>
##$USERA5= <user>
##$V9= 5
##$VALIST= <valist>
##$VCLIST= <CCCCCCCCCCCCCCC>
##$VD= 0
##$VDLIST= <DDDDDDDDDDDDDDD>
##$VPLIST= <PPPPPPPPPPPPPPP>
##$VTLIST= <TTTTTTTTTTTTTTT>
##$WBST= 1024
##$WBSW= 4
##$XGAIN= (0..3)
0 0 0 0 
##$XL= 0
##$YL= 0
##$YMAX_a= 720850
##$YMIN_a= -520982
##$ZGOPTNS= <>
##$ZL1= 120
##$ZL2= 120
##$ZL3= 120
##$ZL4= 120
##$ABSF1= 16.522
##$ABSF2= -4.171173
##$ABSG= 5
##$ABSL= 3
##$ALPHA= 0
##$AQORDER= 0
##$ASSFAC= 0
##$ASSFACI= 0
##$ASSFACX= 0
##$ASSWID= 0
##$AUNMP= <proc_1d>
##$AZFE= 0.1
##$AZFW= 0.1
##$BCFW= 0
##$BC_mod= 0
##$BYTORDP= 0
##$COROFFS= 0
##$CY= 12.5
##$DATMOD= 1
##$DC= 0
##$DFILT= <>
##$DTYPP= 0
##$F1P= 14.0000005364418
##$F2P= -0.99999901652339
##$FCOR= 0.5
##$FTSIZE= 32768
##$FT_mod= 6
##$GAMMA= 0
##$GB= 0
##$INTBC= 1
##$INTSCL= 1
##$ISEN= 128
##$LB= 0.3
##$LEV0= 0
##$LPBIN= 0
##$MAXI= 10000
##$MC2= 0
##$MEAN= 0
##$ME_mod= 0
##$MI= 0
##$NCOEF= 0
##$NC_proc= -3
##$NLEV= 6
##$NOISF1= 0
##$NOISF2= 0
##$NSP= 0
##$NTH_PI= 0
##$NZP= 0
##$OFFSET= 16.522
##$PC= 1
##$PHC0= 72.3774
##$PHC1= 5.349962
##$PH_mod= 1
##$PKNL= yes
##$PPARMOD= 0
##$PSCAL= 4
##$PSIGN= 0
##$REVERSE= no
##$SF= 250.13
##$SI= 32768
##$SIGF1= 0
##$SIGF2= 0
##$SINO= 400
##$SIOLD= 32768
##$SREGLST= <1H.CDCl3>
##$SSB= 0
##$STSI= 32768
##$STSR= 0
##$SW_p= 5175.98343685301
##$SYMM= 0
##$S_DEV= 0
##$TDeff= 65536
##$TDoff= 0
##$TI= <Analysis number 999999
Compound Code 99
Book Reference 9
Project Code 9>
##$TILT= no
##$TM1= 0
##$TM2= 0
##$TOPLEV= 0
##$USERP1= <user>
##$USERP2= <user>
##$USERP3= <user>
##$USERP4= <user>
##$USERP5= <user>
##$WDW= 1
##$XDIM= 32768
##$YMAX_p= 354640258
##$YMIN_p= -313272
$$ End of Bruker specific parameters
$$ ---------------------------------
##NTUPLES= NMR SPECTRUM
##VAR_NAME=  FREQUENCY,     SPECTRUM/REAL,   SPECTRUM/IMAG
##SYMBOL=    X,             R,               I
##VAR_TYPE=  INDEPENDENT,   DEPENDENT,       DEPENDENT
##VAR_FORM=  AFFN,          ASDF,            ASDF
##VAR_DIM=   32768,         32768,           32768
##UNITS=     HZ,            ARBITRARY UNITS, ARBITRARY UNITS
##FACTOR=    0.157963299565203, 1,           1
##FIRST=     4132.6476996994, 0,             0
##LAST=      -1043.33573715361, 0,           0
##MIN=       -1043.33573715361, -313272,     0
##MAX=       4132.6476996994, 354640258,     0
$$ Real data points
##PAGE= N=1
##DATA TABLE= (X++(R..R)), XYDATA
$$ [...]
16101g602o284k25L02m513J15j1558J247L119L81p685J2108M893k265K1889J3155
16086A7077q397r481j3877P145L816L221K936J3212n280k0393k036J2026r3r504
16072i628l166J4058k812o874p27p756k035P474J6846P652j872n329j009m107
16058G15j806m829o918O255n152R777J1504R114q162r695K343j1285j1436R401
16044a0174J3511m902o84J3346P946J2460J253k4988j7729l018p706J452J352
16031a7881J00K209J93N995J2556M771n693m615l436N924P423J837J893L556M066
16016A8898k71L618N712J121j2328j2664N543R381P93o226n087N832m228L54M459
16001A4907o76r828o871j1783m510J1930J4399o729p848N039R315J3212K0415
$$ plain form
16101 -7602 -13886 -14111 -13809 -18322 -18207 -29765 -28518 -25399 -25018 -32703 -20595 -15702 -17967 3922 17077
16086 17077 8680 -801 -14678 -7533 -3717 -496 2440 15652 10372 -10021 -12057 -31 -124 -9628
16072 -9628 -12794 1264 -1548 -8422 -9149 -16905 -18940 -11466 5380 13032 11160 5831 4822 715
16058 715 -1091 -5920 -12838 -6583 -11735 -1958 9546 18660 10498 803 3146 -8139 -19575 -10174
16044 -10174 3337 -1565 -2249 11097 19043 31503 32756 7768 -9961 -12979 -20685 -19233 -17881
16031 -17881 -17781 -15572 -15379 -9384 3172 7943 2250 -2365 -5801 123 7546 9383 11276 14832 18898
16016 18898 18627 22245 27957 29078 16750 4086 9629 19010 19803 13577 8490 14322 10094 10448 14907
16001 14907 14231 4403 -2468 -14251 -18761 -6831 7568 839 -7009 -1970 7345 20557 40972
15988D0972p934k0859n34J140o070l346l294J865k695J828r028J2390o720o116
15974h401O710k705r567L794J9132K1887J0574l862j780J644r001o205j2994l493
15960E733j396Q240M671j0285L316J4716j107n179l828m070O069l090o87R607
15946B2710j878R640J599k651l530J1961Q436r108r115k0493r137o956O655n796
15932g663m565J0320K367N877J5462R22j3949k775K0058N725l144K573P323r655
15918B8876j6308n791M833M939j926j274l191p191n320J1112J0743P413K540j539
15904B7916L433j1895K092O100j5501K262K3562l756k345P47m618j0793q084r446
15890c26l925q395l445M829P922j228r255l623n440J4358J5098Q916N581N908
$$ plain form
15988 40972 33038 12179 11645 12785 6715 3369 75 1940 -755 1073 -7955 4435 -2285 -8401
15974 -8401 -1691 -4396 -13963 -10169 8963 30850 41424 37562 35782 37426 28425 22220 9226 5733
15960 5733 4337 12577 17248 6963 10279 24995 23888 18709 14881 10811 16880 13790 13103 22710
15946 22710 20832 30472 32071 29420 25890 37851 46287 37179 28064 7571 -1566 -8522 -1867 -7663
15932 -7663 -12228 -1908 459 6336 21798 22720 8771 5996 26054 31779 28635 31208 38531 28876
15918 28876 12568 6777 11610 16549 14623 13349 10158 2967 -2353 8759 19502 26915 29455 27916
15904 27916 31349 19454 21546 27646 12145 14407 37969 34213 31868 32615 27997 17204 9120 -326
15890 -326 -4251 -12646 -16091 -11262 -3340 -4568 -13823 -17446 -22886 -8528 6570 15486 21067 26975
15876B6975l544j3135k0026J679N984O049j0660j231M137J236n209K142P892l007
15862g18J0104J800j0740j2188j3765K182L488q475J5776J1704J3939k532N555
15849A6130p064j6224r121l411o74M086k378P622k00M389o649O047p68Q116o782
15834f881j8482j2693j265J6077N544o558k012J4283J1226P031j775m002O214
15821F707j558N187j1q226l621r088L004o544O365N241J0258q45j1560m240J651
15806g280K225l588J0534R218N110l430q955k478J007J248j522p341N033k486
15792b705J22N453o44R339n811p541q098L484J7614K834r021p904P464J1472j1703
15777D355o471n273n177L90K373l83J0459M617J598o607k1215n49J2285j445M271
$$ plain form
15876 26975 23431 10296 -9730 -8051 -2067 3982 -6678 -7909 -3772 -2536 -7745 -5603 2289 -718
15862 -718 9386 11186 446 -11742 -25507 -23325 -19837 -28312 -12536 -832 13107 10575 16130
15849 16130 9066 -7158 -16279 -19690 -20364 -16278 -18656 -11034 -11234 -6845 -13494 -7447 -8215 -99 -6881
15834 -6881 -25363 -38056 -39321 -23244 -17700 -24258 -26270 -11987 -761 6270 4495 493 6707
15821 6707 5149 10336 10325 2099 -1522 -10610 -7606 -14150 -7785 -2544 7714 6869 -4691 -8931 -7280
15806 -7280 -5055 -8643 1891 11109 16219 12789 3834 1356 2363 3611 2089 -5252 -219 -2705
15792 -2705 -2583 2870 2226 11565 5754 -1787 -9885 -6401 11213 14047 5026 -2878 4586 16058 4355
15777 4355 -2116 -7389 -12566 -12176 -9803 -10186 273 4890 6488 -119 -21334 -21883 -9598 -11043 -6772
15762f772J1942N516j2040o727J2436L583m970m641M701J1132m815k0820l142
15749a4617l901k0929O185L652J128J2332K189K194M280n243L727K888j993M151
15735c957K0908Q323p032r366j7073K208J1364n424m688j240m726N278J0614n330
15721a41m297O038p641l943Q544j055m611j0006o195J871k978J1036K0834o155
15707A301N319k602K443j2567k0170J39j416N305J6863P319j5762L988J1090J103
15693B353j0362R56L170j447O484J1938j5639j1039M109J1252l75j0154j2982
15680b1736l512K446n303J6923J1497Q689N7n170p281l60M059k315r099p607J671
15665a7041K256j120L481O559Q595J5562k076j6308Q625p35m943j948j1494o372
$$ plain form
15762 -6772 5170 10686 -1354 -8081 4355 7938 2968 -1673 3028 14160 9345 -11475 -14617
15749 -14617 -18518 -39447 -33262 -29610 -28482 -16150 -13961 -11767 -7487 -12730 -9003 -6115 -8108 -3957
15735 -3957 16951 25274 18242 8876 -8197 -5989 5375 -49 -4737 -5977 -10703 -5425 5189 -141
15721 -141 -4438 1600 -6041 -9984 -1440 -2495 -7106 -17112 -23307 -21436 -24414 -13378 7456 1301
15707 1301 6620 4018 6461 -6106 -26276 -26137 -27553 -22248 -5385 1934 -13828 -9840 1250 2353
15693 2353 -8009 -7053 -3883 -5330 1154 13092 -2547 -13586 -9477 1775 1400 -8754 -21736
15680 -21736 -25248 -22802 -28105 -11182 315 9004 9061 3891 -3390 -3750 309 -2006 -11105 -18712 -17041
15665 -17041 -14785 -15905 -12424 -5865 2730 18292 16216 -92 8533 7798 2855 907 -10587 -16959
15651a6959m319P382R28r064O319K5507O398M227L275j3589p510L923R010R81
15637A6509j0982O031j1874k008J1406q637J5621o193l564j721j1237j0379M336
15624a2692k265J505N772J532J0431R065o23j453j2930L91j1505m993p86M637
15610a3914q583O318j869J2137M725R220j034P320n148j0110J175J845K695L385
15596H162o133J949j3494j1909o902J246M560R565J1905k308M675n296l382O763
15582e99j870O81Q134j29j586L580j0028p06l90n132K501Q553K762m079O319J3670
15566B1681n465j2339P92j1239q868N450N911k019M819r23r231l060o602J7466
15552c627Q445R503m134j5249q469r065J1101J2610N484j4661j3039K011K3286
$$ plain form
15651 -16959 -21278 -13896 -12968 -22032 -15713 9794 16192 20419 23694 10105 2595 6518 15528 16509
15637 16509 5527 11558 -316 -2324 9082 445 16066 9873 6309 4588 -6649 -17028 -12692
15624 -12692 -14957 -13452 -7680 -6148 4283 13348 12725 11272 -1658 -1267 -12772 -17765 -18551 -13914
15610 -13914 -22497 -16179 -18048 -5911 -1186 8034 7000 14320 9172 -938 237 2082 4777 8162
15596 8162 2029 3978 -9516 -21425 -28327 -27081 -22521 -12956 -1051 -3359 1316 -3980 -7362 -599
15582 -599 -2469 -1788 6346 6217 4631 8211 -1817 -2523 -2913 -8045 -5544 3009 5771 1692 8011 21681
15566 21681 16216 3877 4669 -6570 -15438 -9988 -4077 -6096 -1277 -2200 -11431 -14491 -21093 -3627
15552 -3627 4818 14321 10187 -5062 -13531 -22596 -11495 1115 6599 -8062 -21101 -19090 4196
15539D196O790K44j1015j618L09o811r736J5944R037l491p21m313j588m399o951
15524a4123J5010P177j641j617p418o791j0381N715q199j595R248r057r87J9537
15510e122K977N240J128q789k399l570Q9N45N96Q755j328J0140q702r915P968
15495b387O318j4929j0668N197M870Q26L160j2513o212J5512J410j371K02M636
15481e949K228o305o216k532J0410Q428n955q63j483O222P150J1531o493j0468
15467b95Q762K474l974j6327j8242j6575o941J3142M643O790M970M677J2922j501
15453e475m30J675J0816J00p721j3970l445n449P955N163O921K354m876K18J000
15438e164o298L030L939J554j3820K430K319p153r814J4727J7454o704l446r807
$$ plain form
15539 4196 10986 11230 215 -1403 -1094 -7905 -17641 -1697 7340 3849 3128 -1185 -2773 -7172 -14123
15524 -14123 887 8064 6423 4806 -2612 -9403 -19784 -14069 -22268 -23863 -14615 -23672 -24659 -5122
15510 -5122 -2145 3095 4223 -4566 -6965 -10535 -10446 -9901 -9305 -550 -1878 8262 -440 -10355 -2387
15495 -2387 3931 -10998 -21666 -16469 -11599 -10773 -7613 -20126 -26338 -10826 -9416 -10787 -10585 -5949
15481 -5949 -3721 -10026 -16242 -18774 -8364 64 -5891 -6754 -8237 -2015 5135 16666 10173 -295
15467 -295 8467 10941 6967 -9360 -27602 -44177 -51118 -37976 -33333 -26543 -21573 -16896 -3974 -5475
15453 -5475 -5905 -4230 6586 6686 -1035 -15005 -18450 -23899 -15944 -10781 -3860 -1506 -6382 -6164 -5164
15438 -5164 -11462 -8432 -4493 -2939 -16759 -14329 -12010 -19163 -28977 -14250 3204 -3500 -6946 -16753
15424a6753o936L138J1864J9444J920j4436k205J336r959k235N248P188K4880
15411B2494O898r686j0314l654o151k801O338j904q755o823m032L399R957O344
15397A310o420m526K596R80K76L674J0960m92m682L16j3060j6033l422J4846P413
15382f264j6080J681k023J7369J2442l040n040o841M889J815j1558k3772N653
15369c0769K5195p039q020j0297M013M634J5621Q499p740O409n575j427m005k0442
15355c0943K077J7180O60m383K833P211n844o44J1768L93j0883p717L096Q031
15341g165n48o431q221K0437J0360j0440j008j2419j0958n528J3989Q025r109
15328a9016O811J749o406j3497J886O90P722J1475l458O419m009o948J3437M333
$$ plain form
15424 -16753 -23689 -20551 -8687 10757 12677 -1759 -3964 -2628 -12587 -14822 -9574 -2386 22494
15411 22494 29392 19706 9392 5738 -413 -3214 3124 1220 -7535 -14358 -18390 -14991 -5034 1310
15397 1310 -5110 -9636 -7040 -6060 -5784 -2110 8850 8358 3676 3992 -9068 -25101 -28523 -13677 -6264
15382 -6264 -22344 -20663 -22686 -5317 7125 4085 -955 -7796 -2907 -1092 -12650 -36422 -30769
15369 -30769 -5574 -12613 -20633 -30930 -26917 -22283 -6662 1837 -5903 506 -5069 -6496 -10501 -30943
15355 -30943 -28866 -11686 -11026 -15409 -12576 -5365 -11209 -11853 -85 308 -10575 -18292 -15196 -7165
15341 -7165 -7713 -14144 -22365 -1928 8432 -2008 -3016 -15435 -26393 -31921 -17932 -9907 -19016
15328 -19016 -12205 -10456 -16862 -30359 -28473 -27783 -20061 -8586 -12044 -5625 -9634 -16582 -3145 1188
15314A188m006L238J0447r80l521k067r058r222J637J711K211N505p313M676J211
15299d343q100J0567l236R726q46k034q674j0877l878m206Q287k462k084J1606
15285a0554J3081K964N203J1277J2404o480j0819r972m676p277l735Q149J857
15272A422l719j207K927k3k609j482J858p524j457J56L649l77M332O584j5920
15257a3390J09L643n328P877p33j1096k680J1489N983M692Q979J6259J67j6016
15243I955j9253q168o293J4183J0108r221j0989P0q23m719J6387R350K655N513
15229H755nQ841J421L296J954l193k757r294O429r050l031Q297L36m062p439j0326
15213i828l22J695N424k161J938o501N296R862K412j304Q068o427j0776K2341
$$ plain form
15314 1188 -2818 420 10867 9887 6366 4299 -4759 -13981 -12344 -10633 -8422 -2917 -10230 -5554 -4343
15299 -4343 -12443 -1876 -5112 4614 3768 1734 -6940 -17817 -21695 -25901 -17614 -20076 -22160 -10554
15285 -10554 2527 5491 10694 21971 34375 27895 17076 7104 2428 -4849 -8584 -435 1422
15272 1422 -2297 -3504 -577 -600 -3209 -4691 -2833 -10357 -11814 -11658 -8009 -8386 -4054 2530 -13390
15257 -13390 -13281 -9638 -14966 -7089 -7822 -18918 -21598 -10109 -4126 566 9545 25804 25971 9955
15243 9955 -9298 -17466 -23759 -9576 532 -8689 -19678 -19608 -20431 -25150 -8763 587 3242 8755
15229 8755 8750 17591 19012 22308 24262 21069 18312 9018 15447 6397 3366 11663 11999 7937 498 -9828
15213 -9828 -10150 -8455 -3031 -5192 -3254 -9755 -4459 5403 7815 6511 14579 8152 -2624 19717
15199A9717m244n199o044k282J7633n972o529O510J745J1335R142K751Kj1360
15185B7205q303L168J965r538J865J175k065j0252J098N913M564j541j732J2622
15171B6144O947j0040R117P741j0938k360k114K924J5916J716j3683Q246K036
15158D1652k901j5724o562r800j4489k740p897n024P22J489R134m355k339k311
15144b1145l987j50R295P212J920m353n2J269J2063J901n572l14N497j843n527
15129c786N225O915J252p107j0406m033j4969j6888J2468K4485N263k233J0015
15116F201J0627r801j0n874o059n093K808P914k991n890m998j073J0261J0864
15102F886J0886j4576J1181R784j6090m817Q310p258o683l907j6301M126J289
$$ plain form
15199 19717 15473 10274 4230 1948 19581 13609 7080 13590 15335 26670 35812 38563 38565 27205
15185 27205 18902 22070 24035 14497 16362 17537 15472 5220 6318 12231 16795 15254 13522 26144
15171 26144 33091 23051 32168 39909 28971 26611 24497 27421 43337 45053 31370 39616 41652
15158 41652 38751 23027 16465 6665 -7824 -10564 -18461 -23485 -22763 -21274 -12140 -16495 -18834 -21145
15144 -21145 -25132 -25282 -15987 -8775 -6855 -11208 -11260 -9991 2072 3973 -1599 -1913 3584 1741 -3786
15129 -3786 1439 8354 9606 2499 -7907 -11940 -26909 -43797 -31329 -6844 -1581 -3814 6201
15116 6201 16828 7027 7017 1143 -4916 -10009 -7201 713 -2278 -8168 -13166 -14239 -3978 6886
15102 6886 17772 3196 14377 24161 8071 3254 11564 4306 -2377 -6284 -22585 -18459 -17170
15089a7170r1n251j1367l676j736L246R186J1689J6935K83j9083k105l019m73
15075b2632P29k194N663Q611J0719l500n490L119K3304J663o346J766R89j0017
15061F384o06l285j3082j218M155l455K266r85r9o618l6P401M615M743p303M459
15045b664n918j004J6647J2832l942O095J912j5502j090M668q106L385L489r454
15031A348k902N099P021o183j9203n359R881J0095j0725N63P296L565M875M572
15017I943O628j5297j305l126l201Q242M652o000j6797l857N222P761J8462N856
15003A7183n222p623j0340p048K446J4405O651j883Q949N054j0133j8727p825
14990a4113L043P841M308L925l680Q102P87j1460m36k198M001k952j3162n545
$$ plain form
15089 -17170 -17261 -22512 -33879 -37555 -39291 -36045 -26859 -15170 1765 2048 -17035 -19140 -22159 -22632
15075 -22632 -21903 -24097 -18434 -9823 896 -2604 -8094 -4975 18329 19992 13646 15412 16401 6384
15061 6384 5778 2493 -10589 -11807 -7652 -11107 -8841 -9826 -9925 -16543 -16579 -9178 -4563 180 -7123 -2664
15045 -2664 -8582 -9586 7061 19893 15951 22046 23958 8456 7366 12034 3928 7313 10802 1348
15031 1348 -1554 3545 10566 4383 -14820 -20179 -10298 -203 -10928 -10365 -3069 496 5371 9943
15017 9943 16571 1274 -31 -3157 -6358 1884 6536 536 -16261 -20118 -14896 -7135 11327 17183
15003 17183 11961 4338 -6002 -13050 -10604 3801 10452 8569 17518 22572 12439 -6288 -14113
14990 -14113 -11070 -3229 1079 5004 1324 9426 10213 -1247 -1683 -3881 120 -2832 -15994 -21539
14976b1539J0259Q599J580r267M438J8591J338L472O010k915n810l110O594q915
14962I325j3946N056m95p98q135Q178n309p987J0207q125m456O861J024Q918k798
14947b480K093r311j6680M88J2439m970j205J2600l399l056J0962J593k339j942
14933e207n219o894M983k339j2823j0940o994M296J1730K1113k753R494Q975j4114
14919f692M680k5498J266J2269L767l17P224m567j0200q790j8755N441R306k835
14905c3701n657J0355O914J2190N158n451N338k643J707J530o179j1813J718J8802
14891a732J1956n423J397K811K21p738j36r39J4646l32j281j1473k392M885j8707
14876a4237p987P469O009l032n485k595K091J5707n20P443L125p374J301L062
$$ plain form
14976 -21539 -11280 -2681 -1101 -10368 -5930 12661 13999 17471 23481 20566 14756 11646 18240 9325
14962 9325 -4621 435 -60 -858 -8993 -815 -6124 -14111 -3904 -12029 -16485 -9624 -8600 318 -2480
14947 -2480 -387 -9698 -26378 -25890 -13451 -18421 -19626 -7026 -10425 -13481 -2519 -926 -3265 -5207
14933 -5207 -10426 -17320 -12337 -14676 -27499 -38439 -45433 -41137 -29407 -8294 -11047 -1553 7422 -6692
14919 -6692 -2012 -27510 -26244 -13975 -10208 -10525 -3301 -7868 -18068 -26858 -45613 -40172 -30866 -33701
14905 -33701 -39358 -29003 -22089 -9899 -4741 -10192 -4854 -7497 -5790 -4260 -10439 -22252 -20534 -1732
14891 -1732 10224 4801 6198 9009 9230 1492 1356 417 15063 14731 13450 1977 -415 4470 -14237
14876 -14237 -22224 -14755 -8746 -11778 -17263 -19858 -17767 -2060 -2580 4863 7988 614 1915 4977
14862D977L72j2167j4248J653j806N006O861m141P799J5344j263l795o227N63
14848a072J2139l261j2050r194j7631M457j544J2478J6271O257M29q371n638j268
14834g998l134l429R185J3727O412j6236j022j292j0342r60q950p486M639j859
14820b8745Q214j237K753O528m793j34M298J3210m000k339j2047p314K678J0175
14806a2753L658r157n73j706J4995Q729o4l470j3434j329J8917J5313J760o545
14792A4341j2540j2994q229q66R922J056m46Q30K180n010j4011o067R028M880
14778a7926P675m008R553J5430r00k5201p951R055k307M715J945j277O998J1445
14764G246L473r771o392m838Q324J0733N83j3503j4414L302R01q827M742j988
$$ plain form
14862 4977 5349 -6818 -21066 -19413 -21219 -16213 -9352 -13493 -5694 9650 8387 4592 -1635 -1072
14848 -1072 11067 7806 -4244 -13438 -31069 -26612 -28156 -15678 593 6850 7279 -1092 -6730 -7998
14834 -7998 -11132 -14561 -5376 8351 14763 -1473 -2495 -3787 -14129 -15089 -24039 -31525 -26886 -28745
14820 -28745 -20531 -21768 -19015 -12487 -17280 -17414 -13116 94 -3906 -6245 -18292 -25606 -22928 -12753
14806 -12753 -9095 -18252 -18825 -20531 -5536 3193 3129 -341 -13775 -15104 3813 19126 20886 14341
14792 14341 1801 -11193 -19422 -20288 -10366 -9310 -9756 -8926 -6746 -11756 -25767 -31834 -22806 -17926
14778 -17926 -10251 -14259 -4706 10724 9824 -15377 -23328 -14273 -16580 -11865 -9920 -11197 -4199 7246
14764 7246 10719 948 -5444 -10282 -1958 8775 9358 -4145 -18559 -15257 -14356 -23183 -18441 -20429
14750b0429J38J5900P074R857q036j5604r170n065M951O687K921K342l497N467
14736f464j665P726l809n294J0424n151j1093j6742N32J2754p718q743P590K6239
14722a414m698j045P003n3j1993J5443N420m74j7828n113o622J5347J6702L13
14708A0988j7406J939J2852n846l871q587k839m007R01J3648J611m078M578j1105
14694a1222p719J5471Q667Q000k189l145p198L905Q314k401l264L667j772j0054
14680i40n784J344J2413m581n542k329p905q379M16O742M691r910P053K505M075
14665f131L723q917N145N51Q360q205j3227O559Q024J2420N929q309P33p206n159
14650e710P303J42L444J721n61r047j0489L694J6569J3717p427k1677j4395L458
$$ plain form
14750 -20429 -20291 -4391 2683 12540 4504 -11100 -20270 -25335 -20384 -13697 -10776 -8434 -11931 -6464
14736 -6464 -8129 -403 -4212 -9506 918 -4233 -15326 -32068 -31536 -18782 -26500 -35243 -27653 -1414
14722 -1414 -6112 -7157 -154 -207 -12200 3243 8663 8189 -9639 -14752 -21374 -6027 10675 10988
14708 10988 -6418 -4479 8373 2527 -1344 -9931 -12770 -16777 -15876 -2228 -617 -4695 -117 -11222
14694 -11222 -18941 -3470 5197 13197 11008 7863 665 4570 12884 10483 7219 10886 9114 -940
14680 -940 -6724 -5380 7033 2452 -3090 -5419 -13324 -21703 -21287 -14545 -9854 -19764 -12711 -10206 -6131
14665 -6131 -2408 -11325 -6180 -5629 2731 -5474 -18701 -12142 -4118 8302 14231 5922 6655 -551 -5710
14650 -5710 1593 1735 5179 6900 6339 -2708 -13197 -9503 7066 20783 13356 -8321 -22716 -19258
14636a9258R075J363P56L240q742j0781Q376R187J247M965k519n868m484N999
14622g444N32o193J204N291M172j951l794j1485m704m56J4782L941k656K587m366
14607a0540j938j2199k248J7207p37N50J2557r214j387P999J4493q545k544r440
14593e986P100P158M431q145p477p799j437j198n283N812j183j1598q779J1043
14579b3341O751r445o235J3075N055K310p822p303L483J786o122L265P046M602
14565a2895n256L965r551n256J4036J5351m590N49P91K718l420J0768q387O399
14551E222Q173r429p703J703Q286n793p520J785M314j6207j7203Q704J0573O74
14537a4421R526o339k031k213k863J2684M890j0867M212j5795j0080o48n232K5560
$$ plain form
14636 -19258 -10183 -8820 -8064 -4824 -13566 -24347 -15971 -6784 -5537 -572 -3091 -8959 -13443 -7444
14622 -7444 -6912 -13105 -11901 -6610 -2438 -4389 -8183 -19668 -24372 -24828 -10046 -6105 -8761 -6174 -10540
14607 -10540 -12478 -24677 -26925 -9718 -10455 -9905 2652 -6562 -7949 50 14543 5998 3454 -5986
14593 -5986 1114 8272 12703 4558 -2919 -10718 -12155 -13353 -18636 -12824 -14007 -25605 -34384 -23341
14579 -23341 -16590 -26035 -32270 -19195 -14140 -11830 -19652 -26955 -23472 -21686 -27808 -24543 -17497 -12895
14565 -12895 -18151 -14186 -23737 -28993 -14957 394 -4196 -3647 -2856 -138 -3558 7210 -1177 5222
14551 5222 13395 3966 -3737 -2034 6252 459 -7061 -5276 -962 -17169 -34372 -25668 -15095 -14421
14537 -14421 -4895 -11234 -13265 -15478 -18341 -5657 -767 -11634 -7422 -23217 -33297 -33945 -39177 -13617
14523a3617K0235L94o719J1342O08m661L075K384j89j171j293n088n6j0231L818
14508a169j944p198l085J0215Q438o594q98L243l48n708j080p383q10n874n480
14493b5675R216L579O764R187J617L752J20M850m70l454n123q921j6807n095L149
14478b3311J0208P099M811J1312j094j0339j737q350k299M273l75N81j6393k383
14464b7997Q998m681n830N384K2458J0562O251j96J930Q55j0795k891O017K738
14450A2803j3821p486N137J130o031l311J1314Q967N4L392L527k896p732k037
14436C010O510J4607o61k3345m727P079k102M822J066R883R000m101j3301q815
14422a075O920k332o930l827m163l771N500l342P810K933P555K983o325N74j07
$$ plain form
14523 -13617 6618 7012 293 11635 12243 7582 10657 13041 12852 11681 10388 5300 5244 -4987 -1169
14508 -1169 -3113 -10311 -13396 -3181 5257 -1337 -2235 1008 660 -5048 -6128 -13511 -14321 -20195 -25675
14493 -25675 -16459 -12880 -6116 3071 4688 8440 8560 13410 12940 9486 4363 -4558 -21365 -26460 -23311
14478 -23311 -13103 -6004 -1193 10119 9025 -1314 -3051 -11401 -13700 -9427 -9802 -9221 -25614 -27997
14464 -27997 -18999 -23680 -29510 -24126 -1668 8894 15145 14949 16879 17734 6939 4048 10065 12803
14450 12803 -1018 -8504 -3367 -2237 -8268 -11579 -265 8702 8756 12148 15675 12779 5047 3010
14436 3010 9520 24127 23466 121 -4606 2473 371 5193 6259 16142 25142 21041 7740 -1075
14422 -1075 5845 3513 -3417 -7244 -11407 -15178 -9678 -13020 -5210 -2277 5278 8261 1936 2510 2403
14407B403j0958j067J2006m063n744R626l091O663n016k963p336j8124K104J4303
14393a1257m82K098J4479k648J68p124M625q368q394L26J1332K212K015K880N028
14378F890J0718q035k5381j0244Q764N935p613N667J840N730M357J1710j194j2014
14364b870j6642p529O003o85K917J4139P171j56O402J266P68q038j2009O348j5114
14349a8029j234L748J4902K217j3529r904K500O493p244M348J1099K505O332o272
14335b068q488l037l293N531L283m20Q608r330p05o066N394j561k412Q48R961
14320c755l865n857n236p618Q416J0898J880P516k131K519m640L114Q177L281
14306A2699j177L325K317o035K116j4433m135K005P490n455J537L55q110j220
$$ plain form
14407 2403 -8555 -9622 2384 -1679 -7423 2203 -888 5775 759 -2204 -9540 -27664 -25560 -11257
14393 -11257 -11739 -9641 4838 2190 2358 -4766 -141 -8509 -16903 -16577 -5245 -3033 -1018 1862 6890
14378 6890 17608 9573 -15808 -26052 -17288 -11353 -18966 -13299 -11459 -5729 -1372 10338 9144 -2870
14364 -2870 -19512 -27041 -21038 -21723 -18806 -4667 2504 2348 8750 10016 10784 2746 -9263 -2915 -18029
14349 -18029 -19263 -15515 -613 1604 -11925 -21829 -19329 -12836 -20080 -15732 -4633 -2128 4204 -2068
14335 -2068 -10556 -13593 -16886 -11355 -8072 -8492 116 -9214 -9919 -15985 -10591 -12152 -14564 -13716 -3755
14320 -3755 -7620 -13477 -18713 -26331 -17915 -7017 -5137 2379 248 2767 -1873 1241 9418 12699
14306 12699 11522 14847 17164 11129 13245 -1188 -5323 -3318 4172 -1283 254 609 -7501 -8721
14292h721M077O354m271J1025J0359K151j2160r068K445K975J365p588p120L059
14278e118n177j42J2074M151R543l232o868j0421P948N310R02p348n857N806l243
14263a672k097q491m217J4066J4540o371N018L4q442o426l299L475m753j671J029
14248i277n671o180Q599Q172k511q848j4224L277J1058Q125P952L990K062m278
14234B246l279j9970j1661K023O670J7102M151L272N10R639Q689J67j1252j038
14220G269j868j4081n907L1161J3607j499k735j0463k253o889R754Q025r772k885
14206A1464K941j5913O41J9460N444P102k167r524m908l78N010J3498k955R90
14192C0705J2573P828P149J3241n17J2179J7101J1172J4233R153K2274K4863J9831
$$ plain form
14292 -8721 -4644 1710 -2561 8464 18823 20974 8814 -254 2191 5166 6531 -1057 -8177 -5118
14278 -5118 -10295 -10437 1637 5788 15331 12099 5231 -5190 2758 8068 8970 1622 -4235 1571 -1672
14263 -1672 -3769 -12260 -16477 -2411 12129 5758 10776 10810 2368 -4058 -7357 -3882 -8635 -10306 -9277
14248 -9277 -14948 -21128 -12529 -4357 -6868 -15716 -29940 -26663 -15605 -7480 472 4462 6524 2246
14234 2246 -1033 -21003 -32664 -30641 -23971 -6869 -2718 554 1064 10703 19392 19559 8307 7269
14220 7269 5401 -8680 -14587 16574 30181 28682 25947 15484 13231 6342 16096 24121 14349 11464
14206 11464 14405 -1508 -867 18593 24037 31139 28972 19448 14540 14162 19172 32670 29715 30705
14192 30705 43278 51106 58255 71496 70979 83158 100259 111431 125664 134817 157091 181954 201785
14179B01785K2150L2799M5350L8912K8106K7134L985R842R31K918K530L741j707
14166D18476j7749j7159k1129l6193m1683n0495l6630l0082l1441j1108j5514
14155A09293j7573p153p074q546q871J3625J667j4050j7434J075o277j878j7972
14142A8832j4008L38q82m636J1001J5020j1064q667Q628Q944M644q958j9658n093
14128e559K3410P474n443k4929l026J7339L501M213m238n425j2605O639N663k184
14114D830L115l339n048j2888N138q34O414J7791P037O368Q771j2153k859n252
14100A7091m420q474L917j044r187L226o221j1017J160O110J1200P598r197l366
14086b624o990j8179P685M372j218J0269J1929R614p875r066k34q83J0360L234
$$ plain form
14179 201785 223935 256734 302084 340996 369102 396236 400221 410063 410994 413912 416442 420183 418476
14166 418476 400727 383568 362439 326246 284563 234068 197438 167356 135915 124807 109293
14155 109293 91720 84567 77493 68947 60076 73701 75368 61318 43884 44959 38682 36804 18832
14142 18832 4824 5162 4280 -356 10645 25665 14601 5934 14562 23506 28150 19192 -466 -5559
14128 -5559 17851 25325 19882 -5047 -8073 9266 12767 16980 12742 7317 -5288 1351 7014 4830
14114 4830 7945 4606 -442 -13330 -8192 -9026 -2612 15179 22216 28584 37355 25202 22343 17091
14100 17091 12671 4197 8114 7070 -2117 1109 -5112 -16129 -14969 -8859 2341 9939 742 -2624
14086 -2624 -9614 -27793 -20108 -15736 -16954 -6685 5244 14858 6983 -2083 -2317 -3200 7160 10394
14072A0394q80M522L611o075l174q357j1204k225Q512j292R956P016P739N464
14058B4007o10j9125j5085Q981Q192p28r469l829j55M226r078K128k754q73M60
14043a3712K187M434M425J6191J1440N55J05J330k366J5828J1J2694J0618J1544
14029G5284L4350L9794J4218k0573j8256k2548k3839j6086j5235K397k4435k8700
14017c629m091j898Q489J3861R435J005l481n870p845J4159R105n452q6l518n949
14002A4235m873m244L548J1991m721r315M441j005q244L48O290n643j5416j2946
13988b5554O138J8572J2448k285J2439l300k642M949R51j0953P657K485l392l394
13974A4119R114K663j216q681j2004O050P355M27J8049L417M989J7895K5864K9461
$$ plain form
14072 10394 9514 14036 17647 11572 8398 41 -11163 -13388 -4876 -6168 3788 10804 18543 24007
14058 24007 23397 4272 -10813 -1832 6360 5632 -3837 -7666 -7821 -3595 -12673 -10545 -13299 -14172 -13712
14043 -13712 -11525 -7091 -2666 13525 24965 25520 25625 26955 24589 40417 40428 53122 63740 75284
14029 75284 109634 149428 163646 143073 124817 102269 78430 62344 47109 49506 25071 -3629
14017 -3629 -7720 -9618 -1129 12732 22167 23172 19691 13821 5976 20135 29240 23788 23702 20184 14235
14002 14235 9362 5118 8666 20657 15936 6621 11062 10057 1813 2161 8451 2808 -12608 -25554
13988 -25554 -19416 -844 11604 9319 21758 18458 15816 20765 21716 10763 18420 20905 17513 14119
13974 14119 23233 25896 24680 15999 3995 10045 17400 17827 35876 39293 44282 62177 88041 117502
13960A17502L8731M7736O6054O6113P5622P0631M7157L0839P902k1317m0187o4644
13948D42139p0551p7642o7626n7718k9052j6905j9546j2711q114j2351o111j7747
13936D6065k1292k1791r343l900J0376J4560J8560j2332j4198n476j7588Q545
13924g814J5129j19M919j880m682K448l150m696r429N600k802p098J756J5355
13910C537P533Q590J132k126j0949r173N067n05q284l061N147J4992N699r34J367
13895A8032o620M68o558j083J005N259K731j3115N776P600q55m723o926Q475O117
13880A5583k227r214N071K440j5040K595R149r186J0220L072j7492l823Q302L510
13866B960n587J1397j63j11M051o153q900n171n458Q734Q621J6704m686j784k1322
$$ plain form
13960 117502 156233 203969 270023 336136 411758 482389 529546 560385 568287 546970 506783 442139
13948 442139 371588 293946 226320 168602 139550 122645 103099 90388 82274 69923 63812 46065
13936 46065 24773 2982 -6361 -10261 115 14675 33235 20903 6705 1229 -16359 -7814
13924 -7814 7315 7196 12115 10235 5553 8001 4851 155 -9274 -3674 -6476 -13574 -11818 3537
13910 3537 11070 19660 20792 18666 7717 -1456 3611 3106 -5178 -8239 -3092 11900 17599 16665 18032
13895 18032 11412 11880 5322 4239 5244 10503 13234 119 5895 13495 12640 7917 991 9466 15583
13880 15583 13356 4142 9213 11653 -3387 -792 8357 -829 9391 12463 -5029 -8852 -550 2960
13866 2960 -2627 8770 8607 8496 12547 6394 -2506 -7677 -13135 -4401 4220 20924 16238 14454 -6868
13851f868n910J0014j486q819J5734K0788K317k0182r111n189O383P208Q26J100
13837F805K550m829J1519Q075M098m304L572L919J369J2387O62k3417q920N056
13823A8542J2790O156J1885l327n663m070q291j5124m169J828j601j561N78r525
13809a552k696O21l961P081K721k973K488l735J103Q319J76p782K210j0144O02
13794g522N591L353m32m649n714L936N078K979o226m653P958P041j0484J0677
13780F933K1870L990o310j305Lj2733L882N949J065N512L891Q299J81j1343J3647
13765D3531O902r837o366r65N69P617o440n332O501O77j559m843j1085m316L906
13750A8960O81j90q669N24o653L962M450O626L305r423O369L266m437n58R914
$$ plain form
13851 -6868 -12778 -2764 -4250 -13069 2665 23453 25770 5588 -3523 -8712 -2329 4879 5705 6805
13837 6805 9355 4526 16045 24120 28218 23914 27486 31405 32774 45161 45823 22406 13486 18542
13823 18542 31332 37488 49373 46046 40383 36313 28022 12898 8729 10557 8956 7395 7973 -1552
13809 -1552 -4248 -3627 -7588 -507 2214 -759 1729 -2006 -903 7416 7592 -190 2020 -8124 -7522
13794 -7522 -1931 1422 990 -3659 -9373 -5437 -359 2620 -3606 -8259 -301 6740 -3744 6933
13780 6933 28803 32793 26483 25178 25181 12448 16330 22279 23344 28856 32747 41046 41227 29884 43531
13765 43531 50433 40596 34230 33265 33834 41451 35011 29679 36180 36857 35298 30455 19370 15054 18960
13750 18960 19641 19451 10782 11306 4653 8615 13065 19691 22996 13573 19942 23208 18771 18213 28127
13735B8127j9069j0672O537K613O10M810j5130j4746m243J0299l268k559J3768
13722b923M189l772R485J0024n999j638j2982O14J0397J1700l310j0135p538J5188
13708A3300J3248j300j8010j4255o786r500J0136J5822K83J0040r494p753N807
13695A538M113K985p563J622m713q19L409Q284p494j691j284L121N937o624J803
13680B624K569N754L538L570k000n728N970o828m795J023J2624r004N171J771
13666A6259o231l66j1145J238P641P081m980o301j1654m917J1400K683Q671J2856
13652B2235m707o944k087N47k431K222l741j666j139R435L447n738L882m584j416
13637G315R928p071M029R804j3624m350P229J108j1386j783R221J0613j035J1523
$$ plain form
13735 28127 9058 -1614 4923 7536 8146 12956 -2174 -16920 -21163 -10864 -14132 -16691 -2923
13722 -2923 1266 -2506 6979 17003 11004 9366 -3616 -3002 7395 19095 15785 5650 -1888 13300
13708 13300 26548 25248 7238 -7017 -13803 -23303 -13167 2655 2938 12978 3484 -4269 1538
13695 1538 5651 8636 1073 2695 -2018 -2837 572 8856 1362 -329 -1613 1508 7445 821 2624
13680 2624 5193 10947 14485 18055 16055 10327 16297 9469 4674 5697 18321 9317 14488 16259
13666 16259 10028 9662 -1483 -245 7396 14477 9497 3196 -8458 -13375 -1975 708 9379 22235
13652 22235 17528 10584 8497 9044 6613 8835 5094 3428 2289 11724 15171 9433 13315 8731 7315
13637 7315 17243 10172 14201 24005 10381 6031 13260 14368 2982 1199 10420 21033 19998 31521
13623C1521O289r510m732k620k63r538P884j82j411J6658n56p152n06O527M900
13608C7309O498J075n591J2575J0755N716k07J2897J8512J4906Q653O515J343
13595A30956J094K6661J7243K3057J4384O052J7421J6432J6270J7180J7598K3213
13583C27561K6712J5174J487j0872j8270k1509k1952m4066m3864k3728m6347k2963
13571A17363k0219j3476p612r167J1071N933O029J329J678M998L117J1821R122
13558A21987n713J3669J5382P102M063R688J0523K5683M2197K6623J4845J2561
13546B98610J1765k700k6482r049k0421l3033l7208l1681l0962k0137M206j0718
13534I2190j3687j0997o353j183o231k0499o681J1093J151j441M675q948n454
$$ plain form
13623 31521 37810 28300 23568 20948 20685 11147 19031 18849 17438 34096 33540 26388 25882 32409 37309
13608 37309 43807 44882 39291 51866 62621 68337 68130 81027 99539 114445 123098 129613 130956
13595 130956 132050 158711 175954 199011 213395 219447 236868 253300 269570 286750 304348 327561
13583 327561 354273 369447 370934 360062 341792 320283 298331 254265 210401 186673 140326 117363
13571 117363 97144 83668 76056 66889 77960 83893 89922 91251 92929 97927 101044 112865 121987
13558 121987 116274 129943 145325 152427 156490 166178 176701 202384 244581 271204 286049 298610
13546 298610 310375 307675 281193 272144 251723 218690 181482 149801 118839 98702 102908 92190
13534 92190 78503 67506 61153 59970 53739 33240 26559 37652 38803 37362 42037 33089 27635
13521B7635N089k239j0185M09m871n492p922Q877R389R659N040P735p097k8391
13507G636j7488L715L880j0002o565N380K2178O633L502Q561k296m274j9227l659
13493b026n400K261k0K211K6672J1820j3199l781K180O24J940j682m418l548j720
13478A1914q968L974q265R556J2743m623K527J24q650o904Q125N604r704p607
13464a54O41o160l948Q335j041j3464k150k577L945J334P230O799L824l766j846
13449b998k581O009J0985M177o425q865J2035N732J261o187k065K222j3861j0679
13435a1240L443k489P618K3972M419o827n555q873R63M321o006N072J2461M657
13421B5936n559j3451k658M044j599K747m93M555j705j2361j8908L843J1657j733
$$ plain form
13521 27635 32724 30485 20300 20709 15838 10346 2424 11301 20690 30349 35389 43124 36027 7636
13507 7636 -9852 -6137 -2257 -12259 -18824 -13444 8734 15367 18869 27430 25134 20860 1633 -2026
13493 -2026 -7426 -5165 -5185 -2974 23698 35518 22319 18538 20718 21342 23282 21600 17182 13634 11914
13478 11914 2946 6920 -1345 8211 20954 16331 18858 18982 10332 3428 11553 17157 7453 -154
13464 -154 487 -5673 -9621 -1286 -2327 -15791 -17941 -20518 -16573 -15239 -8009 -1210 2614 -1152 -2998
13449 -2998 -5579 430 11415 15592 9167 302 12337 18069 19330 13143 11078 13300 -561 -11240
13435 -11240 -7797 -10286 -2668 21304 25723 18896 13341 4468 5431 9752 3746 8818 21279 25936
13421 25936 20377 6926 4268 8312 6713 9460 8967 13522 11817 -544 -19452 -15609 -3952 -5685
13407e685K115P085J488l52J3127j4872l809J0884Q41o300J667P119M582j108
13393A6782j4999K522n32k398Q223o278m422J3134n765r188J928J5494O364J1474
13379C2339J411j6102p598n482n847l791o191j3814j395r23l012R028J5014P04
13365e659j2793P57O10M579J5552J6342j0154p404l204Q046P16K997K428M390
13351A7203l914J819n348J2210R14j448J587M141Q39j4036p691M045J964J4513
13337B6798K384j8840m781l993j718N685p8j593J080N304M310j4326R78M522J8410
13322B4142K198p361J0248P708q193r217k61r363n037L976J1988K473N663j200
13308B7764l595J3850Q131J1635P359j8219j8433j0447N156Q708k711j4599q818
$$ plain form
13407 -5685 -3570 3515 5003 4651 17778 2906 -903 9981 10822 4522 6189 13308 17890 16782
13393 16782 1783 4305 3773 1375 9598 3320 -1102 12032 6267 -2921 -993 14501 20865 32339
13379 32339 33750 17648 10050 4568 -1279 -5070 -11261 -25075 -26470 -27393 -30405 -21377 -6363 -5659
13365 -5659 -18452 -17695 -17085 -12506 3046 19388 9234 1830 -1374 6672 7388 10385 12813 17203
13351 17203 13289 15108 9760 21970 22884 21436 23023 27164 28003 13967 6276 10321 12285 26798
13337 26798 29182 10342 5561 1568 -150 5535 5457 3864 4944 10248 14558 232 1210 5732 24142
13322 24142 26340 18979 29227 36935 28742 19525 19264 9901 4864 8840 20828 23301 28964 27764
13308 27764 24169 38019 46150 57785 65144 46925 28492 18045 23201 31909 29198 14599 5781
13295E781J9219K1773K546o892M604j5108k7263q628j218J0541p287p466L188
13282f210R478M905P262j288q388n910n335m992k383l54J1477N620J0615j931
13268A2566K092O49k891j839o345k216K951N288M561L76Q195J2357K34j0691k946
13253B2341K373J0270N04n754j5754j2449P972k86l300K547J4155n842j129J626
13239A7274j6307M918m156N860J3160M709K979J1157l123j610L983Q746j703j4921
13225C0966M422J6706p691q124j3141j1891K326Q839r986j1304q308K759J6761
13212A2334k644q616J1996J0876j70j2631M57J9466J5204j3410q350J8603l182
13199C9933k2896j3821J4486J1885M234j364j8800j613N094j331L764J2628j444
$$ plain form
13295 5781 25000 46773 49319 42427 47031 31923 4660 -3968 -5186 5355 -1932 -9398 -6210
13282 -6210 3268 8173 15435 14147 5759 -151 -5486 -10478 -12861 -13215 -1738 3882 14497 12566
13268 12566 14658 15307 12416 10577 4232 2016 4967 10255 14816 15192 23387 35744 35978 25287 22341
13253 22341 24714 34984 35488 29734 13980 1531 9503 9217 5917 8464 22619 16777 15648 17274
13239 17274 967 5885 1729 7589 20749 25458 28437 39594 36471 34861 38844 47590 45887 30966
13225 30966 35388 52094 44403 36279 23138 11247 13573 22412 12426 1122 -7186 -4427 12334
13212 12334 9690 1074 13070 23946 23776 11145 11602 31068 46272 32862 24512 43115 39933
13199 39933 17037 3216 17702 29587 33821 32457 13657 12044 17138 15807 19571 32199 30755
13186C0755K06P87k712r51j077K766l759K91m664j792J4161J6374O473j3724k2377
13171B0757j3653O255L438J4324k160l375j296L118M472r126q985P112J5004p953
13157B7932j992r843n33L080N669j257l685j230N584J5571R083N90J5205J7452
13143H1626n211p345j5250j3844J1316K319N83K634m145j2657J2038p90K704L526
13129E7504R374K3344J8158j5056P378K238k4536j1896N299K536j4508J5381J8262
13116I3478J6297R563j462J662r58Q716L5850L7525J7483M1525O9560R7801J15220
13103E42260J44725J35328J09505O3108K3199n0680q9234j12928j53772j38421
13093D73090r3352p6650o8277n1917l8234k6051j4034K726R889K2367P92l42o58
$$ plain form
13186 30755 30961 31748 29036 28085 27008 29774 26015 26306 21642 19850 34011 50385 56858 43134 20757
13171 20757 7104 13359 16797 31121 28961 25586 24290 27408 31880 22754 13769 20881 35885 27932
13157 27932 25940 16097 15564 18644 24313 23056 19371 18141 23725 39296 48379 48969 64174 81626
13143 81626 76415 69070 53820 39976 51292 53611 54194 56828 52683 40026 52064 51274 53978 57504
13129 57504 66878 90222 108380 93324 100702 102940 78404 66508 71807 74343 59835 75216 93478
13116 93478 109775 119338 117876 119538 118580 127296 163146 200671 218154 259679 329239 427040 542260
13103 542260 686985 822313 931818 994926 1018125 967445 878211 765283 611511 473090
13093 473090 379738 303088 234811 182894 144660 118609 104575 107301 117190 139557 140349 140007 139349
13080A39349l480j5383k728l110j4197k62l551n640J9271r430j9268j1362o166
13067F4043p812j4089r416N960R363M048j3137j2008K318Q342J118P398M76q563
13053C8041j232j140k71L177L285O233N087J4398O409P409J0193J7999J2331K7269
13039A49188K9045L5947L6790N4452M3548J3338Q06k7801n4823m8509m4231l5722
13027A52028k6741k9526j0057l626r044k4502j1608m746M462K0090P65p476k774
13014D7245J1495m608r075r309n127l762J9356R521m277j289J104J3876N74j3712
13000E2012N172Q140R22R79q107j506L270k740j898k329P557k106j2990p56m365
12985D1255q080r899J767M244k800k1685n501R646M722J8862R976r923j2240N439
$$ plain form
13080 139349 135869 120486 117758 114648 100451 100189 96638 90998 110269 100839 81571 70209 64043
13067 64043 56231 42142 32726 38686 48049 52097 38960 26952 29270 37612 38730 46128 46604 38041
13053 38041 36809 35669 35398 38575 41860 48093 53180 67578 73987 81396 91589 109588 121919 149188
13039 149188 178233 214180 250970 305422 348970 362308 363114 335313 280490 231981 187750 152028
13027 152028 125287 95761 85704 82078 73034 48532 36924 32178 36640 56730 57495 50019 47245
13014 47245 58740 54132 45057 35748 30621 26859 46215 55736 51459 50170 51274 65150 65724 52012
13000 52012 57184 65324 66246 67225 59118 57612 60882 58142 56244 53915 61472 59366 46376 45620 41255
12985 41255 33175 23276 25043 29287 26487 4802 -699 8947 13669 32531 42507 32584 20344 25783
12971B5783k12n1J4274P079j32M535J392M465j78n802r449q92P1Q004o404p494
12955C4989l813r443R888N293p88m884j3967M426N329J1066J3256O831j0291j678
12941D6214J194M693M025r20J5052J1307q16o28J3692M505M579J2383p349o106
12927A01825J551k341K445o163j2759j5387j5966m817j307N186J2572j045q782
12914E5012K339K232n113R610K0957L07q07R05j970P097Q295o451k1445j6334
12900E4634j1173k055n808J791O809j305j66R852Q438N083J314K430R890K2064
12886A01798J7705J7443N085J5950K4691L5580K4331L733P356J6194k2055l9533
12874B08278j7809p122n992r398j5585k0551k4567k1237r003j7823q572p086q573
$$ plain form
12971 25783 25571 25520 39794 46873 46741 51276 52668 57133 56955 51153 41704 40812 40883 48887 42483 34989
12955 34989 31176 21733 31621 36914 36126 31242 17275 21701 27030 38096 51352 58183 47892 46214
12941 46214 47408 52101 56126 55206 70258 81565 80749 80121 93813 98318 102897 115280 107931 101825
12927 101825 103376 101035 103480 97317 84558 69171 53205 48388 47081 52267 64839 63794 55012
12914 55012 57351 59583 54470 64080 85037 85344 84537 85442 83472 90569 98864 92413 70968 54634
12900 54634 43461 41406 35598 37389 44198 42893 42727 52579 61017 66100 67414 69844 79734 101798
12886 101798 119503 136946 142031 157981 182672 218252 242583 246316 253672 269866 247811 208278
12874 208278 190469 183347 177355 167957 152372 131821 107254 86017 77014 59191 50619 43533 34960
12861C4960j6776L746J506k560r857J1757M592K607m77p572J5219Q964M109q055
12847D2163N877K015j99M129j293J3028J602P52j1180j0230o485j1012L914J5897
12833D8978o655l705j72J2848R563K569m825O157J0153J7772J2355O196j5259
12820I5975k1805j0283J3091J3084o163j6105J597J6610o430j0688N20N638J8479
12807I3520K5184J4736Q157J297K77q761m986R463J0566O494J0174j331j1135
12794A53655k0685N173J4385j663j8400j2028j8760R067J7914O6J33j552O573
12781A33878J1316M40L854K633L416J7249P254J2081K0858K0039J3582L7220J3447
12768B97267J472J612M778K467j0729j8223k0056J96N128J0061J3772j211J3345
$$ plain form
12861 34960 18184 21930 23436 20876 11019 22776 27368 29975 29498 21926 37145 46109 50218 42163
12847 42163 48040 50055 49856 53985 52692 65720 67322 68074 56894 46664 40179 29167 33081 48978
12833 48978 42323 38618 38446 51294 60857 63426 58601 64758 74911 92683 105038 111234 95975
12820 95975 74170 63887 76978 90062 83899 67794 69391 86001 79571 68883 69403 75041 93520
12807 93520 118704 133440 141597 142894 143171 134410 129424 138887 149453 155947 166121 164790 153655
12794 153655 132970 138143 152528 150865 132465 120437 101677 110744 128658 128724 128857 127305 133878
12781 133878 145194 145634 149488 152121 155537 172786 180040 192121 212979 233018 246600 283820 297267
12768 297267 298739 300351 305129 307596 296867 278644 258588 258784 263912 273973 287745 286534 299879
12755B99879J405J878n508J455O054K0797Q782Q092J5857P727j998P016J9418
12742C90854K1209J5984K0155J4052m311r105p774N192N536J9627J7354J3124
12730E01897L3860L5399K7206J8066J0920L5852K9338J2517L1536L9797M9362
12719H25750M8777N0081L4785M5277N9822P0632P9858Q8525J02312J12247J47356
12708A665422J69333J75261J95447K14441K16093K29170K14110K23696K34818
12699C537791K48605K99687L97496N54706P00992Q86184J053553J194597J308530
12690A0182141J467726J705283K116991K852223M085908O070833R135075J3421938
12682E1038118J8446677K2895057K5160824K4409437K0614202J3892960M782885
$$ plain form
12755 299879 301284 303162 297654 299109 305163 325960 334742 342834 358691 366418 364420 371436 390854
12742 390854 412063 428047 448202 462254 457943 448838 441064 446256 451792 471419 488773 501897
12730 501897 535757 571156 598362 616428 627348 663200 692538 705055 736591 776388 825750
12719 825750 874527 924608 959393 1004670 1064492 1135124 1214982 1303507 1405819 1518066 1665422
12708 1665422 1834755 2010016 2205463 2419904 2635997 2865167 3079277 3302973 3537791
12699 3537791 3786396 4086083 4483579 5038285 5739277 6625461 7679014 8873611 10182141
12690 10182141 11649867 13355150 15472141 18324364 22410272 28481105 37616180 51038118
12682 51038118 69484795 92379852 117540676 141950113 162564315 176457275 181240160
12675A81240160m869058j3361420j9808490k3454439k3757716k1512653j7994209
12668E6482175j3868525j0055785p052422m856371l378408k435923j855422j520847
12660A1458472j298894j157146j057393r70216q62389p46059o55812n52292m54359
12651C703912l84176l11434k44274k14592j63902j36477j10207q9989o3812l8542
12641A946507m0102m1269l8451l8880k9285m0128m4348l7152n3888p1129o0585
12630A451290o3772o9467n5709k0832L4430N2197P1122N8202L9551k800m3473
12619A450739p2396r5433j13240j16249r2045p5940n8436m0521l6942l1596k3614
12608F94327j9888k2146l2308k8300k6825j6950n252n302q113j3936j8240l8278
$$ plain form
12675 181240160 176371102 163009682 143201192 119746753 95989037 74476384 56482175
12668 56482175 42613650 32557865 25505443 20649072 17270664 14834741 12979319 11458472
12660 11458472 10159578 9002432 7945039 6974823 6112434 5366375 4710563 4158271 3703912
12651 3703912 3319736 3008302 2764028 2549436 2385534 2249057 2138850 2048861 1985049 1946507
12641 1946507 1906405 1865136 1826685 1787805 1758520 1718392 1674044 1636892 1583004 1511875 1451290
12630 1451290 1387518 1318051 1262342 1241510 1275940 1328137 1399259 1457461 1497012 1494212 1450739
12619 1450739 1378343 1282910 1169670 1053421 961376 885436 827000 786479 749537 717941 694327
12608 694327 674439 652293 619985 591685 564860 547910 542658 537356 529243 515307 497067 458789
12596D58789k1246k7381j2397j4520l402p207j6819j7217J513O001O398J5867
12584C68379R893K593J938N733J558O356n614p787l068K294L780o062j3364k6586
12570C40043l570P919q008j1445J0502L6k1196k8518j4594J988k130j4302n624
12557B51101j254N289J8498J5112L481K118J1258R350L533j3874r605j888k068
12544B91051o958N961K8850K0932K1783K7498K6942K5981N2031O1696P4749O3029
12532F93545Q4396J01010P1387N7000K5631j332l6146o3445q9738j07939j07797
12521F26572r2830p3250n2031n5269l3479k8019j9219j6953k2704j0022j5500
12510B07296j7922r774M549j5175j3388O879N716O354K3671n882o39K244L2080
$$ plain form
12596 458789 437543 410162 397765 383245 379843 372636 355817 338600 340113 346114 352512 368379
12584 368379 378272 380865 382803 388536 390094 396450 390836 383049 379981 382275 386055 379993 366629 340043
12570 340043 336473 344392 336384 324939 335441 335477 314281 285763 271169 273157 271027 256725 251101
12557 251101 249847 255136 273634 288746 292227 294345 305603 314953 318486 304612 295007 293119 291051
12544 291051 284093 290054 318904 339836 361619 389117 416059 442040 494071 555767 630516 693545
12532 693545 777941 878951 950338 1007338 1032969 1031637 995491 932046 842308 734369 626572
12521 626572 533742 460492 408461 353192 319713 291694 272475 255522 232818 222796 207296
12510 207296 189374 179600 184149 168974 155586 162465 168181 174535 198206 192324 191685 193929 226009
12497B26009J4293O338J0667R716J7195K2600J6010K5167K7039O2566Q3113N6412
12485E77125K3566J5833j4241m9080q1575q3390o9733o3538m2992l2178j8246
12474A61551r059o646K212L756j0748m049j5812L822l32R277J4887N56R34L155
12460A53504m816O51m325J51j112L434j214O284J314j2802j7764n247J1194p624
12446A21628p46J9453K6059J4226J4863J5523j684j8038k0466L131n878n289j402
12433A61380K989J8520J6229K425j2601o135l496j3158m812j0839J266m101l550
12420A44117L371m224q852J4322J1455j0002j7849r032N849J3060M154j2193N217
12407A39393J7692J01q882K569J3118J2073R220L022O024J1302j117N604J8597
$$ plain form
12497 226009 240302 246640 257307 267023 284218 306818 322828 347995 375034 437600 520713 577125
12485 577125 600691 616524 602283 553203 471628 388238 318505 254967 211975 179797 161551
12474 161551 152492 145846 148058 151814 141066 137017 121205 125027 124695 133972 148859 149415 150349 153504
12460 153504 148688 149339 145014 145165 144053 147487 146273 152557 153871 141069 123305 118058 129252 121628
12446 121628 120882 140335 166394 180620 195483 211006 209322 191284 170818 173949 168071 162782 161380
12433 161380 164369 182889 199118 201543 188942 182807 179311 166153 161341 150502 151768 147667 144117
12420 144117 147488 143264 134412 148734 160189 150187 132338 123306 129155 142215 146369 134176 139393
12407 139393 157085 157186 148304 150873 163991 176064 185284 188306 194330 205632 204515 210119 228716
12394B28716J8181J5626P671L834K3206J3778K9614L4296L3372N9766O9054M3336
12382E80450j2416m9687m1502m6073l4016k2660k4706j3128N015R005J8344K2743
12370C91369L0789K4641J5894Q58P649K4852J2880K6394J7064k857r405k700j8597
12357E18831r651K636J3429J1013K7473M4241O7124J11106J47685J38979R4020
12346A166886M0252k8342r0593j27098j30982j08748q4153o8033l6539k8297r400
12335D94953L282l518p138K076j9012J376q853k1021j5881m635j800j8050k3692
12322C78087r005j2614k0701j932J0649L057J0620K7716L0484M9861P2919Q6295
12310F25436N0462M400k0512p3036r5608r2041o2783n2477n3908m5457j7110k8991
$$ plain form
12394 228716 246897 262523 270194 274028 297234 311012 340626 374922 408294 468060 537114 580450
12382 580450 568034 518347 476845 430772 396756 374096 349390 336262 341277 350282 368626 391369
12370 391369 422158 446799 462693 463551 471200 496052 508932 535326 552390 549533 540128 537428 518831
12357 518831 509180 511816 525245 536258 563731 607972 675096 786202 933887 1072866 1166886
12346 1166886 1207138 1178796 1088203 961105 830123 721375 637222 569189 532650 504353 494953
12335 494953 498235 494717 487579 489655 470643 472019 463166 442145 426264 421629 419829 401779 378087
12322 378087 369082 356468 335767 333835 344484 347541 358161 385877 416361 466222 539141 625436
12310 625436 675898 680298 659786 586750 491142 399101 336318 283841 229933 184476 167366 138375
12298A38375j6333j0413j1243J8039N275Q899K4928K6310p402l686J886J3346
12286A87981K534J1561P984O421N017p458k1744j3181j4345p5j3660j4083P44
12273A37696P099m075K308Q852J0511n048m616n684J1480R488J242J7743J3593
12260B00589J1948R464K0945K8809K4044L4699N4860P6754Q9206J17412J19503
12249G88233J18058J00809O6409J3509l1983n5083o8976r8021j17339j09975q9583
12238E16058o8705n4889m1486k3985j8532j6596j4940l372k587j2007k3068j8239
12226B17652r792j1779j0688j1170j413L744j391K437P681J1502P132K554Q724
12213B15193J3702J9415J026k433P004J4552K5861J3025l262M85J783N124O977
$$ plain form
12298 138375 122042 111629 100386 118425 123700 132599 157527 183837 176435 172749 174635 187981
12286 187981 190515 202076 210060 216481 221498 214040 192296 179115 164770 164695 151035 136952 137696
12273 137696 144795 140720 143028 151880 162391 157343 152727 147043 158523 168011 169253 186996 200589
12260 200589 212537 222001 242946 271755 295799 330498 385358 462112 551318 668730 788233
12249 788233 906291 1007100 1073509 1087018 1055035 999952 930976 832955 715616 605641 516058
12238 516058 447353 392464 350978 326993 308461 291865 276925 273553 270966 258959 235891 217652
12226 217652 207860 196081 185393 174223 172810 176554 175163 177600 185281 196783 203915 206469 215193
12213 215193 228895 248310 249336 246903 253907 268459 294320 307345 304083 304568 306351 311475 318452
12200C18452K0856J4731Q23j2001Q694J2942p23j848l173j201J5707O334K2488
12187D02081K4061O383J4654J3612J0045N625J0480J3914L0494L3407K0712L0049
12175F15517L3752N9046Q8558P9554P7831N7021N8622M2298M3472K1602L74j8992
12163A158655l3733l4571k6289j5470p69o415J3215K3580K8257N1506L9318N3272
12151A250556P3487P0976O1896Q3841R1925J19001J48729J51265J55686J84296
12141B391658K06021K27545K39716K48951K81773L33886M00728M95110O19364
12132E444752P83730R43713J101251J231280J339273J414021J535267J750205
12124A5543492K127166K838800M058941N982611Q802086J2544017J6851546K0921854
$$ plain form
12200 318452 339308 354039 354862 342861 351555 364497 363774 361926 358753 357552 373259 379593 402081
12187 402081 426142 432525 447179 460791 470836 476461 486941 500855 531349 564756 585468 615517
12175 615517 649269 708315 796873 876427 954258 1011279 1069901 1112199 1155671 1177273 1177647 1158655
12163 1158655 1124922 1090351 1064062 1048592 1047823 1041408 1054623 1078203 1106460 1157966 1197284 1250556
12151 1250556 1324043 1395019 1456915 1540756 1632681 1751682 1900411 2051676 2207362 2391658
12141 2391658 2597679 2825224 3064940 3313891 3595664 3929550 4330278 4825388 5444752
12132 5444752 6228482 7172195 8273446 9504726 10843999 12258020 13793287 15543492
12124 15543492 17670658 20509458 24568399 30551010 39353096 51897113 68748659 89670513
12116H9670513K3556443K3636495K0645671J4480646N832780l647305j2571135
12109A61604108j9560957k3324326k3572629k1215567j7370896j3146165r367683
12102C4045885o420942m395702l053018k228918j742529j516928j438702j415396
12094A1833750j406064j346695j214065j068053r00173p46151o17490m86087l95138
12085C653834l15778k64232k29381j90343j46203j23470j14686q8795o8307m7102
12075B065537j3799j056j3437l6835n3058o9743j15556j16588j15993j10269r5669
12064A323534o5243p0561o4497l3950m6124m5949k7011m6428m9660l1910j2231
12053H29970j9432l2996j8534r308k3317k7616j6075n383j8432k4998k9936l3374
$$ plain form
12116 89670513 113226956 136863451 157509122 171989768 177822548 174175243 161604108
12109 161604108 142043151 118718825 95146196 73930629 56559733 43413568 34045885
12102 34045885 27624943 23229241 20176223 17947305 16204776 14687848 13249146 11833750
12094 11833750 10427686 9080991 7866926 6798873 5898700 5152549 4535059 4048972 3653834
12085 3653834 3338056 3073824 2844443 2654100 2507897 2384427 2269741 2180946 2112639 2065537
12075 2065537 2051738 2050682 2037245 2000410 1947352 1877609 1762053 1645465 1529472 1419203 1323534
12064 1323534 1258291 1187730 1123233 1089283 1043159 997210 970199 923771 874111 842201 829970
12053 829970 810538 777542 759008 749700 726383 698767 682692 677309 658877 633879 603943 570569
12041E70569j5581j6317j4741l742j9241k1698p521j0219r874j1934j6883j8729
12029D04089k3956j2262o765r242j4985O603r328j1976p946j543J0371J5893J353
12016C40306r576p752m077L338k987q548n455O897k033l264J3596J5058p51m449
12002C30303J972p50j3621k3347p057M948j674j6609r354n422p95l99J5197J4966
11988B88358R949J8024n110j8909p735o293r49J642r681j6799j2027O996r778
11975B37688r943J1448K66l4P597j580m056j0084j2888o198j9916J0604J90Q78
11961B03972K67N003O860J6738M392n444j3700j045L79q48l038J055l331R88Q11
11946B13059j3620J770q57l99o101m872l665l765J6284J4212O353j4990n425K458
$$ plain form
12041 570569 554988 538671 523930 520188 500947 479249 471728 461509 451635 439701 422818 404089
12029 404089 380133 367871 361106 351864 336879 343482 334154 322178 314232 312689 323060 338953 340306
12016 340306 330730 322978 318901 322239 319252 310704 305249 312146 310113 306849 320445 335503 334752 330303
12002 330303 332275 331525 317904 294557 287500 292448 290774 274165 264811 259389 258594 258195 273392 288358
11988 288358 298307 316331 311221 292312 284577 278284 277335 278977 269296 252497 240470 247466 237688
11975 237688 227745 239193 239459 239425 247022 245442 241386 231302 218414 212216 192300 202904 203094 203972
11961 203972 204239 209242 216102 232840 237232 231788 218088 217043 217422 216574 213536 214591 211260 212248 213059
11946 213059 199439 201209 200352 199953 193852 188980 185315 181550 197834 212046 218399 203409 197984 200442
11932B00442p092M578O005o081J128J0299r373j1662j1772k2463j3555j914j25
11919A38415j2667k3940q065l765k126m43L588r454M111K6849Q840Q779o057Q795
11905A32860J8822J8928J3100M210n783j4309j6338N777N119j2932Q303k661N171
11892A60267l209o475m951J4905J6130J4838R621J6291p326m145p236j1392O26
11879A87944j2503j9205O369J0954J0693M124j5741j7075j1973J74R409P713R053
11866A69936l098K5J0423m933j7981m586J1264J335k550N77q610K356L29N722
11852A60209M404m312J2557m785r306M410j1983j4820P301J0716j2114q317Q64
11839A34824J96q545j1271J385k817p993N129p24J7451r18p375L792J5048R501
$$ plain form
11932 200442 193350 197928 203933 197852 198980 209279 199906 188244 176472 154009 140454 138540 138415
11919 138415 125748 101808 93743 89978 87852 87409 90997 81543 85654 112503 121343 130122 124065 132860
11905 132860 151682 170610 183710 187920 182137 167828 151490 157267 162386 149454 157757 155096 160267
11892 160267 157058 150583 145632 160537 176667 191505 201126 217417 210091 205946 198710 187318 187944
11879 187944 175441 156236 162605 173559 184252 188376 172635 155560 143587 143761 153170 160883 169936
11866 169936 166838 166863 177286 172353 154372 149786 161050 162385 159835 160412 151802 154158 154487 160209
11852 160209 164613 160301 172858 168073 158767 163177 151194 136374 143675 154391 142277 133960 134824
11839 134824 135020 126475 115204 116589 113772 105779 110908 110184 127635 126717 119342 123134 138182 147683
11825A47683n985n947o64r84p562J0487N845r563J50K864M446j2847p768J511
11811A21666r059q616R791K848Q255R116O616j4292j8782r78P433J719j760j303
11797A12654p22J362j0799j3901k065M330N661J1094p639J2519p71j0448L934
11784A05209J4112N209O121Q877K815m145K509N013o826r721j4705k04J1097P28
11770A26089K722M105J460L172j1579j034P71K601l296j214m429n591J485K0961
11756A36223l094j3318P058K493J06k981j2807k233P580Q184l505J481R136K246
11742A36569j18j3894j3640p072k542J0872O338j474J0853J31q333o031L321J0778
11728A25758j071L607k328J1553J1739q729J988J075j412N401l818l229Q075P272
$$ plain form
11825 147683 141698 135751 135087 134103 126541 137028 142873 133310 133460 136324 140770 127923 120155 121666
11811 121666 112607 103991 113782 116630 124885 134001 140617 126325 107543 106565 113998 115717 113957 112654
11797 112654 111932 113294 102495 88594 86529 90859 96520 107614 99975 112494 111723 101275 105209
11784 105209 119321 124530 130651 139528 142343 138198 140707 145720 138894 129173 114468 114264 125361 126089
11770 126089 128811 132916 134376 137548 125969 124935 125706 128307 125011 123797 119368 113777 115262 136223
11756 136223 133129 119811 126869 129362 129468 126487 113680 111447 119027 127211 123706 125187 134323 136569
11742 136569 136451 122557 108917 101845 99303 110175 116513 115039 125892 126023 117690 111659 114980 125758
11728 125758 124687 128294 125966 137519 149258 140529 142517 143592 142180 147581 143763 140534 148609 155881
11714A55881O492Q625J419p636L113R770Q970K200Q326R003R406Q648J0434J5824
11700B50475J6914L1162M5432O8282Q0264J04699J09660J12860R7477O9915K5814
11689A012954p008o6224j10322j28245j15161r0388p9337o9190m2702k9988k8835
11678B45554r935J248o164j8586j9304k6230j4520m189l836r547P772j654r804
11665A30805l493J7056M282q861P206J041R452j5499j6169L259N936J2407m453
11652A42969K647o19j0114k565J70l084K83n370j0514n554Q453J1958j4254j3874
11638A00532N972J1345l729O507K855J5189n56l529n385k61P798O983q363P237
11624A42595j2867r467p712K266P541R502N514L584O76J0689N253j2889n517J8234
$$ plain form
11714 155881 162373 170998 172417 164781 167894 177664 186634 188834 197160 206163 215569 224217 234651 250475
11700 250475 267389 298551 343983 412265 492529 597228 706888 819748 917225 987140 1012954
11689 1012954 1005946 939722 829400 701155 585994 495606 416269 347079 304377 274389 245554
11678 245554 235619 236867 230703 212117 192813 166583 152063 147874 144038 134491 142263 140609 130805
11665 130805 127312 144368 148650 139789 146995 148036 157488 141989 125820 129079 135015 147422 142969
11652 142969 145616 144997 134883 132318 132488 129404 129687 124317 113803 108249 116702 128660 114406 100532
11638 100532 106504 117849 114120 120627 123482 138671 138115 134586 129201 128940 136738 143721 135358 142595
11624 142595 129728 120261 112549 114815 122356 131858 137372 140956 141632 152321 157574 144685 139168 157402
11610A57402O69p604m375o132p62j865J0789P711o205l816l114p982J0575p673
11596A37618l445j700L988L326q712M797N268J0134r060k867l457K537N726K329
11582A46482N820m012l923Q451O267N001j1738j4901m248J295O089j828l87j888
11568A36480P7p629o610m94K992J9111j183r619J7890n327k985J1093O03K111
11554A56510p790j2968p921M338L839K616L067O661R704j4552O641Q279L416R370
11540A71210j3037n549j33L247R17m892J0698J4226m032m691k1931q566J302O80
11526A39449N574J5026J4554k343j6306m660l546p773p814K597J0800J7086J0955
11513A73599j0822K842J0250k637j5707n870L478j533J2787J8429k976r036j0035
$$ plain form
11610 157402 158071 150467 146092 139960 139198 137333 148122 155833 149628 145812 142698 134716 145291 137618
11596 137618 134173 132473 136461 139787 131075 135872 141140 151274 142214 139347 135890 138427 144153 146482
11582 146482 152302 148290 144367 152818 159085 164086 152348 137447 133199 134494 140583 138755 138368 136480
11568 136480 136557 128928 122318 121824 124816 143927 142744 133125 151015 145688 142703 153796 154399 156510
11554 156510 148720 135752 127831 132169 136008 138624 141691 148352 158056 143504 150145 158424 161840 171210
11540 171210 158173 152624 152491 155738 156655 151763 162461 176687 172655 167964 146033 137467 138769 139449
11526 139449 145023 160049 174603 172260 155954 151294 147748 139975 132161 134758 145558 162644 173599
11513 173599 162777 165619 175869 173232 157525 151655 155133 153600 166387 184816 181840 172804 162769
11500A62769j430K603J404j2877n79J2777J0328Q411j384j9837j1552q109O063
11487A48587K596P241J9934N733J11n132p975K278J0447j0524j878K215R723p979
11473A75377R6J0192r58j2936j409m04KQ587q38k017K616Q354K998j3850r399
11458A66411p439N625R64L028N684K2083M880j9933L756j748j040n700r510k916
11444A64145m225M469P396M998K238J3944M729j5809K25R222k904k027N702J961
11430A94064n665L539J32n269P939J1799M894p761N648o456P295O982M455o376
11416B15220J6444o023j7360m870N295p690k480k822L447O873R045j473j2732
11403B00874k049J1780Q676r419p798n224P907L332N584J6530J0105k287J26P173
$$ plain form
11500 162769 161339 163942 165346 152469 151890 164667 174995 183406 182022 162185 150633 142524 148587
11487 148587 151183 158424 178358 184091 184202 179070 171095 173373 183820 173296 171418 173633 183356 175377
11473 175377 175473 185665 184707 171771 170362 169958 169960 178547 177709 175692 178308 186662 189660 175810 166411
11458 166411 158972 164597 165561 168589 174273 196356 201236 181303 185059 183311 182271 176571 167061 164145
11444 164145 159920 164389 171785 176783 179021 192965 197694 181885 182110 191332 188428 186401 192103 194064
11430 194064 188399 191938 192070 186801 194740 206539 211433 203672 209320 202864 210159 217141 221596 215220
11416 215220 231664 225641 208281 203411 208706 201016 198536 195714 199161 206034 215079 213606 200874
11403 200874 198825 210605 219281 209862 202064 196840 204747 208079 213663 230193 240298 238011 238137 245310
11389B45310p814j4384m899n748l071J0162J6045j4664j4315J0456L509j036k692
11376B16859l684J0458m826J025p125j0689n001O960J0365r903K682O919L394
11363B17434r809o795J0057J3200J1620j289J0999j0504J475j573n346q71K442
11350B31040P543l747K610L724n192J552N453K59P169m86l337m442j0638o283
11336B25225Q142m184P914j936n209j207K0434L911j905q895p929l580J1436p248
11322B34969M690l9p517l970N658J7918O321n453o415J481J5499l624l515r75
11308B55028N934J1138q798M903k529j3048M608J2465R285J2785j3306k4121M204
11295B58548j57p29p784J3429Q493k366o850j4262k171J1373Q80l966o080M364
$$ plain form
11389 245310 237496 223112 218213 212465 209394 219556 235601 220937 206622 217078 220587 219551 216859
11376 216859 213175 223633 218807 219832 212707 202018 197017 203977 214342 204439 207121 214040 217434
11363 217434 207625 200830 210887 224087 235707 234418 245417 234913 236388 234815 229469 228598 231040
11350 231040 238583 234836 237446 241170 235978 237530 242983 243242 250411 249925 246588 242146 231508 225225
11336 225225 233367 229183 237097 235161 229952 228745 249179 253090 251185 242290 234361 230781 242217 234969
11322 234969 239659 239620 232103 228133 233791 251709 258030 252577 246162 247643 263142 259518 256003 255028
11308 255028 260962 272100 263302 268205 265676 252628 257236 269701 278986 291771 278465 254344 258548
11295 258548 258391 257662 249878 263307 271800 269434 262584 248322 246151 257524 258404 254438 248358 252722
11281B52722O881P378K201j5052M612L544R884J1592j137o510M174P435K540L545
11267B93809N539l376M433l590m10N260J0057m663q803j1479O085P577M37M723
11253C05599l332m294P717K353O84j471j0760J3568L42M999R73p43O011Q101j3022
11238C16725j0011O595J9386P037K477j8863m511j522J1954N551P623O336M60
11225C49237q459J118N484O419N522J0480J3558K0705M0266K5852P658O932j1917
11212D72855k2686l0500k7333j4147j2O963L026l02J2878K0139K2012M9601N8980
11199E51474O8264O7415P2415N6518K5003m0395o3147n6146n6061n0505l4156
11188E40679l5699k7787j0667n624K382K688m735R078K2529Q863m624k480K1055
$$ plain form
11281 252722 259603 266981 269182 254130 258742 262286 272170 283762 282625 276115 280289 287724 290264 293809
11267 293809 299348 295972 300405 296815 296405 301665 311722 307059 298256 286777 292862 300439 300876 305599
11253 305599 302267 297973 305690 308043 308727 307256 296496 310064 310406 315405 316378 315635 321646 329747 316725
11238 316725 306714 313309 332695 339732 342209 323346 318835 317313 329267 334818 342441 348777 349237
11225 349237 340778 341896 347380 353799 359321 369801 383359 404064 444330 470182 477840 484772 472855
11212 472855 450169 419669 392336 378189 378177 385140 388166 387864 400742 420881 442893 492494 551474
11199 551474 619738 687153 759568 816086 841089 800694 737547 681401 625340 574835 540679
11188 540679 504980 477193 466526 460902 463284 465972 461237 470315 492844 501707 497083 494603 515658
11175E15658K2758L5953K7045L7361P5395P4561Q2608P3620Q0561P0005N1549
11164A147074M254k0734n6617p7548q1722o0874p3027o3626m8988l8998k9477
11153E99717k9945l2770o492m35o933o621j6529O140Q301O150J7625L0640L0683
11140E99531L7716M4268N8963O1263O8812N9425L1361l37k7478m4693o3281q0745
11128G44805o3904o7693k9194k0383k2647j4847j8558l1142k1086J2424J8700
11117D86475J956j7437l103Q948k80mM157m521R623L359J7051N708K86m166J166
11102E09218L677J694j1412j0858o17R270m839J6785P143q378j2645J3120L85
11089E12543K4504K723j2307p924K657r200k268m743K962r193K580p198n154P774
$$ plain form
11175 515658 538416 574369 601414 638775 714170 788731 871339 944959 1025520 1095525 1147074
11164 1147074 1151328 1130594 1073977 996429 914707 853833 780806 717180 668192 629194 599717
11153 599717 569772 537002 530510 530075 523142 516521 499992 506132 514433 520583 538208 568848 599531
11140 599531 637247 681515 740478 801741 870553 929978 961339 961002 933524 888831 825550 744805
11128 744805 680901 613208 584014 563631 540984 526137 507579 476437 455351 467775 486475
11117 486475 488431 470994 467891 476839 476559 476555 480712 476191 485814 489173 506224 511932 512218 508052 509218
11102 509218 512895 514589 503177 492319 491702 500972 496133 512918 520061 511683 499038 512158 512543
11089 512543 537047 539770 527463 519539 522196 512996 510728 505985 508947 499754 502334 495136 489982 497756
11075D97756K636Q035J3940M150M713J1408M636j1330j6226r88L541J3370J6205
11062E51846J3919j0280O695N991j230l650O329k444o026k024Q248J4108M571
11049E86053j1141R97J0282n748o572J076J2459N16l681M74j0350k985J0150K5726
11035F07256l81Q99n686J3308L166k84J2985J4963r38j3132j7533J237J4421k938
11021F27343O429J7927J2959J220o975O076O516n119m780J556J5603Q741l799
11008F83697J0327N786M987n359R845o428J1853J2703j1069J0076n288q530J570
10995G14170N993N690L074J0097J0029j0187L659R389N708k728p450o771M125
10982G44798J7317j334o276M161O695J1547K380J8160J6768Q706k382J4212l274
$$ plain form
11075 497756 500392 508427 522367 526517 531230 542638 547274 535944 519718 518730 522271 535641 551846
11062 551846 565765 555485 562180 568171 566941 563291 569620 567176 561150 559126 567374 581482 586053
11049 586053 574912 575909 586191 580443 573871 574947 587406 587922 584241 584715 574365 571380 581530 607256
11035 607256 606875 607774 602088 615396 618562 618278 631263 646226 645288 632156 614623 615860 630281 627343
11021 627343 633772 651699 664658 665878 658903 664979 671495 666376 661596 663152 678755 687496 683697
11008 683697 694024 699810 704797 699438 709283 702855 714708 727411 716342 726418 721130 712600 714170
10995 714170 720163 725853 728927 739024 749053 738866 742525 751914 757622 754894 747444 740673 744798
10982 744798 762115 760781 754505 758666 765361 776908 779288 797448 814216 822922 820540 834752 831478
10969H31478K017P807L244R773o905M41P150J584n283J0238J5921J2820L83J0964
10955I01632K0668p192l696M561k13R447R831K980O887R481m972J5736R989j64
10941I74975n954q687J4102k122J0822J5592m047R753J9559Q023m150p819n160
10928A014887R487J3267j573K755R051j370O538J9298L263K1088M214q318k643
10915A089944j0339P102K1355J3428P284J992P412m947J162J7652M153J0887j768
10902A165317O029Q260P126J781R1J3510J1844p563R872j003M268O288P252O514
10888A239586J5606m153p882Q162N174p186J0290N244R919J5038J2406p368O081
10875A300917L768M596P791Q290M43J7454O632m837P67M49l699J2003R999N188
$$ plain form
10969 831478 833495 841302 844546 854319 847414 847855 855005 856589 851306 861544 877465 890285 890668 901632
10955 901632 922300 915108 911412 915973 915760 925207 935038 938018 944905 954386 949414 965150 975139 974975
10941 974975 969021 960334 974436 972314 983136 998728 994681 1004434 1023993 1032016 1027866 1020047 1014887
10928 1014887 1024374 1037641 1036068 1038823 1047874 1046504 1053042 1072340 1075603 1096691 1100905 1092587 1089944
10915 1089944 1079605 1086707 1108062 1121490 1128774 1130766 1138178 1133231 1134393 1152045 1156198 1167085 1165317
10902 1165317 1171346 1179606 1186732 1188513 1188604 1202114 1213958 1206395 1216267 1215264 1219532 1225820 1233072 1239586
10888 1239586 1255192 1251039 1243157 1251319 1256493 1249307 1259597 1264841 1274760 1289798 1302204 1294836 1300917
10875 1300917 1304685 1309281 1317072 1325362 1325805 1343259 1349891 1345054 1345821 1346270 1342571 1354574 1364573 1369761
10861A369761J0175r466l67P256P442J5404J3128J2880J2697O061R738K62j0277
10848A444694j5014M12J4795K562O840J2941Q2L677N092l245R271j372j140N173
10834A484768j3820R61J2992J4094J8742J1861Q809n86N436N523R695J7220P378
10821A583073j713P450R086k302m998k2J6942L547Q770P652o415R508K671R995
10807A643244J2297Q029N339J089R693J4963J0992J2184L539Q481p622r233M992
10794A717987K1428K7052K2675O719K323k321J3891K1454J0296L870O447p267
10782A844554J5243K4128J2158J4950P324J0669K2680m397J85K2537K8180K3089
10770B021300o788R14N385J0842J0184j845K0450K8836K6439K2533J5385J5239
$$ plain form
10861 1369761 1379936 1370470 1370103 1377359 1384801 1400205 1413333 1426213 1438910 1444971 1454709 1454971 1444694
10848 1444694 1429680 1430092 1444887 1447449 1454289 1467230 1467312 1470989 1476081 1472836 1482107 1480735 1479595 1484768
10834 1484768 1470948 1471909 1484901 1498995 1517737 1529598 1538407 1537821 1543257 1548780 1558475 1575695 1583073
10821 1583073 1581360 1588810 1597896 1595594 1590596 1590574 1607516 1611063 1619833 1627485 1621070 1630578 1633249 1643244
10807 1643244 1655541 1663570 1668909 1669998 1679691 1694654 1705646 1717830 1721369 1729850 1722228 1712995 1717987
10794 1717987 1739415 1766467 1789142 1795861 1798184 1795863 1809754 1831208 1841504 1845374 1851821 1844554
10782 1844554 1859797 1883925 1896083 1911033 1918357 1929026 1951706 1947309 1947494 1970031 1998211 2021300
10770 2021300 2014512 2015426 2020811 2031653 2041837 2039992 2060442 2089278 2115717 2138250 2153635 2168874
10758B168874J7798K8480J3405J2328R751Q178J8369K1381P961L70N805Q994Q090
10745B329784J6885j650J8414K8948J9882M392J0568K6868J3453K2747J5928J6520
10733B522739L1225J1763J6419J1488K3157K8643K5210K2157J6248J8032J9869
10722B746950J9537K3044L1816K2427J4027K6172K8548K7574L1991R921R821J8279
10710C010107N082K3334M2182L5990K4583L0546K5238J8707L6194K9269L5643
10699C316875J7692J6153K9589M9704K2807J5290K8026L2263K6552M1640L3963
10688C630554K0194M1521L3728J3045J9037L6689N2333M6876K9356L8489K8741
10677C990563M2248M0029M0561L0863L9798N2665M2263K6806L8824N8420N8616
$$ plain form
10758 2168874 2186672 2215152 2228557 2240885 2250636 2258814 2277183 2298564 2306525 2306895 2312700 2321694 2329784
10745 2329784 2346669 2345019 2363433 2392381 2412263 2416655 2427223 2454091 2467544 2490291 2506219 2522739
10733 2522739 2553964 2565727 2582146 2593634 2616791 2645434 2670644 2692801 2709049 2727081 2746950
10722 2746950 2766487 2789531 2821347 2843774 2857801 2883973 2912521 2940095 2972086 2982007 2991828 3010107
10710 3010107 3015189 3038523 3080705 3116695 3141278 3171824 3197062 3215769 3251963 3281232 3316875
10699 3316875 3334567 3350720 3380309 3430013 3452820 3468110 3496136 3528399 3554951 3596591 3630554
10688 3630554 3650748 3692269 3725997 3739042 3758079 3794768 3847101 3893977 3923333 3961822 3990563
10677 3990563 4032811 4072840 4113401 4144264 4184062 4236727 4278990 4305796 4344620 4403040 4461656
10666D461656M3414M5458M7926M7032N3989L7655K6586M7946N2991M0014M4654
10655D949321N8000N0132N6774N7461P2407O0737M7922O0277O6066O1050P1870
10644E612017O0535N2365O0980O1178O3326Q3206P2343P0523Q2668Q2730P3985
10633F375856Q6216Q7432P1298P2790P9461Q0360Q8723Q5803Q4427J00197J02340
10622G314903J00036J10514J19155J15712J30808J48375J63656J88889K20897
10613H612945K85671L36401M01003M16041K92965R9247m0121j09059j37016j26065
10603A0032012o1706j3021L3257P4917R3217J01810J22364J26937J37047J54304
10593A0801138J60190J53619J53391J56196J55404J69191J65464J72547J91761
$$ plain form
10666 4461656 4505070 4550528 4598454 4645486 4699475 4737130 4763716 4811662 4864653 4904667 4949321
10655 4949321 5007321 5057453 5114227 5171688 5244095 5304832 5352754 5413031 5479097 5540147 5612017
10644 5612017 5672552 5724917 5785897 5847075 5910401 5993607 6065950 6136473 6219141 6301871 6375856
10633 6375856 6462072 6549504 6620802 6693592 6773053 6853413 6942136 7027939 7112366 7212563 7314903
10622 7314903 7414939 7525453 7644608 7760320 7891128 8039503 8203159 8392048 8612945
10613 8612945 8898616 9235017 9636020 10052061 10345026 10444273 10404152 10295093 10158077 10032012
10603 10032012 9970306 9957285 9990542 10065459 10158676 10260486 10382850 10509787 10646834 10801138
10593 10801138 10961328 11114947 11268338 11424534 11579938 11749129 11914593 12087140 12278901
10584A2278901J86857J88536K12116K03661J85091J82497K00780K33957K23173
10575A4095569K10127K25126K30594K19693K34717K41318K50918K56095K58302
10566A6222459K57082K56008K58395K77440K77258K87144K89692K84769K88044
10557A8698291L08873L02520K99349L08047L08805L18381L18842L36387L35682
10548B1535177L32724L28936L39187L52714L56668L65661L49699L53767L68553
10539B4683086L64761L69508L72277L77271L73565L82918L89945L87705L99310
10530B8100346M01873L94862M04308L97823L95939L94101M18034M20275M19572
10521C1747133M29439M08866M18542M29784M30852M20939M23929M39521M40261
$$ plain form
10584 12278901 12465758 12654294 12866410 13070071 13255162 13437659 13638439 13872396 14095569
10575 14095569 14305696 14530822 14761416 14981109 15215826 15457144 15708062 15964157 16222459
10566 16222459 16479541 16735549 16993944 17271384 17548642 17835786 18125478 18410247 18698291
10557 18698291 19007164 19309684 19609033 19917080 20225885 20544266 20863108 21199495 21535177
10548 21535177 21867901 22196837 22536024 22888738 23245406 23611067 23960766 24314533 24683086
10539 24683086 25047847 25417355 25789632 26166903 26540468 26923386 27313331 27701036 28100346
10530 28100346 28502219 28897081 29301389 29699212 30095151 30489252 30907286 31327561 31747133
10521 31747133 32176572 32585438 33003980 33433764 33864616 34285555 34709484 35149005 35589266
10512C5589266M27376M37969M28749M26061M24600M31365M39091M26048M12768
10503C9443293M06604M11123M36949M18108M25772M31962M25487M15169L93466
10494D3207933M10724M09672M22179M03518L75655L57015L59433L55359L41625
10485D6643113L20463K97750K96448K88976K72271K60260K61527K47226K32851
10476D9120885J87866J87415J58012J40742J31218J10149J19437R5014J06067
10467E0356805P9833L5716l0092q6631j16903j32886j51409j63597j67319j72085
10457D9451432j84108k12305k49407k43875k45136k67426k74843k88477l02985
10448D7182870k99458l51902l88092l94713l96250l88627m04355m33441m46779
$$ plain form
10512 35589266 36016642 36454611 36883360 37309421 37734021 38165386 38604477 39030525 39443293
10503 39443293 39849897 40261020 40697969 41116077 41541849 41973811 42399298 42814467 43207933
10494 43207933 43618657 44028329 44450508 44854026 45229681 45586696 45946129 46301488 46643113
10485 46643113 46963576 47261326 47557774 47846750 48119021 48379281 48640808 48888034 49120885
10476 49120885 49308751 49496166 49654178 49794920 49926138 50036287 50155724 50250738 50356805
10467 50356805 50436638 50472354 50442262 50355631 50238728 50105842 49954433 49790836 49623517 49451432
10457 49451432 49267324 49055019 48805612 48561737 48316601 48049175 47774332 47485855 47182870
10448 47182870 46883412 46531510 46143418 45748705 45352455 44963828 44559473 44126032 43679253
10439D3679253m60522m75026m80320m65884m66814m70302m67360m76109m83534
10430C9433382m79472m84418m88597m92193m86346m80060m75421m70878m65714
10421C5110283m56311m81284m92573m81873m79620m66633m65189m66736m61827
10412C0858237m62777m61673m54049m60253m47765m34235m42633m20684m23236
10403B6850932m18636l93855m14857m07393m05109l94159l82838l68697l64682
10394B3300706l68768l41185l20408l36980l38366l36256l29433l23643l39261
10385B0266406l15886l32398l49229l29221l21556l19279l14878l06519k87448
10376A7389992k71338k62411k53834k58025k43743k40468k38067k37700k42683
$$ plain form
10439 43679253 43218731 42743705 42263385 41797501 41330687 40860385 40393025 39916916 39433382
10430 39433382 38953910 38469492 37980895 37488702 37002356 36522296 36046875 35575997 35110283
10421 35110283 34653972 34172688 33680115 33198242 32718622 32251989 31786800 31320064 30858237
10412 30858237 30395460 29933787 29479738 29019485 28571720 28137485 27694852 27274168 26850932
10403 26850932 26432296 26038441 25623584 25216191 24811082 24416923 24034085 23665388 23300706
10394 23300706 22931938 22590753 22270345 21933365 21594999 21258743 20929310 20605667 20266406
10385 20266406 19950520 19618122 19268893 18939672 18618116 18298837 17983959 17677440 17389992
10376 17389992 17118654 16856243 16602409 16344384 16100641 15860173 15622106 15384406 15141723
10367A5141723k37418k27490k09000k21062j98644k01021j98236j97104j92035
10358A3259713j81018j88392k03542j92988j83591j81118j76325j80538j84451
10349A1587750j72419j75894j68741j47202j28936j24549j25766j21205j10823
10340A0312215j23605j34389j49759j43571j38929j43631j41775j39462j25430
10331I071664r0897r9833j02080j04009j02033j06190j05364j01709r8506r0499
10321H070544p8993q5562j10935j06762q7570q0537p1824p3372p8457q3981p6520
10310G136031q9595r6946j12033r2924q4537q5483q1796p8451o5144p6921o3623
10299F208578o9785p1299o9168m4344k3184j9987l6361k9451j2437N905J0690
$$ plain form
10367 15141723 14904305 14676815 14467815 14246753 14048109 13847088 13648852 13451748 13259713
10358 13259713 13078695 12890303 12686761 12493773 12310182 12129064 11952739 11772201 11587750
10349 11587750 11415331 11239437 11070696 10923494 10794558 10670009 10544243 10423038 10312215
10340 10312215 10188610 10054221 9904462 9760891 9621962 9478331 9336556 9197094 9071664
10331 9071664 8980767 8880934 8778854 8674845 8572812 8466622 8361258 8259549 8161043 8070544
10321 8070544 7991551 7905989 7795054 7688292 7600722 7520185 7448361 7374989 7296532 7212551 7136031
10310 7136031 7046436 6949490 6837457 6744533 6659996 6574513 6492717 6414266 6349122 6272201 6208578
10299 6208578 6138793 6067494 5998326 5953982 5930798 5910811 5874450 5844999 5832562 5838467 5849157
10288E849157J3901J9084K1829K0836O498n772m1020n7243o5265r3987j25293
10277E542725j19078j01287j16069j07612j01695o3185n0587m2821l5207l2789
10267D772395m4277m2520k5116l6146m0467m9501l6726k8755j9015r588j2642
10256D427642j7854l0411q242n118q102j5081j2951j6692k395k986J5220K0193
10244D343223K1448p722o084K218J3754R674Q245K1279M6208M0026O1184Q1767
10232D635220P9046N1653P7503J04954R5221J15503J41329J70766J69785J66926
10222E807906J81316J99003K09200K33724K85801L36625L79419M50491N55000
10213H638485P05266Q97940J138981J370362J465252J352047J216685J277644
$$ plain form
10288 5849157 5863058 5882142 5903971 5924807 5931305 5925533 5884513 5827270 5762005 5668018 5542725
10277 5542725 5423647 5322360 5206291 5098679 4996984 4933799 4883212 4840391 4805184 4772395
10267 4772395 4728118 4685598 4660482 4624336 4583869 4534368 4497642 4468887 4449872 4440284 4427642
10256 4427642 4409788 4379377 4371135 4366017 4357915 4342834 4329883 4313191 4310796 4307810 4323030 4343223
10244 4343223 4364671 4356949 4350865 4353083 4366837 4376511 4384756 4406035 4452243 4492269 4553453 4635220
10232 4635220 4714266 4765919 4843422 4948376 5043597 5159100 5300429 5471195 5640980 5807906
10222 5807906 5989222 6188225 6397425 6631149 6916950 7253575 7632994 8083485 8638485
10213 8638485 9343751 10241691 11380672 12751034 14216286 15568333 16785018 18062662
10205A8062662J564951K028459K634385L486790M755990O552275R204675J3384803
10197F1674990J9789045K9527991M4226414O3184154P4143603N3947454Q146607
10190C54640258l0329637m7896823n8620078n7621144m4270685l0193797k0092881
10183F5615213j3651866r639506o976222m998589l464898k323836j745781j535611
10175B1278904j432791j523589j781857j794852j665758j502137j287725j046546
10167I243649q41298o63258n38602m55462l85065l28679k73440k36982k20531
10158E300332k00845j73067j73780j54193j55134j47659j26399j10001r5595r6152
10148C867507r5580p0508o0091o0098p4290p1368o8031o8628p4353o3644n7674
$$ plain form
10205 18062662 19627613 21656072 24290457 27777247 32533237 39085512 48290187 61674990
10197 61674990 81464035 110992026 155218440 218402594 292546197 346493651 354640258
10190 354640258 324310621 276413798 217793720 160172576 115901891 85708094 65615213
10183 65615213 51963347 42323841 35347619 30349030 26884132 24560296 22814515 21278904
10175 21278904 19846113 18322524 16540667 14745815 13080057 11577920 10290195 9243649
10167 9243649 8402351 7739093 7200491 6745029 6359964 6031285 5757845 5520863 5300332
10158 5300332 5099487 4926420 4752640 4598447 4443313 4295654 4169255 4059254 3963659 3867507
10148 3867507 3771927 3701419 3641328 3581230 3506940 3435572 3367541 3298913 3224560 3160916 3103242
10137C103242n2194n9124o8024o5506m1635l3484m3067n4165m7201l2138l9657
10126B567047l0146l4393j9453k1917l7110n1079k9633k9118m0050j8425j4072
10115B241651l2202l4978k8445j8491k1349j7602k3150l5134k1041j5255k3358
10104A970646j1050j2256j6369j2283k0380j1917K425K281j7284j5477k0981k0699
10092A816656M404J2216j710p793M720J5499K767j1104j0240M010l682j2679k3253
10079A789811j7806k0220j3411j7222j9136k8011k6985l380j6554k2734M518M7312
10067A656182N9232M0710J90l5955m2791k4086J09j3971k0378j3436j474N60j0928
10054A593964l64J5480N011k4371l0199j0538k9088k5934l7655j4454o079n565
$$ plain form
10137 3103242 3051048 2991924 2923900 2858394 2816759 2783275 2740208 2686043 2638842 2606704 2567047
10126 2567047 2536901 2502508 2483055 2461138 2424028 2372949 2343316 2314198 2274148 2255723 2241651
10115 2241651 2209449 2174471 2146026 2127535 2106186 2088584 2065434 2030300 2009259 1994004 1970646
10104 1970646 1959596 1947340 1930971 1918688 1898308 1886391 1888816 1891097 1873813 1858336 1837355 1816656
10092 1816656 1821060 1833276 1831566 1823773 1828493 1843992 1846759 1835655 1825415 1829425 1825743 1813064 1789811
10079 1789811 1772005 1751785 1738374 1721152 1702016 1674005 1647020 1643640 1627086 1604352 1608870 1656182
10067 1656182 1715414 1756124 1756314 1720359 1677568 1653482 1653591 1639620 1619242 1605806 1604332 1604892 1593964
10054 1593964 1593600 1609080 1614091 1589720 1559521 1548983 1519895 1493961 1456306 1441852 1435773 1430208
10042A430208N418n38q498o867J1937J1261K361j0231k3174j3300p032o026k1743
10029A363776j7420j3658k5901j7890l608q630l021j929J420n75J2989O607j1762
10016A280398j8729q686P284j2628j9905L346K2953K0336Q375N215K644j8559
10004A272044l3910l2326l8246k0106k7533m6204m8546m4729k1328p083O326k953
9992I55406k333M835J9015L1618K8045O463p208k1387p679M0K323p18m965J8677
9978A022132k469n829j1592P10q408r247L096N707j4956j0757q021j7424j1975
9965I30967r928j3587j6223j547K041k168J329Q578K129n777L274o222n595O78
9951H87949P538J0029k819n82p643l512l060k0604p174n626o614n497j4147j0883
$$ plain form
10042 1430208 1435626 1435088 1426590 1419723 1431660 1442921 1445282 1435051 1411877 1398577 1391545 1385519 1363776
10029 1363776 1346356 1332698 1306797 1288907 1285299 1276669 1273648 1271719 1273139 1272564 1285553 1292160 1280398
10016 1280398 1261669 1252983 1260267 1247639 1227734 1231080 1254033 1274369 1282744 1287959 1290603 1272044
10004 1272044 1238134 1205808 1167562 1147456 1119923 1073719 1025173 980444 959116 952033 958359 955406
9992 955406 953073 957908 976923 1008541 1036586 1043049 1035841 1014454 1006775 1006815 1009138 1008420 1003455 1022132
9978 1022132 1019663 1013834 1002242 1002952 994544 985297 988393 994100 979144 968387 960366 942942 930967
9965 930967 921039 907452 891229 889682 891723 889555 890884 899462 901591 895814 899088 892866 887271 887949
9951 887949 895487 905516 902697 902115 894472 890960 887900 867296 860122 854496 847882 842385 828238 817355
9937H17355O649j2229j1340M913P149o834q690j0995o543J7355J2379j2736k6453
9924G69980j0664K834N915l452N70j3047l191j32o768k6717j6060l037J5258J5614
9910G27103j0559l542j4029j7231l605J2047M136P629O347j3511o04N408j6029
9897F83560K54K795J4251Q953K1024J2025P992K327J454J1518J0088J5366K5668
9884H17275L5041J1158j9753k5524m6929l6148k1175j4542m830o255j3036k6833
9872F48449j8196j9833j59j6405j1063p483Q621J6316R867O605k343j5491j1081
9859E87804p346r037M752j249r999m403l798o510P812J5121M326L964O748j7292
9845E70893R364P125k1733q654n859j0871m400r436J8313J2890o208Q921K4232
$$ plain form
9937 817355 824004 811775 800435 805348 812497 805663 796973 785978 779435 796790 809169 796433 769980
9924 769980 759316 762150 768065 764613 765183 752136 748945 748813 742045 715328 699268 696231 711489 727103
9910 727103 716544 713002 698973 681742 678137 690184 694320 701949 708296 694785 694181 699589 683560
9897 683560 683814 686609 700860 709813 730837 742862 750854 753181 754635 766153 776241 791607 817275
9884 817275 852316 863474 843721 818197 771268 735120 713945 699403 694573 688318 675282 648449
9872 648449 630253 610420 610261 593856 582793 575310 583931 600247 610114 616719 614376 598885 587804
9859 587804 580458 571421 576173 574924 564925 560522 556724 550214 558026 573147 577473 581437 588185 570893
9845 570893 580257 587382 565649 556995 551136 540265 535865 526429 544742 557632 551424 560345 584577
9832E84577J7641J5413P139J2489L5831N0693K1623L029j7678k5904k7296p411
9820F70146L2272N6660L9078m481k2240l6636l8875n2592n6732l1142j2779o277
9808E36402j1801L198L936Q714j1865m105M780j079J3244P66k7149l740J5299
9795E26600j674J056J4463O765r102K3847J5398n533L191J0327M983K1052K7021
9782F38394K1428K8068L9478P8795J11080J60375K40839L09751L40146K90660
9772B259014K11393J41907J08902P8203p839j52148k57177l07485l37898l27237
9762A409635k47124j58655j15529q1756n9022m8803m4898l9098j9142k449j2365
9751E80794l0440j8368n372j0836k4881k2486j2225k355Q878P187O582j5115j9942
$$ plain form
9832 584577 602218 617631 624770 637259 673090 723783 745406 748435 730757 704853 677557 670146
9820 670146 702418 759078 798156 793675 771435 734799 695924 643332 586600 555458 542679 536402
9808 536402 524601 527799 531735 540449 528584 524479 529259 528180 541424 542190 515041 511301 526600
9795 526600 524926 525982 540445 547210 538108 561955 577353 571820 575011 585338 590321 611373 638394
9782 638394 659822 687890 727368 806163 917243 1077618 1318457 1628208 1968354 2259014
9772 2259014 2470407 2612314 2721216 2799419 2791580 2639432 2382255 2074770 1736872 1409635
9762 1409635 1162511 1003856 888327 806571 747549 698746 653848 614750 595608 593159 580794
9751 580794 550354 531986 526614 515778 490897 468411 456186 453831 462709 469896 476478 461363 441421
9738D41421K597J41O240J1240j0278l807o915o999O86R480K848J053l465m776
9724D39466j147n156j0002J4033l10j4003k5832J3455O335o892J8306J7276p460
9711D38069j5686j2793J732J0378L136q119P65k504j561o497j266m479M159m490
9697D00844l44J0137j975j966j2542n851J8964M039j1152k006k028j285L835l846
9683C94824Q759J374p060l657P730M291k932J6486n96q893n397J730k158q447
9669C96054o135J354N707O190l523O274J0670m611J4265m203m463J193q606n352
9655D04814N071n534M211K4631J6825J6686K9973M1517J0054J5810J9852K3427
9643F07337o858l5914j1125j7126k4026k2884k7558k1516k8574j989n688L614
$$ plain form
9738 441421 444018 444159 450399 461639 451361 447554 440639 433640 434326 443806 446654 447707 444242 439466
9724 439466 438319 433163 423161 437194 436884 422881 397049 410504 416839 409947 428253 445529 438069
9711 438069 422383 409590 411322 421700 424836 416717 417482 414978 413417 406920 405654 401175 405334 400844
9697 400844 400500 410637 408662 406696 394154 388303 407267 411306 400154 398148 396120 394835 398670 394824
9683 394824 403583 404957 397897 394240 401970 406261 403329 419815 419219 410326 404929 406659 404501 396054
9669 396054 389919 391273 396980 403170 399647 405921 416591 411980 426245 422042 417579 418772 410166 404814
9655 404814 409885 404351 408562 433193 450018 466704 496677 538194 548248 564058 583910 607337
9643 607337 600479 564565 553440 536314 512288 489404 461846 440330 411756 409767 404079 407693
9631D07693M019L244m946m865Q217J5288J2500P020j4177j5786p195Q913l540
9618D16385l622J1650q435k4840m847J755O7L010j5269j0573q892K5364J0352
9605C92105n038q990k508n93m076M848J0159J5200k463k351j340J309J4349M124
9591D14735n548r154p548K3040K4256J1886J0992n227q774j3053j0151l970j2851
9578D08633l284l932J828m944Q06N769J050p403q959m244j0612l608j0195J3781
9564C74686J0823P658m100k954J454M246J8211k34k6952n441n111l782N968K1440
9550C95912N412P064o23J9617J849k3687m757k203J951J0307R181P97j27j466
9536D19227j1910r207k913p003m311L099J2590p871j0953J4195r255o723k66N372
$$ plain form
9631 407693 411712 414956 410010 405145 413362 428650 441150 448170 433993 418207 411012 419925 416385
9618 416385 412763 424413 415978 391138 386291 388046 388113 391123 375854 365281 356389 381753 392105
9605 392105 387067 378077 375569 374976 370900 375748 385907 401107 398644 396293 394953 396262 410611 414735
9591 414735 409187 400033 392485 415525 439781 451667 462659 457432 448658 435605 425454 421484 408633
9578 408633 405349 401417 403245 398301 399107 404876 405926 398523 389564 385320 374708 371100 360905 374686
9564 374686 385509 393167 389067 386113 387567 391813 410024 409790 382838 377397 372286 368504 374472 395912
9550 395912 401324 408388 407765 427382 429231 405544 400787 398584 400535 410842 420023 420820 420693 419227
9536 419227 407317 398110 395197 388194 383883 386982 399572 391701 380748 394943 385688 378965 378699 384071
9522C84071k976j0109q662o069q18J1337M563l124J1224j436j9285m403L141J2086
9508C69540N345m206n571N376O832j775r176l303K357O800J4987R129J76J910
9494C98421J019n749R058N700k1446k3046l188K422J0167P434J6085j2003j1028
9481C73846L593j4025l379N753J2829q66L306k656j2952P633K795j229J4847k313
9467C87182k741j2801q225l622k99K1204J2332M450q969j4151L364J2838K382
9454C92944r994K078N959N265O291j6256M877J0179M344J985j051R578n67m944
9440D10688l344p847o173K290j4299j5818N751R275L903J708r685p537L276l616
9426C68572l405K1323j260m514N638N517n898L565J1533q18J4691P36l739M35
$$ plain form
9522 384071 381095 370986 362324 356255 355437 366774 371337 368213 379437 378001 358716 354313 357454 369540
9508 369540 374885 370679 365108 370484 377316 375541 366365 363062 365419 372219 387206 396335 396511 398421
9494 398421 399440 393691 402749 408449 387003 363957 360769 363191 373358 380792 396877 384874 373846
9481 373846 377439 363414 360035 365788 378617 377751 381057 378401 365449 373082 375877 374648 389495 387182
9467 387182 384441 371640 363415 359793 359494 380698 393030 397480 388511 374360 377724 390562 392944
9454 392944 382950 385028 390987 396252 402543 386287 391164 401343 405687 407672 406621 416199 415632 410688
9440 410688 407344 399497 393324 395614 381315 365497 371248 380523 384426 386134 376449 368912 372188 368572
9426 368572 365167 386490 385230 380716 386354 391871 385973 389538 401071 400253 414944 415680 411941 412376
9412D12376N181J0964p875k479l507R045L452j6160j5223q507J5512P491j7624
9399C92646J0397K1735J0434l97j3025j1467K441j4275l87P919M749M657j402
9386D14025J564p953L457J3314r08O69L107N066j007Q493j2961o64J4788k611
9372D38379L460K2559R846j405j2519p426Q533m085n3j0997Q037J3384j877L839
9358D69675m155l597q037N641j3870q116M595J1448N666k108K759O747o615q838
9344D51195j885J307J4570m159q856K337L958Q505k112j3840R136J0187J2147
9331D82490N651n92L628M946j192K795P44q39j617N393j0196j660l691m159k540
9316D79161J4690n823J6716k109n885N084Q526K139P445J2848o317l150n815o458
$$ plain form
9412 412376 417557 428521 420646 418167 414660 423705 427157 410997 395774 387267 402779 410270 392646
9399 392646 403043 424778 435212 434815 421790 410323 412764 398489 398102 406021 410770 415427 414025
9386 414025 415589 407636 411093 424407 423499 424168 427275 432341 431334 439827 426866 426202 440990 438379
9372 438379 441839 464398 474244 472839 460320 452894 461427 457342 457289 446292 454329 467713 465836 469675
9358 469675 465520 461923 453886 459527 445657 437541 442136 453584 459250 457142 459901 466648 460033 451195
9344 451195 449310 450617 465187 461028 452172 454509 458467 466972 464860 451020 460156 470343 482490
9331 482490 488141 487549 491177 496123 494931 497726 498470 497631 496014 501407 491211 489551 485860 481701 479161
9316 479161 493851 488028 504744 502635 496750 501834 510360 512499 519944 532792 526475 523325 517510 511052
9302E11052p201M167J7235J4842J4718Q842N534j071j3098q365J1313j651r202
9289E47115j28Q762L754J6155L467P815l503J0545j0984m797l146o3m307R754
9275E80439L421L342J661J5516M67l621O689O064J6934J1106J7346J5873J9551
9262F94788M0343M9796N4821O4839P6238N2213J2840k1049m7643n1455q0671n7799
9250G87261l6305j327J3840L4342L0790M3246O3583O2600L6692M3262L6237R21
9238A115142j3382j6974l2489k4459j7482k0654l818J817J6608K9675K9980L8402
9226A102366K9566O3328J14115J50142J65761J51356Q0315o748r5380j38845j52095
9215A463881j49925j13578o8782l8535k1041o568J8558O171N012J4743K6734J7880
$$ plain form
9302 511052 503851 508018 525253 540095 554813 563655 569189 568118 555020 546655 557968 556317 547115
9289 547115 546987 555749 559503 575658 579125 586940 583437 593982 582998 578201 575055 574992 570685 580439
9275 580439 583860 587202 588863 604379 604846 601225 607914 613978 630912 642018 659364 675237 694788
9262 694788 735131 784927 839748 904587 980825 1033038 1045878 1024829 977186 925731 845060 787261
9250 787261 750956 749629 763469 797811 828601 871847 935430 998030 1034722 1077984 1114221 1115142
9238 1115142 1101760 1084786 1052297 1027838 1010356 989702 985884 987701 1004309 1033984 1063964 1102366
9226 1102366 1131932 1195260 1309375 1459517 1625278 1776634 1856949 1850201 1754821 1615976 1463881
9215 1463881 1313956 1200378 1131596 1093061 1072020 1065452 1084010 1090181 1095193 1109936 1136670 1154550
9203A154550L4376L6079K8680J7997j7073k8087l9798n3012m7213l7784k6398
9192A022317n914Q087P764J4188L0025O4408P4384Q2004N0290N641k5001n8339
9180A269854o7024n4371m0497m0488k5716k3086j2953j3717q951Q196J2100N201
9168A008548L434J0632O190N343L97J0838Q53Q935Q749Q960M932N279L617l705
9154A083002P106R206J1196J6607J0937P885K1256K3843J3272J3694R857J5832
9142A243693P009L678J793l664P414p726L989P640M589N496J4068J251P714J2767
9128A309711R067K1705J4439J2590O40M621J1295J9561J3047J6700J6925J6491
9116A466792J2508J2249O728K4110J5600K5607J6346P271R335J7705K1294K6642
$$ plain form
9203 1154550 1188926 1225005 1253685 1271682 1254609 1226522 1186724 1133712 1086499 1048715 1022317
9192 1022317 1016403 1024490 1032254 1046442 1076467 1140875 1215259 1297263 1347553 1353194 1328193 1269854
9180 1269854 1202830 1148459 1107962 1067474 1041758 1018672 1005719 992002 983051 991247 1003347 1008548
9168 1008548 1011982 1022614 1028804 1034147 1034544 1045382 1046235 1055170 1063919 1072879 1077811 1083090 1086707 1083002
9154 1083002 1090108 1099314 1110510 1127117 1138054 1145939 1167195 1191038 1204310 1218004 1227861 1243693
9142 1243693 1250702 1254380 1256173 1252509 1259923 1252197 1256186 1263826 1268415 1273911 1287979 1289230 1296944 1309711
9128 1309711 1318778 1340483 1354922 1367512 1368152 1372773 1384068 1403629 1416676 1433376 1450301 1466792
9116 1466792 1479300 1491549 1498277 1522387 1537987 1563594 1579940 1587211 1596546 1614251 1635545 1662187
9104A662187J5861J3528J4629J5904J1958O640R293J7381J7498J7555K4371J9896
9092A846701J4901J3632n47K3723L2390N510K0574K5628J9616K4881J8666J7356
9080B063031K0476K7231R020L0257L5861J7355L4123L6133K4841J9464K8109L4499
9068B380400K6683K6621L0424K4690J5688K2702M6546M1133L8415M0799L7783
9057B731884L1977K9019M7094L0713K6277M3896L8630K2750L1123M2712N8752
9046C134827L4011L7489L4039N2838N2432N2058N1741M4997M4059M0897M8812
9035C628200M4435O0030M6465N9616O1971O0761O0265O7140N7343O3187O4047
9024D273460O6386P0499Q6227P2849O2092N3072O6420P1263P1313Q2149Q1273
$$ plain form
9104 1662187 1678048 1691576 1706205 1722109 1734067 1740707 1750000 1767381 1784879 1802434 1826805 1846701
9092 1846701 1861602 1875234 1874687 1898410 1930800 1936310 1956884 1982512 2002128 2027009 2045675 2063031
9080 2063031 2083507 2110738 2119758 2150015 2185876 2203231 2237354 2273487 2298328 2317792 2345901 2380400
9068 2380400 2407083 2433704 2464128 2488818 2504506 2527208 2573754 2614887 2653302 2694101 2731884
9057 2731884 2763861 2792880 2839974 2870687 2896964 2940860 2979490 3002240 3033363 3076075 3134827
9046 3134827 3168838 3206327 3240366 3293204 3345636 3397694 3449435 3494432 3538491 3579388 3628200
9035 3628200 3672635 3732665 3779130 3838746 3900717 3961478 4021743 4088883 4146226 4209413 4273460
9024 4273460 4339846 4410345 4496572 4569421 4631513 4684585 4751005 4822268 4893581 4975730 5057003
9013E057003R3939R4361P8272Q2081Q3935Q9080Q4840R7372J07402J10796R4029
9002F073110Q7168J02988R6882R9192J07650J20093J25510J22621J20434J17493
8992G173141J19776J20774J24759J40526J33074J28211J17448J33500J33369J29033
8982H453611J47726J64356J47782J51897J44460J56736J57652J53100J58665J60844
8972I996829J63528J47949J58620J63079J62108J77090J80317J57959J63132J60941
8962A1631552J58451J50037J55075J59869J63361J60469J54131J42701J50210
8953A3025856J54072J54569J29911J17371J20131J37582J34183J00782R2433J04618
8943A4271508J06944R1576O0761N0481O2976O4562N0855L1298K4897K4677K3267
$$ plain form
9013 5057003 5150942 5245303 5323575 5405656 5489591 5578671 5663511 5760883 5868285 5979081 6073110
9002 6073110 6160278 6263266 6360148 6459340 6566990 6687083 6812593 6935214 7055648 7173141
8992 7173141 7292917 7413691 7538450 7678976 7812050 7940261 8057709 8191209 8324578 8453611
8982 8453611 8601337 8765693 8913475 9065372 9209832 9366568 9524220 9677320 9835985 9996829
8972 9996829 10160357 10308306 10466926 10630005 10792113 10969203 11149520 11307479 11470611 11631552
8962 11631552 11790003 11940040 12095115 12254984 12418345 12578814 12732945 12875646 13025856
8953 13025856 13179928 13334497 13464408 13581779 13701910 13839492 13973675 14074457 14166890 14271508
8943 14271508 14378452 14470028 14530789 14581270 14644246 14708808 14759663 14790961 14815858 14840535 14863802
8932A4863802O041o111j7984j6553l8429n4439n9123n9604n7037p6861p3588q9606
8920A4320508j06603j13275r3442r9713j13368j23327j29069j30038j50624j41090
8910A3119959j45352j48942j46394j47871j51228j48231j49419j73079j86892
8901A1722551j60105j60139j73068j71576j62140j60140j62890j44094j42851
8892A0285548j69984j76653j51910j47624j54597j58640j47704j57013j60112
8883H861311j70374j43387j35521j31697j45767j35172j32690j31544j25609j25187
8873G484363j19391j30983j24840j17288j20407j18991j17984j06700j05276j07845
8863F314658j07405r3726r2839j05271j03130r5450p9576q3407j01225q9792q2232
$$ plain form
8932 14863802 14869843 14863732 14845748 14829195 14790766 14736327 14677204 14617600 14560563 14483702 14410114 14320508
8920 14320508 14213905 14100630 14007188 13907475 13794107 13670780 13541711 13411673 13261049 13119959
8910 13119959 12974607 12825665 12679271 12531400 12380172 12231941 12082522 11909443 11722551
8901 11722551 11562446 11402307 11229239 11057663 10895523 10735383 10572493 10428399 10285548
8892 10285548 10115564 9938911 9787001 9639377 9484780 9326140 9178436 9021423 8861311
8883 8861311 8690937 8547550 8412029 8280332 8134565 7999393 7866703 7735159 7609550 7484363
8873 7484363 7364972 7233989 7109149 6991861 6871454 6752463 6634479 6527779 6422503 6314658
8863 6314658 6207253 6113527 6020688 5915417 5812287 5716837 5637261 5553854 5452629 5362837 5280605
8852E280605p6880p3188r9060q3958p8221q2497p6369p3323p8696p0590p7655
8841D410168n4114n4961o6914n9070m8819n9313q3570o2667o0364o6352n0917
8830C743107n1449l7008n4693m7713m7095m8495n0844n4176m4810m5744l3467
8819C227613j7355l9113n9721m7459n1524l6987k9997m5740m5746m2857m0403
8808B770711k7855l1519m0445k7834k8269l6120j9353j8505l3942j1551m2704
8797B452614m8929j9543k8647k0112l0165m8551m1008l2094o778j6483j5379k0095
8785B124830l7044k0871j5243k3497l0861l0570k1697j6008l1548j8484j2695
8774A866312k1454j7248k5813j6920j2665j1485k4385k2927j8246j5866q008l9181
$$ plain form
8852 5280605 5203725 5130537 5031477 4947519 4869298 4786801 4710432 4637109 4558413 4487823 4410168
8841 4410168 4356054 4301093 4234179 4175109 4126290 4066977 3983407 3920740 3860376 3794024 3743107
8830 3743107 3691658 3654650 3599957 3552244 3505149 3456654 3405810 3351634 3306824 3261080 3227613
8819 3227613 3210258 3171145 3111424 3063965 3012441 2975454 2945457 2899717 2853971 2811114 2770711
8808 2770711 2742856 2711337 2670892 2643058 2614789 2578669 2559316 2540811 2506869 2495318 2452614
8797 2452614 2403685 2384142 2355495 2335383 2305218 2256667 2215659 2183565 2176787 2160304 2144925 2124830
8785 2124830 2087786 2066915 2051672 2028175 1997314 1966744 1945047 1929039 1897491 1879007 1866312
8774 1866312 1844858 1827610 1801797 1784877 1772212 1760727 1736342 1713415 1695169 1679303 1671295 1632114
8762A632114j4315L137l099k5033j9593j5028o453j6655k3361j8544q332r863
8750A474975j6718k3457l496r508j9138j5649j5394j8333q367r286m888j4868
8738A315873k9579j9151j2719n631L567j1503r898j211j7042k1292k1380P55R460
8725A180249q656k0917n380M112j4392k5465j1642l439p079o096j6226j0081q432
8712A046556n463P04L487j1426k6177o333r750j0558M084l78P45j3333k938k321
8698I66899j6751o613j4696j9661j4290m414J8320n370j6054m486P386j1606q64
8685H77800n155m519j2916j1507p511k234p122k221j5273k288J6768J0910o735
8672H27997k036q13j7784k6186o369n401J0142P68N075q0r595j1390q810j7653
$$ plain form
8762 1632114 1617799 1620936 1617837 1592804 1573211 1558183 1551730 1535075 1511714 1493170 1484838 1474975
8750 1474975 1458257 1434800 1431304 1421796 1402658 1387009 1371615 1353282 1344915 1335629 1330741 1315873
8738 1315873 1286294 1267143 1254424 1248793 1252360 1240857 1230959 1229748 1212706 1191414 1170034 1170789 1180249
8725 1180249 1171593 1150676 1145296 1149408 1135016 1109551 1097909 1094470 1087391 1081295 1065069 1054988 1046556
8712 1046556 1041093 1041797 1045284 1033858 1007681 1001348 991598 981040 985124 984746 985491 972158 969220 966899
8698 966899 950148 943535 928839 909178 894888 890474 908794 903424 887370 882884 890270 878664 877800
8685 877800 872645 868126 855210 843703 836192 833958 826836 824615 809342 807054 823822 834732 827997
8672 827997 825961 825148 807364 781178 774809 769408 779550 780318 785393 785313 775718 764328 755518 737865
8658G37865j0065k762q880j5956M05j375J0408J7439m035M92J908o247M439Q204
8644G31840j6215j6866P473J2212j4526j8647q292j119J1246j1934l85K449P624
8631F84860O688M373m770k917L159n19L343J0206Q313K012O054J1359j0029j3772
8617G08360j0215p339j4631j8804j2113j4066j0230m800m946n661k962j8318r718
8604E74557j4011j5442K164k00M789J3290J2831j212r729p308O671p646n385q099
8590E45270P982J2805o807j9157j0933L342R395L186J1617J0220L357O188M900
8577E81365J5317J5222M7936N0323l54j4018M368j4374q383P65o9j7299m1859
8564F18940j8235k5936l5721l6347j6542p652j6677r160N145p84q758p739r992
$$ plain form
8658 737865 727800 725038 716158 700202 700607 699232 709640 727079 723044 723536 725444 719197 723636 731840
8644 731840 715625 698759 706232 718444 703918 685271 676979 675860 687106 675172 674787 677236 684860
8631 684860 691548 695921 691151 688234 691393 690874 694217 704423 712736 714748 720802 732161 722132 708360
8617 708360 698145 690806 676175 657371 645258 631192 620962 616162 611216 605555 602593 584275 574557
8604 574557 560546 545104 547268 547068 551857 565147 577978 576766 567037 559729 566400 558754 553369 545270
8590 545270 553252 566057 559250 540093 529160 532502 541897 545083 556700 566920 570277 576465 581365
8577 581365 596682 611904 659840 710163 709809 695791 700159 685785 677402 678167 678098 660799 618940
8564 618940 600705 574769 539048 502701 486159 478507 461830 452670 457815 457031 448273 440534 430542
8551D30542L982m495p117R037j013J185j8491j3925j089N035l371m131J421k155
8537C95415R95k990m865r754n049O121J9668K0743J8456l602o138m999p09K1700
8523D44992K9849R184r624n913j9670l9712j9247K954J209o776p487j2352j1998
8510C55409m231q645j8968j9841K756k922P553J0166j9150o217J1909L049p595
8497C03273j5001J0573M70K501k8P216Q823j0545j753N000j1525l985n311J1291
8483C00999J3869r49n345O388K2941J0086j0355m887j1214j3233J468r120q682
8470B91966j5387J1033m912o167n20k0893r259l225j579o90K889Q477n523M54
8456B46664J9058m679r307m827M860J454p681l757r22k376j487N001j0621P672
$$ plain form
8551 430542 434524 430029 422912 431949 430936 432121 413630 399705 398616 403651 400280 396149 397570 395415
8537 395415 396410 393420 388555 378801 373752 379873 399541 420284 438740 435138 429000 424001 423292 444992
8523 444992 474841 484025 474401 468488 448818 409106 389859 392813 394022 387246 379759 367407 355409
8510 355409 351178 342533 323565 303724 306480 303558 311111 321277 302127 295910 307819 310868 303273
8497 303273 288272 298845 299315 301816 301788 309004 317827 307282 305529 310529 299004 295019 289708 300999
8483 300999 314868 313919 308574 314962 337903 347989 337634 332747 321533 308300 309768 300648 291966
8470 291966 276579 287612 282700 276533 276013 255120 245861 242636 241057 240367 243256 251733 246210 246664
8456 246664 265722 261043 251736 246909 251769 253223 245542 241785 240863 238487 237000 242001 231380 239052
8442B39052l705j0300o067R09N390k936O235J6438L050j1422j5136q7K164m52
8428B23133m838p836N907O94O26r46k962M126M91L915n753j3473N203J4909J0147
8413B33343N416n397j1614j0474K410R95o869K858J0458J2690k5418j4326l037
8400A91035P895n91j0900J7794J2928M003P126j5875p838n194K514j291l375N952
8386B04183p061M802k847r532q592K667J1886q141l482J8741j369P989P72p967
8372B02049l129j253R16l216o933J368o399O818o842n06J4453l12q264q281K965
8357A83434N066K029M39o897R118Q873l952L257Q81M718j1489j1511j0346o58
8343A72962p02m695p224N001M040K652N174p163j2187N517P974L278L074j1998
$$ plain form
8442 239052 235347 225047 218980 219889 225279 222343 228578 245016 248066 236644 221508 221421 223585 223133
8428 223133 218295 210459 216366 217060 217686 216740 213778 217904 218395 222310 216557 203084 208287 223196 233343
8413 233343 238759 233362 221748 211274 213684 214679 207810 210668 221126 233816 208398 194072 191035
8400 191035 198930 198339 187439 205233 218161 222164 229290 213415 205577 200383 202897 201606 198231 204183
8386 204183 197122 201924 199077 189545 180953 183620 195506 187365 183883 202624 201255 209244 210016 202049
8372 202049 198920 197667 198583 195367 188434 189802 183403 190221 183379 182873 197326 197014 188750 180469 183434
8357 183434 188500 190529 190968 184071 193189 202062 198110 201367 202248 206966 195477 183966 173620 172962
8343 172962 172260 167565 160341 165342 169382 172034 177208 170045 157858 163375 171349 174627 177701 165703
8329A65703J1398Q723p271n731l427p162P554r217n557n60M294j8222M58J4022
8315A55005n32o042M157q179o378O693J7025J0816J245q885N647M220N537o723
8301A73606J1403L123m404k7959k527J415l184j0578L313N4j5549k722R115J558
8287A36664Q95M029J8587J477l286L155m36j0800p639r292r137J2951M098M895
8273A46161M492P676O229J3649m844k6546j7702k338p19r803r87J0211J1972p386
8259A30065K849J0801N148J458j5100l299j495Q805J730o211j1069l618Q984L385
8245A32433K034O358Q737o175j2891j7722k95Q931K0199J4054j4947j1808r24
8232A27984l327J521k299o299L885k19M125K765M693n695j3192J214N710j585
$$ plain form
8329 165703 177101 185824 178553 172822 169395 162233 169787 160570 155013 154453 158747 140525 140983 155005
8315 155005 154473 148431 152588 144409 138031 144724 161749 172565 173810 164925 170572 174792 180329 173606
8301 173606 185009 188132 183728 155769 153242 154657 151473 140895 144208 144262 128713 125991 135106 136664
8287 136664 137559 141588 160175 161652 158366 161521 161085 150285 142646 133354 124217 137168 141266 146161
8273 146161 150653 158329 164558 178207 173363 146817 129115 126777 126058 116255 115268 125479 137451 130065
8259 130065 132914 143715 148863 150321 135221 131922 130427 139232 140962 134751 123682 120064 129048 132433
8245 132433 134467 140825 149562 143387 130496 112774 112479 121410 141609 155663 140716 128908 127984
8232 127984 124657 126178 123879 117580 121465 121246 125371 128136 132829 127134 113942 115156 120866 119281
8218A19281r35l475J2534p982N478m701o661p583N622N325r563j199j1001r668
8204H5472j31J2085L476j0974p01J9566r24l884m417P502L595l462J365r333L999
8189A03234P803j923J113o28n544J466k044K996O379l380o732J0889L905k006
8175A15528J73j0512j3914j035O807r665J4901P383l567j0146q399r809o109Q607
8161H0243J6196R131Q321O531J1523j6622j8758M921o777j7488r42M4N236J1739
8147I3298P515j0819r796q652l069J2220O007m802q065j0701Q052J4377M348O6
8133H9979l920j626J0023K837L177k767k851J0316J2786q044j8656K364P713m670
8119I6661j5946J009M534L653m194P126J0515M048l365N563Q035J8365O715O756
$$ plain form
8218 119281 118346 114871 127405 119423 124901 120200 113539 105956 111578 116903 107340 106141 95140 85472
8204 85472 85341 97426 100902 89928 89227 108793 107869 103985 99568 107070 110665 107203 108568 99235 103234
8189 103234 111037 109114 110227 109599 104055 105521 103477 106473 112852 109472 102740 113629 117534 115528
8175 115528 115701 105189 91275 90240 97047 87382 102283 109666 106099 95953 87554 77745 71636 80243
8161 80243 96439 105570 113891 120422 131945 115323 96565 101486 94709 77221 76279 76323 81559 93298
8147 93298 100813 89994 80198 71546 68477 80697 86704 81902 73837 63136 71188 85565 89913 89979
8133 89979 86059 84433 94456 97293 100470 97703 94852 105168 117954 109910 91254 93618 101331 96661
8119 96661 80715 81724 86258 89911 85717 92843 103358 107406 104041 109604 117639 136004 142719 149475
8105A49475l320R424m74k5795k1399L899M466r915j3909J070M540n515J667P675
8091A01889R787M719L192o018j7729j3347o738M165j1197o986L646J4385m94l605
8077G5669k339K117o001m973k475K3082J5587k199j6064k957L336j019Q586J1596
8063A01946J0275J5729L0486J9978P366j311m448j3647l6915j8562r054j213J0750
8050A11380K005l761N829J353P516K0605M488L061R51r22N921M379j2371q422
8036A42012m503k15k244j6103O07J5609J3797L265l498k5416j1015J0593J9255
8023A42144Q698o398k4272r264k773N146J3967K8158O099J6494J6638Q725L464
8010B06826j21J248L329J3195k1556j4388j0972o68r669k216J0764J2566K965
$$ plain form
8105 149475 146155 155579 155105 129310 107911 111810 116276 106361 92452 93522 98062 92547 94214 101889
8091 101889 111676 116395 119587 113569 95840 82493 75755 79920 68723 61737 65383 79768 79274 75669
8077 75669 73330 75447 69446 64473 61998 85080 100667 98468 82404 79447 82783 81764 90350 101946
8063 101946 112221 127950 158436 178414 185780 184469 180021 166374 129459 110897 101843 100630 111380
8050 111380 113385 109624 115453 116806 124322 144927 149415 152476 153427 152505 158426 162805 150434 142012
8036 142012 137509 137294 135050 118947 119554 135163 148960 152225 148727 123311 112296 122889 142144
8023 142144 150842 144444 120172 110908 108135 113281 127248 155406 161505 177999 194637 203362 206826
8010 206826 206705 207953 211282 224477 202921 188533 177561 176893 167224 165008 175772 188338 191303
7997A91303O981L867j4788j3963j280j3042j8097j521J075J70n514p287O710l705
7983A30909j5957l633M188K757o604O162J8630Q045P451L541O369N64K076K812
7969A67310j3513m000m349r903k283Q053l875M230n716j6217k652p21j3401k014
7955A00949K0364O89p557o912n893N416P528p245o531k55L461m186J432k54N637
7940A06643O836O100n383J0227j383j8274m147j739p179L536J8388Q221j274j2271
7926A08301N621M07k3897q149K602p3p524m02n951j188J2396J452r677Q397N508
7911H7823J9237N374m986r639r563P364L938J0221j910j211m577j1468n981J995
7897H6617Q346N277K040r998k4027O809K0167Q527j734j0248j1575l643j1748
$$ plain form
7997 191303 198284 202151 187363 173400 172120 159078 140981 139460 140535 140705 135191 127904 134614 130909
7983 130909 114952 111319 115507 118264 111660 117822 136452 144497 151948 155489 161858 162422 164498 167310
7969 167310 153797 149797 145448 135545 133262 141315 137440 141670 135954 119737 117085 116364 102963 100949
7955 100949 121313 122002 114445 107533 101640 107056 114584 107339 100808 100553 104014 99828 101260 101006 106643
7940 106643 113479 119579 114196 124423 123040 104766 100619 98880 91701 95237 113625 121846 120572 108301
7926 108301 113922 114329 90432 82283 84885 84812 77288 76886 70935 69747 82143 83595 73918 82315 87823
7911 87823 107060 112434 107448 97809 88246 95610 99548 109769 107859 106648 102071 90603 84622 86617
7897 86617 94963 100240 102280 92282 68255 75064 95231 103758 102024 91776 80201 76558 64810
7884F4810M785n922r057M663N730M70j977j571l35L818O217l747o893J4974J5698
7869I1663q033q499P336j4916p004L584j551M432Q886K210j2677j879N240k516
7855F6276q887p267N208N777O814J271l896P287L258r924j0101o555P426r301
7841D7386r205M508J0702O562p549p106l055J707J283O692M591K975j5766l154
7827D0571J2532J1515L084o761j2358j1183M139M477j239m366J757l44Q320K488
7813E2632j3345J0557J080N325J2874K461j0740k2491r160Q700p725k587J9522
7800D7103P829j4190j4216L239J2697k279P004O988j227o313o270q391j3191K203
7786B0986Q306p458N683Q135M350q425j6745R247K1065J8504K395l259j3617K48
$$ plain form
7884 64810 69595 63673 54616 59279 65009 65479 63502 61931 61596 65414 71631 67884 60991 75965 91663
7869 91663 83630 75131 82467 67551 60547 64131 62580 67012 75898 78108 65431 63552 68792 66276
7855 66276 57389 50122 55330 61107 67921 69192 65296 72583 75841 65917 55816 49261 56687 47386
7841 47386 38181 42689 53391 59953 52404 45298 42243 43950 45233 51925 56516 59491 43725 40571
7827 40571 53103 64618 67702 60941 48583 37400 41539 46016 44777 40411 42168 41824 50144 52632
7813 52632 39287 49844 50924 56249 69123 71584 60844 38353 29193 37893 30168 27581 47103
7800 47103 54932 40742 26526 29765 42462 40183 47187 54175 52948 46635 40365 31974 18783 20986
7786 20986 29292 21834 27517 35652 40002 31577 14832 24079 45144 63648 66043 62784 49167 49415
7772D9415r746j2788O614Q872j275l944J0154j2882j2553P931R22L650O9q73J1937
7757D5503P491K150l762p158m219j4064K602l809J979J1630K430O404p722j0426
7743B9029o70L247M179J203L913p256j242J347r202P176J1679J5164L986r641
7729E2912k4200j0500l976L126q605j860J3556Q426L075J635O545m519k300L845
7715C7160r023n719R095O608K367Q578R959P329M995p491J8054j1982j8682n350
7701D5898k5208K589J2596J577k894P855O901j841j6577j8296J1534J3347j1550
7688B5931j0928l427Q739M576J0247L538k852N375N271n860N035q61j238O541
7674E0087o548j2606J3036J5008k486N589J310J384o174j5677j0150J564p98J2023
$$ plain form
7772 49415 39669 26881 33495 42367 41092 37148 47302 34420 21867 29798 30720 34370 34439 33566 45503
7757 45503 52994 55144 51382 44224 40005 25941 28543 24734 26713 38343 40773 47177 39455 29029
7743 29029 28359 31606 35785 36988 40901 33645 32403 33750 24548 31724 43403 58567 62553 52912
7729 52912 28712 18212 14236 17362 8757 6897 20453 28879 31954 33589 40134 35615 33315 37160
7715 37160 28137 22418 31513 38121 40488 49066 59025 66354 71349 63858 81912 69930 51248 45898
7701 45898 20690 23279 35875 37452 34558 42413 49314 47473 30896 12600 24134 37481 25931
7688 25931 15003 11576 20315 24891 35138 38676 35824 41199 46470 40610 45645 44784 43546 50087
7674 50087 43539 30933 43969 58977 56491 62080 63390 64774 58600 42923 32773 34337 33539 45562
7660D5562M928R89j8084m413O544R268J7261n542l737j5479n793m38R723p507
7646C3282j289p308J5296j457K367O669m389M577N566K30n903q926q086K771K4351
7631E7751m544q179m576n966j7150K93J0530K345J746K859N072L595j0215K114
7617C5675J1853L738l786O392j3253k0023N028J1396j3490m497P063j930o238
7604A7928p098J6477Q661l118l519M019r416j6647J205J3154O933J5349j0830
7591C3098n725J2501O384j1675p90j0449Q198P213M93j6122P557R164O316q894
7577C7269l06N02p714j2733j8537p889J816K4712J2033N674L189O259O464J372
7563E2111j03j1014j0186q672M283J2573p660p79N740k194p902Q041J3939p823
$$ plain form
7660 45562 50490 51479 33395 28982 35526 44794 62055 56513 52776 37297 31504 31066 40789 33282
7646 33282 31993 24685 39981 38524 40891 47560 43171 47748 53314 53544 47641 38715 30629 33400 57751
7631 57751 53207 45028 40452 34486 17336 17629 28159 30504 32250 35109 40181 43776 33561 35675
7617 35675 47528 51266 47480 53872 40619 20596 25624 37020 23530 19033 26096 24166 17928
7604 17928 10830 27307 35968 32850 29331 33350 23934 7287 8492 21646 28579 43928 33098
7591 33098 27373 39874 46258 34583 33793 23344 31542 38755 39248 23126 30683 39847 46163 37269
7577 37269 36963 37465 29751 17018 -1519 -9408 -7592 17120 29153 34827 38016 44275 50739 52111
7563 52111 52008 40994 30808 22136 26419 38992 31332 30553 36293 34099 26197 34238 48177 40354
7549D0354m219j6834j2647J3160M092k65P076r45Q9m274K945j834p796k799r025
7534G078m52J4630J3127Q74r605j1984O11L042m470L355R082L789q895J267k14
7519B1235o882j1986m224L547Q904K182Q566M481m87j0418j0025p947o943M246
7505e751L746o728J2457K048m907J3865J6894n098m58k030L917k389p039L803
7491B2330P121Q637l418r728o943j148k523L343L079J4962n414l510N816K729
7477C5333j4790j2641k193P140P69L284J2532O706j3493j5866J87J880j5971K281
7463d842J7474Q773l509m256J6197J175j4948J0052m13j0580o982r15K1456J3576
7449D2258j1286j9221j2853J4925q752r683L330P675J3430L590M840o006n294
$$ plain form
7549 40354 36135 19301 6654 19814 23906 23641 30717 29772 29861 25587 28532 26698 18902 16103 7078
7534 7078 6626 21256 34383 35257 25652 13668 14279 17321 12851 16206 25288 29077 20182 21449 21235
7519 21235 14353 2367 -1857 1690 10594 12776 21342 25823 25336 14918 4893 -3054 -9997 -5751
7505 -5751 -2005 -8733 3724 5772 865 14730 31624 26526 26068 24038 27955 25566 18527 22330
7491 22330 29451 38088 34670 24942 17999 16851 14328 17671 20750 35712 30298 26788 32604 35333
7477 35333 20543 7902 5709 12849 13618 16902 29434 36140 22647 6781 6968 8848 -7123 -4842
7463 -4842 12632 21405 17896 13640 29837 31012 16064 26116 25703 15123 8141 7226 28682 42258
7449 42258 30972 11751 -1102 13823 5071 -4612 -1282 6393 19823 23413 28253 22247 16953
7436A6953Q528p405o652j296l103M537l662J2722J3683j4309N50m598j309N055
7422A9694J6269O708q919r416J728J430P203m418Q197m410j1622Q814J1425M663
7408D7346j4896l084J2925J978j1454j4240n543L705J1227Q703L034q889q293
7395B2519O300r749j1145k134q279J2354J0689M548j803O76j7963o187N562P285
7381A2673l007j0303J4018J2829L513q019j0492n648P833J2456j86o888N943J3768
7367C8490Q401Q9m467m658j901q273j900O51j2362k943J1962K84j2204l76M564
7352A5357m051j2660l453j22P329M601R639Q454j325o027p96M858l357j0624j0143
7337b320m188J7201J1090j625J0661l303r493j855L147J1368K560j025k068l949
$$ plain form
7436 16953 25481 18076 11424 10128 7025 11562 7900 20622 34305 19996 20546 15948 14639 19694
7422 19694 35963 42671 33752 24336 26064 27494 34697 30279 38476 34066 22444 31258 42683 47346
7408 47346 32450 29366 42291 44269 32815 18575 13032 16737 27964 36667 39701 30812 22519
7395 22519 28819 19070 7925 5791 -2488 9866 20555 25103 23300 23976 6013 -174 5388 12673
7381 12673 9666 -637 13381 26210 29723 21704 11212 5564 13397 25853 25667 18779 24722 38490
7367 38490 46891 46980 42513 37855 35954 27681 25781 26432 14070 11127 23089 23373 11169 10793 15357
7352 15357 11306 -1354 -4807 -4929 2400 7001 16640 25094 23769 17742 16946 21804 18447 7823 -2320
7337 -2320 -6508 10693 21783 20158 30819 27516 18023 16168 19315 30683 33243 32218 30150 26201
7323B6201J959K268J1632l313n57n953j8981m287J7277J2658R817j2115r791o632
7309B0183n135K701K024O13o656r513k300Q15l910j2669p247J8027J1702M067
7295A2702q051j68n684j0347K769M764J1944J4836j112l121N083P344K14l058
7281B8115m76J468k558q279M96M417o728M825Q071o458j0884p982K555o353M564
7266D793J0524j616q961O994M762L622L326Q46k76j2502n638m584J717J3173N685
7251B1865j2762o464J2706J2641R025j5346p955o813J0925Q386j1229o30Q945
7238B3294J0791k533j2760r499j760m993R494Q669J142K828J549n721r852j4718
7224d069O314n905L759M138K307O545j352q425N488M630j3896N84N125m358n934
$$ plain form
7323 26201 28160 30428 42060 38747 38190 32237 13256 8969 26246 38904 48721 36606 26815 20183
7309 20183 15048 17749 19773 20386 13730 4217 1917 2732 -1178 -13847 -21094 -3067 8635 12702
7295 12702 4651 4483 -1201 -11548 -8779 -4015 7929 22765 21653 18532 23615 30959 31173 28115
7281 28115 27639 29107 26549 18270 18766 23183 16455 21280 29351 22893 12009 4027 6582 229 4793
7266 4793 15317 13701 4740 11734 16496 20118 23444 24290 24014 11512 5874 1290 3007 16180 21865
7251 21865 9103 2639 15345 27986 37011 21665 13710 6897 17822 26208 14979 14349 23294
7238 23294 34085 31552 18792 9293 7533 2540 12034 20703 21845 24673 26222 20501 10649 -4069
7224 -4069 2245 -3660 99 4237 6544 13089 11737 3312 8800 13430 -466 118 5243 885 -5049
7209e049Q777J0985N066q818o434L191R281L487L07j2249j3944K363K50P231K052
7194F496K665K1469O509j2016j0426n388K936L05Q040m080o710j0820j518J8635
7180A6097R182l930L366r28k002j0373m466R05P298n645m258N207K162K982l401
7165A2196l250J904N771L562J3336q34q493j3870k483J0282P054r505k652m534
7151H484J595R344R178L815j4798o548p408o662K959p494O149Q555Q2m601J839
7136D489O697J3632O253j5336j2998K946N055J274l288O952j4357o703j1200L667
7122a2917J3516J6792j0290j7350J5053K673j10k124k360N842M0P65P674p337
7108I867j1298L003K979k395n507j4209l577J5234J9969R805n041j8132J0289
$$ plain form
7209 -5049 3728 14713 19779 10961 4527 7718 16999 20486 20793 8544 -5400 -3037 -2787 4444 6496
7194 6496 9161 30630 37139 25123 14697 9309 12245 12550 20590 16510 9800 -1020 -2538 16097
7180 16097 25279 21349 24715 23787 21785 11412 6946 7851 15149 9504 5246 10453 12615 15597 12196
7165 12196 8946 10850 16621 20183 33519 32685 24192 10322 7839 18121 25175 15670 13018 8484
7151 8484 10079 19423 28601 32416 17618 11070 3662 -3000 -41 -7535 -1386 7169 7251 2650 4489
7136 4489 11186 24818 31071 15735 2737 5683 10738 12012 8724 15676 1319 -5384 -16584 -12917
7122 -12917 599 17391 7101 -10249 4804 7477 7367 5243 2883 8725 8765 9530 17204 9867
7108 9867 -1431 1572 4551 2156 -3351 -17560 -21137 -5903 14066 23871 18830 698 10987
7095A0987J7947n466k5640o603O048J4606J3814n917o498l295k355o565L084l333
7081H14N069N883R384j5342j6663m368Q844N061K73Q620M679k795K967k314l677
7066F435o117k026M115K262J323P92q244q859J84M84J3343J0274n112j2582k791
7051f519N27k279N629M398k207j6015N407J2764Q692Q442n31k2004k579J5038
7037H763Q184L316o591N904O33j3525j6600N246J0136j2365q271J5540P173J70
7023G713j535R9l281j2327p217J0444P45j175L519n787n03m837Q018O644J5683
7008A6203n057q299L500K531k833j7724j985J5071K0526P311J108j3866j832k553
6994A2101l471o849l696J1959N951M081k292o340J920j6907r157J0205K335K819
$$ plain form
7095 10987 28934 23468 -2172 -8775 -2727 11879 25693 19776 13278 9983 7628 1063 4147 814
7081 814 5883 11766 21150 5808 -10855 -15223 -6379 -1318 -1045 7575 12254 9459 12426 10112 6435
7066 6435 318 -1708 2407 4669 5992 6784 -1460 -10319 -10135 -9651 3692 13966 8854 -3728 -6519
7051 -6519 -5992 -8271 -2642 1756 -451 -16466 -11059 1705 10397 18839 18308 -3696 -6275 8763
7037 8763 16947 20263 13672 19576 20209 6684 -9916 -4670 5466 -6899 -15170 370 7543 7713
7023 7713 6178 6277 2996 -9331 -16548 -6104 -5359 -6534 -3015 -8802 -9305 -14142 -6124 520 16203
7008 16203 11146 2847 6347 8878 6045 -11679 -13664 1407 21933 29244 30352 16486 14654 12101
6994 12101 8630 1781 -1915 10044 15995 20076 17784 11444 13364 -3543 -12700 -2495 -160 2659
6980B659N33J700K066j0254O620N980p66O761m808j4118p777j440R467M17k931
6965e891P285R620n05q58l118N611M925m364m573K325J164O571J1869k993q7K268
6949B9249J078l053o391q561j0806o269R301k917j1662j800M866m527j1530L379
6935a9643J0128J2203J2606p532J822o465m798K842P028j1750K357m087M269J3276
6921A2256J1934P072J34k2667k610n149n29P446m5K954n329j0502O236q65k2k729
6905b415L218J965J4923q91m986o496K181J8018Q539q894J239J3335j3207j1729
6891A4800l754O032o078j9859l621J1522J0928j2845L02L804p629j06J9290N428
6877A8214P606K530j4319o138j6879l184P057K202L314J1432r35l785J6793l365
$$ plain form
6980 2659 3192 4892 6958 -3296 3324 9304 8538 15299 10491 -3627 -11404 -12844 -3377 -2960 -5891
6965 -5891 1394 11014 10509 9651 6533 12144 17069 12705 8132 10457 11621 18192 30061 27068 26981 29249
6949 29249 30327 27274 20883 12322 1516 -4753 4548 1631 -10031 -11831 -6965 -11492 -23022 -19643
6935 -19643 -9515 2688 15294 7762 9584 3119 -1679 1163 8191 -3559 -1202 -5289 -1020 12256
6921 12256 24190 31262 31396 8729 6119 970 441 7887 7842 10796 5467 -5035 1201 336 314 -2415
6905 -2415 803 2768 17691 16800 11814 5318 7499 25517 34056 25162 26401 39736 26529 14800
6891 14800 11046 17078 11000 -8859 -12480 -958 9970 -2875 -2573 1231 -6398 -6504 12786 18214
6877 18214 25820 28350 14031 7893 -8986 -12170 -5113 -2911 403 11835 10900 7115 23908 20543
6863B0543n07J768n036m189j2146J330N819r73n164j912n342P606M675j237P94
6848F029l521Q887q30K621N773p053N891l22p447n731n508m022L130J8593R304
6833B5794k432l766j2466J3680O781k750N553Q709l128j2770N43Q488L140k706
6819C2670j4836j1426q683J2050j935l887j5493L831J842J3354J8658m766K680
6806B4059M942J2459J0871M90j3025j4681m421n074p632j5764j4189R175K5934
6793A3144j1952k1182L069L204o688n116J2512J6180J0086J4592q113m566k108
6780A3062P546J1143O436p196N8j1311k7618m241l384J6797J904m002J087O168
6766F449j3384o318J568n102J6201R739j550k789j051N856M296J857p643j2849
$$ plain form
6863 20543 20036 21804 16768 12579 433 1763 7582 6609 1445 -467 -5809 1797 6472 5235 6029
6848 6029 2508 11395 10565 13186 18959 11906 17797 17475 10028 4297 -1211 -5233 -2103 16490 25794
6833 25794 23362 19596 7130 20810 27591 24841 30394 39103 35975 23205 23748 32236 35376 32670
6819 32670 17834 6408 -2275 9775 7840 3953 -11540 -7709 -5867 7487 26145 21379 24059
6806 24059 29001 41460 52331 52821 39796 25115 20694 15620 7988 -7776 -21965 -12790 13144
6793 13144 1192 -19990 -16921 -13717 -20405 -25521 -13009 3171 13257 27849 19736 15170 13062
6780 13062 20608 31751 38187 30991 31049 19738 -7880 -12121 -15505 1292 3196 -806 281 6449
6766 6449 -6935 -13253 -11685 -16787 -586 9153 7603 4814 3763 9619 13915 15772 8129 -4720
6752d720O568n48o165O443R278l153R806P000k0196j4071L684K914R47J0970k879
6737E878o676J0031M040q124J505R481j1572j0426o476N530N884r259P034K606
6723e44l442o02M611m838M316n27K852J1315j409J397J0077J1609O41k525o577
6708B6354M241k42k0064k805J3954K072l62m966J1203J3423P922K0935R975p946
6694G3694k7753k9229p399n808j3270k092N928K549L141k946l884o327J4807J383
6680B794P423J858o587j4203q637k678q908K2148J629J905P573K252q147q619
6666a0197J426J1923M832r097j7676k142J6449J0729j1754p135Q344J6377R984
6653B2063j8175p879l367J1456P040j0165O199l068n920j2600r287J3678J2023
$$ plain form
6752 -4720 1848 1300 -4865 1578 10856 7703 17509 24509 4313 -9758 -6074 -3160 -2213 8757 5878
6737 5878 -798 9233 13273 5149 6654 16135 4563 -5863 -12339 -6809 -925 -10184 -3150 -544
6723 -544 -3986 -4588 23 -4815 -499 -1026 1826 13141 11732 13129 23206 34815 35456 32931 26354
6708 26354 30595 30353 10289 7484 21438 23510 23148 18182 29385 42808 50730 71665 81640 73694
6694 73694 45941 16712 9313 3505 -9765 -11857 -5929 -3380 -239 -3185 -7069 -13396 1411 2794
6680 2794 10217 12075 5488 -8715 -17352 -20030 -28938 -6790 -5161 -3256 4317 6569 -1578 -10197
6666 -10197 -8771 3152 7984 -1113 -18789 -20931 -4482 6247 -5507 -12642 -4298 12079 22063
6653 22063 3888 -3991 -7358 4098 11138 973 7172 4104 -1816 -14416 -23703 -10025 1998
6640A998J0098M296k490m163r266o348l512J6962l337j0862k926J43R495K314
6626B402L344p919j5373o87N072n654q620R458N675j11K92m726m626J757m743
6611b4459R552L087j0515Q000J6096j761k893R50P011l54n947j1829o494N786
6597a3770P659Q676O395L734j849P153M563p630J341j895q319L737n225J28j1460
6582f762o855M347L079l856P563J0328Q316j0373k3364r447J2921J3935m200j2970
6568a7338N182Q558P160M048n401M184P900j1537o22r55r281J2453J492m89k698
6553B656J6011m962j1779k787o808O72J1021J3250o931r231N920k3322k244K796
6539a5738N878O595P088j674q812m824O375P967J2425o100p152l118k016m052
$$ plain form
6640 1998 12096 16392 13902 9739 473 -5875 -9387 7575 4238 -6624 -9550 -9407 88 2402
6626 2402 5746 -2173 -17546 -18233 -13161 -18815 -27435 -17977 -12302 -12413 -12121 -16847 -21473 -19716 -24459
6611 -24459 -14907 -11820 -22335 -14335 1761 0 -2893 -1943 5068 4714 -1233 -13062 -19556 -13770
6597 -13770 -6111 2565 8960 12694 10845 17998 22561 14931 16272 14377 6058 9795 4570 4698 -6762
6582 -6762 -13617 -9270 -6191 -10047 -2484 7844 16160 5787 -17577 -27024 -14103 -168 -4368 -17338
6568 -17338 -12156 -3598 3562 7610 2209 6393 14293 2756 2134 1179 -8102 4351 5843 5354 2656
6553 2656 18667 13705 1926 -861 -7669 -6997 4024 17274 10343 1112 7032 -16290 -18534 -15738
6539 -15738 -9860 -3265 3823 2149 -6663 -11487 -5112 2855 15280 9180 2028 -1090 -3106 -7158
6525g158j1096M992J0459M391q82q228j699P820J3368l947l782j6082r454o125
6511b7423N207K9180Q350j8068j0849k28j99N323M073m200Q127K2794R12o064
6497A6935R213K129k2309n142M366j800l698k833k212J0919j67K58r79p989o935
6482a0244R920O96j1447K348R633o587j616J0067r96r341k223o995O166q08J0600
6467h27O150j488j1885l743K821n757M819m22l735j227q32R490K1K36J0379J4124
6451A8124k127j3029j308J1580K701N007l921q947j575o359p798R694Q620j1444
6437g82j3683N36J309r32m746J4586P353j0637R73n3N20m15L571N207o047Q205
6421D965K328r260j8743N765r07j1787n560J6605N766k278K349r103j523k86R62
$$ plain form
6525 -7158 -18254 -13262 -2803 1588 706 -7522 -9221 -1401 11967 8020 4238 -11844 -21298 -27423
6511 -27423 -22216 6964 15314 -2754 -13603 -13831 -14030 -8707 -4634 -8834 -707 22087 22999 16935
6497 16935 26148 28277 5968 826 5192 3392 -306 -3139 -5351 5568 5401 5659 4680 -3309 -10244
6482 -10244 -324 372 -11075 -8727 906 -5681 -7297 2770 1774 -7567 -9790 -16785 -10619 -11427 -827
6467 -827 5323 3835 -8050 -11793 -8972 -14729 -9910 -10332 -14067 -15294 -16126 -6636 -6615 -6379 4000 18124
6451 18124 15997 2968 1660 13240 15941 20948 17027 8080 6505 146 -7652 2042 10662 -782
6437 -782 -14465 -13929 -12620 -13552 -18298 -3712 3641 -6996 -6023 -6076 -5556 -5971 -2400 2807 -3240 4965
6421 4965 7293 -1967 -20710 -14945 -15852 -27639 -33199 -16594 -10828 -13106 -10757 -19860 -21383 -21669 -20707
6406b0707P332r04J627Q616p081o529J5927J4242L677j4077r309L094L594L75
6392a23l359O126P75j588j8452k687J0531R197l326j0186P529J1010M266r38o433
6377B342K789j521k217J4021R839q180P452Q171j3455n427L431n659j994J803
6363A1395j3428k300p73o394o151M735J5293R506L83M981Q401q431k0880r46J3041
6348H432K529L475L447n410Q260j1515m734J6926l018j4441j3918J05P852P221
6334E211j3793m04J3105J4749j179q845j5032J2742P958r864j2939o238J123j28
6320a3534R130P189r495k941j590K453J058l783J0871Q412j6952j3086M375M842
6306a3051L499k076p328J412n255R672J0579Q114m604o915l010n221J244o314
$$ plain form
6406 -20707 -13375 -14279 -12652 -4036 -11117 -17646 -1719 12523 16200 2123 -7186 -4092 -498 -123
6392 -123 -3482 2644 3419 1831 -16621 -19308 -8777 420 -2906 -13092 -5563 5447 9713 8775 2342
6377 2342 5131 3610 1393 15414 25253 17073 24525 32696 19241 13814 17245 11586 9592 11395
6363 11395 -2033 -4333 -5106 -11500 -17651 -12916 2377 11883 12266 17247 25648 17217 -3663 -4609 8432
6348 8432 10961 14436 17883 12473 20733 9218 4484 21410 18392 3951 -9967 -9862 -2010 5211
6334 5211 -8582 -8986 4119 18868 17689 8844 -6188 6554 14512 4648 -8291 -14529 -13406 -13534
6320 -13534 -4404 2785 -6710 -9651 -11241 -8788 -7730 -11513 -642 7770 -9182 -22268 -17893 -13051
6306 -13051 -9552 -11628 -18956 -17544 -22799 -13127 -2548 5566 962 -5953 -8963 -14184 -12940 -19254
6292a9254r862l233J6863L030L319l95Q996O904R742p30q190j525j9200j8058
6278c1593J364L264Q196J0852R740l29Q921r285l863J6626j2353j0983j1093o260
6264b6796j076N974J3840n360r662R134Q646k015J5514P490K411j3477R07M216
6250I746J908j0056R069j3904j5457J1695J4270l889j1841j788J2173O955L626
6237A2507Q86N589q93o689p506j3617J579K2J0879K463M976K265P387r080K433
6222A3201P072N003r328j5700l578P520L009J969j012j0619N018J1853o52N047
6208A8803m358j1434l813P804K848j7448p428J197J0347P077j1290j960j3952
6195b3607K747m079J2448J7930K835k696r364M663l735r69J1999N473j70o437
$$ plain form
6292 -19254 -29116 -32349 -15486 -12456 -9137 -9532 -536 6368 16110 15380 7190 5665 -13535 -31593
6278 -31593 -30229 -26965 -18769 -7917 1823 1494 10415 1130 -2733 13893 1540 -9443 -20536 -26796
6264 -26796 -27872 -21898 -8058 -13418 -23080 -13946 -5300 -7315 8199 15689 18100 4623 5530 9746
6250 9746 11654 1598 10667 -3237 -18694 -6999 7271 3382 -8459 -10247 1926 8881 12507
6237 12507 13393 18982 18089 11400 3894 -9723 -8144 -8122 2757 5220 10196 12461 19848 10768 13201
6222 13201 20273 25276 15948 248 -3330 4190 7199 9168 8156 -2463 2555 14408 13756 18803
6208 18803 14445 3011 -802 7002 9850 -7598 -15026 -13829 -3482 3595 -7695 -9655 -23607
6195 -23607 -20860 -24939 -12491 5439 8274 5578 -3786 877 -2858 -3827 8172 13645 13475 7038
6181G038j193Q065k194k279J0361P79k5770q887L956k852J2999J2828K416m006
6167A1261l714p85k27n787K563l43M326L697q593l270o561p477N115J8169J108
6152I482k093j3062n013J4390P431r773j346o071k582R469l648j5940M349K3888
6138I481P301J219j0876j2967q555n51Q216j712q094j615J3061J3165j271m458
6124B344k480l451O885n66m354O182m588j3442p089R838J134O783Q051J0410P511
6109B3168p738j4152r937J973J468m789R46J0033o555K611K010O042m455j036
6095d11p436j0125q648R590k019N06N784J7204L306o741j0215j856J77k070j955
6080a4909O019n733J709j229p607O694R523P339N341m667l030k396M071Q467O028
$$ plain form
6181 7038 5845 13910 11716 9437 19798 20577 -5193 -14080 -10124 -12976 23 12851 15267 11261
6167 11261 7547 6762 6535 748 3311 2968 7294 10991 2398 -872 -7433 -14910 -9795 8374 9482
6152 9482 7389 -5673 -10686 3704 11135 1362 16 -6055 -8637 832 -2816 -18756 -14407 9481
6138 9481 16782 18001 7125 -5842 -14397 -14948 -6732 -8444 -16538 -18153 -5092 8073 6802 2344
6124 2344 -136 -3587 3298 2732 -1622 4560 -28 -13470 -20559 -10721 -9587 -2804 5247 15657 23168
6109 23168 15430 1278 -8659 -6686 -5218 -10007 -9061 972 -5583 -2972 -962 5080 625 -411
6095 -411 -7847 -17972 -26620 -17030 -19049 -18543 -12759 4445 7751 1010 -9205 -11061 -10884 -12954 -14909
6080 -14909 -8890 -14623 -12914 -14143 -21750 -15056 -5533 1806 7147 2480 -550 -2946 1125 9592 15620
6065A5620R97j0791m963l226j943j668Q683J0422r376k624P01j490j0006M610
6051e054J1472o835O682M251p232n866j0781j0164j824J5621J0890p605l617P548
6037b514J1702J619l919r650o246L281j150r610n135J817O563Q790j061N166N075
6022D728O124n192k968O439Q731j257r751j0110j0260J1424J4016k879k099q691
6008a745j5280p357N374q53J074K863j381N161j13J519O050l177j6989P740p065
5993b4179J793J1560l68p650P68J0965j9988j6341J1246K7140J996j0811j20l026
5979a7015L63K195O195r781j621n640J2132j877l356M325J1911j5358k720J0357
5965i890J540K712q657m813L906n591o866m58m614o645Q117J2127J1369M399r979
$$ plain form
6065 15620 16617 5826 863 -2363 -4306 -5974 2709 13131 3755 1131 1832 342 -9664 -5054
6051 -5054 6418 -417 6265 10516 3284 -2582 -13363 -23527 -25351 -9730 1160 -6445 -10062 -2514
6037 -2514 9188 10807 6888 -2762 -9008 -5727 -6877 -16487 -21622 -19805 -13242 -4452 -5513 -347 4728
6022 4728 10852 5660 2692 9131 17862 16605 6854 -3256 -13516 -2092 11924 9045 6946 -1745
6008 -1745 -17025 -24382 -19008 -19861 -18787 -15924 -17305 -12144 -12257 -10738 -4688 -7865 -24854 -17114 -24179
5993 -24179 -22386 -10826 -11194 -18844 -18076 -7111 -27099 -43440 -32194 -5054 -3058 -13869 -13989 -17015
5979 -17015 -16652 -14457 -8262 -18043 -19664 -25304 -13172 -15049 -18405 -14080 -2169 -17527 -20247 -9890
5965 -9890 -8350 -5638 -14295 -19108 -15202 -20793 -27659 -28117 -32731 -39376 -31259 -19132 -7763 -3364 -13343
5950a3343J7385M547q608j3616o93J769L528O297Q761m972p481L56j586L607l300
5935g349n560J895p186n538J1842J5492M867p305l174n10K866n020J2361Q747
5921A6428m171r761n63Q151r901m024L296J4145m28o023j135j1878k591M89N451
5906b515K872r323P607r895J284J9721O586q277n168k655L991q388j279L016J1979
5891I556O907k5333k562K1420J7391J44j4849q372o942j212j4052K819p356p79
5877b3220J3011J541J2478m953q105J4786O232P228K95q778j4120n414k145J639
5863i525L401M268k381K949j1100j1905L049O955P831N801o820R602N886n799
5849B212k978q722j139m423J0377J0501q239j9750j784Q284K460N516P930k813
$$ plain form
5950 -13343 4042 8589 -19 -13635 -14328 -12559 -9031 -2734 6027 1055 -6426 -6070 -7656 -4049 -7349
5935 -7349 -12909 -11014 -18200 -23738 -11896 3596 8463 1158 -2016 -2526 340 -4680 7681 16428
5921 16428 12257 2496 1933 10084 183 -3841 -545 13600 13172 7149 6014 -5864 -8455 -7966 -2515
5906 -2515 357 -8966 -1359 -11254 -9970 9751 16337 8060 2892 237 4228 -4160 -5439 -2423 9556
5891 9556 16463 -8870 -11432 9988 27379 27523 12674 4302 -2640 -3852 -17904 -15085 -22441 -23220
5877 -23220 -10209 -8668 3810 -1143 -9248 5538 11770 18998 19293 10515 -3605 -9019 -11164 -9525
5863 -9525 -6124 -1856 -4237 -1288 -12388 -24293 -21244 -14289 -6458 -657 -7477 2125 8011 2212
5849 2212 -766 -9488 -10627 -15050 -4673 5828 -2411 -22161 -23945 -15661 -13201 -7685 245 -2568
5835b568o158j0091r749O49J5694L557J1M926k374j3962K185J954N72O223n720
5820a4851l93J3550J4838O563j2122j2346m614J562Q354P812m719o075P013J0667
5806A5239l578r196o711q348R149O051J518l776R145J2234k640j3357N626j732
5792I624j1548j0313M164L786k08N60L361k655K47O457K0582M935m442p255j1953
5777E342j5494L297o36J9944J1594L698n930N334j003o66l18K613k627j1571j0546
5762C031L725l428k3532j947M782n497J3892J7981j0672r636l082Q412J1797J348
5748G174k6536j4507j324O988J6034M368N301k53j0369o096j491J683J657J7188
5734a83R956P930m408n101n53J800K281j366q431j2162j3115K269J4569J5536
$$ plain form
5835 -2568 -8726 -18817 -28566 -27917 -12223 -8666 -8655 -3729 -6103 -20065 -17880 -15926 -15354 -9131 -14851
5820 -14851 -15244 -1694 13144 19707 7585 -4761 -9375 -7813 541 8353 3634 -2441 4572 15239
5806 15239 11661 2465 -4246 -12594 -3445 2606 4124 348 9493 21727 19087 5730 11356 9624
5792 9624 -1924 -12237 -8073 -4287 -4495 -3935 -574 -3229 -2982 3475 24057 28992 24550 17295 5342
5777 5342 -10152 -6855 -7491 12453 24047 27745 21815 27149 26146 25480 25162 27775 25148 13577 3031
5762 3031 6756 3328 -20204 -22151 -17369 -22866 -8974 9007 -1665 -11301 -14383 -5971 5826 7174
5748 7174 -19362 -33869 -35193 -28205 -12171 -7803 -2502 -2755 -13124 -19220 -20711 -19028 -17371 -183
5734 -183 9773 17703 13295 8194 7641 9441 11722 10356 1925 -10237 -23352 -21083 -6514 9022
5720I022Q58K249O674o538o645J050n846j0235m345J4571J9069r667j5361J2464
5706G320R77p54j978N276J057o563K929n482k146k550M739n542J1625K967J024
5691A2899q138N15j8635k1390O265J4084l070J6378K2758j2008j0927p609o791
5678a5669J74p519L47R709Q714n9L911j540p914j7535K714K9458N496k530j841
5663E916o749q047o563L906J269n915K4020J9021j2228l711j933j1123n955p167
5649a5259O926R160J5818J0311n759r876j7551M634M146R46j0026P1Q842O495
5635H878N847J2520k455o86L53k734o493j3533n901o687o223P237J2838n401k0949
5620b3389q623J6789J521J0202m859r895P072O692L67j0674N842J5260p635m214
$$ plain form
5720 9022 9880 12129 18803 12265 5620 6670 824 -9411 -13756 815 19884 10217 -5144 7320
5706 7320 8297 7543 5565 10841 11898 5335 8264 2782 636 -1914 2825 -2717 8908 11875 12899
5691 12899 4761 5276 -13359 -34749 -28484 -14400 -17470 -1092 21666 9658 -1269 -8878 -15669
5678 -15669 -15495 -23014 -22667 -12958 -4244 -4303 -392 -1932 -9846 -27381 -24667 4791 10287 7757 5916
5663 5916 -833 -8880 -15443 -11537 -10268 -16183 7837 26858 14630 10919 8986 -2137 -8092 -15259
5649 -15259 -8333 827 16645 26956 21197 11321 -6230 -1596 2550 3496 -6530 -6459 2383 8878
5635 8878 14725 27245 24790 24104 24457 21723 15230 1697 -4204 -10891 -17114 -9877 2961 -2440 -23389
5620 -23389 -32012 -15223 -13702 -3500 -8359 -18254 -11182 -4490 -4123 -14797 -8955 6305 -1330 -5544
5606e544n902J5705j0182j6724n19R449R197J4864j0380j194l178j84J4320J031
5592A0759M243J1104j9590j3978L253J31L22J0318j1164L417J3084J3580j412
5579B4067j6333r079j0226j0892j196N468J8951P446k911L968n002p275j5501
5566a8515j7458j983l452J2789P784J3810J9163N542k406j1154m907j0167N77
5553a0377j577m178j01l120P175J3917J1301Q469j2901j5047q507n645J0435n733
5539a5889q137N713M290P774M483n270p605P574j685k709P462r17j4725j1483
5525c1124K971J8243J8483J2945j0674r626J14j5360j642Q964N995K51J721R64
5511B225m199N910K342q808j3230p48M030n530j7429Q669J2184R156L055L132
$$ plain form
5606 -5544 -11446 4259 -5923 -22647 -23166 -13717 -4520 10344 -36 -1230 -4408 -4592 9728 10759
5592 10759 15002 26106 6516 -7462 -4209 -4078 -3756 6562 -4602 -1185 11899 25479 24067
5579 24067 7734 -1345 -11571 -22463 -23659 -18191 760 8206 5295 9263 4261 -3014 -18515
5566 -18515 -35973 -37956 -41408 -28619 -20835 -7025 12138 17680 15274 4120 -787 -10954 -10377
5553 -10377 -11954 -16132 -16233 -19353 -12178 1739 13040 21509 8608 -6439 -14946 -20591 -10156 -15889
5539 -15889 -24026 -18313 -14023 -6249 -1766 -7036 -14641 -7067 -8752 -11461 -3999 -4916 -19641 -31124
5525 -31124 -28153 -9910 8573 21518 10844 1218 1332 -14028 -15670 -6706 -711 -460 1261 2225
5511 2225 -1974 3936 6278 -2530 -15760 -16508 -12478 -18008 -35437 -26768 -14584 -5428 -2373 759
5497G59R037n779j176N532j1534l453P971m511q013j2267J5626J633P2J0730J0492
5482A5119j8815j011N29J1464m29j7809j3989j210M547J041M567l078J268J0640
5468g166P625l103P210K678K718j1411j4771M059J1747Q296j2672l508Q278M603
5454D583j766o520p501l441J668J1985L090R09l006n318n240m701J198k011N604
5439a0467R530O519j1138p49N048M935K184j4590l109J642k221n143r66K543J2891
5424c091j38o050j2102j1842L744m395M042J3096n45K395l137M641p047K785k276
5409a9920J37M554J3071J4508m62p107l178k77J707j2859j0067K579J8627J2259
5395A3572J705M48k310j5915l318J809P074J4200J1564P093q417k245j5720j4380
$$ plain form
5497 759 9796 4017 2841 8373 -3161 -6614 1357 -3154 -11167 -23434 -7808 -6175 -6103 4627 15119
5482 15119 -3696 -4707 -4178 7286 6857 -10952 -24941 -26151 -21604 -20563 -15996 -19074 -17806 -7166
5468 -7166 459 -2644 4566 7244 9962 -1449 -16220 -12161 -414 7882 -4790 -8298 -20 4583
5454 4583 2817 -3703 -11204 -14645 -12977 -992 2098 3007 1 -5317 -10557 -15258 -14060 -16071 -10467
5439 -10467 -937 5582 -5556 -6305 -1257 3678 5862 -8728 -11837 -10195 -12416 -17559 -18525 -15982 -3091
5424 -3091 -3229 -9279 -21381 -33223 -29479 -33874 -29832 -16736 -17281 -14886 -18023 -13382 -20429 -17644 -19920
5409 -19920 -19783 -15229 -2158 12350 11888 4781 1603 1326 3033 -9826 -19893 -17314 1313 13572
5395 13572 15277 15725 13415 -2500 -5818 -4009 3065 17265 28829 35922 27505 25260 9540 -4840
5381d840j1797j1680k183J3152O309J9838J3975k832k2415j6972J3194J2435p058
5368h74j3618J3217o51K2J5681r97N008J2391O417n950j1024o645j4985j0741
5354a2749n72J4437Q519p83r849j5318k298O505P056M446N519O499L449j702m835
5339H324j0001q518J187L677p933K658J4927R508L258p830j3589n046M749Q491
5325C862n372N741L847l725n647r664P888J0458o513q366p426j271q116r64L035
5310b2233l302P767L944L393M122J0264Q651J106j147K471j0530k048J848m24
5296C882n302j751P761O112n565l912l687q646j1298j168J4392J1827j4605k13
5282a2173P619Q228J259j6114p157J1462K849l09j1091j441P551K690j520j121
$$ plain form
5381 -4840 -16637 -28317 -30500 -17348 -11039 8799 22774 19942 -2473 -19445 -6251 6184 -874
5368 -874 -14492 -1275 -1926 -1904 13777 12780 17788 30179 36596 30646 19622 12977 -2008 -12749
5354 -12749 -13321 1116 9635 8852 -997 -16315 -18613 -12108 -5052 -606 4913 11412 14861 13159 8324
5339 8324 -1677 -10195 -9008 -5331 -13264 -10606 4321 13829 17087 9257 -4332 -9378 -4629 3862
5325 3862 -1510 4231 8078 4353 -1294 -10958 -3070 7388 875 -7491 -14917 -16188 -24304 -25268 -22233
5310 -22233 -25535 -17768 -13824 -10431 -6309 3955 12606 13712 12565 15036 4506 2458 4306 3882
5296 3882 -1420 -3171 4590 10702 5137 1225 -2462 -11108 -22406 -23574 -9182 2645 -11960 -12173
5282 -12173 -4554 3674 4933 -11181 -18338 -6876 -4027 -4336 -15427 -16868 -9317 -6627 -8147 -9268
5268i268L999m693j0814l600J1927P168o85q083J191K98N921j768j5475M185K2751
5253C054j001j8995j4477k427J7351J7858J980o120r621j275j496J9094J052j7034
5239a2057q847M732N776J6121P581q218l735M374L32j0737j0553k691j741O072
5225a3591r974j1678P962k187J3150J1355O256K342K273J558k74L365K003j503
5211A1057j0791j745k27j3198n405Q420P582L179m429r296J4300J2274p262L756
5197H215j4174k045L833j563r596k519N86p864N02J363Q697J1177Q997m025o994
5182e410K542o14m942l966J3906R905O608O049j7966j0029j105M474L102J764
5168D318L490J5897o185q213j4844q135j12M197J0434m117j2947p136o766J620
$$ plain form
5268 -9268 -5269 -9962 -20776 -24376 -12449 -5281 -5966 -14049 -12858 -12560 -6639 -8407 -23882 -19697 3054
5253 3054 2053 -16942 -31419 -33846 -16495 1363 3343 -2777 -12398 -13673 -15169 3925 4977 -12057
5239 -12057 -20904 -16172 -10396 5725 13306 5088 1353 5727 6059 -4678 -15231 -17922 -19663 -13591
5225 -13591 -23565 -35243 -27281 -29468 -16318 -4963 1293 3635 5908 7466 7192 10557 12560 11057
5211 11057 266 -1479 -1706 -14904 -20309 -11889 -4307 -1128 -5557 -14853 -553 11721 4459 8215
5197 8215 -5959 -8004 -4171 -5734 -15330 -17849 -17263 -25127 -24625 -23262 -14565 -3388 5609 1584 -5410
5182 -5410 -2868 -3482 -8424 -12390 1516 11421 18029 24078 6112 -3917 -5022 -548 2554 4318
5168 4318 7808 23705 17520 9307 -5537 -13672 -13784 -9587 847 -3270 -16217 -23353 -30119 -28499
5154b8499o188k439R739K5072J9229p302n456p375Q511J813J346J475m311q269
5140b654r616j135J5562J320j3473M904r062J2035n248j0856l36N121N883Q067
5126E12J0705L043M090k152k7484o997O07k154J7951J0855r255J86P602l322j3456
5111i269m862J7896P88o707o82M74j598j733j1288J1209J6301P443k0821j6076
5097a8925q649L445J2516k652R057J7120P859j0764Q113L093j1856q056k0019
5084a9718r577K258J9301L238j1476n47J2022J1915N51o46l286O118o49j3904
5070d400l331o302n919j157O161J0891J1878o727j8589l750R777R754O19o183
5056g278k512p296K897q74k90J3719o11q541j9174M068J7049M765R942J689n486
$$ plain form
5154 -28499 -34687 -37126 -27387 -2315 16914 9612 4156 -3219 5292 7105 8451 9926 5615 -2654
5140 -2654 -12270 -13405 2157 3477 -9996 -5092 -14154 -2119 -7367 -18223 -18559 -13438 -7555 512
5126 512 11217 14260 18350 16198 -11286 -18283 -17676 -19830 -1879 8976 -279 -93 7509 4187 -9269
5111 -9269 -14131 3765 4553 -2154 -2836 -2362 -3960 -5693 -16981 -5772 10529 17972 -2849 -18925
5097 -18925 -27574 -24129 -11613 -14265 -5208 11912 19771 9007 17120 20213 8357 301 -19718
5084 -19718 -29295 -27037 -7736 -4498 -15974 -16521 -4499 7416 7967 7321 4035 10153 9504 -4400
5070 -4400 -7731 -14033 -19952 -21109 -14948 -4057 7821 1094 -17495 -21245 -11468 -1714 -1095 -7278
5056 -7278 -9790 -17086 -14189 -15063 -15353 -1634 -2245 -10786 -29960 -25892 -8843 -4078 5864 7553 2067
5041B067j174J7275P224r279j3128o736R184Q74K832q097m902L097o308l562J2225
5026A592R179L974m260j8190N563Q543K037l069q410N896J781N292j5623o798
5012a2493O329j0261Q580M118n863O028J9442k244j6291J676j721J587p889N862
4998c140O211M804N757j6105r031R066K236K3Q267J610n911N63o995k70J5522
4983A2607J0856q987l716o241j4444p946J1312L512m689j335J45Q5J4076l398
4969A837j3715P129j0684m681J1284L895N52K599J608J72n994l123j922J839N841
4954c363o786K085l232L098P308O182R354n017j0859N514p75k288j0651p79k836
4939a3045k446J1275J0785R785j0979j1165l769n321M089J1366M928m20K413N478
$$ plain form
5041 2067 893 18168 25392 16113 2985 -3751 5433 6307 9139 1042 -3860 -763 -7071 -10633 1592
5026 1592 10771 14745 10485 -7705 -2142 6401 8438 5369 -3041 2855 4636 9928 -5695 -12493
5012 -12493 -6164 -16425 -7845 -3727 -9590 -3562 15880 13636 -2655 -979 -2700 -1113 -9002 -3140
4998 -3140 3071 7875 13632 -2473 -11504 -2438 -202 -179 8088 9698 3787 4350 -2645 -2915 12607
4983 12607 23463 14476 10760 4519 -9925 -17871 -6559 -3047 -7736 -9071 -8926 -8841 5235 1837
4969 1837 -11878 -4749 -15433 -20114 -8830 -4935 -4383 -1784 -176 -4 -5998 -9121 -11043 -9204 -3363
4954 -3363 -10149 -8064 -11296 -8198 -890 5292 14646 9629 -1230 4284 3509 1221 -9430 -10209 -13045
4939 -13045 -15491 -4216 6569 16354 5375 -5790 -9559 -14880 -10791 575 5503 5083 7496 12974
4925A2974j197q965m970j125p176J4513K2002R443q473n518j5473J910J0432n526
4911A2851j1800J458M79q531r170mN878J2489J4628p873q467m573q135K617J0859
4896B706r454J566J871N384l329n833K829K667j479q602j6262j760N653J0352
4882a3691m316o908K929j4254m303O459J6988K200j049k926K11J3606K0410P301
4868B2657k1249p473m771p152o172J7722J1993j626m337j2241J4120M217p4j082
4854D532M764P276J162j4756O015n643K008j563K788k23O989j0401j6321l065
4840a6438n583o5L13P349L718l345L518J8411J068P197m683k264q176j6284m147
4825a9411N634M03j428Q725m525k181L993m000j0250o744o308n26J659m111O545
$$ plain form
4925 12974 11777 2812 -2158 -3283 -10459 4054 26056 35499 27026 21508 6035 7945 18377 12851
4911 12851 1051 2509 2988 -5543 -14713 -14717 -8839 3650 18278 10405 1938 -2635 -10770 -8153 2706
4896 2706 -6748 -5182 -3311 2073 -1256 -7089 -4260 -1593 -3072 -11674 -27936 -29696 -24043 -13691
4882 -13691 -18007 -24915 -21986 -36240 -40543 -34084 -17096 -14896 -15945 -18871 -18660 -5054 15356 22657
4868 22657 1408 -6065 -10836 -17988 -24160 -6438 5555 3929 -408 -12649 1471 5688 5614 4532
4854 4532 9296 16572 17734 2978 8993 3350 5358 3795 6583 6360 13349 2948 -13373 -16438
4840 -16438 -22021 -22086 -21773 -14424 -10706 -14051 -10533 7878 8946 16143 11460 9196 1020 -15264 -19411
4825 -19411 -13777 -13374 -14802 -6077 -10602 -12783 -8790 -12790 -23040 -29784 -36092 -36618 -34959 -39070 -32525
4810c2525K920P435L664Q503J973o522K42O920l179k227p229l899p122Q579J78
4795b2289P86r570j0388J4207L0441R053r674j1164o190J691P935p210J1424m100
4781e048j8863P512N04l44l355q675m092R452J2766O424O380M237m238k301N350
4766E709K467k949n680L291j0132r0K769J2537M26j5514j1431O05k854P364L718
4751i764n05R228q858j6430j1278J5556J9587J183n065N404N878L628q880l571
4737c887J6l343r047J2787k451o898l511m503m23J4832J5338M355J007j6285J694
4722c19k971J0518K836j2115q956p066J0513R516k841j080O022J692j4638l70
4708i259J0323l34j2110p576J0492q29O69J226j4261j462K127M431L10o82K607
$$ plain form
4810 -32525 -29605 -22170 -18506 -10003 -8030 -14552 -14310 -7390 -10569 -12796 -20025 -23924 -31046 -22467 -22289
4795 -22289 -21503 -31073 -41461 -27254 3187 12240 2566 -8598 -14788 -13097 -5162 -12372 -948 -5048
4781 -5048 -23911 -16399 -15895 -16239 -19594 -28269 -32361 -22909 -10143 -3719 2661 6898 2660 359 5709
4766 5709 8176 5227 -453 2838 -7294 -7384 -4615 7922 8348 -7166 -18597 -17992 -20846 -13482 -9764
4751 -9764 -10269 -1041 -9899 -26329 -37607 -22051 -2464 -1281 -6346 -942 4936 8564 -316 -3887
4737 -3887 -3871 -7214 -16261 -3474 -5925 -12823 -16334 -20837 -21260 -6428 8910 13265 14272 -2013 -319
4722 -319 -3290 7228 10064 -2051 -11007 -18073 -7560 1956 -885 -1965 4057 5749 -8889 -9259
4708 -9259 1064 730 -11380 -18956 -8464 -9293 -8624 -7398 -21659 -23121 -20994 -16563 -16253 -16935 -14328
4693a4328j0691p611K335Q768K0977k271O6J1458J6733n957k1980j1547O991R605
4679B548j1512j1633L71j785N252M01k559J0366J8394j395l495l283o784r050
4665a4164Q434N935r032N543J8695R112m627n160q149j1967M726j668O379j288
4651B769N931M110L96n205j2636n233l002n652m106J954N702r3M510Q114P347
4636D906J802j0322J410J4767J7482N567j1325j2619J0322m928k611N977p200
4623A3228q372j8704j497R479K692L886j135n316m480l223m480j1037J202Q673
4609a9084K0621p231j7520O315M467p654l62j740n710J045Q704J4170J1398l0
4595G389L97l299K89j0653J049m76N820r213m136l869k186J1868l430o946J0506
$$ plain form
4693 -14328 -25019 -32630 -30295 -21527 -550 -2821 -2755 8703 25436 19479 -2501 -14048 -7057 2548
4679 2548 -8964 -20597 -20226 -22011 -16759 -16358 -18917 -8551 9843 8448 4953 1670 -5114 -14164
4665 -14164 -5730 205 -8827 -3284 15411 24523 19896 14736 6587 -5380 -654 -2322 4057 2769
4651 2769 8700 12810 13206 8001 -4635 -9868 -12870 -18522 -22628 -20674 -14972 -15065 -10555 -2441 4906
4636 4906 6708 -3614 -2204 12563 30045 35612 24287 11668 21990 17062 14451 20428 13228
4623 13228 4856 -13848 -15345 -5866 -3174 712 -423 -5739 -10219 -13442 -17922 -28959 -27757 -19084
4609 -19084 1537 -5694 -23214 -16899 -12432 -20086 -20448 -22188 -27898 -26853 -18149 -3979 7419 7389
4595 7389 7786 4487 4776 -5877 -4828 -5304 516 -8697 -12833 -16702 -18888 -7020 -10450 -17396 -6890
4580f890K0795J1738L066L541r155l42j5016l535M838l684j3328q258N618P953
4566b659j662O875L681k678k653J914o889m136R448q857n367J730J0279J1095
4552A0121K532M933j222p020r069L750j7271r13J5326J2690M931j0245j4762P56
4538e463l539P432J8839o352q687j1004m953L780J2084J0967l486j1582p799o02
4524a0365q25m842j133j065N260J2845L731j0425J518J145L917J6437l392q639
4510D167o592r152k319J7902L207m982o699K783J7466Q325r461j9971J0247Q944
4496A3865N750j0821q379n594P444m050j1181j2425J6061M821J520j3203M037
4483a2155R352k138N214q341j1643l983j11Q371L975k198J463P143J206o370k939
$$ plain form
4580 -6890 13905 25643 28709 32250 23095 22753 7737 4202 9040 5356 -7972 -16230 -10612 -2659
4566 -2659 -4321 2554 6235 3557 904 2818 -4071 -8207 1241 -7616 -12983 -11253 -974 10121
4552 10121 12653 17586 16364 9344 275 4025 -13246 -14159 1167 13857 18788 8543 -6219 -5463
4538 -5463 -9002 -1570 17269 10917 2230 -8774 -13727 -9947 2137 13104 9618 -1964 -9763 -10365
4524 -10365 -11190 -16032 -17165 -18230 -12970 -125 3606 -6819 -5301 -4156 -239 16198 12806 4167
4510 4167 -2425 -11577 -13896 4006 7213 2231 -4468 -1685 15781 24106 14645 -5326 4921 13865
4496 13865 19615 8794 415 -5179 2265 -1785 -12966 -25391 -9330 -4509 -2989 -16192 -12155
4483 -12155 -2803 -4941 273 -8068 -19711 -23694 -23805 -15434 -11459 -13657 -12194 -5051 -3845 -10215 -13154
4468a3154n416J3654o510n358J1961k21j8954r12n164M524J3369J2587M972K068
4454G446n042M336n506p483o208J1629k622J60n338N633m479J047J6j935J137
4439g209J893M698P98J0974N104j4309M326r685k6529o725K8752J4616M15J827
4425H946q317M513o70N725p142p23L360R523n144p565j553p367J238K272J098
4410a806j098J3258n891j8473l537M001J1183K7786M902j4382k373j1657o540
4397d627M565O33O285K1269n918k3097j0012n957P433J5090j7885n875r98J6511
4383b583K611r90M385j3726r359K7767J0376M797p195q410j834j819M372K49l944
4368D697N762l191j1248l583K36j918K286O028N744j27j412j2794p872P004l440
$$ plain form
4468 -13154 -18570 -4916 -11426 -16784 -4823 -5044 -23998 -24910 -30074 -25550 -12181 406 5378 7446
4454 7446 2404 6740 1234 -6249 -12457 -828 -3450 -3290 -8628 -2995 -7474 -6427 -6411 -8346 -7209
4439 -7209 -5316 -618 180 11154 16258 1949 6275 -3410 -29939 -36664 -7912 6704 7119 8946
4425 8946 629 5142 4472 10197 3055 2332 5692 15215 10071 2506 953 -6414 -5176 -2904 -1806
4410 -1806 -2904 10354 4463 -14010 -17547 -13546 -2363 25423 30325 15943 13570 1913 -4627
4397 -4627 -62 571 6856 28125 22207 -890 -10902 -16859 -9426 5664 -12221 -18096 -19094 -2583
4383 -2583 28 -962 3423 -10303 -19662 8105 18481 23278 16083 7673 5839 4020 8392 8641 4697
4368 4697 10459 7268 -3980 -7563 -7327 -9245 -6959 -931 4813 4686 3274 -9520 -17392 -10388 -13828
4353a3828n926J697P075M036q687J3269k9L691J363o05J3305P563j9949r543l588
4338a0156J2900R960p329j1642J445R98N750l799j1212l154j5329J073J7442P334
4324e719J6609l110k1175j2668l16J44J1561P742l095j6620L653l206j0066O788
4310b9478O60l950n414R63J3838R881m189J0021M40P006K617q394p320j156p915
4295b2390j261J2651M967P266m31n760j8421o402K1309r55j0738k787K152J7444
4281c356J7692K62k6j7027L868k819k136N472J779o565n880J5328Q264j1412n759
4266b315r313m044n728r720M190l412j557J232J596N807N580j208K295P217J302
4251h078K055j8374l456R838J5970O69r145m640o501o248J6337J1569O092l513
$$ plain form
4353 -13828 -19754 -18057 -10982 -6946 -15633 -2364 -2393 1298 2661 2056 15361 22924 2975 -6568 -10156
4338 -10156 2744 12704 5375 -6267 -4822 -3824 1926 -1873 -13085 -16239 -31568 -30495 -13053 -5719
4324 -5719 10890 7780 -13395 -26063 -26379 -26235 -14674 -6932 -10027 -26647 -22994 -26200 -36266 -29478
4310 -29478 -28818 -32768 -38182 -37219 -23381 -13500 -17689 -7668 -7228 -222 2395 -5999 -13319 -14475 -22390
4295 -22390 -23651 -11000 -6033 1233 802 -4958 -23379 -29781 -8472 -9427 -20165 -22952 -20800 -3356
4281 -3356 14336 14598 14572 -2455 1413 -1406 -3542 1930 3709 -2856 -8736 6592 14856 3444 -2315
4266 -2315 -11628 -15672 -21400 -31120 -26930 -30342 -31899 -30667 -29071 -23264 -17684 -18892 -16597 -9380 -8078
4251 -8078 -6023 -24397 -27853 -18015 -2045 -1376 -10521 -15161 -21662 -27910 -11573 -4 6088 2575
4237B575p998N719L666o057q811l40J6924m219k0643L017k45M695Q42M941j755
4222g689J6334K0000j7636j979J3802l304j2451j4098q223K864l0004j835M875
4209c9344Q296j302P372J8663O224j1683j375o542J3569O691Q647O539j3692p656
4195e593n163N613R391q887j3321M084n457l733K406N008q120J463Q349q695J4
4180b2641r43J1336J2501M485l349r896N21J2551m543r7m769J1013J7712p858
4166A6023n915j8603j2570J716J1080j98L481L642j2323n607n795K370Q952p91
4152a4538L118M145m138j2261J2687J3975J788o667j0461K449J2616o259j2931
4139a6477m953N477m537M583O422J2839m69o284m707J0940j0677r856q688p27
$$ plain form
4237 2575 -5423 296 3962 -2095 -10906 -11246 5678 1459 -19184 -16167 -16412 -11717 -10875 -5934 -7689
4222 -7689 8645 28645 11009 9030 22832 19528 7077 -7021 -15244 -12380 -42384 -44219 -39344
4209 -39344 -31048 -32350 -24978 -6315 -91 -11774 -13149 -19691 -6122 569 9216 15755 2063 -5593
4195 -5593 -10756 -5143 4248 -4639 -17960 -13876 -19333 -23066 -20660 -15652 -23772 -22309 -13960 -22655 -22641
4180 -22641 -23584 -12248 253 4738 1389 -8507 -7986 4565 22 -75 -4844 6169 23881 16023
4166 16023 10108 -8495 -21065 -19349 -8269 -8467 -4986 -1344 -13667 -19274 -25069 -22699 -13747 -14538
4152 -14538 -11420 -7275 -11413 -23674 -10987 2988 4776 -1891 -12352 -9903 2713 -3546 -16477
4139 -16477 -21430 -15953 -20490 -15907 -9485 3354 2885 -3399 -8106 2834 -7843 -17699 -26387 -27114
4125b7114J0818P14M173J5901N372k65j857j7138j2578K811J2319n862j7938l756
4111c4400J4067J2539M904O008L148j0321j7891n686O880R286M723K87p255K9
4097a3682N21L685P711J511j0830n376J796J0046q015L563L346J4954M764j3883
4083A11K31r479K856n574m894L275o55P544j46m626N171J1046o650N271Q439k7
4067A1893j1844n453R042J002p988o217J156k311N702n9j485M049N448Q34j386
4052B383q006j5551n151J530J733J0251k039p50m104n645N692R361N453Q417p655
4037d081k685M206m353L519N850K841q824m162l057K287P089N585n852n793K846
4022d584R124J329J135R467n256O2l629j4468J0703P107M235J779k317m04l084
$$ plain form
4125 -27114 -16296 -15582 -11409 4492 9864 9599 7742 -9396 -21974 -19163 -6844 -12706 -30644 -34400
4111 -34400 -20333 -7794 -2890 3118 6266 -4055 -21946 -27632 -20752 -11466 -6743 -6456 -13711 -13682
4097 -13682 -13161 -9476 -1765 -254 -11084 -16460 -14664 -4618 -12633 -9070 -5724 9230 13994 111
4083 111 342 -9137 -6281 -11855 -16749 -13474 -14129 -6585 -6731 -11357 -6186 4860 -1790 3481 11920 11893
4067 11893 49 -5404 3638 4640 -3348 -9565 -8409 -10720 -5018 -5077 -6562 -2513 2935 3769 2383
4052 2383 -5623 -21174 -26325 -24795 -23062 -12811 -14850 -15600 -19704 -25349 -19657 -10296 -4843 3574 -4081
4037 -4081 -6766 -2560 -6913 -3394 2456 5297 -3527 -7689 -10746 -8459 -1370 4215 -1637 -7430 -4584
4022 -4584 4540 5869 7004 16471 11215 11277 7648 -6820 3883 10990 15225 17004 14687 14283 11199
4007A1199j417q993j0191o703q23J9240r053L464j999P294Q930r389k0309r902
3993b8652O904P048m812M142j7K903J638M974m777o891L516o882n074K575n54
3978b3959J7885Q649k973o479P443O765q247n401J128K451K437n60j4062j0160
3964b5083J708J6771Q199N912j1000n475M27l129n813q576M657n963N478R506
3950a2381m248K135L373J38L39K149J173N229J1425r317j6751p025n485m118N387
$$ plain form
4007 11199 9782 789 -9402 -16105 -16928 2312 -6741 -3277 -5276 2018 10948 1559 -18750 -28652
3993 -28652 -21748 -14700 -19512 -15370 -15387 -12484 -10846 -5872 -10649 -17540 -14024 -20906 -25980 -23405 -23959
3978 -23959 -6074 2575 -398 -6877 566 7331 -916 -6317 -5189 -2738 -301 -861 -14923 -25083
3964 -25083 -23375 -6604 1595 7507 -3493 -8968 -8541 -11670 -17483 -26059 -21402 -27365 -21887 -12381
3950 -12381 -16629 -14494 -11121 -10983 -10644 -8495 -7322 -2093 9332 15 -16736 -23761 -29246 -33364 -27977
$$ [...]
##END NTUPLES=NMR SPECTRUM
##END=
