##TITLE=Analysis number 314719
Compound Code cc 45616
Book Reference 440/80
Project Code adrs
Chemist Name craigr
##JCAMPDX= 6.0         $$ Bruker NMR JCAMP-DX V2.0
##DATA TYPE= NMR SPECTRUM
##DATA CLASS= NTUPLES
##ORIGIN= Bruker BioSpin GmbH
##OWNER= NMR
$$ XWIN-NMR		Version 3.5
$$ Tue Oct 25 10:58:21 2005 GMT Daylight Time (UT+1h)  MAYBRIDGE\NMR@NMR_250MHZ
##.OBSERVE FREQUENCY= 250.131544655141
##.OBSERVE NUCLEUS= ^1H
##.ACQUISITION MODE= SIMULTANEOUS (DQD)
##.ACQUISITION SCHEME= undefined
##.AVERAGES= 16
##.DIGITISER RES= 18
##SPECTROMETER/DATA SYSTEM= dpx250
##.PULSE SEQUENCE= zg30
##.SOLVENT NAME= CDCl3
##.SHIFT REFERENCE= (INTERNAL, CDCl3, 0, 16.522)
##AUDIT TRAIL= $$ (NUMBER, WHEN, WHO, WHERE, WHAT)
$$ ##TITLE= Audit trail, XWIN-NMR		Version 3.5
$$ ##JCAMPDX= 5.01
$$ ##ORIGIN= Bruker BioSpin GmbH
$$ ##OWNER= NMR
$$ C:\u/data/dgb/nmr/ADRS/11350/pdata/1/auditp.txt
$$ ##AUDIT TRAIL=  $$ (NUMBER, WHEN, WHO, WHERE, WHAT)
(   1,<2005-10-25 10:57:45.96 +100>,<MAYBRIDGE\NMR>,<NMR_250MHZ>,
      <created by zg, POWCHK disabled, PULCHK disabled
       configuration hash MD5:
       62 19 C7 07 E1 42 D1 B7 37 6C 3D D0 77 39 F9 E6
       data hash MD5: 64K
       4D EC B5 04 32 21 8F 3F C3 55 B4 12 BF 6A 2D D2>)
(   2,<2005-10-25 10:58:03.16 +100>,<MAYBRIDGE\NMR>,<NMR_250MHZ>,
      <Start of raw data processing
       ef LB = 0.3 FT_mod = 6 PKNL = 1 SI = 32K 
       data hash MD5: 32K
       75 53 1D 43 30 19 75 7C BB CB BF 33 EB 5C 07 AC>)
(   3,<2005-10-25 10:58:08.13 +100>,<MAYBRIDGE\NMR>,<NMR_250MHZ>,
      <apk 
       data hash MD5: 32K
       4E E1 71 7B 0A 45 48 4A B8 D6 C4 96 43 A8 E5 6D>)
(   4,<2005-10-25 10:58:09.97 +100>,<MAYBRIDGE\NMR>,<NMR_250MHZ>,
      <abs ABSG = 5 
       data hash MD5: 32K
       D8 C4 09 08 D5 E6 1E 58 F0 05 A8 B5 CA 44 C9 BA>)
$$ ##END=
$$ 
$$ hash MD5
$$ D6 D0 89 B2 11 44 32 03 8C 74 A2 37 4D 37 2F AF
##$RELAX= 
##$RELAX= 
##$RELAX= 
##$RELAX= 
##$RELAX= 
##$RELAX= 
##$RELAX= 
$$ Bruker specific parameters
$$ --------------------------
##$DU= <C:\u>
##$EXPNO= 11350
##$NAME= <ADRS>
##$PROCNO= 1
##$TYPE= <nmr>
##$USER= <dgb>
##$AMP= (0..31)
100 100 100 100 100 100 100 100 100 100 100 100 100 100 100 100 100 100 
100 100 100 100 100 100 100 100 100 100 100 100 100 100 
##$AQSEQ= 0
##$AQ_mod= 3
##$AUNM= <au_zg>
##$AUTOPOS= <9 >
##$BF1= 250.13
##$BF2= 250.13
##$BF3= 250.13
##$BF4= 250.13
##$BF5= 500.13
##$BF6= 500.13
##$BF7= 500.13
##$BF8= 500.13
##$BYTORDA= 1
##$CFDGTYP= 0
##$CFRGTYP= 5
##$CHEMSTR= <none>
##$CNST= (0..31)
1 1 145 1 1 1 1 1 1 1 1 1 1 1 1 1 1 1 1 1 1 1 1 1 1 1 1 1 1 1 1 1 
##$CPDPRG= <>
##$CPDPRG1= <>
##$CPDPRG2= <>
##$CPDPRG3= <>
##$CPDPRG4= <mlev>
##$CPDPRG5= <mlev>
##$CPDPRG6= <mlev>
##$CPDPRG7= <mlev>
##$CPDPRG8= <mlev>
##$CPDPRGB= <>
##$CPDPRGT= <>
##$D= (0..31)
0 1 0 0 0 0 0 0 0 0.06 0 0 0 0 0 0 0.0002 0 0 0 0 0 0 0 0 0 0 0 0 0 0 
0 
##$DATE= 1130234264
##$DBL= (0..7)
120 120 120 120 120 120 120 120 
##$DBP= (0..7)
150 150 150 150 150 150 150 150 
##$DBP07= 0
##$DBPNAM0= <>
##$DBPNAM1= <>
$$ [...]
##$SUBNAM7= <"">
##$SUBNAM8= <"">
##$SUBNAM9= <"">
##$SW= 20.6930455092707
##$SWIBOX= (0..15)
0 0 3 0 0 0 0 0 0 0 0 0 0 0 0 0 
##$SW_h= 5175.983436853
##$TD= 65536
##$TD0= 1
##$TE= 296.16
##$TE2= 300
##$TE3= 300
##$TEG= 300
##$TL= (0..7)
0 120 120 120 120 120 120 120 
##$TP= (0..7)
150 150 150 150 150 150 150 150 
##$TP07= 0
##$TPNAME0= <>
##$TPNAME1= <>
##$TPNAME2= <>
##$TPNAME3= <>
##$TPNAME4= <>
##$TPNAME5= <>
##$TPNAME6= <>
##$TPNAME7= <>
##$TPOAL= (0..7)
0.5 0.5 0.5 0.5 0.5 0.5 0.5 0.5 
##$TPOFFS= (0..7)
0 0 0 0 0 0 0 0 
##$TUNHIN= 0
##$TUNHOUT= 0
##$TUNXOUT= 0
##$USERA1= <user>
##$USERA2= <user>
##$USERA3= <user>
##$USERA4= <user>
##$USERA5= <user>
##$V9= 5
##$VALIST= <valist>
##$VCLIST= <CCCCCCCCCCCCCCC>
##$VD= 0
##$VDLIST= <DDDDDDDDDDDDDDD>
##$VPLIST= <PPPPPPPPPPPPPPP>
##$VTLIST= <TTTTTTTTTTTTTTT>
##$WBST= 1024
##$WBSW= 4
##$XGAIN= (0..3)
0 0 0 0 
##$XL= 0
##$YL= 0
##$YMAX_a= 502871
##$YMIN_a= -517537
##$ZGOPTNS= <>
##$ZL1= 120
##$ZL2= 120
##$ZL3= 120
##$ZL4= 120
##$ABSF1= 16.522
##$ABSF2= -4.171173
##$ABSG= 5
##$ABSL= 3
##$ALPHA= 0
##$AQORDER= 0
##$ASSFAC= 0
##$ASSFACI= 0
##$ASSFACX= 0
##$ASSWID= 0
##$AUNMP= <proc_1d>
##$AZFE= 0.1
##$AZFW= 0.1
##$BCFW= 0
##$BC_mod= 0
##$BYTORDP= 0
##$COROFFS= 0
##$CY= 12.5
##$DATMOD= 1
##$DC= 0
##$DFILT= <>
##$DTYPP= 0
##$F1P= 14.0000005364418
##$F2P= -0.99999901652339
##$FCOR= 0.5
##$FTSIZE= 32768
##$FT_mod= 6
##$GAMMA= 0
##$GB= 0
##$INTBC= 1
##$INTSCL= 1
##$ISEN= 128
##$LB= 0.3
##$LEV0= 0
##$LPBIN= 0
##$MAXI= 10000
##$MC2= 0
##$MEAN= 0
##$ME_mod= 0
##$MI= 0
##$NCOEF= 0
##$NC_proc= -3
##$NLEV= 6
##$NOISF1= 0
##$NOISF2= 0
##$NSP= 0
##$NTH_PI= 0
##$NZP= 0
##$OFFSET= 16.522
##$PC= 1
##$PHC0= -70.67394
##$PHC1= 4.531193
##$PH_mod= 1
##$PKNL= yes
##$PPARMOD= 0
##$PSCAL= 4
##$PSIGN= 0
##$REVERSE= no
##$SF= 250.13
##$SI= 32768
##$SIGF1= 0
##$SIGF2= 0
##$SINO= 400
##$SIOLD= 32768
##$SREGLST= <1H.CDCl3>
##$SSB= 0
##$STSI= 32768
##$STSR= 0
##$SW_p= 5175.98343685301
##$SYMM= 0
##$S_DEV= 0
##$TDeff= 65536
##$TDoff= 0
##$TI= <Analysis number 999999
Compound Code 99
Book Reference 9
Project Code 9>
##$TILT= no
##$TM1= 0
##$TM2= 0
##$TOPLEV= 0
##$USERP1= <user>
##$USERP2= <user>
##$USERP3= <user>
##$USERP4= <user>
##$USERP5= <user>
##$WDW= 1
##$XDIM= 32768
##$YMAX_p= 334092187
##$YMIN_p= -151514
$$ End of Bruker specific parameters
$$ ---------------------------------
##NTUPLES= NMR SPECTRUM
##VAR_NAME=  FREQUENCY,     SPECTRUM/REAL,   SPECTRUM/IMAG
##SYMBOL=    X,             R,               I
##VAR_TYPE=  INDEPENDENT,   DEPENDENT,       DEPENDENT
##VAR_FORM=  AFFN,          ASDF,            ASDF
##VAR_DIM=   32768,         32768,           32768
##UNITS=     HZ,            ARBITRARY UNITS, ARBITRARY UNITS
##FACTOR=    0.157963299565203, 1,           1
##FIRST=     4132.6476996994, 0,             0
##LAST=      -1043.33573715361, 0,           0
##MIN=       -1043.33573715361, -151514,     0
##MAX=       4132.6476996994, 334092187,     0
$$ Real data points
##PAGE= N=1
##DATA TABLE= (X++(R..R)), XYDATA
$$ [...]
16355h131M301q085o786J8314Q803P264q746Q023L462j4826j1559n027P650N736
16341C93j850k7K367L417j3716j8143p150P011m962L195l286N999J3426R603J2713
16326H990m512j0431q687m217P83J08R102J5655O594p128J4206M544j0494j2503
16312B010p084M861R036p758l501N62J2616Q78r78o562o53o459Q343P488j0340
16297B459k338o758N26L021L911N144q421j2581n606P613J3503J3331O509j4168
16283F145N375J907j7181j0491l277J83O52o730L89O788N554Q524O192R12j0765
16268e823K336o360q221L955J0743N133r210j5640N37O124Q923o797L304K376
16254h620l492J761N414N004L221r359J590j791p348j666j698q131J1278P222
$$ y = [-8131, -3830, -11915, -18701, -387, 8416, 15680, 6934, 14957, 18419, 3593, -7966, -12993, -5343, 393, -1457, -1484, 883, 4300, -9416, -27559, -34709, -27698, -32660, -29465, -32751, -26752, -13326, -3723, 8990, 4478, -5953, -14640, -18857, -18074, -17966, -8864, 6791, 13385, 6257, 20463, 25007, 14513, 2010, -5074, -213, 8823, 1065, -2436, -1874, 10742, 11620, 10642, 4080, 3427, -3032, 5311, 12799, 2459, 121, -6637, -6111, -3090, 821, 5965, -2456, -15037, -20643, -13030, 473, 13804, 20313, 6145, 11520, 13427, -3754, -14245, -17522, -17339, -16687, -23417, -23028, -16240, -10686, -2162, 4030, 4942, -5823, -3487, -9847, -18068, -14113, -3370, 1763, -7447, -23087, -22550, -16426, -7503, -14300, -10996, -8620, -12112, -10351, -4937, 67, 3288, -6071, -4481, -6272, -13620, -15286, -16984, -25115, -13837, -6615]
16240f615k0345m445J1842M032m038P883J4038O243j2826j0582L865P53p020N470
16226a1745l851L924Q517R516j3110j5913n280O506J3223K774J191J734P228n206
16212d92P59J909Q64l898L93M6n279o261K0156J016l943M689j7856q45J1905m865
16196a702n721m794R573N255n35K163p313j15m510l613j1180L290J6786J0620
16182H204O834m33K131j371j464m717q149o216J843r782q16P329K025K0006M442
16167A9866n143K948j0068j1758j2993j2537M504K213r00Q929J3564j193r235
16154a1803o917M822J3092r273p56J5881M722L876j7388P645Q412J3624m632K153
16140B3458j3187j4452k885K50K436L192J990o615K991J24k844j657J3849l487
$$ y = [-6615, -26960, -31405, -19563, -15531, -19569, -11686, 2352, 8595, -4231, -14813, -10948, -10195, -17215, -11745, -15596, -11672, -3155, 6361, -6749, -22662, -27942, -21436, -8213, -5439, -4248, -2514, 4714, -492, 267, 2176, 3040, -858, -465, -419, -5698, -11959, 8197, 9213, 5270, 9959, -7897, -8742, 3163, -1702, -7423, -12217, -2644, 2611, 2076, 4239, -3074, -3189, -7699, -11312, -22492, -19202, -2416, 8204, 15038, 14605, 16736, 15365, 13901, 9184, 1035, -5181, -3338, -13120, -13936, -6607, -4582, 15424, 19866, 14723, 17671, 7603, -4155, -17148, -29685, -25181, -22968, -23868, -14939, -1375, -2568, -11803, -18720, -13898, -806, -10079, -10835, 5046, 9768, 13644, -3744, 3901, 12313, 25937, 21305, 23458, 10271, -4181, -7066, -6816, -4380, -1188, 802, -5813, -2822, -2698, -5542, -7199, 6650, 3163]
16126C163j1074J250k836K487q57K673Q951L437M184j086j0702o630N856J1853
16112A0669N676j1854m60k592N831K115K0281L770l825j3520l1645j418J4192
16099b780O32K761J6144o056j6421l643q087K437j9K403p83m533q53P161K752
16084h885J1979r521r750L329p0P461J4025j658m428N62r128o09k482N187k357
16069f345j4323R398O680J5880q654j2526k673L672N718j840K536O196l989l422
16055c692M297r605o668k027n49P260J4963M424k37j1496k1489J659R533J0774
16041b853R460n899r447k365R850j2132J436J5019K3533p144p363Q9j2506j5675
16027a5997j0337O969N626L318R2j935k289J6438J2669K622r172o148q370n392
$$ y = [3163, -7911, -6661, -9497, -7010, -7867, -5194, 3757, 7194, 11378, 10292, -410, -7040, -1184, 10669, 16345, 4491, 4031, 1439, 7270, 9385, 29666, 33436, 29611, 16091, -15554, -16972, -2780, -2148, 613, 16757, 10701, -5720, -9363, -17450, -15013, -15032, -12629, -13412, -17945, -18798, -11637, -8885, 3094, -6427, -16177, -12848, -12918, -5457, 8568, 6910, 2482, 3044, -6084, -6693, -9175, -3988, -6345, -20668, -11270, -4590, 11290, 2636, -9890, -12563, -8891, -3173, -5013, -2477, 3719, -270, -3692, 605, -9000, -15668, -17695, -18244, -10984, 3979, 8403, 8166, -3330, -24819, -23160, -13627, -2853, 6607, 708, -8739, -11104, -1254, -13386, -11950, 3069, 26602, 19458, 12095, 12184, -322, -15997, -26334, -19365, -13739, -10421, -10329, -12264, -14553, 1885, 14554, 17176, 8004, 1856, -6514, -11906]
16013a1906r798M682K646J0509P768n575M099m59k717p49Q578R505m70M57p634
15998H936k384J499O112m508M375n635k201j349j928J3525r32J135p742m382j0064
15983e543j0349l464J940N12K130R48P828M12n876j1860l501L672J2962J2443
15969B254L772o008N588J6482j5898k5661k686Q315n350k470R794K18n08j70J2491
15954A63J5762R974j2838j5689j1646j2207K822J1885J1957J2087K434k4208p460
15941a6964N819J426J884l368m430P684J080l060J385p832k065M298K0024J2424
15927A8305l438J520J4113q303j0520j0597J4721L610o430m765J299N93m227M335
15913A0216n098n308j478O209O346Q676Q064p583j7147j9463N715P603M331K357
$$ y = [-11906, -21704, -17022, -14376, -3867, 3901, -1674, 2425, 1966, -751, -1500, 7078, 16583, 16113, 16570, 8936, 6552, 8051, 14163, 9655, 14030, 8395, 6194, 4845, 2917, 16442, 15510, 16645, 8903, 4521, -5543, -15892, -19356, -17416, -16904, -14774, -13826, -5998, -5586, -11462, -23322, -26823, -23151, -10189, 2254, 6026, 18, 5606, 22088, 6190, -19471, -22157, -13842, -19192, -21662, -11868, -11650, -12158, -12328, 163, 15925, 25899, 13061, -2628, -14274, -26481, -23659, -11774, 183, 12270, 14704, -9504, -16964, -11145, -9719, -7835, -11203, -15633, -7949, -6869, -9929, -8544, -16376, -18441, -14143, 5881, 18305, 14867, 16387, 30500, 22197, 11677, 1080, 15801, 19411, 12981, 8216, 9515, 10108, 5881, 10216, 5118, -190, -1668, 4541, 10887, 19563, 27627, 20044, 2897, -16566, -10851, -3248, 1083, 3440]
15899C440k75n708J4759o16p928l364l71q44p543k116m111q787l257J2975j744
15884a5490N694J0823O964r261N99J0346M15o483M004J093j3771j014P787n142
15870c436p181j2597M669J196J4582j922r882q445L50J0884j945n541k867j999
15856b4134m34J8809j2715M883Q940k54k467j2204j2850l365j385l195J5276J6200
15842h895N518k839P166R645J52q306j3658j532j2624o721J1898O029O900K856
15828d411p40l61o344N062J385l037n629l622j693J313k678K404R768J172L188
15813d223k063N414o090n012l937M534j233j0264Q718M458N205M214P845M984
15799A2550j84m507j923j3787r221P20j881n686J1668J4147K2496j1484k7642
$$ y = [3440, 3165, -2543, 12216, 11600, 3672, 308, -63, -907, -8450, -10566, -14677, -23464, -26721, -13746, -15490, -9796, 1027, 7991, -1270, -671, 9675, 10090, 3607, 7611, 8704, -5067, -6081, 1706, -3436, -10617, -23214, -18545, -17349, -2767, -4689, -14571, -23016, -22666, -11782, -13727, -19268, -22135, -24134, -24568, -5759, -18474, -13591, -4651, -4905, -7372, -19576, -32426, -35791, -37176, -40371, -25095, -8895, -3377, -6216, 950, 10595, 10747, 2441, -11217, -12749, -25373, -32094, -20196, -14167, -7267, -4411, -5151, -5512, -11856, -6794, -5409, -8446, -14075, -17697, -19390, -18077, -20755, -18351, -8583, -7411, -4223, -6286, -872, -6962, -11974, -15911, -11377, -12610, -22874, -14156, -9698, -4493, -279, 7566, 12550, 12366, 7859, 5936, -7851, -17072, -16352, -18233, -23919, -12251, 1896, 24392, 12908, -14734]
15786a4734j70R381l440o167m804O37q032R425Q840P031p2q136J798Q894M536
15771D987P382J320o496M085L419j280k781j5048j2437j2823l715R588K1429O871
15757D501K882J0399r454r733j2107k105J1641o665N091k970N872o997j812P612
15743c845J1839m081N442k320j5150j0400l136N759L495r966n027J1407J0902
15730e081J51q362r34j4905m81Q174J0013j1209O020P112O504R752K532q126n411
15715d251R40p959L399O47O193o309J6483O579m079m475P546j1517j6911j7470
15701c1184J9957J6945M497L582r185P771K756m895J748j52j1759n400r461o247
15687b1027Q616J1451P642L743N782o176J11k581J59l370r608m938n140r008l313
$$ y = [-14734, -14904, -5523, -8963, -15130, -19934, -19297, -27329, -17904, -9064, -2033, -2105, -10241, -8443, 451, 4987, 12369, 13689, 7193, 11278, 14697, 13417, 10636, -4412, -16849, -29672, -33387, -23799, -2370, 4501, 7383, 17782, 8328, -1405, -13512, -15617, -3976, -10641, -5550, -8520, -2648, -9645, -11457, -3845, 7994, 3913, 9355, 7035, -8115, -18515, -21651, -15892, -12397, -22363, -27390, -15983, -5081, -4930, -13292, -14226, -29131, -29612, -21438, -11425, -22634, -16614, -9502, -2998, 6754, 9286, 1160, -4251, -3311, -11270, -7871, -7224, -1031, -7340, 9143, 15722, 11643, 7168, 14714, 3197, -13714, -31184, -11227, 5718, 10215, 13797, 4612, 12383, 15139, 10244, 11992, 11840, 81, -5319, -14780, -21027, -12411, -960, 6682, 10425, 16207, 10031, 10142, 7561, 7720, 4350, -5258, -10196, -15336, -24344, -27657]
15672b7657M698L0415P478r720j1682j2463q756J1993R587J800q8m372J680R603
15658B516o712l760j883n668j2279k586J235M83J3055P531j3032K250N24N820
15644a2506L709n218R747O076n635j555L366N908O204l926j1975j967O533L865
15630B626J7941p971l037J003j8491l934R133R343J1019j8048k1313j2946m092
15617c8767N689R367J3881J4020O142r785l340R1P920K985k0046r793J0810J1325
15603D99R875O978n220j1200j853J480n636j1839k535J4667J0743O124K219k2297
15589g995q033l59J3590K795j0426N375P442m22n207J3586J5736J343r844j8307
15575g26j3889J565J456n74k214Q493K171n482P595J2014K975j2830j1317J9161
$$ y = [-27657, -22959, 7456, 14934, 5214, -6468, -18931, -27687, -15694, -6107, -4307, -4395, -8767, -7087, 2516, -4196, -7956, -9839, -15507, -27786, -30372, -29137, -28654, -15599, -8068, -21100, -18850, -18326, -12506, -8797, -14015, -4268, 1808, -3827, -5382, -2016, 3892, 10096, 6170, -5805, -7772, -1239, 2626, 20567, 12596, 9559, 10562, -7929, -11863, -2730, 6613, 17632, -416, -21729, -34675, -38767, -33078, -23711, -9830, 4190, 10332, 547, -2793, -2702, 5218, 8203, -11843, -21636, -10826, 499, 10374, 17352, 12132, 932, -921, 559, -5077, -16916, -19451, -4784, 5959, 12083, 14302, -7995, -16028, -16387, -2797, -2, -10428, -5053, 2389, 1967, -3240, 10346, 26082, 27425, 17581, -726, -14615, -13050, -11594, -12168, -14382, -5889, -3718, -9200, -1605, 10409, 13384, 554, -10763, 8398]
15561H398J2468p814n194l689m238J449R462p585M642O051J513j0034l819q210
15547f600R87K195J770P605M038j0767j6083j375M083o486N031K292k000Q549
15533f761l781n815N603J0233J5342J1016l107k4136j2890m66J885J1164M961
15520C248q538k908K990N917j1460J679r109m524P468q159M418j235L143P757
15506i313r173M125J1497P461K964j709J526j645q68N048k253q123M936M605k570
15491F508k601N07O285J2256R666L426o041j3910r915j4330k7419k902J7995K0050
15477d25l759j2706j0295k62N227J7493j758n715J6803L077j3159k318J1908L793
15463G904r958j1005q337j274Q115R902P607M72j0235r125j969P515J1558m459
$$ y = [8398, 20866, 13052, 7858, 4169, -69, 1380, 10842, 3257, 7899, 13950, 15463, 5429, 1610, -6600, -5613, -3418, -1648, 5957, 9995, -772, -16855, -18230, -14147, -20633, -15602, -13310, -15310, -6761, -10542, -16357, -10754, -521, 14821, 25837, 22730, -1406, -14296, -14762, -12877, -1713, 3248, -5290, -8198, -5208, 709, -10751, -9072, -18181, -22705, -15237, -23396, -18978, -20213, -17070, -9313, -18486, -14361, -2864, 4597, 7561, 5852, 7378, 5733, 4865, 9913, 7660, -463, 4473, 9078, 6508, 3907, 4414, 10699, 22955, 32621, 36047, 30006, 16096, 6181, -8149, -35568, -38470, -20475, -425, -4184, -16890, -27185, -27447, -22220, -4727, -6485, -12200, 4603, 7680, -5479, -7797, 4111, 7904, -2054, -13059, -21396, -22670, -14555, -4653, 2954, 3426, -6809, -15934, -17903, -10388, 1170, -3289]
15449c289o633J3259J202o531k56j381k746K342J4595q178j5951N131L112J4421
15435I097L471j2873m127M107j369o299j478J122J357n785K887Q624M406R615
15421A2755j0585j0969O364L506n596q332K07J3380J3885n066n31n854j5184m066
15407a6086R616J948o920j5185k153L422K1363L210n269J92L973m97m300j523
15393h209O199k903M69P036J1952j693k4780N910J2926l261P052n687O675P643
15379A9329j9158j0064M264R516M758m793K308j1399m833l792R211J8353O250
15366A9950J63j2383j0785n676q767L614P500J2434J2963q375o866J2621j9607
15353c214j5789J2182J1553Q395q51j379p406K015j7819r76R582p9M857J81J1737
$$ y = [-3289, -9922, 3337, 4539, -1992, -2248, -3629, -6375, -4033, 10562, 2384, -13567, -8436, -5324, 9097, 12568, -305, -4432, -325, -1694, -7993, -9471, -8349, -6992, -12777, -9890, -1266, 3140, 12755, 2170, -8799, -2435, 1071, -4525, -12857, -12650, 730, 14615, 9549, 9018, 3164, -12020, -16086, -6470, -4522, -11442, -26627, -28780, -25358, -3995, -785, -6054, -5862, -1889, -2386, -6686, -8209, -2010, -4913, -4444, 2592, 14544, 12851, -11929, -6019, 6907, 3646, 10698, 5011, 11686, 19329, 171, -9893, -5629, 3887, 8645, 3852, 6160, -5239, -10072, -13864, -4653, 13700, 19950, 20113, 7730, -3055, -8731, -17498, -13884, -6384, 6050, 19013, 10638, 3772, 16393, -3214, -19003, -6821, 4732, 13127, 12276, 10897, 3491, 5506, -12313, -13289, -3707, -3786, 1071, 1252, 12989]
15338A2989N18m766j262J0735P551m093o476l423j1559m177k786q367L484J0250
15324a382N609M358J9847J2629j5783k3721N145q985j0209r873o886r84R444J6351
15310d440j357j0242o246K007K034P187N998Q542L687R07l855J339j3852P2M706
15295c513J0016o830l798m074J3575O805J0327l859j5836k367N415p19j6827j936
15281a3621P266L703N697m393k128p901j2562N67N148j1546m011R673P359l771
15267b0520M903R87K539l886p61M454J5668L996k877k2608r888K63L840j437R042
15252a6285P345k357J1049r266l830Q863j380n212j750J0423J1108J1717j4924
15239E501j0960O421j953N6o459q803j2941M938j4394L09J3670M451n076k427
$$ y = [12989, 13507, 8741, 7479, 18214, 25765, 21672, 15196, 11773, 214, -3963, -6749, -15116, -11632, -1382, 4227, 8585, 28432, 41061, 25278, 1557, 6702, -2283, -12492, -22365, -29251, -30235, -20791, -4440, -5797, -16039, -22285, -20278, -18244, -11057, -5059, 3483, 7170, 8077, 4222, 5561, -8291, -8219, -3513, 6503, -327, -4125, -8199, 5376, 12181, 22508, 18649, 2813, 446, 5861, 5142, -11685, -13621, -6355, -2652, 3045, -1348, -3476, -11377, -23939, -23372, -18224, -29770, -33781, -24108, -16749, -20520, -15617, -14630, -12091, -15977, -16738, -12284, 3384, 7380, 4503, -18105, -27993, -27730, -23890, -25327, -16285, -8940, -11297, -248, -9514, -13344, -4481, -5861, -11073, -12823, -2400, 8708, 20425, 5501, -5459, 962, -991, -935, -7394, -16197, -29138, -24200, -38594, -38285, -24615, -20164, -25240, -27667]
15225b7667J5977J6105J0491r616k0328l680j456K0833K9253k395j8201j1334
15213b018J1726J2419o666r831P73j1441n284l029r79N996O900J88j9124R03J0465
15198i002J1587n547R53J0678j0454j0720K697J5592P697J0370n964k0345j5829
15185a8287l096L783L081q210J2841J6138J687n976p946m441J5206L003r034j0225
15171a1476J2956Q545Q72M027l244n721J164m79j2943k372P413J255K4452K41
15157B4690k3303J1393J2193m538o778j478l037Q931j373J2298K6730J7731J028
15144G4487n499j3522P25m900P10N795o106j850L987p214j4043o971p102n536
15130A2961o347j0369M815r247o972L729J3849R852p33j40Q507o249n412j371
$$ y = [-27667, -11690, 4415, 14906, 5290, -15038, -18718, -20174, 659, 29912, 27517, 9316, -2018, 9708, 22127, 15461, 5630, 6403, -5038, -10322, -13351, -14330, -8334, -1434, -1246, -20370, -19467, -9002, 2585, -2962, -2009, 8669, -1785, -12505, -9808, 5784, 13481, 23851, 17887, -2458, -18287, -21383, -17600, -14519, -22729, -9888, 6250, 7937, 1961, -5985, -10426, 4780, 7783, -1251, -11476, 1480, 10025, 10897, 14924, 11680, 5959, 7123, 6644, -6299, -8671, -1258, -3, 24449, 24690, 1387, 12780, 24973, 20435, 13657, 12179, 9142, 18073, 16700, 28998, 55728, 73459, 74487, 68988, 55466, 56191, 51291, 52001, 57796, 51690, 49840, 53827, 46613, 32570, 25599, 18497, 12961, 6614, -3755, 1060, -8187, -15159, -11430, 2419, 12271, 11538, 11398, 19905, 13656, 8244, 6873]
15116F873J0058O981p004j7144l665N333m289Q510q215p685K399k97P90L789Q980
15101E414K355j044L547k972q390q309L443n439q856M117Q275k091L277J140O847
15086A314L334p526L003N120J1728o454j5053N80j155k88l123r929J3898j58k524
15071g233J1548J4943q266k4846l697Q200l220l943R220O098k49M040N28j774
15057A349j4667l258j837J25Q92R653R062P903k500j3291l416k76l384K465N925
15042e255L990R51N144m500k753n140q904L222l462J1775J0387j6118p467N298
15028a2832J449J0234l303j0824M634J7021O914j0724r517l237J0664R648O599
15015A6726o475q214J2594j577p163j1081L62m320r62o460r956K462J3713P417
$$ y = [6873, 16931, 23912, 16908, -236, -3901, 1432, -2857, 5653, -2562, -10247, -7848, -8145, -7355, -3566, 5414, 7769, 6725, 10272, 7300, -1090, -9399, -5956, -11395, -20251, -16134, -7859, -9950, -6673, -5533, 1314, 4648, -2878, 125, 5245, 16973, 10519, -4534, -3954, -5109, -5397, -8520, -18449, -4551, -4709, -7233, 4315, 19258, 10992, -13854, -17551, -9351, -12571, -16514, -7294, -1196, -1445, 2595, 3123, 1349, -13318, -16576, -18413, -18288, -17396, -7743, 1319, 9222, 6722, -6569, -9985, -10261, -13645, -11180, -5255, -1265, -314, 4830, 330, -2423, -7563, -16467, -13245, -16707, -4932, 5455, -10663, -18130, -12832, -11383, -1149, -4452, -15276, -10642, 6379, 13293, 2569, -6948, -10185, 479, 10127, 16726, 10251, 2037, 14631, 13054, 5891, -5190, -4828, -9148, -10110, -16570, -26526, -24064, -10351, -2934]
15001b934R163l683K096K882q645J640k677J56j5822r450J3068J2201L181j5224
14987a4048q218j0523p152M786K7033M88j6791m066m26j069N164P64J0917j246
14973a4387N860n93m612p62M161k913k672R762r614J96L274P645J5019N452J0035
14958B5851o185j6612j1691L85j629J5696k638k348L249r549j626j0996j3766
14945c1859Q330O908R23J0643k880P660j220o354J221k861j3138Q326J0178J3889
14931I766N986j369l120j3726j2324Q95J9508L604o767q69q799L297r866M785
14917h999K556p600m62O729J6529l987j145Q505r891L477K533m085J2595j9696
14903b941j5834m174p49J0124k471l237M777O106M308R64J599k709j4553j1544
$$ y = [-2934, 6229, 2546, 4642, 7524, -1121, 519, -2158, -2002, -17824, -27274, -14206, -2005, 1176, -14048, -22266, -32789, -39941, -35155, -8122, -7634, -24425, -28491, -28917, -29986, -24822, -24058, -13141, -14387, -8527, -9120, -13732, -14494, -10333, -13246, -15918, -6156, -15770, -15574, -12300, -4655, 10364, 15816, 25851, 19666, 3054, -8637, -8252, -9881, 5815, 3177, 829, 4078, -5471, -7097, -18093, -31859, -23529, -16621, -15698, -5055, -7935, -275, -1495, -7849, -6628, -9489, -22627, -14301, -4123, 9766, 15752, 14383, 11263, -2463, -14787, -13892, 5616, 9220, 2453, 1584, -7215, -3918, -13784, -8999, -6443, -14043, -14505, -7776, 8753, 4766, 3621, 12126, 2235, 5712, 8245, 4160, 16755, -2941, -18775, -22949, -23698, -13574, -16045, -19282, -14505, -8399, -4091, -3127, -1528, -4237, -18790, -30334]
14889c0334Q050o491M826J4676K6871J7513L39p501j2104j3675l651j0890J2792
14876D21R528j1202j6432q570R97J0273J5976R741J0724L145j5787k4324j1006
14863b6516q1O822J4955k606L298J4921m659O427P712j4524j0501q007q222J1471
14849i510J1409m6L134M703q484n834J808N777m030p707o194l120J0555J6251
14835H712n43m423j5070q939J157l755l597R763J3364j044J083L572j2j205R527
14820H590o859j881N133k544J0657K227O6L53N59l025j1414j2278L879M689J2312
14805A0464r762j0149o557q59L755m437l640M915K1377m695j211j113K23M334
14791B645J350l702q550j856J1012k084j2399n336O02J112J495p116O352j0108
$$ y = [-30334, -22284, -28775, -23949, -9273, 17598, 35111, 35450, 27949, 15845, 2170, -1481, -12371, 421, 9949, -1253, -17685, -26255, -25258, -14985, 991, 10732, 21456, 24601, 8814, -15510, -26516, -26597, -19775, -4820, -7426, -4128, 10793, 6134, 12561, 20273, 5749, -4752, -12759, -20981, -9510, 1899, 1853, 4987, 9690, 1206, -4628, -2820, 2957, -1073, -8780, -14974, -18094, -7539, 8712, 8169, 3746, -11324, -20263, -19106, -22861, -26458, -16695, -3331, -4375, -3292, 280, 268, -937, 8590, 1731, -150, 4983, 2439, 13096, 15323, 15389, 15742, 16301, 13276, 1862, -10416, -6537, -1848, 10464, 702, -9447, -16004, -16863, -13108, -17545, -21185, -16270, 5107, 412, -799, -1912, -1689, 2645, 3995, 293, -8257, -10113, 899, -1185, -13584, -18920, -18318, -17206, -15711, -22827, -16475, -26583]
14777b6583M239J0128L754p914p526j7117P001J6708P889M170J249J382m031m97
14763g148q835Q83J0673K865O178m322J939M185J035n905j2907j2980P038j43
14749a7444n361r684P90J2321l00M40n629J1349J5716Q77j374K824J226o784j4777
14734a5810Q55O885K3140J1429r755m372m016p44j0053o973o789P715P175J1145
14720I832n828j6707p848N47J2558P891J81j3843J0133J172j428k0656p837K5834
14706e999J5948M585p344r125l514M685O105M187n85k364O520K074j0179k28l211
14691A555p758L977L070j7105r078J49P476N376M17K224L137o591Q447M577o804
14676f931m813PP641N463j0884q889j8595M17J1100J7597J4909o503J370R558
$$ y = [-26583, -22344, -12216, -8462, -16376, -23902, -41019, -34018, -17310, -9421, -5251, -4002, -2620, -6651, -7148, -15983, -15100, -4427, -1562, 4616, 294, 2233, 6418, 7453, 1548, -11359, -24339, -17301, -17444, -22805, -32489, -31699, -19378, -19678, -19238, -24867, -13518, 2198, 3075, 1701, 4525, 5751, -1033, -15810, -14955, -8070, 15070, 26499, 16744, 12372, 8356, 7612, -2441, -9414, -16203, -8488, -1313, 9832, 4004, -12703, -20551, -20004, -7446, 445, 626, -13217, -3084, -1912, -3340, -23996, -31833, -5999, 9949, 14534, 7190, -1935, -5449, -764, 5341, 9528, 8943, 6579, 13099, 15173, 4994, 4766, 1555, -6203, -2226, 844, -16261, -25339, -25190, -17714, -12338, -11921, -9697, -6560, -13151, -4704, -127, -6931, -11744, -11737, -4096, 1367, -9517, -18406, -37001, -36584, -25484, -7887, 7022, 519, 1889, 11447]
14662A1447K50j3029o290k814j501Q762j048o538Q793o053o866k394j478M085
14648a4674J7312J0028j6561j1845R056J2090J3874o494n564J859j3762j8316
14636b2997J666O589J2592m291q464q306K2626O157m314P795J0246P00j0682q906
14622D11r376r374J0288J3228R417j7649q315n29N274O323J335M261P430o631
14608F093K860l038L81k722j3493n554L437n75O416P740K573l420l215j0383m836
14593a7736O094J876j185j739o071J1207J4246n958L790J0797p222j5081k841
14580i823Q875L529n270q633P949K500j6954M3J9333J282l076P035j1972k213
14566g395R615O420R475k760N572o59m621j1871j4766P224l333q086j2626P345
$$ y = [11447, 11697, -1332, -7622, -10436, -11937, -3175, -4223, -10761, -1968, -8021, -14887, -17281, -18759, -14674, 2638, 12666, -3895, -15740, -6684, 5406, 19280, 12786, 7222, 9081, -4681, -22997, -21331, -14742, -2150, -6441, -14905, -23211, -585, 5572, 1258, 9053, 19299, 19999, 9317, 411, -8965, -18339, -8051, 5177, 14594, -3055, -11370, -11899, -6625, -302, 1033, 5294, 12724, 6093, 8953, 5915, 6296, 3574, -9919, -15473, -12036, -12611, -6195, 1545, 4118, 698, -2517, -12900, -17736, -11642, -9766, -10951, -12690, -18761, -7554, 6692, 734, 4524, 15321, 8099, -6982, -9823, -948, 2581, -2689, -11322, -3373, -873, -17827, -17784, 1549, 2831, -245, 6790, -5182, -7395, 2220, 8640, 18115, 15355, 20927, 20268, 15647, 3776, -10990, -3766, -7099, -15185, -27811, -20466]
14552b0466J4162Q380J0922j2110j1522r292m411O762L299n819n766n164J5730
14539a5295J6013L096o363j8645L975P480k60J379m995q491R049J5914j0237m776
14525a2156k882O627l460K888r65k774J2402j454K792o33M173J1314n031j9551
14511h710o470q19l302o475o833K1448J9719k318j6140P066J2198L547j4783m386
14497f258Q183q214L224J2031P656q033o213l587N544j255K684R460J250J059
14483A7531k636j7209l113j303P56r83Q944p704K114L488k182m934O57p219n685
14468a9478L827l22j0467R345O474M853l79K985q264J1904k276l806k706K455
14454e855l391l486J1140M648N092n047m658r552J61O903O914J269n297q938q802
$$ y = [-20466, -6304, 2076, 12998, 888, -10634, -19926, -24337, -17575, -14276, -20095, -25861, -31025, -15295, 718, 3814, -2549, -21194, -17219, -9739, -9999, -8620, -13615, -22106, -13057, 2857, -7380, -12156, -15038, -8411, -11871, -8983, -9948, -12722, -320, -1774, 1018, 385, 4558, 15872, 10841, -8710, -15180, -15999, -19301, -25776, -32609, -11161, 8558, 6240, -9900, -2834, 9364, 12911, -1872, -6258, 1925, -6289, -3065, 8966, 16622, 8589, 2376, -1211, 4333, 3078, 5762, 15222, 16472, 17531, 14895, -2314, -5427, -6730, -5974, -6957, 1987, -5717, -3603, -115, -2297, -7231, -6574, -13793, -19478, -15651, -15973, -26440, -17095, -10621, -5768, -6147, -3162, -11426, 478, -1798, -5604, -8310, -5855, -9246, -12732, -1592, 3056, 8148, 3101, -1557, -11109, -10948, -4045, 2869, 4138, -1159, -10097, -18899]
14439a8899N621O214o472J460K4587P663j0832j0805J090K898N677N95j885J217
14425H129r498k5747L327O570j471k720P427k578K724k486q906J2198L270p048
14411a6809J5813J457l71L568j0907r171M330M110N152J901l263n311j057J925
14397h633p715J34N416J4011K152J385O74q575r821N506j233J2795K1216Q553
14383C5865k895k1254k0983j5369O240J6611N456l330p732o89J239j3906j2199
14370c2946O727J0771N433J4247r022P067K520l324j230J243j657j2051n126O011
14356a1337M52N386J0549J315r712R26J6199J2188J351j3523j1686m001o758m915
14342a3566n246l526J6401O130k292O581R064l583k945n487n878l246K157L013
$$ y = [-18899, -13278, -7064, -13536, -12076, 12511, 20174, 9342, -1463, -373, 2525, 8202, 8797, 6912, 8129, -1369, -27116, -23789, -17219, -18690, -21410, -13983, -16561, -13837, -16323, -25229, -13031, -9761, -16809, -996, 461, 90, 3658, -7249, -16420, -12090, -7980, -2828, -927, -4190, -9501, -10558, -8633, -16348, -16214, -10798, 3213, 5365, 6750, 7424, -1151, -10972, -5466, -6699, 6096, 27312, 35865, 32970, 11716, -9267, -24636, -18396, -1785, 3671, 341, -7391, -8080, -6841, -20747, -32946, -26219, -15448, -10015, 4232, -4790, 2277, 4797, 1473, 243, 1486, -171, -12222, -17348, -11337, -10885, -5499, 5050, 6365, -3347, -2421, 13778, 25966, 27317, 13794, 2108, -1893, -8651, -13566, -18812, -22338, -5937, 193, -2099, 4482, 13546, 9963, 7018, 1531, -4347, -7593, -5436, -2423]
14328b423J178Q343k033n333j8261j4707N167L162N879P461rl996L267J1498Q824
14313H017J61j78N618m636N139J0171O886j0806k8233q931K529K52J0419j975
14299e567j5928m007J0865O039o870R43J4910N030N111n902p853j0742j0566O330
14285a8207O086J4741N532O966l202j4271q861O782L686l345M246n105L234J5731
14271A4013P775n754j6590j4509O78M488K823o185m766J5193J5847j157m678j7237
14257a0059j0637j542J598O21J195O146m814J490L007N298Q855q954j6184K2472
14243a508L820j5110J741N903m812J0169j0833j0896J1233J0523O929q488r648
14230a0977R095P491l875J939n066K752N510n938Q540p607j2007L506n968N784
$$ y = [-2423, -1245, 7098, 5065, -268, -18529, -33236, -28069, -24907, -19028, -11567, -11576, -15572, -12305, -807, 8017, 8178, 8000, 13618, 8982, 14121, 24292, 31178, 20372, -7861, -16792, -14263, -14011, -3592, -5567, -21495, -25502, -14637, -8598, -15468, -14525, 385, 5415, 10526, 4624, -3229, -13971, -24537, -18207, -12121, 2620, 8152, 15118, 11916, -2355, -11216, -4434, -748, -4093, 153, -4952, -1718, 14013, 21788, 16034, -556, -15065, -14387, -9899, -7076, -13261, -18027, -2834, 13013, 11856, 7178, -10059, -20696, -22238, -20640, -20019, -18824, -12678, -17492, -16002, -12995, -7697, 1158, -7796, -23980, -1508, 2312, -12798, -11057, -5154, -9966, 203, -10630, -21526, -10293, 230, 7159, -1329, -10977, -1882, 5609, 1734, 3673, -1393, 1359, 6869, 931, 9471, 1864, -10143, -6637, -12605, -6821]
14216f821J2346J0903n747l02k3475j0203J0111O76O778J3992K485k36N651o944
14202I214j3675N34o979R311J2766N077m675n083P06j3926j864J2814l848j165
14188g93M315j668k131L305p059p272m92k60k514j3436r352Q43o154R412R648
14173b3608j1818N479J1959J07m452K215r641m939n041J9626J1923Q2j2320J912
14159a8516L721L494K413j2234j0817l906m699J382R889J0296J225M01K615o114
14145b0850J583m214l151L223O790R97Q141k752O792O573m520R369q69l234K799
14130F677P902J1091N500k266j855j3563q474m062j00O283N370K923Q55j602n893
14115H786O97K506Q526L168l795k0101m648M835Q164M392L613j143k360r024r138
$$ y = [-6821, 5525, 16428, 10681, 10379, -13096, -23299, -13188, -12512, -5734, 8258, 10743, 10507, 16158, 9214, -4461, -3927, -10906, -1595, 11171, 16248, 11573, 6490, 7196, -6730, -8594, 4220, 372, -793, 3522, 1854, -277, 3028, -4031, -11303, -11795, -12055, -14569, -28005, -37357, -36514, -42668, -33256, -23608, -35426, -29947, -17988, -17881, -22333, -20118, -29759, -34698, -39739, -20113, -8190, -8108, -20428, -18516, -14795, -11301, -8888, -21122, -31939, -35845, -40544, -39162, -29273, -18977, -17752, -17351, -14736, -20850, -19267, -23481, -26632, -23409, -16619, -15622, -7481, -10233, -3441, 3132, -1388, 7981, 7112, 3878, 6677, 14579, 25670, 31170, 28904, 27049, 13486, 5012, 950, 850, 7133, 12503, 15426, 16281, 14679, 8786, 9483, 11989, 20515, 23683, 19888, -213, -4861, -26, 8138, 12530, 16143, 15000, 12640, 3616, -5522]
14100e522r328k715k220j2385K003N532P393j058J2975r10O370P735l170j839
14086B861m190j4662l796P589O906J2719O398l480j5153p624j973J548J4888k256
14072b25m978Q347k402j4253o002M743J5107k595r217M591J4455M543l620n017
14058C477l828k515p466q482m777m536J2117K4008J952k979k751m02j971J303
14044C150K433n284j7677l6M152J6372r167O766P690p109r964J619J949M750M781
14029D425J243J836P889P526m691p155p9J511r981k697m90M566O881k362q404
14014A8k991j823N617J7457j0726r422N754K716j075j0412M613Q934o168O34R833
13999A2959j732k661n210k658J2527j825q142o714k347J3142R926r002j4258J32
$$ y = [-5522, -14850, -17565, -19785, -32170, -30167, -24635, -17242, -18300, -5325, -6235, 135, 7870, 4700, 2861, -1329, -15991, -19787, -12198, -5292, 7427, 13825, 10345, -4808, -12432, -14405, -12857, 2031, -225, -5203, 3144, 742, -13511, -19513, -14770, 337, -2258, -11475, -6884, 7571, 12114, 8494, 3477, -351, -2866, -10332, -18814, -23591, -28127, -16010, 7998, 9950, 6971, 4220, 3818, 1847, 3150, 5583, 299, -17378, -17414, -13262, 3110, -6057, 709, 8399, 1290, -8674, -7055, -5106, -356, 4425, 5668, 7504, 15393, 22919, 18228, 11073, 10994, 12505, 2524, -173, -663, 3903, 10784, 8422, 18, -2973, -4796, 821, 18278, 7552, -1870, 3884, 6600, 5525, -4887, -274, 8660, 2492, 3126, 12959, 11227, 8566, 3356, 698, 13225, 11400, 3258, -3456, -5803, 7339, 17265, 8263, -5995, -5863]
13985e863Q173L297Q571N4M768p086j3562O690J2991j00p031j1835r043n401L604
13970a1773j780j1018j2606Q113J0296K985m860O998m860k903L83O753l005M329
13956a2948j636k553Q464O523J2999J1786N577j4054o36N456O518J647R67r402
13942A8708j4664m896J2501M720j5312l474J0240q741j0009K785J3162J4424k0742
13929a298k4131Q326O070M224J164j0175M163N107o981k748n69k237j169R613
13915a0641P336L542N490N898j734j0987k363P561m945q34J227N32q11N642J7072
13900B1985p6J903j5850J74J531N875Q373j6877k767N703j1383O599J0981j2391
13886C780j3916n764J1797M133N762L492j975K665o310p630P972R813m282L543
$$ y = [-5863, 2310, 5607, 14178, 14232, 19000, 11914, -1648, 5042, 18033, 17933, 10902, -933, -9976, -15377, -11773, -13553, -24571, -37177, -29064, -18768, -15783, -20643, -13645, -18505, -21408, -21025, -14272, -17277, -12948, -14584, -17137, -8673, -2150, 10849, 22635, 28212, 14158, 13522, 18978, 25496, 27143, 28110, 18708, 4044, -852, 11649, 16369, 1057, -2417, 7823, -918, -10927, -8142, 5020, 19444, -1298, -25429, -17103, -11033, -6809, -5645, -15820, -11657, -6550, -13531, -16279, -16848, -19085, -20254, -10641, -3305, 237, 5727, 11625, 9891, -1096, -3459, 4102, -843, -1677, -450, 82, -729, 4913, 21985, 21909, 23812, 7962, 8136, 9667, 15542, 23915, 7038, 4271, 9974, -1409, 5190, 16171, 3780, -10136, -15900, -4103, 30, 5792, 9284, 7309, 9974, 3664, -3966, 4006, 13819, 9537, 13080]
13872A3080n923l357k829j011P615N024R096o421j7828P126J1090o810r966o667
13858g781m072n984J1959J4725j2795l901O791k563J5633k448j3482o134j3854
13845b3906J04k263K308O333Q209k546R258k17j031M516j432J652N797j0884j336
13830e438j3629k384K1451J9007M046n828j9453q028K0684J531j949J137o269
13817D878J230l199J895k813j706O219M873j873P193r396o452p945J180L20r647
13802a5243j1J4479L759j2085j56j087L402J8276l007j0733m073L907P278N547
13788A0253m37j5364p847k169J3399Q498k780j1346o025k668j012J639R347J1634
13774E122j7055j4028j808m626j811M384P226J1702l776r24J8617l313n928M296
$$ y = [13080, 7157, 3800, 971, -40, 7575, 12599, 21695, 15274, -2554, 4572, 15662, 8852, -1114, -7781, -11853, -17837, -5878, 8847, -3948, -7849, -1058, -3621, 12012, 9564, -3918, -10052, -23906, -23802, -26065, -23757, -17424, -9215, -11761, -2503, -2720, -3751, 765, -667, 985, 6782, -4102, -5438, -19067, -21451, 0, 19007, 23053, 17225, -2228, -10256, 10428, 11959, 10010, 11147, 4878, 6108, 2909, 4804, 1991, 285, 6504, 11377, 9504, 16697, 7301, 849, -7096, -5916, -5596, -15243, -15254, -775, 2984, -9101, -9257, -10344, -6942, 11334, 8327, -2406, -6479, -2572, 4706, 10253, 9816, -5548, -13395, -15564, -2165, 6333, 3553, -7793, -13818, -16486, -17498, -15859, -6512, 5122, -11933, -25961, -27769, -32395, -34206, -29822, -22596, -10894, -14670, -15594, 3023, -290, -6218, -1922]
13760a922r739P42L721q79k962N798P027J46l076j084M630l333N634J500j0598
13745d395L571o41l793j266N900J0385Q321M749k841p919q34Q28j8212k3523M259
13730b5411J4144M852P860p812O192m086l565m013r89O137M428J3611O696n616
13716A2428j5350p947J6475K3392j0009j0272k876l243n712l260N428j1458r64
13703a3368M875J4365J468J0194q57o323j134L053L954j0117l309j0130L358r683
13689a3654Q753J0988o073p502l717O154K256m404J530o860J3094J5808j1860
13676D513q422J0314l341M839n434M008q31n944L21L675j1090r316M345P761R955
13661E353j5053p505O561O918R689m432j947j1770K740J2134R218L645n015m898
$$ y = [-1922, -11661, -10919, -7198, -8077, -11039, -5241, 1786, 1932, -1144, -2228, 2402, -931, 4703, 6203, -4395, -824, -1465, -5258, -6524, -624, 9761, 18082, 22831, 19990, 12071, 11237, 12065, -6147, -29670, -25411, -11267, -6415, 1445, -6367, -175, -4261, -7826, -11839, -12828, -6691, -2263, 11348, 18044, 12428, -2922, -10869, 5606, 28998, 18989, 8717, 5841, 2598, -3114, -6374, -946, -12404, -13368, -8493, 5872, 7340, 17534, 16677, 10354, 9220, 12273, 16227, 6110, 2801, -7329, -3971, -13654, -4901, 6087, 14, -7488, -11205, -5051, -2795, -7199, -5669, -12529, 565, 16373, 4513, -3909, 6405, 3064, 7903, 2469, 6477, 5646, -298, 23, 3698, -7392, -16708, -12363, -4602, 5353, -9700, -17205, -10644, -3726, 5963, 1531, -416, -12186, -9446, 2688, 11906, 15551, 10536, 5638]
13647E638J1021k6l923j2097n773k673R756j2124r04J22J1345K916K365o198r526
13632a0081m762Q629P887K12P751r86P205N775j2396J211j875q151K523k158m732
13617c948J421N977m313L08l992J297O910O065m541k029j3734l785N654Q388p039
13602g361p568n793L728J6477Q565L86L173n669L724L661j3894j340R866o090
13588A865J0741J8874M213p458k088r682o652p810m36N865j208Q854O153j120
13574B0111m903l737n801j4591n651n270K26Q177l307n480M978Q263M856Q841
13560F712J1305o169j0960n966l176q420L58J2581J3751L152K818L647o490l697
13546I446K051Q243l30n586m670J570K750j3045j4430J629R886J5586J1794o779
$$ y = [5638, 16659, 16633, 12710, 613, -5160, -7833, 1923, -10201, -11105, -10983, 362, 3278, 5643, -555, -10081, -14843, -6214, 1673, 1885, 9636, 8650, 15855, 21630, 9234, 10445, 8570, 419, 2942, 784, -3948, -2527, 3450, -863, -555, -4547, -3250, 3660, 9725, 5184, 3155, -10579, -14364, -8710, -322, -7361, -14929, -20722, -16994, -517, 8048, 8434, 11607, 5938, 9662, 13323, -571, -1911, 7955, 1865, 12606, 31480, 35693, 28235, 26147, 16465, 9813, 2003, 1567, 7432, 6224, 15078, 21231, 20111, 15208, 11471, 5670, -8921, -14572, -19842, -19616, -11439, -14746, -20226, -15248, -6985, -2129, 6712, 18017, 11848, 888, -5078, -8254, -16674, -16316, -3735, 10016, 13168, 15986, 19633, 13143, 9446, 11497, 19740, 19410, 13824, 9154, 10724, 13474, 429, -14001, -12372, -2486, 13100, 24894, 18115]
13532A8115j7908J2951J2962o954O99j7152J009O515k70j3388j7834m118J17Q925
13518a6331O335M133N039O276O927J3076o509j4248K368J8561r844q461N299r285
13504C336n515P625k189p71J3865o443p980r906q866m49L612J8474K920m046K901
13489F568m366l199q458j3040N540Q301M652l51J1112J5088R29j1049l020m817
13475C890l078K135r475m072J0996J1788O191j0101J290o543J819n211O235J7330
13461B3194p736p170m043r464j1734P354O609J3971J0899J0880j1249j9180j5908
13448a3577l695P638J2419k494K58k573l612Q325L973k070l650p671r746M357
13434a2118O656M50j0596N192M990L041k422Q499O976j2791m153M671J0468J1073
$$ y = [18115, 207, 13158, 26120, 19166, 19865, 2713, 3722, 10237, 9967, -3421, -21255, -25373, -25256, -16331, -9996, -5863, -824, 5452, 12379, 25455, 18946, 4698, 7066, 25627, 15783, 7322, 12621, 3336, -2179, 5446, 3257, 2486, 16351, 9908, 1928, -7978, -16844, -17293, -13681, 4793, 7713, 3667, 6568, 2202, -997, -9455, -22495, -16955, -8654, -4002, -4353, 6759, 21847, 22776, 11727, 8707, 3890, 812, 2947, -6528, -10600, 396, 12184, 18375, 8274, 9564, 3021, 4840, -371, 5864, 23194, 15458, 8288, 4245, -5219, -16953, -9599, -2990, 10981, 21880, 32760, 21511, 2331, -13577, -17272, -9634, 2785, 291, 549, -2024, -5636, 2689, 6662, 4592, 942, -6729, -16475, -12118, -5462, -5012, -15608, -10416, -5426, -2385, -4807, 3692, 10668, -2123, -6276, -1605, 8863, 19936]
13420A9936J504q779j3727o848P81N120n973j2J328N915o28j4034L866K063J732
13405g756Q064K464k795J2845M711M05M82m057K040K4056r429k0014n140o010
13391a34Q059P964k252j1752n833m796L679O882m205j3177j2985Q193J2785R65
13377f607j8548l684P465L420L427q107K204R030J3856j2457k051L032J952l160
13363a0228o616L571O197J8739pj2205l899l756n378l267J1198J2297M133M038
13349A4817k340q239J3713L752o617j008j971o344n657p491L912J2634j7j650
13335G494J1896O164j2951q54K143P87l390l559k773l216j0133M102K975j0621
13321a1936p33q8k66L249P921J4422L748j1989j4134M633R998P745N222l331r109
$$ y = [19936, 21440, 12661, -1066, -7914, -7133, -2013, -7986, -7998, -6670, -755, -1383, -15417, -11551, -9488, -7756, 308, 2772, -23, 12822, 17533, 17938, 18420, 14363, 16403, 40459, 31030, 11016, 5876, -134, 7925, 15889, 13637, 1885, -3948, -8744, -5065, 1817, -2388, -15565, -28550, -20357, -7572, -6607, -25155, -28839, -21374, -17954, -14527, -22634, -20430, -11400, 2456, -10001, -12052, -9020, -7068, -10228, -16844, -13273, -7076, 11663, 11656, -549, -4448, -8204, -13582, -16849, -5651, 6646, 10779, 14817, 12477, 4238, 17951, 21703, 15086, 14078, 12107, 5763, 106, -7385, -3473, 9161, 9144, 7494, 19390, 25554, 12603, 11749, 13892, 14679, 11289, 7730, 4957, 1741, -8392, -4290, -1315, -11936, -12669, -12757, -13023, -9774, -1853, 12569, 16317, 4328, -9806, -5173, 4825, 12570, 17792, 14461, 5352]
13306E352r348N32j563K959j4522k0741N96K2710K978L685J5776J5099R885o474
13292B6924q556j3800j0823o389J0616K170L465k027J776K853L678m60J2005p516
13278A3916r313R95r548j2500K521Q126j133R065O007L385m804k509L381j2093
13264d504j9750j6127K1415K8304K501k632q664o242M281P689J0508p82J0547
13251B6544j895k192M754J846r373j2010q152p821k17n00Q537M714K66L169P355
13236A5025q567R684K2269O014k678j4318j2660M46l12o321j4291k094J6821M646
13222A3664n002J2243o7K841l915l210q558N321j0695p618K123J4316l645j0742
13208b944r93n364N707K0565r866j8n67R508j6820Q768n600m850N791o467L311
$$ y = [5352, -3996, -3464, -5027, -2068, -16590, -37331, -36735, -14025, -11047, -7362, 8414, 23513, 33398, 26924, 18368, 4568, -6255, -12644, -2028, 142, 3607, 1580, 3356, 6209, 9887, 9427, 21432, 13916, 4603, 5598, -3950, -16450, -13929, -5803, -6936, 2129, 8136, 11521, 6717, 4208, 7589, -4504, -24254, -40381, -18966, 9338, 11839, 9207, 543, -5699, -1418, 6271, 16779, 15997, 26544, 24649, 22457, 27211, 29057, 19684, 7674, -478, -8299, -8516, -9016, -479, 4235, 4501, 7670, 15025, 6458, 16142, 38411, 44425, 41747, 27429, 14769, 15215, 14903, 8582, -5709, -7803, 9018, 13664, 8662, 20905, 20838, 23679, 19764, 16554, 7996, 13317, 2622, -4996, -2873, 11443, 7798, -2944, -3937, -9301, -3594, 16971, 7105, 7087, 6520, 16028, -792, 7976, 2376, -2474, 3317, -3150, 161]
13193A61J414q074J2756J0567K895p502j2508j5047r65K259l773R732N921J8298
13179A6134p086j5772l819L80J2898N418M656J208j4346N151P033q775k181j061
13165a62k400J21l544J3454M541O160p032J787J0469J0369J355k0738k1320R052
13151B112J1988k398J112n212l338o435N650J3200J3348o229r101L666j1122l451
13137C790j732K399l438K382J6108J110j3217M064J7016O901j8493j7260L913
13124C543P795K291o376j812K622Q613K313o767O643Q905j789j0280p442J0857
13110A9116q110m841j0731P513J2285J1431L990K149j2580K147M912n549o508
13097A5224L575k230n027m471n678l468j217P935r845j2579O43O597Q231J8698
$$ y = [161, 1575, -6499, 6257, 16824, 19719, 12217, -291, -15338, -16303, -14044, -17817, -8085, -2164, 16134, 9048, -6724, -10543, -10163, 2735, 8153, 12809, 14017, -329, 4822, 11855, 3080, 899, -162, -2562, -2441, -5985, 7469, 12010, 18170, 11138, 12925, 23394, 33763, 35118, 14380, -6940, 2112, 14100, 11702, 12814, 7602, 4264, -2171, 3479, 16679, 30027, 23798, 14697, 18363, 7241, 3790, 2058, 4457, 1019, 3401, 19509, 20619, 7402, 11466, 28482, 35383, 16890, -370, 3543, 11338, 13629, 7253, 5441, 8063, 16676, 18989, 12222, 18865, 27770, 25981, 15701, 8259, 19116, 11006, 6165, -4566, 2947, 15232, 26663, 30653, 32802, 20222, 22369, 27281, 21732, 15224, 18799, 16569, 11542, 7071, 1393, -2075, -3292, 4643, -5202, -17781, -17138, -10541, -2310, 16388]
13083A6388J5184r98q705r230k451R094J157L79n01j1238L537o231O616J3736
13069B6737k911r481R669r18j7567N381J0097M60j3136J2503P199k2140N609j638
13055I864m831L600M504J0431m516n258q52L537J6577j989j4049r756N855O140
13041A9257J116j959n369M630M288p059J704o40j377M857K152m378j0830N1o95
13026E748n573P504q80p046O423J493p436j1272O915O234M022R127k428J081k372
13011A1540J2259k963r955L489J5592p07o944p040n782o167l952n85n281N279
12997a217j2858j3214R578N809q514J9728R870p236O860R45r344o439J2546l721
12983B793j1190j457Q010O551J546l792p01j616j996n42J7279N109P572p984J211
$$ y = [16388, 31572, 30574, 21869, 12639, 10188, 19282, 20439, 20818, 20317, 9079, 12616, 6385, 13001, 26737, 23826, 14345, 24014, 23096, 5529, 10910, 21007, 21467, 8331, 20834, 28033, 5893, 11502, 9864, 5033, 8633, 13137, 23568, 19052, 13794, 12942, 16479, 33056, 31067, 17018, 7262, 13117, 19257, 20373, 18414, 13045, 17675, 21963, 14904, 16608, 15968, 14591, 19448, 21600, 17222, 6392, 6443, 5748, 175, 7679, 6799, -247, 6176, 7669, 233, -11039, -4124, 2110, 6132, 15259, 12831, 13912, 11540, 23799, 20836, 10881, 14370, 29962, 29255, 22311, 15271, 9489, 3322, -630, -1215, -6496, -1217, -14075, -27289, -17711, -11902, -20416, -688, 9182, 1946, 8806, 9751, 407, -6032, 6514, 2793, -8397, -9854, -1844, 4707, 6253, 2461, 1760, 144, -1852, -2394, 14885, 19994, 27566, 19582, 20793]
12968B0793j6453k0134K673J6741J3213J2279M889m240k696O036j8298j2091J3988
12955A6700K609k619L197j2256j4222q993P450K3434j822n499P102j367p693j580
12941D441J0215K476K278J382j864k698N92J453O544j7003j6509M82k384J2345
12927A750J7335R748j1127j4442m906M927J4675O026o024o299Q63N660Q606J379
12913B8171n632j0795J952j0247O280J8299J1035j7290r441j2133K865J300N009
12900I373O62O746P809j1975j0883n700N633J1759l673o751l853J6008N528k002
12886A8681O602j569J281l646q498M936K5538J7187j2273j5505J824O326m811
12873C6073n289j2174o249p233p48l910j721P306L185K436j204J566r19j994L656
$$ y = [20793, 4340, -15794, -13121, 3620, 16833, 29112, 34001, 29761, 27065, 33101, 14803, 2712, 16700, 19309, 16690, 19887, 7631, -6591, -15584, -8134, 15300, 13478, 7979, 15081, 13714, 6021, 4441, 14656, 17132, 19410, 20792, 18928, 16230, 16822, 18275, 24819, 7816, -8693, -8211, -10595, 1750, 19085, 28833, 17706, 3264, -1642, 3285, 17960, 23986, 17962, 11663, 12526, 18186, 26792, 28171, 22539, 11744, 13696, 3449, 9729, 28028, 39063, 21773, 12332, 199, 3064, 4364, 9373, 10035, 16781, 24590, 12615, 1732, -3968, 1665, 13424, 9751, 3000, -853, 15155, 20683, 18681, 25283, 23714, 24995, 21349, 12851, 17787, 43325, 60512, 48239, 32734, 34558, 40884, 36073, 30784, 18610, 12361, 5128, 4380, 470, -1251, 6055, 9240, 11676, 10472, 12038, 11119, 9125, 12781]
12858A2781k99Q76Q610K694k002N01q13M883l404K522L557k775q601p357n075
12843F098J5446k887q756o28j2155K128J8259J0758r347m779q486n242k139P406
12829E676j7684j1937O252L082r83J0888J9708l859J476N416m535j71n153J047
12815I223m502K216j6552J1458O744J0304j567m166K157L757P213k190j3845M368
12801A4618J764q497M582M777K562r097l204j058m730K6032Q973k1444Q417J3477
12787C7172n791j6859O124J118L617P500q288j4355r464J913J0914R989r008o755
12773G827m679j760K900J4921K870j1204l138m945K706J285j728P928o594l807
12759B582M198J0163L02j3611k511J1293Q066j784L800j8642m585K881O515O532
$$ y = [12781, 12482, 13358, 21968, 24662, 22660, 23161, 22348, 27231, 23827, 26349, 29906, 27131, 18530, 11173, 6098, 21544, 18657, 9901, 9273, -2882, -754, 17505, 28263, 18916, 14137, 5651, 409, -1730, 5676, -12008, -23945, -17693, -14611, -15594, -4706, 15002, 11143, 12619, 18035, 13500, 13329, 8176, 9223, 4721, 6937, -9615, 1843, 8587, 18891, 17324, 13158, 15315, 19072, 26285, 24095, 10250, 14618, 16382, 7885, 12467, 17244, 19806, 10709, 7505, 6447, 1717, 27749, 36722, 15278, 23695, 37172, 31381, 14522, 20646, 21764, 25381, 32881, 24593, 10238, 774, 2687, 13601, 23590, 14582, 7827, 3148, 1388, 4288, 19209, 22079, 10875, 7737, 2792, 5498, 6783, 5055, 12983, 6389, 2582, 6780, 16943, 17245, 3634, 1123, 12416, 20482, 18698, 22498, 3856, -729, 2152, 8667, 15199]
12745A5199J630O564R002N465N806o644J818q708m786l722j8776J726J3527O045
12731B4146J0388N013j0290l614m894n031J2014J599j3621n326q153n733Lq040
12717a1539K900K6097M019K979P385o39L571q560k399P614J2821j81j6105L016
12703C0979L113j1057Q586J4746L706k4864j2575O903J7599l855N949r128j3735
12690A6367P217J1485j6254j4603R756J0355n813J5482J5761l617r342p310p904
12677B1580J0866L008M668M757p777j2506j0715j2627J4447L586p138l965J879
12664A0063N820n670j222J2587J6114J1707j6766o985l142q239J8887JJ407o864
12650B7698o295P968O885l606J2541R616J0366j1323j0297M098K6806R289J9746
$$ y = [15199, 16829, 23393, 32395, 37860, 43666, 37022, 38840, 30132, 25346, 21624, 2848, 4574, 18101, 24146, 34534, 39547, 29257, 25643, 20749, 15718, 27732, 29331, 15710, 10384, 2231, -3502, -3499, -11539, -8639, 17458, 21477, 24456, 31841, 31202, 34773, 26213, 23814, 31428, 44249, 44068, 27963, 30979, 34092, 23035, 31621, 46367, 50073, 25209, 12634, 19537, 37136, 33281, 39230, 30102, 16367, 23584, 35069, 18815, 4212, 13968, 24323, 18510, 33992, 49753, 46136, 36794, 29484, 21580, 32446, 35454, 40122, 44879, 37102, 24596, 13881, 1254, 15701, 19287, 12149, 8184, 10063, 15883, 10213, 8991, 21578, 37692, 49399, 32633, 25648, 22506, 14267, 33154, 33155, 34562, 27698, 21403, 29371, 36256, 32650, 45191, 54807, 65173, 53850, 43553, 47651, 74457, 83746, 103492]
12637A03492J1746J4055K9989K6094K6191L8588O9373Q2137O5990Q1316P9229
12626F28200O0622M2994L1660j2280l6400o4136o1803o8600p5089q4675p3706
12615B86787o4981m4202k5127j9626j2530L6j3843r503j883j0909K540N366m679
12602H7446j5066q645j4360j2557K346J2109N700R450J835M7N305m734j1194l167
12588E4515R682J402M500k531k8619o435q09J2273J3416m748q222m456N295j1971
12574C3292J4548J4712j960o91Q448j3908o006m721O365J5174j1137M217J116
12561E9449q319j143q314L81R260N124n601o888J0598Q627K207m499M584M363
12547F9829l066m827j1247Q132J1283J1772O35M267j3954j5481n110J9388J1791
$$ y = [103492, 115238, 129293, 159282, 185376, 211567, 250155, 319528, 401665, 467655, 548971, 628200, 688822, 731816, 763476, 751196, 714796, 650660, 588857, 520257, 445168, 360493, 286787, 221806, 177604, 152477, 132851, 120321, 120357, 106514, 97011, 95128, 84219, 86759, 92125, 87446, 72380, 63735, 49375, 36818, 39164, 51273, 56973, 66423, 68258, 68305, 73610, 68876, 57682, 54515, 64197, 65599, 70099, 67568, 38949, 32514, 31705, 43978, 57394, 52646, 44424, 39968, 45263, 33292, 47840, 62552, 60592, 59901, 68349, 54441, 48435, 43714, 50079, 65253, 54116, 58333, 59449, 51130, 49987, 41673, 42054, 51314, 56438, 50837, 43949, 54547, 63174, 65381, 60882, 65466, 69829, 66763, 61936, 50689, 58821, 70104, 81876, 82511, 86778, 72824, 57343, 52233, 71621, 83412]
12534H3412K11j7061k1291o116M194J2711J2997N104m542j2076m513k393J7038
12521F7675P934K1522P083r754o941m433p527O717J4416O5m758j823j6311l843
12507G0022o808j9419j3133K58l329O623J3240n67K830K89j0700j1068J871K0450
12493E0559J2333q854m222K757k304m244j515M21j1450O677K6496M884j4169j229
12479E6140N653N877p431N07o637m842M832Q109J2674k617K613J2882L121O242
12465I7123K784J4285J1975O486J3242J0024N422m908r967q477j0309r867k1028
12452I6785j5612j028k1547j5418R83K2633J0271m681j6029j6534k079k679j3755
12439B1310j0255n416J4522J1444J6490M99j0507j1749j5380p178R346P268J6158
$$ y = [83412, 83623, 66562, 45271, 39155, 43349, 56060, 69057, 74161, 69619, 57543, 53030, 50637, 67675, 75609, 97131, 104214, 94460, 87519, 83086, 75559, 82276, 96692, 96757, 91999, 90176, 73865, 70022, 63214, 43795, 30662, 30920, 27591, 34214, 47454, 46887, 49717, 50006, 39306, 28238, 30109, 50559, 62892, 54038, 49816, 52573, 50269, 46025, 44510, 44931, 33481, 40158, 66654, 71538, 57369, 56140, 61793, 67670, 60239, 60746, 54109, 49267, 54099, 62208, 74882, 72265, 74878, 87760, 90881, 97123, 99907, 114192, 126167, 132653, 145895, 155919, 161341, 156433, 146466, 137989, 127680, 117813, 96785, 81173, 80145, 58598, 43180, 44163, 66796, 77067, 72386, 56357, 39823, 37744, 35065, 21310, 11055, 5639, 20161, 31605, 48095, 48594, 38087, 26338, 10958, 3780, 13126, 20394, 36552]
12426C6552j1832j5814r357J5402O675J42Q287K0749l042J67Q931o858q345O030
12412D7687J0776r88r224j4860j1047J264O496o667j5981j3400l610M792o054
12399a0816J3775K6811J5276M335R371K0214J0979R80P482n331L04J7163J6191
12386A26734j0250j9355o946j2580j912j92P609l893j1868j467M640r58J677j5824
12372E5415j8248k282j3860j672P052m795o363q015j0604J0087J4898J0553J0801
12359D2967n318r353L802L2236K0461P318K2900R125J9468J2283q508o827j0693
12346A29861K0711J7903L320N196J3606L330K554K1373J2731N753J9852K1122
12334B77312N771J2691Q523j6018l110j1801j1558k7271k4342j8883o396m821
$$ y = [36552, 24720, 8906, -451, 14951, 21626, 21768, 30055, 50804, 47762, 47929, 56860, 50002, 41657, 47687, 58463, 57475, 48251, 33391, 22344, 23608, 30104, 23437, 7456, -5944, -9554, -4762, -10816, 2959, 29770, 45046, 49381, 58752, 78966, 89945, 90925, 98407, 93076, 93380, 110543, 126734, 116484, 97129, 90183, 77603, 75691, 75499, 83108, 79215, 67347, 65880, 70520, 69562, 71239, 55415, 37167, 34885, 21025, 19353, 26405, 21610, 15247, 7232, -3372, 6715, 21613, 32166, 42967, 37649, 28296, 32098, 64334, 84795, 92113, 115013, 124138, 143606, 155889, 147381, 140554, 129861, 150572, 168475, 171795, 176991, 190597, 193927, 196481, 217854, 230585, 236338, 256190, 277312, 283083, 295774, 304297, 288279, 285169, 273368, 261810, 234539, 210197, 191314, 184918, 180097]
12322A80097M557o717N575K527k729j677q291r37K081K260n133J0463N511R93
12308A88580R846J2235J040N80K309J84O641K839P412M730r516l542Q615P746
12294B39699K383M39k7738l231P50k603o19J7199J3330J1188J5670k251L685J9325
12280B87226J6428R62J362O190J5636J5890Q669R908J7511K0010J3857J5729J3805
12267D43183J408J1746J6508L374M000J6319J5501J7344K6134K0237Q691K5649
12255F10094L9648M8662N0593N3369N9279M7552M2850N4108L6838P0829N8358
12244A172180O0024N7818O5830Q5949Q8808R8870J20514J30462J43821J71981
12234B196257J99179K35103K72312L43826M25040N05936O17923P61368Q91674
$$ y = [180097, 184654, 177937, 183512, 186039, 183310, 181633, 173342, 172405, 174486, 176746, 171613, 182076, 187587, 188580, 198426, 210661, 211701, 212281, 214590, 214774, 221415, 224254, 231666, 236396, 226880, 223338, 231953, 239699, 242082, 242521, 214783, 211552, 212302, 209699, 209080, 226279, 239609, 250797, 266467, 264216, 267901, 287226, 303654, 304616, 305978, 312168, 327804, 343694, 352363, 362271, 379782, 399792, 413649, 429378, 443183, 444591, 456337, 472845, 476219, 480219, 496538, 512039, 529383, 555517, 575754, 584445, 610094, 649742, 698404, 748997, 802366, 861645, 909197, 952047, 1006155, 1042993, 1113822, 1172180, 1232204, 1290022, 1355852, 1441801, 1530609, 1629479, 1749993, 1880455, 2024276, 2196257, 2395436, 2630539, 2902851, 3246677, 3671717, 4177653, 4795576, 5556944, 6448618]
12225F448618J009642J170275J346162J503979J695038J972284K387437L091854
12217B0625289M218737N984275Q490352J1364087J3911246J5532638J6022995
12210I6149619J5467471J3776347J0764381O056629K38913n583849j0255068j3531789
12202A13082654j5372826j6146251j5736882j4164576j1623976q833190o341296
12195B4863657m419540l115196k297857j822896j539151j368199j240054j132388
12187G928376j029578r16355p95415o85572n76721m63818l76310l06624k55009
12178B522974k18945k04573j57797j20686j32628j24827j10052r3614q5119p7543
12168A197190o3143n7555m9894n0343m2253k8990j8292k7689k9072q016j3725
$$ y = [6448618, 7458260, 8628535, 9974697, 11478676, 13173714, 15145998, 17533435, 20625289, 24844026, 30828301, 39318653, 50682740, 64593986, 80126624, 96149619, 111617090, 125393437, 136157818, 142214447, 142453360, 136869511, 126614443, 113082654, 97709828, 81563577, 65826695, 51662119, 40038143, 31204953, 24863657, 20444117, 17328921, 15031064, 13208168, 11669017, 10300818, 9060764, 7928376, 6898798, 5982443, 5187028, 4501456, 3924735, 3460917, 3084607, 2777983, 2522974, 2304029, 2099456, 1941659, 1820973, 1688345, 1563518, 1453466, 1359852, 1274733, 1197190, 1134047, 1076492, 1026598, 976255, 934002, 905012, 886720, 859031, 829959, 821943, 808218]
12157H08218k2084l7120k6356j8408j7198j6247k8835l2970l8871k7849l793j0170
12145E28317k1613j6992j0796o041p368k562n234r043j6643l37r602p387J1099
12132D25798o98k4028j6150l263m063k253j1331j5643j1154j645j121j3015k0694
12119C00740j4679j099j2294r878j3264k0442q063l545p90o892P274O662J5452
12106B39182M856j5106p572j759j1080j3209K928J53n533L12p460m848m156L641
12092A80349m752j9042j215L089l881m327R24r075n901j1269J610p814j1790o69
12078A06237j5430o028j1735r761P432J3271k573N841R498O323n703q153o256
12065H2963m521J1182J2175L764O351J2985m358L933r16Q857M760J2067J6187
$$ y = [808218, 786134, 749014, 722658, 704250, 687052, 670805, 641970, 609000, 570129, 542280, 538487, 528317, 506704, 489712, 478916, 472875, 465507, 462945, 457711, 448668, 432025, 431688, 422086, 414699, 425798, 425100, 401072, 384922, 381659, 377596, 375343, 364012, 348369, 337215, 335570, 334449, 321434, 300740, 286061, 284962, 272668, 262790, 249526, 229084, 221021, 217476, 216686, 209794, 217068, 223730, 239182, 244038, 228932, 221360, 219601, 208521, 195312, 198240, 198393, 192860, 193172, 185712, 180864, 176708, 180349, 175597, 156555, 155340, 158429, 154548, 150221, 151145, 142070, 136169, 124900, 126510, 118696, 106906, 106237, 90807, 84779, 73044, 63283, 70715, 83986, 81413, 87254, 96752, 103075, 97372, 89219, 82963, 78442, 89624, 101799, 105563, 111914, 124899, 120541, 124474, 123558, 132415, 137175, 149242, 165429]
12052A65429J5115L480N929j3648q454l560L219N969p289o96m670j3359j1988
12039A35477n013j1533k057m694Q944j1641j2194l893K78j157l061R307m052L138
12025I7849J6569j6378L44P83l126J2298J2783J6336K5199J5434K7417K3168J55
12012B28831k969j0929l963j4759r561p549j5931j4138j8628q089O645J0954j921
11999A37993M03p049o324n664m608k508J4759L343J4706n392o713l076l26J08
11985A29652K956o332k364O355R868l665q946M635J0616q72o478q649J408m156
11971A24028k333n085o518L00j4064l597M839o284q130n283L22P527m757R853
11957I0818J5148J7783q160j3233o47m969j604l631K176R094O158k0241r486N81
$$ y = [165429, 180544, 184024, 189953, 176305, 167851, 164291, 167510, 173479, 166190, 165494, 160824, 147465, 135477, 130464, 118931, 116874, 112180, 121124, 109483, 97289, 93396, 93674, 92517, 89456, 98763, 94711, 97849, 114418, 98040, 98384, 99167, 96041, 108339, 121122, 137458, 162657, 178091, 205508, 228676, 228831, 225862, 214933, 210970, 196211, 186650, 179101, 163170, 149032, 130404, 122315, 128960, 139914, 137993, 138396, 131347, 125023, 119359, 114751, 112243, 127002, 130345, 145051, 139659, 132946, 129870, 129544, 129652, 132608, 126276, 123912, 130267, 140135, 136470, 127524, 132159, 142775, 141903, 135425, 126776, 128184, 124028, 121695, 116610, 110092, 110392, 96328, 92731, 97570, 91286, 83156, 77873, 78195, 85722, 80965, 90818, 105966, 123749, 115589, 102356, 101709, 96740, 95136, 91505, 93681, 102775, 108933, 88692, 79206, 79787]
11943G9787k139p574J4591J0612L872J5220J163q188l568j0930L011J0790N092
11930A11739l715p434J060r738P787J8087j2917j7068l121J956k760K345O796
11917I3017j4051o515p873J972p630j6659r032K5927K042J139K0917J1500J318
11904I6072o356K309J428K327O440o381j4785N727J5102l19j3041k404J3437M03
11890I9959q637j1044o204q639J4249P622N32k047n021K0657m944k904k1288K699
11876G4990N648r354P639P499n389j2043j641l545k958R759M979J142j3838q343
11862E4545O737Q847M740R158k10j573M968l009m74J779P449K960o666k062K784
11847H9973k170m777j0309o973p298p008k949Q443j012L137Q575L859J257O094
$$ y = [79787, 77648, 70074, 84665, 95277, 99149, 114369, 115532, 107344, 103776, 92846, 95857, 106647, 111739, 108024, 100590, 101650, 91912, 99699, 117786, 104869, 87801, 84680, 86636, 83876, 86221, 93017, 78966, 72451, 64578, 66550, 58920, 42261, 33229, 59156, 61198, 62337, 83254, 94754, 96072, 89716, 92025, 93453, 95780, 102220, 95839, 81054, 86781, 101883, 101564, 88523, 86119, 99556, 99959, 91322, 80278, 74074, 65435, 79684, 87306, 87838, 85791, 80770, 101427, 96483, 93579, 72291, 74990, 80638, 71284, 78923, 86422, 81033, 68990, 67349, 63804, 60846, 70605, 75584, 76726, 62888, 54545, 61282, 70129, 74869, 84027, 83817, 82244, 87212, 84203, 83729, 85508, 92957, 95917, 89251, 87189, 89973, 87803, 83026, 72717, 65744, 58446, 51438, 48489, 56932, 55920, 59057, 67632, 71491, 72748, 78842]
11833G8842m380j8081q85K2793J7012L411o000q921j5037j3529p08Q407K697Q576
11819G4197J6661k693m583m513K352j0750o680J2954K26O142K0334j2229p399
11806H4019J762K338P333L715k764M696K1931J1355J0446M840J4485K5660K0663
11793B10479K8780M4995N7408O0787O9674O0766P3218Q0429N0913L5811Q388j9006
11781G62642l9004o3922p4311o3127p3447o5890o1966m6902l9478k3599j0815
11770B00181k0684j2720r814m937p646l562O26L250k1175j7526j5246K936k122
11757I1561p99J1568Q371J4997r551n077o410r063J144l707J5765Q705j2799j1692
11743I3013M438l324r994j0077r676J5J7557j4121l787O711M235M794j8018q868
$$ y = [78842, 74462, 56381, 55496, 78289, 95301, 98712, 92712, 83791, 68754, 55225, 54517, 62924, 65621, 74197, 90858, 88165, 83582, 79069, 81421, 70671, 63991, 76945, 77171, 83313, 103647, 91418, 84019, 85781, 88119, 95452, 99167, 96403, 101099, 123030, 134385, 144831, 149671, 164156, 189816, 210479, 239259, 284254, 341662, 402449, 472123, 532889, 606107, 686536, 737449, 773260, 781648, 762642, 723638, 659716, 585405, 522278, 448831, 382941, 320975, 274073, 234595, 210996, 200181, 179497, 166777, 156963, 152026, 144380, 140818, 141444, 144694, 123519, 105993, 90747, 93683, 91561, 90762, 102330, 110701, 125698, 116147, 111070, 104660, 95597, 96741, 93034, 108799, 117504, 104705, 93013, 97451, 94127, 84133, 74056, 64380, 64395, 81952, 67831, 64044, 70755, 74990, 79784, 61766, 52898]
11729E2898J215J4081k884m713N339k880L949L452q472n794m358J1679M279K175
11715F9966p965n317J8145J2000o731o19K197l708o124l229k251J1926J6782m88
11701I4584j5717j4939n357j937J4629k250Q875N214P712O965L406j1803j6839
11688G2543N920N665j931J2321P382r936j1028L574P525l997j3787q63j6916j663
11674E4809J5044J2058l360j1988L29m111m408n735K0972J2907P928l010q7o886
11660H4462L230K356J4482l831j3040j1008j2837k877p914J4476J6936j087J809
11647H5157o21o578q323O404N310J426Q121P030p002j0101q269l885P685K708
11633G9062J877P888J4195J0086j3970j0507j143J20P78p472l798k599m610J4644
$$ y = [52898, 54113, 68194, 65310, 60597, 65936, 63056, 67005, 70457, 61985, 56191, 51833, 63512, 67791, 69966, 62001, 56684, 74829, 86829, 80098, 79479, 81676, 77968, 71844, 68615, 66364, 78290, 95072, 94584, 78867, 63928, 58571, 56634, 71263, 69013, 77888, 83102, 90814, 97779, 101185, 89382, 72543, 78463, 84128, 82197, 94518, 101900, 91964, 80936, 84510, 92035, 88038, 74251, 73388, 56472, 54809, 69853, 81911, 78551, 66563, 66892, 62781, 58373, 52638, 73610, 86517, 94445, 91435, 91348, 84462, 87692, 90048, 104530, 100699, 87659, 76651, 63814, 60937, 53023, 67499, 84435, 83348, 85157, 84536, 77958, 69635, 76039, 81349, 82775, 90896, 97926, 90924, 80823, 72554, 68669, 76354, 79062, 80939, 88827, 103022, 113108, 99138, 88631, 87488, 87608, 88386, 80914, 77116, 74517, 69907, 84551]
11619H4551L88J804p204k4395l800J0214J0171L910k849o485k861J0150J5371
11606H8965J4590l333k790m394j3732M277J2291J2188p667j0625p522O368L769
11593I2385O339m555N087m69j0339L90J63r529q30R796j3963l530R073K091j0701
11578G1408o458L358j485m98m452J0157K3400R384l534n921J2936K658L98J954
11564A13305o036o850o584K368K768Q047j970k5885p302K832R379o224N610J16
11550H3574M399m688N632l901O580j317m481j738Q964M031l232p038L344k6m492
11535H5611M256o432n378Q159N480m625K328J6309r335j8957R543K366k910J0964
11521I7379k63j201J79n436l900O226R472J211P718J2116J8793m822j4918m052
$$ y = [84551, 84939, 86743, 79539, 55144, 51344, 61558, 71729, 75639, 72790, 66305, 63444, 73594, 88965, 103555, 100222, 97432, 93038, 79306, 83583, 95874, 108062, 100395, 89770, 82248, 88616, 92385, 98724, 94169, 99256, 98787, 88448, 88838, 89001, 79472, 78642, 88438, 74475, 70945, 80018, 82109, 71408, 64950, 68308, 66823, 66325, 61873, 72030, 95430, 104814, 101280, 95359, 108295, 110953, 111351, 113305, 107269, 100419, 93835, 96203, 98971, 107018, 105048, 79163, 71861, 74693, 84072, 77848, 83458, 83574, 87973, 83285, 88917, 85016, 91596, 90279, 85798, 84060, 93024, 97055, 93823, 86785, 90129, 90103, 85611, 89867, 83435, 78057, 86216, 91696, 87071, 89399, 105708, 96373, 77416, 86959, 89325, 86415, 97379, 97116, 95915, 96094, 90658, 86758, 92984, 102456, 103667, 111385, 123501, 142294, 137472, 122554, 118502]
11507A18502n445P951N928l720Q464M579M870j0741j3233j0923p887N080K560
11494A05985M548q030r264P450J5069J050n307N255N335j715J0836R629Q566j8549
11480A30858j6910m744J278j4624P274L562L230N066l870m792o343M810R031p232
11466A06594m754n14M582K477P977k699r297m568j87o86l937m252j0410J6430
11452I6756K0827q272j2370K45Q719J089K414j151M371O036P832l555j1165k297
11438A09479K83M997j0252j5982k328P185J4843L979P366K7802J3601j2850k7115
11425A21008j5195J39K376J059J1869j7835n843Q562N900J0007r982l414j0105
11412I8546K537r285j725J2825J1704R522M325R062N66j1480m849Q985K624r186
$$ y = [118502, 113057, 121008, 126936, 123216, 131680, 136259, 141129, 130388, 117155, 106232, 98345, 103425, 105985, 110533, 102503, 93239, 100689, 115758, 116808, 111501, 116756, 122091, 120376, 131212, 140841, 149407, 130858, 113948, 109204, 110482, 95858, 103132, 106694, 109924, 114990, 111120, 106328, 99985, 104795, 113826, 106594, 101840, 101326, 105908, 108385, 116362, 113663, 104366, 99798, 99611, 98925, 94988, 90736, 80326, 96756, 117583, 109311, 96941, 97186, 105905, 106994, 109408, 108257, 112628, 118664, 126496, 122941, 111776, 109479, 109762, 114759, 104507, 88525, 86197, 93382, 108225, 112204, 119570, 147372, 160973, 148123, 121008, 105813, 105952, 108328, 109387, 121256, 103421, 97578, 106140, 112040, 122047, 112065, 108651, 98546, 101083, 91798, 90073, 102898, 114602, 124124, 128449, 137511, 138077, 126597, 121748, 130733, 133357, 124171]
11398A24171L474N120j3301J4815M846q995R307M24j308l305l594N249j0856J0016
11384A36063J2102O627o376j4504j3729k009J3200K3599j0439j0891l748M146
11372A34041K2670k681j4460k949k755J2374J7082J3969m166k2040L214R020o823
11359A56496n046J4220L948o704k5j262n987l12j260k12K369l808J324r214O73
11344A45200P212P931o86J4009M123j4289l638N937k806l481N752L165M836l973
11330A69292j895n466j17j4722n56P011K173k812P760l084r08R558o17m422p847
11315A53348p269J804p142J2979J4738P09o008j671M325J1150L182n740j2396
11302A62009r638m439M961J0003M641k873n004K370k381L437O348K191J8344J3381
$$ y = [124171, 127645, 132765, 119464, 134279, 139125, 130130, 139437, 139861, 138553, 135248, 131654, 136903, 126047, 136063, 148165, 154792, 148416, 133912, 120183, 118174, 131374, 154973, 144534, 133643, 129895, 134041, 156711, 154030, 139570, 136621, 133866, 146240, 163322, 177291, 173125, 151085, 154299, 163319, 156496, 151450, 165670, 169618, 162914, 162889, 161627, 155640, 155328, 154068, 153856, 156225, 152417, 153741, 144527, 145200, 152412, 160343, 159657, 173666, 177789, 163500, 159862, 165799, 162993, 159512, 165264, 168429, 173265, 169292, 167397, 161931, 161814, 147092, 146536, 153547, 155720, 152908, 160668, 157584, 156676, 166234, 165617, 161195, 153348, 146079, 147883, 140741, 153720, 168458, 169167, 163159, 161488, 165813, 176963, 180145, 174405, 162009, 152371, 147932, 152893, 162896, 167537, 164664, 159660, 162030, 159649, 163086, 169434, 171625, 189969, 203350]
11288B03350q762k8099J43K301N385o647r95l896M483J5979M485j4072J341K3170
11274A98166P777n963j0078R264r538j0044M585P421L320l438N894Q645q503J079
11260A98587Q555J568j2382Q770O284n955j4135J996L608N146j0319J607J9576
11247B12906P147k747r401j1099l139P662J1219L062M059o820o750j6492j212
11234A88395M947O048J0349R817j637L844r836R63K612J548J4065J6583n737j9464
11220B22497j0639J3331L369j101m027r16j75M758P517l885J794q54k864k365
11206B26440K5638K947j2061q089R424Q189n920p246q136r776M71J2352p681m613
11192B21939k492m387Q817P558O032J3968Q222j5303q615J0073J3040J0022p079
$$ y = [203350, 194588, 166489, 166632, 168933, 174318, 167671, 166676, 162780, 167263, 183242, 187727, 173655, 174996, 198166, 205943, 199980, 189902, 199166, 189628, 179584, 184169, 191590, 194910, 191472, 197366, 206011, 197508, 198587, 207142, 208710, 196328, 205098, 211382, 205427, 191292, 193288, 196896, 202042, 191723, 193330, 212906, 220053, 217306, 207905, 196806, 193667, 201329, 212548, 215610, 219669, 212849, 206099, 189607, 188395, 193342, 199390, 209739, 219556, 217919, 221763, 211927, 212890, 215502, 217050, 231115, 247698, 241961, 222497, 211858, 225189, 228558, 227457, 223430, 222514, 222339, 227097, 234614, 230729, 232523, 231669, 228805, 226440, 252078, 255025, 242964, 234875, 244299, 252488, 246568, 239322, 231186, 221410, 221881, 234233, 226552, 221939, 219447, 215060, 223877, 231435, 237467, 251435, 259657, 244354, 235739, 245812, 258852, 268874, 261795]
11179B61795m246j0977J637J7021r51J1541R164j3002K009j0482j865j496r544
11166B50604n328n524N777M35m822K099K315M996J3596J168p90n04R571O460j11
11151B79942j8529L896R132n144q28J842n029J3247J4767r31o630o530L621K439
11137B85265M856L139l27j9323o80R108r49j565M736M284R285j4321j2559J8362
11123B89311J0543J786O08p61p707r834q726j72j00M36L357J2033Q918J2772m083
11108C08381k649n032q721j751N466J162N281J0047k203J5725J853k057l759q8
11094C21655j2713r756j600K5296Q036k091j1030Q51L423n997r198q849Q26R544
11080C08397J7204J0766k035j3178m135l91N603J2058K901l495J3923J1049n040
$$ y = [261795, 257549, 246572, 248209, 265230, 264279, 275820, 284984, 271982, 273991, 263509, 261644, 260148, 250604, 245276, 239752, 245529, 245964, 241142, 243241, 245556, 250552, 264148, 265316, 264526, 264022, 273593, 280053, 279942, 261413, 265309, 274441, 269297, 268469, 270311, 265282, 278529, 293296, 292365, 285735, 279205, 282826, 285265, 290121, 293260, 292933, 273610, 272930, 282038, 281089, 279524, 284260, 288544, 297829, 283508, 270949, 289311, 299854, 301640, 302248, 301487, 293780, 283946, 275220, 275048, 274948, 275384, 278741, 290774, 299692, 312464, 308381, 305732, 300700, 291979, 290228, 295694, 296856, 302137, 312184, 309981, 325706, 327559, 325502, 321743, 321655, 308942, 299186, 297586, 322882, 330918, 328827, 317797, 318648, 322071, 316074, 306876, 298027, 298853, 308397, 325601, 336367, 334332, 321154, 317019, 316628, 322231, 334289, 337190, 333695, 347618, 358667, 353627]
11067C53627p398j4296n893J3327Q924r160J078K657R774M222M970m970L780N768
11053C66410L992p085L845q499q213l737J1748P38O377J2452q22j0467M751N49
11039C72039P64K2137J4637j2565k614l553j2983J1441J9841R289M272M608J1884
11026D39197m603K9J549k1021m343J0898p81M642M816j471k570m635L410R276
11012D34393J1059J1133L554j65n781J554L720p141M220J7602R36n533k292J2113
10998D79372R386n641p50J5301O817Q124J5115K0610j1280j2265P428O658l409
10985E35466J2403N371J724m914L94N990K852J5123j570r753J0340N318j320j183
10971E76241J31k600k929L574Q232J7571J9818K3122J206o577m84l019p291O010
$$ y = [353627, 346229, 331933, 326040, 339367, 348291, 339131, 340209, 342866, 352640, 356862, 361832, 356862, 360642, 366410, 370402, 363317, 367162, 358663, 350450, 346713, 358461, 359199, 365576, 378028, 377206, 366739, 371490, 372039, 372803, 394940, 409577, 397012, 394398, 390845, 377862, 389303, 409144, 418433, 422705, 427313, 439197, 434594, 434623, 436172, 415151, 410808, 421706, 420925, 425567, 430383, 428912, 426342, 421707, 425117, 434393, 445452, 456585, 460139, 459974, 454193, 455747, 459467, 452326, 456546, 474148, 475084, 469551, 467259, 479372, 488758, 483117, 482367, 497668, 504485, 512609, 527724, 548334, 537054, 524789, 532217, 538875, 535466, 547869, 553240, 554964, 550050, 550444, 556434, 559286, 574409, 572839, 563086, 573426, 578744, 577424, 576241, 576372, 573772, 570843, 574417, 582649, 600220, 620038, 643160, 644366, 637789, 637305, 634286, 626995, 633005]
10957F33005K5330n570O38J9333J1898J5537L692P540m070J5501R474j1463Q742
10944G29587K626n551K641N50J7903J2519M004l544K764o76L528l233J1149J2596
10930G86863Q55k642L182R90K645J7173n536k969L091O83O675Q097k657j270O167
10915H21347O380N941J2612J3395J0032j834n048J319n643L644M776j3485R143
10902H62579J1008M979J7430O099j6041r144p594J076M022O261P676j560q058
10889H78733J0336J5482O465P550J3559j3204k839L552Q068n06p790j6280o158
10876H96968j2369R174J7069n619l170M531P688J2489L675n282k99P507J1189
10863I43551M016Q91k938j1327m691j0158M019J0688M925p62n755J078J104j4984
$$ y = [633005, 658335, 652765, 653403, 672736, 684634, 700171, 703863, 711403, 707333, 722834, 732308, 720845, 729587, 732213, 726662, 729303, 729853, 747756, 760275, 764279, 760735, 763499, 762823, 766351, 763118, 774267, 786863, 787718, 785076, 788258, 789248, 791893, 809066, 803530, 800561, 803652, 804335, 811010, 819107, 816450, 815180, 821347, 827727, 833668, 846280, 859675, 869707, 867873, 862825, 864144, 858501, 862145, 866921, 853436, 862579, 873587, 878566, 895996, 902095, 886054, 876910, 869316, 870392, 874414, 880675, 888351, 886791, 878733, 889069, 904551, 911016, 918566, 932125, 918921, 916082, 919634, 927702, 927196, 919406, 903126, 896968, 884599, 893773, 910842, 905223, 902053, 906584, 914272, 926761, 930436, 925154, 924855, 932362, 943551, 947567, 948458, 945520, 934193, 929502, 919344, 923363, 934051, 938976, 938214, 932459, 933537, 934641, 919657]
10849I19657P817J001J2379O435Q43l864k90M213M434M027J2999P279K027q836
10835I70121M654p258k323M259K550l143J3029J2341L614n6J5901J0403l206L252
10821A024138O165j406J0339N677M109O382J898j157l861O967j348o212J0273
10808A061964K829R208J1016K099j0114k088J1070J6887p91R85j153j0923K217
10795A093206K1839J3575N459N387J0548M88L398R050r60J0781J5305R977J550
10782A199603J1174J6041J1594O104P515N253O507Q035J0381J9369M551N995J1651
10769A323773J2389Q407M982J4702M763R270J5462J3498J0095J0890J907k379
10757A427759M946L972J3940J0897P209K932j879P665J5356K3068J4158J4399
$$ y = [919657, 927474, 928475, 940854, 947289, 948132, 944268, 943978, 948191, 952625, 956652, 969651, 976930, 978957, 970121, 974775, 967517, 965194, 969453, 972003, 968860, 981889, 994230, 997844, 997788, 1013689, 1024092, 1020886, 1024138, 1030303, 1028897, 1039236, 1044913, 1049022, 1055404, 1057302, 1056145, 1052284, 1059251, 1057903, 1051691, 1061964, 1064793, 1074001, 1085017, 1087116, 1077002, 1074914, 1085984, 1102871, 1102080, 1103065, 1101912, 1090989, 1093206, 1115045, 1128620, 1134079, 1139466, 1150014, 1150502, 1153900, 1162950, 1161990, 1172771, 1188076, 1198053, 1199603, 1210777, 1226818, 1238412, 1244516, 1252031, 1257284, 1263791, 1271826, 1282207, 1301576, 1306127, 1312122, 1323773, 1336162, 1344569, 1349551, 1364253, 1369016, 1378286, 1393748, 1407246, 1417341, 1428231, 1430138, 1427759, 1432705, 1436677, 1450617, 1461514, 1468723, 1471655, 1469776, 1477441, 1492797, 1515865, 1530023, 1544422]
10745A544422K1962J8116J1438J2232P371J3139M938M291J5749O773J0006L0997
10733A701434J8900J2167J1151N518K095R609J3605n584P986K6489J8695K0335
10721A842400K1588L1541J4996L931J7248J3269l43L774J6185L2119K5852K2219
10709B044779J1111K2122j236M221J2576O010L3518K9148J3856J9884K3078J2369
10697B231436J4823K5589K5082J1932J9815M1950K5405K3479J8096K3692L8712
10686B500011K7637J4830K0908K0809K5066J4406K0241K7262K5575K4809L2911
10675B754465L1437L4833L3120M5505L6783K4525K9358L1034L9642L8833M0819
10664C140354K7442J4618K5871M2298L2586N3951N3409M2699K3095K9621N1436
$$ y = [1544422, 1566384, 1584500, 1595938, 1608170, 1615541, 1628680, 1633618, 1637909, 1653658, 1660431, 1670437, 1701434, 1720334, 1732501, 1743652, 1749170, 1751265, 1760874, 1774479, 1768895, 1776881, 1803370, 1822065, 1842400, 1863988, 1895529, 1910525, 1914456, 1931704, 1944973, 1944630, 1948404, 1964589, 1996708, 2022560, 2044779, 2055890, 2078012, 2076776, 2080997, 2093573, 2099583, 2133101, 2162249, 2176105, 2195989, 2219067, 2231436, 2246259, 2271848, 2296930, 2308862, 2328677, 2370627, 2396032, 2419511, 2437607, 2461299, 2500011, 2527648, 2542478, 2563386, 2584195, 2609261, 2623667, 2643908, 2671170, 2696745, 2721554, 2754465, 2785902, 2820735, 2853855, 2899360, 2936143, 2960668, 2990026, 3021060, 3060702, 3099535, 3140354, 3167796, 3182414, 3208285, 3250583, 3283169, 3337120, 3390529, 3433228, 3456323, 3485944, 3537380]
10653C537380N5901N1253N4170O4997N5838M1514L8266O0886O9966Q2770P7047
10642D189988Q0055Q4796R6134J17668J46073J99714K83945L38206L47580K57829
10632F141988P1162j05742k01801j96122j46972r1800m5718j4018J0491M5812
10622E467280N4626N4976N7946N6607P6155P4874P5553Q3343Q2858R1186Q6675
10611F262079R6682R9685J02425R7802J08753J08515J26264J14245J06884J00015
10601G323349J37874J42623J21070J19276J39724J40328J24385J54511J61395
10592H564535J60443J54783J74992J75777J70397J99724K04160J95804J94191
10583A0194806K03027K06879K12613K30185K30016K38595K51954K55375K62944
$$ y = [3537380, 3593281, 3644534, 3698704, 3763701, 3819539, 3861053, 3899319, 3960205, 4030171, 4112941, 4189988, 4270043, 4354839, 4450973, 4568641, 4714714, 4914428, 5198373, 5536579, 5884159, 6141988, 6213150, 6107408, 5905607, 5709485, 5562513, 5470713, 5424995, 5410977, 5421468, 5467280, 5521906, 5576882, 5634828, 5691435, 5767590, 5842464, 5918017, 6001360, 6084218, 6175404, 6262079, 6358761, 6458446, 6560871, 6658673, 6767426, 6875941, 7002205, 7116450, 7223334, 7323349, 7461223, 7603846, 7724916, 7844192, 7983916, 8124244, 8248629, 8403140, 8564535, 8724978, 8879761, 9054753, 9230530, 9400927, 9600651, 9804811, 10000615, 10194806, 10397833, 10604712, 10817325, 11047510, 11277526, 11516121, 11768075, 12023450, 12286394]
10574A2286394K82709K83170K90304K96128L04172L09154L15678L31907L57568
10565A5057184L49463L65346L80206M01842L95586L88368M09710M25250M34355
10556A8607310M47166M68582M68366M86079M82675M71938N05797N22392N39841
10547B3000146N38979N41151N60371N75239N86083N98606O14760O16820O26684
10538B8258839O19696O34621O35876O57585O87663O88421O85859O94963O97387
10529C4260910P03522P20317P27668P40819P70821P87697P89351P92411P86277
10520D1079793P94220P99574Q03073Q13126Q32335Q42332Q44944Q34830Q40724
10511D8484951Q36821Q59121Q61337Q33863Q34244Q33292Q22942Q01009P75690
$$ y = [12286394, 12569103, 12852273, 13142577, 13438705, 13742877, 14052031, 14367709, 14699616, 15057184, 15406647, 15771993, 16152199, 16554041, 16949627, 17337995, 17747705, 18172955, 18607310, 19054476, 19523058, 19991424, 20477503, 20960178, 21432116, 21937913, 22460305, 23000146, 23539125, 24080276, 24640647, 25215886, 25801969, 26400575, 27015335, 27632155, 28258839, 28878535, 29513156, 30149032, 30806617, 31494280, 32182701, 32868560, 33563523, 34260910, 34964432, 35684749, 36412417, 37153236, 37924057, 38711754, 39501105, 40293516, 41079793, 41874013, 42673587, 43476660, 44289786, 45122121, 45964453, 46809397, 47644227, 48484951, 49321772, 50180893, 51042230, 51876093, 52710337, 53543629, 54366571, 55167580, 55943270]
10502E5943270P61965P23230P12326O92964O54221N98040N60804N21525M73416
10493F1641761M43693L80036L32382K78261K15073J67294J18757O5204q347p0694
10483F3563420j16307j69670k21081k82513l50888l93113m51540n06245n45108
10474F0526955n83601o16315o34327o61735p15612p19862p42048p60967p94905
10465E4297583q62775q82529q70637q70116q48368q42717q55201q74515q55629
10456D6535096q49383q56876q40426q24935q17902q06798p95973p80251p81269
10447C9181283p70878p44602p39699p17683p24456o86970o80711o78434o64258
10438C2773592o42775o35569o16986n99929n93507n96351n84431n66088n54314
$$ y = [55943270, 56705235, 57428465, 58140791, 58833755, 59487976, 60086016, 60646820, 61168345, 61641761, 62085454, 62465490, 62797872, 63076133, 63291206, 63458500, 63577257, 63642461, 63634114, 63563420, 63447113, 63277443, 63056362, 62773849, 62422961, 62029848, 61578308, 61072063, 60526955, 59943354, 59327039, 58692712, 58030977, 57315365, 56595503, 55853455, 55092488, 54297583, 53434808, 52552279, 51681642, 50811526, 49963158, 49120441, 48265240, 47390725, 46535096, 45685713, 44828837, 43988411, 43163476, 42345574, 41538776, 40742803, 39962552, 39181283, 38410405, 37665803, 36926104, 36208421, 35483965, 34796995, 34116284, 33437850, 32773592, 32130817, 31495248, 30878262, 30278333, 29684826, 29088475, 28504044, 27937956, 27383642]
10429B7383642n38260n27597n00485m96648m87626m76615m80160m68194m48494
10420B2959563m48994m56177m38487m15043m11290m12003m11416l91212l70986
10411A9203955l71971l63553l74555l67442l37236l04001k76910k73924k77754
10402A6256609k91738k99515k90938k87408k87082k90692k87580k64796k67146
10393A3689714k59197k45231k34159k49212k50703k41843k22037k11039k21518
10384A1554775k19103k03347j98271k03490j96042j96815j75926j87137j91077
10375I783567j89351j92568j84745j55009j55339j53826j22767r0796r1483j17664
10365H330019j19060j30512j21504j09493j00441j00857j12048j23136j08294
$$ y = [27383642, 26845382, 26317785, 25817300, 25320652, 24833026, 24356411, 23876251, 23408057, 22959563, 22510569, 22054392, 21615905, 21200862, 20789572, 20377569, 19966153, 19574941, 19203955, 18831984, 18468431, 18093876, 17726434, 17389198, 17085197, 16808287, 16534363, 16256609, 15964871, 15665356, 15374418, 15087010, 14799928, 14509236, 14221656, 13956860, 13689714, 13430517, 13185286, 12951127, 12701915, 12451212, 12209369, 11987332, 11776293, 11554775, 11335672, 11132325, 10934054, 10730564, 10534522, 10337707, 10161781, 9974644, 9783567, 9594216, 9401648, 9216903, 9061894, 8906555, 8752729, 8629962, 8539166, 8447683, 8330019, 8210959, 8080447, 7958943, 7849450, 7749009, 7648152, 7536104, 7412968, 7304674]
10356G304674j13742j10593j10969r7063q2057r1888r1149p1537p3105p4789n6252
10345F331530m4689m1444l9127m7000n9466p4754j02707j19191j05454j12873
10335E584825j14361j14919q9507o8582o9055p0530p0007n3887n4216n5995o0570
10324D763196m5757k9367m3086m7061o4122m8801o6276o5785n3002m0297l1904
10313D227738l5082l4698k4822k2629k6129l2456l8622m3805n7153n4902p2076
10302C785364n1276k3361l0050k7559m3144l1668q975k3539m5057l1560j6592
10291C452583k5459j7035j4426j0974k1070j8704R087L747j2059j7714j2404M520
10279C320092J3510P014O522p383p072j3958p374j0140k1388L425n690L125J8632
$$ y = [7304674, 7190932, 7080339, 6969370, 6872307, 6790250, 6698362, 6607213, 6535676, 6462571, 6387782, 6331530, 6286841, 6245397, 6206270, 6159270, 6099804, 6025050, 5922343, 5803152, 5697698, 5584825, 5470464, 5355545, 5266038, 5197456, 5128401, 5057871, 4987864, 4933977, 4879761, 4823766, 4763196, 4717439, 4688072, 4644986, 4597925, 4533803, 4485002, 4418726, 4352941, 4299939, 4259642, 4227738, 4192656, 4157958, 4133136, 4110507, 4084378, 4051922, 4013300, 3969495, 3912342, 3857440, 3785364, 3734088, 3710727, 3680677, 3653118, 3609974, 3578306, 3569331, 3545792, 3500735, 3469175, 3452583, 3427124, 3410089, 3395663, 3384689, 3363619, 3344915, 3354002, 3357749, 3345690, 3327976, 3315572, 3320092, 3333602, 3340616, 3347138, 3339755, 3332683, 3318725, 3311351, 3301211, 3279823, 3283248, 3277558, 3280683, 3299315]
10266C299315J8053J6342K3371K1274K4383K6469M6585P2210P5149P1660N8308
10255C753119Q5018Q3421O3409P0798R8467J17024J09625R0260Q2624Q8952J55998
10244D798715J90544K37447K84759L46204L90743M31484M94316N96412P56073
10235H526697R76581J240143J437971J403125J181558J037945J236083J789364
10227A8829467K614300L550816M562969N683524P222173R641865J3575024K0023328
10219H5703466L0611314M7091456O6112386O8470623L6102942j2719509m8313800
10212B73058878o1356664n7395996m3442015k9546213j9695660j3424252r481027
10205C8717051o861654n050010l804278k896885k181686j558805j079135r11833
$$ y = [3299315, 3317368, 3333710, 3357081, 3378355, 3402738, 3429207, 3475792, 3548002, 3623151, 3694811, 3753119, 3838137, 3921558, 3984967, 4055765, 4154232, 4271256, 4380881, 4471141, 4553765, 4642717, 4798715, 4989259, 5226706, 5511465, 5857669, 6248412, 6679896, 7174212, 7770624, 8526697, 9503278, 10743421, 12181392, 13584517, 14766075, 15804020, 17040103, 18829467, 21443767, 24994583, 29557552, 35241076, 42463249, 52105114, 65680138, 85703466, 116314780, 163406236, 229518622, 297989245, 334092187, 321372678, 273058878, 211702214, 154306218, 110864203, 81317990, 61622330, 48198078, 38717051, 31855397, 26805387, 23001109, 20104224, 17922538, 16363733, 15284598, 14372765]
10197A4372765j079325j299954j324845j240772j070043q71141p04208n54975
10189F227502m38114l51201k91277k44345k16321k26240k62908k73559k46290
10180C677247j84735j39482j29764j17340r3952q0952q4473q2877p1367m9380
10170B642925l2339k5964m5273m5103l0036m3078m6171n5253m7228m8803k9263
10159B194414l0212n5683m0532l5560n0613n1801k5441l9806k7138p981l2624
10148A797023k5588j5293k3546j4228K652q578j3165j6589j8692k3272j8780m871
10136A617073o585o706j5995j9886k1419r790k4507k6216j3903r117k2754m4959
10124A395236l9896j5046l572p717k932R173k943M804k454n284j524j962j0240
$$ y = [14372765, 13293440, 11993486, 10668641, 9427869, 8357826, 7486685, 6782477, 6227502, 5789388, 5438187, 5146910, 4902565, 4686244, 4460004, 4197096, 3923537, 3677247, 3492512, 3353030, 3223266, 3105926, 3011974, 2931022, 2846549, 2763672, 2692305, 2642925, 2610586, 2584622, 2539349, 2494246, 2464210, 2421132, 2374961, 2319708, 2272480, 2223677, 2194414, 2164202, 2108519, 2067987, 2032427, 1981814, 1930013, 1904572, 1864766, 1837628, 1829647, 1797023, 1771435, 1756142, 1732596, 1718368, 1721020, 1712442, 1699277, 1682688, 1663996, 1640724, 1621944, 1617073, 1610488, 1603782, 1587787, 1567901, 1546482, 1536692, 1512185, 1485969, 1472066, 1462949, 1440195, 1395236, 1355340, 1340294, 1336722, 1329005, 1326073, 1335246, 1332303, 1337107, 1334653, 1329369, 1327845, 1325883, 1315643]
10111A315643k0349k872P234R21o569O519O046r146q412o793r770M525p21j2857
10097A263399l126k433j0835n717j8298l7483k0862k1129k8997l2009l4748j4181
10085A033581J494J4272J4404J3701M419P248L761J1615m880M87q051j3794M360
10072A082617o407j2536K186J5762K1073K4893M314M85k698K1076L0111K5835
10060A206711K1183K4018J7576j8661k9380l1644l1301r199M525J176q224J222
10048A148002j2886k5000j0556o713L827m077j5208j7290j6485Q459P753o956
10036A052870r369J346j6205j2276j7129j4326J374n956J2276J0164L9821N7412
10024A100002M4974L8487R131J2349n553M7O943P885L687j4078j4310o99Q327
$$ y = [1315643, 1295294, 1292422, 1299656, 1300577, 1294008, 1300527, 1306573, 1297427, 1289015, 1282222, 1272452, 1276977, 1276256, 1263399, 1260273, 1257840, 1247005, 1241288, 1222990, 1185507, 1164645, 1143516, 1114519, 1082510, 1047762, 1033581, 1035075, 1049347, 1063751, 1077452, 1081871, 1089119, 1092880, 1104495, 1099615, 1100102, 1092051, 1078257, 1082617, 1076210, 1063674, 1065860, 1081622, 1102695, 1127588, 1131902, 1132387, 1129689, 1150765, 1180876, 1206711, 1227894, 1251912, 1269488, 1250827, 1221447, 1189803, 1158502, 1149303, 1153828, 1155004, 1146780, 1148002, 1135116, 1110116, 1099560, 1092847, 1096674, 1092597, 1077389, 1060099, 1043614, 1052073, 1059826, 1052870, 1043501, 1044847, 1028642, 1016366, 999237, 984911, 986285, 980329, 992605, 1002769, 1042590, 1100002, 1144976, 1183463, 1192594, 1204943, 1199390, 1199437, 1206380, 1214265, 1217952, 1203874, 1189564, 1188865, 1197192]
10011A197192M410J3776R574J5329J9314L4828J7452J4289J7800K6639K9155L3242
9999A433000L0525J9748J4760P438J5842K5832K0517K0981J3585K5653L5498J5472
9987A678851K629J3614J8393Q004P965l409l10p650j3043k4203j3068j8082n1802
9974A597889m8454k7991k0922k2067k1186k4116j6807l7033l7264l2722j5650
9963A293677l4043m7900m3553l9289j6456k0498m3402m6708l4132n355j8838j6682
9951I26821j2488L103p932l3220k4919k2630j7403m709j0480k3936j8811j3441
9939G39955j5137l376j4047k5731j6543m353L380j9376j0134j3755r639j982j3918
9926E95344M50R15K528n197j4089L263l604j725o815p363p184L549q251o040J557
$$ y = [1197192, 1201602, 1215378, 1224952, 1240281, 1259595, 1294423, 1311875, 1326164, 1343964, 1370603, 1399758, 1433000, 1463525, 1483273, 1498033, 1505471, 1521313, 1547145, 1567662, 1588643, 1602228, 1627881, 1663379, 1678851, 1681480, 1695094, 1713487, 1721491, 1729456, 1726047, 1725737, 1718087, 1705044, 1680841, 1667773, 1649691, 1597889, 1549435, 1521444, 1500522, 1478455, 1457269, 1433153, 1416346, 1379313, 1342049, 1309327, 1293677, 1259634, 1211734, 1168181, 1128892, 1112436, 1091938, 1048536, 1001828, 967696, 962341, 943503, 926821, 914333, 917436, 909504, 876284, 851365, 828735, 811332, 806623, 796143, 772207, 753396, 739955, 724818, 721442, 707395, 681664, 665121, 660768, 664148, 644772, 634638, 620883, 611244, 609262, 595344, 595794, 596709, 599237, 594040, 579951, 583214, 579610, 577885, 571070, 563707, 556523, 560072, 551821, 545781, 547338]
9911E47338j278j4448k4508q06J0891l81O773L271J3539j685j2874j9472k0101
9898D86259j3967J155L105j040j1133k4324j6504K257k362j284Q201K696Q12m627
9884D29244q847k495o380m652l612M104j2649p911N491N559l570k331N479J1996
9870D09426K259j4182j6053j5883j666J3786p542q066j28j1945j8996m479Q941
9857C35472K604o395o548p847n950J3774J2391M819J505n356j6696j964J2704
9844C32513M543j0378j2497l681j83J556J2744R500j88L81P340K299j1721o543
9830C25685j0651j0187J0498Q090l547k892n669k709l529J1383M528j3842o660
9817C00498j374l473P47P081J4888j0668M449P112L783J1299N197P315K379m425
$$ y = [547338, 546060, 531612, 507104, 506298, 517189, 516808, 523581, 526852, 540391, 538706, 525832, 506360, 486259, 472292, 473447, 476552, 475512, 464379, 440055, 423551, 425808, 423446, 422162, 430363, 433059, 433871, 429244, 420397, 417902, 411522, 406870, 403258, 407362, 394713, 386802, 392293, 397852, 394282, 391951, 397430, 409426, 411685, 397503, 381450, 365567, 363901, 377687, 370145, 362079, 361951, 350006, 331010, 326531, 335472, 338076, 331681, 325133, 317286, 311336, 325110, 337501, 342320, 343825, 338469, 321773, 319809, 332513, 337056, 326678, 314181, 310500, 310317, 311873, 324617, 334117, 333929, 334310, 341650, 343949, 332228, 325685, 315034, 304847, 315345, 323435, 319888, 316996, 311327, 308618, 305089, 316472, 321000, 307158, 300498, 299124, 295651, 296398, 303479, 318367, 307699, 312148, 319260, 323043, 334342, 339539, 346854, 349233, 344808]
9803C44808R980K6367K9290M0353N2064N2210O4634J05780J35052K02434K85664
9792A348636L03776J93648j7000j79927k59768k64391k14274j66745j12540p4151
9782E57264n9167k7590k0364k5787k6192l6292n018K514j6568k1379j8961j1013
9770B91447J174l016N964L720j7014j3162M820m671q180J333K698j1670k324J6053
9756B67172J2641r771K928N992k220p467j5591q378l651o864P401r3j5777l432
9742B22890N329j0656j2265k635J9037J3017j714j3976j037N232p426r140k172
9729B04484j1723L191J1808j0578R790K235p298j2044m790J0072o967J1313O372
9716B05865j9142k632p168Q252N018p887k906J1234M447k3090p034J4299J6110
$$ y = [344808, 354788, 381155, 410445, 450798, 502862, 555072, 619706, 725486, 860538, 1062972, 1348636, 1652412, 1846060, 1829060, 1649133, 1389365, 1124974, 910700, 743955, 631415, 557264, 498097, 470507, 450143, 424356, 398164, 361872, 356854, 359368, 342800, 321421, 302460, 291447, 292621, 289605, 295569, 299289, 282275, 269113, 273933, 269262, 261082, 262415, 265113, 253443, 251119, 267172, 279813, 270042, 272970, 278962, 276742, 269275, 253684, 245306, 241655, 234791, 242192, 242099, 226322, 222890, 228219, 217563, 205298, 202663, 221700, 234717, 233003, 219027, 217990, 223222, 215796, 206656, 204484, 192761, 195952, 207760, 197182, 206972, 209207, 201909, 189865, 185075, 195147, 188180, 199493, 205865, 186723, 184091, 176923, 185175, 190193, 182306, 179400, 190634, 195081, 171991, 164957, 179256, 195366]
9703A95366p166o708O278K614M343K499p127l108j564K763J4457R82J3p101o958
9688A89583k190j7800m250N602m521j096N273o380l404L895M867M727J1703K330
9674A88339l250L268o821o363r272M034J986K604M25j2453P726O255q212o773
9660A61493j957J1964J0558o067j0416L801q695r303K968j9805J1133N259p22
9647A50211o724L309N934M170r950P829N180j312O238M685k918q119p067j0132
9633A41334l018J1688j2005j363O227M459j940J3715j2745l393J301K026j1284
9620A35002k599K362K181j1703P727k878n120m283Q906K379k493R207k424q810
9606A27454j24K373O02m155M176J3853K146j1172N867o001K25q232j3971J942
$$ y = [195366, 188200, 181492, 187770, 190384, 194727, 197226, 190099, 186991, 185427, 188190, 202647, 203629, 203642, 196541, 189583, 187393, 169593, 165343, 170945, 166424, 165328, 170601, 164221, 160817, 164712, 169579, 174306, 186009, 188339, 185089, 188357, 181536, 175173, 165901, 169935, 171921, 174525, 174950, 162497, 170223, 176478, 168266, 161493, 159536, 171500, 182058, 175991, 165575, 169376, 160681, 151378, 154346, 134541, 145674, 150933, 150211, 143487, 146796, 152730, 156900, 146950, 154779, 159959, 158647, 164885, 169570, 166652, 158533, 151466, 141334, 138316, 150004, 137999, 136636, 142863, 147322, 145382, 159097, 146352, 142959, 144260, 146286, 135002, 132403, 134765, 136946, 125243, 132970, 130092, 124972, 120689, 129595, 131974, 129481, 138688, 136264, 127454, 127330, 129703, 130305, 126150, 130326, 144179, 146325, 135153, 141020, 135019, 135244, 127012, 113041, 114983]
9592A14983K0914Q826J2255j2001j5331O658Q058p663p022L056J2980k829Q31
9579A43715q941j1168m110K506m331p709P361k430M483M841k441n605j784k456
9565A11931j878O922J4539J0852p331j1231j1705p687N55L383j847o205P049J2979
9551A20326o546n291O502j906j3165q848L286N602m077J855Q187q139o15J4323
9537A11494J2101p728j773m721l501M408M70j4633o381N936N421J0924j540J032
9523A11509Q782P965j3213o881N896R652j917l744q427j1637r415J2645M238M449
9509A09902M029M67j736k769o726p158m90J781J763j0960j4489M650J0459N450
9495I4173Q262L210P470J853q012j7105P570R536r932J2781L396Q209Q78j1133
$$ y = [114983, 135897, 144723, 156978, 144977, 129646, 136304, 144362, 136699, 129677, 132733, 145713, 142884, 143715, 134774, 123606, 119496, 122002, 117671, 109962, 117323, 114893, 119376, 124217, 121776, 116171, 114387, 111931, 110053, 116975, 131514, 142366, 135035, 123804, 112099, 104412, 104967, 108350, 106503, 100298, 107347, 120326, 113780, 108489, 114991, 113085, 99920, 91072, 94358, 99960, 95883, 97738, 105925, 97786, 97171, 111494, 123595, 115867, 114094, 109373, 105872, 110280, 110750, 96117, 89736, 95672, 101093, 112017, 110477, 111509, 120291, 128256, 115043, 108162, 114058, 123710, 121793, 118049, 109622, 97985, 88570, 101215, 105453, 109902, 113931, 114398, 112662, 109893, 103167, 96009, 95519, 97300, 99063, 88103, 73614, 78264, 88723, 94173, 102435, 105645, 113115, 114968, 106956, 89851, 97421, 106957, 97025, 109806, 113202, 121411, 122289, 111156]
9481A11156K368L810k0023L990l588R259Q244j2575k565o89j4193l578R230P785
9467I8631r87j0949P104q343n10J2399J0035q365m528O59K719j7200K094J8682
9453A01441q434q420j1667J3527M908j1259j1909J041K556N596L641K136J2383
9440I5540Q433J84K801K657L341j2418K120L163j2782j7095O689J9591N141J911
9426A09276j0843j5779K441N24J84o113j6893O379Q116m344R058J4037n46Q90
9412I6387M332Q601j3222M38O848j153j0309j6654M429Q17r856K981L258K035
9398G8932j6567j3574n870K0422J5725K508m463M346K35j21N784j1712n327M798
9384G5116P919l932n803R249J047p20l118q594p230l974L26r548O968K5771m05
$$ y = [111156, 113524, 117334, 97311, 101301, 97713, 106972, 115216, 102641, 100076, 99387, 85194, 81616, 90846, 98631, 97644, 86695, 93799, 85456, 84946, 97345, 107380, 99015, 94487, 95146, 97865, 80665, 82759, 101441, 93007, 84587, 72920, 86447, 91355, 80096, 68187, 69228, 71784, 77380, 81021, 83157, 95540, 103973, 104157, 106958, 109615, 112956, 100538, 102658, 105821, 93039, 75944, 82633, 102224, 107365, 109276, 98433, 82654, 85095, 85619, 85803, 79690, 62797, 69176, 77292, 72948, 82006, 96043, 95497, 96387, 100719, 109320, 96098, 96536, 103384, 102231, 91922, 75268, 79697, 80514, 70658, 73639, 76897, 78932, 62365, 48791, 42921, 63343, 79068, 81576, 77113, 81459, 81694, 81573, 87357, 75645, 70318, 75116, 83035, 79103, 73300, 82549, 83596, 82876, 79758, 71164, 63934, 59960, 60286, 50738, 57706, 83477, 83072]
9369H3072N955J280N560n468J481J127j891j042j006k1149K757Q029L897k02m714
9354G7686m343J0016K36o229J449j2614N033r076j3016p033J217o685O343K1336
9340F4320K4603N240j2842j6109L67J1343n766m986R023L289n695n989R490M75
9326G6763p30n007j277J1351m353l012N441L285k934q010r320K517O592r35N573
9311G5944Q952m212n802r94Q006j31j5868J842O993r391n03N279j6207j3345P179
9296D7742M401J1473L071j1632R33J6276L390o246j216J914n035n421n4L145O7
9281F2808k777l00Q85Q762J575o176j2682k987p36J017J2673j986J0294J4180
9267H4550o580k965j814r4j2037j788j0521J7764Q069n23j5820p614K309J360
$$ y = [83072, 89027, 90307, 95867, 90399, 91880, 93007, 91116, 90074, 89068, 67919, 70676, 78705, 82602, 82400, 77686, 73343, 83359, 83595, 77366, 78815, 66201, 71234, 62158, 49142, 42109, 43326, 36641, 42984, 64320, 88923, 94163, 81321, 65212, 65579, 76922, 71156, 66170, 75193, 78482, 72787, 66798, 76288, 76763, 76033, 71026, 69749, 81100, 76747, 73735, 79176, 82461, 79527, 71517, 62197, 64714, 71306, 70371, 75944, 84896, 80684, 74882, 73888, 81894, 81763, 65895, 67737, 74730, 65339, 64836, 70115, 53908, 40563, 47742, 52143, 63616, 66687, 55055, 55988, 72264, 75654, 69408, 68192, 70106, 65071, 59650, 59596, 62741, 62808, 60031, 59731, 60616, 69378, 70953, 64777, 52095, 49108, 48372, 49389, 62062, 60076, 70370, 84550, 77970, 75005, 73191, 73097, 61060, 59272, 48751, 66515, 74584, 74061, 58241, 50627, 52936, 54296]
9253E4296k344P354k767M231p00q946l692J3864J5263J191o894j927k907j329
9239F4693L340J6059J1950Q787o453j1944j381M254m485n649o095K721j392j1372
9225F3033k2256q06J2484J630l601J243J290O056L708k075p566k142K135J6304
9211F9437P92r408p795K587j1108j3147L9M70p91J1043K849J514J1149R579O308
9196G3518q601r952k814k440k322l622M123K275m452J851R3N564o378j3389n976
9181B7478L681r8J1275k66k910L013N892r80P602K719k703m426J2132P010J0162
9166G9581J5920j8485j9167j1481r443L649J1916J1226m818p564j863J450j3454
9153C7467J2189Q819l309m212R54p011l412p67K458J0959K291L437m991O24L794
$$ y = [54296, 51952, 59306, 56539, 60770, 60070, 51124, 47432, 61296, 76559, 77750, 70856, 68929, 66022, 64693, 68033, 84092, 96042, 104829, 98376, 86432, 85051, 89305, 84820, 79171, 73076, 75797, 74405, 63033, 40777, 39971, 52455, 54085, 50484, 51727, 53017, 59073, 62781, 60706, 53140, 50998, 53133, 69437, 70229, 60821, 53026, 55613, 44505, 31358, 31397, 31867, 31076, 42119, 44968, 46482, 57631, 67210, 73518, 64917, 54965, 52151, 49711, 47389, 43767, 47890, 50165, 45713, 47564, 47657, 53221, 46843, 33454, 27478, 31159, 31061, 42336, 42070, 39160, 42173, 48065, 47085, 54687, 57406, 54703, 50277, 62409, 69419, 79581, 95501, 77016, 57849, 46368, 36925, 40574, 52490, 63716, 58898, 51334, 49471, 50921, 37467, 49656, 58475, 55166, 50954, 51908, 44897, 41485, 40718, 43176, 54135, 56426, 59863, 54872, 55496, 59290]
9138E9290l180n427o023p280J0402R092J17Q465n51l41J785j3688j4748P388o68
9123D4633K001Q189j1498n340N886J926J403Q065J960j2538j4606p51J2669J6045
9109E8044K456M670P13m016j2197m839M910o51n97J7258O781j4032j98r848m12
9094D8042q993r503N170J1078L033o74J2667l958j1816J034n128J6579J3142q357
9080F2316k223O517j0729q543o72m275m735N178P00l859m531M583Q60j044n407
9065C4136l945K328j330O66j0122O186J3259Q600o096N303j470J1096J1545J753
9051G1909J603m484p969m091p836j642J514j95j2370L688J4205Q229o497l837
9037E2227k2020L542Q871p23J8J472q608J1697K890r053J637l81P692P503O362
$$ y = [59290, 56110, 50683, 44660, 37380, 47782, 56874, 56991, 65456, 64905, 64564, 66349, 52661, 37913, 45301, 44633, 46634, 54823, 43325, 37985, 43871, 45797, 47200, 55265, 57225, 44687, 30081, 29330, 41999, 58044, 60500, 65170, 65883, 61867, 49670, 44831, 49741, 49090, 48493, 65751, 72532, 58500, 58302, 48454, 48042, 39049, 29546, 34716, 45794, 48827, 48153, 60820, 56862, 45046, 46080, 40952, 57531, 70673, 62316, 60093, 66610, 55881, 47338, 46666, 42391, 37656, 42834, 43534, 39675, 35144, 39727, 40587, 39543, 34136, 30191, 32519, 31189, 31855, 21733, 27919, 41178, 49778, 43682, 48985, 47515, 58611, 70156, 71909, 73512, 69028, 61059, 56968, 49132, 47490, 49004, 48809, 36439, 40127, 54332, 62561, 56064, 52227, 30207, 33749, 42620, 41897, 41915, 43387, 34779, 46476, 49366, 40313, 41950, 41569, 49261, 56764, 63126]
9022F3126M816r720j623o068J0464J0290j2283j3718K722m003L738M432k251n236
9008D4686J1493N882j5367n757O134J1264P02k482o197j722j2753l317l998K36
8994B8804P2m979K45m321J2296J4756J520j0857l878O73O732N173k429p873J608
8979C7542J37P783r075p849m314p758L248J1927J6638R266l077M640M598p187
8965E6519N241q24j1865j6201j4742k241O841K765K1198j721l82n555k612O232
8951D2653L174J190j0243j5236J124m254K712K1117K0881K489o193n759j2233
8938D1422r782m009j172J3582J0715K442P0p329N04p457Q011J052r260Q065l880
8923D2974Q93m340p150l813j0169o007N497J487L518J0903o693p57J050J614O501
$$ y = [63126, 67942, 58222, 56599, 50531, 60995, 71285, 59002, 45284, 48006, 44003, 47741, 52173, 49922, 44686, 56179, 62061, 46694, 40937, 47071, 58335, 59037, 56555, 50358, 48636, 35883, 32566, 28568, 28804, 28876, 23897, 24142, 19821, 32117, 46873, 48393, 37536, 33658, 34331, 41063, 46236, 43807, 35934, 37542, 37679, 45462, 36387, 28538, 24224, 16466, 19714, 31641, 48279, 57545, 54468, 59108, 63706, 56519, 61760, 60936, 49071, 32870, 18128, 15887, 22728, 25493, 46691, 44970, 44588, 39033, 36421, 42653, 45827, 47017, 36774, 21538, 22662, 18408, 21120, 42237, 63118, 65607, 59414, 53655, 41422, 31640, 27631, 26459, 40041, 50756, 53198, 53268, 45939, 46443, 38986, 46997, 48049, 38789, 46854, 42974, 43867, 39527, 32377, 28564, 18395, 12388, 17885, 19372, 22890, 33793, 27100, 26343, 27393, 29007, 35508]
8908C5508n789J76l620Q045L455k328l027l065k772K370K93q171j69p734J2676
8893B5848M423j0029j2451K676R315J0177j3873j521K5782K939q023j329j1676
8880B2258j0411L020l402O141J03J5016M278m364k362j193o411j5410J557Q092
8866A6912j561Q021O790J3247J929M32N144l094k386Q37K004L324M348Q837o553
8851E8231K449M862J3249J3115N859Q706K6868M7068P8921J26859J17377M9773
8839E53337l6810r0451r4281q7298o8987m9307k7572j6364j3456j7013k603p260
8827D1935J1111L277Q560l619j0610l346p620k75M958p382j368M98n235j173n176
8812B4535M80k302kQ769p073K658J2368k39N445J830j695j1772n473j1182R426
$$ y = [35508, 29719, 29895, 26275, 34320, 37775, 35447, 32420, 29355, 26583, 28953, 29246, 21075, 20906, 13172, 25848, 30271, 20242, 7791, 10467, 19782, 29959, 16086, 14565, 40347, 43286, 35263, 33934, 22258, 11847, 14867, 11465, 17606, 17709, 32725, 37003, 32639, 30277, 29084, 22673, 7263, 8820, 16912, 15351, 23372, 30162, 43409, 45338, 45770, 50914, 47820, 45434, 46271, 48275, 51599, 55947, 64784, 58231, 60680, 65542, 78791, 91906, 97765, 106471, 133339, 180407, 259328, 386187, 503564, 553337, 516527, 426076, 331795, 244497, 175510, 126203, 98631, 82267, 68811, 51798, 49195, 41935, 53046, 56323, 64883, 61264, 50654, 47308, 39688, 39413, 44371, 36989, 35621, 36119, 30884, 29711, 24535, 25015, 22713, 22711, 31480, 24407, 27065, 39433, 39194, 44639, 46469, 44774, 33002, 27529, 16347, 25773]
8797B5773K787M75O156r03M43j4269j8343J2065J9582M476N651n342m252j2475
8783B1824j873J95Q502m244M173o052k1513J120J3290J2936M270l839n550J0496
8769C3735P710Q909j1477j4721N953M766J601L180j512r015j3394K35J3698J3467
8755D3135J050K955j943k258p799k6090j993J1003J5565m358P00O838n388m085
8741B7332j5542m29J4692r380j3933J633M24O940J0984O616P916k0o943j678J57
8726B8769J0153J4284k748o101R093N853k402m262o955j6864m029J5793L586O229
8712E0399Q540L386n689r202r31l292J414p089j3474J3472K4407J1029r705j4468
8698D8797K129K995k294m536J567L590J210r639j6658l964J9392Q787r55J1065
$$ y = [25773, 28560, 29035, 35191, 34288, 34731, 20462, 2119, 14184, 33766, 38242, 43893, 38551, 34299, 21824, 19951, 20146, 28648, 24404, 28577, 22525, 1012, 2132, 15422, 28358, 32628, 28789, 23239, 33735, 41445, 50354, 38877, 24156, 30109, 34875, 36476, 39656, 38144, 29129, 15735, 15970, 29668, 43135, 44185, 47140, 45197, 42939, 35140, 9050, 7057, 18060, 33625, 29267, 29967, 36805, 31417, 27332, 11790, 11361, 26053, 16673, 2740, 4373, 4797, 11737, 22721, 29337, 37253, 37233, 30290, 28612, 28769, 38922, 53206, 50458, 44357, 53450, 59303, 56901, 52639, 45684, 28820, 24791, 40584, 44170, 50399, 58939, 62325, 56636, 47434, 46503, 43211, 44625, 37536, 24062, 37534, 61941, 72970, 63265, 48797, 50926, 53921, 51627, 47091, 48658, 52248, 53458, 43819, 27161, 23197, 42589, 51376, 50421, 61486]
8684F1486r188q296m585Q356Q130J646l285K731k787L271j739P893J415k091r56
8669F2001J458m785L073R70j2342J0803P288O184j052m104l45R91m75K881L110
8654G5656m310L896j166p023K283N999l898j3182m291M912J222m153j1998n940
8640C8007O934O118J4034j81q237P846Q210J6503J0390k129n021j2427Q67O712
8626H7626J7172O228J0049O05q146j2245R833J2048j0776m728J5922M505j1880
8613A16213l894l972l678Q666J9398L214L869L012J5188J1169o02Q31R177K9915
8599B08506J2195L859J0132K116L226R561J5074J2879P998K1943j1393k2693j6122
8586B57281k940o993r410p491j0695J417j6387j9742P324O339j3444q303j0796
$$ y = [61486, 52298, 44002, 39417, 47773, 55903, 57549, 54264, 56995, 54208, 57479, 55740, 63633, 65048, 62957, 62001, 63459, 58674, 61747, 62717, 50375, 61178, 68466, 74650, 73598, 69494, 69149, 70140, 69665, 72546, 75656, 71346, 75242, 74076, 67053, 69336, 75335, 71437, 58255, 53964, 58876, 60098, 55945, 43947, 38007, 44941, 51059, 65093, 64912, 56675, 64521, 72731, 89234, 99624, 97495, 92474, 80047, 80914, 87626, 104798, 111026, 121075, 121680, 113534, 101289, 111122, 123170, 112394, 107666, 123588, 128093, 116213, 112319, 108347, 104669, 113335, 132733, 135947, 139816, 142828, 158016, 169185, 168583, 169414, 178591, 208506, 220701, 224560, 234692, 236808, 240034, 249595, 264669, 277548, 285546, 307489, 296096, 273403, 257281, 254341, 247348, 237938, 230447, 219752, 221169, 204782, 185040, 192364, 198703, 185259, 176956, 166160]
8573A66160m327j1000j42o203q812j0813j1228P911l549j2392j9720j97M941M986
8559I5615j4585j7636Q92k244j1307M753N581P278K54j0833m771P262p737r704
8545D2818J4247Q033j3437k173k762j0297j0225K785J2685O336J2950L613R938
8532G4511j3830o673j4993j1512j886K449P160p503K898R479L004o078r232p607
8518B0187k446N067K061n261q22J0085N892J1469p670j2951j1960O261J2672J76
8504C2760Q847k879L455q830J053J1172L639j549j215k242p514m703j1408j304
8490A9282Q101N717n194m11R007q520q118k086L994N926O384N35o582L705N86
8475C2326j4537J135K952J0188J2528k752k2644j2481m425o234J0558Q849q195
$$ y = [166160, 161833, 150833, 150691, 144488, 135676, 124863, 113635, 121546, 117997, 105605, 85885, 85688, 90629, 95615, 81030, 63394, 64286, 62042, 50735, 55488, 61069, 68347, 68601, 57768, 52997, 60259, 52522, 42818, 57065, 65098, 51661, 49488, 46726, 36429, 26204, 28989, 41674, 48010, 60960, 64573, 74511, 60681, 54008, 39015, 27503, 25617, 28066, 35226, 27723, 30621, 40100, 43104, 37026, 27794, 20187, 17741, 22808, 24869, 19608, 18786, 28871, 34763, 46232, 38562, 25611, 13651, 19912, 32584, 32760, 41607, 38728, 42183, 33353, 34406, 45578, 49217, 47668, 46453, 44211, 36697, 31994, 20586, 19282, 27383, 33100, 27906, 27495, 36502, 27982, 19864, 17778, 21772, 27698, 34082, 34617, 28035, 31740, 32326, 17789, 18924, 21876, 32064, 44592, 41840, 19196, 6715, 2290, -3944, 6614, 15463, 7268]
8462G268M815k059Q165J889q175k095M297J608j633j3J1893K0053q335o613j3843
8447A7222j3302J954J4199J0371K056P06P921K53j1832m527k762q061r704J0207
8433A4701J9309J086N808m054k29k430j4171n420J560k907j1445k10J1243O863
8419A9704J739j1385l136L433J0813M735l5j0928j888L7Q863p402J208J3200M686
8404C3644j4002P84J5029n065k265R248K0501n487j4331L399Q178r012j0923K294
8390C1992L529J131R127k507l000j5712o462J0435K296j0596n200L706P110J4711
8376D0560r777j772M132r45p540K259M96j4965J2960L498J702l146j0511M603
8362B1554Q354n192l910Q595O380p963k546M834j0686O124j5823J227j2304K691
$$ y = [7268, 12083, 10024, 18189, 20078, 11903, 9808, 14105, 15713, 14080, 14067, 25960, 46013, 37678, 31065, 17222, 3920, 5874, 20073, 30444, 32500, 33206, 41127, 41380, 29548, 25021, 22259, 14198, 4494, 14701, 34010, 35096, 40904, 36850, 36621, 34191, 20020, 14600, 16160, 13253, 1808, 1598, 12841, 19704, 21443, 10058, 6922, 10355, 21168, 25903, 25868, 14940, 13052, 13089, 21952, 14550, 15758, 28958, 33644, 19642, 20426, 35455, 30390, 28125, 37373, 57874, 52387, 38056, 41455, 49633, 40621, 29698, 31992, 35521, 36652, 45779, 43272, 40272, 24560, 18098, 28533, 30829, 20233, 15033, 18739, 25849, 40560, 30783, 29011, 33143, 32198, 24658, 26917, 27413, 12448, 25408, 28906, 30608, 27462, 16951, 21554, 29908, 24716, 20806, 29401, 35781, 27818, 25272, 30106, 19420, 25544, 9721, 10948, -1356, 1335]
8348A335J0628o697K635J3154m825N79J3362m527M054L868J100M61j5972o109
8334A3046j494P610k829p247m52R805Q760R718j4535j1267p64M019J2875l930
8320B3315j1268n470J2905M721l82q659j1025J3663J5225P95n319p713p328J160
8306A4620J487L149J0317L457l243l426j4274J355J8182P217q625j3212k151r721
8292E132k809m718N565K007n079P363J9664q741p306j4097J688L553R899l771
8278H350p847j0117K926J3050J0858R533p551o513p21M962Q559O281N696k0757
8264A6709m948L24j3238j651q737j068N322M378M006Q666l066q145J0259R766
8250A8577l524r075q087J0686P186k72k615j2767J2499l42N499L257O33J43p885
$$ y = [1335, 11963, 5266, 7901, 21055, 16230, 16809, 30171, 25644, 29698, 33566, 34666, 35127, 19155, 13046, 11552, 19162, 16333, 9086, 8634, 18439, 27199, 36917, 22382, 11115, 10351, 14370, 27245, 23315, 12047, 6577, 19482, 24203, 23821, 15162, 4137, 17800, 33025, 33820, 28501, 20788, 13460, 14620, 16107, 19256, 29573, 33030, 29787, 26361, 12087, 13442, 31624, 38841, 30216, 17004, 14853, 5132, 2323, -2395, 3170, 5177, 98, 7461, 27125, 18384, 11078, -3019, -1331, 2222, 12121, 8350, 503, -9614, -6688, 6362, 17220, 26753, 19202, 12689, 11968, 16930, 25489, 31770, 37466, 16709, 11761, 12085, -1153, -2804, -11541, -12609, -7287, -2909, 1097, 9763, 6697, -1448, 8811, 18577, 15053, 5978, -2109, 8577, 15763, 15491, 12876, 109, 12608, 12266, 17765, 21022, 21655, 21798, 13913]
8235A3913o455N769R772J3644p963m023j2111P291P340K503K4194J8296m13o924
8221F4833k2214j6407j1129j2985l650R94J386J0108J4542j0921k6207j0226l010
8208b4886L381L332O52J1671J0747l543N932k396n545k483J451j989Q747O226
8194A1297K469M027p275n401j5564n717R320M63l168J309P344J6357M364r437
8180A0388N513L814m797k871L963j0210q229L257j39p711o508M59l130J392N295
8165i514l89j03J7533J361j3001l69M669R355J6179O73O394m431m737m522j1693
8150G405L81j3670j5544J0898M910R311Q734K337K642j277J993L953n534P626
8136B4165Q814J0036L4117J4449j4456j6812j3084j2568L406M197p406o31r410
$$ y = [13913, 7458, 13227, 22999, 36643, 28680, 24657, 12546, 19837, 27177, 29680, 53874, 72170, 71757, 64833, 42619, 26212, 15083, 2098, -1552, -558, 828, 10936, 25478, 14557, -11650, -21876, -24886, -21505, -18173, -17521, -5850, 4897, 1354, 7286, 4890, -655, -3138, -1687, -3676, 5071, 11297, 13766, 17793, 10518, 5117, -10447, -16164, -6844, -6381, -9549, -8240, -896, 15461, 19825, 10388, 15901, 19715, 14918, 12047, 16010, 5800, -2429, 828, 689, -7022, -13530, -13071, -16201, -14809, -9514, -9903, -10006, 7527, 8888, -4113, -4482, 187, 9542, 25721, 26394, 32788, 28357, 23620, 19098, 7405, 7786, -5884, -21428, -10530, -5620, 3691, 12425, 14762, 17404, 16127, 18120, 22073, 16539, 24165, 32979, 43015, 77132, 91581, 77125, 60313, 47229, 34661, 38067, 42264, 34858, 34227, 24817]
8123B4817r633m826M48P481r074J869J251o28K951L395n54j0477o381L284K765
8108F688l368R669N202O140k286r183o70K259j21p305J3771Q492m939J5679J6818
8093E6846K3085R18j2775j777o976j5456k3901j2558O487k355m651r583j4885
8080a7581N207J5870L339n051n817J3093N451J928P29n653N981N449j1023M619
8066A6541Q538l551o796q01o011P848J0435J673m821j0735p53J641j258Q374n204
8051A5120n884K889K123k366J7560J1700N62j4232n849O777J555o2l790o194M66
8036B0375R653J189K68J6462Q504o018j0292O558J3367P763j884J5954J5456J8437
8022A15792J5418p043j1757k605L651L737q22Q342N642O387J315j6899j5109L589
$$ y = [24817, 15184, 10358, 10806, 18287, 9213, 11082, 12333, 11705, 14656, 18051, 17497, 7020, 639, 3923, 6688, 3320, 12989, 18191, 24331, 22045, 12862, 12192, 14451, 14330, 7025, 20796, 29288, 24349, 40028, 56846, 79931, 80849, 68074, 66297, 59321, 43865, 19964, 7406, 13893, 11538, 6887, -2696, -17581, -12374, 3496, 6835, 1784, -4033, 9060, 14511, 16439, 17168, 11515, 17496, 22945, 11922, 16541, 25079, 21528, 14732, 13931, 7920, 15768, 26203, 27876, 23055, 12320, 11567, 13208, 11950, 20324, 15120, 9236, 12125, 14248, 11882, 29442, 41142, 41704, 27472, 21623, 28400, 29955, 29893, 26103, 19909, 20375, 30028, 31217, 31485, 47947, 56451, 50433, 40141, 46699, 60066, 67829, 65945, 81899, 97355, 115792, 131210, 124167, 112410, 109805, 113456, 117193, 116371, 124713, 130355, 136742, 138057, 121158, 106049, 109638]
8008A09638m163m373j2067n374p798l215p820J386J0060O542R188n25K174n109
7994H8544K93P332M992n766q725J3448J4693J5501L2439M2600O7068O3265M4407
7981C80091J4272j7796n1635n1553o1175m0850j9092J1476K3562K3918M5544L2124
7969B88886K860k8494m8666l8900l0451l5510k0091K066q072r296j096O840J0420
7956I0496M92j1191r345O724J7425p194k968J636p18l132l702K2242J4437J4949
7942A30151K0126J2335K5608K7862K2032R876J4925p647j6560q507l4151k6486
7930A69564K1521L6535K9010R480k4376m2581m5018j6128k6367k1242o598q400
7918G5400j6347P91K291k2012k7284J3447J3060r176n334M620m351J556P616O650
$$ y = [109638, 105475, 101102, 89035, 83661, 75863, 72648, 64828, 66214, 76274, 82816, 92004, 91479, 93653, 88544, 88837, 96169, 101161, 95395, 86670, 100118, 114811, 130312, 162751, 205351, 272419, 335684, 380091, 394363, 376567, 324932, 273379, 212204, 171354, 152262, 163738, 187300, 211218, 256762, 288886, 291746, 263252, 214586, 175686, 145235, 109725, 89634, 91700, 83628, 74332, 73236, 80076, 90496, 90988, 79797, 70452, 77176, 94601, 87407, 84439, 86075, 85357, 82225, 78523, 100765, 115202, 130151, 150277, 162612, 188220, 216082, 238114, 247990, 262915, 255268, 238708, 230201, 196050, 169564, 191085, 227620, 256630, 266110, 241734, 199153, 154135, 138007, 111640, 90398, 83800, 75400, 59053, 59844, 62135, 40123, 12839, 26286, 39346, 30170, 24836, 29456, 25105, 26661, 34277, 40927]
7904D0927k896K269P865K462l525M737J5503K6809R324M228M666k4338l1255M793
7890F1569K103M44j842k071M482o230j2908j3596r698P290J0232m544j906m425
7876B8900j0135N409n824K658m94N048J920j6528j3896O703R668J778n149j6132
7862f074J0976l196P40L663N30K695r186K19j338q405J3177L245J003L187k976
7847H260o912j8253j563J0990Q885r51P554N265q503j8629l514J2233K2945R304
7833B7111p181P439o861q180M959O857l250J858O809O466j9325j7072j6841O705
7819a0506J1899L558K974M108K792R194R840P080j2117j4981l36m628n070l86
7805C421p399P18O148j7180j4460J0706J2378J0309J392l183N625N089j43j024
$$ y = [40927, 38031, 40300, 48165, 50627, 47102, 51839, 67342, 94151, 103475, 107703, 112369, 88031, 56776, 61569, 63672, 64116, 62274, 60203, 64685, 58455, 45547, 31951, 22253, 29543, 39775, 35231, 33325, 28900, 18765, 24174, 18350, 21008, 20514, 25562, 27482, 10954, -2942, 3761, 13429, 15207, 10058, -6074, 4902, 1706, 2446, 6109, 6639, 9334, 148, 367, -971, -9376, 3801, 7046, 8049, 11236, 8260, 1348, -16905, -18468, -7478, 1407, 456, 8010, 13275, 4772, -13857, -17371, -5138, 17807, 27111, 19930, 27369, 20508, 12328, 17287, 24144, 20894, 22752, 29561, 36027, 16702, -370, -17211, -10506, 1393, 4951, 7925, 12033, 14825, 24019, 33859, 40939, 28822, 13841, 13505, 8877, 3807, 3421, -3978, -3260, 2888, -14292, -28752, -18046, -5668, 4641, 6033, 2850, 8475, 13564, 13421, 12397]
7791A2397m527O30l661p086j3550K797O599m3M600m015m151J1657j645K633K249
7776D884J134q567P920J6311m395q421o007J490L701k861j468jk656J0505j0171
7761A398j631p57k5j7771m871N963p207l634N409Q973Q918l303j792l61k59J2501
7745A551M288n629r097n764L557L945l511o294M440K763N957P510J2925P550j0045
7730A4146j7483P308K864j80Q436l169q595N508L733j2674J562K975p469j376
7716d414O741Q645j1401l508j953m686J410J3710N666j656R230l969k3999j1J4085
7701C890Q582l95j488k0815l02J4022J90j1988o797M314Q980P305j1690l950j543
7686a1685Q660k642l296O656M457N729m427j2704K306o46J1165J1337J91Q857
$$ y = [12397, 7870, 8500, 4839, -2247, -15797, -13000, -6401, -6444, -1844, -5859, -10010, 1647, 2, 2635, 4884, 6018, -2549, 5371, 21682, 17287, 8866, 2859, 4349, 8050, 5189, 3721, 3720, 1064, 11569, 1398, -233, -990, -1015, -18786, -23657, -17694, -24901, -28535, -23126, -14153, -5235, -8538, -10330, -10691, -10950, 1551, 5839, 210, -8887, -14651, -11094, -7149, -10660, -16954, -12514, -9751, -3794, 3716, 16641, 24191, 14146, -3337, 3971, 6835, 6655, 15091, 11922, 3327, 8835, 12568, -106, 1456, 4431, -3038, -4414, 2327, 10972, -429, -3937, -5890, -10576, -9166, 4544, 10210, 8554, 17784, 13815, -10184, -10195, 3890, 12472, 12077, 10589, -10226, -10528, 3494, 3684, -8304, -15101, -10787, -1807, 5498, -6192, -10142, -11685, -3025, -5667, -8963, -2307, 2150, 7879, 3452, -9252, -6946, -7592, 3573, 14910, 15101, 23958]
7672B3958r704q321J0934J515n637R402J560L126J1466j0608j3952j1255k0782
7659a8298J1759J8323J3158m32K151J578r289j5890j8188J349L039J0315l559
7646c984r757o214L484R422r67r806k03j1699J027Q709J1644m965R329J2622k015
7631F627r069k954Q61M309O100q998o064n656O69J4215J3448n763j0365p23J6901
7616A3538J1543j2342k1196j4314J824O456K509L195Q111m65P8O215M427p619
7602A960N950k887l915K490n18J562j694m157k957Q605J2892n87p056J348l237
7587G799q899n576j7787m794M901R837R908j436o042q52r105p669k08K426L054
7572b4443J2623R494J0890r872k398J3030L554o730O748J0480J742p379l613K517
$$ y = [23958, 14254, 5933, 16867, 18382, 12745, 22147, 23707, 26833, 38299, 27691, 13739, 2484, -18298, -6539, 11784, 24942, 24510, 26661, 28239, 18950, 3060, -15128, -13779, -10740, -425, -3984, -13741, -19955, -16471, -7049, -8016, -17822, -18025, -29724, -28697, -19988, -8344, -13309, -3980, 8642, 6627, -2442, -5396, -4535, -226, 5874, -3124, -9188, -14844, -14175, 40, 13488, 7725, -2640, -3363, 13538, 25081, 12739, -8457, -22771, -20947, -14491, -11982, -8787, -676, -1141, -1063, 5152, 9579, 1960, 7910, 5023, 1108, 3598, 3080, 4642, 2948, -1209, -4166, 4439, 17331, 16744, 9688, 11036, 7799, -1100, -6676, -24463, -29257, -24356, -14519, -4611, -6047, -12089, -12941, -22046, -29715, -29923, -27497, -24443, -11820, -2326, 8564, -1308, -3706, 9324, 12878, 6148, 12896, 23376, 25118, 17739, 14126, 16643]
7558A6643k102P920J651P05P799p142o065n996k631j2788l443N183J843o301o352
7543a1076j6378k552M312M813O791M449l680m671R390J5287P878J301j6139j1992
7529a2267L27k786J0973P235P314p823j048J5838k76k063j4170J1468R629r515
7515A2836j5778o476l867J697M14J3444O124j4992k863L407K939l881p031j987
7501a6014O748P111k221J0342p967o889K009l134J447J0408K1687j712m840r501
7487G474m971j0512r248j0022K745J2856J120O507P678L949r796n416J144r062
7473a5554k754L621Q098P928J837K194p272l465N451O741j3414l524J8190o535
7459A542P444O474o010p641q427k971R048N461q908j4986l128P360n677L604J364
$$ y = [16643, 14541, 22461, 24112, 24817, 32616, 25474, 19409, 13413, 10782, -2006, -5449, -266, 1577, -4724, -11076, -27454, -30006, -25694, -20881, -14090, -9641, -13321, -17992, -8602, 6685, 14563, 15864, -275, -12267, -11940, -14726, -3753, 3482, 10796, 2973, 1925, 17763, 17487, 15424, 1254, 12722, 22351, 12836, -2942, -9418, -13285, -11588, -11174, 2270, 8394, -6598, -9461, -6054, -3115, -6996, -14027, -16014, -9266, -2155, -4376, 5966, -2001, -8890, -6881, -10015, -8568, 1840, 23527, 21815, 16975, 7474, 2503, -8009, -17257, -27279, -24534, -11678, -10558, -4051, 3627, 7576, -2220, -7636, -6492, -15554, -18308, -14687, -6589, 1339, 3176, 5370, -1902, -5367, 84, 6825, -6589, -10113, 8077, 1542, 8986, 15460, 9450, 1809, -6618, -9589, -541, 4920, -3988, -18974, -22102, -14742, -20419, -16815, -15451]
7444a5451o41r077j2395J0317J8054J4977Q84J2124j824j2729l140j2874M28J6493
7430E146J2063P78o853o913j6933L317R174k90K268k566n815Q345L276M474j245
7415H226j2075p103l452J0402J1531J6240L157o482q001n96P592L446R53J844
7401B5682j2405q503m935k531M605k449p39j450p903n557J1331R484K469Q830
7387A5929K570L677r424J296l429N193O016p039j4324J224j436o11K1954j788
7373A9808j4366o791m342q150L745P253L889J940k987q719M560q41O387m501K316
7358g99m266L503R268n53j2342j535j48o016n722j892l66M711J5305J5088K566
7343A6802j8018m84P891n225n544m902j41j437m445p311M476M321q811n310j188
$$ y = [-15451, -16092, -25169, -37564, -27247, -9193, 5784, 6668, 18792, 16968, 4239, 1099, -11775, -11347, 5146, 17209, 17987, 11134, 4221, -12712, -9395, -221, -511, 1757, -809, -6624, 1721, 4997, 9471, 8226, -3849, -10952, -14404, -4002, 7529, 23769, 26926, 20444, 12443, 11847, 19439, 22885, 23838, 25682, 13277, 4774, -161, -2692, 1913, -536, -1275, -2725, -10628, -16185, -4854, 4630, 7099, 15929, 18499, 22176, 12752, 14048, 10619, 15812, 21828, 14789, 465, 1689, 253, -358, 21596, 19808, 5442, -1349, -5691, -13841, -10096, -2843, 1046, 2986, -1, -8720, -4160, -5001, 1386, -3115, -799, -5065, -1562, 7706, 7153, -5189, -6724, -6872, -12888, -18610, -20502, -20868, -16157, -852, 14236, 16802, -1216, -1700, 6191, 966, -4578, -9480, -9621, -11058, -15503, -22814, -18338, -14017, -22828, -28138, -29326]
7328b9326o108N028J1794M764j0230j89O813Q58J907R653m512J914L025j344p221
7313a3174K940J0817M093P632m225J491j1911o727k526J786J2880O506j938j9337
7299a1693q363p855q198Q357J0019N131O406l200P709j3124k390L053N200R212
7285B64O222j8245m396j2861J611J2065R432k356N238j885r607L020Q343J3748
7271A0593J089j5806o884j634J2778J0592j5427j3619m528m920J3137J5353j1289
7258a0565o32k077n009L451J3408K244p815j1164j3880J2739J5683L01j741j574
7244f631N757Q988P731j3180j3683J4689k424r863n601Q190K879O104K072j0028
7230e000J2221O046n03n409o228j2959o436M627q130k990J8670K540q690j1970
$$ y = [-29326, -35434, -30406, -18612, -13848, -24078, -24267, -17454, -16596, -14689, -5036, -9548, -7634, -4609, -5953, -13174, -10234, 583, 4676, 12308, 8083, 9574, -2337, -9064, -11590, -9804, 3076, 9582, 7644, -11693, -20056, -27911, -36109, -27752, -17733, -12602, -6196, -9396, -1687, -14811, -17201, -14148, -8948, 264, 6486, -11759, -16155, -29016, -27405, -15340, -5908, -8264, -3026, -4911, -14518, -11498, -3155, 10593, 11682, -4124, -11008, -12642, 136, 10728, -4699, -18318, -22846, -27766, -14629, 724, -10565, -11197, -13274, -18283, -14832, -1424, 820, -6995, -18159, -32039, -19300, -3617, -3316, -5057, -6631, -874, 8114, 15845, 2665, -11018, 3671, 1247, -8616, -14217, -6027, -3148, 2956, 5028, -5000, 7221, 13267, 12764, 7355, 1127, -11832, -18268, -13641, -21771, -24761, -6091, -3551, -12241, -24211]
7216b4211m030J2569J4980O867m849j9879m248P707J6037J298K904j3993j0052
7203a8900Q810j888R278J6211O462l132j8604j6651J6358Q877l683j6465q749
7190b2076M569J284J90J222O282K461n348j6221m51P799P495M472N487l398K309
7175c924K654r221j1212Q146M762J397K288O153o049O658n560q646M655K884n639
7160a0654Q764k662O15q868m144O893j540O792q659N395k987j5145J67J0934j1598
7145b6697M397J1777k289j458n068R736R538j046N554R883j29m252o655J926J321
7130F538j2976j772q37Q98O533N255R36n189N01K074p68j101o982m89k97L038
7114d638O654l598m610m044M595O36M6l89j1304r666J1708R997N383N609J833
$$ y = [-24211, -28241, -15672, -692, 6175, 1326, -18553, -22801, -15094, 943, 2241, 5145, -8848, -18900, -10090, -11978, -2700, 13511, 19973, 16841, -1763, -18414, -2056, 6821, 3138, -13327, -22076, -17507, -16223, -16033, -14811, -8529, -6068, -11416, -27637, -28088, -20289, -12794, -8322, -2835, -6233, -3924, -1270, -10491, -21703, -13557, -8795, -7398, -5110, 1043, -5006, 1652, -3908, -12554, -7899, -5015, -10654, -1890, -4552, -3937, -12805, -16949, -10056, -11596, -4804, -13463, -8068, -11055, -26200, -26033, -15099, -26697, -22300, -10523, -12812, -14270, -19338, -9602, -64, -1110, 4444, 14327, 14198, 9946, 3291, 5217, 6538, -6438, -8210, -9047, -8149, -1616, 3639, 4575, -614, -113, 1961, 1193, 92, -6890, -7379, -7676, -4638, 2016, -1582, -6192, -10236, -5641, -5005, -4959, -5348, -16652, -26318, -14610, -4613, 770, 6379, 8212]
7099H212Q045N375k988K788k110j661m420l630M450o158J326k3461j8256J6286
7085a6202J734N604L174K640J796r174K784m21j0750q830J1922J1388J1815R770
7071A7250k069J456p283j2609N833o51K854J509q606k386K008M757q488P232J1489
7056A2296r103N101q680j5583O87J2230k415n10j0520k174N225R623K3136M099
7042B3412j1914j0247L963P266p390n56O412m874M466P89J113J785l582j2271
7028a628j4011k614Q406K0891Q707r366j0199j9686j2132J1925J696k50J2837
7015e424K072J811j2461j578K695P664M897r810n796N693O615J6470k764m442
7001E642k404m990m218L582o111k131N34J1430l067r157O365M430j4223L569k53
$$ y = [8212, 16257, 21632, 18644, 21432, 19322, 17661, 13241, 9611, 14061, 7903, 9229, -14232, -32488, -16202, -14468, -8864, -5690, -3050, -1254, -10428, -7644, -8065, -18815, -27645, -15723, -4335, 7480, 17250, 15181, 16637, 9354, -3255, 2578, 1927, 4781, 6290, -2316, -4702, -2694, 2063, -6425, 807, 12296, 3193, 8294, -386, -15969, -15282, -3052, -5467, -5977, -16497, -18671, -13446, -3823, 19313, 23412, 11498, 1251, 5214, 12480, 5090, 4534, 10946, 6072, 10538, 11327, 12440, 14225, 10643, -1628, -15639, -18253, -9847, 11044, 19751, 10385, 186, -19500, -31632, -19707, -18011, -18261, -5424, -3352, -1541, -14002, -15580, -12885, -5221, -324, -10134, -15930, -10237, -3622, 12848, 10084, 5642, 3238, -1752, -5970, -2388, -8499, -10630, -10096, 1334, -1733, -10890, -4525, -95, -14318, -10749, -11002]
6986a1002k299M394L623N493N128K235J7469l164j0987O225k967j0804M38p756
6972c974K077N623r103j509J8516j555M797P054q693L819M428r925j3673J45k2749
6957b4722j0223J3001J1467J695r890K072k430j5283q051L565m858L690P585O362
6943b6020J7203K5459q55p060m002P514k946m662m470q001m087P800J841K024
6929b62M458j1735k862q0n423J600K819J4681P27L803J08j4331K446Q642J4816
6914A9407k1q554l751n043J417k760k776o980N63j59r444M981j1739N992J0756
6899h111M546L441J3986J1919j2679j2842P179m077q967Q67j144L724Q472J2270
6885A8584m637p202r637J5795J632k457r996j3967j3294l997Q718K8387L084n867
$$ y = [-11002, -13301, -8907, -5284, 209, 5337, 7572, 25041, 21877, 10890, 17115, 14148, 3344, 3782, -3974, -1897, 3726, -5377, -6886, 11630, 10075, 14872, 21926, 13233, 17052, 21480, 11555, -2118, -1973, -24722, -34945, -21944, -10477, -8782, -18672, -16600, -19030, -34313, -42364, -38799, -43657, -39967, -32382, -26020, -8817, 16642, 15787, 8727, 4725, 12239, 9293, 4631, 161, -7840, -11927, -4127, -2286, -262, 4196, -7539, -10401, -10481, -15904, -14304, -11485, 3196, 3923, 7726, 7834, -6497, -4051, 4591, 19407, 19386, 10832, 7081, 2038, 3455, 695, -2081, -9061, -8498, -8657, -18101, -13120, -24859, -18867, -8111, -3565, -124, 13862, 25781, 13102, 260, 7439, 3362, -5605, -4738, -5882, -2158, 6314, 18584, 13947, 6745, -2892, 12903, 14535, 12078, 2082, -11885, -25179, -29176, -20458, 7929, 11013, 5146]
6871E146n254P76m94k485q245J1036N399J0719j453k5917p463J0815m977j748
6857a4145J6410P565k091q382l091l347j4179n483J169M942P394K399Q973R90
6843h76l855R093m283m914R08O588l042p053N992J0760m662r44o101p334N625
6828d098K699K379o142j1140P841M938Q6k902J074J1983K920j2616J6J421N227
6813C686j1879j7008J0832J4143r956L771K882p387J801o902j636l30M725L383
6799i875M366p083O711m259j8176J5237K1060O722M316J024l964p63j1388r838
6785e910N362P916P474N852j2813L876o085n199P525J4421m028q031K738q341
6771D757j3689p773M474Q974n887j538R398J327P969k364j8223O19j400Q106o047
$$ y = [5146, -108, 668, 174, -2311, -10556, 480, 5879, 16598, 15145, -10772, -18235, -7420, -12397, -14145, 2265, 9830, 7739, -643, -3734, -7081, -21260, -26743, -25574, -20632, -13238, -10839, -1866, -876, -4731, 4362, 79, -4835, -3927, 2661, -381, -7434, -1442, 9318, 4656, 3712, -2389, -9723, -4098, -1399, 980, -5162, -16302, -8461, -3523, -3437, -6339, -5265, 6718, 9638, -2978, -2962, -1541, 3686, -8193, -25201, -14369, -226, -10182, -6411, -3529, -10916, -9115, -16017, -17653, -17983, -13258, -9875, -5509, -12592, -5881, -10140, -28316, -13079, 7981, 14703, 19019, 20043, 16079, 15316, 3928, -5910, -548, 7368, 14842, 20694, 7881, 11757, 5672, 473, 7998, 22419, 18391, 10360, 13098, 4757, -8932, -16705, -12231, -3257, -9144, -10682, -1284, 43, 8012, 5648, -12575, -11956, -13356, -5250, -11297]
6756a1297K922l305q06O934N135J1254n201j0418l848J718J480Q884o480r328
6742a2356m016J829J1507J5619P8m377m71n711j0964n533J0097n971n913l268
6728a9450J3255J2046J325n713q740j2836R87M003l12J2590M183K783L905P626
6714A5652M295O798o126j1614j7361Q550K1129O939j9442o206Q631J3178M876
6701B9299j0293Q43M6j0599l570J137J4046K701m402p533M916l57K103j029q990
6686H318j8926p580n413J3506J2887N975m899j7666L004R871m032r752j554k648
6672a8909N096j1085r577N012P262N24Q386K0769L643k0478J777m58P350N275
6658D587r351q004K125P098J4270P259q328j1198k088M564q11m937r037M520N307
$$ y = [-11297, -8375, -11680, -12486, -5552, -417, 10837, 5636, -4782, -8630, -6912, -5432, 3452, -3028, -12356, -16372, -14543, -3036, 12583, 12661, 8284, 7813, 2102, -8862, -14395, -4298, -10269, -16182, -19450, -6195, 5851, 7176, 1463, -7277, -20113, -19126, -15123, -15435, -2845, 1338, 4121, 8026, 15652, 19947, 26745, 20619, 9005, -8356, 194, 21323, 28262, 8820, 2614, 11245, 24423, 29299, 19006, 19849, 19895, 9296, 5726, 6863, 20909, 23610, 19208, 11675, 16591, 16234, 18337, 17308, 8318, -10608, -18188, -23601, -10095, 2792, 8767, 3868, -13798, -10794, -923, -4955, -14707, -16261, -18909, -13813, -24898, -34475, -29463, -22201, -21677, -13291, 7478, 11121, -9357, -7580, -8038, -688, 4587, -4764, -12768, -10643, -3545, 10725, 17984, 9656, -1542, -3630, 934, 123, -4814, -13851, -9331, -4024]
6643d024K80P202R836q869k2990R418O434L550J021n862n742J0511L93k80J697
6628B575M956K57j2914o299o02O880P491M438n923j027L460m93j4119l30J0440
6613a210K804K986Q295o081q433Jj1412J4327P939l171l629P941q803o755J971
6598c230j716k010l784J287m077n21L671n83p988O117J0922L529j202Q2J78n877
6582e202j7751l373q837o594J2678M207Q081Q849n296o520O606K613L364P022
6568a53N574M554o724J703l576j0566M892R139j1838L53P68j8833q997J2196J5080
6553f428j879l909K049J824P735j134m825O043R566o515l497J0050j2065j7924
6539b0909J691J1704M814p971p022o322J2492J1644n889n184M853n259R355k618
$$ y = [-4024, -3744, 3458, 13294, 4425, -18565, -9147, -2713, 837, 1858, -4004, -9746, 765, 1158, 878, 2575, 7531, 7788, -5126, -11425, -12027, -5147, 2344, 6782, 859, -168, 3292, 2799, -11320, -11650, -1210, 1594, 4580, 12875, 6794, -1639, -1638, -13050, 1277, 9216, 6045, 2416, 10357, 1554, -5201, -3230, -4946, -6956, -10740, -9453, -13530, -14051, -10380, -10963, -18951, -12834, -1912, 1617, 415, 497, 675, -5202, -22953, -26326, -35163, -41757, -29079, -24872, -16791, -7942, -13238, -19758, -13152, -10539, -7175, -153, 5421, 9975, 3251, 4954, 1378, -9188, -4296, 4843, -6995, -6642, -5874, -24707, -33704, -21508, -6428, -8307, -12216, -10167, -8343, -608, -1742, -6567, -524, 9042, 2527, -970, 9080, -2985, -20909, -19218, -7514, -2700, -10671, -17693, -24015, -11523, 121, -5768, -10952, -6099, -11358, -2003, -4621]
6525d621j3276m048J5193J7013N142j379k453J1882P641K914j2570r364j8971
6512f897j1874n066N384j895N954j825N978o73j101J83J4796P670n055j8926Q235
6497e112K1216N635p757j6601Q098P937k925k6704j6808O304J0352N859J3660
6484C154J1918j6066j6755J710o02N205L49M035n709L207j3189L424R313J684
6470h322L281j949M064J947P371j2051m999j750n382J871J440M073O560j998l288
6455i132l237N849m983j3051O174L517l479J780J8092J4786p743m412N612r748
6441B5q849n108m868J3242o09p765K464P84K142Q163O260L425r130l48J3404K392
6425A5624k785m388M945l393j9524j2676p268L404J9828P888M166N8n390J289
$$ y = [-4621, -17897, -21945, -6752, 10261, 15403, 14024, 11571, 23453, 31094, 34008, 21438, 12074, -6897, -18771, -23837, -18453, -20348, -14394, -16219, -10241, -10914, -12015, -11832, 2964, 10634, 5579, -13347, -5112, 16104, 21739, 13982, -2619, 5479, 13416, 10491, -16213, -33021, -26717, -16365, -10506, 3154, 15072, -994, -17749, -16039, -16641, -11436, -11087, -7052, -12761, -9554, -22743, -19319, -10006, -8322, -5041, -6990, -2926, -979, 6392, -5659, -10658, -12408, -17790, -15919, -14479, -10406, -3846, -5844, -9132, -12369, -6520, -11503, -24554, -18380, -14863, -18342, -16562, 1530, 16316, 8573, 4161, 9773, 25, -8824, -13932, -18800, -5558, -6167, -13932, -11468, -10684, -8542, -379, 5881, 9306, 176, -172, 13232, 15624, 12839, 8451, 13396, 10003, -9521, -22197, -29465, -26061, -6233, 1655, 5821, 5879, 489, 1778]
6411A778j4275j7841Q979J3092k26L160l260j1544j3855J6770K0315M015j7098
6398i990k055m32L72L986M384K565q806j2822K0094K4218N536j4646j9160n865
6384a2621Q404J26o751o645K0765R880p061k506J6220k027j2117J077r107r891
6370a2254M110m53q187j0422J573J1495l015n950J5548l397P406N948K246J886
6356F534k109j322n090k174k512K969L7p097r821J2829K1020r61q757k667o829
6341e950n392o760K165R728J1601O258j2783j0991p313j2194O775M988K506o93
6327a8055J1356J0422L489p476N620k107o822J903N527J949J4891P977l221m938
6313B0515r52o487q773o389Q925N47j6564r717N506m01J4063M203L284K144J1621
$$ y = [1778, -12497, -30338, -21359, -8267, -8493, -5333, -8593, -20137, -33992, -17222, 3093, 7108, -9990, -12045, -12477, -12105, -8119, -3735, -1170, -9976, -22798, -2704, 21514, 27050, 12404, -6756, -12621, -4217, -4091, -10842, -17487, 3278, 13158, 6097, 3591, 19811, 17784, 5667, 6744, -2363, -12254, -8144, -8597, -16784, -27206, -25633, -14138, -17153, -23103, -7555, -10952, -3546, 2402, 4648, 6534, 4425, 3103, -1987, -4161, -6673, -3704, -3667, -10764, -20585, -7756, 13264, 12303, 3546, 879, -5950, -11342, -18102, -15937, -6209, 5392, 11650, -1133, -12124, -19437, -31631, -24856, -19868, -17362, -18055, -6699, 3723, 7212, -264, 5356, 3249, -3573, -1670, 3857, 5806, 20697, 28674, 25453, 20515, 19563, 13076, 4303, -2086, 6839, 7386, -9178, -18895, -13389, -13790, 273, 4476, 7760, 9904, 21525]
6298B1525m213j6010m283O486r69j923k771r77m630J917p299O920J2411M480l190
6283G474L535J691j0116k683m808j743R28j5134j0880r516J751K174J0422O426
6269b0479P658J5392L523j628q793L79N929Q762j695k67l925j4059q547N468J495
6254a0787j2473o897Q629N323N793J191m206p59N819j0288l891M371J8958J4975
6240A5758q583j5032r641Q429m142n845R860P093L579j475J931m372j3197R8j4
6225a5553J0634J481J0917k097j232l160o881K873l189M613K591n718q027R80
6211a1768O646n295N293J0519O691j940l737j0228p562O254N572m362Q75M988
6197A946n79O709M48k611m57J607k885J261M632J117R567j475j3829l363j421
$$ y = [21525, 17312, 1302, -2981, 3505, 2536, 613, -2158, -3135, -7765, -5848, -13147, -6227, 6184, 10664, 7474, 11009, 12700, 2584, -99, -4907, -6650, -5722, -20856, -31736, -41252, -39501, -37327, -26905, -20479, -12821, 2571, 6094, 4466, -4327, -3948, 1981, 10743, 9048, 8781, 4856, -9203, -17750, -12282, -10787, -23260, -30157, -21528, -16205, -10412, -9221, -13427, -14186, -8367, -18655, -22546, -18175, 783, 15758, 7175, -7857, -17498, -9069, -13211, -19056, -9196, -2103, 1476, 1, 1932, -2440, -15637, -15539, -15553, -4919, -3438, 7479, 5382, 4150, 990, -5891, -3018, -6207, -1594, 997, -4721, -12748, -11768, -5122, -10417, -5124, 5395, 12086, 10146, 6409, -3819, -11381, -5127, 445, -3917, -3042, 1946, 1367, 8076, 8524, 5913, 5456, 7063, 4178, 5439, 10071, 11188, 20755, 19280, 5451, 2088, 667]
6182F67J17O98j1665q431N583J6565J6696P60k2074l602n371m93O035N099K073
6167B657n754J0114J988L393J015K18j0688k983J1285j3914j3218L775J1425L255
6153B568r814n62p338n777R739N384J7222L965o70k869n640J0205j5861k574q238
6138a0260J050n61R967o99m505l425m299O746N844k785m808m91L3229N337j2735
6123A7605m922l646j2283j4241P837M589R835J0285q623p008J1837O555q873o471
6109B476R315M875o316l870k5738j739L0573J5874j5960o295J2949k713j5020
6096a589p42R582l058n246m173J4314o224j6092J149J4566K688q380l546K047
6082d704lm838J1862j1770R191j830j5216J441J1470J1303j4520J0145O639J759
$$ y = [667, 784, 1482, -10183, -18614, -13031, 3534, 20230, 20990, -1084, -4686, -10057, -10550, -4515, 584, 2657, -3097, 7017, 9005, 12398, 13413, 13631, 2943, -40, 11245, -2669, -15887, -12112, -687, 2568, -7246, -7808, -15146, -20923, -11184, -5800, 11422, 15387, 14717, 11848, 6208, 16413, 552, -2022, -10260, -9210, -9771, 196, -503, -5008, -8433, -12732, -5986, -142, -2927, -7735, -8226, 25003, 30340, 17605, 12683, 9037, -3246, -17487, -9650, -5061, 4774, 15059, 6436, -572, 11265, 17820, 8947, 2476, 11791, 16666, 10350, 6480, -19258, -20997, 9576, 25450, 9490, 3195, 16144, 13431, -1589, -2331, 7251, 4193, -1053, -5226, 9088, 2864, -13228, -12079, 2487, 5175, -3205, -6751, -4704, -4707, -9545, 2317, -9453, -262, -2092, -17308, -15867, -4397, 6906, -7614, 2531, 9170, 10929]
6068A0929k790p852j220k426K335j049L204j5261p8K670l449L190m625q337m596
6053b9355L260R278Q612o653R492K538K029K243M365j0809j3243N564J0458P301
6039E080q034n397j0664k384p896j2773K619K2897O108m297P016J0393K90j429
6025A529p738m809m987L499R701J595n356J1426L607j290N74k812j1889n472k66
6010a2688m356O298R279L452N712k961l803j0580l30J0850n400j0924J6251J0061
5996A0861M985M81K61r009j0796O287P696m179j599J1174R288n661j0253j2108
5982b572m550o175n642Q744O288l061K539j754L556L338n249o02l773q660K348
5967a5225k816N915O311M923J4380J1034r258r158m624M44Q784q751J62o79r496
$$ y = [10929, 8139, 287, -933, -3359, -1024, -2073, 1131, -14130, -14208, -11538, -14987, -11797, -16422, -24759, -29355, -26095, -16817, -8205, -14858, -5366, -2828, -799, 1444, 5809, -5000, -18243, -12679, -2221, 5080, -2954, -8351, -19015, -21399, -29295, -42068, -39449, -16552, -10444, -14741, -7725, 2668, 2958, 1529, -6209, -11018, -16005, -12506, -2805, -1210, -6566, 4860, 8467, 7177, 7751, 4939, -6950, -12422, -12688, -17044, -10746, -1467, 1985, 7697, 4736, 933, -9647, -9977, 873, -4527, -15451, 800, 10861, 15846, 16327, 16588, 7579, -3217, 3070, 10766, 6587, 4988, 16162, 25450, 19789, 9536, -2572, -7122, -13297, -18939, -10195, -3907, -6968, -4429, -6183, -2627, 711, -4538, -5140, -8913, -17573, -15225, -18041, -12126, -5815, -892, 13488, 24522, 15264, 6106, 1482, 1926, 10710, 1959, 2121, 1442, -8054]
5952h054p243o24J66j0813p66N399J2283K742o597N147p05p84j1512n970P656
5937a9675M543R358J085N318J0728k337q589n690j3208r249M213J987R296O814
5923e406j1270k054M760j2079L99K841m372R350P359k301k28O133J5353j0783
5909b298j1272q995J533N677l755M119O624j122N253Q254m643j1100q820j7296
5895c7841r04P070K2116J2689K803j2142p679J3076q150r046j760k325O530K729
5881a2834l323J485R292j71N498Q246j0537l419L091j00Q77p828L642k336k980
5866a1397J3077J7234l773r879j2541k00L56j0556k610J6297j536J3554J1194
5853A9220o509r950j4091l8L758J5049o281K191R710o233q486K277M030j797k488
$$ y = [-8054, -15297, -15921, -15755, -26568, -27334, -21935, -9652, -6910, -13507, -8360, -9065, -9849, -21361, -27331, -19675, -15132, -5774, -4689, 629, 11357, 9020, 431, -5259, -18467, -27716, -23503, -21516, -12220, -5406, -16676, -18730, -13970, -26049, -25650, -22809, -27181, -17831, -10472, -12773, -13001, -6868, 8485, -2298, -13570, -22565, -21032, -15355, -19110, -14991, -8367, -9489, -4236, 4018, -625, -11725, -20545, -37841, -38745, -31675, -9559, 3130, 5933, -6209, -13888, -812, -8962, -18008, -19768, -22093, -15563, -12834, -16157, -14672, -5380, -5551, -53, 8193, -2344, -5763, -2672, -2772, -1895, -9723, -6081, -8417, -11397, 1680, 18914, 15141, 5262, -7279, -7479, -7123, -17679, -20289, -3992, -5528, 8026, 19220, 12711, 2761, -11330, -11368, -7610, 7439, 1158, 3349, 13059, 6826, -1660, 617, 4647, 2850, 362]
5838C62l996q003n915K31n317J475M524N317Q690m498L315J0406k239p784m081
5823g513J612J502M248L990J9271j675O169r153k2134j0685J750l777N088J1126
5809a81J6131n815j2182j1144j0772M629J8192J4479N742j0838j0024l086J244
5796c625J5940Q90j7411j3565J3393j609j497M798N1P580J4136j625j9681j2236
5782a4461k98R986M770l008l662k998j468q596o43Q203N499N923j26j404Q642
5767F359q763J138L507j1648N191K0701M041N818j0465j1790m020J6006N771n057
5753A6789k055j8175r695k841J1734k857n49P605N539K491j850p443J28m735n942
5738a1856K013O042J5363N073m014N415P90J995M82j5909r603j2062Q811P466
$$ y = [362, -3634, -11637, -17552, -17321, -22638, -21163, -16639, -11322, -2632, -7130, -3815, 6591, 4352, -3432, -7513, -5901, -4399, -151, 3839, 23110, 21435, 27604, 18451, -3683, -14368, -12618, -16395, -11307, -181, 15950, 10135, -2047, -13191, -23963, -19334, -1142, 13337, 19079, 8241, -1783, -4869, -3625, 12315, 13205, -4206, -17771, -4378, -5987, -7484, -2686, -2635, 4945, 19081, 17456, -2225, -14461, -14759, -4773, -3, -3011, -6673, -9671, -11139, -19735, -20378, -12175, -6676, -753, -879, -2283, 6359, -2404, -1266, 2241, -9407, -4216, 16485, 20526, 26344, 15879, 4089, 69, 16075, 21846, 16789, 14734, -3441, -13136, -15977, -4243, -7100, -7649, -44, 5495, 7986, 6136, -1307, -1179, -5914, -11856, -9843, -3801, 11562, 16635, 12621, 18036, 18826, 20821, 21303, 5394, -4209, -16271, -7460, 6]
5724Fl25N273j7177L496N089J926r506J1481P750j1905j956M179r833o158P88
5709a6872k834j98P509J7027j4682o312L259L983O456j2134j891O474J288M297
5695d630k04R774n10j0493m223M791O787J2846j2802p370j1965r438N61O821k09
5680b0264q365J275Q923j7m32J3943R257K648j519p888j2444j7030K445Q944K953
5665a7571R910l80k796N751K495j2082R4N774M516M979j071L690J0060m68O507
5650A9408j3416j2157j0876N641J0509O27p90k464L845O845l111L516l645p554
5636c622R747j812j720O339o34k643j3521j3705k779R27P981M503j462J0916m183
5621e668j0241O686N255K499R57q30P684o013m435l317j5654k497O106J6240R230
$$ y = [6, -319, 4954, -12223, -8727, -3638, -1712, -11218, 263, 8013, -3892, -5848, -1669, -11502, -17660, -16872, -19706, -19904, -12395, 4632, -10050, -16362, -13103, -9120, -2664, -14798, -16689, -10215, -8927, -4630, -4834, 4940, 4430, -6063, -10286, -5495, 1292, 14138, 1336, -6034, -17999, -27437, -26876, -20055, -20264, -28629, -27354, -18431, -18448, -18880, -4937, 4320, 6968, 5449, -2439, -14883, -31913, -29468, -20524, -17571, -7661, -8041, -10837, -5086, -2591, -14673, -14579, -8805, -4289, 690, -381, 3309, 13369, 12901, 19408, 5992, -6165, -17041, -11400, -891, -264, -1054, -3518, 327, 7172, 4061, 7577, 3932, -3622, 6125, 4313, 2593, 8932, 8298, 5655, -7866, -21571, -24350, -23423, -15442, -10939, -12401, -1485, -5668, -15909, -9223, -3968, -1469, -512, -1342, 6342, 329, -4106, -7423, -23077, -25574, -19468, -3228, 6002]
5606F002m238M409j1052p956J1510J495M072j0885k630P29J523j008q292l338
5592a9659R739R173Q310j4480n810Q324R948L62j1689L301R670j723j5779j0135
5578b0448J4814J2111n998k0560j6905J0370m783J6756J7750P279l54J819j141
5565A0710J242j6758k232j289R93m796m499Q543J3297l444j6908k747J3531J7379
5551A3022L333j6414L732R266J5444l608j9557l0890j223J1049j747J057j1748
5538b8284o824J0490K477k741p878R247K2229J5079m342l053l606O410l780n975
5524e51o412N543P327R633J5916l156j5251r419k263R298K798q048M940J283k285
5509I353R79M405o546j901O065o079o079j1033n708l831m291j1900l101P977N683
$$ y = [6002, 1764, 6173, -4879, -12835, -1325, 170, 4242, -6643, -9273, -8544, -7021, -8029, -16321, -19659, -9920, -747, 7563, -6917, -12727, -4403, 5545, 5907, -5782, -2481, 7189, 5466, -10313, -20448, -5634, 6477, 479, -20081, -36986, -26616, -31399, -14643, 3107, 10386, 10032, 11851, 10710, 11952, -4806, -7038, -8327, -7334, -12130, -16629, -8086, 5211, 1767, -15141, -17888, -4357, 13022, 16355, -59, 3673, 12939, 28383, 24775, 5218, -25672, -26895, -15846, -17593, -16536, -28284, -35108, -24618, -22141, -24882, -32760, -23513, -1284, 13795, 9453, 6400, 2794, 9204, 5424, -551, -6963, -1420, 5907, 15540, 31456, 28300, 13049, 3630, 1367, 10665, 13463, 5415, 10355, 11638, 9353, 10332, 14737, 8191, 6290, 12355, 6276, 197, -10836, -16544, -20375, -24666, -36566, -39667, -31690, -26007]
5494b6007O376J5222M902l45J4284M067l981K377o60j3549r736J6902P209n949
5480A1112j0301j0851J416J2308J670P714p39r664q370N483O249J013k229p653
5466b842k309l413J0469k482J1548M034o364O636J044P942m311p272r547L557
5452F690J1282p012k080p355R144l153L05l478O703N141O265k881k328o042j8774
5437g573J1119o104j0262N033l315Q296n395j8798O244L513M727Q152l351j38
5423g852Q017n598m837J0185J0759L40J0121O010J6136j513k2930j3718j5103
5410i983j6212N42K713L864k946K791J4381K003k761R167P03j9970n941P73j314
5395b2190M264Q538J1403k011p866K051J0849o272k772J82O620Q127o118j0452
$$ y = [-26007, -19631, -4409, 493, 148, 14432, 18499, 14518, 16895, 16235, 2686, -7050, 9852, 17061, 11112, 811, -10040, -8624, 3684, 5354, 13068, 12329, 2665, -5705, -222, 6027, 7040, 4811, -2842, -5151, -8564, 1905, -577, 10971, 15005, 8641, 15277, 16321, 24263, 19952, 12680, 3133, 6690, 17972, 10960, 8880, 1525, 10669, 7516, 7821, 4343, 11046, 16187, 22452, 19571, 17243, 11201, -7573, 3546, -2558, -12820, -7787, -11102, -2806, -8201, -26999, -20755, -17242, -12515, -4363, -7714, -7852, 165, -5433, -10270, -85, 10674, 11014, 21135, 27145, 43281, 41768, 18838, 5120, -9983, -26195, -25653, -22940, -19076, -22022, -19231, -4850, -2847, -5608, 3559, 4262, -15708, -21649, -20876, -22190, -17926, -9388, 2015, 4, -7862, -5811, 5038, -1234, -4006, -3824, 2796, 10923, 4805, -5647]
5381e647j96o050k803l575J3986k894p660P019K877p675j49J2672N884q289j820
5366d320j528l045N205m885r435j2303R621J5466r970j8187P664J8828j900k676
5352a1465Q229L171j1983k3810j7970Q775J5241M748J730L448O666O006R199P669
5338I654j3546r126O645P609Q146j0901q903R31j91n237l434J639r966r966K1825
5323a4821J1050o39P457L098J922l767N892M68J727P349k67j2393n240Q131r909
5308E8j466m887O121Q149j6172o37j0150j4172M114K1445J8884o4r792q98j1834
5293a1301j3713k001p70l708r87J2741J173M390N948N72j9417p805J4058P472
5279a3348N37O682l452m098J2124j25J1114n252j528n420n055q500j393L759K31
$$ y = [-5647, -5843, -11893, -14696, -18271, -4285, -7179, -14839, -7820, -4943, -12618, -12767, -95, 5789, -2500, -4320, -5848, -8893, -3688, -8573, -18008, -30311, -20690, -5224, -15194, -33381, -25717, -6889, -8789, -11465, -3236, -65, -12048, -35858, -53828, -45053, -29812, -25064, -23334, -19886, -13220, -7214, 1985, 9654, -3892, -13018, -6373, 1236, 9382, -1519, -10422, -9491, -9682, -14919, -18353, -16714, -26680, -36646, -14821, -3771, -4410, 3047, 6145, 8067, 4300, 10192, 10660, 12387, 19736, 19469, 7076, 1836, 9967, 58, -1408, -6295, -174, 7975, -8197, -8834, -18984, -33156, -29042, -7597, 11287, 11223, 1431, 533, -11301, -25014, -27015, -27785, -31493, -32480, -19739, -18566, -14176, -8228, -7656, -27073, -34878, -20820, -13348, -12811, -6129, -9581, -13679, -1555, -1680, 9434, 4182, 2654, -2766, -7821, -16321, -17714, -13955, -13724]
5264a3724O835k491j1550j854n594M265O68R574J5224j418j341k523j79j2856
5250a6964n734O70L718K502K723k373o251O183P283k435O87o809o863J0218n286
5235a8731J621J2574Q983n950m992p879j7014L181K4842J6730P828j929n499k446
5221A1319o730r479J852J0406j3696K919J1751M415q264o128r516n337Q567j882
5207i803j196j7205n332K3410J5135J930q05j696L065P97o372N049K105j0528
5193a446m46k058K434M319o24p520k3r583j1983n936j195J2024K0810L977p057
5178d307J1019l555n7o17P971P024o664n109L434p284r754J059J3871M045j2089
5163a013j2108J39J6953O112j0490j4426n546o314J7762J1009o053m477j5614
$$ y = [-13724, -6889, -9380, -20930, -22784, -28378, -24113, -23445, -13871, 1353, -65, -1406, -3929, -4108, -16964, -22698, -22028, -18310, -15808, -13085, -15458, -21709, -15526, -8243, -10678, -9991, -16800, -23663, -13445, -18731, -17110, -4536, 4447, -1503, -6495, -14374, -31388, -28207, -3365, 13365, 21193, 19264, 13765, 11319, 4589, -4890, -3038, 7368, -6328, -3409, 8342, 12757, 4493, -1635, -11151, -16488, -7921, -9803, -10999, -28204, -33536, -10126, 5009, 6939, 6134, 4438, 7503, 8300, 1928, 6977, 9082, -1446, -1892, -3950, -1516, 2803, 2179, -5341, -5364, -14947, -26930, -32866, -34061, -22037, -1227, 2750, -4307, 6712, 3157, 3100, 2483, 10454, 17478, 10814, 5705, 9139, 1855, -7899, -6840, 7031, 11076, -1013, -13121, -12982, 3971, 10083, -407, -14833, -20379, -26693, -8931, 2078, -3975, -8452, -24066]
5150b4066q172R429O143j0646m400R516J6843j923k755J466L06Q064J350j449
5136b94o678J101N390L803q035j4323Q348J8722P513m091q378j929j677o563J0225
5121C134p038m177M434P482l087P229j135k0188q474K0869M608q781l909L449
5107e584K997j0806m142J817P866N606l201L83M626O698q009R57J6779J1975J231
5092B9193p441j1578j1679M457O673R452r297o324Q07n571M823r176j6708K806
5078a9563L103N583j363m042n609r162n496L008K2093J4644k922n706p099M269
5064h262J7965J5549k157o507r508m688m182J0183l536o186o295N946O709m001
5050A030m230o773j987R001r996O555R87K181M794K918o065j821p45o549J3058
$$ y = [-24066, -32238, -22809, -16666, -27312, -31712, -22196, -5353, -7276, -10031, -8565, -8259, -195, 1155, -294, -6972, -5871, -481, 3322, -4713, -19036, -10688, 8034, 15547, 11456, 3078, 1149, -528, -7091, 3134, -3904, -8081, -3647, 3835, 748, 7977, 6842, -13346, -21820, -951, 3657, -5124, -9033, -5584, -2587, -13393, -17535, -15718, -7852, -2246, -5447, -5064, -438, 6260, -1749, -792, 15987, 27962, 29193, 21752, 10174, -1505, 2952, 9625, 19077, 9780, 3456, 4263, -1308, 3515, -5661, -22369, -19563, -16460, -10877, -12240, -16282, -21891, -31053, -36549, -33541, -11448, 3196, 274, -5432, -12531, -8262, 9703, 25252, 23095, 16588, 7080, 2392, -1790, 8393, 4857, -1329, -7624, -1678, 5031, 1030, -3200, -9973, -11960, -2959, -12955, -6400, -5413, -3232, 1562, 4480, -1585, -3406, -4151, -10700, 2358]
5035B358j0840r98J3593M946r160r315N911L698q663j7668O503R653l865N786
5021h061Q601k74j2797m595K679L368K607P731J0355j8588m310J853J816j043
5007a0658P499j5262Q235J3034J727o954n650l670l207n217M663M934J832K077
4993f617J7249n233j5733j1692l419J8286O369l778N805o088p759o789J0717M373
4979d309j3722L965J4723j2749k616M844L496N68J4584Q324p92L841Q54j6251
4965D760q984K015J51M462N231o413p689P933L955P604L370j4095K56k598k44
4950b86L259k813j1453k555m694n86j256N76J1721P115j419l627j2208k276J1624
4935h878O220N350n676j825j1904j1076N682J1478m71J14J3272k078q74l697j8422
$$ y = [2358, -8482, -9480, 4113, 9059, -101, -9416, -3505, 193, -8470, -26138, -19635, -9982, -13847, -8061, 540, 266, -12531, -17126, -14447, -11079, -8472, -741, 9614, -8974, -13284, -11431, -9615, -10658, -3159, -18421, -10186, 2848, 4575, -2379, -8029, -11699, -14906, -20123, -15460, -10526, -8694, -6617, 10632, 5399, -10334, -22026, -25445, -7159, -790, -4568, 1237, -4851, -12610, -19399, -8682, -4309, -18031, -14066, 657, -12092, -14708, -9864, -6368, -5800, 8784, 17108, 16316, 20157, 21011, 4760, -4224, -2209, -2058, 2404, 7635, 1222, -6467, 1466, 5421, 13025, 16395, 2300, 2556, -42, -286, 2973, 160, -11293, -13848, -18542, -19128, -20384, -19808, -8087, -972, -2391, -6018, -18226, -20502, -8878, -2658, 2692, -2984, -4809, -16713, -27789, -22107, -10629, -11100, -10986, 2286, 208, -666, -4363, -22785]
4920b2785P345Q695J7335j3883r335m248k38O892L15k38j534j673l94r68Q306
4905f408Q724p002q312j603j155K1487L666q734o306L514l769O83q253J653j6382
4890b8197L568n379j2130J7747K3933j262p631n363J819Q988K2926j772n426m577
4876G244q510M574N885j0193n364J0121k158k1277J565J2515P476Q04k966j1239
4862a1523J1310j662k224O724j2224k505J975j941J1313R250L674p401j4131n351
4848a4716j968l648K458m253o553p157M397J0335j118n126M972J830M087L814
4834a2646P250L044m773m793q504J2442J1050R578n213j4215R133m890j3665l59
4820a6561p267M43Q604O246J1933p556P848Q393m385o505l261L562j014J895J681
$$ y = [-22785, -15440, -6745, 10590, -3293, -12628, -16876, -17114, -10222, -9907, -10145, -11679, -13352, -13746, -14714, -6408, 2316, -4686, -12998, -14601, -15756, 5731, 9397, 663, -5643, -2129, -5898, -5215, -13468, -11815, -28197, -24629, -30008, -42138, -24391, -458, -1720, -9351, -14714, -12895, -3907, 19019, 17247, 11821, 7244, -1266, 3308, 9193, -1000, -6364, 3757, 1599, -19678, -18113, -5598, 1878, 2682, -284, -11523, -213, -1875, -4099, 2625, -9599, -12104, -10129, -12070, -757, 8493, 12167, 4766, -9365, -14716, -16684, -20332, -17874, -22127, -28680, -35837, -31440, -21105, -22223, -27349, -22377, -20547, -16460, -12646, -5396, -2352, -7125, -11918, -20422, -7980, 3070, 12648, 7435, -6780, 2353, -2537, -16202, -16561, -23828, -23385, -14781, -8535, 3398, -4158, 3690, 12083, 7698, 1193, -2068, 1494, 480, 2375, 4056]
4805D056r237m961L117P110K917j742M190r639n753K811j0290j326J771p985M800
4790b0161J8922p671m566l68r77J7360O39l647J3991j590o896n950m398j2454
4776a7766L02L06J227R885J0412M004j219J989O810j1373j266q163j3669m025
4762b2546J0253m068j9448m272Q495O150J8997J9278n256k6683n356P352J4714
4749b390q019n153L56M940R087J2796M140j2031K713K950n992o36N505j799O209
4734A2676l423j4540k027P53p883R73Q71K651J0650Q118k407j0318j2854J0065
4720f695J3864n970J0707j189j1090k871R839N894l921M074j0706r600j3307j0200
4706c1171J45J6430J05n160L798K040l383j88O536R557j887l052M237Q319J670
$$ y = [4056, -5181, -10142, -7025, 85, 3002, 1260, 5450, -4189, -9942, -7131, -17421, -18747, -16976, -24961, -20161, -1239, -8910, -13476, -13844, -14821, 2539, 3178, -469, 13522, 11932, 5036, -914, -5312, -17766, -17464, -17158, -15931, -6046, 4366, 8370, 7151, 9140, 15950, 4577, 3311, -4852, -18521, -22546, -12293, -16361, -35809, -40081, -31586, -25436, -6439, 12839, 7583, -19100, -24456, -17104, -2390, -10409, -15562, -15206, -10266, -1179, 11617, 15757, 3726, 6439, 9389, 3397, 2761, 8266, 6467, 12676, 9253, -5287, -7314, -6561, -14444, -13471, -12600, -9949, 701, 8819, 6412, -3906, -16760, -6695, 7169, 1199, 11906, 10717, -373, -3244, 6595, 12489, 8568, 12642, 1936, -7664, -20971, -31171, -31026, -14596, -14491, -19651, -15853, -13813, -17196, -17384, -10848, -1291, -3178, -6230, -1993, 6326, 7996]
4691G996m961L18K973O407M278m366N07j6243l904M882r018M381N368n642j3417
4676b0441m252n081l087J1457J6385J0011O725r009j3961j313j560r803J2141
4663a1788L799K302J270N951J535m614L599J1084O085J597J698o665r917j2186
4649f250j1682k6250J7101K5476P087r929j0045O909K819J081r336M138J6720
4636G839O976j067M365l211j649l61o934p747r959n734r710J1626L134M623J897
4621e912J5756J589R79j126n97q582m758P791J478j5287N065J1768M717r271j799
4606A811M659j4230p026m926n299L403J2609L758J1126M949j6067j5277M753P664
4592h093J291M175n608p505O191K560n227n687L959P012j620J86j0056j459l997
$$ y = [7996, 3035, 3353, 6326, 12733, 17011, 12645, 13152, -3091, -6995, -2113, -11131, -6750, -1382, -7024, -20441, -24693, -29774, -32861, -21404, -5019, 4992, 11717, 2708, -11253, -12566, -14126, -23929, -11788, -7989, -5687, -4417, 1534, 3069, -1545, 2054, 13138, 19223, 20820, 22518, 15853, 5936, -6250, -17932, -44182, -27081, -1605, 5482, -4447, -14492, -7583, -4764, -3683, -13019, -8881, 7839, 14815, 13748, 18113, 14902, 13253, 12892, 5958, -1789, -11748, -17482, -27192, -15566, -12432, -7809, -5912, 9844, 11433, 12412, 11286, 10689, 2107, -2651, 5140, 6618, -8669, -3604, 8164, 12881, 3610, 1811, 6470, -7760, -14786, -19712, -25011, -21608, -8999, -5241, 5885, 10834, -5233, -20510, -15757, -8093, -6802, -2627, -8235, -15740, -9549, -6989, -12216, -17903, -13944, -6932, -8552, -8366, -18422, -19881, -23878]
4577b3878j535j70R060K424J32P882j1231K400R003m520p467p357J063L810J3207
4562g177n874l249P90O236j3195N439k828k886J616L619R24k366J3319K296n721
4547i057m474M912m0r331P097J3803j329M556j1281m507K064J4043J030p491p512
4532g517j1860p173Q736Q830J1002o621N414m906r285K854J2252J0380P090p498
4518A1698n129k410Q01n57k2316j2041N42J39N96P154N154J3964N627o079n050
4503g907J731Q831n634o824j3120R968J2026J760j285K323q472k3708O945Q167
4489a5199k932j470k978J1022j80j1089K167K214o330p400J7331J404p566l052
4475b4058j614J3312K455O209J0664N078m406j2789j2510k479R879J4693l149
$$ y = [-23878, -25413, -25583, -16523, -14099, -13967, -6085, -17316, -14916, -5913, -10433, -17900, -25257, -24194, -20384, -7177, -13051, -16300, -15510, -9274, -22469, -17030, -19858, -22744, -21128, -17509, -16585, -18951, -5632, -3336, -9057, -13531, -8619, -8659, -17990, -10893, 2910, 1581, 6137, -5144, -9651, -7587, 6456, 7486, -5, -7517, -19377, -26550, -17814, -8984, 2018, -4603, 811, -4095, -13380, -10526, 1726, 12106, 19196, 11698, 6569, 4159, 4960, 4403, -17913, -29954, -29412, -29273, -28677, -21523, -16369, -2405, 3222, -2857, -7907, -6176, 2655, -2979, -9803, -22923, -12955, -929, 831, -454, 1869, -6603, -30311, -23366, -15199, -18131, -19601, -22579, -11557, -11737, -22826, -20659, -18445, -24775, -32175, -14844, -13440, -21006, -24058, -25672, -12360, -9905, -3696, 6968, 12046, 7640, -5149, -17659, -20138, -10259, 4434, 1285]
4462A285j3803M48L328k777m19K358N072J757M354O353j30r950n73M47k019j2136
4446a6405q314j3379J1167J4937J6269J6453O891K590j6036l275q024J51m629
4433a604Q948n972k262r064m165J656M423J2147n246l257l85o579k498K000K546
4418i312O473n726q360q332j2094n302J7957J6683J1764J1052j4870o00Q153M067
4404A1553L217J0539j0955j2320r016j667j0993K798k078J887J271O742M086J3971
4390I035J8318j0698j0958L14N389j7282p823M321q234p499n909M215R425R593
4376g793Q784l581j681L120j557r950K217J0616J5374p155p219o265q269P092
4362f267N949j777k20l038n841j019j9574j318O82K848j350Q078R277n70K087
$$ y = [1285, -12518, -12070, -8742, -11519, -11938, -9580, -4508, -2751, 1603, 7956, 7826, -2124, -2697, -2250, -4269, -16405, -24719, -38098, -26931, -11994, 4275, 20728, 27619, 30209, 14173, 10898, 2874, 3025, -1604, 7344, 1372, -890, -9954, -14119, -12463, -8040, 4107, -1139, -4396, -4781, -11360, -13858, -11858, -9312, -2839, -8565, -16925, -25257, -37351, -42653, -24696, -8013, 3751, 14803, -67, -667, 7486, 11553, 14770, 25309, 14354, 2034, -6982, -8649, -19642, -16844, -18922, -17035, -15764, -9022, -4936, 9035, 27353, 16655, 5697, 6011, 11400, -5882, -13705, -9384, -17618, -25117, -31026, -26811, -17386, -7793, 991, -2590, -4271, -1151, -2708, -12658, -10441, 175, 15549, 8394, 1175, -5090, -13359, -6267, -318, -2095, -2315, -5353, -11194, -12213, -31787, -33105, -32423, -29575, -30925, -22847, -13570, -14140, -12053]
4347a2053J802j0382O539J6069o784j9658K569L477O019R914n456K914J2831p160
4333F41j380L119j1070m89J744r86J979P74j323J600j0104l408L01J3214J9907
4318A4519J896l31K384O036n949K473r178j5668q82r49j6648k950J6766Q895M319
4303D733N572j1196P430Q934n273n074m718N008P424K191n784j40q757n442M634
4288d58L109K805m09L763K71J502L123L364j3052M351r469r177L803J0816q949
4273d607j5142J1264J1245p084j5443j191O353k718R455j329p650N938J2580m877
4259c206j1658O601K601o25K76l523m593O513n243k958J739R719Q179K569L952
4244A0343j672q672p887J1447n158O694J8261n116j7210j3190q225N754J5995
$$ y = [-12053, -10251, -20633, -14094, 1975, -4809, -24467, -21898, -18421, -12402, -2488, -7944, -5030, 7801, 641, -739, 2380, -8690, -9179, -7435, -8421, -6442, -5668, -6991, -5391, -15495, -18903, -18602, -5388, 14519, 16415, 16084, 18468, 24504, 18555, 21028, 11850, -3818, -4700, -5649, -22297, -25247, -8481, 414, 4733, 10305, -891, 6539, 15473, 10200, 5126, 408, 5416, 12840, 15031, 9247, 9107, 350, -5092, -458, 2651, 5456, 5047, 8810, 9081, 10583, 13706, 17070, 4018, 8369, -1100, -10277, -6474, 4342, -4607, -19749, -8485, 2760, -4324, -19767, -20958, -14605, -17323, -7868, -9197, -16847, -10909, 1671, -3206, -14864, -8263, -5662, -6287, -6011, -9534, -14127, -7614, -12857, -15815, -14076, -4357, 3822, 6391, 10343, 8671, -1, -7888, 3559, -1599, 5095, 23356, 18240, 1030, -12160, -20385, -14631, 1364]
4231A364O512j2195Q85Q798r997K120K503J0123Q74J320o834k291m894R494j0351
4216b569r936P027o871N204R974m691L299J520M878O457j645n865j2686o637o6
4201a2607l181L719K430Q794P113N130q312m391k592q551M955lj6830L307J2303
4186h716N726J411j0830J0841K138o9M308l938q083J2107k865m508O82j041m464
4171g301M671J2873K10k929L470M166K913n466l429P994q067q793Q592o229J637
4156D312J3014M382n695n087k395k862P544j0177j2513q198o457J461o389m2p693
4141c6795q54J4722J5884K0945P845p968j9383n159Q098J1063j989R60P916J553
4127A6838j7181k1353J0255J6667J2375l770n09q080j2713j7951n000L929O220
$$ y = [1364, 7876, -4319, -3434, 5364, -4633, -2513, -10, 10113, 10987, 12307, 5473, 3182, -1712, 7782, -2569, -12505, -5478, -12349, -7145, 2829, -1862, 1437, 2957, 7835, 14292, 12647, 6782, -5904, -12541, -12607, -15788, -12069, -9639, -845, 6268, 11398, 3086, -1305, -3897, -12448, -7493, -7496, -24326, -21019, -8716, -2990, -1579, -12409, -1568, 570, 501, 4809, 871, -7212, 4895, 2030, -2478, -1796, -2837, -7301, -2630, 10243, 10453, 7524, 10994, 15160, 18073, 12607, 9178, 17172, 9105, 312, 8904, 2675, 4312, 17326, 21708, 16013, 10926, 8531, 5669, 13213, 3036, -9477, -17675, -24132, -22671, -29060, -29102, -36795, -37649, -22927, -7043, 13902, 21747, 13779, -5604, -10763, -2665, 8398, 6409, 7369, 15285, 16838, -343, -21696, -11441, 5226, 17601, 13831, 13322, 5242, -7471, -25422, -30422, -26493, -20273]
4114b0273Q194L472r093M395N892M447O016m53O839O04j859L10L305j438N377
4099A5735J814j690J2146j3302o447O21j0560l755J02l199o706j31N718M737j1851
4084a6768M705J3941Q750j0657j0897Q763N657J2899L932j2571R6j4987j1506
4071a8643J6973j30j9672j934J0122P668J4887o808n936q173p40J823O731Q213
4057D381J448k922m368K524n8J4525o672m444j37k456p434J1216R332L250n848
4042A2337J138N417j4859l143L759o082p115J361l846Q596J3925m614j4870N027
4028b969J4239J0312j1212j0114j1426j3787O507K888j2702j418M919J3452K426
4015h885k97J1758r028K690O553N700K941j603j7011k585M354j0476r197Q192
$$ y = [-20273, -12079, -8607, -17700, -13305, -7413, -2966, 3050, 2597, 9436, 10040, 8181, 8491, 11796, 10358, 15735, 17549, 15859, 28005, 14703, 8256, 8877, -1683, -5438, -5336, -8535, -15241, -15372, -9654, -4917, -16768, -12063, 1878, 10628, -29, -10926, -2163, 3494, 16393, 20325, 7754, 7850, -7137, -18643, -1670, -1800, -21472, -23406, -13284, -5616, 9271, 2463, -3473, -11646, -12386, -10563, -3832, 4381, 5829, 2907, -1461, 1063, 1005, 15530, 8858, 4414, 4277, 1821, -5613, 5603, 14935, 18185, 12337, 13475, 18892, 4033, 890, 4649, -1433, -8548, -7187, -11033, -2437, 11488, 6874, -7996, -2969, 11270, 21582, 10370, 256, -11170, -24957, -18450, -15562, -28264, -29682, -24763, -11311, -8885, -9182, 2576, -6452, -3762, 2791, 8491, 11432, 9829, -7182, -9767, -5413, -15889, -25086, -16894]
4001a6894J2017J3049K440n123N755j176o440j2517p359j244L596J0108P473p635
3987c950j2509o221L746J3240r145j3013M37L258P947p27K02J8263N008l136J6479
3972A9879K65j3673p271k069Q89j2870j605R280Q00n052J1245J611J2900R091
3958B3420k1422j9176l174j3560N940J4123Q791n942m001o481K102J4505N101
3945B26K77M33N795N442J8304p959j6059j3181j2171K253R631O129J500p12M945
3930D853J981j976N70j215M932k321j201j5825o157P955p36r285P534Q813J79
3915a899L47q33O884J5963r136j3806j2232j422m267O643N85L303O064J064n490
3900h232j283R554J6092K623p528n458o038J205j0669n297l065j428R864M270
$$ y = [-16894, -4877, 8172, 10612, 5489, 11244, 10068, 3628, -8889, -16248, -17492, -13896, -3788, 3685, -3950, -16459, -22680, -18934, -5694, -14839, -27852, -27415, -24157, -16210, -16937, -16735, 1528, 6536, 3400, 19879, 20144, 6471, -800, -2869, -1980, -14850, -16455, -7175, -6375, -11427, -182, 1429, 14329, 23420, 1998, -17178, -20352, -33912, -27972, -13849, -5058, -11000, -15001, -21482, -19380, -4875, 226, 503, 936, 6731, 12173, 30477, 22518, 6459, -6722, -18893, -16640, -7009, -880, 620, -92, 4853, 6834, 4858, 5428, 4213, 9145, 6824, 5623, -10202, -16359, -8404, -9140, -18425, -10891, -2078, -1899, -1552, -2385, 4499, 20462, 11326, -2480, -14712, -16134, -20401, -13758, -13173, -9870, -3806, -2742, -8232, -9515, 39, 16131, 18754, 11226, 5768, -270, 935, -9734, -15031, -18096, -19524, -9660, -5390]
3886e390p561q25M556Q756J2555J766j3506M650M393j0808J2998m091j7555o388
3872a6450L566M180J6958K3075K288j5944k961j5288k4956m913M007l093K355
3859b7176K720m720J4635J0664q736j0643J0621k838p079n854J6244J5352J3049
3846A6239N365p198j4034n782j997J2507J5362k846J492K147o706j5239n167Q97
3832d960q796m790M214K228J93L099l756n392J9646J3518r419j1897O060K485
3818B433j1085j0006P027k689j2248O705J0616k432k978Q911O099J2693j8618
3805e572K568o363o43l734J3219k100q169J2063n13K706M519j5019j2834M177
3791a5695r898r439r519R889J3510J3651J0196m116j0020p130O511Q532l361r399
$$ y = [-5390, -12951, -13776, -9220, -464, 12091, 13857, 351, 5001, 9394, -1414, 11584, 7493, -10062, -16450, -12884, -8704, 8254, 31329, 33617, 17673, 14712, -576, -25532, -30445, -26438, -29531, -27176, -24456, -29176, -14541, -3877, -12613, -23256, -12635, -15473, -22552, -28406, -12162, 3190, 16239, 21604, 14406, 372, -5410, -7407, 5100, 20462, 17616, 19108, 21255, 14549, -690, -5857, -4960, -13756, -18546, -14332, -12104, -11911, -8812, -12568, -17960, 1686, 15204, 5785, -6112, -52, 2433, -8652, -18658, -11631, -14320, -26568, -19863, -9247, -11679, -14657, -5746, 353, 13046, -5572, -3004, -9367, -10010, -13744, -525, -2625, -10794, 1269, 756, 3462, 7981, -7038, -19872, -15695, -25593, -35032, -44551, -34662, -21152, -7501, 2695, -1421, -11441, -18571, -12060, -3528, -6889, -16288]
3777a6288R428q55k844R702j3548m692M883J4898k350n3L438p390j1327K654K239
3762a2105j432O477p278P552N167o934j0394Q82Q645O30q779p955J467N740L558
3747a4759N911j969R275R220j210j3340j080K741M998J1053J9185j2090j2242
3734E693j643n400R2K687m73l498l592k119p298j2069j025J113k402J1934O964
3719a1036j086j3240r197J0048P756K24q706j226J814M994N364K592n720l24j854
$$ y = [-16288, -6860, -7715, -10559, -857, -14405, -19097, -14214, 684, -1666, -1719, 1719, -5671, -16998, -14344, -12105, -13537, -7060, -14338, -6786, -1619, -8553, -18947, -18065, -9420, -8790, -17569, -25524, -24057, -18317, -14759, -8848, -10817, -1542, 7678, 6468, -6872, -7952, -5211, -213, 10840, 30025, 17935, 5693, 4050, -1350, -1258, 1429, 956, -2542, -6134, -8253, -15551, -27620, -28645, -27532, -29934, -18000, -11036, -12122, -25362, -34559, -24511, -16755, -16531, -25237, -26463, -24649, -19655, -14291, -11699, -17419, -17743, -19597]
$$ [...]
##END NTUPLES=NMR SPECTRUM
##END=
