##TITLE=Analysis number 313632
Compound Code cc 45646
Book Reference 440/60
Project Code adrs
Chemist Name craigr
##JCAMPDX= 6.0         $$ Bruker NMR JCAMP-DX V2.0
##DATA TYPE= NMR SPECTRUM
##DATA CLASS= NTUPLES
##ORIGIN= Bruker BioSpin GmbH
##OWNER= NMR
$$ XWIN-NMR		Version 3.5
$$ Thu Sep 15 12:10:03 2005 GMT Daylight Time (UT+1h)  MAYBRIDGE\NMR@NMR_250MHZ
##.OBSERVE FREQUENCY= 250.131544655141
##.OBSERVE NUCLEUS= ^1H
##.ACQUISITION MODE= SIMULTANEOUS (DQD)
##.ACQUISITION SCHEME= undefined
##.AVERAGES= 16
##.DIGITISER RES= 18
##SPECTROMETER/DATA SYSTEM= dpx250
##.PULSE SEQUENCE= zg30
##.SOLVENT NAME= CDCl3
##.SHIFT REFERENCE= (INTERNAL, CDCl3, 0, 16.522)
##AUDIT TRAIL= $$ (NUMBER, WHEN, WHO, WHERE, WHAT)
$$ ##TITLE= Audit trail, XWIN-NMR		Version 3.5
$$ ##JCAMPDX= 5.01
$$ ##ORIGIN= Bruker BioSpin GmbH
$$ ##OWNER= NMR
$$ C:\u/data/dgb/nmr/ADRS/9500/pdata/1/auditp.txt
$$ ##AUDIT TRAIL=  $$ (NUMBER, WHEN, WHO, WHERE, WHAT)
(   1,<2005-09-15 12:09:42.86 +100>,<MAYBRIDGE\NMR>,<NMR_250MHZ>,
      <created by zg, POWCHK disabled, PULCHK disabled
       configuration hash MD5:
       62 19 C7 07 E1 42 D1 B7 37 6C 3D D0 77 39 F9 E6
       data hash MD5: 64K
       86 FA 3C 89 A8 C3 95 C9 2A F2 D1 9A 75 68 85 96>)
(   2,<2005-09-15 12:09:55.06 +100>,<MAYBRIDGE\NMR>,<NMR_250MHZ>,
      <Start of raw data processing
       ef LB = 0.3 FT_mod = 6 PKNL = 1 SI = 32K 
       data hash MD5: 32K
       8C 99 AE FC 5B 44 8E FF D9 12 B9 97 5B 00 FB 46>)
(   3,<2005-09-15 12:09:56.97 +100>,<MAYBRIDGE\NMR>,<NMR_250MHZ>,
      <apk 
       data hash MD5: 32K
       E4 75 79 1F 8B 5F 20 54 F5 7D C8 53 43 EF 59 D3>)
(   4,<2005-09-15 12:09:57.72 +100>,<MAYBRIDGE\NMR>,<NMR_250MHZ>,
      <abs ABSG = 5 
       data hash MD5: 32K
       62 9F C8 09 F6 CF 5C F7 EB B1 EE 20 35 CA 62 24>)
$$ ##END=
$$ 
$$ hash MD5
$$ 80 72 B9 00 C8 87 EC 22 81 60 8D 8E 8C D8 E6 B3
##$RELAX= 
##$RELAX= 
##$RELAX= 
##$RELAX= 
##$RELAX= 
##$RELAX= 
##$RELAX= 
$$ Bruker specific parameters
$$ --------------------------
##$DU= <C:\u>
##$EXPNO= 9500
##$NAME= <ADRS>
##$PROCNO= 1
##$TYPE= <nmr>
##$USER= <dgb>
##$AMP= (0..31)
100 100 100 100 100 100 100 100 100 100 100 100 100 100 100 100 100 100 
100 100 100 100 100 100 100 100 100 100 100 100 100 100 
##$AQSEQ= 0
##$AQ_mod= 3
##$AUNM= <au_zg>
##$AUTOPOS= <15 >
##$BF1= 250.13
##$BF2= 250.13
##$BF3= 250.13
##$BF4= 250.13
##$BF5= 500.13
##$BF6= 500.13
##$BF7= 500.13
##$BF8= 500.13
##$BYTORDA= 1
##$CFDGTYP= 0
##$CFRGTYP= 5
##$CHEMSTR= <none>
##$CNST= (0..31)
1 1 145 1 1 1 1 1 1 1 1 1 1 1 1 1 1 1 1 1 1 1 1 1 1 1 1 1 1 1 1 1 
##$CPDPRG= <>
##$CPDPRG1= <>
##$CPDPRG2= <>
##$CPDPRG3= <>
##$CPDPRG4= <mlev>
##$CPDPRG5= <mlev>
##$CPDPRG6= <mlev>
##$CPDPRG7= <mlev>
##$CPDPRG8= <mlev>
##$CPDPRGB= <>
##$CPDPRGT= <>
##$D= (0..31)
0 1 0 0 0 0 0 0 0 0.06 0 0 0 0 0 0 0.0002 0 0 0 0 0 0 0 0 0 0 0 0 0 0 
0 
##$DATE= 1126782581
##$DBL= (0..7)
120 120 120 120 120 120 120 120 
##$DBP= (0..7)
150 150 150 150 150 150 150 150 
##$DBP07= 0
##$DBPNAM0= <>
##$DBPNAM1= <>
$$ [...]
##$SUBNAM7= <"">
##$SUBNAM8= <"">
##$SUBNAM9= <"">
##$SW= 20.6930455092707
##$SWIBOX= (0..15)
0 0 3 0 0 0 0 0 0 0 0 0 0 0 0 0 
##$SW_h= 5175.983436853
##$TD= 65536
##$TD0= 1
##$TE= 295.16
##$TE2= 300
##$TE3= 300
##$TEG= 300
##$TL= (0..7)
0 120 120 120 120 120 120 120 
##$TP= (0..7)
150 150 150 150 150 150 150 150 
##$TP07= 0
##$TPNAME0= <>
##$TPNAME1= <>
##$TPNAME2= <>
##$TPNAME3= <>
##$TPNAME4= <>
##$TPNAME5= <>
##$TPNAME6= <>
##$TPNAME7= <>
##$TPOAL= (0..7)
0.5 0.5 0.5 0.5 0.5 0.5 0.5 0.5 
##$TPOFFS= (0..7)
0 0 0 0 0 0 0 0 
##$TUNHIN= 0
##$TUNHOUT= 0
##$TUNXOUT= 0
##$USERA1= <user>
##$USERA2= <user>
##$USERA3= <user>
##$USERA4= <user>
##$USERA5= <user>
##$V9= 5
##$VALIST= <valist>
##$VCLIST= <CCCCCCCCCCCCCCC>
##$VD= 0
##$VDLIST= <DDDDDDDDDDDDDDD>
##$VPLIST= <PPPPPPPPPPPPPPP>
##$VTLIST= <TTTTTTTTTTTTTTT>
##$WBST= 1024
##$WBSW= 4
##$XGAIN= (0..3)
0 0 0 0 
##$XL= 0
##$YL= 0
##$YMAX_a= 366037
##$YMIN_a= -488816
##$ZGOPTNS= <>
##$ZL1= 120
##$ZL2= 120
##$ZL3= 120
##$ZL4= 120
##$ABSF1= 16.522
##$ABSF2= -4.171173
##$ABSG= 5
##$ABSL= 3
##$ALPHA= 0
##$AQORDER= 0
##$ASSFAC= 0
##$ASSFACI= 0
##$ASSFACX= 0
##$ASSWID= 0
##$AUNMP= <proc_1d>
##$AZFE= 0.1
##$AZFW= 0.1
##$BCFW= 0
##$BC_mod= 0
##$BYTORDP= 0
##$COROFFS= 0
##$CY= 12.5
##$DATMOD= 1
##$DC= 0
##$DFILT= <>
##$DTYPP= 0
##$F1P= 14.0000005364418
##$F2P= -0.99999901652339
##$FCOR= 0.5
##$FTSIZE= 32768
##$FT_mod= 6
##$GAMMA= 0
##$GB= 0
##$INTBC= 1
##$INTSCL= 1
##$ISEN= 128
##$LB= 0.3
##$LEV0= 0
##$LPBIN= 0
##$MAXI= 10000
##$MC2= 0
##$MEAN= 0
##$ME_mod= 0
##$MI= 0
##$NCOEF= 0
##$NC_proc= -4
##$NLEV= 6
##$NOISF1= 0
##$NOISF2= 0
##$NSP= 0
##$NTH_PI= 0
##$NZP= 0
##$OFFSET= 16.522
##$PC= 1
##$PHC0= -80.66138
##$PHC1= 4.046604
##$PH_mod= 1
##$PKNL= yes
##$PPARMOD= 0
##$PSCAL= 4
##$PSIGN= 0
##$REVERSE= no
##$SF= 250.13
##$SI= 32768
##$SIGF1= 0
##$SIGF2= 0
##$SINO= 400
##$SIOLD= 32768
##$SREGLST= <1H.CDCl3>
##$SSB= 0
##$STSI= 32768
##$STSR= 0
##$SW_p= 5175.98343685301
##$SYMM= 0
##$S_DEV= 0
##$TDeff= 65536
##$TDoff= 0
##$TI= <Analysis number 999999
Compound Code 99
Book Reference 9
Project Code 9>
##$TILT= no
##$TM1= 0
##$TM2= 0
##$TOPLEV= 0
##$USERP1= <user>
##$USERP2= <user>
##$USERP3= <user>
##$USERP4= <user>
##$USERP5= <user>
##$WDW= 1
##$XDIM= 32768
##$YMAX_p= 476335997
##$YMIN_p= -246920
$$ End of Bruker specific parameters
$$ ---------------------------------
##NTUPLES= NMR SPECTRUM
##VAR_NAME=  FREQUENCY,     SPECTRUM/REAL,   SPECTRUM/IMAG
##SYMBOL=    X,             R,               I
##VAR_TYPE=  INDEPENDENT,   DEPENDENT,       DEPENDENT
##VAR_FORM=  AFFN,          ASDF,            ASDF
##VAR_DIM=   32768,         32768,           32768
##UNITS=     HZ,            ARBITRARY UNITS, ARBITRARY UNITS
##FACTOR=    0.157963299565203, 1,           1
##FIRST=     4132.6476996994, 0,             0
##LAST=      -1043.33573715361, 0,           0
##MIN=       -1043.33573715361, -246920,     0
##MAX=       4132.6476996994, 476335997,     0
$$ Real data points
##PAGE= N=1
##DATA TABLE= (X++(R..R)), XYDATA
$$ [...]
$$ plain form
24192 25260 20925 5276 19187 17321 -6950 -11988 -9852 -23296 -37418 -39142 -42155 -20631 -2535
24179 -2535 11559 18056 -66 -7959 24416 59915 62055 35610 10835 6420 4851 19363 9823
24166 9823 9055 3133 -13150 -19437 -23355 -27678 -37808 -30092 -11188 16134 30753 46213 21780
24153 21780 -22077 -20333 -15581 -17398 -7068 8436 2938 -34104 -65755 -51156 -49623 -27890 -16671
24140 -16671 -13795 -9402 -26252 -18474 -28304 -26502 -28831 -27571 -31878 -21667 -14017 -8365 -25536 -21602
24126 -21602 -24739 -20954 -40332 -31957 -19685 -23748 -25209 -19715 4685 3882 25319 18683 15724 24663
24112 24663 24229 -2004 -24086 -21423 -16783 7619 23843 -8177 -13004 1121 -11866 -29943 -13183
24099 -13183 -1588 -41887 -58308 -47568 -29461 -1895 -1407 809 -3503 12763 4493 7018 -2352
$$ packed form
24192B5260m335j5649J3911j866k4271n038K136j3444j4122j724l013K1524J8096
24179b535J4094O497j8122p893L2375L5499K140k6445k4775m415j569J4512r540
24166I823p68n922j6283o287l918m323j0130P716J8904K7322J4619J5460k4433
24153B1780m3857J744M752j817J0330J5504n498l7042l1651J4599J533K1733J1219
24140a6671K876M393j6850P778r830J802k329J260m307J0211P650N652j7171L934
24126b1602l137L785j9378Q375J2272m063j461N494K4400q03K1437o636k959Q939
24112B4663m34k6233k2082K663M640K4402J6224l2020m827J4125j2987j8077J6760
24099a3183J1595m0299j6421J0740J8107K7566M88K216m312J6266q270K525r370
$$ plain form
24086 -2352 -4366 -3477 -5143 -19209 -32568 -26891 -12644 -9476 21997 50676 66875 59229 47735
24073 47735 31389 21574 24904 37266 30221 2827 -5835 -10480 -22696 7161 20232 5405 4524
24060 4524 21945 5318 -7717 -1973 -3621 -7262 12356 -13308 -3139 32777 47335 49429 39504
24047 39504 29655 34077 21592 26798 41820 52365 56494 46255 6683 -5129 18234 47374
24035 47374 34204 17448 42779 45497 51940 50172 2572 -13082 5321 6123 6589 -15191 -24144
24022 -24144 -37610 -40463 -21654 -14137 -24187 -20128 -3335 6806 -10660 5388 13099 12989 -6842
24009 -6842 15565 32928 16909 10031 10673 -6802 -29699 -11067 15499 -7060 -26294 -26032 -38426
23996 -38426 -33585 -6970 6624 6631 -12655 -19721 -14036 -27325 -23438 -10314 -14005 -1056 7823 -16421
$$ packed form
24086b352k014Q89j666j4066j3359N677J4247L168L1473K8679J6199p646j1494
24073D7735j6346r815L330J2362p045k7394q662m645j2216K9857J3071j4827q81
24060D524J7421j6627j3035N744j648l641J9618k5664J0169L5916J4558K094r925
24047C9504r849M422j2485N206J5022J0545M129j0239l9572j1812K3363K9140
24035D7374j3170j6756K5331K718O443j768m7600j5654J8403Q02M66k1780q953
24022b4144j3466k853J8809P517j0050M059J6793J0141j7466J6048P711j10j9831
24009f842K2407J7363j6019o878O42j7475k2897J8632K6566k2559j9234K62j2394
23996c8426M841K6615J3594Pj9286p066N685j3289L887J3124l691J2949Q879k4244
$$ plain form
23982 -16421 -1135 22097 27631 18564 8434 -603 -14031 -14846 -23747 -7266 -11862 -27985 -19892
23969 -19892 -10562 -23897 -8417 5833 -11555 -18632 -22844 -17768 -2421 -8023 10667 15136 29720
23956 29720 27476 19673 43306 23017 40782 38976 28892 9003 -13081 -5553 -6636 -20908 -18087
23943 -18087 -12122 -27850 -9533 16095 22200 13704 8580 -5885 -24891 -32403 -8265 -12078 -21495
23930 -21495 -4664 4000 21566 36473 5812 -6545 -20541 -5445 6662 22525 17643 7084
23918 7084 -1961 11154 1366 -5000 -21499 -13949 12242 16427 11253 -8532 -25431 -31389 -37919
23905 -37919 -31050 -43717 -56738 -63223 -68049 -69778 -43536 -1168 -18051 -38020 -37586 -42897 -26871
23892 -26871 -6116 -18700 749 34458 40696 43796 26711 13026 14215 -8458 -13683 -16827 -6435
$$ packed form
23982a6421J5286K3232N534r067j0130r037j3428q15q901J6481m596j6123Q093
23969a9892R330j3335J5480J4250j7388p077m212N076J5347n602J8690M469J4584
23956B9720k244p803K3633k0289J7765j806j0084j9889k2084P528j083j4272K821
23943a8087N965j5728J8317K5628O105q496n124j4465j9006p512K4138l813r417
23930b1495J6831Q664J7566J4907l0661j2357j3996J5096J2107J5863m882j0559
23918G084r045J3115r788o366j6499P550K6191M185n174j9785j6899n958o530
23905c7919O869j2667j3021o485m826j729K6242M2368j6883j9969M34n311J6026
23892b6871K0755j2584J9449L3709O238L100j7085j3685J189k2673n225l144J0392
$$ plain form
23879 -6435 -8805 -33282 -29924 -1458 13881 1345 31814 61942 46417 42904 -11321 -23052
23867 -23052 -19634 -12414 -9391 -32461 -21596 778 -21040 -34747 -24314 -17451 -33440 -16795
23855 -16795 6186 -19635 -53459 -42635 -13066 -43652 -50343 -74400 -59612 -12298 -5318 -10164
23843 -10164 -21730 -18834 -22789 -31109 -14437 -2554 -6254 -15831 -17346 -15266 -11578 10143 15609
23830 15609 225 -622 -26089 -31405 -44454 -54117 -28910 -12143 24265 47329 18207 5560
23818 5560 11986 34655 28830 18593 32344 34813 10276 -25010 -35272 -39696 -40531 -29290 -10704
23805 -10704 -28586 7399 25112 17750 -11782 -24786 -35261 -65776 -62209 -53290 -44256 -30752
23793 -30752 -29892 -40812 -29754 -34904 -30374 -30872 -56068 -38704 -20209 -10534 -8447 -7459 -315 8328
$$ packed form
23879f435k370k4477L358K8466J5339j2536L0469L0128j5525l513n4225j1731
23867b3052L418P220L023k3070J0865K2374k1818j3707J0433O863j5989J6645
23855a6795K2981k5821l3824J0824K9569l0586o691k4057J4788M7314O980m846
23843a0164j1566K896l955q320J6672J1883l700r577j515K080L688K1721N466
23830A5609j5384q47k5467n316j3049r663K5207J6767L6408K3064k9122j2647
23818E560O426K2669n825j0237J3751K469k4537l5286j0262m424q35J1241J8586
23805a0704j7882L5985J7713p362k9532j3004j0475l0515L567Q919R034J3504
23793c0752Q60j0920J1058n150M530m98k5196J7364J8495R675K087R88P144Q643
$$ plain form
23779 8328 14215 10342 -20182 -11057 -4984 -12375 -784 -9064 -620 3989 2491 5738 6605 22438
23765 22438 17845 8892 10815 10247 -10005 -6038 -4077 6408 1401 1685 -2059 20884 -12390 -27154
23751 -27154 -62101 -54439 -17693 -23655 -23838 -17898 -12511 -28257 -25400 15366 29785 13881 17310
23738 17310 -11193 -10942 -8690 -2788 25507 43966 41097 25891 9822 13402 11633 2088 -15087
23725 -15087 -10669 -1595 25242 6925 -2845 9949 -523 -17236 -30165 -34096 -38396 -25694 -9120
23712 -9120 -8523 -11750 13194 42477 48714 37991 26909 19557 -8045 -9626 5571 -1280 9551
23699 9551 13865 -11859 -45426 -76887 -56330 -14695 -7491 19747 23515 4551 19481 11486 -1585
23686 -1585 13174 8606 21458 18087 27918 28240 12237 5882 2333 -10812 18410 45454 42667
$$ packed form
23779H328N887l873l0524R125O073p391J1591q280Q444M609j498L247Q67J5833
23765B2438m593q953J923n68k0252L967J961J0485n007K84l744K2943l3274j4764
23751b7154l4947P662L6746n962j83N940N387j5746K857M0766J4419j5904L429
23738A7310k8503K51K252N902K8295J8459k869j5206j6069L580j769r545j7175
23725a5087M418R074K6837j8317r770J2794j0472j6713j2929l931m300J2702J6574
23712i120N97l227K4944K9283O237j0723j1082p352k7602j581J5197o851J0831
23699I551M314k5724l3567l1461K0557M1635P204K7238L768j8964J4930p995j3071
23686a585J4759m568J2852l371R831L22j6003o355l549j3145K9222K7044k787
$$ plain form
23673 42667 36094 34999 23968 -14558 -33453 -51249 -50137 -32010 -6615 -3832 -32469 -53134
23661 -53134 -51884 -55361 -54410 -51453 -28237 -13682 -7190 -12955 -26755 467 18041 16004 14963
23648 14963 -11022 -26203 -19415 -17581 -3484 -10724 -8989 6663 -9707 -33875 -41761 -14987 -21450
23635 -21450 -27435 -29320 -37506 -22599 5012 949 -9653 -8286 2646 11080 17363 6510 -26408
23622 -26408 -42083 -59170 -25230 6914 26543 32450 8242 -5465 -9380 -25151 -17568 -13521
23610 -13521 -17873 -22454 1172 21461 6225 9683 -483 5652 -9342 18931 26766 21645 9054
23597 9054 21858 48075 50154 27836 4425 -9513 -13263 -9620 -21068 1085 7867 14695 34404
23584 34404 20608 2554 1736 25167 39002 20414 14200 7840 -27499 -34970 -878 22984 19261
$$ packed form
23673D2667o573j095j1031l8526j8895j7796J112J8127K5395K783k8637k0665
23661e3134J250l477R51K957K3216J4555O492n765j3800K7222J7574k037j041
23648A4963k5985j5181O788J834J4097p240J735J5652j6370k4168p886K6774o463
23635b1450n985j885q186J4907K7611m063j0602J367J0932Q434O283j0853l2918
23622b6408j5675j7087L3940L2144J9629N907k4208j3707l915j5771P583M047
23610a3521m352m581K3626K0289j5236L458j0166O135j4994K8273P835n121j2591
23597I054J2804K6217K079k2318k3411j3938l750L643j1448K2153O782O828J9709
23584C4404j3796j8054q18K3431J3835j8588o214o360l5339p471L4092K3862l723
$$ plain form
23571 19261 -12017 -12996 -15419 -17577 -28092 -45205 -29654 -31591 -53874 -58119 -36173 -26741 -21470
23558 -21470 -14090 -11073 10346 24532 5080 10047 41066 13248 -19503 -36670 -22319 28480
23546 28480 13408 -10470 -4392 2328 -31513 -44045 -40601 -35617 -20354 -16012 -32572 -7486 11076
23533 11076 -7231 -20451 -19611 9180 11775 191 18788 1877 -4127 -1085 -4884 -4414 12454
23520 12454 39410 51304 54107 40691 24000 10258 13373 5345 7776 28492 38078 28028 38098
23507 38098 11697 -10747 -17270 -9938 1438 -15237 -30746 -11790 3949 17875 33759 7170
23495 7170 417 8053 -20926 -12919 -30396 -21196 1652 12744 24488 21416 14888 4628 661
23482 661 12039 32609 21361 -357 -1677 -17163 -37747 -53743 -54799 -35013 -18156 -25191 -22084
$$ packed form
23571A9261l1278r79k423k158j0515j7113J5551j937k2283m245K1946R432N271
23558b1470P380L017K1419J4186j9452M967L1019k7818l2751j7167J4351N0799
23546B8480j5072k3878O078O720l3841j2532L444M984J5263M342j6560K5086J8562
23533A1076j8307j3220Q40K8791K595j1584J8597j6911o004L042l799M70J6868
23520A2454K6956J1894K803j3416j6691j3742L115q028K431K0716R586j0050J0070
23507C8098k6401k2444o523P332J1376j6675j5509J8956J5739J3926J5884k6589
23495G170o753P636k8979Q007j7477R200K2848J1092J1744l072o528j0260l967
23482F61J1378K0570j1248k1718j320j5486k0584j5996j056J9786J6857p035L107
$$ plain form
23469 -22084 -21807 -10297 5544 5069 -3340 -22595 -33347 -18966 -10880 -5456 -1362 -922 11515 -1535
23455 -1535 -17311 11939 14943 -2803 -31712 -46337 -29713 -16749 -10050 -42408 -14676 9850
23443 9850 3522 -5395 24296 26617 33780 45071 43474 53687 46512 45216 50159 23877 6143
23430 6143 -654 -665 9757 4389 2936 11341 19204 39673 28466 17512 -28354 -61718 -44753
23417 -44753 -27081 -32213 -46340 -51436 -18415 10935 6505 -1379 5416 15669 12463 -1404 -461
23404 -461 -28874 -41230 -30828 -48255 -24428 -14528 -16255 -6235 -25714 -2159 4690 491 2599
23391 2599 -9474 -42225 -46921 -18636 -3986 -4279 -5850 16181 19852 -10484 -32681 -18488 -24913
23378 -24913 -10758 -10264 22587 50232 45437 50936 22394 -6729 7047 24858 25784 18995 14422
$$ packed form
23469b2084K77J1510J5841m75q409j9255j0752J4381Q086N424M094M40J2437j3050
23455a535j5776K9250L004j7746k8909j4625J6624J2964O699l2358K7732K4526
23443I850o328q917K9691K321P163J1291j597J0213p175j296M943k6282j7734
23430F143o797j1J0422n368j453Q405P863K0469j1207j0954m5866l3364J6965
23417d4753J7672n132j4127n096L3021K9350m430p884O795J0253l206j3867R43
23404d61k8413j2356J0402j7427K3827R900j727J0020j9479K3555O849m199K108
23391B599j2073l2751m696K8285J4650k93j571K2031L671l0336k2197J4193o425
23378b4913J4155M94L2851K7645m795N499k8542k9123J3776J7811R26o789m573
$$ plain form
23365 14422 25503 39336 11501 12034 15619 25608 18988 10657 8052 3252 14919 16884 3811
23352 3811 15026 -581 -2575 13651 29338 43986 55416 5763 -27952 -29566 -32179 -12635
23340 -12635 -3318 -12819 -23810 -1938 18270 -5615 12957 22277 43981 78332 59278 -1060
23328 -1060 -3182 21303 16327 23703 9572 13809 23864 35454 20109 5504 2572 -13133 -20711
23315 -20711 -20834 2155 -22850 -40094 -19643 -5747 13655 -23627 -39581 -49862 -48741 -57480
23303 -57480 -61646 -40018 -16269 -8266 3189 9381 -16262 -13582 12457 -4093 -19034 -25773 -21958
23290 -21958 -17080 -10896 -13877 4055 12936 33715 24651 1905 -10040 -28761 -23044 11218 10405
23277 10405 -5243 12646 -10007 -21651 -38386 -49041 -37501 -15465 -213 -1310 4230 13893
$$ packed form
23365A4422J1081J3833k7835N33L585R989o620q331k605m800J1667J965j3073
23352C811J1215j5607j994J6226J5687J4648J1430m9653l3715j614k613J9544
23340a2635R317r501j0991K1872K0208k3885J8572R320K1704L4351j9054o0338
23328a060k122K4485m976P376j4131M237J0055J1590j5345j4605k932j5705p578
23315b0711j23K2989k5005j7244K0451J3896J9402l7282j5954j0281J121q739
23303e7480m166K1628K3749Q003J1455O192k5643K680K6039j6550j4941o739L815
23290b1958M878O184k981J7932Q881K0779r064k2746j1945j8721N717L4262q13
23277A0405j5648J7889k2653j1644j6735j0655J1540K2036J5252j097N540R663
$$ plain form
23265 13893 -10933 -24191 -18127 2122 3108 10880 6024 -2784 -17784 -795 11333 -13180 -48442
23252 -48442 -38704 -24876 -30058 -19309 -18152 -29553 -48645 -43846 -13738 7394 -3755 -6541 -2900
23239 -2900 -12460 -17410 -31751 -24659 -18581 -7397 14573 9079 8329 29551 26821 -4595 -403 16546
23225 16546 21780 20170 24208 29216 18512 -12427 8273 21422 11784 -16154 -5395 -12066 -9782
23212 -9782 12853 1668 -8040 5302 14400 208 -2573 30 -19816 -28837 -19269 9083 27041
23199 27041 -16965 -62202 -66997 -70410 -47962 -29784 -30651 -37703 -12577 -24296 -11728 -6349 -18265
23186 -18265 -3949 -12549 -14477 -5340 -9410 -11058 1582 -2187 8773 8227 13610 26979 39755
23173 39755 17861 23966 39039 12232 13126 21428 8206 -6533 -3646 1581 19646 11554 12778
$$ packed form
23265A3893k4826j3258O064K0249R86P772m856q808j5000J6989J2128k4513l5262
23252d8442R738J3828n182J0749J157j1401j9092M799L0108K1132j1149k786L641
23239b900r560m950j4341P092O078J1184K1970n494p50K1222k730l1416M192J6949
23225A6546N234j610M038N008j0704l0939K0700J3149r638k7938J0759o671K284
23212i782K2635j1185r708J3342R098j4192k781K603j9846r021R568K8352J7958
23199B7041m4006m5237m795l413K2448J8178q67p052K5126j1719J2568N379j1916
23186a8265J4316q600j928R137m070j648J2640l769J0960n46N383J3369J2776
23173C9755k1894O105J5073k6807Q94Q302j3222j4739K887N227J8065q092J224
$$ plain form
23160 12778 14300 27889 18416 -13260 -39812 -35226 -44054 -18115 6917 12687 13375 31565 50373
23147 50373 39707 11425 -8509 -20748 -24342 -17501 -8925 3173 25521 45090 39883 42002 22416
23134 22416 9525 35193 37584 5862 -6873 2675 10916 5606 619 -17905 -17695 4996 -13091
23121 -13091 -29870 -22220 10723 2595 7040 29307 39529 33494 43179 41363 32109 11847 -11795
23108 -11795 -40009 -23147 -9406 -18173 -11371 -26604 -31603 -26070 -16522 28447 39230 19403 -21151
23095 -21151 -4367 -1502 -35860 -53628 -40192 -20653 -2700 5752 -21909 -10941 17480 21866
23083 21866 11973 20681 21892 4376 -21436 -24165 -23914 -26217 -13834 -5649 -9570 7431 5190 -1602
23069 -1602 6625 29979 26508 7556 -9264 3837 16019 17636 18500 7848 2896 28780 38056
$$ packed form
23160A2778J522J3589r473l1676k6552M586q828K5939K5032N770O88J8190J8808
23147E0373j0666k8282j9934j2239l594O841Q576J2098K2348J9569n207K119j9586
23134B2416j2891K5668K391l1722j2735R548Q241n310m987j8524K10K2691j8087
23121a3091j6779P650L2943q128M445K2267J0222o035R685j816r254k0262k3642
23108a1795k8214J6862J3741q767O802j5233m999N533R548M4969J0783j9827m0554
23095b1151J6784K865l4358j7768J3436J9539J7953Q452k7661J0968K8421M386
23083B1866r893Q708J211j7516k5812k729K51k303J2383Q185l921J7001k241o792
23069a602Q227K3354l471j8952j6820J3101J2182J617Q64j0652m952K5884R276
$$ plain form
23056 38056 31960 29491 20755 20443 21230 35499 49739 54493 28512 9779 19938 35477 13004
23043 13004 7631 5389 -7595 2069 -14798 -33290 -27255 -14319 16628 9803 14373 2283 -3385
23030 -3385 5358 -85 12387 12254 -1467 -31239 -12203 12216 26054 23385 42135 26831 7390
23017 7390 5733 3813 -10633 -5333 -19217 -18106 9780 28620 13198 -13179 -26538 -31143 -14539
23004 -14539 -9476 -17621 -54897 -58053 -61110 -71710 -65594 -39389 -15643 -25324 -36882 -23535 -9560
22991 -9560 11467 8733 12583 17809 13610 10891 -2227 16441 9180 27418 -3521 -7648 -117
22978 -117 -15492 -38775 -33364 -14487 2016 25328 24991 22878 53919 50973 33752 16423 1228
22965 1228 8699 17238 22397 23670 -20242 -36627 -21699 -28507 5476 38220 48798 22564 -30253
$$ packed form
23056C8056o096k469q736l12P87J4269J4240M754k5981j8733J0159J5539k2473
23043A3004n373k242j2984R664j6867j8492O035J2936L0947o825M570j2090n668
23030c385Q743n443J2472j33j3721k9772J9036K4419J3838k669J8750j5304j9441
23017G390j657j920j4446N300j3884J111K7886J8840j5422k6377j3359m605J6604
23004a4539N063q145l7276l156l057j0600O116K6205K3746r681j1558J3347J3975
22991i560K1027k734L850N226m199k719j3118J8668p261J8238l0939m127P531
22978a17j5375k3283N411J8877J6503K3312l37k113L1041k946j7221j7329j5195
22965A228P471Q539N159J273m3912j6385J4928o808L3983L2744J0578k6234n2817
$$ plain form
22952 -30253 -55854 -38130 -18045 -565 -9087 -15985 -29994 -1585 13445 2355 15416 38958
22940 38958 48973 37792 15040 -5765 -15426 -10243 2086 213 -23268 -14358 19808 23371 16280
22927 16280 22160 30545 27721 8935 -29574 -39962 -20800 -12967 13279 20478 35435 37018 31591
22914 31591 26882 12505 378 -14653 -11105 -14299 -25585 -12673 -15704 -17824 -9234 5124 15977
22901 15977 17261 7926 7325 20257 14725 5041 3600 -25291 -9930 11619 15515 -6595 -8763
22888 -8763 -17185 -17268 -14515 -15305 9734 13421 27375 36358 45899 25862 5514 -22697 -26268 -32706
22874 -32706 -567 -433 3293 -11416 -26935 -64387 -29207 3854 -23874 -34820 -35103 -27113 -13704
22861 -13704 -1901 -2507 -15623 -22302 -37982 -37532 -17149 -7131 -7906 -6896 5348 7377 4158 19527
$$ packed form
22952c0253k5601J7724K0085J7480q522o898j4009K8409J5030j1090J3061K3542
22940C8958J0015j1181k2752k0805r661N183J2329j873k3481Q910L4166L563p091
22927A6280N880Q385k824j8786l8509j0388J9162P833K6246P199J4957J583n427
22914C1591m709j4377j2127j5031L548l194j1286J2912l031k120Q590J4358J0853
22901A5977J284r335o01J2932n532r684j441k8891J5361K1549L896k2110k168
22888h763q422q3K753p90K5039L687J3954Q983R541k0037k0348k8211l571o438
22874c2706L2139J34L726j4709j5519l7452L5180L3061k7728j0946k83P990J3409
22861a3704J1803o06j3116o679j5680M50K0383J0018p75J010J2244K029l219J5369
$$ plain form
22847 19527 33224 64559 65549 20386 -8356 -29844 -18826 2421 10795 25581 30403 42531
22835 42531 50252 30039 21097 28187 14035 12700 9724 16480 22212 17515 -7843 -16374 2902
22822 2902 -14338 -35777 -14478 6803 -7857 -13924 -581 3765 -15114 -12797 -27445 -20361 11080
22809 11080 10728 11762 13835 20635 16943 21796 10614 -2805 -17338 -428 3229 4385 22697
22796 22697 38737 50754 61472 54206 45625 59636 38294 627 -14213 -6407 -13888 -11152 -17716
22783 -17716 -39196 -35135 -40658 -48923 -29383 -6181 -12221 -27282 -8657 -8463 490 13187 26476
22770 26476 24515 26020 5352 1649 -8967 -33276 -57766 -48083 -18357 3307 13321 11181 5335
22757 5335 -14752 -39077 -76170 -48936 -25422 -37069 -70796 -40320 -27034 -22261 -29350 -10497
$$ packed form
22847A9527J3697L1335R90m5163k8742k1488J1018K1247Q374J4786M822J2128
22835D2531P721k0213q942P090j4152j335k976O756N732m697k5358q531J9276
22822B902j7240k1439K1299K1281j4660o067J3343M346j8879K317j4648P084L1441
22809A1080l52J034K073O800l692M853j1182j3419j4533J6910L657J156J8312
22796B2697J6040J2017J0718p266q581J4011k1342l7667j4840P806p481K736o564
22783a7716k1480M061n523q265J9540K3202o040j5061J8625J94Q953J2697J3289
22770B6476j961J505k0668l703j0616k4309k4490R683K9726K1664J0014k140n846
22757E335k0087k4325l7093K7234K3514j1647l3727L0476J3286M773p089J8853
$$ plain form
22745 -10497 36710 1503 -13295 -31584 -40952 -42004 -59021 -46501 -42496 -21935 5410 19992
22733 19992 582 6672 7665 19689 10779 12814 9577 -649 -12185 -6559 9878 30941 32000
22720 32000 25343 4139 -4919 733 -8564 -14727 -29453 -48739 -36150 -14144 9950 20798 30919
22707 30919 -642 -26525 -26609 889 21474 25907 11286 -23620 -26503 -10420 14762 33574 21311
22694 21311 24301 29383 21698 11027 -30605 -34668 -35832 -41371 -21609 -997 16512 32890 23757
22681 23757 5232 18897 -2519 -9970 10727 3144 -20874 -48723 -34163 3798 19997 26148
22669 26148 6479 6209 9825 -1445 -19948 -6093 -8407 -1192 16046 4899 -34161 -24240 -14850
22656 -14850 -18984 -20194 -16398 -26080 -8627 19590 33344 -5917 -31457 -21549 -11693 2750 -44199
$$ packed form
22745a0497M7207l5207j4798j8289r368j052j7017J2520M005K0561K7345J4582
22733A9992j9410O090R93J2024q910K035l237j0226j1536N626J6437K1063J059
22720C2000o657k1204r058N652r297o163j4726j9286J2589K2006K4094J0848J0121
22707C0919l1561k5883q4K7498K0585M433j4621l4906k883J6083K5182J8812j2263
22694B1311K990N082p685j0671m1632m063j164n539J9762K0612J7509J6378r133
22681B3757j8525J3665k1416p451K0697p583k4018k7849J4560L7961J6199O151
22669B6148j9669k70L616j1270j8503J3855k314P215J7238j1147l9060R921R390
22656a4850m134j210L796r682J7453K8217J3754l9261k5540R908R856J4443m6949
$$ plain form
22643 -44199 -40470 -47537 -89967 -52286 8742 49672 34680 9327 1078 -473 4890 9420 17107
22630 17107 30022 36993 24327 6070 -10923 -28335 -40864 -34873 -24645 -35651 -27202 -10333
22618 -10333 6639 -8272 -26018 -36077 -53635 -36016 -16793 -10071 -13908 -10604 -26523 -18952
22606 -18952 18001 10734 -4293 -6039 -24059 -16561 -6043 -14159 -2732 15917 32580 20960
22594 20960 1923 6517 -24304 -18640 -2103 18109 16219 -1352 -8002 -5480 -469 50816 54684
22581 54684 8206 -25956 -9778 -8128 -2067 17934 -9840 7049 9980 5696 1613 -1562 -3424
22568 -3424 -6731 -13190 -13576 -14414 -11105 -11905 -20929 -24612 -8800 15195 27261 9307 -22823 -32906
22554 -32906 -58432 -59216 -13587 -12032 -14129 -30555 -29554 -38133 -53366 -41085 -17283 4755 11110
$$ packed form
22643d4199L729p067m2430L7681O1028M0930j4992k5353q249j551N363M530P687
22630A7107J2915O971j2666j8257j6993j7412j2529N991J0228j1006Q449J6869
22618a0333J6972j4911j7746j0059j7558J7619J9223O722l837L304j5919P571
22606a8952L6953p267j5027j746j8020P498J0518q116J1427J8649J6663j1620
22594B0960j9037M594l0821N664J6537K0212j890j7571o650K522N011N1285L868
22581E4684m6478l4162J6178J650O061K0001k7774J6889K931m284m083l175j862
22568c424l307o459l86q38L309q00r024l683J5812K3995J2066j7954l2130j0083
22554c2906k5526p84M5629J555k097j6426J001q579j5233J2281K3802K2038O355
$$ plain form
22541 11110 -14975 -30875 -35346 -47241 -50851 -35258 -49063 -70736 -44149 -20916 -31616 -28810
22529 -28810 -31348 7259 4343 -37210 -26925 -9489 -27429 -14361 13207 4377 1972 9574 11760
22516 11760 -10071 -30843 -23117 -17240 -19487 -14055 -7964 -1602 170 -10924 4007 15572 -10379
22503 -10379 -12398 -13805 13190 10931 -21364 -35877 -54528 -60920 -64085 -94154 -93611 -78871 -62647
22490 -62647 -45466 -41780 -22187 -23569 -25580 -20046 -946 12171 6523 13726 -11797 -21000 -26235
22477 -26235 -13039 11375 13064 -19168 -51808 -59187 -65556 -38726 -26217 -13190 -2351 -4105
22465 -4105 -36773 -24700 -21713 -15664 18389 12732 -10127 -5369 -6052 -21995 -32328 -42876 -34556
22452 -34556 6773 29811 36179 33680 48677 36105 25333 8493 37184 32684 15862 29115
$$ packed form
22541A1110k6085j5900m471j1895l610J5593j3805k1673K6587K3233j0700K806
22529b8810k538L8607k916m1553J0285J7436j7940J3068K7568q830k405P602K186
22516A1760k1831k0772P726N877k247N432O091O362J772j1094J4931J1565k5951
22503a0379k019j407K6995k259l2295j4513j8651o392l165l0069N43J4740J6224
22490f2647J7181L686J9593j382k011N534J9100J3117n648P203k5523r203n235
22477b6235J3196K4414J689l2232l2640p379o369K6830J2509J3027J0839j754
22465d105l2668J2073K987O049L4053n657k2859M758o83j5943j0333j0548Q320
22452c4556M1329K3038O368k499J4997j2572j0772j6840K8691m500j6822J3253
$$ plain form
22440 29115 16159 23853 35368 24842 2111 -15298 -10996 -4201 -3014 21797 27755 -1204 -812
22427 -812 -12477 -1736 6201 -12014 28450 30587 4333 -3163 18882 12361 -3271 -16395 -32166
22414 -32166 -36728 -55069 -47112 -19466 7605 -9162 -29200 -54684 -86041 -78815 -72352 -48608
22402 -48608 -27576 -29956 3182 27639 36278 9165 -9230 -8549 5534 179 14659 15197 14929
22389 14929 -3773 -20093 -31193 -32782 -7388 261 8787 169 -1046 17016 16916 21114 25872
22376 25872 24137 33036 46941 53481 21285 -917 -36764 -57326 -20324 -15323 -22839 -10595 -18662
22363 -18662 -16717 -18965 -47224 -28377 -45623 -52233 -39461 7868 -3557 -14303 -37362 -22319
22351 -22319 -33587 -9179 2572 9520 5768 5386 -18689 22927 40709 25347 13878 9887 7309
$$ packed form
22440B9115j2956P694J1515j0526k2731j7409M302O795J187K4811N958k8959L92
22427h12j1665J0741P937j8215M0464K137k6254p496K2045o521j5632j3124j5771
22414c2166m562j8341P957K7646K7071j6767k0038k5484l1357P226O463K3744
22402d8608K1032k380L3138K4457Q639k7113j8395O81J4083n355J4480N38k68
22389A4929j8702j6320j1100j589K5394P649Q526q618j215J8062j00M198M758
22376B5872j735Q899J3905O540l2196k2202l5847k0562L7002N001p516J2244q067
22363a8662J945k248k8259J8847j7246o610J2772M7329j1425j0746k3059J5043
22351b2319j1268K4408J1751O948l752l82k4075M1616J7782j5362j1469l991k578
$$ plain form
22338 7309 32478 34047 26704 40282 47395 38291 26502 5576 8814 4399 15416 27923 -1862
22325 -1862 -23272 -8319 -15680 -9766 -794 -6681 -17711 -38451 -41986 -25337 -622 -4221 13281
22312 13281 14047 -19264 -39869 -31481 -11676 -18337 -18338 -17137 6692 -3251 -25125 -30504 -55008 -36399
22298 -36399 -3115 20785 14574 33724 44752 73602 58803 43417 6907 9193 1384 -12341
22286 -12341 -8147 -15979 -11393 -3354 -12790 -21871 -21309 -16961 -35783 -46722 -46468 -18706 -2696 4611
22272 4611 31310 36916 19296 6123 -30896 -49847 -5926 13843 -6841 -22838 -26992 -29009
22260 -29009 -186 -4405 -14990 -11532 -15838 -17838 -23821 -14013 -10757 -20906 -28342 -22905 -7121
22247 -7121 9709 -2148 -36060 -29044 -7480 -4357 -15426 1373 19572 40269 21911 8760
$$ packed form
22338G309K5169J569p343J3578P113r104j1789k0926L238m415J1017J2507k9785
22325a862k1410J4953p361N914Q972n887j1030k0740l535J6649K4715l599J7502
22312A3281P66l3311k0605Q388J9805o661jJ201K3829r943k1874n379k4504J8609
22298c6399L3284K3900o211J9150J1028K8850j4799j5386l6510K286p809j3725
22286a2341M194p832M586Q039r436r081N62M348j8822j0939K54K7762J6010P307
22272D611K6699N606j7620j3173l7019j8951M3921J9769k0684j5997m154k017
22260b9009K8823m219j0585L458m306k000n983R808L256j0149p436N437J5784
22247g121J6830j1857l3912P016K1564L123j1069J6799J8199K0697j8358j3151
$$ plain form
22235 8760 298 17770 16636 9581 -7591 -29564 -26888 -10420 -22792 -41965 -24439 -13547 -13552
22222 -13552 -11160 -3110 -13479 -15772 -16435 -18329 -18876 -18271 10215 18305 896 -20053 -27419 -36702
22208 -36702 -40377 -32305 -25425 -22739 -24737 -36817 -37474 -36034 -19539 -24928 -18039 -11345 -10871 9728
22194 9728 1657 -6101 -22761 -45723 -43313 -16762 15236 49137 35465 14035 -4459 -29544
22182 -29544 -27620 -23359 -4909 -12080 -25959 1014 17300 24145 22472 9233 -11114 -8430 14305
22169 14305 -1504 -17 -3680 -2550 -295 12614 24806 12271 5208 44033 30394 20012 1057
22156 1057 1914 26788 18322 -680 2117 -3950 -20211 -10623 27168 45981 16983 42239 44762
22143 44762 33858 9218 9470 34344 33446 6280 -6277 -759 5284 7970 3759 -5689 -16952
$$ packed form
22235H760q462J7472j134p055j7172k1973K676J6468j2372j9173J7526J0892n
22222a3552K392Q050j0369k293o63j894n47O05K8486Q090j7409k0949p366r283
22208c6702l675Q072O880K686j998j2080o57J440J6495n389O889O694M74K0599
22194I728q071p758j6660k2962K410K6551L1998L3901j3672k1430j8494k5085
22182b9544J924M261J8450p171j3879K6973J6286O845j673j3239k0347K684K2735
22169A4305j5809J487l663J130K255J2909J2192j2535p063L8825j3639j0382j8955
22156A057Q57K4874q466j9002K797o067j6261R588L7791J8813k8998K5256K523
22143D4762j0904k4640K52K4874q98k7166j2557N518O043K686m211r448j1263
$$ plain form
22130 -16952 -18177 -8058 -8007 -5430 4219 17714 1510 4982 19891 10227 -7300 -17423 -5761
22117 -5761 -9695 5338 -5265 -27373 -27577 -4792 15291 19948 3888 12800 34964 42224 14330
22104 14330 8444 7100 23757 44859 5725 -28726 -31147 -12356 5953 7719 10754 11103 -15519
22091 -15519 -37921 -5739 12126 4965 -628 17183 30862 41059 28893 20868 13573 -7624
22079 -7624 -10133 443 -19895 -29947 -20618 1132 -6666 2504 -13479 -38584 -23432 -22721 -36680
22066 -36680 -26846 -21690 -3495 4621 11226 3117 -14460 -21049 -1512 6586 -2446 5809 -17803
22053 -17803 -31206 -5782 -11221 -52517 -66245 -27891 -26057 -19236 -16291 -38599 -45052 -39354 -32928
22040 -32928 -25974 -41 -13442 -2487 -11862 -34097 -41045 -12715 -4612 3214 10492 -3032 23710
$$ packed form
22130a6952j225J0119N1K577R649J3495j6204L472J4909r664j7527j0123J1662
22117e761l934J5033j0603k2108k04K2785K0083M657j6060Q912K2164P260k7894
22104A4330n886j344J6657K1102l9134l4451k421J8791J8309J766L035L49k6622
22091a5519k2402L2182J7865p161n593J7811J3679J0197j2166q025p295k1197
22079g624k509J0576k0338j0052R329K1750p798R170j5983k5105J5152P11j3959
22066c6680R834N156J8195Q116O605q109j7577o589J9537Q098r032Q255k3612
22053a7803j3403K5424n439m1296j3728L8354J834O821K945k2308o453N698O426
22040c2928O954K5933j3401J0955r375k2235o948K8330Q103P826P278j3524K6742
$$ plain form
22027 23710 10136 -8533 21297 26318 20345 6598 -4859 -1915 -18643 -33036 -32384 -20510 626
22014 626 -603 -12108 -6635 -8047 -2375 -22323 -23530 -37329 -30933 -6769 27077 15977 12730
22001 12730 17469 5936 1842 11110 1941 -8182 -3202 23165 33200 14122 4185 12827 29366
21988 29366 41717 36090 19998 21094 10334 -10136 -7458 -8519 -34936 -26659 -29337 -20354 -41
21975 -41 2045 23973 35703 9673 -5737 -23827 -9177 -22522 -20146 -30975 -50779 -26655 4856
21962 4856 -22369 -23723 -14178 -15968 -22127 6833 15142 20903 10869 1986 -2983 13263 33804
21949 33804 49345 44212 2646 -17119 -13271 5943 -4097 -43898 -48861 -55766 -32890 -1507
21937 -1507 8528 -25988 -44289 -22809 16917 20806 -8349 -16447 -42242 -43150 -22267 -14710 -24182
$$ packed form
22027B3710j3574j8669K9830N021n973j3747j1457K944j6728j4393O52J1874K1136
22014F26j229j1505N473j412N672j9948j207j3799O396K4164L3846j1100l247
22001A2730M739j1533m094R268r169j0123M980K6367J0035j9078r937Q642J6539
21988B9366J2351n627j6092J096j0760k0470K678j061k6417Q277k678Q983K0313
21975d1K086K1928J1730k6030j5410j8090J4650j3345K376j0829j9804K4124L1511
21962D856k7225j354R545j790o159K8960Q309N761j0034q883m969J6246K0541
21949C3804J5541n133m1566j9765L848J9214j0040l9801m963o905K2876L1383
21937a507J0035l4516j8301K1480L9726L889k9155q098k5795r08K0883P557r472
$$ plain form
21924 -24182 -8654 -13657 -41064 -56219 -21377 5589 -1845 -33779 -27773 -2214 26462 32191
21912 32191 23461 3622 5092 2806 4404 -11365 -29858 -32423 -13610 -8357 -19227 -19797 -15564
21899 -15564 -12017 -7 8797 -16379 -29854 -27217 -22213 -1481 -14340 -18921 -30365 -28300 4997
21886 4997 -1390 -14072 1691 21077 5228 -5767 9410 20590 22356 44000 32339 9361
21874 9361 33925 36667 14482 -12676 -26746 -50046 -65070 -57509 -12639 -13144 -9928 -15701 227
21861 227 -2460 -13941 -26179 -9801 15353 8656 11380 11127 11772 -7190 -4722 25037 20027 6682
21847 6682 2566 8949 -1866 -17074 -35576 -30417 -17770 -30966 -33992 -27703 9004 71454 61374
21834 61374 42150 22222 15857 12477 -10097 -21129 -23590 -21680 -25545 -25607 -28261 -14837 -14275 -4517
$$ packed form
21924b4182J5528n003k7407j5155L4842K6966p434l1934O006K5559K8676N729
21912C2191q730j9839J470k286J598j5769j8493k565J8813N253j0870n70M233
21899a5564L547J2010Q804k5176j3475K637N004K0732j2859m581j1444K065L3297
21886D997o387j2682J5763J9386j5849j0995J5177J1180J766K1644j1661k2978
21874I361K4564K742k2185k7158j4070k3300j5024P561M4870n05L216n773J5928
21861B27k687j1481j2238J6378K5154o697K724k53O45j8962K468K9759n010j3345
21847F682m116O383j0815j5208j8502N159J2647j3196l026O289L6707O2450j0080
21834F1374j9224j9928o365l380k2574j1032k461J910l865o2k654J3424N62R758
$$ plain form
21820 -4517 24910 28277 40445 26499 -5884 -19932 -19017 -9148 12564 8474 19616 18262 22469
21807 22469 14631 29503 34634 28475 11960 4855 -12851 -4735 7799 13178 30091 19210 9322
21794 9322 -20980 -34129 -23204 -43102 -45827 -31694 -36464 -17754 -1489 8878 -13609 -36966
21782 -36966 -28099 7663 10657 -2273 -2444 2761 3802 13557 10583 8376 -9010 -28565 -24740 -7945
21768 -7945 -28910 -53383 -44110 -17176 -25100 -17233 15482 12321 4652 2148 -17777 -15780 31988
21755 31988 17852 2705 14070 33871 41717 19925 -21137 -48350 -44143 784 14584 16316
21743 16316 62447 72482 60925 39029 30479 5191 -31047 -4119 11799 -4870 -2950 -27277
21731 -27277 -63058 -30236 -20325 -4905 10868 29741 35074 37220 30822 13698 -8403 -26758
$$ packed form
21820d517K9427L367J2168j3946l2383j4048R15R869K1712m090J1142j354M207
21807B2469p838J4872N131o159j6515p105j7706Q116J2534N379J6913j0881r888
21794I322l0302j3149J0925j9898k725J4133m770J8710J6265J0367k2487k3357
21782c6966Q867L5762K994j2930j71N205J041R755k974k207j7386j9555L825J6795
21768g945k0965k4473R273K6934p924P867L2715l161p669k504j9925J997M7768
21755C1988j4136j5147J1365J9801P846k1792m1062k7213M207M4927J3800J732
21743A6316M6131J0035j1557k1896q550k5288l6238K6928J5918j6669J920k4327
21731b7277l5781L2822R911J5420J5773J8873N333K146o398j7124k2101j8355
$$ plain form
21719 -26758 -38652 -47030 -37006 -48693 -44037 -36913 -26999 -13892 -18186 -24867 -4581 -104 1756
21706 1756 15981 4806 -6659 -23709 -9824 -405 -15260 431 -13436 -21594 -46152 -70605
21694 -70605 -48143 -25114 -8476 -7002 1923 28302 -1996 -34071 -30144 -26309 -46310 -34590
21682 -34590 -8246 -17368 -36661 -17798 -6169 4771 8592 -9748 -30950 -26492 -19746 -904
21670 -904 9734 -23200 -58300 -44401 -44356 -50388 -39291 -17566 5271 15489 45445 28985 -9181
21657 -9181 -14233 -5097 2942 -26994 -30122 -16481 -17375 -11387 -3047 -12468 -35923 -11953 44 -16395
21643 -16395 -8884 -2618 -7216 -11129 17946 29836 31626 -419 -42157 -62762 -37133 -19950 8314
21630 8314 18331 30808 36477 44177 13021 20463 50550 20155 -13430 -35476 -23241 -16022 -11219
$$ packed form
21719b6758j1894q378J0024j1687M656P124R914J3107m294o681K0286M477J860
21706A756J4225j1175j1465j7050J3885R419j4855J5691j3867q158k4558k4453
21694g0605K2462K3029J6638J474Q925K6379l0298l2075L927L835k0001J1720
21682c4590K6344r122j9293J8863J1629J0940L821j8340k1202M458O746J8842
21670i04J0638l2934l5100J3899M5o032J1097K1725K2837J0218K9956j6460l8166
21657i181n052R136Q039k9936l128J3641q94N988Q340r421k3455K3970J1997j6439
21643a6395P511O266m598l913K9075J1890J790l2045m1738k0605K5629J7183K8264
21630H314J0017J2477N669P700l1156P442L0087l0395l3585k2046J2235P219M803
$$ plain form
21617 -11219 -4811 -22779 -32328 -53433 -44838 -8489 -28393 -36944 -27485 -21659 -6906 7867 -10831
21604 -10831 -23610 -71560 -62518 -9476 24387 22146 9977 1555 -32451 -55236 -51884 -24881
21592 -24881 2537 11574 4765 12704 13129 -2185 6477 7527 -15226 9834 11093 2438 1071 11819
21578 11819 4902 -25649 -29677 -37073 -26669 2080 14810 -9015 3901 17678 26800 15626
21566 15626 8719 -13899 -21099 -5472 1970 -9563 3355 18631 16028 -14830 -27334 -40641
21554 -40641 -51232 -51454 -39597 -15707 19559 9120 -8360 -6089 -8211 -32501 -9826 31376
21542 31376 40660 35360 22010 -17667 -66270 -48727 -16898 5547 -22768 -20116 27608 44422
21530 44422 29019 7677 -7331 14777 16298 22866 28481 15699 10906 21750 12522 26391 73320
$$ packed form
21617a1219O408j7968r549k1105Q595L6349j9904q551R459N826J4753J4773j8698
21604a0831j2779m7950R042N3042L3863k241j2169q422l4006k2785L352K7003
21592b4881K7418R037o809P939M25j5314Q662J050k2753K5060J259q655j367J0748
21578A1819o917l0551m028p396J0404K8749J2730k3825J2916J3777R122j1174
21566A5626o907k2618p200J5627P442j1533J2918J5276k603l0858j2504j3307
21554d0641j0591k22J1857K3890L5266j0439j7480K271k122k4290K2675M1202
21542C1376R284n300j3350l9677m8603J7543L1829K2445k8315K652M7724J6814
21530D4422j5403k1342j5008K2108J521O568N615j2782m793J0844r228J3869M6929
$$ plain form
21517 73320 58589 31764 8539 -7338 -12135 -42348 -8357 9512 1158 -1277 -19378 -13129
21505 -13129 16130 22657 7028 6733 20130 6932 -24245 -9809 -5104 -31698 -45917 -53694 -22239
21492 -22239 4253 -9500 -1677 760 15488 14352 -9450 -10085 19790 26791 16502 6356 -21221
21479 -21221 -34229 -7647 -4421 -6483 14749 29571 18932 -733 -12824 7067 195 1808
21467 1808 9945 -29584 -24807 -3698 -7993 -6724 -17778 -22490 -24517 -4177 -3883 4925 13570 4266
21453 4266 -9423 -10588 -14483 -12763 -5694 2564 -22010 -27361 -5241 -12770 -11691 2197 -8014
21440 -8014 21087 10704 -8218 -11106 -13475 -19286 -3000 15697 9975 18266 21792 4272 19287
21427 19287 20592 -7891 -27082 -17746 -6873 -4317 -13640 -20080 -20940 -7466 1541 9020 4033 -22595
$$ packed form
21517G3320j4731k6825k3225j5877m797l0213L3991J7869q354k435j8101O249
21505a3129K9259O527j5629k95J3397j3198l1177J4436M705k6594j4219p777L1455
21492b2239K6492j3753P823K437J4728j136k3802o35K9875P001j0289j0146k7577
21479b1221j3008K6582L226k062K1232J4822j0639j9665j2091J9891o872J613
21467A808Q137l9529M777K1109m295J269j1054m712k027K0340K94Q808Q645r304
21453D266j3689j165l895J720P069Q258k4574n351K2120p529J079J3888j0211
21440h014K9101j0383j8922k888k369n811J6286J8697n722Q291L526j7520J5015
21427A9287J305k8483j9191R336J0873K556r323o440q60J3474R007P479m987k6628
$$ plain form
21413 -22595 -22955 -27269 -37209 -23584 3600 14118 2602 -8487 -2861 4589 -8239 -17946 -39697
21400 -39697 -48185 -51825 -18980 -8153 4609 5953 19234 26246 27869 39329 30508 -6382 -22098
21387 -22098 -15389 -19231 -1731 16838 1038 727 -7911 1976 -12770 -11219 -11878 -11844 -8580 -13416
21373 -13416 -5183 -1309 -15776 -41958 -39500 -23701 -23776 -16371 4242 41558 48326 52795 52229 21915
21359 21915 -20191 -28160 -45492 -58876 -31634 -30176 -30331 -20155 -14144 -39253 -36618 -17567 -10966
21346 -10966 14530 22413 -2437 -16347 -12799 -446 11278 11986 13379 1884 1525 14097 20525
21333 20525 3162 11516 6605 11112 21200 42135 41848 44876 51674 34863 42407 33237 -12713
21320 -12713 -20747 -12148 -12356 7447 34098 9622 -11779 -3341 -2219 -9508 -7683 -25233 -18943
$$ packed form
21413b2595l60m314r940J3625K7184J0518j1516j1089N626P450j2828r707k1751
21400c9697q488l640L2845J0827J2762J344J3281P012J623J1460q821l6890j5716
21387b2098O709l842J7500J8569j5800l11q638R887j4746J551o59L4L264m836
21373a3416Q233L874j4467k6182K458J5799p5P405K0613L7316O768M469n66l0314
21359B1915m2106p969j7332j3384K7242J458j55J0176O011k5109K635J9051O601
21346a0966K5496P883k4850j3910L548J2353J1724P08J393j1495l59J2572O428
21333B0525j7363Q354m911M507J0088K0935k87L028O798j6811P544r170m5950
21320a2713q034Q599k08J9803K6651k4476k1401Q438J122p289J825j7550O290
$$ plain form
21307 -18943 -9544 -21022 -25689 -35174 -24776 -21435 8999 5124 4065 14822 21814 12436 23385
21294 23385 32884 38900 -708 -3733 718 -639 -5858 -13047 33036 30344 19207 18257 1535 -29273
21280 -29273 -35713 -17541 31548 7052 326 -9610 -21800 -18881 -18804 -17817 3288 -16428 -14140 -6096
21266 -6096 -29947 -44270 -32488 -15900 -23118 -7396 25687 11401 -2791 14623 24665 -12607
21254 -12607 -15913 14344 24168 32853 35210 53449 33115 39548 35951 16074 13907 -5609 7092
21241 7092 2102 -6596 23887 33039 8895 17106 29886 28484 27731 9646 -17485 -7971 -11618 -32089
21227 -32089 -26228 -31552 -32634 -40983 -46259 -26133 -11271 13409 8750 116 -489 17332 7373 -21665
21213 -21665 -29532 -43808 -12063 -3428 -16875 -15927 -7968 -26401 -38076 -45614 -63865 -69556 -76384
$$ packed form
21307a8943R399j1478m667r485J0398L341L0434l875j059J0757O992r378J0949
21294B3385R499O016l9608l025M451j357n219p189M6083k692j1137r50j6722l0808
21280b9273o440J8172M9089k4496o726r936j2190K919P7R87K1105j9716K288Q044
21266f096k3851j4323J1782J6588p218J5722L3083j4286j4192J7414J0042l7272
21254a2607l306L0257R824Q685K357J8239k0334O433l597j9877k167j9516J2701
21241G092m990q698L0483R152k4144Q211J2780j402p53j8085k7131R514l647k0471
21227c2089N861n324j082q349n276K0126J4862K4680m659q634o05J7821r959k9038
21213b1665p867j4276L1745Q635j3447R48P959j8433j1675p538j8251n691o828
$$ plain form
21200 -76384 -67745 -52962 -59873 -62052 -27575 -30725 -28943 5492 14856 16799 13180 -18785 -44381
21187 -44381 -48911 -59011 -49923 -59496 -45343 -18067 -11287 -17996 -12012 -2718 -4741 23189 18917
21174 18917 6413 -10268 -20006 -9722 -20281 -26068 -16362 -18930 -28798 -30452 -31064 -41228 -40753 -34547
21160 -34547 -21521 -27868 -36435 -29505 -26450 -2386 9353 14131 18315 2708 -2444 11453 6364
21147 6364 12882 12066 8935 -5018 14822 22002 -15712 -44417 -39422 -31729 -15324 -566 -8528
21134 -8528 -27606 -2188 -2592 -30567 -37013 16807 8936 -33409 -22895 26941 18897 3352 -10469
21121 -10469 17725 41073 51800 35853 12830 973 23080 41773 25267 3431 -4409 -15855
21109 -15855 -13945 -32202 -40363 -36029 -30479 -11168 -8693 1045 5787 6817 16231 4925 -16581
$$ packed form
21200g6384Q639J4783o911k179L4477l150J782L4435R364J943l619l1965k5596
21187d4381m530j0100R088r573J4153K7276O780o709N984R294k023K7930m272
21174A8917j2504j6681r738J0284j0559n787R706k568r868j654o12j0164M75O206
21160c4547J3026o347q567O930L055K4064J1739M778M184j5607n152J3897n089
21147F364O518q16l131j3953J9840P180l7714k8705M995P693J6405J4758p962
21134h528j9078K5418m04k7975o446N3820p871m2345J0514M9836q044j5545j3821
21121a0469K8194K3348J0727j5947k3023j1857K2107J8693j6506k1836p840j1446
21109a5855J910j8257q161M334N550J9311K475R738M742J030R414j1306k1506
$$ plain form
21096 -16581 -13604 9325 13606 16697 2711 31299 6032 10653 26655 13966 7969 -12455 -27862
21083 -27862 -2785 12623 20488 6792 12741 38530 47570 48616 39356 4312 -16383 -10703 671
21070 671 -23197 -53784 -38888 -24404 -16098 -1273 -20554 -27583 -46206 -59491 -38250 -207
21058 -207 24376 -13125 -8680 20603 11662 -37307 -48041 -27042 -25601 -27299 -36090 -27082 -7015
21045 -7015 5876 3479 -321 -9278 -21026 -29468 -37300 -20858 10095 28903 32069 27674 13224
21032 13224 -20822 -23599 -10538 -16737 -15671 -2214 5735 -3821 -8220 7079 34350 29170 20727
21019 20727 4483 -9804 -13551 -9068 -31687 -36725 -21599 -23032 -23268 -19730 -34796 -33962 -15709
21006 -15709 12479 15806 -8301 -17257 929 8224 -21788 -31460 -37930 -53643 -56890 -68487 -54002
$$ packed form
21096a6581K977K2929M281L091j3986K8588k5267M621J6002j2689n997k0424j5407
21083b7862K5077J5408P865j3696N949K5789R040J046r260l5044k0695N680J1374
21070F71k3868l0587J4896J4484Q306J4825j9281p029j8623j3285K1241L8043
21058b07K4583l7501M445K9283q941m8969j0734K0999J441j698q791R008K0067
21045g015J2891k397l800q957j1748q442p832J6442L0953J8808L166m395j4450
21032A3224l4046k777J3061o199J066J3457P949r556m399J5299K7271n180q443
21019B0727j6244j4287l747M483k2619n038J5126j433k36L538j5066Q34J8253
21006a5709K8188L327k4107q956J8186P295l0012r672o470j5713l247j1597J4485
$$ plain form
20993 -54002 -35230 -3058 -16517 -20864 -29550 -28797 -41208 -38275 -20618 -7016 2348 15244 16991
20980 16991 19704 18050 26493 -984 -3617 -236 -1639 -17051 -22484 3641 19282 23622 -7244
20967 -7244 -38501 -59586 -51381 -39466 -8546 -20058 -44937 -74221 -59357 -44303 -44052 -50686 -47062
20954 -47062 -35953 -37154 -29484 -2234 19109 19127 8880 -1214 -9879 10358 13947 17939 26997
20941 26997 41754 13710 -27282 -31099 -28868 -26333 -16859 -5028 -9255 -758 -6866 9713 6235
20928 6235 12671 28004 5971 -24077 -23587 -13361 -16569 -9535 -41587 -23970 10487 4696 -21108
20915 -21108 -32852 -33314 -16291 -11289 -4665 3663 -18154 -14813 -1841 -16152 -30609 -45279 -41179
20902 -41179 -11929 -17426 90 10177 11264 -6094 -18603 -42510 -42666 -9728 5597 -9009
$$ packed form
20993e4002J8772L2172j3459m347q686P53j2411K933J7657J3602R364J2896J747
20980A6991K713j654Q443k7477k633L381j403j5412n433K6125J5641M340l0866
20967g244l1257k1085Q205J1915L0920j1512k4879k9284J4864J5054K51o634L624
20954d7062J1109j201P670K7250K1343J8j0247j0094q665K0237L589L992R058
20941B6997J4757k8044m0992l817K231K535R474J1831m227Q497o108J6579l478
20928F235O436J5333k2033l0048M90J0226l208P034l2052J7617L4457n791k5804
20915b1108j1744m62J7023N002O624Q328k1817L341J2972j4311j4457j4670M100
20902d1179K9250n497J7516J0087J087j7358j2509k3907j56L2938J5325j4606
$$ plain form
20890 -9009 -16833 -10910 -5346 -26122 -8857 -25717 -28864 -9324 -212 -6240 -6435 -6157 -17162 -19518
20876 -19518 3345 5016 1027 -20606 -19289 21267 29954 14798 11759 -13275 -37180 -26169 3192
20863 3192 5336 4630 11542 13254 -22689 -21877 5155 -5237 -30089 -42216 -35847 -11347 -31553
20850 -31553 -31356 -35573 -50149 -35336 -4981 -13768 -13596 35558 22511 21784 37437 49354 30830
20837 30830 9636 -478 15743 21082 15193 -210 -3189 8577 27843 46710 43909 41891 6180
20824 6180 -50532 -77170 -76938 -19688 14300 12402 -3642 4296 12203 2424 -5696 549 1622 4173
20810 4173 -6360 6449 -8843 -24566 -30992 -21303 -12279 -4448 23386 29534 7447 -7490 -30656
20797 -30656 -16399 10636 -2319 15493 21230 29681 19350 11762 18937 20268 38423 21542 -2067
$$ packed form
20890i009p824N923N564k0776J7265j6860l147J9540R112o028j95K78j1005k356
20876a9518K2863J671l989k1633J317M0556Q687j5156l039k5034k3905J1011K9361
20863C192K144p06O912J712l5943Q12K7032j0392k4852j2127O369K4500k0206
20850c1553J97m217j4576J4813L0355q787J72M9154j3047p27J5653J1917j8524
20837C0830k1194j0114J6221N339n889j5403k979J1766J9266J8867k801k018l5711
20824F180n6712k6638K32N7250L3988j898j6044P938P907r779q120O245J073K551
20810D173j0533J2809j5292j5723o426R689R024P831K7834O148k2087j4937k3166
20797c0656J4257K7035j2955J7812N737Q451j0331p588P175J331J8155j6881k3609
$$ plain form
20784 -2067 -4044 -27902 -9939 24873 27953 33533 51202 53209 23262 -2548 -1041 7092 8354
20771 8354 25510 29689 28895 36526 23319 8868 -5885 6382 31275 4418 -4738 4067 -423
20758 -423 -8700 -8907 -14922 -9918 5405 30292 80592 76875 32284 8717 -1999 -37585 -42629
20745 -42629 -12322 -6866 -20704 522 32342 2145 -17814 -46162 -42222 -45956 -54217 -63088 -42965
20732 -42965 -13541 -16625 -41770 -27830 -14347 -8802 -10898 -26649 -11929 -8649 -22337 -19724 -22397
20719 -22397 -34483 -35652 -23637 -20105 -15872 -31741 -42957 -44610 -44628 -28328 -18535 -7815 -17891
20706 -17891 -29340 -31818 -40716 -25360 -27810 -38008 -39893 -54634 -53981 -84901 -67176 -49333 -37841
20693 -37841 -38626 -37202 -38395 -35956 -35387 -63884 -34158 12626 35133 51436 27195 14867 11139
$$ packed form
20784b067j977k3858J7963L4812L080N580J7669K007k9947k5810J507Q133J262
20771H354J7156M179p94P631j3207j4451j4753J2267K4893k6857r156Q805m490
20758d23q277k07o015N004J5323K4887N0300l717m4591k3567j0716l5586n044
20745d2629L0307N456j3838K1226L1820l0197j9959k8348L940l734q261q871K0123
20732d2965K9424l084k5145J3940J3483N545k096j5751J4720L280j3688K613k673
20719b2397j2086j169J2015L532M233j5869j1216j653j8J6300R793J0720j0076
20706a7891j1449k478q898J5356k450j0198j885j4741O53l0920J7725J7843J1492
20693c7841p85J424j193K439N69k8497K9726M6784K2507J6303k4241j2328l728
$$ plain form
20680 11139 12173 14069 -6065 423 -1366 -15218 -34684 -13742 48318 55944 18668 -7693 16614
20667 16614 19574 -6085 -19888 -8225 -8492 -25634 -68410 -60032 -44831 -33391 -41212 -41168 -17679
20654 -17679 -2699 -26233 -25535 -38892 -48123 -26217 -29319 -39151 -41730 -31103 -51198 -51807 -41965
20641 -41965 -26099 -23172 -36251 -33122 -28086 -17844 4393 1844 -15711 -8132 -4477 9488 4943
20628 4943 -8875 10806 33507 27885 13503 -3817 -18293 -16541 1542 13658 10736 -6610
20616 -6610 -14355 -13242 8776 -5714 -19146 -20399 -7892 20838 4443 -27908 -11402 -8797 -48498
20603 -48498 -54616 -59014 -19846 17106 32576 14217 -7391 8569 -7025 -15276 -4064 14275
20591 14275 15584 -15934 -22075 -126 -9460 -5537 1071 1686 -5407 -7068 -7190 -4921 10218 19183
$$ packed form
20680A1139J034J896k0134O488j789j3852j9466K0942O2060P626l7276k6361K4307
20667A6614K960k5659j3803J1663k67j7142m2776Q378J5201J1440p821M4K3489
20654a7679J4980k3534O98j3357r231K1906l102r832k579J0627k0095o09R842
20641d1965J5866K927j3079L129N036J0242K2237k549j7555P579L655J3965m545
20628D943j3818J9681K2701n622j4382j7320j4476J752J8083J2116k922j7346
20616f610p745J113K2018j4490j3432j253J2507K8730j6395l2351J6506K605l9701
20603d8498o118m398L9168L6952J5470j8359k1608J5960j5594q251J1212J8339
20591A4275J309l1518o141K1949r334L923O608O15p093j661j22K269J5139Q965
$$ plain form
20577 19183 19826 -7344 -10892 -3482 -31055 -24822 -6614 -585 7189 6135 -6321 -25135 -23456
20564 -23456 -21546 -27115 -36631 -54405 -68418 -47934 -16450 -17594 -13500 -13564 16884 24348 6200
20551 6200 -4398 -10276 -21240 -16358 -6662 -43183 -64210 -58417 -22411 7389 1632 22762 4103
20538 4103 -25267 -36509 -7945 -18976 -33919 -32851 -9416 3467 -1326 -7741 27030 1544
20526 1544 9102 20945 5690 -6573 -10268 -24769 -47217 -44370 -40961 -30834 -14063 -10627 -17755
20513 -17755 -14817 -25291 -28265 -10188 -7571 9625 17536 -10033 -26269 17116 42985 16021
20501 16021 8541 18269 12737 -8732 4790 9317 -3902 5306 26876 25812 29433 35898 5433
20488 5433 11823 3863 -22811 -9126 -10646 -18377 -46200 -59642 -53579 -31308 -10178 20767 9510
$$ packed form
20577A9183O43k7170l548P410k7573O233J8208O029P774j054j2456j8814J679
20564b3456J910n569r516j7774j4013K0484L1484j144M094o4L0448P464j8148
20551F200j0598n878j0964M882R696l6521k1027N793L6006K9800n757K1130j8659
20538D103k9370j1242K8564j1031j4943J068K3435J2883m793o415L4771k5486
20526A544P558J1843j5255j2263l695j4501k2448K847L409J0127J6771L436p128
20513a7755K938j0474k974J8077K617J7196P911k7569j6236M3385K5869k6964
20501A6021p480R728n532k1469J3522M527j3219R208K1570j064L621O465l0465
20488E433O390p960k6674J3685j520p731k7823j3442O063K2271K1130L0945j1257
$$ plain form
20475 9510 267 14476 30763 15548 13165 14287 23919 4634 6340 11613 -13736 3500 9303
20462 9303 5350 19793 17650 4795 3025 40456 58261 31233 20527 17692 -1592 1670 4817
20449 4817 24823 8029 7874 22647 26339 2280 2734 -3573 -8799 -12520 -24078 -20437 -37690 -59901
20435 -59901 -57927 -41325 -46007 -50280 -55931 -59745 -59698 -37306 -19937 -22059 -28584 -14433 -13886 -17526
20421 -17526 -19614 -34737 -51172 -24309 9169 11556 -7257 -31172 -47320 -36535 -19301 -7922
20409 -7922 -21502 -30323 -18214 -5721 12361 -6241 -27027 -34316 -24881 -25417 -16394 -19178 -25475
20396 -25475 -25914 -15154 3251 490 -6994 1754 7420 -979 -6817 -1864 18177 10319 -18265 -19829
20382 -19829 -6824 -387 -25996 -24690 -24499 -18310 -21229 -13732 -4554 -6888 -9502 -48514 -28402 -12640
$$ packed form
20475I510r243J4209J6287j5215k383J122R632j9285J706N273k5349J7236N803
20462I303l953J4443k143j2855j770L7431J7805k7028j0706k835j9284L262L147
20449D817K0006j6794j55J4773L692k4059M54o307n226l721j1558L641j7253k2211
20435e9901J974J6602m682m273n651l814M7K2392J7369k122o525J4151N47l640
20421a7526k088j5123j6435K6863L3478K387j8813k3915j6148J0785J7234J1379
20409g922j3580q821J2109J2493J8082j8602k0786p289R435n36R023k784o297
20396b5475m39J0760J8405k761p484Q748N666q399n838M953K0041p858k8584j564
20382a9829J3005O437k5609J306J91O189k919P497R178k334k614l9012K0112J5762
$$ plain form
20368 -12640 -34023 -21046 -34783 -31266 -49180 -30838 -19394 -12999 -7232 19778 31551 3214
20356 3214 -1798 -7986 18323 30265 15749 -4738 -26162 -9812 -6590 -21626 -33037 -42428 -28751
20343 -28751 1298 35495 59719 40091 17757 9112 -929 7712 -16068 10970 17922 13165
20331 13165 -6026 -37113 -51334 -46993 -28380 3248 1378 3671 4749 -14713 -22564 -25893 -26398
20318 -26398 -58989 -44276 -5196 15080 15392 9489 9728 25076 29801 -2380 -31760 -24599 -22081
20305 -22081 -32293 -40309 -39166 -21557 -9301 -2417 -9454 -30065 -22828 -15451 -15335 -10813 -20517 -33521
20291 -33521 -13339 -2564 31219 48798 15785 -22635 -31081 -32552 2784 27744 11829 8730
20279 8730 12064 -12016 -11181 -17673 -1022 17842 5347 -16453 -36186 -33926 -57560 -77356 -36739
$$ packed form
20368a2640k1383J2977j3737L517j7914J8342J1444O395N767K7010J1773k8337
20356C214n012o188K6309J1942j4516k0487k1424J6350L222j5036j1411r391J3677
20343b8751L0049L4197K4224j9628k2334q645j0041Q641k3780K7038O952m757
20331A3165j9191l1087j4221M341J8613L1628j870K293J078j9462p851l329n05
20318b6398l2591J4713L9080K0276L12n903K39J5348M725l2181k9380P161K518
20305b2081j0212q016J143J7609J2256O884p037k0611P237P377J16M522r704j3004
20291c3521K0182J0775L3783J7579l3013l8420q446j471L5336K4960j5915l099
20279H730L334k4080Q35o492J6651J8864j2495k1800j9733K260k3634j9796M0617
$$ plain form
20266 -36739 10454 4551 7177 -3124 3507 5967 14748 19965 1328 -4893 -14567 19320 25917
20253 25917 26862 19541 17323 2511 10619 12668 3606 10462 20761 19919 27567 26503 30975 41132
20239 41132 27229 3961 21266 6661 -11099 -3721 -27407 -25867 -7508 -1178 -4049 16965
20227 16965 9355 -6761 -1630 12885 5420 -17774 -49697 -56658 -39231 -12147 21972 20734 16811
20214 16811 -3684 -22293 -4792 27213 29203 17928 19580 25820 29047 19034 -16256 -7531 -2039
20201 -2039 -217 -10182 -6449 -12266 -1302 -7569 -1661 1052 3870 -9838 -21507 -7572 439 17876
20187 17876 29840 9727 8168 7569 -8359 -6774 -9911 2589 35676 38335 3337 -14398 -17438
20174 -17438 4337 -2864 -6021 -343 -2046 -24056 -56548 -76264 -59898 -32211 -18651 -25862 -9132
$$ packed form
20266c6739M7193n903K626j0301O631K460Q781N217j8637o221r674L3887O597
20253B5917R45p321k218j4812Q108K049r062O856J0299q42P648j064M472J0157
20239D1132j3903k3268J7305j4605j7760P378k3686J540J8359O330k871K1014
20227A6965p610j6116N131J4515p465k3194l1923o961J7427K7084L4119j238l923
20214A6811k0495j8609J7501L2005J990j1275J652O240L227j0013l5290Q725N492
20201b039J822r965L733n817J0964o267N908K713K818j3708j1669J3935Q011J7437
20187A7876J1964k0113j559n99j5928J585l137J2500L3087K659l4998j7735l040
20174a7438K1775p201l157N678j703k2010l2492j9716J6366K7687J3560p211J6730
$$ plain form
20161 -9132 -2968 3277 75 -7987 -1926 -25409 -10954 4906 9191 2067 -3601 599 -10421 -18090
20147 -18090 3479 11958 24859 21091 13640 7529 2888 25464 35187 26813 -5321 -14611 14040
20134 14040 7360 7312 2514 -18990 -13848 -12887 -12454 401 -12245 -11008 14193 8399 -72 -35054
20120 -35054 -43553 -51260 -50505 -35330 -20129 -15357 -6121 -21531 -28014 13030 24297 25829 10213
20107 10213 -22198 -8812 1693 -9344 -13715 -13760 -8016 -13303 -1580 -12991 -17025 -7542 -450
20094 -450 -19533 -35865 -34096 -3581 -2567 -10615 -38652 -19391 -25002 -47616 -30639 -20892 -16214
20081 -16214 -18886 14757 17435 7359 -13916 -3055 -24162 -53569 -50849 -37495 -28996 -35912 -41679
20068 -41679 -30887 -6616 -5614 -20994 -27873 -20896 -5938 4799 1200 -8723 -26857 -21727 -10471
$$ packed form
20161i132O164O245l202q062O061k3483J4455J5860M285p124n668M200j1020p669
20147a8090K1569Q479J2901l768p451o111m641K2576R723q374l2134r290K8651
20134A4040o680m8m798k1504N142R61M33J2855j2646J237K5201n794q471l4982
20120c5054q499p707P55J5175J5201M772R236j5410o483M1044J1267J532j5616
20107A0213l2411J3386J0505j1037m371m5N744n287J1723j1411m034R483P092
20094d50j9083j6332J769L0515J014q048k8037J9261n611k2614J6977R747M678
20081a6214k672L3643K678j0076k1275J0861k1107k9407K720J3354Q499o916n767
20068d1679J0792K4271J002j5380o879O977J4958J0737l599r923j8134N130J1256
$$ plain form
20055 -10471 -9792 -24082 -11822 -994 -8437 -41671 -35299 -35018 -45726 -20945 3040 21858 30946
20042 30946 6190 -2087 8255 32920 22805 34181 30293 27275 15885 9966 3711 1795 -5417
20029 -5417 -16065 -3036 7048 -2353 -29264 -36701 -33471 -12254 8745 10617 12252 7911 11603
20016 11603 23184 48293 49964 10046 -19628 -17134 -17129 -4720 -17858 -13751 15321 6782 -13206
20003 -13206 -18241 4873 -17594 -9783 -5250 6430 2576 -12510 -27712 -21508 1913 13028 439
19990 439 -31776 -43776 -47351 -39996 -4371 -6467 5302 14976 -21753 -28760 -28997 -8412 -2622 -12597
19976 -12597 -39214 -11469 3457 -21930 -30990 20726 51004 18549 -14734 -8533 -1047 3668
19964 3668 -8672 -7127 -2547 -10716 -24843 -19304 -8499 -27382 -34923 -28212 -36913 -25882 -16048
$$ packed form
20055a0471O79j4290J2260J0828p443l3234O372K81j0708K4781K3985J8818R088
20042C0946k4756q277J0342K4665j0115J1376l888l018j1390n919o255j916p212
20029e417j0648J3029J0084r401k6911p437L230K1217K0999J872J635m341L692
20016A1603J1581K5109J671l9918k9674K494NJ2409j3138M107K9072q539j9988
20003a3206n035K3114k2467P811M533J1680l854j5086j5202O204K3421J1115j2589
19990D39l2215j2000l575P355L5625k096J1769R674l6729p007k37K0585N790r975
19976a2597k6617K7745J4926k5387r060N1716L0278l2455l3283O201P486M715
19964C668j2340J545M580q169j4127N539J0805j8883p541O711q701J1031R834
$$ plain form
19951 -16048 -16932 -13893 -7826 16530 13517 -11674 -17789 -18909 -5832 23532 29021 6251 -31519
19938 -31519 -21791 -10665 -1319 -4582 7189 8250 17144 1156 -1918 -9428 -15673 -1118 13458
19925 13458 46130 61978 60311 10249 3485 33986 32036 46868 54580 39912 16552 -3349
19913 -3349 -48030 -51838 -26752 -32887 -22442 -18856 -5689 14573 9371 16927 -877 20144 16246
19900 16246 7020 15570 13407 15150 15487 2696 16657 23120 5877 -639 20305 43573 65775
19887 65775 54355 25690 1461 16290 41877 13044 -37523 -38437 -14490 -5719 8899 4794
19875 4794 5435 3632 1891 -8919 -6783 -6681 404 11134 11235 13351 -13761 -10280 -32693 -47304
19861 -47304 -32732 -15708 -21321 -42031 -38666 -15442 840 -16195 -35797 -34406 -38174 -22892
$$ packed form
19951a6048q84L039O067K4356l013k5191o115j120J3077K9364N489k2770l7770
19938c1519R728J1126R346l263J1771J061Q894j5988l074p510o245J4555J4576
19925A3458L2672J5848j667n0062o764L0501j950J4832P712j4668k3360j9901
19913c349m4681l808K5086o135J0445L586J3167K0262n202P556j7804K1021l898
19900A6246r226Q550k163J743L37j2791J3961O463j7243o516K0944K3268K2202
19887F5775j1420k8665k4229J4829K5587k8833n0567r14K3947Q771J4618m105
19875D794O41j803j741j0810K136J02P085J0730J01K116k7112L481k2413j4611
19861d7304J4572J7024n613k0710L365K3224J6282j7035j9602J391l768J5282
$$ plain form
19849 -22892 -24201 -28012 -31328 -26908 -19355 -8161 -3368 -2942 -18769 -37170 -44879 -49146 -41695 -20174
19835 -20174 -12816 -11524 -7154 -5810 -1124 25864 25251 -8406 -45616 -41682 -26891 -13840 5765
19822 5765 20952 -4904 -34746 -73544 -79381 -28888 -9710 -18480 -17067 -11408 -3100 -1077 -25243
19809 -25243 -46327 -40866 -40960 -40492 -42196 -44621 -43583 -43634 -43210 -58802 -33782 -25559 3363 7454 -18446
19794 -18446 -36831 -45795 -59074 -45459 -33104 -26392 -2475 5257 25932 3492 -28010 -30180
19782 -30180 -23688 -29429 -65313 -73227 -34723 -25402 -30492 -17295 8021 14419 23029 8043 -2511
19769 -2511 1100 -28278 -60094 -62199 -36504 -4341 18146 25296 7635 -15310 -46226 -27227
19757 -27227 14359 14045 -5711 -23173 -29456 -22767 9475 30115 38692 38279 42597 30329 1866
$$ packed form
19849b2892j309l811l316M420P553J1194M793M26j5827j8401p709m267P451K1521
19835b0174P358J292M370J344M686K6988o13l3657l7210L934J4791J3051J9605
19822E765J5187k5856k9842l8798n837N0493J9178q770J413N659Q308K023k4166
19809b5243k1084N461r4M68j704k425J038n1M24j5592K5020Q223K8922M091k5900
19794a8446j8385q964j3279J3615J2355O712K3917P732K0675k2440l1502k170
19782c0180O492n741l5884p914L8504R321n090J3197K5316O398Q610j4986j0554
19769b511L611k9378l1816k105K5695L2163K2487P150j7661k2945l0916J8999
19757b7227M1586l14j9756j7462o283O689L2242K0640Q577m13M318j2268k8463
$$ plain form
19744 1866 844 35304 36513 5822 901 11858 36654 14710 6883 17311 11678 33051 26341
19731 26341 -9988 -39580 -37492 -19650 -34035 -27145 5265 -191 -16819 -20012 -21768 -4100 25285
19718 25285 22222 -8685 7272 20702 23274 12807 -19447 -11042 -17380 -27205 -26833 -44294 -56039
19705 -56039 -42185 -32785 -15229 -9618 -29676 -37085 -9452 -10892 -5807 13414 25471 15909 4460
19692 4460 26437 41687 35937 44993 37252 31821 29932 39197 42258 17411 -20851 -51359 -8781
19679 -8781 17336 11969 11451 42368 62296 47415 20648 21584 25991 16009 1867 -23136 -15401
19666 -15401 1918 -6095 -19643 -11708 7505 -10732 -9723 -9771 -15386 -15734 -28769 -14398 -13194 -3542
19652 -3542 -3878 -31356 -51534 -44324 -33554 -8562 -1419 6789 -14587 -25205 -18642 356 -8842
$$ packed form
19744A866j022L4460J209l0691m921J0957K4796k1944p827J0428n633K1373o710
19731B6341l6329k9592K088J7842j4385O890L2410n456j6628l193j756J7668K9385
19718B5285l063l0907J5957J3430K572j0467l2254Q405o338r825L72j7461j1745
19705e6039J3854R400J7556N611k0058p409K7633j440N085J9221J2057r562j1449
19692D460K1977J5250n750R056p741n431j889R265L061k4847l8262l0508M2578
19679h781K6117n367n18L0917J9928j4881k6767R36M407r982j4142k5003P735
19666a5401J7319q013j3548P935J9213j8237J009m8n615l48j3035J4371J204R652
19652c542l36k7478k0178P210J0770K4992P143Q208k1376j0618O563J8998r198
$$ plain form
19639 -8842 -29818 -25095 -28060 -31260 -26761 -13868 1295 17503 19601 -8772 -16339 10631 36826
19626 36826 13099 4766 -11998 -42110 -33193 -26222 -16297 -8615 -14987 -5987 -10490 -16077 16764
19613 16764 40689 24619 12607 -11567 -11912 -17011 -6418 -13359 -11292 17392 13854 16045 4436
19600 4436 -14462 -13797 -14310 -25022 -6432 -3853 16956 6346 5553 14383 7211 -16645 -34289 -8920
19586 -8920 -1689 -9499 -23672 -21267 -6322 -12899 245 -10892 -21133 -5359 3666 2185 -1763
19573 -1763 -16039 -21424 14083 42370 39819 29874 6730 7450 12190 189 17939 18818 7294
19560 7294 18756 38717 48398 38706 28479 14919 5142 -16907 -57864 -59617 -50006 -42412 -27015
19547 -27015 -9346 -15898 4965 16257 15633 15391 11742 -9580 9466 37111 -206 -17554 -19211
$$ packed form
19639h842k0976M723k965l200M499J2893J5163J6208K098k8373p567K6970K6195
19626C6826k3727q333j6764l0112Q917O971R925P682o372R000m503n587L2841
19613A6764K3925j6070j2012k4174l45n099J0593o941K067K8684l538K191j1609
19600D436j8898O65n13j0712J8590K579K0809j0610p93Q830p172k3856j7644K5369
19586h920P231p810j4173K405J4945o577J3144j1137j0241J5774R025j481l948
19573a763j4276n385L5507K8287k551r945k3144P20M740j2001J7750Q79j1524
19560G294J1462J9961R681r692j0227j3560r777k2049m0957j753R611P594J5397
19547b7015J7669o552K0863J1292o24k42l649k1322J9046K7645l7317j7348j657
$$ plain form
19534 -19211 5007 2399 -43929 -58144 -56557 -34724 -14452 -12073 942 -6777 -35945 -52174
19522 -52174 -45479 472 25024 2671 -5465 11040 -8681 -28279 -18887 -17598 -19766 -33240 -35400
19509 -35400 -16683 -16607 -7019 -29903 -37274 -22632 -1091 12805 -4142 -21916 -18665 740 31509
19496 31509 34409 3835 -15945 -5794 16405 595 -11700 10117 7023 -13549 -6555 9044
19484 9044 7284 -17183 -7835 -9347 -11892 -19256 3831 258 -18044 -239 6156 20896 34657
19471 34657 6183 -10564 -16645 -25697 -37145 -52375 -41832 -19537 -17058 -39970 -42413 -26280
19459 -26280 -13238 -17002 -14136 -23719 -31744 -45300 -23586 10259 7584 -7217 -11548 -5465 6096
19446 6096 -2127 -14908 -4161 9990 434 -24992 -20406 5754 17717 -6818 -19302 -15688 8900
$$ packed form
19534a9211K4218k608m6328j4215J587K1833K0272K379J3015p719k9168j6229
19522e2174O695M5951K4552k2353q136J6505j9721j9598R392J289k168j3474k160
19509c5400J8717P6R588k2884p371J4642K1541J3896j6947j7774L251J9405L0769
19496C1509K900l0574j9780J0151K2199j5810j2295K1817l094k0572O994J5599
19484I044j760k4467R348j512k545p364K3087l573j8302J7805O395J4740J3761
19471C4657k8474j6747o081r052j1448j5230J0543K2295K479k2912k443J6133
19459b6280J3042l764K866r583q025j3556K1714L3845k675j4801m331O083J1561
19446F096q223j2781J0747J4151r556k5426M586K6160J1963k4535j2484L614K4588
$$ plain form
19433 8900 23351 10713 -13478 -19712 -20937 -16375 -19455 -15342 -8711 -28012 -29131 -35574 13381
19420 13381 40438 37854 10155 -4015 -4462 -19779 -28952 -33304 -14926 7043 -6966 -25209 3025
19407 3025 21749 15663 11923 -5475 -28070 -1014 -9910 -12385 -10771 -9016 9353 16241 20602
19394 20602 9770 -15853 -22903 -31505 -45502 -33535 -11224 -11880 -4738 2060 -3871 14317 -4912
19381 -4912 22517 57583 38427 31377 8357 -3052 -18110 -29964 -23217 -2137 6388 -9337
19369 -9337 -2058 -7693 -19341 -49753 -49004 -54999 -28873 -13699 -16872 -31861 -3455 7013 3059
19356 3059 -2587 -16193 -13354 -19681 -33873 -12866 -4612 -1185 2359 -6860 -3417 -14942 20530
19343 20530 30346 24641 56233 44541 20144 -3940 -24416 -23423 -19790 -17853 -26264 -27422 -1253
$$ packed form
19433H900J4451j2638k4191o234j225M562l080M113O631j9301j119o443M8955
19420A3381K7057k584k7699j4170m47j5317r173m352J8378K1969j4009j8243K8234
19407C025J8724o086l740j7398k2595K7056q896k475J614J755J8369O888M361
19394B0602j0832k5623p050q602j3997J1967K2311o56P142O798n931J8188j9229
19381d912K7429L5066j9156p050k3020j1409j5058j1854O747K1080Q525j5725
19369i337P279n635j1648l0412P49n995K6126J5174l173j4989K8406J0468l954
19356C059n646j3606K839o327j4192K1007Q254L427L544r219L443j1525L5472
19343B0530R816n705L1592j1692k4397k4084k0476R93L633J937q411j158K6169
$$ plain form
19330 -1253 -5905 5098 7759 1240 12959 -14675 -9798 2154 -13207 -40761 -48298 -32999 -39570
19317 -39570 -18477 -8005 -16711 -16474 -22879 -17820 2684 5445 -5159 8560 28720 32212 2155
19304 2155 -19698 4815 1457 -14622 -12830 -1999 9819 18293 -493 25686 30706 10251 4640
19291 4640 -369 5201 -1676 -4164 -15239 2322 -13406 -28661 -23945 -19616 7147 32287 19109
19278 19109 -791 11912 16751 46627 42418 9171 12357 666 17230 12662 1404 -11337
19266 -11337 -8108 -602 3863 31757 44043 50833 41103 23548 -1977 -6803 -18026 -40552 -35189
19253 -35189 -2619 -18086 2435 7320 -2947 -8249 -15672 -18880 -32350 -10723 11352 -18401
19241 -18401 -38410 -33830 -11853 5755 -2219 -13426 -24295 -36617 -49722 -54221 -20370 -7260
$$ packed form
19330a253m652J1003K661o519J1719k7634M877J1952j5361k7554p537J5299o571
19317c9570K1093J0472q706K37o405N059K0504K761j0604J3719K0160L492l0057
19304B155k1853K4513l358j6079J792J0831J1818Q474j8786K6179N020k0455n611
19291D640n009N570o877k488j1075J7561j5728j5255M716M329K6763K5140j3178
19278A9109j9900J2703M839K9876m209l3247L186j1691J6564m568j1258j2741
19266a1337L229P506M465K7894J2286O790r730j7555k5525m826j1223k2526N363
19253c5189L2570j5467K0521M885j0267n302p423l208j3470K1627K2075k9753
19241a8401k0009M580K1977J7608p974j1207j0869j2322j3105m499L3851J3110
$$ plain form
19229 -7260 -13916 -34551 -31484 -18752 -30198 -37114 -7978 -16663 -37948 -36094 -19975 -8205 -10872
19216 -10872 -14902 -25925 -21591 -17294 -29460 -26986 -47398 -42311 -31947 -56951 -57338 -38960 -37298
19203 -37298 -37700 -16202 -6484 23513 45262 13267 -32479 -12641 6042 30846 25441 -627
19191 -627 13074 10498 -41359 -52542 -27641 -42778 -58100 -45999 -27423 -10477 -11865 7034
19179 7034 1929 -12121 -36119 -30865 -25343 6270 32803 26920 3134 12709 30278 57876 49585
19166 49585 19501 15921 7839 14526 11650 -4261 5324 -14064 -24863 -41857 -41273 -41110 -2066
19153 -2066 18984 -7468 -14052 -4295 -11391 -7995 -2254 -3502 -5456 -20074 -26781 -19625 -21242 -16010
19139 -16010 3 13560 -14162 -12949 -2794 21539 41949 56052 46791 30470 24415 4406
$$ packed form
19229g260o656k0635L067J2732j1446o916K9136q685k1285J854J6119J1770k667
19216a0872m030j1023M334M297j2166K474k0412N087J0364k5004l87J8378J662
19203c7298m02K1498R718K9997K1749l1995m5746J9838J8683K4804n405k6068
19191f27J3701k576n1857j1183K4901j5137j5322J2101J8576J6946j388J8899
19179G034n105j4050k3998N254N522L1613K6533n883k3786R575J7569K7598q291
19166D9585l0084l580q082O687k876j5911R585j9388j0799j6994N84J63L9044
19153b066K1050k6452o584R757p096L396N741j248j954j4618o707P156j617N232
19139a6010J6013J3557k7722J213J0155K4333K0410J4103r261j6321o055k0009
$$ plain form
19127 4406 -23172 -29788 10884 18235 -8267 -14800 -30209 -25233 -1419 4713 4015 10573 3269 -22048
19113 -22048 -1743 17165 18821 25837 9800 10440 2334 -6284 -15972 -22747 -15069 -15656 -21848 -24362
19099 -24362 -9005 -1705 -6610 -23790 -2464 10342 30783 22383 4752 -117 -12836 -19467 -17688
19086 -17688 -38493 -29484 -25032 -30467 -20943 11251 17331 19060 -6652 -21457 -11491 -1085 -21377
19073 -21377 8854 19891 -1549 18918 20484 1047 -10714 -3672 2704 10283 10641 10493 -1254
19060 -1254 -26931 -30399 -23016 -22455 -19943 -48834 -50644 -35161 -22168 -3934 -3368 -18098 -18276 -25681
19046 -25681 -34288 -29591 -19518 -23791 -10860 -9975 -24846 -24222 -43024 -36444 -32018 -9127 -4984 2852
19032 2852 -195 -27867 -25146 -28975 -7836 25284 35748 39761 33747 27175 32497 27868 21527 -5814
$$ packed form
19127D406k7578o616M0672P351k6502o533j5409M976K3814O132o98O558p304k5317
19113b2048K0305J8908J656P016j6037O40q106q618r688o775P678n87o192k514
19099b4362J5357P300m905j7180K1326J2806K0441q400j7631m869j2719o631J779
19086a7688k0805R009M452n435R524L2194O080J729k5712j4805R966J0406k0292
19073b1377L0231J1037k1440K0467J566j9437j1761P042O376P579L58j48j1747
19060a254k5677l468P383N61K512k8891j810J5483J2993J8234N66j4730j78p405
19046b5681q607M697J0073m273J2931Q85j4871O24j8802O580M426K2891M143P836
19032B852l047k7672K721l829K1139L3120J0464M013o014o572N322m629o341k7341
$$ plain form
19018 -5814 -15390 -3028 6466 -6124 -1943 13601 20960 8405 -23639 -32719 -7429 16546 10269
19005 10269 -7095 -30545 -26082 -49265 -46683 -39820 -43178 -24980 -28796 -31151 -35547 -35910 -6807
18992 -6807 -927 19148 17106 21732 31520 17928 4709 34800 41907 17706 3117 -6680 -4933
18979 -4933 13167 15653 25688 25903 30559 27128 22278 6515 -16349 -18837 24771 22235 6063
18966 6063 51108 82264 34227 20466 15690 6753 6166 -4321 13476 33400 29153 15104 -11040
18953 -11040 -21761 -19123 -25341 -10279 4861 18581 3054 -26058 -31264 -17085 -24168 -26052 -9905
18940 -9905 15980 14620 12618 6085 14103 22517 12742 -20775 -20549 -21462 367 13737 -3071 -11984
18926 -11984 -9560 2586 -8559 -8499 5331 8885 13754 5838 -34050 -17315 -11216 -37509 -33750
$$ packed form
19018e814r576J2362R494j2590M181J5544P359j2555l2044r080K5290K3975o277
19005A0269j7364k3450M463k3183K582O863l358J8198l816k355m396l63K9103
18992f807N880K0075k042M626R788j3592j3219L0091P107k4201j4589r797J747
18979d933J8100K486J0035K15M656l431m850j5763k2864k488M3608k536j6172
18966F063M5045L1156m8037j3761m776q937n87j0487J7797J9924m247j4049k6144
18953a1040j0721K638o218J5062J5140J3720j5527k9112n206J4179p083j884J6147
18940i905K5885j360k002o533Q018Q414r775l3517K26r13K1829J3370j6808q913
18926a1984K424J2146j1145O0J3830L554M869p916l9888J6735O099k6293L759
$$ plain form
18913 -33750 -14541 -8172 -19375 -1227 23462 35572 25333 11659 10422 17076 26439 15857
18901 15857 2532 12832 14559 -486 -15720 -12916 23292 34306 27374 23564 35918 46791
18889 46791 -4371 -44568 -13256 -37605 -57249 -16300 12220 3673 -30073 -51511 -45944 -69461
18877 -69461 -57960 -21547 -19852 -20308 -31738 -37618 -22945 -23427 -25490 -33858 -26176 -4333 11791
18864 11791 32631 48440 49165 47051 26280 -4044 -28260 -10816 6775 15506 15154 -7898 -28087
18851 -28087 -15735 -8633 -34021 -55715 -29476 -12058 7938 28633 35307 14382 -3306 -5155
18839 -5155 -19157 -35888 -19991 3291 -15273 -23492 -39979 -49670 -51190 -53940 -51356 -23152 4412
18826 4412 8542 2266 11458 41021 50743 67159 51354 19862 -2425 9620 29006 32499 -2188
$$ packed form
18913c3750J9209O369j1203J8148K4689J2110j0239j3674j237O654R363j0582
18901A5857j3325J0300J727j5045j5234K804L6208J1014o932l810J2354J0873
18889D6791n1162m0197L1312k4349j9644M0949K8520q547l3746k1438N567k3517
18877f9461J1501L6413J695m56j1430n880J4673m82k063q368P682K1843J6124
18864A1791K0840J5809P25k114k0771l0324k4216J7444J7591Q731l52k3052k0189
18851b8087J2352P102k5388k1694K6239J7418J9996K0695O674k0925j7688j849
18839e155j4002j6731J5897K3282j8564q219j6487r691j520k750K584K8204K7564
18826D412M130o276R192K9563R722J6416j5805l1492k2287J2045J9386L493l4687
$$ plain form
18813 -2188 -7463 12555 12915 24763 12080 7344 5466 -5266 -14242 15123 30936 17189 26980
18800 26980 25386 -4465 -6428 7911 12991 10053 16155 11212 7688 -7837 -37086 -18934 -2438
18787 -2438 15612 15171 65 -3502 -645 13770 13074 19281 29738 42342 37455 24308 18463 16221
18773 16221 16440 25597 43385 60223 95921 184751 286132 316215 259690 203774 146100 100120
18761 100120 89008 71575 50899 34238 42890 50087 37944 25513 -13592 -27930 -2474 14713
18749 14713 12441 10639 13673 30383 31763 33558 11794 10336 6634 22458 28397 15062 18306
18736 18306 10835 27086 13740 6436 10600 4782 4197 -12064 -19430 -9162 30016 32188 -4055
18723 -4055 -8586 16229 40279 34307 34930 17190 11892 24013 6854 -7343 15943 32706 27531
$$ packed form
18813b188n275K0018L60J1848j2683m736j878j0732q976K9365J5813j3747R791
18800B6980j594k9851j963J4339N080k938O102m943l524j5525k9249J8152J6496
18787b438J8050m41j5106l567K857J4415o96O207J0457J2604m887j3147n845k242
18773A6221K19R157J7788J6838L5698Q8830J01381L0083n6525n5916n7674m5980
18761A00120j1112j7433k0676j6661Q652P197j2143j2431l9105j4338K5456J7187
18749A4713k272j802L034J6710J380J795k1764j458l702J5824N939j3335L244
18736A8306p471J6251j3346p304M164n818n85j6261p366J0268L9178K172l6243
18723d055m531K4815K4050n972O23j7740n298J2121j7159j4197K3286J6763n175
$$ plain form
18710 27531 43162 43084 10500 18521 38817 38359 19185 20758 20379 13423 6383 12415 9741 -16901
18696 -16901 -1281 25030 4395 15919 37048 -9693 -13107 3455 -16657 -28847 -4987 20668
18684 20668 55377 51829 44616 51699 40382 11697 -1284 11004 -6776 -5851 5984 -5733 -20815
18671 -20815 -3020 -7411 39649 52842 48893 31996 -2537 -28289 -4018 14020 20837 45015
18659 45015 26731 -8521 -8198 8002 46344 67999 37058 22861 54871 69435 73287 103392
18647 103392 136746 149106 182258 210145 220861 225960 226687 220763 219570 197930 198214 193435 194943
18634 194943 175237 193230 224057 248263 250212 252713 229668 179088 171408 203902 202246 206410
18622 206410 168706 148801 141856 133380 118863 120262 118803 153082 182265 208172 248214 284722
$$ packed form
18710B7531J5631p8l2584Q021K0296m58j9174J573l79o956p040O032k674k6642
18696a6901J5620K6311k0635J1524K1129m6741l414J6562k0112j2190K3860K5655
18684B0668L4709l548p213P083j1317k8685j2981J2288j7780R25J1835j1717j5082
18671b0815J7795m391M7060J3193l949j6897l4533k5752K4271J8038O817K4178
18659D5015j8284l5252L23J6200L8342K1655l0941j4197L2010J4564L852L0105
18647A03392L3354J2360L3152K7887J0716N099P27n924j193k1640K84m779J508
18634A94943j9706J7993L0827K4206J949K501k3045n0580p680L2494j656M164
18622B06410l7704j9905o945q476j4517J399j459L4279K9183K5907M0042L6508
$$ plain form
18610 284722 324556 325968 320930 337047 371631 355003 357833 353886 375980 348414 318607 290463
18598 290463 286371 303536 314334 332162 334803 360657 392193 390332 394029 378119 359471 365994
18586 365994 373687 360475 346325 318989 319813 324546 320156 311672 318940 314272 283456 246600 228311
18573 228311 234880 219952 162891 113438 118786 138420 151065 152783 163576 171142 174496 200566
18561 200566 239061 244023 243583 249203 260204 265232 288497 309240 339935 346955 350798 332200 331070
18548 331070 301418 277904 267174 260003 226827 240301 222542 199172 163692 128783 83215 50176
18536 50176 38540 31599 36840 18925 16741 6492 9549 6718 12907 38960 46907 55257 62573
18523 62573 68093 44370 4343 -25930 -31739 -21864 3251 9603 26153 23104 -22889 5358 5936
$$ packed form
18610B84722L9834J412n038J6117L4584j6628K830l947K2094k7566k9807k8144
18598B90463m092J7165J0798J7828K641K5854L1536j861L697j5910j8648O523
18586C65994P693j3212j4150k7336Q24M733m390q484P268m668l0816l6856j8289
18573B28311O569j4928n7061m9453N348J9634J2645J718J0793P566L354K6070
18561B00566L8495M962m40N620J1001N028K3265K0743L0695P020L843j8598j130
18548C31070k9652k3514j0730p171l3176J3474j7759k3370l5480l4909m5568l3039
18536E0176j1636o941N241j7915k184j0249L057k831O189K6053P947Q350P316
18523F2573N520k3723m0027l0273n809R875K5115O352J6550l049m5993K8247N78
$$ plain form
18510 5936 1967 16985 24467 35878 42315 58119 43753 27555 30780 36873 68121 57887 43915
18497 43915 40106 14086 -23317 -16260 6189 -13752 -4921 9431 25601 24738 23031 29448 33678
18484 33678 48199 44414 26039 13371 17603 18773 7032 3220 -24650 -28351 -7239 -1087 15617
18471 15617 1624 -13379 -13267 2510 19955 20722 -10470 -25857 -17452 -10478 -31656 -46120 -51320
18458 -51320 -49250 -15919 8352 -20558 -29037 -14160 6759 17257 9979 7126 5576 11107 48257
18445 48257 40353 23244 38001 34476 5785 -8546 -322 -3865 -17344 -7396 -170 7421 12964
18432 12964 8929 -3790 -955 4312 -688 -14187 -19093 -30382 -23225 -42970 -42095 -40378 -39679 -61531
18418 -61531 -68416 -55034 -46315 -50432 -35674 -23549 -43416 -40394 -3581 -15327 -55832 -48098 -53083
$$ packed form
18510E936l969J5018P482J1411O437J5804j4366j6198L225O093L1248j0234j3972
18497D3915l809k6020l7403P057K2449j9941Q831J4352J6170q63j707O417M230
18484C3678J4521l785j8375j2668M232J170j1741l812k7870l701K1112O152J6704
18471A5617j3993j5003J12J5777J7445P67l1192j5387Q405O974k1178j4464n200
18458e1320K070L3331K4271k8910q479J4877K0919J0498p278k853j550N531L7150
18445D8257p904j7109J4757l525k8691j4331Q224l543j3479R948P226P591N543
18432A2964m035j2719K835N267n000j3499m906j1289P157j9745Q75J717O99k1852
18418f1531o885J3382Q719m117J4758J2125j9867L022L6813j1746m0505P734m985
$$ plain form
18405 -53083 -41827 -24036 -23869 -23620 -6906 1305 -8482 -36915 -40159 -20107 20747 39156 49097
18392 49097 43122 34059 3269 -7804 22870 34277 22100 27283 33350 68771 95208 107656
18380 107656 124469 120910 145711 195637 205203 180027 193890 186331 171291 173994 176742 138023
18368 138023 111839 121059 114286 104674 124877 143169 161900 167064 167426 155916 164450 176985 197210
18355 197210 212580 225294 229669 206890 195654 173390 145402 143515 142449 142334 133724 125114 104753
18342 104753 88944 95163 103197 90606 73714 56279 59390 42311 20704 36981 43326 31442
18330 31442 12789 -30672 -34375 -27686 -29558 -26084 -18257 6066 16660 16450 2196 -29055 -45449
18317 -45449 -57947 -48154 -53928 -55078 -38181 -51058 -59004 -61427 -78256 -84193 -70523 -61532 -52514
$$ packed form
18405e3083J1256J7791J67K49J6714Q211r787k8433l244K0052M0854J8409R941
18392D9097n975r063l0790j1073L0674J1407j2177N183O067L5421K6437J2448
18380A07656J6813l559K4801M9926R566k5176J3863p559j5040K703K748l8719
18368A38023k6184R220o773r612K0203J8292J8731N164L62j1510Q534J2535K0225
18355A97210J5370J2714M375k2779j1236k2264k7988j887j066j15q610q610k0361
18342A04753j5809O219Q034j2591j6892j7435L111j7079k1607J6277O345j1884
18330C1442j8653m3461l703O689j872L474P827K4323J0594k10j4254l1251j6394
18317d5449j2498R793n774j150J6897j2877p946k423j6829n937J3670Q991R018
$$ plain form
18304 -52514 -32493 -20786 -23273 -64476 -88057 -104847 -93814 -70046 -41680 22967 87210 149746
18292 149746 212400 286794 361907 455529 542225 602344 660495 725331 808376 850794 872546
18281 872546 907441 922216 882450 830411 782610 753445 717094 680845 625306 575472 543014
18270 543014 530502 503770 506705 464067 406233 350835 318973 303699 278996 247125 216402 191654
18258 191654 193618 211938 211960 210010 224532 225292 244038 298482 335417 381455 409870 440133 482642
18245 482642 493651 522588 537290 559591 582926 578111 599765 642027 664113 664226 686582 719765
18233 719765 784167 836831 881867 916283 959739 963827 971345 972143 930122 913099 862720 800302
18221 800302 767461 742053 727724 729539 726300 747757 763289 765920 739369 709744 666596 667121
$$ packed form
18304e2514K0021J1707k487m1203k3581j6790J1033K3768K8366O4647O4243O2536
18292A49746O2654P4394P5113R3622Q6696O0119N8151O4836Q3045M2418K1752
18281H72546L4895J4775l9766n2039m7801k9165l6351l6249n5539m9834l2458
18270E43014j2512k6732K935m2638n7834n5398l1862j5274k4703l1871l0723k4748
18258A91654J964J8320K2j950J4522P60J8746N4444L6935M6038K8415L0263M2509
18245D82642J1009K8937J4702K2301K3335m815K1654M2262K2086J13K2356L3183
18233G19765O4402N2664M5036L4416M3456M088P518P98m2021j7023n0379o2418
18221H00302l2841k5408j4329J815l239K1457J5532K631k6551k9625m3148N25
$$ plain form
18209 667121 660019 655125 657048 656594 667184 692324 686578 682482 705518 709846 743529 782487 787761
18196 787761 811794 838235 863732 877057 928490 1011378 1088641 1142947 1188596 1265511 1378101
18185 1378101 1479529 1561569 1658326 1771045 1905996 2043007 2204685 2338542 2478689 2690461
18175 2690461 2959759 3262340 3612732 4107163 4855961 6055311 7960481 10651717 13417303
18166 13417303 14737836 13964020 12180777 10604071 9814658 9859363 10609276 11773936 12950271
18157 12950271 13623795 13335366 12378573 11418107 10786139 10501273 10445088 10252406 9660453
18148 9660453 8809666 7969334 7325418 6930539 6852898 7046174 7426065 7897521 8368216 8740825
18138 8740825 8910512 8843976 8620191 8351064 8126490 8009605 8017690 8169160 8483873 8937624
$$ packed form
18209F67121p102m894J923m54J0590K5140n746m096K3036M328L3683L8958N274
18196G87761K4033K6441K5497J3325N1433Q2888P7263N4306M5649P6915J12590
18185A378101J01428Q2040R6757J12719J34951J37011J61678J33857J40147K11772
18175B690461K69298L02581L50392M94431P48798J199350J905170K691236K765586
18166A3417303J320533p73816j783243j576706p89413M4705P49913J164660J176335
18157A2950271O73524k88429r56793r60466o31968k84866n6185j92682n91953
18148I660453q50787q40332o43916l94879p7641J93276L79891M71456M70695L72609
18138H740825J69687o6536k23785k69127k24574j16885Q085J51470L14713M53751
$$ plain form
18128 8937624 9569726 10451735 11618406 13132689 14990811 16925085 18623334 19946086
18120 19946086 21056264 22295826 23932857 26096126 28811270 32163896 36421663 41985715
18112 41985715 49586678 60476978 77569718 104757303 134978941 152456883 168062433
18105 168062433 191813878 219781451 244400147 260926151 268556334 270493202 270741751
18098 270741751 270668193 267886322 257957584 238244566 208681399 173958475 140051046 110222986
18090 110222986 86156075 68177798 55434551 46553483 40048687 34865722 30620474
18083 30620474 27146377 24314461 22163668 20680032 19685637 19012510 18279952 17152567
18075 17152567 15555704 13727140 11959468 10444507 9247758 8349929 7680925 7226040
$$ packed form
18128H937624O32102Q82009J166671J514283J858122J934274J698249J322752
18120A9946086J110178J239562J637031K163269K715144L352626M257767N564052
18112D1985715P600963J0890300J7092740K7187585L0221638J7477942J5605550
18105A68062433K3751445K7967573K4618696J6526004P630183J936868K48549
18098B70741751p3558k781871r928738j9713018k9563167l4722924l3907429k9828060
18090A10222986k4066911j7978277j2743247q881068o504796n182965m245248
18083C0620474l474097k831916k150793j483636r94395o73127p32558j127385
18075A7152567j596863j828564j767672j514961j196749q97829o69004m54885
$$ plain form
18067 7226040 6968106 6876496 6964744 7186717 7494618 7864110 8193968 8330679 8233702 7987882
18057 7987882 7608294 7199496 6847159 6603173 6578717 6857766 7446893 8257426 9035757 9468929
18047 9468929 9578068 9633404 9867847 10491111 11465749 12301410 12323578 11498789 10148682 8525041
18037 8525041 6997227 5760719 4837030 4158164 3644376 3258041 2975067 2772046 2589434
18028 2589434 2410502 2255761 2092296 1925306 1772389 1658514 1536059 1394527 1309987 1218083
18018 1218083 1125691 1025545 929183 857316 786114 751349 707031 676156 645683 631981 593933
18007 593933 567387 555989 516014 523841 515588 501287 491515 472493 459846 469613 465448 475265 464776
17994 464776 452821 457533 456338 460320 433583 402242 396159 441489 487198 495891 520688 533134
$$ packed form
18067G226040k57934r1610Q8248K21973L07901L69492L29858J36711r6977k45820
18057G987882l79588m08798l52337k43986k4456K79049N89127Q10533P78331M33172
18047I468929J09139N5336K34443O23264R74638Q35661K2168q24789j350107j623641
18037H525041j527814j236508r23689o78866n13788l86335k82974k03021j82612
18028B589434j78932j54741j63465j66990j52917j13875j22455j41532q4540r1904
18018A218083r2392j00146r6362p1867p1202l4765m4318l0875l0473j3702l8048
18007E93933k6546j1398l9975P827q253j4301r772j9022j2647R767m165R817j0489
17994D64776j1955M712j195L982k6737l1341o083M5330M5709Q693K4797J2446
$$ plain form
17982 533134 564282 620294 649620 665070 651197 648495 637656 627309 616808 560875 514808 498502
17970 498502 487988 474127 453839 396564 358677 333779 336436 331096 308326 276121 257681 221329
17958 221329 185697 189609 171663 161832 175262 192543 198453 219804 246671 249983 258391 279544
17946 279544 311434 305082 317753 348230 330632 291178 290067 273745 281594 262562 232735 188114
17934 188114 140138 105334 67351 40176 58980 42884 9894 -23638 -24380 -45483 -101894 -131930
17922 -131930 -170465 -189502 -186320 -201158 -223172 -218230 -218017 -244702 -246920 -237835 -184112 -102233 -16694
17909 -16694 44623 107123 154307 187389 272094 350079 391663 445476 461216 460054 434359 400753
17897 400753 381547 373865 350489 342619 349430 356397 351727 318338 284007 273252 286007 319743
$$ packed form
17982E33134L1148N6012K9326J5450j3873k702j0839j0347j0501n5933m6067j6306
17970D98502j0514j3861k0288n7275l7887k4898K657n340k2770l2205j8440l6352
17958B21329l5632L912j7946r831J3430J7281N910K1351K6867L312Q408K1153
17946B79544L1890o352J2671L0477j7598l9454j111j6322P849j9032k9827m4621
17934A88114m7976l4804l7983k7175J8804j6096l2990l3532p42k1103n6411l0036
17922a31930l8535j9037L182j4838k2014M942K13k6685k218R085N3723Q1879Q5539
17909a6694O1317O2500M7184L3082Q4705P7985M1584N3813J5740j162k5695l3606
17897D00753j9206p682k3376p870O811O967m670l3389l4331j0755J2755L3736
$$ plain form
17885 319743 329702 293501 263657 262390 256233 269474 253842 241550 237015 213734 194516 170565
17873 170565 167243 197466 197005 189363 172532 187397 202617 197678 174890 163184 167682 188450 197783
17860 197783 210564 184225 171457 159645 138433 135816 159553 160079 145898 135957 133481 138807 125573
17847 125573 147820 146871 133814 148693 135468 133708 125260 109177 87919 56363 60375 76456
17835 76456 88549 105684 56850 59950 60875 92062 122512 95943 74270 76235 80400 61014 52730
17822 52730 62798 84642 113280 118164 133119 144829 141192 123573 104929 131120 143686 120625
17810 120625 74142 79232 70434 72763 42742 65558 89382 91264 100970 93578 103095 115381 121845
17797 121845 117218 127692 142991 134857 137936 126484 132433 132768 118007 128534 146978 156867 153220
$$ packed form
17885C19743R959l6201k9844j267o157J3241j5632j2292m535k3281j9218k3951
17873A70565l322L0223m61p642j6831J4865J5220m939k2788j1706M498K0768R333
17860A97783J2781k6339j2768j1812k1212k617K3737N26j4181r941k476N326j3234
17847A25573K2247r49j3057J4879j3225j760q448j6083k1258l1556M012J6081
17835G6456J2093J7135m8834L100R25L1187L0450k6569k1673J965M165j9386q284
17822E2730J0068K1844K8638M884J4955J1710l637j7619j8644K6191J2566k3061
17810A20625m6483N090q798K329l0021K2816K3824J882R706p392R517J2286O464
17797A21845m627J0474J5299q134L079j1452N949L35j4761J0527J8444R889l647
$$ plain form
17784 153220 119204 129134 133834 148080 155626 126045 94298 95805 89944 87014 71829 54862 58575
17771 58575 84966 126593 129946 104665 108710 101014 74198 65511 62895 81035 51036 58462 72161
17758 72161 51265 22638 21520 21678 42939 66515 69458 61581 63214 31211 15298 21572 25076
17745 25076 61616 96322 97468 104626 120500 114917 95578 92793 81252 81999 94243 95819 110044
17732 110044 104665 82135 100254 88608 77784 65835 75168 82342 87270 87894 74946 40156 42082
17719 42082 66665 81991 66433 35914 24769 40702 52078 55512 47902 65300 58749 28954
17707 28954 15376 31279 70885 74549 52557 40775 21689 28747 80548 72965 46661 37575
17695 37575 16723 5707 1361 24935 26452 16036 30332 67031 72040 59701 64479 86820
$$ packed form
17784A53220l4016R930M700J4246P546k9581l1747J507n861k930j5185j6967L713
17771E8575K6391M1627L353k5281M045p696k6816q687k616J8140k9999P426J3699
17758G2161k0896k8627j118J58K1261K3576K943p877J633l2003j5913O274L504
17745B5076L6540L4706J146P158J5874n583j9339k785j1541P47J2244J576J4225
17732A10044n379k2530J8119j1646j0824j1949R333P174M928O24j2948l4790J926
17719D2082K4583J5326j5558l0519j1145J5933J1376L434p610J7398o551k9795
17707B8954j3578J5903L9606L664k1992j1782j9086P058N1801p583k6304r086
17695C7575k0852j1016m346K3574J517j0416J4296L6699N009j2339M778K2341
$$ plain form
17683 86820 86539 92294 82479 80318 100806 112356 109196 94054 82307 83022 88393 71085 60348
17670 60348 60989 76051 78115 100714 97434 74292 76616 67747 61319 73945 67754 64276 44122
17657 44122 45217 69609 87572 83797 68738 92202 110651 129960 168913 187218 209981 248032
17645 248032 274715 275465 279385 297661 316713 333673 358419 374325 364094 376144 382502 352604
17633 352604 329558 333149 334013 315876 293997 287158 263870 253347 260374 259037 236606 237658 253045
17620 253045 276251 307007 340851 366401 366271 380978 390108 397468 404535 402578 406860 393321 402100
17607 402100 407183 426125 430342 408161 387769 371955 326426 318268 314184 301696 280056 277194
17595 277194 297535 339962 358435 350074 363286 358374 387709 390726 368148 355913 363664 364105 371229
$$ packed form
17683H6820k81N755r815k161K0488J1550l160j5142j1747P15N371j7308j0737
17670F0348O41J5062K064K2599l280k3142K324q869o428J2626o191l478k0154
17657D4122J095K4392J7963l775j5059K3464J8449J9309L8953J8305K2763L8051
17645B48032K6683P50L920J8276J9052J6960K4746J5906j0231J2050O358k9898
17633C52604k3046L591Q64j8137k1879o839k3288j0523P027j337k2431J052J5387
17620B53045K3206L0756L3844K5550j30J4707R130P360P067j957M282j3539Q779
17607D02100N083J8942M217k2181k0392j5814m5529q158m084j2488k1640k862
17595B77194K0341M2427J8473q361J3212m912K9335L017k2578j2235P751M41P124
$$ plain form
17582 371229 340077 299256 309997 296236 284061 268644 220299 196572 225216 264167 259060 252945
17570 252945 257237 245601 255299 257693 235093 226582 227964 245131 254861 229960 234908 222749 203595
17557 203595 201593 199897 233836 238771 235505 236131 224496 209188 209495 192026 173830 161115 139995
17544 139995 109484 91787 76333 60941 45839 52832 77774 87540 46942 67196 78122 55279
17532 55279 42380 49657 84868 85941 67085 57213 35827 24001 38372 50278 50743 41125 32459
17519 32459 48892 44462 49248 31812 33961 43847 29371 11135 3163 318 -7581 4352 23830
17506 23830 46138 30088 11854 12674 -3206 23974 45684 29085 21882 20931 22407 38441 22809
17493 22809 28377 35729 16171 12226 13619 38132 54311 57129 50039 31888 22152 9702 6384
$$ packed form
17582C71229l1152m0821J0741j3761j2175j5417m8345k3727K8644L8951n107o115
17570B52945M292j1636R698K394k2600q511J382J7167R730k4901M948j2159j9154
17557B03595k002j696L3939M935l266O26j1635j5308L07j7469j8196j2715k1120
17544A39995l0511j7697j5454j5392j5102O993K4942R766m0598K0254J0926k2843
17532E5279j2899P277L5211J073j8856r872k1386j1826J4371J1906M65r618q666
17519C2459J6433m430M786j7436K149R886j4476j8236p972k845p899J1933J9478
17506B3830K2308j6050j8234Q20j5880K7180K1710j6599p203r51J476J6034j5632
17493B2809N568P352j9558l945J393K4513J6179K818p090j8151r736j2450l318
$$ plain form
17480 6384 21353 31303 20778 35290 43578 40815 59748 49978 9487 -442 24564 40780 27807
17467 27807 31700 44351 48128 35856 15192 23861 27102 18464 -546 -11152 -4847 8782 -17687
17454 -17687 -16935 -13164 -6280 -5041 625 47642 70998 46463 56714 76991 95158 200548 293503
17441 293503 321228 244482 159480 110845 73495 73905 60976 54757 19905 15473 10998 -7667
17429 -7667 -20646 -39903 -27769 22733 37793 33812 24206 10649 7964 -2838 -28996 -17557
17417 -17557 2092 633 -8369 13401 50441 39367 16968 30619 36645 39929 23777 7899
17405 7899 -1619 -7068 18839 34810 27756 16319 15306 17393 9721 7513 -7191 -8448 9834
17392 9834 1000 -3312 -7834 -21297 -22891 -5115 6854 -5921 -40144 -34844 -23540 -4712 -3708
$$ packed form
17480F384J4969R950j0525J4512Q288k763J8933r770m0491r929K5006J6216j2973
17467B7807L893J2651L777j2272k0664Q669L241q638j9010j0606O305J3629k6469
17454a7687P52L771O884J239N666M7017K3356k4535J0251K0277J8167J05390R2955
17441B93503K7725p6746q5002m8635l7350M10j2929o219l4852m432m475j8665
17429g667j2979j9257J2134N0502J5060l981r606j3557k685j0802k6158J1439
17417a7557J9649j459r002K1770L7040j1074k2399J3651O026L284j6152j5878
17405G899r518n449K5907J5971p054j1437j013K087p672k208j4704j257J8282
17392I834q834m312m522j3463j594J7776J1969j2775l4223N300J1304J8828J004
$$ plain form
17379 -3708 -18939 -7550 11034 15228 16528 28183 47914 15125 2756 9502 35669 35794 12966
17366 12966 14717 27527 -1329 -15071 -25256 -30390 -21709 -13440 -13621 1493 21576 19130 4726
17353 4726 12473 36510 54621 32584 13264 -918 25815 33559 24715 8594 -52 -3543 -17822
17340 -17822 16435 29393 -4689 401 20976 18410 -22483 -34248 -12658 14338 17538 25353
17328 25353 18134 -2148 6164 -5214 3848 28553 48127 48163 34153 23852 20534 21048 -2887
17315 -2887 -14595 -7756 9082 -6336 -21397 -1086 16619 961 25619 9101 -24125 -41411
17303 -41411 -9961 -23656 -51392 -39986 -9388 4274 -20439 -56074 -55502 -29698 -25032 -11875
17291 -11875 -13005 -14282 -8533 -565 -370 -6426 -25073 -25359 14546 9497 -6960 -28827 -7160 -921
$$ packed form
17379c708j5231J1389J8584M194J300J1655J9731l2789j2369O746K6167J25k2828
17366A2966J751J2810k8856j3742j0185n134Q681Q269j81J5114K0083k446j4404
17353D726P747K4037J8111k2037j9320j4182K6733P744q844j6121q646l491j4279
17340a7822L4257J2958l4082N090K0575k566m0893j1765K1590K6996L200P815
17328B5353p219k0282Q312j1378R062K4705J9574L6j4010j0301l318N14k3935
17315b887j1708O839J6838j5418j5061K0311J7705j5658K4658j6518l3226j7286
17303d1411L1450j3695k7736J1406L0598J3662k4713l5635N72K5804M666J3157
17291a1875j130j277N749P968J95o056j8647k86L9905n049j6457k1867K1667O239
$$ plain form
17277 -921 -1321 10178 26215 8591 3750 31762 34095 38634 36346 13860 -16357 -23118 -6660
17264 -6660 -3641 17242 31574 27040 15318 -397 30012 34261 25014 5777 -14684 -28641 -27109
17251 -27109 4065 36766 52927 16616 7312 15785 18811 7062 6517 -16659 -48119 -37690 14611
17238 14611 -6601 -31792 -24239 -2797 24680 37378 34693 12062 -17115 6993 70579 95369
17226 95369 81231 47616 26695 7873 -1794 7838 4315 22414 36768 54825 50068 53534 58418
17213 58418 62264 54653 33633 17571 -9713 -2756 -11500 -4010 24386 -400 -8867 -3851 6437
17200 6437 34614 27894 -6948 -19954 -14118 3375 26144 44947 37179 6124 13979 29775 39901
17187 39901 16646 4230 20575 18271 12435 21099 18759 5155 -6576 -19713 -49932 -15429
$$ packed form
17277i21m00J1499J6037j7624m841K8012K333M539k288k2486l0217o761J6458
17264f660L019K0883J4332m534j1722j5715L0409M249r247j9237k0461j3957J532
17251b7109L1174L2701J6161l6311r304Q473L026j1749n45k3176l1460J0429N2301
17238A4611k1212k5191P553K1442K7477J2698k685k2631k9177K4108O3586K4790
17226I5369j4138l3615k0921j8822r667R632l523J8099J4354J8057m757L466M884
17213E8418L846p611k1020j6062k7284O957q744P490K8396k4786q467N016J0288
17200F437K8177o720l4842j3006N836J7493K2769J8803p768l1055P855J5796J0126
17187C9901k3255j2416J6345k304n836Q664k340j3604j1731j3137l0219L4503
$$ plain form
17175 -15429 23669 -781 -2113 2240 -4397 12914 32822 63719 46169 -4995 -16093 11208
17163 11208 25539 4479 19268 29404 22913 -20971 -20795 3888 21067 23769 -14348 -24204 -15126
17150 -15126 4441 -1274 -5507 3204 18834 16684 12842 23041 32946 18029 -5220 -9526 -9908
17137 -9908 18750 9942 -12753 -21373 -9916 -20677 -4162 -26604 -45808 -43893 -36212 -19743 -5804
17124 -5804 5953 1493 8635 -4269 -14765 1828 12825 22424 13892 3857 -7432 -21475 -8469
17111 -8469 -32288 -16556 7490 -850 6978 10461 5422 25438 40935 56257 30534 17586 11936
17098 11936 15175 15265 11868 -10093 -22284 -27515 -11186 12933 35120 3371 -20107 16131 18105
17085 18105 17539 17221 19882 29053 30047 33597 35994 35415 49069 46404 18478 8295 7364 -5071 -10661
$$ packed form
17175a5429L9098k4450j332M353o637J7311J9908L0897j7550n1164j1098K7301
17163A1208J4331k1060J4789J0136o491m3884J76K4683J7179K702l8117r856R078
17150a5126J9567n715m233Q711J5630k150l842J0199R905j4917k3249m306l82
17137i908K8658q808k2695q620J1457j0761J6515k2442j9204J915P681J6469J3939
17124e804J1757m460P142j2904j0496J6593J0997R599q532j0035j1289j4043J3006
17111h469k3819J5732K4046q340P828L483n039K0016J5497J5322k5723j2948n650
17098A1936L239R0l397k1961j2191n231J6329K4119K2187l1749k3478L6238J974
17085A8105n66l18K661R171R94L550K397n79J3654k665k7926j0183r31j2435n590
$$ plain form
17070 -10661 -11743 -27623 -39572 -40698 -19191 -7413 2475 28885 24330 677 -24612 -25728 2280
17057 2280 13795 14899 6788 12634 32244 49847 32501 -15895 -18827 8247 10594 10644 7710 -22229
17043 -22229 -9006 27670 42070 40063 -3378 -13806 -3618 5228 8224 12113 -874 -17521
17031 -17521 -11397 -30867 -45587 -34373 -18074 -10362 -16928 17039 18258 17594 -26524 -29157 -36239
17018 -36239 -33971 -22549 -9845 6705 30144 21437 -9055 -14298 -24207 -10079 6750 28349
17006 28349 20841 8858 -19215 -27005 -21636 -19912 -24031 -28613 -15919 -17202 -23306 34558 59477
16993 59477 65651 29000 9646 27995 53902 73491 46284 35044 15845 -7233 -28769 -54080
16981 -54080 -43570 -40053 -27732 -27232 -20647 -254 2332 -8995 -2573 -10870 -26950 -38326 -3669
$$ packed form
17070a0661j082j5880j1949j126K1507J1778R888K6410m555k3653k5289j116K8008
17057B280J1515J104q111N846J9610J7603j7346m8396k932K7074K347N0k934k9939
17043b2229J3223L6676J4400k007m3441j0428J0188Q846K996L889j2987j6647
17031a7521O124j9470j4720J1214J6299P712o566L3967J219o64m4118k633p082
17018c6239K268J1422J2704J6550K3439q707l0492n243r909J4128J6829K1599
17006B8349p508j1983k8073p790N369J724m119m582J2694j283o104N7864K4919
16993E9477O174l6651j9354J8349K5907J9589k7207j1240j9199k3078k1536k5311
16981e4080J0510L517J2321N00O585K0393K586j1327O422q297j6080j1376L4657
$$ plain form
16968 -3669 14248 12105 -2283 -26178 -25872 19427 3031 -15918 5468 23525 19871 14601 8017
16955 8017 -14837 -16855 6129 20076 8474 18526 19699 10232 -3090 -6165 -13999 -8003 -24774
16942 -24774 -46071 -39466 -41055 -39894 -31678 -37184 -45625 -33559 -14902 -19215 -16129 -2588 -6898
16929 -6898 -20554 -21108 -27233 -29704 -11318 38326 24577 441 23037 31905 17132 12280 19525
16916 19525 15167 16442 35568 21097 780 -18470 7550 17617 38393 25481 3059 18922
16904 18922 22999 -3543 -6537 11254 1367 -7284 -7238 -1165 -14194 -14104 -1068 31658 21667 6723
16890 6723 24080 29199 40761 35553 -829 2653 1772 -9633 -26964 -34587 -15114 17093 13500
16877 13500 12668 35581 58421 69126 56462 16527 -34478 -21742 3800 32327 13515 12558
$$ packed form
16968c669J7917k143j4388k3895L06M5299j6396j8949K1386J8057l654n270o584
16955H017k2854k018K2984J3947j1602J0052J173r467j3322l075p834N996j6771
16942b4774k1297O605j589J161Q216n506q441J2066J8657m313L086J3541m310
16929f898j3656n54o125k471J8386M9644j3749k4136K2596Q868j4773m852P245
16916A9525m358J275J9126j4471k0317j9250K6020J0067K0776j2912k2422J5863
16904A8922M077k6542k994J7791r887q651M6O073j3029R0J3036L2726r991j4944
16890F723J7357N119J1562n208l6382L482q81j1405j7331p623J9473L2207l593
16877A3500q32K2913K2840J0705j2664l9935n1005J2736K5542K8527j8812r57
$$ plain form
16865 12558 -5711 -8530 -4455 6393 891 -1099 -9290 4455 -1551 3410 23535 15775 -10507
16852 -10507 -21735 -20568 -7359 -24466 -40147 -47453 -30137 -28406 -31715 -52878 -51494 -43465 -37107
16839 -37107 -46765 -33994 -28373 -14502 1634 -1338 401 2963 14571 16984 13326 8413 17454
16826 17454 60363 69937 44857 19197 10686 10326 30550 10981 -704 -1851 -12948 -36676 -29560
16813 -29560 -34200 -35439 -14236 -885 -5532 -26090 -45077 -49231 -64769 -52172 -35957 -1699
16801 -1699 27371 31198 16114 15185 33930 27501 6912 -3142 -12760 4012 -3964 -30781 -40116
16788 -40116 -25309 4568 42300 46473 63992 33983 33135 33392 32128 12059 24138 17537 2285
16775 2285 -4506 -5504 399 -12135 -23579 -23401 -10667 -33965 -2485 4484 -15366 -21981 -13058 -14485
$$ packed form
16865A2558j8269k819M075J0848n502j990q191J3745o006M961K0125p760k6282
16852a0507j1228J167J3209j7107j5681p306J7316J731l309k1163J384Q029O358
16839c7107r658J2771N621J3871J6136k972J739K562J1608K413l658m913R041
16826A7454M2909R574k5080k5660q511l60K0224j9569j1685j147j1097k3728P116
16813b9560m640j239K1203J3351m647k0558j8987m154j5538J2597J6215L4258
16801a699K9070L827j5084r29J8745o429k0589j0054r618J6772p976k6817r335
16788d0116J4807K9877L7732M173J7519l0009q48K57j264k0069J2079o601j5252
16775B285o791r98N903j2534j1444J78J2734k3298L1480O969j9850o615Q923j427
$$ plain form
16761 -14485 9721 3788 -19100 -21666 -38019 -59260 -83093 -62934 -58789 -69514 -64151 -44753
16749 -44753 -32641 -21069 -39223 -38795 -31425 -10345 -2644 -1609 4380 31156 57322 36320 12113
16736 12113 13234 3822 -6335 -21494 -18644 -18078 -35751 -13544 -9836 -49723 -54392 -40138 -43098
16723 -43098 -31852 -47428 -1515 10417 -9537 -30122 -44477 -45482 -32032 -32849 -36595 -54202
16711 -54202 -45214 -38676 -56475 -52848 -37023 -31261 -37389 -26695 -7198 -6372 2729 -12654 21775
16698 21775 59574 40246 45626 55041 24018 17584 15430 8244 3066 15114 2295 13732 -4462
16685 -4462 -22596 -14347 17286 27120 1094 11986 44862 41636 21257 13561 10426 26108 20683
16672 20683 14466 4931 1221 -270 12722 26468 20810 17229 -3011 -13151 -3470 32269 35162
$$ packed form
16761a4485K4206n933k2888k566j6353k1241k3833K0159M145j0725N363J9398
16749d4753J2112J1572j8154M28P370K1080P701J035N989K6776K6166k1002k4207
16736A2113J121r412j0157j5159K850N66j7673K2207L708l9887m669J4254k960
16723d3098J1246j5576M5913J1932j9954k0585j4355j005J3450q17l746j7607
16711e4202Q988O538j7799L627J5825N762o128J0694J9497Q26R101j5383L4429
16698B1775L7799j9328N380R415l1023o434k154p186n178J2048j2819J1437j8194
16685d462j8134Q249L1633R834k6026J0892L2876l226k0379p696l135J5682n425
16672B0683o217r535l710j491J2992J3746n658l581k0240j0140R681L5739K893
$$ plain form
16659 35162 287 23812 28043 14796 20510 4207 -17858 -20376 -4181 16311 19483 11114 34404
16646 34404 57742 55592 42561 30219 33504 10718 -11754 -16803 15987 23119 20127 26412 19042
16633 19042 -403 7159 3973 -8948 -30748 -33599 -6592 -14035 -20957 -16375 -21687 -23558 -24470 -7492
16619 -7492 9838 2966 -11039 -29790 -18993 -1825 112 7025 -983 -21329 -16046 -4507 -22712
16606 -22712 -18951 -8692 -13125 -2451 6657 20089 2151 636 -15902 -34948 -29150 -10365 -18469
16593 -18469 -12364 25077 12629 -6337 6320 -14161 -38953 -36407 -31763 -21276 -24416 -26427 -31301
16580 -31301 -27341 -17516 -17815 -13283 -7591 12391 -21704 -27649 -14493 -4270 6220 193 3625
16567 3625 -5370 -48041 -61703 -24768 7545 3612 -4147 -22261 -11876 -404 12941 7771 -2034
$$ packed form
16659C5162l4875K3525M231j3247N714j6303k2065k518J6195K0492L172q369K3290
16646C4404K3338k150j3031j2342L285k2786k2472n049L2790P132k992O285p370
16633A9042j9445P562l186j2921k1800k851K7007p443o922M582n312j871r12J6978
16619g492J7330o872j4005j8751J0797J7168J937O913q008k0346N283J1539j8205
16606b2712L761J0259m433J0674R108J3432j7938j515j6538j9046N798J8785q104
16593a8469O105L7441j2448j8966J2657k0481k4792K546M644J0487l140k011m874
16580c1301L960R825k99M532N692J9982l4095n945J3156J0223J0490o027L432
16567C625q995m2671j3662L6935L2313l933p759j8114J0385J1472J3345n170r805
$$ plain form
16554 -2034 -11155 -11664 -2440 2573 -6145 -1341 -21519 -10668 -2488 -8938 -8636 -8648 -3591 15235 23570
16539 23570 9656 4754 4711 13548 18589 692 -4774 -9940 -43150 -54316 -48511 -19566 -3066
16526 -3066 2956 21330 26903 -3548 -2690 18218 42908 3396 -15913 35 20103 13351 8908
16513 8908 13249 15346 2193 -1583 -7489 7745 21517 -6053 -28673 -38839 -14530 -36556 -45885
16500 -45885 -45708 -47275 -35676 -20654 -37607 -53586 -58246 -34366 -29828 -26812 -22734 4462 15638
16487 15638 19244 32190 43624 31086 19377 -4026 -5118 -5691 -13162 -31164 -18038 -2939 357
16474 357 -4532 -28966 -47415 -21456 -5447 -7749 8695 35435 20025 10197 1353 1543 -12308
16461 -12308 -21824 -37233 -18833 6920 -10197 -3420 7051 -13634 24188 41000 38582 28065
$$ packed form
16554b034r121n09R224N013q718M804k0178J0851Q180o450L02j2N057J8826Q335
16539B3570j3914m902m3Q837N041j7897n466n166l3210j1166N805K8945J6500
16526c066O022J8374N573l0451Q58K0908K4690l9512j9309J5948K0068o752m443
16513H908M341K097j3153l776n906J5234J3772k7570k2620j0166K4309k2026r329
16500d5885J77j567J1599J5022j6953j5979m660K3880M538L016M078K7196J1176
16487A5638L606J2946J1434j2538j1709k3403j092n73p471j8002J3126J5099L296
16474C57m889k4434j8449K5959J6009k302J6444K6740j5410r828q844J90j3851
16461a2308r516j5409J8400K5753j7117O777J0471k0685L7822J6812k418j0517
$$ plain form
16449 28065 42907 36737 23107 14308 24217 11333 -9482 -24842 -25524 -28401 -29678 -39131 -43198
16436 -43198 -24839 -33509 -53014 -37940 -36194 -59163 -46905 -43006 -46826 -67427 -90834 -54290
16424 -54290 -31029 -44772 -38180 -8474 6337 11183 -214 38435 31481 -12916 -6415 7976
16412 7976 11470 1281 -2892 6663 -3088 -10960 6404 2753 7171 24528 7850 160 17144
16399 17144 25279 21580 20455 10708 18945 14408 32741 29267 4852 14582 29719 41914 23496
16386 23496 -13909 -32686 -22853 -17091 9399 21466 15609 23486 3380 -35936 -18698 11235
16374 11235 7657 -5320 -9041 2161 6084 -8052 12910 210 -20800 -68518 -101438 -64634
16362 -64634 -18447 8099 1773 -26966 -45266 -52437 -41941 -31272 -11676 9225 4274 4600 -20938
$$ packed form
16449B8065J4842o170j3630q799R909j2884k0815j5360o82k877j277r453m067
16436d3198J8359q670j9505J5074J746k2969J2258L899l820k0601k3407L6544
16424e4290K3261j3743O592K9706J4811M846j1397L8649o954m4397O501J4391
16412G976L494j0189m173R555r751p872J7364l651M418J7357j6678p690J6984
16399A7144Q135l699j125r747Q237m537J8333l474k4415R730J5137J2195j8418
16386B3496l7405j8777R833N762K6490J2067n857P877k0106l9316J7238K9933
16374A1235l578j2977l721J1202L923j4136K0962j2700k1010m7718l2920L6804
16362f4634M6187K6546o326k8739j8300p171J0496J0669J9596K0901m951L26k5538
$$ plain form
16349 -20938 -20884 3149 12864 45399 63660 45734 14198 352 -727 -4118 -7707 -40821 -50473
16336 -50473 -47892 -40373 -21198 -26625 -48252 -46098 5989 13771 8717 25036 22946 10849 21163
16323 21163 14893 24897 17872 6321 6976 6401 2836 20691 4289 -31346 -48617 -79354 -55525
16310 -55525 -24752 -10508 -2109 2045 12873 16182 11117 6965 4721 -4266 7335 17934 16137
16297 16137 1126 1976 5547 -19365 -26718 -30215 -57454 -40009 -7724 6917 -34977 -40399 -24242
16284 -24242 2540 17323 8899 -13502 6540 15013 2603 -23508 -14484 -8698 -34332 -19667
16272 -19667 -17140 -30130 -17397 15522 1709 -5921 -17178 -24321 -7818 -29741 -56632 -39610
16260 -39610 -18217 -24918 -15496 -4369 -9669 -1728 11121 -13937 3783 17459 8838 -19127 -25482
$$ packed form
16349b0938N4K4033R715L2535J8261j7926l1536j3846j079l391l589l3114r652
16336e0473K581P519J9175n427k1627K154N2087P782n054J6319k090j2097J0314
16323B1163o270J0004p025j1551O55n75l565J7855j6402l5635j7271l0737K3829
16310e5525L0773J4244Q399M154J0828L309n065m152k244q987J1601J0599j797
16297A6137j5011Q50L571k4912p353l497k7239J7445L2285J4641m1894n422J6157
16284b4242K6782J4783q424k2401K0042Q473j2410k6111R024N786k5634J4665
16272a9667K527j2990J2733L2919j3813p630j1257p143J6503k1923k6891J7022
16260c9610K1393o701R422J1127n300P941J2849k5058J7720J3676q621k7965o355
$$ plain form
16247 -25482 -35370 -52625 -39877 -16111 -8428 -24723 -35548 -22327 -31767 -23590 -29733 -34646 -14731
16234 -14731 -8599 -13410 -3677 -12858 -15075 16438 12019 -273 4857 10299 6488 11866 13720 2218
16220 2218 -22279 -42456 -29861 3368 16150 21218 -6640 -36907 -43672 -52847 -45173 -42345 -56074
16207 -56074 -45430 -7933 29650 39527 49761 27028 3013 -35296 -41872 -6752 -1983 -26009
16195 -26009 -29442 -38195 -28232 -22320 -29692 -19597 -1536 -26539 -65343 -46034 -37523 -19988 -2078
16182 -2078 1135 13516 46700 53269 25941 15194 2850 10422 13347 -31276 -46276 -31291 -20814
16169 -20814 -18781 -10512 -7768 -3869 -212 12684 -6519 -24696 -26308 -54152 -36568 -22662 -38303
16156 -38303 -34223 -20601 -8047 -18148 -34787 -23410 -25286 -21365 -10911 -4101 499 -22779 -47338
$$ packed form
16247b5482r888j7255J2748K3766P683j6295j0825J3221r440Q177o143m913J9915
16234a4731O132m811R733r181k217L1513m419j2292N130N442l811N378J854j1502
16220B218k4497k0177J2595L3229J2782N068k7858l0267o765r175P674K828j3729
16207e6074J0644L7497L7583R877J0234k2733k4015l8309o576L5120M769k4026
16195b6009l433q753R963N912p372J0095J8061k5003l8804J9309Q511J7535J7910
16182b078L213J2381L3184O569k7328j0747j2344P572K925m4623j5000J4985J0477
16169b0814K033Q269K744L899L657J2896j9203j8177j612k7844J7584J3906j5641
16156c8303M080J3622J2554j0101j6639J1377j876L921J0454O810M600k3278k4559
$$ plain form
16143 -47338 -30867 -22973 -8591 -5200 11194 15345 -14753 -29502 -24980 -3369 5116 3571 -281
16130 -281 -13938 -23808 -35439 -15160 -2712 -18715 -23119 -26227 -5489 12651 18823 30966 18714
16117 18714 591 -3879 11646 21753 -15913 -50829 -27261 8025 7399 6822 14597 19411 7148
16104 7148 8914 5833 19083 24362 4891 -11377 -20630 -6597 14956 27537 31711 3202 -3284
16091 -3284 -581 -157 16020 6555 6880 20274 19932 22560 14320 23769 42993 37507 22596 27032
16077 27032 36340 25587 14665 24848 17394 -114 1458 -27033 -38765 -34874 -32245 -24955 -9639
16064 -9639 -13844 -2400 7868 -10245 -37637 -29277 -35838 -25259 -23226 -22104 -15023 -53 -2471
16051 -2471 2876 -5921 -1558 -3293 -28858 -22698 1654 2919 -34441 -50645 -24455 -24636 -30622 -15370
$$ packed form
16143d7338J6471P894J4382L391J6394M151l0098j4749M522K1611Q485j545l852
16130b81j3657r870j1631K0279J2448j6003m404l108K0738J8140O172J2143j2252
16117A8714j8123m470J5525J0107l7666l4916K3568L5286o26n77P775M814j2263
16104G148J766l081J3250N279j9471j6268r253J4033K1553J2581M174k8509o486
16091c284K703M24J6177r465L25J3394l42K628q240R449J9224n486j4911M436
16077B7032R308j0753j0922J0183p454j7508J572k8491j1732L891K629P290J5316
16064i639m205J1444J0268j8113k7392Q360o561J0579K033J122P081J4970k418
16051b471N347q797M363j735k5565O160K4352J265l7360j6204K6190j81n986J5252
$$ plain form
16037 -15370 9763 28174 19387 -11836 -20338 -18003 -2288 -15324 2586 38234 45126 58337
16025 58337 46281 18446 8492 14851 3003 -17787 -37810 -17504 -21359 -27263 -25668 -40035 -41018
16012 -41018 7235 34445 28952 35232 53880 37113 22945 17212 8929 -5603 -3091 480 -17060
15999 -17060 -11308 2902 9684 50967 57930 39166 43063 43055 34941 12695 13299 30612 15167 4330
15985 4330 6172 28095 19295 29331 40057 35806 26836 33917 25228 8940 8789 141 -19312 -19404
15971 -19404 -19655 -592 34415 37317 20960 10423 -6055 -9769 -32423 -46150 -70694 -51966
15959 -51966 -37736 -35762 17806 26170 22213 39518 27064 2868 10456 17326 -1622 -7108 -14249
15946 -14249 -29379 -36153 -48876 -48784 -32414 -27525 -12167 -5799 9391 26680 40719 41525 20821
$$ packed form
16037a5370K5133J8411q787l1223q502K335J5715j3036J7910L5648O892J3211
16025E8337j2056k7835r954O359j1848k0790k0023K0306l855n904J595j4367r83
16012d1018M8253K7210n493O280J8648j6767j4168n733q283j4532K512L571j7540
15999a7060N752J4210O782M1283O963j8764L897qq114k2246O04J7313j5445j0837
15985D330J842K1923q800J0036J0726m251q970P081q689j6288j51q648j9453r2
15971a9404k51J9063L5007K902j6357j0537j6478l714k2654j3727k4544J8728
15959e1966J4230J974N3568Q364l957J7305j2454k4196P588O870j8948n486p141
15946a4249j5130o774j2723R2J6370M889J5358O368J5190J7289J4039Q06k0704
$$ plain form
15933 20821 21751 27897 36797 34457 25615 6757 -19324 -34543 -26297 -10726 -27905 -9495 -15770
15920 -15770 -26971 -4632 20065 31317 15094 -2968 28651 25553 17130 8487 2649 -2446 -6807
15907 -6807 1034 30438 20034 14612 -3922 -25990 -57670 -57200 -42697 -40356 -36036 -51202 -38248
15894 -38248 -32568 -33545 -9751 -2523 -8915 -9378 -18093 -12753 -31959 -52187 -64915 -39708 -11128
15881 -11128 -13648 279 6061 -3583 -7116 -517 6432 -9200 4029 17262 -14713 -28264 -21174
15868 -21174 9301 18926 16453 14760 13789 22358 30137 21714 872 -20793 -30680 -46059 -59887
15855 -59887 -18851 1113 -7753 -16291 -1664 5110 9346 -9570 4039 24493 22949 12325 -2530
15842 -2530 -7924 -28343 -49998 -52975 -62541 -91977 -81778 -42057 -6817 -10701 -13325 4536 1097
$$ packed form
15933B0821R30O146Q900k340q842j8858k6081j5219Q246J5571j7179J8410o275
15920a5770j1201K2339K4697J1252j6223j8062L1619l098q423q643n838n095m361
15907f807P841K9404j0404n422j8534k2068l1680M70J4503K341M320j5166J2954
15894c8248N680r77K3794P228o392m63q715N340j9206k0228j2728K5207K8580
15881a1128k520J3927N782r644l533O599O949j5632J3229J3233l1975j3551P090
15868b1174L0475R625k473j693r71Q569P779q423k0842k1665r887j5379j3828
15855e9887M1036J9964q866q538J4627O774M236j8916J3609K0454j544j0624j4855
15842b530n394k0419k1655k977r566k9436J0199L9721L5240l884k624J7861l439
$$ plain form
15829 1097 -610 -23264 -21186 -1191 8434 -9596 -28567 -40801 -46203 -31106 -42443 -30084 1207
15816 1207 2159 -19644 -35474 -40828 -47662 -42473 -44508 -45530 -28130 -9201 2864 13265 -9863
15803 -9863 2569 6387 -1175 237 -24857 -25912 -15912 -1000 -880 -495 5669 10295 -8661 -39296
15789 -39296 -35667 -10804 -12360 -11028 7292 28455 17272 -10120 -16892 -11579 -20305 -5901 -3968
15776 -3968 -20877 -27728 -20743 -22562 -28388 -39716 -44703 -55167 -51550 -37464 -12153 -19187 -5908
15763 -5908 29728 46962 38086 -2802 -12103 -15037 -7966 -5860 2808 -10432 -13845 -11381 -14492 -25560
15749 -25560 -46972 -53639 -33985 -32819 -41527 -37477 -23068 414 1989 -17830 -25258 -39129 -34986
15736 -34986 -39778 -39376 -31453 -24293 -20435 -12404 -8378 -14119 -29527 -53008 -41527 440 -2550 -39385
$$ packed form
15829A097j707k2654K078J9995R625j8030j8971j2234n402J5097j1337J2359L1291
15816A207R52k1803j5830n354o834N189k035j022J7400J8929J2065J0401k3128
15803i863J2432L818p562J412k5094j055J0000J4912J20L85O164M626j8956l0635
15789c9296L629K4863j556J332J8320K1163j1183k7392o772N313q726J4404J933
15776c968j6909o851O985j819n826j1328m987j0464L617J4086K5311p034J3279
15763e908L5636J7234q876m0888r301k934P071K106Q668j3240l413K464l111j1068
15749b5560k1412o667J9654J166q708M050J4409K3482J575j9819p428j3871M143
15736c4986m792M02P923P160L858Q031M026n741j5408k3481J1481M1967k990l6835
$$ plain form
15722 -39385 -36600 -11727 12380 12745 12934 17850 18800 34253 22665 11492 -27792 -44256 -39008
15709 -39008 -8146 12445 22585 17851 9438 28173 16388 -2320 -16891 -19608 5781 -6226
15697 -6226 -17742 -49765 -35911 -31451 2390 15245 12941 -5408 -1384 31426 25529 13722 12989
15684 12989 17816 23460 33384 20915 -6844 -12603 -19825 -10356 -20154 -20021 6649 12216 11208 10987
15670 10987 18009 9083 18806 10352 -14999 -30435 -23456 -37630 -24166 -22813 -4631 9916 13745
15657 13745 -6113 -25029 -4180 13211 32341 47295 39053 31654 33261 16361 -75 4764
15645 4764 -12493 -27126 -30216 -3315 16634 18882 28868 6206 -34152 -8666 391 -10593 -16934
15632 -16934 -33133 -15066 -2730 -6343 -21120 -23667 -39253 -37005 -15999 10976 17676 6774
$$ packed form
15722c9385K785K4873K4107L65J89M916R50J5453j1588j1173l9284j6464N248
15709c9008L0862K0591J0140m734q413J8735j1785j8708j4571k717K5389j2007
15697f226j1516l2023J3854M460L3841J2855k304j8349M024L2810n897j1807p33
15684A2989M827N644R924j2469k7759n759p222R469r798J33K6670N567j008k21
15670A0987P022q926R723q454k5351j5436O979j4174J3464J353J8182J4547L829
15657A3745j9858j8916K0849J7391J9130J4954q242p399J607j6900j6436M839
15645D764j7257j4633l090K6901J9949K248R986k2662m0358K5486R057j0984o341
15632a6934j6199J8067J2336l613j4777k547j5586K248K1006K6975O700j0902
$$ plain form
15620 6774 9320 12500 18425 10754 5996 7239 -13719 -40369 -23663 22893 25910 9567 3389
15607 3389 -27080 -30571 -40119 -39605 -23001 -11558 6834 28524 52960 51028 38605 43415 38016
15594 38016 22980 31968 -6411 -76091 -85999 -43186 -17910 -47237 -36027 -29912 -7406 9966
15582 9966 -20936 -42634 -37343 -34308 -21576 -133 -22709 -19095 20419 18582 6010 -8146 3952
15569 3952 12542 15745 15339 7380 8153 -4565 -43715 -47246 -40575 -37629 -19127 -13257 -7950 995
15555 995 3702 759 -4023 -15150 -30555 -256 9948 14225 -17608 -41211 -41789 -13043 13757
15542 13757 20461 32248 1424 6560 -11580 -27563 -1640 29689 7032 -29661 -66365 -49169
15530 -49169 -30462 -35726 -29076 -34126 -49320 -38796 -19249 -7450 2738 8122 -23209 -28480 -14421
$$ packed form
15620F774K546L180N925p671m758J243k0958k6650J6706M6556L017j6343o178
15607C389l0469l491r548N14J6604J1443J8392K1690K4436j932j2423M810n399
15594C8016j5036Q988l8379o9680r908M2813K5276k9327J1210O115K2506J7372
15582I966l0902k1698N291L035J2732K1443k2576L614L9514j837j2572j4156J2098
15569C952Q590L203m06p959P73j2718l9150l531O671K946J8502N870N307Q945
15555I95K707k943m782j1127j5405L0299J0204M277l1833k3603n78K8746K6800
15542A3757O704J1787l0824N136j8140j5983K5923L1329k2657l6693l6704J7196
15530d9169J8707n264O650n050j5194J0524J9547J1799J0188N384l1331n271J4059
$$ plain form
15517 -14421 -14554 -7970 2298 3765 -24210 -52231 -63733 -46519 -31012 -31465 -29580 -32919 -19082
15504 -19082 -25984 -40064 -32082 -16598 -1819 14319 1521 5006 -7635 -14114 -22322 -23655 -15527
15491 -15527 -19761 -22034 -7093 2924 9904 13083 -15273 -31786 -19905 -16978 -7913 3992 1688
15478 1688 -24841 -34353 -30344 -9829 880 23461 38649 13599 5132 -5940 -13116 -24940 -25779
15465 -25779 -5818 -5049 -1826 -5604 -10437 1723 -4750 -4893 -16343 -17252 3854 -5612 -9438 11010
15451 11010 21125 -26408 -52094 -74951 -58857 -14702 -3734 -29016 -47547 -35888 7392 16113
15439 16113 28122 20538 12122 15119 29931 52238 52118 55398 50601 23480 6177 -13377 -11085
15426 -11085 -15867 -23106 -37998 -20524 -5071 -27901 -58533 -62639 -20139 -14590 -7885 -27028 -23214
$$ packed form
15517a4421j33O584J0268J467k7975k8021j1502J7214J5507m53J885l339J3837
15504a9082o902j4080P982J5484J4779J6138j2798L485j2641o479q208j333Q128
15491a5527m234k273J4941J0017O980L179k8356j6513J1881K927R065J1905k304
15478A688k6529r512M009K0515J0709K2581J5188k5050q467j1072p176j1824q39
15465b5779J9961P69L223l778m833J2160o473j43j1450r09K1106r466l826K0448
15451A1010J0115m7533k5686k2857J6094M4155J0968k5282j8531J1659M3280Q721
15439A6113J2009p584q416K997J4812K2307j20L280m797k7121j7303j9554K292
15426a1085m782p239j4892J7474J5453k2830l0632m106M2500N549O705j9143L814
$$ plain form
15413 -23214 -29139 -4075 -4471 -9694 3661 21970 13040 15145 8008 2221 10184 -11381 -47640
15400 -47640 -45804 -35816 -25177 1332 1812 1353 -4459 -29903 -50358 -29953 -19265 -18157 -25726
15387 -25726 -23548 -17273 -10553 -16804 -53609 -37205 -16304 -10947 -36614 -32752 -12127 -20837 14740
15374 14740 4328 -19788 -17131 4209 22327 12182 -4659 -29288 -4409 17290 7442 3066
15362 3066 4211 16451 -1806 -19688 -20359 1573 34066 11712 1120 -24740 -31891 -46040 -41570
15349 -41570 -17567 2529 -10523 -10534 -14879 -3571 25421 11702 -5485 -5214 23102 26865 19743
15336 19743 -4331 -16907 954 1275 -1683 27103 24806 10300 7004 -8475 -35560 -19839 -5413
15323 -5413 -7202 -12047 1574 12314 21395 21996 36653 20720 -9464 -19327 -1623 16925 1619
$$ packed form
15413b3214n925K5064l96n223J3355J8309q930K105p137n787P963k1565l6259
15400d7640J836R988J0639K6509M80m59n812k5444k0455K0405J0688J108p569
15387b5726K178O275O720o251l6805J6404K0901N357k5667L862K0625q710L5577
15374A4740j0412k4116K657K1340J8118j0145j6841k4629K4879K1699r848m376
15362C066J145J2240j8257j7882o71K1932L2493k2354j0592k5860p151j4149M470
15349d1570K4003K0096j3052j1m345J1308K8992j3719j7187K71K8316L763p122
15336A9743k4074j2576J7861L21k958K8786k297j4506l296j5479k7085J5721J4426
15323e413j789m845J3621J0740R081O01J4657j5933l0184r863J7704J8548j5306
$$ plain form
15310 1619 -2572 -8379 27405 41292 10534 -8317 -37897 -47746 -44107 -26250 14859 28985 28177
15297 28177 11698 7513 -2317 -3306 2706 -24783 -41283 -37714 -23538 -11481 -22156 -63413 -58383
15284 -58383 -41227 -35335 -23792 553 20281 12768 3004 -33467 -43918 -34461 -35938 -39876 -34463
15271 -34463 561 8524 1028 2770 -5542 -11368 22919 41207 33908 35338 24111 21706 23888
15258 23888 -4189 -15358 -8444 11210 27583 39259 43027 21042 3142 -25890 -29349 -30424
15246 -30424 -44555 -48960 -46363 -35694 -24398 -11502 -5868 -213 2353 19859 5751 -7310 -19486
15233 -19486 -3329 -7515 -13700 -18460 -32415 -41382 -29141 -24773 13067 -4690 -8004 -4510 -8626
15220 -8626 -18302 -30098 -30745 -22982 -41844 -41182 -13581 -3025 19253 25022 15517 18228 1583 -10361
$$ packed form
15310A619m191n807L5784J3887l0758j8851k9580r849L639J7857M1109J4126q08
15297B8177j6479m185r830r89O012k7489j6500L569J4176J2057j0675m1257N030
15284e8383J7156N892J1543K4345J9728p513r764l6471j0451R457j477l938N413
15271c4463L5024P963p496J742q312n826L4287J8288p299J430j1227k405K182
15258B3888k8077j1169O914J9654J6373J1676L768k1985j7900k9032l459j075
15246c0424j4131m405K597J0669J1296J2896N634N655K566J7506j4108j3061j2176
15233a9486J6157m186o185m760j3955q967J2241M368L7840j7757l314L494m116
15220h626r676j1796o47P763j8862O62K7601J0556K2278N769r505K711j6645j1944
$$ plain form
15206 -10361 -12279 -9906 -1919 8709 12031 1879 560 -6582 6361 -10479 -31687 11392 9020
15193 9020 22449 16792 16369 44319 29264 12214 1752 8008 27468 23535 26286 8157 -2830
15180 -2830 10754 16065 -8789 -6780 -8551 -16897 -41146 -32563 -17022 -13842 -10725 -15389 -4816
15167 -4816 16261 24345 36223 17452 -790 6015 22496 5970 -15760 -32160 -29052 -20883 4040
15154 4040 -13382 -24911 -50008 -58756 -34115 6589 13080 -2522 -9259 20413 21764 6719 -2588
15141 -2588 -6518 -12695 7882 35384 18106 -5290 -11538 -27143 -43468 -50762 -62044 -67303 -44709
15128 -44709 -28474 -25570 -21151 -29629 -21303 -24284 -34297 -14019 -36840 -30126 -6370 16376 59345
15115 59345 75076 46089 12486 -5427 16852 1260 8353 20201 20856 16490 14732 -1993 -7585
$$ packed form
15206a0361j918K373P987J0628L322j0152j319p142J2943j6840k1208M3079k372
15193I020J3429n657m23K7950j5055j7050j0462O256J9460l933K751j8129j0987
15180b830J3584N311k4854K009j771q346k4249Q583J5541L180L117m664J0573
15167d816K1077Q084J1878j8771j8242O805J6481j6526k1730j6400L108Q169K4923
15154D040j7422j1529k5097q748K4641M0704O491j5602o737K9672J351j5045r307
15141b588l930o177K0577K7502j7278k3396o248j5605j6325p294j1282n259K2594
15128d4709J6235K904M419q478Q326k981j0013K0278k2821O714K3756K2746M2969
15115E9345J5731k8987l3603j7913K2279j5592P093J1848O55m366j758j6725n592
$$ plain form
15102 -7585 5613 5411 48903 83550 50485 23536 28563 35344 29777 16948 3397 -3569 -13085
15089 -13085 -22710 -39499 -8498 5600 13758 13 -20987 -38535 -32055 -15800 -4626 -16532
15077 -16532 -17526 -21418 -11628 -9019 -7681 -17800 -28485 -34739 -31569 -36981 -20446 8514 24633
15064 24633 11356 -3336 -22197 -7300 29429 19154 -14063 -526 22471 13515 -26150 -32038
15052 -32038 -42816 -28266 -7108 14019 30652 31286 23054 23882 -25842 -44307 -33851 -18787 -40995
15039 -40995 -57474 -70080 -55086 -37142 -439 14349 -14161 -36030 -16723 12118 4825 4811
15027 4811 12945 961 -26651 -29563 -8529 9067 -1005 1711 -19937 -31697 -28404 -32686 -16125
15014 -16125 -2959 -6280 -12281 -24163 -6516 -10510 -1737 12885 -2151 -30554 -41868 -10136
$$ packed form
15102g585J3198k02M3492L4647l3065k6949N027O781n567j2829j3551o966r516
15089a3085r625j6789L1001J4098Q158j3745k1000j7548O480J6255J1174j1906
15077a6532r94l892R790K609J338j0119j0685o254L170n412J6535K8960J6119
15064B4633j3277j4692j8861J4897L6729j0275l3217J3537K2997q956l9665n888
15052c2038j0778J4550K1158K1127J6633O34q232Q28m9724j8465J0456J5064k2208
15039d0995j6479j2606J4994J7944L6703J4788k8510k1869J9307K8841p293j4
15027D811Q134j1984k7612k912K1034J7596j0072K716k1648j1760L293m282J6561
15014a6125J3166l321o001j1882J7647l994Q773J4622j5036k8403j1314L1732
$$ plain form
15002 -10136 25523 39900 26985 25228 26059 31051 6033 -22803 -30248 -20384 -1338 25570 29436
14989 29436 32723 42828 47388 40450 42892 67736 67340 58938 65449 37883 -7568 -28093 -2352
14976 -2352 13700 13216 36426 18704 6489 -3078 -4691 -13005 -17665 -21799 -18586 -27542 1802 5161
14962 5161 2492 644 4267 20655 -3638 0 19876 31472 32097 9819 4555 -14589 -25492
14949 -25492 -21717 -41454 -53775 -37647 -35294 -15704 -21875 -32401 -4614 -3459 -22378 -11172
14937 -11172 -4438 5427 -10828 3342 6429 1166 -5189 -32258 -41222 -31517 -39054 -7608 18466
14924 18466 324 24229 63288 51008 21848 -1046 -19409 -43222 -58858 -32809 -23345 -22748
14912 -22748 -11087 -3145 11706 40889 32435 18950 -4447 -26740 -34498 -31800 -9297 -9169 -24916
$$ packed form
15002a0136L5659J4377j2915j757Q31M992k5018k8836p445R864J9046K6908L866
14989B9436L287J0105M560o938K442K4844l96q402O511k7566m5451k0525K5741
14976b352J6052m84K3210j7722j2215r567j613q314m660m134L213q956K9344L359
14962E161k669j848L623J6388k4293L638J9876J1596O25k2278n264j9144j0903
14949b5492L775j9737j2321J6128K353J9590o171j0526K7787J155j8919J1206
14937a1172O734R865j6255J4170L087n263o355k7069q964R705p537L1446K6074
14924A8466j8142K3905L9059j2280k9160k2894j8363k3813j5636K6049R464N97
14912b2748J1661P942J4851K9183q454j3485k3397k2293p758K698K2503J28j5747
$$ plain form
14899 -24916 -10397 5832 17189 32293 23724 284 -19102 -8547 3044 14748 14537 14893 20544
14886 20544 3338 -11361 -9274 -21267 -15042 -7459 -18048 -28241 -36557 -48087 -26254 -17496 -18093
14873 -18093 -42039 -56232 -45032 -36530 -14567 897 21791 37090 36640 29042 10925 -25054
14861 -25054 -54177 -57956 -25713 1814 27504 53063 31027 38313 46692 34375 20489 6575
14849 6575 -11656 -14534 -26731 -19090 -11500 -28187 -21177 -28938 -32286 -11285 -315 -8032 -14102
14836 -14102 -29442 -21124 -7227 -13677 24 5913 -14822 -34523 -50815 -46645 -7388 -1055 -13701
14823 -13701 -17787 -16906 -14988 -40838 -42642 -12178 -20904 -20455 -14566 -25166 -2571 6858 -17145 22162
14809 22162 24952 -2916 -17443 2923 16303 37519 45260 25746 18572 -757 -4244 -3663 -22861
$$ packed form
14899b4916J4519J6229J1357J5104q569k3440j9386J0555J1591J1704k11L56N651
14886B0544j7206j4699K087j1993O225P583j0589j0193q316j1530K1833Q758n97
14873a8093k3946j4193J1200Q502K1963J5464K0894J5299m50p598j8117l5979
14861b5054k9123l779L2243K7527K5690K5559k2036P286Q379j2317j3886j3914
14849F575j8231k878j2197P641P590j6687P010p761l348K1001J0970p717o070
14836a4102j5340Q318J3897o450J3701N889k0735j9701j6292M170L9257O333j2646
14823a3701m086Q81J918k5850j804L0464q726M49N889j0600K2595R429k4003L9307
14809B2162K790k7868j4527K0366J3380K1216P741j9514p174j9329l487N81j9198
$$ plain form
14796 -22861 -13979 -946 -4669 -16019 15137 42098 30673 19012 25037 17971 1689 -15632
14784 -15632 -14073 -34014 -27096 -10441 20266 40206 32101 11994 -12252 10264 -6137 12013
14772 12013 49966 53050 32580 935 -22706 -23430 -20295 -46908 -42074 -42088 -13358 23302 33980
14759 33980 27309 2693 -9547 -32673 -47921 -38839 -20039 134 -7136 -8290 -20660 -20757 -22846
14746 -22846 -7079 1465 -19112 -4753 10188 3606 -4 6873 28210 17501 -2869 -21730
14734 -21730 -35149 -32807 -1838 9111 2884 28973 6820 -14038 1332 16932 20875 -10021
14722 -10021 -25245 -34699 -33707 -26376 -5076 962 11639 25631 25814 4701 8817 6462 -11269
14709 -11269 -35971 -25294 4542 22335 22780 88 8381 37850 31549 2281 -5588 -916 -5087
$$ packed form
14796b2861Q882J3033l723j1350L1156K6961j1425j1661O025p066j6282j7321
14784a5632J559j9941O918J6655L0707J9940q105k0107k4246K2516j6401J8150
14772A2013L7953L084k0470l1645k3641p24L135k6613M834j4K8730L6660J0678
14759C3980o671k4616j2240k3126j5248R082J8800K0173p270j154j2370r7k089
14746b2846J5767Q544k0577J4359J4941o582l610O877K1337j0709k0370j8861
14734b1730j3419K342L0969J0949o227K6089k2153k0858J5370J5600L943l0896
14722a0021j5224r454R92P331K1300O038J0677J3992J83k1113M116k355j7731
14709a1269k4702J0677K9836J7793M45k2692Q293K9469o301k9268p869M672m171
$$ plain form
14696 -5087 -3006 -16300 -25831 -31709 -47750 -20914 -9973 -8185 -7624 7406 9987 5403 14336 4384
14682 4384 -4050 -4843 4318 -10566 26374 17831 -11890 19222 22640 8398 24030 34750 31418
14669 31418 25011 30911 26910 15841 -4334 -13413 11839 23232 -9103 -23246 12292 24362
14657 24362 -3944 19156 7430 -26727 -21047 -37377 -41004 -29585 -26865 -25748 -46664 -59083
14645 -59083 -18261 565 -7669 -23844 -18863 -24049 -49092 -50324 -28770 -24578 -8345 -4200 -1098
14632 -1098 266 -6927 18291 48220 38748 22202 -16955 -2142 -184 -27744 -45441 -35475 -9183
14619 -9183 22401 16572 -11130 -22371 -5610 -4800 -35821 -39699 -56407 -74292 -76802 -37672 -34396
14606 -34396 -55551 -49482 -53704 -48343 -31713 -26665 -9525 2859 13749 -10119 -18365 -2063 -25982
$$ packed form
14696e087K081j3294r531n878j6041K6836J0941J788N61J5030K581m584Q933r952
14682D384q434p93R161j4884L6940q543k9721L1112L418j4242J5632J0720l332
14669C1418o407N900m001j1069k0175r079K5252J1393l2335j4143L5538J2070
14657B4362k8306K3100j1726l4157N680j6330l627J1419K720J117k0916j2419
14645e9083M0822J8826q234j6175M981n186k5043j232K1554M192J6233M145L102
14632a098J364p193K5218K9929r472j6546l9157J4813J958k7560j7697R966K6292
14619i183L1584n829k7702j1241J6761Q10l1021l878j6708j7885k510L9130L276
14606c4396k1155O069m222N361J6630N048J7140J2384J0890k3868q246J6302k3919
$$ plain form
14593 -25982 -28164 -33456 -23099 -11529 -5412 -3003 -4507 -3078 -9934 -10387 -19300 -3836 -15761 -40389
14579 -40389 -40832 -35716 -24445 -29876 -33307 -25328 7274 16079 15995 21252 28754 67436 57566 8470
14565 8470 -9665 -6088 3387 7319 18072 8762 20815 35262 25888 32037 37774 40738 23354
14552 23354 -561 -41935 -73169 -71398 -33478 -34049 -48294 -64991 -39238 -13127 -17459 -22043 -26863
14539 -26863 -26992 -2244 6251 8630 8570 -9090 -15993 -43556 -51660 -14491 26716 35776 46592 19763
14525 19763 15488 6373 -28624 -18838 9468 18530 21174 27673 16556 -9874 -13855 -35225 -32471
14512 -32471 -19027 1722 -19375 -11685 -7475 -39545 -42520 -24536 -28524 -24352 17330 30260 37569
14499 37569 27319 30963 25132 -10518 -4296 -15298 5640 14280 30794 62699 82504 47522
$$ packed form
14593b5982k182n292J0357J1570O117K409j504J429o856m53q913J5464j1925k4628
14579d0389m43N116J1271n431l431P979L2602Q805q4N257P502L8682r870m9096
14565H470j8135L577R475L932J0753r310J2053J4447r374O149N737K964j7384
14552B3354k3915m1374l1234J771L7920n71j4245j6697K5753K6111m332m584m820
14539b6863j29K4748Q495K379o0j7660o903k7563q104L7169M1207R060J0816k6829
14525A9763m275r115l4997R786K8306R062K644O499j1117k6430l981k1370K754
14512c2471J3444K0749k1097P690M210l2070k975J7984l988M172M1682J2930P309
14499C7569j0250L644n831l5650O222j1002K0938Q640J6514L1905J9805l4982
$$ plain form
14487 47522 6925 15872 1201 -14798 -5950 5599 11040 11040 12524 17217 31312 25976 10430 -13818
14473 -13818 -26054 -33147 -24780 4492 -15337 -54290 -43287 -29561 -44650 -27916 -10797 -12592
14461 -12592 -21240 -6668 18755 11268 -1618 14296 6493 5173 10273 5380 37232 43115 49685
14448 49685 39208 14397 2863 -21852 -15274 -4148 -13048 -14586 -13695 -16174 -26084 -18296 -29126
14435 -29126 -31152 -61661 -92025 -71644 -36851 -18218 -42441 -25667 -7187 -11195 -736 -7954
14423 -7954 -23943 -12981 -5689 988 10156 -1594 -24360 -21871 8358 -3181 -17311 -25909 -28702
14410 -28702 -22289 -9121 19291 38200 35506 54169 57563 40734 29748 36685 25057 -10410
14398 -10410 -44300 -24435 18386 11506 -2863 -15319 -24701 -29540 -29147 -22644 -9377 -8767 -8642 2638
$$ packed form
14487D7522m0597Q947j4671j5999Q848J1549N441%J484M693J4095n336j5546k4248
14473a3818j2236p093Q367K9272j9829l8953J1003J3726j5089J6734J7119j795
14461a2592q648J4572K5423p487j2886J5914p803j320N100m893L1852N883O570
14448D9685j0477k4811j1534k4715O578J1126q900j538Q91k479r910P788j0830
14435b9126k026l0509l0364K0381L4793J8633k4223J6774J8480m008J0459p218
14423g954j5989J0962P292O677R168j1750k2766K489L0229j1539j4130q598k793
14410b8702O413J3168K8412J8909k694J8663L394j6829j0986O937j1628l5467
14398a0410l3890J9865M2821o880j4369j2456r382m839L93O503J3267O10J25J1280
$$ plain form
14384 2638 -6744 -25398 -17658 3188 -2872 13694 -11940 -41916 -32774 -9192 6502 6917 -474
14371 -474 -24996 -26495 -28205 -3916 -3158 -16530 -19696 -8101 17450 39259 25587 22231 31954
14358 31954 26775 15545 9631 -7108 -8889 28862 19486 -1733 -1863 9137 34556 55559 72485
14345 72485 89500 62406 29771 26123 4172 -9626 -24394 -19762 -6585 9197 21556 -3860
14333 -3860 -27200 -18667 1360 17981 39783 31332 13310 14406 16258 42665 33624 16602 20408
14320 20408 19580 44767 60515 31975 21114 19994 33359 35032 28147 25626 13301 16698 39438
14307 39438 40986 54138 35680 27028 21414 -2696 -13867 -24002 -30088 -25361 -41436 -51017 -37603
14294 -37603 -11701 8403 -4644 -6690 -11420 431 -12126 -25682 -49415 -47710 -55687 -51932 -33592
$$ packed form
14384B638r382j8654P740K0846o060J6566k5634k9976R142K3582J5694M15p391
14371d74k4522j499j710K4289P58j3372l166J1595K5551K1809j3672l356R723
14358C1954n179j1230n914j6739j781L7751r376k1219j30J1000K5419K1003J6926
14345G2485J7015k7094l2635l648k1951j3798j4768M632J3177J5782J2359k5416
14333c860k3340Q533K0027J6621K1802q451j8022J096J852K6407r041j7022L806
14320B0408q28K5187J5748k8540j0861j120J3365J673o885k521j2325L397K2740
14307C9438J548J3152j8458q652n614k4110j1171j0135o086M727j6075r581J3414
14294c7603K5902K0104j3047k046m730J1851j2557j3556k3733J705p977L755J8340
$$ plain form
14281 -33592 -18255 8243 27810 3643 22709 26106 -9549 -40033 -43015 -36072 -4864 23762
14269 23762 28039 5049 2455 -14194 -67 15341 17505 27505 13713 5448 -18447 -40322
14257 -40322 -36965 -26999 -16994 -10569 -20959 -20104 5163 4741 -15 18018 13915 15429 2257 -20980
14243 -20980 -3415 -8183 -22128 -19381 -18814 -18257 -19957 -51670 -29924 8809 3427 6371 24494
14230 24494 16389 53284 82517 81246 79100 41454 45004 45946 31909 11739 17203 12512 -8256
14217 -8256 -4800 2451 6954 31755 57922 46833 54367 38349 34537 50613 34024 10410 -18119
14204 -18119 7972 9510 -11964 -10051 2547 -12670 -36325 -30236 -28829 -3609 26214 53031
14192 53031 43421 12562 13863 17855 16367 20938 5178 10378 14404 5170 23755 57322 47275
$$ packed form
14281c3592J5337K6498J9567k4167J9066L397l5655l0484k982O943L1208K8626
14269B3762M277k2990k594j6649J4127J5408K164J0000j3792q265k3895k1875
14257d0322L357R966J0005O425j0390Q55K5267m22m756J8033m103J514j3172k3237
14243b0980J7565m768j3945K747N67N57j700l1713K1746L8733n382K944J8123
14230B4494q105L6895K9233j271k146l7646L550R42j4037k0170N464m691k0768
14217h256L456P251M503K4801K6167j1089P534j6018l812J6076j6589k3614k8529
14204a8119K6091J538k1474J913J2598j5217k3655O089J407K5220K9823K6817
14192E3031r610l0859J301L992j488M571j5760N200M026r234J8585L3567j0047
$$ plain form
14179 47275 25752 12199 11499 987 -5751 5996 16600 18037 20566 -10929 -15541 6978 -25657
14166 -25657 -54719 -50188 -42224 -37109 -33677 -11848 2493 899 -2760 -6940 3413 -4592 -11154
14153 -11154 11227 10026 1838 14618 17691 3702 4481 22074 21884 27083 63872 65944 25919
14140 25919 -741 11144 29845 27676 12730 21717 32764 33515 6385 6028 14745 -3926 -32421
14127 -32421 -11612 -9233 -21777 307 38796 41180 16391 8469 -18960 -17843 -28454 -8651
14115 -8651 19432 12267 23061 25203 12321 -5369 -194 12767 21169 12373 34511 65332 31239
14102 31239 20587 33073 15849 8558 36540 34191 19223 50269 40927 8570 30546 11645
14090 11645 -9836 -2953 6358 13708 12901 9712 1534 20079 52951 55896 41213 27281 35282
$$ packed form
14179D7275k1523j3553p00j0512o738J1747J0604J437K529l1495m612K2519l2635
14166b5657k9062M531P964N115L432K1829J4341j594l659m180J0353q005o562
14153a1154K2381j201q188J2780L073j3989P79J7593j90N199L6789K072m0025
14140B5919k6660J1885J8701k169j4946Q987J1047P51k7130l57Q717j8671k8495
14127c2421K0809K379j2544K2084L8489K384k4789p922k7429J117j0611J9803
14115h651K8083p165J0794K142j2882j7690N175J2961Q402q796K2138L0821l4093
14102C1239j0652J2486j7224p291K7982k349j4968L1046r342l2357K1976j8901
14090A1645k1481O883R311P350q07l189q178J8545L2872K945j4683j3932Q001
$$ plain form
14077 35282 39971 33581 14604 16605 -5396 -30333 -55118 -52785 -11310 16168 14317 9182 16989
14064 16989 17957 9165 36216 68612 68679 52965 35936 45341 71556 78498 53729 41243 51248
14051 51248 47090 166 -14956 -25529 -37706 -8904 -10664 1345 10163 -7366 -9332 -20638
14039 -20638 -19316 -15798 -26887 -45007 -21319 -3816 632 16998 30181 -5113 -9782 10238
14027 10238 20262 19647 -20331 -31590 -26580 5654 367 787 13374 30126 45344 41315 10099
14014 10099 -24393 -22204 17703 35814 56740 73680 54278 18176 1614 -14501 -10117 -2631
14002 -2631 23836 42701 37782 25829 52035 76238 86586 61753 34411 58171 84902 94898
13990 94898 98983 86261 105403 127608 170261 201371 218401 238808 256695 272959 319143 353174
$$ packed form
14077C5282M689o390j8977K001k2001k4937k4785K333M1475K7478j851n135P807
14064A6989R68q792K7051L2396O7j5714j7029R405K6215O942k4769j2486J0005
14051E1248m158m6924j5122j0573j2177K8802j760J2009Q818j7529j966j1306
14039b0638J322L518j1089j8120K3688J7503M448J6366J3183l5294m669K0020
14027A0238J0024o15l9978j1259N010L2234n287M20J2587J6752J5218m029l1216
14014A0099l4492K189L9907J8111K0926J6940j9402l6102j6562j6115M384P486
14002b631K6467J8865m919j1953K6206K4203J0348k4833k7342K3760K6731R996
13990I4898M085j2722J9142K2205M2653L1110J7030K0407J7887J6264M6184L4031
$$ plain form
13978 353174 385686 430814 481526 549995 615890 671404 751367 838295 991195 1194665 1487018
13967 1487018 1919190 2490730 3183930 3872659 4347872 4459676 4174293 3590458 2899398
13958 2899398 2238845 1668153 1249803 953356 760836 628430 559193 463030 395907 371129
13948 371129 336564 279551 226907 200376 186607 150024 153288 158385 143772 109064 60835 60282
13936 60282 81677 73176 89223 88025 96616 97319 82620 27711 -2744 -5703 -2020 12204 47745
13923 47745 55876 59349 53871 87260 93876 88857 64614 49707 25834 4944 332 15545 26799
13910 26799 37684 50116 42801 23807 29760 61218 60975 33936 18947 23482 43290 25127 -1906
13897 -1906 -8239 4880 -7162 -22578 -23154 -619 9050 16562 19444 21189 14607 19178 -5610 -28243
$$ packed form
13978C53174L2512M5128N0712O8469O5895N5514P9963Q6928J52900K03470K92353
13967A487018M32172N71540O93200O88729M75213J11804k85383n83835o91060
13958B899398o60553n70692m18350k96447j92520j32406o9237r6163o7123k4778
13948C71129l4565n7013n2644k6531j3769l6583L264N097j4613l4708m8229n53
13936F0282K1395q501J6047j198Q591P03j4699n4909l0455k959L683J4224L5541
13923D7745Q131L473n478L3389O616n019k4243j4907k3873k0890m612J5213J1254
13910B6799J0885J2432p315j8994N953L1458k43k7039j4989M535J9808j8163k7033
13897a906o333J3119j2042j5416n76K2535R669P512K882J745o582M571k4788k2633
$$ plain form
13883 -28243 -30981 -13972 13647 10389 23543 17652 -4078 18807 59322 49582 11695 39775
13871 39775 57287 48796 15434 -5135 4440 1683 9765 -8637 -137 24094 34274 48658 30614
13858 30614 19666 7038 28516 53520 60678 21969 4653 1287 11412 3347 -14651 -33032
13846 -33032 -29493 12467 31236 43315 53106 41109 50991 48192 47790 38247 49668 20832 12741
13833 12741 27889 40600 33086 15624 16844 31013 29369 30887 14650 2346 -4668 10813 13443
13820 13443 12438 21742 13231 9475 14437 723 -10374 -4539 -12446 12171 60821 49078 33813
13807 33813 30566 31151 7092 735 -4306 -26783 -17458 3477 18350 -8578 -35215 -27329 -26864
13794 -26864 -25858 -9360 -15729 -6011 24363 21704 -21778 -27708 -38268 -31092 -6533 -24390 -8722
$$ packed form
13883b8243k738J7009K7619l258J3154n891k1730K2885M0515r740l7887K8080
13871C9775J7512q491l3362k0569R575k757Q082j8402Q500K4231J0180J4384j8044
13858C0614j0948j2628K1478K5004P158l8709j7316l366J0125q065j7998j8381
13846c3032L539M1960J8769J2079R791j1997R882k799m02r543J1421k8836q091
13833A2741J5148J2711p514j7462J220J4169j644J518j6237j2304p014J5481K630
13820A3443j005R304q511l756M962j3714j1097N835p907K4617M8650j1743j5265
13807C3813l247N85k4059o357n041k2477R325K0935J4873k6928k6637P886M65
13794b6864J006J6498o369R718L0374k659m3482n930j0560P176K4559j7857J5668
$$ plain form
13781 -8722 7926 16186 26512 34623 25850 14071 22287 25036 45917 78854 94053 65874 58664
13768 58664 55680 47654 12791 -10291 11721 50942 53044 39625 7973 -37875 -34041 -9084
13756 -9084 953 335 -21912 -16819 -8462 -21869 -6024 21684 10418 3635 -550 -9637 -1335
13743 -1335 8699 11158 26286 52345 71532 68971 69223 50492 48116 57997 41740 34950 34005 24505
13729 24505 21123 37947 37167 52892 29772 34813 57107 72859 55585 41130 31766 36826 15784
13716 15784 8396 48452 50563 33037 39941 55717 76789 54727 58882 62515 50744 30264 51652
13703 51652 61599 23340 -1189 2405 -4727 1203 8221 14399 25574 37612 50044 67531 90376
13690 90376 85524 35112 6968 -5593 -20113 -40257 -11354 22712 25205 29195 33570 26823 50116
$$ packed form
13781h722J6648Q260J0326Q111q773j1779Q216K749K0881L2937J5199k8179p210
13768E8664k984q026l4863k3082K2012L9221K102j3419l1652m5848L834K4957
13756i084J0037o18k2247N093Q357j3407J5845K7708j1266o783m185r087Q302
13743a335J0034K459J5128K6059J9187k561K52j8731k376R881j6257o790r45r500
13729B4505l382J6824p80J5725k3120N041K2294J5752j7274j4455r364N060k1042
13716A5784p388M0056K111j7526O904J5776K1072k2062M155L633j1771k0480K1388
13703E1652R947l8259k4529L594p132N930P018O178J1175J2038J2432J7487K2845
13690I0376m852n0412k8144j2561j4520k0144K8903L4066K493L990M375o747K3293
$$ plain form
13677 50116 44737 35798 42592 26611 23605 21544 26048 13894 7913 27760 57304 57847 38862
13664 38862 41762 44675 28822 27464 33909 33824 51147 35340 12711 11677 34949 54700 12441
13651 12441 -12542 4687 2140 -11816 2931 19533 37810 69694 61575 60039 59568 48325 43012
13638 43012 18061 8424 22661 24849 22507 22876 6214 -11897 -61227 -98690 -79797 -32364 -10565
13625 -10565 28096 57509 51515 46414 52922 25115 25303 10335 -22267 -19852 12513 33433 10698
13612 10698 -1829 -17536 -38655 -44580 -27223 -30011 -23858 17 8500 15898 21139 5882 -2224
13599 -2224 -21127 -15520 11066 27252 21830 35291 67183 66945 39170 34897 14109 14429 39760
13586 39760 49624 25247 19422 12631 15646 21112 25187 21652 -10689 -32697 -18376 -24215 -30275
$$ packed form
13677E0116n379q939O794j5981l006k061M504j2154n981J9847K9544N43j8985
13664C8862K900K913j5853j358O445q5J7323j5807k2629j034K3272J9751m2259
13651A2441k4983J7229k547j3956J4747J6602J8277L1884q119j536m71j1243n313
13638D3012k4951r637J4237K188k342L69j6662j8111m9330l7463J8893M7433K1799
13625a0565L8661K9413n994n101O508k7807J88j4968l2602K415L2365K0920k2735
13612A0698j2527j5707k1119n925J7357k788O153K3875Q483P398N241j5257q106
13599b224j8903N607K6586J6186n422J3461L1892k38k7775m273k0788L20K5331
13586C9760R864k4377n825o791L015N466M075l535l2341k2008J4321n839o060
$$ plain form
13573 -30275 -20761 -986 5018 -5141 2412 35892 19056 16163 36401 50770 36424 45275 26931
13560 26931 -3051 -2862 7732 3134 3855 22152 29180 48284 58639 42116 33118 -7228 -10571
13547 -10571 5624 9788 19465 -5363 -13946 -20717 -1755 -16631 -17281 -20649 802 17841 4939
13534 4939 -23868 -51086 -13254 19702 2847 -24376 -22042 -27987 -43286 -23975 -14210 -7529 -734
13521 -734 1251 5658 17205 29690 50660 64534 59285 62360 84173 89610 75685 56331 42884
13508 42884 47141 37560 17464 7462 20918 20251 25489 63929 70920 50971 32888 38095 54702
13495 54702 57912 41147 53472 62235 32020 10729 15741 24388 36911 18806 -3097 11340
13483 11340 36665 55852 66388 63678 30170 25641 36427 50673 58162 36458 42209 48433 50614
$$ packed form
13573c0275R514J9775O004j0159P553L3480j6836k893K0238J4369j4346Q851j8344
13560B6931k9982J89J0594m598P21J8297P028J9104J0355j6523q998m0346l343
13547a0571J6195M164R677k4828q583o771J8962j4876o50l368K1451J7039j2902
13534D939k8807k7218L7832L2956j6855k7223K334n945j5299J9311R765O681O795
13521g34J985M407J1547J2485K0970J3874n249L075K1813N437j3925j9354j3447
13508D2884M257r581k0096j0002J3456o67N238L8440O991j9949j8083N207J6607
13495E4702L210j6765J2325Q763l0215k1291N012Q647J2523j8105k1903J4437
13483A1340K5325J9187J0536k710l3508m529J0786J4246P489k1704N751O224K181
$$ plain form
13470 50614 53629 46329 43437 39354 55422 48938 57043 37983 28134 11722 4706 18096 8528
13457 8528 -2184 31093 39364 8669 83 4768 -4885 12151 31475 22071 26285 14878 -1927
13444 -1927 5969 14427 11950 10066 20412 26591 27031 -4547 5852 51293 66953 63407 51988
13431 51988 37443 -9555 -20287 -20502 -6457 13441 23913 3749 -5591 5565 -4774 -6990
13419 -6990 -1715 -21867 -14778 8418 8872 11951 23081 31757 14583 -21699 -33474 -35723 -28359
13406 -28359 -19212 2169 30797 11160 13895 24322 25759 -7035 -15025 6515 13259 1491 16970
13393 16970 42922 38320 20467 10582 19801 26166 36617 45725 66403 65889 61590 48837 50872
13380 50872 29312 5286 10293 11770 29452 30574 61440 84635 101592 120447 144051 141282
$$ packed form
13470E0614L015p300k892m083J6068o484Q105j9060r849j6412p016J3390r568
13457H528j0712L3277Q271l0695q586M685r653J7036J9324r404M214j1407j6805
13444a927P896Q458k477j884J0346O179M40l1578J0399M5441J5660l546j1419
13431E1988j4545m6998j0732k15J4045J9898J0472k0164r340J1156j0339k216
13419f990N275k0152P089K3196M54L079J1130Q676j7174l6282j1775k249P364
13406b8359R147K1381K8628j9637K735J0427J437l2794p990K1540O744j1768J5479
13393A6970K5952m602j7853r885R219O365J0451R108K0678n14m299j2753K035
13380E0872k1560k4026N007J477J7682J122L0866K3195J6957J8855K3604k769
$$ plain form
13368 141282 151681 137912 120855 106887 105810 98529 107358 111353 103983 112176 109391 86795 79616
13355 79616 94551 86143 62164 75237 80731 86423 84356 84876 76602 55558 17753 49084 56730
13342 56730 49329 39445 30115 11691 -12282 -10819 -11075 -16819 11829 11279 -3562 55292 108912
13329 108912 103399 75574 42306 18098 47840 46836 35857 24515 17016 15007 13840 20817 48429
13316 48429 76069 67673 35159 22414 24196 13035 27613 30889 14128 -3262 19467 19612 61087
13303 61087 79340 42688 43878 53818 53346 31717 33373 20450 26873 55158 70323 71149 61431
13290 61431 38027 88244 127265 134672 153710 166916 172998 161721 106178 96863 102944 115146
13278 115146 125590 91433 61010 63170 82072 99809 134876 154790 160388 162181 144177 133885
$$ packed form
13368A41282J0399j3769j7057j3968j077p281Q829L995p370Q193k785k2596p179
13355G9616J4935q408k3979J3073N494N692k067N20q274k1044l7805L1331P646
13342E6730p401r884r330j8424k3973J463k56n744K8648n50j4841N8854N3620
13329A08912n513k7825l3268k4208K9742j004j0979j1342p499k009j167O977K7612
13316D8429K7640q396l2514j2745J782j1161J4578L276j6761j7390K2729J45M1475
13303F1087J8253l6652J190R940m72k1629J656j2923O423K8285J5165Q26r718
13290F1431k3404N0217L9021P407J9038J3206O082j1277n5543r315O081J2202
13278A15146J0444l4157l0423K160J8902J7737L5067J9914N598J793j8004j0292
$$ plain form
13266 133885 130441 148651 140959 130657 107437 83676 65359 59678 61046 57975 28571 24503 14541
13253 14541 5891 11844 28072 64700 72100 60709 42306 48790 59957 18321 -12065 -535
13241 -535 7651 -5708 2722 27943 14678 29368 59439 67196 61464 69368 64201 31506 16541
13228 16541 44346 31646 31276 29781 56120 91494 91989 81660 61786 47962 48795 27631 3941
13215 3941 6360 22277 32367 37734 2420 -21704 -7438 7652 5831 14929 41398 43389 19695
13202 19695 13960 29023 38154 22399 10408 -12661 -9606 20649 26643 50372 75313 100287
13190 100287 90445 71050 79886 108716 97873 86777 88838 85017 63483 50202 45815 18393
13178 18393 16533 7069 11414 56650 59221 73819 80893 64681 94206 113133 92479 79858 58010
$$ packed form
13266A33885l444J8210p692j0302k3220k3761j8317n681J368l071k9404m068r962
13253A4541q650N953J6228L6628P400j1391j8403O484J1167m1636l0386J1530
13241e35Q186j3359Q430K5221j3265J4690L0071P757n732P904n167l2695j4965
13228A6541K7805j2700l70j495K6339L5374M95j0329j9874j3824Q33k1164k3690
13215C941K419J5917J0090N367l5314k4124J4266J5090j821R098K6469J991k3694
13202A9695n735J5063R131j5755j1991k3069L055L0255N994K3729K4941K4974
13190A00287r842j9395Q836K8830j0843j1096K061l821k1534j3281m387k7422
13178A8393j860r464M345M5236K571J4598P074j6212K9525J8927k0654j2621k1848
$$ plain form
13165 58010 39549 43994 39359 37827 32995 40260 42169 23888 40020 69749 77528 72336 34415
13152 34415 29053 47346 60203 51494 33090 948 -10934 29686 75447 93896 60828 48184
13140 48184 62478 58073 82343 101852 87335 77128 58907 67962 61698 46887 40327 42986 57633
13127 57633 39772 52465 57396 60259 61849 30975 15480 18705 30515 28571 40728 33448 12382
13114 12382 3938 42836 66201 65439 42105 39030 34969 54109 64000 70882 59205 36677 44496
13101 44496 87962 129762 151031 147563 131698 125929 102564 80131 47234 50300 39993 25753
13089 25753 7900 13777 38205 36514 24885 31774 44073 47502 55646 50847 58009 72868 77324
13076 77324 75840 75126 65932 33659 17248 33217 54331 45788 34303 13354 34910 56368 34557
$$ packed form
13165E8010j8461M445m635j532m832P265J909j8281J6132K9729P779n192l7921
13152C4415n362J8293J2857q709j8404l2142j1882M0620M5761J8449l3068j2644
13140D8184J4294m405K4270J9509j4517j0207j8221R055o264j4811o560K659J4647
13127E7633j7861J2693M931K863J590l0874j5495L225J1810j944J2157p280k1066
13114A2382q444L8898K3365p62k3334l075m061J9140R891O882j1677k2528P819
13101D4496M3466M1800K1269l468j5865n769k3365k2433l2897L066j0307j4240
13089B5753j7853N877K4428j691j1629O889J2299L429Q144m799P162J4859M456
13076G7324j484p14r194l2273j6411J5969K1114q543j1485k0949K1556K1458k1811
$$ plain form
13063 34557 30660 39576 28432 15425 43245 53600 56390 16329 23294 51477 70815 53917
13051 53917 51955 38804 36989 41448 34364 28271 57537 90194 90963 55578 34652 48400 17821
13038 17821 3493 -12727 6549 14545 11063 28910 65567 89232 74298 34222 14869 23971
13026 23971 23727 6878 17090 44542 40973 20431 -6410 -8465 22683 26319 15825 40192 48918
13013 48918 51071 51031 44874 47260 30770 31781 46877 54399 67677 45180 36344 47470 58997
13000 58997 75671 59309 37477 49424 51793 67812 80869 78709 69281 52109 62580 82521
12988 82521 71426 67794 56428 39549 43076 33685 41947 34552 50777 56047 61253 57865 32739
12975 32739 32146 36932 50698 53842 31287 10357 18798 12091 -5344 15080 28725 24465 52210
$$ packed form
13063C4557l897Q916j1144j3007K7820J0355K790m0061O965K8183J9338j6898
13051E3917j962j3151j815M459p084o093K9266L2657P69l5385k0926J3748l0579
13038A7821j4328j6220J9276P996l482J7847L6657K3665j4934m0076j9353R102
13026B3971k44j6849J0212K7452l569k0542k6841k055L1148L636j0494K4367Q726
13013D8918K153m0o157K386j6490J011J5096P522J3278k2497q836J1126J1527
13000E8997J6674j6362k1832J1947K369J6019J3057k160r428j7172J0471J9941
12988H2521j1095l632j1366j6879L527r391Q262p395J6225N270N206l388k5126
12975C2739n93M786J3766L144k2555k0930Q441o707j7435K0424J3645m260K7745
$$ plain form
12962 52210 81870 99172 103107 117689 125769 95305 73170 82397 74292 72260 48031 54985 64688
12949 64688 84471 87013 89026 96702 109627 113731 113145 124259 118329 93516 91490 107252 102360
12936 102360 124268 108088 113732 110680 118698 144876 124615 138944 165391 196628 208662 235011
12924 235011 280708 337866 427062 560488 688825 868133 996831 1039999 1031104 963333 866977
12913 866977 721996 589798 498297 431906 329587 278403 255699 225597 201024 195379 182035
12902 182035 154762 123707 113612 86656 107068 101901 86512 81712 75419 68655 63735 60014 62853
12889 62853 59130 69546 85151 68246 43593 29435 39198 68180 66668 69107 83516 96354
12877 96354 97639 96427 92110 89113 99743 87526 68535 39617 39571 55400 50967 18660 -8593
$$ packed form
12962E2210K9660J7302L935J4582Q080l0464k2135R227q105k032k4229O954R703
12949F4688J9783K542K013P676J2925M104n86J1114n930k4813k026J5762m892
12936A02360K1908j6180N644l052Q018K6178k0261J4329K6447L1237J2034K6349
12924B35011M5697N7158Q9196J33426J28337J79308J28698M3168q895o7771r6356
12913H66977j44981j32198r1501o6391j02319n1184k2704l0102k4573n645j3344
12902A82035k7273l1055j0095k6956K0412n167j5389m800o293o764m920l721K839
12889F2853l723J0416J5605j6905k4653j4158R763K8982j512K439J4409J2838
12877I6354J285j212m317k997J0630j2217j8991k8918m6J5829m433l2307k7253
$$ plain form
12864 -8593 3779 33186 24838 7452 4282 15677 7850 22992 56049 52102 57909 60056 70257
12851 70257 59690 22909 15166 12291 26772 58209 85211 73519 67016 69610 87278 56783
12839 56783 18371 38102 45791 32532 15946 21316 62820 85740 67938 67167 58148 35459 -688
12826 -688 -6756 22278 20634 8791 10689 20088 37745 9711 -4168 8111 34412 25903 12534
12813 12534 -4043 4350 11218 11199 5269 11981 10852 11171 14878 23031 36703 56011 49321 63544
12799 63544 80832 88750 84098 79229 71364 75875 91196 107175 116011 111401 98948 73469 64994
12786 64994 106568 107236 85956 70464 67454 81759 75055 83178 99979 162910 218332 227949 207665
12773 207665 207284 184488 143411 120731 96718 87941 98588 101566 127301 129737 124110 131865 123150
$$ packed form
12864h593J2372K9407q348j7386l170J1395p827J5142L3057l947N807K147J0201
12851G0257j0567l6781p743k875J4481L1437K7002j1692o503K594J7668l0495
12839E6783l8412J9731P689j3259j6586N370M1504K2920j7802p71r019k2689l6147
12826f88o068K9034j644j1843J898R399J7657k8034j3879J2279K6301q509j3369
12813A2534j6577Q393O868j9n930O712j129L19L707Q153J3672J9308o690J4223
12799F3544J7288P918m652m869p865M511J5321J5979Q836m610j2453k5479q475
12786F4994M1574O68k1280j5492l010J4305o704Q123J6801O2931N5422R617k0284
12773B07665l81k2796m1077k2680k4013q777J0647K978K5735K436n627P755q715
$$ plain form
12760 123150 106961 126404 171855 182431 193643 199127 178395 174924 193633 216533 209242 184329
12748 184329 194503 199786 180503 147903 112320 71793 91526 112922 113034 92728 65668 80898
12736 80898 93173 100229 93703 64061 75762 90155 93484 88159 81071 60267 37211 44800 53309
12723 53309 68132 89030 88700 101028 91463 62771 26383 21712 34401 22394 11062 38699
12711 38699 63008 47556 34188 42480 62385 67393 41485 37770 41850 39624 27120 28140 26442
12698 26442 15171 -4021 -1326 2006 3270 1323 17569 32461 45079 115425 187627 254971
12686 254971 342701 418732 433551 418320 392502 388431 414370 385555 348364 330645 305885 299227
12674 299227 327524 325552 317657 297703 296431 279108 267266 273264 278768 277234 286507 270307 239631
$$ packed form
12760A23150j6189J9443M5451J0576J1212N484k0732l471J8709K2900p291k4913
12748A84329J0174N283j9283l2600l5583m0527J9733K1396J12k0306k7060J5230
12736H0898J2275P056o526k9642J1701J4393L329n325p088k0804k3056P589Q509
12723E3309J4823K0898l30J2328r565k8692l6388m671J2689j2007j1332K7637
12711C8699K4309j5452j3368Q292J9905N008k5908l715M080k226j2504J020j698
12698B6442j1271j9192K695L332J264j947J6246J4892J2618P0346P2202O7344
12686B54971Q7730P6031J4819j5231k5818m071K5939k8815l7191j7719k4760o658
12674B99227K8297j972p895j9954j272j7323j1842N998N504j534R273j6200l0676
$$ plain form
12661 239631 216700 204048 177258 131403 110077 78617 54955 65841 57654 85692 117650 170127
12649 170127 208289 244234 267426 274159 288128 274587 278150 295887 287158 287719 277539 265882
12637 265882 277270 288626 307662 311038 300078 295059 324280 352615 359717 340176 327532 316170
12625 316170 322154 327364 338117 343533 327299 338361 358275 370932 386374 447769 485090 505711
12613 505711 509913 500600 456357 425804 440808 450127 414939 405131 445948 464747 432244 413248
12601 413248 437927 459413 426851 420294 456414 480811 486214 479410 461053 468188 480437 493367
12589 493367 511933 549323 596572 607705 607117 610593 609748 598094 608464 604680 614158 647303 652415
12576 652415 661415 680677 694410 707574 717785 751490 790369 794666 810043 827459 831927 841938
$$ packed form
12661B39631k2931j2652k6790m5855k1326l1460k3662J0886q187K8038L1958N2477
12649A70127L8162L5945K3192O733J3969j3541L563J7737q729N61j0180j1657
12637B65882J1388J1356J9036L376j0960n019K9221K8335P102j9541j2644j1362
12625C16170N984N210J0753N416j6234J1062J9914J2657J5442O1395L7321K0621
12613E05711M202r313m4243l0553J5004R319l5188r808M0817J8799l2503j8996
12601D13248K4679K1486l2562o557L6120K4397N403o804j8357P135J2249J2930
12589D93367J8566L7390M7249J1133n88L476q45j1654J0370l784R478L3145N112
12576F52415R000J9262J3733J3164J0211L3705L8879M297J5377J7416M468J0011
$$ plain form
12564 841938 857570 885632 919390 934972 979063 1015356 1065294 1089508 1135989 1224738 1267130
12553 1267130 1290820 1354764 1410498 1472548 1505446 1540924 1612362 1713261 1835550 2000304 2203140
12542 2203140 2394776 2572236 2666638 2748046 2791155 2783305 2736053 2727087 2780388 2877918 2993455
12531 2993455 3153411 3319373 3509718 3743996 4000016 4278933 4601132 4932804 5316477
12522 5316477 5796461 6358553 6988918 7733436 8673853 9830841 11225174 12874214 14758941
12513 14758941 16792090 18856571 20891979 22978210 25171247 27779890 31187475 35985349
12505 35985349 43047393 53553702 68922649 90353415 117489920 147251273 174101065
12498 174101065 192424211 198569718 191604176 173606230 148582230 121332784 95824041
$$ packed form
12564H41938J5632K8062L3758J5582M4091L6293M9938K4214M6481Q8749M2392
12553A267130K3690O3944N5734O2050L2898L5478P1438J00899J22289J64754K02836
12542B203140J91636J77460R4402Q1408M3109p850m7252q966N3301R7530J15537
12531B993455J59956J65962J90345K34278K56020K78917L22199L31672L83673
12522E316477M79984N62092O30365P44518R40417J156988J394333J649040J884727
12513A4758941K033149K064481K035408K086231K193037K608643L407585M797874
12505C5985349P062044J0506309J5368947K1430766K7136505K9761353K6849792
12498A74101065J8323146O145507o965542j7997946k5024000k7249446k5508743
$$ plain form
12491 95824041 74303918 57456496 44905676 35776297 29225777 24552390 21118241 18484010
12483 18484010 16374648 14581179 12946570 11387869 9941502 8638577 7515866 6573888
12475 6573888 5802540 5159209 4613112 4165235 3788853 3472906 3215232 2951343 2722694
12466 2722694 2560534 2408179 2269541 2153003 2027771 1881083 1783096 1725402 1643734 1562037
12456 1562037 1471971 1390410 1344883 1288826 1231410 1180276 1132633 1103264 1069602 1021216 1006374
12445 1006374 967084 929254 899366 851113 830736 839106 832995 808722 768850 741622 716458 695734
12433 695734 691278 652300 620760 584021 541968 525678 502826 502259 482283 478637 473000 474580 479250
12420 479250 469112 440545 408387 403965 417088 421398 401249 344674 327901 306285 299413 290926
$$ packed form
12491I5824041k1520123j6847422j2550820r129379o550520m673387l434149k634231
12483A8484010k109362j793469j634609j558701j446367j302925j122711r41978
12475F573888p71348o43331n46097m47877l76382l15947k57674k63889k28649
12466B722694j62160j52355j38638j16538j25232j46688r7987n7694q1668q1697
12456A562037r0066q1561m5527n6057n7416n1134m7643k9369l3662m8386j4842
12445A006374l9290l7830k9888m8253k0377Q370o111k4273l9872k7228k5164k0724
12433F95734m456l8978l1540l6739m2053j6290k2852n67j9976l646n637J580M670
12420D79250j0138k8567l2158m422J3123M310k0149n6575j6773k1616o872q487
$$ plain form
12408 290926 257157 254855 288247 335177 381271 395947 398780 425711 424475 406137 365070 347939
12396 347939 344653 299518 276274 310003 305085 306948 319513 325630 322499 315453 306908 298429 330275
12383 330275 329081 358087 348491 335957 335664 347831 367331 377951 399359 392062 417036 429774
12371 429774 420393 412234 406349 374273 330663 259372 195275 216592 220923 216801 191728 163839
12359 163839 174952 174100 146739 104017 90572 120070 154901 173019 155425 127708 121767 132862
12347 132862 136837 175703 197317 208380 239372 265193 269272 277831 299214 284557 242166 199043
12335 199043 182711 160414 164408 176050 151487 113648 111706 104050 104583 113801 110335 111139 103456
12322 103456 88480 51606 52592 54943 92080 136934 229719 335951 394203 462838 532526 614469
$$ packed form
12408B90926l3769k302L3392M6930M6094J4676K833K6931j236j8338m1067j7131
12396C47939l286m5135k3244L3729m918J863J2565O117l131p046q545q479L1846
12383C30275j194K9006r596j2534k93J2167J9500J0620K1408p297K4974J2738
12371D29774r381q159n885l2076m3610p1291o4097K1317M331m122k5073k7889
12359A63839J1113q52k7361m2722j3445K9498L4831J8118j7594k7717n941J1095
12347A32862L975L8866K1614J1063L0992K5821M079Q559K1383j4657m2391m3123
12335A99043j6332k2297L994J1642k4563l7839j942p656N33R218l466Q04p683
12322A03456j4976l6874R86K351L7137M4854R2785J06232N8252O8635O9688Q1943
$$ plain form
12310 614469 686194 780207 877118 1056631 1245483 1452339 1636588 1800769 1920933 2014386
12300 2014386 2051434 2004578 1933147 1814334 1656129 1512936 1357660 1213772 1080342 975980
12290 975980 887188 821822 758277 700558 653322 605597 540101 493105 465768 450632 455247 466215
12278 466215 464921 493569 509804 519998 516301 489255 490985 482219 461153 467921 445190 422530
12266 422530 430986 447951 450726 466438 477891 469190 472735 487823 479441 490861 488655 492769 479831
12253 479831 450358 459211 437986 403471 413552 452787 468093 455816 463774 452902 455248 479198
12241 479198 481097 473451 474009 466674 425106 432157 425860 443412 448902 448456 457270 466561 442163 392300
12227 392300 366644 413178 444076 481753 486994 499865 492464 509447 525303 534642 562032 589890
$$ packed form
12310F14469P1725R4013R6911J79513J88852K06856J84249J64181J20164R3453
12300B014386L7048m6856p1431j18813j58205j43193j55276j43888j33430j04362
12290I75980q8792o5366o3545n7719m7236m7725o5496m6996k7337j5136M615J0968
12278D66215j294K8648J6235J0194l697k7046J730q766k1066O768k2731k2660
12266D22530Q456J6965K775J5712J1453q701L545J5088q382J1420k206M114j2938
12253D79831k9473Q853k1225l4515J0081L9235J5306j2277P958j0872K346K3950
12241D79198J899p646N58p335m1568P051o297J7552N490m46Q814R291k4398m9863
12227C92300k5656M6534L0898L7677N241J2871p401J6983J5856R339K7390K7858
$$ plain form
12215 589890 583978 625718 655561 672595 672935 684707 714781 744039 730130 726751 718642 745120
12203 745120 774074 820033 873572 915362 905322 912004 910510 932715 949333 960474 991238 1028364
12191 1028364 1049888 1063569 1088598 1126067 1186634 1234776 1261613 1292346 1317652 1341149 1392489
12180 1392489 1483809 1554116 1585442 1600945 1642398 1711252 1768217 1813567 1892907 1966187 2022333
12169 2022333 2121782 2269456 2434588 2611361 2820933 3030886 3225663 3408016 3584987 3777437
12159 3777437 3970746 4112660 4247169 4426278 4622334 4856223 5127967 5469038 5902573
12150 5902573 6406851 6996242 7673053 8484515 9523587 10748575 12169493 13877562 15865558
12141 15865558 18112463 20573686 23239869 26047682 28889276 31837378 35058419 39037514
$$ packed form
12215E89890n912M1740K9843J7034L40J1772L0074K9258j3909l379q109K6478
12203G45120K8954M5959N3539M1790j0040O682j494K2205J6618J1141L0764L7126
12191A028364K1524J3681K5029L7469O0567M8142K6837L0733K5306K3497N1340
12180A392489R1320P0307L1326J5503M1453O8854N6965M5350P9340P3280N6146
12169B022333R9449J47674J65132J76773K09572K09953J94777J82353J76971J92450
12159C777437J93309J41914J34509J79109J96056K33889K71744L41071M33535
12150E902573N04278N89391O76811Q11462J039072J224988J420918J708069J987996
12141A5865558K246905K461223K666183K807813K841594K948102L221041L979095
$$ plain form
12133 39037514 44504241 52558703 64463270 81251136 103210396 129226850 156079666
12126 156079666 179262112 194137798 197077772 187070312 166067730 138823231 110913592
$$ packed form
12133C9037514N466727Q054462J1904567J6787866K1959260K6016454K6852816
12126A56079666K3182446J4875686K939974j0007460k1002582k7244499k7909639
$$ [...]
##END NTUPLES=NMR SPECTRUM
##END=
