##TITLE=Analysis number 317414
Compound Code cc 45714
Book Reference 382/178
Project Code qc-cat
Chemist Name simons
##JCAMPDX= 6.0         $$ Bruker NMR JCAMP-DX V2.0
##DATA TYPE= NMR SPECTRUM
##DATA CLASS= NTUPLES
##ORIGIN= Bruker BioSpin GmbH
##OWNER= nmr
$$ XWIN-NMR		Version 3.5
$$ Mon Feb 20 11:43:18 2006 GMT Standard Time (UT+0h)  MAYBRIDGE\nmr@NMR_250MHZ
##.OBSERVE FREQUENCY= 250.131544655141
##.OBSERVE NUCLEUS= ^1H
##.ACQUISITION MODE= SIMULTANEOUS (DQD)
##.ACQUISITION SCHEME= undefined
##.AVERAGES= 16
##.DIGITISER RES= 18
##SPECTROMETER/DATA SYSTEM= dpx250
##.PULSE SEQUENCE= zg30
##.SOLVENT NAME= CDCl3
##.SHIFT REFERENCE= (INTERNAL, CDCl3, 0, 16.4559)
##AUDIT TRAIL= $$ (NUMBER, WHEN, WHO, WHERE, WHAT)
$$ ##TITLE= Audit trail, XWIN-NMR		Version 3.5
$$ ##JCAMPDX= 5.01
$$ ##ORIGIN= Bruker BioSpin GmbH
$$ ##OWNER= nmr
$$ C:\u/data/dgb/nmr/ADRS/16240/pdata/1/auditp.txt
$$ ##AUDIT TRAIL=  $$ (NUMBER, WHEN, WHO, WHERE, WHAT)
(   1,<2006-02-20 11:42:40.06 +000>,<MAYBRIDGE\nmr>,<NMR_250MHZ>,
      <created by zg, POWCHK disabled, PULCHK disabled
       configuration hash MD5:
       84 BC 41 DB A1 6E 1D 46 DA 25 12 A5 C1 ED C5 3A
       data hash MD5: 64K
       B6 17 1D BD 2D 6E 89 95 30 08 9B 75 3D 6D 23 5F>)
(   2,<2006-02-20 11:43:02.54 +000>,<MAYBRIDGE\nmr>,<NMR_250MHZ>,
      <Start of raw data processing
       ef LB = 0.3 FT_mod = 6 PKNL = 1 SI = 32K 
       data hash MD5: 32K
       EC AC D7 B3 97 DE FF C4 12 4B 42 F7 55 A2 93 5A>)
(   3,<2006-02-20 11:43:05.84 +000>,<MAYBRIDGE\nmr>,<NMR_250MHZ>,
      <apk 
       data hash MD5: 32K
       B8 95 F5 85 E7 E0 37 74 4E 05 8D A6 8A 22 F7 42>)
(   4,<2006-02-20 11:43:07.25 +000>,<MAYBRIDGE\nmr>,<NMR_250MHZ>,
      <abs ABSG = 5 
       data hash MD5: 32K
       D5 C5 BC BC 38 8F 4F 59 39 4E 68 37 8A C3 7B B4>)
$$ ##END=
$$ 
$$ hash MD5
$$ B4 5E 55 15 8D 58 A5 62 89 86 D4 FC 78 4D 52 FA
##$RELAX= 
##$RELAX= 
##$RELAX= 
##$RELAX= 
##$RELAX= 
##$RELAX= 
##$RELAX= 
$$ Bruker specific parameters
$$ --------------------------
##$DU= <C:\u>
##$EXPNO= 16240
##$NAME= <ADRS>
##$PROCNO= 1
##$TYPE= <nmr>
##$USER= <dgb>
##$AMP= (0..31)
100 100 100 100 100 100 100 100 100 100 100 100 100 100 100 100 100 100 
100 100 100 100 100 100 100 100 100 100 100 100 100 100 
##$AQSEQ= 0
##$AQ_mod= 3
##$AUNM= <au_zg>
##$AUTOPOS= <15 >
##$BF1= 250.13
##$BF2= 250.13
##$BF3= 250.13
##$BF4= 250.13
##$BF5= 500.13
##$BF6= 500.13
##$BF7= 500.13
##$BF8= 500.13
##$BYTORDA= 1
##$CFDGTYP= 0
##$CFRGTYP= 5
##$CHEMSTR= <none>
##$CNST= (0..31)
1 1 145 1 1 1 1 1 1 1 1 1 1 1 1 1 1 1 1 1 1 1 1 1 1 1 1 1 1 1 1 1 
##$CPDPRG= <>
##$CPDPRG1= <>
##$CPDPRG2= <>
##$CPDPRG3= <>
##$CPDPRG4= <mlev>
##$CPDPRG5= <mlev>
##$CPDPRG6= <mlev>
##$CPDPRG7= <mlev>
##$CPDPRG8= <mlev>
##$CPDPRGB= <>
##$CPDPRGT= <>
##$D= (0..31)
0 1 0 0 0 0 0 0 0 0.06 0 0 0 0 0 0 0.0002 0 0 0 0 0 0 0 0 0 0 0 0 0 0 
0 
##$DATE= 1140435757
##$DBL= (0..7)
120 120 120 120 120 120 120 120 
##$DBP= (0..7)
150 150 150 150 150 150 150 150 
##$DBP07= 0
##$DBPNAM0= <>
##$DBPNAM1= <>
$$ [...]
##$SUBNAM7= <"">
##$SUBNAM8= <"">
##$SUBNAM9= <"">
##$SW= 20.6930455092707
##$SWIBOX= (0..15)
0 0 3 0 0 0 0 0 0 0 0 0 0 0 0 0 
##$SW_h= 5175.983436853
##$TD= 65536
##$TD0= 1
##$TE= 293.16
##$TE2= 300
##$TE3= 300
##$TEG= 300
##$TL= (0..7)
0 120 120 120 120 120 120 120 
##$TP= (0..7)
150 150 150 150 150 150 150 150 
##$TP07= 0
##$TPNAME0= <>
##$TPNAME1= <>
##$TPNAME2= <>
##$TPNAME3= <>
##$TPNAME4= <>
##$TPNAME5= <>
##$TPNAME6= <>
##$TPNAME7= <>
##$TPOAL= (0..7)
0.5 0.5 0.5 0.5 0.5 0.5 0.5 0.5 
##$TPOFFS= (0..7)
0 0 0 0 0 0 0 0 
##$TUNHIN= 0
##$TUNHOUT= 0
##$TUNXOUT= 0
##$USERA1= <user>
##$USERA2= <user>
##$USERA3= <user>
##$USERA4= <user>
##$USERA5= <user>
##$V9= 5
##$VALIST= <valist>
##$VCLIST= <CCCCCCCCCCCCCCC>
##$VD= 0
##$VDLIST= <DDDDDDDDDDDDDDD>
##$VPLIST= <PPPPPPPPPPPPPPP>
##$VTLIST= <TTTTTTTTTTTTTTT>
##$WBST= 1024
##$WBSW= 4
##$XGAIN= (0..3)
0 0 0 0 
##$XL= 0
##$YL= 0
##$YMAX_a= 338570
##$YMIN_a= -548915
##$ZGOPTNS= <>
##$ZL1= 120
##$ZL2= 120
##$ZL3= 120
##$ZL4= 120
##$ABSF1= 16.45587
##$ABSF2= -4.237303
##$ABSG= 5
##$ABSL= 3
##$ALPHA= 0
##$AQORDER= 0
##$ASSFAC= 0
##$ASSFACI= 0
##$ASSFACX= 0
##$ASSWID= 0
##$AUNMP= <proc_1d>
##$AZFE= 0.1
##$AZFW= 0.1
##$BCFW= 0
##$BC_mod= 0
##$BYTORDP= 0
##$COROFFS= 0
##$CY= 12.5
##$DATMOD= 1
##$DC= 0
##$DFILT= <>
##$DTYPP= 0
##$F1P= 14.0000005364418
##$F2P= -0.99999901652339
##$FCOR= 0.5
##$FTSIZE= 32768
##$FT_mod= 6
##$GAMMA= 0
##$GB= 0
##$INTBC= 1
##$INTSCL= 1
##$ISEN= 128
##$LB= 0.3
##$LEV0= 0
##$LPBIN= 0
##$MAXI= 10000
##$MC2= 0
##$MEAN= 0
##$ME_mod= 0
##$MI= 0
##$NCOEF= 0
##$NC_proc= -4
##$NLEV= 6
##$NOISF1= 0
##$NOISF2= 0
##$NSP= 0
##$NTH_PI= 0
##$NZP= 0
##$OFFSET= 16.45587
##$PC= 1
##$PHC0= -114.5486
##$PHC1= 9.684554
##$PH_mod= 1
##$PKNL= yes
##$PPARMOD= 0
##$PSCAL= 4
##$PSIGN= 0
##$REVERSE= no
##$SF= 250.130016539096
##$SI= 32768
##$SIGF1= 0
##$SIGF2= 0
##$SINO= 400
##$SIOLD= 32768
##$SREGLST= <1H.CDCl3>
##$SSB= 0
##$STSI= 32768
##$STSR= 0
##$SW_p= 5175.98343685301
##$SYMM= 0
##$S_DEV= 0
##$TDeff= 65536
##$TDoff= 0
##$TI= <Analysis number 999999
Compound Code 99
Book Reference 9
Project Code 9>
##$TILT= no
##$TM1= 0
##$TM2= 0
##$TOPLEV= 0
##$USERP1= <user>
##$USERP2= <user>
##$USERP3= <user>
##$USERP4= <user>
##$USERP5= <user>
##$WDW= 1
##$XDIM= 32768
##$YMAX_p= 487469094
##$YMIN_p= -441601
$$ End of Bruker specific parameters
$$ ---------------------------------
##NTUPLES= NMR SPECTRUM
##VAR_NAME=  FREQUENCY,     SPECTRUM/REAL,   SPECTRUM/IMAG
##SYMBOL=    X,             R,               I
##VAR_TYPE=  INDEPENDENT,   DEPENDENT,       DEPENDENT
##VAR_FORM=  AFFN,          ASDF,            ASDF
##VAR_DIM=   32768,         32768,           32768
##UNITS=     HZ,            ARBITRARY UNITS, ARBITRARY UNITS
##FACTOR=    0.157963299565203, 1,           1
##FIRST=     4116.10695389357, 0,            0
##LAST=      -1059.87648295944, 0,           0
##MIN=       -1059.87648295944, -441601,     0
##MAX=       4116.10695389357, 487469094,    0
$$ Real data points
##PAGE= N=1
##DATA TABLE= (X++(R..R)), XYDATA
$$ [...]
24441 -33029 3870 -51025 -118516 -40896 -46997 -89424 -125700 -156180 -223841 -234332 -169037 -80940
24429 -80940 -125576 -28101 51596 -9823 -79685 -89028 -44518 65792 142500 153559 156870 158522
24417 158522 159993 154129 55248 88770 143766 103819 18092 45189 65188 -1198 -87693 18105
24405 18105 98198 28194 -66378 -134350 -62612 -4655 58643 19386 -38700 56135 76724 31998
24393 31998 104615 119916 103912 133309 170339 117350 70014 63371 32883 -28052 -2955 -9925
24381 -9925 -126059 -119692 -69199 -71495 -38518 -22161 -71774 -31361 16173 14561 26633 -6540
24369 -6540 -12806 -79954 -28198 -74609 -75821 -40856 -57860 -61194 -111691 -107451 -71024 -107541 -96824
24356 -96824 -24076 -36112 -76630 30254 74742 98668 37187 -40876 -54038 -81675 -88612 -36823
24344 -36823 37412 91753 128088 35047 -82862 -119552 -60676 37684 66645 55127 -2391
24333 -2391 -65480 -65076 -29497 -36382 -33288 40409 40008 15598 -10575 25015 86113 110271 130235
24320 130235 139266 118897 22520 -54598 30558 11987 -19054 -27843 50703 56582 -4517 -2041
24308 -2041 1840 8964 68117 -18325 -1046 23893 -91546 -136941 -91156 -144483 -125800 -53944
24296 -53944 -97074 -130061 -165520 -156918 -161559 -191498 -118815 -128179 -88555 -36348 -82144 -67809
24284 -67809 -35409 -58135 -116453 -99354 -31150 14571 63087 119706 197750 132640 106186 134480
24272 134480 9948 -29749 4527 16629 58592 86788 52282 -8206 -60563 -22871 48393
24261 48393 104506 199973 206253 213659 125755 79898 48330 -25402 -46649 17011 66454 85703
24249 85703 42496 -48103 -111399 -86271 -122961 -108278 -32564 -90658 -98109 -76897 -36443 -5829
24237 -5829 69505 11011 -96219 -168136 -224744 -245823 -170501 -22276 35348 27362 37962 93244
24225 93244 123602 27584 -94872 -183959 -155992 -124354 -115626 -142447 -223752 -225144 -158310 -34063
24213 -34063 -27898 -21560 9537 37488 113721 60110 112428 51243 20721 -15515 -31723 -29605
24201 -29605 44625 50659 144239 186418 159102 209736 174428 -26563 -83610 -81915 -83433 -14249
24189 -14249 95372 132450 28635 32273 48748 11011 45909 168065 141964 133051 67194
24178 67194 15172 16327 -46481 -90692 -40150 -43525 -104912 -173894 -136965 -70919 2225 -74072
24166 -74072 -126197 -35917 -12570 4938 23104 55405 45631 31259 114491 112485 73780 56922
24154 56922 -248 8453 24406 -2235 45193 23318 -109231 -110688 -92138 19233 43651 83235
24142 83235 37006 -35640 -54653 2178 40310 47090 83925 95728 1055 -85235 -41556 -30261
24130 -30261 -84746 -49010 -28485 -96540 -136803 -36819 -32908 -88916 -39177 -57342 -116342 -83469
24118 -83469 14533 74541 17908 67850 76353 11833 19213 -26073 -107221 -32402 14417 62141
24106 62141 67412 24281 60094 17933 5131 -8416 -1319 -78315 -55443 -13649 -47622 -65799
24094 -65799 1384 39857 -9501 57423 102565 66714 -76347 -118316 -176858 -216286 -231795
24083 -231795 -188347 -82556 -108558 -105525 -123823 -44281 -17966 -66727 -29784 35387 17802
24072 17802 -63698 -39254 -75295 -135787 -85477 14900 24172 72875 1793 -35489 -9010 78744
24060 78744 128584 63055 -71848 -12475 80596 39487 59366 100436 91917 69183 130111 190792
24048 190792 91032 -18753 -57080 22216 21531 76326 122932 72825 15669 23968 19760 49622
24036 49622 69417 39453 9060 21509 -23140 -78890 -16889 93681 73107 45814 13147
24025 13147 19763 136372 203228 163848 69603 41933 -45499 -78949 -7094 -3154 132650 207550
24013 207550 197777 159965 93602 19561 -109948 -226749 -173809 -170904 -158150 -100310 14886
24002 14886 45661 -20308 -37038 -78679 -58865 -42394 -86843 -82299 -51437 -28257 -75402 -51708
23990 -51708 16511 -39156 -17261 9457 88229 134679 140241 89179 4418 -42953 -52700 -48680
23978 -48680 -42649 -33967 -34965 -67330 -85939 -96023 -61192 -22813 877 78119 117938 119992 24433
23965 24433 69901 104566 -6744 28532 106397 115991 163159 234636 227947 152670 119314 96592
23953 96592 13573 31730 -751 57587 116710 38679 34224 84309 72877 51446 90959 97200
23941 97200 39874 -6520 -72375 -14919 -31935 -62284 -37029 87133 114765 33583 20028
23930 20028 92959 80697 43109 6665 -62134 -46558 -41303 26849 135636 54927 -52426
23919 -52426 -974 22827 -18234 2168 40117 70120 -45540 -29408 34177 -6180 -15458 55491
23907 55491 110147 39040 -44984 -27180 16073 -55420 -84097 -65673 -33944 -11847 -33474 -31001
23895 -31001 27413 49616 -9653 -37592 -108360 -70612 17656 72351 -431 -42101 -59141 -105352
23883 -105352 -144014 -199794 -99570 -41172 -1602 -8540 -85505 -58070 -43886 -18498 35060
23872 35060 60528 63016 10545 -26788 -31890 -57246 8788 883 -63452 -139032 -120670 -113632
23860 -113632 -159962 -142611 -82731 10516 10047 2536 41633 51650 -82834 -144631 -118141 -104066
23848 -104066 -201469 -136104 -19422 36511 87165 13524 2203 -31171 -127065 -170776 -112376
23837 -112376 12924 12765 -4941 14421 36190 -18229 -25534 -49411 -21923 11074 23891 -36473
23825 -36473 -25847 21880 52094 155351 172323 204614 169360 166251 81476 99387 115606 52589
23813 52589 57322 68644 57995 34113 40137 66947 71427 -10063 12203 65703 92512 45600
23801 45600 10545 76734 169654 66433 -53556 -40746 -133256 -159910 -158432 -119273 -101020
23790 -101020 -113414 -146906 -64163 -33210 -26456 -22553 -21559 -50136 -51395 -129381 -128995 -95162 -65373
23777 -65373 -61471 -65978 -85326 -118435 -98574 -110922 -110700 -57633 13376 18943 -34652 1316 -19555
23764 -19555 -50068 -71785 -27697 91234 96997 9606 51859 -12931 -94411 -16041 68615 90373
23752 90373 234902 204305 134398 61656 -1626 54804 106311 160933 43957 -8001 14652
23741 14652 89364 74259 61279 38768 58263 98032 44521 13566 17820 -22965 -67080 -106217
23729 -106217 -92553 -108295 -80623 -19275 8357 -17213 -41656 -64462 -50050 27788 62333
23718 62333 50104 -69505 -164438 -108422 -57621 31805 -9295 -42154 64357 68243 33461
23707 33461 -51305 -131457 -125787 -110905 -99429 -84708 -179436 -113066 -63113 16374 -2725 71451
23695 71451 136083 19782 -59806 -19438 18786 70898 28398 20717 35942 34164 -37289 -25841
23683 -25841 -14043 -136261 -238996 -222644 -137781 -150507 -134219 -139222 -80283 40012 99604
23672 99604 109015 23207 -60123 -102950 -115408 -76834 -42227 -8797 -2562 -9192 -46542 -35832
23660 -35832 -17358 -59296 -57362 35840 183616 204232 49096 -86457 -69338 39625 30316
23649 30316 33133 153004 144385 54206 772 83494 109834 31389 37485 118134 125439 68828
23637 68828 84730 112311 61385 79827 144348 77355 34109 88303 151414 114329 29744 32503
23625 32503 -8290 -30959 -11747 -48091 -92475 -124383 -93875 -121889 -136899 -53943 -53672 -130872
23613 -130872 -135538 -89508 -54795 51567 119720 73954 28062 125243 109114 20882 -40154
23602 -40154 -15791 3549 52239 73032 47583 58411 -27014 -141790 -68645 -50757 -62300
23591 -62300 -41187 -9021 -37096 -20031 96810 118898 68672 31206 -6012 30322 14199
23580 14199 23289 25902 -40958 -26459 -9006 -36058 -64430 -47737 43657 50642 21493 28957
23568 28957 -8607 64141 88409 133895 197590 114571 96242 128287 97541 55352 46320 30085
23556 30085 -38225 -127241 -47515 5753 -18131 -45258 -59728 -89379 -106693 -103036 -40729 -15787
23544 -15787 -60789 -171177 -216085 -140984 -110437 -15046 14294 -20609 10870 108406 67757
23533 67757 18415 -11425 -88326 -113506 -89515 -114065 -199616 -139085 -114675 -169660 -117619 -44886
23521 -44886 -99972 -114781 -91633 -14199 90377 1748 -95229 -88283 -150293 -182564 -156551 -125581
23509 -125581 -106684 -97534 -34107 54704 95938 117779 39263 11770 -8764 -8620 40360 -4449
23497 -4449 -37931 -45743 -82984 -67779 -82040 -52157 -12999 -21119 -9694 -23257 -97 43242
23485 43242 46706 -46346 -65439 -17592 -3907 -34449 -122303 -177124 -147437 24532 53171 33265
23473 33265 79558 120181 56118 -48928 -102228 -57113 -88054 -172063 -286781 -238115 -59355
23462 -59355 -76204 -48255 -67786 -83094 -63844 16863 -6058 -31085 -62496 -76521 -96359 -107981
23450 -107981 -150359 -172619 -159416 -131156 -105083 -24301 -12313 -29785 -61398 -34828 -38757 -86124
23438 -86124 -81531 -130598 -110741 -43596 -32950 17760 51481 52749 52794 -17892 -25164 -24320 43186
23425 43186 29956 7838 27467 74245 9962 -49172 22917 92523 82220 83034 91098 61173
23413 61173 41352 -9277 -15520 -22335 -41996 -67424 -134512 -170857 -93725 30303 128550 50419
23401 50419 -14071 2747 -70836 -114790 -181464 -122953 -131038 -53182 -106099 -173955 -87799 -85211
23389 -85211 -102410 -128409 -167835 -84224 -108586 -81303 -31718 -51211 29123 58961 24116 37673
23377 37673 58785 57715 17180 19767 48831 -38500 -72578 -106726 -73949 -163879 -185924 -109639
23365 -109639 -112628 -137586 -161826 -142303 -46963 19177 -50772 52079 73308 85682 127051
23354 127051 118263 91367 90357 89917 59266 16509 -82326 -90081 -133465 -65185 1694 3439 -84683
23341 -84683 -101423 -52194 -30287 -88015 -194642 -255406 -222612 -227210 -179692 -137450 -39881 -961
23329 -961 -4407 26278 -6158 635 24499 -16122 -22571 -49853 -72188 12281 75262 48536 -27974
23316 -27974 24545 134660 187919 97304 36022 19381 70599 84440 -87 -25688 36001
23305 36001 9078 18801 60177 113693 115322 70911 42247 48402 32709 46108 11166 37643
23293 37643 49565 7878 -49479 -59054 -75129 -91467 -101686 -100578 -46866 11460 9774 -3866
23281 -3866 -61164 -1092 -22141 -118784 -177804 -128792 -152093 -89254 -45554 -115597 -41725 50369
23269 50369 89585 135890 106618 -119161 -196658 -163123 -185022 -163963 -157338 -134070 -107624 -40659
23257 -40659 23217 58023 31801 49844 -14379 -61294 -34301 -94650 -117588 -83436 -17596 -114647
23245 -114647 -166498 -133821 -143667 -230380 -184429 -133682 -75771 -36549 -100393 -132393 -152047 -83188
23233 -83188 -158450 -176133 -87862 -87615 -109286 -81263 24161 121541 78863 66073 88592 101636
23221 101636 122199 164140 131628 20893 30193 14671 -80500 -165165 -102507 -16507 23833
23210 23833 80887 91429 76171 93642 69944 30369 -5683 -61839 -60166 -25409 -27527 -96004
23198 -96004 -102583 -52409 13460 12845 -63161 -106159 -65958 -115214 -214856 -139875 -38036 -58745
23186 -58745 -14136 27044 -11616 -92217 -30991 22909 -6109 -82236 -69729 -35075 29930 3986
23174 3986 -12247 27697 15099 -29261 -105456 -53755 -3831 2443 7708 71848 57855 26485
23162 26485 -3462 -13619 -82709 -103822 -168585 -165153 -145548 -78638 -52713 19653 40035 64593
23150 64593 78370 35958 41504 33409 83816 9797 -132761 -192788 -143949 -132480 7817 104949
23138 104949 42051 -31696 5577 81817 73557 53336 76630 4393 -22549 19550 129716
23127 129716 73012 50040 16807 -65315 -209420 -153342 -100453 -132110 -157826 -97252 -12135
23116 -12135 -9059 -21127 -37296 -31311 -70108 -42208 -16272 -3870 -62242 -85364 16731 84441
23104 84441 -15049 -54153 -111712 -190988 -168716 -67985 -18922 -23385 67948 125441 147571 64386
23092 64386 -28365 -86002 -33756 51534 -80359 -108993 -129126 -129095 -107246 -89826 -69537 -22314
23080 -22314 35881 -4103 -26081 -114255 -152569 -157759 -156201 -150216 -171407 -259942 -251347 -188929
23068 -188929 -132894 -93301 -22205 18664 31043 -60998 -141206 -114963 -137209 -204678 -130306
23057 -130306 -73227 -55396 -122320 -121642 -108601 -100205 -133256 -84737 283 31774 -45278 -88813
23045 -88813 -47764 11532 13177 -27457 -46975 -63986 -16912 8921 -7578 -31187 -71352 -66036
23033 -66036 3351 48324 67095 78560 19642 63505 38115 64060 57960 2186 30009 -3794
23021 -3794 69431 35583 2613 30815 41674 63631 27569 -16280 -104426 -163849 -185332 -129278
23009 -129278 11888 -10189 -55372 29108 129060 88974 39028 -7351 -24250 -133599 -109256
22998 -109256 -15443 -54404 -58003 18703 -694 -2185 5637 -110471 -153367 -188495 -217279 -217296
22986 -217296 -45769 19934 -11839 -66237 -100363 -86557 -92830 -119841 -81175 1602 29682
22975 29682 43922 -21469 11415 -28514 -36706 -16259 -9082 97066 64975 -37844 -103880 -44300
22963 -44300 28712 -43413 -40605 -123425 -122819 -72525 -80535 -102412 -128364 -48728 12320 33835
22951 33835 101666 97818 39857 71364 65848 44175 124146 74837 -22554 14681 26945 40004
22939 40004 74431 37622 51063 36662 11252 -123468 -194535 -135872 96093 185532 134708
22928 134708 41556 -7529 -4299 -59840 -49962 -2871 -19555 52184 44475 13250 -4332 -159382
22916 -159382 -165011 -10649 58647 53435 47523 28410 -6248 -64421 -59550 47756 8769 -41061
22904 -41061 22551 66880 115407 64807 59316 -11342 -36543 46269 20342 -65570 -96555 -46306
22892 -46306 72874 123384 174894 83013 29840 55613 96261 47114 25886 99735 171911
22881 171911 65314 -2680 33695 65821 112566 101105 89821 150859 107238 -13028 -34585
22870 -34585 22962 83994 141329 169160 119628 141370 85918 29442 94622 73410 12941 -41909
22858 -41909 -32390 64452 82800 25609 2220 48920 21288 -49380 -135850 -147836 -101312 7163
22846 7163 73441 -19826 7366 74818 41722 38751 40185 82794 63099 36338 77864 -30520
22834 -30520 -112179 -73245 -70086 -24741 5595 43485 -2736 -64051 -131709 -168189 -179421 -130335
22822 -130335 -79603 -51099 -67613 -27528 14270 -47706 -127311 -107844 -6815 -29682 -85727
22811 -85727 -95963 -85260 -100023 -89360 -114873 -71291 61801 80548 105125 63203 -7372
22800 -7372 -46673 -115808 -143881 -130025 -120400 -94870 -93185 -107111 -112229 -61564 -1227 -31994
22788 -31994 -83141 -108232 -68650 -13368 32074 7335 -57416 -37246 -12973 12031 -45635 -97456
22776 -97456 -130869 -50637 -48091 567 91166 79112 20442 16885 58147 62407 71297 56145
22764 56145 41619 81869 69072 64076 -12454 -46188 -55065 -135391 -116183 -70487 -15450 5025
22752 5025 -1346 -60235 -38533 53341 117564 107346 132861 98464 17057 -48396 -2925 -82580
22740 -82580 -114567 -117907 -60983 -26333 -69272 12914 69437 50404 52202 21943 -40359 -52231
22728 -52231 -5241 25795 107483 58354 7706 -1355 2594 -12776 -46660 -33006 -88464 -167718
22716 -167718 -131406 -94657 -145126 -196813 -195103 -164554 -41423 -2999 663 -34159 -86164 -149717
22704 -149717 -122124 -77165 -129668 -93591 -82792 -129134 -123496 26443 84972 85759 58253 36802
22692 36802 35760 71691 94436 87050 67766 19971 -26435 -40229 -54446 -103727 -112971 -92193
22680 -92193 -48145 -65349 -101772 -123488 -91715 41873 205938 145319 25697 -50052 -67333
22669 -67333 90876 73745 86545 136882 126189 79571 16345 43106 7861 -63630 -31958
22658 -31958 14966 43016 144323 126732 71751 20833 1614 4120 -31986 -71326 -61594 -19386
22646 -19386 -29315 100940 105536 137115 185699 99604 79589 63359 75160 82827 78222 731
22634 731 -18687 -36216 34094 -45598 -147103 -50744 -23976 -21283 42048 16197 54957 33690
22622 33690 31501 18810 -19557 -58857 -15952 22374 -4953 -53288 -93842 -70983 -69086 -35129
22610 -35129 -70538 -105249 -40629 -10624 -61988 -49284 488 -40493 26805 90294 73282 147
22598 147 17778 45080 15743 19044 -13325 -11522 -89368 -63300 -610 30468 -11153 -88500
22586 -88500 -48765 11849 -47724 -147510 -106944 -35852 -9576 -23458 -30814 46262 102010 79586
22574 79586 78852 72404 70329 8641 -30654 -3425 -10526 -55733 -67758 -70708 -31901 5789 -41608
22561 -41608 -55230 19607 31853 27608 -38511 -17376 -10971 -63551 -120994 -153199 -89376 -42858
22549 -42858 -32993 -99437 -97928 -10156 77484 60917 -40842 -27402 -26946 -87607 -72207 -58478
22537 -58478 -56139 -120960 -11174 42983 -5505 -44179 -109946 -144395 -86937 -63494 -25361 -23122
22525 -23122 -134634 -223421 -144830 -112973 -128116 -160366 -117644 -76261 -79554 -113982 -101286 -30430
22513 -30430 42799 22541 -55805 -64039 -63703 -51563 -96657 -148839 -154792 -96241 -57795 -67341 -81106
22500 -81106 -38831 -31071 -29503 123940 120357 8979 -122943 -112838 -90000 -75133 -84344 -9801
22488 -9801 -21604 -2472 16459 -34643 -68669 -85385 4384 55398 70068 6280 -39014 -5615
22476 -5615 -20663 -40328 -74306 -88818 -52839 27118 53374 15555 27644 -4753 22842 14726
22464 14726 41950 53790 -99028 -231852 -240236 -155546 -175827 -149399 -183130 -149909 -105641
22453 -105641 -119515 -147006 -189149 -94926 9694 -4779 46642 85866 80846 28736 -10918
22442 -10918 -30245 -47991 -71697 -72676 -115530 -67819 12762 -28297 -54778 465 22623 -42969
22430 -42969 -96164 -47679 -13280 -31797 -87607 -110259 -84201 -40534 -78472 -83725 76119 89780
22418 89780 64775 60046 27903 -19845 -3605 32277 110731 47435 16005 1130 12420 -82890
22406 -82890 -143018 -97349 -3760 30742 4820 -102613 -120902 -71163 34418 57590 9573
22395 9573 -33066 -107075 -194184 -230504 -278773 -250206 -259272 -232719 -120063 -49250 -30661 31581
22383 31581 32207 -39518 -62906 -132946 -118382 -102362 -48812 45354 41340 -18725 11609 8190
22371 8190 -34904 -14917 48495 43714 -8893 -6602 -70566 -59338 -36643 -39367 -73857 -71666 -24706
22358 -24706 121079 235224 173291 59907 -6025 25939 82783 111129 85240 81176 96128
22347 96128 5067 -108838 -84582 -108138 -113153 -71315 -84833 -98535 -129022 -147054 -133648 -71491
22335 -71491 -59509 -12748 16275 9045 -13699 29623 80779 131600 160606 79769 53033 73057
22323 73057 54960 -111381 -137688 -95302 9732 5367 -64563 -103875 -73565 7503 52191
22312 52191 66294 39964 -4637 -66545 -130853 -82734 -55445 -82926 -79867 -131331 -163149 -142103
22300 -142103 -144239 -94999 -46452 -24941 20328 75129 53380 24588 45480 -8415 -59985 -52509
22288 -52509 -73770 -130423 -83023 -21171 -77032 -102346 -40872 -57234 -60941 55204 8582 -36905
22276 -36905 -5842 105827 129383 144151 132864 85719 72776 42124 74100 85185 69862
22265 69862 5400 -63044 -81819 -117336 -75078 16274 37271 -24737 -13403 -16547 14770 64004
22253 64004 36654 -8502 -58351 -57640 -29165 4228 -39078 -135153 -167857 -84039 -3110 43997
22241 43997 18567 38107 119658 164032 88953 12991 -1264 3607 19034 -39075 -92159 -74678
22229 -74678 -46746 -14089 -23819 -135855 -35293 22164 21356 23335 14335 20725 1557 -37510
22217 -37510 -14737 7095 -29454 -42525 -70083 -37547 41993 112160 86665 55306 -27196 -22909
22205 -22909 -48472 -68091 3627 -22324 -78332 -80261 -76209 -74826 -142295 14983 13523 13960 -15050
22192 -15050 -31642 -12670 -24066 -53939 -46323 -108008 -95747 -44031 -43608 -44971 -68505 -96439
22180 -96439 -132418 -145952 -146984 -129655 -118383 -82291 24919 -85365 -98194 -138072 -173257
22169 -173257 -91880 -90296 -81985 34621 14696 6048 -35788 -76528 -48404 30410 -13126 -44655
22157 -44655 -57553 -44164 -25889 -26669 -54232 -34884 -13656 -59787 -10903 42183 2817 -58516
22145 -58516 -90235 -83614 -87873 -22478 45676 76166 -19882 -18817 -44201 -100808 -98933 10094
22133 10094 109979 77168 65615 100322 69470 -15006 -33167 -22256 72778 38298 -53176 -24239
22121 -24239 34954 57577 33292 87417 91207 43263 69469 88908 86259 70313 27902 -1349
22109 -1349 -6701 -85677 -109036 -58534 -91727 -106200 -80896 -52762 -78383 -47602 -32647 -70655
22097 -70655 -105290 -58461 8142 -4766 5894 20743 -18484 -12088 -100557 -132413 -56887 6558
22085 6558 57633 23945 8753 54478 74098 188450 214711 58208 -50219 6079 -7573
22074 -7573 -38280 2699 24102 58677 92916 96796 39553 53485 129835 104383 129452 61632
22062 61632 -56183 -109816 -122663 -119588 -85936 -24344 11851 6234 -59752 -69516 51786 153508
22050 153508 139597 84340 20821 33026 112827 100058 68985 34669 28412 84808 74190 -87359
22038 -87359 -202300 -193349 -117985 -99428 -152644 -97018 -37021 -121362 -173310 -109202 -118398 -73594
22026 -73594 -30047 13214 27484 41547 50148 68754 71677 16812 21492 85657 42668 -61494
22014 -61494 -142762 -165505 -124459 -136065 -177793 -212348 -110273 -36993 -96367 -155734 -70401
22003 -70401 -39553 -82133 -162843 -223440 -171761 -95233 -68841 -39328 -39565 -18078 40206 101967
21991 101967 75215 59642 103393 96700 62587 74954 96352 44111 94983 168678 172119 56052
21979 56052 -64667 -38319 -59495 -57419 1228 139078 182760 105788 96720 38711 12565 20624
21967 20624 58011 44024 46840 32708 70124 98008 19132 -35071 59672 33060 -48228 -85834
21955 -85834 -44678 -27748 -90933 -56219 60984 88813 5544 -12029 -9838 10825 -80822 -88462
21943 -88462 -16982 -56147 -17705 47907 21111 16583 9418 -62211 -144048 -177908 -161131 -70314
21931 -70314 -78005 -14511 79624 113 22201 143664 170946 38708 -101781 -73099 -19206
21920 -19206 5928 -19823 -17422 105616 99732 -33562 -102923 -107182 -25958 44574 54856 85901
21908 85901 -23684 -121968 -82315 -91492 -102376 -126368 -122543 -155333 -76876 -5143 -24975 -31000
21896 -31000 -100042 -98472 -128812 -92159 -106218 -49070 101730 86562 36266 -50088 -103696 -73797
21884 -73797 -93674 -108639 -82184 -59867 30916 93409 22538 45438 99037 48282 79020 -25991
21872 -25991 -88150 -116017 -149082 -135702 -85703 28468 44793 10841 -3619 17219 -4768
21861 -4768 36709 12276 -164465 -155463 -62743 9634 55254 -63630 -106257 -45219 -118088 -114026
21849 -114026 -26573 -30392 -87836 -71230 -104494 -64970 -14033 -47720 -16789 67364 85022 97339
21837 97339 40312 -19410 -135107 -152400 -49148 -27554 -50782 -110796 -141024 -173059 -109000
21826 -109000 -63493 -131356 -125849 -147288 -87669 -8629 -25013 -27693 -51899 -97515 -115522 -68480
21814 -68480 10172 8900 -4125 -5868 10403 -13167 2259 76510 71659 35462 55592 70841
21802 70841 81145 74146 50710 35388 10349 -63088 -110513 -99079 38473 31760 -83904 -105718
21790 -105718 -33626 -13544 -35792 -23347 -9744 -17053 -64607 -66124 -18335 -33848 -108305 -94427
21778 -94427 -85262 -91199 -23188 -15190 -12723 -43450 -37936 -35811 1647 -76352 -145727 -52875 71826
21765 71826 -14677 42232 78592 69398 65241 22865 -28721 38782 -15339 26187 43895 26159
21753 26159 -1158 350 -60835 -54604 -97300 -51757 -124000 -119150 -23520 -485 -54050 -23111
21741 -23111 -21285 -68005 -111805 -78937 -71952 -103321 -95036 -136439 -209976 -123451 -32809 -14011
21729 -14011 21831 129617 123552 63777 115445 99231 72518 74511 107212 8721 -37493 34090
21717 34090 -43858 -86821 27985 28187 -24627 -104740 -207987 -175503 -132796 -108120 -70693 5207
21705 5207 61412 100221 31653 -71331 -110177 -21488 51588 53226 24982 5298 -31212 38823
21693 38823 19505 -11062 -21954 34341 -7061 -58387 -58076 -51419 -29552 -37852 34777 15390
21681 15390 4749 -22883 -59670 -90216 -36959 -14714 -355 103389 142759 51526 -12685
21670 -12685 -37905 -88266 -151287 -96853 -30515 21752 112782 115021 68754 3767 83604 88287
21658 88287 -49100 -88224 -114058 -39366 -5675 2885 -16173 -50067 -140521 -133965 -149878 -61817
21646 -61817 29386 85536 144495 106098 70360 20537 -53271 -36199 -16184 -35498 -60609 27815
21634 27815 151353 250242 258850 217706 181840 198034 167881 104802 102366 113757 59282 -51874
21622 -51874 -11817 34343 14912 62322 27462 -77229 -91651 -66326 -116530 -141767 -94283
21611 -94283 -15965 9221 -50530 -67624 -72422 -82772 -150387 -127437 -123712 -27929 33029 -4241
21599 -4241 321 45483 26885 53843 32305 -30660 -112215 -112957 -145881 -149644 -141127 -171070 -193284
21586 -193284 -151225 -59697 -59140 -111289 -149692 -46991 17899 21820 58248 74024 18739 -40550
21574 -40550 -11923 -14281 -1012 2878 20463 12652 88395 133533 69672 66539 109583 12641
21562 12641 -20731 -48239 -13350 3211 2182 -23249 -33352 -21232 -68363 -11013 -10694 22905
21550 22905 113362 13966 -94462 -129786 -190301 -138971 -126680 -72584 -29356 17311 34905
21539 34905 -124618 -168546 -143356 -72984 -70967 -84191 -78764 9154 -6214 -58363 -168161 -108888
21527 -108888 -49114 75902 112924 97373 51958 -52668 -58644 -33170 72081 73625 39991
21516 39991 27952 51406 69952 90475 62851 71644 98128 133848 185332 129210 61446 -46676
21504 -46676 -39099 -42676 -26902 -49381 -99413 -81666 9078 7321 -10102 34989 22746 -709
21492 -709 -9626 -15063 775 -41960 -103874 -117881 -63921 -17768 -88038 -140887 -61311 -15857
21480 -15857 -52117 -129325 -91354 -20120 -9711 -44246 -16447 -16613 -54512 -95476 -39989 -70337
21468 -70337 -177391 -172876 -82249 -37981 -86928 -185087 -206144 -169491 -147764 -88861 -91632 -90703
21456 -90703 -107932 -94402 -18188 43254 32610 18369 -1410 35497 59944 66694 84081 38352
21444 38352 27820 48246 17059 18507 767 -83050 -147306 -140300 -117083 -124409 -123036 -117710 -69021
21431 -69021 -31636 14773 -30422 -64585 -127068 -221400 -212864 -204229 -117270 -104884 -155020 -186454
21419 -186454 -236680 -177043 -62021 26515 -43992 -175572 -148966 -56599 -44844 -41177 -27292
21408 -27292 -29255 -52016 -50977 -57699 -25272 -21309 -79168 -126172 -181672 -326485 -308739 -129879
21396 -129879 3532 -30823 -31051 -29702 -13904 -24872 -48206 -44779 37807 -5534 2277 -27180
21384 -27180 -121940 -148329 -167824 5148 12262 -134975 -193033 -156548 -77004 -41513 -3309
21373 -3309 -25096 -43516 -101990 -94886 -36905 46910 122137 134393 71668 -8395 -6800 55289
21361 55289 151231 108564 -17734 -21369 1254 -44067 -1502 -72830 -107008 -89736 -25708 38453
21349 38453 -20829 -66078 -115278 -168916 -41187 -31034 -128856 -102684 -72255 -67973 -96297 -6284
21337 -6284 -10175 -86150 -45437 -60861 -52964 22167 33613 -25073 65330 49229 -26923 -24961
21325 -24961 20300 25688 21382 7886 -75393 -51324 -56040 -18949 24074 49569 63492 12215
21313 12215 -149830 -111002 -104406 -92354 53697 82500 52731 63572 56304 51126 15560 -72100
21301 -72100 -78585 24219 91530 114984 111371 80213 -23603 198 35364 -8183 169004
21290 169004 231392 162079 141249 49772 8466 9033 30856 19049 -944 -33529 -146801 -185766
21278 -185766 -129703 -95742 -181263 -220656 -225022 -171932 -120698 -101678 -106596 -35469 43839 -26384
21266 -26384 -122253 -198768 -252498 -177020 -117859 -70785 -84517 -82634 -42085 41741 7434 16544
21254 16544 37727 31471 23455 6819 4292 -62863 -18569 -31205 -31435 15531 2705 -26439 -76647
21241 -76647 -35460 -12122 -43467 -83047 -106742 -75475 29582 78884 26264 46385 60129
21230 60129 92376 138130 129798 76224 79072 6341 -12340 -81105 -53525 48771 23317 19456
21218 19456 -3142 -114431 -78319 -30344 -29012 -8587 -8180 28824 -45028 -176985 -207835 -209156
21206 -209156 -140684 -103829 26170 56595 51416 -12099 -17633 -7096 -40810 2152 -20585 -33234
21194 -33234 -80286 -174912 -135786 -125924 -114219 -67292 -81370 -34320 3360 -59637 -84797 -104256
21182 -104256 -21680 60565 70656 77803 115801 67868 91543 59993 50207 70673 70632 -38512
21170 -38512 -83296 -63915 -41729 -94572 -108726 -965 48111 -24728 -72146 -26955 -8810
21159 -8810 -43917 13031 39808 75073 65444 -19974 -26383 19438 -7021 -18548 -8602 -15574 43689
21146 43689 104427 99280 99657 106479 149722 184402 170362 37688 -23240 29165 65770 118499
21134 118499 71384 -62890 -192696 -83460 -14264 -17377 -73520 -114357 -115095 -7635 -91753
21123 -91753 -217106 -216185 -141952 -49363 -92029 -68493 -79285 -89203 -20998 76782 47218 -14204
21111 -14204 -58724 -37503 -43131 -142837 -192311 -177959 -160654 -144912 -113803 17714 -97079
21100 -97079 -83802 -15242 -67181 -107838 -112909 -188877 -179541 -181188 -122523 -94540 -127689 -66926
21088 -66926 31953 113932 160270 133915 74179 -2222 79541 91190 -15528 -9874 58550 36435
21076 36435 20516 103802 117984 147983 96206 2306 -62905 -20545 -45418 -24700 -19387 -35456
21064 -35456 -45353 -47837 -85658 -34913 -13201 21158 99764 123355 79511 98387 106199 67714
21052 67714 -9609 23899 90695 44272 -45604 -123396 -152008 -117043 -105081 -110950 -38259 9022
21040 9022 50273 -38795 -65677 -78781 -106435 -108352 -11966 -4211 -94489 -117496 -33082 -8515
21028 -8515 -29603 -11826 -43452 -97803 -46554 97226 90339 37037 -49167 12093 70492 66895
21016 66895 68427 70296 102185 62530 -18089 -58798 8250 123201 14623 -69301 -73299 -122397
21004 -122397 -155190 -122555 -122525 -101742 -157968 -113736 -47610 -15244 32416 -18518 -33030 26118
20992 26118 19101 -34242 -12237 -80389 -121352 -113847 -96656 -100696 -96550 -50639 19048 65181
20980 65181 70388 65614 27136 40397 -54714 -131543 -106622 -79440 -60806 -67294 -62632 -5428
20968 -5428 34381 61145 31292 -37295 -8918 62133 46944 -9501 50223 89852 149568 63244
20956 63244 -48002 -45782 -37505 -63250 -69374 -42174 -6986 66979 103262 86908 30463 35511
20944 35511 67037 117011 145453 111260 -28707 -31328 35887 31197 -50674 -20995 -13206 -105253
20932 -105253 -57005 -22354 101325 143161 105793 44047 43657 66216 89362 31936 -28687 -43735
20920 -43735 -46975 -145071 -131064 22397 71828 91799 10314 -72487 -38051 29948 36580 -47682
20908 -47682 -88520 -88824 -83848 -21185 1568 54149 84882 81975 -43875 -105023 -131180 -111524
20896 -111524 -63924 -41927 -37506 -2573 17767 64763 91045 44690 -23844 14233 72296 16030
20884 16030 -33726 19916 57619 47555 31965 -58530 -95714 -54532 14995 45409 6326 -37509
20872 -37509 -50301 -241345 -223165 -141993 -189122 -155126 -22110 56311 67913 27469 -12682
20861 -12682 2109 14275 23299 26031 -29343 -83061 -71287 25260 109388 90519 140539 169483
20849 169483 208601 177106 97589 7501 -9580 -1766 56258 24015 54519 76926 30964 -69400
20837 -69400 -151124 -109041 -101661 -82140 -70076 -125429 -141123 -76524 23576 56641 6852 -86536
20825 -86536 -126778 -139031 -103552 -155577 -133065 -22162 -85403 -61645 -7458 49084 -4903
20814 -4903 -78139 -49549 -73003 -120718 -115112 -37971 28520 38956 32737 2611 -14 13160
20802 13160 101627 119803 16400 -90576 -76730 -17457 90732 74757 36579 62873 -12335
20791 -12335 19081 29486 83287 80114 86084 126995 56543 -26468 -55755 -35884 -47348 17723
20779 17723 65357 54944 40632 27879 -87041 -118463 -124612 -75346 -237 36258 18014 -75961
20767 -75961 -49875 -117959 -233056 -131974 10117 5143 -13040 -53858 -44485 -2366 -10972 89646
20755 89646 107058 74219 -5112 26316 69639 58744 79644 86051 120029 52990 27408 -38136
20743 -38136 -95823 -75246 -69999 -120971 -90611 6450 9561 40930 21069 24863 72598 113073
20731 113073 69980 -43982 -57308 -6944 -4408 19774 -6440 -76104 -34142 -11254 -16845 20920
20719 20920 67102 99377 58593 -62028 -40677 6669 45201 -24850 -90686 -99243 -48245 5249
20707 5249 133457 175445 128655 45123 67780 66977 7829 39821 97503 154141 138703 19200
20695 19200 -32562 45029 87068 -15532 -74944 -36012 30987 25433 6449 48848 92806 66157
20683 66157 47094 52282 -5948 -20186 113757 207088 200061 104666 14911 17529 -17509 -35615
20671 -35615 -65589 -120686 -130545 -105202 -12 64074 109606 74582 32447 -68730 -103299
20660 -103299 -118628 -64290 -85048 -62494 -86949 -167439 -82134 -101849 -147808 -125714 -63503
20649 -63503 43006 -39307 -64588 -73789 -64032 -32778 -53700 -80154 -66424 -67438 29131 97523
20637 97523 78230 73296 33070 56959 117838 107470 108092 139147 130832 25967 55645 33144
20625 33144 -15586 -26907 -38722 31734 109437 141489 82844 57606 58082 47527 19606 -2586
20613 -2586 -25516 19737 35428 17714 44260 11953 -262 41314 -10354 -68882 -41627 58429
20601 58429 12783 -73604 -66641 -17791 -37328 -116437 -207086 -150369 -92979 -110854 -95749 -41586
20589 -41586 -33595 -64328 -26401 15402 -5545 -33337 -67390 -47791 -34704 -44523 -25464 67840
20577 67840 126851 213876 158070 80728 -71326 -99734 -7665 103268 169849 85006 -18269
20566 -18269 -23262 4559 82450 101491 35132 16972 -34928 -31323 77631 47462 9320 -52400
20554 -52400 -166332 -171267 -186348 -141587 14552 -49883 -117955 -61823 -5889 49036 56436 25603
20542 25603 -73759 -68014 -55603 -35072 20586 78083 68034 -36177 -54996 -140398 -166594 -182619
20530 -182619 -159340 -59084 14016 52390 39771 73981 92782 128688 120684 137005 110340
20519 110340 39530 1020 6681 -5165 -16187 64122 141630 69407 -1604 -72382 -102148 5200
20507 5200 111016 4660 -88493 -122137 -63063 726 63513 -11416 -100045 -162252 -140684
20496 -140684 -62475 -69569 -98743 -130927 -112824 -67405 -93951 -42319 -47045 -3519 12520 -18587
20484 -18587 -90702 -97602 -48742 -67601 -142613 -85573 49339 134080 202874 158205 122387 135653
20472 135653 88782 159814 95119 -71577 -164474 -200333 -164964 -144333 -231630 -214184 -193838
20461 -193838 -105792 -30542 -6907 -22099 -19446 -47454 -28118 3109 15709 70337 64709 56196
20449 56196 19463 -21846 -19712 29449 131157 148622 116874 29776 -69476 -29901 -27305 -1677
20437 -1677 62616 44801 -14826 -26816 -59828 -33206 -64809 -107548 -149632 -183523 -92636 -134867
20425 -134867 -73711 -91963 -97774 -38620 112874 70105 18713 -12734 2914 7028 -34893 10178
20413 10178 -102646 -199534 -181483 -160658 -116373 -107500 -40904 34993 57361 88183 93492 90381
20401 90381 112059 144369 216557 200428 97186 121340 89557 4583 36418 6877 7466 -44564
20389 -44564 -30920 -30706 -124005 -61624 -63244 -56582 -81603 -80866 -31145 37515 58064 2494 -39385
20376 -39385 -55561 50096 59195 692 -27816 -17123 -29440 -48783 -84998 -112417 -39347 -91650
20364 -91650 -143928 -110683 -41244 -57659 27018 132764 137655 86094 30790 40826 17157 -36361
20352 -36361 -90100 -133438 -146689 -125982 -25677 36348 25662 57092 58700 66651 38713 -10509
20340 -10509 -6533 58820 13299 29618 40120 510 6358 -64115 2950 -630 15506 11159
20328 11159 -18955 -121384 -207298 -244907 -184023 -118122 -126238 -40069 -82310 -158478 -124039 -34423
20316 -34423 193 -43967 -60306 13324 57098 73999 84827 20623 31066 58127 35297 -31579
20304 -31579 -76654 -111889 -82629 -134896 -63098 50456 79175 57396 -27349 -36914 -69865 -154525
20292 -154525 -233343 -193736 -73434 -31176 -17075 -28361 42331 31965 -18712 8252 70358
20281 70358 69089 294 23961 -632 -35914 -49644 -28375 -42390 102471 219979 196030
20270 196030 105354 73513 39306 -21265 23359 77511 -17480 20848 103704 52832 60336 58450
20258 58450 77810 70106 76214 83314 91100 58446 28161 68244 113263 -974 -56611 -79591
20246 -79591 -18953 24923 -1183 -22997 -22960 82534 121745 148275 89028 45756 -20685 9186
20234 9186 -60662 -61298 48404 38145 -23582 -5926 -779 -40567 -36838 78646 159962 107686
20222 107686 72831 40787 55510 977 -158815 -190860 -139671 -73396 8296 11676 45582
20211 45582 118947 73122 -65948 -127840 -72796 -45377 -65158 -26980 -78275 -27342 31173
20200 31173 -19760 -42324 -48515 -22513 -69983 -18089 115730 146333 113653 142243 149936 39296
20188 39296 48729 64164 77208 134540 78725 32554 -1713 -26144 -81718 -42536 84097 162937
20176 162937 123217 36379 -58180 -110716 -74689 -41961 -108800 -111555 -52389 47446 157504
20165 157504 199314 173834 141382 155703 139213 47822 -8946 -81836 -60006 -126049 -196198
20154 -196198 -166549 -148233 -97742 -55072 -41749 -47048 -24872 -25579 22836 -38170 33524 145761
20142 145761 83386 -52026 -82060 -51407 27995 67957 63775 31254 -18661 -31234 33809
20131 33809 44181 74388 73424 59886 60010 25736 9900 16924 5698 98101 146631 107104 64168
20118 64168 90337 118676 121298 117660 165931 186158 115906 29756 86938 77274 55671 63132
20106 63132 36389 -55322 -51971 -63637 -65793 31358 91616 132283 131938 70371 -43082 -77070
20094 -77070 23958 24267 111213 170029 188100 205221 98601 54205 36925 24247 18958 20610
20082 20610 -6685 -33089 -75204 -37623 -28981 -73952 -106660 -119232 -157807 -120549 -37198 26376
20070 26376 -24506 -24463 -10912 44671 101302 76763 124924 124008 47377 -44995 -213128 -158956
20058 -158956 -76883 -100861 -104843 -87605 -10331 21506 -24756 -48467 -132619 -113633 14183
20047 14183 21567 90367 195291 165839 57529 4579 -330 -77683 -119887 -121446 -54839 28674
20035 28674 26147 111621 20403 -6326 23094 -2889 -83666 -76174 -2165 -47442 -94452 -88218
20023 -88218 -88706 -80772 -29525 10367 62178 59556 75091 44427 -22791 -58509 -13303 35024
20011 35024 53910 75371 68276 79927 42725 31952 25353 44877 62117 87379 58296 34416
19999 34416 -15330 -136929 -131960 8127 68293 86156 -18033 -57613 38163 -17694 -64516
19988 -64516 -94561 -141990 -148231 -206426 -154219 -76054 -58193 -69540 -109550 -88246 -162268 -107324
19976 -107324 -43032 -17097 63674 59710 -33408 -42294 37834 30184 14174 -26063 -65696 -49797
19964 -49797 -63222 18782 104372 125163 124620 105923 43145 -16994 6722 26199 31866 19361
19952 19361 -22259 21900 11825 -16700 21648 80103 18738 7105 -18394 -89639 -146773 -138217
19940 -138217 -47807 3925 23329 -5755 43397 -4706 28441 60441 50800 -28456 -86313 -69286
19928 -69286 33505 71545 -3443 54802 112137 100531 59895 62205 119519 123920 42107 90480
19916 90480 82848 151553 159554 114420 88182 60690 6448 -9378 71395 176085 105481 139949
19904 139949 182260 160275 101133 -27110 -84019 -105244 -85368 -97895 -78186 14581 105981
19893 105981 216757 218935 234249 229549 251000 366473 474875 533379 676818 835915 922109
19882 922109 1001829 1009848 1018261 1038507 1053262 891726 788136 653846 506999 394641 290489
19871 290489 336381 303293 283273 250824 287909 270149 220440 240127 170071 151427 85948
19860 85948 -7279 27078 124476 77381 133425 161551 108398 22414 29631 14598 4876 37189
19848 37189 80544 52654 70416 87393 157388 203724 221979 341521 430105 493519 574452
19837 574452 693286 878043 992422 1067963 1165306 1213811 1095442 898525 739707 711406
19827 711406 656448 551108 423359 383733 351797 296987 275344 139357 74708 -11627 47041
19816 47041 54215 73638 87998 77826 60374 34228 115734 168920 202438 190099 80922 6708
19804 6708 -17955 20089 28014 78873 60173 96527 178529 195586 195991 194651 128211 120104 121131
19791 121131 121802 74282 81652 138363 100936 139492 188931 145474 128502 40837 61286 -36024
19779 -36024 -100708 -138749 -126886 -66291 -131370 -91525 -5254 -93153 -176301 -135072 -142327 -17310
19767 -17310 85158 111087 39277 -20390 60984 100284 46080 -7005 -50760 -157610 -99006
19756 -99006 -66642 -126237 -127799 -97577 -114526 -216393 -191438 -131693 -134391 -31510 120973
19745 120973 86607 76340 140022 190177 225999 170717 99948 123619 179042 231843 149352
19734 149352 58460 -8834 -101023 -84479 28367 27184 49304 97429 54571 -25938 -13494
19723 -13494 18176 46177 114099 141225 145374 186366 143580 47677 40951 118241 69932 128613
19711 128613 174665 220410 92975 59014 67280 33758 -21662 -59114 -102443 8052 75625
19700 75625 60120 95643 160122 161417 146088 198833 201793 226289 298453 296815 219268 164192
19688 164192 166126 112938 25042 83375 131457 162370 237105 253011 229555 217927 140611 35950
19676 35950 3991 -41142 -41632 31743 -16536 -65053 -14538 70355 114705 165530 140503 50883
19664 50883 46696 18774 -13279 34365 17689 53362 95678 127334 117870 22167 -17536 2550
19652 2550 146066 167266 102147 109981 76058 -1495 52202 70942 50420 26774 62687 70399
19640 70399 78522 119295 168023 182686 189526 120450 108685 90483 132077 171084 251167 301416
19628 301416 208460 277216 223634 202378 192855 154657 100994 113640 127212 106345 188227 163587
19616 163587 123936 81270 69505 26793 -51335 -14495 69091 139951 100294 24305 -12206
19605 -12206 2947 63597 157925 122379 8365 73278 63563 122515 98051 31845 -40761 -23490
19593 -23490 39259 -3369 -41022 -62927 6357 106587 30246 40990 146293 136465 202930
19582 202930 205727 130549 8098 16618 93019 116105 135791 106974 113132 153620 185735 177307
19570 177307 104867 85589 128543 186242 251489 308549 238421 178603 168157 259967 329887
19559 329887 220393 165639 204658 207285 167791 246169 311013 280703 168558 90732 107861
19548 107861 129727 135569 207391 229698 194271 102891 16708 4977 108380 125623 108446
19537 108446 -28705 -112131 -56522 10036 168854 205414 227521 195404 115167 -28539 -47282
19526 -47282 -40577 -51421 -11164 13849 55905 96916 20824 -78987 -22385 43337 38465 45001
19514 45001 51828 102888 159769 88180 9428 54700 106418 130515 150083 95024 98375 126887
19502 126887 184083 231272 215918 270220 244519 181759 123417 117139 195026 211935 171800 157551
19490 157551 168385 171025 231306 252396 108603 70762 104115 240851 379689 476535 527776
19479 527776 580911 638340 633911 622792 581053 677116 678926 516097 520880 462125 415539 410163
19467 410163 414129 431038 475803 380227 318085 263777 205051 214049 286685 241047 159210 100814
19455 100814 183255 242863 145505 64214 95759 118839 188282 287472 276921 164706 129919
19444 129919 135113 201448 242099 257134 249724 259306 244749 255038 225200 206948 204754 301988
19432 301988 349236 335664 298283 283254 293898 287439 328003 391123 381095 449594 430802 374194
19420 374194 369973 366943 365890 380429 354858 440571 474677 411956 325953 343834 289605 245916
19408 245916 170594 202947 335870 347278 326164 281457 312319 278368 163741 104911 150429
19397 150429 278382 336718 273133 331876 363586 340817 298568 358172 393656 416327 447460
19386 447460 439804 440620 497330 565187 534104 450357 428834 386337 344959 344618 298114 327730
19374 327730 403894 324226 367064 371977 450685 485773 459378 465434 448055 492269 550893 577467
19362 577467 551660 516243 493218 529018 652083 732972 680266 657524 632456 594561 533830
19351 533830 494134 500985 524747 588689 680419 700734 619500 555267 542251 577791 569739 555473
19339 555473 647479 727664 787438 717664 683457 626790 503989 504121 584046 628264 696164 722696
19327 722696 629872 589300 612237 591721 546301 484287 537162 635543 661488 639851 628893
19316 628893 612476 596646 707987 802906 894793 983107 996915 1026878 1022283 1023013 1074531 1051481
19304 1051481 1031527 1094964 1072115 1089600 1080107 1109552 1180717 1166645 1141324 1196375 1336718
19293 1336718 1359363 1356368 1378140 1387869 1476587 1624430 1793966 1822324 1801413 1657970 1644374
19282 1644374 1690941 1627445 1608980 1671721 1740919 1805218 1790525 1812823 1864584 1948201 2065227
19271 2065227 2154586 2164628 2289380 2374468 2536827 2723523 2946131 3251032 3596177 3970629
19261 3970629 4406602 4761067 5035082 5198119 5274761 5328205 5352090 5381303 5465566 5668064
19251 5668064 5921284 6189665 6540026 6809888 7109048 7419734 7729555 8110263 8603466
19242 8603466 9332377 10169006 11124574 12317118 13782642 15552108 17679973 20243065 23438205
19233 23438205 27514005 32807548 39708617 48874071 61105526 77011719 96736677 119579439
19225 119579439 144063359 167736929 187330273 199965085 203597040 197437694 182713400
19218 182713400 162398964 139424807 116353757 95454244 77900081 63958640 53301582
19211 53301582 45205642 39186636 34627900 31152707 28407804 26316555 24806086 23723515
19203 23723515 22922480 22325922 22010356 22092140 22595824 23395371 24641678 26317250 28549163
19194 28549163 31551483 35472631 40685514 47622227 57011167 69867076 87330496 110483682
19186 110483682 139238068 171246914 200777835 220895602 226264387 215714774 192446832
19179 192446832 162789490 132893154 106631077 85578511 69300915 56931111 47473626
19172 47473626 40226103 34544533 30031890 26347612 23419665 20944929 18875994 17168420
19164 17168420 15763145 14570654 13428735 12480462 11699571 10971804 10291113 9633918 8914353
19155 8914353 8158625 7547151 7018698 6570266 6158704 5802897 5375836 5053103 4850407
19146 4850407 4694081 4602882 4406362 4269356 4178034 4085078 3952823 3767858 3528849 3333484
19136 3333484 3066212 2917909 2889123 2827078 2637472 2456345 2284954 2109036 1958433 1898282
19126 1898282 1838274 1682440 1618190 1536665 1502043 1494450 1483258 1518912 1520146 1488310 1498978
19115 1498978 1312098 1159742 1092501 1043582 1004066 1038233 1034484 953673 806756 792654 857825
19104 857825 787494 680964 694667 722930 734069 687279 757808 784410 693868 644146 589001
19093 589001 548847 531673 564159 559314 533873 519300 523226 578011 562098 536191 516810 376259
19081 376259 344063 333826 305991 324589 371355 482718 454662 335766 405095 452103 463910
19070 463910 446116 367400 295109 296640 332891 259839 216206 252361 225233 221151 252911 222759
19058 222759 223221 305248 431636 445118 393014 308815 294209 287658 279095 228773 211241 217788
19046 217788 213804 225360 178647 186146 249193 186859 118403 78982 199642 217226 288007 307790
19034 307790 234473 172706 236488 187629 201933 111373 60887 -29695 -38748 17612 69558 138418
19022 138418 115479 -8991 10497 114826 96444 49375 3507 133649 249138 214394 181064
19011 181064 141555 58237 36595 37182 47543 60230 87690 157593 210420 201308 182241 152661
18999 152661 212501 203139 204091 209081 169454 87730 78518 100721 85402 28108 52896 95593
18987 95593 34222 -59944 -33630 16655 -55097 -61228 -90540 -95871 -63599 -27420 26478 17983
18975 17983 104354 169511 112429 56807 -2247 15995 108350 58406 13425 84992 105661 70725
18963 70725 80651 46162 7302 7570 51111 76674 102502 68977 -57758 -32406 26820 -16334
18951 -16334 -51226 38794 98532 52698 29065 2089 34771 78739 16560 15650 104483 160099
18939 160099 110497 89196 87349 135131 126247 -11249 -33602 6289 50668 11076 34213 66026
18927 66026 -36344 -50295 23836 59673 41058 61890 67078 45546 14832 103529 106067 22097
18915 22097 -36220 9913 57114 71974 -5290 -1040 28571 29730 39150 67880 46331 61268
18903 61268 28259 10400 38207 82201 83015 66289 29920 52462 62472 100761 178892 187664
18891 187664 152216 116264 92015 113952 57138 21391 150503 164555 153335 77475 -26846
18880 -26846 -44978 -49581 9887 54118 21558 43633 53557 26944 -22327 63173 66166 116524
18868 116524 34891 -1426 77709 100741 -1262 10522 35780 115135 43716 14126 107438
18857 107438 70822 -18000 -76503 -72097 -11891 29713 84050 106387 42296 -11717 -20554 -20542
18845 -20542 62374 137032 82967 46797 54565 54430 43542 79031 153026 88708 47686 73156
18833 73156 153116 185302 185287 189342 99581 20803 95019 148421 153972 21651 -29711 -79010
18821 -79010 -117498 -121418 -112024 -101066 -24136 27303 -45041 -93197 -100616 -90666 -69337 -35617
18809 -35617 -120453 -76053 10357 68572 78681 77052 13602 77756 101281 131173 170892 190641
18797 190641 194104 215523 213346 150884 121853 125843 134628 175520 207971 158141 24216 -3604
18785 -3604 42552 117435 83940 8193 39789 95326 -10687 -51473 83865 119916 108108
18774 108108 16303 19960 111375 148731 77727 41035 128878 237220 271421 438577 694832
18763 694832 807902 775012 740497 567776 281139 100936 113743 242945 285189 137688
18753 137688 -5278 -46453 -35052 -29283 -18003 -30459 39044 -19474 -55583 -52610 -29996 -22250
18741 -22250 -59665 -39469 -27481 24836 66142 35891 -76194 -53454 -26888 17120 2304
18730 2304 -37758 -50404 -120566 -184575 -164521 -116341 -101924 -81739 -52742 287 -9757 40040
18718 40040 4782 -5093 -39501 2881 -24263 -137069 -153209 -130736 -102058 -147707 -129284 -14737
18706 -14737 5746 83431 136675 83540 40563 56954 77179 62987 70639 62518 37779 100118
18694 100118 118859 81604 72374 77017 95327 12885 32278 46995 27693 55182 65437 22246
18682 22246 13400 18560 15888 -2276 7175 85262 77329 59484 15322 -23879 -46028 -161866
18670 -161866 -115698 -107919 16278 129701 123673 35472 14495 36606 25412 5388 83653
18659 83653 146353 180145 184162 141922 57766 10858 84601 135610 79790 129664 101157 46627
18647 46627 7486 -9987 -4214 -48019 -47235 -72857 -131725 -2852 45891 52186 8868 6886
18635 6886 -28960 -45179 -12396 59573 78705 58868 33485 55839 -63440 -81106 -71792 -8145
18623 -8145 -61978 -74136 -75322 -110918 -113992 -76699 -86318 -118453 -137468 -124348 -107509 -52636
18611 -52636 -21033 7217 68593 54161 42826 22691 -19532 37212 88050 70778 53875 58262
18599 58262 60096 10004 -62394 -144528 -97687 -80005 -105389 -62315 -130889 -166453 -61614 59381
18587 59381 20047 -3879 29023 59835 148612 184364 209622 244222 205551 93990 -1729
18576 -1729 30108 108084 112513 143318 126627 65904 32699 -36253 88219 133851 196220 165701
18564 165701 167983 301445 396692 536477 592831 629458 681744 896550 1096739 1179109 1171185
18553 1171185 1125351 954743 851034 782270 700497 554621 419855 295625 211743 134762
18543 134762 141422 115387 56542 55388 76683 82439 170172 190219 186882 251487 262681 205233
18531 205233 189620 182061 276716 398824 506699 653046 912242 1174546 1238673 1160261 1092151
18520 1092151 1065497 957429 812176 664246 567129 518698 553283 420486 226280 62795
18510 62795 2140 -35182 36475 71905 145106 123366 129058 162839 138129 118228 90629 44791
18498 44791 65471 91644 78756 -31091 -128106 -187052 -149180 27900 72747 -24160 -116831
18487 -116831 -27060 -5960 9841 53634 68559 -15023 -4604 5344 39047 157365 119578
18476 119578 80570 48183 -6677 9017 15951 57779 150360 242898 238265 187945 218704 151244
18464 151244 105930 85673 11488 9995 12097 38199 -18969 -16227 53198 19277 33422 151473
18452 151473 189506 158889 147618 96738 97099 101639 72616 24246 34648 28247 5809 75556
18440 75556 37005 107526 197287 83175 37990 -22269 -27815 82091 97689 30710 34077 117583
18428 117583 75159 42628 45701 56407 68287 2006 -16766 39897 120356 145532 63138 53710
18416 53710 109408 120608 76895 60587 144156 119963 55406 80473 115758 44345 111624 201276
18404 201276 160907 70291 66576 57650 59851 14639 -38859 -30291 -78772 -99299 -86221 -83940
18392 -83940 -115226 -67495 20316 64697 43124 78222 50835 59216 89893 190294 191510 242377
18380 242377 285409 337066 383577 346469 286552 340695 431456 527201 549079 570805 518811
18369 518811 510525 443192 379253 322646 289978 324253 353270 407463 574753 663691 656050 729190
18357 729190 733531 652654 571295 568165 559365 574527 628212 566505 513761 529931 562306 642274
18345 642274 537200 479800 390670 359927 343393 250002 225682 274658 250610 223770 228582
18334 228582 203738 244115 233383 335745 361017 340847 336831 353162 384232 380454 341152 298144
18322 298144 321599 385259 373234 341404 357720 414794 502394 648760 758680 787927 841284
18311 841284 761181 809398 825914 690902 551780 530560 640650 749185 720301 615890
18301 615890 547568 479384 493199 510162 480621 428211 508538 586654 511705 510908 507100 472742
18289 472742 421444 409867 272998 214914 193372 160623 99717 86962 127093 88345 128680
18278 128680 123194 84871 138593 67807 79878 98602 96913 106694 129021 74124 47664 114986
18266 114986 137978 66275 -20300 -74585 -21647 4326 26700 20444 42363 26624 119664 112773
18254 112773 100311 111961 141749 96869 31346 -5739 -40654 26297 98391 90496 66853 102505
18242 102505 175424 138609 84425 94418 97863 110794 111796 83723 68746 66817 39055 8567
18230 8567 67741 127510 151515 207974 268378 236757 191313 158730 89488 -17774 28091 131911
18218 131911 152442 154805 163096 124095 33085 49517 110957 136746 133122 151411 186728 75674
18206 75674 4530 67719 82856 95452 98322 112158 169024 214507 179467 185240 225042 192670
18194 192670 194282 123461 132870 211516 253035 215092 175451 149157 42286 -5029 -25370 20400
18182 20400 19541 -11271 620 68449 96079 145778 182075 270518 218524 213075 225991 200535
18170 200535 175244 171954 226122 210584 221608 241603 310369 261470 277696 339784 281181 221861
18158 221861 232018 223896 87276 155418 252132 332348 272518 203072 235890 186063 275061
18147 275061 388504 381294 402573 377993 384790 388375 439283 504540 556532 608718 695747 662493
18135 662493 645598 722419 786532 824720 826372 878953 924993 953102 979597 1097930 1230059
18124 1230059 1358877 1516110 1712696 1950824 2178136 2553046 2927951 3440680 4059763
18115 4059763 4801298 5761449 7106861 9081135 12171289 17185548 26146722 43762269
18107 43762269 79610098 135594925 169273799 155158155 116596514 73341640 44342618
18100 44342618 29167834 20891132 15698611 12291725 9870649 8259041 6997350 6008800
18092 6008800 5142276 4436500 3899018 3480747 3292541 3045085 2720821 2461310 2285009
18083 2285009 2183649 1994549 1838233 1632314 1387611 1229486 1157874 1113721 1176600 1192171
18073 1192171 1139905 1147685 1081295 1091968 1041127 1011194 987067 958647 899518 780151 650004
18062 650004 611480 669156 611219 573093 642776 645339 558914 505840 482134 554149 537188 509471
18050 509471 406890 383351 394248 307457 266497 289980 308296 392747 467775 374907 337198
18039 337198 269437 279399 267070 251379 276281 326119 321006 335116 327651 282028 238307 170397
18027 170397 156426 232878 317699 378155 466532 464543 424548 389981 368188 303095 273102 339150
18015 339150 350061 288910 260825 254522 162694 213491 253101 253251 165196 155405 154969 143611 293958
18002 293958 418399 324584 188863 252915 385733 423811 303902 266193 272530 245454 175407
17991 175407 153714 158108 228388 246879 278510 318940 266508 331509 393858 451230 438472 438015
17979 438015 468776 525221 544209 546105 405910 362872 387687 355628 392328 424807 402592
17968 402592 420269 466176 483392 500186 484190 575618 624373 641847 591837 529592 585145
17957 585145 714504 679616 598239 473552 409001 448766 519858 501554 511244 561758 566845
17946 566845 559588 598434 667938 705635 621754 543606 465970 478475 515928 528990 598755 632921
17934 632921 631959 641018 701179 752946 764455 779031 756599 718543 783422 866675 857230 878468
17922 878468 955382 1007359 1050566 1112897 1228446 1252192 1283691 1306994 1316496 1417154 1532979
17911 1532979 1556713 1597609 1748380 1883583 2046231 2317280 2559155 2841165 3118380 3412595
17901 3412595 3753090 4082833 4428916 4821509 5203974 5780628 6638858 7985938 9840946
17892 9840946 12096238 14481740 17082132 19349533 20447756 20489323 19887585 18984147 18217175
17883 18217175 17874964 18164815 19721610 23171055 29064242 39190239 55404406 77386051
17875 77386051 101484593 127320157 155105144 176119271 183772360 181022731 170268132
17868 170268132 152480738 130225249 107621910 88434069 74906945 67053549 63540393
17861 63540393 62849341 64415762 66528160 65925717 61952462 55840060 48341214 40357040
17853 40357040 32892395 26461589 21613965 18416642 16519165 15423731 14735593 14308203
17845 14308203 14210685 14177359 14125947 14182351 14355075 14909030 16144410 18416157 22378229
17836 22378229 28479417 36189205 44354032 52726044 60925594 66530986 67858636 66553310
17828 66553310 64304727 62719242 63945285 69630335 81015724 99707315 125990189 154991142
17820 154991142 180264224 201620266 217362034 218211925 202638566 178027833 148745878
17813 148745878 118208442 90056226 66764212 49925998 38993895 32155533 28177033
17806 28177033 26383680 26150411 26727895 27583407 28756899 29317039 28214254 26027589 23215910
17797 23215910 19945668 16719229 13782263 11471136 9773220 8592308 7729434 7054356
17789 7054356 6400443 5790693 5256033 4756103 4196703 3734535 3458129 3087197 2854539
17780 2854539 2724113 2650521 2519711 2283407 2175439 2078351 1915363 1728147 1744843 1647921
17770 1647921 1507886 1375897 1221360 1107932 1067911 1010873 1015476 852496 769055 744248
17760 744248 654684 608902 573769 486379 495380 572679 609115 582514 475185 390853 408696
17749 408696 458053 328792 276375 274393 183209 211998 271995 343076 393493 376772 479485
17738 479485 452856 462058 426115 366550 294739 298912 248880 260394 230123 137078 182883 222646
17726 222646 316449 258078 173065 173635 167963 154741 125693 146458 149132 101098 44782 76599
17714 76599 205114 157832 106359 144059 147973 157951 169820 220598 179942 160381 176143 157201
17702 157201 170440 220836 268945 310746 380934 385344 463717 476418 484728 627578 847104
17691 847104 953732 1068905 1072313 1013134 869797 732074 611856 615222 616007 493964 421413
17680 421413 422855 425678 421111 562031 614465 780879 932223 947915 936747 877490 744646
17669 744646 661768 704377 756753 722256 602043 577741 552079 550698 536014 377762 315268
17658 315268 227082 192237 229363 148768 108232 65383 14794 126585 231709 231859 194093
17647 194093 212592 216319 205405 161583 204951 336312 375890 303722 233524 267694 323713
17636 323713 336178 419213 525046 549236 586036 483275 411749 397325 387878 446338 434661
17625 434661 469891 457506 429207 461764 498517 428336 347782 392431 486190 436881 308952
17614 308952 195581 79560 71880 128173 220687 200331 224783 218942 149706 136120 113563
17603 113563 164942 121598 99194 146006 154071 173581 81791 22884 -157 29742 87999 94014
17591 94014 107931 158428 144578 135641 161861 165693 231937 235357 186767 147216 44748 -21832
17579 -21832 53390 107663 59332 -4141 -4008 -22568 -11454 38912 132547 202467 169180 125916
17567 125916 127017 88145 123279 121861 66814 17412 53572 133953 113829 142703 168972 214999
17555 214999 180330 207611 164700 120966 116620 45407 -20528 14104 112128 64957 102722 210707
17543 210707 175949 187755 166642 197744 193164 119387 110626 182079 175607 137632 166659 174104
17531 174104 74956 -20757 48407 88747 104045 113763 50185 85452 165179 182457 101095 53425
17519 53425 72390 83622 15135 20228 38193 50780 86116 72201 66181 36705 -7885 47740
17507 47740 129669 104598 89529 49673 66456 76430 80562 100475 121904 81828 77545 95484
17495 95484 121901 89435 67968 90689 4542 -84065 -39532 51367 65408 68486 56912 147241
17483 147241 163127 62017 -56980 -95292 29562 135230 203330 138034 71615 37344 85573
17472 85573 12500 23268 8846 -74298 -151367 -127128 -18777 -7206 47085 -14470 -81168
17461 -81168 -111352 -65850 -79204 -22912 -26464 -51042 -30442 -28087 -18454 7130 28217 109589
17449 109589 148605 175574 184325 206632 268002 227996 293449 403656 612919 826789 1143213
17438 1143213 1146606 964457 744977 477971 352658 409309 451154 493045 538362 573769 564106
17427 564106 561719 514031 415846 435411 421282 284618 215624 207587 267694 233180 226844 201647
17415 201647 145448 127828 129109 157951 155689 98835 111895 155046 66305 -16842 -48243 -35221
17403 -35221 -56626 3110 111138 89327 36210 94025 154189 200780 178944 132008 45248
17392 45248 81439 159972 278274 356698 470626 535852 672610 724877 727167 658137 661812
17381 661812 703430 700869 695775 701739 764414 815646 937326 1045128 1116763 1119582 1073331 1028944
17369 1028944 920899 764697 588369 426636 353689 276256 316174 320389 249694 243032 293160
17358 293160 329551 412567 489645 483418 445968 380115 289234 203320 249568 276682 262430 254730
17346 254730 154776 147143 264314 304266 283565 303269 303688 317554 380212 416998 614383 826292
17334 826292 888548 842175 849563 821936 816417 858035 967495 987738 984792 916345 839235 665236
17322 665236 463005 445724 523366 590408 665679 759851 900836 1049381 1149378 1202440 1158664
17311 1158664 1158848 1051430 850980 628381 544233 483716 340411 257771 297284 371029 308365
17300 308365 279038 283817 347385 275319 283047 357315 397416 429267 335182 308353 347572 392559
17288 392559 337182 316778 346439 366350 431149 460993 465255 328871 252609 274001 282665 297904
17276 297904 306175 366212 391778 384612 324912 351407 309815 367695 382116 406011 452127 386521
17264 386521 374249 342320 305124 271643 331758 368915 306834 320013 365707 445624 424939
17253 424939 388856 382988 537939 528475 467897 451018 440677 487439 443610 500830 606683
17242 606683 680505 677198 616425 669795 782363 760708 786034 698501 738680 761179 880515
17231 880515 994725 1136482 1193319 1261055 1394582 1482837 1516128 1604630 1648511 1761041 1921972
17220 1921972 2158199 2402619 2696963 3067112 3572560 4122881 4758837 5530469 6258376
17211 6258376 6977465 8081654 10031963 13335153 18085695 23599387 28001153 29453998
17203 29453998 27784984 24252554 20838315 18758087 18207149 18861664 20569819 23529906
17195 23529906 28664687 37033460 51130056 75652435 115210067 168437145 223591806
17188 223591806 260012795 266525236 245333003 208430487 167540984 130141273 99879114
17181 99879114 77842409 64046774 57676125 58042182 64377310 74259493 82614715 83685922
17173 83685922 76077513 62814268 48566363 36840435 28591731 23228661 19875039 17665383
17165 17665383 16273592 15381272 14608080 13907009 13349132 12978513 12816879 12753483 12843620
17156 12843620 13131893 13708834 14864888 17081124 21059395 27663141 37916669 51381761
17148 51381761 64975397 73268646 73148557 66521470 57665274 50961368 49054916 53272990
17140 53272990 64547937 83375958 109160454 140429175 175602100 208488001 228290535
17133 228290535 222741862 192854613 149741702 107713750 75619833 54304984 40866295
17126 40866295 32443038 26903943 23159060 20586931 18999352 18549343 19593976 21984064
17118 21984064 24730058 26350217 25577445 22570563 18521453 14792324 12051932 10175895
17110 10175895 8932508 7882119 6948519 6073429 5253470 4633114 4091855 3586296 3303188
17101 3303188 3040057 2817446 2723683 2606951 2463453 2381764 2235998 2109722 2045264 1977626
17091 1977626 1862539 1787258 1603914 1509412 1427445 1305087 1212562 1108698 1072768 1074651 1003827
17080 1003827 889489 872002 865424 864724 855808 840114 728494 585192 555117 484538 422304
17069 422304 527848 591414 540751 481989 417235 341245 346491 385708 380795 329282 395297 477930
17057 477930 521980 495618 415894 439831 425333 446503 478526 486662 421238 359031 433003 476152
17045 476152 378632 266655 282761 256407 269642 269919 189595 99667 97908 149997 288499 328677
17033 328677 304197 240507 219446 245501 251048 194049 88458 99567 85608 84080 109831 113898
17021 113898 166866 114850 182643 234232 177207 120380 102063 59247 33646 49107 47832 34277
17009 34277 86080 169852 109615 62453 39065 -19569 -5029 56832 103406 113838 77984 46536
16997 46536 36597 -12161 56353 102019 6952 -23464 63007 173137 19154 -113869 -52475
16986 -52475 1256 14942 90147 141255 175785 239306 242806 180732 189251 144416 91217 33308
16974 33308 -34057 -71801 -129531 -112886 -41608 -28865 -11896 -33955 -2034 28793 3436 -8940
16962 -8940 78323 179264 163865 120669 115420 50269 -10503 -41482 2569 5960 -43263 -69595
16950 -69595 -22650 55888 146051 103153 -55014 -59003 -46529 -44453 -29251 29758 80713 21014
16938 21014 23233 58789 51355 84678 99260 102398 81067 42558 44372 48876 51446 47077 32601
16925 32601 158 33739 47108 83137 97187 73030 162399 243494 174923 143583 127698 96014
16913 96014 98021 107020 56938 8538 -33431 23669 97546 22020 11841 64785 80841 -19359
16901 -19359 -49605 -79752 -50662 -877 29624 32993 -12003 -86231 -67713 -118461 -87153 -76369
16889 -76369 27554 2104 -1574 -548 47692 55124 93768 121867 51552 70433 49908 35238
16877 35238 -40309 -90061 -48643 -94796 -179506 -77652 -73381 -9301 39967 9676 -44410 -56177
16865 -56177 -43427 -7201 59267 64708 51373 -10131 25052 154449 236106 182101 63141
16854 63141 -5519 -84983 -43207 20632 -49742 -153069 -101183 -114573 -125074 -144623 -78580
16843 -78580 60468 153839 127244 98101 94237 85611 84762 118347 72839 28384 63255 79711
16831 79711 40151 -6191 -60044 -69391 -47843 -62671 -47464 -14971 59060 103118 108947 23453
16819 23453 -80709 -59101 8032 -33745 -74002 -138125 -254279 -205856 -118704 -87125 -123259
16808 -123259 -29428 28606 -16360 -15413 -67997 -80924 -2305 1242 -35469 -131731 -212040 -272654
16796 -272654 -251352 -126044 -58451 -81038 -66728 -72951 -22397 -27905 -96577 -121897 -43844 60444
16784 60444 57068 -14994 -100923 -117561 -33153 -19678 10228 -13456 -59645 -108622 -80559 -30806
16772 -30806 -55032 -47036 9708 -103835 -78028 4118 38950 74034 -3193 -36711 10341 111908
16760 111908 90939 -209 -48183 -93860 -141066 -125652 -98354 -75002 -91068 -83719 -66343 -85196
16748 -85196 -31292 -115770 -177428 -168885 -195055 -203110 -193574 -197137 -139248 -88974 -96384 -128846 -84547
16735 -84547 -10547 26019 19492 -77264 -129146 -73786 -78550 -22987 21185 -45583 -8643 -9592
16723 -9592 -74153 -109781 -195675 -166625 -102878 17265 40119 41032 -1920 -54682 -156046 -208958
16711 -208958 -103247 -62555 658 36957 31934 96920 195125 185154 197532 185116 165809 254022
16699 254022 247492 275224 400830 489423 541560 686184 696954 631239 539018 500048 483808
16688 483808 485298 471443 386855 373361 438776 549695 666668 708704 756133 659337 483048
16677 483048 332382 198361 198121 214947 210524 231127 127361 71144 153123 207533 255312
16666 255312 291812 238937 149117 142916 97719 49161 132341 129151 118824 100338 91503 9869
16654 9869 -25848 50069 206745 222956 350222 528459 513133 486908 582168 582519 585503 616095
16642 616095 607348 660394 679406 632388 474727 415294 357808 280355 157925 102438 102930 210411
16630 210411 313400 346613 349511 419656 554925 626122 708408 689427 532958 435459 321921
16619 321921 186719 119700 73851 50833 36535 -48713 -53089 9577 30471 -71086 -119773
16608 -119773 -117803 -107309 -22335 18572 -67533 -128191 -114139 -173623 -258739 -358328 -261735 -232212
16596 -232212 -122508 -49116 -94752 -198919 -151839 -111624 -140880 -152258 -125733 -83226 -1804
16585 -1804 14065 28588 25403 -40797 -45567 -16598 -15888 -397 8986 -109461 -224005 -267392
16573 -267392 -265455 -232355 -266262 -271512 -175023 -102238 -91623 -93817 -106094 -113995 -142123 -54014
16561 -54014 -88710 -114652 -95042 -70022 -38925 15710 -7646 -97018 -81085 -51801 -45571 1135
16549 1135 -4260 -79621 -33694 -7511 -48521 -47246 14096 36008 60152 57271 -13268 -29595
16537 -29595 -6855 -28232 -64526 9581 -3575 21114 -11795 -30349 -90670 -127105 -115967 -89832
16525 -89832 -39709 -51970 -102560 -254429 -284282 -290806 -220605 -103796 11546 78976 66175
16514 66175 -12318 -83520 -87033 -21751 3891 -67468 -128607 -92830 -42143 -48387 -17631 -17498
16502 -17498 -41013 -33017 59965 -17816 -67371 -134540 -85385 -117191 -148259 -104436 12640 7449
16490 7449 31550 45832 8356 -88383 -124879 -36699 20983 -627 -43930 -81294 -64775 -105562
16478 -105562 -26316 -95361 -111671 -23271 35674 6861 5938 -21717 -27528 -97366 -122392 -121162
16466 -121162 -127348 -70321 -24803 -3206 20016 78297 149106 92983 70258 57703 -44611
16455 -44611 -112795 -198651 -172209 -72872 16269 12520 -86289 -143154 -110268 -70015 -25876 -18718
16443 -18718 22789 59997 7817 -8185 -2026 -19904 -154088 -182808 -105611 -15746 -14462 37909
16431 37909 86917 -4201 -67183 -15657 41764 -12444 -26159 29158 10588 -28230 -76843 -146472
16419 -146472 -174267 -194368 -196503 -205749 -138206 -71891 -75801 -77879 -46137 -29633 -21942 -19794 3774
16406 3774 -72932 -91299 -158196 -162096 -109215 -76738 -68680 -113358 -27747 -98431 -182706 -192150
16394 -192150 -147206 -122997 -92733 -5647 20921 -110616 -58239 -59559 -62179 -1963 -11218 -26803
16382 -26803 -27369 -30176 -115765 -82767 -4270 -57119 -72627 -93305 -164049 -147959 -47570 -38166
16370 -38166 -127765 -151779 -168861 -117477 -46262 -8840 62521 52810 8129 -69222 -105293 -33889
16358 -33889 -47903 -111336 -136156 -87408 -122131 -126608 -115020 4730 107587 108664 17236 -43059
16346 -43059 -41068 -32659 -97526 -92394 -372 -25695 -60000 -135072 -185515 -231276 -265074 -249780
16334 -249780 -161592 -130573 -41115 -46905 -95332 -172056 -251979 -279372 -202234 -103762 -23834 -853
16322 -853 29259 83427 80065 -43512 -63449 -78904 -91781 -126799 -183165 -97701 7624 17191
16310 17191 -15073 -63987 -92198 -117887 -109703 -56250 -26341 -45018 -83384 -39495 -16360 -4895
16298 -4895 22442 -23972 -106758 -115216 -143792 -159944 -143278 -140399 -143061 -117140 -78899 -54526
16286 -54526 -51731 -92934 -62735 -36166 -102841 -176484 -189512 -118702 -47325 -15905 -2046 -3795
16274 -3795 -17967 -3812 -6465 2806 -28511 -118580 -144615 -91192 -169413 -138989 -49136 -77478
16262 -77478 -140259 -95306 53341 30402 -35875 -57554 -119454 -174459 -223860 -271181 -263016 -277671
16250 -277671 -238599 -205520 -156480 -112731 -45359 721 -24326 -31226 -17359 -64761 -104038 -95428
16238 -95428 -34798 -70266 -124574 -135496 -116955 -90916 -101516 -126038 -108750 -74025 -66764 -118269
16226 -118269 -131533 -95576 -119020 -125125 -120276 -99411 -96783 -78528 -7016 66121 -8396 -66692
16214 -66692 -103209 -170738 -144851 -68347 -46376 -83152 -97914 -142349 -182076 -183268 -169599 -181514
16202 -181514 -202696 -159399 -137429 -91749 -22955 -3293 -29011 -88279 -106488 -145231 -169692
16191 -169692 -142154 -127756 -148561 -115328 -29989 4313 23250 -20900 -65109 -35474 12776
16180 12776 -1413 -68420 -51902 -95777 -86385 -180785 -253177 -288839 -246520 -119656 -110210 -104336
16168 -104336 -127644 -156842 -88429 -38759 -97566 -200736 -119836 -23386 -91040 -87880 -34050
16157 -34050 -37829 38430 71716 9499 -6976 -18990 -57035 -92669 -58492 -135153 -155130 -100980
16145 -100980 -100158 -112835 -138317 -52085 22839 54510 29386 17098 37866 43589 -5339 -29417
16133 -29417 -135116 -135386 -138838 -224945 -243157 -270259 -274708 -212225 -112169 -56118 -22564 13319
16121 13319 4685 83742 121842 67885 -11396 -69539 -129935 -133537 -58525 -24370 -17458 4921
16109 4921 -50721 -4921 23752 -28950 -123524 -121406 -78706 -39606 -109587 -57645 34141 -6345
16097 -6345 -43897 -97282 -165857 -122621 -6558 114229 156109 130803 108631 140491 141305 91469
16085 91469 109292 -32987 -40684 -38675 34553 121504 75655 55904 -35214 -97990 -124496 -160272
16073 -160272 -155900 -131472 -103891 -17379 35951 -6333 -18581 -11729 26340 33921 -35123 -111432
16061 -111432 -96619 -152076 -118547 -85221 -27631 85461 142759 120991 84254 72625 41021
16050 41021 -91213 -146190 -80994 -51645 -77584 -94596 -93448 -28083 -7361 11016 37185 109277
16038 109277 128471 132805 67943 9729 -1489 69588 125779 27936 -65728 -65208 -34122 -73594
16026 -73594 -141056 -82121 -15003 -49398 -45893 -23449 -14033 -85637 -126814 -51977 -18789 -24935
16014 -24935 51331 99303 50081 51749 45624 -11577 -129100 -130460 -158997 -133103 -89733 -97871
16002 -97871 -105355 -45582 9531 21933 66584 17784 -60857 -71667 -85368 -80755 -27302 -53712
15990 -53712 -87033 -109282 -111350 -24035 -28998 -46268 -103448 -88698 -112210 -134015 -57138 -16589
15978 -16589 -14928 4642 -70443 -108387 -8370 5912 -112198 -157508 -114912 -157189 -191739
15967 -191739 -166626 -101576 -94861 -84134 -55747 -71323 -91060 -111555 -102669 473 80261 12222
15955 12222 -78655 -107502 -126594 -125497 -64743 -89899 -64466 -26009 -71607 -73256 -43986 14057
15943 14057 39057 -12393 -102297 -73576 -43571 -44133 -62573 -92872 33739 92776 2814 -52468
15931 -52468 -69051 -31934 -55058 -68233 -44030 53385 56390 -30874 -32688 6896 13107 -30469
15919 -30469 -141357 -120571 -100726 -50668 -39722 -73098 12045 78987 40247 -17447 -28351
15908 -28351 -57215 -89276 -133542 -140164 -94723 -43002 -6293 -43576 -118017 -197536 -183382 -142470
15896 -142470 -70269 -35734 6432 49226 -31994 -67235 -91641 -44890 -83502 -103279 -29161
15885 -29161 -59236 -103690 -101227 -136918 -98553 -54897 17846 4249 -6470 -11480 77763 133135
15873 133135 138548 163589 18265 -12705 -31731 1878 114525 163596 50823 -64228 -102237
15862 -102237 -75139 -28566 45557 -9891 -98850 -109886 -38690 59882 85616 30889 -70721
15851 -70721 -51580 -18138 -41302 -16170 -99013 -153713 -132160 -30683 -21020 -89474 -87664 -153107
15839 -153107 -86830 -28134 -69347 -37950 -48600 -206732 -233211 -219848 -225427 -185662 -237124
15828 -237124 -290832 -346565 -333089 -193942 -56936 -26302 21159 -6918 -74190 -162246 -113359
15817 -113359 -5890 15150 -16747 55242 133253 209113 206405 114272 -7551 -40580 -59889
15806 -59889 -104850 -110760 -76343 -5819 64350 -27462 -65462 40608 100288 206126 197678 142460
15794 142460 76852 -18933 -48153 -48092 -38568 -44208 -7181 -6366 -1389 9950 11876 -47619 -109966
15781 -109966 -117260 20712 52910 85300 146899 90095 8999 -31543 -33530 12192 -33450 14973
15769 14973 105443 106295 132973 166153 124514 111581 154614 171876 153931 102723 89766 129924
15757 129924 164267 225529 224687 15974 -17312 40874 -22077 -1103 20415 -33208 -52297 -83700
15745 -83700 -45465 -21801 -31149 -64567 -20946 -3801 55587 93612 118403 71118 -30400 -46226
15733 -46226 -41067 -95807 -82997 -65170 -47015 -26048 -81095 -169406 -128270 -127629 -74914 -86079
15721 -86079 -115027 -115887 -88636 -71661 -69545 -135514 -139506 -198546 -207788 -196097 -170696 -92235 -26706
15708 -26706 -16210 -24552 -47058 -34299 -32007 -80564 -115860 -104114 -115857 -124611 -50688 7780
15696 7780 11248 -26122 38184 5149 -30929 -52200 -51781 -29248 -23458 -11636 -92613 -115750 -6975
15683 -6975 82183 62112 55462 35984 -3355 -64630 -20580 -30511 -35443 -57833 -91503 -134594
15671 -134594 -137204 -134171 -110039 -102827 -85067 4719 27641 22361 -8762 17518 80779 97334
15659 97334 81410 95539 96444 67973 21811 24387 -26091 -86995 -94158 -141012 -104982 -9940
15647 -9940 -5754 3166 15353 127851 95629 -35280 -10573 -88857 -163372 -138996 -70581 -135074
15635 -135074 -171125 -135069 -73909 -49165 -67197 -122198 -135921 -134637 -87550 -97374 -105722 -105674 -125653
15622 -125653 -93799 -136517 -197345 -202156 -45311 4405 -1273 -87256 -175898 -189946 -207695 -125248
15610 -125248 -102674 -119662 -65638 -65115 -116828 -68852 -9597 23521 2824 36055 133073 176023
15598 176023 102320 -15490 31824 19259 -16287 -16728 -3949 33104 -97738 -96184 11374
15587 11374 4217 -78696 -106133 -76483 -36889 -49058 -76077 -56594 13446 103752 60665 -32802
15575 -32802 -51582 -58243 49726 94981 13821 -49248 34851 56588 8764 -74230 -54003 -54763
15563 -54763 -94931 -113333 -97879 -175072 -107680 -15713 40159 13955 -41765 -72616 -83119 -94127
15551 -94127 -20844 -18306 -108400 -147726 -166669 -156822 -139198 -61965 2883 54937 50005 17980
15539 17980 30134 58034 59001 7621 -61262 -64384 -48265 -95275 -127561 -121623 -46980 -57897
15527 -57897 -69223 -27279 31321 42820 408 -11227 -28857 18296 78864 139619 55263 23311
15515 23311 98232 41652 29154 -1142 -10127 -59284 -90154 -83131 -56177 31206 102994 153122
15503 153122 76483 7697 -82465 -122668 -109513 -46874 54939 -41820 -119436 -165389 -155112
15492 -155112 -56609 -53288 50715 83334 26948 -30686 -13335 -49155 -20661 27322 35757 30169
15480 30169 -1100 -3757 108925 101741 126856 57309 -27251 -115153 -193497 -190050 -86056 -107283
15468 -107283 -125717 -51708 -47238 -77902 -86609 -88957 -75981 -95383 -115616 -116492 -103893 -38731
15456 -38731 40053 -4731 -105481 -126139 -168009 -127486 -53275 -33721 48732 70833 31895
15445 31895 12440 34887 47649 128030 146505 61345 -27651 -60945 -102395 -100037 -95289 -52600
15433 -52600 -47821 -46829 -16053 -55798 -105107 -93016 -140627 -66055 -81014 -106958 -81932 -76047
15421 -76047 -19924 -2855 4439 47232 9287 40784 -8244 -74608 -81386 21342 57054 34079
15409 34079 10267 37278 38152 -10149 -112943 -59922 -98338 -92518 -15526 24061 -11150 -3057
15397 -3057 -3766 -39240 -12875 -8893 9726 -25396 -63613 -85105 -40869 113373 166648 180504
15385 180504 108404 -12477 -99397 -72150 -11968 44085 110940 72931 -50626 -141793 -116756
15374 -116756 -207172 -187192 -108446 -37620 -53729 -59076 -48560 -6572 86942 147048 145047 59161
15362 59161 19646 23497 70429 75557 52032 34216 -6037 55819 46038 -93356 -206290 -193138
15350 -193138 -127912 -104307 10562 101195 82015 12130 -88105 -81136 -30009 -17706 11622
15339 11622 -26048 3445 47802 39776 -22531 -46386 -84702 -52995 35082 -4526 -63131 -66802
15327 -66802 -11895 37898 84104 97035 80635 21411 -96579 -77875 -68713 -144465 -69172 -9238
15315 -9238 72987 25226 -29197 33966 29246 -27531 -90221 -128041 -56067 27813 69575 43487
15303 43487 76515 147682 162718 166554 161464 248945 322959 381736 389876 489132 688501 903588
15291 903588 1194382 1477901 1717512 1994030 2307951 2571216 2588462 2438451 2298261 2048403
15281 2048403 1669939 1335317 1072133 777034 623383 501948 343258 326985 368733 388147
15271 388147 280430 176975 130976 134900 118408 186420 193086 176744 92504 18783 -27643
15260 -27643 21441 71484 101061 77100 68477 24129 94238 155191 74816 50229 105973 41549
15248 41549 22688 13006 -16408 10615 85097 86488 69969 35105 31506 96252 103245 34967
15236 34967 65157 3322 43885 78022 15766 33835 89801 64745 34221 -650 66389 34976
15224 34976 18957 -88632 -80703 -39600 -9376 69196 82721 110007 112920 183329 236610 317348
15212 317348 368347 513656 616687 570459 550156 547224 608877 618905 539327 437683 349207
15201 349207 346758 298299 217117 219999 176685 196278 154106 42368 138868 181913 152327 138989
15189 138989 90532 67642 73144 64771 87689 89183 42672 -20506 33392 134642 107646 88318
15177 88318 26231 -8657 -69354 -129589 -136344 -123134 -93199 19987 71906 17947 -42835 45257
15165 45257 114547 -11996 -52916 83853 44819 -89359 -100247 -23871 32038 -44566 -94109
15154 -94109 -128514 -65197 -37660 -38272 112791 185195 139478 146433 134088 34625 2854 21552
15142 21552 -15851 120025 231867 131335 31054 -5372 -68999 -5360 17604 68611 95990
15131 95990 147967 72347 -6846 -37994 61870 112663 132238 162890 78493 38934 80883 50126
15119 50126 -113479 -187680 -101145 -74694 -46279 682 -28485 -46712 58290 82890 39421
15108 39421 48966 70882 100910 21210 -31847 -30328 45919 149395 152937 168977 247524 290350
15096 290350 315276 348661 318763 243570 289936 308164 200994 188392 113711 -25612 -66815
15085 -66815 -45772 -105595 -45162 1593 -22148 16535 69035 101363 127835 68301 -17128 -80525
15073 -80525 -108583 -154495 -183234 -156931 -28802 5844 -20014 -84466 -27383 -45247 -115298
15062 -115298 -104343 -22729 26102 14561 7104 -53834 9584 85384 159227 210071 122943 92864
15050 92864 24599 85278 120380 157935 192941 243239 240762 216255 248247 179576 180595 224598
15038 224598 343820 443320 439460 431704 459756 466862 463438 427593 392389 313951 340686 412069
15026 412069 429847 382987 340577 273983 190384 145740 108555 151642 228305 128065 106852
15015 106852 101845 70212 125193 77597 15928 -13824 61544 127218 140953 165797 108348 168131
15003 168131 187406 209906 292437 399408 423526 378972 424634 448907 456992 596686 762521
14992 762521 1185072 1411821 1281192 1019258 745376 566237 450996 445488 382434 280698
14982 280698 226268 136696 28966 45294 149157 46196 93647 97494 77703 140101 186382
14971 186382 226908 227256 284239 330157 390440 359289 317003 262300 174422 101694 104050 192583
14959 192583 250156 160079 160544 262596 249197 290206 297610 360845 331253 372870 408396 343810
14947 343810 296527 252519 193539 165112 188311 265482 266468 315791 375947 397079 391729 364665
14935 364665 364991 307426 264991 287254 371806 489579 425405 330125 339217 231539 282624 341243
14923 341243 483447 417818 378106 405611 413543 399467 414625 484107 534900 484665 429796
14912 429796 454865 578214 612587 652711 705469 672141 704449 828092 799896 746732 744141
14901 744141 813774 908518 951514 956207 955055 1098925 1186486 1139821 1070783 1161616 1306642
14890 1306642 1410076 1410080 1559806 1784018 1949004 2202511 2353132 2496720 2639861 2882091
14880 2882091 3075844 3270573 3491519 3671027 3886557 4046613 4164131 4353935 4664210
14871 4664210 4972801 5342766 5726374 6092672 6617199 7326349 8317780 9587112 11391214
14862 11391214 13520335 15899002 18495863 21317427 24298743 27526127 31064365 35524404
14854 35524404 41618586 50557589 64546172 86526879 119029131 162974327 217836394
14847 217836394 281405374 348318276 409839840 457089844 484096890 487469094 466404267
14840 466404267 423738741 366310798 302914940 241244359 186493322 141697817 107793012
14833 107793012 83886080 67722124 56726016 49021610 43279854 38838890 35019742
14826 35019742 31600078 28477553 25467421 22585340 19988672 17540406 15403236 13715757
14818 13715757 12325491 11083377 10045871 9188500 8394918 7737476 7165463 6646734 6219992
14809 6219992 5980515 5764920 5428924 5210145 5042604 4844338 4577262 4314311 4139305
14800 4139305 3955605 3778120 3535166 3246527 2981980 2808602 2571520 2285633 2153406
14791 2153406 2081543 1986989 1891129 1821993 1663823 1529374 1454787 1431208 1346260 1372108 1428995
14780 1428995 1417991 1420429 1305355 1221992 1136082 1083128 1070370 1042949 1096267 1137686 1085217
14769 1085217 1075009 1099784 1090398 1078865 996040 950137 895417 752031 696818 694737 688672 615255
14757 615255 521720 548678 613946 642456 554135 447374 427652 437652 367603 403724 435671
14746 435671 466170 466994 408295 391475 380024 373463 359098 343230 374364 354414 414023 473817
14734 473817 421416 308007 320757 265044 247960 231697 164042 213199 286890 319085 364950
14723 364950 264421 274804 249853 267882 288436 299339 322975 245048 147368 222106 307927
14712 307927 310552 229392 267156 308891 332852 325068 211829 182040 206050 218868 195192 261082
14700 261082 385482 311931 293804 208671 233887 251985 182388 173300 168817 136392 163035 97736
14688 97736 83219 81287 70934 131904 145613 34421 76572 24512 -17074 -10577 60511 45604
14676 45604 101761 177303 269062 296438 397871 400856 381492 302017 320126 245766 178632 69914
14664 69914 -4309 -35867 -39138 -12811 -76067 -27589 -55630 -52117 -12280 63948 35222 20495
14652 20495 -25405 -56105 -78365 -64358 14764 25622 -34104 -101571 -134607 -177841 -182205 -19687
14640 -19687 6265 90836 189646 212077 132676 -3178 -9607 89387 132183 29542 -57787
14629 -57787 -47445 25525 34580 14786 -7979 18825 127883 155690 116628 120520 -6464 -26190
14617 -26190 -12924 -86461 -79407 -14625 133048 143650 121027 92275 64114 -20806 55398 57075
14605 57075 -31046 2885 17183 -19536 -8742 5508 55831 47233 28537 3560 46566 3088
14593 3088 39109 80361 161573 128601 73462 -10068 -80408 -85325 -48567 35147 96319 100140
14581 100140 80568 98679 115210 160204 92970 63458 19 111 -9789 78481 86960 35337
14569 35337 3154 -10203 -32424 14213 -22445 -7529 11575 -7918 49412 102698 47047 -10004
14557 -10004 -102926 -110895 -21654 31891 103671 88475 -2740 -24436 -12861 23108 84542 196771
14545 196771 175729 160330 92748 43172 3075 4299 -84740 -113124 -48655 -45101 -109225 -109713
14533 -109713 -141005 -206216 -205868 -199286 -151405 -78610 12695 23434 1816 -40795 -46647 -28313
14521 -28313 -46836 -46864 -37016 -21452 -10455 19378 -117446 -89783 42464 82244 100111 108772
14509 108772 136923 132982 161667 109263 60100 97836 163379 98674 34377 61156 114165 120259
14497 120259 163543 105660 -53350 30513 -7766 -16382 24926 -83758 -113376 -51909 7952
14486 7952 -34413 -20783 -28909 -17507 91841 36290 82603 116684 106394 102608 102258 139683
14474 139683 158029 134268 53467 98147 251706 172837 55253 -17013 -18863 61678 68662
14463 68662 -8014 46861 100008 59115 17399 -17855 10527 8864 -19670 -102133 -48661 -47266
14451 -47266 9492 47772 104981 85347 72398 23930 3524 15332 -42800 -102314 -85525 -31756
14439 -31756 27172 63573 127739 148737 72256 58321 31588 57370 65618 17314 12203 8938
14427 8938 -8323 41578 151078 175267 144526 25013 -1107 67404 47366 38034 59956 68935
14415 68935 -1315 22401 97377 146147 88663 46722 122815 86605 61891 69723 106108 269818
14403 269818 205507 328592 613389 903108 1085162 1268911 1583136 1913735 2173845 2437609
14393 2437609 2490937 2394372 2245969 1966420 1632882 1306987 956308 650839 517661 388535
14383 388535 366381 378424 275137 145908 27361 -39550 -14799 -7791 54347 8906 10994
14372 10994 -40036 -109591 -118141 -49838 -19592 412 -12614 47399 103933 138257 178116 203902
14360 203902 190184 149355 121864 89806 5611 -7071 93696 133049 46995 -6859 24999
14349 24999 -20131 -29782 -22869 20577 67791 23959 21290 40077 18136 -19595 43200 53774
14337 53774 40807 -41957 -32430 37038 64437 48943 63223 91732 134619 186802 134993 54093
14325 54093 29990 18128 23127 47348 21909 78158 77805 41149 26350 -14517 -79136 -51273
14313 -51273 -44421 -119308 -68548 -88964 -128418 -52847 -88155 -121489 -67356 -18686 14792 3600
14301 3600 -6253 4330 22117 37479 58221 3128 -162970 -175631 -152321 7660 125831
14290 125831 86644 13872 -13419 34963 46057 108196 178281 110614 76908 17064 740
14279 740 -34322 -98999 -39453 -52742 -37130 71385 155428 193149 79026 -55988 -116334
14268 -116334 -113945 -64693 -18591 -14235 -12041 -30967 -53733 -62002 -47439 -94786 -29065 13403
14256 13403 -94172 -87295 8153 87535 80340 52326 97613 40891 45183 89441 59904 68294
14244 68294 134476 202629 81840 -26538 -38803 -21835 30224 -28699 -69106 -14500 50143
14233 50143 29499 24391 60298 -41725 -14935 -54714 4148 39380 -7830 -11191 -37866 -903
14221 -903 -17201 -29192 1362 -11097 -8238 12008 57498 85105 129082 125047 81576 23744
14209 23744 34971 67574 39966 18718 57333 61166 -60383 -55983 82516 115050 42378 23811
14197 23811 16599 -1495 42139 46998 27225 23113 -8383 -64045 -68679 -68366 -84582 -30018 -57666
14184 -57666 -71062 -109906 -137710 -184293 -187632 -87019 -54040 -125113 -79133 -18736 50921 -39203
14172 -39203 -51279 -61564 -73310 -111497 -95208 -74610 -108604 -101538 808 58246 88807 103738
14160 103738 26389 92272 93179 138895 61051 72848 150397 128657 85941 39020 -3406 -43339
14148 -43339 -26127 -62319 21866 97429 -8877 -52607 -90341 -125643 -104242 -139800 -96529
14137 -96529 -119839 -72832 37805 102494 176497 178041 90749 51863 50599 26102 -21866 -114289
14125 -114289 -163336 -58973 1621 -49136 -71474 -44010 -98030 -120048 -9589 -82024 -97152
14114 -97152 -8168 66672 94044 172735 165170 57259 20736 -104242 -94375 -1439 39633 31966
14102 31966 8790 -9409 49546 65846 62363 48855 -60605 -172692 -138474 -46790 4002
14091 4002 11959 10263 53358 100160 24239 -98124 -1765 245 56461 98129 95470 12594
14079 12594 -43509 -4474 -49897 -67680 33342 58010 -82485 -90511 33914 87379 25451
14068 25451 45540 24569 85981 100453 -15124 -63123 -82133 -62076 -80969 -91633 -40560
14057 -40560 129428 210388 222372 40577 -95260 -119440 -84412 -115420 -161209 -153616 -118227
14046 -118227 -151784 -174421 -126077 -36113 49316 80427 28493 -93691 -112012 -70239 2867
14035 2867 47378 36647 17300 -55280 -130402 -111127 6585 18333 -11313 38922 92566 134297
14023 134297 100766 25281 72897 44464 -67927 -58909 19220 55879 28281 78621 94586
14012 94586 58686 40432 -18959 63689 122736 52445 -8271 53892 86822 74762 16813 111076
14000 111076 166931 189220 171828 135461 113566 -19181 -30533 95315 138919 133150 65878
13989 65878 5523 -19126 -47667 -28060 -93046 -99432 -170162 -210529 -147837 -84433 -146131 -143510
13977 -143510 -63975 -124590 -113951 -85094 -44334 -83288 -134354 -122225 -72225 -70057 -83704 -86905
13965 -86905 -81567 22473 75876 8521 26719 -59694 -86342 -89449 -30751 16806 39417 89875
13953 89875 142116 123218 115043 102752 157433 178131 157606 109450 105778 75060 63023 -24696
13941 -24696 756 13021 -22283 85456 100061 109522 51995 -31839 -49802 -9801 -17955 52947
13929 52947 62608 69609 108808 149588 67727 12442 -79888 -44303 -21936 -43467 -29898 -19456
13917 -19456 -34453 -122358 -61736 -17232 -9601 -24004 53506 37248 5422 29451 55044 7823
13905 7823 -7501 -41379 62149 127400 45584 -42895 -96382 -115521 -101769 -132476 -101190 -82678
13893 -82678 -110155 -23404 92435 129260 105521 48640 -86291 -31992 8454 29128 29976 -24500
13881 -24500 -82981 -90540 -35061 102422 101455 50236 133834 80137 87921 36464 51954 23056
13869 23056 52118 27851 -368 -29314 65369 92828 112023 88354 88596 -52619 -149430 -235308
13857 -235308 -289062 -238458 -122787 -128512 -166016 -148705 -142061 -133897 -83112 51431 47480 -59780
13845 -59780 -72876 -63866 -81333 -115868 -93331 -76143 -4768 64137 44717 27626 -43783 -74336
13833 -74336 -85462 -5474 82250 91050 81098 119826 96297 73742 69214 52552 28228 -78474
13821 -78474 -98481 -70836 -47671 -30845 -115374 -211640 -216667 -200288 -64933 -25439 -54155 -22535
13809 -22535 18631 -28399 -67372 -171712 -138698 -72455 -43791 3768 -33574 -76226 -82547 -110695
13797 -110695 -80724 -26024 -47334 26306 44791 5490 -47474 -107953 -106889 -100228 -112590 -18933
13785 -18933 54954 81647 188552 145888 118963 121935 104823 56387 91437 92638 98850 144938
13773 144938 196758 127944 73900 43711 49087 132098 106918 166819 132791 87014 79568 19585
13761 19585 -8714 -26934 -14067 53002 18492 30194 -22997 -48532 -46596 -2112 9304 -29858
13749 -29858 -27912 -38819 -150519 -102803 -38051 -70237 -123574 -60090 -41953 -12826 37669 14830
13737 14830 26809 35738 37936 -14731 -108548 -89184 -63569 39286 105268 109588 108227 99253
13725 99253 50842 32452 37641 -175 70072 19066 3113 22314 -20867 -29116 13721 -39415
13713 -39415 -93989 -46602 49419 142340 58101 -58262 -142237 -143531 -76246 -55279 -72681 22610
13701 22610 46121 25624 39983 -18416 -133366 -124346 -102193 -59654 -55627 -46247 -22722 -22585
13689 -22585 26561 81246 164014 169116 24718 -47226 28205 135111 34421 11056 30399
13678 30399 770 -71784 -66628 -34632 -15382 51596 64514 30223 -28979 6360 139904 169725
13666 169725 91502 40581 12773 21083 66754 -16217 -20881 -10187 -19865 131666 183326 106637
13654 106637 13940 -44274 -65708 -67465 -22102 15249 68163 19082 35268 58970 100691 65925
13642 65925 26599 22317 -6217 -47627 9674 25655 -40970 -76057 -123060 -146076 -57763 25285
13630 25285 1900 -68715 -108060 -86078 -42066 -16978 112616 209515 102614 64660 86738
13619 86738 90204 164877 201213 137227 103194 45948 24944 -33528 -14198 -14088 -759 -22180
13607 -22180 -77746 -65797 -35858 44216 158911 176078 136647 197842 217637 106364 25676
13596 25676 20375 35455 53060 135600 113238 -25801 -39916 69410 40008 43944 16336 137698
13584 137698 275226 203126 95854 137477 158627 150478 152345 82008 31979 -10264 -17931 -72271
13572 -72271 -118179 -118601 -100223 -142679 -81340 -52844 -65536 -142502 -101507 -4115 7360 -69771
13560 -69771 -9174 15858 18155 12507 -5604 94070 62660 11142 -31699 -41656 -7351 -8726
13548 -8726 -60147 -18978 -26048 -359 22579 -4227 -58373 -18403 17367 133543 134050 45946
13536 45946 -44805 2717 46292 87460 66483 77178 73431 92753 43691 -69255 8515 8588
13524 8588 26300 1502 -43238 -45704 5172 -66419 -71974 -88521 -52801 -19544 4136 62593
13512 62593 101945 75667 34957 14716 46543 56772 2427 17426 116172 142084 30205
13501 30205 35832 83521 56181 18989 37639 13995 40487 63285 89872 56319 32855 -8501
13489 -8501 -12788 56097 100491 17789 -8231 28874 -3641 58511 58726 91729 109291 140272
13477 140272 81303 36831 37997 74519 12922 9797 63718 54873 70809 99701 193170 162178
13465 162178 87376 52120 82730 73967 31642 43459 45655 73369 221978 257994 122847
13454 122847 55824 43642 -14081 24404 5120 130682 225249 163073 133418 105271 101537
13443 101537 70629 6819 48843 34729 -14513 -83978 -72674 -72125 -123925 -160993 -69500 -47697
13431 -47697 -1812 41570 40366 61115 55433 -15216 -30718 -56326 -37658 18603 40594 22138
13419 22138 39417 52166 29398 122428 164054 121118 59058 14729 46306 104408 67263 42109
13407 42109 30509 53832 66040 74319 55527 -11125 26892 40807 43748 34179 76218 108507
13395 108507 33511 1344 78993 102416 96586 56347 9370 71575 89855 50222 58899 15827
13383 15827 -48764 -37661 -40622 -5451 -36493 -15696 60143 11261 115148 204025 226304 178463
13371 178463 94185 85912 106111 20765 62841 32721 98630 168065 162095 94525 65619 18057
13359 18057 -5319 10304 89522 85205 -10148 -15315 -26020 79918 184755 158294 49620
13348 49620 36752 20822 11828 36447 82777 75174 -10829 -55389 -64141 -87779 -110393 -3708
13336 -3708 64219 104919 122205 77437 97955 50727 36505 36817 72118 228602 252671 118511
13324 118511 73217 120805 31652 -27037 119036 204010 192757 148672 98579 13451 -31830
13313 -31830 30008 98918 41001 22057 35221 39786 -8815 -92137 -158531 -87703 77111 167739
13301 167739 86772 14096 50713 44145 159577 212494 132329 73823 -51944 -43136 -1531
13290 -1531 103180 127027 179396 132604 101523 114951 198758 207785 109225 98237 117313 180459
13278 180459 247352 168119 159902 205253 197542 70416 130432 127986 67203 79596 155286 194763
13266 194763 190613 199421 185709 203514 231066 127984 119621 145684 95892 129559 127521 87275
13254 87275 25405 -5522 -33915 -77657 75940 279377 259890 164501 136698 185178 182727
13243 182727 168558 151890 141203 193801 115612 102754 219135 293092 272635 188734 158395
13232 158395 120606 125721 228602 271774 203054 134010 129531 102375 56984 149545 259289
13221 259289 311456 248647 230979 207514 194890 201882 203106 219230 219570 186687 135121 139704
13209 139704 119969 126574 102611 134494 230749 253218 159119 58526 48224 -11066 -71635
13198 -71635 -15702 95281 73359 106388 127971 71876 126436 116258 93010 90057 119907 152932
13186 152932 153386 125675 161244 95935 73891 104775 74329 110109 91464 82928 158679 169923
13174 169923 115369 90473 92033 69708 58869 72443 52769 120318 118028 26101 32653 7497
13162 7497 25498 72115 27754 67344 149342 260536 287878 257869 227593 204781 125766 98063
13150 98063 130680 235096 230355 246102 153607 133335 113762 162991 188434 107616 72207 100818
13138 100818 211523 247000 256978 296994 189588 114487 113934 118225 110785 81501 86022 102375
13126 102375 135608 132751 166033 272862 264207 240281 171886 137435 153653 216414 188548 162133
13114 162133 150511 147998 174683 188692 112812 66627 107535 125448 183240 203112 92457
13103 92457 58770 124342 178976 297197 305290 202221 148728 84131 103352 108548 129283 119743
13091 119743 126367 129524 187075 193029 217569 244359 264085 241187 238846 216082 183933 237308
13079 237308 277669 285918 285984 219512 187440 302270 322351 303115 267534 264741 294331 166696
13067 166696 186833 248970 239718 313607 230666 188545 260117 272302 253699 159645 228847 236705
13055 236705 170371 198125 216332 284062 290974 282563 296839 305837 303767 338661 272886 154803
13043 154803 135048 291680 381883 341476 270183 250517 340738 348073 353754 407467 399095 342424
13031 342424 355641 401655 421508 366873 397864 431455 452187 467279 496310 524153 531505 475024
13019 475024 377202 414247 401944 408107 390294 434329 418807 378581 388851 350018 250742 202075
13007 202075 235277 285429 379419 359250 388635 387023 427913 402741 335081 335048 409802 453103
12995 453103 403696 399748 398320 459431 509492 509232 466674 481947 507268 517093 476380 387235
12983 387235 355078 386758 330508 248595 392007 435475 457401 439389 365803 300870 318815
12972 318815 352618 364126 409100 461330 518927 508580 478632 480497 472754 418050 358604 331494
12960 331494 348347 396162 442403 335495 250447 238280 292706 320989 372273 390705 335234
12949 335234 371128 408182 336223 375844 473980 474786 451435 531204 445332 340148 304059 481546
12937 481546 515136 472436 435389 342810 274941 277990 344353 428451 407371 477021 551688 573386
12925 573386 476225 395052 403536 468521 508983 500016 562080 620447 603740 571366 562176 484340
12913 484340 512543 536803 593393 732205 678061 595169 641373 576238 494837 501368 497058 429983
12901 429983 461102 513674 549043 528645 600838 601688 519856 489335 487485 523821 653403 730238
12889 730238 664993 641592 655861 646440 588740 611622 606634 591771 605059 649553 612407 635066
12877 635066 678941 641469 627949 718105 630948 527925 545062 611118 660355 732066 768844
12866 768844 734096 715209 730722 694461 670030 660442 824008 945611 990332 891927 802924
12855 802924 727752 712311 719432 792924 814447 884258 974924 1001114 967350 855257 806258
12844 806258 860435 928911 941819 1019778 1029219 945354 836280 886696 954676 1028961 1088140
12833 1088140 996292 949515 993997 1044417 1108954 1224868 1337223 1396907 1397992 1488358 1509602
12822 1509602 1484765 1499790 1553245 1541179 1497038 1443203 1449564 1513952 1445360 1437432 1530383 1499061
12810 1499061 1386656 1338019 1351756 1380256 1404731 1470412 1434132 1363326 1403191 1331617 1307717
12799 1307717 1321906 1302335 1352905 1403191 1420566 1391650 1373596 1416412 1444699 1431434 1436330
12788 1436330 1438462 1367203 1389353 1397622 1396106 1408918 1390470 1522045 1532323 1493749 1475569 1432013
12776 1432013 1373489 1376547 1412868 1443772 1542412 1696849 1706180 1755045 1780514 1741991 1563560
12765 1563560 1493047 1564913 1698858 1792676 1811514 1796956 1845414 1844613 1829550 1921216 1972886
12754 1972886 1958277 1987117 1977324 1996377 2014194 1962649 1978270 2000682 2091301 2126425 2182410
12743 2182410 2162739 2139350 2147706 2145479 2135381 2171977 2202432 2235912 2286068 2259071 2294744 2347018
12731 2347018 2425157 2513551 2611238 2674823 2670948 2651041 2698966 2738346 2738352 2708311 2698065 2741149
12719 2741149 2780915 2806512 2808673 2874269 2939667 2920406 2976310 3039673 3112765 3157043 3316308
12708 3316308 3425938 3419472 3353122 3330471 3257986 3265960 3375521 3522724 3590716 3590024 3634796
12697 3634796 3731805 3824617 3818748 3881225 3974042 3978002 4074188 4188702 4179928 4143204 4251783
12686 4251783 4440175 4522813 4518588 4566323 4617779 4670490 4811137 4919822 5024209 5061678 5144097
12675 5144097 5261291 5317321 5408629 5419622 5570884 5711527 5768920 5879270 6005446 6141677
12665 6141677 6319385 6463540 6530423 6575663 6588758 6713926 6828467 6974676 7096719 7333505
12655 7333505 7556927 7732305 7819133 7836487 7941591 8195820 8424956 8586387 8798415 8898766
12645 8898766 9104338 9350231 9569832 9791382 10005140 10255760 10414502 10597922 10914189
12636 10914189 11178230 11481774 11725754 11975450 12298185 12570707 12915828 13277705 13607655
12627 13607655 13885538 14267475 14681371 15106419 15517064 15889429 16401123 16886364 17298104
12618 17298104 17742596 18245519 18739230 19257534 19856646 20481716 21106471 21719198 22368740
12609 22368740 22973598 23591589 24307741 25079337 25909907 26722469 27491582 28390041 29239653
12600 29239653 30082985 31109892 32153292 33193228 34158659 35099586 36181098 37218592
12592 37218592 38380695 39627848 40798029 42088161 43299665 44568012 45964416 47196301
12584 47196301 48426576 49656372 50913274 52099272 53302709 54484397 55691459 56840032
12576 56840032 57858768 58861503 59817799 60794661 61587669 62228701 62794124 63298484 63741832
12567 63741832 64067373 64267914 64346634 64388516 64243153 63936673 63524899 63012282 62523845 61890633
12557 61890633 61132862 60275123 59349569 58349431 57340704 56219348 55007180 53909609
12549 53909609 52628105 51361278 50199089 49056336 47851371 46507048 45225212 44084954
12541 44084954 43008742 41833188 40719602 39648447 38496017 37343269 36331674 35299262
12533 35299262 34250173 33263693 32371871 31462201 30518887 29653550 28868928 28129010 27335876
12524 27335876 26548376 25747697 24955099 24289980 23647684 23099299 22505666 21873284 21258540
12515 21258540 20684830 20167550 19692584 19189290 18660000 18156820 17670139 17171597 16780238
12506 16780238 16400808 15957241 15607552 15262222 14900065 14537032 14160784 13891448 13546278
12497 13546278 13050953 12661923 12369481 12162278 11828152 11623005 11401245 11073838 10772607
12488 10772607 10584727 10408133 10212057 9987333 9805934 9607881 9477169 9242077 8990220
12479 8990220 8793770 8636076 8495491 8350551 8203468 8001766 7834870 7754736 7727735 7668546
12469 7668546 7548680 7410189 7315987 7196100 7058747 7001978 6868024 6688243 6508740 6401558
12459 6401558 6262273 6096015 5939775 5920179 5907653 5780841 5708201 5669770 5519324 5410124
12449 5410124 5300139 5174289 5054012 4961541 4880248 4820096 4729795 4617341 4564947 4551802
12439 4551802 4555402 4480420 4388834 4313922 4219462 4251686 4258956 4184200 4150371 4086742 4037332 3919392
12427 3919392 3825622 3712223 3609318 3514215 3566889 3568752 3560015 3448021 3349095 3293375 3303610
12416 3303610 3292379 3257244 3208475 3160429 3096638 3088906 3050626 2945761 2897029 2812968 2808263
12405 2808263 2767731 2789635 2786999 2773955 2735823 2687051 2658645 2598777 2547334 2524400 2503971
12394 2503971 2472113 2524164 2651803 2606830 2411431 2286702 2252754 2350830 2356614 2230299 2148488
12383 2148488 2159755 2126635 2191142 2307483 2239455 2196190 2127532 2029752 2021995 1997360 1945061
12372 1945061 1901024 1919886 1880626 1884165 1856424 1839059 1859474 1886436 1847910 1837506 1756060
12361 1756060 1804476 1816422 1758093 1779161 1747727 1732162 1679015 1632440 1577089 1521878 1594793
12350 1594793 1635600 1570340 1564455 1614648 1627028 1640408 1654656 1653050 1643749 1570801 1589502 1579613
12338 1579613 1490654 1464441 1424510 1374751 1392721 1416425 1412861 1378281 1358718 1264661 1273292 1335812
12326 1335812 1402849 1368167 1352693 1358580 1328268 1283141 1302858 1305299 1352490 1399926 1417270 1485959
12314 1485959 1488822 1549277 1595961 1586679 1585851 1604504 1646635 1604631 1505051 1490598 1488327 1411147
12302 1411147 1392472 1293439 1199532 1178470 1116191 1071507 1050209 990528 959101 948753 991666
12291 991666 958461 981938 1011887 975569 898155 866565 914808 920299 960749 981009 972271 908474
12279 908474 902099 867203 834273 859147 822943 827925 856830 855741 893565 905335 864164 820742
12267 820742 772973 846696 903022 884707 881446 835615 786240 791115 801222 818452 804026 766906
12255 766906 691930 653018 710160 675404 652568 695413 650200 701233 612865 610492 584491 574620
12243 574620 634644 593685 628555 658753 747934 703307 692801 736016 769242 709697 769869
12232 769869 817637 829269 788125 809740 713189 623724 665090 662998 671215 689259 720874 731620
12220 731620 713813 602637 566086 492474 451933 474256 544783 627428 622206 609808 597716
12209 597716 527321 510827 566657 671672 734905 622378 495416 464839 446868 470062 452050
12198 452050 408591 469137 573628 613772 570218 409412 352402 347852 372307 491831 464729
12187 464729 438723 469892 537237 565795 504361 501314 514160 466222 468723 465179 451865 478039
12175 478039 462460 405615 366807 362282 533363 580982 536170 549046 501660 474881 490967
12164 490967 517288 511821 461379 458444 428469 343026 337340 452691 553192 572197 598385 594916
12152 594916 513958 458366 438633 400102 414339 414084 504933 515674 449548 397838 401001 359029
12140 359029 312218 354405 342601 397307 371441 279977 224362 293618 320551 356399 342882
12129 342882 364590 332479 283114 315551 348566 447700 450520 361100 363600 316835 282091 320576
12117 320576 335125 356585 325806 327331 324796 337347 351031 363246 372465 306799 350573 348018
12105 348018 316975 275748 269941 298538 302923 303439 225492 237463 263689 227578 141863 204878
12093 204878 283858 314126 313161 327250 306837 276741 136179 72702 135767 224204 269740 258878
12081 258878 275892 282784 297020 349992 357142 356942 313505 248916 361648 457038 381318 383337
12069 383337 374707 289379 218967 241368 254462 227180 316483 256177 207795 265493 359966 460857
12057 460857 435972 438900 363882 399398 462212 367179 266441 300016 315522 378823 366982
12046 366982 368746 343263 361487 341764 275335 159334 185624 293286 367879 359235 357674 275117
12034 275117 258845 283687 257237 312245 360147 294214 186454 173588 197469 180013 235071
12023 235071 315959 393299 410570 245968 120372 151736 203303 219906 140005 100605 144122
12012 144122 199493 259810 263295 239726 258810 304138 244793 155688 225076 301046 328837 335664
12000 335664 329925 302417 244361 287952 281826 363490 326393 181059 187911 222857 292994 297678
11988 297678 239842 222829 249685 267664 268728 204341 156930 194677 206663 160874 170629 223346
11976 223346 250079 224761 299819 310445 226458 182585 89412 70398 68039 124946 146732 152667
11964 152667 119963 100260 88719 44098 32206 97829 121757 151950 115437 128102 134460 92696
11952 92696 117338 64553 93544 84980 65214 131105 208527 258272 257517 217819 265921 244851
11940 244851 214838 170157 120870 84109 80830 157346 134061 212997 203248 146078 119762 84924
11928 84924 72592 97233 191049 204748 155555 131001 70729 80918 208041 321126 325104
11917 325104 179170 69255 68306 78648 16996 149770 266057 238728 147311 191522 306163
11906 306163 366002 291397 157992 68498 54429 122296 64621 -11811 6710 84845 120589
11895 120589 166392 166143 115124 124676 141357 163456 136185 62207 48906 82896 12079 39869
11883 39869 121729 185291 185217 273294 244260 124938 49277 56785 123291 83573 33910 15911
11871 15911 111835 194349 221389 162169 101851 58392 50025 63331 77853 78329 84228 125199
11859 125199 116758 67239 44621 103540 146095 141476 110691 82587 70614 19195 -37773 -76848
11847 -76848 -78679 -55369 27383 36003 19111 45650 88917 162274 168356 168092 159894 172538 191620
11834 191620 203021 87594 25274 109939 101690 62820 73144 -18921 -31803 26766 36980
11823 36980 26020 99014 70088 78241 135493 104484 61448 33135 -21038 -3706 137680 146496
11811 146496 197832 189623 216336 179831 126361 105627 66830 -13924 -19203 87198 159216 148176
11799 148176 106087 127200 89146 19871 -92455 -55106 17567 38305 116765 183443 147302
11788 147302 122572 86007 108356 65325 71967 154460 122899 46434 59737 14161 -24487 11519
11776 11519 45992 36815 58672 74492 137861 193809 147513 129157 110206 131316 74155 -80646
11764 -80646 -162717 -67414 76988 151515 112910 64966 52146 63774 56419 63382 65708 49512
11752 49512 5871 -2866 37416 79844 56156 73802 31850 81072 137344 180411 106552 5238
11740 5238 76188 129337 9405 -67954 -16335 70334 149878 105668 118879 124870 93205 91122
11728 91122 159848 117773 99082 113070 116035 85979 74561 19897 63818 103262 122221 42654
11716 42654 5381 18511 20154 53275 55508 -31595 -2952 57138 43221 95423 68348 63270
11704 63270 78314 43647 16828 -8002 -24390 -34572 12327 25143 -32882 -19897 95921
11693 95921 108501 44786 42705 -9671 -36084 20706 77006 29509 87841 59044 77637 45516
11681 45516 21901 -26590 -1660 3373 4272 -19853 -18541 -58794 -114678 -93332 -45837 -25912
11669 -25912 -70464 -22123 34629 82026 115999 174107 205630 130671 94987 69366 77693 131013
11657 131013 154716 194865 134453 8665 -17514 7003 30056 41887 61080 7881 -106844
11646 -106844 -117055 -68023 -22539 57799 82044 108708 197349 153814 80758 90914 18421
11635 18421 -19998 37142 49069 112433 57680 18947 13448 -63983 -78867 -51265 49106 87822
11623 87822 71575 37001 -45939 -46416 -65811 -45109 19480 43717 11732 -52197 -18966 -8134
11611 -8134 -33055 -63839 -42836 -1697 53120 39834 44070 136311 166149 196573 144003 124317
11599 124317 90199 36514 65931 564 29748 -14469 -42160 24649 68275 -34862 -101206
11588 -101206 -261 85831 86935 123234 187760 149488 56930 47208 6926 -33740 -113764 -111849
11576 -111849 -105053 -26601 -73082 -31374 -12419 -30520 -3616 45877 79842 11495 -27137 -119940
11564 -119940 -117093 -118874 -90301 19767 120132 53654 -49778 -81939 -38949 58696 63997
11553 63997 51829 35510 57569 85669 86836 62765 112866 77131 -14502 -64815 -49792 44142
11541 44142 148488 133796 47687 7654 30203 9451 46452 3623 -23506 68143 190949
11530 190949 246535 155634 60614 29143 4388 28998 7741 -2375 -184269 -230764 -205406
11519 -205406 -269151 -227779 -114749 -44352 -39083 54192 55798 63666 37828 14963 67515 93556
11507 93556 97638 87637 37377 9336 -18540 -11828 41992 39269 75406 123156 99756 170642
11495 170642 207076 167840 137585 87544 87793 141575 154909 95813 30382 -20571 -32083 29341
11483 29341 4438 -12876 31942 99655 80338 -46506 -80306 -32587 -3850 18676 55707
11472 55707 87957 -5617 -78751 -15218 -5586 41203 33221 -37519 -20276 17502 25695 -35748
11460 -35748 -73900 -83958 -32612 30076 99392 135849 3334 -101287 -99890 -68698 -122347
11449 -122347 -98674 -30403 108310 154953 77502 71687 86966 162443 -22672 -142586 -101891
11438 -101891 -43376 -73655 -50985 -11115 -6903 -56369 -95083 2229 16231 49486 132398 157878
11426 157878 75573 62128 15048 -23303 -58630 -143251 -174108 -105296 -31285 9715 56380
11415 56380 -25080 -68646 -1524 81424 58395 91846 146944 87708 21153 -28688 -33455 50802
11403 50802 23860 6400 38631 15281 -24607 -60350 -69089 -23898 -46249 -12014 3551 11633
11391 11633 37910 7904 -11106 -50737 -76536 -46636 -7228 -56264 -62083 28462 -21238 -65468
11379 -65468 -79256 37549 112016 85714 12158 10902 -8127 -63307 -46989 -60353 -36919 -57458
11367 -57458 -13708 -26745 -52566 -47432 -35831 -42383 -83074 -153444 -120738 -94119 -111875 -97775
11355 -97775 -74063 -65336 70369 86043 77340 109208 95659 29808 -59233 -87148 -127087 -44729
11343 -44729 -13365 -56774 -101889 -72444 -58169 -84281 -103193 -99390 -45565 -2437 39352 -4426
11331 -4426 -35411 -37718 -60661 -47458 -119605 -152704 -123530 -153199 -112556 -75668 -71692 -145921
11319 -145921 -149812 -79478 29725 6613 13918 64803 76340 -36851 -129034 -150118 -131965
11308 -131965 -166167 -103540 -21192 -5863 -35099 -28249 9131 67049 144357 226430 127720 -7832
11296 -7832 -134478 -155464 -95687 -105357 -106410 6512 6392 -54277 -108060 -124879 383 13736
11284 13736 -49867 49590 108571 168430 79535 -16700 50340 67006 41482 82541 147622 143483
11272 143483 84063 20268 -81620 -161266 -145393 -81275 9232 -10750 -53637 -80999 -121945
11261 -121945 -104449 -49983 -57064 -38647 -28895 33978 98946 85284 -77719 -86532 -18819 -63019
11249 -63019 -50496 -39840 32479 4096 -1159 52066 92285 26280 21332 21275 62400 36408 -48803
11236 -48803 -65738 -85173 -72612 -62594 -11897 -32472 -84635 -127746 -108545 -27202 2754 -47709
11224 -47709 -139732 -143486 -19065 68158 -7676 -80759 -59229 20807 88449 63762 22215 -68673
11212 -68673 -134092 -17568 104822 106499 67165 29740 19426 116431 99837 64335 114136
11201 114136 80468 -6198 -53490 -59363 -52479 -15781 -47728 -73762 -67737 -91786 -146788 -127103
11189 -127103 -94394 -116298 -130447 -196709 -240016 -204780 -50370 75519 53408 -33857 -100824
11178 -100824 -83201 -115248 -56375 46259 121782 44802 -25138 -17282 33529 72688 61768
11167 61768 -61646 -17340 27667 24357 -46251 -35925 18095 23955 1668 -23077 38168 89238
11155 89238 88895 -34323 -156857 -146136 -76818 -7274 31345 59634 -40098 -95003 -107430 -117747
11143 -117747 -145163 -175899 -186873 -234598 -202050 -139393 -138520 -87005 20927 27147 11218 -6327
11131 -6327 52751 117706 113906 107075 89894 61660 73734 36255 64268 113336 31113 -41866
11119 -41866 -95285 -127848 -90758 -114897 -116094 -85048 -24378 -20449 19516 35344 -3564 36631
11107 36631 81967 87713 51936 45762 21369 167 -9250 -27030 -56320 -75770 -176973 -224148
11095 -224148 -114347 -35370 -4864 -25257 8757 -37135 -68632 -56384 -27728 39867 86029
11084 86029 54306 -5207 -1942 -11851 -42945 -170903 -157106 -34918 -55030 -2369 18249 36723
11072 36723 -42660 -101887 -92755 -28521 -12719 -37210 -70622 -50761 -73337 -107872 -22926 52569
11060 52569 -8375 -24397 -25059 -46765 -17047 42599 93716 110953 84370 49587 107320 128378
11048 128378 119569 20989 60049 102204 82808 104106 18078 -42078 -2822 153875 174594
11037 174594 123700 102576 98776 105034 123467 81304 45753 18961 -34431 -35672 -3840 4504
11025 4504 -34310 85541 137638 122432 105366 167676 132476 35688 -69310 -124477 -71122
11014 -71122 -41902 25678 122065 157153 116775 74322 13497 19914 36046 30205 102800 72932
11002 72932 3057 12541 98284 155338 118643 89799 20299 -71077 -98966 -79189 -98086 -109432
10990 -109432 -117436 -63968 -152492 -142480 -69275 -88564 -114512 -119924 -97339 -94016 -26624 81300
10978 81300 61746 -29245 -65208 -131624 -187762 -193841 -197387 -107914 -37129 47736 46374 -43933
10966 -43933 -117397 -163644 -71936 -40193 4973 34292 45585 50890 81682 62689 19170 -23485
10954 -23485 -48696 -21938 -87048 -90327 21828 42442 -40341 -60583 -154383 -137098 -106848 -64586
10942 -64586 -78951 -27960 82830 49221 58884 -29167 -102113 -12063 -10712 -6524 76266 114235
10930 114235 23855 23552 37110 46721 99876 68626 16196 -61473 4121 -11242 -77137 -33597
10918 -33597 -65073 -117952 -138400 -160576 -61603 -65302 8997 64531 -927 40913 89955 6228
10906 6228 -42084 -19539 -67903 -114269 -180740 -152337 -76737 -34883 -16880 -10527 -40522 -35992
10894 -35992 -18377 90352 61724 51512 -31076 -97417 -69568 -125294 -201604 -134551 -84320
10883 -84320 -15028 24485 5642 -58723 -91054 -61302 -78844 -72722 52213 -17173 -54149 -81499
10871 -81499 -78966 -155233 -169296 -45535 -25665 -41110 -36926 -118954 -122329 -11518 46207 12403
10859 12403 -43581 -70184 -137299 -53757 -79420 -111513 1485 109093 29528 -24730 3343
10848 3343 -11436 -56539 -41007 34439 58432 10056 4415 -49026 -52504 43382 59672 28892
10836 28892 -59132 -83494 -43789 -51488 -19304 -64944 -72686 10362 46998 60037 7581 -36575
10824 -36575 -90053 -115861 -9062 -6663 -19362 -51266 555 10867 20016 31430 43939 116368
10812 116368 100187 -19138 -115948 -115445 -29167 3575 35909 -9473 -17964 -59960 -123928 -134087
10800 -134087 -136291 -107096 -143557 -105628 -30368 -62953 -100441 -52092 17031 -55088 -98311 -88126
10788 -88126 -32079 27233 -17661 -40857 -4646 48904 22524 23720 -14254 2387 51402 56693
10776 56693 61952 48037 21150 55095 52863 109590 128797 32352 -37780 27872 66823 102784
10764 102784 168798 189665 82658 -20472 -59634 -36302 -31585 -74300 -84560 -92090 -165359
10753 -165359 -160574 -122850 -75633 -28337 -44951 -40878 -54122 -70122 -87370 21578 116915 148705
10741 148705 204091 150230 147471 131025 52690 -37209 14638 121602 161027 115880 128286
10730 128286 42613 59352 -18020 6514 15992 18065 -14464 -76995 -104490 -112876 -84755 -20870
10718 -20870 -7912 59416 139200 123281 90920 75351 65046 -12090 -95056 -50335 23610 123155
10706 123155 123881 145558 9718 -11440 -369 -60900 -119031 -150834 -166859 -138086 -51030 82057
10694 82057 151261 103812 86755 89448 -53538 -93504 4827 82215 140845 147300 98327 94974
10682 94974 45610 22319 -30302 -27337 -83152 -50507 -16429 -64723 -108958 -196962 -137096 -15437
10670 -15437 17137 -16625 -12319 27756 5546 -108609 -113516 -120328 -180479 -102669 -73189 -144900
10658 -144900 -162809 -92773 -134100 -100559 -69787 -75169 -16731 2774 37713 39605 74194 68816
10646 68816 87160 143842 9176 -26833 33438 72801 -11058 -46019 -137545 -204219 -153821
10635 -153821 -13109 57116 34904 21793 -22 -31143 -74335 4498 -18682 -34399 -34521 8327
10623 8327 -33147 -54600 -121992 -193244 -197075 -220601 -224751 -194300 -263347 -282083 -181123 -137238
10611 -137238 -182257 -142157 -157918 -206791 -206084 -111924 -34094 -8422 16936 -6311 -56433 -12801
10599 -12801 -47733 -106737 -43840 39332 -24813 -35007 -37148 25715 55677 -76056 -80263 -39058
10587 -39058 8856 -66163 -198429 -156336 -73375 -44277 6825 141799 199307 141694 89331
10576 89331 88571 -19650 -51356 -62281 -42074 13466 52831 71530 96167 -10894 -71516 -17762
10564 -17762 5154 -43635 -85008 -55815 -56442 -28890 2202 -14662 -44368 -49610 -77832 -49764
10552 -49764 -11190 -28772 25727 59117 78280 17550 515 -33023 42431 84221 -1365 -43977
10540 -43977 -79788 -86664 -144538 -180140 -135354 -107738 -64502 -65711 -17393 -27537 -32480 -130802
10528 -130802 -113924 -4273 40722 29116 106302 159797 54445 -31973 -76346 16146 -28311
10517 -28311 -111869 -67182 -68693 -91095 -21757 -38704 -149497 -128937 -22863 -14895 -56488 -99744
10505 -99744 -91134 -70694 6584 -19624 -90933 -103485 -54217 -49284 -36012 -110242 -167484 -110834
10493 -110834 6041 71504 44915 46087 -26412 -145695 -146151 -79928 -100079 -28592 21585 109938
10481 109938 88881 114255 40759 42904 31605 -46979 -79049 -64572 -106522 -154740 -150567 -70299
10469 -70299 -15134 -48950 -75803 -5259 49102 96480 98020 76142 57668 53229 112259 86877
10457 86877 -3378 25260 91475 44173 -5676 -2587 -86345 -103113 -121515 -116794 7766 126208
10445 126208 48822 63007 53786 -348 -39791 -101034 -135851 -50028 -6562 -92783 -128636 -93655
10433 -93655 -89012 -210158 -250233 -124594 -56206 -82295 -16314 16453 -41369 -83674 -128778
10422 -128778 -53665 -3527 3748 2955 -39039 8142 28134 48190 40640 13162 76316 71155
10410 71155 -14196 -88917 -17036 31046 53796 33129 12484 -46721 -33626 -22573 68371 66814
10398 66814 82524 119912 77972 102098 130590 44272 -8062 -6113 -23856 52520 80010 57277
10386 57277 68322 73888 91474 20164 17950 29678 46341 34477 33334 33254 4428 -8321 -55843
10373 -55843 -14450 51185 65383 90602 63738 117491 55849 42032 54498 78352 63048 7350
10361 7350 -6147 20081 86622 68408 -29751 38277 30987 -48442 -25773 21451 50311 30434
10349 30434 -3103 -30584 -75601 -147075 -99508 -33283 -101436 -142689 -107145 -20539 29699 78213
10337 78213 31277 -3262 -116780 -113077 -23465 7350 53640 101901 130332 141908 69926 -272
10325 -272 2044 -59363 -61481 -97889 -103470 -5386 63294 93395 44003 53567 118743 141406 98070
10312 98070 -3115 -140496 -161683 -69161 -45693 -78989 -40309 66057 87405 93369 89034
10301 89034 35342 15441 62049 73326 -75419 -118113 -75633 44645 102599 11958 47999
10290 47999 94372 99882 102887 26385 -424 33916 83464 28633 -44694 -53139 48576 19371
10278 19371 -15226 30524 18792 49838 37993 34114 13751 -57983 -37457 49668 50157 93082
10266 93082 4252 -9956 7671 -28005 -86557 -105774 -53857 -60189 -39498 21641 -39319 -51526
10254 -51526 30923 94479 190628 176473 204350 214614 130753 85964 67764 58445 -10501 -36643
10242 -36643 -91897 -50474 44412 94598 71011 25967 29184 34091 34602 -10961 2584 -1502 18864
10229 18864 8345 5786 -41171 -65017 67296 144980 154838 26693 -82486 -82832 -82072 -94214
10217 -94214 -76421 -879 -28858 -51107 -16524 -13210 -43147 -54304 -65051 -64159 -142370 -77842
10205 -77842 -106252 -165968 -147650 -92406 -56115 -84101 -92165 -22070 20208 -18832 -60337 -35275
10193 -35275 99540 121376 -8415 -187197 -215443 -91888 -102875 -105835 -91901 -73067 21963
10182 21963 7486 -70081 -105488 -87423 -101153 -195451 -214418 -163537 -79850 -50381 3122 -1588
10170 -1588 -57039 -84608 -19305 -10299 -16420 -51535 -32721 -7756 105528 18542 -32636 -50410
10158 -50410 -40661 71462 9930 -16382 -39761 9176 -29194 -35548 -15566 -45792 -14753 -14308
10146 -14308 -8882 25800 113446 70522 -44482 -100791 -154759 -102909 -98684 -49716 51686 14478
10134 14478 -22761 -16845 49896 82036 68538 85976 63118 8043 7980 -54930 -99090 -160721
10122 -160721 -173715 -178188 -178144 -122999 -64013 -46601 14484 13283 149 -3992 -60341 -96326 -112984
10109 -112984 -48241 17191 -16756 -59253 -82428 -58338 9685 53509 105027 184555 127808
10098 127808 5288 -18882 36606 8299 -68842 -129908 -64323 11723 -67512 -104698 -13657
10087 -13657 90456 128226 120965 80633 -5551 -24718 -59036 -11330 21671 -76260 -38808 -58162
10075 -58162 -46320 -17778 46775 109854 34256 -45699 -80556 30250 -20138 -81054 -19120
10064 -19120 33833 101193 198061 225833 209900 142681 116335 170982 218333 97904 96628 64751
10052 64751 36236 56619 1451 -10862 84690 164885 182480 234578 369517 542083 880135
10041 880135 1622333 1963100 1699698 1215431 837518 473180 338535 328326 267062 195897
10031 195897 172586 47016 -2892 -52372 5804 -28315 -8676 60585 50906 38690 1546
10020 1546 -37163 17106 11045 53269 32100 -29792 -32386 8907 3122 -6783 44763 97974 27520
10007 27520 -44912 5700 45799 60874 70722 64930 63790 10873 38835 53297 45732 1244
9995 1244 -7939 83996 146671 97229 154007 175714 99238 -114022 -136954 -75795 -61154 -42017
9983 -42017 6913 58565 22679 -30389 -46459 -107385 -98880 -687 14794 52756 96432 51105
9971 51105 -20819 -34559 25133 21954 18397 69489 169023 170979 85852 32631 -15031 -13663 -17945
9958 -17945 -29290 -26209 -64458 -24982 -112928 -152879 -168529 -61735 -20375 -64600 -84861 -98092
9946 -98092 -117781 -76427 -45187 -151291 -84538 -10484 6789 12665 -31652 -109404 -156240 -140344
9934 -140344 -85264 -70868 -61654 -40152 -38288 -40757 -34262 45519 90294 82528 80510 18574 -21201
9921 -21201 -36162 -90912 -119985 -41948 -11661 7307 71679 3816 -59450 -105586 -93222 -57080
9909 -57080 -59328 -111431 -180064 -183025 -154262 -126443 -86790 -30817 8171 80141 105260 111062
9897 111062 59132 16161 -17907 67556 101139 22524 53987 -55152 -5484 65690 29583
9886 29583 70200 61135 23667 24407 101518 62361 -2252 -100048 -124933 -19139 -3720 28328
9874 28328 23801 -7513 -49658 -33236 12899 13787 33378 -16549 -83409 -80450 -133017 -187158 -147265
9861 -147265 -107425 -105590 -143919 -145145 -92073 -62787 -70521 -79280 -65640 -26776 -35943 -34007 -20386
9848 -20386 88026 142051 149587 174092 93421 70708 80847 -12645 51258 55233 -23711 19083
9836 19083 119447 109337 86639 29427 -48409 -80953 -17933 44940 63692 -44437 -153473
9825 -153473 -210568 -176253 -169188 -216155 -207534 -98615 -99822 -108563 -61968 -73971 -100520 -111320
9813 -111320 -55451 -56467 -137181 -179467 -166218 -78141 -47698 -75576 -60152 -16834 53168 58801
9801 58801 41126 80435 65490 -16588 -43617 -79882 -115950 -158445 -139549 -150002 -149513 -113655
9789 -113655 -163377 -61237 -9671 -43580 -68526 -98723 -157590 -24251 106991 87986 108255
9778 108255 55865 -48983 -84809 -41904 -7138 -51194 -39282 -12937 -48065 -23725 -12521
9767 -12521 -54426 -156543 -262761 -249011 -180213 -76161 -28741 -67944 -75920 -83674 -87476 -84647
9755 -84647 -11590 6431 48502 468 -103972 -72688 -41772 -54712 -61291 -1076 -31673 -83271
9743 -83271 -122451 -38698 16964 -58931 -96995 -66594 160 46839 21845 -62822 -105722 7178
9731 7178 58305 -17408 -117866 -100362 -69649 -66828 -51437 -2274 21109 41306 30185 76542
9719 76542 96150 -24204 -109696 -148915 -100589 -45599 -119759 -252876 -213436 -112847 -4707
9708 -4707 70119 131213 117888 13803 -10545 49881 -35065 -77376 -112209 -161510 -98365 -61417
9696 -61417 -25309 -55755 -89266 -59054 -48099 -44439 -44487 -36893 32981 74649 45083 -17905 -60127
9683 -60127 -32487 11135 3068 -24633 -116467 -230178 -273726 -146622 -86308 -91719 -75233 12412
9671 12412 2614 -100684 -130790 -138581 -122922 -66527 6009 -51716 -59361 -44534 -73646 9125
9659 9125 52808 74229 82693 142365 144670 48053 71948 60880 54344 -2948 -117268 -137789
9647 -137789 -101328 -44937 -11967 -19187 -38813 -99329 -71076 -48002 -63827 27019 119912 149302
9635 149302 111407 51614 -7186 74006 169252 244846 191789 172551 199085 261219 205914 92709
9623 92709 81512 24417 -59339 -8001 71569 -27486 -105862 -130696 -81086 -5951 4586 -22671
9611 -22671 -94013 -115902 -45110 -30134 -35032 -76175 -128660 -138085 -98604 -72602 -79173 -28850
9599 -28850 -6933 -48709 -72309 -53224 1459 47274 80863 40824 73131 40942 -619 -4733
9587 -4733 74067 151064 138630 28879 46510 65951 -10575 -27328 47764 108132 113379 128989
9575 128989 60808 -62960 -95579 -51582 -56348 -63726 -99681 -90132 -124429 -95138 -36423 -72381
9563 -72381 5032 20466 30849 129583 169954 93746 -50939 -136507 -144351 -79342 -14852 17598
9551 17598 75882 80820 47924 101870 113633 136669 195349 129964 -79659 -71006 65759 95970
9539 95970 53776 44938 34612 110140 105183 26752 -108938 -113195 -82807 -79301 2051 55681
9527 55681 -16324 10739 71841 121137 73651 10566 28109 21645 -8755 -46977 -52382 -177020
9515 -177020 -177836 -33218 152592 216413 202938 123020 109017 85548 91342 29356 57858 168063
9503 168063 211995 158525 59733 68591 73302 81974 86859 186761 206351 135305 134052 126666 154037
9490 154037 28457 21221 38647 67327 141174 208872 256967 237161 272044 181125 110618 121253
9478 121253 143407 66632 -7648 -37280 -34350 75940 48273 -22725 -22904 12730 70056 81199
9466 81199 98944 72992 20046 13779 67898 97087 87924 123349 126520 177453 216985 259143
9454 259143 209840 148563 139071 203242 202814 263168 301788 334926 330825 384539 329653 297986
9442 297986 400775 526934 461226 486600 585635 667643 611925 532399 551216 648628 708005
9431 708005 730745 796177 843746 868537 939089 993325 1094360 1104949 1147293 1179946 1251723
9420 1251723 1438727 1544787 1626695 1829800 1987982 2140897 2447239 2680713 2876311 3124951
9410 3124951 3411305 3749845 4114999 4671219 5294721 5960801 6692586 7476430 8458309 9435568
9400 9435568 10429734 11384998 12265995 12992204 13450286 13648551 13511606 12896331 12065811 11199535
9390 11199535 10343862 9433184 8531307 7723542 6984635 6257574 5578332 4986894 4525452
9381 4525452 4117510 3761887 3462204 3139863 2835736 2691809 2485123 2252632 2099721 1979167
9371 1979167 1832637 1738552 1648146 1512028 1367484 1289003 1125702 1103208 1143809 1131497 1084098
9360 1084098 1018086 997070 1010116 984332 909173 792189 748003 786578 729620 638321 548656
9349 548656 516878 441800 455407 506956 604551 598828 567459 532160 412178 393199 476227 471488
9337 471488 443691 448439 390835 400833 446315 394957 298150 306869 319677 266656 230973 172406
9325 172406 160363 170987 170414 178723 174535 144125 4382 22090 73527 131027 157807 132800
9313 132800 31879 38244 109162 170523 197445 247851 188469 90882 102551 174003 263720 241911
9301 241911 229712 211444 191461 138391 109111 114120 19089 -8432 85386 62827 57475 102071
9289 102071 155790 85505 52350 19045 94039 230395 259300 188970 62373 12088 84214
9278 84214 55700 122857 251416 216072 174351 171138 139063 126838 176612 236140 188819 165629
9266 165629 174459 144800 137841 143458 140037 119394 109642 91422 24176 12291 -38834 -78728 -49771
9253 -49771 10630 50128 70786 130548 163184 120527 92359 51486 35099 67257 76901 59618
9241 59618 -29790 -11518 -49122 -96922 -53140 30906 94288 137589 116580 116921 397 -49377
9229 -49377 -1929 118007 122533 20095 -106305 -139322 -169459 -110073 47731 72420 29385
9218 29385 -63461 -124325 -109240 -265 54939 98090 83338 -24666 -103902 -52628 31641
9207 31641 45654 -70853 -96110 -92562 -42236 -22197 -96172 -66690 -54971 -37037 -49878 -13874
9195 -13874 -21292 4119 27528 -52880 -26427 -29774 43572 120060 164762 126719 30459 -66091
9183 -66091 -90049 -47694 -43034 -8544 -55957 -53072 16754 97309 13081 -94421 -138027 -36075
9171 -36075 25477 63357 38234 124831 203338 86629 122311 118537 34007 29550 25437 -47019
9159 -47019 -33734 -74567 -79544 -132725 -80809 46975 172575 163096 138058 95029 -14486 -110205
9147 -110205 -64447 15705 61734 53920 12959 -7235 57033 174439 207542 271813 243455 220708
9135 220708 203061 113090 97519 82150 59699 -42762 -75422 -113732 -106648 -99681 -126360 -140671
9123 -140671 -156542 -80472 -87362 -111421 -160712 -152987 -149340 -77831 -118160 -62688 72245 38570
9111 38570 -34684 44847 12215 -27858 -22544 -19553 -32283 -35837 -36469 -19123 46134 10522 46481
9098 46481 13576 -91501 -95933 -67622 -16973 19557 -24603 -104054 -89093 -30681 -50650 -40286
9086 -40286 -63332 -102506 -47234 3765 27706 28674 46014 -14399 -97504 -34800 91283 105045
9074 105045 55965 -47584 -35989 -66327 -32071 -13661 11950 16060 -75788 -125211 -87681 -127987
9062 -127987 -59078 -3828 17243 -11033 -36234 -13835 1578 -8275 -21858 9091 41351 78507
9050 78507 114450 17196 8428 35988 -19269 -85912 -58953 37550 -4570 -6378 -19517 -17396
9038 -17396 30454 -52617 -35405 -74055 -65226 -6050 36219 -2359 -38936 20855 93957 113669
9026 113669 102081 75537 88353 53369 97381 57043 -47066 -33484 81528 89007 72936
9015 72936 97217 107243 66312 22653 32497 19826 46927 87958 89122 67995 74174 87779
9003 87779 43499 73451 134605 111191 123667 173043 151739 137359 181170 173717 113157 30313
8991 30313 -41666 -120937 -84799 -61851 -41997 116955 85351 111998 157978 184882 208541 205562
8979 205562 78133 83534 114992 170958 143631 95777 85974 114296 91727 67428 88943 126899
8967 126899 204549 159486 113127 131385 99680 75954 112745 112854 49299 107730 216949 245730
8955 245730 235530 303265 329799 281017 185622 167889 138948 97060 131841 176286 195147 125882
8943 125882 63090 113469 166123 221735 129038 110575 49753 -54839 -53623 51116 124930
8932 124930 179949 166508 179953 220936 205323 190584 146440 87895 110072 61054 53337 149555
8920 149555 195408 185840 209530 220257 211607 215556 241082 277733 268748 222252 126246 53422
8908 53422 41495 95750 160044 141257 89179 112894 94109 46027 153515 215253 188569 98449
8896 98449 101471 199934 262298 303473 198259 156624 77622 61370 54333 -46573 -80942 -38136
8884 -38136 9392 81404 71503 -14731 -42127 -15014 53610 38278 60422 59400 67549 95440
8872 95440 58063 -2377 -52829 49886 111552 199947 213517 112539 137393 162844 62027
8861 62027 58899 182317 194200 203422 276268 283738 308829 233418 175825 37574 -26198 -5799
8849 -5799 -26311 29713 78497 110317 107123 83505 31210 952 -30461 -107020 -67879 -61244
8837 -61244 -81570 -24157 -3365 14004 5474 -56967 30784 42287 27226 108012 93126 112
8825 112 20688 111815 73301 -20193 -98433 -76251 -60757 -12290 44570 -17032 -114014 -108171
8813 -108171 -99052 -126797 -4404 62158 67028 68008 59929 33008 35218 26459 13030 63309 144473
8800 144473 169355 102082 28129 -68995 -123721 -158016 -145256 -87632 -100504 -15936 55897 66339
8788 66339 106355 68806 57003 59982 137911 118265 68480 -1821 -26384 -51088 -33801 56298
8776 56298 126184 105032 21543 -4512 73611 111265 52058 8428 28408 -20747 3180 -7782
8764 -7782 -27280 -62 51072 131801 142092 104288 44440 77091 21235 42813 120963 164835
8752 164835 152502 139021 127231 153776 50404 -14818 27135 49236 40752 76949 154602 98052
8740 98052 83070 -47068 -35003 22721 47442 66449 26346 72411 123337 144529 113505 46392
8728 46392 35558 49011 83750 92101 135418 88992 14131 -52715 -82373 17670 29711 58897
8716 58897 71524 80505 91426 115619 -1560 3815 88198 93299 48903 31573 48576 54482
8704 54482 42276 72710 195051 95487 6284 -22185 -59100 67966 5554 -58385 14590
8693 14590 -9557 81342 136051 126908 91854 45896 56616 16751 -7012 -125117 -104000 -86962
8681 -86962 -24379 -67141 -127713 -91581 -116036 -149321 -135123 -146291 -39644 -7398 -77085 -81654
8669 -81654 -9014 -18764 61 48215 182962 243338 144141 2664 -55413 25662 65748 -10094
8657 -10094 41055 79979 29029 24471 67380 103340 100991 17418 55807 181376 135515 102805
8645 102805 19810 -10120 -7959 98634 34447 -88612 -112818 -76969 -23239 37748 93045
8634 93045 137391 155366 143810 226581 270799 185907 213163 205479 225722 187545 98390 31067
8622 31067 30340 125269 223116 208411 188299 174901 129918 146091 187449 290960 398516 639942
8610 639942 1140366 1830309 2305256 2181305 1715283 1185017 745903 471725 362296 325816
8600 325816 282693 148511 88075 195179 236148 195141 178661 184312 199933 178891 227477
8589 227477 266837 287469 276196 268740 290874 343924 308684 250264 167065 140102 177585 261390
8577 261390 350958 321116 212187 147666 130462 205013 273604 276918 474683 684699 1030938
8566 1030938 1705450 2861424 4061263 4239876 3627707 2643515 1754811 1236386 955181
8557 955181 852397 714166 558161 465893 359214 301779 214022 204514 247364 282174 270294
8546 270294 207161 112940 188842 304135 288369 276032 226927 184791 100677 68070 148027
8535 148027 159327 229250 282805 231010 118294 201971 176456 153047 127175 185201 196296
8524 196296 305719 466921 681822 1069930 1721357 2082086 2044489 1724777 1214646 770496
8514 770496 509581 401949 368770 332391 259558 242722 140152 106829 126767 14088 -5161
8503 -5161 -44135 -24587 27082 74670 95013 24401 -83207 -110816 -57840 8966 7863 27337
8491 27337 5137 35734 75816 58027 -41315 -27429 -3973 61275 56019 -26635 -629 44184
8479 44184 187956 218002 145361 150089 41682 -107996 -173957 -71500 -34695 81816 57206
8468 57206 -22254 43856 134938 96282 -19851 -64839 -68075 -33019 43231 94921 85723 62170
8456 62170 97048 35204 66127 117074 109543 135845 94358 20549 25459 15987 23203 73532 19034
8443 19034 -65554 -56002 -9324 85220 144358 68804 63357 86673 96376 -18996 -8129 53857
8431 53857 98329 112204 96129 35847 100083 79233 21176 -49192 -29835 23518 24598 1134
8419 1134 20166 11841 3709 -94251 -79732 -50020 -20401 -6396 31716 7501 -58143 -52540 5840
8406 5840 44159 41548 -53713 -60871 -65439 -106957 -10300 87020 73026 77435 189497 237839 168045
8393 168045 104744 74511 32562 29453 38976 47939 46408 105975 78694 -24611 16474 42118
8381 42118 40543 -36165 -75852 -135136 -113086 -124374 -67423 1078 -10319 13213 13295 58657 669
8368 669 -39348 80065 54390 83956 98152 22909 -61652 -90207 -52175 -15258 39919 32802
8356 32802 -58010 -50806 -73164 -88551 25284 51315 14002 -32729 -48575 -23038 -46975 -75173
8344 -75173 -41985 75322 86807 40175 -44664 -62813 -91862 -98150 -41675 4295 1058 17250
8332 17250 39570 15514 -41225 -79648 -160877 -167510 -156406 -148215 -125433 -30871 -24365 -51867
8320 -51867 24119 57381 11478 46086 88835 78755 125922 147976 170162 155204 127657 -4906
8308 -4906 -174959 -85375 39950 59616 26672 -22771 -115808 -48983 39360 45120 965 -25224
8296 -25224 -1673 72621 85856 51212 -30122 -14817 54548 151950 70992 -16966 -73548 57190
8284 57190 102035 73638 38722 21838 36112 15292 -53438 -144146 -90916 -31610 -17850 -61504
8272 -61504 -86620 -66041 -51264 -151532 -196273 -177204 -75534 -47455 -14443 -5534 -42855 -50565
8260 -50565 -33752 26898 51036 49593 51087 19503 -18766 -35886 -48441 -47237 -17614 29481
8248 29481 100931 206120 247099 159840 78308 -9475 -33640 -77358 -86837 -14655 22194 64418
8236 64418 71815 67229 59500 98207 60817 25478 45950 17355 553 51342 -13121 -43849
8224 -43849 -91180 -161075 -218067 -177450 -115157 -97485 -126844 -72312 -21537 4652 90953 204804
8212 204804 115003 37638 67018 21368 -35027 -108433 -96082 -19439 -34229 -84915 -52898 -81031
8200 -81031 -61724 -90502 -16257 49908 20492 -45089 -73776 -90424 -43231 38715 124456 151978
8188 151978 2004 -28713 11995 81386 55282 57848 91708 102148 8938 -17708 -65774 -76381
8176 -76381 -53081 -55819 -107167 -144000 -81817 23917 -15941 -44683 -5707 -63200 -129339 -160356
8164 -160356 -39397 -69143 -15160 67717 36680 96330 69275 24560 -71768 -131692 -79710
8153 -79710 -94936 -109822 -39606 3101 60610 159785 224361 130630 52923 -13734 -22289 -19833
8141 -19833 -18715 -21723 2929 32849 -2605 -50047 4908 2451 4489 -52519 -52257 -34467 -72660
8128 -72660 -60033 -36606 -40226 10474 21427 -2346 -63613 -89856 -103115 -120410 -105264 -93869
8116 -93869 -10382 63769 40184 -3176 8663 28526 70935 11660 -49195 -29454 31401 127551
8104 127551 120674 -46509 -124852 -100672 -101754 -27706 72719 77346 -8688 -331 11167 -20959
8092 -20959 -19743 -7796 8300 69767 27589 -62492 -22948 25838 35389 46085 -5810 29406
8080 29406 137861 112402 127393 53607 -22087 62855 116883 166519 193424 178817 145727 73437
8068 73437 -81734 -132941 -50993 98822 156905 224579 97805 -22606 6850 -10767 -29084
8057 -29084 4219 48036 84870 78381 128683 126836 97961 71574 106604 96273 44810 44909 34551
8044 34551 32243 37780 133476 140846 82513 15903 70356 93799 126760 107571 55851 37044
8032 37044 64256 95944 173272 152642 154663 174013 182623 178382 116900 69533 142910 179465
8020 179465 119751 101255 114089 46869 49485 109007 132245 132601 84262 54386 117270 184169
8008 184169 163934 171532 164426 83913 83519 66521 89771 160731 104880 -14461 -54796 -376
7996 -376 60509 37309 93982 35973 58446 57949 -7094 -74523 -71214 -31694 51071 34753 18638
7983 18638 62690 49127 52067 22766 -18444 2193 -12265 -50739 -15694 -4075 -21018 -127457
7971 -127457 -138107 -38972 -54427 -68168 -105566 -85734 -116597 -38555 -7086 43783 114989 122946
7959 122946 97921 -2661 -6949 26594 84677 3444 25437 35271 -75737 -122161 -19131
7948 -19131 59913 35840 75272 30510 8732 59538 144074 200337 165723 58123 -31083 -101484
7936 -101484 -31822 15035 58624 102200 132345 128229 76058 15412 4824 -36506 -39528 49864
7924 49864 119283 61474 44797 9789 23883 31574 48225 4325 -92347 -58137 -23308 -51341
7912 -51341 -31493 -5679 5504 90383 157141 83855 61036 91426 151919 181244 98414 62294
7900 62294 114447 96840 96320 112358 163960 151956 30453 1322 61436 29802 -48679 -17077
7888 -17077 1725 -57122 -108097 -92662 -24495 40484 117020 77644 27554 13463 75568 111271
7876 111271 76687 90945 55798 3440 29154 -6594 -92317 -31046 54557 131594 135164 103946
7864 103946 82180 153892 183294 142804 71517 -11557 -3369 69560 49574 42629 26062 65793
7852 65793 140311 131568 78211 91611 53635 84230 104161 42013 -55037 -85436 -42009 -17461
7840 -17461 3704 -10596 58903 113479 85697 116206 162132 49389 -40364 -58006 9669 67658
7828 67658 43643 -27015 -43894 -36302 -6812 52888 78586 146913 150867 144862 21103 -58372
7816 -58372 -10154 -11398 -65497 -41895 17570 97210 123604 181890 260567 190388 107738 5932
7804 5932 35363 36029 120704 111032 57746 -46157 -26186 68496 199431 213185 191772 166496
7792 166496 56408 -32853 -74786 -157583 -188524 -210850 -161385 -86988 27073 3683 -39614
7781 -39614 -16065 -9933 -30894 -79007 -31991 32493 94575 43406 76767 29348 24092 39203
7769 39203 122155 62184 60880 124783 142299 127731 21688 7820 3435 -44014 -77597 -74819
7757 -74819 -69876 -135299 -102385 -120769 -233581 -255331 -169685 -107268 -191413 -175105 -115821 -166103
7745 -166103 -162924 -35152 34514 105392 154823 56257 38622 45663 37932 13229 -59210 -73593
7733 -73593 -101080 -30581 25681 -1072 -20603 -9456 -76731 -122032 -86115 -60275 -121299 -150306
7721 -150306 -156392 -162948 -56064 33972 67155 29771 -106378 -60109 -52466 -78802 5437 -7038
7709 -7038 -69991 -28001 3187 1842 44901 88290 133224 98539 -33285 -30456 55501 20557
7697 20557 23289 33835 25218 10005 51518 -6150 13534 -8649 -118570 -113074 -137579 -88117
7685 -88117 -35486 13950 -18208 -135027 -168734 -115423 -170563 -214684 -202333 -234546 -163782 -59294
7673 -59294 -55506 11533 -11861 -1881 -52183 -81634 -96189 -160371 -165315 -102427 -15879 -29409
7661 -29409 -128042 -206248 -144309 -36645 -12814 41038 123861 142668 61243 23460 14197 53477
7649 53477 -30465 -39115 -26336 -37968 21708 24742 2735 64791 71927 13835 -32561 -54579
7637 -54579 -93171 -100647 -115918 -208240 -217143 -232325 -136121 -85700 29314 20897 -17576 -73244
7625 -73244 -116373 -141006 -89899 -29037 -48845 -124791 -124018 5716 -48039 18257 20673 -60544
7613 -60544 -71811 -38651 -64237 -86743 17202 82530 38414 -18665 -73288 -141676 -195078 -164468
7601 -164468 -129552 -76629 -33872 -89042 -71599 -1270 18956 39620 70085 65442 76128 67718
7589 67718 25764 -16055 -47241 -80573 -63220 -82504 -20491 51610 71979 60076 19114 5557
7577 5557 6548 30218 104121 74270 7389 -6437 -54787 -108858 -102990 -59708 62517 123933
7565 123933 27687 -21701 -30931 -64845 -90333 -123356 -98984 -90738 -27438 79603 80479 -29573
7553 -29573 -41679 -91707 -183613 -133536 -25352 -11252 -64470 -79658 -3338 4765 -46615 8622
7541 8622 55315 -9578 55648 41331 5976 -8523 -56202 -6696 9086 -15705 -40752 -33922
7529 -33922 44636 22382 -34433 -105437 -136364 -50965 -46152 7003 50636 -29869 -112440 -86371
7517 -86371 -61664 -57256 -31507 -9127 -11921 28924 12411 96713 65177 66518 27806 -49675
7505 -49675 -27640 13159 30741 34248 81719 29657 -56977 1100 49452 81963 21146 -10308
7493 -10308 44213 115422 68207 13785 -2202 8116 -46228 -18763 11650 -67221 -34461 -47849
7481 -47849 12850 -66043 -86310 6698 17085 51354 148015 158307 27459 -55129 -19699 -31731
7469 -31731 -17042 -49312 -15853 16485 117013 195287 94929 -42924 15971 117042 132916
7458 132916 71306 51940 -25894 -89531 -118035 -69846 11419 47222 72091 122838 54193 45138
7446 45138 60642 160119 63943 23805 -58448 -116873 -94997 -101655 -124699 -137437 -67828 39838
7434 39838 58182 114599 104948 25072 -42227 -114556 -94153 -101537 -120901 -70519 -15480 17543
7422 17543 39190 -32166 -8278 -16563 -15416 -13428 -92168 -123847 -122609 -49316 63640 135630
7410 135630 22959 -30590 -52233 -106465 -88826 -14230 59017 88595 19326 -61843 -59282 -39311
7398 -39311 5988 74063 11324 6138 48324 99734 97553 82732 56896 51976 3748 -6061 32425
7385 32425 63079 61103 -31584 -19661 -15610 -17509 14217 53597 -7317 -102483 -28636 28596
7373 28596 -57294 -82222 -89504 -25996 19204 -32091 -24194 40439 127294 142449 91204 36265
7361 36265 25079 -21166 -101874 -60633 -33451 22728 96868 108045 61780 5576 16069 61381
7349 61381 26796 -35911 -26757 -42719 -89259 -89437 -31076 54930 77618 28140 5161 29237
7337 29237 52394 92491 66674 109527 38568 6962 20721 20633 65091 26358 -59388 69041
7325 69041 139597 107112 12577 -25390 -42592 -147323 -233578 -175394 -147342 -134880 -175050 -130374
7313 -130374 -80389 -80900 -61231 -38248 -13156 -27549 -72070 -54336 -31821 -89376 -54522 -21844
7301 -21844 -70228 -65480 -12944 73819 16655 -27607 -11061 44499 94899 120626 51539 -84036
7289 -84036 -143546 -123782 -115217 -82065 -63329 67383 150168 33592 22305 76696 63248 68819
7277 68819 -93766 -203327 -175360 -133454 -92219 -99470 -121079 -51325 -21281 -14654 -79256 -76944
7265 -76944 -69852 -113753 -80161 -59337 26693 43866 52936 4941 37825 46965 20323 -48991
7253 -48991 -34573 -9514 38662 52527 -21382 -97983 -89003 -106172 -129137 -107546 -49742 -27626
7241 -27626 -74159 -133674 -128003 -55352 59680 62645 34353 17471 -11855 -10084 34243 57731
7229 57731 -74246 -127354 -53165 -3496 -8656 29192 21822 32857 34996 13856 20823 114903
7217 114903 118556 -2623 -62518 20675 118389 83233 33962 -80998 -174470 -189461 -269877
7206 -269877 -260961 -110969 -118196 -152661 -232319 -185983 -128868 -57944 31175 79105 128707 128114
7194 128114 23639 -33602 -11127 -74344 -150768 -205194 -243787 -239159 -145620 -90258 -79960 -56940
7182 -56940 -7421 -55819 -11283 13399 -17634 -38734 -79751 -135622 -142856 -155602 -117689 -133396
7170 -133396 -158112 -159406 -119147 -93991 -50167 -85127 -46689 4797 -6247 -24468 -17336 -18579
7158 -18579 -77272 -81282 -175207 -135735 -6266 75902 73151 -116848 -157989 -123339 -73905 42127
7146 42127 10956 -70056 -40261 20683 24236 73979 -14184 69461 48790 49574 48320 -20118 -54121
7133 -54121 30748 34397 -40554 -135887 -111913 -41494 -112748 -128477 -41077 -41920 -36540 10047 4817
7120 4817 19252 19010 -92625 -139416 -76514 -74616 -152605 -217754 -179143 -173040 -135589 -127051 -154083
7107 -154083 -130919 -104138 -98242 -84478 15020 31294 -59960 -120055 -113710 -139710 -100185 -73232
7095 -73232 -46950 -30752 -45157 -69245 -16978 -716 -38395 -57814 21743 36826 23461 -3622
7083 -3622 11443 115 -17656 58554 84967 93789 12325 -18483 -36516 -14314 6695 -12638
7071 -12638 46403 109733 127460 120172 88089 64087 40639 -46912 -68607 -52189 -69641 -35254
7059 -35254 17784 -42199 -114658 -87158 -73593 -54 44419 45281 17343 65546 79884 36842
7047 36842 6601 94861 50321 -14084 -33751 -19539 -105037 -177520 -126116 -6462 38194 -10508
7035 -10508 -53465 -36894 -28250 -74155 -50438 -41424 -29884 -8737 -3266 21464 6865 -89450
7023 -89450 -84549 -25917 -73455 -200697 -136915 -51716 -50780 -7467 -17244 1952 53068 37249
7011 37249 39648 23352 -9231 38780 87215 61774 -5771 -57537 61283 40843 -22899 29302
6999 29302 -55683 -166946 -250668 -223732 -165533 -134878 -185958 -116193 36758 93087 96431 98447
6987 98447 -42052 -70056 -64133 -107415 -84437 8088 -74869 -47290 13217 -61730 -67330 -63125
6975 -63125 -123582 -176325 -167407 -105218 -1335 -8222 -76803 -78047 -62852 23886 40841 41938
6963 41938 38973 17369 -23007 -86286 -69781 -30604 18930 92707 -10126 -31381 -30377 21819
6951 21819 -44061 -84252 -55450 -77529 -144612 -81783 -98555 -110933 -66165 -21890 56456 45971
6939 45971 59181 17773 17278 58888 41486 2371 33232 96082 63847 53026 114694 188715
6927 188715 206197 132626 74193 41455 31081 68282 15991 -39984 -84902 -91736 -37856 -21477
6915 -21477 -27628 -44604 20901 4300 -54351 -54549 -68642 -34595 -57689 59463 98965 67035
6903 67035 -5526 -4860 -11579 -37050 -73071 -70436 -170876 -181209 -199809 -42394 -17439 51424
6891 51424 41250 41117 -21177 -17187 -29442 12396 -39102 -76175 -11028 1597 -5123 -44405 -70774
6878 -70774 -117371 -66973 -49181 -121760 -55785 7147 76561 84196 29036 6918 17716 2296
6866 2296 3334 -48987 -63243 -78356 -68856 -70148 -132195 -162162 -124425 -150026 -143990 -53169 20722
6853 20722 28820 4135 -32508 2131 63449 9438 -18321 4819 -18070 -131315 -152437 -94151
6841 -94151 -71659 -90297 -14291 -57873 -123495 -92542 -48451 -47836 22419 12821 -1878 -39341
6829 -39341 -57563 -87804 -123866 -147649 -181753 -52899 -7585 -87047 -131308 -122673 -22164 -8513
6817 -8513 -68548 -16730 1687 22960 17601 55681 33423 53383 64710 39608 26192 -3104
6805 -3104 -31489 -28716 7905 7449 -13293 -7511 -19037 -72713 -151958 -137524 -86763 -76450 -47621
6792 -47621 1730 -16926 81021 82238 85258 103679 155502 131898 109793 190540 144778 78312
6780 78312 16512 -1344 44909 49250 2814 34120 73398 76992 73800 193326 199635 68385
6768 68385 -48453 -35158 -64814 -66990 -128550 -86874 -26619 -12215 22774 100480 115102 103928
6756 103928 82914 101833 126351 104235 39414 41618 15074 -59021 -35365 -71513 -97013 -87904
6744 -87904 -6205 71407 107388 47048 -8062 -17180 73268 32724 145867 226404 213440 135980
6732 135980 92189 123001 141201 84305 120973 123608 157027 237746 165900 142144 125383 178236
6720 178236 269239 316751 420246 585843 755273 938324 1270989 1841121 2751932 3807805
6710 3807805 4476354 4135528 3276558 2299061 1590784 1149470 860478 734934 542914 403721
6700 403721 319850 232232 300005 320126 239079 156947 106409 138986 142863 147479 181121 247150
6688 247150 164867 76270 99979 188463 217620 237630 188894 121856 42890 -63768 -27904
6677 -27904 29781 68913 62015 104880 81845 52594 87195 42940 -49634 6591 13631 -46400
6665 -46400 -52801 -98529 -121414 -5779 93629 82596 11426 -6035 -69899 -71241 -43298 -45168
6653 -45168 -68550 -75691 -122881 -47122 -74338 -111361 -151229 -215499 -194823 -159298 -133530 -62318
6641 -62318 -84748 -59016 -31191 -100961 -134251 -137973 -96419 -95047 -150504 -113379 -92665 -53998
6629 -53998 -49176 -95464 -179877 -109890 -38821 -53097 -23803 31995 35807 54308 82614 -20066
6617 -20066 -92940 -80242 -72488 -80037 -135756 -142793 -58881 18263 90801 52837 20012 -12745
6605 -12745 -95945 -142199 -127013 -96816 -81555 -125137 -149271 -66564 -32684 -40676 -140618 -149059
6593 -149059 -48925 -48072 -70493 -60312 -86917 -68592 -23467 -11781 -61079 -78688 -98291 -84621
6581 -84621 -72866 -34637 -10321 50093 -35192 -71693 -51481 27467 51911 24063 -14546 -58150
6569 -58150 -77259 -32195 9802 -10056 -32553 2056 -13108 -101098 -138910 -155436 -131710 -100747
6557 -100747 -43958 51755 33891 23442 47134 56399 13791 -36057 -88580 -107943 -158058 -173413
6545 -173413 -202860 -205142 -136679 -141293 -197006 -196813 -166497 -137601 -92788 -17809 -38039 -61194
6533 -61194 32363 107050 98394 99124 96404 42831 -43663 -28683 19298 76779 41442 4558 -8971
6520 -8971 53742 100029 150177 63483 32410 63122 92890 82984 67166 190757 150364 49426
6508 49426 36278 -2296 14806 81569 83168 13118 -39045 -118641 -58769 55461 27276 30893
6496 30893 48183 7011 8911 74992 52336 -62035 -52350 -27337 -92226 -66562 -47293 -70477
6484 -70477 -129908 -132930 -147022 -107915 -15408 28836 -3353 -7763 2871 -22501 -30963 -75449
6472 -75449 -106559 -38657 -36842 -134022 -120423 -27569 -55921 -37618 60764 133092 167978 163985
6460 163985 159013 206352 232326 171676 98921 24452 92766 230679 213491 134812 165817 94681
6448 94681 15804 3119 -13145 -60556 4739 41810 71787 11544 -1452 -10508 -64781 -43028
6436 -43028 -23933 9024 40030 136895 193984 161693 132978 165942 131586 12547 4416 30395
6424 30395 23617 -7773 -21083 -41210 -14455 58535 111502 72447 63781 123167 192272 141315
6412 141315 69587 153265 103569 47708 61774 62643 68032 39817 57426 24027 61183 164896
6400 164896 125230 139690 115789 130575 120075 33563 42392 98439 38721 16212 88059 101043
6388 101043 64447 -10785 -48196 51151 113880 91561 38742 -35547 -109875 -156904 -73381 3857
6376 3857 3255 -29656 -98837 -123926 -98907 -139260 -53294 34463 -38831 -109121 -65968 9325
6364 9325 51486 37119 121249 117952 100050 64363 -2805 -83573 -133876 -47925 30712 8124
6352 8124 -89358 -104458 -153288 -156747 -96579 -41935 16211 15453 -22273 -24066 -24806 -33734 -51920
6339 -51920 -82883 -19508 23316 51038 63260 109199 79368 -9495 -69213 -73599 -67380 -37757
6327 -37757 21182 26054 -25514 -53958 -32029 -34119 -46648 -86570 -14651 41592 -27442 -44469
6315 -44469 -20299 -55102 -121556 -159443 -74415 61546 75226 -22671 -115493 -75314 -21136 -23700
6303 -23700 3057 -101331 -208832 -202888 -146668 -107917 -82346 -101465 -184634 -152557 -50448
6292 -50448 -31297 -62357 -95002 -52804 -86055 -36543 17958 61137 127000 47626 -69923 -38890
6280 -38890 -55618 -92081 -112604 -19111 -26578 -113171 -118417 -113983 -95245 -81727 -75016 15660 117452
6267 117452 -33098 -134910 -151479 -104289 -69096 -60926 -117546 -136260 -65637 -25338 -61124
6256 -61124 16506 12895 62688 59704 8555 -19905 -14355 10192 17060 11670 22437 91868 33472
6243 33472 -46563 1472 -22639 -11984 -34306 7105 82172 -7320 -47417 -115265 -131474 -78333
6231 -78333 5326 95858 116299 42785 -20339 -14353 -49054 -731 23469 -3068 -30860 -11939
6219 -11939 30343 61224 154902 125450 -6315 -45831 -65097 -56656 -50844 -44245 -5424 -21712
6207 -21712 -32285 -102897 -95447 -170345 -147457 -85471 -92719 -132722 -104550 -46166 94334 149137
6195 149137 55427 18385 10509 -11316 -8070 12247 57325 160259 237081 232117 251892 253979
6183 253979 195012 128067 126692 95854 13129 4751 2733 -20520 1454 65089 88349 59388
6171 59388 55202 44842 63368 53672 1710 -18664 -21553 119689 161104 55849 -69211 -91273
6159 -91273 -20631 55050 74375 -86604 -103235 11874 6629 3229 -25460 -45595 -32877 11048
6147 11048 -84776 -96150 -81877 -70248 -12254 -38953 -147515 -100207 -27118 10923 10163 -65595
6135 -65595 -67251 4339 -1449 14983 -89565 -138443 -170580 -147393 -86120 -133744 -92792 21267
6123 21267 76601 76731 96533 11943 29685 26740 -57344 -19481 -20631 -97236 -90352 -56974 52382
6110 52382 24817 -63026 -90200 -64784 -120992 -155561 -216760 -134261 -63973 -137896 -174162 -200465
6098 -200465 -240310 -174197 -54713 50130 60592 -124421 -211830 -151745 -80653 -42121 -95911
6087 -95911 -47888 68192 18544 -96635 -96588 -62869 -79157 -18115 -33108 -54572 -65055 -58347
6075 -58347 -23187 -21855 24489 39587 56528 48457 53554 52495 25442 2562 -65317 -112156 -61819
6062 -61819 -69642 -174321 -111544 -127756 -172711 -132130 -115349 -100886 -81605 -38682 -83070 -174841
6050 -174841 -113735 -68000 -81216 11716 70525 135501 129596 56144 -66557 -90507 33448
6039 33448 145738 111923 52438 53632 35619 51652 29257 33256 11345 23890 -21613 -21702 -18406
6026 -18406 9063 -25409 25809 48822 78339 94416 61995 2889 -131650 -132234 -86624 -11396
6014 -11396 -60603 -77113 -50727 -15617 -18259 -31916 -44857 -12755 63776 30812 18225 1659
6002 1659 -2606 33725 -31104 -15650 34348 76099 199081 196674 169333 201380 114046 33675
5990 33675 18160 12371 -90390 -51820 -38880 -11429 -17403 -2314 120141 74099 128561 140807
5978 140807 64905 120131 180729 160491 60049 289 -39098 -74419 -71960 -75276 -84159 -130769
5966 -130769 -163749 -187203 -105166 -40460 -55659 -117055 -114435 -30709 -1401 -76801 -104889 -95611
5954 -95611 -64194 -8316 70571 59051 -17444 -111549 -49240 56008 52457 -9037 -123823 -223785
5942 -223785 -246629 -169941 -188618 -147336 -148645 -118532 -85472 -118179 -89154 -31815 29382 52068
5930 52068 74538 18703 -93935 -50046 37550 60990 -7062 -44597 -29300 -32717 -34607 33934
5918 33934 21151 -15274 77531 72110 55938 68274 75374 90457 33588 -44463 -12224 636
5906 636 -13161 -53045 -35550 33438 23005 -59363 -111272 -90835 -74034 -5014 -31708 10613
5894 10613 81384 23707 -12597 -51797 -81010 -91158 -64047 22281 68211 35871 9659 -40062
5882 -40062 -74840 -77266 -71335 -42486 -21011 -50003 -63849 30197 14640 -33278 -30237 -458
5870 -458 27998 -4774 -95741 -99187 -78129 -63641 40083 93661 22488 -69066 -119582 -171978
5858 -171978 -138699 -53737 -44035 -29799 2446 20781 30266 48141 91243 130476 80523 148830
5846 148830 108620 86689 84895 20340 -32052 -70669 -51486 -118112 -113693 -20201 527 -62605
5834 -62605 -77965 -69021 -47245 -35469 -28029 -39866 -64021 -66576 54142 121835 67238 -16955
5822 -16955 -24484 25484 121433 111752 37686 19076 6746 33336 14995 -45323 -79522 -45575
5810 -45575 -22439 14609 -11015 -7997 10982 70232 13491 57358 94930 8209 16330 -54525
5798 -54525 -132780 -81487 -44952 26279 39642 -14150 -17734 -31191 -64676 -76155 -202939 -219524
5786 -219524 -88730 -90794 -83451 -171118 -277951 -247824 -170402 -167920 -236567 -233949 -288148 -198509
5774 -198509 -91510 -82962 -103259 -106960 -130569 -80159 -53282 -58524 -117990 -92888 -91981 -51877
5762 -51877 -37527 -97695 -83776 -78290 19490 16044 32290 32105 1829 -30641 49687 91570 83763
5749 83763 -25156 -96181 -124193 54838 66198 37727 105789 114880 60020 53175 35046 27845
5737 27845 -134623 -139623 -63183 -11755 84009 173618 178222 123909 11073 -56943 -97253 -79259
5725 -79259 -15701 -1211 48900 1889 -6616 -46468 -45017 11245 6355 -6828 21305 -17136
5713 -17136 -83405 -61229 -63320 -45405 -65969 -147884 -186491 -180785 -103860 -36302 -29909 -58563
5701 -58563 -37094 -67111 -25805 -32641 -38878 -37922 101992 72771 46740 4704 -7848 -15193 -19914
5688 -19914 9353 -27364 -93814 -50667 -38123 -44640 -86600 -24019 -10615 28512 11895 -923
5676 -923 39727 44402 92829 115647 127856 86256 -18164 -109983 -160249 -141646 8022 -23214
5664 -23214 -56371 -139269 -144069 -45460 10747 61125 58104 34260 102837 71668 14780 -64265
5652 -64265 -59899 -6107 -34645 -33237 -34695 -78544 -82200 -18392 -2595 -70136 -127463 -157533 -123469
5639 -123469 -80067 -109240 -173368 -146318 -51295 -48733 -10582 22139 37022 45703 75774 81765
5627 81765 84404 76034 19529 -23066 96839 103954 51409 28142 -7352 -39168 -18514 -6125
5615 -6125 -30754 -71100 -81511 -22087 -11528 -75341 -173282 -234731 -235062 -116253 -72791 -63104
5603 -63104 -110545 -131212 -76289 -80884 -103795 -69487 -61607 -52231 -69412 -56520 -49572 -37371 54327
5590 54327 166492 116287 -64056 -109898 -54005 -33177 -89031 -25079 86475 108260 49167
5579 49167 33994 33304 -19253 -64616 -13472 -62934 -88131 4425 49761 -6197 26964 111493
5567 111493 222211 188925 62185 21362 35453 44091 14475 -72884 -166658 -130957 -40151
5556 -40151 -65778 -81354 -62770 6904 25292 -10330 -14486 -10557 -5740 62067 66099 -6236 -68943
5543 -68943 -90053 -171685 -192626 -2948 86812 73840 87514 50953 13723 7252 -10720 -60478
5531 -60478 -49712 77299 144100 143929 70333 -7384 -3743 30893 -16595 -31203 112168 134672
5519 134672 89980 100190 93654 98527 100610 64452 101255 -3929 -91998 -149365 -137383 -61199
5507 -61199 -81035 -39257 10182 27008 -4349 -5070 38799 -10984 -69306 49659 34774 -83602
5495 -83602 -141201 -135833 -146841 -118069 16330 90185 174355 214564 147222 122111 107299 64164
5483 64164 -10968 2955 18843 77254 94032 107102 111121 -6833 -82522 -84129 -83689 -133807
5471 -133807 -200025 -99486 -56692 -82026 -87609 -40339 30714 80427 56773 18921 -2689 -31907
5459 -31907 -121272 -127157 -61912 -90800 -10021 31402 -24056 -124156 -145575 -79102 -7535 -586
5447 -586 36303 -2572 -43912 -71277 -9342 58504 32562 -12703 -36740 -35992 -142851 -168361
5435 -168361 -74467 -27210 51309 79544 120338 138850 12258 -39659 -9661 8097 39339
5424 39339 -1504 33737 110698 101847 -4201 82878 178163 142634 123944 84052 91001 128794
5412 128794 117278 59863 40981 75224 87607 77094 116237 64073 -22855 -15907 -25124 -69167
5400 -69167 612 114996 77161 61119 47055 38588 16845 12634 51455 37556 91589 113167
5388 113167 53371 53711 82143 78717 -52998 4451 64328 19627 22456 65404 23983 1260
5376 1260 -24497 -26858 24815 59697 123044 162274 46623 -93305 -151664 -132589 -190646 -58051
5364 -58051 9435 27146 12824 -80879 -138612 -112378 -134082 -106334 -67508 -74867 -132846 -92686
5352 -92686 -8363 -3036 36283 90975 67158 81264 67682 14789 18375 -6327 61556 78863
5340 78863 59610 -54492 -132488 -90180 -127452 -97630 -47880 -23304 34019 -66669 -107690
5329 -107690 -61046 -22937 33295 -57188 -31263 23687 15132 -36227 -17528 8176 17399 75766
5317 75766 26374 9923 -19825 -44056 -70982 -93764 -54824 -40482 -46323 -141347 -177981 -280110
5305 -280110 -193556 -137978 -157477 -111020 -113576 -57583 -62451 -98201 -116280 -109797 -98975 -80402
5293 -80402 -57238 -11734 42124 121826 52736 -31761 -81844 -35589 -29137 -56467 -101005 -60065
5281 -60065 -105891 -54328 -55323 -42605 -109199 -103108 117385 159877 -43997 -139089 -75105 -24967
5269 -24967 8570 -19934 -21659 -46471 -162863 -106653 -22341 -22603 -58863 -51749 48514 122656
5257 122656 89028 31479 -29942 -59146 -83652 -131142 -109217 -82160 -41945 -39256 -43239 -25503
5245 -25503 -28547 4556 37436 114825 135432 107607 113631 -30047 -19880 -20987 -102986 -72969
5233 -72969 -77980 -48240 -36266 50771 124538 105446 147927 81781 26425 3618 47173 13163
5221 13163 -36833 -32521 -34604 -32480 -31647 -10702 1198 -68714 -146916 -160970 -155587 -18783 26568
5208 26568 -27563 -93791 -83715 13624 109163 208480 168283 65519 19511 2190 29467 54026
5196 54026 81589 66376 5209 -47411 -69752 -156835 -193125 -169674 -139501 -118781 53209 20327
5184 20327 -22827 -31218 -46812 -37247 43857 17240 -55558 -23558 -64712 -2293 -10174 -58977
5172 -58977 -102225 -74480 -1667 49087 64570 39296 -36167 -77748 -72895 -155572 -167361 -65697
5160 -65697 45070 101437 84816 49707 487 9977 51824 40879 20724 -65230 -73814 -50194
5148 -50194 -18623 -1042 17514 42207 94580 131115 175299 162695 127979 95479 124069 183247
5136 183247 115561 63855 100763 101897 109728 87574 70191 80938 65236 37649 57983 110813
5124 110813 105484 81514 7405 -16342 -17935 -9107 -17863 1612 23018 -30790 -6697 91068
5112 91068 26477 17809 -43534 -19152 13002 -11919 -51911 -67757 -6435 -20177 35864 97448
5100 97448 74835 35056 83141 22357 -4685 13266 59674 73731 30970 43697 41949 -71501
5088 -71501 -100040 -103187 -17132 67711 112136 81400 -14647 3096 -23360 -68385 -43199 -56732
5076 -56732 -96285 -58849 -17068 -88406 -79251 -41228 -105468 -87146 -33476 -35757 -130274 -126473
5064 -126473 -97213 -85040 -66669 -109613 -58241 11095 72025 -29029 -84559 -9995 24693
5053 24693 43793 21033 39873 69229 31202 -16175 -1325 67972 128188 4338 -75578 13815
5041 13815 67025 42430 -14178 62937 56960 35402 19994 12197 22361 78610 101788 186886
$$ [...]
##END NTUPLES=NMR SPECTRUM
##END=
