##TITLE=Analysis number 314355
Compound Code cc 45716
Book Reference 440/76
Project Code adrs
Chemist Name craigr
##JCAMPDX= 6.0         $$ Bruker NMR JCAMP-DX V2.0
##DATA TYPE= NMR SPECTRUM
##DATA CLASS= NTUPLES
##ORIGIN= Bruker BioSpin GmbH
##OWNER= NMR
$$ XWIN-NMR		Version 3.5
$$ Fri Oct 14 10:48:16 2005 GMT Daylight Time (UT+1h)  MAYBRIDGE\NMR@NMR_250MHZ
##.OBSERVE FREQUENCY= 250.131544655141
##.OBSERVE NUCLEUS= ^1H
##.ACQUISITION MODE= SIMULTANEOUS (DQD)
##.ACQUISITION SCHEME= undefined
##.AVERAGES= 16
##.DIGITISER RES= 18
##SPECTROMETER/DATA SYSTEM= dpx250
##.PULSE SEQUENCE= zg30
##.SOLVENT NAME= CDCl3
##.SHIFT REFERENCE= (INTERNAL, CDCl3, 0, 16.522)
##AUDIT TRAIL= $$ (NUMBER, WHEN, WHO, WHERE, WHAT)
$$ ##TITLE= Audit trail, XWIN-NMR		Version 3.5
$$ ##JCAMPDX= 5.01
$$ ##ORIGIN= Bruker BioSpin GmbH
$$ ##OWNER= NMR
$$ C:\u/data/dgb/nmr/ADRS/10810/pdata/1/auditp.txt
$$ ##AUDIT TRAIL=  $$ (NUMBER, WHEN, WHO, WHERE, WHAT)
(   1,<2005-10-14 10:47:42.66 +100>,<MAYBRIDGE\NMR>,<NMR_250MHZ>,
      <created by zg, POWCHK disabled, PULCHK disabled
       configuration hash MD5:
       62 19 C7 07 E1 42 D1 B7 37 6C 3D D0 77 39 F9 E6
       data hash MD5: 64K
       1E B0 65 C1 36 23 40 FA 6D EE 2E 9A 6A F9 BC 16>)
(   2,<2005-10-14 10:47:57.71 +100>,<MAYBRIDGE\NMR>,<NMR_250MHZ>,
      <Start of raw data processing
       ef LB = 0.3 FT_mod = 6 PKNL = 1 SI = 32K 
       data hash MD5: 32K
       6F 97 72 33 47 6F 98 F4 F8 6E ED 74 DE 47 C2 3E>)
(   3,<2005-10-14 10:48:02.39 +100>,<MAYBRIDGE\NMR>,<NMR_250MHZ>,
      <apk 
       data hash MD5: 32K
       C2 85 B1 7F E7 16 5B 1D 19 6F A2 DB D3 5F BB 55>)
(   4,<2005-10-14 10:48:04.07 +100>,<MAYBRIDGE\NMR>,<NMR_250MHZ>,
      <abs ABSG = 5 
       data hash MD5: 32K
       65 D0 24 DC C8 A4 DC 74 89 DD 01 5A 79 39 17 63>)
$$ ##END=
$$ 
$$ hash MD5
$$ 4F 39 A1 B2 A0 D2 D6 F3 4C 49 25 2C C3 40 6E 79
##$RELAX= 
##$RELAX= 
##$RELAX= 
##$RELAX= 
##$RELAX= 
##$RELAX= 
##$RELAX= 
$$ Bruker specific parameters
$$ --------------------------
##$DU= <C:\u>
##$EXPNO= 10810
##$NAME= <ADRS>
##$PROCNO= 1
##$TYPE= <nmr>
##$USER= <dgb>
##$AMP= (0..31)
100 100 100 100 100 100 100 100 100 100 100 100 100 100 100 100 100 100 
100 100 100 100 100 100 100 100 100 100 100 100 100 100 
##$AQSEQ= 0
##$AQ_mod= 3
##$AUNM= <au_zg>
##$AUTOPOS= <42 >
##$BF1= 250.13
##$BF2= 250.13
##$BF3= 250.13
##$BF4= 250.13
##$BF5= 500.13
##$BF6= 500.13
##$BF7= 500.13
##$BF8= 500.13
##$BYTORDA= 1
##$CFDGTYP= 0
##$CFRGTYP= 5
##$CHEMSTR= <none>
##$CNST= (0..31)
1 1 145 1 1 1 1 1 1 1 1 1 1 1 1 1 1 1 1 1 1 1 1 1 1 1 1 1 1 1 1 1 
##$CPDPRG= <>
##$CPDPRG1= <>
##$CPDPRG2= <>
##$CPDPRG3= <>
##$CPDPRG4= <mlev>
##$CPDPRG5= <mlev>
##$CPDPRG6= <mlev>
##$CPDPRG7= <mlev>
##$CPDPRG8= <mlev>
##$CPDPRGB= <>
##$CPDPRGT= <>
##$D= (0..31)
0 1 0 0 0 0 0 0 0 0.06 0 0 0 0 0 0 0.0002 0 0 0 0 0 0 0 0 0 0 0 0 0 0 
0 
##$DATE= 1129283261
##$DBL= (0..7)
120 120 120 120 120 120 120 120 
##$DBP= (0..7)
150 150 150 150 150 150 150 150 
##$DBP07= 0
##$DBPNAM0= <>
##$DBPNAM1= <>
$$ [...]
##$SUBNAM7= <"">
##$SUBNAM8= <"">
##$SUBNAM9= <"">
##$SW= 20.6930455092707
##$SWIBOX= (0..15)
0 0 3 0 0 0 0 0 0 0 0 0 0 0 0 0 
##$SW_h= 5175.983436853
##$TD= 65536
##$TD0= 1
##$TE= 294.16
##$TE2= 300
##$TE3= 300
##$TEG= 300
##$TL= (0..7)
0 120 120 120 120 120 120 120 
##$TP= (0..7)
150 150 150 150 150 150 150 150 
##$TP07= 0
##$TPNAME0= <>
##$TPNAME1= <>
##$TPNAME2= <>
##$TPNAME3= <>
##$TPNAME4= <>
##$TPNAME5= <>
##$TPNAME6= <>
##$TPNAME7= <>
##$TPOAL= (0..7)
0.5 0.5 0.5 0.5 0.5 0.5 0.5 0.5 
##$TPOFFS= (0..7)
0 0 0 0 0 0 0 0 
##$TUNHIN= 0
##$TUNHOUT= 0
##$TUNXOUT= 0
##$USERA1= <user>
##$USERA2= <user>
##$USERA3= <user>
##$USERA4= <user>
##$USERA5= <user>
##$V9= 5
##$VALIST= <valist>
##$VCLIST= <CCCCCCCCCCCCCCC>
##$VD= 0
##$VDLIST= <DDDDDDDDDDDDDDD>
##$VPLIST= <PPPPPPPPPPPPPPP>
##$VTLIST= <TTTTTTTTTTTTTTT>
##$WBST= 1024
##$WBSW= 4
##$XGAIN= (0..3)
0 0 0 0 
##$XL= 0
##$YL= 0
##$YMAX_a= 272528
##$YMIN_a= -164992
##$ZGOPTNS= <>
##$ZL1= 120
##$ZL2= 120
##$ZL3= 120
##$ZL4= 120
##$ABSF1= 16.522
##$ABSF2= -4.171173
##$ABSG= 5
##$ABSL= 3
##$ALPHA= 0
##$AQORDER= 0
##$ASSFAC= 0
##$ASSFACI= 0
##$ASSFACX= 0
##$ASSWID= 0
##$AUNMP= <proc_1d>
##$AZFE= 0.1
##$AZFW= 0.1
##$BCFW= 0
##$BC_mod= 0
##$BYTORDP= 0
##$COROFFS= 0
##$CY= 12.5
##$DATMOD= 1
##$DC= 0
##$DFILT= <>
##$DTYPP= 0
##$F1P= 14.0000005364418
##$F2P= -0.99999901652339
##$FCOR= 0.5
##$FTSIZE= 32768
##$FT_mod= 6
##$GAMMA= 0
##$GB= 0
##$INTBC= 1
##$INTSCL= 1
##$ISEN= 128
##$LB= 0.3
##$LEV0= 0
##$LPBIN= 0
##$MAXI= 10000
##$MC2= 0
##$MEAN= 0
##$ME_mod= 0
##$MI= 0
##$NCOEF= 0
##$NC_proc= -5
##$NLEV= 6
##$NOISF1= 0
##$NOISF2= 0
##$NSP= 0
##$NTH_PI= 0
##$NZP= 0
##$OFFSET= 16.522
##$PC= 1
##$PHC0= -62.37761
##$PHC1= 10.11232
##$PH_mod= 1
##$PKNL= yes
##$PPARMOD= 0
##$PSCAL= 4
##$PSIGN= 0
##$REVERSE= no
##$SF= 250.13
##$SI= 32768
##$SIGF1= 0
##$SIGF2= 0
##$SINO= 400
##$SIOLD= 32768
##$SREGLST= <1H.CDCl3>
##$SSB= 0
##$STSI= 32768
##$STSR= 0
##$SW_p= 5175.98343685301
##$SYMM= 0
##$S_DEV= 0
##$TDeff= 65536
##$TDoff= 0
##$TI= <Analysis number 999999
Compound Code 99
Book Reference 9
Project Code 9>
##$TILT= no
##$TM1= 0
##$TM2= 0
##$TOPLEV= 0
##$USERP1= <user>
##$USERP2= <user>
##$USERP3= <user>
##$USERP4= <user>
##$USERP5= <user>
##$WDW= 1
##$XDIM= 32768
##$YMAX_p= 396057744
##$YMIN_p= -1219672
$$ End of Bruker specific parameters
$$ ---------------------------------
##NTUPLES= NMR SPECTRUM
##VAR_NAME=  FREQUENCY,     SPECTRUM/REAL,   SPECTRUM/IMAG
##SYMBOL=    X,             R,               I
##VAR_TYPE=  INDEPENDENT,   DEPENDENT,       DEPENDENT
##VAR_FORM=  AFFN,          ASDF,            ASDF
##VAR_DIM=   32768,         32768,           32768
##UNITS=     HZ,            ARBITRARY UNITS, ARBITRARY UNITS
##FACTOR=    0.157963299565203, 1,           1
##FIRST=     4132.6476996994, 0,             0
##LAST=      -1043.33573715361, 0,           0
##MIN=       -1043.33573715361, -1219672,    0
##MAX=       4132.6476996994, 396057744,     0
$$ Real data points
##PAGE= N=1
##DATA TABLE= (X++(R..R)), XYDATA
$$ [...]
20116a40978R3284Q2781j56066j31988m7108L99456M7849J84369J30359j39151
20106C22807k26402j27946N16117J67253p7735j09303j70266K4092l69274k0672
20096g1329j35265l15811O9883L0632J19423N7277K90038J96075j42019k25237
20086a26333P8614r9922p4212K47906J4735j21305J278J5233j02855j49131J10245
20075b05747Q9660j02027K55302k614L5322J49233j1402k02559k9406K13303j08128
20064H0937o7520k5550J15578J72683N0267l0868k28245N2497j60894k03509O4552
20053a80072K20981J10645j54636k18651j70265M1752j3442q497P5462L14368
20043A7645K25278N4544K92891L8119m11410k11972L17807J00832j20074j81167
$$ y = [-140978, -47694, 35087, -120979, -252967, -300075, 99381, 147230, 331599, 461958, 322807, 96405, -31541, 484576, 651829, 574094, 464791, 294525, 318617, -50657, -71329, -206594, -522405, -452522, -421890, -302467, -245190, 44848, 240923, 98904, -126333, -47719, -147641, -221853, 26053, 40788, -80517, -79239, -64006, -166861, -315992, -205747, -116087, -218114, 37188, 34574, 69896, 219129, 207727, 5168, -24238, 189065, 80937, 13417, -12133, 103445, 276128, 326395, 295527, 67282, 119779, -41115, -244624, -180072, 40909, 151554, -3082, -221733, -391998, -350246, -363688, -372185, -296723, 17645, 242923, 297467, 590358, 628477, 217067, 5095, 322902, 423734, 303660, 122493]
20033A22493J58968J87676k7686J84817m2547K9090j13015j8529N7726P1956o2402
20022E48547k28736k27516K36250q6738K06185R6248j84751l06873k20552j75248
20012c43184J70567M8996K24805N7652j70376j46J36765N2051n3788j40571j06231
20001a23460j48075m3850j40277J47993R1383p6431Q9230R8239p0725R7736L48191
19990B69954M41650R4818k7593r0213k2371j24496m77577j26990J34247J23178
19980A94607K28935l948k22112q1444q3754q600j913k52642J46418J41015L10180
19969C66742K6281j81747j43657j92730K05146j1981L459j01389N7527R9249K60826
19958C87726J86587K1489j47416n9294O3861j30083P6048L85017L24588q5841
$$ y = [122493, 281461, 469137, 441451, 626268, 583721, 612811, 499796, 481267, 538993, 610949, 548547, 319811, 92295, 328545, 241807, 447992, 544240, 359489, 52616, -167936, -343184, -172617, -123621, 101184, 158836, -11540, -11686, 125079, 177130, 123342, -17229, -123460, -271535, -315385, -455662, -307669, -216286, -292717, -203487, -105248, -175973, -78237, 269954, 711604, 806422, 778829, 688616, 666245, 541749, 64172, -62818, 71429, 194607, 423542, 419594, 197482, 116038, 32284, 23684, 21771, -230871, -84453, 56562, 366742, 393023, 211276, 67619, -125111, 80035, 68054, 71513, -29876, 27651, 126900, 387726, 574313, 595802, 448386, 389092, 452953, 322870, 398918, 783935, 1108523, 1022682]
19948A022682j27036j09330Q2231J62456M8655j68504j34949l78929k5049J85509
19938E57736N1961J01866L05813j89451l26406k17095l82740m16565j76785P2538
19928f19128l01345k99199M01347K68986r907K64250J36940J83844P9046l0906
19918G3928J04914r449J21809k2262J3727n3279K70302n6189j69983j06865r9677
19907F6976J99820j43437J24286k22858m30K14859l9899J77739L7563L2606j59097
19896B88128J13582j11899j34696J38201L0728k27518l1815j52928r4693k92564
19886d75474j01147L01331K60171M6487N0942k54546k70710K24881L33801l2839
19876H2897j15966j96763J48386P2143K43500J16259m1218j57713J1110M6412
$$ y = [1022682, 895646, 786316, 868547, 1031003, 1079658, 911154, 776205, 397276, 372227, 557736, 609697, 711563, 1017376, 827925, 501519, 284424, -98316, -514881, -691666, -619128, -920473, -1219672, -818325, -549339, -559246, -294996, -158056, 25788, 104834, 73928, 178842, 169393, 291202, 268940, 282667, 229388, 499690, 443501, 273518, 166653, 66976, 266796, 123359, 247645, 24787, 24357, 239216, 199317, 377056, 414619, 447225, 288128, 401710, 289811, 155115, 293316, 324044, 96526, 64711, -88217, -182910, -475474, -576621, -275290, -15119, 31368, 82310, -172236, -442946, -218065, 115736, 82897, -33069, -229832, -81446, -9303, 234197, 350456, 309238, 151525, 162635, 209047]
19866B09047q7000J4975L66024M2390j1899N500j93879l0783p4154J06037J42569
19855D88827j64921J35692k59114k8585K5587j46145m5823l5047M6130K8883Q6736
19844A32220M91111L6051m30112p5625o327o6252j18945J16153L6144k25610q0319
19833a91511j9338p3922J02028J60299Q9242L67732j04039m04390J99172M47111
19823E72384k52165j75149J4997J23619j5766p4706j14734j05173K1084P8480
19813G2871J28314o2662j97853Q7782L53123J05159j64261J90384l03340L6592
19803B46109K45084l6514j43878J84190K35810J52062k62770j43807k59735j08821
19793A07730k2833L463N4837K0281L7420j54488N4239q677j6227R4151j58306
$$ y = [209047, 122047, 137022, 503046, 545436, 533537, 539037, 345158, 314375, 240221, 346258, 488827, 323906, 459598, 200484, 171899, 197486, 51341, 5518, -29529, 16601, 45484, 132220, 623331, 659382, 229270, 153645, 147318, 81066, -37879, 78274, 114418, -111192, -191511, -210849, -284771, -182743, -22444, 66798, 434530, 330491, -73899, 125273, 572384, 320219, 145070, 160067, 283686, 267920, 193214, 78480, -26693, -5609, 72871, 201185, 138523, -59330, 28452, 381575, 486734, 322473, 512857, 209517, 246109, 491193, 454679, 310801, 494991, 730801, 882863, 620093, 476286, 216551, 107730, 84897, 88360, 143197, 163478, 200898, 46410, 100649, 91972, 75745, 169896, 11590]
19782A1590N3218L69835J65673k20564l56233m16887J26655K09042J31852K28283
19772C02464J9593j1604N368Q6530K67038n9241j47891O8137k82761L2637n3317
19761B26953m1972P0937Q523N5544K55140k32162m9513J02621n00778N3741K7960
19750b3006k57490J62534K82336k27076k73592p5517r0129J71767J97826L6114
19740i6233J81474J08430J63698J5810K83329K53138k29907m17289j18669o4577
19730G9204o0943p006M9673p7343l6223Q8072r685N6000J21388K34834k4739P7772
19718D91004J23706k1723j92896n7095k53981j98039J03854L7263L85908K29619
19708F47620k26227m5884q1641n2807R5158J7428j03366k90245j0112M7188J12045
$$ y = [11590, 64808, 434643, 600316, 379752, 23519, -393368, -266713, -57671, 74181, 302464, 322057, 310453, 315821, 402351, 669389, 610148, 462257, 530394, 247633, 280270, 226953, 184981, 255918, 264441, 319985, 575125, 342963, 293450, 396071, -104707, -50966, -23006, -280496, -117962, 164374, -62702, -336294, -411811, -501940, -330173, -132347, -96233, 85241, 193671, 357369, 373179, 656508, 909646, 679739, 262450, 143781, 79204, 18261, 11255, 60928, -16415, -52638, 35434, 25749, 81749, 203137, 437971, 413232, 491004, 614710, 592987, 400091, 342996, 89015, -109024, -5170, 32093, 418001, 647620, 421393, 375509, 293868, 241061, 336219, 353647, 250281, -39964, -50076, -2888, 109157]
19697A09157J27123J18102K04095K94993k84173j96719J42569o1803K8937j76424
19687C05857k22889k54030j80952J89729j28121R8932J84262p021K65713K7446
19677B78926j33924p8537J47372O1238q0449m1641O9983o8039J2356Q4421O4929
19666C16635k88482j11512P6719j5773Q9202J33442P3165L34268K8839j39584
19656D96919j17311L5599J53803P2657R6560j14722J792k1125k35623J2749K65548
19645F46846K64414j11029q6001N2809m6750K12761J1165N6331J46991k90433
19635H57104l73599M08J45173J9814J6129k8359j8873q7059r5387l4446k6255
19624C74650J7736J9252Q6618K589O2627K54684j8407k03454l7291L6268m9419
$$ y = [109157, 236280, 354382, 558477, 853470, 569297, 372578, 515147, 453344, 482281, 305857, 82968, -171062, -352014, -162285, -290406, -191474, -7212, -14233, 251480, 278926, 145002, 66465, 213837, 275075, 194626, 152985, 222968, 154929, 167285, 251706, 316635, 28153, -83359, -6640, -22413, 66789, 200231, 273396, 607664, 636503, 496919, 379608, 415207, 569010, 641667, 738227, 623505, 625297, 604172, 368549, 381298, 646846, 911260, 800231, 714230, 767039, 720289, 933050, 944215, 1000546, 1147537, 857104, 483505, 483913, 629086, 648900, 665029, 636670, 617797, 530738, 435351, 400905, 374650, 392386, 411638, 498256, 500845, 563472, 818156, 799749, 596295, 559004, 595272, 545853]
19613E45853K82345Q7206j27076J18862K46974k45933m67641O5392J89848J78506
19603H74336K1363j08986J74065K96694P6692n8059j83492J23863L32665L2138
19593A581279j60957L3508r8971p3584p4270M1661K35137N2036m0355j99726j1215
19582A284543J16840J40298Q6578j29709J08825N1672J57504N51944L19259r8990
19572B588764P835J99035j7325J06580L27414K20406j53827K00251M04887K32246
19562D116266K34029M2192l86095L51485L49680J44360J49353P71369M85469M61028
19552F719136K15626j24267K13882L34010K25828P11155Q78281O16972Q26041
19543A0616664M75759N22652R85920J086905J158330J226720J367994J517933
$$ y = [545853, 828198, 915404, 788328, 907190, 1154164, 908231, 440590, 505982, 695830, 874336, 895699, 786713, 960778, 1257472, 1334164, 1276105, 1092613, 1216476, 1549141, 1581279, 1420322, 1453830, 1354859, 1281275, 1207005, 1248666, 1483803, 1535839, 1495484, 1295758, 1284543, 1401383, 1541681, 1628259, 1498550, 1607375, 1659047, 1816551, 2368495, 2687754, 2588764, 2596599, 2795634, 2778309, 2884889, 3212303, 3432709, 3278882, 3479133, 3884020, 4116266, 4350295, 4392487, 4006392, 4357877, 4707557, 4851917, 5001270, 5772639, 6258108, 6719136, 6934762, 6810495, 7024377, 7358387, 7584215, 8295370, 9173651, 9790623, 10616664, 11092423, 11615075, 12600995, 13687900, 14846230, 16072950, 17440944, 18958877]
19535A8958877J542699J532732J694066K087574J944707K229831K389875L068551
19527C5448912L535749M502347N830604P464008R315827J1946306J4988031J7723268
19519A10755052J8846378J7911234J4498418Q019814m90786q664288j5286060
19512A45589762j9687821k0109204j7637211j4374463j1158926q760057o300701
19505D7561379n045704m035702l691281l448183l419915k926329k467522j979012
19497B0547731j816282j942570j750752j648401j394738j065039q57938p87631
19489I284380m70775m96978l54487o71420n37434m92962k88939k01960o8136n3770
19479E647519k25465o06809k26916l50640n17831k89505l56584j27282Q4012j64725
$$ y = [18958877, 20501576, 22034308, 23728374, 25815948, 27760655, 29990486, 32380361, 35448912, 38984661, 43487008, 49317612, 56781620, 66097447, 78043753, 93031784, 110755052, 129601430, 147512664, 162011082, 170030896, 169540110, 160875822, 145589762, 125901941, 105792737, 88155526, 73781063, 62622137, 53862080, 47561379, 42515675, 38479973, 34788692, 31340509, 27920594, 24994265, 22526743, 20547731, 18731449, 16788879, 15038127, 13389726, 11994988, 10929949, 10072011, 9284380, 8813605, 8316627, 7962140, 7290720, 6753286, 6260324, 5971385, 5769425, 5701289, 5647519, 5422054, 4815245, 4588329, 4237689, 3719858, 3430353, 3073769, 2946487, 3030499, 2865774]
19469B865774l40833k40091k36206j98912j41852k01639n4180K70908J71552l38547
19459A555974j39133P1796J34570k19859k18503q0298p192j72893N034j98900
19449G30596l1604r0721P7561L92527J70905J125j41367o3035j00695j13431j7432
19438H14429J7060J17595K16033J3982j35012p0769Q456m1981k06691j12277j38144
19427D82681q0227j0000J64689J52028R0861R9894J66710n0539k8896J98704J45071
19416A330976j66366k96918l55813n3788n4865l7361J34829K96173K21804K5581
19406A044252O4242K3520Q9630J42735m1751j72433j1653K2348k5359j04073l5602
19395I95856M0261j07931k10714j39005K75279Q2612L3849n4180J49272o2009
$$ y = [2865774, 2524941, 2284850, 2048644, 1849732, 1707880, 1506241, 1452061, 1722969, 1894521, 1555974, 1416841, 1488637, 1623207, 1403348, 1184845, 1104547, 1097355, 924462, 929496, 730596, 698992, 608271, 685832, 1078359, 1249264, 1250389, 1109022, 1045987, 945292, 831861, 814429, 831489, 949084, 1165117, 1179099, 1044087, 973318, 981774, 939793, 733102, 620825, 482681, 402454, 392454, 557143, 709171, 800032, 899926, 1066636, 1016097, 987201, 1185905, 1330976, 1164610, 867692, 511879, 458091, 403226, 365865, 500694, 796867, 1018671, 1044252, 1108494, 1132014, 1221644, 1364379, 1322628, 1150195, 1138542, 1160890, 1135531, 1031458, 995856, 1036117, 928186, 717472, 578467, 853746, 936358, 970207, 916027, 1065299, 1003290]
19385A003290j34285K5992k0632J05580n6279j37019k10246j01223j15K45824
19375G20887K51223M80285j99568j73540j14571r9799J80271J74605k20220L0662
19365A030235M3236j2105K8400J85608L05541M6011m8901J36364K23745K23361
19355B161495j26085m63525j06035k4346l7559L94259J74831J24036J52323O3303
19345B312697N20113L50553L76632J25948k06489k3445J22879K86020K48150J10628
19335D223686Q8551m439M0696K19046M02541L34508M30747N79060L07276K25773
19325F847445M23542L93290J37539O37552P72616P74508P47246Q11025R50523
19316A2495286J111068J149495J306366J103383J176487J135064J346843J535478
$$ y = [1003290, 869005, 894997, 874365, 979945, 923666, 786647, 576401, 475178, 475063, 720887, 972110, 1452395, 1252827, 1079287, 964716, 864917, 1045188, 1219793, 999573, 1030235, 1073471, 1061366, 1089766, 1275374, 1580915, 1626926, 1578025, 1714389, 1938134, 2161495, 2035410, 1571885, 1465850, 1441504, 1403945, 1798204, 1973035, 2097071, 2249394, 2312697, 2832810, 3183363, 3559995, 3685943, 3479454, 3456009, 3578888, 3864908, 4113058, 4223686, 4312237, 4307798, 4348494, 4567540, 4970081, 5304589, 5735336, 6314396, 6621672, 6847445, 7270987, 7664277, 7801816, 8439368, 9211984, 9986492, 10733738, 11544763, 12495286, 13606354, 14755849, 16062215, 17165598, 18342085, 19477149, 20823992, 22359470]
19308B2359470J765762K044328J733277K086341K435926L086634L038320L665331
19300D2215389M919954N995081P716631J0112131J2325101J4909619J7458369
19293A15652275J8460809J6683435J2026698M434945m939366j3378189j8678767
19286A30261840j9893579j8250914j4863184j1605049q662352o474991n092146
19279D5419625m305623l901064l650114k915792k930388k758663k312070k010934
19271B0634977j766594j701802j286898j034615j312981j064923p40045o87510
19263A1039609r04991r78532n11394o87529o84862l69558l36346o18973m44746
19254E502678k93684j02240O1772j03821k95302j75357k56842m18543l77314l55632
$$ y = [22359470, 24125232, 26169560, 27902837, 29989178, 32425104, 35511738, 38550058, 42215389, 47135343, 53130424, 60847055, 70959186, 83284287, 98193906, 115652275, 134113084, 150796519, 162823217, 167258162, 162318796, 148940607, 130261840, 110368261, 92117347, 77254163, 65649114, 56986762, 50511771, 45419625, 41114002, 37212938, 33562824, 30647032, 27716644, 24957981, 22645911, 20634977, 18868383, 17166581, 15879683, 14845068, 13532087, 12467164, 11727119, 11039609, 10134618, 9156086, 8644692, 7957163, 7272301, 6902743, 6566397, 5947424, 5502678, 5208994, 5106754, 5168526, 5064705, 4769403, 4594046, 4337204, 3918661, 3541347, 3185715]
19244C185715j64357j52993J51433N238l37115m37632l30248k18563k08888j7811
19234A474779n5850L04162q1752m41140J401r1151j24226L7829n9638j08641m0608
19223H15165K4556j64897K38172Q3046k35819n5943K55337N1354k63820j16179
19213F30972j40202N1795O1516o697J05814o9254q1942q384j63352K24193K47674
19202H52133N730k53416K70873k20919m81018m877J92246N7389q9971q2310O8356
19191C14216J2042j40131k47332K2973Q0858L66442J36791R9679M2555k05570
19181D82523j34890k38747k57857Q9160J70205o032k5690N406J65063K37007O2654
19170E48802k62353q8909J67615J67431o3880O0947k69128k22489p9471J12130
$$ y = [3185715, 3021358, 2868365, 3019798, 3025036, 2687921, 2250289, 1920041, 1701478, 1492590, 1474779, 1418929, 1723091, 1641339, 1200199, 1201600, 1110449, 986223, 1024052, 964414, 855773, 815165, 839721, 674824, 912996, 996042, 760223, 704280, 959617, 1010971, 747151, 630972, 490770, 542565, 604081, 597384, 703198, 633944, 552002, 543618, 380266, 604459, 852133, 857863, 604447, 875320, 654401, 173383, 168506, 360752, 418141, 328170, 245860, 314216, 326258, 186127, -61205, -38232, 42626, 409068, 545859, 645538, 688093, 482523, 347633, 108886, -148971, -59811, 110394, 104362, 78672, 84078, 249141, 486148, 548802, 286449, 197540, 365155, 532586, 468706, 529653, 260525, 38036, -41435, 70695]
19160G0695N40512J22978R2795r873l60825m6097L5831k75819j6009J76265J244
19149C31697o11Q2714J62296K6137j43208k06146J22811k25984J70333J25567
19139D45606o1245J15343p5860O5664j90724O5374O5027j03452j21947j24275
19129G9511J0024J28252R6914j30485k3940r2823K65318J2749q786J209k1839
19118C16104k87472J93064K53044J67110J11498j69093j31061M164P4072q8349
19108D43081j002O0513K95846k71979l38378r5164L41672p5347K9023j50701j76250
19097F1314j33033p841Q7365J01915J16306J68886p9495j053J70866P000K4955
19086E17185k95550j80353J36775r3559l2737J13036j19939j06775N0893K5349
$$ y = [70695, 611207, 734185, 826980, 817107, 456282, 410185, 446016, 170197, 154188, 330453, 331697, 331086, 413800, 576096, 602233, 459025, 252879, 375690, 149706, 320039, 445606, 384361, 499704, 423844, 489508, 298784, 364158, 429185, 325733, 203786, 79511, 89535, 217787, 314701, 184216, 160276, 67453, 332771, 345520, 336734, 337943, 316104, 28632, 221696, 474740, 641850, 753348, 584255, 453194, 457358, 531430, 443081, 442079, 502592, 798438, 526459, 188081, 92917, 434589, 359242, 388265, 237564, 61314, -71719, -79560, 7805, 109720, 226026, 394912, 315417, 314364, 485230, 492230, 517185, 221635, 41282, 178057, 84498, 51761, 164797, 44858, -61917, -11024, 14325]
19076A4325P607J12738P9422O5531j41979j37703M04229L54851J95143l52392
19066F01772m22536j69548Q2726K25527j7472P6957J23013J90500k37871o00096
19056a47028o1800J72091K74338q704k23431R4090J09336o2406K45145J35392
19046E27023k30730k48369J39927J95325L67961N1005j97342j8681L8503L1724
19036F56346k41301L2006o33P4442l37150l54363k47497K96444K30805K08861
19026C17960N5072j28613J4917O0980M242n3725j78120L4390n9753j00335J8256
19015a4729n413J33928K99445M78630J7980m97753j41380n2775J91105q0129l66729
19004c7820k20957J91688J22317J6213n9738K20371J45963k12986l87790l4245
$$ y = [14325, 21932, 134670, 214092, 279623, 137644, -59, 404170, 759021, 954164, 601772, 179236, 9688, 92414, 317941, 300469, 377426, 500439, 690939, 453068, -147028, -208828, -36737, 237601, 228897, 5466, 99556, 208892, 146486, 391631, 527023, 296293, 47924, 187851, 383176, 751137, 802142, 604800, 586119, 624622, 656346, 415045, 447051, 446418, 520860, 183710, -170653, -418150, -121706, 109099, 317960, 373032, 244419, 259336, 320316, 324558, 270833, 92713, 127103, 67350, -32985, -14729, -20142, 113786, 413231, 891861, 909841, 412088, 270708, 217933, 409038, 328909, -37820, -258777, -67089, 55228, 71441, 11703, 232074, 378037, 165051, -222739, -256984]
18994b56984M61062J04552l34639m0801J96439P8535L06289J14644j62499j41381
18984C25217K94424M4256k66623k90012O0114J90712K86427J08443o9501j32695
18974E50762j95080k15032q5976J6209N1404m7428q4211P3996q5529k9026p3963
18963a23874P008K77021j1557J10378k23494L1307P7946K75271K14712k29280
18953D05438j58316J04329L23553L46689m11318k64727J15857P2803M0896O9077
18943F44281j48658k08616r5778J01253J49735L4661P0308j28962J22027K4936
18933E65187j34935J37789J73016K3999J68874L0055m9949j50966j40014K10954
18923H34010N2311m01419k09602L35633J38790j93009o7421j95029j97239Q7798
$$ y = [-256984, 204078, 308630, -26009, -66810, 129629, 208164, 514453, 629097, 466598, 325217, 619641, 663897, 397274, 107262, 167376, 358088, 644515, 752958, 683457, 550762, 355682, 140650, 54674, 70883, 122287, 74859, -9352, 64644, -20885, -49911, -123874, -116866, 160155, 148598, 258976, 35482, 66789, 144735, 420006, 634718, 405438, 247122, 351451, 675004, 1021693, 610375, 345648, 461505, 534308, 575204, 644281, 495623, 287007, 191229, 292482, 442217, 476878, 547186, 418224, 540251, 565187, 430252, 568041, 741057, 765056, 933930, 963985, 914036, 763070, 623056, 834010, 886321, 484902, 275300, 610933, 749723, 556714, 489293, 294264, 97025, 184823]
18913A84823j13548o7425m1525m042L80137K28867j36484j04933R9428J9854j15870
18902C29282n39717r8640K88726L09967K2471k5624M26429L46472J30444p4514
18892A115296k89658j78396r7160K15323j05846j16150J04644N669L9542P7249
18882G70513L09273j3376J18401q6521K4847J85981J53254l5402k26922p4451
18872A125597k16405n9213J15702M42961K43535J9085k11630k35638n9322p8807
18862A085865n5808L6047K21130J36859M2132J33440j45943N5641J87363K09863
18852A906589K05497q6217J57535j37589o2123m9497J50795j39536J07043K30140
18842B282637J87021K39020j05845j46950J67512J71931J5634L07953L39184L9040
$$ y = [184823, 71275, 3850, -37675, -41717, 338420, 567287, 430803, 325870, 425298, 445152, 329282, -210435, -309075, -20349, 289618, 312089, 286465, 712894, 1059366, 1189810, 1115296, 825638, 647242, 550082, 765405, 659559, 543409, 648053, 653722, 693264, 770513, 1079786, 1066410, 1184811, 1098290, 1123137, 1309118, 1462372, 1426970, 1200048, 1125597, 909192, 849979, 965681, 1408642, 1652177, 1671262, 1459632, 1223994, 1164672, 1085865, 1030057, 1066104, 1287234, 1424093, 1466225, 1599665, 1453722, 1509363, 1696726, 1906589, 2112086, 2025869, 2183404, 2045815, 1983692, 1934195, 2084990, 1945454, 2052497, 2282637, 2469658, 2708678, 2602833, 2455883, 2623395, 2795326, 2810960, 3118913, 3458097, 3497137]
18832C497137M04234M8846J9694J8426n9814R4564M6352O0946J1858M0015M03213
18821D585471N92730M97367K63983M68737K52553O82958N51795L31346N11001
18812H737941Q35491J356196R70406R13881R20202J245158J425684J617283J784908
18803A9807150K193193K253851K425733K916309L386011L439023L034395K693612
18795D2149277J435562J300561K375901M981004R069600J3172302J7335525K0359225
18787A12178957J9422177J5538363O850246n917497j2010800j3902852j3926323
18780A08232271j3876977j2254268q788476m384656l14913J380614R22455n10618
18772G0405432m468793p475057q112908p362769n492820l444399k258623j372565
$$ y = [3497137, 3901371, 3950217, 3969911, 3988337, 3928523, 4023087, 4069439, 4130385, 4142243, 4182258, 4585471, 5178201, 5675568, 5939551, 6408288, 6660841, 7343799, 7895594, 8226940, 8737941, 9573432, 10929628, 11900034, 12813915, 13734117, 14979275, 16404959, 18022242, 19807150, 22000343, 24254194, 26679927, 29596236, 32982247, 36421270, 39455665, 42149277, 43584839, 44885400, 47261301, 52242305, 61311905, 74484207, 91819732, 112178957, 131601134, 147139497, 153989743, 148072246, 136061446, 122158594, 108232271, 94355294, 82101026, 73312550, 68927894, 68612981, 69993595, 70916050, 70405432, 65936639, 58461582, 50348674, 42985905, 37493085, 34048686, 31790063, 30417498]
18764C0417498p71869l78307Q3380L61200l02537m67914j54484L16117O56327
18755B9759411J036720J102854J340486J914372K979799L935745M942694O313936
18747E3326017P570863P770790O587934M355109P01299k457392j579597J651426
18739G7926449O457169J1944387J6691940J9838494K0806569J7483172J0321870
18732A81470050K674554o064828j8786482k7754470k7310476k2484980j4465364
18725F7278004q009563l822637j689414j245610j652308k956072m902351n661325
18717C7338724n315482m436895l649273k821688k238169j952749j237096j398725
18709A4288647j238649q53980q90658q04070j063403q12935p60611o73353o72479
$$ y = [30417498, 29645629, 29267322, 29350702, 29711902, 29409365, 28941451, 28786967, 29103084, 29759411, 30796131, 31898985, 33239471, 35153843, 38133642, 42069387, 47012081, 53326017, 60896880, 68667670, 75255604, 79610713, 80312012, 77854620, 76275023, 77926449, 84383618, 96328005, 113019945, 132858439, 153665008, 171148180, 181470050, 184144604, 178079776, 159293294, 131538824, 104228348, 81743368, 67278004, 59268441, 55445804, 53756390, 52510780, 50858472, 47902400, 43000049, 37338724, 32023242, 27586347, 23937074, 21115386, 18877217, 16924468, 15687372, 14288647, 13049998, 12196018, 11305360, 10501290, 9437887, 8624952, 7864341, 7190988, 6518509]
18700F518509n61419l79765l85488n26107j41151k85394k48886n21519j20429
18691C348351k23381m28648j23653j33238p6285j22042k56180k71331j90717j15098
18681A407778M4450J91978p7830k69299K9991l1674j3901J73827q8615Q2397Q1289
18670A530391l50165k45869p7212k3665J42108j51657m6322j08555n01002r1277
18660G6775L56347J3082O306K03809L04962r6398m30929R3185R1556J4080P9575
18649G12350N6820k08714J50853J7351L9041P2230q9951l5864o89n5784L64362
18638A022005Q8296j31994m35383k08111N26004K26011K12061M27794L42080K87210
18628B355973n7794k54348k91502o8740K23496J9773k84680l08135q5543L59542
$$ y = [6518509, 5957090, 5577325, 5191837, 4665730, 4524579, 4239185, 3990299, 3468780, 3348351, 3124970, 2696322, 2572669, 2439431, 2363146, 2241104, 1984924, 1713593, 1522876, 1407778, 1452228, 1644206, 1566376, 1297077, 1327068, 1295394, 1281493, 1455320, 1366705, 1449102, 1530391, 1180226, 934357, 857145, 833480, 975588, 823931, 777609, 669054, 168052, 76775, 433122, 446204, 452510, 656319, 961281, 864883, 433954, 527139, 618695, 632775, 712350, 769170, 560456, 711309, 728660, 767701, 839931, 749980, 714116, 713427, 657643, 1022005, 1110301, 978307, 542924, 334813, 860817, 1086828, 1298889, 1726683, 2068763, 2355973, 2298179, 2043831, 1752329, 1683589, 1907085, 1926858, 1642178, 1334043, 1248500, 1608042]
18618A608042K04483O9192j02437r9351k96693k95550M4219N4253L05067k1833
18608A469392l752l60590l74827K7933j08721r8914J89907L4842J98472L49433
18598A323175m3718l22991j53999l10318O7342K7706J5549L2350J64243J53603
18588I52942l05578k7240M7941j93509J5574J75332R3126j17374j20107J23023
18578F44130J96013K40384J31562r5215k32115K6259K98369Q7219j24966J5448
18568A187088O2130J36947n677L9189K94341J09543j23377j37496k52667l4419
18558A275602k2696o6609k30574j07187K2563j21939k40738j6066j15676m6901
18548C29779L7824j11872J17937L052J21886O2615J02429M9146k02442j35964
$$ y = [1608042, 1812525, 1881717, 1779280, 1679929, 1383236, 1087686, 1131905, 1186158, 1491225, 1469392, 1465640, 1105050, 730223, 758156, 649435, 550521, 740428, 775270, 973742, 1323175, 1279457, 956466, 802467, 492149, 559491, 587197, 602746, 635096, 799339, 952942, 647364, 620124, 668065, 474556, 490130, 665462, 758588, 641214, 521107, 644130, 840143, 1080527, 1212089, 1116874, 884759, 911018, 1209387, 1296606, 1171640, 1187088, 1249218, 1386165, 1380488, 1419677, 1714018, 1823561, 1700184, 1562688, 1310021, 1275602, 1252906, 1186297, 955723, 848536, 871099, 749160, 508422, 492356, 376680, 329779, 367603, 255731, 373668, 376720, 498606, 561221, 663650, 712796, 510354, 374390]
18538C74390j91874J23813P0518j37100j39860M076M5747J40235L83532O484j53419
18527E26542Q3799Q846m1666P5300q4321r1913j98320n8610o6509j16921J20247
18516A56474M30554J72514j86633j29553O557j757j74780K83442j4571r1250K44047
18505F95044J09496Q9031j07138k87688j17355j43357k32698j5386P1092L46839
18495D07880K70655k28338j31227r6876q5449J98780R0522n0330j51041R3357
18485C17933L1114J55808K99540K47808q507m18093l34213j50528N9168P7273
18475B77303K71380K08619J33906J14636K76429j58322j15238k1053j37575k87248
18465E62837J44108J15183j34103r5779J64191J07286K37915q4222k93792m6774
$$ y = [374390, 182516, 306329, 376847, 239747, 99887, 103963, 149710, 289945, 673477, 679961, 526542, 610341, 619187, 577521, 652821, 568500, 476587, 278267, 219657, 153148, 36227, 156474, 587028, 759542, 572909, 443356, 449913, 448156, 273376, 556818, 542247, 450997, 695044, 804540, 893571, 786433, 498745, 381390, 238033, 5335, -10051, 61041, 407880, 678535, 450197, 318970, 222094, 136645, 335425, 425947, 375617, 224576, 317933, 349047, 504855, 804395, 1052203, 1043696, 625603, 291390, 140862, 200030, 277303, 548683, 757302, 891208, 1005844, 1282273, 1123951, 1008713, 987660, 850085, 562837, 706945, 822128, 688025, 592246, 756437, 863723, 1101638, 1017416, 723624, 676850]
18455F76850M5851Q756o6169j39342Q0728q0234m4836L27025L23347n8354r0112
18444I83510j78655q7259J19596K36072j56250j50121k45922J34287J1697j02218
18434E64737J56133K66914K12897l29542j56152p0323m082R7578l11895J85465
18424F11730j36404j61434J63684L9780q0976M5231q1645j47040j02221K64370
18414D15075q190k57454K19947J01686r9948j4321r7394J73379j18054J5150J64160
18403D94036R1628N5895p6819K04519m578p175k78003l5381j6400M2094J25688
18392E95504J16841J16163L0985m3480j73100j78302L4823J52505N3319K42150
18382I47408J45846p2509J05911p1867j30302J65121k80450p5481l2266J01324
$$ y = [676850, 722701, 731457, 665288, 525946, 606674, 526440, 481604, 808629, 1131976, 1073622, 983510, 804855, 717596, 837192, 1073264, 917014, 766893, 520971, 655258, 666955, 564737, 720870, 987784, 1200681, 871139, 714987, 644664, 640582, 738160, 426265, 611730, 475326, 313892, 477576, 517356, 436380, 481611, 399966, 252926, 150705, 415075, 406885, 149431, 369378, 471064, 371116, 356795, 259401, 432780, 314726, 329876, 494036, 585664, 641559, 564740, 769259, 764681, 757506, 479503, 444122, 427722, 469816, 595504, 712345, 828508, 859493, 816013, 642913, 464611, 499434, 651939, 705258, 947408, 1093254, 1020745, 1126656, 1054789, 924487, 1089608, 809158, 733677, 701411, 802735]
18372H02735K91265Q2661L31602J71842k89808k76874L02997J48069o1662l99438
18362A103389k74060K11298J11311M635q129L9716K61731J98848r9021l30839
18352A218879j8324j46010N0734L89029j14717j68493q0520K4154p270o6113M6936
18341A128285J47120N1852o3442k56720p036m3027L59487L23687k03907o32102
18331H04197l62169J62344J58907L76438J63387n2859Q8616K27034R4202j19096
18321A541001j97596p601J18646L05782K90839k3333R4634J69805M1595Q5757
18311B419529O0484k7775o694R8888J06056l65682N5044K91504Q7607J24773J1844
18300B855578j79428L84768M94489Q6713P6812Q2562j50655k34266J9383J91626
$$ y = [802735, 1094000, 1176661, 1508263, 1680105, 1390297, 1113423, 1416420, 1564489, 1502827, 1103389, 829329, 1040627, 1151938, 1156573, 1148444, 1188160, 1449891, 1648739, 1549718, 1218879, 1200555, 1054545, 1105279, 1494308, 1379591, 1211098, 1130578, 1154732, 1147462, 1081349, 1128285, 1275405, 1327257, 1263815, 1007095, 1000059, 957032, 1316519, 1640206, 1436299, 804197, 442028, 604372, 763279, 1139717, 1303104, 1250245, 1338861, 1565895, 1660097, 1541001, 1343405, 1335804, 1454450, 1760232, 2051071, 2027738, 2122372, 2292177, 2333772, 2419529, 2480013, 2452238, 2445544, 2544432, 2650488, 2284806, 2339850, 2631354, 2718961, 2843734, 2855578, 2676150, 3060918, 3555407, 3642120, 3718932, 3801494, 3650839, 3416573, 3435956, 3627582]
18290C627582K30321K15976L7602J95001L89126K81382N53506O76995L56204O18491
18280G182186N32557J99233L27548N10904P93656Q37219P63706J026262R98279
18271A3171550J016686J202892J273015J216833J401244J674839K139912K633299
18263B5730270L066515L573150L758184L184307K852644L467603M914197M592748
18255E5139618M911742P360222R701535J2305974J5249852J4346582R913079J1032562
18247A39961166J5166488P963980q892216j0807933l916726o699434j5170899
18240A17604426j4767544q894982n244608n632692n610945l674329j935084k676810
18232F9167432n542000o255815m817634m306852m609058m563209l817305k595557
$$ y = [3627582, 3857903, 4073879, 4111481, 4306482, 4695608, 4976990, 5530496, 6207491, 6563695, 7182186, 7714743, 7913976, 8241524, 8752428, 9546084, 10383303, 11147009, 12173271, 13171550, 14188236, 15391128, 16664143, 17880976, 19282220, 20957059, 23096971, 25730270, 28796785, 32369935, 36128119, 39312426, 42165070, 45632673, 50546870, 55139618, 60051360, 67411582, 77113117, 89419091, 104668943, 119015525, 128928604, 139961166, 155127654, 163091634, 154199418, 143391485, 139474759, 132775325, 117604426, 102836882, 93941900, 88697292, 83064600, 77453655, 73779326, 71844242, 69167432, 63625432, 57369617, 52551983, 48245131, 43636073, 39072864, 35255559, 32660002]
18224C2660002j650136q73254m99007k53911n50978k46018N5970K90491J067344
18215C0000503J199503J138377J628519K118886K692626L552751M590526M304068
18207E1225759L543114L785540M858245M543265K143446K592314N852162Q259437
18199H6803282P317689O457909R495221J2008427M987156l516006j001398L159128
18191A25711408o195906j7497995j4868550q713571p826059j0046515q791746
18184E1771066o109256m106834k708359k260228l151817l464982k981146k455221
18176B4533223k616249k703764k558494j932089j459769j068071p86688o12467
18168A0795632k76294o90316p51752q04264l94559k34610l52321j18169k33318
$$ y = [32660002, 31009866, 30136612, 29637605, 29383694, 28832716, 28586698, 28642668, 28933159, 30000503, 31200006, 32338383, 33966902, 36085788, 38778414, 42331165, 46921691, 51225759, 54768873, 58554413, 63412658, 67955923, 70099369, 72691683, 78543845, 86803282, 94120971, 100578880, 110074101, 122082528, 127069684, 123553678, 122552280, 125711408, 119515502, 102017507, 87148957, 78435386, 70609327, 60562812, 51771066, 45661810, 41554976, 38846617, 36586389, 33434572, 29969590, 26988444, 24533223, 21916974, 19213210, 16654716, 14722627, 13262858, 12194787, 11408099, 10795632, 10519338, 9829022, 9077270, 8273006, 7878447, 7643837, 7291516, 7173347, 6940029]
18159F940029l16021l22077l34178k22309k90254k03976k5771j9083N149j24388
18149E087121O4261R3108J03863L24249k48412r0776K10631K5519L19710O02959
18139F492233P19040K87987K23344K85031K31599O36047M87914O05234P37742
18130A0706171J011119J252629J573968J639847J653247J623524J566353J748046
18122B2774904J820720K080963K053168J554341J660746J793591K760092L452007
18114C9950532M022380M552836N297685P138146J0381835J6787583K9113308M8537248
18106A65781553N9086829N0147087O0303800O0738475m9593849j22964387q1409111
18099A42090397m0564355k1619800j3182851q402607n066627l291338k640670
$$ y = [6940029, 6624008, 6301931, 5967753, 5745444, 5455190, 5251214, 5225443, 5206360, 5211509, 5087121, 5151382, 5244490, 5348353, 5672602, 5424190, 5333414, 5544045, 5569564, 5889274, 6492233, 7211273, 7499260, 7722604, 8007635, 8239234, 8875281, 9363195, 9968429, 10706171, 11717290, 12969919, 14543887, 16183734, 17836981, 19460505, 21026858, 22774904, 24595624, 26676587, 28729755, 30284096, 31944842, 33738433, 36498525, 39950532, 43972912, 48525748, 53823433, 60961579, 71343414, 88130997, 117244305, 165781553, 224868382, 275015469, 335319269, 396057744, 346463895, 223499508, 142090397, 101526042, 79906242, 66723391, 58320784, 53254157, 49962819, 47322149]
18092D7322149k879062l999838m520645m344402l851524l498311k794025k599286
18084A8835056j993229j634296j653482j104428r48823j173713j102024q37771
18076H387290q41807q88821n00654l50285m96781j71871l13723k93582n06253
18067D023513m66400k20061j14322k56768l14997m41126k04556k96023n6357J59570
18057A812473Q4101k77252l33335m7866k93383k94343N3872j80017l07558p9057
18047A37635k98928J27619L79786M15438N8590l48637j68145J72354k87688k11062
18037b3038p4174l1635M63214J35874K361q3974m9272j07956J20162J47129Q1917
18026E80608j05812k649k7762j54468j33216j8757j40724k8346K00381K80577
$$ y = [47322149, 44443087, 40443249, 35922604, 31578202, 27726678, 24228367, 21434342, 18835056, 16841827, 15207531, 13554049, 12449621, 11500798, 10327085, 9225061, 8387290, 7545483, 6656662, 6156008, 5805723, 5308942, 5137071, 4823348, 4529766, 4023513, 3557113, 3337052, 3222730, 2965962, 2650965, 2209839, 2005283, 1709260, 1652903, 1812473, 1896574, 1619322, 1285987, 1238121, 944738, 650395, 704267, 524250, 216692, 137635, -161293, -33674, 346112, 761550, 820140, 471503, 303358, 475712, 188024, -23038, -97212, -128847, 334367, 470241, 472602, 388628, 339356, 231400, 351562, 498691, 580608, 474796, 472147, 444385, 289917, 156701, 137944, -2780, -31126, 169255, 449832]
18016D49832j34438r9799O9357K18977p9648r9176k60580l38884k51408j18292
18006f44059j082J86107L14648P7230j67071J26395L24274m5102j53716J0091
17996B7715K34734j70952k98504O1700J30906j66757L2115N6781j80357J8625
17986b53994M80512Q3258l18327p5861J63285J55154J6728j69634k8097J38566
17976A91590O6499J07212j75875j45823J4493j50192R1340K77693K1710j58379
17966A40268j64838k60716K47365P4961j77383J240o4907j49819o8722k15165
17956f37716p8698O2475L84113L17383K8363j91226j77809K2481J28824r1713
17946b33523K0841J67748O9762M6177j20880j07607K2268r5994k00921k28362
$$ y = [449832, 315394, 215595, 284952, 503929, 424281, 325105, 64525, -274359, -525767, -644059, -645141, -459034, -144386, -67156, -234227, -107832, 216442, 171340, 17624, 27715, 262449, 91497, -207007, -145307, -14401, -181158, -149043, -92262, -272619, -253994, 226518, 309776, -8551, -84412, 78873, 234027, 250755, 81121, 53024, 191590, 258089, 365301, 189426, 43603, 58096, -92096, -756, 276937, 298647, 140268, -24570, -285286, -37921, 37040, -140343, -139103, -204010, -353829, -422551, -637716, -716414, -653939, -269826, 47557, 75920, -115306, -293115, -270634, -141810, -233523, -212682, -44934, 24828, 71005, -49875, -157482, -135214, -231208, -432129, -660491]
17936f60491o9809L6474L32479L6086J22787J50460r04j65108k6420K4060K06238
17925a4148R6699q7184J39452j64425K8798J72716l3050O6832K2921n04410j60663
17914d36462J83029J07095l19746k52590L43881J50521J32567l144k46433q314
17904c49596q6204J04265k7563J61284K00712M3597j01303j90958k6755J68944
17894a03577L5004O109K98168o1702k60958j39573M3181j81675M24563M10253
17884D69793k11685m81458o6335n2752J51840L26751J26103j24229j39615j75776
17874a77363j79861j80165K17040M9153j13523p1488N1824J63026J0642K13390
17864a7325K39316q363j20518o9936O5265j9196j36970o0860k06684K6601j10637
$$ y = [-660491, -730300, -693826, -361347, -325261, -202474, -52014, -52918, -218026, -244446, -220386, -14148, 82551, -4633, 134819, -29606, -808, 171908, 138858, 205690, 228611, -275799, -436462, -253433, -146338, -466084, -718674, -374793, -224272, -91705, -94849, -341282, -349596, -435800, -331535, -359098, -197814, 2898, 46495, -54808, -245766, -272521, -103577, -68573, -62464, 235704, 174002, -86956, -226529, -183348, -365023, 59540, 469793, 258108, -223350, -289685, -342437, -190597, 136154, 262257, 138028, -1587, -177363, -357224, -537389, -320349, -271196, -384719, -456207, -404383, -241357, -230715, -17325, 221991, 213628, 93110, 23174, 88439, 69243, -67727, -128587, -335271, -308670, -419307]
17853d19307J02050K47682j56635p6408J77908K50972k35448j18764L03567J27134
17843B02751J4452j43486j0108p7655n5518P2976q3456q8517K9534j95919k77740
17832f12686M2909L19270R4493k04663m1581j71476j17045J92870k7962L01306
17822b24565J80936j40070k09190M2021K02017Q2465O9537N1669j83357m5483
17812a74020J20950m9576o0353J53545J24778J53650j83096O8544J96062l77502
17802b7018j01706n2732k82022P1103J30357O8348j52803j09194K42908K84605
17792G1846j15471j43434P8988L25017K07138J8408r5891l69056j1820J53770
17782A19495j26888k71382j24220K15289m2301p2535j71213p0629J75540J70633
$$ y = [-419307, -317257, -69575, -226210, -302618, -124710, 126262, -109186, -227950, 75617, 202751, 217203, 73717, 63609, -14046, -69564, 3412, -80044, -168561, -139027, -334946, -612686, -569777, -250507, -156014, -360677, -402258, -573734, -690779, -497909, -525871, -224565, -43629, -183699, -392889, -350868, -148851, -66386, 3151, 54820, -128537, -174020, -53070, -102646, -162999, -9454, 115324, 268974, 85878, 154422, 350484, -27018, -128724, -181456, -463478, -392375, -262018, -193670, -346473, -455667, -212759, 71846, -43625, -187059, -108071, 216946, 424084, 442492, 346601, -22455, -34275, 119495, -7393, -278775, -402995, -187706, -230007, -302542, -473755, -544384, -368844, -198211]
17772a98211J80293M5327M5064P1339j61550o1892k164j73162L439O9805j6740
17761a98452Q5045N7539j76639k3811R2914M31110K2885k0446j71924l31891J15542
17750a18128K78463O6449p0266k14715r0524J27575j1829R1740L8751L03730J32692
17739E33938j29325L2001K21517N7967j59268K4640M03885K08511j55646k01518
17729H36702k65734j53581j19983L0348J5083J25035J09643j85893k82336J34381
17719B43665P8753j73427j34669L02140J84979n8692l32024j89241P3258K42646
17709B37388j15829J5079m1752m8782l1613j44705N7908K8785J17286J31191K5489
17698B30445J70989k56925r4951J4498k77902L02876L53633J82293J53776O4030
$$ y = [-198211, -17918, 27409, 72473, 143812, -17738, -79630, -81794, -254956, -251517, -181712, -198452, -113407, -55868, -232507, -256318, -163404, 267706, 290591, 270145, 98221, -233670, -118128, 160335, 226784, 156518, -58197, -148721, -21146, -32975, 58765, 97516, 401246, 533938, 404613, 436614, 658131, 716098, 556830, 581470, 985355, 1193866, 1038220, 836702, 570968, 417387, 297404, 327752, 342835, 467870, 577513, 391620, 109284, 243665, 322418, 148991, 14322, 316462, 501441, 442749, 110725, -78516, -5258, 237388, 121559, 136638, 94886, 46104, 14491, -130214, -72306, -43521, 73765, 204956, 230445, 401434, 144509, 49558, 64056, -213846, 89030, 442663, 624956, 778732, 842762]
17688H42762M482r1887j71524j08358J20484J70752J2559j65151j30932r0326
17678C92861P6825j78440J12859Q3671j82900j20415o9448m6645L36167K62262
17668F66797k36722q2814K06466M34118j30707k34039j91463M9698l02418j27005
17658E1911j23963r1305k647q130O9079j4251P7383J77718r644r9197q9269k05817
17646b68132J42890l2470k30295P5191J56651R7941J75467K68506j13700m69704
17636a97655j02962L90931K9844k12717K06879j39171l16163j23161J79452K9324
17626b55399j9808k74062j8712L55827M16226j4436m1355k176j65985j166J15883
17615I4837k09064J99007P8637m51552n8425L8109k5050k13322j13445K65416
$$ y = [842762, 847244, 755357, 583833, 475475, 595959, 766711, 779270, 614119, 483187, 392861, 469686, 291246, 404105, 487776, 304876, 184461, 115013, 68368, 404535, 666797, 430075, 347261, 553727, 987845, 857138, 623099, 431636, 481334, 178916, 51911, -72052, -163357, -166004, -174134, -105055, -119306, -41923, 135795, 126151, 26954, -62315, -268132, -125242, -157712, -388007, -312816, -156165, -58224, 117243, 385749, 272049, -197655, -300617, 90314, 120158, -92559, 114320, -24851, -341014, -464175, -284723, -255399, -275207, -549269, -567981, -212154, 204072, 189636, 148281, 146105, -19880, -21046, 94837, -114227, 84780, 163417, -288135, -346560, -308451, -333501, -546823, -660268, -394852]
17605c94852Q7660J60029n0937j03028k5357J91539L5167l0958j12811L62298
17595A18750K84594r6608m6660o1203K0125j95815o5298j48270o0428k7004o6460
17584c44277j1428J09860K55674K28942j59695l62654j57501K94724L10658R5938
17574B60241j72096j58760M5018j24326R7790O0207j10069J1386J37952M7260
17564I4603J29820P1416N1420J46961k46005k24401j6022N9996K21528J72508
17554D61824J35645O4379l12065l53454o5539j34843j14241J54955q8045j89424
17544d40808o8167P3663N1793n0881K19002J45548J38726p605l71446j80245J37095
17533c53325J12580M5046j77020J37488P842k46419j02039R2731K04760L28033
$$ y = [-394852, -307192, -147163, -198100, -301128, -326485, -134946, -99779, -130737, -243548, 118750, 403344, 306736, 260076, 198873, 218998, 23183, -42115, -190385, -250813, -277817, -344277, -355705, -245845, 9829, 238771, 79076, -283578, -441079, -146355, 164303, 260241, 88145, -70615, -25597, -149923, -52133, 8074, -101995, -90609, 47343, 94603, 224423, 295839, 347259, 494220, 248215, 23814, 7792, 67788, 289316, 461824, 597469, 661848, 349783, -3671, -69210, -204053, -318294, -163339, -251384, -440808, -508975, -435312, -383519, -434400, -215398, -69850, 68876, 61271, -310175, -490420, -353325, -240745, -195699, -372719, -235231, -227389, -473808, -575847, -483116, -278356, 49677]
17523D9677k5251J38964o5954l2416m3921n6252K17882J64407m8340k78047n6971
17512c6222M7250k772j45403K0332j08220j76917j07643J93122J17890k46513
17502d45096J65984J23886J96352j3629J21184j93846k44503m47571p9228M05274
17492d11193J3288j74200Q3416M53425J65361j06951j00284n182J64982l33373
17482b50711l8998K00114J85001j04956j40843J72977o3650k9776J17216k1869
17472B4505m09529j96953L43503K85689j07868j63789J31892n5914J30520L01187
17462B83243N0626n7691j48678k21497K3546J50737J64758l9457k23316j0024
17452b7753J47975j76490j66936J64382L18557K16140n0301K06435J73114o4396
$$ y = [49677, 24426, 163390, 97436, 65020, 21099, -35153, 182729, 347136, 298796, 20749, -36222, 11028, 8256, -137147, -116815, -225035, -401952, -509595, -316473, -198583, -445096, -279112, -155226, 41126, 27497, 148681, -45165, -289668, -737239, -816467, -411193, -397905, -572105, -488689, -35264, 130097, 23146, -77138, -82320, 82662, -250711, -289709, -89595, 95406, -9550, -150393, 22584, -41066, -70842, 46374, 24505, -385024, -581977, -238474, 47215, -60653, -224442, -92550, -148464, -17944, 283243, 333869, 276178, 127500, -93997, -70451, 80286, 245044, 205587, -17729, -27753, 120222, -56268, -223204, -58822, 259735, 475875, 425574, 632009, 805123, 740727]
17442G40727j30322M63373L53207k2355j51592J95854N0172l89796k20901l02139
17432E86228k00219J03692j50661j82752j6580M0608q3368l4257j41574k2614
17422a01497M0132J05728L9913j72793J76111L3292j70188k64066K25629J059
17412h6680n7876K19358R4459o5024L14122k86017n60951j8051o5136J13684Q7079
17401c11033M2717J77678M6410J80061M1008j55664l63414n037n7789k43333J3944
17390f34452J96888R3490K31767J47421l2449j59863J86729J4423k87025q0934
17380c24005L43787K74806O2475k56125k5166J47591k90684j73045k8838R3249
17370a75955J30553r2195j89070J76509K44999j1157j3246J36957j1756j54675
$$ y = [740727, 610405, 1073778, 1426985, 1404630, 1253038, 1448892, 1499064, 1109268, 888367, 586228, 386009, 489701, 339040, 156288, 139708, 180316, 96948, 62691, -78883, -101497, -61365, 44363, 84276, -88517, 87594, 120886, -49302, -313368, -87739, -86680, -144556, 74802, 169261, 104237, 418359, 132342, -428609, -446660, -511796, -398112, -311033, -268316, -90638, -44228, 135833, 176841, 21177, -342237, -347274, -405063, -648396, -634452, -437564, -344074, -112307, 35114, 2665, -157198, 29531, 43954, -243071, -324005, 19782, 294588, 357063, 100938, 75772, 223363, -67321, -240366, -269204, -175955, -45402, -137597, -326667, -150158, 94841, 83684, 70438, 207395, 195639, 40964]
17360D0964m11299j50853L16403K42982j29935l5734J31927j00808k95374J87238
17350b04489K70607r9358J5130J74585L0955J45690Q6776l48655p5885j1722j63900
17339a80266n5008o0901J77432J61419N6609j707J04488m0603j73119N6197j64117
17328a19576J2397K2321m5164K28391J27109J5231j41751l5590p5311l46552m3338
17317d01833J84704j10679n219k50030o5692Q4426P1590J64275j43792K35470
17307b36780K53783k55395k01128J63405J57613o9505j8413N1891R4112j55299
17297b15716k3704j28137N1480J82871k1598R8301Q7176O1646m8932j01217j02497
17286a60327L2623k29885j77546K119R4956k7765J46349J58554J44287n9926Q3501
$$ y = [40964, -370335, -521188, -204785, 38197, -91738, -127472, 4455, -96353, -391727, -204489, 66118, -33240, -18110, 156475, 187430, 333120, 419896, 71241, -4644, -16366, -180266, -235274, -296175, -118743, 42676, 99285, 97578, 202066, 161463, -11656, 44541, -119576, -107179, -84858, -130022, 98369, 225478, 240709, 98958, 63368, -11943, -358495, -401833, -217129, -327808, -333027, -583057, -648749, -564323, -492733, -328458, -472250, -236780, 17003, -238392, -439520, -276115, -118502, -188007, -206420, -154529, -60417, -215716, -239420, -367557, -316077, -133206, -154804, -56503, 30673, 92319, 43387, -57830, -160327, -127704, -357589, -535135, -533016, -438060, -465825, -319476, -160922, -16635, -76561, 6940]
17275F940j07778k3487O0161n3924j13923J04501K08442j70731k82929J75201
17265a97527J02392J27043J2418j66168k57523K8805L19530L51280P4828J56349
17255E51427N3623j71848j58890J8761J70542p7412r828p1107J1532k15584J59165
17244B60381J79736j12669j94791Q4926j06218N7430J02072m4768n9754J90612
17234C56957P4667l3733k15471j69419j18568l3288J4152J02808K26071k46927
17224d2751j00103J26863K69833L3624l06992m6037J79451n9855k88860k39761
17214d74588j51851L71331K05753n3596J543k4111P3569P1813m12991Q2183J79141
17203a31804Q1225n9113j17735L60629N1599k57790k00693q3403j45080J47267
$$ y = [6940, -100838, -124325, -64164, -118088, -232011, -127510, 80932, -89799, -372728, -197527, -95135, 31908, 44326, -121842, -379365, -350560, -31030, 320250, 395078, 551427, 605050, 433202, 274312, 293073, 463615, 386203, 376375, 305268, 316800, 101216, 260381, 440117, 327448, 132657, 217583, 111365, 168795, 270867, 226099, 166345, 356957, 431624, 397891, 182420, 13001, -105567, -138855, -124703, -21895, 204176, -42751, -142854, -15991, 253842, 287466, -19526, -65563, 113888, 54033, -234827, -474588, -626439, -255108, -49355, -102951, -101408, -125519, -51950, 19863, -393128, -310945, -131804, -50579, -109692, -227427, 133202, 184801, -72989, -273682, -357085, -502165, -354898]
17193c54898L5430k2192K45466K59704j90529J97578k32507J44651J80463k05732
17183E7434k58596P3661j36306R2889J64034j16825L17504M24003M8985n45052
17173A21731m15223L2443R2672k31675j68492j18335J45259J53272n4596K01569
17163b41375Q0184L9963p631N8396N1412p6246J98221J51822P0052l47934k02225
17152b25361m72877j44480J31922L57190R7927J12472r3908J10329l8908L1405
17142a34289M9867l10710J6700J05452R0593P8601K18541J01444J13884J07086
17132D37169j69888k90912K0053J32134k40042l5458J43531K54154k02355k48206
17122a99820k07368j15640P4403L6507K47833L41377j77070L7038J69728M8535
$$ y = [-354898, -319468, -341660, -96194, 163510, -27019, 170559, -61948, 82703, 263166, 57434, -201162, -127501, -263807, -170918, -6884, -123709, 193795, 617798, 666783, 121731, -293492, -261049, -168377, -400052, -568544, -686879, -541620, -388348, -442944, -241375, -161191, -121228, -128859, -70463, -19051, -95297, 102924, 254746, 324798, -23136, -225361, -698238, -842718, -710796, -353606, -255679, -143207, -237115, -126786, -165694, -134289, -84422, -395132, -378432, -272980, -182387, -103786, 114755, 216199, 330083, 437169, 267281, -23631, -3578, 128556, -111486, -146944, -3413, 250741, 48386, -199820, -407188, -522828, -448425, -411918, -164085, 177292, 222, 37260, 206988, 255523]
17112B55523j2137Q5316j37318Q974j23282k11642J58502n2664k5712j44598N7939
17101a41099Q5604k05600j26701J05150Q771J05270L35050O7222J38935m03021
17091c0419k69413o3799J57000M1360K34232o5158j40571j27689J39337n9033
17081a84153J17431P4733k54878K66276J40536J47436O2266k66846j02347l6185
17071c5731j87140o7037l3303K51202m2926p5510j56425k39924J59642L22599
17061a04553J56621J21402j8520j8921k7130P16R5735P2977l5127l16727k08776
17050b82303J24480l35862j59214J46678N41917M9566j05208p1335K14679R6768
17040B20166p9250o4640k15856k35251M9735J08369q9462J12590j71401k51M63015
$$ y = [255523, 243386, 328702, 191384, 200358, 77076, -134566, 23936, -28728, -54440, -199038, -141099, -55495, -261095, -387796, -282646, -273875, -168605, 166445, 233667, 372602, -30419, -299832, -363631, -206631, -165271, 68961, 3803, -136768, -264457, -125120, -184153, -66722, 8011, -246867, 19409, 159945, 307381, 369647, 102801, 454, -35731, -222871, -289908, -323211, -72009, -114935, -190445, -346870, -586794, -427152, -104553, 52068, 173470, 154950, 136029, 108899, 109615, 205350, 278327, 243200, -73527, -282303, -157823, -493685, -652899, -506221, 35696, 85262, -19946, -91281, 123398, 220166, 140916, 76276, -139580, -374831, -325096, -216727, -306189, -193599, -365000, -365251, 97764]
17029I7764J13659k43492m91127j74804K24434M6326O8542n6153K2661J2083J27149
17018b52958J96059n3809p2768J74166N77343J39144l96665k38546N8424q090
17008A22300L1739j0910N0364k64567j10450J04979J27080q1687K4725M2045O359
16997D1977N580k20864m8125K17664L26305j6054m11797J69709P8887k05029L6378
16986b5369L43840K76494k68666o3444J18271j18421j38366m1683L35805K52051
16976F70512k10911k12294k08771J25189k08337q2715L19686q473K6080j63813
16966D6153o1481J18163J42033n9241j85624J30219j58539l757O0827j54402l7918
16955a63567K05029O4219j05743l5759j97601K06903n7742K34379L83920r7958
$$ y = [97764, 211423, -32069, -523196, -698000, -473566, -427240, -358698, -414851, -392190, -380107, -252958, -56899, -110708, -183476, -9310, 568033, 707177, 310512, 71966, 130390, 122300, 154039, 143129, 193493, -71074, -181524, -76545, 50535, -31152, -6427, 35618, 41977, 47557, -173307, -221432, -3768, 322537, 306483, -105314, 64395, 143282, -61747, -25369, 318471, 594965, 326299, 262855, 381126, 262705, 124339, 82656, 418461, 670512, 459601, 247307, 38536, 163725, -44612, -127327, 192359, 183886, 209966, 46153, -15328, 102835, 244868, 185627, 3, 130222, -28317, -32074, 28753, -125649, -163567, 41462, 105681, -62, -35821, -233422, -26519, -84261, 150118, 534038, 436080]
16945D36080l05265j68141M0369P5245O7292j3002k0673N6520J81364k01086J1174
16934A59877j51554N3620l9670j19176m3156J37172M14913j35828p8749m18231
16924b20782j63129j19719J89279J01084L57620L19617Q2793Q7086o7697p3196
16914D92956k07659j85237j49156k40275p4587L13848K9300j46393k78652K245
16904d43610J49976K83968L7535j17379J19739R2132K3874L46174j98666m73549
16894a79806k62604Q2992K56642r5909j0502k64236l6088L07752P0364J97733
16884F6338K44521k33056j61917N5947m3994k81458L6991K52819K48243O9381
16874B53815j1157j95760J69134J79461k60963k66594M2923q6349j35743L7703
$$ y = [436080, 130815, -37326, 3043, 78288, 145580, 132578, 111905, 168425, 349789, 148703, 159877, 8323, 61943, 22273, -96903, -140059, -2887, 412026, 276198, 197449, -220782, -383911, -503630, -314351, -213267, 144353, 463970, 546763, 633849, 566152, 492956, 285297, 100060, -49096, -289371, -363958, -50110, -20810, -167203, -445855, -443610, -293634, -9666, 27869, -89510, 30229, 122361, 146235, 492409, 293743, -179806, -442410, -359418, -102776, -198685, -209187, -473423, -509511, -201759, -131395, 66338, 310859, 77803, -84114, -28167, -72161, -353619, -316628, -63809, 184434, 253815, 242658, 46898, 216032, 395493, 134530, -132064, -89141, -175490, -311233, -273530]
16864b73530J66079m8593R6915j00448l00302L38227M00853K1002j50275j10246
16854C9682k57451J33735l124k8238J39443J00625J65225R7429j45142m12549
16844a70365n2646K93753L46418j10517j69782r9412j76250P9729K50425o0680
16834A30673L197o1794k9425K38630k65107k55366J12987q8997k71323q3212P955
16823e61782j37490j58227L37806J92311k2762l35437J80228K07294j9684R3146
16813b24597J7707k2161J01894O7812k81274M4890K58555L07007O0010k65387
16803F4456j27878L18065j06305p8729k86697l92602j4449L80637L24435k07617
16793a26684q5766O9087n1306J06955N6407o7008j69609j42276J72569N3371J05505
$$ y = [-273530, -107451, -156044, -59129, -159577, -459879, -121652, 279201, 300203, 149928, 39682, -217769, -84034, -87158, -115396, 24047, 124672, 289897, 387326, 242184, -170365, -223011, 70742, 417160, 306643, 136861, 37449, -138801, -59072, 191353, 130673, 133870, 72076, 42651, 281281, 16174, -239192, -126205, -215202, -486525, -569737, -561782, -699272, -857499, -519693, -327382, -350144, -685581, -505353, -298059, -317743, -224597, -206890, -229051, -127157, -59345, -340619, -295729, -37174, 269833, 329843, 64456, -63422, 254643, 148338, 69609, -217088, -609690, -624139, -243502, 80933, -126684, -212450, -143363, -194669, -87714, -31307, -98315, -267924, -410200, -237631, -184260, -78755]
16782g8755j28921j36047j68810M1063J94172J40827P4437J68480Q7734k02566
16772h386m7782L92553K67872L6691q7022m37175k13408j6675N1574K01391k09891
16761g0258l11539o740L7481j6407R6782J35240R7998K70462P7265K00928Q3407
16750E94619j55315l66989j87186P3678j69042j36924J91109J32793j95907N2186
16740a66978O6654Q262n9229N4813J07578j60863j19147q4543l0580R3917K83594
16729f522J90803J37400K56553k16573j22661j59458J15804J65492k67619j84237
16719i1018K134K59488j53587m12179k65312L53166J43491j25555N1899M1824
16709a95649l22O1930R3097q6028M216J59029P0428n8338n770k49628k9670J71258
$$ y = [-78755, -207676, -343723, -512533, -471470, -277298, -136471, -62034, 106446, 194180, -8386, -56168, 336385, 604257, 640948, 553926, 116751, -96657, -113332, -61758, 139633, -70258, -381797, -388537, -351056, -367463, -270681, -135441, -37443, 233019, 310284, 511212, 594619, 439304, 72315, -114871, -41193, -210235, -347159, -156050, -23257, -219164, -166978, -100324, -92062, -151291, -96478, 11100, -149763, -268910, -353453, -384033, -290116, -6522, 184281, 321681, 578234, 361661, 239000, 79542, 195346, 360838, 93219, -91018, -88884, 170604, 17017, -395162, -660474, -307308, -163817, -289372, -237473, -195649, -195971, -134041, -40944, -126972, -122756, 36273, 106701, 48363, 42593, -207035, -236705, -65447]
16697f5447j13161k06679J55801R7045R9251K32513j53249q290j4101l9373m6478
16686f2168J6700K20326j18183L5788K00613J96739l02775k20067N3204k19540
16676a99363J05792J58770K0923K26339r2308j91457J02195j975l4102P3870j31568
16665C7116j83710k33507j62902J10822P3627o9412j05669P0557q9629R5853L06877
16654a49977K13005k7801N0827j30748k78244k04369J6468j07813J64307K13560
16644b40785K32772N9002r616p7059n4554J927n581K07180M29789J51148k71598
16633D22625j79293Q1418j28985j85363M5815J7605j44860l3984L9735j7737o4561
16622a47585k1186R4227j42684j56715J53790p4277n4950k4632L1331J45019k50402
$$ y = [-65447, -178608, -385287, -229486, -132441, -33190, 199323, 46074, 37784, 23683, -15690, -62168, -45468, 174858, 56675, 92463, 293076, 489815, 187040, -33027, 20177, -199363, -93571, 65199, 86122, 312461, 220153, 28696, 130891, 128916, 94814, 168684, 37116, -146594, -380101, -543003, -432181, -358554, -427966, -533635, -463078, -552707, -456854, -149977, 63028, 35227, 86054, -44694, -322938, -527307, -510839, -618652, -454345, -240785, -8013, 50989, 41373, -35686, -90240, -88313, -93894, 113286, 543075, 694223, 422625, 243332, 324750, 195765, 10402, 56217, 73822, -71038, -105022, -65287, -83024, -147585, -168771, -74544, -217228, -373943, -220153, -294430, -349380, -374012, -342681, -197662, -448064]
16611d48064j7378K1777K39977Q5972j977J1617k63388j38543K55464N16735J49937
16600D12129L9804j70485j35089J33137k24245k10848Q0107J53500j41610J79500
16590A15900K49739j57583k0401o6922j98525l0615K73216L44764J22824j96014
16580D36383j82528j89540l15902l92084m882L97695L86445Q6238q4566k68228
16570a30969r0775j27125K03515J14700r412Q6870K97737q358m98294j09634k64426
16559e36171j35310K05493q3890Q9896K38683K07828P2541j07583k06970k50785
16549e06268N0796K3450n1552j75878K08091L45008Q1908n4215Q8113K28116J38059
16538C75628j6688n09033k85893K9527j364M2547K12949L05909r8678q6965m9214
$$ y = [-448064, -465442, -443665, -203688, -117716, -119693, -108076, -371464, -510007, -254543, 262192, 412129, 451933, 281448, 146359, 279496, 55251, -155597, -75490, 78010, -63600, 115900, 365639, 208056, 187655, 120733, -77792, -108407, 164809, 509573, 632397, 436383, 253855, 64315, -251587, -643671, -648553, -250858, 135587, 221825, 137259, -130969, -221744, -348869, -145354, -30654, -40066, 46804, 344541, 336183, -162111, -271745, -536171, -671481, -465988, -549878, -459982, -221299, -13471, 59070, -48513, -255483, -506268, -455472, -432022, -483574, -659452, -451361, -106353, -24445, -78660, 9453, 237569, 375628, 358940, -150093, -435986, -406459, -407823, -365276, -152327, 153582, 54904, -32061, -81275]
16527h1275M1024N0315r207p9765k80066N5015J78254J67620k7565j56277J49749
16516G822J96528L2699j02305k54486J37296K05221j45299j12639o2967K28476
16506A30346J92172k19418l76874R630K05243J23403k45229o500K37034R0858
16496A40665Q6416j55393l58277k3410J31627J48238j17713j38156n0237O9760
16486b66480L15909J67054j94939k38446K731o1515K50310L50788r81k41181o2213
16475B1037M19246r159k573R5844q3106k2446K6151l91842K3907R4885k2603j76726
16463b7385o4882r594j14102o8190m8124J4562K3047n3652k6845R9046K8465K07196
16451d0458L0450Q4856p0664K42501K24867j90424k64332J78116R1787j00992
$$ y = [-81275, -40251, 10064, 857, -78908, -358974, -303959, -125705, 41915, 14350, -141927, 7822, 204350, 237049, 134744, -119742, 17554, 222775, 77476, -35163, -98130, 130346, 322518, 103100, -273774, -264144, -58901, 64502, -180727, -187227, 49807, 140665, 227081, 71688, -286589, -309999, -178372, -30134, -147847, -286003, -336240, -266480, 49429, 216483, 21544, -216902, -214171, -275686, -25376, 325412, 324431, 83250, 21037, 440283, 431124, 428551, 524395, 441289, 418843, 444994, 53152, 77059, 171944, 149341, -27385, -92267, -101861, -215963, -284153, -332277, -317715, -294668, -348320, -375165, -276119, -247654, -40458, -10008, 74848, 4184, 246685, 471552, 281128, 16796, 194912, 286699, 185707]
16441A85707k4781k34192n4937K83456j65435l55065q2852J87766J91300l4172
16431a03205m4809j27762K55205L31092k07707O1429K21489j80012j39078k53585
16421a86943J06487J06014K10903q0135j57141q445J9134J734M9425M2850l1318
16410G2565J594R6021n1803j98984P4772K23501j75923R7743J38506K6473j47870
16399A56595j06685m21027p8277J69101J92132K56753P3911J11686j22322K8867
16389B60734q4404o5041l2207m6532J32705J71431j10713j49067j10170l52585
16379c85849k3949J13557J30638M6343M8462Q3404J98932k49027k09756L885r5093
16368c38453k748K16885j02032j18715K21506j9252r9099l44374N2882K33537
$$ y = [185707, 160926, -73266, -128203, 155253, -10182, -365247, -448099, -260333, -69033, -103205, -148014, -275776, -20571, 310521, 102814, 164243, 385732, 205720, 66642, -186943, -80456, 25558, 236461, 156326, -815, -9260, 9874, 11608, 61033, 103883, 72565, 74159, 170180, 118377, -80607, -5835, 217666, 41743, 139486, 277992, 304465, 156595, 49910, -371117, -449394, -280293, -88161, 168592, 242503, 354189, 231867, 260734, 176330, 111289, 79082, 32550, 165255, 336686, 225973, 76906, -33264, -385849, -409798, -296241, -165603, -119260, -70798, 12606, 211538, -37489, -247245, -243360, -338453, -341201, -124316, -226348, -345063, -123557, -142809, -241908, -586282, -533400, -299863]
16358b99863K70369P1799J48781q9917m61290Q7585L50082K26372m9555k44596
16348I767n1614j94220J40284J04708j60970J28976J92155M6616J08031l70905
16338d7172m67021k04319l8261J15143M4053Q8158L68718J50257l40578M4944
16328b86078J31740P974R0236L6967M6243K6065l12745j31241L06177J62381K02448
16317B80167j77279l11065l24744k29871K29784J93870N3885J73344k32036q3549
16307d27494K7777K2639j34531p2174K3830J15635R0924L7491j8770k23575J67564
16296c90684J18313j12416j14670j23799J32271K25017J1014O5421J11925P40
16286g6868j11365r3645O1057P4398J27416r7916j85960J79994K7426p8406q7510
$$ y = [-299863, -29494, 42305, 191086, 101169, -360121, -272536, 77546, 303918, 254363, 9767, -41847, -236067, -95783, 8925, -152045, -23069, 169086, 215702, 323733, -47172, -514193, -718512, -756773, -641630, -597577, -509419, -140701, 9556, -331022, -286078, -154338, -146364, -56128, -19161, 27082, 53147, -259598, -390839, -84662, 77719, 280167, 102888, -208177, -532921, -762792, -533008, -339138, -285253, -111909, -343945, -427494, -399717, -377078, -511609, -583783, -559953, -444318, -353394, -315903, -334673, -558248, -390684, -272371, -384787, -499457, -623256, -490985, -265968, -254954, -189533, -77608, -76868, -188233, -281878, -220821, -146423, -19007, -116923, -302883, -122889, -95463, -173869, -261379]
16275b61379P9905r7781L3669n2514o2814K24737J64354q0131m2943k04486m2501
16264c41884Q4848k0801L34622J72600j03569k32335p6421M4916L37503q823j26700
16253F3956m5485o824O8422J56847P0550k12287j72116l43334r2782M3710N4866
16242d14477K75698N796L9536o4353O4647J34758k5864J37958K01164l19075q3947
16231d8159J09689r3962k49395j62039L09457j6802p9273J47939p3453J04686
16221e1312J6793j53227N649j46801J05078K75862K54166o5466p1120k97655k59442
16210c87475J62724O8461p6903J35150J93408J73128m46450k07312k0078P2200
16200c33147J0406J12635J83017K10059j8090j12255P3575O7190O9301k14932
$$ y = [-261379, -181474, -279255, -245586, -298100, -360914, -136177, 28177, -51954, -94897, -299383, -341884, -257036, -277837, 56785, 229385, 125816, -106519, -182940, -138024, 199479, 190656, 63956, 18471, 11647, 80069, 236916, 307466, 95179, -76937, -420271, -513053, -469343, -414477, -138779, -132983, -93447, -157800, -93153, 41605, 15741, 153699, 354863, 35788, -48159, 61530, -32432, -281827, -443866, -134409, -151211, -230484, -82545, -155998, -51312, -34519, -187746, -182097, -328898, -223820, 52042, 306208, 240742, 169622, -128033, -387475, -224751, -156290, -233193, -98043, 95365, 268493, -177957, -385269, -405347, -333147, -322741, -210106, -27089, 182970, 164880, 52625, 126200, 193390, 262691, 47759]
16190D7759k01900L7045K1367l4215K12434k46208j29815o7464J17817K16231
16180b6949K66541J24928j00339j62026j69983J7630l4541l12465K01628K2333
16170a73243O8328j98110k86934j47814K61236J77336K01076K3984r3695J10202
16160e7634n0885K63897J24434M3659J98698R8745j85890k01170j41791k36441
16150a44378o952J46676l76726j59564J69032K13310L90310J0639J47663L796
16140C93806l45427j71885M1393j18352M0262P1983j59828l07049J69317K20025
16130a65755J13301j02204k61272J1052K16242K72937J42459j33927k44071m21818
16120e73056L19308L19375k26687M9434j48988M2180M18682K10670L4109j58091
$$ y = [47759, -154141, -117096, -95729, -129944, 82490, -163718, -293533, -360997, -243180, -26949, 239592, 364520, 264181, 102155, -67828, -50198, -84739, -397204, -195576, -173243, -104915, -303025, -589959, -737773, -476537, -299201, -98125, -74141, -167836, -57634, -108519, 155378, 279812, 323471, 522169, 620914, 435024, 233854, 92063, -144378, -151330, -4654, -381380, -540944, -371912, -158602, 231708, 242347, 390010, 393806, 48379, -123506, -82113, -200465, -160203, -88220, -248048, -555097, -385780, -165755, -52454, -154658, -415930, -404878, -188636, 84301, 226760, 92833, -151238, -573056, -253748, 65627, -161060, -111626, -260614, -218434, 200248, 410918, 445027, 286936]
16110B86936n3843m4227l35998k72914o8823J85099P0283J35166j15335j43421
16100c57077J13182L6421J92754p593j50870Q0235R088J31405j78283q8203p8539
16089b97480K24057o370l1934j23548j42078J03006j08005J53407M36877J24928
16079C32860k40311j47778r9983o656p487R3828j48337J32768K37097J09702j69600
16068H6103j96310J3148J34693q449l53830K06825J14818J27450N7971r5740k78307
16057a91628r9658k80882j83808J99543J62963K17305p3358l84820o6328J16483
16047e84188P6031J44072M22229M17383k7730j1316k81828l35722J03503N6184
16037b1382j08156J99410P3737m1763k58340l06842J74743N25457k8299j01101
$$ y = [286936, 233093, 188866, -147132, -420046, -488869, -303770, -233487, -98321, -213656, -357077, -243895, -207474, -14720, -22313, -173183, -92948, -83860, 47545, -130738, -218941, -297480, -73423, -79793, -111727, -235275, -377353, -274347, -382352, -228945, 207932, 332860, 92549, -55229, -155212, -161868, -169355, -75527, -223864, -91096, 146001, 255703, 86103, -110207, -97059, 37634, 29185, -324645, -117820, -3002, 124448, 182419, 86679, -191628, -291286, -572168, -755976, -556433, -393470, -176165, -249523, -634343, -700671, -584188, -508157, -364085, 58144, 475527, 447797, 436481, 154653, -181069, -77566, -21382, -129538, 69872, 143609, 101846, -156494, -463336, -288593, 236864, 208565, 107464]
16027A07464k84907L2298K47607K735k59832J581J96509K65517R8873l6724p0156
16016C00965m8582j66586J91404K30202j56057k92932j99674Q6855j28596O9406
16006a13595L5516l691j75460j126J82435K49393r0943p066j50289L5357M2313
15995B844J331K96087q1792j9269L5991J21914k25167J24764p0559j13902j64898
15984i2656K57400L5537J8149k85588L7686P4463J66087J29977j2720k84811k43179
15973a99655K71771J56774J02854j91313k10436J2629P0604J6316l6604j69065
15963a76125q8225K379K8657r8469J46548K39685j06902O6916q2570j73597n5169
15952b96872J77043L86735R126p5469J29078j87043N769J18609o2797J77546j08391
$$ y = [107464, -177443, -145145, 102462, 105197, -154635, -153054, 43455, 308972, 407845, 371121, 300965, 252383, 85797, 277201, 507403, 351346, 58414, -141260, -54405, -183001, -113595, -78079, -81770, -257230, -258356, -75921, 173472, 82529, 75463, -74826, -39469, 2844, 4175, 300262, 218470, 199201, 235192, 357106, 131939, 256703, 186144, 72242, -92656, 164744, 200281, 218430, -67158, -29472, 44991, 211078, 341055, 328335, 43524, -199655, 72116, 228890, 331744, 140431, -70005, -57376, 13228, 29544, -7060, -176125, -264350, -261971, -233314, -331783, -185235, 54450, -52452, 14464, -68106, -241703, -296872, -119829, 266906, 276032, 200563, 329641, 142598, 148367, 266976, 204179, 381725, 273334]
15941B73334j45230l0458K51705Q3116j73850j379k80163q1325R4267j45923J77726
15930B1820J39277m08372k17753J70549o351m821k4429m34698l1174L11346Q9531
15919c95075J73924L62461L54804L0640k04788j23939j56243j34709j43882j28037
15909c64844l4403N71523M00803n7386j09659j66837m9207J60478r8309N2995
15899C05154k13920l94434l01736P9386L11090l9664q6060K24443Q5158J88733
15889A58150M6648k14648j51475J20353J72709j22713Q0246k2781k88171q1378
15879c03060R0883J23891r8659N2915O6562J1269L36044j12655l268J28290j82505
15868A09707j52904Q6983j83453j07068k47830R8386K72629m1707M9583p2701
$$ y = [273334, 128104, 97646, 349351, 432467, 258617, 257238, -22925, -104250, -9983, -155906, 21820, 161097, -247275, -465028, -294479, -300830, -305651, -330080, -764778, -795952, -484606, -395075, -221151, 141310, 496114, 526754, 321966, 198027, 41784, -92925, -236807, -364844, -399247, 172276, 573079, 515693, 406034, 239197, 189990, 350468, 252159, 305154, 91234, -303200, -604936, -525550, -214460, -254124, -340184, -115741, -30583, 158150, 204798, -9850, -161325, -40972, 131737, 9024, 89270, 66489, -221682, -303060, -212177, -88286, -186945, -134030, -67468, -56199, 279845, 167190, 163922, 292212, 109707, -43197, 43786, -139667, -246735, -494565, -396179, -123550, -165257, -115674, -188375]
15858a88375p8065k21795r0697N1116J89461j34053k33118P5529J84552r2373
15848e37818P1894J01064J94812m4061O3866r4028n1115J57905K4088K50984J59668
15837B97259j70405j78209J89493m1427J22048p3422p5545o3417m0091Q3831m2123
15826G992j47521N8405l6180J25088J39519j88098j58545j16070j99315P7765
15816d36960R4766L40049n5234l9721P6026L8469k06803j09966J28831K60953
15806I0410J88133j6863j05728j34453J6282k3706J29662J00847j44403k35097
15796a34916L12185K08589l72358l35209J27750J05445J21083O5173R3278K8780
15786B19800j96903q1753n8463K10884J31588k84417q7807J68463R0429K43378
$$ y = [-188375, -266440, -488235, -578932, -527816, -338355, -472408, -705526, -629997, -445445, -537818, -465924, -364860, -170048, -214109, -150243, -244271, -295386, -137481, -113393, 137591, 297259, 126854, -51355, 138138, 96711, 218759, 145337, 69792, 6375, -33716, 50115, 7992, -139529, -81124, -117304, 7784, 147303, -40795, -199340, -315410, -514725, -436960, -342194, -2145, -57379, -97100, -21074, 17395, -189408, -299374, -170543, 90410, 278543, 261680, 155952, 21499, 37781, 14075, 143737, 244584, 100181, -134916, 177269, 385858, 13500, -321709, -193959, -88514, 32569, 97742, 191020, 219800, 22897, -58856, -117319, 93565, 225153, -59264, -147071, 21392, 111821, 355199]
15776C55199k32567k05995j3543Q4686o5359P9065p9159J29012K28729K25137
15766E05205k07618k47237J8196j25208R3917L4643o6476O4521N2405O3815K07639
15755C93802q7758n5942k016k24395j63578J5741J14174l999j64017p7003k54629
15744e09620o8968K09647J64209J86095j11604k41416j0989J62324J54029Q1307
15734A5014o6084j26435J948j49104j07884Q5293L55727m7850j30876j66428p0362
15723d07041j07304N6049M08400K3646O4575j5681J46610K90876K10492Q8143
15713G58765p1935j47380J9286j29996k35363n2511j85408J13988J41644l40796
15703a29706Q0125N11308J50464P610j29222l49888j43626N353L6488K1796N1187
$$ y = [355199, 122632, -83363, -96906, -12220, -77579, 1486, -77673, 51339, 280068, 505205, 297587, 50350, 68546, -56662, 37255, 71898, 5422, 69943, 122348, 186163, 393802, 306044, 250102, 248086, 23691, -139887, -124146, -9972, -13971, -177988, -254991, -509620, -578588, -368941, -204732, -18637, -130241, -371657, -382646, -220322, -66293, 15014, -51070, -177505, -175557, -324661, -432545, -347252, 8475, -39375, -170251, -336679, -407041, -514345, -458296, -49896, -26250, 38325, 22644, 169254, 460130, 670622, 758765, 686830, 539450, 558736, 428740, 193377, 140866, -44542, 69446, 211090, -129706, -49581, 461727, 612191, 619801, 490579, 140691, -2935, 2418, 38906, 60702, 111889]
15692A11889O234J73706R7648j72014l72769r7464L63212P1653j63040p233J20051
15681A31873O6402j27278J02449k9969l24067j17686O960M2267Q6197K10115k7064
15670B0199P5760R2542p8464k25759N3853N7344L3055J53519K44183j51401K04824
15659D79655m13513l08913L63818L42530p0970k50734J04811p8629m8935K54230
15649C73350J26172K06250Q5128J76299K53024K02968K93610J32711K76839j67148
15639A959203k43704O8084o5363l8807k26160j88344m02891j69584J43374m3523
15629G92285k02224j50956r6015q6526K28387L88859k39721j14520k49519j31488
15619A38562j23108R048J34357J19008q9818k09969j29033J70766L03316J87944
$$ y = [111889, 118123, 291829, 389477, 217463, -155306, -252770, 110442, 182095, 19055, 11822, 131873, 198275, 70997, 173446, 143477, -180590, -298276, -291316, -249049, -162852, 47263, 20199, 95959, 188501, 110037, -115722, -61869, -4525, 28530, 182049, 426232, 274831, 479655, 66142, -242771, 121047, 463577, 392607, 141873, 246684, 168055, 119120, 373350, 499522, 705772, 790900, 967199, 1220223, 1423191, 1716801, 1849512, 2126351, 1959203, 1715499, 1783583, 1718220, 1679413, 1453253, 1264909, 862018, 692434, 835808, 792285, 590061, 439105, 343090, 256564, 484951, 873810, 634089, 519569, 270050, 138562, 15454, 24502, 158859, 277867, 188049, -21920, -150953, 19813, 323129, 511073]
15609E11073J8594K6389m64053p3696l7960o3994J00108n8206P2769J14584k76248
15598a30640j86245J75321k54497k4925J16997p6553J2342J72836L9491k95151
15588d51024j04786L91560K64861K7999j7823k58551P4061L08057j48595k96672
15578b10913k6229L12370Q0722J99300J17764m68599m06549L8793K97545J6834
15568d8962J81058m2347p2029l54548O7097Q2067L0386p4721p0292N3570J97611
15557e1110J66408J17047j91590Q6741L8482k7862J80554P8528P4131J90380J11619
15546G73328p1629k84286j84841o3914p7459j13357m4307K4362m2137J96290k9002
15535H3048q9015J09220L5496J11023m32395l61634J43526K12065J1226m9647
$$ y = [511073, 529667, 556056, 92003, 18307, -19653, -83647, 16461, -41745, 31024, 145608, -130640, -316885, -141564, -396061, -420986, -303989, -380542, -368200, -195364, -155873, -451024, -555810, -164250, 100611, 128610, 110787, -147764, -73703, 234354, 85759, -210913, -237142, 75228, 155950, 355250, 473014, 4415, -402134, -363341, -65796, -48962, 132096, 89749, 17720, -336828, -269731, -187664, -157278, -231999, -302291, -248721, -51110, 115298, 232345, 40755, 127496, 165978, 138116, 318670, 397198, 471329, 661709, 773328, 701699, 417413, 232572, 168658, 91199, -22158, -66465, -42103, -84240, 112050, 83048, -5967, 103253, 138749, 249772, -182623, -544257, -400731, -188666, -177440, -227087]
15525b27087L31390K63123M6663l2312k20723k47438n7055j6891n4566J0376J48528
15514e5992R2016J20552n2625l2573n0441m9175J76109m0972K05421K77091J4568
15503F03979L77275j8534j5794l05124k55193J4258j01758n05270R4525j0766
15493a22402K16816O930O9974P1035p9733J10381R3266J6110j19346j78270j06164
15482b1403J13693J70891j29941K9804k38j10838r2070j15502K57117j25819m5133
15471f9439Q1203J80387K66403j63335J99113j07714j10924j58421j01960M9345
15461F4658J51202j70389m9120L06172K2814o9994k46910R3552P0726k07611J61288
15450A26388K81932j43042q1193o479P3204J34579K23849L27715j7206l08476
$$ y = [-227087, 104303, 367426, 414089, 381777, 161054, -86384, -143439, -160330, -214896, -204520, -55992, 36024, 156576, 103951, 71378, 20937, -28238, 147871, 106899, 312320, 589411, 603979, 981254, 962720, 946926, 641802, 386609, 400867, 299109, -206161, -111636, -122402, 94414, 101344, 171318, 242353, 162620, 273001, 366267, 382377, 263031, 84761, -21403, 92290, 263181, 133240, 163044, 162806, 51968, -40102, -155604, 101513, -24306, -69439, 11764, 192151, 458554, 295219, 494332, 386618, 275694, 117273, 15313, 64658, 215860, 45471, -3649, 302523, 325337, 255343, 8433, 101985, 172711, -34900, 126388, 408320, 265278, 184085, 177606, 250810, 385389, 609238, 936953, 919747, 611271]
15440F11271j91669r5519j60533k94727k70649J72464Q0171K19781l1284K83570
15430C22876J61230r8752R1084k01667k96822M4257O98j58473m8389J68253J55556
15419A39851J76204J12807K50495j53770l78435j10527J3073N7112L19152L6233
15409D62195j9145J7128r4002J235j78910K02191R1137m57843q5280M95792K94429
15398G28927j65511l78305m07024P0684J5368J81395J7466m0150K96778j35911
15388A83717j94698O4405k07507J98753n8509k92090J52444N6591j46956m1854
15378b85704K88866K09075J70662l6966j10758J46715K12719N1122l1720m64233
15368A49778l46710K7785K15166J43054j34626P4728r4429j76928O2117K01914
$$ y = [611271, 419602, 324083, 163550, -131177, -401826, -229362, -149191, 70590, 39306, 322876, 484106, 385354, 476438, 274771, -22051, 22206, 22904, -135569, -183958, -15705, 139851, 316055, 428862, 679357, 525587, 147152, 36625, 49698, 106810, 425962, 462195, 443050, 460178, 366176, 367411, 188501, 390692, 481829, 23986, -61294, 434498, 728927, 563416, 185111, -221913, -151229, -135861, 45534, 63000, 22850, 319628, 183717, -10981, 53424, -154083, 44670, -13839, -305929, -153485, -96894, -243850, -285704, 3162, 212237, 382899, 345933, 235175, 381890, 594609, 645731, 614011, 149778, -196932, -169147, 46019, 189073, 54447, 129175, 34746, -142182, -80065, 121849]
15358A21849L953q8074O2298J83430J77495J60156o151j75293k4824j13749q1046
15347B20044K25461L05294r9615P8341J9478R8614o5633k29264j8951P446j05329
15336D35886r5967o835K96961J6824o2362j81481Q8913J83973q5209k66148j16620
15325B07935O704L5446L91437j42313k13957k35497r3734K0992n9248j87972J80219
15314h9988M32041n4958k28391K36506R6131J59685l7834j34741j17318K60481
15304E21614L12371k6937l15135l22773O4606J11324r670J7927P2983J20428J11828
15293F58566J5340J6155m0698O4203n7842P8788p994j5833O3134J02959J21034
15282I97812K92042k47553j6316m8984j49746p5768J45004K2061j70508N7121
$$ y = [121849, 125802, 37728, 100026, 283456, 460951, 621107, 614956, 439663, 414839, 301090, 220044, 445505, 750799, 651184, 729525, 749003, 847617, 781984, 552720, 533769, 541215, 435886, 339919, 333084, 630045, 646869, 584507, 403026, 491939, 675912, 590703, 324555, 207935, 214639, 250085, 641522, 499209, 285252, 49755, -43979, -22987, -82235, -270207, -89988, 342053, 287095, 58704, 295210, 391341, 551026, 513192, 378451, 261133, 521614, 833985, 807048, 491913, 169140, 233746, 345070, 335400, 353327, 426310, 546738, 658566, 673906, 690061, 649363, 713566, 655724, 734512, 726518, 710685, 773819, 876778, 997812, 1289854, 1042301, 1025985, 977001, 827255, 751487, 896491, 918552, 748044, 805165]
15272H05165j01536J5960J8729K90778M82943K93725J4019l80835l86842k3712
15262A028394L06028J09490M22839K22711P8606K04982J14677Q56K62274J68117
15252B918974J09041R7236Q1024J68589J99482K41630K40201K94517K46151r450
15242D587395M45940K81890l1087L52289M79494N52852O10670K17829M53431P95830
15232H746533K85475N91367R37381J024821R90348R84953J296234J347620J688563
15223A7893295J420362J867424J934164K070187K849081K858588K754636L149976
15215C6797713L560100M023363M235648M293676M575055N075814N809692P231265
15207G5602326Q925257J1708170J5413758J9431773K3881885K8262865L1286704
$$ y = [805165, 703629, 719589, 738318, 1029096, 1512039, 1805764, 1819783, 1438948, 1052106, 1028394, 1334422, 1443912, 1866751, 2089462, 2168068, 2373050, 2487727, 2488583, 2750857, 2918974, 3028015, 3125251, 3206275, 3374864, 3574346, 3815976, 4056177, 4350694, 4596845, 4587395, 5033335, 5315225, 5284138, 5636427, 6115921, 6668773, 7279443, 7497272, 7950703, 8746533, 9032008, 9623375, 10560756, 11585577, 12575925, 13560878, 14857112, 16204732, 17893295, 19313657, 21181081, 23115245, 25185432, 28034513, 30893101, 33647737, 36797713, 40357813, 44381176, 48616824, 52910500, 57485555, 62561369, 68371061, 75602326, 84527583, 96235753, 111649511, 131081284, 154963169, 183226034, 214512738]
15200B14512738L1964667L0255428K6160284J9437179R996387k12997j0403816
15193C21709870j9325219k6266363l0565680l1521453l0571595k7817115k4141474
15186A31500971j9628261j5289245j1670965q997727p648586o723160n867336
15179E5675691n168826m803313m648071m441063m025661l548618l044491k718659
15171B3276989k238950k193671j893853j690560j399145j399586j045190p98338
15163A0617696q32130q42183o95436o13897q36680l29740k16495l53647l43191
15154E554297l71537m01647m61266j632l47847p20614l59620n26396l6568j33990
15144B193180k92487k37331j8074K61424r4812m34362J68200Q158j83875k795
$$ y = [214512738, 246477405, 276732833, 302893117, 322330296, 332326683, 332113686, 321709870, 302384651, 276118288, 245552608, 214031155, 183459560, 155642445, 131500971, 111872710, 96583465, 84912500, 75914773, 68266187, 61543027, 55675691, 50506865, 45703552, 41055481, 36614418, 32588757, 29040139, 25995648, 23276989, 21038039, 18844368, 16950515, 15259955, 13860810, 12461224, 11416034, 10617696, 9785566, 8943383, 8247947, 7634050, 6797370, 6467630, 6251135, 5897488, 5554297, 5182760, 4781113, 4319847, 4318215, 3970368, 3249754, 2890134, 2363738, 2327170, 2193180, 1900693, 1663362, 1645288, 1906712, 1811900, 1377538, 1545738, 1553896, 1370021, 1367226]
15134A367226k04415j44823J63320J4436l47169j12740R8597J98028q4905O386
15124I53941J39656r9551j87778J888J66976O088r1934j19887p1642j97056p3090
15113D27611K10908J48555O9862K2117p8188J6882o9362J90573j0611q5795j43739
15102F98813l23621k02724J15625O2676N8782L01000J58655k92546m04977n1539
15092A20144K57869J16201O4817K16549j63802l94642j25528j24248j60750J95760
15082B370L17341o1431j04064N9905J84965o1622j41645O3730K02264q6649K5221
15071D00385J39885M9164L06592j3576n68983k00874Q0612l5292j74128M7680
15061C1465M4868j37809J81471M08060J08779m0632j38735k33221k5559K89091
$$ y = [1367226, 1162811, 1017988, 1181308, 1195744, 848575, 735835, 834432, 1032460, 947555, 953941, 1093597, 994046, 806268, 808156, 975132, 981220, 889286, 769399, 697757, 500701, 427611, 638519, 787074, 856936, 879053, 800865, 817747, 748385, 938958, 928347, 842552, 698813, 375192, 172468, 288093, 350769, 409551, 710551, 869206, 576660, 171683, 120144, 378013, 494214, 559031, 775580, 611778, 217136, 91608, -32640, -193390, 2370, 319711, 258280, 154216, 214121, 399086, 337464, 195819, 259549, 461813, 375164, 400385, 540270, 589434, 896026, 882450, 313467, 112593, 193205, 157913, -16215, 31465, 76333, -61476, 119995, 528055, 636834, 596202, 457467, 224246, 198687, 487778]
15051D87778L3063j43262j06391Q5341P0682J0069L6197J16721K0839o905k33437
15040C70695q8895j50243j15407j51036J09636R9345M1358R6599o1176N408m6119
15029A10165L6307Q0134K79921K43632j86626j46385j74898j20794J05373L21297
15019E48126j05746r6391j38087k08514j94255r9526j09691J64236J89162K05859
15009A55173K7812k15180q4857K64991j05329M8738J83908Q1256r5922j24757
14999A35833P321k41499N3047J24731p3079l9686K23131j42119j61485M399k49375
14988c58781O5048J33142K43584k37508l97270J61J99371M04949K96163j84797
14978A64062N253k26783q6548M1566J65183J31875J95499k4722j43590k15431
$$ y = [487778, 520841, 377579, 271188, 356529, 427211, 437280, 473477, 590198, 611037, 604132, 370695, 281800, 131557, 16150, -134886, -25250, 74095, 115453, 212052, 150876, 156284, 110165, 146472, 226606, 506527, 750159, 563533, 417148, 242250, 121456, 226829, 548126, 442380, 345989, 207902, -612, -194867, -294393, -404084, -239848, -50686, 155173, 182985, -32195, -117052, 147939, 42610, 91348, 275256, 356512, 260590, 135833, 143154, -98345, -45298, 79433, 6354, -33332, 189799, 47680, -113805, -109406, -358781, -293733, -160591, 82993, -154515, -551785, -551624, -352253, 52696, 348859, 164062, 169315, -57468, -144016, -102450, 62733, 194608, 390107, 365385, 221795, 6364]
14968F364o1988J84236J48618J94759k28251j90513R0883j1239k01380L5532K59903
14957B26924L8682j55116j5943J47881r8185M9780j37136Q5463q899j8578J4839
14946A29712k40906J30797p9333L2232J36734r5530j18481l9113j8472R6225J81653
14935A15518J53209q3650l92837k30023J88545J91340R25l2653k4839R0619P8111
14924E4265p0771r1627j25991K93020M19143n4846k31914o8248j43418l01864
14914c22251K0916J10033J13078M4772N9861k11520k20800j3449J39511p3652
14904c53501J00938J59441j727K2884p6943L1311j35787J9335Q5216K9622q2295
14893b01506J97725L51964J32307N3378k06393m9889j83900o5608n3222j666K21107
$$ y = [6364, -55624, 128612, 277230, 471989, 243738, 53225, 144108, 132869, -68511, -32979, 226924, 265606, 110490, 94547, 242428, 144243, 194023, 56887, 142350, 133451, 114873, 129712, -111194, 19603, -59730, -27498, 109236, 13706, -104775, -143888, -162360, -66135, 115518, 268727, 185077, -207760, -437783, -249238, -57898, -56973, -89626, -114465, -23846, 54265, -16506, -108133, -234124, 58896, 478039, 423193, 191279, 123031, -20387, -322251, -301335, -191302, -78224, -33452, 26409, -185111, -405911, -419360, -279849, -353501, -252563, -93122, -94849, -71965, -148908, -117597, -253384, -234049, -148833, -119211, -201506, -3781, 348183, 480490, 533868, 327475, 277586, 93686, 28078, -25144, -26810, 194297]
14882A94297J36995K49284J36411j12279k37893p1006Q1870j10368j91214K08424
14872B84521k33910j20815k5436j24094K69708K42795J41257P3127q2192k2719
14862D02242m5208m43183k69624J42994O1777P0763K20195j15869j87558j61062
14852c24533m056j7126J23761j20198q2000k80110j51546K17444K01992J64107
14842b72265K79354O6478o7750M6230r8177P0366j54703r6083K26650J02946l61
14831A02685J7328J22191J33003n5878J57776o2286k31793j0072k45174j269K1605
14820e1884O8844R6034k53822r684J66191P6643J6292k56498j53651J61297N1676
14809h8562N0784J58957K16744J82547k20182l00402o1536r9188J79812O2472
$$ y = [194297, 331292, 580576, 716987, 604708, 366815, 295809, 377679, 267311, 76097, 284521, 50611, -70204, -95640, -219734, 49974, 292769, 434026, 507153, 424961, 402242, 357034, -86149, -355773, -212779, -151002, -80239, 139956, 24087, -163471, -324533, -328589, -345715, -221954, -342152, -424152, -704262, -855808, -638364, -436372, -272265, 7089, 73567, 5817, 52047, -46130, 24236, -130467, -226550, 100, 103046, 102685, 120013, 242204, 375207, 319329, 477105, 414819, 183026, 172954, -72220, -73489, -51884, 16960, 112994, -140828, -150512, 15679, 92322, 108614, -147884, -301535, -140238, -88562, -37778, 121179, 337923, 520470, 300288, -114, -61650, -160838, 18974, 81446]
14799H1446M02677L56841J32929k50991l21121j86004n9577k09702J65923j66616
14789e4195k03908K21721K83309j81835j01926r0201k0394j07550R9762J05762
14779d9455J33935P9880P2827J14826j3040P3166m1736k06187k9386J15582J94332
14768D44744J63067k78263j41841q7410O4706j27598O3227K29613P9530k49572
14758A60203O956L7659Q9125L13039M25194K00025J02905Q1852K16973J08m5485
14747A588554N474K177K04228J67951m3678l6256k46348j01599m82819k24145
14737H33539n8441j60528j17903k8287j63969o1199l9153J19665J45370o4005
14727D05089j13001j50572j30859l35054r0747J38157p5339P6865K28208K86249
$$ y = [81446, 484123, 840964, 973893, 722902, 401781, 215777, 156200, -53502, 112421, -54195, -258103, -36382, 246927, 65092, -36834, -127035, -147429, -254979, -155217, -49455, 84480, 164360, 237187, 352013, 338973, 412139, 370403, 164216, 134830, 250412, 444744, 607811, 329548, 187707, 100297, 165003, 37405, 100632, 330245, 409775, 160203, 167159, 204818, 293943, 606982, 1032176, 1232201, 1335106, 1416958, 1633931, 1634039, 1588554, 1594028, 1596205, 1800433, 1968384, 1924706, 1888450, 1642102, 1540503, 1057684, 833539, 775098, 614570, 496667, 468380, 304411, 243212, 204059, 323724, 469094, 405089, 292088, 141516, 10657, -324397, -415144, -276987, -352326, -275461, -47253, 238996]
14717B38996n7168k48229Q224K70401j20828j51923j37960j76058M1671L14006
14707a8868J8512j79922J04172K81447p5063k13680J40227J5175Q388J74256j61565
14696I3079L6472K17485j04352j58321j71072j30040J076M3757q9234K84201L64439
14685C87490n9654m62043j25947Q4497L25737K47067l3729l6189l45810j87295
14675b05876J84874J40259j10514J82791j56865r1695l02348K7456K343K5074
14665c04501L77274K51677m4980p5271p1740k27k84905k42082J29327r5625L06454
14654e4599m3416J24433P8457o9532k17060L2210j06887j06478J42081l5670K69548
14643A3087m2329k41273n9261O0840K76762J51895k52108L9938R4720J55467N7410
$$ y = [238996, 181828, -66401, -58177, 212224, 91396, -60527, -198487, -374545, -332874, -18868, -356, -180278, -76106, 205341, 130278, -83402, 56825, 72000, 80388, 254644, 93079, 129551, 347036, 242684, 84363, -86709, -216749, -215673, -171916, -261150, 23051, 387490, 327836, -134207, -260154, -175657, 150080, 397147, 363418, 327229, -18581, -205876, -21002, 119257, 8743, 191534, 34669, -57026, -359374, -331918, -329575, -304501, 72773, 324450, 279470, 204199, 132459, 132232, -152673, -394755, -265428, -361053, -54599, -98015, 26418, 104875, 35343, -181717, -149507, -256394, -362872, -220791, -256461, 13087, -29242, -270515, -329776, -268936, 7826, 159721, -92387, -52449, 42271, 197738, 255148]
14632B55148p5151q5802J15004J80478J27928j73310l74659j71681j68024J65615
14622b04454K53013k88407K23012L9301p368J76448M4649j41770k73675N4491
14612a24760K17783K13827j09003r9820l5782k400P2071k69313l53162r1990J12110
14601d70439M38592O3000O437O996j0759j76999J07290L75001J40788j42292k06962
14590A30653R7071r2509k71370K90386K48837k21736j5007j46023J70091l6013
14580A54380j7463M2659k08776n2013m2623N3654L27695J13953J60015k76497
14570B54984l5325N4066K6707m4762R2610K04764M24077J4618j79969j4896k71930
14559E24944j45188K21860j50100L8577K03697N3376j85098j24615k5739L2039
$$ y = [255148, 179997, 94195, 209199, 389677, 517605, 344295, -30364, -202045, -370069, -204454, 48559, -239848, -16836, 22465, 15097, 191545, 236194, 94424, -179251, -124760, 93023, 306850, 197847, 98027, 62245, 59845, 131916, -137397, -490559, -582549, -470439, -31847, 31153, 37590, 44586, 33827, -143172, -35882, 339119, 479907, 337615, 130653, 227724, 135215, -136155, 154231, 403068, 181332, 166325, 20302, 190393, 154380, 136917, 179576, -29200, -81213, -123836, -70182, 257513, 371466, 531481, 254984, 219659, 273725, 300432, 255670, 348280, 553044, 977121, 991739, 811770, 796874, 524944, 379756, 601616, 451516, 490093, 693790, 747166, 562068, 437453, 411714, 443753]
14549D43753J90663L42728l66547k28480R9538j19195j90997L8054j8737j05746
14539H5034N5126k87788q1799L01386n6968l01039K20160k1207P3262R5284L805
14528H5256J69074l6353j37162j47754n7627J65015J78263o6959k25513k22523
14518b96283L04286J69195J13967k9860L7353j45252k8885L85786J88456k47574
14508D51189k65243m21661l14250P7294K15706o6641r6774K34664m9564Q4114
14498a51166R5568J81789r990l36461O9062j76236k89264M20041N8929k84730
14488d22458j61705K83995J64023J93066k91582L4612K40954q078M5560J23362
14478B01749j99387K61706J32640l16718j68893j5556K02632L2508j02119l8138
$$ y = [443753, 634416, 977144, 610597, 382117, 481655, 362460, 171463, 209517, 190780, 85034, 140160, -147628, -229427, 71959, 14991, -286048, -65888, -87095, -13833, 81451, 85256, 254330, 217977, 80815, -66939, -124566, 40449, 218712, 151753, -73760, -296283, 8003, 177198, 291165, 261305, 298658, 153406, 124521, 510307, 698763, 451189, 185946, -235715, -549965, -472671, -256965, -323606, -420380, -185716, -235280, -151166, -55598, 126191, 116201, -220260, -151198, -327434, -616698, -196657, -137728, -422458, -584163, -300168, -136145, 56921, -234661, -200049, 40905, 32827, 78387, 201749, 2362, 264068, 396708, 79990, -88903, -104459, 98173, 130681, 28562, -9576]
14468i576q0656Q3074K03406M4331j92867k81947N740n6555p0148J43472J8227
14457a93499p2619L67747p5739q9834J21685J0983J75051N0180K09592K86374
14447G89921j71799m33000q5491n6491j07760K81112K91298k14458k68330Q56
14437B5858J10180J45719k6999M9155p8240p5230n9750j66339Q610K11781O3324
14426B08069m01927n9928J82392j64229n8218K82902K46862j84216r8811J11872
14416F4768K54718Q0311k57178j08224j31545j3332k04735J36212P1705p1434
14406a78734j34587K80757K17551j60411k92190J10998K30879j04680j63941r7562
14396b91920n841q203J00883J68866j03447q7263J45768L0349p5346N15902o0994
$$ y = [-9576, -90232, -7158, 196248, 240579, 47712, -234235, -228495, -285050, -355198, -211726, -193499, -266118, 101629, 25890, -63944, 57741, 68724, 243775, 293955, 503547, 789921, 618122, 185122, 99631, 43140, -64620, 216492, 507790, 293332, 25002, 25858, 136038, 281757, 254758, 303913, 225673, 150443, 90693, -75646, -67036, 144745, 208069, -193858, -253786, -71394, -235623, -293841, -10939, 235923, 51707, -47104, 64768, 319486, 399797, 142619, 34395, -97150, -110482, -315217, -179005, -107300, -178734, -313321, -32564, 184987, 24576, -267614, -156616, 74263, -30417, -194358, -291920, -297761, -305964, -205081, -36215, -139662, -226925, -81157, -50808, -126154, 389748, 328754]
14385C28754O824J84501K5730k83301K087j36297l6551j14743K29549M6836j39058
14374A14331j91490k2228J47317M4653j68251M7548j9282L9631n0202M4876j18051
14363a31148L4334L5169j0143J81444J66613l3202k33092j68302L39896K30722
14353D12291K10495R9245r9551m57074l55931j40857q8981R6596L51265L922j80119
14342a48699n8868P9134K37596J6691K1932K24678K6735j52889l08469l3899N73293
14331D77235J13740j39381k46555j90986J23450K08961o2503Q980k41603k8155
14321B3183q4408N8559n0264j17244L8926K11617j72025k99639J90439K40568
14311C9712P4897k5483l69985Q293K70431j42210j46190r2236K12353K07249J40100
$$ y = [328754, 335578, 520079, 545809, 262508, 264595, 128298, 91747, -22996, 206553, 253389, 114331, -77159, -99387, 47930, 92583, -75668, -28120, -47402, -7771, -57973, -13097, -131148, -96814, -61645, -71788, 109656, 276269, 243067, 9975, -158327, 181569, 412291, 622786, 722031, 622480, 165406, -190525, -331382, -420363, -323767, 27498, 31420, -148699, -207567, -128433, 109163, 125854, 147786, 372464, 399199, 246310, -62159, -96058, 477235, 590975, 451594, 205039, 14053, 137503, 346464, 283961, 292941, 51338, 23183, -61225, -2666, -52930, -170174, -131248, 80369, -91656, -391295, -200856, 39712, 114609, 89126, -280859, -272566, -2135, -144345, -290535, -382771, -170418, 36831, 176931]
14300A76931K18068j74069j95060N7654Q3595k29029m6069J83025l7654n1241
14290a3849N2660K653n4482j35499k32940o6605R7246K68745J47782l899j22308
14279f0496l65220j02726L75264L92551m6934j37459q2086O7012j04983L9354
14269b5723N6986p5568l77077N749L50478J78537p9777q2115M5096j59347J38247
14258b4514K76639J70416j15174j74320l5097J85120k34354J1534j45172j22410
14248b07332P4823o3976Q9610j80326j98752K38127K44467L39906J89254l6572
14238D89229j56051l9279j00870p7994j46060j47101j45345J22810m6045J75002
14228g1704j18856K29715K7568m8664O0840Q2545j27696k84336K76515M64375
$$ y = [176931, 394999, 220930, 25870, 83524, 167119, -61910, -107979, 75046, 37392, -13849, 38811, 41464, -13018, -148517, -381457, -448062, -350816, -82071, 65711, 61812, -60496, -425716, -528442, -153178, 239373, 192439, 54980, -27106, 39906, -65077, -25723, 31263, -44305, -421382, -415633, -65155, 113382, 33605, -48510, -3414, -162761, -24514, 252125, 422541, 307367, 133047, 97950, 283070, 48716, 60250, -84922, -207332, -132509, -196485, -106875, -287201, -485953, -247826, -3359, 336547, 525801, 489229, 333178, 293899, 193029, 115035, -31025, -178126, -323471, -200661, -246706, -71704, -190560, 39155, 66723, 18059, 78899, 161444, 33748, -250588, 25927, 490302]
14218D90302J14437j91024l19972J06332J63066K30180k2210j80527J864J37399
14208E29847k92720k86860J72714P4095M0275m5527p0643O5732k8416l5172J04197
14197B27522j26133J56145K37256k99551j98079o4604k6924P7535q7869j0118
14187a14820O0537k96072o7934L3122J31992m3307J66700J90450J86570Q2462
14177C29700L42061k03255l43185k13767K60142L95925Q0546m08293j13320j88305
14167f1751j13406K97375m2753j42058K41409J63694l415k16975J63928M247j62741
14156A27554n1752j01058M1292k0450m4522n8492L4706J5495J58765L1946r4206
14145C9278j19132K8028l5380L2272p4405N1738n5293j0077N2730j87400k93665
$$ y = [490302, 604739, 413715, 93743, 200075, 363141, 593321, 571111, 390584, 392448, 529847, 237127, -49733, 122981, 197076, 237351, 191824, 121181, 186913, 158497, 123325, 227522, 101389, 257534, 494790, 195239, -2840, -67444, -94368, -16833, -104702, -114820, -54283, -350355, -418289, -385167, -253175, -296482, -129782, 60668, 247238, 329700, 671761, 468506, 125321, -88446, 171696, 567621, 648167, 239874, 126554, -61751, -175157, 122218, 79465, -62593, 178816, 342510, 339095, 122120, 286048, 290295, 127554, 75802, -25256, 16036, -4414, -48936, -107428, -72722, -57227, 101538, 133484, 39278, -79854, -51826, -87206, -54934, -129339, -77601, -132894, -142971, -90241, -277641, -571306]
14134e71306K40795J47815J74052j20823m5770j12654k30523k15012K07784L30256
14124a95386L47230K15421l3515k49070J17578K22427J57830M7299K5209j37298
14114E17725k81247M0403J2455k63192k71104R985k7711R4542J12808O3170P5333
14103H3167m5589K2651K2363j34729K03597J29888k59167j41305p7524k34152
14093d30800M6281K31594J99464J29251K67054K38917J05786P953j65987r8510
14083E31003J19213l6539l39559k45015k1708J95596j20557L2869K67735M4427
14073D27465j90577j18679o1150k01762n9087O0440R9195K02571J08032k25356
14063D1092l2651k41603q7309M6500J86943J28711j2608o8294J74459j24052j6162
$$ y = [-571306, -330511, -182696, -8644, -129467, -175237, -287891, -518414, -733426, -525642, -195386, 151844, 367265, 333750, 84680, 202258, 424685, 582515, 629814, 655023, 517725, 236478, 276881, 289336, 26144, -244960, -234975, -262686, -168144, -55336, 7834, 83167, 37578, 60229, 82592, -52137, 151460, 281348, 22181, -119124, -196648, -430800, -384519, -152925, 46539, 175790, 442844, 681761, 787547, 795500, 629513, 531003, 650216, 613677, 274118, 29103, 7395, 202991, 82434, 115303, 383038, 427465, 236888, 118209, 57059, -144703, -203790, -143350, -44155, 158416, 266448, 41092, 8441, -233162, -320471, -273971, -87028, 41683, 29075, -39219, 135240, 11188, -4974]
14052d974m9009L18833r5756J63178j17507m834q83O642L5960P3468J9495J26378
14040D70991O1719R8042J27638j05052m090l4836r7464o7184J35709J82313k7729
14029G40057L18606K53777P2476n3735n0199M3415j17320J15773M5365j53274
14019A214941l79430M9389L48799N1216q4864p3523k59037K07461q5767j14339
14009H74846K7119k82815R0254p3592Q375l7208k12696p8553j28056N5827L73
13998B43874k37986K15354L01045J7566n4590j56058l08660O1066L66532K33262
13988F81405J72184l7409j26001j87894k90909k7226k5895N4815j61680k93023
13978b41633j17434J25129L98195r2804L6397J94055j58053K4871J67180p6906
$$ y = [-4974, -53983, 264850, 169094, 332272, 214765, 209931, 209048, 215690, 251650, 325118, 344613, 470991, 532710, 630752, 758390, 653338, 649248, 614412, 516948, 449764, 585473, 767786, 740057, 1058663, 1312440, 1384916, 1331181, 1280982, 1324397, 1207077, 1322850, 1368215, 1214941, 835511, 884900, 1233699, 1284915, 1200051, 1126528, 867491, 1074952, 989185, 874846, 901965, 619150, 709404, 635812, 644187, 606979, 394283, 315730, 187674, 243501, 243874, 5888, 221242, 522287, 539853, 485263, 329205, 20545, 81611, 448143, 681405, 853589, 816180, 690179, 502285, 211376, 184150, 158255, 213070, 51390, -241633, -359067, -233938, 164257, 71453, 107850, 301905, 143852, 168723, 335903, 258997]
13968B58997K60769l1864j07547j51165J71094k05151j05372l6133o7433n8453
13958g2258M5948K94162Q9767K66266j05141j54547r0854L4874J64948J16607
13948E89772j99535l66036j7952R2322P7456j55963M1604j25056m0143P0654K48989
13937B16112O6874J44160j69031j44572m4152k1295O4494K12097l5120m18901
13927a29334n8924M34024k7101j13341N3180k7615J3971j71584m1977O7954K62894
13916B62147J13295P3559j74138j40131J1489j26980n6616J39597k4454K8816
13906A06584l4517Q8761j51053J07888K37155r1252j82431m9129N7329j39561
13896e0226N8124J31553J28396j983J7553M3960j5980M5674n9694j56041l79508
$$ y = [258997, 519766, 487902, 380355, 229190, 400284, 195133, 89761, 53628, -13805, -72258, -26310, 267852, 357619, 623885, 518744, 364197, 273343, 308217, 473165, 589772, 390237, 24201, 6249, 98571, 176027, 20064, 61668, -63388, -103531, -32877, 216112, 282986, 427146, 258115, 113543, 69391, 48096, 112590, 324687, 289567, -129334, -188258, 245766, 218665, 105324, 158504, 130889, 144860, -26724, -68701, -747, 262147, 375442, 449001, 274863, 134732, 146221, 19241, -37375, 102222, 77768, 106584, 72067, 160828, 9775, 117663, 354818, 263566, 81135, 32006, 89335, -50226, 7898, 139451, 267847, 265864, 283417, 327377, 311397, 357071, 297377, 141336, -238172]
13885b38172n8227l1006K25232l1351m6184j68061J48617K51071K51819o4781
13875B38957j8199L8585L876k42195j40424R4744n0965o9125p4956K56350L39202
13864C75850l7915l75581j47303R7700K43151J66264n9432J81077j09980J10337
13854D44168Q5202J08744j5072n1690r5886P9912j18198l06751j78409k6838J49041
13843G4223j0978l13290j92145J70287n7324L10641J56825P8168j05731P1128
13833A81804O4384j22549j34055N478J78378J5241J45605l2440l91371L3022J08858
13822E2355J83576q6073l67763r8049K28151J32719J18544k10628j07130J53676
13812f22j89189J55457L43745J5008j60119q9239R4327j4868J91976J67835j09266
$$ y = [-238172, -296399, -327405, -102173, -133524, -179708, -347769, -199152, 51919, 303738, 238957, 220758, 259343, 263219, 21024, -119400, -24656, -75621, -144746, -219702, 36648, 375850, 337935, -37646, -184949, -87249, 155902, 322166, 262734, 443811, 333831, 444168, 529370, 638114, 623042, 571352, 475466, 555378, 437180, 130429, -47980, -74818, 74223, 63245, -250045, -442190, -271903, -329227, -18586, 138239, 216407, 110676, 181804, 246188, 123639, -10416, -4938, 173440, 188681, 334286, 301846, -89525, -56503, 52355, 235931, 149858, -217905, -315954, -87803, 44916, 163460, -47168, -154298, -622, -189811, -34354, 309391, 324399, 164280, 75041, 169368, 154500, 346476, 514311, 405045]
13801D05045Q640J7429j70140j12740j63866M1965L0954o8123m6358Q0188J81498
13790B04492J41915k14669M101j28959M3058J59201o7534l59604j08496j10108
13780d36603k1540K08963O1009o0765K699O1364J74573J44011j92809k52486J37367
13769a74217J96586J30552o6701r4327m6760m9239m6384J21441J44711K98424
13759D14086j14728j60096k9686J43089O8965M5312K55791j83111O4303n4885
13749D49040l11740j94094q1457K3406q4427o2833K18345N7759N7758j86862K16747
13738A01642l8269k20474Q5829R3158p2427Q8009J1241L28100J86535J0578k45893
13727C28029k92454j72781J21532R9104j13463L653O3813o8621K52368J12685
$$ y = [405045, 413685, 431114, 260974, 148234, -15632, 26333, 57287, -10836, -57194, 22994, 204492, 346407, 131738, 135839, 6880, 49938, 209139, 141605, -217999, -326495, -436603, -458143, -249180, -188171, -248936, -246237, -184873, -10300, 133711, -59098, -311584, -174217, 22369, 152921, 86220, -8107, -54867, -104106, -150490, -29049, 115662, 414086, 299358, 139262, 109576, 252665, 321630, 366942, 622733, 439622, 503925, 449040, 137300, -56794, -138251, -114845, -199272, -262105, -43760, 13999, 71757, -115105, 101642, 63373, -157101, -71272, 21886, -50541, 37468, 48709, 376809, 563344, 573922, 328029, 35575, -137206, -15674, 83430, -30033, -26380, 37433, -31188, 221180, 333865]
13717C33865Q5681j00332j56984J26360k84205J23699o2899k22276J52430K41464
13707B36803j52605n6269P8508p1802J28553J53863o9600N264n4092j63332j38331
13696a03040j00868M58231J1671j77623j6596k40841j22196R1075J03836K14838
13686A18487m0294K08001J38085K4607j8738k98428j03348Q4507k39689J07095
13676a9715J96404J30157l20851k284L9126N2591k13164p3277J20217j46888r6460
13665c34144j90996J08806L69730J84870j08488m41251k25467K33038J23036n831
13655b86697L13745J53730J4543o8753k67895J13764L33059k2584r5229N8859
13645B46542n2967k23892k34723j99244J7430J06986N06035L2979l5713P698j75772
$$ y = [333865, 419546, 319214, 162230, 288590, 4385, 128084, 65185, -157091, -4661, 236803, 84198, 27929, 106437, 34635, 163188, 317051, 247451, 252715, 198623, 35291, -103040, -203908, 254323, 265994, 88371, 71775, -169066, -291262, -200187, -96351, 118487, 78193, 286194, 424279, 448886, 430148, 131720, 28372, 112879, -126810, -19715, 176689, 306846, -14005, -16289, 22837, 75428, -137736, -211013, -90796, -237684, -334144, -525140, -416334, -46604, 138266, 29778, -411473, -636940, -403902, -280866, -286697, 27048, 180778, 195321, 126568, -141327, -27563, 305496, 282912, 187683, 246542, 193575, -30317, -265040, -464284, -446854, -339868, 166167, 199146, 163433, 171131, -4641]
13634d641l8925p4811K10519P3716l02721j98374j61065r2349L48278o7716J2386
13623b95703r0225J23975M47616P4411j68627r8744n2443R4180J14065M021j6984
13612A35542K29080q4673k97051o637k21910j82094J075Q8547J44841k20999J93852
13601b20427o5203j32782j27528K17280j5334j1243J17354k8116K56430L12587
13591C03018l04761j29556L00898N1612j83407r3203n4456K3974j81658k66899
13581e34438J56169K70133L26030J71330j97750J59345J75612k01724l25054L9351
13571C9004J41955j98460r3583K46513K5773j37270m62596j59151L4802K49975
13561c13038J88331j58837j23897j01587j17431J63153J95176K9653j26984n2958
$$ y = [-4641, -43566, -118377, 92142, 165858, -136863, -335237, -496302, -588651, -240373, -308089, -295703, -385928, -261953, 185663, 260074, 91447, -7297, -59740, 34440, 148505, 152526, 135542, 364622, 279949, -17102, -23739, -245649, -427743, -426668, -338121, -193280, -414279, -220427, -285630, -418412, -545940, -328660, -343994, -355237, -237883, -265999, -9569, 303018, -1743, -131299, 169599, 221211, 37804, -55399, -109855, -85881, -267539, -534438, -378269, -108136, 217894, 389224, 191474, 350819, 526431, 324707, -347, 39004, 180959, -17501, -111084, 135429, 161202, 23932, -438664, -597815, -563013, -313038, -124707, -283544, -407441, -509028, -626459, -463306, -268130, -238477, -365461, -418419]
13551d18419L87781K23782O5288j05745J29341j29397l60571N4657J57929J03191
13541A07837J97739j32000j65415L16997j98991o510P4741J32307j53203j47270
13531B6232j24785r4148J79916M0637R4470p8281J37341J48185p4768j14262j54969
13520a4432J94750p0614r7188p2932n6737m4298J1044L0293J3459p4242R848M9198
13508a21851J42498J25642r9793K21457L9964K6302J22015O0627j80607j92730
13498A43524q6530k291k37084K71907J77516k02762k05560j57631j98473J44560
13488c52824R502k54286K3832J4997K84837M70134J90261j15712j33903R5874
13478B32712K60468K36247O721l43020j49494j72971m9384m5832l17244M5502
$$ y = [-418419, -30638, 193144, 258432, 152687, 282028, 152631, -207940, -153283, 4646, 107837, 305576, 173576, 8161, 325158, 126167, 119657, 194398, 326705, 173502, 26232, -98553, -192701, -12785, 27852, 122322, 44041, 181382, 329567, 254799, 140537, -14432, 180318, 109704, 12516, -60416, -117153, -161451, -150407, -120114, -106655, -180897, -171049, -121851, 20647, 146289, 46496, 267953, 307917, 334219, 456234, 516861, 336254, 143524, 56994, 54703, -182381, 89526, 267042, 64280, -141280, -298911, -497384, -352824, -343322, -597608, -573776, -558779, -273942, 196192, 386453, 270741, 136838, 232712, 493180, 729427, 736148, 393128, 243634, 70663, 21279, -24553, -341797, -296295]
13468b96295J42703J87530K14235n6836j28106K42845q134l58180J51244r0861
13458A45k0715K113J32864M05073l2177m9722k30191J91793J6529j57724j75869
13447H2119J27342o7999m315L5485K51542m0880k15273k54209R2583K10589P003
13436B23987o0825k49133k81169P7429J18503j38754L2305K51476k983O2968J26
13425C3930j94747l49656K6034K67831J9902j80521K51252N3401r6196P0506K99947
13414B01683J4164m24689j24638L07244N8680k03107J53063K50491J30721r4917
13404B68695l35100j35234L35430K12375K83545j89930k36934q3757k5342P5035
13394A68783K1606K03270j92076r9002l781Q0041Q0588j3353j26074J67463N7304
$$ y = [-296295, -153592, 33938, 248173, 191337, 63231, 306076, 297942, -60238, 91006, 145, -20570, -18457, 114407, 519480, 487303, 437581, 207390, 399183, 415712, 257988, 82119, 209461, 141462, 137147, 172632, 424174, 383294, 168021, -86188, 6395, 216984, 223987, 163162, -85971, -367140, -289711, -171208, -309962, -277657, -26181, -29164, 33804, 33930, -160817, -510473, -484439, -216608, -196706, -377227, -125975, -72574, -168770, -98264, 201683, 215847, -208842, -333480, -26236, 32444, -170663, -17600, 232891, 363612, 268695, -66405, -201639, 133791, 346166, 629711, 439781, 202847, 119090, 93748, 168783, 190389, 393659, 201583, 102581, 98800, 178841, 259429, 246076, 120002, 287465, 344769]
13383C44769j18721j32302j85459k59995J19040K7656K17029Q3802j68592J8356
13373e4417j86132n5825K88322J53954O9232J35716k55236l00779j61147r2175
13363d58487K37818K51724n0646k14655J4228K53272m7447p5417k28756r6830
13353d15196N6132j33515k70136j55794P23025J50921J5848J13930j9464J14796
13343A80547K9462j50452Q3310p7912L020j12735K47639O4565l16872r2071O2583
13332g8916j89942q7990P2648R5848K6648k3247k35113J32368M52806J1863r7861
13321G9112m0231r3226l0396P6212j25363l8833J49194k2799j27741J14399K1374
13310c8298Q4247j91765l72836K85310k83719J86688L20087j58753M6328N286
$$ y = [344769, 226048, 93746, -91713, -351708, -232668, -205012, 12017, 95819, -72773, -54417, -240549, -296374, -8052, 145902, 215134, 350850, 95614, -205165, -366312, -458487, -220669, 31055, -19591, -234246, -220018, 33254, -14193, -89610, -318366, -415196, -359064, -492579, -762715, -918509, -195484, -44563, -28715, 85215, 65751, 180547, 210009, 59557, 142867, 64955, 67975, -44760, 202879, 267444, -49428, -141499, -78916, -268858, -356848, -284200, -188352, -161704, -184951, -420064, -287696, 165110, 176973, 79112, 38881, -54345, -84741, -8529, -133892, -172725, -23531, -46330, -174071, -59672, -38298, 45949, -145816, -518652, -233342, -517061, -330373, -10286, -169039, -122711, -117425]
13300a17425J03140P5978j96647k0485J05051J65930o0738P6272J33490j44175
13290A20391m52704m0554k6076J63921M16253M875N9747l4080m58738k90909L15191
13279b22683J19935j13998k1108q8194L3811L52391n49N9080J84997N1048r4143
13268B60587P4654j90760j77126r6772j07752J91032J07995m4904k73411J62702
13258i3755K37471J93139m4676O2998M1121r1968k07362n6293L6247j30308J67817
13247A14431J99509k36351J05236K37327k09126l02957k61996K02097O2033k534
13237i2331N6608K80870K02804k95842j35129J79722M6454r7661m87500N8013
13227b83992P5347j93542L59982L73090j45995m0265j846K1666k43501J00608
$$ y = [-117425, -14285, 61693, -134954, -155439, -50388, 115542, 54804, 131076, 264566, 120391, -332313, -372867, -398943, -235022, 181231, 186106, 245853, 211773, -246965, -537874, -222683, -102748, -216746, -237854, -326048, -292237, 60154, 59605, 118685, 303682, 354730, 260587, 335241, 144481, -32645, -129417, -237169, -46137, 61858, 16954, -256457, -93755, 143716, 336855, 292179, 355177, 396298, 304330, 96968, 40675, 76922, -53386, 114431, 313940, 77589, 182825, 420152, 211026, -91931, -353927, -151830, -89797, -92331, -35723, 245147, 447951, 152109, 16980, 196702, 243156, 145495, -342005, -283992, -208645, -402187, -42205, 330885, 184890, 144625, 142779, 164445, -79056, 21552]
13217B1552M60859k16617k660j10419q2261j42212k82552j92000J86961J49381
13207b09968Q5663J59516N1835N89J34173k22981j20001J89692J53108k02178
13197A9448l6221p6133J15021Q7296K23336j08400j89593L3564J60550k95207
13187f6339M2388J05575R3823j11357j13738n388k31405O3747K27761K1338k28443
13176b02038L3867Q8517j75584l67520j63729J59044K25768J18331o0917J13375
13166b30886K46605P4864j11740J2222J80135J36466N5481j2295j70666k97590
13156a17404l90858P7246K49635K78432n5212J41180K58813n562k12232l5263
13146A88775k49357q6167k6761p1419p1485M5896J13344K27074l1664j53669J78331
$$ y = [21552, 482411, 265794, 263134, 152715, 70454, -71758, -354310, -546310, -359349, -209968, -124305, 35211, 87046, 87635, 221808, -1173, -121174, 68518, 221626, 19448, -16773, -92906, 22115, 109411, 332747, 224347, 34754, 68318, 228868, -66339, -23951, 81624, 175447, 64090, -49648, -55036, -286441, -222694, 5067, 26405, -202038, -168171, -79654, -255238, -622758, -786487, -627443, -401675, -283344, -344261, -230886, 15719, 90583, -21157, -8935, 171200, 307666, 363147, 350852, 180186, -117404, -508262, -431016, -181381, 97051, 41839, 183019, 441832, 436270, 224038, 188775, -60582, -146749, -173510, -244929, -316414, -270518, -157174, 69900, 38236, -115433, 62898]
13135F2898J83221j09055k11102j52519J12339K14199O1342n8894j25174k32322
13125b55067j39081L5945K8471j35966J10263K25770j17595l328M04132M2668
13115A96212l15958Q2684J95996L3808O3515J66433Q2864j3668k0293J88814n4637
13104F05770r3066l64918m30499j81167m5380L49545K02684J19885K59916j06730
13094C16040l26560p6981m7937l827k3745p0088j37544J21336j18085L63429J62962
13083A59000k86523J25883K76905l44331j91081k2100K78787r7385j01064o4079
13073b65988p500N4295L7333r3355q0464L3240J37563J36102N7808j52943R1552
13062e2357P5574O5728k29233m49362J07003M9051L4286K47782J38142k05629
$$ y = [62898, 246119, 137064, -74038, -226557, -114218, 99981, 161323, 102429, -22745, -255067, -394148, -358203, -329732, -465698, -355435, -129665, -247260, -250588, 153544, 196212, -119746, -37062, 158934, 192742, 256257, 422690, 505554, 491886, 471593, 660407, 605770, 512704, 147786, -282713, -463880, -509260, -159715, 42969, 162854, 422770, 316040, -10520, -87501, -135438, -139265, -163010, -233098, -370642, -249306, -367391, -3962, 159000, -127523, -1640, 275265, -69066, -260147, -282247, -3460, -100845, -201909, -265988, -273488, -219193, -181860, -275215, -355679, -322439, -184876, -48774, 9034, -143909, -52357, 23217, 88945, -140288, -589650, -482647, -433596, -399310, -151528, -13386, -219015]
13052b19015q4998j6895k53228J22953J53588L9415J90853K02805m5181j69492
13042g9195J60713Q6787n9896K780L24804Q025j57511Q117Q0715M6609m32968
13031a1020j15983L5379k21662k01677l9579J15804j68586P8999K43547K40214
13021d4564k372J63147J42457m7205j37365l72810k94934L6323K61243K10226
13011h5854J10132k08845p1857K44681O9225n2693k26427j80135J49890K94676
13001D2793Q7208J22101J40524Q0690o9289n9786l34903J27835J35339j09725
12991A62787Q231j41783L2567O666J67311L56712l2957o3322m58709L5262M5813
12980A18578l82268j34051Q7995N6755l38872R0759J88533l14690p137M05780
$$ y = [-219015, -304013, -320908, -574136, -451183, -297595, -258180, -67327, 135478, 90297, -79195, 81518, 168305, 108409, 111189, 435993, 444018, 286507, 294624, 375339, 421948, -11020, -127003, -91624, -313286, -514963, -554542, -438738, -607324, -528325, -284778, -44564, -46936, 116211, 258668, 211463, 74098, -298712, -593646, -557323, -296080, -85854, 24278, -184567, -256424, -11743, 57482, 4789, -221638, -401773, -251883, 42793, 130001, 252102, 392626, 473316, 404027, 344241, 9338, 137173, 272512, 162787, 171018, 29235, 61802, 68468, 235779, 592491, 559534, 496212, 37503, 72765, 118578, -263690, -397741, -309746, -252991, -591863, -501104, -312571, -627261, -634398, -228618]
12970b28618J07120P9660m5743k43854n8992J54495P6964j52265r4654P3384o907
12959c39410J38567J90617q2578K01913l41069N623L10249j75935k42959L13103
12949b1879q8628L797j2053L3180L1575Q1993K23664j22454o1859K4392j46348
12938e4620k40318r8037m2645o6861K6595K17848J77657J23377N1390l7575L57473
12927D14284J5679j4991n7162j64805j01024L68219L5431j47051k9330J05981
12917D25231j05066j46164J01189k26711j67486J75458L50825p9378k34130j81283
12907h7515k14858l79470R6634K54642J80650K22177N7881l7202l70941j46926
12897d24928o3454J49437J78342n4820J97804K16874j35925K4863N265j66426
$$ y = [-228618, -121498, -41838, -87581, -331435, -390427, -235932, -158968, -311233, -405887, -332503, -339410, -200843, -10226, -92804, 109109, -231960, -226337, 83912, -92023, -334982, -21879, -110507, -106710, -118763, -85583, -54008, 27985, 251649, 129195, 67336, 91728, -54620, -294938, -392975, -435620, -502481, -475886, -258038, -80381, 42996, 94386, 56811, 414284, 429963, 414972, 357810, 193005, 91981, 460200, 495631, 348580, 319250, 425231, 320165, 174001, 275190, 48479, -119007, 56451, 407276, 327898, 93768, -87515, -302373, -681843, -585209, -330567, -149917, 72260, 130141, 92939, -278002, -424928, -488382, -338945, -160603, -215423, -17619, 199255, 63330, 88193, 93458, -72968]
12887g2968L2612k43359j76591K70662L03364K63528L6660J22758j53980l54630
12877B8056Q5330M28456j90169m19377j60878K5515o5748M6506P4599n0978n0721
12866b49409o0530J36984Q8110M6517k69572l12436J05875M01244K00271J03274
12856A90328l42044j19766k31R1503L00281j50566q938J1111k17851l11943n9922
12845f18038J04690L15082M79682K8091J10704j20926m3679j86896J1572o2141
12835A8141l38624R7360l5777Q7485L28147J67337p1464j25175N3437k94808k78196
12824c92137J02611J0975J68346N5870K7535k17154l37594J60166O4257J56980
12814b00145L26794L41903N7910j99469k01388j18922n8643J38900J18733j63921
$$ y = [-72968, -40356, -283715, -460306, -189644, 113720, 377248, 413908, 536666, 382686, 28056, 113386, 541842, 351673, -67704, -228582, -203067, -268815, -222309, -147710, -198688, -249409, -309939, -172955, -84845, -38328, -307900, -620336, -514461, -113217, 87054, 190328, -151716, -271482, -271713, -180210, 120071, -30495, -39433, -28322, -246173, -558116, -618038, -513348, -198266, 281416, 309507, 420211, 299285, 255606, 68710, 80282, 18141, -320483, -223123, -258900, -171415, 156732, 324069, 252605, 127430, 180867, -113941, -392137, -289526, -278551, -110205, -54335, -26800, -243954, -581548, -421382, -357125, -200145, 126649, 468552, 526462, 326993, 125605, 6683, -51960, 86940, 205673, 41752]
12804D1752k01844M5656Q4513j27501J63678Q7964R2850q9957M3526J39656N7564
12793C37857J958k9727k4758L1359J8534j24675k279j73751N6729J5097K9288
12782A35632J10315j6669n5414l36081q0859j96481J82060R1610K7476N21029
12772C82618n7610n6954j20601N2626J03395j05562j09191p3653O4515O9958P3515
12761B23056p9363Q7738j4988k0325R8417p5944n9771K61115n7682N674k07249
12750A60678n8205l35358j75641J27091Q0127J73235J87392j23240J00762M2163
12740A79004k73036L0654K2593l091k4470L7256j99793m55000J06023K20824N04484
12729A45448J11845O9904k5502J5902l50407j98091K8904j96247k2049P7486M26611
$$ y = [41752, -160092, -114436, -29923, -157424, 6254, 94218, 187068, 97111, 140637, 280293, 337857, 339815, 310088, 285330, 316689, 335223, 210548, 208269, 34518, 91247, 106344, 135632, 245947, 229278, 173864, -162217, -243076, -439557, -257497, -165887, -138411, 382618, 325008, 268054, 147453, 200079, 303474, 197912, 88721, 15068, 79583, 149541, 223056, 143693, 231431, 216443, 196118, 294535, 218591, 158820, 419935, 362253, 367927, 160678, 102473, -232885, -408526, -281435, -201308, -28073, 159319, 36079, 136841, 179004, -94032, -63378, -40785, -43876, -68346, -31090, -230883, -685883, -579860, -359036, 145448, 257293, 327197, 301695, 317597, -32810, -230901, -201997, -398244, -420293, -342807, 83804]
12718H3804M0355o7231k97451k17745M31618j0466k23693K04822K59630K68211
12708D71854J83108k62315m7956j58866k14912o9424K17552q2509J74112L869
12698B14513Q0676l9500L2876J33618k45394J05448j28178l85757k84056k10650
12688g26404M37631K55280o3208J4330J19782m6099j2779j2453n6295o4140l28202
12677d82557q8864N9497L9926m0101J94018J57032O6087K20702J29541R4744n429
12666C44596m96693k80332J59126L27140J05698j56299k20644J5287K46566J5309
12656E9754J59828m2396p5341K30826j3738O2291L0049k53430l37732j42517p3599
12645c96005J57067J52653j9076j05077k1662q463O9541J23269k77772O6356J95849
$$ y = [83804, 124159, 56928, -240523, -458268, -26650, -37116, -260809, -55987, 203643, 471854, 654962, 392647, 344691, 185825, -29087, -98511, 119041, 36532, 210644, 214513, 295189, 255689, 288565, 422183, 176789, 282237, 154059, -231698, -515754, -726404, -288773, -33493, -96701, -82371, 37411, -8688, -21467, -33920, -90215, -154355, -482557, -571421, -511924, -471998, -512099, -318081, -161049, -94962, 125740, 255281, 350025, 344596, -152097, -432429, -273303, 53837, 159535, 3236, -217408, -202121, 44445, 59754, 219582, 177186, 101845, 332671, 318933, 381224, 411273, 157843, -179889, -322406, -396005, -238938, -86285, -105361, -210438, -232100, -240563, -171022, -47753, -325525, -259169, -63320]
12634f3320j2071o6289J8836J01551J19497N5460j20166r3696R9503J24129j90746
12623b7312j17697K315J20041P6936k79101o8551P5998L65379K49868j34467K25053
12612D88462K27199j18344j15541j811l26179J360p5115J82786J26284l04494
12602H4607k62798k09908R2016r5559K64710J54664O4211J50588k77554J76912
12592A41889K56547k60491j61256L8274P0880j4893K12053L3048j98908k87032
12582a69889m4937J01009K23153K20083j7810j55249j41380N6561J42770j60788
12572E3523j17027j79812K61552J52834K9948k18889j76171r1875j13675N2905
12562c46687m4633J57823R7265J95268k1389j39005R2315J61675j01112k95341
$$ y = [-63320, -75391, -141680, -122844, -21293, 98204, 153664, 33498, -60198, 39305, 163434, -27312, -145009, -142694, -22653, 54283, -224818, -293369, -217371, 148008, 397876, 263409, 488462, 715661, 597317, 481776, 479965, 153786, 155146, 80031, 262817, 389101, 84607, -178191, -388099, -296083, -391642, -126932, 27732, 91943, 242531, -35023, 141889, 398436, 137945, -23311, 14963, 85843, 70950, 283003, 316051, 117143, -169889, -214826, -113817, 109336, 329419, 311609, 156360, 14980, 71541, 214311, 53523, -63504, -243316, 18236, 171070, 201018, -17871, -194042, -285917, -399592, -346687, -391320, -233497, -136232, 59036, 37647, -101358, -9043, 152632, 51520, -243821]
12552b43821j04076j75258L13546J22212o5863N2429K99185M0731k06364j6963
12542A5758r1159k76872j85307J19295L09257J83720Q8568J806k1612K89606K79422
12531G12482j36463m97469k39375N7107n6394L9597K73209o4185m9766J19916
12521A58659J26621k91999k08284j20667J38430J14169M1397n7427m8915J97101
12511D9085K25801J13847l41490o4626Q5843J4771o8659R3586K10472k09983K7745
12500A36392K72104O5966j49562o8893K98239m7479l98440J86114m5242r9467
12490A49732r4971J9990Q3212k06698k99590k91042J41294J50764N06102N2578
12480B11371k90116J6283m428p7333K75042L6834j70145R1438K07274j5413m7303
$$ y = [-243821, -347897, -523155, -209609, -87397, -153260, -100831, 198354, 239085, 32721, 15758, -75401, -352273, -537580, -418285, -109028, 74692, 163260, 165066, 143454, 433060, 712482, 576019, 78550, -160825, -103718, -160112, -120515, 152694, 88509, 38743, 158659, 285280, -6719, -215003, -335670, -197240, -83071, -41674, -99101, -148016, 49085, 274886, 388733, 47243, -17383, 68460, 83231, 14572, 108158, 318630, 108647, 136392, 408496, 474462, 324900, 256007, 554246, 506767, 108327, 294441, 249199, 149732, 54761, 74751, 157963, -48735, -348325, -639367, -498073, -347309, 158793, 211371, -78745, -62462, -66890, -144223, 130819, 167653, -2492, 88946, 296220, 280807, 233504]
12469B33504j41543o9483J01123j55613M07346K17540k28343j34175M2963l3043
12459B40276j66020O9547M8606K31599l4084p2559J33549j07614o9107k42890
12449C1303n7169J21466j3583p6889N6033J86574K5455j46753p852k47038j12956
12438b41409k5710J78244o2035J9826O0213J53083L75822K38012j37770l29363
12428B28913k83660j44291k2330j53147j2159M0322o35j95114Q8676L33349k56403
12417c76479N2945K36291j07168j14069L603j6218J85307N4228k12238k9594K47248
12406g6144k6164p6954L58105l03256j98754J62497J57033l8534M7298P1169K4556
12395A00852K94338L39513J46209k30338j08559k37526j30871Q6678o3454M3281
$$ y = [233504, 91961, 22478, 123601, -32012, 375334, 592874, 364531, 230356, 273319, 240276, 74256, 143803, 192409, 424008, 389924, 317365, 450914, 343300, 274193, 31303, -25866, 95600, 82017, 5128, 61161, 247735, 273190, 126437, 118585, -128453, -241409, -267119, -88875, -150910, -131084, -70871, 82212, 458034, 696046, 558276, 228913, -54747, -199038, -221368, -374515, -386674, -346352, -346987, -542101, -453425, -120076, -376479, -323534, -87243, -194411, -308480, -304877, -321095, -135788, -81560, -293798, -323392, -76144, -102308, -179262, 178843, -124413, -323167, -160670, -3637, -42171, 5127, 76296, 100852, 395190, 734703, 880912, 650574, 542015, 304489, 173618, 260296, 196842, 240123]
12385B40123j98650Q5989K56817j06236M2561r9847p1769l03135p3789R6677O7525
12374f3734j19185K44748O33k73314J00485L54979m9244j39114j00919j93632
12364b38297k40859m9737K25356M4654K1291k11309o8655J2545J85248j06407
12354d26170j57218K45360L36398k2583k17343O6511J13516j05617J18524k28568
12344b77190l4097K3799N134l144k205Q1002J85535J74032l3059o6015j4245k5996
12332A3551j87547J2093p042Q5570m1287M3717J41407j51629j67720K5852j12834
12321c45869L3188J52332N7162j01597r8504R7107L35524J49893j63664j26523
12311a0951j29377Q2301R989k7853k72390o8932J93188J55840j43691K71533J80539
$$ y = [240123, 41473, 127462, 384279, 278043, 320604, 220757, 148988, -154147, -227936, -131259, -63734, -182919, 61829, 62462, -210852, -110367, 244612, 195368, 56254, -44665, -238297, -479156, -528893, -303537, -258883, -237592, -448901, -517556, -505011, -319763, -426170, -583388, -338028, -1630, -24213, -241556, -175045, -61529, -167146, -48622, -277190, -311287, -287488, -282354, -285498, -287703, -206701, -21166, 152866, 119807, 53792, 39547, 13551, -173996, -161903, -168945, -83375, -124662, -80945, 60462, -91167, -258887, -233035, -345869, -312681, -160349, -103187, -204784, -303288, -206181, 129343, 279236, 115572, -10951, -140328, -58027, -48038, -75891, -348281, -417213, -224025, -68185, -211876, 59657, 240196]
12300B40196k533k4405j03345K5354k19744j31169l0875R6140L23528K15675L9581
12289D28403L4216j64775j20463l42541p1103j04169K03781J19330M02049j58587
12279B26141j99695j98036m7937J60099O8835J72983J5462j03921L2161J3375
12269A39467j98573j56033J03799K85372J73533J9601j99030j14654n1938n3945
12259e2401o4275k12110J29241J02178j05773K27930K16992o4986j35686J7256
12249E8366r7611L52359J77860k81019k61636j29417J25497l848l70552k0349
12239d50350J82213J74280J52403Q224j2088j17499k00900P7910K86149J03197
12229B03539k25887l19981K19897J60856Q404K1870k44456l3622J66208O3080
$$ y = [240196, 237663, 213258, 109913, 135267, -84477, -215646, -246521, -150381, 173147, 388822, 428403, 462619, 297844, 177381, -165160, -236263, -340432, -136651, -17321, 384728, 226141, 26446, -171590, -219527, -59428, 9407, 182390, 197852, 93931, 126092, 139467, -59106, -215139, -111340, 174032, 347565, 367166, 168136, 53482, 1544, -52401, -116676, -328786, -199545, -97367, -203140, 24790, 241782, 176796, 41110, 58366, -39245, 313114, 490974, 209955, -51681, -181098, -55601, -59449, -430001, -450350, -268137, -93857, 58546, 66770, 54682, -62817, -263717, -185807, 100342, 203539, -22348, -342329, -122432, 38424, 46828, 68698, -175758, -209380, -43172, 19908]
12219A9908K06333K433j03185n7444q8222k7855j56339N7833K87560j10853M8793
12208G8962l3624O7680k31501k57959j88521J25577J16238K5219M53065P4840
12198B29976j36379K4537j17543k9013J71507L88655j73880j29818k16404j47146
12188a35508J56535K63657m1465L9183o1620j76276k26123K02093K16413j13556
12178A23333o2813J43276j41682j34702L7503r462j9512j42979k86069M17423
12168g5684K40555j68758N254p8059J4605J89054J24503m2578J23071r5256k11246
12157B5461J68873J18682j19581j01877j49152N5200J00214m1824o7216J60308
12147A49088j0913M0305j59892j55617J42910k4218p4738m570O5399k56491j68665
$$ y = [19908, 226241, 228674, 125489, 68045, -20177, -48032, -204371, -146538, 141022, 30169, 78962, 45338, 113018, -118483, -376442, -564963, -439386, -323148, -297929, 155136, 229976, 93597, 118134, 591, -28422, 143085, 531740, 357860, 228042, 11638, -135508, 21027, 284684, 243219, 282402, 220782, 44506, -181617, 20476, 236889, 123333, 60520, 203796, 62114, -72588, -35085, -44547, -64059, -207038, -493107, -75684, 164871, -3887, 1367, -76692, -62087, 126967, 251470, 208892, 331963, 236707, 25461, 194334, 313016, 193435, 91558, -57594, -2394, 97820, 55996, -11220, 149088, 138175, 178480, 18588, -137029, 5881, -18337, -93075, -97645, -32246, -288737, -457402]
12136d57402J75130J61058p7013k07903Q6257K53866P8379j30730q1195l8784
12126b38337k29381J91192L27764j04633j76195J80333j24046m4993K2905K27153
12116C1762K5849K04185K04453K0548j10680k51962j05143p4100L2049M6658r5573
12105g1954j47444K24232J64783J7260j17477k52368r0168J98454k28403M6835
12095b56250K02620J25045L93415J66747k34159p8703K0034J66290J4183k07837
12085C11385j81641o3278j81008K26517J16007k33443K79525J03451n3020p0324
12075B54171j81940m0840j05745k26724j30680N5643K7397K26949J56647j54736
12065a19858J03620k0941k16398J22244J34459P1362J60312j77322K9146j18293
$$ y = [-457402, -282272, -121214, -198227, -406130, -319873, -66007, 12372, -118358, -199553, -238337, -467718, -276526, 51238, -53395, -229590, -49257, -173303, -218296, -195391, 31762, 57611, 261796, 466249, 486797, 376117, 124155, 19012, -55088, -23039, 23619, -71954, -219398, 4834, 169617, 186877, 69400, -182968, -273136, -74682, -303085, -256250, -53630, 71415, 464830, 631577, 397418, 318715, 338749, 505039, 519222, 311385, 129744, 66466, -114542, 111975, 227982, -5461, 274064, 377515, 324495, 254171, 72231, 31391, -74354, -301078, -431758, -376115, -348718, -121769, 34878, -119858, -16238, -37179, -253577, -131333, 3126, 74488, 234800, 57478, 86624, -31669]
12055c1669j79692L46925K29845q8613n3565r5065J1761j24121o7313j58073n9172
12044b68752J08051M5277J8609K44005O6184j3211R0219j51859l00614k18706
12034c80797L08230L79014M7213J11041R9540j63580n4171o1619j44462R7000
12024B37409N6277k1051p0218m3125j47523j50983j08449N8202O214L8774k7334
12013a71807j6933J7669k4650J24853L2110K93354m6995j40773k933j03807P6187
12002C6275J4701K1985j42990m4164P518K75320J43272l9302k0089l22251N0503
11991a9222R3342j19698j28280j74629R5844J25506r9341Q1500Q6300j37503n7883
11980b54064m8751k5124J90331L01415p6166k02685l41416Q0323J56665J59170
$$ y = [-31669, -211361, 135564, 365409, 276796, 223231, 128166, 139927, 15806, -51507, -209580, -268752, -160701, -115424, -96815, 147190, 213374, 200163, 290382, 138523, -162091, -380797, -72567, 306447, 353660, 464701, 564241, 400661, 346490, 284871, 140409, 237409, 293686, 272635, 202417, 159292, 11769, -139214, -247663, -189461, -183247, -144473, -171807, -188740, -171071, -195721, -70868, -38758, 254596, 207601, 66828, 63895, -39912, 36275, 50976, 72961, -70029, -114193, -106675, 168645, 311917, 272615, 252526, -69725, -19222, 74120, -45578, -173858, -348487, -252643, -127137, -226478, -144978, -58678, -196181, -254064, -302815, -327939, -137608, 163807, 87641, -115044, -456460, -376137, -219472, -60302]
11970f0302j40867l14213k01125J77645Q3784l70q8964M36616j23506l27543J17490
11959d41355j12914M3728K99388L22864r0723l42074l7092j67896M0484J49705
11949c35885N61901p304k75590k03608j82951J92720L4497K25995J75559l739
11939A81595k27113j87621o9285J06461n9574J43494K20140K70862j16266l62939
11929a00246Q994p2033l25978Q0219P2484j15871J30684K22078J12542k26281
11919b13408P2192n4724p7707q2611k6909R7080Q9296j38933K5525L15936J55277
11908A61014r3842m7205p7666P3131p7542N0948j06780j48301l4045N3453K9258
11897b17577Q7725J6925k75297m5027J32458J36352K19453N5521k55618l48513
$$ y = [-60302, -201169, -515382, -716507, -538862, -455078, -455448, -544412, -107796, -231302, -558845, -441355, -554269, -510541, -211153, 111711, 20988, -321086, -358178, -526074, -485590, -335885, 226016, 218712, -56878, -260486, -443437, -250717, -216220, 9775, 185334, 181595, -45518, -233139, -302424, -195963, -255537, -112043, 108097, 378959, 262693, -100246, -91252, -163285, -489263, -409044, -336560, -452431, -321747, -99669, 12873, -213408, -141216, -195940, -273647, -356258, -383167, -286087, -196791, -335724, -310199, 5737, 161014, 67172, 19967, -57699, 15432, -62110, -11162, -117942, -266243, -300288, -246835, -217577, -129852, -112927, -388224, -433251, -300793, -164441, 55012, 110533, -145085, -493598]
11887d93598P3596J95920K05010j30531l7626k01236K15785K13471j53570J41998
11877B9219P7350M2090j88566k13640J5858p2028J9709l7830J36365K25220l1111
11866B636j60376j59373K62408K05146q5432M5864J43221k42593l11440N2560
11856b47379j06308J97171K98561j33817l20106N4841N6343J93477k35604o9054
11846c11875j93408k4702M34276R9801J31056j3684l29279K5131J38106J00669
11836E6091r7700K2888J03732k6949J36048J13016k48038l33082J23064J91458
11826D0528j97093j54248j09181j85070J83124K33202Q0896K27227m8119l39740
11816b68474l6609J14567o4991O5724J74957Q0946j7710k18719k44123J29212
$$ y = [-493598, -420002, -224082, -19072, -149603, -187229, -388465, -172680, 40791, -112779, 29219, 106569, 148659, -39907, -253547, -237689, -309717, -290008, -327838, -191473, 33747, 2636, -157740, -317113, -54705, 150441, 65009, 110873, 254094, 11501, -299939, -247379, -353687, -156516, 142045, 8228, -311878, -257037, -200694, -7217, -242821, -311875, -505283, -529985, -95709, 4092, 135148, 121464, -207815, -182684, -44578, 56091, -41609, -18721, 85011, 58062, 194110, 307126, 59088, -273994, -150930, 40528, -156565, -310813, -419994, -605064, -421940, -188738, -107842, 119385, 71266, -268474, -305083, -190516, -255507, -189783, -14826, 66120, 48410, -170309, -414432, -285220]
11806b85220J94388K2053j34480R9724m3741K02618J64454J30564J36906m35307
11796E1959j28698l28399Q3931N1376o0919J09678j31449j43253J51829J63203
11786a80742P396l0980K92019k465J59850n6265m6776R9177k04890j97683k39004
11775d00363J79246L4726k67774q5206Q9285K09902J29832m0484k43823J47554
11765b47105K63827j14578l11455J68923J93288L35240k9637k28762r779m7074
11755b7112J52122J60031m3170m93321j0610J29632L1676k45676j61211j42460
11745f50099N5885O4820N1298M53742J04392l944j21887M47881j70923j95498
11735C5667J6630J03478j53712j57665J06400K65666j93590K9161p7489L8805
$$ y = [-285220, -90832, -68779, -203259, -103535, -147276, 55342, 219796, 350360, 487266, 51959, -76739, -405138, -321207, -269831, -330750, -221072, -352521, -495774, -343945, -180742, -173346, -204326, 87693, 85228, 245078, 188813, 142037, 241214, 36324, -161359, -400363, -221117, -186391, -454165, -539371, -450086, -240184, -110352, -150836, -394659, -247105, 16722, -97856, -409311, -240388, -47100, 288140, 258503, 29741, 19962, -27112, 125010, 285041, 241871, -251450, -262060, -132428, -100752, -346428, -507639, -650099, -594214, -529394, -478096, -24354, 80038, 76094, -45793, 402088, 231165, 35667, 52297, 155775, 2063, -155602, -49202, 216464, 22874, 52035, -25454, 13351]
11725A3351K77132q2573k11492l50948J1079K73593K8575j5979j09318j53717
11715c20297J19220O9061p4635K71389j07746J44838K58153K41244k51988k03338
11705A45901j54001k11352J92075J12934L8606R1575j23730K3646n1988M009O4380
11694A32055p369n7864j42267l55831j1400j2519j21856J90945J15229K6685J07705
11683a36487l4602J23888m7103j59760j22851K49399K60307J66383j42372j17940
11673C8862j88308p8180k06868l25784j40548K61023N46790L97917o3989j87885
11663E3030k80847P8032J61509q2839P6625J09491o2063q2988J85250M21635j94371
11652C82464n18459k29812j02940K15514K15469K29814K853m24847n5733K41422
$$ y = [13351, 290483, 207910, -3582, -354530, -343451, -69858, -41283, -57262, -166580, -320297, -201077, -132016, -206651, 64738, -43008, 101830, 359983, 601227, 349239, 145901, -8100, -219452, -27377, 85557, 124163, 215738, 92008, 115654, 63666, 67675, 132055, 124686, 66822, -75445, -431276, -442676, -455195, -577051, -386106, -270877, -244192, -136487, -171089, -47201, -94304, -254064, -376915, -127516, 132791, 299174, 156802, 38862, -149446, -227626, -434494, -760278, -900826, -639803, -93013, 304904, 240915, 53030, -227817, -149785, 11724, -71115, 5510, 115001, 52938, -30050, 155200, 576835, 382464, -135995, -365807, -468747, -253233, -37764, 192050, 194903, -229944, -285677, -44255]
11642d4255P5431j1503M5021k3573L3446p5864J52285K26595J01672k00490k14768
11631F3997K05343k5009k80911l4680R216O5076k32898M6121L22897R905R1710
11620B40767J25145K9643m5301R5778j06058r1896L0656J15762J51600Q875l04493
11609B50478q7304K18081J77093K8410j51395k71392r9052J31509m9966n3657
11599I2805J48703l053j24446j34462j57766J04346j49224k0790k0867J10826
11589a53928K92578L14135M8547k64312l66288n8846j0386q6075M30K24703L08528
11578B49086j53112r4817P7142O5906L60386j08392j93283l97643j0474L25424
11568A20223o0063k53858j36333q6317N1608Q5908K79773J50981K3912J8614j2330
$$ y = [-44255, 31176, 19673, 64694, 41121, 74567, -1297, 150988, 377583, 479255, 278765, 63997, 269340, 244331, -36580, -71260, -62044, 3032, -229866, -183745, 139152, 149057, 240767, 365912, 395555, 350254, 446032, 339974, 248078, 278734, 394496, 546096, 554971, 250478, 163174, 381255, 558348, 586758, 435363, 163971, 64919, 196428, 146462, 92805, 241508, 238455, 114009, -20453, -178219, -73873, -223097, -243887, -264754, -153928, 138650, 452785, 501332, 237020, -129268, -188114, -198500, -284575, -284145, -59442, 249086, 95974, 1157, 78299, 144205, 504591, 396199, 202916, -194727, -205201, 120223, 60160, -193698, -330031, -416348, -364740, -278832, 941, 151922, 175834, 194448, 182118]
11557A82118k01475J6973L47972p8553j36013j40761J23193K8818n7199J88491
11547B73564k09049N4731K46211k71555J33510k4618k0188k18060J8856k83778
11537c00376n8224K28990N3974k2610k99495J35239K07725k0921j06018j29563
11527c11279L4186K09618M001k7350j55902K805j4355K22582K86539M8893l5423
11516B64315j51991q4690J18980P734j46961j7333L9962J20965j10350R1339j53286
11505b1316k10644J48349R4357j23438J37279L41781m7741m35262N0506O4821
11495a308k26048j39597j04341Q8051K01227N43986J76830k46126N019j5286J60561
11484D42968j48957l91042J03090J27405j8001q5145J21476J05839j49454j95724
$$ y = [182118, -19357, -2384, 345588, 267035, 131022, -9739, 113454, 142272, 85073, 273564, 64515, 119246, 365457, 93902, 227412, 202794, 182606, -35454, -16598, -300376, -358600, -129610, -75636, -98246, -397741, -262502, -54777, -75698, -181716, -311279, -277093, -67475, -63474, -90824, -246726, -243921, -258276, -35694, 250845, 299738, 264315, 112324, 27634, 146614, 154348, 7387, -9946, 30016, 150981, 40631, 131970, -21316, -231960, -83611, 10746, -112692, 24587, 366368, 318627, -116635, -66129, -1308, -227356, -366953, -471294, -383243, -182016, 361970, 538800, 292674, 297693, 282407, 442968, 294011, -97031, 6059, 133464, 115463, 30318, 151794, 257633, 108179, -87545]
11474h7545j47008j4339R6329J61922M7275q4058j11067P623J56419J93269M7995
11463B66815N8340L2770M5273j61121j43396r9067J21725j61691N7753K1104j73312
11452a34807j40803M9693j32137l6563M856K32006J47230k8996q2483k29527q0679
11441d32210L00821p3690L1738Q1048k35168l0272p9033K63738K65521R6391n7996
11430A30888k08163J63966K2465r1206k3521O2759J58197k37935j96375J20039
11420i8886J06797K34987L14044j23946k94230k08272k06653m8367L2234M4912
11410b47380J73892m7917J03473J28794k6306n9922j67730m4526K36628J72476
11400B21482j72413l76340K4423M47915n2720q4196j06402j46263j1086p9679
$$ y = [-87545, -234553, -248892, -152563, 9359, 56634, -27424, -138491, -130868, 25551, 218820, 266815, 325155, 357925, 403198, 242077, 98681, -386, 121339, -40352, 17401, 38505, -134807, -275610, -225917, -358054, -394617, -389761, -157755, -10525, -39521, -122004, -351531, -432210, -131389, -205079, -173341, -92293, -327461, -357733, -436766, -173028, 92493, 188884, 130888, -77275, 86691, 109156, 17950, -5571, 57188, 215385, -22550, -218925, -98886, 7911, 242898, 556942, 432996, 138766, -69506, -276159, -324526, -292292, -247380, -73488, -121405, -17932, 110862, 84556, 24634, -143096, -187622, 49006, 221482, 49069, -327271, -302848, 145067, 92347, 8151, -98251, -244514, -255600, -335279]
11390c35279j11779M5332j27871M8188K46805L75431j56995k09436R3765K06640
11380G4801P7027k6039K2065k0930K60657J23709l20376j74265l8010j31915J1069
11369a42207K74105R6465J96542O1431k26003j10671l48459p6344M5257R8782
11359a31102K691l50928j42718R2497K12495J14997m8982o8578j66883q8371l6127
11348f11009L53248M8379o8069J05525Q0133K97406J9998j57824j48263J63203
11338H2727J95965p3845j93859j07181j18528M3102q4116j59647m6911J20786
11328c41507P2008K21681J03053j53710M9515J05133O2460K24364l0976k79237
11318C2784j19779j15445l27997j07305r711L22015J00053l7333n2528L4536J16189
$$ y = [-335279, -447058, -401726, -529597, -481409, -234604, 140827, -16168, -225604, -131839, 74801, 151828, 125789, 147854, 126924, 387581, 511290, 190914, 16649, -21361, -153276, -142207, 131898, 228363, 424905, 486336, 260333, 149662, -198797, -275141, -229884, -131102, -128411, -479339, -622057, -529560, -317065, -202068, -251050, -319628, -486511, -574882, -611009, -257761, -209382, -277451, -171926, -91793, 205613, 225611, 67787, -80476, 82727, 278692, 204847, 10988, -96193, -214721, -171619, -255735, -415382, -462293, -341507, -269499, -47818, 55235, -98475, -48960, 56173, 118633, 342997, 312021, 32784, -86995, -202440, -530437, -637742, -647453, -325438, -225385, -262718, -315246, -280710, -164521]
11307a64521j40154k31288j23075N5319K53356J96260J70279M0123n3095k89656
11297b86452J18004R0821L59158p4513l85742l10340q2702P7437L87106q2720
11287a89943J27557O5084j66302k4266P4111K19099R0324k23178j92485j20778
11277c40777j15361J15476J95939j42456k6341o9884P2453K8301K18262L49364
11267B84976l65038m28347k6772L48372K59603q0851m9223j93156Q8842L76671
11257B15077J79332J12995J9750j99022k13958k90481J49214J34400j08541j76615
11247a77849m0048K54914o3855m2829j00685P5067o7473j42875J89901L2456K81916
11236A98640J03794m9606k12178j54613J3393n2088j78139j95338j19223p4207
$$ y = [-164521, -304675, -535963, -659038, -603719, -350363, -154103, 16176, 56299, 3204, -286452, -168448, -77627, 281531, 207018, -178724, -489064, -571766, -494329, -107223, -189943, -62386, 2698, -163604, -187870, -113759, 105340, 195664, -27514, -219999, -340777, -456138, -340662, -144723, -287179, -313520, -383404, -310951, -282650, -64388, 284976, -80062, -508409, -535181, -186809, 72794, -8057, -57280, -250436, -161594, 215077, 394409, 507404, 527154, 328132, 114174, -176307, -27093, 107307, -1234, -177849, -217897, 37017, -26838, -69667, -170352, -95285, -162758, -305633, -115732, -83276, 198640, 302434, 252828, 40650, -113963, -100570, -152658, -330797, -526135, -645358, -719565]
11226g19565J49431L57477J74570n4913M0346J53198K10769J89143j0014k73331
11216B17111j28967l59935j59025o8782J25314K53354J35144k345J61379j00724
11206G2524N8157R2009m7825q4543j20643K90892J41994j53658k87249j5807K90319
11195B36170N4485k01639J49851J96241j10090l57187K4494K002j47981Q550o9704
11184b14808n8281J53490k35835o9627k7803K17930R7633J54569j20857O0540
11174d3049q9368l48357l8745J58157J52074K29355J28301p4687P2113o0366n8231
11163B7197o7200O5574K41925M7975P2532r6088k65281k93713o7096n7276J26573
11152b64878K99009k6570k7146K516K80902J1959P5179j20936L4052R5508k2180
$$ y = [-719565, -570134, -212657, -38087, -93000, -52654, 100544, 311313, 500456, 490442, 217111, 88144, -271791, -430816, -499598, -374284, -120930, 14214, 11869, 173248, 72524, 130681, 222690, 174865, 90322, -30321, 260571, 402565, 248907, -38342, -54149, 236170, 290655, 89016, 238867, 435108, 325018, -32169, -7675, -5673, -153654, -145104, -214808, -273089, -119599, -355434, -425061, -452864, -234934, -137301, 17268, -103589, -43049, -132417, -480774, -519519, -361362, -209288, 20067, 148368, 73681, 145794, 85428, 27197, -40003, 25571, 267496, 315471, 388003, 291915, 26634, -267079, -334175, -391451, -264878, 34131, 7561, -19585, -17069, 263833, 275792, 350971, 230035, 264087, 359595, 337415]
11141C37415p5257j19682k95083m4791K09230Q0725m1781k91097J39206K79020
11131A77905j8058k5460M02466N9457r5809m23818l97580k19573J74287L71240
11121E057K44590L12435J33512M8293J77746n3101l05305l71949l23884Q8384
11111d4222J25095k38663M6138J99387k07571j34687k39572K91961L20429N9732
11101A78027m11918m0599Q488J6668J28892L75530n6455j59160j07764n3176j03034
11090b24501J4533L15770J78046J06334J78261p5846k49714k15524L00126j22768
11080B04717o8380j61890L3166p8468j78602r1574j95645J39342L31526P7563
11070A1755j41611K98689k15978j86892j86039J95882J45953K40297J11625o8843
$$ y = [337415, 262158, 142476, -152607, -197398, 11832, 92557, 50776, -240321, -101115, 177905, 159847, 134387, 536853, 596310, 500501, 76683, -320897, -540470, -366183, 5057, 249647, 562082, 695594, 743887, 921633, 868532, 563227, 191278, -132606, -44222, 80873, -157790, -111652, 87735, -119836, -254523, -494095, -202134, 118295, 178027, -233891, -274490, -266002, -249334, -120442, 255088, 198633, 39473, -68291, -121467, -224501, -209968, 105802, 283848, 390182, 568443, 492597, 242883, 27359, 327485, 204717, 136337, -25553, 7613, -70855, -249457, -341031, -536676, -397334, -65808, 11755, -129856, 168833, -47145, -234037, -420076, -224194, -78241, 162056, 273681, 204838]
11060B04838k16945J17466J73329k1770j07874p7756j644r3538J47699K40289
11050C64094J73830j04632l36657k15844J26669o6327P2548J21172j18448j85608
11040a69203n928L43362q3461k36426n3174q854J79738K47085j83323k14024R1703
11029i2505o9871J24559K81480M9152j03832k34468k62395q7883K5128K04686
11019a65949J43760Q881n1072N4943p9963l21621J31580J67342k55689K77866
11009h9922J39212r1415J21815P3221k92374j32466P9464J85645k7228n9682k50116
10998c43846l1223P6143J0599Q3146K68870J78129k62419j43939Q2239J14340
10988C2039n1920Q0709J17365L43349J18811l58628k56612m3048j77757J77677
$$ y = [204838, -12107, 105359, 278688, 256918, 149044, 71288, 69644, -23894, 123805, 364094, 537924, 433292, 96635, -119209, 7460, -58867, 13681, 134853, 16405, -169203, -175131, 168231, 84770, -151656, -204830, -213684, -33946, 213139, 29816, -184208, -92505, -162376, -37817, 243663, 292815, 188983, -45485, -307880, -395763, -370635, -165949, -22189, -13308, -64380, -9437, -89400, -411021, -279441, -112099, -367788, -89922, 49290, -42125, 79690, 152911, -139463, -271929, -192465, -6820, -34048, -93730, -343846, -375069, -298926, -288327, -205181, 63689, 241818, -20601, -164540, -82301, 32039, -19881, 60828, 178193, 521542, 640353, 281725, 25113, -17935, -195692, -18015]
10978a8015J33220R767L3325J2079j04747k50212p5812L44924J45630k26624k77866
10967b74331r7876J9321l2542J56570J17322O5490k97387n2514K30144L15476
10957A49673P7765K4841J61321m34662k61549K0145L1873K10359r3379N0576J57968
10946I4931o2825N0579K14469M8204o9066J88978j07395m95333r9251J78412j6837
10935g5134O1023L3314k8232L216k02020l4387j59762L5301K59334M4011m8886
10924a12222M7536k53687j54914J68250p4074j17992N473K70994J17480N5901
10914d7255L50410J26253k46842j43949O6083J37220P9680j36947j31304k93342
10904b39993J98319k62364K16424M9910p2326j74709N2936J02414j1357j6185
$$ y = [-18015, 115205, 124972, 158297, 170376, 65629, -184583, -260395, 84529, 230159, 3535, -274331, -372207, -352886, -385428, -228858, -111536, -46046, -343433, -395947, -165803, 149673, 227438, 252279, 413600, -21062, -282611, -262466, -230593, -20234, -113613, -63037, 94931, 32106, 82685, 297154, 345358, 276292, 465270, 357875, -137458, -236709, -58297, -75134, -14111, 19203, -9029, -5813, -207833, -242220, -401982, -366681, -107347, -63336, -112222, -64686, -318373, -473287, -305037, -379111, -497103, -491630, -220636, -103156, -47255, 303155, 429408, 182566, 38617, 104700, 241920, 321600, 184653, 53349, -239993, -41674, -304038, -87614, -37704, -110030, -284739, -231803, -129389, -140746, -156931]
10894a56931J38376n2404J55004l268m1521J25111j06473k9094k07897r6226n282
10883b80605j06025R8049J57652N3432J41223Q8l5827K78341k53630k96253j93819
10872d37374O670K80002K28282O8640R965N7901k06565L3832q3876R3546l4530
10861A6493j29894j90227P6098J39558j24044l7200J3691k84595p7150M17572
10851a79698L59298l4535k99188m47885k282k081j5240J9940j36662L54287M35298
10840E1252O7378k4124J14469K27773K4893p1784j7036m3860m9535j7896j58315
10829A03215j19425K70986L8131l1040j09738j78137N8798K2463k50708R4083
10819a01372J30032k6850K25140J30318j70909k23940M35K19134k00084M1510
$$ y = [-156931, -18555, -70959, 84045, 80777, 39256, 164367, 57894, 28800, -179097, -275323, -280605, -386630, -288581, -130929, -77497, 63726, 63814, 27987, 306328, 52698, -243555, -437374, -430704, -150702, 77580, 146220, 156185, 214086, 7521, 41353, -42523, 51023, 16493, -113401, -303628, -227530, -87972, -212016, -249216, -235525, -520120, -597270, -179698, 179600, 145065, -154123, -602008, -604290, -606371, -621611, -601671, -738333, -384046, 51252, 118630, 94506, 208975, 436748, 461641, 389857, 372821, 328961, 279426, 261530, 103215, -16210, 254776, 292907, 261867, 152129, -26008, 32790, 55253, -195455, -101372, 28660, 1810, 226950, 357268, 186359, -37581, -37146, 181988, -18096, 23414]
10809B3414j1082j8378k21312K0334Q6060J48754r6416j18462O5552r6460j026
10798b19022j73661K2228K43149j471R9451J63186J2962n912J04076J68259k05834
10787B07411m70493k64484J31660n2564N8202R6587K1955J17110J82133J9514
10777D7031j13532j93217K24226l443j48098K56403Q9740M793n1016q6789N541
10766C1639l06103j23410M8795K29049L39479j64244k96630r0424P0052J6971
10756b44826M5551K30625k13399O0089K04976J79168j36486l82301q9002K83496
10746f2109J13050k35595Q8340J63843l15230l62965K47410L54082J02050O1758
10736A54634j46298O723J97316m9163m12418j57027M48547J5626p2353j21682
$$ y = [23414, 12332, -6046, -227358, -207024, -120964, 27790, -68626, -187088, -121536, -217996, -219022, -392683, -370455, -127306, -128777, -29326, 133860, 146822, 140910, 244986, 413245, 207411, -263082, -527566, -395906, -448470, -390268, -293681, -271726, -154616, 27517, 47031, -66501, -259718, -35492, -38935, -187033, 69370, 159110, 163903, 112887, 26098, 31639, -274464, -397874, -349079, -120030, 219449, 55205, -241425, -331849, -261797, -244826, -199275, 31350, -182049, -121960, 83016, 262184, 125698, -256603, -345605, -62109, 50941, -184654, -96314, 67529, -247701, -610666, -363256, -9174, 92876, 154634, 8336, 15059, 212375, 163212, -249206, -406233, 42314, 57940, -14413, -136095]
10726a36095k02603m8117k5672M7468m6122p7118j14294J4713J56240J50418K30764
10715e0418J90351j04255j56629m2951j19034k21307m8426K51701K30522Q5823
10705A5377j56992j22143J96949L00561r8265J3835j18679j0280J63207J3736
10695A97306l7294K17236L685j23701K1265r890J10830m8189l60706m6099k16033
10684b91590k11391P6497j3040N9112J63599J17727j67926O2317J67496R1291
10674E4092L3454J880j90280o0547J17493R4613J16654j73242Q0326L26272O8824
10663D69539j79818k0827l04148k14678n6643J22533K87322p1456k23860q6085
10653b78121L138J65931K51423j27377J0995K03523k31388j17762J8609J96373
$$ y = [-136095, -338698, -386815, -412487, -365019, -411141, -488259, -602553, -587840, -431600, -281182, -50418, 139933, 35678, -120951, -163902, -282936, -504243, -552669, -300968, -70446, 15377, -141615, -263758, -66809, 233752, 135487, 149322, 30643, 20363, 183570, 197306, 160012, 377248, 380933, 257232, 278497, 268607, 379437, 331248, -29458, -75557, -291590, -502981, -426484, -439524, -380412, -216813, -99086, -267012, -204695, -37199, 54092, 87546, 89426, -100854, -161401, -43908, 50705, 167359, -5883, 74443, 400715, 469539, 289721, 268894, -35254, -249932, -306575, -184042, 103280, 31824, -192036, -278121, -274983, -109052, 142371, 14994, 25989, 229512, -1876, -119638, -101029, 95344]
10643I5344J19591j34517j5601m6413r8889L08314j14031M522M3132k38699J12801
10632C5554J70709R526k56728j23783J13842J58688J87597j53242m41007l0243
10622c29087R9297K26109m5271q4862K7383R3625j19303L2905M0864J35521K35954
10611C13135j95796k42569k09241j67895J32730N8884J99617J5424j15949K7023
10601a84637j84839q8703l7170J23413m098J66596R1379J37274Q8177l6115j47092
10590g5815j52522K15731N3687R4789n0654N6762N7464j50391l65908J34736J64846
10579a7275M7636J63051r7620q7028j11548o5640J67475j25116k06128J1936J32874
10568a87383L00977K90368m9228j33030K4950j54580k18158k52394P7054O5832
$$ y = [95344, 214935, 80418, 64817, 18404, -80485, 227829, 113798, 118320, 161452, -77247, 35554, 206263, 215789, -40939, -164722, -50880, 107808, 295405, 142163, -298844, -329087, -229790, -3681, -48952, -133814, -106431, -12806, -132109, -99204, -58340, 77181, 313135, 117339, -125230, -334471, -502366, -369636, -310752, -111135, -95711, -211660, -184637, -369476, -458179, -495349, -371936, -376034, -209438, -118059, 19215, 107392, 71277, -75815, -228337, -12606, 41081, 135870, 85216, 141978, 199442, 49051, -316857, -182121, -17275, 30361, 193412, 95792, 8764, -102784, -168424, -949, -126065, -332193, -320257, -187383, 113594, 403962, 354734, 221704, 246654, 92074, -126084, -378478, -301424, -235592]
10558b35592l5332K22191o0331J7342K60931n7018N4567J27978k33314K2514Q4674
10547A68610q6742j50194o9247O2545K47005q8409n9254N8756N9481J35220j10130
10536A67641l76236j63939P4936j88236K8022R2872M6915N20286K51003j5016
10526D38248l3474j84625k8210k69937l83482J2007N46068P0079q973j62440q8136
10515i2875M0192J19382K47651l1062l31972L118M9225J2969p473k13408r9012
10504c03265k1050J03415j08917J23622J80645j48497J51285J43433J1460N3302
10494A85433j99635J47304j66366M1261K70805j8759j07139J79204j80259k63566
10484a11717j54904M2492P2969j09761P5178n4284K32946L58223j61049k57910
$$ y = [-235592, -270924, -48733, -109064, -91722, 169209, 112191, 166758, 294736, 61422, 83936, 168610, 81868, -68326, -137573, -75028, 171977, 83568, 24314, 83070, 142551, 277771, 167641, -208595, -372534, -297598, -485834, -457812, -364940, -318025, 202261, 453264, 438248, 404774, 220149, 191939, -77998, -461480, -449473, 96595, 166674, 157701, -4739, -92875, -52683, 66699, 314350, 283288, -48684, -45566, 3659, 16628, 9155, -204253, -303265, -324315, -220900, -329817, -206195, -25550, -174047, -22762, 120671, 132131, 185433, -14202, 133102, -33264, 7997, 278802, 260043, 152904, 332108, 151849, -111717, -266621, -224129, -151160, -260921, -185743, -240027, -7081, 351142, 190093, -67817]
10474f7817j99475M2013J2813p686k0080N2185J50535N9605j28875o8639M3877
10463a31544Q3634m2268Q9698j34131k29345j00733J32425O6661O3124P7716L25825
10452B01062K43019j38116k86663l0690J19575p9443L5556K2225J30430K63618
10442D80573k48751m13405J01758j233K26182J54329n5157l57349J93059J8567
10432I8573j3432J29268L585j55591m5647n6184j4586L26193O6351Q5640o5635
10421C58535J00377l95710j02378l144j06779j58878n738R9334L74793L63353
10411E23765j5821j30766j04491j34631K16985n3500j69775n9228j06502K2443
10401a1521J18459k84228k37672J11411K1552J94639j99531M9965L00670j08415
$$ y = [-67817, -267292, -225279, -212466, -220152, -240232, -188047, -37512, 22093, -106782, -175421, -131544, -47910, -90178, -480, -134611, -363956, -464689, -332264, -265603, -202479, -124763, 201062, 444081, 305965, 19302, -11388, 108187, 28744, 64300, 86525, 216955, 480573, 231822, -181583, -79825, -81058, 145124, 299453, 244296, -113053, 80006, 98573, 85141, 214409, 217994, 62403, 16756, -39428, -54014, 272179, 338530, 424170, 358535, 458912, 63202, -39176, -42320, -149099, -307977, -313715, -214381, 160412, 523765, 507944, 377178, 272687, 138056, 355041, 301541, 131766, 72538, -33964, -11521, 106938, -177290, -414962, -303551, -281999, -87360, -286891, -236926, 63744, -44671]
10391d4671j29190J32740K68485o9703K0187p602k26194J16401j05663O9399l5501
10380a1312m6616j15266j60834J5148j88541k97827o7220J88605K02757J91497
10370b89609P4405J51131j33453j97197p5748r2884J02598K88359L15774J3037
10360A56413k61610J45888l2668k66052N8399j8412K02112O8971k59026j34050
10350c40035J00513R6431p7539l4687J33023O4634R5580l3263J22813N962m00079
10339b66647L5669K01759r0737j45526J11809J87009j9411J00848j07273K77269
10329B84769K82341Q4631O4588j56047l08252k0860M2136n5096k56380l8964j66854
10318b43988K27675N299q1225J88721k62998J4154M10982j00296o5853O7971j27015
$$ y = [-44671, -173861, -41121, 227364, 157661, 177848, 170246, -55948, 60453, -45210, 24189, -11312, -57928, -173194, -334028, -318880, -507421, -805248, -872468, -683863, -481106, -289609, -215204, -64073, -197526, -394723, -470471, -563355, -460757, -172398, 143376, 156413, -105197, 40691, 8023, -258029, -199630, -218042, -15930, 53041, -205985, -340035, -239522, -143091, -220630, -255317, -122294, -57660, 37920, 4657, 127470, 133432, -266647, -230978, -29219, -119956, -265482, -153673, 33336, 13925, 114773, 7500, 284769, 567110, 651741, 716329, 560282, 252030, 231170, 273306, 218210, -38170, -77134, -243988, -16313, -11014, -92239, 96482, -166516, -152362, 258620, 158324, 92471, 160442, 33427]
10307C3427p2587L4935N1407J08662r166K0047J29100J22133M9153J02256J8795
10296E88162k09714k7393j5800l3545m690j76278j62136J45598K19768L6360N9822
10285D20154j60784P2698j24955l44848r3815N0484M2901l0094l1566K27326R3846
10274A21347M3304L7282P7132j31660l77759l11693k2466J73778J97847K61667
10264F8779J61829j64658k40103J88771J8259O6862M1313q9375J38719J90667
10254C81063q2695k87742M5526L8773J23941O2858k18311j45325p1233m2864j7547
10243b13556Q8793K75692O0351M3203k10211J220r2503P1147J81P465K08775l20418
10231g9861j99090M9069l134J17339J86889q7212k82777L14070k8531j40630n8452
$$ y = [33427, -39160, -4225, 47182, 155844, 146678, 166725, 295825, 417958, 467111, 569367, 588162, 378448, 351055, 335255, 301710, 297020, 120742, -41394, 104204, 323972, 360332, 420154, 259370, 332068, 207113, -137735, -231550, -181066, -138165, -168259, -199825, 27501, 121347, 164651, 201933, 279065, 147405, -230354, -542047, -564513, -390735, -192888, 68779, 230608, 65950, -174153, 14618, 32877, 99739, 141052, 51677, 190396, 381063, 298368, 10626, 56152, 94925, 218866, 281724, 63413, -81912, -153145, -196009, -213556, -124763, 150929, 211280, 254483, 44272, 45492, -47011, 24136, 24317, 31782, 240557, -79861, -278951, -229882, -233016, -115677, 71212, -16000, -298777, 15293, -13238, -153868, -212320]
10220b12320J10173K6238N9941r6205L1448J74216P6946j45489n2422l68253l63160
10209g58887M1432M38492L4735J91219J79392k28810p4701J19042k6355k4167
10199a08608K06172N1062J49877m0719l64869j06470L15250K12530j17381l85390
10189a88546j63720Q8587J25058n0461K65727k40074k6345j12623J24257O0771
10179a17369j59922q7812J91345Q1773J72019j84992p9745J70149J35592j98807
10169g7769q0491P1954R9309J04993O2064J04161r0627m0638p1826l06495J35746
10158h9619J32j04340m4842K02643O6357K0096K03278M1375j13297k11663j43246
10147a73126Q4453j67146N7052M21237J61222k40040k06404K370J71234O963o6243
$$ y = [-212320, -102147, -75909, -15968, -112173, -80725, 93491, 170437, 24948, -27474, -395727, -758887, -717455, -278963, -244228, -53009, 126383, -102427, -177128, -58086, -84441, -108608, 97564, 148626, 298503, 257784, -107085, -213555, 101695, 314225, 196844, -188546, -352266, -263679, -138621, -189082, 76645, -163429, -189774, -302397, -178140, -117369, -277291, -365103, -173758, -91985, 80034, -104958, -184703, -14554, 121038, -77769, -158260, -86306, 13003, 117996, 180060, 284221, 193594, 152956, 81130, -225365, -89619, -89487, -193827, -238669, -36026, 30331, 50427, 253705, 295080, 181783, -29880, -173126, -88673, -255819, -198767, 222470, 383692, 143652, -62752, -60382, 110852, 117815, 51572]
10136E1572m0903l28136J9154P5352q2146N0078J14589K49058M3757j61239j91259
10125b00123m4790K70415O3360k48735m40264J36255J58671J14745k40217j87732
10115f18415M1330K47662J08840j17874K12413J14288J81492r9273O6571L896
10105A40930N8679K21168R64j32471r212k68297j47291k15240k23635J16758K2587
$$ y = [51572, 10669, -317467, -298313, -222961, -305107, -255029, -140440, 108618, 152375, -8864, -200123, -244913, 25502, 88862, -159873, -600137, -463882, -305211, -190466, -430683, -618415, -577085, -329423, -220583, -338457, -126044, -11756, 169736, 70463, 137034, 140930, 199609, 420777, 421741, 289270, 280058, 11761, -135530, -350770, -574405, -457647, -435060]
$$ [...]
##END NTUPLES=NMR SPECTRUM
##END=
