##TITLE=Analysis number 318010
Compound Code cc 45801
Book Reference 468/47/2
Project Code adrs
Chemist Name colinb
##JCAMPDX= 6.0         $$ Bruker NMR JCAMP-DX V2.0
##DATA TYPE= NMR SPECTRUM
##DATA CLASS= NTUPLES
##ORIGIN= Bruker BioSpin GmbH
##OWNER= nmr
$$ XWIN-NMR		Version 3.5
$$ Mon Mar 13 08:57:01 2006 GMT Standard Time (UT+0h)  MAYBRIDGE\nmr@NMR_250MHZ
##.OBSERVE FREQUENCY= 250.131544655141
##.OBSERVE NUCLEUS= ^1H
##.ACQUISITION MODE= SIMULTANEOUS (DQD)
##.ACQUISITION SCHEME= undefined
##.AVERAGES= 16
##.DIGITISER RES= 18
##SPECTROMETER/DATA SYSTEM= dpx250
##.PULSE SEQUENCE= zg30
##.SOLVENT NAME= DMSO
##.SHIFT REFERENCE= (INTERNAL, DMSO, 0, 16.522)
##AUDIT TRAIL= $$ (NUMBER, WHEN, WHO, WHERE, WHAT)
$$ ##TITLE= Audit trail, XWIN-NMR		Version 3.5
$$ ##JCAMPDX= 5.01
$$ ##ORIGIN= Bruker BioSpin GmbH
$$ ##OWNER= nmr
$$ C:\u/data/dgb/nmr/ADRS/560/pdata/1/auditp.txt
$$ ##AUDIT TRAIL=  $$ (NUMBER, WHEN, WHO, WHERE, WHAT)
(   1,<2006-03-13 08:56:41.03 +000>,<MAYBRIDGE\nmr>,<NMR_250MHZ>,
      <created by zg, POWCHK disabled, PULCHK disabled
       configuration hash MD5:
       84 BC 41 DB A1 6E 1D 46 DA 25 12 A5 C1 ED C5 3A
       data hash MD5: 64K
       B5 0C EA 43 3F 39 BD F4 A5 9C 39 A8 7D B2 DF 6E>)
(   2,<2006-03-13 08:56:52.61 +000>,<MAYBRIDGE\nmr>,<NMR_250MHZ>,
      <Start of raw data processing
       ef LB = 0.3 FT_mod = 6 PKNL = 1 SI = 32K 
       data hash MD5: 32K
       A7 19 D0 28 C3 56 54 B0 CC E8 5B 2C ED F0 DA AF>)
(   3,<2006-03-13 08:56:54.28 +000>,<MAYBRIDGE\nmr>,<NMR_250MHZ>,
      <apk 
       data hash MD5: 32K
       C1 4F C9 5C BA C6 00 AB 23 0E 10 FD F6 99 7C 23>)
(   4,<2006-03-13 08:56:55.06 +000>,<MAYBRIDGE\nmr>,<NMR_250MHZ>,
      <abs ABSG = 5 
       data hash MD5: 32K
       D9 79 B0 A3 76 D0 D6 2B 54 4C 72 01 40 AA F9 3E>)
$$ ##END=
$$ 
$$ hash MD5
$$ 0F 91 11 95 72 86 0D B4 A8 D6 EE AA 84 97 EB 67
##$RELAX= 
##$RELAX= 
##$RELAX= 
##$RELAX= 
##$RELAX= 
##$RELAX= 
##$RELAX= 
$$ Bruker specific parameters
$$ --------------------------
##$DU= <C:\u>
##$EXPNO= 560
##$NAME= <ADRS>
##$PROCNO= 1
##$TYPE= <nmr>
##$USER= <dgb>
##$AMP= (0..31)
100 100 100 100 100 100 100 100 100 100 100 100 100 100 100 100 100 100 
100 100 100 100 100 100 100 100 100 100 100 100 100 100 
##$AQSEQ= 0
##$AQ_mod= 3
##$AUNM= <au_zg>
##$AUTOPOS= <7 >
##$BF1= 250.13
##$BF2= 250.13
##$BF3= 250.13
##$BF4= 250.13
##$BF5= 500.13
##$BF6= 500.13
##$BF7= 500.13
##$BF8= 500.13
##$BYTORDA= 1
##$CFDGTYP= 0
##$CFRGTYP= 5
##$CHEMSTR= <none>
##$CNST= (0..31)
1 1 145 1 1 1 1 1 1 1 1 1 1 1 1 1 1 1 1 1 1 1 1 1 1 1 1 1 1 1 1 1 
##$CPDPRG= <>
##$CPDPRG1= <>
##$CPDPRG2= <>
##$CPDPRG3= <>
##$CPDPRG4= <mlev>
##$CPDPRG5= <mlev>
##$CPDPRG6= <mlev>
##$CPDPRG7= <mlev>
##$CPDPRG8= <mlev>
##$CPDPRGB= <>
##$CPDPRGT= <>
##$D= (0..31)
0 1 0 0 0 0 0 0 0 0.06 0 0 0 0 0 0 0.0002 0 0 0 0 0 0 0 0 0 0 0 0 0 0 
0 
##$DATE= 1142240200
##$DBL= (0..7)
120 120 120 120 120 120 120 120 
##$DBP= (0..7)
150 150 150 150 150 150 150 150 
##$DBP07= 0
##$DBPNAM0= <>
##$DBPNAM1= <>
$$ [...]
##$SUBNAM7= <"">
##$SUBNAM8= <"">
##$SUBNAM9= <"">
##$SW= 20.6930455092707
##$SWIBOX= (0..15)
0 0 3 0 0 0 0 0 0 0 0 0 0 0 0 0 
##$SW_h= 5175.983436853
##$TD= 65536
##$TD0= 1
##$TE= 294.16
##$TE2= 300
##$TE3= 300
##$TEG= 300
##$TL= (0..7)
0 120 120 120 120 120 120 120 
##$TP= (0..7)
150 150 150 150 150 150 150 150 
##$TP07= 0
##$TPNAME0= <>
##$TPNAME1= <>
##$TPNAME2= <>
##$TPNAME3= <>
##$TPNAME4= <>
##$TPNAME5= <>
##$TPNAME6= <>
##$TPNAME7= <>
##$TPOAL= (0..7)
0.5 0.5 0.5 0.5 0.5 0.5 0.5 0.5 
##$TPOFFS= (0..7)
0 0 0 0 0 0 0 0 
##$TUNHIN= 0
##$TUNHOUT= 0
##$TUNXOUT= 0
##$USERA1= <user>
##$USERA2= <user>
##$USERA3= <user>
##$USERA4= <user>
##$USERA5= <user>
##$V9= 5
##$VALIST= <valist>
##$VCLIST= <CCCCCCCCCCCCCCC>
##$VD= 0
##$VDLIST= <DDDDDDDDDDDDDDD>
##$VPLIST= <PPPPPPPPPPPPPPP>
##$VTLIST= <TTTTTTTTTTTTTTT>
##$WBST= 1024
##$WBSW= 4
##$XGAIN= (0..3)
0 0 0 0 
##$XL= 0
##$YL= 0
##$YMAX_a= 370337
##$YMIN_a= -488113
##$ZGOPTNS= <>
##$ZL1= 120
##$ZL2= 120
##$ZL3= 120
##$ZL4= 120
##$ABSF1= 16.522
##$ABSF2= -4.171173
##$ABSG= 5
##$ABSL= 3
##$ALPHA= 0
##$AQORDER= 0
##$ASSFAC= 0
##$ASSFACI= 0
##$ASSFACX= 0
##$ASSWID= 0
##$AUNMP= <proc_1d>
##$AZFE= 0.1
##$AZFW= 0.1
##$BCFW= 0
##$BC_mod= 0
##$BYTORDP= 0
##$COROFFS= 0
##$CY= 12.5
##$DATMOD= 1
##$DC= 0
##$DFILT= <>
##$DTYPP= 0
##$F1P= 14.0000005364418
##$F2P= -0.99999901652339
##$FCOR= 0.5
##$FTSIZE= 32768
##$FT_mod= 6
##$GAMMA= 0
##$GB= 0
##$INTBC= 1
##$INTSCL= 1
##$ISEN= 128
##$LB= 0.3
##$LEV0= 0
##$LPBIN= 0
##$MAXI= 10000
##$MC2= 0
##$MEAN= 0
##$ME_mod= 0
##$MI= 0
##$NCOEF= 0
##$NC_proc= -3
##$NLEV= 6
##$NOISF1= 0
##$NOISF2= 0
##$NSP= 0
##$NTH_PI= 0
##$NZP= 0
##$OFFSET= 16.522
##$PC= 1
##$PHC0= 166.8618
##$PHC1= 5.956436
##$PH_mod= 1
##$PKNL= yes
##$PPARMOD= 0
##$PSCAL= 4
##$PSIGN= 0
##$REVERSE= no
##$SF= 250.13
##$SI= 32768
##$SIGF1= 0
##$SIGF2= 0
##$SINO= 400
##$SIOLD= 32768
##$SREGLST= <1H.DMSO>
##$SSB= 0
##$STSI= 32768
##$STSR= 0
##$SW_p= 5175.98343685301
##$SYMM= 0
##$S_DEV= 0
##$TDeff= 65536
##$TDoff= 0
##$TI= <Analysis number 999999
Compound Code 99
Book Reference 9
Project Code 9>
##$TILT= no
##$TM1= 0
##$TM2= 0
##$TOPLEV= 0
##$USERP1= <user>
##$USERP2= <user>
##$USERP3= <user>
##$USERP4= <user>
##$USERP5= <user>
##$WDW= 1
##$XDIM= 32768
##$YMAX_p= 350174737
##$YMIN_p= -182006
$$ End of Bruker specific parameters
$$ ---------------------------------
##NTUPLES= NMR SPECTRUM
##VAR_NAME=  FREQUENCY,     SPECTRUM/REAL,   SPECTRUM/IMAG
##SYMBOL=    X,             R,               I
##VAR_TYPE=  INDEPENDENT,   DEPENDENT,       DEPENDENT
##VAR_FORM=  AFFN,          ASDF,            ASDF
##VAR_DIM=   32768,         32768,           32768
##UNITS=     HZ,            ARBITRARY UNITS, ARBITRARY UNITS
##FACTOR=    0.157963299565203, 1,           1
##FIRST=     4132.6476996994, 0,             0
##LAST=      -1043.33573715361, 0,           0
##MIN=       -1043.33573715361, -182006,     0
##MAX=       4132.6476996994, 350174737,     0
$$ Real data points
##PAGE= N=1
##DATA TABLE= (X++(R..R)), XYDATA
$$ [...]
22801 -42587 -25856 -1710 9633 -1858 -11715 -8146 -19235 -29025 30823 101727 107740 81834
22789 81834 50478 31651 44772 39566 13664 -32693 -63715 -46866 -29078 -8032 23870 27740
22777 27740 32235 19613 -24572 -34759 7260 48212 63960 44507 -5815 38066 40981 8206
22765 8206 -15439 -24810 9331 8294 -8520 9927 11640 -9248 6166 -12435 -60439 -46825
22753 -46825 -41932 13733 35679 56671 61466 46511 4030 29947 39888 30867 49149 -3603
22741 -3603 -34440 -17402 -6274 16764 3791 2230 12533 12059 15685 5608 -50310 -43609 -26258
22728 -26258 -20410 -28385 -58588 -59044 1714 51275 14236 -14280 -32513 -8012 -14366 -18496 -30252
22715 -30252 -17186 -46572 -45278 2687 7349 -31899 12950 18073 13864 25763 1417 -18779
22703 -18779 -20419 -8165 31699 35375 32228 49954 44346 18184 21789 33698 27553 48853 18050
22690 18050 30072 -16310 -62966 -54887 -43983 -39546 -40900 -52474 -78607 -19881 3401 -7698
22678 -7698 -19900 -8270 -13397 -14039 -30401 -59847 -50638 2740 16645 33279 23796 42145 65371
22665 65371 48272 52732 62012 51181 36397 33283 10668 35725 15783 -20048 -25358 -32169 636
22652 636 25551 43323 50804 25283 -59403 -81999 -69888 4181 30613 2539 19622 12867
22640 12867 -3737 -4239 -13076 -38627 -30054 16160 39011 58575 85593 54984 48680 87230 65638
22627 65638 7018 -30988 -52988 -51940 -48339 -25757 -37713 -61919 -34270 11796 -5451 -24985
22615 -24985 -9894 7959 38090 66241 13496 -68369 -99114 -67856 -37387 -36592 -57610 -58350
22603 -58350 -86333 -60292 -27899 -31846 -10010 -2595 13173 22921 53372 54938 57946 46533 12534
22590 12534 6299 14974 7913 11840 -15637 -8172 21791 24148 -51133 -110962 -97824 -50562 -4563
22577 -4563 -447 -26452 -55296 -51230 -16616 -51429 -60532 -64168 -21520 826 11447 9094 -26555
22564 -26555 -54430 -40926 -18200 -13117 -22381 -45203 -40990 -38090 -52441 -21059 12551 -7092
22552 -7092 2138 15807 5249 -25789 -88183 -58791 -21876 -1292 -14124 -6554 -42868 -63347
22540 -63347 -44853 -49905 -46697 -22960 -2976 -14515 -14368 -24682 -43602 -59127 -36502 -48291
22528 -48291 -76975 -26235 25688 943 -9642 1466 -28138 -35689 -3938 -10338 -3295 26179
22516 26179 42869 18095 -12479 25520 44911 -1033 -19909 -2296 -16794 -30922 -1346 -10071
22504 -10071 -16736 4668 42291 60344 26230 2649 -15820 -13685 -29102 -27111 -3584 28736
22492 28736 41142 13090 -25398 -45846 -65149 -51790 -48195 -10165 -32883 -48502 -25721 18121
22480 18121 8479 -9593 11593 71985 97432 49136 22590 23703 -26000 -79312 -57669 -19899
22468 -19899 -1441 14903 8435 4417 25158 26270 27665 27964 -11816 -240 24004 -4191 -70730
22455 -70730 -72767 -36210 -27813 -24038 -14806 -24105 -20168 -19076 -1773 10920 25247 66606 89699
22442 89699 53600 26206 25474 59336 58073 35144 23122 112 -13245 -7468 -3041 28633 13041
22429 13041 9058 -30674 -40131 -48693 -32470 -19520 -19095 -6270 8682 33899 -13449 25616 -3214
22416 -3214 -42126 -63763 -28268 -14232 -16999 21992 3891 10285 11580 -18512 -40650 -31646 28926
22403 28926 38382 14935 -19231 -63027 -48199 -18561 -3833 1794 4213 -11344 -16751 -2674
22391 -2674 -28745 -7772 5026 6333 18974 16822 1738 -25481 -44869 -39426 -5308 -9318 -61917
22378 -61917 -45962 -23348 -3634 15262 -5118 -15122 -27131 -41373 -44356 -49690 -28152 2353
22366 2353 77913 62889 -13433 -25346 -25508 -63441 -90516 -110353 -96941 -105226 -30693 32268
22354 32268 27256 21726 75836 86313 71039 32438 26086 39718 9573 -27577 -5182 -100
22342 -100 9567 -7253 -35211 -13772 -6573 -12729 -29184 -77095 -61502 -34806 -10265 -25409 -1792
22329 -1792 -1359 13436 2358 -14886 -18563 -29377 -76995 -97840 -97099 -33730 -42871 -72473 -33099
22316 -33099 -29767 -25244 -13578 -34590 -42602 2540 -5447 -60195 -63198 -13480 25227 31021 22718
22303 22718 -2590 -22884 4011 34226 60216 66194 28453 -20289 -31319 -3171 -6897 7062
22291 7062 463 -21163 -32303 -29078 25481 29393 41774 31504 -29512 -56385 -76269 -31803
22279 -31803 -14350 -7238 -37862 -40845 -5229 12944 61956 59940 53269 73557 73307 16281 -4842
22266 -4842 -51821 -45220 -17461 551 3941 27117 24131 32521 41315 21069 15839 44564 38928
22253 38928 17327 -5810 5439 27875 57307 65705 15963 18413 36809 3312 5878 -9403
22241 -9403 -58341 -49071 -16388 -33960 -46420 -52018 -79381 -92667 -51688 39908 51280 -9155
22229 -9155 -18783 -21802 -30882 -35879 -9129 9314 -12632 -2097 -13717 -13295 37574 23722 6828
22216 6828 -14559 -21588 16748 29299 -40136 -102773 -99160 -77827 -28170 -20161 1922 45235
22204 45235 70807 56410 13590 -31842 -101933 -82756 15232 5490 -40092 -18944 -2381 -11926
22192 -11926 -19017 -30210 -17595 -17309 -49263 -20866 33129 43469 75765 71313 68027 67677 12358
22179 12358 7691 22068 -7213 -63888 -83512 -42883 -15001 -49334 -44074 -3557 -10021 -22665
22167 -22665 -43777 -13897 -44908 -73226 -30876 -53138 -44683 4355 -8280 -12858 -28063 -17753
22155 -17753 5878 -1473 21062 46037 77606 92291 59713 7598 4205 -25386 -20639 9359
22143 9359 34744 80283 44795 8784 7327 -22871 -34474 -56717 -38973 -23505 -18379 -13386
22131 -13386 -37000 -67040 -35637 -86355 -104075 -67107 -62528 -32888 -4041 -22676 -54803 -46918
22119 -46918 -21866 13180 26736 -15762 -32230 16784 9037 -3790 -1385 -17837 -20298 -35892
22107 -35892 -45008 -23027 150 54763 46259 14478 -31492 -60153 -22430 -39792 -51703 22151
22095 22151 4116 -11811 -2163 -9931 -89019 -120639 -67281 -15340 -1903 -28025 -35682 -54387
22083 -54387 -47746 -36314 -22621 44598 43956 39816 39378 62302 23121 -1890 6561 8858 -5682
22070 -5682 29220 36865 20829 23495 14858 -19123 -31539 717 71982 56400 17892 -7049
22058 -7049 -32347 -65597 -64317 -50146 -45953 -51369 -25719 -4148 13338 2506 -7296 -29648 -22908
22045 -22908 -35272 148 14870 4884 -17810 -26067 6016 48827 36826 -62773 -49659 -25104
22033 -25104 -40013 -12930 11630 -274 -33924 -26511 -52583 -37188 -1600 3060 5532 -9903
22021 -9903 -17553 4394 42558 10161 -38426 15776 50433 41470 749 16302 47339 111384
22009 111384 128126 124386 97040 29778 -51696 -80400 -59941 -90030 -85681 -51274 -27020 27265
21997 27265 39966 3475 13247 44239 31606 -14393 -23426 -26842 -6727 -3378 -19619 -16258 11682
21984 11682 55306 31372 36041 20378 20243 21786 2053 11525 31358 25570 2131 -3901 -54719
21971 -54719 -34884 -35235 -43235 -6741 8446 19330 24140 30870 18861 1312 -12703 -20978 19827
21958 19827 22035 -19187 -51908 -28575 -11980 -3450 -63374 -47768 -28107 -41588 -28788 -51854
21946 -51854 -46346 -32797 8455 -18042 -38898 -26324 -26743 -44770 -64021 -36919 -31623 -44787
21934 -44787 -48914 -56919 -117067 -146456 -102761 -79999 -68735 -30269 -41908 -39889 -35653 -13339
21922 -13339 -13377 39327 34459 45432 -345 -31953 -40528 -38798 11005 57762 31896 3342 -14672
21909 -14672 -28334 -35602 76 122 -7555 -23536 -4742 3577 -28636 -77758 -62390 -27825 -39724
21896 -39724 -38902 -22234 -28382 -38771 -23078 -18129 6809 3710 -9424 -5366 9085 8343 -23498
21883 -23498 -4475 17415 -12297 -24259 -40128 -30153 -28495 -7511 -30024 -33244 42405 77210
21871 77210 84691 57871 30047 45085 56864 63641 57206 41151 14591 31408 1139 -12303
21859 -12303 -8518 7110 30638 28547 32193 72724 44259 30075 18526 2092 -1459 -9817 19965
21846 19965 46749 39574 -32816 -68749 -21669 -30635 -80848 -82443 -81720 -75017 -45644 -33269 -29451
21833 -29451 -43901 -33569 -1467 42116 6133 -10259 -24138 -22235 -46554 -89864 -55181 -19737
21821 -19737 17373 -3668 -28165 -44459 -8177 3798 9380 5684 359 -10557 -5631 23791
21809 23791 26663 -25890 -31998 215 -10900 -22414 -30714 -23281 -28170 -71401 -76501 -56493 -69985
21796 -69985 -66384 -66646 -90721 -102160 -69361 -17074 -15990 -28096 -27866 -32197 -33602 -12043 -3530
21783 -3530 141 -18450 -59932 -41268 12148 46846 66388 56735 48747 38624 13079 47493
21771 47493 63245 9683 6255 -30663 -70497 -94850 -99182 -70614 -46006 -35690 -26585 -9369
21759 -9369 14094 26245 47332 74094 46703 7125 27782 34713 -15926 -57135 -30287 640
21747 640 -37078 -37806 -8488 3637 1592 -2654 -7664 -37323 -66391 -31043 -41149 -33285 -50357
21734 -50357 -87689 -73031 -53261 -32365 6695 -8941 -21512 -29201 -68917 -50857 -14114 -6839
21722 -6839 4542 -2048 -27660 -67094 -83019 -69185 -32980 43196 48181 27117 45484 87199
21710 87199 30237 -6355 -16282 34403 35042 -597 -12363 -29732 -8047 34363 20377 -48680
21698 -48680 -58004 -35823 -57808 -95278 -90302 -41218 -11002 4560 12026 25123 34925 16605
21686 16605 9544 -24130 -5403 -19019 -26196 -737 41666 9802 -4997 -4281 -30529 -48934
21674 -48934 -43263 -19172 -5825 -8028 -15905 -34285 -89582 -88114 -12852 14896 17641 -8110 -49809
21661 -49809 -14586 13075 11453 -30262 -88247 -102613 -80486 -47053 -40603 -35237 -15948 42384
21649 42384 54051 57900 53413 74697 53827 -2554 -734 -28543 -31279 -47406 -53660 -59977 -57708
21636 -57708 -23509 -5660 13246 46994 63419 25803 -511 -17887 -46044 -71864 -88191 -38432
21624 -38432 -18013 -24356 -28153 -13926 -10714 8006 19094 31752 -20227 -76717 -76707 -33111 -35494
21611 -35494 -11954 -1554 -33794 -45402 -34230 -24555 -7504 -4723 -2161 -32513 -64982 -38665
21599 -38665 -50302 -67088 -44001 -3486 2485 9464 16009 -25839 -70355 -56953 -51533 -85522
21587 -85522 -79175 -39240 -13235 59667 85310 69349 38348 35831 2219 -658 -7237 40059
21575 40059 67800 64318 42876 62564 27188 7994 26651 22940 -24369 -70361 -90870 -54363
21563 -54363 4678 6771 -66972 -105247 -76281 -37763 -41611 -62651 -72396 -71386 -47424 25138
21551 25138 17161 -18474 605 31317 35725 -9601 -6011 62246 50005 29706 39503 22864
21539 22864 43390 22857 2164 893 -22061 -17902 29320 32868 1306 -962 -913 -12883 -20592
21526 -20592 2719 21557 45786 66106 78043 37024 -10563 -30454 -58438 -63591 -9946 17453
21514 17453 19335 50630 76817 57098 22208 12581 24147 49829 33901 24608 13460 -12864
21502 -12864 -3628 -8556 -9369 -13 6856 13593 34264 -14692 -41655 -797 15636 29725 17233
21489 17233 8092 10339 20525 7466 -24490 -16046 -331 -51353 -39252 11394 55444 71735
21477 71735 86217 44639 25264 8678 33467 52772 10011 6987 -6770 -44221 -63975 -18219
21465 -18219 -21993 -60446 -46864 -43377 -14293 -36707 -61743 -46009 -57802 -47628 -39359 -32320
21453 -32320 -85903 -70724 6887 69712 67529 64084 49539 50729 54999 33020 -16224 -71803
21441 -71803 -55842 -69105 -88820 -70696 265 -1359 -22078 -8038 -22882 12316 29934 -1835
21429 -1835 5048 12599 22475 30549 17501 -3125 -30346 -27240 -13753 6602 59291 46756 -6770
21416 -6770 -15577 3708 12429 -2082 -666 566 19321 17945 -7573 -29153 -29138 -73116 -74543 -70179
21402 -70179 -19479 17158 29067 28168 41632 10636 -43475 -62895 -9392 8562 10146 14989
21390 14989 46941 31702 3584 -899 -11407 18662 27490 -11629 791 -3544 -39957 -55874
21378 -55874 -39626 -27742 -22911 5978 12178 -53499 -92342 -85222 -76070 -80840 -70085 -31462 25913
21365 25913 80 -9957 1522 15123 -19587 -10501 -39782 -33074 -13487 28083 66551 69436
21353 69436 22907 2703 -31959 -80558 -75876 -63308 -71892 -47008 -41186 -39101 -22760 -80245
21341 -80245 -45073 -12220 13170 27302 12894 12460 34873 11301 18778 51599 36936 23626
21329 23626 6144 -32771 -89247 -71748 -23389 -27136 -8669 25 13992 34684 11511 -37877
21317 -37877 -16057 -11368 -56292 -36703 -4119 -8096 -42487 -57949 -40455 -16024 -13715 -30778
21305 -30778 -38633 -42915 -27616 -19647 -19127 -11516 -46389 -60661 -54460 -88599 -84043 -23773 -31066
21292 -31066 -32726 -31166 -35486 -68856 -64315 16365 4440 -26273 -26537 -31163 -25796 -21518 -41314
21279 -41314 10500 71556 68401 41446 40179 7786 25109 -7521 -49492 -51215 -36126 15001
21267 15001 3190 -10726 -15336 -731 -1975 -15287 -14191 -29176 -35579 -8053 -22767 -11723
21255 -11723 3063 43526 54641 65028 80865 48538 -13704 -15768 -8982 14979 79143 63854
21243 63854 32182 1617 -43686 -44341 -30977 -20299 6643 23641 -4723 -43866 -29843 -36174
21231 -36174 -46401 -11527 14064 7738 10357 -10671 -75704 -58191 -30221 -21711 15132 38505
21219 38505 28267 5460 10130 -3240 -10602 -37964 -12961 27659 62540 63319 52234 84939
21207 84939 68737 67585 14106 34485 64240 74481 53492 24106 -28567 -38684 6868 52034
21195 52034 49075 37152 24744 13797 35416 28282 6873 34831 22815 -6871 -24408 -69830
21183 -69830 -95987 -45467 19149 35935 13352 7784 -4382 -39959 -21449 10775 16770 7599
21171 7599 26361 16495 9528 5801 34698 51594 56741 26746 11287 5198 29071 18878 -9533
21158 -9533 -4710 8296 40778 43897 31134 21579 6913 710 28970 57109 -11296 -30521 -19798
21145 -19798 11770 -570 -50740 -4129 46015 32664 541 -22597 -23854 -33344 -33492 -25766 -55730
21132 -55730 -19763 -6405 -21336 -30555 -52484 -63515 -30495 -40711 -43130 -5649 10734 -4086
21120 -4086 16523 84905 72671 10881 -28407 -61196 -57477 -34564 -49384 -49002 -36049 -50944
21108 -50944 -21475 41240 39304 6386 11365 -22284 -26737 -15702 -35815 -45265 -46362 -51986 -85338
21095 -85338 -37438 -25122 -18226 7207 -6152 -48231 -70444 -80010 -77696 -85462 -84479 -81228 -47644
21082 -47644 1916 24176 9543 -15888 -38047 -7040 -9796 -1937 -6289 -27017 1943 42625
21070 42625 32653 21492 15540 36769 52425 65050 94147 49356 5681 -10156 -53306 -57533
21058 -57533 4566 11463 -124 21972 6668 -14635 -16401 -32235 -34450 -46864 -32060 5921
21046 5921 17379 17618 22002 33077 16626 -61459 -94345 -94849 -42166 -63821 -48241 -10510 -23612
21033 -23612 25032 28430 31762 29035 31815 10611 9334 27325 53216 37236 -1955 -15494 -9893
21020 -9893 -12781 -5774 4440 15020 25627 27251 10497 -7462 -32913 -59547 -42569 31074
21008 31074 82151 75448 59300 34655 3562 13510 43913 40260 16138 4629 -3079 11300
20996 11300 -6047 -8222 -1450 -8712 -50881 -66131 -82546 -100807 -108394 -112315 -102699 -24640 -7092
20983 -7092 -40112 -69728 -62180 -43426 -2676 2959 -1425 -14139 -15644 5181 -11583 -2204 11562
20970 11562 -4569 5553 13059 69831 102248 108828 124515 108436 89989 65022 42331 28022
20958 28022 31507 37716 50729 60631 43060 -8145 -38701 -40761 -25726 -5596 11711 37071
20946 37071 46052 -11219 -32362 -14186 21098 20737 23303 34229 20223 14678 -784 2066 43082
20933 43082 68438 66299 31850 17118 -31055 -35020 15029 -1876 -5008 31336 36636 17471
20921 17471 -15775 -35946 -3471 -13296 -22146 -20586 -15702 43156 2846 -34011 -54533 -77176
20909 -77176 -65862 -8470 14851 19853 -17058 -22272 -49698 -60389 -23909 5436 -17984 -58800
20897 -58800 -80529 -68831 -43535 2905 22277 17570 26892 -12471 -13946 -22127 -12422 3828 25636
20884 25636 32848 25207 -29305 -41136 -46953 -42501 -19086 -14204 -22512 -24703 -42864 -81669 -81503
20871 -81503 -38849 -40375 -101803 -112785 -37490 -5020 -42920 -105012 -60765 -51868 -49589 -7592
20859 -7592 -35789 -51868 -73222 -108182 -69000 -34246 -4040 -6686 -26093 -40137 -58934 -16154
20847 -16154 -38480 -11251 6319 -5927 -43297 -77731 -54184 -46666 -30588 5097 -49641 -86524
20835 -86524 -81767 -52916 -55773 -67299 -57872 -75231 -97552 -95939 -51596 -21281 18567 26021 -21804
20822 -21804 -31217 -15257 -5642 -28781 -38565 -61554 -40832 30151 44527 -510 -38839 -43029
20810 -43029 -42823 -37636 -22710 -43980 -26607 6161 -2209 -34113 -71569 -127744 -127122 -76503 -32569
20797 -32569 -76543 -37585 17255 32874 37891 43457 38889 -8416 -47571 -52829 14834 -1897
20785 -1897 -5215 27444 48156 55517 24572 -1072 -18886 7917 47731 62804 16709 -2877
20773 -2877 -18544 -34556 -48661 -20449 8719 -23554 -32396 -6397 -8665 -25165 -14084 -45480
20761 -45480 -36012 -4724 -4211 -27226 -25752 -33450 -5159 13578 5692 33722 10471 13719 -13003
20748 -13003 -20637 -23985 -31923 -12175 4169 -1304 -26300 -35486 6577 25553 18868 17764 24829
20735 24829 12659 38289 88436 95069 44326 -3415 -30407 -20367 11833 -33859 -45927 -8366
20723 -8366 669 -12078 -66683 -41035 -30175 -50233 -78685 -79632 -49099 -3737 -3336 5449 -11435
20710 -11435 -12677 -22109 -65914 -52932 17867 48861 24478 13911 26226 75239 103084 85084
20698 85084 38339 8790 -36189 -42442 42018 88060 67196 37066 48530 14434 3151 13069
20686 13069 19180 29508 63743 69060 61606 26040 -21172 7699 39371 29102 15869 -23190
20674 -23190 -38978 -16677 -19614 -7138 -27870 -27231 -42869 -59776 -58016 -81918 -85537 -61580 -48162
20661 -48162 -7377 10495 5127 -27653 -19318 42162 54888 59951 39689 31429 31270 -3591 -19629
20648 -19629 -17093 -60088 -97932 -86397 -67147 -27860 -4048 35461 34304 27237 36711 61366
20636 61366 10636 -9420 18460 10782 27335 40240 82985 106626 45078 10489 49221 57987
20624 57987 41330 -7658 2553 17842 24411 26768 37325 38646 25246 53189 33201 59527
20612 59527 31890 28897 57708 36667 -11515 -20534 48063 46031 1442 -12850 -2106 -2883 26898
20599 26898 7000 -21480 30918 40720 -34961 -50368 -38405 -13218 -12125 -58224 -66214 -14957
20587 -14957 1368 -1766 11355 20477 43124 21043 -23794 -1204 15739 -1256 -27074 -22754
20575 -22754 -19024 -29373 -4562 408 5814 4236 12623 11190 -10977 -3403 18371 18699 24833 54925
20561 54925 72127 54337 14616 -12717 -5828 -28100 22684 44234 27778 -6471 -4402 -2469
20549 -2469 19485 41223 -19054 -32560 33837 83234 78344 24694 -3713 -42826 -21544 19376
20537 19376 35704 32241 47469 48344 17198 -24758 -23333 26200 62539 21298 -6926 -4368 19263
20524 19263 37384 78923 59410 63505 -12251 -62428 -39316 -34719 -41662 -21394 -28722 -26632 -25685
20511 -25685 -36385 -61342 -48589 -18223 -33279 -34857 -48365 -92964 -129661 -103327 -49711 -22836
20499 -22836 -3567 31794 27737 32245 27576 -11626 -1799 57623 55453 53300 24097 37658 26776
20486 26776 -52244 -64672 -51989 -12117 13310 -1168 8001 22073 -27831 -30479 3041 10722
20474 10722 31332 39990 -12908 -45857 -49931 -81224 -57950 -19758 -58932 -106100 -55175 -41290
20462 -41290 -60385 -98582 -78643 -31703 -10436 2646 6768 37245 14940 24570 43903 -19782
20450 -19782 -45217 -18642 12817 13231 -11503 -185 63817 16309 -26998 16498 18195 47557
20438 47557 60132 42868 -20436 -64234 -27281 -16699 -35688 -5622 8723 -31477 -43195 -4015
20426 -4015 39175 25166 11940 1396 -962 34943 65220 105823 88449 18396 -24597 -46787
20414 -46787 -15621 -19808 -57827 -59914 -57340 -42309 8597 14238 18668 80685 45361 24984 38652
20401 38652 -19989 -51161 -54894 -96376 -111112 -74786 -30340 -44995 -12735 27258 1572 10177
20389 10177 19321 38759 4782 -9390 -2658 30197 27518 76191 82794 59297 25527 36517
20377 36517 53972 33068 -2492 13287 2888 -18338 -33291 -73021 -71730 -71990 -59615 -41058
20365 -41058 -56394 -17080 46130 37077 -39059 -65348 -60053 -9313 51631 63569 75514 61966
20353 61966 41364 -20058 -57252 -55666 -58166 -39317 -17623 -18049 -16056 -6967 -7236 3514 33022
20340 33022 32946 803 -33362 -59282 -35686 -10172 5320 -21079 -18441 3336 8239 -43650 -14169
20327 -14169 -7699 23427 1851 -18124 -36756 -32447 -40336 -10188 44986 66990 56828 54495
20315 54495 -7519 -37199 -28336 -29320 9883 8464 13330 4160 -10292 -2205 45855 69786 73060
20302 73060 17546 -56050 -54690 -47555 -67051 -86646 -35599 31787 63473 41640 34890 16305
20290 16305 22362 33934 -28811 -15641 3766 7224 -24588 -43312 -69752 -68533 -6281 -2572
20278 -2572 -1482 -18718 15353 36143 35518 24911 33717 21751 -8617 -6240 -1528 -12608 -8259
20265 -8259 -741 -15776 -1591 11632 2997 54534 72194 74372 39831 8609 -20785 18332
20253 18332 15535 -6713 18416 45288 28418 20456 -200 -20918 -24790 55319 96652 97196 83161
20240 83161 58436 42966 93029 64775 20895 17982 -5876 -15596 -14638 -49799 -85646 -73517
20228 -73517 -53245 -52970 -60281 -26648 -23403 -42916 -35060 -3373 -18597 -37290 -36108 -26208 -62435
20215 -62435 -70430 -58080 -22130 15927 20102 -10860 -12964 -40111 -15911 33587 -9336 -39840
20203 -39840 -23813 -38391 -43125 -22203 -1726 -205 58596 84758 49105 -10740 -50374 -76218
20191 -76218 -74750 12251 63706 20325 5218 -3025 -39341 6306 27421 36446 63258 57076
20179 57076 40669 10128 -10538 -39991 -16194 31183 4375 -5075 12906 -15618 -6552 9959
20167 9959 43457 31757 33049 11213 23315 694 -50872 -26357 3402 43968 -5442 -74363
20155 -74363 -42212 -7806 -43887 -56502 -21435 -14369 -25473 -16515 -7344 15912 22607 19062 25306
20142 25306 90306 74155 40603 13357 -5311 -34493 -5943 27692 -21269 -14963 14528 9185
20130 9185 21323 28898 33126 28000 25806 8937 10201 9648 52588 63134 40639 51702 40069
20117 40069 41238 29925 38174 35381 35652 15978 3650 2731 5999 18738 9154 8380 -14527 -18475
20103 -18475 -21876 -4870 -5258 -11049 -12121 41731 78235 69851 33737 14567 781 -5207 -16649
20090 -16649 -25456 14354 17612 33581 45243 45127 28762 12510 29743 64975 35303 -16623
20078 -16623 -15428 -10600 29735 39483 18439 -5525 -20274 -33359 -58450 -68098 -17750 13799
20066 13799 -4247 3494 32328 87735 105385 58069 15427 46707 70448 51544 44367 9458
20054 9458 -724 -35241 10964 1044 -30783 -1076 -8467 -1623 14066 39276 26567 6763
20042 6763 -14194 -30868 -5433 8805 22593 31149 11408 7276 -38984 -37119 -42425 15757 54052
20029 54052 28890 23417 73962 54558 63586 28170 4190 -941 -45811 -46735 -1654 19218 21080
20016 21080 31686 58465 74404 41580 43277 -3810 -17822 -37191 -48326 -22757 21655 26629
20004 26629 11192 -75717 -74419 -38090 9806 89656 95678 73413 59127 40679 15683 9584
19992 9584 60344 94422 96836 91315 128069 126196 62082 -2209 -23038 -23866 1732 40137 29628
19979 29628 -12908 -31025 -16871 519 -22007 -59034 -44038 -6439 15985 -1179 8848 5218
19967 5218 -12416 -32653 10254 -2466 -68362 -81622 -72034 -27297 42460 60524 66612 79458
19955 79458 85685 93672 57747 57228 30042 -11410 17158 43559 18171 -5801 -15264 9120 27135
19942 27135 12719 19814 44303 45508 -28753 -31620 6086 16776 49019 88022 73007 112483
19930 112483 111216 66782 53518 61128 91386 70664 45709 40833 22401 -19713 -31734 -51757
19918 -51757 -23830 5146 20037 -5203 -24470 -9133 4446 7558 23274 13321 3246 -30475
19906 -30475 13119 19004 37779 45662 29503 25250 6291 -32442 -20056 -48830 -45059 -20864
19894 -20864 -35156 -42247 -9839 3865 -3874 -824 70094 54955 8972 -47593 -52564 -45523 -39508
19881 -39508 -35831 39361 66236 48075 47063 47311 17704 26680 33153 38556 26377 19276 44630
19868 44630 63253 34852 -22727 -44428 -7953 16031 -8882 41633 59168 31340 14907 13848
19856 13848 13521 16186 -15 -54787 -79698 -71322 -41719 -3203 12016 63674 71176 -25303 -78950
19843 -78950 -69677 -89215 -67124 -24761 -193 1337 63647 102335 107814 94069 82220 77085
19831 77085 29314 -42573 -31792 -15270 -35086 -72158 -86525 -100440 -102619 -82395 -67458 -22197
19819 -22197 7204 1072 -3585 520 9356 35046 38240 9245 -3079 12272 16660 36587 12359
19806 12359 916 14862 -23463 -31616 46430 93827 104597 121284 84052 25213 -3605 -13074
19794 -13074 -10284 5428 -26128 -25058 -6094 -863 -18436 -18781 -43183 -48926 -33453 1614 10720
19781 10720 32717 38391 -1447 -4727 48431 42366 8588 5729 3878 -16130 -16347 21416 -2345
19768 -2345 14149 17149 3862 5530 -2506 -27411 886 32781 47605 91695 70737 43855
19756 43855 47504 32181 -19 11116 -3793 -6926 -26295 -64821 -70864 -60964 -4675 71669
19744 71669 35932 21492 -37733 -87302 -47604 32877 39239 38326 37368 41533 21763 12233 -2586
19731 -2586 -7983 -7988 -15277 -8715 30413 54295 41005 52442 29756 -7148 6437 25028 7608
19718 7608 -6248 -39984 -44406 -56118 -1008 769 -18213 -2558 44430 53527 58298 23497 -8416
19705 -8416 -12539 -27422 -13967 -12322 -6249 43182 85243 60736 73893 103474 124697 92799
19693 92799 92684 72412 44432 24277 34484 77671 100477 70201 63186 73941 53066 37040
19681 37040 46119 10291 33287 39740 7530 -29430 -6604 64062 52630 46299 17335 -2678
19669 -2678 -4645 -39773 -79541 -45968 -6425 17600 21699 41115 15151 4940 19848 58154
19657 58154 64238 55053 -6562 7456 64771 71049 11761 -20907 12497 30382 31508 35410 33314
19644 33314 51451 45595 58057 38272 -7174 -3505 2183 5602 16127 53638 76845 47382
19632 47382 34345 44846 64726 73900 74510 11947 -14626 -6762 -1449 6703 -6326 -14530 -19036
19619 -19036 -43009 -40365 -7465 4794 42885 74988 98956 93483 46870 6580 3021 36934
19607 36934 36483 23440 -13469 -8976 -26771 5893 20074 18445 4805 -23640 -62061 -34176
19595 -34176 5879 44669 68783 91552 94570 26743 6043 40713 46224 19590 32202 32316
19583 32316 19104 20615 46227 23849 1839 6480 13536 -15001 -54523 -19646 -24697 -35959
19571 -35959 -54850 -1845 60094 43914 79663 67040 78216 52111 9116 -18406 -22481 -35841
19559 -35841 -22751 10627 20091 9562 -9656 19827 14683 -14114 -20882 4054 -19415 -19788 -9026
19546 -9026 -2509 18622 57314 50773 32154 61534 -21646 -50479 23733 21015 7681 31571
19534 31571 29436 -669 -4130 -6326 20333 -1571 -13478 19511 55089 53599 50817 49642 50958
19521 50958 5270 -23512 -29468 -12861 7708 4212 380 1227 36469 55698 53872 68852 48756
19508 48756 39849 -5566 -47304 -50948 -50801 -75328 -37686 -19221 -3003 -5089 5878 37807 52316
19495 52316 60990 45717 12925 43965 43937 90597 114602 128749 114134 60885 44361 24508
19483 24508 63760 91320 65261 65870 25225 65594 75731 46508 -5583 3831 -14627 -10851
19471 -10851 5004 -12930 -15218 12408 28448 33958 25894 26008 7807 25460 16833 15881 9470
19458 9470 29547 54497 59665 29244 32248 39515 61429 70026 71853 87083 96000 96213 71084
19445 71084 36558 17904 -20722 -27414 43390 96171 117247 121596 101540 109953 103129 121432
19433 121432 119722 110363 83279 77370 58205 64832 95176 92293 83520 71002 63634 43170 47456
19420 47456 41959 54033 65735 93188 132752 163873 242350 252361 276532 301655 254774 236148
19408 236148 272006 274299 222829 191489 179704 228103 246127 220538 221734 217768 218791 222451
19396 222451 208955 189395 164138 138702 127185 142186 141016 105137 101879 122833 96832 69444
19384 69444 21759 46286 100869 129900 105120 99816 80923 77573 70656 96305 124225 160870
19372 160870 161700 159924 176546 221604 288818 315484 341875 373447 367110 323947 324623 346523 369668
19359 369668 393273 411580 399520 357634 289627 200710 186323 228446 205539 151458 112814
19348 112814 121124 116990 111179 124630 107822 135362 105721 104675 118432 109892 101276 119919 116336
19335 116336 93515 68540 111977 116221 117069 114886 103475 82168 44541 87690 107711 138428
19323 138428 177404 189825 208572 226632 241390 249158 258532 229600 192790 197295 198669 177559
19311 177559 158040 163583 167509 154557 152341 123323 61467 66105 38128 53273 74554 82233
19299 82233 93857 80526 27085 6738 10207 16914 18443 64587 96319 86609 77295 45217 41649
19286 41649 -9033 -30622 11991 24445 16796 1434 32030 -5310 -24762 16915 10956 24778
19274 24778 55465 36650 14 29785 31756 38323 21691 2816 -2643 8164 31211 57510
19262 57510 30443 28381 62911 79727 80080 107558 114015 82340 -12293 7054 77472 106395
19250 106395 95416 127593 167666 159702 81327 58512 63861 54601 81921 87314 69003 89441
19238 89441 59663 39518 37202 74896 76728 80015 96060 97916 74212 68379 79490 87512 69039
19225 69039 28045 19966 34683 40295 50552 88865 126230 186503 162221 159237 112197 87284
19213 87284 79762 67575 83030 125278 130118 121728 115181 81315 86075 95753 105336 102489 84975
19200 84975 76407 123588 136499 151628 179434 115228 104463 134951 142056 119108 93466 57314
19188 57314 37149 71735 109233 136630 138441 124756 101802 101187 114334 91911 50300 22995
19176 22995 22351 75677 94405 149396 164950 108310 123078 140679 126421 143762 116725 70872
19164 70872 44543 77664 104912 81858 52783 75213 85692 72613 81117 75377 68806 87170
19152 87170 82336 94852 85230 120574 181929 160141 142724 142278 135133 164180 177765 160746 168772
19139 168772 176348 168892 144292 155024 159617 123540 109273 85611 106921 124481 143991 146785
19127 146785 111506 82274 64808 57463 87524 121719 145496 129123 132203 132373 167674 148799
19115 148799 100761 98882 79398 73247 75609 98385 152949 160214 162809 151995 141305 153693
19103 153693 185380 211099 211922 229042 222285 188078 133914 122850 107833 110882 178731 178100 151466
19090 151466 135465 96873 68097 68491 106977 156437 180095 197535 209076 198685 186353 189177
19078 189177 165291 151365 155304 165838 186239 227985 244711 233666 181915 150754 181219 191167
19066 191167 203354 210430 201133 156608 159942 160466 175744 182536 173359 239161 214448 217273 220420
19053 220420 194332 192394 252051 285177 304721 317842 378417 439479 471663 439105 422007 431388
19041 431388 397743 320576 290269 277042 256881 251169 284334 308786 330791 364073 393782 361958
19029 361958 346732 411520 482217 504684 483896 512351 534418 492800 426581 385579 363340
19018 363340 323885 301778 271945 290999 346175 376622 394652 386856 390453 397333 418188 422549
19006 422549 392910 449149 503977 580183 669145 811082 1015404 1258072 1619994 2031368
18996 2031368 2274769 2314347 2161184 1860167 1485854 1179436 1002123 860752 755868 735756
18986 735756 692213 652556 669138 665084 723943 787530 845571 1038194 1275253 1535896 1937731
18975 1937731 2323905 2545349 2488015 2204627 1859390 1510217 1249008 1094258 975165 893489
18965 893489 851378 803512 789097 764224 699177 699787 710141 742404 778567 769823 755014 836282
18953 836282 946919 1053308 1251997 1476380 1702065 1843624 1867480 1881274 1856538 1967309
18943 1967309 2175297 2243256 2135399 1915652 1682984 1517634 1373140 1336663 1358965 1387040
18933 1387040 1425589 1461655 1518506 1618900 1753094 1885112 1960353 2055571 2128013 2225572 2366580
18922 2366580 2524033 2716281 2896368 3087722 3287970 3528165 3784087 4211023 4752543
18913 4752543 5452534 6384563 7706242 9543150 12235445 16285656 22233191 29706596
18905 29706596 36227517 39516536 40441821 40401040 41542634 45611365 50161826 50467465 46401672
18896 46401672 39439117 30936809 23484667 18232080 14765834 12421619 10787783 9549896
18888 9549896 8592015 7961575 7571038 7314898 7119146 6952826 6845563 6875999 6953335 7079576
18878 7079576 7386844 7756974 8232301 8865323 9834219 11212834 13232235 16159951 20242645
18869 20242645 25255850 29893923 33229029 35765901 38580237 42978680 49124041 55045827
18861 55045827 59453431 63464314 68131078 72055805 73215466 71945968 68757827 66135222
18853 66135222 66245498 66884796 63815565 56844971 47386741 37063495 28373886 22261255
18845 22261255 18100725 15204016 13121448 11623276 10633404 9912873 9309902 8728403 8150464
18836 8150464 7605777 7193450 6954927 6708343 6493350 6324389 6201542 6071810 6039546 6134867
18826 6134867 6314797 6597378 7002964 7703602 8793117 10360396 12760768 16330977 21379887
18817 21379887 27387295 32517619 35545489 37267597 39122933 42360263 46621627 49046764
18809 49046764 47826730 43775231 38623347 34407895 31672691 29177041 25842523 21831491
18801 21831491 17572180 13798379 10892445 8768528 7228390 6145149 5370274 4789752
18793 4789752 4311030 3849843 3462998 3116972 2841267 2622031 2413304 2230917 2037433
18784 2037433 1900186 1762446 1677312 1611454 1524396 1376999 1261162 1224691 1157619 1055407
18774 1055407 983990 959402 929092 896029 810345 756392 709209 689968 654827 644384 624043
18763 624043 603559 574959 543062 565542 570163 539411 512962 497765 465065 397314 403556 438156
18751 438156 401619 384872 346437 330391 330026 259649 260767 272617 273935 245907 245226 262582 296700
18738 296700 294618 301725 276579 271776 227529 165895 179898 211050 230924 218937 210249 224866
18726 224866 248438 263520 249906 206104 178770 178088 185898 189485 150203 173812 213340 211722
18714 211722 171775 159824 182773 198426 199109 200527 189104 183022 189970 202665 218611 252328
18702 252328 268197 258706 221953 186148 182315 184645 183477 197887 175526 171757 164465 164177 190964
18689 190964 160640 111602 109603 98010 94471 112896 139683 150764 143246 128795 120223 75654
18677 75654 45912 55598 60177 67138 123759 138754 184862 248029 193145 104193 62473 59033
18665 59033 83880 114768 107848 129719 106012 100717 105286 110756 168071 235670 275197 281467 278715
18652 278715 226992 204552 242328 255174 257527 307153 341409 357125 299092 252576 225508 216889
18640 216889 180655 151413 135562 138859 162599 191393 184766 144489 130186 143187 212699 263359
18628 263359 274045 305552 340661 314601 264997 223833 223132 240766 266532 249922 236805 212991
18616 212991 197428 206442 189629 173535 136041 140582 178088 161238 118788 162315 249632 309608
18604 309608 360915 406933 399687 347232 329439 358524 428176 478335 496466 437535 381605 346475
18592 346475 313871 278025 272905 277750 319540 302258 275526 337011 387193 383825 397326 426978
18580 426978 412856 397162 382061 406772 400452 362139 337452 367580 384378 378702 395569 350858
18568 350858 293766 284659 276490 284900 288382 293298 288021 260912 258882 260789 232698 181382 176449
18555 176449 187793 221083 260429 284158 309596 306986 300752 300344 296717 283046 272245 201165
18543 201165 211197 315256 375678 364546 377572 393413 394280 403536 372947 359825 378456 390520
18531 390520 375887 411185 446777 482618 493400 475274 484862 538766 554985 554012 539396 535172
18519 535172 489393 466730 465576 478782 479060 481427 492237 480393 510185 561046 568009 611031
18507 611031 649149 649651 714499 772762 866663 941266 998169 1042216 1143653 1258578 1379305
18496 1379305 1528378 1678124 1839358 2019545 2124309 2259808 2378804 2472661 2581847 2642402
18486 2642402 2763929 2849081 2983676 3168794 3429293 3811385 4297256 4902529 5691388 6670070
18476 6670070 7959291 9724754 12071917 15367402 20153870 27032597 36284327 47150827
18468 47150827 57526684 64645596 66273944 62227100 53974166 44035194 34706922 27284644
18460 27284644 21972554 18489099 16373726 15378573 15328584 16275079 18361466 22007198 27705903
18451 27705903 35914234 46259416 57108593 65789241 69463113 67110002 59530202 49042767
18443 49042767 38384148 29266624 22324779 17374160 13872545 11402620 9546373 8139201
18435 8139201 7019374 6153922 5481644 4964970 4538729 4162199 3851239 3575014 3337854
18426 3337854 3163664 2973766 2819962 2673492 2549147 2449127 2364050 2190428 2034424 1870703
18416 1870703 1705572 1577200 1430308 1280263 1188462 1128148 1046627 997437 951699 895075
18406 895075 878820 832769 766758 752029 739171 736494 706592 685414 690726 705945 681551 649532
18394 649532 707503 760898 801327 784083 769123 771001 780811 744032 687468 679055 692976 666068
18382 666068 605483 552021 530574 487613 414497 371227 328207 276399 324397 331318 271312 274651
18370 274651 241650 222633 224406 243742 236933 224119 256639 254127 249241 294344 277400 297531
18358 297531 314279 327476 336445 361099 340334 353128 372915 392144 446515 477849 440618 473397
18346 473397 485814 403215 378595 406813 417222 411711 412673 397681 367056 307118 283560 287629
18334 287629 280139 262667 220549 144934 143160 162300 194750 200014 152118 161959 170354 160140
18322 160140 151988 201552 229866 230962 202506 196810 200121 185277 170567 162461 151324 144598 178608
18309 178608 227254 235059 234749 234594 306265 340812 310300 315604 326637 344764 317001 264790 225861
18296 225861 196256 221581 213847 218040 225799 209671 179648 168865 192928 183329 152134 126686
18284 126686 127564 133651 176832 211384 206452 193241 172761 163318 152959 184614 185844 170303 150897
18271 150897 129945 117874 111604 94997 61379 64311 36959 44430 51027 59197 38478 18948
18259 18948 73813 104962 103470 115601 114367 112964 87243 107500 164059 192050 185852 189621 172094
18246 172094 198106 221612 192454 201341 201121 174356 196467 230595 269964 352696 413866 529399
18234 529399 686991 867946 1047059 1198357 1191858 1101743 968104 834204 656948 477742
18224 477742 380846 338989 328257 330952 323988 305513 290463 254509 210855 204591 208528 213781
18212 213781 155256 148990 187014 215887 215598 222226 231670 246842 297295 323372 296175 249559
18200 249559 241005 236139 270879 299547 355009 345065 343938 360672 371803 447828 525193 595552
18188 595552 700296 845374 1084867 1308244 1511849 1658950 1695047 1692804 1729601 1702185
18178 1702185 1603061 1452123 1260132 1103476 988685 918218 869070 825830 796445 797197 798991
18167 798991 770060 720854 703707 684752 654098 661164 667882 708260 736910 777478 871194 965468
18155 965468 1029225 1151052 1222418 1215499 1259235 1308864 1336345 1364705 1387787 1409119 1435545
18144 1435545 1464144 1491781 1574241 1695420 1822697 1997838 2218272 2497864 2877349 3390760
18134 3390760 4064229 4857168 5793937 6981595 8598619 10982500 14529909 19794076 26618055
18125 26618055 33401232 38046478 39256510 36146541 30427393 23981828 18029659 13473820
18117 13473820 10375262 8310426 6885233 5835866 5071823 4426217 3914052 3532219 3271917
18108 3271917 3113154 2980987 2899157 2830689 2744653 2729466 2759368 2771338 2799712 2862558 2877328
18097 2877328 2900667 2898944 2929518 2953019 3036012 3144218 3346776 3574198 3847424 4241167
18087 4241167 4794541 5538387 6477964 7792820 9680149 12362899 16277905 21981181 29419209
18078 29419209 37103615 43591285 48043299 49995844 50820121 50550752 48783515 45107047
18070 45107047 39019120 31846165 24841879 18931321 14541696 11508919 9394942 7858642
18062 7858642 6730018 5844481 5151729 4607071 4138294 3810015 3596411 3430793 3279108
18053 3279108 3163715 3096442 3041267 3009930 3030562 3025812 2990546 2909746 2821603 2719043 2687755
18042 2687755 2661313 2652682 2595166 2630962 2742037 2916508 3136892 3512599 3991185 4627284
18032 4627284 5555898 6979215 9142109 12388490 17026489 22718180 27795849 30862742
18024 30862742 30810073 27337588 22306780 17072643 12598751 9326859 7166789 5722505
18016 5722505 4646583 3863133 3302741 2889898 2504558 2167670 1936454 1805240 1650271
18007 1650271 1527819 1428170 1315864 1216240 1153500 1099867 1079607 1042778 1013335 975732 929927
17996 929927 843636 759290 748336 733810 647108 549452 505776 486589 510415 472655 379098
17985 379098 314967 316034 331582 326537 354564 347821 332171 286107 272425 216572 241843 252592
17973 252592 218065 230469 208490 180432 167272 196203 191488 217528 232781 238544 282520 309668
17961 309668 329076 352254 343943 308463 333644 350100 344258 376735 366005 325124 237705 200888
17949 200888 197791 190594 142119 113239 90061 91878 100274 118187 172000 184103 129457 99569
17937 99569 131456 122443 86117 92547 100954 121972 137019 138829 128823 93645 58227 21201
17925 21201 7022 27485 67121 34645 32569 31750 13617 32753 19484 54709 91607 73302
17913 73302 79779 105393 118448 209225 258401 208744 212372 244825 235281 223881 216578 197073
17901 197073 180223 159141 119512 115363 78355 73555 111844 148155 110810 63210 63936 106783
17889 106783 148585 140808 183311 215777 258041 289588 307265 340209 368401 377313 341513 311396
17877 311396 264561 252282 211957 156020 139179 130452 129270 164918 232930 282975 333622 404728
17865 404728 416889 432274 448775 451148 422266 373765 312035 228146 184581 164165 197328 193186
17853 193186 146868 99428 56124 40789 95871 120947 86665 80244 40523 63310 114855 125379
17841 125379 114182 94084 93401 60957 11212 12401 14279 9636 19804 44511 61123 72281
17829 72281 75052 78463 41257 17846 40461 68135 38334 68931 52377 42866 28496 -8798
17817 -8798 -46279 -52535 -41294 -1147 51848 37898 26576 42003 56947 38688 20879 43014
17805 43014 55039 29931 14217 -16356 18537 51689 86410 108080 63055 47984 59143 71407
17793 71407 72075 59028 64813 86635 82740 66893 75452 62468 45376 64973 36651 41523 34669
17780 34669 10789 -13214 3083 71214 79917 58886 69260 74725 34974 51134 60713 24142
17768 24142 32962 89722 100170 34415 34565 87510 85498 110646 133928 123864 138658 128056
17756 128056 121366 122837 92197 46709 10294 68518 76139 95333 84480 65595 35638 37496
17744 37496 58773 53637 52753 97468 109746 92245 81868 94716 115832 149862 144401 155138
17732 155138 156710 161245 210987 204017 160202 147117 130012 128128 125029 87056 57267 75720
17720 75720 89265 105683 117183 143976 129726 118331 100220 111551 123764 90216 54813 58437
17708 58437 51946 69464 109410 141066 151911 139621 96449 75174 95369 102815 146974 160827
17696 160827 120716 117544 189045 211212 209028 193811 164966 174544 187846 163053 164313 169757
17684 169757 207465 223300 245947 250969 252162 251241 230485 204165 200685 242512 240902 253501 282089
17671 282089 273718 327690 339703 362277 396592 442475 453780 471856 455023 411537 421493 461619
17659 461619 484891 487177 494976 476147 504504 537440 586546 592559 615335 597022 682936 771071
17647 771071 838072 891697 932990 995466 1078538 1127017 1168624 1246821 1351883 1466169 1573165
17636 1573165 1656400 1715618 1779382 1895479 2062897 2264411 2429983 2588733 2789644 3049491
17626 3049491 3356572 3732398 4163519 4663335 5291441 6089257 7186238 8690087 10779155
17617 10779155 13893633 18644348 25944836 35915283 45265185 49859336 51143867 50894822
17609 50894822 51186082 53341192 53628502 49643669 43189493 34934989 27155711 21735152
17601 21735152 18500578 16986455 16842175 18141602 21102255 26390177 34504702 43629318
17593 43629318 49158250 50492741 49988683 49176178 50261512 51251245 48128036 42006574
17585 42006574 33925891 25377897 18670531 14121220 11134088 9099265 7735604 6682182
17577 6682182 5887080 5284011 4807351 4372626 3978516 3591658 3229058 2953456 2698402
17568 2698402 2508929 2377766 2231113 2044547 1901584 1779620 1734137 1686004 1624877 1532676
17558 1532676 1457293 1417716 1332896 1284683 1196931 1108084 1040904 952081 860089 799052 756214
17547 756214 735487 692454 626322 567182 574137 527659 467438 464513 421590 394518 442788 442082
17535 442082 399498 345304 333243 354778 341036 336763 314466 293532 312154 289306 286959 267002
17523 267002 244296 233530 245304 256435 276589 306258 320220 355092 379665 391986 388761 340479
17511 340479 289119 269898 226534 237133 259599 237536 300992 370668 432952 509062 619087
17500 619087 849719 1167577 1399250 1493241 1490992 1435592 1412910 1473834 1512670 1469540 1322312
17489 1322312 1086612 816789 578259 429840 391394 440247 443799 452350 483414 569003 730520
17478 730520 982776 1225643 1400145 1465824 1444704 1380973 1375234 1441600 1451822 1299115 1099431
17467 1099431 884264 659918 470152 355299 294750 259395 254055 221863 183173 166153 110290
17456 110290 89032 54539 49346 53653 47046 50650 47140 91780 119097 123703 105932 82765 52594
17443 52594 41214 23254 18365 -10629 5159 1414 -39789 -51998 -10397 48307 32781 50973
17431 50973 40431 47344 79721 83642 50830 -20813 -46145 -19318 -14561 -2162 -12174 -23276
17419 -23276 -16600 27375 22700 23607 16748 43488 59461 13461 -11405 -43993 -35872 -33781 -31407
17406 -31407 -12792 35502 66932 78460 69715 56053 64702 59241 38879 27308 11384 21420
17394 21420 69745 53900 16850 24467 55940 79605 36954 16207 37029 73891 78972 54488
17382 54488 29445 34552 11403 35370 39513 11010 -32793 -22335 -5440 -20381 -56869 -42271
17370 -42271 -32040 -9296 -2061 -24802 -51970 -41423 -42004 -39164 -30578 -22365 7639 2984 -16684
17357 -16684 5526 50390 42242 -11316 -22171 13808 3363 1591 -35952 -55877 -18630 -4666
17345 -4666 -10339 -18742 -18360 -40115 -52646 -24346 -8512 -26130 -37784 -15875 43278 62845 23786
17332 23786 24875 6316 -27340 -79010 -67768 -52067 -19557 16068 -9412 -7572 -18348 -6899
17320 -6899 6761 -25190 -38620 -27011 -32180 -33937 -67427 -94738 -87802 -67572 -66006 -52587 -72631
17307 -72631 -57582 -49604 -74674 -65965 -70503 -55380 -79087 -34573 39532 39992 33730 57344 46162
17294 46162 53549 4247 -28083 -39132 -18389 -26935 -7079 32173 -19244 -35395 -64860 -47647
17282 -47647 -7062 5781 9844 -10592 -15482 16744 -3379 -54972 -52467 -48220 -31286 -25961 -12574
17269 -12574 -25359 -33433 -40729 -39776 -59743 -69209 -67457 -53507 -1270 28044 35637 6637 -9042
17256 -9042 -49361 -103961 -89947 -91386 -65108 -37768 -41407 -68342 -88680 -100978 -96491 -62736
17244 -62736 -29662 9896 35227 205 -23476 3605 -14966 -36990 -62043 -74762 -52217 -62034
17232 -62034 -73238 -93857 -84869 -96489 -102263 -103684 -75512 -53792 -22443 -23421 -12170 31248 36936
17219 36936 -27354 -81054 -110847 -109724 -84561 -37392 -41580 -59455 -49357 -70731 -85205 -80159
17207 -80159 -77003 -103019 -115318 -110518 -97504 -91860 -52921 -9684 20137 38923 6663 -8140
17195 -8140 -37908 -50911 10481 7718 12258 31864 8722 -19706 -23897 -26863 -1585 -16741 -1144
17182 -1144 -17376 -73342 -84944 -58065 -10526 14926 3986 -24135 -1718 43586 25205 27847
17170 27847 46662 33232 3892 -37461 -40416 -31898 -32359 -45515 -35085 -18326 -16273 -2478 12153
17157 12153 15474 -10101 -69084 -62547 -36943 -12835 -5310 -24930 -62674 -35646 -34630 -54468
17145 -54468 -70540 -93840 -90354 -66908 -52321 -60943 -50855 -38774 -28173 7813 7221 9318 -3690
17132 -3690 -35137 -20835 -18972 -10519 -14724 -52868 -45500 -46478 -29349 -22799 -26438 -24146 -18582 -9138
17118 -9138 -29938 -44049 -21941 6736 18747 -10508 -36652 -22688 -17374 -25697 -19586 -12785 -1134
17105 -1134 -32787 -79497 -99740 -119081 -104917 -101617 -51117 4654 -7681 -56136 -84843 -81596
17093 -81596 -66456 -31077 -5221 2279 -25379 -39659 -68977 -66024 -34809 -21579 -38289 -19101
17081 -19101 -13072 -16192 -36895 -94459 -122315 -107941 -76954 -75449 -67442 -70002 -44250 -4883 18305
17068 18305 -5983 -30168 -30519 -32058 -42083 -29859 -21129 -49440 -62018 -19699 25133 34114 23607
17055 23607 26688 57221 88278 124839 128427 128751 189510 209188 205338 207889 213436 214108 217645 228243
17041 228243 221374 225295 230852 210395 177975 134370 116320 95221 113512 146406 181721 174788
17029 174788 172311 207992 256495 268937 261809 241555 183457 140002 148638 138120 88480 76481
17017 76481 76291 111298 119427 118710 90481 43820 -21369 -22645 -13020 -6743 -16723 -43772 -22249
17004 -22249 20572 41918 33665 66853 18102 -20476 14815 49025 54560 41259 39299 48298
16992 48298 36636 23594 29978 40513 75090 49261 29564 23108 4888 -33876 -66199 -89792
16980 -89792 -63877 -40202 -41297 -14319 -12217 -79142 -67063 -36527 -49415 -94819 -129534 -117365
16968 -117365 -46603 -10753 17055 2604 11882 38849 41906 196 -35722 -32052 -33088 -86332
16956 -86332 -122945 -85617 -54093 6392 17307 -5214 -23507 -22638 -40894 -47547 -68335 -85848
16944 -85848 -66551 -28030 -11984 -5659 17585 -3610 -10064 -25964 -66227 -77786 -38645 -21771
16932 -21771 -35971 -36000 -24733 -24746 -46889 -71823 -34950 -37851 -25940 -21833 -50190 -54376 -42725
16919 -42725 -10813 13291 26357 32130 41232 19550 9940 22925 38645 37980 13004 -19478 -38483
16906 -38483 -30806 11091 3368 -10044 -2415 -7526 -27067 -23579 -669 17071 23875 19254 18955
16893 18955 -7597 -64607 -61034 -49598 -66700 -90581 -55915 -78484 -117885 -61789 -9422 23886
16881 23886 -18106 -28103 -37065 -37296 -64041 -67701 -54589 -28192 -5389 11053 -44978 -56872 -52345
16868 -52345 -16888 19738 43466 36745 32380 5861 -27175 -52285 -46406 -33342 -11546 -11976 55038
16855 55038 78988 59117 36991 13617 -17960 -28709 12018 27241 15870 -35774 -48795 -52570
16843 -52570 -67361 -41039 -37941 -37586 -19440 -46193 8018 74873 74400 40956 28317 11960 28854
16830 28854 30452 33352 26254 2186 -19410 2120 -13196 -39517 -74317 -37357 -41977 -72656
16818 -72656 -53561 -34280 -16423 -8112 -26121 -60214 -28894 -55044 -56475 -16511 11267 -3502
16806 -3502 -41504 -31630 -35638 -28335 -28220 -3658 28313 58437 11216 -10656 -52099 -59812 -47448
16793 -47448 -24224 -33889 -37186 -71825 -111474 -69038 -7203 24943 35695 25488 1246 -34881
16781 -34881 -31007 -13168 -6584 13437 60415 36983 23527 -17167 -58711 -40206 11725 6728
16769 6728 -31646 -43331 15227 5845 45161 51192 21608 -3981 762 -3040 -49811 -104240 -88438
16756 -88438 -46065 -30501 -31471 -60502 -78486 -86858 -92507 -67899 -49098 -38983 -68762 -45953
16744 -45953 -5193 28480 1540 -50428 -47476 -36705 -67230 -81884 -88633 -87753 -51454 -14164
16732 -14164 10819 -15661 -18769 -36219 -45737 -35955 -28112 -31391 -18765 5014 38552 34643 61816
16719 61816 9362 -15504 12582 27570 -13390 -28726 -15550 -14241 7194 49440 48368 47492
16707 47492 52854 32127 1739 11038 25409 42526 69748 57893 22354 -3060 -13549 -27807
16695 -27807 -35559 -22942 -15072 -54561 -84018 -36744 19387 -1362 -30377 -9614 -28867 -44454
16683 -44454 -9353 22131 40768 30408 36332 36622 27094 -8946 21538 967 -20870 -7393
16671 -7393 -78604 -93657 -77802 -42070 -49558 -27328 -18954 -38018 -69230 -64060 -65853 8140 1022
16658 1022 -23716 -3722 631 31459 59912 559 -26750 -20368 -35954 -51545 -79543 -76803
16646 -76803 -44175 -23387 -26693 1851 -4667 -9860 15771 18492 17317 1375 -6971 -47910 -105720
16633 -105720 -85181 -118340 -122018 -124997 -66064 -17027 2721 -26896 -61886 -74911 -100197 -77766
16621 -77766 -53540 -53024 -17914 3661 48594 59293 75748 44936 26741 17113 -3874 6036
16609 6036 -34510 -57259 -11196 17305 41074 26937 9416 -11872 4576 -4847 -29662 -35847
16597 -35847 -15881 -27560 3471 1335 -12676 14084 -42881 -67552 -94724 -82874 -69065 -33420
16585 -33420 -26333 -3029 -17926 -41685 -72539 -82019 -44489 2441 24735 23069 16922 3847
16573 3847 -36811 -45902 -34724 -6467 17431 53790 9237 -34677 -35315 23602 27382 14603 18038
16560 18038 43115 30335 42049 5317 -16284 -52877 -35012 23296 44986 37126 -29456 -12113
16548 -12113 -8890 -8384 -46679 -52998 -103071 -137770 -91642 -41029 -31315 -29883 -27363 12933 19128
16535 19128 -9700 -12522 -29806 -17041 3752 887 -78427 -82227 -64880 -82675 -116407 -126778
16523 -126778 -55550 -6090 -2989 -24307 -25279 -12117 -17291 -4066 -1645 36129 86180 58130
16511 58130 40160 -17609 -34705 -42553 -39994 -30064 -45544 -45424 -9872 28946 58749 -3482 -11605
16498 -11605 6185 -22712 -27031 12619 5441 -3473 15470 -12471 -17006 -4015 2579 1967 -15865
16485 -15865 -30401 -37433 1241 23370 12646 -31517 -11819 -14494 -681 37972 40276 54584
16473 54584 31723 23655 48594 843 -8393 -55514 -69262 -47450 -24711 -3442 38300 16640
16461 16640 -18816 -23679 -20412 -15724 -30323 -34297 18791 37256 24914 -19628 7549 15978 27891
16448 27891 13796 29681 23113 -8103 35107 17148 834 4962 -1317 -35373 -49110 -88363
16436 -88363 -68371 -23298 -34592 -8129 7086 22656 -607 -2023 -15233 1353 26849 12803
16424 12803 -13896 -29336 -52447 -17646 9187 22926 -14946 -70190 -56510 -44578 -38929 -54996
16412 -54996 -86364 -112816 -92465 -89137 -55705 -4799 -24733 -73009 -66330 -70155 -50284 -13916
16400 -13916 -7378 -25208 -14960 -24558 -39626 -66459 -45586 -19811 -40926 -48000 11651 51590
16388 51590 29821 -29821 -38890 -53853 -63301 -49292 -14265 23286 7555 7418 5346 -9466 27524
16375 27524 33030 11156 11929 -8781 -16841 -64998 -116919 -95580 -32184 -30673 -33094 -52344 -64408
16362 -64408 -92500 -56992 -19663 21796 12098 3127 10710 13776 20479 48454 65255 51973 22866
16349 22866 -7693 -3722 31455 29826 -1072 18242 39727 39459 29702 -3649 -36522 -43982 -42421
16336 -42421 -20097 -15158 -40341 -27494 -33447 -18786 -366 10263 31102 57886 51488 72084
16324 72084 63127 71827 36109 3712 13809 -3740 -2405 13143 15436 -4820 7985 -5200
16312 -5200 -41890 -48691 -62407 -33342 34200 18688 -30829 -39309 -10924 -17968 -50949 -60545 -38692
16299 -38692 3430 -40382 -83819 -77845 -69984 -48165 -89095 -64805 -57020 -54980 -42387 -35562 -6103
16286 -6103 782 29581 30311 48827 15011 18082 63145 29959 -48246 -42195 -42439 -33875 -39815 -28929
16272 -28929 -19814 -15224 1640 529 2054 48224 27168 -9993 -35922 -21869 -16441 -39851 -35515
16259 -35515 -63962 -87986 -66790 -22847 -20402 -26806 -3452 -3780 2957 1215 13736 30229 33305
16246 33305 34008 -33222 -16065 19965 16343 19076 -27955 -20170 43257 44964 72717 44281 51205
16233 51205 40472 32341 12077 -32968 -60566 -47554 -35345 -64027 -66799 -36131 -41042 -39349
16221 -39349 -2637 11852 12474 -16104 2500 28275 51006 55091 29647 -13971 2788 33245
16209 33245 7243 -23688 -32827 -41280 -46083 -53906 -17686 -23104 -11988 16667 18313 25034 34752
16196 34752 20055 -972 -28752 29230 39556 17107 -11345 -148 -13311 19420 51428 10863
16184 10863 -21641 -32762 -32601 -13138 8019 -15321 -52037 -66890 -31561 -43705 -78255 -81286
16172 -81286 -60983 -77673 -51411 -40174 -5840 8436 -6862 -16853 -42411 -43862 5911 -1017
16160 -1017 -14938 -16255 -35581 -75568 -78139 -64849 -11810 40261 8334 -11945 -32510 -22534
16148 -22534 -1340 24743 16618 -9755 -18013 -26587 -37310 -46269 -25280 -25634 -48320 -59282 -37952
16135 -37952 -51846 -50696 -18768 16141 42303 38711 -21555 -25950 34624 40187 64947 50199
16123 50199 -14208 -29908 -28273 -6451 11113 12614 -9999 11169 20787 2250 -19391 -38368
16111 -38368 -70256 -31780 14617 31818 15797 1091 -16151 -4598 -10815 -6462 -8951 1026
16099 1026 5145 -7439 29783 -1671 -33467 2000 19551 33135 18635 27637 20446 -1444
16087 -1444 -13608 -21663 -23041 -39542 -22543 24397 26646 13083 -3780 -38672 -24480 21959
16075 21959 63819 106091 101367 53057 10615 -23467 -29880 -33784 -38847 -20853 -23222 -36540 -41546
16062 -41546 -49584 -10381 11705 14134 -4078 -23119 -54886 -33796 -51793 -94072 -75225 -23380
16050 -23380 -2474 -17727 -8833 -11290 -46700 -74793 -35391 -56303 -36585 -9932 -44316 -94334
16038 -94334 -70684 -9274 -385 -26235 -25336 -22042 -15547 -23126 -19374 7981 -28289 -46487 -71302
16025 -71302 -21834 23008 43653 68624 46885 11216 -35723 -60945 -72077 5253 18949 15020
16013 15020 9440 23084 37408 44735 21855 -5851 -20668 -44975 -20595 15786 -10525 -40755
16001 -40755 -38288 -38861 -64486 -81530 -49189 -59875 -64831 -38102 -54050 -31511 -39670 -67070 -101881
15988 -101881 -118625 -101528 -74337 -53471 -1241 -25873 -63833 -46349 -32401 -47813 -36036
15977 -36036 -74815 -39095 53084 78816 56662 57853 19809 -12055 -6282 33210 59060 45839
15965 45839 11046 1992 17439 46066 41500 71284 61729 51979 27923 -29836 -62203 -41246
15953 -41246 4709 4500 -20679 591 -30205 -60402 -63211 -58586 -30629 -44549 -89274 -49426
15941 -49426 -49556 -59350 -36290 -62623 -44784 -40618 -36602 -30206 -48838 -63173 -44730 -12146 -13674
15928 -13674 6656 10025 22679 11819 -27862 -52958 -41803 -48695 -14355 32761 68712 42818
15916 42818 770 -28440 -59343 -45072 -8933 -30347 -23508 -36825 -61110 -58802 -38197 -43216
15904 -43216 -56271 -59783 -52342 -20428 -3913 -30351 -90731 -101053 -43713 -2958 -35194 -84046
15892 -84046 -55244 -47524 -34514 21523 39250 17209 -15958 -47974 -51160 -66670 -67739 -65850
15880 -65850 -52586 -78892 -62116 11970 76 -41970 -69200 -65951 -491 38966 9406 1325
15868 1325 -8386 -52558 -83122 -78322 -78314 -83732 -63409 -36120 -27119 -26884 -36193 -50197 5861 55376
15854 55376 394 16364 19376 -15022 -40709 -64620 -47868 -24117 -56721 -67377 -82004 -46462
15842 -46462 -12883 -34968 -59321 -45366 -58900 -64936 -68792 -37850 -23605 -25517 -26991 -23562 -20734
15829 -20734 3241 -1652 -2241 34351 48160 49791 6198 -21651 11982 15878 -13959 459 -28263
15816 -28263 -28698 -12875 -20716 6114 59378 40509 -30237 -52342 -1903 24401 29925 16707
15804 16707 8504 30234 30484 28819 38843 22758 -5880 -9459 11565 22859 24851 -10302 -48908
15791 -48908 -14261 -18711 -18044 -8493 5899 13137 8049 35415 68236 59555 31376 66547 61796
15778 61796 47942 4097 -51040 -1583 20621 5442 -44568 -66303 -89046 -95161 -84291 -60332
15766 -60332 -19636 240 36101 64156 81490 39690 58662 34438 -6457 -48126 -45775 2819
15754 2819 32957 20967 14539 17535 25822 6429 -31791 26544 27335 -38979 -35624 -15215 28345
15741 28345 19573 -1226 3910 -1184 -53533 -63184 -15159 -26378 -12405 -9432 -23627 -3567 -1825
15728 -1825 24128 26557 29925 -353 -21545 3551 26048 -16625 -22263 -26247 -12817 -31451 -60237
15715 -60237 -67933 -64464 -54295 -58548 -18769 -4426 -30611 -39284 -3063 1080 15740 -5401 -15732
15702 -15732 -23825 -69544 -54255 -55332 -66735 -44694 -24411 -6570 47922 65136 -1556 -5306
15690 -5306 23627 29944 -20170 -89858 -110830 -95282 -41417 -46516 -74775 -53305 -50543 -31299
15678 -31299 -11019 -11325 -16532 -40203 -80181 -65411 -22767 -34442 -47511 -35273 -64478 -80075
15666 -80075 -64785 -54560 -18035 -41595 6393 47844 30022 5504 31356 55384 17882 -5690
15654 -5690 -29441 -55832 -60531 -42599 -46403 -91440 -93732 -56627 -32884 -20850 -26375 -16236 -33890
15641 -33890 -42957 -38317 13724 22160 17229 -9269 -15586 -10972 -27479 -24919 -19843 -14960 -13109 -27320
15627 -27320 -8666 -7374 -5481 -6581 -4737 -33134 -86749 -76858 -40779 -13956 6873 26001 34266
15614 34266 36324 37505 52981 37761 26047 19044 6559 -9351 -18721 -68185 -51314 -34213
15602 -34213 -5848 -8792 -26802 -17250 -14687 1617 6339 -26236 -31453 9778 -7825 -6651 -1754
15589 -1754 4583 19754 12724 -6179 -21933 -43289 -34748 -35911 2951 8881 7457 -15555 -15324
15576 -15324 -32689 -41073 20325 13020 35687 55292 39834 -6516 14943 37482 20493 20119
15564 20119 59988 41153 21775 -10192 -12454 7181 17546 1153 -29287 -32769 -49946 -57831
15552 -57831 -48102 -39346 -15490 -4982 -3470 4586 11668 3360 6452 43313 38778 20198 -17508
15539 -17508 -11691 11153 -23604 -79108 -102278 -51086 14257 50391 31578 14237 13232 1606
15527 1606 -12445 16338 16456 8179 37744 20560 -12505 -9948 5346 22390 97 37286 14174
15514 14174 -10827 3004 -14612 -6276 20087 11878 23217 31982 31298 33094 20184 4866 -13359
15501 -13359 11793 2189 -11270 -15807 -14022 -44409 -83637 -44589 16580 19323 -9956 -10331 6154
15488 6154 12329 -12070 15697 62275 86263 55630 9741 6921 -14772 -21253 -11578 -53967 -50818
15475 -50818 -16491 -4443 -29125 -65321 -49645 -39045 -16639 5661 39010 38553 1796 -24591
15463 -24591 -39506 -68073 -80923 -80963 -57390 -43546 -34057 -48915 -13397 21899 11723 12704 38949
15450 38949 68054 14914 -40320 -31586 -6827 4122 23991 15715 60448 23282 -6870 -25979
15438 -25979 -19330 23240 26819 13516 52866 31594 15934 73875 53805 44956 29668 10401
15426 10401 10534 44735 -12590 -74302 -105437 -41479 9701 26788 66089 62233 15870 29530
15414 29530 -6213 -34463 1089 30747 40947 79956 28375 -7885 30221 56709 38260 11423
15402 11423 -2541 -32324 -33504 -33145 -30421 -28341 -1752 24888 32344 42634 47209 58026 40380
15389 40380 829 -3473 -46490 -46149 -32136 -26563 -14895 -18960 11436 39947 67102 62802 61616
15376 61616 64721 39398 -5178 -17312 -5172 -2484 -19190 -24758 8781 -1555 -483 -4068 21873
15363 21873 12164 25023 -8456 -3624 23548 12542 19948 4458 20030 41429 44605 27017
15351 27017 -1103 -5310 -5117 65254 111065 125684 87551 45925 25501 47823 54297 -4979
15339 -4979 -19581 -33752 6762 41667 7401 12481 24698 13910 15056 -7252 -62504 -62332 2670
15326 2670 54576 61228 -785 -21724 209 15339 7447 -37144 -58888 -36547 -5555 10537
15314 10537 -17669 -38267 -28320 -23957 -12687 9828 4214 -56120 -64592 -45764 -7367 2230 27556
15301 27556 22701 -6357 -7318 3584 8476 45668 13152 20781 45070 25899 -894 -4843 -168
15288 -168 28810 48353 41166 28257 -2286 34381 24713 -10841 -8161 -1093 -7597 -9245 13180
15275 13180 34423 29615 -1912 -7025 -11641 -22497 16714 22999 9240 -25189 -45158 -15371
15263 -15371 15343 44330 48922 44586 20409 9211 4249 -20391 -12491 20205 35084 49441
15251 49441 24742 20809 19009 30212 22450 -1474 19380 56458 52151 60101 38806 -22927 -42051
15238 -42051 21537 36943 55071 32292 50034 46512 48168 74426 80256 60428 16563 -62372
15226 -62372 -33983 7514 7312 24222 54086 58502 30506 30535 11941 -29182 -5251 3737 38375
15213 38375 45550 54522 28891 25485 21295 9986 2641 24591 59467 55037 32170 31452 49152
15200 49152 -7078 -27023 -46581 -46756 -65408 -66208 -41106 -64486 -59739 -38293 -14433 -11973 -10432
15187 -10432 10666 -29708 -42556 -53506 -28622 -35823 -59044 -27278 -4312 -12029 11825 72043
15175 72043 49644 28257 1797 5523 -3241 -21482 -12808 -43440 -43070 -32231 -12002 -5844 -8028
15162 -8028 -6274 9779 21738 17402 -33049 -12050 42072 60342 56292 47166 19269 32068 37341
15149 37341 20670 -15976 -5337 32635 55565 77892 74982 54297 30576 32055 31317 85804
15137 85804 76406 76906 89187 67286 24839 25476 -4466 -20694 -25249 -8510 3072 19418 15231
15124 15231 13631 -10516 34872 31334 24385 55110 32823 -17734 -49191 -9073 5574 8937
15112 8937 12965 34311 9084 -10912 4182 -621 -18604 25586 31456 -4985 19527 63282
15100 63282 99620 67200 53767 20923 -8149 -26128 -15349 -16752 16607 26741 5379 30077
15088 30077 28565 -20523 -54778 -54792 -25431 -6205 9128 -23971 -25558 5662 22989 22720 14219
15075 14219 -12594 -19306 -1707 14374 31851 55516 65310 28766 -5963 -57508 -78651 -55141
15063 -55141 -51179 -90411 -68923 -33481 -47075 -46969 -3172 -26701 -32770 -59346 -55966 -16001 17964
15050 17964 -10968 -30308 -55421 -98872 -59347 -16795 -336 -11257 1321 -2897 -8177 5500
15038 5500 30643 26644 11684 6741 -21602 -35931 -54393 -62697 -57371 -35783 -24727 28975 54593
15025 54593 58507 12604 -47580 3458 61230 62964 -370 -38753 36957 53732 22308 -15724
15013 -15724 -54819 -52141 -27144 -17102 -1944 -2519 30830 18278 27626 58228 21366 -13189
15001 -13189 -14892 -70502 -87232 -65912 -47369 -55033 -29355 11087 38558 27532 -10522 -20273
14989 -20273 -1257 -10272 -31364 -29639 -1714 367 -11973 -78999 -107259 -77256 -34883 35162
14977 35162 3061 -19518 26977 14786 -15233 -35144 -8427 5116 -479 22941 -9321 -27459
14965 -27459 -19416 -25063 -24204 -6694 -19848 -41863 -44023 -6283 36155 24748 22 -24505 -14032
14952 -14032 14029 23391 -22412 -21418 7822 19677 -41655 -71904 -80340 -67867 -33722 14386
14940 14386 58806 58750 43845 29230 12081 21468 14435 3594 6328 15807 -14012 -44534 -23992
14927 -23992 14017 10729 -7297 -32303 -40558 -9137 -28707 -2918 7944 -42928 -41527 -53128
14915 -53128 -37310 -596 23820 33053 11425 20034 28920 9781 6225 2191 8785 -18871 -50701
14902 -50701 -96861 -85874 -61721 5071 28324 19392 14225 828 22584 19788 11455 30100
14890 30100 15109 -4564 -7105 11850 32397 27474 4563 -8779 25327 13325 401 -31175
14878 -31175 -34142 13525 11377 -16163 -45928 -34627 6135 25764 -5008 -22564 -1254 3161
14866 3161 -12888 -6538 19516 25703 -18585 -64129 -44343 -8913 -48296 -103543 -125293 -100301
14854 -100301 -51942 14542 57839 72162 37351 5586 -47781 -24909 38923 53859 36165
14843 36165 10607 -21095 -24261 -13813 -13913 -25432 -35522 -40003 -16564 23726 -3416 5566 41697
14830 41697 12460 -56251 -47691 -34615 -595 12631 42757 58893 68409 78052 76953 28441
14818 28441 7858 38029 48147 45671 52020 68288 51750 90819 99046 108572 104268 61718 57239
14805 57239 37794 -612 -9049 -11382 16563 36694 43007 40349 34004 -30987 -34185 -18658 14235
14792 14235 -30416 -72390 -31580 15078 38663 55400 89818 109440 77789 38190 -12114 -16608
14780 -16608 -61640 -88159 -76517 -18876 14075 22687 33952 -9026 -34701 -47668 -58254 -14895
14768 -14895 1764 15240 29951 25177 -17807 -37695 -59880 -39394 -24965 -42088 -22804 9245
14756 9245 16541 7946 -19619 1757 37194 24385 13516 4297 34124 64626 87664 78558 39084
14743 39084 38770 15603 11595 15130 -10449 -2955 -7457 -35290 -16396 24153 -7524 -13308 -30320
14730 -30320 -36314 -47362 -45278 25296 45028 -4666 -69279 -85403 -59755 -71025 -65911 -20476
14718 -20476 -7726 -23831 5048 2682 -17139 -21524 -17816 -15120 2125 -24371 -6525 -376 30012
14705 30012 24169 11198 -39280 -37187 -36806 -43209 -43565 -65516 -76976 -68772 -16390 -31953 -34763
14692 -34763 16646 43722 50277 50465 45297 40785 55511 1057 -22267 -17887 -11393 -17017 -37355
14679 -37355 -36566 -25021 1348 -30518 -33804 -45020 -5863 39775 58834 81289 59950 71982
14667 71982 64781 31059 18178 391 585 24865 -17388 -13573 -7155 61371 67073 63791 68271
14654 68271 42873 20115 47725 28063 -30472 -50729 -44767 -28411 -2663 58015 75973 82085
14642 82085 66927 52671 34695 61571 75888 35156 3855 -6997 -13296 -26016 -11085 26864
14630 26864 33149 48428 75670 73419 50339 77653 66448 89157 74196 37399 58044 65946
14618 65946 38046 -2565 14342 13194 26626 14411 25881 81777 100238 95148 64166 14789
14606 14789 -11999 14845 18631 -39942 -48686 -8020 7009 27805 24710 7592 -538 9688
14594 9688 16981 15121 -31271 -35362 -26941 -10418 4643 16255 9247 -30027 -69437 -97423 -76773
14581 -76773 -52975 -21227 -6326 15787 25607 9978 13407 16282 191 21578 17 36890
14569 36890 87981 109069 60850 24405 -6064 -68151 -29418 10235 8532 11320 34271 43093
14557 43093 27003 17906 33105 62098 41095 22699 28361 23740 42434 66258 90140 98343
14545 98343 66256 28785 33117 29410 43401 61031 28763 23732 1339 -1309 11924 -17776
14533 -17776 -51497 -76380 -36460 -47856 -31818 -10860 8107 39583 23919 44946 1178 -16139
14521 -16139 -18603 -41120 -68715 -27942 -30955 -23460 8449 757 -7579 23475 17124 56647 53301
14508 53301 7899 -36025 -19010 15483 5546 -23665 -72116 -75979 -16105 43488 39735 31635
14496 31635 1223 -26008 -41785 -25275 -1845 5821 53047 62777 75287 78063 14929 -29807
14484 -29807 -11012 1044 -17065 -7290 -20183 15334 65681 54516 33256 18037 28778 18598
14472 18598 18699 18461 33357 -1674 14457 17710 -12087 9113 9503 -21440 -15351 -28460 -41060
14459 -41060 -9666 17067 12722 28676 39845 40562 18614 31952 43732 49157 602 -41088
14447 -41088 -55382 -30484 -49945 -25952 -11411 -73 -6134 -35123 -28931 -12654 5818 3636
14435 3636 37282 61103 14924 -13467 19661 18043 -24772 -14564 -2998 13815 34892 11255
14423 11255 -42890 -47024 12268 87031 68017 70796 66793 92624 51801 30471 35065 41482 41430
14410 41430 28226 521 -8259 -39625 -7343 49323 43779 13687 -11551 10852 35525 33689
14398 33689 -259 -30554 -35688 -23810 -22635 -39596 -51713 -15675 13521 31715 52220 32058
14386 32058 2987 -2907 970 -37298 -56578 -49890 -81965 -27822 -6559 17039 82292 108262
14374 108262 67402 9165 -7713 20294 7780 -22586 -32096 -24574 5763 -21114 -32140 -10976
14362 -10976 -38889 -53228 29469 41800 -9804 -19516 9153 39984 33580 52738 54000 88330
14350 88330 116495 88361 10969 6031 30364 33522 -5389 -15878 22634 71308 124183 133968
14338 133968 109568 80265 86016 24552 18768 32191 37401 6263 -7080 13412 3949 -22866
14326 -22866 1388 48251 36419 7165 -25884 -7932 -2425 -41852 -28416 -2192 -32380 -36482
14314 -36482 -21201 18869 72609 69638 33801 54698 -1111 9555 12156 22539 57837 25179
14302 25179 49837 26229 -12571 -26346 -12666 20796 60531 78353 70710 52995 48131 110011
14290 110011 69056 -1525 -2674 28027 96654 122334 88820 45835 15812 32130 55907 41048
14278 41048 18134 -6919 -30121 -66053 -42364 19546 19290 49154 58976 52062 16496 -8332
14266 -8332 -31907 -22634 -5516 -2830 -16277 -15557 -10455 -25208 7008 60643 52554 68906 78258
14253 78258 40159 48774 41509 57941 74074 40874 24630 31127 15947 -10667 -12809 -12565 -26832
14240 -26832 1121 32496 36940 52502 44048 44554 64120 72250 94450 91565 111229 138679 128734
14227 128734 114233 116063 64868 31821 12022 -15026 23224 64092 85540 91477 66730 51040
14215 51040 46924 13446 26 -4479 24133 21991 23102 59905 57759 3215 -26947 -22901 -33587
14202 -33587 -16257 721 -10964 -31171 27218 71178 87545 59543 36444 60853 66693 19386
14190 19386 18575 74154 71503 68761 68375 81138 85039 46218 35074 -17083 -58902 -44519 2616
14177 2616 50044 48820 -1243 -10645 17042 51754 30614 28892 29605 -13266 -15886 -30729 -42260
14164 -42260 -40813 -22092 -1350 28802 24931 23754 11429 -26233 -24254 18798 67839 81612
14152 81612 74748 69956 82714 71765 46973 9856 -17100 -39406 -33365 34747 50700 59898
14140 59898 78348 64356 25763 34637 70010 84378 97684 63862 40759 12262 -10898 -44199
14128 -44199 -41370 -29744 -6287 49166 69905 42017 49549 43531 49795 39920 15061 -23158 -40719
14115 -40719 -18609 7303 -455 10548 33967 62256 -2182 -44775 -8193 7748 15425 21446
14103 21446 69332 72328 40169 35780 25242 -15342 -64464 -72525 -21922 45139 58590 64384
14091 64384 42934 -8823 29769 65013 84087 81333 66951 36253 38973 39161 51782 57406 54935
14078 54935 66380 92827 85633 99487 90869 81575 47542 9312 -19180 -18884 14868 16586 15097
14065 15097 63861 51702 -26723 -8761 30739 43251 32480 43275 26818 7686 -16934 -31265
14053 -31265 -33060 -5130 10680 -20349 -45576 -50962 -30120 -43160 -27951 -26555 -40196 -31690
14041 -31690 -5618 2275 -5393 -33651 -34766 -47239 -74870 -98314 -24423 67953 68777 66404 77434
14028 77434 65764 39666 29022 9057 27788 54017 13733 13094 32186 44082 51308 35096
14016 35096 24644 10581 -3437 18882 31346 13838 17125 5944 4334 7738 10262 31786
14004 31786 26125 57352 52946 -15858 -61571 -11520 -15654 -44117 -93818 -39739 -15573 -1751
13992 -1751 12786 10621 14175 14126 -34195 -57342 -50973 5932 11913 -41801 5934 40299 67060
13979 67060 51965 54594 39052 36480 40081 48680 14436 45761 24098 -7991 -32155 -59793
13967 -59793 -19916 5858 18290 -22987 -34157 -57498 -71355 -43748 -232 22791 38752 90202
13955 90202 33162 -49236 -87363 -66356 -43276 -41364 -90136 -92640 -119196 -93659 -45594 4723
13943 4723 34319 31460 49847 89779 89598 28237 -18296 -2956 50807 68679 50125 18955
13931 18955 -2415 -33176 -49704 -31042 -25211 -15041 1441 41128 55674 16343 894 15939
13919 15939 24552 32012 44740 40892 17429 9329 601 36251 36459 33092 17008 21046 27787 14057
13905 14057 -34822 -71980 -27260 -163 37160 71110 69527 95495 82452 57562 28863 23422
13893 23422 28927 20133 53750 64864 61167 71273 37382 -12049 -26669 813 22760 -32660
13881 -32660 -38117 11866 55151 89663 129138 108944 56322 31985 41764 52897 47694 13546
13869 13546 6543 23025 43378 29708 2874 28988 82607 85484 88403 82922 65617 82308
13857 82308 56003 18822 -2256 64074 57805 16076 14701 20203 9354 24706 31912 -10276
13845 -10276 -19808 -7356 -18686 10522 60270 61857 31861 24328 34183 3957 4375 -10580 -17687
13832 -17687 4192 58826 44303 15443 39533 28963 26499 26722 20812 27997 32729 40273 52997
13819 52997 23332 7188 19404 18068 -25731 -11729 16267 41724 50787 20449 617 33557
13807 33557 40259 20571 6021 26580 30555 -7726 -6582 -5835 -33725 -47250 -18263 32165 11334
13794 11334 -19869 -29198 -4402 23806 28597 50116 57014 37486 1606 -2374 39602 53569
13782 53569 -4925 -26966 -10331 -2058 28094 53950 51847 77019 72917 77322 57226 49104 12899
13769 12899 10001 22795 64914 95305 83055 21433 11216 45645 38895 32345 36885 9338
13757 9338 -11273 -21062 -6102 -37475 -69470 -76127 -76534 -50212 -63341 -23749 43030 75085 16340
13744 16340 30973 73678 71269 84559 100431 121670 76038 92551 78528 49577 22019 51381
13732 51381 79747 84138 86091 73860 24207 -2062 -3181 43255 110810 112206 65251 30408
13720 30408 22662 2295 -3397 -2757 5269 43895 88054 99009 59764 13024 3819 -47404 -13771
13707 -13771 29308 45215 12221 -2186 -920 23228 5084 -20181 -14630 27904 53826 44667
13695 44667 12429 62227 83481 105116 90645 56208 39267 -21656 -20035 -15703 -39615 -51924
13683 -51924 -21328 12192 107 -21906 -38533 -26440 9416 26241 76308 109836 99917 65981
13671 65981 68207 92368 90836 63424 67563 78018 75342 26685 -22144 -14052 1566 16118 16633
13658 16633 60583 39331 -3524 16423 9338 -29643 -18301 -3410 -25760 7035 24218 28213
13646 28213 26934 31390 16469 5185 -3881 373 46281 52329 26968 13358 -8861 2585 2230
13633 2230 -3223 -18207 -37967 -30452 1895 27259 34571 68695 60357 60470 63322 78263 82675
13620 82675 74852 50237 80946 105341 125464 148994 69413 70294 26996 -6332 -1853 38842
13608 38842 68197 50770 8294 -28988 14373 63842 103372 89142 82201 89777 131822 122867
13596 122867 65358 52009 55154 28357 42582 57062 84038 101714 97277 56325 17510 3466
13584 3466 16084 54182 23864 -50791 -42136 -35861 -34494 -18878 56405 97381 89960 67440 78995
13571 78995 91338 105153 148009 162601 133780 110299 136032 144344 115092 88583 49462 29139
13559 29139 56009 111159 153758 172068 178799 172238 117236 114354 104799 113501 106400 87276 77170
13546 77170 69486 82759 36412 20095 20014 46793 30520 20661 4811 -17931 18366 49905 58898
13533 58898 65771 64692 34323 69290 87038 46971 43431 82675 95335 104262 101722 96604 86133
13520 86133 89024 93098 119446 138496 73875 50934 86599 66451 51525 26344 46028 59543
13508 59543 44550 33595 31418 62290 74894 70436 111418 97060 82129 71032 30407 49368
13496 49368 70907 64950 35783 41759 51437 70627 57778 39656 46129 71932 41175 -5017
13484 -5017 4207 3632 12793 25370 14209 -2826 -745 -18357 3308 58401 49390 25550 -26183
13471 -26183 21255 39575 41184 64766 60593 25183 9960 22304 18418 16777 22383 47989 207
13458 207 -18593 -1575 53847 46680 41187 58716 29379 11099 12639 1912 -5290 10718 4383
13445 4383 -2860 -7991 37387 35156 34661 89418 69409 35687 14740 26472 64086 77734 40582
13432 40582 7341 11248 8406 -3732 -18343 -6309 -25604 3592 -29628 -38838 -2309 56773
13420 56773 82567 93746 85609 93502 106370 108078 75050 66067 46691 55020 82870 55107 24423
13407 24423 51332 70517 94191 85103 78196 64011 34978 26744 25205 26781 35945 48718 81558
13394 81558 64732 63474 81593 92592 81889 144336 131870 92452 78008 66791 81739 112714
13382 112714 76180 36861 21009 30803 33550 -11709 -20391 28012 58449 62755 99367 108432
13370 108432 134874 126754 96190 48896 39122 34878 37396 26227 27658 10309 65656 93850
13358 93850 94124 120404 105497 70384 39565 10899 27056 -3796 37142 90029 93782 62865
13346 62865 21563 6300 -48129 -30263 5037 31170 66452 11836 -7063 29627 60931 77156
13334 77156 102795 154272 226982 207252 156217 136734 130617 88455 81232 101552 48972 41618
13322 41618 41767 45938 43285 53101 42504 40853 -5360 -4206 1463 32581 72633 49335 24985
13309 24985 4287 50819 50866 40486 51121 41546 33581 59584 41358 19797 -1835 -32953 -2276
13296 -2276 51845 75059 111814 105106 41900 43801 59752 67525 46543 46613 43863 60014 42461
13283 42461 14206 6415 14893 70408 50610 133 -2199 38628 43487 56695 86008 113403
13271 113403 115073 122698 166778 158456 138567 70929 40620 57619 59200 69309 138243 176754
13259 176754 130884 89400 54928 68739 114580 125907 123583 112112 103308 132671 95401 88799
13247 88799 88556 74261 86481 111355 114119 112591 117904 152587 146451 102797 99669 137221 175492
13234 175492 173798 131489 90751 76392 77953 131353 158754 158612 143169 119588 67244 41095
13222 41095 34451 65475 104546 133482 131218 129727 147761 167490 177217 138767 103522 106551 138994
13209 138994 126143 108155 70743 77899 106406 106019 137014 134093 101795 82618 63857 71647
13197 71647 72806 76950 60516 102216 129729 91977 109341 126940 146485 171464 167314 170743
13185 170743 167498 121522 121432 124930 135298 144936 156233 168923 172253 184176 195833 203571 164469
13172 164469 152979 166635 180381 191111 137063 89619 60948 54708 91758 121976 165773 224917
13160 224917 214570 172110 150008 138721 154751 179252 192312 208900 205762 213561 234181 260243
13148 260243 299162 316739 350265 353223 369374 433698 431367 476045 533477 645483 726735 847846
13136 847846 1034985 1234756 1381672 1549715 1692714 1721810 1670546 1486482 1320660 1113454
13126 1113454 971020 860272 745126 653937 600375 617143 634986 584951 503580 501313 563395
13115 563395 623850 636722 664274 738882 841878 885409 946801 1049998 1177034 1358468 1619784
13104 1619784 1955663 2431843 3118591 4147020 5734140 8033689 10739358 12601692 12577681
13095 12577681 11184340 8943364 6688247 4926441 3725457 2913163 2326959 1908354
13087 1908354 1639044 1414558 1191773 1027014 904630 787727 681837 617500 565621 549319
13077 549319 537139 503387 475999 438908 411522 404563 410396 352332 336984 325882 339965 321365
13065 321365 306239 295260 281810 216455 225282 274278 272248 265537 268583 286691 247788 216088
13053 216088 203258 197835 156202 180783 226955 192887 158040 183177 230903 257728 260555 228175
13041 228175 200814 167418 180809 175263 192515 191956 188571 212033 212649 208888 189321 208606 214354
13028 214354 211439 189062 152251 127939 120643 117039 114036 142210 127733 143623 139356 137479 122156
13015 122156 151556 121941 135241 146506 140559 121461 159447 187651 168914 198690 200677 176729
13003 176729 174222 158527 146446 173104 211088 227657 210999 205982 210822 217506 234651 222095
12991 222095 204906 223764 255553 240091 252145 234563 215445 210784 222948 219186 196979 189711
12979 189711 212402 217698 201509 224172 276523 235980 173069 128613 122365 126968 147217 197802
12967 197802 190833 140062 88345 150046 190094 243931 263249 245793 241811 225730 222992 265544
12955 265544 298579 275628 256176 271602 339480 381234 391164 389592 373201 374310 355664 360685
12943 360685 329606 314884 294312 302175 294575 271003 233260 198795 193151 210806 190062 197717
12931 197717 237981 257313 253121 290384 283570 229406 175484 145012 155756 182469 233613 265654
12919 265654 264543 288801 307558 281349 278615 282161 273844 213216 132514 145784 206189 195612
12907 195612 204304 238775 223587 198028 187864 181622 176199 173733 212204 288152 327305 308279
12895 308279 267810 249132 265667 247474 222994 228990 262838 279018 271390 271711 273248 248062
12883 248062 220306 144540 117225 167955 259218 301029 329308 317702 351307 362987 385854
12872 385854 374723 372840 407501 360928 342343 340089 329902 334244 325396 354608 381467 408859
12860 408859 408718 405294 391669 393044 418400 431719 412874 405495 427345 468288 471273 474299 468115
12847 468115 500057 524523 531676 528410 526605 536553 537561 544589 539416 527538 482983 482241 485920
12834 485920 508054 518198 536033 507914 474162 469742 473394 485306 454805 429852 471825 501976
12822 501976 535930 601809 563085 533397 560598 582232 595873 592111 613079 637028 653232 634203
12810 634203 640817 656146 696298 686834 706484 749047 747023 727466 731720 726602 689499 710856
12798 710856 737182 743637 772054 757269 767892 774253 800282 798695 775413 784550 833275 843035
12786 843035 825087 812407 909113 1003333 1027459 1006411 1005688 1030893 1019826 1056832 1088249 1102852
12774 1102852 1085853 1056067 1084668 1121225 1163083 1239801 1313009 1342803 1340222 1375077 1388289
12763 1388289 1420440 1427871 1467450 1535331 1592252 1602243 1607193 1674741 1792981 1868121 1907284 1957897
12751 1957897 2016031 2085511 2173200 2265573 2364027 2433880 2504916 2599369 2691436 2742619 2799159
12740 2799159 2919633 3064615 3240365 3411706 3615318 3792523 3989355 4195593 4377452
12731 4377452 4573817 4799619 5093178 5401126 5734404 6145352 6569423 7017611 7505589
12722 7505589 8032942 8607533 9254565 10000812 10826225 11744230 12787621 13917699 15249600
12713 15249600 16826496 18705590 20972655 23739290 27075713 31098022 36016921 42027696
12705 42027696 49380639 58590667 70494072 86448643 108254301 138303415 178871648
12698 178871648 230327326 286348015 331270964 350174737 336707286 297231925 245790594
12691 245790594 194890345 152715018 120837909 97397739 80154151 67191494 57166521
12684 57166521 49067849 42395260 36846291 32184092 28347414 25091169 22371239 20084235
12676 20084235 18117623 16438192 14971296 13653373 12485984 11499739 10643435 9828155
12668 9828155 9153256 8533249 7987896 7452757 6999487 6630075 6279687 5910431 5603019
12659 5603019 5348825 5099105 4840029 4621313 4404280 4186610 3983608 3799125 3667108
12650 3667108 3530255 3375895 3232422 3117275 2984286 2838500 2698568 2539504 2394972
12641 2394972 2355003 2321470 2230153 2146365 2033660 1944138 1847670 1799317 1716016 1618088 1555697
12630 1555697 1536040 1545696 1448924 1361716 1310150 1266628 1183411 1130710 1088866 1018671 955192
12619 955192 951484 968691 957420 873153 848350 793298 709821 687746 696884 721124 713095 677822
12607 677822 622555 634001 611534 599809 575923 556650 545882 556345 552932 533413 589674 630989
12595 630989 605502 605847 621496 571215 513003 525410 528046 459005 444463 447257 389974 346383
12583 346383 344800 394925 419411 444636 406422 404441 400090 394297 425278 437362 478422 518183
12571 518183 491050 465198 447820 439710 436117 416998 410863 433299 501152 551528 571461 587866
12559 587866 626150 722141 844140 1040218 1253309 1528922 1784885 1951525 1973515 1867577
12549 1867577 1684832 1428341 1135867 888509 738852 607776 485248 393729 337342 286299
12539 286299 289838 320656 353545 352532 342877 313594 277551 242545 249534 272452 290460 290086 309024
12526 309024 268570 251633 232853 215123 239156 257743 252843 262198 221742 172202 133133 98577
12514 98577 102529 149049 193215 213704 229065 252048 243885 240311 234826 247708 291786 259283
12502 259283 211749 182361 125251 98184 109843 104240 112780 131364 167231 178940 152142 147870
12490 147870 190626 194023 187578 183043 146244 160157 181114 185967 221590 228467 222577 201446 213806
12477 213806 192716 175319 139936 113921 141452 142470 164902 185796 204367 164019 143684 114283
12465 114283 115471 126122 149226 176438 186668 190428 189800 181864 167855 156368 115368 105681 130146
12452 130146 155283 145461 174319 161877 146895 124583 90898 105017 107477 116143 138320 129405
12440 129405 84081 97706 153566 135773 93592 95957 96329 109543 100775 146670 139870 158348
12428 158348 134417 92421 32868 16392 40621 74852 89372 64893 74488 137880 150396 115803
12416 115803 116186 128549 90760 68948 82252 111277 107744 102921 99254 101416 45470 67520 94106
12403 94106 65600 92570 92039 68391 79578 36223 64075 46118 -4806 24822 68150 74609
12391 74609 105754 88801 58601 44380 38735 42097 107802 130499 119399 123229 150645 186373
12379 186373 178045 160192 115695 110342 104958 108157 120507 114481 118572 147181 165656 133155 112594
12366 112594 69351 86247 97585 82357 56234 77144 73320 55002 67231 128823 195407 214204
12354 214204 211467 180426 160159 139060 111863 113916 118863 122074 105434 150833 150297 137269 149046
12341 149046 141359 115027 110889 119694 116076 110127 122874 105482 95934 150760 145598 92704 63948
12328 63948 89240 107138 78493 83736 126099 141188 168717 159588 102095 92806 138866 157888
12316 157888 171155 167697 133198 147343 161325 175120 162608 156857 158243 179573 182876 184060
12304 184060 163307 135513 134182 140130 155791 203895 222737 202594 171554 167633 164161 185407
12292 185407 186579 187629 176720 162988 144567 142176 177926 221670 246224 289171 292299 274921
12280 274921 236226 239845 251985 242362 234619 252969 254442 264998 300580 319136 311385 295210
12268 295210 286993 333778 323511 307825 357490 402180 472390 536971 615703 679898 781560
12257 781560 942464 1073608 1269366 1487381 1656713 1745279 1746914 1597712 1439217 1247086
12247 1247086 1036066 916263 858536 741797 633297 594830 542060 480834 425299 397961
12237 397961 392233 310939 292774 294382 320173 245703 218457 206462 184083 188494 183606 240747
12225 240747 249360 196937 188875 240038 262657 242940 207534 222680 230948 232752 223458 220563 205834
12212 205834 182863 178277 163435 192575 212287 265365 325469 317177 247668 185545 175372 205828
12200 205828 212999 249104 279061 248565 220728 237805 244027 269340 238039 234776 250009 213039
12188 213039 254741 281467 282863 292203 297532 271870 238583 212178 233837 252143 254775 240614
12176 240614 262624 275397 295042 300824 299480 352250 384361 385484 346576 358250 355996 315274
12164 315274 300622 309115 361876 356407 323706 275225 225780 257792 293215 308791 312643 274033
12152 274033 293685 291863 268022 326059 354255 316157 303883 253023 280074 335620 404575 426894
12140 426894 407343 428292 447573 439625 426947 403903 447806 420551 381912 406301 445406 449159
12128 449159 445267 428943 442179 486162 466664 412611 362099 371914 390769 384404 412342 453175
12116 453175 445780 445162 464403 488523 507340 506151 496957 508715 554735 526411 516572 585636 602335
12103 602335 619744 632242 630919 636538 659896 641445 612117 624840 632475 646622 690376 726049
12091 726049 732097 723385 746195 724094 719761 737494 733048 759995 738785 740791 783659 805887
12079 805887 795320 805863 750729 694854 729827 770651 769945 756151 773205 812714 820780 837185
12067 837185 785559 745668 745292 820850 855749 842255 868196 889680 899984 897137 911085 939253
12055 939253 954507 1018657 1038428 1030475 1071307 1092892 1130061 1171976 1159725 1161266 1246611 1246132
12043 1246132 1260861 1278414 1253939 1202504 1200782 1254269 1296657 1273757 1272735 1338039 1355787 1331528
12031 1331528 1341602 1376687 1388282 1388306 1390754 1400155 1478871 1496814 1531374 1555176 1581556 1636600
12019 1636600 1697007 1709886 1709483 1749963 1809623 1848188 1914556 1968100 2001756 2052234 2080454 2113282
12007 2113282 2142534 2187367 2226984 2285127 2340694 2438634 2489414 2507484 2563912 2627150 2645987
11996 2645987 2681755 2761069 2815704 2874306 2938811 2994979 3089729 3219595 3335281 3405371 3467500
11985 3467500 3577082 3674331 3769087 3824065 3879139 3990433 4150783 4308711 4465850 4571953
11975 4571953 4658151 4771615 4927851 5109940 5256536 5415473 5577592 5756806 5872173 6047609
11965 6047609 6239562 6415623 6603805 6868385 7073993 7299626 7498296 7681023 7911371
11956 7911371 8175391 8401698 8660574 8892994 9130884 9357289 9594204 9828592 10092016
11947 10092016 10342166 10612281 10871662 11114962 11342769 11563333 11812951 11977258 12158580
11938 12158580 12307299 12453605 12563635 12711281 12801881 12878752 12935749 12968996 12954637 12948083
11928 12948083 12874287 12803976 12770303 12649130 12518627 12387764 12249167 12074099 11896320 11691832
11918 11691832 11463079 11238572 11047831 10796828 10512654 10261315 9977274 9705507 9443633
11909 9443633 9228420 8942942 8673221 8459881 8219205 8017643 7811154 7548987 7334515
11900 7334515 7145831 6923278 6717488 6471819 6276478 6115567 5926478 5721303 5559686
11891 5559686 5418841 5243953 5117312 4975612 4869755 4755228 4582070 4445748 4334763
11882 4334763 4223134 4127234 3987547 3840084 3729037 3623671 3514852 3410103 3321444 3267268
11872 3267268 3213412 3167138 3086593 3010531 2934013 2832504 2730599 2666314 2615307 2540392 2444185
11861 2444185 2408512 2382379 2322257 2288269 2274559 2207132 2086475 2029666 1957663 1894319 1814948
11850 1814948 1794909 1792317 1788855 1770703 1734449 1707055 1657647 1592151 1577689 1579797 1571022 1568986
11838 1568986 1553837 1494483 1490453 1461158 1408711 1351829 1340948 1305096 1258219 1197651 1193415 1212791
11826 1212791 1242215 1228712 1185847 1119267 1044400 1011937 1012889 995282 984610 991593 1008538 981271
11814 981271 985519 987541 964618 944289 928352 911252 863073 871316 883283 890454 862331 843333
11802 843333 836845 848769 820085 812437 764089 728070 675605 686522 680101 687576 721383 701160
11790 701160 671644 634945 586336 588951 605451 584984 604840 586473 580129 581985 556769 562472
11778 562472 568244 561744 554064 588596 619564 611329 591350 560734 541933 543430 522895 515817 459338
11765 459338 435124 475749 454934 414144 433828 415825 422812 420201 424270 431407 422141 447141
11753 447141 444081 431441 430541 417830 421211 398453 355548 357376 384402 390163 358372 374678 386657
11740 386657 391814 397986 369807 374194 366574 369360 353427 362511 367273 380641 335995 314033 300976
11727 300976 252535 291621 309296 295416 313826 280190 274339 274768 259033 278508 305982 307004
11715 307004 280774 293193 309365 316787 308174 297773 307827 296716 299301 279186 293061 316326
11703 316326 303089 344778 354969 364638 344001 299307 273292 268133 271361 275900 286426 281192
11691 281192 264298 233689 238421 230614 276955 292931 237844 179321 169367 171100 180404 184745 197382
11678 197382 215379 238423 265615 250623 252458 238742 190460 135666 154487 158183 135594 174446
11666 174446 215669 185580 203831 204196 167438 152708 145116 149471 143824 178274 184340 170545 161157
11653 161157 187221 185196 150414 142111 142244 138752 158842 195052 240144 217209 171013 170250 223664
11640 223664 224620 218144 229844 207984 159013 116644 192380 254958 253704 232783 223487 221864 241082
11627 241082 181417 117862 110803 72654 66023 60291 78354 99088 146057 152115 137218 154218
11615 154218 142251 121732 139239 165591 132549 125429 110935 79654 48864 83400 96175 107052
11603 107052 107962 99387 73596 139604 186838 144979 168433 196096 136200 100678 124600 99173
11591 99173 64392 57552 40137 77026 125531 129588 116763 122507 155439 143410 116779 109122
11579 109122 128696 124593 106845 129265 146764 156778 160501 176005 162536 159248 116697 76295
11567 76295 79765 65763 62121 84948 139963 139456 83902 54817 58605 73241 54825 49869 12717
11554 12717 9499 19585 33780 24129 8305 10587 -9090 -2021 -2774 45696 70255 79928 85323
11541 85323 90511 94480 40042 29896 47115 51366 88773 10226 -29860 2381 3070 5132 54468
11528 54468 118357 108332 87595 28960 1073 -12808 4646 89361 155915 106360 71604 96494
11516 96494 125931 122059 98427 98195 118105 124620 132993 133298 127586 59425 74870 120587 118923
11503 118923 76126 70669 60815 35089 -9405 -6086 36332 70224 75359 107399 89608 97462
11491 97462 65973 43953 56235 46805 88994 106503 50260 37376 41978 73703 80708 80385 108208
11478 108208 126811 126217 138341 172718 147054 148918 117510 65759 48697 44211 60858 31062
11466 31062 15011 36883 77925 71014 99556 65337 29221 34009 55325 108935 83073 47048
11454 47048 82656 126363 152891 126619 94652 92115 95607 111864 118209 97459 92083 132321
11442 132321 90285 49092 20798 54936 82301 67734 69208 91892 112343 121933 109335 106500
11430 106500 73799 56350 70430 40742 29712 -969 -18095 -5826 -15236 -21373 7269 40488
11418 40488 60968 52598 56370 93418 75486 59546 43875 17993 14704 28369 51814 60712
11406 60712 73110 25202 -4985 -22951 8866 17102 78878 78051 81706 47544 4788 -24135
11394 -24135 8544 68415 49399 41271 70432 69233 34272 14319 39135 63809 48095 67248
11382 67248 80665 51330 77932 24310 -29833 -17892 -19034 -8798 -8900 16151 24736 44233
11370 44233 37955 42559 93922 96987 97041 68215 44536 17738 6956 39708 28439 59413 63850
11357 63850 44241 39391 36693 34431 5353 35834 73464 68542 85677 48218 -1682 -23291
11345 -23291 -20270 -40139 -32878 11691 64128 63531 22658 26435 22599 33774 50837 42707 14847
11332 14847 37975 77055 50738 66528 43174 -14693 -3067 41993 50304 58750 61556 66169
11320 66169 75081 95632 79801 35681 -1112 -8665 -46564 -7820 8700 44415 62738 95663
11308 95663 64972 20512 37284 56300 69176 33991 46923 28579 25158 38842 27593 36785
11296 36785 56984 393 -19481 9441 22185 -123 22612 87710 89807 84870 86867 113547
11284 113547 95273 92072 54336 35661 35964 -11035 4520 8562 5325 44803 73058 63550 89471
11271 89471 93531 86358 64658 56733 13329 6172 25867 69026 54335 27434 3422 -1242 -18798
11258 -18798 852 52420 100936 78923 21474 6998 44489 70218 39492 -1822 22816 28281
11246 28281 43885 67640 86623 105624 115587 116374 124735 127301 117980 113870 70594 -4514 12366
11233 12366 -11150 23934 21821 8063 -36214 -25469 -58273 -58670 5177 60937 65423 19555
11221 19555 -14177 -35033 -56242 -34856 7645 -35236 -86798 -68502 -23601 18459 51990 59345
11209 59345 76366 101051 70535 32892 40874 33859 1682 25226 52495 72118 37659 20638
11197 20638 39328 38313 31682 17464 34258 23400 33293 52143 43723 42775 -4246 -17406 41952
11184 41952 66675 34069 -5085 -2853 665 -28551 -28492 -38630 -45561 -20187 -58716 -14375 20696
11171 20696 -5136 -16054 46314 26918 -14003 -18471 45405 61343 59308 35637 15047 -11763
11159 -11763 -20690 3612 63039 80466 117503 126708 155170 161350 115982 90182 79754 45115
11147 45115 26603 40757 34566 7354 88945 113402 90064 94873 119817 113388 99685 130513
11135 130513 123063 78750 66665 65978 37242 31742 30968 9402 7940 56202 65276 109522 111526
11122 111526 89532 104205 96005 86704 82728 70856 64507 76862 92351 84618 83818 71272 14814
11109 14814 -22317 -1525 51459 94129 120356 111716 103152 91006 79669 33244 -4842 -4566
11097 -4566 5557 43858 64876 61837 -9218 -5972 13408 40980 98128 97402 53894 32930 28179
11084 28179 49884 73627 31341 10480 14139 10370 -20561 -25251 -16162 -30712 -29174 -14651 49149
11071 49149 78731 71758 76214 81665 31866 -4928 -36604 -62916 -59386 -24428 41564 66179
11059 66179 34903 25576 -9859 8674 -417 -9389 37384 50295 39586 36030 13210 33265
11047 33265 83666 121925 113373 103218 74461 73041 71853 59441 41449 73372 97010 137763
11035 137763 172292 164754 115839 125202 161398 160835 160824 173352 214608 239675 308289 339937 314011
11022 314011 285639 258749 240280 240390 229583 233152 269530 310307 347103 404892 423488 440185
11010 440185 437635 363575 338607 353023 348673 339180 329137 306164 322827 364194 362464 311136
10998 311136 284118 238447 235339 227422 209779 229502 246639 249024 202280 197996 203999 233596
10986 233596 226738 198977 137539 59786 10018 44005 54053 64172 66505 52723 73177 66298
10974 66298 9065 1241 51599 51798 34880 1660 -21295 11924 11936 37311 40722 72637 117033
10961 117033 153340 132765 114205 132832 139113 125065 107472 100306 101178 69199 43035 46619
10949 46619 55406 35573 27156 25334 37023 65501 56505 37764 34924 14671 -12339 -489 46396
10936 46396 64495 86621 150288 147750 175379 170328 127658 114886 148808 152182 112505 52794
10924 52794 64330 24089 41326 82933 93971 65330 34672 34034 93262 97784 30950 36515
10912 36515 14178 8635 35316 50106 44640 65656 65801 78946 138236 131476 71836 41232 38704
10899 38704 -857 2254 37972 83856 109132 69186 60323 40303 37175 40806 88737 148105
10887 148105 142500 93736 28025 -17743 -22882 8545 80144 114760 49551 -36432 -17074 8062
10875 8062 30340 30357 3589 -13140 1015 42773 102716 97790 59212 21671 39863 86984 56374
10862 56374 39516 47855 15373 -33073 -53324 -33312 -2236 35571 43306 70559 63648 46937
10850 46937 76349 86460 70995 58404 85760 79172 84429 121735 161429 183343 188849 150780
10838 150780 91555 87398 103574 101224 106895 64520 26758 64822 99461 68920 25836 8094
10826 8094 51226 47676 23998 322 -9381 16927 12769 16451 13964 -7793 11631 55378 74146
10813 74146 56510 46674 5478 -30228 -41184 -9611 9569 75594 110492 52115 53634 109127
10801 109127 104760 105228 102511 114213 134847 105849 92310 45995 24012 58958 83879 72797
10789 72797 72417 86806 124980 129821 99584 76610 71329 84609 52527 -11703 -2698 35432 29570
10776 29570 -8094 47616 65562 65432 20954 24050 84403 63735 9138 6814 29190 87141
10764 87141 125460 175197 209831 203799 164306 159676 145375 152634 134045 137260 140884 134086 120256
10751 120256 141961 150690 156056 154926 170990 165530 162723 160632 162794 179165 166617 154670 147120
10738 147120 134661 132669 156365 155583 185440 199502 192353 159483 128256 154136 160558 193043
10726 193043 231968 242774 213245 178219 186825 138739 148440 183260 200158 200436 184551 169773
10714 169773 221470 244806 211378 186573 198050 214801 236286 249315 217324 202332 224643
10703 224643 224802 233700 212534 197579 210609 216769 252680 252717 267602 252645 196949 194392 221288
10690 221288 222748 250643 242090 248807 250603 237622 236565 236203 211823 219221 240417 283045 324591
10677 324591 259607 231708 255138 269494 329515 377998 355010 327442 303516 324462 384549
10666 384549 394106 391388 410829 398932 352233 359197 389880 409670 394437 433284 430646 433481
10654 433481 440854 462060 466652 490884 528800 577293 620273 606583 622243 686122 701310 696376
10642 696376 732627 770379 810425 862411 902006 925493 931947 962195 995832 1015699 1046268 1120454
10630 1120454 1241685 1330104 1424337 1520912 1654443 1820186 2008653 2208955 2372206 2506877
10620 2506877 2686759 2938484 3147045 3454959 3891623 4393506 5049407 5940024 7115633
10611 7115633 8678778 10609378 13049146 16077711 19367211 22261594 24206217 24972680
10603 24972680 24820645 24334685 24035973 24450603 25949260 28791243 33178620 38949173 45220766
10594 45220766 50313465 52807959 52405697 49841868 46471996 43769133 42685979 43561602
10586 43561602 46646069 51973706 59098495 66533428 71719853 72680363 69361833 63149610
10578 63149610 56048507 49869069 45591271 43501557 43588572 45538895 48842393 52198250
10570 52198250 53827325 52575951 48596238 42941964 37016282 32003550 28376117 26091148
10562 26091148 25089596 25051849 25563102 26013393 25641457 24138487 21657073 18555954 15398120
10553 15398120 12557016 10241487 8454202 7116013 6038615 5207467 4603679 4108200
10545 4108200 3708893 3382243 3031426 2719498 2514907 2298481 2130282 2019208 1852004
10536 1852004 1719404 1622532 1530054 1422873 1332758 1268460 1208718 1115622 1057755 1039554 990013
10525 990013 926849 877498 851638 839722 807272 716225 682257 630989 561840 544225 556618
10514 556618 538899 469089 435932 469689 469595 458485 426966 416714 396214 431719 419164 358033
10502 358033 301804 277312 255171 258206 299201 284938 232865 200522 227022 204369 203401 206594
10490 206594 212573 229503 223026 160311 112962 125594 145864 181934 155735 146993 127391 84318
10478 84318 78384 91972 59799 56890 43242 25982 44125 71626 76031 76643 79049 58317 79098
10465 79098 77514 19491 -22229 16197 94328 122009 92427 95574 68894 81768 66642 81605
10453 81605 79541 37642 -29742 -31716 7052 55924 86779 75182 56720 39384 74288 42737
10441 42737 -20721 -57203 -8381 35009 88715 97704 85273 83715 82414 36113 2498 -58984
10429 -58984 -54350 -37173 -24522 31731 11001 -25800 -17719 20333 10510 13126 -9444 -62495
10417 -62495 -64815 -14575 -12056 -48022 -34416 49176 4105 -57454 -49680 -3680 11387 3671
10405 3671 -4626 -1612 17448 13 2654 -35356 -52114 -49399 -27989 12813 1277 -27634 -5963
10392 -5963 7851 -4540 -5082 5502 -7883 -20226 14750 71393 65944 4950 -8947 -2614 -19102
10379 -19102 -18286 6136 16093 3453 -29193 -83335 -59008 -18412 -48385 -57788 -33268 -7640
10367 -7640 -2824 6936 -330 -25739 -13324 -16737 -4695 22769 60492 68302 66256 102018 112907
10354 112907 45437 40045 27146 30612 -4142 3132 55038 74130 24989 19554 9243 -16775
10342 -16775 -26063 20141 41875 3425 -8136 -4935 -11506 -4807 -14871 -28265 -45302 -47272 -32265
10329 -32265 -15504 -42751 -31630 -28698 -11801 -14549 -24834 -14593 9509 -11805 22369 27938
10317 27938 20100 12923 22934 55632 72737 53303 933 -27007 -16444 21733 15590 27700
10305 27700 44466 69284 98053 84199 71662 53260 46743 98385 95591 55261 70005 53143
10293 53143 39524 42478 56422 74252 130032 154383 145782 142615 185355 222934 280050 375977
10281 375977 461556 514502 658967 846177 1018030 1231567 1336820 1334746 1272524 1248496 1253151
10270 1253151 1294835 1197138 1014087 850038 707544 557985 441458 339598 276766 228543
10260 228543 174912 119908 107731 98971 84390 50805 53763 48740 74352 86010 93566 96676
10248 96676 116274 91350 63552 39274 5245 4815 -3805 10984 16905 -19918 -38795 -35068 -13846
10235 -13846 7125 18503 23991 -4439 -33966 14791 16630 -11019 -60448 -35419 -43826 -56315
10223 -56315 -70282 -27595 13065 -12928 -57852 -41851 -6119 19011 -12034 -36282 -20451 -27384
10211 -27384 5832 45734 46628 -1732 -35380 -45740 -32479 -24398 -56338 -67387 -58878 -59278 -15169
10198 -15169 27993 54507 91250 85849 23407 -19982 -54591 -38864 -13842 -44210 -64192 -57272
10186 -57272 -75426 -67769 -36632 -11887 -27538 -36154 -76889 -98750 -59133 -27149 -7056 -1684
10174 -1684 43365 71925 57983 110186 153156 118988 106292 74126 122936 179119 185719 168860
10162 168860 183917 217631 242604 279862 282240 293678 317562 280681 252316 270603 292274 278100
10150 278100 265343 273120 297393 337829 393055 402703 402199 381807 395323 411366 375206 321302
10138 321302 312576 285983 256627 284040 318247 328256 319439 286380 243985 206165 188329 167920
10126 167920 167065 168869 175157 168432 155740 175024 143243 86990 41115 13202 22157 10398 -21873
10113 -21873 -6807 31844 21530 26001 31226 24635 -24038 -68566 -62573 -36138 -39367 -57821 -56932
10100 -56932 -25600 15749 1919 -9294 722 -29395 -29727 599 -5528 -33337 -36136 -21633
10088 -21633 17162 36174 38763 22668 55665 67507 74011 69200 32977 24933 16665 15435 -9928
10075 -9928 -483 -6000 -25624 -3014 -17826 -46413 9427 35018 -23027 -30511 -23155 -17135 -15172
10062 -15172 -383 5130 -10590 -21146 -16001 -41129 -24593 4341 8202 -1847 -53725 -14263
10050 -14263 24908 -14199 -73712 -38750 -19145 -44085 -21825 -5263 -5918 3939 9379 -898
10038 -898 -2311 -16104 -17717 -17429 -43878 8262 23186 1258 -33425 -39836 -20563 -11448 -11934 -29577
10024 -29577 -35780 -29959 -42586 -39283 -32198 28446 65900 38788 -25983 6131 -12211 -44083
10012 -44083 5173 26863 -17716 -18662 -17133 -47608 -69813 -60671 -47476 -37478 -45126 -73985 -76558
9999 -76558 -83117 -80895 -63751 -48132 -38298 -26949 3293 9818 16682 4536 -9164 -32384 -14061
9986 -14061 -45337 -28373 -51784 -66551 -59456 -44122 -44236 6671 -14662 -1888 6403 -33350 13375
9973 13375 17553 12615 53394 22141 7982 8407 -12821 -28243 -35769 -43872 -61872 -44688 -24828
9960 -24828 -16850 1732 -24092 -63050 -65565 -61076 -10286 34991 36362 28076 -4365 -19699 5145
9947 5145 43657 34525 14153 36050 11712 -723 27747 1673 -27067 804 13855 8892
9935 8892 18133 13737 26227 12489 32954 50380 -9521 -44308 -33140 -10739 -13003 -14561 -15406
9922 -15406 -26607 4049 29266 -13455 -31298 -38723 -40292 -42964 -25035 -18488 -14498 -3334 -41864
9909 -41864 -70676 -65248 -62820 -46325 -55664 -36431 -10714 -31383 -47543 -25931 37613 52816
9897 52816 12846 -45727 -23292 31376 35849 50229 47794 20995 17681 -10128 -20302 -37129
9885 -37129 -30084 -15825 -48424 -57540 -63357 -56884 -12690 -18228 -52544 -30449 -14430 -19877 -5092
9872 -5092 -3212 22829 53414 14751 -31219 -30864 -3624 2151 -17042 -23528 1874 21518 14361
9859 14361 18230 44573 30828 13202 -643 21079 -37753 -51225 -42680 1414 28066 60298
9847 60298 75487 62327 14294 34260 1762 15662 52533 20275 14514 20119 39425 43419
9835 43419 24623 -14167 -39616 -53616 -62147 -59048 -28958 -3786 -31797 -13745 -20518 -42061
9823 -42061 -6409 45093 28987 -29639 -69828 -33259 -3387 9174 -27529 -34976 -51548 -13788
9811 -13788 12 8246 21176 35435 63627 38927 12422 35668 11811 -36447 -19979 1858
9799 1858 6268 -2553 19860 33416 2781 -37918 -58060 -108689 -120548 -98945 -58472 -58595 -50630
9786 -50630 -15401 11268 -4457 15343 20839 26674 33034 47511 18283 7701 -19299 -31284
9774 -31284 -26758 -15742 -12853 9892 903 -52644 -72276 -46988 -15360 429 2748 16329 33539
9761 33539 40169 40948 59415 46515 5221 -27181 -42471 -16125 14702 26876 16352 7096 -6598
9748 -6598 -13019 -3106 -4466 -41230 -115891 -146219 -98009 -4797 -16951 -43635 -57903 -34742 -35692
9735 -35692 -45806 -21087 -12235 14789 92199 77880 25975 31931 48522 41147 8147 9980 -8209
9722 -8209 5826 5796 -47354 -67578 -66087 -82597 -88649 -33381 -42065 -47246 -49820 -65578 -46741 5336
9708 5336 65929 88144 58305 765 8773 -8263 -48562 -53456 -28600 -22396 -67627 -75402 -73292
9695 -73292 -51447 170 -17609 11653 25447 -10259 -56912 -82710 -99373 -99062 -68256 -29902
9683 -29902 6350 21862 20834 -46905 -28473 -27752 -17911 -38702 -16455 39519 44015 -343 -10350
9670 -10350 -10445 -10593 -22626 -31455 -39562 -25081 24568 -6334 -51468 -63213 -42352 -2090 24882
9657 24882 31475 23932 872 15278 21743 -7712 31902 84153 135017 131287 158485 174593 230509
9644 230509 252543 194653 113328 90957 67483 52466 40767 16471 40298 49682 37442 36525
9632 36525 31440 25428 23723 44708 44687 7922 7534 46008 44099 18611 10897 -16083 -31999 -33029
9618 -33029 -35618 -55587 -86395 -52807 -12725 4395 22341 19136 20034 42011 14879 -11198 -9740
9605 -9740 4112 -448 -48479 -52252 -48910 -26460 -15796 -66729 -84531 -48707 -54001 -40498 -19239
9592 -19239 -35250 -43292 -35267 -13961 -3905 46061 39847 41226 39211 45776 67505 60188 37621
9579 37621 5288 -14329 22004 54156 66132 85009 82610 24494 -31173 -49196 -45858 -9411
9567 -9411 -47014 -80701 -70786 -48059 -33613 -35069 -44770 -25254 1053 470 -17559 -35100 -82452
9554 -82452 -109901 -59473 11792 80513 70671 17069 10537 31383 48206 8365 -7574 -3592
9542 -3592 -16344 -39940 -42352 -14290 -16240 5983 -7161 -299 7800 18689 40805 26815 4815
9529 4815 -36042 -31432 -19397 -43119 -58109 -66093 -41006 -7542 -45565 -20810 14986 40911
9517 40911 35324 52895 49397 30401 -13984 -42347 -65400 -57997 -15223 -7624 -38566 -18541 73
9504 73 -14123 -33091 20356 43413 -12524 -44670 -51648 -17986 6406 -28659 656 -10967 -9521
9491 -9521 -30200 -32900 -52354 -55065 -48717 -62598 -43436 -26248 -38634 -10085 22367 42520 50793
9478 50793 50259 30629 -11722 -43980 -53404 -76999 -54095 -30796 -28661 -38589 -20446 -4632 -38272
9465 -38272 -47548 -47204 -18611 16150 18961 -27279 -66939 -73055 -94867 -33735 -16561 -47122 -64296
9452 -64296 -37268 -4317 -48717 -53925 -16155 9430 25146 11871 22587 42515 7577 -27393
9440 -27393 -39639 -29029 -65493 -34619 -23060 -21142 -3901 -21370 -2936 31930 -29768 -60426
9428 -60426 -80738 -53340 -7263 -2668 -2019 -13362 -11422 -10532 -49294 -29816 -9234 -8612 13691
9415 13691 11722 18002 34708 42615 13266 -26291 -18105 6838 13805 -14307 -11839 10025 382
9402 382 -28620 -24905 -12796 25285 23657 44544 42308 -279 -32192 -29610 -16945 -44416 -37668
9389 -37668 -31503 -53874 -46838 -44447 2930 -27949 -7633 12195 20872 12609 -10219 -24905 -47360
9376 -47360 -19153 -58299 -77842 -82767 -91426 -54502 -21535 -16312 12780 21203 60543 31904 8323
9363 8323 -38890 -51173 -66539 -62220 -36718 -51919 -89253 -43651 22135 39240 6508 8889
9351 8889 28607 7188 -44079 -8103 32124 -3344 -60132 -53241 -14402 -13097 -26295 -64243
9339 -64243 -30199 5403 -22856 -11958 -306 -11019 -45290 -26773 -26535 -76147 -77483 -67058
9327 -67058 -69904 -99869 -60668 -39577 -36312 -42647 -24068 -9436 -5726 6372 14562 -16050 1844
9314 1844 -12811 -44332 -33749 -2364 5831 -19236 -33173 -5534 -19507 -36312 -16928 23683
9302 23683 21906 16233 25449 40076 36919 12263 28743 44473 43225 28892 33174 31361 31327 62254
9288 62254 53274 45889 17076 -20711 -23084 -7228 32467 -8092 -15771 -4074 -19904 -30032 -10390
9275 -10390 28867 10321 -18110 513 37417 59598 55095 58201 48512 53755 58493 19423 -13469
9262 -13469 3766 -21 -24114 -79437 -80287 -24124 35292 37028 22858 -13507 -2844 12231 9905
9249 9905 -9960 -14173 -10351 -5318 10246 30379 39428 1173 15910 43758 40572 12283 -13069
9236 -13069 -50174 -80459 -74873 -66160 -48807 -44529 -22801 -30355 -40030 -25685 -40974 -36728 -17841
9223 -17841 -9940 3279 -22909 -57530 -67029 -29402 -43853 -55767 -55489 -64758 -53486 -34451 -3495
9210 -3495 -47498 -75793 -90854 -65155 -26146 -31876 -56564 -68166 -56733 -64823 -40914 -10080
9198 -10080 -2280 -31305 -61828 -51768 -27710 -7755 -9779 3743 -723 1353 29067 27165 -8436
9185 -8436 -5998 10430 -12595 -61261 -75182 -36191 -46226 -26833 -7155 -27987 -9013 -25937
9173 -25937 -31973 -23582 -41396 -18529 -53564 -84376 -83349 -90571 -25250 -17054 13703 52718 43863
9160 43863 -1441 15339 35238 -32370 -51339 -50720 -64684 -51711 -32331 -3295 16374 -4847
9148 -4847 -31136 -14338 -10951 -81318 -99826 -64057 -34894 -29811 -35450 -47513 -32705 -27973 -15667
9135 -15667 -12198 -28930 -34866 -24424 -44676 -6832 33486 11483 6637 16757 5541 21395
9123 21395 -6489 -54563 -72783 -54879 -40162 -21169 -3424 -516 1741 9389 31929 34662 -12416
9110 -12416 -31740 -32871 -55203 -45128 -60998 -40492 -620 -5646 -10459 -8338 -27497 -28809 -24355
9097 -24355 -35138 -43618 -48661 -27607 -20829 -22742 -35319 -43444 -36109 -50683 -67678 -44939 1372
9084 1372 14665 24093 46938 51646 50513 34312 7756 16469 31374 82696 96003 66255 4348
9071 4348 -6234 19563 10325 -28548 14686 3020 15805 41477 49100 36999 16976 11178 -16155
9058 -16155 -24941 33706 65137 46855 15175 20083 37371 34567 17697 -37544 -45610 -33525 -16286
9045 -16286 -30430 -32799 -33183 -27049 -13187 42930 21669 -10729 -70735 -94059 -54784 -57784 -39741
9032 -39741 6655 -3534 -38984 -51273 7250 13503 -6641 -8181 5712 -11376 -24462 -4168
9020 -4168 -11101 16599 13306 29485 17835 15403 -4311 -19216 -999 -28421 -29945 -7906 11094
9007 11094 -4385 -41283 -59178 -76499 -56902 -59227 -34066 -11433 -5647 -11901 13687 17942 47908
8994 47908 42643 -13715 -32375 -12691 22502 15221 2784 5636 23041 28495 60522 53960 37565
8981 37565 11541 -7461 14538 2147 5872 7201 -12073 -20701 7477 -33153 -34580 -9280 38897
8968 38897 22638 50631 77367 97748 72409 46959 41677 40160 30332 71911 79342 46915 9940
8955 9940 -15097 -16472 -2667 21616 6950 -34844 -55670 -19567 35396 63678 30420 32927
8943 32927 11179 -10514 -1334 19040 -6833 -22575 -53932 -78451 -93050 -92247 -94678 -83466 -55754
8930 -55754 -46416 -27634 -34812 -8007 16096 52300 35852 15076 -17207 -42777 -6916 -8726
8918 -8726 -29816 -13400 6816 17626 3191 -53242 -42729 -7696 5369 -7986 23887 16592
8906 16592 21469 73051 62449 48678 39530 63750 91843 90681 63265 31796 16419 9184 -1292
8893 -1292 -14312 -5257 50301 41427 17220 10625 -22934 -16189 -17363 10941 28316 -15514 -32451
8880 -32451 1325 13793 12389 15040 -18773 -41722 -11873 39246 -8908 -61223 -56163 -60396 -30445
8867 -30445 -41069 -42201 -32031 -63871 -49712 -7966 -17164 -6514 2233 -26425 -37379 30764
8855 30764 42617 70564 71343 22348 -44282 -53601 -13662 -13492 -33013 -52593 -31174 -47723 -58375
8842 -58375 -43257 -28515 -48917 -39571 -2472 -16327 -11796 -19867 -19415 -17462 -23767 -6066 35585
8829 35585 44449 15011 -7163 18010 22922 -3708 -67958 -102171 -107784 -116978 -67118 -5420 43687
8816 43687 48777 39909 35988 26578 31238 -8910 -6912 -6488 -23875 -19741 -12825 -3371 -37171 -18719
8802 -18719 3096 -4519 -30140 -37087 -31311 -45148 -62192 -48169 -31268 -35732 -5354 18550 36951
8789 36951 29318 -13427 -31984 -28337 9999 27891 30568 20477 14236 -5959 -1307 42991 44219
8776 44219 24353 -10894 -16437 31412 52754 77105 37244 -1650 3512 52763 67789 33020
8764 33020 24428 760 22038 59027 51663 31545 33820 29989 1230 -7917 52339 66615 18663
8751 18663 3071 33161 40968 -24163 -19286 8367 22331 -15028 -21983 -16310 -2910 -10580 25521
8738 25521 23895 12814 3153 -23858 -21675 -14711 -56876 -34027 -32801 8812 36013 -25043 -23760
8725 -23760 -17123 -74363 -122356 -88746 -61436 -48652 -30836 19532 21223 16920 24459 13772 -26370
8712 -26370 -71350 -61122 -17153 -22303 15396 43470 -2560 -34550 -41650 -48910 -34267 -12281
8700 -12281 -11211 9683 7492 -14181 -24357 -728 4606 -13243 7825 -25227 -34305 -36984 -17543
8687 -17543 -14206 -18195 -10423 -14029 -33134 -32609 -34589 -14357 18517 24068 -2590 10932 22329
8674 22329 4263 -31405 -51571 -28200 -9298 -36260 -32753 31276 29857 62158 67699 37311
8662 37311 3662 -2527 -43271 -10332 12113 11625 2023 -22306 -24404 -65475 -59027 -33681 -43632
8649 -43632 -78031 -64661 -27035 -28842 -15387 -37022 -53962 -61093 -59465 -21713 8041 -1008 3614
8636 3614 -29153 -28885 -35187 20143 11905 -23670 16139 42605 -24810 -77142 -95572 -92664 -69084
8623 -69084 -21347 6651 -14007 -24166 -23399 8245 9813 18693 -15204 -2249 -3954 6090 4321
8610 4321 -30592 -45144 -28342 -24787 -61588 -61508 -38606 -17502 -16517 -1668 18025 -8403 -14724
8597 -14724 -10114 1897 -8198 -38878 -20069 -54733 -37300 -11018 11994 24625 53762 44203
8585 44203 12138 7016 15928 1067 -29609 -33946 -40882 -33551 -8473 14343 12066 22773 6013
8572 6013 29664 22398 30017 56250 51218 38954 16284 -3945 14286 -3980 -20409 40721 68972
8559 68972 40017 18810 41611 39007 45113 217 -62447 -70713 -49070 -62600 -58543 -38283 -11569
8546 -11569 -1177 5725 -15427 -11936 -20139 -37573 -55661 -28070 -29705 16988 26315 25169 11948
8533 11948 38169 68519 66111 58763 9804 -53988 -64592 -27502 -1189 595 13520 7000 8087
8520 8087 -3208 26915 36760 -42882 -46039 -11071 -6111 39895 58056 48651 39580 20918 8309
8507 8309 -5749 -14072 7901 -1551 -10004 19098 55415 66992 69925 57661 382 -39517 -27170
8494 -27170 -47486 -17794 8380 538 -40437 -58783 -31334 -35519 37156 93846 88671 64379
8482 64379 80052 75938 65392 45008 -4944 -57134 -27703 -11434 -23817 -36540 -13562 -17872
8470 -17872 -38584 -31883 19489 49118 -433 17180 72431 54380 19010 18390 17203 31858 43225
8457 43225 9583 -11309 1028 -13832 -12424 -30102 -61448 -50039 -5550 4699 12550 13174 -10652
8444 -10652 -4601 5282 -18820 -220 27257 65145 69589 11075 4558 44638 61267 40750 43862
8431 43862 61700 66730 28678 27854 24828 42375 87055 57760 12380 19497 14899 -11267 -18046
8418 -18046 -4769 25532 14296 -28137 -51974 -49089 -52009 -54211 -60576 -49584 -55090 -70211 -10852
8405 -10852 14489 -8219 -2789 22080 34619 25032 22956 -11839 -41485 -63457 -78587 -82147 -51170
8392 -51170 -58204 -68253 -29801 -5692 -878 25116 49352 21512 10360 -2532 -42120 -12343
8380 -12343 -1177 42935 20678 -52164 -26728 15129 27249 25148 42114 19753 2184 6664
8368 6664 21192 13481 8669 28367 9166 14756 12318 406 -9852 7123 41404 40713 56699
8355 56699 20427 2425 4456 -2271 6738 -10220 -41398 -43985 -14042 7044 21215 22079 -15859
8342 -15859 -3355 11849 30938 59055 166078 302776 480139 509786 468547 370510 268436
8331 268436 201898 126057 95366 47511 43072 27825 51257 42365 7916 6374 20015 13859
8319 13859 -2932 7584 24478 15251 6987 -29198 -45261 -13664 -28627 -61222 -56824 -32980
8307 -32980 14573 31012 83291 115197 102158 101412 36407 46950 77933 126213 156147 170604
8295 170604 212935 307575 505663 737672 820495 783484 687684 504503 367865 235137 178004
8284 178004 140403 113347 146664 147772 122351 120757 143921 116013 65906 46335 27339 21583
8272 21583 29160 42023 40211 59078 48174 46833 29886 9190 13331 8290 -17357 -12873 -47030
8259 -47030 -47317 -2395 34294 20798 33404 29782 33067 70245 82678 151609 207844 301308 361658
8246 361658 368963 323124 214815 137226 86097 29036 15263 9091 19184 23080 26393 6071
8234 6071 30705 35658 -251 16724 12522 521 -17316 8539 7727 31571 86648 68197 33529
8221 33529 -19114 -2211 0 -32202 -60784 -66508 -60532 -53623 -47497 -6262 45975 63042 51386
8208 51386 40724 12127 -43354 -18293 21989 -16541 -28806 -44517 -12170 -12791 -41455 -44499
8196 -44499 -32985 -51388 -65785 -45470 -40332 -39770 -11498 -6486 -5377 1914 30123 33306 9684
8183 9684 -20823 5596 -18083 -68646 -82652 -39668 -3541 25939 -6606 -34484 -9675 -14089
8171 -14089 -26483 -1779 46963 32885 12501 28817 -4478 1415 -22016 -50543 -72460 -23410
8159 -23410 49795 32405 -37620 -85475 -65528 -17939 -29540 -40041 -40009 -19578 34431 71474
8147 71474 61380 45875 18845 -2060 -10642 -13236 -33720 8999 36989 -24471 -51040 13964
8135 13964 -211 -30291 -50511 -79148 -54585 -51783 -58863 -24965 -26936 -22815 -5823 -13889 -26781
8122 -26781 -33368 -83454 -63931 -15172 -14027 -1545 21194 71378 72709 13592 -16209 -53063
8110 -53063 -64817 -47049 -11924 4633 -35883 -34472 -49900 -50464 3578 19410 4548 26312
8098 26312 17341 16148 16777 -4175 -58854 -44516 -38010 -5298 28803 5903 -15811 -15132 -16546
8085 -16546 36256 42247 317 -24083 -29477 -32690 -33706 -40388 -2636 24637 -23577 -53344 -33579
8072 -33579 -49332 -69496 -20333 -30255 -14111 -10817 -22807 -18502 -8915 8707 33383 18684 10996
8059 10996 48997 47911 -39037 -51236 -32096 -14813 -19215 -359 7404 -1112 -27196 -32585 -17879
8046 -17879 -10735 -24506 -28948 -31157 -15114 -29704 -73766 -65246 -36197 5475 -33675 -60626 -80992
8033 -80992 -61371 -38702 -48372 -29488 -8653 -61024 -97918 -101083 -75832 -59038 -60245 -54725 -24004
8020 -24004 -16495 -46599 -69338 -90325 -77235 -76042 -70896 -109452 -134338 -50993 9235 15459 -278
8007 -278 -25606 -7001 -3716 4147 -10382 -29057 -6051 -5248 18403 37130 39733 30053 15550
7994 15550 -8121 -44291 -53753 -17357 40691 70890 29719 7323 -27689 -84026 -64234 -27911
7982 -27911 -16258 -9249 30678 28203 -29576 -70054 -58136 -13430 11936 21795 16101 -24797 -63228
7969 -63228 -55682 -20841 -6940 -10382 -12400 -1883 44666 32662 61238 38287 -23309 -27858 -4415
7956 -4415 -49585 -61551 -38002 -35123 -61864 -63126 -78369 -84892 -30554 -21853 -56063 -55698 -57000
7943 -57000 -96294 -99217 -83489 -67832 -48841 -53305 -36646 -55016 -67500 -67129 -67261 -57458 -68639
7930 -68639 -64025 -55276 -6988 -17759 -71781 -95669 -103161 -72763 -42739 -32001 -23249 -22428 1813
7917 1813 -3069 -13335 14953 19123 14445 16140 1409 10520 -16528 -52400 -27300 -3102 9193
7904 9193 9630 66446 124880 78451 38533 65148 84201 102134 79027 37384 1782 17078
7892 17078 4067 10079 -1766 -51568 -46534 -73846 -64272 -71607 -40486 17622 16892 -27037 -80190
7879 -80190 -72219 -65442 -93155 -107851 -84892 -32416 -29029 -36468 -42962 -2499 30510 -4604 -9187
7866 -9187 -6947 -20136 -14640 -3797 3190 7036 5156 -17106 -4292 -35675 -38287 -53195 -61150
7853 -61150 -66713 -51352 -22722 -27295 -44790 -35880 -19069 -65816 -69150 -18599 -15960 -11717 3060
7840 3060 1176 -35549 -43040 -48553 -37929 -14083 -22139 -32703 -74914 -82334 -56154 -5589 6601
7827 6601 12946 -2497 -24051 -15991 -4013 -33994 -33207 -9772 14955 11014 -27970 -47386 -55141
7814 -55141 -30331 -13394 2201 1785 -14923 -40743 -64812 -62342 -106876 -87008 -66685 -85422
7802 -85422 -66497 -51319 -3093 -25451 -18167 16541 12409 39973 52955 -1070 -16479 -7934
7790 -7934 -39837 -42771 -34399 -44452 -20880 16916 66619 104071 73688 17121 -39665 -54819
7778 -54819 -53423 -82601 -58938 -33935 -24735 -42981 -30176 20572 38353 27098 20942 17942 -37380
7765 -37380 -39314 -11213 -18331 11161 64379 62154 42473 10911 -8581 -10789 31093 83874 67441
7752 67441 50724 81296 111230 71583 31906 -10148 12772 27985 -4134 20321 42769 8608
7740 8608 -5932 8109 26956 19338 30190 18580 29236 31532 2926 21780 24953 10995 9875
7727 9875 17223 38085 16789 -2840 2868 32240 54128 80343 63339 62880 61135 55300 21948
7714 21948 -45489 -45457 -15089 -20492 -41701 -86084 -36755 17086 -36257 -83774 -99916 -82822 -48864
7701 -48864 -22321 7468 3982 -33728 -49414 -35260 -3503 42376 25346 19350 13654 32697
7689 32697 29718 21207 4047 48182 48863 24093 -21612 -63264 -77566 -49174 3808 49450 87621
7676 87621 83094 66633 26403 -8100 6802 1126 1188 9961 13816 25488 65772 89808 60573
7663 60573 7497 -6432 -20014 -58949 -67960 -30190 -24247 -9790 23508 42517 45532 20275
7651 20275 12888 4753 9783 41661 57393 15933 -19516 -35581 -6651 26446 73487 92590
7639 92590 62876 15654 18471 -12628 -34444 -46807 -41407 -54435 -29784 -26703 -64056 -62868 -27203
7626 -27203 -41977 -82517 -96301 -111062 -110386 -66467 -31271 -51071 -78768 -74163 -46981 -34455
7614 -34455 -52225 -41944 -23809 5082 33132 23960 -16716 -46690 -16992 -17171 -24000 -42154 -31014
7601 -31014 9394 39486 -4476 -43578 -44910 -28121 -8113 -29741 -29829 10097 29809 29236 27785
7588 27785 17121 -3276 17775 29774 6488 -7413 -48291 -80651 -99974 -105328 -97295 -70294
7576 -70294 -29189 -6742 8589 14232 -16870 -6780 8897 -40759 -41948 15266 47501 74988
7564 74988 79282 23940 2311 -29839 -14684 -45024 -53770 -64388 -45799 -20895 -51725 -91123
7552 -91123 -80306 -26727 6056 20290 -26406 -52177 -41413 -29433 -17406 4420 -2357 13087
7540 13087 20069 9493 38643 39055 29322 5182 -39019 -75773 -60884 -58352 -41644 -59011 -59222
7527 -59222 -33775 -75575 -106522 -54731 -42078 -79218 -117093 -75357 -54375 -45480 -56215 -26983
7515 -26983 -13702 -11851 -13576 17780 11051 -46571 -55783 -66046 -68481 -66170 -91167 -28446 22655
7502 22655 49536 35312 -718 5879 51519 22726 -41971 -73723 -79914 -66245 -61469 -56361 -38672
7489 -38672 -1180 64603 69929 65731 42968 -14313 36358 73986 21737 35295 23997 -16840
7477 -16840 27550 78073 60076 7909 -33782 -36804 -33960 -1319 -59 20296 28664 31058 19858
7464 19858 23178 40464 7934 -68163 -95945 -97948 -84149 -82545 -75884 -82828 -75728 -67182 -51912
7451 -51912 -30177 -36376 -29120 -33178 -37337 -9358 -61101 -111434 -104472 -104607 -45744 21474 -524
7438 -524 -864 11816 25963 30065 15434 -3314 -45459 -27769 -4905 -19070 -50100 -86048 -101723
7425 -101723 -95812 -95520 -75442 -7119 27304 15238 -49817 -56877 -29701 -23350 -30323 -15981 -10368
7412 -10368 -7824 -6118 11087 16146 4852 -13203 10265 -5124 21799 28295 13221 29678 45595
7399 45595 22801 55773 39203 14609 20574 -4627 -14873 -20351 -22627 -27731 -43637 -15715 -16859
7386 -16859 -22015 -7366 43035 79629 89159 93418 93579 28767 -165 -2328 6212 18551 8959
7373 8959 -11353 3452 14479 644 -1443 16926 53769 62801 37788 12938 -33765 -44997
7361 -44997 -20332 14969 31505 18886 14958 -18056 -9891 21881 45277 13187 29426 -6843
7349 -6843 -80247 -75713 -77930 -77896 -63645 -43727 -42457 -76320 -61207 -10836 29952 29996 -284 -46318
7335 -46318 -70707 -69171 -66416 -64755 -99905 -103346 -49845 -16772 -2097 25528 53684 82896 53238
7322 53238 16102 -18610 -42045 12435 66492 82640 34225 -13012 10239 35707 -25924 -83694
7310 -83694 -93238 -16057 42918 17755 -54024 -60916 -78763 -94942 -63955 -26115 10157 1497
7298 1497 -21089 -31919 4772 14635 12136 -39983 -19984 -22337 -24955 -38880 -31226 -13029 11236
7285 11236 40528 53823 9133 -16565 -22698 -9884 -18520 -22026 -16375 41498 46699 -15864 -25766
7272 -25766 -55018 -80151 -71597 -10143 25622 24346 36178 49043 57364 13804 21788 24740 27300
7259 27300 26819 26589 41907 59287 36780 44831 55311 18499 13382 39658 30522 -8315 29127
7246 29127 60509 34692 14124 -25384 -70146 -47546 -21865 -43469 -46504 1540 29081 25648
7234 25648 15874 -31587 -48484 -2312 -8428 -22453 -48127 -91369 -128296 -119405 -96032 -85402
7222 -85402 -93650 -67536 -34553 2300 -382 2469 -11424 -39155 -48694 -117446 -103107 -59325 -42969
7209 -42969 6974 50868 61123 57670 42938 81266 27387 -2414 3503 1367 807 8753 14106
7196 14106 40198 15399 8681 -1534 -11088 45809 39136 -1282 -26519 11847 69269 22346
7184 22346 -13850 -31129 -23846 -74723 -71079 -19461 -23417 -67070 -82607 -31422 -10929 -1383 27852
7171 27852 -6027 -75505 -79314 -38794 -7447 -8316 -9747 -9024 8207 47844 107327 127763 130458
7158 130458 97475 24902 -22173 -6621 -12835 3797 2644 -6592 24193 8 -6708 -2276 -3477
7145 -3477 2907 -7586 -10927 7469 20428 -16016 2558 13682 5847 -4970 -39332 -63472 -65146
7132 -65146 -57706 -44977 -13750 34533 2671 11099 44160 24972 38455 27431 -396 3198
7120 3198 12308 15366 -221 10825 23861 5143 13841 38512 3534 -53829 -52101 -43905 -18181
7107 -18181 -16059 11314 65611 39682 17660 -3325 -5762 -33314 -45268 -37313 -24774 5854
7095 5854 28375 -9595 -48635 -25718 8548 34022 79917 88546 66150 2042 -45469 -17405
7083 -17405 29192 33320 32061 -5013 -14304 -24615 -37780 -8187 -11112 -33384 -43894 1647 21136
7070 21136 33728 -1297 -41475 -2194 6364 -19225 -24894 2518 8505 25122 20841 -9028 8350
7057 8350 12332 -49141 -88602 -34983 -6891 1997 23813 -10243 -9889 11318 14197 -28883 -77325
7044 -77325 -46385 -24806 -37219 -20402 26450 71925 61314 37112 1675 -2861 -32975 -28357
7032 -28357 -19908 -27360 9 8269 -14982 -13519 11310 35594 52902 69270 72972 53746 31707
7019 31707 44550 68413 55628 53805 49491 3850 13258 -22832 -69322 -50108 -70777 -24431
7007 -24431 33365 42323 39193 30878 28393 36218 -3430 5607 19085 55798 72286 47336 30624
6994 30624 65990 35315 12830 4454 33145 42332 18041 5264 19364 21049 21179 18339 -29857
6981 -29857 -51156 -64268 -32494 -25339 -23763 -5582 12942 48109 39391 20918 8017 -32851
6969 -32851 -35664 -18319 4434 -24782 -2799 8910 4391 -31468 -8395 7758 -3836 -20485
6957 -20485 -7009 10057 -6020 -9951 -6313 7155 19477 30416 -23553 -77536 -53894 -14438
6945 -14438 -2587 14723 -10030 5687 -4122 -15261 -61249 -32993 8376 31296 22530 -22933
6933 -22933 -2297 27531 14138 23979 22910 42326 16716 -10714 -6621 20433 57166 43278
6921 43278 26567 51361 14741 -5769 -12024 -37918 -14894 -11623 19093 27603 17873 34228 29021
6908 29021 -18797 -27156 1614 -1281 18652 46662 58311 42139 16787 49630 69182 7727
6896 7727 -4668 50960 47720 44664 35831 37993 53317 54314 41668 52653 15724 -2300 17952
6883 17952 -3791 -35995 -71162 -32415 -11675 -41884 -43960 -15990 12380 -10162 -394 27672
6871 27672 -10469 -1277 -446 8567 67302 88507 77526 73445 51488 16321 -27553 -51658 -66939
6858 -66939 -25414 14044 18412 -39466 -53832 -28486 -29179 1508 30846 23406 -11463 -14434 -31304
6845 -31304 -11673 -23105 8361 -22215 -10688 33363 46873 30770 53600 66307 47141 32998
6833 32998 68191 54005 34398 58295 51837 44129 62792 55936 45454 3379 -21783 -42942
6821 -42942 -75025 -40705 26183 44407 71598 82608 44515 -5341 8097 -5374 14471 58803
6809 58803 55673 36973 5165 33459 37547 38353 -5777 -59624 -51390 -82188 -95714 -59107 -56399
6796 -56399 -51547 -48072 -68544 -73908 -5069 25095 1055 -16631 8092 -10981 -7605 6002 49
6783 49 -10076 18948 9654 -13133 -61759 -73437 560 21214 -27408 -54361 -47243 -30102 -39319
6770 -39319 -21714 29478 61355 63615 14964 -34785 -21006 -569 -35213 -69121 -58417 -46186
6758 -46186 -59585 -61711 -20933 66 23720 -18727 -45741 -60262 -75616 -86465 -89528 -108848
6746 -108848 -67895 -20133 -8910 -2817 26606 -2044 22102 47252 11602 8712 -38076 -37398
6734 -37398 -33440 -375 37400 -2693 -6385 -3631 821 -27362 -49448 -18213 52956 43007 14473
6721 14473 21158 -2368 -31941 -13586 7857 65020 64162 54877 71886 86137 62151 50863 51120
6708 51120 32653 42097 34150 23895 32555 14981 11345 -25158 -63100 -66396 -6256 -999 -31566
6695 -31566 -15435 14969 10623 5053 18654 26614 17770 19666 27770 -7397 -35317 -35221 -66935 -76488
6681 -76488 -56584 -47721 -19161 -1101 -28877 -48363 -29504 2717 41088 38682 32938 41615 60478
6668 60478 49463 43387 50900 16448 40397 8185 -28824 -11173 9964 -56155 -130687 -113208
6656 -113208 -70730 -30623 6253 -9413 -40610 -6159 16148 -20050 -4475 16236 321 5645
6644 5645 5190 5759 1153 -23800 -45453 -36848 -15088 -8703 -16385 -8086 32597 2393 -35569 -38024
6630 -38024 -32571 -30524 9225 30165 9740 -841 18925 13585 -10992 8524 25695 59624
6618 59624 44542 -9877 -25847 -39026 -11992 -39391 -15253 46838 56303 55566 -28074 -64203
6606 -64203 -67777 -66135 -55549 -40264 31977 45564 48158 -13106 -22753 39032 76989 56717 68466
6593 68466 95698 92689 114929 100722 82017 43538 51519 34514 -3751 7342 34815 63852
6581 63852 66400 58728 25972 20183 475 -39298 -50249 -22946 11078 17756 15812 2019 21774
6568 21774 42229 59506 35907 40867 82612 41787 2930 -39990 -60964 -32439 -21953 -42720
6556 -42720 -33964 7114 5954 -37843 -43515 3973 676 -8122 -5518 -12470 -1036 10511 -16741
6543 -16741 -2533 15401 1449 -8758 4462 11103 6039 -18134 19444 76928 42323 7233
6531 7233 8020 35493 1434 -32345 -48219 -55611 -73693 -86808 -63046 -41405 -64209 -98219 -62822
6518 -62822 -46664 -22603 3883 -3857 -11929 -46246 -48391 -22275 -7341 42026 33879 -10591 -12204
6505 -12204 11286 20933 -479 -13980 -30788 -74680 -92073 -61348 -28200 15085 21257 43891
6493 43891 46843 62157 59024 40268 -3468 19594 35638 20605 -24155 2398 39788 4215
6481 4215 -29941 -14757 -21028 -30498 -11751 19787 -19904 -42766 -58634 10121 26716 45487
6469 45487 66385 30087 10746 38853 3958 309 28450 26682 6396 32978 68148 34783
6457 34783 6497 -30033 -43082 -12121 38621 8916 22099 18857 -3727 3402 -10226 -42852
6445 -42852 -96112 -124236 -88856 -37409 -10046 -8832 -33278 -57300 -38383 -1971 -13298 -35151
6433 -35151 -17492 -9638 6583 -7862 -13148 1506 34346 31537 23517 19634 43820 24486 42896
6420 42896 52844 55826 18275 26038 40824 -7078 -29660 -37054 -14171 -1110 -34612 -54718 -39648
6407 -39648 29681 26309 18449 30222 20050 -14218 16956 36530 14159 6452 -27925 -34900 -59633
6394 -59633 -20706 -14079 873 9894 -9067 715 29380 62017 40490 18074 36186 63225
6382 63225 51643 71248 28120 -10708 -19056 -31887 -26435 -7203 -23337 -14909 -18791 -30998 -36895
6369 -36895 -11193 24146 16475 35795 38257 19824 46899 20239 14852 -3456 -18620 10559
6357 10559 34897 49218 11335 13885 17969 -27004 -42838 -57738 -54800 -30822 -30028 -44448 -73464
6344 -73464 -101775 -71487 -15601 -7266 -37430 -30838 -21402 -38710 -53341 -42216 -51848 -45377 -74612
6331 -74612 -102931 -68942 -21936 -724 -18641 -294 30483 12943 27160 -12505 -26314 -5750
6319 -5750 29907 44897 34730 21450 -12876 -751 23140 21304 12957 -36315 -34809 29541 71579
6306 71579 47310 20935 -6821 -6849 2559 14420 21647 50420 32800 216 -3059 21308 21143
6293 21143 -4763 2422 -27887 -46343 -53805 -33286 -18642 -35817 -69765 -55890 -16738 4151
6281 4151 30674 34815 -5504 -21180 -10251 7651 37068 51090 7274 12645 24186 15624 -9771
6268 -9771 -18615 12203 39887 34555 12709 11127 12477 17191 -23002 -19691 5389 43173 44873
6255 44873 36006 -8451 -6998 13732 13454 46010 54057 29579 30501 4062 52317 63905 51727
6242 51727 51123 23328 -444 -30025 -55207 -54186 -72675 -32853 7248 -18895 -31278 -63927
6230 -63927 -39886 -18230 -61638 -97253 -73125 -32392 -15675 -8430 9572 -9350 3495 -13612
6218 -13612 -19583 -22016 -30819 -59010 -50413 -19502 2624 25153 74398 72399 75640 85062 34775
6205 34775 1345 8566 -15371 -21218 -7388 -11521 -26890 14098 36456 58529 9945 -17587
6193 -17587 -13758 25264 16998 -8065 7910 -1657 2721 -5334 7803 -11172 -38268 -49161 -23082
6180 -23082 -37658 -22263 -30668 -8065 61871 72734 38724 30964 4616 -26761 26708 80614
6168 80614 97247 92074 51876 29750 3334 -6367 26199 61376 17708 -14815 -32907 -663
6156 -663 46120 26841 -10798 -31505 -62354 -63505 -61380 -34374 10163 3246 6393 11616 -27713
6143 -27713 -46911 6210 19184 -19653 -26490 -16758 -5842 -41002 -33824 -4815 14732 16150 -26255
6130 -26255 16168 10984 32304 8781 -20538 -41093 -26987 4502 -10326 -57646 -65046 -36734
6118 -36734 -14812 -30613 -44555 -22542 -16157 41922 64469 60272 20258 7046 -24639 39618
6106 39618 74908 87573 31375 17228 22673 21309 3484 17473 49018 114745 85777 29684
6094 29684 22383 56738 81108 89229 33043 -24252 -3927 56650 13849 24579 28494 62145
6082 62145 22903 14195 13167 1438 12675 -23295 -46560 -24503 -30988 -15713 -18317 -28630 -38459
6069 -38459 -40639 -30583 -51338 -85540 -53303 -41048 -7752 1264 30166 32619 21300 8970
6057 8970 28755 43197 50658 64599 50410 -28872 -51338 -17173 -9572 -61337 -99788 -65165
6045 -65165 -63491 -93553 -88843 -96329 -95439 -83356 -53678 -22781 18763 19165 14679 19609 31740 34538
6031 34538 31006 -11264 -41750 -38395 -4486 33090 53626 20166 23934 -9569 -10604 -8332 8582
6018 8582 75113 80344 31084 -14027 -25515 -31756 -26541 -25854 -66535 -59494 -51120 -34282 -23472
6005 -23472 -38841 -63290 -80216 -44578 -42116 -22118 -3551 -18904 -26904 -54332 -69389 -57635
5993 -57635 -40822 -46978 -12307 -14842 -2381 -14332 -41250 -19105 -16291 -12044 -5725 -2263 -3049
5980 -3049 11637 6497 -11424 4121 31300 47252 52059 48976 5393 -6305 20628 44781 -2977
5967 -2977 -56137 -47997 -46836 -26532 -11768 -64644 -112642 -115167 -17879 -1668 38343 35376 31617
5954 31617 40263 31868 23875 -19908 -53332 -32450 22879 4200 7963 2423 -16660 -17640 -1918
5941 -1918 30335 854 -18914 -42583 -21877 105 -27089 -26658 4061 -1066 -21857 -26153 -26835
5928 -26835 -63780 -53119 -44819 -36724 -13976 -17720 -4927 -15079 -33816 -8739 14356 6490 -7309
5915 -7309 -8038 -53748 -81597 -47039 3755 6973 1981 -4187 -61045 -59197 -21883 19910 1266
5902 1266 -24230 -13634 -22159 -32507 -14175 997 57287 35772 11956 1455 -15914 15985
5890 15985 19512 2572 1704 15446 28492 24781 37140 46903 23037 -47992 -52289 -31081 1353
5877 1353 -17977 -41852 -26415 -7689 13730 38234 18702 -24217 -16114 -26455 -25434 -30952 -62276
5864 -62276 -53162 -30817 38069 87080 83142 61420 49086 33962 20255 -17101 -15300 17725
5852 17725 3593 20517 18270 -7862 -16987 -18342 -7954 14782 65975 43174 20686 13179 34595
5839 34595 32205 13309 5014 -10282 -59639 -83085 -95432 -21953 54719 38897 33429 40764 29183
5826 29183 9382 -13522 -5870 -18419 -3081 8015 11617 36881 58028 9966 17599 51477
5814 51477 30355 -7951 -48828 -29252 26874 37063 17194 -3657 16047 -22496 -32757 -30377
5802 -30377 -33327 -14438 2315 -7277 -31708 -1680 5930 -45047 -51833 -66089 -78595 -83892 -107806
5789 -107806 -90858 -59082 -55504 -87156 -74261 -78638 -21752 46215 66382 68732 113513 50273
5777 50273 12642 8794 2072 -8346 1375 42445 17359 30265 39187 1311 -115 8402 41948
5764 41948 89165 80340 14161 -13567 17111 25862 -5409 -15606 13142 1797 -28573 -30907
5752 -30907 -31006 1186 19933 -28779 -84357 -70457 -34533 -25994 -32749 -454 9435 -33635 -16340
5739 -16340 -396 11137 26964 53068 38223 -9402 -26127 -58625 -72381 -89356 -85900 -33234
5727 -33234 17158 -33999 -55745 -63716 -56801 -19651 -21882 -46873 6587 -748 -14806 8078 74465
5714 74465 90096 45214 10896 15528 -4885 -26136 -50082 3276 13649 1768 -31017 -54173
5702 -54173 -18815 -15168 -24695 -18724 -37244 -61660 -22568 -11584 -6348 -34076 -14682 9044 30366
5689 30366 -5680 -44588 -23011 -22309 -2610 544 22663 12327 -29246 -27414 17457 15131 6233
5676 6233 387 -8383 -59616 -71438 -63757 -20817 13450 57245 106884 100350 78619 102615 108438
5663 108438 81793 20289 -2221 -31448 -19659 -2709 -1975 -35490 -43873 -38560 -26788 501
5651 501 6737 5378 -5040 15859 4417 -27264 -14929 4420 45166 52042 10232 5968 24812
5638 24812 85 -25404 11334 37517 16309 23909 16223 61626 61989 25227 16156 -47764 -73245
5625 -73245 -67569 -55880 -10338 -10495 -31553 -37838 -53593 -31937 -51700 -57632 -21140 -8196 9443
5612 9443 29569 7008 -35088 -66160 -78168 -25625 -14648 -22220 -23609 -35723 -27718 -60577 -65540
5599 -65540 -54832 -50847 -59576 -12795 5378 9130 202 -13283 -9357 3705 35973 19607 23470
5586 23470 -30325 -41062 -44297 -21055 -15890 -4023 -515 2750 5916 22640 14855 -540 27864
5573 27864 27669 -4221 -54366 -24412 17331 28778 20978 4737 5314 14969 21260 18035 -2395
5560 -2395 -22071 -1184 -25188 -26676 -23291 -28497 -30000 -19261 -34523 -28564 -41684 -58871 -64523
5547 -64523 -83634 -70328 3308 38775 28148 -10744 -50018 -51489 -43761 -78096 -62989 -61486
5535 -61486 -66499 -65025 -70172 -44781 -18660 -17279 -54380 -43339 -9401 7243 -7604 -11892 20103
5522 20103 -12666 -619 24851 39669 47624 15867 12141 -4384 -4706 22360 65924 106586 82031
5509 82031 59116 42623 29338 -863 45561 84970 55675 54062 68441 27206 -32704 -47622
5497 -47622 -53434 -73629 -29555 7270 -20017 -65506 -59204 -52641 -54946 -45807 -24995 -3317 -12799
5484 -12799 -4186 22727 21110 23100 52917 40397 18954 4624 17621 19029 34637 33518 31280
5471 31280 -1243 41963 44381 -9333 -5757 -3509 -17419 -39330 -48516 -33366 -36526 -118 37986
5458 37986 67810 82866 71827 77150 66172 28622 43885 -10845 3048 4760 -34745 -24078
5446 -24078 -23346 -4792 -18719 -1 15120 9343 -14400 -16463 -1582 6600 -40877 -10039 18235
5433 18235 13637 31789 9431 -55449 -88624 -64739 -9218 19476 28290 533 -19484 -5579
5421 -5579 -18041 -14340 28358 44654 -1207 3577 24712 3888 16190 3082 -8624 37832
5409 37832 49457 57110 52823 40890 43368 23869 4447 -2118 -60297 -51061 17952 2370 -42916
5396 -42916 -39503 -32359 -10087 -24001 -58166 -57180 -22420 -20988 -21780 -69768 -68373 -8719 31475
5383 31475 73056 48146 -2792 -24236 -46404 -7331 23533 15196 -2023 12258 30 -39561
5371 -39561 -59505 -66818 -47372 953 -39226 -64463 -47251 -53473 -63587 -34731 -47465 -50030
5359 -50030 -19145 4524 -6450 -1660 10285 23907 18766 -37915 -36554 19003 -3935 -27893
5347 -27893 -13835 -20519 -24403 -36183 -65670 -37127 9522 -14776 -47841 -17588 5924 -19857
5335 -19857 18545 27174 -4694 -18135 -60630 -55816 -63381 -76053 -83891 -120463 -106591 -50691 31116
5322 31116 67236 61749 46614 71107 63330 79092 92850 37235 9620 4605 -18930 -35235
5310 -35235 -33825 7570 -37999 -56076 -85350 -94235 -59927 -29213 -3797 14844 51892 51991 50918
5297 50918 40813 20246 -40403 -56478 -54087 -42887 -18627 -22739 -20297 -30331 -22012 -18214 -13992
5284 -13992 -30855 -44398 -10724 -9765 -18537 -28417 -17029 -45917 -70442 -25728 -9921 -40020 -31958
5271 -31958 -34287 -69048 -56963 -33752 -25556 -42623 -27277 -9419 -11323 -8173 -89 -61923 -73649
5258 -73649 -45478 9876 44865 56997 29940 -5320 -14131 1647 16139 13107 -18461 -7044
5246 -7044 -36874 -5939 29089 27240 42977 56666 2573 -28541 -26672 -945 47622 71565
5234 71565 50639 56313 68119 46541 31118 11269 3134 19487 16987 276 9050 12040 -148
5221 -148 -15924 -15561 -14448 -24506 -31413 -80441 -79710 -19498 1984 -8724 -5502 4482 -19817 -11140
5207 -11140 -38763 -85304 -71327 -86065 -90419 -74914 -26937 9162 8639 -1608 36870 76210
5195 76210 46307 26862 24778 51665 32680 -5140 -36990 -4845 -8314 26608 35549 62337
5183 62337 24691 -8324 -15165 22212 48874 30566 33759 57386 60598 62258 49808 65767 73269
5170 73269 89449 67401 5366 14191 7899 -6424 21574 9482 -5584 -9254 11508 -18951
5158 -18951 -10382 37342 44941 28153 15717 -30028 -64079 -56372 -49145 -67863 -56558 -55464 -47661
5145 -47661 -7663 -10975 -36816 -33817 -5064 1283 5159 -808 9900 41716 24764 -21069 -49898
5132 -49898 -66076 -83887 -50588 -86011 -100801 -38443 1105 12457 10043 -6606 -6645 -41865 -19269
5119 -19269 42480 10200 5778 45659 54499 28528 36673 -20114 -18046 9173 27462 19780 -41817
5106 -41817 -91637 -115378 -107713 -64751 -11329 -22970 -52346 -58111 -8803 -16168 14589 18319 -21158
5093 -21158 -29810 -47061 -18605 30017 27192 49342 38499 8855 37323 58304 32166 46537
5081 46537 1114 -37589 -39201 -48973 -76075 -54866 -50128 -39479 -59507 -51888 8616 11636 593
5068 593 -53097 -34761 16879 29519 916 6303 26189 22614 18397 8096 -24361 -22381 -22290 -20845
5054 -20845 -15420 -40950 -24687 -14603 -2154 -33827 -65190 -40355 -13918 31023 34170 -19090
5042 -19090 -29678 -4190 60616 32413 -24553 -49678 -35260 -13883 -8532 -27326 -40499 -42381
5030 -42381 -70532 -91601 -36741 17233 15828 -24643 -27963 -6260 -37872 -86384 -47634 -27119
5018 -27119 -24881 -5457 2957 8555 -9464 -20975 -4710 8728 2623 -8808 -21239 -24777 3840
5005 3840 5565 1363 1912 21468 33683 24331 11272 -30014 -56939 -82497 -76193 -51866 -71792
4992 -71792 -75462 -89713 -105751 -48969 -13881 -15929 -36332 -38689 35653 57537 -5955 -56869
4980 -56869 -41403 -39684 -47707 -49401 -42808 -41453 -48679 -22028 -26716 -41071 -31076 46638 31954
4967 31954 1172 -267 24084 30108 33481 45341 66781 67050 83917 75792 36586 7123 23842
4954 23842 -3879 -50561 -68242 -73380 -28145 7507 -26270 -69475 -50082 2764 -4641 -1651
4942 -1651 15496 18108 15888 -22462 -23509 -29565 -63300 -67228 -54545 -12702 58384 81623 11786
4929 11786 -3446 23412 5620 -5799 -33175 -29483 -23018 -51697 10959 43342 43773 28184 -11666
4916 -11666 -27376 -23886 -2420 7434 -12781 -21747 -21806 -5948 -31435 -69775 -79400 -59629 7374
4903 7374 -14424 -14849 11591 -6272 54917 101191 108525 97271 64047 27192 -40290 -55455 -54723
4890 -54723 -68028 -87975 -82374 -34351 -3888 -17078 -24437 -21303 -28486 -40437 -57269 -61475 -29462
4877 -29462 -33929 -39564 -95077 -74487 -53111 -11128 23826 35452 58808 61311 16578 901
4865 901 7813 28209 -2958 16973 42469 37792 32664 49868 19127 -4638 12301 46314 37263
4852 37263 -2498 1047 4156 -43901 -74268 -33595 -4602 -12001 12372 6860 18541 -3493 19
4839 19 -18121 -35493 -34434 -12844 -33785 -31869 10409 31035 53678 21644 -6304 -25146 -33494
4826 -33494 -154 26586 53943 39045 33461 14710 -16595 -29537 -43728 -6883 50140 51632
4814 51632 49113 50685 56805 48566 36344 39048 42901 33391 10681 -5323 -2284 -36660 -51182
4801 -51182 -37083 -33527 -18458 11570 20121 28370 2403 -14239 22380 18477 -4763 -4228 -12723
4788 -12723 -29635 4109 24011 -2290 9985 22458 4515 5973 28456 55623 43261 21163
4776 21163 22140 22855 -977 10234 44066 45555 30880 41098 40667 44336 1253 -16924 -18708 -32427
4762 -32427 951 -6932 5455 23658 -1635 -322 753 -26083 -58345 -36080 -28905 -15979 -10264
4749 -10264 1633 5872 2612 5 -24461 -37553 -14423 -4950 -26533 4742 26475 70137 104049
4736 104049 86687 56058 50237 26688 6223 4811 -10354 -18313 8073 6697 -33596 -19671
4724 -19671 1341 13960 7894 40413 76076 91828 111536 102480 106468 91481 60181 62308 74478
4711 74478 84053 72435 16945 9514 22298 62493 60546 9012 -57990 -38293 19795 35463
4699 35463 46818 57105 46894 -5664 -19123 21661 31391 72011 77835 101333 87418 67045
4687 67045 51675 36396 60647 54094 86798 67048 60171 72470 70168 37481 28856 45830 9606
4674 9606 8404 23164 -8071 737 -24202 -22193 15879 13496 -20263 -37000 -30704 -55362 -52124
4661 -52124 -51021 -67961 -47638 -28742 -12525 5111 47324 52537 37903 20884 -1400 -11814
4649 -11814 -10534 56110 114066 78576 74233 77585 35193 11265 21288 15764 -32785 -7174 59917
4636 59917 108058 94112 93600 131617 121514 90174 44655 23929 977 2968 -1664 -10758 -22299
4623 -22299 -7387 -61663 -56966 -20732 -7689 -16141 472 20577 -5539 -64290 -47521 -57078
4611 -57078 -30822 5125 -18835 -14528 -2968 2068 -10467 7596 -5944 -15385 -20231 -24777 -16218
4598 -16218 10366 4678 20131 45415 48750 62432 31479 37194 41287 68998 30208 15815 -9530
4585 -9530 -9989 -25948 13439 34649 25614 -6111 5432 23248 18458 18054 -24484 -43434 -25342
4572 -25342 -33404 -66449 -51707 -33814 7055 15044 -2057 -2939 -25622 -49791 -42817 -30338 -31074
4559 -31074 14423 44514 64935 40809 38118 25111 42998 58014 42771 20502 -34671 -29906
4547 -29906 -17145 -26329 -27748 -32208 -32767 -29506 -32933 -26048 -4427 2777 -26273 -51880 -46574 -50749
4533 -50749 -13619 425 -106 -693 -31833 -17017 -2181 13480 57891 -6337 -61506 -23705 27376
4520 27376 112486 187524 150846 95232 39326 24675 37553 31661 24817 40382 7053 -15327
4508 -15327 -10961 24405 29153 28227 57429 90109 85446 49227 38249 -2021 -2970 12821 25961
4495 25961 38387 18755 11097 7354 -4101 8108 -13306 -21644 1530 -1930 13202 44664 54585
4482 54585 73087 43664 17775 2442 -83 20099 -7589 -69285 -53364 -61680 -64405 -16253
4470 -16253 -19993 17030 12991 -27362 -28371 -25522 -23911 22517 19843 14485 1473 -15477 -23671
4457 -23671 -41215 -38416 -24230 -22910 20284 59340 67426 64880 76524 79017 51337 24889 3821
4444 3821 12369 -3850 -28374 -17611 -13142 -10307 18711 34913 3455 18087 24340 11816 19936
4431 19936 18045 51062 49806 -845 -39213 -24276 -2667 34736 56117 93387 98143 46927
4419 46927 -13677 -970 24241 -4007 -29262 -63274 -84240 -48324 -1966 -7136 -9333 30572
4407 30572 71321 50942 909 -3150 -31743 -27311 3517 76996 124801 84318 49315 29367
4395 29367 20423 28248 66926 93147 50227 -1947 -14900 -18799 -38172 -31974 -47950 -55923 -55264
4382 -55264 -48739 -3345 1582 12362 -24541 -32854 -16916 11231 5688 -354 18509 -5656 4143
4369 4143 14681 -24500 -54551 -48160 -67104 -11241 2947 -16967 -10479 -34903 -16563 24858
4357 24858 18448 -24683 1402 73929 74667 72685 19120 -26313 -39035 -9683 5429 -8552 -1421
4344 -1421 -8445 1940 3463 45343 24977 -37314 -47708 -32457 -39323 -39663 -24157 -30096 5889
4331 5889 47357 50774 -19826 -3406 25824 10055 -20490 -22327 -24270 14857 36021 -10834 -42774
4318 -42774 -56123 -7815 -2028 -13650 -41925 -63623 -49805 -46837 -38986 10102 46542 18539
4306 18539 -35581 -11708 11532 -60 -5221 56301 87445 44448 16328 9867 21889 14195
4294 14195 31574 51300 66735 63023 25446 8556 15587 7371 2581 1358 -31289 -91439 -60061
4281 -60061 9528 17464 27168 16551 -39849 -62555 -19813 -3765 25990 36133 18070 -34323
4269 -34323 -49968 -27455 -53773 -63025 -65836 -67983 -27234 23877 54034 49363 37474 18860 2403
4256 2403 10386 -4817 -20081 -20428 -11066 -10981 -9621 -3947 -11364 -24529 -1 8757 -15138 -66462
4242 -66462 -57164 -36795 -45840 -48442 -46632 -56632 -4175 20208 28156 64058 58414 -16 -14510
4229 -14510 -7040 8892 54686 29773 71472 81472 3385 -24991 -37646 -45713 -46461 -14730 -1256
4216 -1256 7039 15352 24898 17231 -25603 -9540 10892 4382 -25346 -10394 4206 3018 -15055
4203 -15055 24427 30463 54388 55615 62954 46188 -3670 -9187 -70027 -61871 -32028 -13796 -32639
4190 -32639 849 792 -7084 -386 59335 35130 -28720 -68115 -42939 -5451 -29190 -48149 -70573
4177 -70573 -88650 -56315 -55700 -36461 -39434 -50994 -57464 -54550 -28641 42320 48957 -3512 -26427
4164 -26427 -39147 -19230 5536 30853 39381 30192 -33006 -66953 -45576 -18488 -25291 -32809 -53361
4151 -53361 -61319 -28070 29578 64247 44570 4085 2481 41432 100439 52136 -7115 10546
4139 10546 30754 29690 6618 21429 19004 70467 57069 51148 82503 53731 47592 71219 60087
4126 60087 69300 56437 40850 11083 59406 95351 64533 41031 35973 6066 10542 27955
4114 27955 3947 8037 45684 52425 57555 56220 30134 28653 -8069 -30991 -16796 -38496 -66864
4101 -66864 -15115 3543 -36681 -64110 -84279 -67684 -56901 -25693 22960 28219 7591 -5554
4089 -5554 -23694 25526 34857 8966 9058 17795 7878 12416 23399 57722 41467 -2492 -12486 -6907
4075 -6907 -11070 2075 19653 56338 31066 10123 -1055 22472 26606 36843 -15699 -43367
4063 -43367 -23214 -437 26853 8852 -41839 -7874 4405 32930 64525 36375 -21988 -16224
4051 -16224 6322 -15601 -70542 -94664 -80023 -11537 12262 17822 -9766 -21520 -1231 -17489
4039 -17489 2468 29476 -2368 14023 40203 25939 -15653 -13948 -809 16193 19896 48576
4027 48576 38012 2649 -18897 -7530 -10519 -8709 -4185 25550 6757 -16067 5588 12895 34899
4014 34899 9876 -34218 -13438 20071 58563 70514 39299 24904 10227 -11536 9839 -21316
4002 -21316 8714 -8950 -23632 -2539 -25884 -43426 -17031 -4769 -7640 11338 12778 34166
3990 34166 17158 -6895 -8304 3747 341 36262 45216 23498 4456 29262 29912 27347 24245
3977 24245 6825 -18732 -22894 -12447 -14947 28577 37513 12678 -7990 8062 -19899 -13122 848
3964 848 16578 42185 25914 51334 98763 92244 53576 38369 37803 14322 -23120 14293 37895
3951 37895 43349 39859 9127 -6398 10166 -3259 49152 76639 68008 65988 20806 36366 72349
3938 72349 42506 50475 19347 16818 11898 63808 79609 64579 31620 12821 5560 21080 13747
3925 13747 -2934 6620 59628 52540 22775 -4673 -35834 -27980 -30803 -28036 -22567 -32115 3669
3912 3669 47004 63331 63706 47237 72043 80686 47521 38328 25742 11828 2173 -34980 -51006
3899 -51006 -67202 -48326 -7284 -8985 -14318 -32585 -46963 -18578 1927 21076 18294 -11371
3887 -11371 3970 -14398 -38776 -41827 -25808 -8581 10577 33129 68854 8902 -40294 -30703
3875 -30703 -9679 -24828 -26180 -21544 -6177 -6687 12001 11324 -27305 -24957 -15163 -22343 -51000 -88966
3861 -88966 -49010 -5435 -16502 -54087 -47600 -15859 -14497 -24937 -46301 -74907 -49967 -65729
3849 -65729 -80537 -55072 -59062 -35757 19398 26286 27314 22118 -48891 -72702 -50157 -22234 -21225
3836 -21225 -18754 -28618 -24948 -60935 -51504 -37705 -51076 -65338 -93263 -62550 -71037 -55013 -64289
3823 -64289 -26505 -7108 -13008 -35944 -20500 18450 8930 -5786 -25474 -5438 -2860 11440
3811 11440 26690 19478 19723 43165 14752 29145 60759 28183 5332 23782 -3617 -2723 26788
3798 26788 14645 11969 33444 68162 125252 87035 39971 11719 -8513 -19135 -11172 -18820
3786 -18820 5060 -18330 -45077 -27525 36395 42667 39196 27760 -5311 3187 45902 70766
3774 70766 71332 31624 -20044 -19870 5358 469 -23999 -10431 19098 13732 -18953 -39741 -19744
3761 -19744 -20824 2105 11082 -28527 -23488 14250 331 25088 19254 30705 28330 17025 -44521
3748 -44521 -43427 -49220 -21860 31014 35602 34715 8807 5891 1605 10803 60130 67303 8618 -24294
3734 -24294 -6348 41866 32158 13426 -18854 -1325 -25405 -20328 -30225 -41773 -21684 -30958 -19063
3721 -19063 20393 33887 39131 62336 36273 11989 16495 -8311 -57489 -48641 6254 21608
3709 21608 18048 1373 166 -10535 -4793 5067 -13222 -21809 -23679 -86264 -51459 -25996 -34487
3696 -34487 11180 60049 61532 39531 381 -39733 -44418 -25768 -27667 -6576 19315 29389
3684 29389 2600 -51331 -57111 -49891 -21257 -46968 -69935 -66293 -59684 -1371 33181 43496 47445
3671 47445 55919 -2169 -25594 -3752 47584 38082 44109 46771 76655 35103 17243 54117 50605
3658 50605 76228 38648 11317 5651 -832 -11892 -24359 -30346 10822 44997 51322 61047 46604
3645 46604 -10613 -28485 -51794 -53177 -6367 6288 7514 37993 5041 -45762 -84639 -64470
3633 -64470 14028 40511 27641 25361 32233 47154 34246 -15084 -21868 -3806 -49234 -56714 -61089
3620 -61089 -47640 -19662 -28550 31410 56024 24151 -2717 19100 -1073 -10378 -29147 -33394
3608 -33394 -19630 -12204 -35116 -26406 -3145 24245 15316 -19178 -15887 10352 68532 64596 88282
3595 88282 85244 53491 45353 10560 13225 -13498 -35082 -43670 -58320 -61799 -77800 -68614 -27003
3582 -27003 -4683 -22667 -49750 -31094 -2334 -19354 -51290 -59866 -54247 -33334 -9923 21457
3570 21457 24659 38423 -12886 -23375 4173 17083 27455 32148 18027 52144 45722 -30018
3558 -30018 -54285 -52925 -91733 -98415 -81627 -58701 -21110 3228 11416 -17489 -43356 13010
3546 13010 26112 42717 61171 81476 68087 -7736 -43684 -10313 16170 17678 877 18121
3534 18121 22857 -31553 -55816 -24212 -11062 7681 16877 33926 13982 -9719 -6021 -18484
3522 -18484 -40569 -19226 -48999 -76726 -88414 -98375 -74132 -34554 -30029 -45528 -30233 27141
3510 27141 38353 -4112 -24020 -44588 -29438 -24385 -27630 -18536 -11237 12141 21841 17275 3700
3497 3700 -13997 -28645 -25736 -24516 -48519 -20095 3632 2206 1062 1989 -17427 -19393 3253
3484 3253 -13422 -7984 6706 34264 23606 -6956 9155 -24065 -53407 -47467 -53116 -43473 -24486
3471 -24486 -26663 1620 55444 68028 70834 56715 34457 46842 14169 -40315 -48161 -57207 -47443
3458 -47443 -12277 21423 38352 9515 14407 9857 -14592 -37824 -28536 -22385 -36014 -32326 -49441
3445 -49441 -57855 -36632 -29060 -21645 3634 30853 55912 64031 47368 33483 35586 27661 25813
3432 25813 -19235 -63426 -42430 7655 39770 53427 55792 64719 64796 54345 21589 -23506 -565
3419 -565 53158 56724 48050 51673 17618 -2121 -27738 -43286 -5566 16632 18046 -22658 -34739
3406 -34739 -25661 -34921 -53197 -57650 5723 15776 24316 42679 24591 52024 27693 -28500 -12554
3393 -12554 54415 21010 -44533 -38762 -10787 15478 12614 13443 1521 -23774 -68720 -67792 -60767
3380 -60767 -24426 67003 26085 12948 47376 18730 22319 31587 -4186 -9432 -12019 -41100 -40787
3367 -40787 -28787 -36933 -6906 -5967 -8492 2606 -2705 29880 27616 -4475 -3388 3201 20793
3354 20793 30224 15640 797 -20432 -34593 -26120 -30131 -34036 -37630 -28398 1167 17147 8135
3341 8135 45099 39234 -11313 -18769 -8913 33467 40368 17441 -34 -4130 -22280 -46752 -88756
3328 -88756 -80864 -62641 -62144 -48547 -4388 -17694 -49119 -64409 -54940 -32387 14999 24190 21435
3315 21435 22938 14998 2110 50447 77178 2139 -31850 -33310 -27509 668 23412 31665 35051
3302 35051 26631 32898 25621 45998 56976 45875 37753 70694 36360 -12661 3478 33444 71124
3289 71124 54267 38304 46570 23304 67790 45761 24213 5681 8239 -610 6854 11495 -10371
3276 -10371 -49546 -26544 8225 -35427 -30506 5488 -9070 -36746 12790 31833 77674 84147
3264 84147 55006 62088 82473 60696 -3330 -8540 20060 39424 10361 -20600 -36320 -65914
3252 -65914 -52652 1426 93805 144772 158875 119349 60365 55012 55866 61730 84646 61251 27557
3239 27557 18390 -8787 -43859 -38384 -27406 -257 -30859 -9123 33230 64638 80438 43475
3227 43475 43403 36918 64719 73104 33190 10708 7328 -3196 -5456 -31115 -43601 -20369 -42452
3214 -42452 -25021 -14152 -3394 19909 37065 2357 -42937 -56517 -59384 -35378 -1585 -37327
3202 -37327 -17662 60831 89809 84099 33245 29978 14677 19173 7777 20967 35596 9693
3190 9693 -25129 -27832 2607 18785 50628 45727 -2088 -18579 -1964 -37547 -74918 -69571 1732
3177 1732 28121 20345 19235 24191 26436 -35766 -72119 -35983 -10248 -27897 -55608 -57348 -40105
3164 -40105 -6937 8296 26345 -21120 -34177 -8271 -24461 -23111 -7445 3664 47731 72643
3152 72643 -2809 -78123 -66932 -4255 -745 -40934 -24945 -29393 -74692 -79475 -45141 -19745
3140 -19745 -25173 -35685 1454 10865 3974 1386 15738 62205 65233 -37 -9753 6222 -23698
3127 -23698 -32737 -2589 6307 11016 -5091 -15529 2621 13752 16225 21889 16862 -16498 -9546
3114 -9546 15422 21528 21873 -11166 4631 79018 57235 3831 -34663 -50564 -51273 -94205 -86536
3101 -86536 -81673 -36207 22169 18020 1669 21221 63865 94150 75251 35227 -23366 -57007
3089 -57007 -76779 -74000 -19810 -6111 -35189 -58514 -21479 -15968 5880 21735 -21637 3297
3077 3297 27446 -24484 -40327 -11859 4087 18621 3904 -1928 75197 84095 81781 35261 22098
3064 22098 52210 30929 4588 38884 43339 6469 -11076 -6553 41889 50312 55295 60390 53530
3051 53530 -24741 -45559 -1073 3964 -584 -1347 -230 14408 32980 55661 51557 8035 18250
3038 18250 69380 63071 43670 -7198 -30473 -40849 -31883 -4473 14508 44589 71557 48846
3026 48846 3968 35780 41216 16846 39733 41243 23008 30741 6917 -19485 -17064 -43201 -25660
3013 -25660 -24625 -67446 -17055 34871 68380 57691 27657 29978 18216 13646 34963 27684 18626
3000 18626 45088 43553 -3027 -32848 4674 34697 16371 7353 55910 70462 57865 13150
2988 13150 15943 62662 88960 112683 118675 126518 90813 49589 66843 54553 53037 72425 65479
2975 65479 58650 40277 67509 60043 26904 10597 29392 26457 29086 47189 -4535 8875 23279
2962 23279 40394 36010 8365 23795 52688 70663 64766 39146 60542 85701 38837 -10752
2950 -10752 -36339 -4353 -9396 8930 35751 56609 23952 -11704 9134 9115 32102 21957 30422
2937 30422 61502 16906 -9240 43579 38413 25091 34259 48592 19239 12987 19133 2235 2578
2924 2578 -9263 -42431 -50662 -77591 -64566 -41847 -41230 -92066 -63806 -40953 -26456 -2259 23457
2911 23457 56791 34632 29618 19873 13510 9065 -3113 13048 -4432 -39074 -26018 3403 8044
2898 8044 7784 -30310 -27975 -25463 11943 58324 50798 38349 48984 56403 8205 -1858 -1050 12040
2884 12040 6616 -15148 -35239 7533 23881 13815 23015 27383 29534 12260 -8443 15338 29042
2871 29042 52909 -21151 -32053 1749 18439 702 51589 60866 69306 90410 91529 55646
2859 55646 29925 31960 50982 9990 -24698 17359 28917 25371 57017 74344 70693 42108
2847 42108 29150 7869 18232 -18302 -8010 -26898 1827 31844 61579 14922 14579 13696 -23948
2834 -23948 -23575 -36332 -17181 20508 25305 -12605 -52178 -35522 -12001 22617 -8387 -39842
2822 -39842 -48388 -36888 -55763 -45817 -27979 -22211 -22378 -25613 -13677 -51095 -72788 -61794 -56512
2809 -56512 -18311 35421 87690 69164 10791 -2423 -20147 -17574 -17700 -19270 47520 59267 31249
2796 31249 -1019 -13282 -8236 -6436 -43645 -57961 -25297 -26713 -1652 -40521 -43651 -451 27165
2783 27165 6405 -12745 -46739 -72566 -69258 -32211 5703 5081 -20471 -42382 -54524 -42043
2771 -42043 -25222 -671 1920 26104 37881 57492 49388 47366 33809 14211 4490 35973 71075
2758 71075 79054 78249 39095 -2402 -15009 -22159 -50808 -70433 -91563 -57752 -7822 4573 32387
2745 32387 37248 57522 62726 50698 46811 20845 -20549 -59122 -16187 40894 24703 33070 21661
2732 21661 -20238 -16753 7142 52420 58601 32443 56135 72657 42055 20096 7872 19342
2720 19342 -3888 -25063 -36113 -54289 -63516 -30028 33732 65423 91105 57307 32252 27995
2708 27995 50975 63712 23442 6151 54239 83648 50078 2384 -41450 -28815 -39477 17781
2696 17781 29662 21020 25815 31311 27700 8627 -11254 14694 -6089 -26545 -25814 -30773 362
2683 362 7529 -25144 -31303 -35218 -36911 -37366 -4052 42507 59327 48817 44558 42288 -6739 -14986
2669 -14986 -4829 1462 7138 -19570 9053 18149 50152 71182 50094 14014 -22517 10265
2657 10265 41838 15447 78 -2095 29464 -4736 -13849 -26123 -61026 -88078 -52277 -20966
2645 -20966 -6420 -8287 26200 72021 65795 29109 4682 -326 126 46941 54016 40839 -5996
2632 -5996 -17890 -21429 -12797 21181 45590 24331 -570 -43559 -35787 -21177 26444 72134 33927
2619 33927 -36116 -22182 213 -18686 -51565 -67215 -48062 -71470 -54931 -15201 -4778 -20718
2607 -20718 -1021 44525 -5819 -59845 -106133 -79159 -92053 -99788 -87503 -62829 -46896 -61936
2595 -61936 -63525 -36465 26881 21748 22129 21530 46545 30774 53987 37625 -8342 -10960 -16722
2582 -16722 -25354 -56004 -47835 -36790 -60615 -76154 -51590 -36748 -16669 -7327 5623 29244
2570 29244 31681 10415 -30170 -66516 -34312 176 19067 4682 -6413 -30419 -21909 -23849
2558 -23849 -27036 -22967 -32778 -3598 33648 51436 37220 1712 -13506 -58948 -56713 -42299 61
2545 61 4709 -19421 -41101 -47037 -63499 -33115 -12848 -39936 -49399 -46201 -43307 -59740 -8518
2532 -8518 20707 -22929 -15174 33022 46663 43030 49516 397 13263 45648 7120 46937 47453
2519 47453 4936 -5859 -32404 -6796 14336 12902 27319 22082 4537 30386 26455 9461
2507 9461 24319 28661 61774 87118 45848 3003 -13419 -16047 2106 48015 55287 3488 5917
2494 5917 39321 10751 -40199 -35494 -26691 -16863 28070 55818 80310 79334 43812 69253 52181
2481 52181 13030 23224 47338 36891 48359 59579 73269 99317 88894 78705 58290 9599
2469 9599 7996 25701 39935 22505 7182 40 -937 -2098 -15242 -514 15256 75444 56629
2456 56629 37362 48628 15229 13151 -6209 -30870 -87010 -79856 -45411 -13350 -27964 -54075
2444 -54075 -34394 -25607 -32792 -15735 -32149 -63225 -58567 -63213 -74361 -55238 -27329 22615 11002
2431 11002 1028 36709 39919 36674 1630 -26113 -28011 -36107 -44072 -84008 -66936 -32132 4746
2418 4746 34072 64461 35313 2693 4433 15989 -16582 -62383 -65004 -14833 -7519 -312 8131
2405 8131 -4173 -22443 -27286 -26458 27088 9661 -9241 6845 43716 25031 17983 -1536 26105
2392 26105 25126 -10171 -41216 -25247 9211 34988 43347 40578 25846 5417 -15292 -57931 -54464
2379 -54464 -25823 2859 16364 -20996 -45518 -49370 -23843 -34589 7410 775 -13354 -18816
2367 -18816 -1381 -17317 5751 32614 -22407 -70465 -66515 -34404 -23120 -4641 -29679 22142
2355 22142 62508 51858 56521 30183 16673 -17716 -47333 -27468 -6297 10787 22333 52366
2343 52366 20938 46392 55847 55409 81223 89682 55411 -11156 -31767 -28755 -19106 -19647 7803
2330 7803 -4964 -6480 25848 13918 -17062 -6791 25384 74072 56324 1278 -1750 -2762 -41755
2317 -41755 -82426 -63991 -44367 -41483 -28070 33326 56061 54661 51600 24308 19520 27414 7245
2304 7245 2410 38685 42689 67841 74925 22348 -42370 -40644 -32663 -12600 -13233 -44859 -61816
2291 -61816 -44463 -7880 -33259 -42445 -34719 -49292 -30691 -30674 -45187 -18925 -8279 -16991 -62923
2278 -62923 -88395 -84704 -81097 -60101 -12712 -759 -35160 -61387 -64540 -3990 13676 562
$$ [...]
##END NTUPLES=NMR SPECTRUM
##END=
