##TITLE=Analysis number 319387
Compound Code cc 45810
Book Reference 470/33
Project Code adrs
Chemist Name mikem
##JCAMPDX= 6.0         $$ Bruker NMR JCAMP-DX V2.0
##DATA TYPE= NMR SPECTRUM
##DATA CLASS= NTUPLES
##ORIGIN= Bruker BioSpin GmbH
##OWNER= nmr
$$ XWIN-NMR		Version 3.5
$$ Fri May 12 09:44:30 2006 GMT Daylight Time (UT+1h)  MAYBRIDGE\nmr@NMR_250MHZ
##.OBSERVE FREQUENCY= 250.131544655141
##.OBSERVE NUCLEUS= ^1H
##.ACQUISITION MODE= SIMULTANEOUS (DQD)
##.ACQUISITION SCHEME= undefined
##.AVERAGES= 16
##.DIGITISER RES= 18
##SPECTROMETER/DATA SYSTEM= dpx250
##.PULSE SEQUENCE= zg30
##.SOLVENT NAME= CDCl3
##.SHIFT REFERENCE= (INTERNAL, CDCl3, 0, 16.522)
##AUDIT TRAIL= $$ (NUMBER, WHEN, WHO, WHERE, WHAT)
$$ ##TITLE= Audit trail, XWIN-NMR		Version 3.5
$$ ##JCAMPDX= 5.01
$$ ##ORIGIN= Bruker BioSpin GmbH
$$ ##OWNER= nmr
$$ C:\u/data/dgb/nmr/ADRS/4220/pdata/1/auditp.txt
$$ ##AUDIT TRAIL=  $$ (NUMBER, WHEN, WHO, WHERE, WHAT)
(   1,<2006-05-12 09:43:37.76 +100>,<MAYBRIDGE\nmr>,<NMR_250MHZ>,
      <created by zg, POWCHK disabled, PULCHK disabled
       configuration hash MD5:
       84 BC 41 DB A1 6E 1D 46 DA 25 12 A5 C1 ED C5 3A
       data hash MD5: 64K
       E6 C0 47 C2 00 2C BC 13 D9 79 BB B5 71 DF CA FD>)
(   2,<2006-05-12 09:44:11.00 +100>,<MAYBRIDGE\nmr>,<NMR_250MHZ>,
      <Start of raw data processing
       ef LB = 0.3 FT_mod = 6 PKNL = 1 SI = 32K 
       data hash MD5: 32K
       B0 1B ED 74 75 06 7D CB EC DC 09 71 90 FE B4 66>)
(   3,<2006-05-12 09:44:16.14 +100>,<MAYBRIDGE\nmr>,<NMR_250MHZ>,
      <apk 
       data hash MD5: 32K
       30 E9 3B 2A 9A 09 DC 08 20 37 6C 1F 24 A9 63 DB>)
(   4,<2006-05-12 09:44:18.26 +100>,<MAYBRIDGE\nmr>,<NMR_250MHZ>,
      <abs ABSG = 5 
       data hash MD5: 32K
       4E 43 D5 37 DA 3A 58 A8 D4 E1 61 84 54 6C FD 98>)
$$ ##END=
$$ 
$$ hash MD5
$$ EC 13 FA B8 BF E0 39 7F 75 C1 41 08 8B F5 15 E2
##$RELAX= 
##$RELAX= 
##$RELAX= 
##$RELAX= 
##$RELAX= 
##$RELAX= 
##$RELAX= 
$$ Bruker specific parameters
$$ --------------------------
##$DU= <C:\u>
##$EXPNO= 4220
##$NAME= <ADRS>
##$PROCNO= 1
##$TYPE= <nmr>
##$USER= <dgb>
##$AMP= (0..31)
100 100 100 100 100 100 100 100 100 100 100 100 100 100 100 100 100 100 
100 100 100 100 100 100 100 100 100 100 100 100 100 100 
##$AQSEQ= 0
##$AQ_mod= 3
##$AUNM= <au_zg>
##$AUTOPOS= <9 >
##$BF1= 250.13
##$BF2= 250.13
##$BF3= 250.13
##$BF4= 250.13
##$BF5= 500.13
##$BF6= 500.13
##$BF7= 500.13
##$BF8= 500.13
##$BYTORDA= 1
##$CFDGTYP= 0
##$CFRGTYP= 5
##$CHEMSTR= <none>
##$CNST= (0..31)
1 1 145 1 1 1 1 1 1 1 1 1 1 1 1 1 1 1 1 1 1 1 1 1 1 1 1 1 1 1 1 1 
##$CPDPRG= <>
##$CPDPRG1= <>
##$CPDPRG2= <>
##$CPDPRG3= <>
##$CPDPRG4= <mlev>
##$CPDPRG5= <mlev>
##$CPDPRG6= <mlev>
##$CPDPRG7= <mlev>
##$CPDPRG8= <mlev>
##$CPDPRGB= <>
##$CPDPRGT= <>
##$D= (0..31)
0 1 0 0 0 0 0 0 0 0.06 0 0 0 0 0 0 0.0002 0 0 0 0 0 0 0 0 0 0 0 0 0 0 
0 
##$DATE= 1147423408
##$DBL= (0..7)
120 120 120 120 120 120 120 120 
##$DBP= (0..7)
150 150 150 150 150 150 150 150 
##$DBP07= 0
##$DBPNAM0= <>
##$DBPNAM1= <>
$$ [...]
##$SUBNAM7= <"">
##$SUBNAM8= <"">
##$SUBNAM9= <"">
##$SW= 20.6930455092707
##$SWIBOX= (0..15)
0 0 3 0 0 0 0 0 0 0 0 0 0 0 0 0 
##$SW_h= 5175.983436853
##$TD= 65536
##$TD0= 1
##$TE= 295.16
##$TE2= 300
##$TE3= 300
##$TEG= 300
##$TL= (0..7)
0 120 120 120 120 120 120 120 
##$TP= (0..7)
150 150 150 150 150 150 150 150 
##$TP07= 0
##$TPNAME0= <>
##$TPNAME1= <>
##$TPNAME2= <>
##$TPNAME3= <>
##$TPNAME4= <>
##$TPNAME5= <>
##$TPNAME6= <>
##$TPNAME7= <>
##$TPOAL= (0..7)
0.5 0.5 0.5 0.5 0.5 0.5 0.5 0.5 
##$TPOFFS= (0..7)
0 0 0 0 0 0 0 0 
##$TUNHIN= 0
##$TUNHOUT= 0
##$TUNXOUT= 0
##$USERA1= <user>
##$USERA2= <user>
##$USERA3= <user>
##$USERA4= <user>
##$USERA5= <user>
##$V9= 5
##$VALIST= <valist>
##$VCLIST= <CCCCCCCCCCCCCCC>
##$VD= 0
##$VDLIST= <DDDDDDDDDDDDDDD>
##$VPLIST= <PPPPPPPPPPPPPPP>
##$VTLIST= <TTTTTTTTTTTTTTT>
##$WBST= 1024
##$WBSW= 4
##$XGAIN= (0..3)
0 0 0 0 
##$XL= 0
##$YL= 0
##$YMAX_a= 365387
##$YMIN_a= -515445
##$ZGOPTNS= <>
##$ZL1= 120
##$ZL2= 120
##$ZL3= 120
##$ZL4= 120
##$ABSF1= 16.522
##$ABSF2= -4.171173
##$ABSG= 5
##$ABSL= 3
##$ALPHA= 0
##$AQORDER= 0
##$ASSFAC= 0
##$ASSFACI= 0
##$ASSFACX= 0
##$ASSWID= 0
##$AUNMP= <proc_1d>
##$AZFE= 0.1
##$AZFW= 0.1
##$BCFW= 0
##$BC_mod= 0
##$BYTORDP= 0
##$COROFFS= 0
##$CY= 12.5
##$DATMOD= 1
##$DC= 0
##$DFILT= <>
##$DTYPP= 0
##$F1P= 14.0000005364418
##$F2P= -0.99999901652339
##$FCOR= 0.5
##$FTSIZE= 32768
##$FT_mod= 6
##$GAMMA= 0
##$GB= 0
##$INTBC= 1
##$INTSCL= 1
##$ISEN= 128
##$LB= 0.3
##$LEV0= 0
##$LPBIN= 0
##$MAXI= 10000
##$MC2= 0
##$MEAN= 0
##$ME_mod= 0
##$MI= 0
##$NCOEF= 0
##$NC_proc= -3
##$NLEV= 6
##$NOISF1= 0
##$NOISF2= 0
##$NSP= 0
##$NTH_PI= 0
##$NZP= 0
##$OFFSET= 16.522
##$PC= 1
##$PHC0= 167.2465
##$PHC1= 3.309983
##$PH_mod= 1
##$PKNL= yes
##$PPARMOD= 0
##$PSCAL= 4
##$PSIGN= 0
##$REVERSE= no
##$SF= 250.13
##$SI= 32768
##$SIGF1= 0
##$SIGF2= 0
##$SINO= 400
##$SIOLD= 32768
##$SREGLST= <1H.CDCl3>
##$SSB= 0
##$STSI= 32768
##$STSR= 0
##$SW_p= 5175.98343685301
##$SYMM= 0
##$S_DEV= 0
##$TDeff= 65536
##$TDoff= 0
##$TI= <Analysis number 999999
Compound Code 99
Book Reference 9
Project Code 9>
##$TILT= no
##$TM1= 0
##$TM2= 0
##$TOPLEV= 0
##$USERP1= <user>
##$USERP2= <user>
##$USERP3= <user>
##$USERP4= <user>
##$USERP5= <user>
##$WDW= 1
##$XDIM= 32768
##$YMAX_p= 451806722
##$YMIN_p= -52063
$$ End of Bruker specific parameters
$$ ---------------------------------
##NTUPLES= NMR SPECTRUM
##VAR_NAME=  FREQUENCY,     SPECTRUM/REAL,   SPECTRUM/IMAG
##SYMBOL=    X,             R,               I
##VAR_TYPE=  INDEPENDENT,   DEPENDENT,       DEPENDENT
##VAR_FORM=  AFFN,          ASDF,            ASDF
##VAR_DIM=   32768,         32768,           32768
##UNITS=     HZ,            ARBITRARY UNITS, ARBITRARY UNITS
##FACTOR=    0.157963299565203, 1,           1
##FIRST=     4132.6476996994, 0,             0
##LAST=      -1043.33573715361, 0,           0
##MIN=       -1043.33573715361, -52063,      0
##MAX=       4132.6476996994, 451806722,     0
$$ Real data points
##PAGE= N=1
##DATA TABLE= (X++(R..R)), XYDATA
$$ [...]
18583A16469L706K200L300N730n511O551M914K41q500j7894n315Q85p1r481m486
18568I2738J6130l476k0919r83J6930J2545M835R270J873O222K62N460j1507j8537
18554A10843j7699P593J1012J2019o143j0107q188m846j7566j3436M724J5311
18542H3517M781P138l371m294m617M765M981O651Q066J7675r286l7384k0236N713
18528F4099J1874J916j557J2954J362l59M779Q736j0909M961J0895M043J1168
18515A23962j0989m943J4113J0227q167m268R171j2621m184j1048l874L921P935
18502A09235m860L210M7j4938L181k236M770j866j2635L260K12o00L58q470M786
18487H3454l506k017j1436N061m719k959j038n485J6671J5796n230o604N378P536
$$ plain form
18583 116469 120175 122375 125675 131405 125894 132445 137359 137600 129100 111206 105891 106776 106705 97224 92738
18568 92738 108868 105392 84473 83490 100420 112965 117800 127070 128943 135165 135427 140887 129380 110843
18554 110843 93144 100737 111749 123768 117625 107518 99330 94484 76918 63482 68206 83517
18542 83517 88298 95436 92065 87771 83154 87919 92900 99551 107617 125292 116006 78622 58386 64099
18528 64099 75973 77889 76332 89286 90648 90289 95068 103804 92895 97856 108751 112794 123962
18515 123962 112973 108030 122143 132370 124203 119935 129106 116485 112301 101253 97379 101300 109235
18502 109235 104375 107585 107632 92694 95875 93639 98409 96543 83908 87168 87380 86780 87138 78668 83454
18487 83454 79948 77931 66495 71556 66837 63878 62840 57355 74026 89822 84592 77988 83366 90902
18473I0902M736Q622J078O118p119j6451j8785J4119K6270K6450j150j0096R708
18460A34402M497K468J8030R352j418j966O857J6265J9872K1376K4482L8246L0686
18447C23149K9960M0371K8020O817k3974k7712m4556m7061m1869l0862j8533j0637
18435A83113M036J7673O353K2718K5227L5406L0651N4970N8148M1147O860K297
18423D88599n734l9100m1129m3186m4066l4844k2643r358K139K786J2966J3957
18411B80387K3652K1900q312k8057l5364j7873k354o730j5975N055r061k9272
18399A77996j0610p157j7809o986O9J285k392j212J0324m164K013J3680R362o679
18385A57720k10m690k3006j9727J6196J8510R677K986J4081J2875j448q022q64
$$ plain form
18473 90902 95638 104260 105338 111456 104337 87886 69101 83220 109490 135940 134790 124694 134402
18460 134402 138899 141367 159397 168749 167331 165365 172222 188487 208359 229735 254217 292463 323149
18447 323149 353109 393480 421500 428317 404343 376631 332075 285014 243145 212283 193750 183113
18435 183113 187149 204822 211175 233893 259120 294526 325177 380147 438295 479442 486302 488599
18423 488599 482865 443765 402636 359450 315384 280540 257897 248539 250678 253464 266430 280387
18411 280387 304039 325939 317627 289570 254206 236333 233979 227249 211274 216329 207268 177996
18399 177996 167386 160229 142420 135434 135503 136788 134396 133184 143508 139344 141357 155037 164399 157720
18385 157720 157510 152820 129814 110087 126283 144793 154470 157456 171537 184412 182964 174942 174078
18372A74078J3728N055J1638K3320J4115L2671L3546M1565L7965M4743L5214K6512
18360D94150O15k6116m6626m9875l3352l3918l8074l5526l0330k8457j5474k69
18348A56748L602m7L169J202j440J2291n311R03J4477J1398L997M943P459N582
18334B18973J7787p567j4441J7777J0083J3303O891j3769q322l910k863l63J1724
18321B45303J0670N573n026J2279O829K7236M5426N2693N5243L4362J1896k2967
18309D79517m6285m6197n0603m1092k2770k2737k1670p383p808j3114o080j0013
18297A83765Q065R425J0222P694K1774L1114K3644J9117K8706N3975O0850M8752
18285E07103L4074M4715O0609P6118O1737L1005M614j3808r940j1212O612J0383
$$ plain form
18372 174078 187806 192861 204499 227819 241934 274605 308151 349716 387681 432424 467638 494150
18360 494150 494765 468649 422023 372148 338796 304878 266804 231278 200948 172491 157017 156748
18348 156748 160350 160303 163472 164674 163234 175525 170214 171117 185594 196992 200989 205932 213391 218973
18334 218973 236760 229193 214752 232529 242612 255915 262806 249037 240715 236805 233942 233579 245303
18321 245303 255973 261546 256520 268799 275628 302864 348290 400983 456226 490588 502484 479517
18309 479517 433232 387035 336432 295340 272570 249833 228163 220780 212972 199858 193778 183765
18297 183765 191830 201255 211477 219171 240945 272059 295703 314820 343526 397501 458351 507103
18285 507103 541177 585892 646501 722619 784356 815361 819975 806167 796227 785015 791627 802010
18273H02010n425l3766l9723l3681l1839k4116l0811l6601l8974l5799l3765j4856
18261D42654q497K126O085k0733n849j101q456M506R584J979J2129K2772J6951
18248D74150Q682J7250R278J9063M2644M4101N4965N5897L8429M4966P9367J00755
18236I89547J27214J43972J31592J10427J08736J34122J82391K00806J49964Q1005
18226B359776L6722M8218J11179J53349J53075J17748Q9752J21290J94076L02903
18216C688088N04954Q26325J325136K294108M142106O544016P862594O599647
18208C3786974M426921Q48108o03522J862479L106741J517301j763395o546019
18200C6635588q039839o322830m527787l219181k223107j476274r72642o80289
$$ plain form
18273 802010 796585 762819 723096 689415 657576 633460 602649 566048 527074 491275 457510 442654
18261 442654 434157 436283 442368 421635 415786 414685 406229 410735 420319 422298 434427 457199 474150
18248 474150 482832 500082 509360 528423 571067 615168 670133 726030 764459 809425 888792 989547
18236 989547 1116761 1260733 1392325 1502752 1611488 1745610 1928001 2128807 2278771 2359776
18226 2359776 2396498 2444716 2555895 2709244 2862319 2980067 3069819 3191109 3385185 3688088
18216 3688088 4193042 5019367 6344503 8638611 12780717 19324733 27187327 33786974
18208 33786974 38213895 39062003 38458481 40320960 43427701 44945002 43181607 36635588
18200 36635588 28595749 22272919 17745132 14525951 12302844 10826570 9853928 9173639
18192I173639m85702l42129k57819j94330j39704r2195o5325o2308n4991n2456
18182G426680l9068k6646j2682j4213J8845J42867K79138M71329P51510J198444
18172A0196204J969385L063511M100902M503351M321864M040127M636327P116538
18164D3948209J0509572J2287590J0411568N554575J388208p13891J542573L720685
18156H8649089J137360m287053j1658329j4934639j2363265q887202o294499m352926
18148B7008536k994186k119797j605940j256367j003104q15647o85150o23055
18140A5905290n57881n04604m58463m17312l94484l86174l96670l68464l15462
18131A2105776k80079j97960j42129r7280o1461L909J11544K75162N00467Q57010
$$ plain form
18192 9173639 8687937 8345808 8087989 7893659 7753955 7661760 7596435 7534127 7479136 7426680
18182 7426680 7387612 7360966 7348284 7334071 7352916 7495783 7774921 8246250 8997760 10196204
18172 10196204 12165589 15229100 19330002 23833353 28155217 32195344 36831671 43948209
18164 43948209 54457781 66745371 77156939 82711514 84099722 83385831 84928404 88649089
18156 88649089 89786449 85499396 73841067 58906428 46543163 37655961 31361462 27008536
18148 27008536 24014350 21894553 20288613 19032246 18029142 17213495 16528345 15905290
18140 15905290 15347409 14842805 14384342 13967030 13572546 13186372 12789702 12421238 12105776
18131 12105776 11825697 11627737 11485608 11388328 11326867 11330776 11442320 11717482 12217949 13074959
18121A3074959J448784K501208M128446N798499O504709N852361M343049L049904
18113D6701919L460149N019862N143868K974084n18408k856690k160291q78010
18105E6886483j471515l453000p138805p974680o259858m597055l348105k406915
18097B0236550j703989j246340j016813q56617p51358o80507o11729n25802m38736
18088A2404659l83134l92693m10397m27401l94309l34116k95070k51537k36137
18079I279865k31423k07150k02011j63443j43320j46959j09434r1991j12326j13124
18069G758684j14073j40192j56528j65475j44446j31135j38992j31585j54398
18060F481860j67832j49603j20914r0948o0408l2909l6255k9706n7166q6547j22587
$$ plain form
18121 13074959 14523743 17024951 21153397 26951896 33456605 39308966 43652015 46701919
18113 46701919 50162068 55181930 60325798 63299882 62781474 59924784 57764493 56886483
18105 56886483 55414968 51961968 44823163 36848483 30588625 25991570 22643465 20236550
18097 20236550 18532561 17286221 16269408 15412791 14661433 13980926 13369197 12843395 12404659
18088 12404659 12021525 11628832 11218435 10791034 10396725 10062609 9767539 9516002 9279865
18079 9279865 9048442 8841292 8639281 8475838 8332518 8185559 8076125 7984134 7871808 7758684
18069 7758684 7644611 7504419 7347891 7182416 7037970 6906835 6767843 6636258 6481860
18060 6481860 6314028 6164425 6043511 5952563 5892155 5859246 5822991 5793285 5736119 5649572 5526985
18049E526985j35292j18132r1852m7951m4320n7838p9459r4990j03296j33122
18039D620733j37373j07424p5672p8122p6077q1589r9376r5498r0535o4081m8295
18028C666691m2626m5636l3000l9993m5861m4883l6420l7526l2923l2589m1312
18017C233922m8308n6979n2831m5104m6077m5636n5889m9394n6389n7317n5988
18006B664010m0381m7798l6646l8076m4034j4424n529j9435K892K5419J7270o054
17994B457214q537O049O010p773j9450m9888o5012o5777l6357l0139j4819j6840
17982B154681l1990m9206l1565j8076K519P917j1623m638m499j0299R351K1455
17970B034027L0473O9930Q4070Q7227O1070j6375r9729j15926q5773k1615N0774
$$ plain form
18049 5526985 5391693 5273561 5181709 5133758 5089438 5031600 4952141 4857151 4753855 4620733
18039 4620733 4483360 4375936 4300264 4222142 4146065 4064476 3965100 3869602 3779067 3714986 3666691
18028 3666691 3624065 3578429 3545429 3505436 3459575 3414692 3378272 3340746 3307823 3275234 3233922
18017 3233922 3185614 3128635 3075804 3030700 2984623 2938987 2883098 2833704 2777315 2719998 2664010
18006 2664010 2623629 2575831 2539185 2501109 2457075 2442651 2437122 2417687 2420579 2445998 2463268 2457214
17994 2457214 2448677 2454726 2460736 2452963 2433513 2383625 2318613 2252836 2216479 2186340 2171521 2154681
17982 2154681 2122691 2073485 2041920 2023844 2026363 2034280 2022657 2018019 2013520 2003221 2012572 2034027
17970 2034027 2064500 2134430 2218500 2305727 2366797 2350422 2250693 2134767 2048994 2027379 2078153
17959B078153N4053L8230l540q3933j23287j24573q8330q3499n6626k9228m3415
17948A534005k7926L071K025r003j7657j8426j2642L27j6760n833j5318j3667
17936A402196j2407K0244P0718P0099M8050O6096N8060N9711M1036L0623M7736
17925A902162M7691O1149N2041K8756J1049R806N6074J11119J14746J07266N6667
17914B558526k348l5259j4668K9971J01681J04837J05252P2361Q4627J48046K35104
17903C388130L77225N89371Q99998J335139K117354L562388N765018Q114265R198915
17894C5347803Q846937N691863j80524l928482p402012q466294o623481m659413
17886A8626397l151506k032542j246195o86111l02879J5751L43130P69489J359525
$$ plain form
17959 2078153 2132206 2170436 2166896 2082963 1959676 1835103 1746773 1663274 1606648 1577420 1534005
17948 1534005 1506079 1509150 1511175 1502172 1484515 1466089 1453447 1453774 1437014 1431181 1415863 1402196
17936 1402196 1389789 1410033 1480751 1550850 1598900 1664996 1723056 1782767 1823803 1854426 1902162
17925 1902162 1949853 2011002 2063043 2091799 2102848 2112654 2168728 2279847 2394593 2501859 2558526
17914 2558526 2556178 2520919 2506251 2536222 2637903 2742740 2847992 2920353 3004980 3153026 3388130
17903 3388130 3765355 4354726 5254724 6589863 8707217 12269605 18034623 26148888 35347803
17894 35347803 44194740 49886603 49706079 45777597 38375585 29909291 23285810 18626397
17886 18626397 15474891 13442349 12196154 11510043 11207164 11222915 11566045 12335534 13695059
17877A3695059K310549L846877N968795Q295729J0049314J0300710Q318971M293925
17869F7079929n78394n154469q010100q896135q057678o320785m500561k970415
17861B2591392j772327q41751J350R01378K084889L802554O065860Q645554J0809735
17852E2288634J1792558J1087428R084338O391037K986567o74275k901138n397184
17844H4657965n637219l978476l773221l681414n773415p082653p425696p550647
17836C9755224o164569m442781l216732k306132j679153j277331j019558q66390
17828A8782578p65161o69173o09604n70874n62173n46095n25018m86282m19660
17819A3628538l29902k30914j30798n8153m3112p8016j57231k40810k87002k82922
$$ plain form
17877 13695059 16005608 19852485 25821280 34117009 44166323 54467033 62786004 67079929
17869 67079929 66501535 61347066 53336966 44440831 36383153 30062368 25561807 22591392
17861 22591392 20819065 19977314 19978664 20880042 22964931 26767485 32833345 41478899 52288634
17852 52288634 64081192 75168620 84252958 90643995 93630562 92956287 90055149 84657965
17844 84657965 79020746 75042270 71269049 67587635 61814220 54731567 47305871 39755224
17836 39755224 33590655 29147874 25931142 23625010 21945857 20668526 19648968 18782578
17828 18782578 18017417 17348244 16738640 16167766 15605593 15059498 14534480 14048198 13628538
17819 13628538 13298636 13067722 12936924 12878771 12835659 12757643 12600412 12359602 12072600 11789678
17809A1789678k73937k54914k21264j60370r7885j7334O6844K04285M27421P40339
17799A2202863J322871K401695L823977M852283M841149L948238R77674j920939
17791C2449811l550904m826100m439226l253582k301719j607017j113342p75713
17783A0582208n72583m51170l79777l39601l15354l07745k67685k30227k05143
17774G512923j94535j68954j26297j28771j22861j24447j18154j27378j31842
17765F269684j18475j19451j14535q1827p4570r0147q6254q0776q4664q1191j00126
17754E237668j13199j19025j08064q5745r5989j07460r5089j01922r7652j04861
17744D208662r2328r7824o6065m6841o2729n4581n8481n7786n3630m9922m5972
$$ plain form
17809 11789678 11515741 11260827 11039563 10879193 10781308 10763974 10830818 11035103 11462524 12202863
17799 12202863 13525734 15927429 19751406 24603689 29444838 33393076 34370750 32449811
17791 32449811 28898907 24072807 19633581 16379999 14078280 12471263 11357921 10582208
17783 10582208 10009625 9558455 9178678 8839077 8523723 8215978 7948293 7718066 7512923
17774 7512923 7318388 7149434 7023137 6894366 6771505 6647058 6528904 6401526 6269684
17765 6269684 6151209 6031758 5917223 5835396 5760826 5670679 5584425 5503649 5418985 5337794 5237668
17754 5237668 5124469 5005444 4897380 4811635 4715646 4608186 4513097 4411175 4313523 4208662
17744 4208662 4116334 4018510 3952445 3905604 3842875 3788294 3729813 3672027 3618397 3568475 3522503
17733C522503n5331n1065l9218l6767l0902l3642l9673m3434l7947k2326l239
17722C128959j1646j9625l6361l2997m2622m7648m2597o1290o9053o9187p2298
17711B623635o4275n7029l9769l5763l7688m1256l0035k9886l1422l6459k8491
17700B191562l4761m1155m0428m4370m6632l4353k3229l0998l8728k9650k0702
17689A806556k4703k3356k4690j6607R061K6737K9156M2524K6790P169J419j6772
17677A843284l5236j5646L592K68l0680n5310o4991o3851l9414k7913j8806k9871
17665A465426l3644k9570l3593k8954j6158j2258j3978j7586j3199O95L278N292
17653A275751K1429J0167q58J1565N050N035J2375K015k0643k6630l0417k9101
$$ plain form
17733 3522503 3467172 3416107 3376889 3340122 3309220 3275578 3235905 3192471 3154524 3132198 3128959
17722 3128959 3117313 3097688 3061327 3028330 2985708 2938060 2895463 2834173 2765120 2695933 2623635
17711 2623635 2559360 2502331 2462562 2426799 2389111 2347855 2317820 2287934 2256512 2220053 2191562
17700 2191562 2156801 2115646 2075218 2030848 1984216 1949863 1926634 1895636 1856908 1827258 1806556
17689 1806556 1781853 1758497 1733807 1717200 1726261 1752998 1782154 1824678 1851468 1858637 1860056 1843284
17677 1843284 1808048 1792402 1795994 1796262 1765582 1710272 1645281 1581430 1542016 1514103 1495297 1465426
17665 1465426 1431782 1402212 1368619 1339665 1323507 1311249 1297271 1279685 1266486 1267181 1270459 1275751
17653 1275751 1297180 1307347 1306489 1318054 1323104 1328139 1340514 1342529 1321886 1295256 1264839 1235738
17641A235738j9859k3492m1958m6782l3775l6405k116K1296J7124K0326n143k8213
17629A056741q741j527j1139k6252k5158m1872l0696k4684j3133k4985l3116l4627
17617G80811k7740K16l019r717j3409K084p77j8150j5922m781j2518j6164j1945
17604F48969j2187P104J3348L0044J3985J1362O780J6706J3213Q769K272j4589
17592G45776k0001k3268j8990k2214k3218j3509l1839m1781j9157j9945j7605
17581D94249p785q571m236L19J4458J3593q903j3516k6975q918M807r662p949
17568D30911p850K747L600R624J0859O68K577N193J9003L5035K9479L1938K9395
17555F03179J7813N437r147o522J0928l897m1176n6672l9916m9312l2228k0218
$$ plain form
17641 1235738 1215879 1192387 1150429 1103647 1069872 1033467 1031351 1052647 1069771 1090097 1084954 1056741
17629 1056741 1048000 1046473 1035334 1009082 983924 942052 911356 886672 873539 848554 815438 780811
17617 780811 753071 753287 750268 740551 727142 729226 728449 710299 694377 689596 677078 660914 648969
17604 648969 636782 643886 657234 687278 701263 712625 719405 736111 749324 758093 760365 745776
17592 745776 725775 702507 683517 661303 638085 624576 592737 550956 531799 511854 494249
17581 494249 486464 477893 473657 473976 488434 502027 493124 479608 452633 443715 448522 438860 430911
17568 430911 423061 425808 429408 439032 449891 450559 453136 458329 477332 512367 541846 573784 603179
17555 603179 620992 626429 617282 610760 621688 617791 576615 519943 480027 430715 398487 378269
17543C78269o193K7302O972J5199L2632L9514K7164J1116J5116j8855j0342r36
17531E16958m052j7886l0569l7220k5708k3280k9582j4180j9320o077N91m047
17519C05628j3860l361k359l247k753p484p883o671n93j545j0720j397o756n818
17505B31181L722n817N624o900j0959k4583q226J1276Q702j683p041j210l172
17492A90914J846R934o178o391j139k384R444J8930j644j7434O725j230j0485
17479A90908j0677j9433L016J1819j2324p072j5110j4245J2703j0298m788J7288
17467A41787k38N669J2783J638j23R324j0165j6038l203O089j757l99P201J3279
17453A65847o595j4590j0989L407M744K3108J8606P524J6814J8159K4767M2164
$$ plain form
17543 378269 372076 399378 406350 421549 454181 493695 520859 531975 547091 528236 517894 516958
17531 516958 512906 495020 464451 427231 401523 378243 348661 334481 315161 309084 309675 305628
17519 305628 291768 288407 286048 282801 280048 272564 264681 258010 257417 255872 245152 243755 236999 231181
17505 231181 234903 229086 234710 227810 216851 192268 184042 195318 204020 202337 195296 194086 190914
17492 190914 192760 202694 196516 190125 188986 186602 196046 214976 213332 195898 202623 201393 190908
17479 190908 180231 160798 163814 175633 163309 156237 141127 126882 139585 129287 124499 141787
17467 141787 141549 147218 160001 161639 161516 170840 160675 144637 141434 147523 145766 145367 152568 165847
17453 165847 159252 144662 133673 137080 141824 164932 183538 191062 207876 226035 250802 292966
17441B92966M7971N1419M7970K0967m821o626p332J481p900L589K9322J826k5662
17428D45170j5871k8177m3017j1299j5249l4441l6384j7038q252p408j1886j4065
17416B02083k0058O864p535q864p7L32j7325k3622N354j0642j4102r645N659Q244
17402A16666o96r076m842P644J3547k778o829P467M180K322J6202O67n367L599
17388A42706J1041K2004L4256N8696L4577K5030J941q989l3556n1517m2905j6591
17376A76693K121j5920k2288j1232j7502r123l040R293r49n984J3475j1852j5886
17363H7806N857J974p10j0704M189L864J6827K027q452m097P206m457j0065J2138
17349A03403J7337o568j7852k3431j3213J5758J8633J1233J1310J1404K1949L7601
$$ plain form
17441 292966 340937 392356 440326 461293 456472 449846 442514 443995 436095 439684 469006 470832 445170
17428 445170 429299 401122 358105 346806 331557 297116 260732 243694 235442 228034 216148 202083
17416 202083 182025 188889 181354 172490 172413 172745 155420 131798 137152 126510 112408 102763 108422 116666
17402 116666 115970 106894 102052 109696 123243 120465 113636 121103 125283 127605 143807 144474 139107 142706
17388 142706 153747 175751 210007 268703 303280 328310 330251 321262 287706 236189 193284 176693
17376 176693 178814 162894 140606 129374 111872 102749 99709 109002 108053 102069 115544 103692 87806
17363 87806 93663 95637 94927 84223 88412 92276 109103 111130 102678 98581 105787 101330 91265 103403
17349 103403 120740 114172 96320 72889 59676 75434 94067 105300 116610 128014 149963 187564
17337A87564L2291M7255L8712K0863K8336J8367l087k0396k9952m8231n3683l8130
17325A79909k8483j5751j1766q857q130L993n00j2599p8J84K928p63l676n920
17311I0491q026k416N39M037l86o924Q115J32n799j2507j250P391J7860O127M425
17296A01809P105J6487K3619L5323N0654N0557M5961M1226J9357J94j3789j2936
17284C65567N428j8157l1023k3231j8841k7213m1167j8588K476K860J9722L4929
17272B52762M6499N4849L6775L0481Q447k9652n0645l9217m1378l3249k7862j3891
17260A93919j5965j3293j5445j5401m013k977K940M635R62j4543m465N701J2784
17247A34839J0104r883k162n632j5262K361k211m63L133O872q451l236Q039M495
$$ plain form
17337 187564 219855 267110 305822 326685 355021 373388 370301 349905 319953 271722 218039 179909
17325 179909 151426 135675 123909 115052 106922 110915 110415 97816 97738 97922 100850 100087 96411 90491
17311 90491 82465 80049 80588 84625 84239 77315 85430 85562 79763 67256 66006 73397 91257 97384 101809
17296 101809 108914 125401 149020 184343 234997 285554 331515 372741 392098 392292 378503 365567
17284 365567 370995 352838 321815 298584 279743 252530 211363 192775 195251 198111 217833 252762
17272 252762 299261 354110 390885 421366 429813 400161 349516 310299 268921 235672 207810 193919
17260 193919 177954 164661 149216 133815 129802 126825 129765 134400 135362 120819 116354 122055 134839
17247 134839 144943 135060 132898 127266 112004 114365 112154 111691 114824 121696 113245 110009 118048 122543
17233A22543J3432k25p98r680P94j4433k5677k507J4714O874L81J740j981r083
17219I6094l732p44j3468K361R499o817j0667o385j214O919J1201n616j1372k0663
17205D5396P907K4863J0159n545m034p897p973q678p097O61l218K805k871L065
17191D7543p82P235K447j2102l254O695K86k797o09J2577Q111j1616m141K758
17177E2351j2432j9957N027L079J4950J0431J797j4474k2204j2996R872J9496
17165C4940J2602N336k797P122N386j1463O387P436m367j0633r098J0790Q208
17152E9849M610l385K836k554j6575k273Q97K136J1481J351k748j1364P299R365
17138F0925M56m246k885J0222L676j022K94J3074J5111P107N588K0424K9804J0630
$$ plain form
17233 122543 135975 135750 134952 125272 126066 111633 85956 83449 98163 105037 105418 107158 105177 96094
17219 96094 92362 91618 78150 80511 90010 83193 72526 66141 64927 71846 83047 77431 66059 45396
17205 45396 53303 78166 88325 82780 78746 70849 62876 54198 47101 47762 44544 47349 44478 47543
17191 47543 46761 53996 56443 44341 41087 47782 48068 45271 44662 57239 65350 53734 49593 52351
17177 52351 39919 19962 24989 28068 43018 53449 55246 40772 18568 5572 15444 34940
17165 34940 47542 52878 50081 57203 62589 51126 57513 64949 60582 49949 40851 51641 59849
17152 59849 64459 61074 63910 61356 44781 42508 43405 45541 57022 58373 55625 44261 51560 60925
17138 60925 61381 57135 54250 64472 68148 67126 67420 80494 95605 102712 108300 128724 158528 169158
17124A69158J9530J8614j8K060J3784J463k1612j0238j4609n994k619r171m385
17111A55963m130N167Q468K9043J9698K1985L2661K1667P353K577M066j08q720
17098B95690k1120p23j1466k038n882p126j2255j597J6409K5127j8911j5578p61
17085B39769M298O699p66k0322k0759p695l090j230J7789J370q86J0365p791n060
17071B12691Q107J0378k338r599o515k147j3386n924J5365J0276J255m700m779
17058B08684J5003K123O498M23J325J9780K6733n109j992J9874K1151J486J5718
17045C31697J0373o470N341K1743J8868J3799j3263J967J2437J1632P089K5174
17033D40387M2447M0216K3665L4096L7493O5654P9198Q3885Q4032P2692N7333
$$ plain form
17124 169158 188688 207302 207284 209344 223128 224591 202979 192741 178132 172138 169519 160348 155963
17111 155963 151833 157000 165468 194511 214209 236194 268855 290522 297875 300452 304518 304410 295690
17098 295690 274570 273847 262381 260343 254461 247335 235080 233483 249892 275019 256108 240530 239769
17085 239769 244067 250766 250000 229678 208919 201224 198134 196904 214693 216063 215177 225542 217751 212691
17071 212691 220798 231176 228838 219239 212724 210577 197191 191267 206632 216908 218163 213463 208684
17058 208684 223687 225810 232308 232731 234056 253836 280569 275460 273468 293342 314493 315979 331697
17045 331697 342070 335600 340941 362684 381552 395351 382088 384055 396492 408124 415213 440387
17033 440387 482834 523050 546715 580811 618304 683958 763156 847041 931073 1003765 1061098
17022A061098N9063Q7697J17773J42516J23851R8422R5756J23192J64179K24447
17012B297994K90430L44503M07669N07291O82513R93254J511597K399144L990470
17003A3424865O398511Q622500Q738774O588496L386700j13745Q1507K163053
16995D9290661J808633n08736m801903q149754p522324n473079l741374k332420
16987A8569704j116547L1724J373710L333235N928756P944846P531450N251958
16979D8848836J928144j109831k2471K012932J300943j195099n537296q399107
16971C7827051p510240n587739m028007k792501j917930j343670r99366q01907
16963A2845691o95699o21928n99305n21513m42070l95578l63751l39535l30634
$$ plain form
17022 1061098 1120161 1207858 1325631 1468147 1591998 1690420 1786176 1909368 2073547 2297994
17012 2297994 2588424 2932927 3340596 3847887 4530400 5523654 7035251 9434395 13424865
17003 13424865 19823376 28445876 37184650 43773146 47159846 47046101 47127608 49290661
16995 49290661 51099294 50590558 45788655 37638901 30116577 24643498 20902124 18569704
16987 18569704 17453157 17484881 18858591 22191826 28120582 36065428 43596878 48848836
16979 48848836 50776980 49667149 49644678 51657610 52958553 51763454 46226158 37827051
16971 37827051 30316811 24729072 20701065 17908564 15990634 14646964 13647598 12845691
16963 12845691 12149992 11528064 10928759 10407246 9965176 9569598 9205847 8866312 8535678
16954H535678k92308k55573k32683k15123k15043k05318j90188j64854j25373
16945F639215j06736q9954n1207j4285L0040L2356k8573q6780j31145r9542p1567
16934F021822j01468j63677k17876k62526k40729j79471j51922j26312j00902
16925D476939q0555n2786K0704Q2453P8271M3216k547n5854o2810m2644m2109
16914D362278o9500j36960k00519k16758j95768j47935j22134r8000q2028o4107
16904C028569n7101o1124o3358n5064l6976m6853m2807m8746n0678k6483n3053
16893B486326m2390l7768l4717m5220m9835l3756l8912m5606l2322m6232n4447
16882B025121k7070k8402l7688l2633l0024l4867m1943m0323l4648k5443j4218
$$ plain form
16954 8535678 8243370 7987797 7755114 7539991 7324948 7119630 6929442 6764588 6639215
16945 6639215 6532479 6442525 6391318 6377033 6407073 6439429 6410856 6324076 6192931 6093389 6021822
16934 6021822 5920354 5756677 5538801 5276275 5035546 4856075 4704153 4577841 4476939
16925 4476939 4396384 4343598 4364302 4446755 4525026 4568242 4565695 4509841 4447031 4404387 4362278
16914 4362278 4292778 4155818 3955299 3738541 3542773 3394838 3272704 3174704 3092676 3028569
16904 3028569 2971468 2910344 2846986 2791922 2754946 2708093 2665286 2616540 2565862 2539379 2486326
16893 2486326 2443936 2406168 2371451 2326231 2276396 2242640 2203728 2158122 2125800 2079568 2025121
16882 2025121 1998051 1969649 1931961 1899328 1869304 1834437 1792494 1752171 1717523 1692080 1677862
16871A677862k7193l6750k7026m206k3669l9113l0862k2887k2956r658j9212k1403
16859A392927j0353k0753k8745m6251k7689j9039j4355n003J471k5126k1273o171
16847A169640m26k3281l1422k6530p587j7851k3795l724k1652j8788j9554k3572
16835I51458k1100k0805k0577r549n892j1760q692j2430j4930j7253n653j7038
16823G85779j4175j482P25q132j3981r367l374j0489j7273j4143q318m383j1487
16810F69900j9818j3269j769j200j3899j2337j2111r295m595j4741j070l207j8991
16797E43598j8166j2847j0256J162J1183p249k0507p629l989j51m150j357j70
16784D69472P300m061p526k3775j7098j6330l525m892Q26r113j1708r49j2705
$$ plain form
16871 1677862 1650669 1613919 1586893 1582687 1559018 1519905 1489043 1466156 1443200 1433542 1414330 1392927
16859 1392927 1382574 1361821 1333076 1286825 1259136 1240097 1225742 1220739 1222210 1197084 1175811 1169640
16847 1169640 1169214 1145933 1114511 1087981 1080394 1062543 1038748 1035024 1013372 994584 975030 951458
16835 951458 930358 909553 888976 879427 873535 861775 853083 840653 825723 808470 802817 785779
16823 785779 771604 770122 770847 762715 748734 739367 735993 725504 708231 694088 685770 681387 669900
16810 669900 650082 636813 635044 633844 619945 607608 595497 586202 581607 566866 565796 562589 543598
16797 543598 525432 512585 502329 503491 514674 507425 486918 479289 475300 475149 470999 469642 469472
16784 469472 476772 472711 465185 441410 424312 407982 404457 399565 400391 391278 379570 378621 365916
16771C65916j3293k762M449o304O961r861r202l627P516K686N941n486m926r191
16757C28817j1762o696j3872r320j0828j435m781J055k048j0119M9p250K94l066
16743B49038l819o733o405r949M479p087q334N42j269j1741q016P399L471j2606
16729A88970J0560k663J807r435k234J017j7573J192J1685j528p536p005j255
16716A66002N648q218k971j0132j108N121Q805J0504R643j5794j4827l989q707
16703A39977L09k865n690k432P706R275q726L723o434p731o77K487j710q157K797
16688A21852P669m181j7143J1804k245j6402m465Q075M5j0740n840J4923n25q64
16674A01963P292Q549R56q892j4137M540K893j6267r066O370M778j623j1446j866
$$ plain form
16771 365916 352623 349861 354310 348006 354967 345106 335904 332277 339793 342479 348420 342934 338008 328817
16757 328817 317055 310359 296487 287167 276339 274904 270123 271178 269130 259011 259060 251810 252104 249038
16743 249038 245219 238486 232081 222132 226611 219524 211190 211732 210463 198722 190706 198105 201576 188970
16729 188970 199530 196867 198674 189239 187005 188022 170449 171641 183326 181798 174262 167257 166002
16716 166002 171650 163432 160461 150329 149221 154342 163147 173651 183294 167500 152673 148684 139977
16703 139977 140286 137421 131731 129299 137005 146280 137554 141277 134843 127112 126435 128922 127212 119055 121852
16688 121852 129521 125340 108197 120001 117756 101354 96889 104964 105009 94269 88429 103352 102827 101963
16674 101963 109255 117804 118760 109868 95731 100271 103164 86897 77831 84201 88979 87356 75910 74044
16660G4044l128R84n49J6905n756k7944Q232L232j80J468k697O026k018p585m788
16645E6246j3322N781O627J5016L597j614N152J0421r489j1762r392J327N058
16632F3646L646j8150j20J6702Q425j1849j4278K775l358K885q526M603k209j0001
16618C4191R52N021N204j0950N584k996M41j2319r048N580J1963o86o632K594
16604B8899m193K509k65r546J142J724j994L666J3580o86O390P74p000N147o076
16589C4071m038J0043p246j2105l656J375l425Q082N099P034j638j6201r939N333
16575A2789R912m80j0198j0282j15K0536j611k0432J936M509m30m739k29l183
16561b017K012K0703l528j1176N583J651J901j289K734Q256M581p812N679Q71
$$ plain form
16660 74044 70916 71900 71351 88256 82500 54556 62788 66020 65840 67308 64611 70637 68619 61034 56246
16645 56246 42924 48705 55332 70348 73945 72331 77483 87904 78415 66653 57261 58588 63646
16632 63646 67292 49142 49022 65724 74149 62300 48022 50797 47439 50324 41798 46401 44192 34191
16618 34191 35143 40164 45368 34418 40002 37006 37447 25128 16080 21660 33623 32937 26305 28899
16604 28899 24706 27215 26950 17404 18546 20270 18276 21942 35522 34836 41226 42000 35000 40147 34071
16589 34071 30033 40076 32830 20725 17069 18444 15019 23101 28200 35234 33596 17395 7456 12789
16575 12789 22701 22221 12023 1741 1626 22162 20551 119 2055 6564 6134 1395 1166 -2017
16561 -2017 -5 20698 17170 5994 11577 13228 15129 13840 16574 24830 29411 21599 27278 28149
16547B8149k517K120L728K075k695J7033p866k3240j4M849K425M911J107K806
16533C2871j2450l291Q118q85q654k1184P618J1421n460M760r954j6485j0228
16520b3803Q522J8698J1855K41J476r14Q535j5264j7973O132q93K985Q714J8992
16506B7303m512j0414N444k120j2459j566k037O905J953j610O119J954N115J5751
16492C5826l19j8011j0050r231l897n399N875N315j442j7725m37J5268J7189K419
16478A5381j5731M230R671l319j3734PL800P82o196o952o908L766k165N309k813
16463a4872L922J2019O287M005o778J888k7J66k230l177n191M71J093m502K750
16448d176J0787R839k221J0919K2630O228M296K4412M1918O5932L9750J8589O332
$$ plain form
16547 28149 25632 27752 31480 33555 30860 47893 40027 16787 16773 21622 24047 28958 30065 32871
16533 32871 20421 17130 25248 24363 15709 -5475 2143 13564 8104 12864 2910 -13575 -23803
16520 -23803 -15281 3417 15272 15513 16989 16075 24610 9346 -8627 -2495 -3388 -403 8311 27303
16506 27303 22791 12377 17821 15701 3242 1676 -361 6544 8497 6887 13006 14960 20075 35826
16492 35826 35507 17496 7446 -1785 -5682 -11081 -5206 109 -1333 -19058 -19495 -4227 12962 15381
16478 15381 -350 3880 13551 10232 -3502 -3495 305 1087 -5109 -12061 -18969 -15203 -17368 -12059 -14872
16463 -14872 -10950 1069 7356 11361 4583 6471 6444 6610 4380 1203 -3988 -3517 -2424 -6926 -4176
16448 -4176 6611 16450 14229 25148 47778 54006 58302 82714 124632 190564 230314 248903 255235
16435B55235M703R858J005j1606j5515k8004m2419l8937j2329j0555j9945K731
16423I4222R424J6728K6321M5566M5605L9890J7593j2833j4883o565k722k285
16411B56061k6939j9732j9145l6923k7186j1909m702n813n819j4299n088j7479
16399F1027j9050K27j0805q579J0178K594j151J2288m274k260k0653o065J0429
16386B3906Q845l877l657J5222O00k447R875m52k1475r93l484j3346O211R951
16372B4879P311p417m287R15j261K148J1596K796l291q516M886j38q555l728j3423
16357C915n674L948M662m939O882J462k531j5350Q15J3814N796K515R59L75p209
16342I440j129k60o265r23k688K64M373n361j5439j566k880m10J5259R383N442
$$ plain form
16435 255235 259938 269796 270801 259195 243680 215676 173257 134320 121991 111436 91491 94222
16423 94222 103646 120374 146695 192261 237866 277756 295349 282516 267633 261068 258346 256061
16411 256061 229122 209390 190245 153322 126136 114227 109525 103712 97893 83594 78506 61027
16399 61027 41977 42204 31399 22820 32998 35592 34441 46729 42455 40195 19542 13477 23906
16386 23906 32751 28874 25217 40439 41039 38592 48467 48015 26540 25547 22063 8717 14928 24879
16372 24879 32190 24773 20486 21401 20140 22288 33884 36680 33389 24873 29759 29621 21066 17338 3915
16357 3915 -1759 2189 6851 1912 8794 10256 7725 -7625 -6810 7004 12800 15315 16274 16649 9440
16342 9440 8311 8051 1786 863 -1825 -1561 2812 -2549 -17988 -19554 -22434 -22844 -7585 1798 7240
16327G240J3185o187j2944L364M696r600l557m29m207J6518k251l903Q114Q98
16313A0937j1821L69J0690l804j5131j6121M022Q517N738k789o119Q615Q784J0718
16299A2605P14o474l880M090M390K708r689P313o980k3893N190J8292J1108n148
16285A0346n330n424l242N591J292r649n328Q776J6854j3724q622Q37N32P338
16271B47r238n271m495M236K3414N012j5143M870R120m842l703m578j292J6565
16257A4902M697P827Q14r011n162j905j0172n396P044n790o135q665K295J1337
16243c320R034j1326q424J8711N880j5662j1491J2719k033j0498O047J7685J612
16230H934p801k2154q647q855m440P505J2340K763M350O256M093J243r21j1642
$$ plain form
16327 7240 20425 14238 1294 4658 9354 -246 -3803 -4232 -8439 8079 5828 1925 10039 10937
16313 10937 -884 -515 10175 6371 -8760 -24881 -20859 -12342 -6604 -9393 -15512 -6897 1887 12605
16299 12605 13319 6845 2965 7055 11445 14153 4464 11777 4797 -19096 -13906 4386 15494 10346
16285 10346 5016 -408 -3650 1941 3233 -6416 -11744 -2968 13886 162 -8460 -7623 -7091 247
16271 247 -8991 -14262 -18757 -14521 8893 13905 -1238 3632 12752 7910 4207 -371 -1663 14902
16257 14902 19599 27426 28240 19229 14067 12162 1990 -3406 3638 -2152 -8287 -16952 -14657 -3320
16243 -3320 5714 -5612 -14036 4675 10555 -5107 -16598 -3879 -5912 -16410 -10363 7322 8934
16230 8934 1133 -21021 -29668 -38523 -42963 -35458 -23118 -20355 -16005 -9749 -5656 -4413 -5334 -16976
16216a6976R798n26P23n691m697J390m99n252j902K481M388J7060j1180l332J057
16201a3158k721K171J205j2796M491N489Q841K151p55R920Q274J672J4248M040
16187C3072J262k3574j961j968j112L690r494j4461j775N418J7201r955p337K809
16173h185L295O203K076O691o400k2853N326J537o176J264M497J1622j1704j008
16159a3815O394j3667J676N94q518o007R666Q765O600R80R59j548r190j0037O14
16144b6534k213p27O502L506L174o211M243P216K212r781q63K368K254o772J0027
16129a1599J1269J5459J2696J265j3081j7475O901q541j6393j275J0919L685j4638
16116b0808L864Q241K1992N245j6476p69m350j8751L753P192o44K7l327O47l339
$$ plain form
16216 -16976 -7178 -7704 -6981 -12672 -17369 -15979 -16478 -21730 -23632 -21151 -16763 297 -10883 -14215 -13158
16201 -13158 -15879 -13708 -12503 -25299 -20808 -15319 -6478 -4327 -5082 4838 13112 14784 29032 33072
16187 33072 34334 10760 8799 6831 5719 9409 -85 -14546 -16321 -10903 6298 -3657 -10994 -8185
16173 -8185 -4890 1313 3389 10080 3680 -19173 -13847 -12310 -18486 -17222 -12725 -1103 -12807 -13815
16159 -13815 -7421 -21088 -19412 -18818 -27336 -33343 -23677 -14912 -8312 -7332 -6373 -7921 -17111 -27148 -26534
16144 -26534 -28747 -29474 -22972 -19466 -16292 -22503 -18260 -11044 -8832 -18613 -19476 -17108 -14854 -21626 -11599
16129 -11599 -330 15129 27825 29090 16009 -1466 5435 -3106 -19499 -20774 -9855 -6170 -20808
16116 -20808 -16944 -8703 13289 18534 2058 1289 -3061 -21812 -18059 -10867 -11511 -11484 -14811 -14164 -17503
16101a7503Q476l946N27n561N52J0409j04j073R753j4311o02J309j9955N982m512
16086c0559Q328K5110P063r539q818q045j807K1300J0590N914n234l396j728R42
16072A0121K457K955k256p865j0972j1169q844N014P780M6Q255n847l997P070
16058g252O390n036k459Q052P326M661P702R444q332q000J549r704m260L201l198
16043H4M064l566k106j532j885N412Q58m588q958k146k079P506O584R140k184
16028D604n185R21r027q63R441Q295M481o00j5772J697o02o903j0256N092m551
16013a9228p212n757J2835J2515M316K426j0286j0394J0363m030K979M134O922
16000d17n250n775j2446J1920J4175J2040n975l934p279j4936n073P672P383j002
$$ plain form
16101 -17503 -9027 -12973 -12446 -18007 -17455 -7046 -7150 -8223 1530 -12781 -13383 -12074 -32029 -26047 -30559
16086 -30559 -22231 2879 9942 403 -8415 -16460 -18267 3033 13623 19537 14303 10907 9179 10121
16072 10121 12578 15533 13277 5412 -5560 -16729 -25573 -20559 -12779 -12733 -4478 -10325 -14322 -7252
16058 -7252 -862 -5898 -8357 -305 7021 11682 19384 28828 20496 12496 14045 4341 81 3282 84
16043 84 4148 582 -1524 -3056 -4941 471 1329 -3259 -12217 -14363 -16442 -8936 -2352 6788 4604
16028 4604 -581 340 -8687 -9550 -109 8186 12667 12067 -3705 -2008 -2610 -9513 -19769 -14677 -19228
16013 -19228 -26440 -32197 -19362 -6847 -2531 -105 -10391 -20785 -10422 -14452 -11473 -7339 -417
16000 -417 -5667 -11442 -23888 -11968 2207 14247 8272 4338 -2941 -17877 -22950 -15278 -7895 -8897
15986h897j854l545j0121N125j176p992k275O352J2578m712L316K0227n182m792
15972b948m002l193J922J1360j0601j3452m641R662L07M092K533Q097l558j4478
15958a8900j0177J8176M551k670j0906n767J5415P277J4406R159j4271n668m478
15945c853K850R370K826r691R051k428l077K227p755j3321N01Q293p356n506R308
15930h561K808j747M776J0105p033j4379L250J883M605N384k914l961j694q034
15916a5512j1390R29O952J1260J0738J036j0452J127L603n413o384l344K001O137
15902h712R029J1846Q868Q71p762M630J4690L256r235J1775P853J998J838j5339
15888C5606k142q456o914j4719N006J4745o124l711j1964k1176O106O475J6707
$$ plain form
15986 -8897 -10751 -14296 -24417 -19292 -20468 -28460 -30735 -24383 -11805 -16517 -13201 7026 1844 -2948
15972 -2948 -6950 -10143 -8221 3139 -7462 -20914 -25555 -15893 -15586 -11494 -8961 -864 -4422 -18900
15958 -18900 -29077 -10901 -6350 -9020 -19926 -25693 -10278 -3001 11405 20564 6293 625 -3853
15945 -3853 -1003 8367 11193 1502 10553 8125 5048 7275 -480 -13801 -13300 -5007 -12363 -17869 -8561
15930 -8561 -5753 -7500 -2724 7381 348 -14031 -10781 -8898 -4293 1091 -1823 -5784 -7478 -15512
15916 -15512 -26902 -25973 -19021 -7761 2977 4013 -6439 -5312 -1709 -7122 -13506 -16850 -14849 -8712
15902 -8712 317 12163 21031 21902 14140 18770 33460 36716 27481 39256 47109 49107 50945 35606
15888 35606 33464 25008 18094 3375 8381 23126 17002 13291 1327 -19849 -13743 -7268 9439
15875I439P272m085j712p504p508n818p691J2011Q610m532p507o071j5944K901
15861b8139L958J691J491q64J2585q31P790J5891J1415k794m059o647R326J1873
15847C2686M855j4321j8265p40j3073p594N561J4138K27J616k468P710L324N356
15833A9012j414k593M229j9179k0808k054K169l654N620J838M250q862p137j1796
15819d0379R138K594J044o652N049j371l014j731q071J3858K3844p135n312l939
15805b2077J6930N824o176Q964p43q092j5678j856J2912J747K037l294j4229r414
15791c3145L472M738J4382M603N011L517j0807N284L664n276q748J1502J0526
15778H723k4989j7684j833J1501J1402j073j3125q064j176J2612N222L745R107
$$ plain form
15875 9439 16711 12626 10914 3410 -4098 -9916 -17607 -5596 3014 -1518 -9025 -15096 -31040 -28139
15861 -28139 -24181 -22490 -20999 -21863 -9278 -10109 -2319 13572 24987 22193 18134 11487 20813 32686
15847 32686 37541 23220 4955 4215 -8858 -16452 -10891 3247 3474 5090 2622 10332 13656 19012
15833 19012 17598 15005 19234 55 -20753 -22807 -20638 -24292 -18672 -16834 -12584 -21446 -28583 -40379
15819 -40379 -31241 -28647 -27603 -34255 -29206 -30577 -33591 -35322 -43393 -29535 -5691 -12826 -18138 -22077
15805 -22077 -5147 677 -5499 3465 2722 -5370 -21048 -22904 -9992 -8245 -6208 -9502 -23731 -33145
15791 -33145 -29673 -24935 -10553 -5950 -939 2578 -8229 -2945 719 -4557 -13305 -1803 8723
15778 8723 -16266 -33950 -35783 -24282 -12880 -13953 -27078 -35142 -36318 -23706 -18484 -14739 -5632
15765e632J1504P23r02l313j6733j745M014l769k905j5561j027q074p288J2303
15751c8405M853J0373J3586N811m955n925L205k67n359J096L548K717L343J1031
15737D652M921n41P271o609k113K4r625j3116q284j2415l922K8654J6911R172
15723A4980Q387p238k0849k081M738n574J014l928M012L918k874n203j1934mJ8097
15708d539L895r320J969M873j2851l837K246Q089Q440R314j257K060M955j3975
15694F2j8839J798o50R247O194J0258K156j1047N706M663n528k171j412M275K710
15679G422q982j5347K398L443l657R929J0886m206j2923j502N974J2281k417o681
15665c382l590j4919n516J8617J4759o382j3028r604j042P940R677L267M323p913
$$ plain form
15765 -5632 5872 6595 5693 2380 -14353 -16098 -12084 -15853 -18758 -34319 -35346 -43420 -50708 -38405
15751 -38405 -33552 -23179 -9593 -3782 -8737 -14662 -11457 -11724 -17083 -15987 -12439 -9722 -6379 4652
15737 4652 9573 9032 16303 9694 7581 7605 -2020 -15136 -23420 -35835 -39757 -11103 5808 14980
15723 14980 23367 16129 -4720 -6801 -2063 -7637 -6623 -10551 -6539 -2621 -5495 -10698 -22632 -22636 -4539
15708 -4539 -644 -9964 -7995 -3122 -15973 -19810 -17564 -9475 -1035 8279 7022 9082 14037 62
15694 62 -18777 -16979 -17629 -8382 -2188 8070 10226 -821 4885 9548 4020 1849 437 4712 7422
15679 7422 -1560 -16907 -14509 -11066 -14723 -4794 6092 1886 -11037 -12539 -6565 5716 3299 -3382
15665 -3382 -6972 -21891 -27407 -8790 5969 -413 -13441 -23045 -24087 -16147 -6470 -3203 1120 -6793
15651f793K333q044j5972P75Q987k194L255M610P277R668N681L362j7042j5661
15637a9758q181q650R70J6542K0104J8451n702j8826O33j528n846j5823P63J7569
15623i282M055R944l18q745N373M16J208j2724j2771L596K839J5618M49P605j0597
15608c334j7919j674O884K658q157q83J7811J8583J917k987j2132J67J4952L569
15594A9455j913j1450n708J323K246l894J77j3608p217j005q571o522J0536M556
15580b1595R851J1884J1855q070j5016m814M378J203M995n441L241o802n95k558
15566a7484l007P170j4284K059P235R826j888Q39P529J2682o074p961M721J0382
15552A1745p692o348o346j0438R888J4291Q411o908p046Q472R014j5149j1397
$$ plain form
15651 -6793 -4460 -12504 -28476 -27701 -18714 -20908 -17653 -13043 -5766 3902 9583 12945 -4097 -19758
15637 -19758 -27939 -36589 -35619 -19077 1027 19478 13776 -5050 -4417 -5945 -11791 -27614 -26851 -9282
15623 -9282 -5227 4717 4399 -4346 1027 1443 2651 -10073 -22844 -19248 -16409 -791 -342 7263 -3334
15608 -3334 -21253 -22927 -16043 -13385 -21542 -22425 -4614 13969 15886 12899 767 934 15886 19455
15594 19455 17542 6092 384 1707 3953 59 236 -13372 -20589 -21594 -30165 -36687 -26151 -21595
15580 -21595 -11744 140 11995 3925 -11091 -15905 -11527 -10324 -5329 -10770 -7529 -14331 -14926 -17484
15566 -17484 -20491 -13321 -27605 -25546 -18311 -8485 -10373 -9534 -2005 10677 4603 -3358 1363 11745
15552 11745 4053 -2295 -8641 -19079 -9191 5100 13511 6603 -443 8029 17043 1894 -9503
15539i503k133o778n446Q6J8169K125r723N563M715J0171p492n930o684K0847
15525G987J0431j5096j0234K801N973o678m622q035L072l512J925K660m805m59
15511a8592K200J0037J3208K156O904j2790q653J049M442N604p87J090L099j6859
15497g892P331Q656N584p794k1128J3753J0982r325P644k409L28j0238j1646j309
15483a7463L024K981p474J704n236o72N974N090K810J527J2343n115j65O373O363
15468A2064L785r170K969L740k5358m456J1585N949k851j7614OJ053j3271M021
15454b7548O441N344J4676M035J910r721m755K310N032k097n101q822j584l532
15440b3412L071O236j0755R315J5496P983r884j2438n423k067R58J0041l257O68
$$ plain form
15539 -9503 -11636 -18414 -23860 -23774 -5605 -3480 -13203 -7640 -2925 7246 -246 -6176 -12860 7987
15525 7987 18418 3322 -6912 -4111 1862 -4816 -9438 -17473 -14401 -17913 -15988 -13328 -18133 -18592
15511 -18592 -16392 -6355 6853 9009 15913 3123 -5530 -4481 -39 5565 4778 5868 8967 -7892
15497 -7892 -561 8095 13679 5885 -15243 -1490 9492 167 7811 5402 5730 -4508 -16154 -17463
15483 -17463 -14439 -11458 -18932 -17228 -22464 -23136 -17162 -12072 -9262 -7735 4608 -507 -672 5701 12064
15468 12064 15849 6679 9648 13388 -11970 -16426 -4841 1108 -1743 -19357 -19351 -18298 -31569 -27548
15454 -27548 -21107 -15763 -1087 2948 4858 -4863 -9618 -7308 -2276 -4373 -9474 -18296 -19880 -23412
15440 -23412 -20341 -14105 -24860 -15545 -49 7934 -1950 -14388 -19811 -21878 -20920 -10879 -14136 -13468
15426a3468K302o114K302Q02o439L790Q307J3389k464j3012q648O088J3872m582
15412c875j2964J3081J1503l254j2558m852J3080J8622R94j3299j1177n378P26
15399i351M84j721J3509J1518r576j4290M799J781p91j958q7J439K3o785q667
15384a9673n699K088N482j2479R457N383N419M47o448N186J3504O161P61M672
15370A4261K461lj0405r909m315p815M527O39l33j121n872N941M267n612J365
15355a1924N812N035m861j8296K0833J8194k0087k836M425L991K001j2746L966
15342f493q56o339q742Q590J1057J512p491m412J244J8125J689P648K626k1498
15328c340k8794r031K489Q352N588J5495P39P405j1315k3139j58J2867Q017q431
$$ plain form
15426 -13468 -11166 -17280 -14978 -14176 -20615 -16825 -8518 4871 2407 -10605 -19253 -13165 707 -3875
15412 -3875 -16839 -3758 7745 4491 -8067 -12919 161 18783 19777 6478 -4699 -10077 -9351
15399 -9351 -8867 -10588 2921 14439 4863 -9427 -4628 -2847 -3638 -5596 -5683 -4244 -4221 -11006 -19673
15384 -19673 -25372 -23284 -17802 -30281 -20824 -15441 -10022 -9575 -16023 -10837 2667 8828 9589 14261
15370 14261 16722 16719 6314 -3595 -7910 -15725 -11198 -10559 -10892 -12013 -17885 -11944 -7677 -13289 -11924
15355 -11924 -6112 -1077 -5938 -24234 -3401 14793 -5294 -8130 -3705 286 2287 -10459 -6493
15342 -6493 -7349 -13688 -22430 -13840 -2783 -1271 -8762 -13174 -11930 6195 7884 15532 18158 -3340
15328 -3340 -32134 -41165 -38676 -30324 -24736 -9241 -8502 -1097 -12412 -35551 -35709 -22842 -14825 -23256
15314b3256j276J3575J1548P786J1923p061j1208r508J531J060J2394j6737l510
15301a2739j168R843J8965J86o498M113k096l683K946N777l233n403N436n913
15287F533o358l232q651j894M564J2525j1469j6000Q560P013J6270Q461j1671
15274D651j4217j3989k159Q31J4212j2698l7J7917J6014P147q090k245L203N070
15260A5610m60m631O854j4570o627k456k255L338n32o928J2034J2838j4888n376
15246h049M991K921m185j2892p105n902j023J3423J652j333l334Q915j601J1956
15232a566L092p923J63J5191k756j6234m779o137M382J353J4368N524j1218J986
15218d554j026j2206p569M064J3091K78M835M45j106j029L742M977l598P098k044
$$ plain form
15314 -23256 -24532 -10957 591 8377 20300 13239 2031 -7477 -5946 -4886 7508 -9229 -12739
15301 -12739 -13907 -4064 14901 15087 8589 12702 10606 6923 9869 15646 12413 7010 12446 6533
15287 6533 175 -3057 -11708 -13602 -9038 3487 -7982 -23982 -15422 -8409 7861 16322 4651
15274 4651 -9566 -23555 -25714 -24883 -10671 -23369 -23406 -5489 10525 17672 9582 7337 10540 15610
15260 15610 15150 10519 17373 2803 -3824 -6280 -8535 -5197 -5729 -12657 -623 12215 -2673 -8049
15246 -8049 -3058 -137 -4322 -17214 -24319 -30221 -31244 -17821 -16169 -17502 -20836 -11921 -13522 -1566
15232 -1566 1526 -6397 -6234 8957 6201 -10033 -14812 -20949 -16567 -15214 -846 4678 -6540 -4554
15218 -4554 -5580 -17786 -25355 -21291 -8200 -7922 -3087 -2642 -3748 -4777 -1035 3942 344 7442 5398
15203E398p257o90j23q37n690L409p720j0776J081J5755O78j2817j561N757L852
15188a1541J704r926o970j758K6670R659j2406j4420k807J3204M808L477j1436
15175a1742n992J4391p918o674Q519J1372n231j6813m925p55L563L212J546P729
15161i718m206N785O152q518o168Q722O031j873m476J1917M506p378j1390L675
15147f939n822q597r125R79J1012K5677J2681k5132r800k130l701k189k216N713
15133a9589J0733j5569j2569k65J2790J4599J2291J5072o408m147j513r892M695
15120B28p377n567M583L569O543j0061l374K977J1748j3501r387M87J0003M061
15106e068l190j5351j3790J2178P267K821n611M16J1832M369k177m816o77m165
$$ plain form
15203 5398 -1859 -2549 -2672 -3509 -9199 -5790 -13510 -24286 -23205 -7450 -6772 -19589 -21150 -15393 -11541
15188 -11541 -9837 -19763 -26733 -28491 -1821 7838 -4568 -18988 -21795 -8591 -3783 -306 -11742
15175 -11742 -17734 -3343 -11261 -17935 -9416 1956 -3275 -20088 -25013 -25768 -22205 -18993 -17447 -9718
15161 -9718 -13924 -8139 -1987 -10505 -16673 -7951 -1920 -3793 -8269 3648 8154 776 -10614 -6939
15147 -6939 -12761 -21358 -30483 -29504 -18492 7185 19866 -5266 -15066 -17196 -20897 -23086 -25302 -19589
15133 -19589 -8856 -24425 -36994 -37259 -24469 -9870 2421 17493 11085 6938 5425 -4467 228
15120 228 -7149 -12716 -8133 -4564 1979 -8082 -11456 -8479 3269 -10232 -19619 -19132 -9129 -5068
15106 -5068 -8258 -23609 -37399 -25221 -17954 -15133 -20744 -20328 -8496 -4127 -6304 -11120 -11797 -15962
15092a5962Q62L86J1229J6314N026p678p347p326P83k823k1008m43O515Q774Q124
15077d574l6r9l572Q346k170J762l604k993m309j439N228j2700r075n901J827
15062c3309K0794P412P520m612j3487P744J1512L823j8410p698n143M741l495
15049b2608J3643N731M119j2029R31J4685p501m488p44j3776k047J0051Q156O511
15035F34j7611l838O30J9104j2290q67J0112J0958O520m996n3P521q767j3208
15021f151J2810J0083j934N49Q067l230m544J0849m513j2378k736j1367J5655
15008A1160p252j9000l899N114K096j1432P310K057J358Q50q131j0320J7P819
14994b2253m277j2668J8905J6073l773J252J8105m188k0233k2p855j903O173N044
$$ plain form
15092 -15962 -15100 -14714 -3485 12829 17855 10177 2830 -4496 -3713 -6536 -27544 -27987 -21472 -12698 -4574
15077 -4574 -4610 -4709 -8281 65 -2105 -343 -3947 -6940 -11249 -12688 -7460 -20160 -29235 -35136 -33309
15062 -33309 -12515 -5103 2417 -2195 -15682 -7938 3574 7397 -11013 -18711 -23854 -19113 -22608
15049 -22608 -8965 -3234 885 -11144 -10213 4472 -3029 -7517 -8261 -22037 -24084 -14033 -5877 634
15035 634 -16977 -20815 -20185 -1081 -13371 -14238 -4126 6832 13352 8356 8303 15824 7057 -6151
15021 -6151 6659 16742 14808 15357 23424 20194 15650 26499 21986 9608 6872 -4495 11160
15008 11160 3908 -15092 -18991 -13877 -11781 -23213 -15903 -13846 -12488 -11638 -19769 -30089 -30072 -22253
14994 -22253 -26530 -39198 -20293 -4220 -7993 -6741 11364 7176 -13057 -13079 -20934 -22837 -16664 -11620
14980a1620J4928N671o26P400O853j8683q250l132P165m296j5812l756J4800O456
14966b902r046j5384R595l473j3760j1190N675J2207P391m122j410J0939J1396
14953d084l001l333N804J6684p363q410J871L915j6818n652M817R574J0784n069
14939b81l258J2099N298j1329j1167n027M994M093K3949j976j709p568r655o611
14925h148J253R585K279j0186O839L989o538r824j851R137j257j3577j1950j001
14911c1250J1790R93J950P539R799O762n808j1428j385q315p322O405J5195J040
14897d035n214K314K227Q993O828P840j6374j5541K609N665r092m620K640k227
14883a7987j845N510L937j7163j0468J3530m347m262J7076J9996j783j5235l472
$$ plain form
14980 -11620 3308 8979 8353 15753 22606 3923 -4327 -7459 -294 -4590 -20402 -24158 -9358 -2902
14966 -2902 -11948 -27332 -17737 -21210 -34970 -46160 -40485 -28278 -20887 -25009 -26419 -15480 -4084
14953 -4084 -7085 -10418 -4614 12070 4707 -3703 -1832 2083 -14735 -20387 -15570 -5996 4788 -281
14939 -281 -3539 8560 13858 2529 -8638 -13665 -8671 -4578 19371 17395 15686 8118 -1537 -8148
14925 -8148 -6895 2690 4969 -5217 1622 5611 -927 -10751 -12602 -3465 -4722 -18299 -30249 -31250
14911 -31250 -19460 -18467 -16517 -8978 821 7583 1775 -9653 -11038 -19353 -26675 -20270 -5075 -4035
14897 -4035 -9249 -6935 -4708 4285 11113 18953 2579 -12962 -10353 -4688 -13780 -18400 -15760 -17987
14883 -17987 -19832 -14322 -10385 -27548 -38016 -24486 -28833 -33095 -16019 3977 2194 -13041 -16513
14870a6513J1401J0944j4838j6313O556M965K857J0118M33j0873J97J4124J398
14857D456O623o831r182r342K1222Q036j3192j5014p076J5310L44j363k732J215
14843g526M456L105O950N377o982N435j404j026Q831J173m160q712q526l924O176
14828g57q070r500K9j480P964J3035J809J0481j213j3161m863L631K796n620l725
14813h644J146L528j066J057O988k263K205N73Q750L770j2635n807L063m781J164
14798b952J388k184L436R78p277L197k122l2m501J3375P203l950j9052k1418P512
14783b6399K4324Q078k266P417N098Q951m250j0704K555N831j6677j4052k531
14770a4625J2007j44J2830o605O524J922j1634k406j0445J5368J3160j279j2148
$$ plain form
14870 -16513 -5112 5832 -9006 -25319 -18763 -13798 -10941 -823 -390 -11263 -11066 3058 4456
14857 4456 11079 4248 -4934 -14276 6946 14982 1790 -13224 -20300 -4990 -4646 -6009 -8741 -7526
14843 -7526 -3070 35 6985 12362 5380 10815 9411 8385 17216 18389 14229 5517 -3009 -6933 -757
14828 -757 -8827 -18327 -18298 -19778 -11814 1221 3030 13511 12298 -863 -5726 -2095 701 -4919 -8644
14813 -8644 -7498 -3970 -5036 -3979 3009 746 2951 3524 12274 16044 3409 -2398 665 -4116 -2952
14798 -2952 -1564 -3748 -312 666 -6611 -3414 -5536 -5568 -10069 3306 10509 6559 -12493 -33911 -26399
14783 -26399 -2075 6003 3737 11154 16252 25203 20953 10249 12804 18635 1958 -12094 -14625
14770 -14625 -2618 -2762 10068 3463 9987 11909 275 -2131 -12576 2792 15952 14673 2525
14757B525m885j1184l698O153L544N567l495j457o981j1056L084J2733K112k603
14743i641O186J6053O157j0840j744m371O148q746j2059q213O561J1985p111j775
14729a1410l895q710Q912J0441J6755p823m727j3017j1015k21N758L660p96Q43
14715a5245J5277n143j4884k117J7773q35k064o062R25j1472O606R690N346O242
14701D037P898j0269j407J2038j3353k084j0366o566J740l197J5677J645j2348
14688a6555l915J986R161P628M416o564o649k759M346M608N474J230m491R19p927
14673i092o665J3623J8435o06j1193n984j0232o574J744k469p94j525O940J3376
14659a016R591j1406q762J1241P681P405o793L073J1446r473j2286n02j2043n303
$$ plain form
14757 2525 -2360 -13544 -17242 -11089 -7545 -1978 -5473 -6930 -13911 -24967 -21883 -9150 -7038 -9641
14743 -9641 -3455 12598 18755 7915 6171 1800 7948 -798 -12857 -21070 -14509 -2524 -9635 -11410
14729 -11410 -15305 -24015 -15103 -4662 12093 4270 -457 -13474 -24489 -24710 -18952 -15292 -16088 -15245
14715 -15245 32 -5111 -19995 -22112 -4339 -5174 -7238 -13300 -12375 -23847 -17241 -7551 -2205 4037
14701 4037 11935 1666 259 12297 -1056 -3140 -13506 -20072 -18332 -21529 -5852 -4207 -16555
14688 -16555 -20470 -18484 -9323 -1695 2721 -3843 -10492 -13251 -8905 -4297 1177 2407 -2084 -1165 -9092
14673 -9092 -15757 -2134 16301 15695 4502 -1482 -11714 -18288 -16544 -19013 -19807 -21332 -14392 -1016
14659 -1016 8575 -2831 -11593 -352 7329 14734 7941 11014 22460 12987 701 199 -11844 -17147
14645a7147n171Q403J2484j672j2081j8978n592M503R255P594r87L115j3368J399
14631b8243J1450J3200K572L592M803q45K409K347l52l53K771j3900q797M525
14617d821K388K2418R190j644n751j0159j289P820m451j6062l225K444j133L551
14603g24N488J1295J2182p409J4377K4237L805J1344K8283K8521K6426J0839j4438
14590A54226k7504k3271j9872n941j4506j4205m779r622m714r573m026p65m959
14577A0489r198n83m977Q808M181p93m165P996R757J919r193j982o24l633Q445
14562A6447K0418j375r820k1019p654m671P1P324j347n307L117J4601J1043r654
14548A2174j446n616k359j036r615j3493L686J9816J0229K017O30N194q714o446
$$ plain form
14645 -17147 -22318 -13915 -1431 -3103 -15184 -34162 -39754 -35251 -25996 -18402 -19389 -16274 -29642 -28243
14631 -28243 -16793 -3593 -1021 2571 7374 6529 8938 11285 10933 10580 13351 -549 -9346 -4821
14617 -4821 -2433 19985 29175 27531 21780 11621 10332 18152 13701 -2361 -5586 -3142 -4275 -724
14603 -724 4764 16059 28241 20832 35209 59446 63251 74595 102878 131399 157825 168664 154226
14590 154226 126722 103451 83579 77638 63132 48927 44148 34526 29812 20239 16213 15448 10489
14577 10489 1291 708 -4269 4539 8720 7927 3762 11758 21515 23434 14241 12259 11635 8002 16447
14562 16447 36865 35490 25670 4651 -3003 -7674 -7603 -279 -1626 -6933 -3816 10785 21828 12174
14548 12174 10728 5112 2753 1717 -7898 -21391 -17705 2111 12340 14357 14987 20181 11467 5021
14534E021j241p153j4536n123M759J2023K060L051O501p246J3062L308r190k131
14520C165J0914K424j5191m70n353L967Q030l898l142r62q003N490J140m727o015
14505a2631K739r96j1110K173L438p861o123l278R499M378J3400M501m398j1205
14491a7474M69J3984J8349n255k729L174j1111j870M757K546k00k1190j0384K653
14477b4281L719l123j428J4592J8240j944j0213P494J0998J094j7162j840J485
14464b369l441R514J8089q460n915q637K038q99J1092q168K450M883r945r398
14450i166j794l845r034J53O390L803O427K952R815Q610j1233q78j0978k015J4315
14435C522j587R54m554l569J1074J6808k516k977Q604q158l320l789j0927r305
$$ plain form
14534 5021 3780 -3373 -17909 -23032 -18273 -6250 -4190 -1139 5362 -1884 11178 14486 5296 3165
14520 3165 14079 16503 1312 842 -4511 -544 7486 3588 446 -516 -8519 -3029 -1889 -6616 -12631
14505 -12631 -9892 -10888 -21998 -19825 -16387 -24248 -30371 -33649 -24150 -19772 -6372 -1871 -6269 -17474
14491 -17474 -17005 -3021 15328 10073 7344 10518 -593 -2463 2294 4840 4640 -16550 -26934 -24281
14477 -24281 -20562 -23685 -25113 -10521 7719 5775 -4438 3056 14054 15148 -2014 -3854 -2369
14464 -2369 -5810 3704 21793 13333 7418 -1219 819 -80 11012 2844 5294 10177 232 -9166
14450 -9166 -10960 -14805 -23839 -23686 -17296 -13493 -7066 -4114 5701 14311 3078 2200 -8778 -10793 3522
14435 3522 1935 2889 -1665 -5234 5840 22648 20132 17155 25759 17601 14281 10492 -435 -9740
14421i740J2472n937J786Q621k1011n70P197M3K563k362n218P230o886Q218P81
14406b813k35k263N675J0101q574j0934J1081J1100q525J608N889K548r64r143
14392D551r093K602J852r994r762r094M959m980Q863J3251j0537O106J654p38
14378a0360n863q38L519p170J855J546L135J6982J235j3577J232q614J649J2388
14364b881J1085R31L173o881m445k007l80P807N404J935m41L334j3746j4664q581
14349b0357O231O143M681n759J318L375j299n914Q155M361L651l027J011l007
14335d37J735l39J1521l929j6837M487L450l85j144L841J0222n931o896j1752
14321a2394M141J0521J0747j1175M003P88m234o891M616L90j970j425j4427O186
$$ plain form
14421 -9740 2732 -3205 -1419 7202 -13809 -14379 -7182 -7139 -4576 -6938 -12156 -4926 -11812 -3594 -2813
14406 -2813 -3048 -5311 364 10465 1891 -9043 2038 13138 4613 6221 12110 14658 13694 4551
14392 4551 -4542 -1940 -88 -10082 -19844 -28938 -23979 -28959 -20096 -6845 -17382 -11276 -9622 -10360
14378 -10360 -16223 -17061 -13542 -20712 -18857 -17311 -14176 2806 4041 -9536 -8304 -16918 -15269 -2881
14364 -2881 8204 9135 12308 5427 982 -1025 -1405 6402 11806 13741 13300 16634 2888 -11776 -20357
14349 -20357 -14126 -7983 -3302 -9061 -7743 -4368 -5667 -11581 -3426 935 4586 1559 2570 -437
14335 -437 1298 959 12480 8551 -8286 -3799 -349 -734 -1878 1963 12185 6254 -642 -12394
14321 -12394 -8253 2268 13015 1840 5843 6631 2397 -4494 122 512 -1458 -2883 -17310 -11124
14307a1124Q373O189m187O525j1043j1104O551J695J796n620R252p854j2913M830
14293a8634j0320o502J0379R259J750J4691M382j1698o845n538J1195K4480o935
14280I664k2319o909J0665J3648J873o587q763m111J923K403M14n421L183J3806
14266C469P470l104j3781J323K236l977J2972J4033m452p375j7658j3863R840
14253a2867J2245Q393Q033p830m451o551L149l810K724n704J709P30j47L054n1
14238a374M60J0710O354l27J800j0087K878O033p628j0010j236J7358Q427j4641
14224H717J1269r62l545N42k916L647k007o10o608n314l939N570M874J4029K218
14209B4965K168K834j5881j247J6255j3693k2804K746K0066O98r960L609O287
$$ plain form
14307 -11124 -2751 3438 -749 5776 -5267 -16371 -9820 -8125 -6329 -11949 -2697 -10551 -23464 -18634
14293 -18634 -28954 -35456 -25077 -15818 -14068 623 5005 -6693 -13538 -19076 -7881 16599 9664
14280 9664 -12655 -19564 -8899 4749 6622 35 -8728 -12839 -10916 -8513 -8099 -13520 -10337 3469
14266 3469 10939 7835 -5946 -4623 -2387 -6364 6608 20641 16189 8814 -8844 -22707 -12867
14253 -12867 -622 7771 15804 7974 3523 -3028 121 -3689 -965 -6669 -4960 -4230 -4377 -1323 -1374
14238 -1374 -914 9796 16150 15823 17623 7536 10414 16447 8819 -1191 -2427 14931 23358 8717
14224 8717 19986 19024 15479 16021 13105 16752 14745 14135 7527 2213 -1726 3844 8718 22747 24965
14209 24965 27133 29967 14086 12839 29094 15401 -7403 -4657 15409 16107 6147 9756 16043
14196A6043P273L462r141j0834P318J268L852j3146q061P448Q052K057K328k55
14182A7664m823J977r240j3914L772K089n240r327O351p019O845J4391N018l811
14168D733j1894M194j429K098p228n751K280k67J3345J8853m079j1103j3350P505
14154b093M684k300O941j288o241j358L100j2820O284J8778m837R8J0621l376
14140A6193p311k186p88j0097o555J1270Q897j5530j7292R156K690o318J5890
14127a981O522j3680M610q11J160M74j4396j3121J4761J2424N03J0122p149j1289
14113a1851P190J016q606J5551Q091J2039L826k5889q142o043P999N70P5Q965
14099D791j2155l724J1168J2319J3435m971j7084J04P946O471k226k590n97q466
$$ plain form
14196 16043 23316 26778 17637 6803 14121 15389 19241 6095 -1966 5482 13534 15591 17919 17664
14182 17664 12841 14818 5578 -8336 -4564 -2475 -7715 -17042 -10691 -17710 -10865 3526 8544 4733
14168 4733 -7161 -2967 -4396 -2298 -9526 -15277 -12997 -13264 81 18934 14855 3752 -9598 -2093
14154 -2093 2591 291 7232 5944 -297 -1655 1445 -11375 -5091 13687 8850 8948 19569 16193
14140 16193 8882 6696 5908 -4189 -10744 526 9423 -6107 -23399 -14243 -11553 -17871 -1981
14127 -1981 4541 -9139 -4529 -5340 -4180 -3706 -18102 -31223 -16462 -4038 -3535 6587 -562 -11851
14113 -11851 -4661 -3645 -12251 3300 11391 23430 27256 1367 -6775 -12818 -4819 -4249 -4174 4791
14099 4791 -7364 -11088 80 12399 25834 20863 3779 3883 11829 18300 16074 13484 12887 4421
14085D421M265J1434p861p467o085P952j341m130J121N492Q952j694k2813j483
14071i237j398J2153J4838N615J072k224l796j5468j2137L161j059K568j66J121
14057d957l402L278J9925J1200Q449j2224j9330Q347J0716r587j0506j1172p882
14044a7145J1922M138J2273P749n876M00J235q531l903K08O495k801p516M100
14030B748P452L346Q648k822r056r987O625R634L272N76P848L075l439j6423j5164
14015c667K600K971R795K4662J568j7683n273q445m155k282R266R435j4511j6305
14001a2024Q947o260k058M721l996q871Q574j955P789Q395m525l65J264m703K567
13986b500l419J979J1409J109M576r699M735O387O88j2939q897r438J4461Q017
$$ plain form
14085 4421 8686 20120 12259 4792 -1293 6659 5318 1188 2309 7801 16753 15059 -7754 -9237
14071 -9237 -10635 1518 16356 21971 23043 20819 17023 1555 -10582 -7421 -8480 -5912 -6078 -4957
14057 -4957 -8359 -5081 14844 26044 34493 22269 2939 11286 22002 12415 1909 -9263 -17145
14044 -17145 -5223 -1085 11188 18937 13061 13461 14696 6165 2262 2470 8965 6164 -1352 2748
14030 2748 10200 13546 22194 19372 10316 329 6954 16588 19860 20436 28284 31359 27920 11497 -3667
14015 -3667 -1067 1904 11699 36361 37929 20246 14973 6528 2373 91 9357 18792 4281 -12024
14001 -12024 -3077 -9337 -11395 -6674 -10670 -19541 -10967 -12922 -5133 3262 -1263 -1628 -364 -5067 -2500
13986 -2500 -5919 -3940 7469 8578 13154 3455 8190 14577 15265 2326 -6571 -16009 -1548 6469
13972F469j4644M082n038K277M592N637k988P834J1276j890m414p474q446k071
13958d798q666j111J5886l8q888p683N692l892j477L510K465K647L003L901K053
13943B604L628M956r301o115O983j596J830J1999O679r911j4367o07j5841L056
13929a6003R328J2441k475m59j2177j1K895L332J235l485O304J0425j831q190
13915A329O768j444j4554j432R951o237m446J1548K06j4062Q1J1002L765M082
13901F557p655j2781O033O018J771O732k020O797J658m144M824N596J131p185
13887A3332q38O424J2231K340k25j0608q193j2784r361K334J0590k869m485P70
13873a342Q593K730n012l149m293j0671k081L1634J6772j3653o371j8659n482
$$ plain form
13972 6469 -8175 -4093 -9131 -6854 -2262 3375 387 8221 19497 17607 13193 5719 -2727 -4798
13958 -4798 -13464 -14575 1311 1273 -7615 -15298 -9606 -13498 -14975 -11465 -9000 -6353 -3350 551 2604
13943 2604 6232 11188 1887 -4228 2755 1159 2989 14988 21667 11756 -2611 -3218 -19059 -16003
13929 -16003 -6675 5766 3291 2832 -9345 -9356 -6461 -3129 -1894 -5379 925 11350 9519 1329
13915 1329 8097 6653 -7901 -9333 618 -5619 -10065 1483 1689 -12373 -12292 -1290 2475 6557
13901 6557 -1098 -13879 -7846 -1828 -57 6675 4655 11452 13110 8966 13790 19386 20517 13332
13887 13332 12494 18918 31149 33489 33264 22656 14463 1679 -7682 -5348 5242 2373 -2112 -1342
13873 -1342 7251 9981 4969 1820 -2473 -13144 -15225 16409 33181 19528 13157 -5502 -10984
13860a0984O558P961m138K161J4488O897o004j5485K928K8679o521r539l211K164
13846A5954r845p469o59o813P26J25j69O351J4940J847j8846k508M043K5124N956
13831B8757j675r519j1151M506q83j190J3167M515r444o379O289L208o811m900
13817H490j9459o77R719L574N729o30p307J763L897R621J862j3511j6605j01j822
13802a5457l043L487J0505j020J7696k761j1919o586m231J5424J4301k760q631
13789E005r004P850o972j4394o274J943J4789J9068k795L00l86k74R298L08J193
13774A9655K098j3565j9199K692O964L402L485j392l232j0526K860M519J1711
13761I472J5339o142j4339o67o274p727J4300J1697j5354N447O473J611p539J37
$$ plain form
13860 -10984 -4426 3535 -603 1558 16046 22943 16939 1454 4382 33061 26540 17001 13790 15954
13846 15954 6109 -1360 -2019 -8832 -8106 -7981 -8150 -1799 13141 14988 -3858 -6366 -2323 22801 28757
13831 28757 27082 17563 6412 10918 10035 8845 22012 26527 17083 10704 16993 20201 13390 8490
13817 8490 -10969 -11646 -1927 1647 7376 6746 -561 1202 5099 14720 16582 3071 -13534 -13635 -15457
13802 -15457 -18500 -15013 -4508 -5528 12168 9407 -2512 -9098 -13329 2095 16396 13636 5005
13789 5005 -3999 3851 -3121 -17515 -23789 -21846 -7057 12011 9216 9516 9130 8856 18154 18462 19655
13774 19655 21753 8188 -11011 -8319 -1355 2047 5532 4140 908 -9618 -6758 -2239 9472
13761 9472 24811 18669 4330 3663 -2611 -10338 3962 15659 305 5752 12225 13836 6297 6434
13747F434J012M634J3635q204l129J0512k841p200j1188m470J2706J9915k510
13734B9306j1544J084n019J1022J0057n364j5352l808j0232j916P777K48J1167
13721A7426j6663j3500m045K108J0412K3284J7405q026j1525j0242K759K940L580
13708A5913l153M015p86p012O485M714r704l600N298L870l30L239q185n522m641
13693F01j4061r079J9580K516k114j494J1218R153K695j1030k078n98j7977K669
13679i999l610M934M365q41l62J2476J5821O136j1597O99k416M651m973k500o66
13664A2118j1663r545M784J0827L54P049N620p006l287k304N50j4329q724L762
13650a1794J1707k363K08J6026M681p79N518r297j1918p527o415P777J1676o123
$$ plain form
13747 6434 7446 12080 25715 17511 14382 24894 22053 14853 3665 -805 11901 31816 29306
13734 29306 17762 18846 13827 24849 34906 29542 14190 10382 150 -1766 6011 6259 17426
13721 17426 763 -12737 -16782 -14674 -4262 19022 36427 28401 16876 6634 9393 12333 15913
13708 15913 12760 16775 15989 8977 15462 20176 10472 6872 12170 16040 15710 18949 10764 5242 601
13693 601 -13460 -22539 -2959 -443 -2557 -4051 7167 16320 19015 7985 5907 5309 -12668 -9999
13679 -9999 -13609 -8675 -4310 -5151 -5513 6963 22784 28920 17323 18022 15606 20257 15284 12784 12118
13664 12118 455 -9090 -4306 6521 6875 13924 19544 12538 9251 6947 7497 -6832 -15556 -11794
13650 -11794 -87 -2450 -2242 13784 18465 17686 23204 13907 1989 -5538 -11953 -4176 7500 1377
13636A377l859j3142N596J5511N88n130J122J383Q820k966k2661q168J6802K4789
13622B0062J7044k915J605k3530r744J9246N462J089L164p108l632K587k778M523
13608B5075j1639J880r664Q55J0781R337o426N805n634J968J8463P979j0418r76
13594C7386l381j1128n287J3648L838n741J866J62k340R643j122k2550j0490J5273
13580A9777r4J128j037k412P43l565l833j0279o44j066l065M272K541K227J5487
13565B0180K16k2045M484J4194P292p526p067J391M622Q926n48n453O209O011
13551C0886P526K988J374o304o270J297P683k903p036K025p645J5098m15j3608
13537B4696J8815n43q388J397p269l363p457J3572P829j699L870j056j579L644
$$ plain form
13636 1377 -2482 -15624 -10028 5483 6071 941 2063 3446 12266 9300 -13361 -21529 -4727 20062
13622 20062 37106 34191 35796 12266 2522 21768 27230 28319 31483 24375 20743 23330 20552 25075
13608 25075 13436 15316 5652 6507 17288 26625 20199 26004 20370 22338 40801 48780 38362 37386
13594 37386 34005 22877 17590 31238 35076 29335 31201 31363 29023 38666 37544 14994 4504 19777
13580 19777 19683 20811 19774 17362 18105 14540 10707 428 -216 -1282 -4347 -75 2466 4693 20180
13565 20180 20396 -1649 2835 17029 24321 16795 9728 11119 15741 24667 24119 18666 24875 30886
13551 30886 38412 41400 42774 36470 30200 31497 39180 36277 29241 31266 23621 38719 38304 24696
13537 24696 43511 42968 34580 35977 28708 25345 17888 31460 39289 37590 41460 40404 38825 42469
13523D2469m763n224l450m888k508K510J5772R801R598k637K603Q721j5398m913
13509D7693m159j0560L41k574J728r583r911Q75K874k12M7j8271k950q73l54N273
13493f16O777O529K043M309r440Q28J320J5164Q391l379N02l958l126L213L435
13478C1992o326o134r049m635M038J8074O452j949m267j60q07K37M825n493j916
13463B4882j935o758K920O477r210p729L09r12j562J649M714J5178P22P338O667
13448D2750k663L147o251j0140J6455J0728m742q427q230o514k015j2671L8m146
13434G319J1607R365J240l748R564M976L730j5212n056Q740P506j2230K2R276
13420C7099o925j4416L272J7444j52J030Q076j026k6853l163J8091N387J5747
$$ plain form
13523 42469 37706 32482 29032 24144 21636 24146 39918 49719 59317 56680 59283 68004 52606 47693
13509 47693 43534 32974 33315 30741 32469 22886 12975 13850 16724 16512 16559 -1712 -4662 -5535 -5889 -616
13493 -616 6161 12690 14733 19042 9602 10430 11750 26914 35305 31926 32428 28470 25344 28557 31992
13478 31992 25666 19532 10483 5848 9886 27960 34412 32463 28196 28036 27229 27466 32291 26798 24882
13463 24882 22947 16189 19109 25586 16376 8647 8956 8044 6482 8131 12845 28023 28745 36083 42750
13448 42750 40087 43234 36983 26843 43298 54026 49284 40857 32627 26113 24098 11427 11465 7319
13434 7319 18926 28291 29531 25783 35347 40323 44053 28841 23785 32525 40031 27801 27823 37099
13420 37099 30174 15758 19030 36474 36322 37352 45428 44402 17549 14386 32477 37864 53611
13407E3611M059j6781j7523O54J0687r794p321Q584N647n237q248j359m729Q537
13393B0787J1003J1426J831J51r31j8897n286l62N130J9453J728o893r454M588
13379C4274J5627n351j3066m21q284j488n20J049P405q923o580L276J0253K198
13365B9449j1026P429R854P256J2224J6406j4775j6419M625R07J0689K255j2507
13352D6367m02O178N771k423r570k187J144R435J973q315j1859M816M930o733
13338C9125N795J02m595n225Q626k805j1951k463J4024l443J0340q25l343Q593
13324E1955m479j2116j855J3382M410j5012p689m242N901J3269N503N151J8069
13311G2247j691q917l772N143P145L471K830J61Q764P444n129J1099J5115n915
$$ plain form
13407 53611 57670 40889 23366 24020 34707 24913 17592 26176 31823 26586 18338 16979 12250 20787
13393 20787 31790 43216 45047 45198 44267 25370 20084 19722 24852 44305 46033 39140 29686 34274
13379 34274 49901 44550 31484 31063 22779 21291 20771 21820 29225 20302 13722 16998 27251 29449
13365 29449 18423 25852 35706 42962 55186 71592 56817 40398 45023 45930 56619 58874 46367
13352 46367 45965 52143 57914 55491 45921 43734 44878 54313 56286 47971 36112 40928 45858 39125
13338 39125 44920 45022 40427 35202 43828 41023 29072 26609 40633 37190 47530 46705 43362 51955
13324 51955 47476 35360 33505 46887 51297 36285 28596 24354 30255 43524 49027 54178 72247
13311 72247 70556 61639 57867 63010 70155 73626 76456 76617 85381 92825 87696 98795 113910 107995
13297A07995j2138J674m734J0248M853p771k496n298j4042j408l543P650N196
13284H6186p741L363J0699m258L815J710j8202N982j062J3410N44j1899k1919
13271F0628j073J2055N982l186L548J323j0559k337k138N117Q738J615K881R30
13257H3524Q303R153J0727J2205j797j9293k2681q921j3763K941N919J367o776
13244F0908N909n173R0r931j239M629L338N297Q215o827q150J14K376J5128M143
13229G8827J666L781J278M285l112L344M518n673m097o631o35n607o683J317j3188
13214E3390J670Q683n29N30R966J2034P387r874J3302N492j2734J0026K997j122
13200A01218N525n091J3892m651q662j1487M50M325p029N023p332j734m404r338
$$ plain form
13297 107995 95857 97531 92797 103045 107898 100127 97631 92333 78291 76883 73340 80990 86186
13284 86186 78445 81808 92507 88249 92064 93774 75572 81554 80492 93902 94446 82547 60628
13271 60628 59555 71610 77592 74406 77954 79277 68718 66381 64243 69360 78098 79713 82594 83524
13257 83524 91827 100980 111707 123912 122115 102822 80141 71220 57457 60398 66317 67684 60908
13244 60908 66817 61644 61734 51803 50564 55193 58531 63828 72043 65216 57066 57180 59556 74684 78827
13229 78827 80493 84274 85552 89837 86725 90069 94587 88914 84817 78186 77551 71944 65261 66578 53390
13214 53390 55060 63743 63214 63744 73710 85744 93131 83257 96559 102051 89317 99343 102340 101218
13200 101218 106743 101652 115544 110893 102231 90744 91194 95519 88490 93513 86181 84447 80043 70705
13186G0705k0358j1588n014L595L712l019K1163K7255N690P125l834n448k138
13173H7846l992J924K0060R996k269q946j1184n33p686p903m728J2165J5833N143
13159A05726p675p59J337L434J0552J5855m870O3N297r000j561N664k867j1701
13145A09495j2199J5054J2338p807J912K338q76o821K750P512j0646j8345N724
13132A00429j0157j0376p109p215O535J968J5895P860J181o495k2071q471M231
13119F6205k845l231M557J3596J0151J5858J8155L7719J7937O729L2443J7543
13107B34817L220q49l206k7670k9436l8527k0017K825j372m634K406Q671j2365
13094A13863J829l961o00p6Q946p860q044k458n543j6138J838J5969P42P74k864
$$ plain form
13186 70705 50347 38759 33745 37340 41052 38033 59196 86451 92141 99266 95432 89984 87846
13173 87846 83854 85778 105838 115834 113565 104619 93435 92902 85216 77313 72585 84750 100583 105726
13159 105726 98051 97292 98629 102063 112615 128470 123600 123663 128960 119960 118399 124063 121196 109495
13145 109495 97296 112350 124688 116881 118793 121131 120255 113434 116184 123696 113050 94705 100429
13132 100429 90272 79896 72787 65572 72107 74075 89970 97830 99011 92516 70445 61974 66205
13119 66205 63360 60129 64686 78282 88433 104291 122446 160165 178102 184831 217274 234817
13107 234817 238037 237188 233982 206312 176876 138349 118332 121157 119785 115151 117557 126228 113863
13094 113863 115692 111731 111131 111055 120001 112141 104097 101639 96096 79958 81796 97765 98507 99281 96417
13079I6417M284K3786M371j0074J1513J2043j4354k0585J956r93K973J6783J7573
13066A45693R261M699k763r660j5427k1784q63J5732l357r885k020J2708O507
13053A28841M904L4292L5514L4593L8991N8589J23166J93069L21548M39984M89471
13042A902962L84143J32786j52935l89869m29635l34663k42250j58008j15563
13033E96968q6446m8205l0809k3205l5627k6736q226j1318q971j313j7988j5436
13021B82688k498j1035r027J309k507j0184j8708n603k631l082l861r944p360
13008A97557m393J177j175l827N985J9290L456j0436j0135j0721n384k722j8626
12995A60046q159n476K035J0457J3447J3733j0637j6724q739J0796R345j666j1710
$$ plain form
13079 96417 100701 124487 128858 118784 130297 142340 127986 107401 109357 108364 111337 128120 145693
13066 145693 154954 159653 156890 147230 131803 110019 109156 124888 121531 111646 109626 122334 128841
13053 128841 133745 168037 203551 238144 277135 335724 458890 651959 973507 1413491 1902962
13042 1902962 2287105 2419891 2266956 1877087 1447452 1112789 870539 712531 596968
13033 596968 510522 462317 431508 408303 372676 345940 337714 326396 317425 316112 298124 282688
13021 282688 280190 269155 260128 261437 258930 248746 230038 224435 221804 218722 214861 204917 197557
13008 197557 193164 194341 193166 189339 195324 214614 218070 207634 197499 186778 181394 178672 160046
12995 160046 151887 146411 148446 158903 172350 186083 175446 158722 149983 160779 170124 168458 156748
12982A56748j0956q860l816R206J492O62m810k2802j8525q463n298J085J322m075
12968H2910K4852K5474J371L72M775j446J7507n549j9074o002r0j0658L185J8212
12954A35839j3003R51J617q351J2109Q510r580L385k295O09L010m920n09n300
12940A22072k844j469J2043m212K482j4657N969K1825J1563j086j3628p560J1196
12927A41694N066N544R163m817M709l138N302j532k244M227P081n540j1567k4955
12913A28993k8301o278R765K1741m226K79J2554J6571J0705J960j8316j8740j5338
12900A11369o669L37o828P630P002j739k565r751n889j0920p91Q825Q529o5R412
12885A07887N098j2888R787m899p738K0738J0416L366j310K0229Q098P334J0788
$$ plain form
12982 156748 145792 136932 133116 142322 143814 144476 139666 116864 98339 89876 84578 85663 86985 82910
12968 82910 107762 133236 134607 134979 139754 138308 155815 150266 131192 125190 125100 114442 117627 135839
12954 135839 122836 123787 125404 117053 129162 137672 128092 131477 129182 129791 132801 127881 127372 122072
12940 122072 119228 117759 129802 125590 128072 113415 119384 141209 152772 151686 138058 130498 141694
12927 141694 146760 152304 161467 156650 161359 158221 163523 161991 159747 163974 171055 165515 153948 128993
12913 128993 100692 94414 104179 125920 121694 121973 134527 151098 161803 163763 145447 126707 111369
12900 111369 104700 105037 98209 105839 112841 111102 108537 98786 92897 81977 81186 90011 98540 98475 107887
12885 107887 112985 100097 109884 104985 97247 117985 128401 131767 130457 150686 158784 166118 176906
12872A76906J0927p987M74Q698j893n467J4236K5175L1644L0319L0940M9776L9710
12859D03458N663j2055r203j3924m5105l3542k7418j7430j1612j0805j7634m201
12847B06192R643l491p11K654Q74J736j791o495k1803j5053M7K575j565K0434
12833A93246R897j4925j6086q860o105p55r122o821o47K819Q656l619m994K2135
12819A64819J3165l121J1832K656j7488l0574j6527l901N985J3986J3074O514
12807A60420J8232j637j6815l927m731q867p796j0279k5645l3350k3491j6765
12795B5349L407K2437L2372K4994L9684J8432p987j6312j91j329p284J9914J6919
12782A70405K911p72L713L326l681J2238J2909R153J4099L2008L0937L3208M0178
$$ plain form
12872 176906 187833 179846 180320 189018 187125 181658 195894 221069 252713 283032 313972 363748 403458
12859 403458 409121 397066 387863 373939 328834 295292 267874 250444 238832 228027 210393 206192
12847 206192 215835 212344 211633 214287 215161 216897 215106 208611 186808 171755 171802 174377 172812 193246
12833 193246 203143 188218 172132 163272 157167 156412 147290 140469 139822 142641 151297 147678 142684 164819
12819 164819 177984 174863 186695 189351 171863 141289 124762 120861 126846 140832 153906 160420
12807 160420 178652 177015 160200 156273 151542 142675 134879 124600 98955 65605 42114 25349
12795 25349 28756 51193 83565 108559 148243 166675 158688 142376 142185 140856 133572 153486 170405
12782 170405 173316 172544 176257 179583 175902 188140 201049 210202 224301 256309 287246 320454 360632
12769C60632K7614j382j8010k0097k0660j7351j4256j3756k6403j2941J0693J779
12757B55862r329j4545l943j2090J191o159R604j858M751O126j1058r950j3107
12744A95495R398J0378m488n689J8683K5668L7745O8965J00652J25946J57558
12733G40311J59742J01444K1153n4832r8407j10114q0497n6568m8884l9765k3879
12722E09704k6452k5223k0981M212K2166J6461O382l238p192p244N009K4949J4192
12709E12745L565K365l824j7607j9591j9485j1417J5673K5597J8449J6520J0532
12697E33522r019J5216m634j6450o519q396j0218j8102k1542j8536K2994O4493
12685E22809Q0520P6459N9448M9541L7785L1203R184J9888M224j1343J54J4999
$$ plain form
12769 360632 388246 386864 368854 348757 328097 310746 296490 282734 256331 243390 254083 255862
12757 255862 246533 231988 228045 215955 217146 210987 220591 218733 223484 229610 218552 208602 195495
12744 195495 204893 215271 210783 205094 223777 249445 287190 356155 456807 582753 740311
12733 740311 900053 1001497 1022650 967818 869411 759297 678800 622232 573348 533583 509704
12722 509704 483252 458029 437048 441260 463426 479887 486269 483031 475839 468595 473604 498553 512745
12709 512745 516310 518675 514851 497244 477653 458168 446751 462424 488021 506470 522990 533522
12697 533522 524503 539719 535085 518635 512116 503720 493502 475400 453858 435322 458316 522809
12685 522809 603329 679788 739236 788777 826562 857765 866949 886837 891061 879718 879872 894871
12673H94871L2664K3396N684J2667J4744P3Q843N616J8879P16o23J1431M0701
12660A069662O5860O8944P5354O3126N3135K9074R106j5508k2285J037L0836N7023
12648A485364P1915R0129J13751J26264J40547J33529J52836J89706K60867L08321
12638C073229L86157N21404P61198J237565J843636K198519K032414J227843L675
12629A3285640j035107j410568j084540n29978q9917K71120N65354Q44755J225836
12620A2042595J716299K331736K978096L601863M205141N165365P161920J1256261
12612E0459276J9349333L4655757N8748777Q4270160R3660715P6962304L3700400
12605D51806722k2285643o6694582q2327636p0263048n0781544l4980420k3166538
$$ plain form
12673 894871 927535 950931 956615 969282 984026 984099 992942 998558 1017437 1018153 1017530 1028961 1069662
12660 1069662 1135522 1204466 1279820 1342946 1396081 1425155 1434261 1418753 1396468 1397505 1428341 1485364
12648 1485364 1557279 1647408 1761159 1887423 2027970 2161499 2314335 2504041 2764908 3073229
12638 3073229 3459386 3980790 4741988 5979553 7823189 10021708 12054122 13281965 13285640
12629 13285640 12250533 10839965 9755425 9225447 9135530 9406650 9972004 10816759 12042595
12620 12042595 13758894 16090630 19068726 22670589 26875730 32041095 39203015 50459276
12612 50459276 69808609 104464366 163213143 247483303 341144018 418106322 451806722
12605 451806722 429521079 362826497 280498861 210235813 159454269 124473849 101307311
12598A01307311j4923750r821183p150839n905452n225275m667647m114970l535900
12590D5962295l016734k529531k081995j740017j527609j434722j394642j344231
12582C0892814j275574j171386j037404r24789q35511p77907p05801o19118n15266
12573B3030058m25245l54414l11642l43347m04141m52136m91788m95561m91797
12564A9259987m59409m64586m47261m41935m47223m48949m16990l91032l75808
12555A5366794l55733l15836k81955k54593k41207k68656k98892k85807k76353
12546A2787762k90378k82751k54632k44407k13431k21039k08119j90676j89143
12537A0693186k00732j88212j65972j50919j43510j51106j49521j42654j34611
$$ plain form
12598 101307311 86383561 76562378 69411539 63506087 58280812 53613165 49498195 45962295
12590 45962295 42945561 40416030 38334035 36594018 35066409 33631687 32237045 30892814
12582 30892814 29617240 28445854 27408450 26483661 25648150 24870243 24164442 23545324 23030058
12573 23030058 22604813 22250399 21938757 21595410 21191269 20739133 20247345 19751784 19259987
12564 19259987 18800578 18335992 17888731 17446796 16999573 16550624 16133634 15742602 15366794
12555 15366794 15011061 14695225 14413270 14158677 13917470 13648814 13349922 13064115 12787762
12546 12787762 12497384 12214633 11960001 11715594 11502163 11281124 11073005 10882329 10693186
12537 10693186 10492454 10304242 10138270 9987351 9843841 9692735 9543214 9400560 9265949
12528I265949j38598j29225j13227j26986j45978j73549j92915j83887j65047
12519G896537j45659j30132j28081j22528j43154j34876r9662j08849j16982r1051
12509F675563r1580j09130j12646j24434j25486j16323j14307q9489r4403j00733
12499E597032j00350r5547p7698o5650q7951p5728n8832p6610r9510q8417q6577
12488D684162r5309j07440r4925r9411j23358j28415j46470j23011n2167p043
12478C706613J0217M111k889k684k8761k3953j1375k4852m7405l9123j5311k23
12466C524365K5247O8775J47093K75900L75428L67846K32598P218k20907l82361
12456D421202m11901l53961k68412j98088j36269j14504r3297p5759o1490p5493
$$ plain form
12528 9265949 9127351 8998126 8884899 8757913 8611935 8438386 8245471 8061584 7896537
12519 7896537 7750878 7620746 7492665 7370137 7226983 7092107 6992445 6883596 6766614 6675563
12509 6675563 6583983 6474853 6362207 6237773 6112287 5995964 5881657 5792168 5697765 5597032
12499 5597032 5496682 5401135 5323437 5257787 5169836 5094108 5035276 4958666 4859156 4770739 4684162
12488 4684162 4588853 4481413 4386488 4287077 4163719 4035304 3888834 3765823 3713656 3706613
12478 3706613 3716830 3720941 3718052 3715368 3686607 3662654 3651279 3626427 3579022 3539899 3524588 3524365
12466 3524365 3549612 3618387 3765480 4041380 4416808 4784654 5017252 5024470 4803563 4421202
12456 4421202 4009301 3655340 3386928 3188840 3052571 2938067 2844770 2769011 2707521 2632028
12446B632028o8125o1807m9596m7600n2323l5224l8533m9331m8381k5464k8690
12435B126954k3983k8179k0760k5706l7991m3534l2284l2025k2445j9298p025
12424A833724n324j8797k5609j1028k087J3124L0226M977j9256o1249o7998p2566
12412A598137o2404l3674k1547j6324l0840k8881j9055k7173j5239j0829o923
12401A325248J057l2112m4170k7962k1291l2123k5725r201n37k552N923j9155
12389A117400j7300k3869l0546j6477q830k7607k5230q146l0669k6463k1677N634
12377H86220J438j7705K32l666j3613j5389j8074l043o957o406r527k1473j5986
12364G56051l57j1987j4958j8485j0942k6190k0911q631n31k3142q9m439j8530
$$ plain form
12446 2632028 2563903 2502096 2452500 2404900 2352577 2317353 2278820 2229489 2181108 2155644 2126954
12435 2126954 2102971 2074792 2054032 2028326 1990335 1946801 1914517 1882492 1860047 1840749 1833724
12424 1833724 1828400 1809603 1783994 1772966 1770879 1784003 1814229 1819206 1799950 1738701 1670703 1598137
12412 1598137 1535733 1502059 1480512 1464188 1433348 1404467 1385412 1358239 1343000 1332171 1325248
12401 1325248 1326305 1294193 1250023 1222061 1200770 1168647 1142922 1133721 1133184 1130632 1136555 1117400
12389 1117400 1100100 1076231 1045685 1029208 1020378 992771 967541 959395 928726 902263 880586 886220
12377 886220 887658 869953 870185 866519 852906 837517 819443 816400 809443 803037 793510 772037 756051
12364 756051 755694 743707 728749 710264 699322 673132 652221 643590 643059 619917 619828 615389 596859
12351E96859k7313j3141R565O977k359j2886q629j3057j5049j5485r206q715j6125
12338D71436O096P170l324k496n952J46K790J511r218p043p160j5890n348J5172
12324D47890R464j3139n999l066J5082M673k8055j0507q571m595k669p728j7794
12311C74986p600k1375j9824q268q642O65j508Q429J5778J6312J0020j4364p366
12298C37243j4236j9312j9069n067k879j9164q995o250l881Q771q540M165L351
12285B46137r18P834L137q641k4229r309L396N308j5230m054M814J577M547l789
12271B10580n534M418O342j2865j1303L164j161n763n152j449j4383r938J021
12258A57977m757m987k366N556j0278q037L699j1764p343P43J7874N664l317Q085
$$ plain form
12351 596859 569546 556405 565970 572947 570588 557702 549073 536016 520967 505482 496276 487561 471436
12338 471436 477532 484702 481378 478882 472930 473076 475866 477377 468159 461116 453956 438066 432718 447890
12324 447890 457354 444215 438216 435150 450232 454905 426850 416343 407772 403177 400508 392780 374986
12311 374986 367386 346011 326187 317919 309277 309942 308434 316863 332641 348953 358973 344609 337243
12298 337243 323007 303695 284626 279559 276680 257516 248521 242271 238390 247161 238621 242786 246137
12285 246137 245219 253053 256190 247549 223320 214011 217407 222715 207485 203431 208245 209822 214369 210580
12271 210580 205046 209464 215806 202941 191638 194802 193641 187878 182726 181277 166894 156956 157977
12258 157977 153220 148233 145867 151423 141145 133108 136807 125043 117700 118443 136317 141981 138664 146749
12244A46749J7644j318M014P419k723l990N295r740j6874r404j1159m89l336n702
12230A16386l577k3j0519j8367r001J8090J2710o814R45j2291q372J8642K354
12217A00163M77K339j2090k0750j6829o026n324Q327K043j1072m021J3345Q620
12204E9202k523J8645K368o461j7651L650J3082o64O829k208M308J9344J6917
12191A14838O399k789p024j186O614N64r360J369o125p145J3520J2280J6421M376
12177A42752J6797J1809K305K1673L6643L4191N0003J03825J77844L17035M62524
12166A377401N17703M09446J45765j59774l82279m41473l55507k42884j70551
12157F97847j19068p7574k9732l4089m4476k5362j5652j4077j1672p180j7054
$$ plain form
12244 146749 164393 163075 167089 174508 171785 167795 173090 163350 146476 137072 125913 125424 122088 116386
12230 116386 112809 112786 102267 83900 74899 92989 105699 98885 99830 87539 79167 97809 100163
12217 100163 100640 102979 90889 70139 53310 47284 41960 50287 52330 41258 37237 50582 59202
12204 59202 56679 75324 77692 71231 53580 57230 70312 69648 76477 74269 78577 97921 114838
12191 114838 121237 118448 111424 110238 116852 117416 108056 109425 103300 96155 109675 121955 138376 142752
12177 142752 159549 171358 173663 195336 231979 266170 316173 419998 597842 914877 1377401
12166 1377401 1895104 2304550 2450315 2290541 1908262 1466789 1111282 868398 697847
12157 697847 578779 501205 471473 437384 392908 367546 351894 337817 326145 318965 301911
12146C01911j7421k5912j2780j5445o591k5835k1771k1136k2037r379O411j222
12134A28793l648K997j74n453R728P925l974j5526j7776Q5J7243J904l950K20
12120A18394J370o812p061m184J0834o887j2276R663P033J4578p408m685j509
12107A11050q777m040j9129j059j231j1019m269r831J2501R911m258p708Q140
12094G0281M895j376m490j3724j4633M168M194J5471J3271j7698j4144j6052O948
12081C7111N075j642o610j379K908J245k147o753P242M584j2391j0211J1645J6033
12067D4710j4558p066j3751M966P124M374K2862K2683l074l920L801M833p511
12054F5473r085K959m276m609Q727O05j1376j8639l203N586o704r749N220J0164
$$ plain form
12146 301911 284490 258578 245798 230353 223762 197927 176156 155020 132983 123604 130015 128793
12134 128793 125145 128142 127968 122515 132243 140168 136194 120668 102892 102977 120220 122124 118174 118394
12120 118394 119764 112952 105891 101707 112541 105654 93378 103041 110074 124652 117244 112559 111050
12107 111050 102273 98233 79104 78045 76814 65795 61526 51695 64196 74107 69849 62141 70281
12094 70281 75176 73800 69310 55586 40953 45121 49315 64786 78057 60359 46215 30163 37111
12081 37111 42186 40544 33934 32555 35463 36708 34561 27808 35050 39634 27243 17032 28677 44710
12067 44710 30152 23086 9335 14301 21425 25799 48661 71344 68270 64350 68151 72984 65473
12054 65473 56388 59347 55071 50462 59189 59794 48418 29779 26576 32162 25458 15709 20929 31093
12040C1093M806k1080j4539M276J196l313k481K940J89J400k75J872J4250Q163
12026B8497M48j230j2331r865k47J2740J0200L459P743j0787O682r956r622J641
12012A7372L503J0833L722R933k126n929j1326j2623n912J1173L404j1386K822
11999A3460K365N089J3933M804j563Q71q255J334k1981r136J866k224K068J135
11985C766k848P187q476P071J543R769K1750Q933J178o290k0268K40J1706J86
11971C5447j1488k0923m847J4773J2376q773l084N759j0157j1832L593M392R408
11958A4644m049J742N410p734k175L931m830J8927J1778K41q352j3283j0652K64
11944E862M840O366l824O869j255o053m38p247L696j206O363R79P423n151K18
$$ plain form
12040 31093 35899 14819 280 4556 5752 2439 -42 2898 3087 4487 4212 6084 20334 28497
12026 28497 28945 27715 15384 5519 5272 18012 28212 31671 39414 28627 35309 25353 15731 17372
12012 17372 20875 31708 35430 45363 43237 37308 25982 13359 7447 18620 22024 10638 13460
11999 13460 15825 20914 34847 39651 38088 38959 30704 32038 10057 921 2787 563 2631 3766
11985 3766 918 8105 -371 6700 8243 18012 39762 48695 49873 43583 23315 23555 35261 35447
11971 35447 23959 3036 -1811 12962 25338 16565 13481 19240 9083 -2749 844 5236 14644
11958 14644 10595 12337 17747 10013 7838 11769 6939 25866 37644 37885 29533 16250 5598 5862
11944 5862 10702 17068 13244 20113 18858 12805 12367 5120 8816 7610 13973 14952 22375 17224 17442
11929A7442q070Q875N847p878m510p967j59l594p166k194J1143M891m936o506
11915d782J1444K7524J0064M032J984j43j2661j3094j1454P331R599J087M269
11902C5200q930j6354n869J1648l532r038k690L727J4563m759r414l188j453n348
11888e437k486L304K483j4992n433m50J8332Q724M063n641n680P62L468l809O173
11873C381j467j1669J449J440K0321Q644o446j533j0058Q689o530n298l765j1744
11859a4586R441P067k396M210l618n373N780n222K006l252k109q809j432M800
11845a3493R548J4406k640p676q34O709K04q651o537J1828L060l175O108J5132
11831B3989m667k4971q632J5015K257o474r270m403K263K0909J0897P78q823j0339
$$ plain form
11929 17442 9372 18247 24094 16216 11706 3739 3580 -14 -7180 -9374 1769 6660 1724 -4782
11915 -4782 6662 34186 44250 48282 50266 50123 37462 24368 12914 20245 29844 30931 35200
11902 35200 26270 9916 4047 15695 12163 3125 435 4162 18725 13966 4552 1364 -89 -5437
11888 -5437 -7923 -4619 -2136 -17128 -22561 -23011 -4679 4045 8108 2467 -3213 -2451 1017 -2792 3381
11873 3381 1914 -9755 -8306 -6866 13455 22099 15653 14120 4062 12751 6221 923 -2842 -14586
11859 -14586 -5145 1922 -474 3736 118 -5255 525 -4697 -2691 -5943 -8052 -16861 -18293 -13493
11845 -13493 -3945 10461 7821 145 -689 6020 6224 -2427 -8964 2864 5924 2749 8857 23989
11831 23989 19322 -5649 -14281 734 2991 -3483 -12753 -17156 -14893 6016 16913 17691 8868 -1471
11817a471J5134j801j9873L635O53k023J0953J1743O351j579J639m785m452J505
11803A5629k429o496J001J6768J0127J429l046M328O810o761j0842K845L93K615
11789C2371N67q384J1592P458k597j0607j1312j12j1741j776m973o485J5322L409
11775A2732k453n901p212l432p3j2885M407J8034j870J419R650q122l294o460
11761e460j5487l146l965q268m46J8085J9597L251j868M807j0428Q203J635J2133
11747A8643N848p23J0976P75n187n815j4112q689P598l860l349k8330p630R913
11733b3942n108m091K19J2015J762R263K323m500N664J2970M9n782L185k199M935
11718F763K238l984j549L60J8211L633k339p870J157M889P066L0614L0242M1335
$$ plain form
11817 -1471 13663 11862 -8011 -4376 -3723 -5746 5207 16950 23301 21722 23361 18576 14124 15629
11803 15629 13200 6704 7705 24473 34600 36029 32983 37311 44121 37360 26518 29363 29756 32371
11789 32371 32938 24554 36146 43604 41007 30400 19088 18976 7235 5459 486 -5999 9323 12732
11775 12732 10279 4378 -2834 -6266 -6339 -19224 -14817 3217 1347 2766 12416 4294 1000 -5460
11761 -5460 -20947 -24093 -28058 -36326 -36772 -18687 910 4161 2293 7100 -3328 4875 6510 18643
11747 18643 24491 23768 34744 35519 30332 24517 10405 1716 9314 5454 2105 -26225 -33855 -23942
11733 -23942 -29050 -33141 -32922 -20907 -19145 -9882 -7559 -12059 -6395 6575 6624 842 4027 1828 6763
11718 6763 9001 5017 3468 3828 22039 25672 23333 15463 16620 21509 28575 59189 89431 130766
11704A30766L9444K8322j6794l2328j5802k3750k4351o413Q191J5507K1496J6568
11692A40856j10Q988M52j7201k2145k0448j0342j0792j0209j0747m690m184J304
11679D0732O105P486K0896J7290J3210J9880k357j3846p126k60J037j4852O806
11666I5001K1684K7991L6367N0794O1152N3832L0946J5648l023k4286m4699m9217
11654B72190m8373l6577k9219j9617k2149j4472j4417j8059j574r028n375k168
11642E1162Q13K427k083j5624j6343j2618J3259K0666K263j0456J026Q058N361
11629D7911j0464j5398j2574p785o979P249J8720L527j1757k398q80m296J1336
11616A6212Q802M823M782O056J8373o982J348J495r505q491r249j9423p009N617
$$ plain form
11704 130766 170210 198532 181738 149410 133608 109858 85507 79094 87285 102792 124288 140856
11692 140856 140746 149734 150186 132985 110840 90392 80050 69258 59049 48302 43612 39428 40732
11679 40732 46837 54323 75219 92509 105719 125599 123242 109396 102270 102010 103047 88195 95001
11666 95001 116685 144676 181043 231837 292989 346821 377767 393415 390392 366106 321407 272190
11654 272190 223817 187240 158021 138404 116255 101783 87366 69307 67733 58705 53330 51162
11642 51162 51975 54402 52319 36695 20352 7734 20993 41659 43922 33466 34492 42550 47911
11629 47911 37447 22049 9475 1690 -5289 1960 20680 24207 12450 10052 9172 4876 16212
11616 16212 25014 29837 34619 40675 59048 52066 53414 54909 45404 36913 27664 8241 1232 6849
11602F849K160K261l413p893o785K390j565P33J189k485N047o793L743N522R09
11587A869K621M150J32l236R37n109r924K387K301N060l52n662p995l867J83j391
11571a7896P094O504J782k463j1519Q838J4202N492L277R332k133j1944k008k831
11557E727j2496q66J0081K029J5239j3815j1162M181J0704n591l787J5230Q653
11544B4127j1364R09j1256k329J341J172n076k77J4533K0877L3188J3823j1202
11531F8466j8561k2379k0125l836l651j0009p569j0147J4534J3180o119p435k392
11518a6043J594J4763O426l955o73O908J054o548p845n066M663o117r133j644
11504b1616m866K2620N773r46K368j0931o489m24jR013m950p702j0895J2241L624
$$ plain form
11602 6849 9009 11270 7857 -36 -6821 -4431 -5996 -5263 -4074 -6559 -1512 -8305 -4562 960 1869
11587 1869 4490 8640 8772 5536 6473 1364 -8560 -6173 -3872 1188 836 -4826 -12821 -16688 -16505 -17896
11571 -17896 -10802 -4298 -2516 -4979 -16498 -7660 6542 12034 15311 24643 22510 10566 8558 5727
11557 5727 -6769 -7635 2446 4475 19714 5899 -5263 -1082 9622 4031 244 15474 24127
11544 24127 12763 13672 2416 87 1428 2600 -2476 -2753 11780 32657 65845 79668 68466
11531 68466 49905 27526 7401 3565 -86 -10095 -17664 -27811 -13277 -97 -6216 -13651 -16043
11518 -16043 -14449 314 6740 2785 2112 9020 10074 3526 -4319 -9385 -4722 -10839 -19972 -21616
11504 -21616 -26482 -3862 1911 965 3333 -7598 -14087 -14511 -14512 -5499 -10449 -18151 -29046 -16805 -13181
11489a3181j244O057q111j634l314N411o519j619j6649J4382P613k970P428K02
11475a4148J198J2787P623j7809k0091J611J4196n201N36p318o558Q713R922O026
11461h513Q928J633j0637L434J4258p15L697M410j3971j8261J0590J65j64l11
11447e457N42J2022M856k142L507j9021j3717Q450J0188l532L207j2657l094O029
11433a0819N564J2164P03M178K1781J6224m677j6600K403n909j0556L687J6805
11420C4948N945K5896j2708N279O434J4541K5799K8199N2388R6629J43183J47529
11408E74062J04100K0889o6113j10032j17574p7812m8142n3122m6551l1178l592
11397A44935p461k985k3755p816o956j3702J325N332k8680k4248J775J1109P451
$$ plain form
11489 -13181 -14425 -8368 -16479 -18113 -21427 -16016 -22535 -24154 -40803 -26421 -18808 -21778 -14350 -14148
11475 -14148 -12950 -163 7460 -10349 -30440 -28829 -14633 -19834 -19298 -26616 -33174 -24461 -14539 -8513
11461 -8513 415 2048 -8589 -5155 9103 8388 12085 16495 2524 -15737 -5147 -4982 -5146 -5457
11447 -5457 -4915 7107 11963 9821 13328 -5693 -19410 -10960 -772 -4304 -1097 -13754 -16848 -10819
11433 -10819 -5255 6909 7612 11790 33571 49795 45118 28518 30921 25012 14456 18143 34948
11420 34948 40893 66789 54081 59360 65794 80335 106134 134333 186721 283350 426533 574062
11408 574062 678162 699051 632938 522906 405332 327520 279378 226256 179705 148527 144935
11397 144935 137474 134489 110734 102918 95962 82260 83585 88917 60237 35989 37764 48873 56324
11384E6324j1436k361M684j1140j1537k91j824K366l275P532L464l00R801j921
11370D0086o459l766o104j730N165l162p084p797m425O26M30J343l57J422N292
11355A3480J446q61J208l011j1892p708K415r565L515n169q224P917R764J4947
11341H262j839j1153M082N608L733K018L072M368N345r089L908j118m200o429
11327F568p450K724R337J4285O459j3898r246j105J647l285J3565L647n829j5849
11313A570n497J0040N979j5320o628N614M79n804K410Q43K98n974M446r05J4843
11298F394J738j2600M393J2425n17j5009K462N396R729m0P498M88r294q371n82
11283D110P44l583R782J4174r554j6949O963J4761k647k9454k3705J3584O507
$$ plain form
11384 56324 44888 42527 47211 36071 24534 24243 22419 24785 21510 29042 32506 32206 42007 40086
11370 40086 33627 29861 23757 22027 27192 24030 16946 9149 4724 5350 5780 7123 6766 8188 13480
11355 13480 14926 14065 15273 12262 370 -7338 -4923 -14488 -10973 -16142 -24366 -16449 -6685 8262
11341 8262 6423 -4730 -648 4960 8693 10711 13783 18151 23496 14407 18315 17197 12997 6568
11327 6568 -882 1842 11179 25464 31923 18025 8779 7674 9321 6036 19601 23248 17419 1570
11313 1570 -3927 6113 12092 -3228 -9856 -4242 -3763 -9567 -7157 -6314 -6016 -11990 -7544 -8449 6394
11298 6394 8132 -4468 -75 12350 11833 -3176 -714 4682 14411 14371 21869 22357 13063 4692 4110
11283 4110 4854 1271 11053 25227 15673 -1276 5687 20448 17801 -11653 -35358 -21774 -15267
11270a5267Q994J573q725N60l048k188L844J48L526J476M512K468O799J3708J1879
11255C0259o289j091j2066k4759l346J6376J3560n386k977P437J3303J3884J6199
11242E5104J3838K3596L7189P3227J08235J41966J56792J07744L1208p2454j25648
11231E50797j15956r6026o8094n4271m6793k9265j5377j7436n087j8750j9864
11220F3878j3500q087j899P70N97o289M974k100q530M076J0781m260Q600R667
11206E8678k330j1973k6149m520J062P218L41J1399r190n564L287j293O081j7056
11192I991k548l479q321m213J3664K337J459K2710q056l089n627J737J5740k267
11178C0038o719n386M109M563j0149o26L782o593o187k866j5820J0662l860k902
$$ plain form
11270 -15267 -6273 -4700 -13425 -12865 -15913 -18101 -14257 -14109 -10583 -9107 -4595 -2127 4672 18380 30259
11255 30259 23970 22879 10813 -13946 -17292 -916 12644 7258 4281 11718 25021 38905 55104
11242 55104 68942 92538 129727 202954 311189 453155 609947 717691 748899 676445 550797
11231 550797 434841 338815 270721 216450 169657 140392 125015 107579 102492 83742 63878
11220 63878 50378 42291 40392 41162 41759 35470 40444 38344 29814 33890 44671 40411 49011 58678
11206 58678 56348 44375 18226 13706 14768 21986 22327 33726 24536 18972 22259 20966 27047 9991
11192 9991 7443 3964 -4357 -8570 5094 7431 8890 31600 23544 20455 14828 16565 32305 30038
11178 30038 23319 17933 22042 26605 16456 15830 19612 13019 6832 3966 -11854 -1192 -5052 -7954
11164g954q748L950J4871K41k825l684j267J4527J0504j1232m455O965q76j3049
11150c032k880K70K379m547k882J0845n575j5647o480J394P369j1154p143J1643
11136b5440M399o222J1965J3119K1380J2101p577m557P650N933J5426N969m783
11123D9363j3314j6352k6116K230J4642P198j0554J920J4112j116q191j0092m630
11110i00Q243m018k497j3481J3831k35r354q662k419J6721J134j545R360k034
11096D144j3721m239M993n536j0241P942Q568m239j488J716j368r913M706k919
11082b1595P955O871J0721j445o007o031J452R859K924P114O103J184P44m609
11068A5240j0441l655P021r486N565O926P403j6033p65K416L312n664j5112m066
$$ plain form
11164 -7954 -16702 -12752 2119 2360 -465 -4149 -5416 9111 19615 8383 3928 10893 10017 -3032
11150 -3032 -5912 -5642 -3263 -7810 -10692 153 -5422 -21069 -27549 -26155 -18786 -29940 -37083 -25440
11136 -25440 -21041 -27263 -15298 -2179 19201 31302 23725 19168 26818 32751 48177 54146 49363
11123 49363 36049 19697 -6419 -4189 10453 17651 7097 9017 23129 22013 13822 3730 -900
11110 -900 7343 3325 828 -12653 1178 943 -8411 -17073 -19492 -2771 -1637 -3182 6178 4144
11096 4144 -9577 -13816 -8823 -14359 -24600 -16658 -8090 -12329 -13817 -12101 -13469 -23382 -18676 -21595
11082 -21595 -13640 -6769 3952 2507 -3500 -9531 -8079 1780 4704 11818 17921 19105 19849 15240
11068 15240 4799 1144 8165 -1321 4244 11170 18573 2540 1775 4191 7503 1839 -13273 -17339
11054a7339R620J246M733j530O051n196J11j1437k30m629J4145P775L52j5393
11040a1721q031n538l709K2912J6343J1756R946j2749r988Q030j3664l0697o353
11027c3463J0591J5578l002J606m009j3488r3P61Q07m282j4833J0243J7552J3049
11013b983m63P183L915P319p199j4574o777P39q83n226K035j0708N129M940R136
10998h417Q04l10j818L105J91j1013M611J7268k024j8600P916J2486m096k0613
10984b0510K215J5039J2365k056m321P408L304n309j4902n594q592l618J2668
10971a1903R535j8099j7326K600K0532M811J3861L865q756N17k489K735l592n627
10957i336j500P340R194N978l701p905o06p552p811l70J211N241J6792L859n279
$$ plain form
11054 -17339 -7719 -6473 -1740 -3270 2781 -2415 -2304 -13741 -13971 -18600 -4455 3320 3672 -11721
11040 -11721 -19752 -25290 -28999 -6087 10256 22012 31958 19209 9221 17251 3587 -27110 -33463
11027 -33463 -22872 -7294 -10296 -8690 -12699 -26187 -26280 -25519 -24712 -28994 -43827 -33584 -16032 -2983
11013 -2983 -3446 3737 7652 14971 7772 -6802 -13579 -12840 -13723 -18949 -16914 -27622 -22493 -17553 -8417
10998 -8417 -7613 -7923 -9741 -6636 -6445 -17458 -12847 4421 2397 -16203 -8287 4199 103 -20510
10984 -20510 -18295 -3256 9109 7053 2732 10140 13444 8135 -6767 -12361 -20953 -24571 -11903
10971 -11903 -2368 -20467 -37793 -35193 -14661 -9850 4011 7876 -880 -363 -2852 -117 -3709 -9336
10957 -9336 -10836 -3496 5698 11676 7975 70 -536 -8088 -15899 -16269 -15058 -9817 6975 10834 5555
10942E555m71q388K458k481j460J507J847N598j2575K109J039q568o483J1161
10928i152J177k458J6664l732j3702k119n798l149j0063N850J1771k193Q214J5114
10914F424p195l110j374o556j1786o827M688Q445K876J0039R35N501o975j8270
10900b3185r680m825N601P296N867o05J4596L610O716N231j4137J237j3669k5949
10886d1896k316P640J7181M762O618K883j1782o14K494n410J5000J0186r820p520
10872a2594j0470l68P242N834M31n747R202K4413j146j6499j5413K38j2983J4987
10858a2873K0716K251j8732J952M389J4167L043j1539k50J175q402j4089Q567
10845i625J6473o006L622q731l924N862J822J949J4014R000j0908j4605j753o24
$$ plain form
10942 5555 5084 -3304 -846 -3327 -4787 -3280 -1433 4165 -8410 -6301 -5262 -13830 -20313 -9152
10928 -9152 -7975 -10433 6231 2499 -11203 -13322 -19120 -22269 -32332 -26482 -14711 -16904 -8690 6424
10914 6424 -771 -3881 -5255 -11811 -23597 -30424 -25736 -17291 -14415 -4376 -3441 2060 -4915 -23185
10900 -23185 -32865 -37690 -32089 -24793 -18926 -19531 -4935 -1325 5391 10622 -3515 -2278 -15947 -41896
10886 -41896 -44212 -36572 -19391 -14629 -8011 -5128 -16910 -17524 -15030 -20440 -5440 4746 -5074 -12594
10872 -12594 -23064 -23432 -16190 -10356 -9925 -15672 -6470 17943 16797 298 -15115 -14877 -27860 -12873
10858 -12873 7843 10094 -8638 -6686 -2297 11870 14913 3374 3124 4299 -4103 -18192 -9625
10845 -9625 6848 842 4464 -4267 -8191 -2329 -507 1442 15456 24456 13548 -1057 -2810 -3434
10831c434k730q776O163J0401J20O800q293l375J264p94j3585j43J2571J023O650
10816C862N214J3888K4p288p152o770j7800O042N976J726m546n575k707Q297J8023
10801A1214N457r355n375n063o923j0673L480J3120N695J3907O285J650k154k443
10787A8822K190o544m845j778M212q063p658j6347j70J7453N274r45l36O26Q725
10772A0616J6259J5930j0799j7721R387j886j0519j19o78Q012K166L72n066l262
10758A2692q596o488j893J4394J4560q747m755J975L129j977L498j324j619l194
10744A1655R969K714K09j3887j355R867M9J2698P40K919J0099k9J237j1955j1586
10729B3344J315N55J0701J3274o97N735n255q700j0598J0520j835J1025K9815
$$ plain form
10831 -3434 -6164 -14940 -8777 1624 1744 8544 251 -3124 -1860 -2654 -16239 -16382 -3811 -2788 3862
10816 3862 9076 22964 22988 15700 8548 1778 -16022 -9980 -4004 -2278 -6824 -12399 -15106 -6809 11214
10801 11214 16671 7316 1941 -3122 -10045 -20718 -17238 -4118 1577 15484 21769 23419 21265 18822
10787 18822 21012 14468 9623 7845 12057 3994 -3664 -20011 -20181 -2728 2546 1601 1265 1891 10616
10772 10616 26875 42805 32006 14285 23672 21786 11267 11148 10470 18482 20648 21020 15954 12692
10758 12692 4096 -2392 -4285 10109 24669 15922 11167 13142 16271 14294 17792 16468 14849 11655
10744 11655 21624 24338 24547 10660 9305 19172 19221 31919 32659 35578 45677 45648 46885 34930 23344
10729 23344 24659 25214 35915 49189 48492 54227 48972 40272 29674 40194 38359 49384 79199
10716G9199O4185M9317N1240M8809M1058R453J4831L0792L5563K691k9523n4053
10704C43562n4813o9545n2726k1118l0820j3127m662J0377J3064K1474N888K152
10692A49706n848q823j1549j0224J321j799J3583O783l505K840O103K8548K6741
10679A93877N7949J05508J59929K22902K29405J90172Q9165l3232n6272r548N5850
10668A205705R7293M4269m8988j47663k06578k03276j63183j02529o3015l6929
10658C75106k3166l8638l4030k3302j1233j4960j5103k0729j0573O942o52j3810
10646A75852j6550p99n593j0467m27m163k137n607n030P400L324l700r320QK222
10631A25013p413K06j1000m675K28l727o786L859K258j5431j8241j219Q351n970
$$ plain form
10716 79199 143384 192701 243941 292750 333808 343261 358092 388884 424447 427138 397615 343562
10704 343562 288749 219204 166478 145360 114540 101413 96751 107128 120192 141666 147554 149706
10692 149706 143858 135035 123486 113262 114583 112784 126367 133150 129645 132485 138588 167136 193877
10679 193877 251826 357334 517263 740165 969570 1159742 1248907 1215675 1159403 1149855 1205705
10668 1205705 1302998 1347267 1298279 1150616 944038 740762 577579 475050 412035 375106
10658 375106 351940 313302 279272 255970 244737 229777 214674 193945 183372 190314 189662 175852
10646 175852 159302 158503 152910 142443 142016 137853 135716 130109 125079 132479 135803 132103 122783 122791 125013
10631 125013 117600 117806 106806 102131 102359 98632 91846 95705 97963 82532 64291 63072 71423 65453
10617F5453j1189o051n633K985J0592Q619o689m512P416j1222p31N307P573m41
10603F1477M472O49j2949L378N795L21K20j9680m481R052N750p052k1875m659
10589B0418J636J1800P936P220K851j024j3693n92J772j1938m01J1586k767o413
10575B8391n072K148N149K681j1378j6592O466Q004L803O575N615k2531q646J0211
10561A4824R153m014j912J891J385Q250N40o930o678r882O205l63j3504k75Q124
10546F814J4386R588m4j1438j228M803q282j0013j1170J362K0723K0235o104Q77
10532C0509O536J226L188P37M242j5854j2938o614n410L437P098O047n433l324
10518A3447l445p488q67R138R882j2119j1155o065P09M183J5103J912K667q341
$$ plain form
10617 65453 54264 48213 42580 45565 56157 64776 58087 53575 60991 49769 49038 54345 61918 61477
10603 61477 65949 66598 53649 57027 62822 63143 63363 43683 39202 48254 54004 46952 25077 20418
10589 20418 22054 33854 41790 49010 51861 50837 37144 36552 38324 26386 25985 37571 34804 28391
10575 28391 23319 25467 30616 33297 21919 5327 11793 19797 23600 30175 35790 13259 4613 14824
10561 14824 23977 19963 18051 19942 21327 29577 30117 23187 16509 6627 12832 12469 -1035 -1310 6814
10546 6814 21200 30788 30744 19306 18078 22881 14599 4586 -6584 -5222 15501 35736 29632 30509
10532 30509 37045 38271 41459 42196 46438 30584 17646 11032 5622 9059 16157 22204 16771 13447
10518 13447 10002 2514 1647 10785 20667 8548 -2607 -8672 -7963 -3780 11323 13235 15902 7561
10504G561j480K468J506J5869R296j0787j3494o278R690N68r05J0216k610j0814
10490A0806L872J4965O346k4134j9313N582O611Q844J3198j1610r870j6601k703
10477a4007K982n958J900K968j5715M152J9333J1447O811j1221r061Q449J6984
10464A9064J9134K987r755r531o082k729L197k869k5878N710J193J5r635l915
10450a9094J4706L763q488P586N742N55O664l110j33J8480K1443K0303j299J255
10436F8373j5481k3946n909j0889p377R483M463j465j82j1833o781j193q639J794
10422i582j987l250j859k125Q123m84J262J3995K206K865j5461j9832J0784N844
10408i501O696Q059P982l758L261M129j2023m567J0155m144k413p333J0443J7161
$$ plain form
10504 7561 6081 8549 10055 25924 35220 24433 10939 4661 14351 14919 14014 24230 21620 10806
10490 10806 14678 29643 35989 11855 -7458 -1876 4735 13579 26777 15167 5297 -11304 -14007
10477 -14007 -11025 -16983 -15083 -12115 -27830 -23678 -4345 7102 13913 2692 -6369 2080 19064
10464 19064 38198 41185 31430 21899 15817 13088 16285 13416 -12462 -6752 -5559 -5544 -15179 -19094
10450 -19094 -4388 -625 -9113 -1527 4215 4770 11434 8324 8191 26671 48114 68417 67118 68373
10436 68373 52892 28946 23037 12148 4771 14254 18717 17252 17070 5237 -1544 -2737 -11376 -9582
10422 -9582 -11569 -14819 -16678 -18803 -10680 -11164 -9902 4093 6299 9164 -6297 -26129 -15345 -9501
10408 -9501 -2805 5254 13236 9478 12739 16868 4845 278 10433 6289 3876 -3457 6986 24147
10394B4147j489k77l415r890j1394P96J4552O546O048j0452j96q793Q946J3098
10380B8227L56j493r899J6490k192Q800K2992N615j2157k0869k453j4922J0233
10367B8728N545P148p38j5652o164M191M39J7723K652j8599q877N091J068L204
10353B5759J2346J5742p938j900q840k570L753M978J8208L3319L2293J0561l220
10340A32491R87K250L427p851J155j696k2556L143l024j9372k3013m460j3483
10327D7998k322K645Q488L588J3390J5023o35J2238j209N50J8147K961j1940m212
10313A04710N618j7698k4124p075K3542J4972L1741N4528P0409O0255P3200N2164
10301D42242J8146j3638o3072p3592p2026n8054m5217k9214r259q587m267p032
$$ plain form
10394 24147 22658 22381 18966 9076 -2318 -1522 13030 19576 25624 15172 14976 6183 15129 28227
10380 28227 28583 27090 17191 33681 31489 40289 63281 68896 56739 35870 33417 18495 28728
10367 28728 34273 41421 40683 25031 18867 23058 23497 41220 43872 25273 16396 21487 22555 25759
10353 25759 38105 53847 45909 44009 35169 32599 36352 41330 59538 92857 125150 135711 132491
10340 132491 133478 135728 139155 131304 132459 130763 108207 111350 108326 88954 65941 61481 47998
10327 47998 45676 48321 56809 60397 73787 88810 88175 100413 99204 99754 117901 120862 108922 104710
10313 104710 110328 92630 68506 61431 84973 99945 131686 186214 256623 316878 390078 442242
10301 442242 460388 446750 383678 310086 238060 180006 134789 105575 96316 87729 83462 76430
10289G6430o939N414o41k612K0736R13R582j2310r851N261p575J3115P010P020
10275A05553J3302L0771L3776M0570L4044K4873M1078K4211J7278j9157k6603
10264C19696k3136k9744l4789l1418m0436l1975j0566m0514r081M609K590J893
10252G7129j49j1785j0854J1103L839Q006j054l496R60m437m083L512K202L835
10238G4728m823J545M364j06j79Q89K623n571l536j362N464j4780J519J4881k551
10223G3105N078J4888m988j0076N265r900q276m113K289j1751j4588J2000O117
10210E5050O458j7268l150O977j31j3264n728k363P200J8867p69k1392L685K2642
10196E6814K7045K620n064Q171R748J3509J6627J7206J2898J6319M994j2667j9204
$$ plain form
10289 76430 69491 74905 74264 71652 92388 93301 102883 90573 80722 85983 78408 91523 98533 105553
10275 105553 118855 149626 183402 223972 258016 282889 323967 348178 365456 346299 319696
10264 319696 296560 266816 232027 200609 160173 128198 117632 77118 68037 72646 75236 77129
10252 77129 76980 65195 54341 65444 69283 77289 76235 72739 73699 69262 65179 68691 70893 74728
10238 74728 69905 71450 75814 75708 75529 76418 79041 73470 69934 68572 74036 59256 60775 75656 73105
10223 73105 78183 93071 88083 78007 83272 73372 65096 60983 63272 51521 36933 48933 55050
10210 55050 61508 44240 41090 48067 47936 34672 28944 26581 33781 52648 51879 30487 34172 56814
10196 56814 83859 86479 81415 89586 99334 112843 129470 146676 159574 175893 180887 168220 149016
10183A49016l5297k5900K76j8540p482N719q712k8814j2479J0555N367p509j9800
10170F400O843N703J711N219k285J0936Q468P634n473L299N445J2291K4401K1629
10156A12221K2758p362q26J093k1639k6442j2284j5567p549P211n161n66r376
10143C6511o661o378j2397J828K822J522k156k157L759L577m20M069p679J776
10129A8016J736o935P315R500o75j0432j0069r218J1433K655o715j0883L554p289
10115h007R423P027J1140K328j8160J3196J6021M663k976k0891k2589l134J0627
10102a332J4029J0462N590n587j4066J083N539L591l705k682N331R899J019m488
10088B4683o012o370L873J0187m776j2055r900j6856L449J1704J0498R031m119
$$ plain form
10183 149016 113719 87819 88095 69555 62073 67792 59080 30266 17787 28342 33709 26200 6400
10170 6400 13243 18946 20657 25876 23591 34527 42995 50629 45156 48455 53900 66191 90592 112221
10156 112221 134979 127617 126791 127884 106245 79803 67519 51952 44403 51614 46453 45887 36511
10143 36511 29850 23472 11075 12903 15725 17247 15091 12934 16693 20270 19850 23919 16240 18016
10129 18016 19752 12817 20132 29632 28957 18525 8456 -762 10671 13326 6611 -4272 -718 -8007
10115 -8007 1416 8443 19583 21911 3751 16947 32968 37631 34655 13764 -8825 -11959 -1332
10102 -1332 12697 23159 28749 23162 9096 10179 15718 19309 15604 12922 18253 28152 29171 24683
10088 24683 18671 12301 16174 26361 21585 9530 -370 -17226 -13777 -2073 8425 17456 13337
10075A3337l164N643J1412k5q388r720J0882O621j668q269k112R077J4113J1623
10061D9362K30j7885o040P431o816j9204q77n501l117J5638m637R018R615l840
10047B3377l282R672K575k4999j2542l80o653J773Q709J7789P650j5142q404j0798
10033a0655J198P024k035J2872j360q694l143o949m721N474J7685K031O683Q174
10019B3584P346M934J2910J6027M121l414o464q553L438N513r92k2052j22O547
10005D2823J322j5329p949L661M923j8872j0227J7956K763j3025j6499j78K740
9992e891Q154j90J7941M178l87j1612k725q232J553m235j484M731N807n071M866
9977G403R940k4578o728J593N980k602q634p90J0118J7763p710K332J3713m560
$$ plain form
10075 13337 10173 15816 27228 27203 18815 9095 19977 26598 24930 16661 14549 23626 37739 49362
10061 49362 49592 31707 25667 33098 26282 7078 6201 700 -2417 13221 8584 17602 27217 23377
10047 23377 20095 29767 32342 7343 -5199 -5579 -12232 -10459 -1750 16039 23689 8547 143 -10655
10033 -10655 -9457 -2433 -4468 8404 7044 -1650 -4793 -11742 -16463 -10989 6696 8727 15410 23584
10019 23584 30930 35864 48774 64801 68922 65508 59044 50491 53929 59442 58450 36398 36276 42823
10005 42823 44145 28816 20867 24528 29451 10579 352 18308 21071 8046 -8453 -8631 -5891
9992 -5891 2263 2073 20014 24192 23805 12193 9468 1236 2789 -1446 -2930 1801 7608 2537 7403
9977 7403 17343 -7235 -13963 -12370 -6390 -8992 -17626 -18416 -8298 9465 1755 4087 17800 13240
9963A3240n848j6531j1036N186L596m940q586j7592O304J3673K450j1201k2O219
9949b5088R314L77O895k406Q243l781j2337n038M754P400O560o02j91N892j634
9934a642p526q055J1458K376Q246J2402K110n26M702M997n427j1629k75J4397
9920B5608J2156J1540P077r789j8193j3266P515o205k531k873P335o896N950j620
9906A5808j770j0809l217N426q96L834K80j935R108N117n459j885O367J9723m353
9891C5339k0384l556J0250l954n443M408m392j1790M167J2610O475m69O640K552
9877C2453J5696R935N515o346k147m080n630j3910j2163l591J7214N649j884R377
9863D6088L994m626j1874m988p261j1911p360J57J3439l379o879J371j829j0857
$$ plain form
9963 13240 7392 -9139 -20175 -14989 -11393 -16333 -24919 -42511 -36207 -22534 -20084 -31285 -31307 -25088
9949 -25088 -15774 -15397 -8502 -10908 -2665 -6446 -18783 -23821 -19067 -11667 -5107 -5709 -5900 -8 -1642
9934 -1642 -9168 -17223 -5765 -3389 4857 17259 19369 18843 23545 28542 23115 11486 11211 25608
9920 25608 37764 49304 56381 46592 28399 15133 22648 16443 13912 11039 18374 11478 17428 15808
9906 15808 14038 3229 12 5438 4542 8376 8656 6721 15829 20946 15487 13602 19969 39692 35339
9891 35339 14955 11399 21649 17695 12252 16660 12268 478 4645 17255 23730 23261 29901 32453
9877 32453 48149 58084 63599 57253 55106 51026 45396 31486 19323 15732 32946 38595 36711 46088
9863 46088 50082 45456 33582 28594 21333 9422 2062 2219 15658 12279 5400 6771 4942 -5915
9849e915P602L3699J6704Q847K31J3742J8682J6965K2331J6803N047j3157k0265
9836A21316k2125j1398p912k2814J8039O903k940M673q38j3145r09q687j474j464
9822E7225o219k59k090j0009k933J843N053K288n56p10l525j150M601j6599j5091
9807A1869m835J3262m85j1151m955o243J929J4732J4880j0061j449L584j0809
9794A0268m548k352M507Q079J41J837M37J671j6333j615J4960j513k13n303N412
9779A5435K457J0051k481q466j2013l390J9525j452k284p80o45j16r510p889n714
9764g272j1416N89J8871R241J18J0054j2004O051J4544N640p871q285o509J3215
9750B4966J7134j2838j0918N65M438j3526r276P395N783j0050l233N92r860K653
$$ plain form
9849 -5915 1687 35386 52090 60937 61168 74910 93592 110557 132888 149691 154738 141581 121316
9836 121316 99191 87793 79881 57067 75106 82009 79069 83742 82904 69759 68850 60163 58689 57225
9822 57225 51006 50747 48657 38648 35715 37558 42611 44899 44343 43633 40108 38958 43559 26960 11869
9807 11869 7034 20296 19811 8660 3705 -2538 -609 14123 29003 18942 17493 21077 10268
9794 10268 5720 3368 7875 15954 16095 17932 18369 20040 3707 2092 17052 15539 15326 10023 15435
9779 15435 17892 27943 25462 16996 4983 1593 21118 19666 17382 16602 15957 15841 6331 -1558 -7272
9764 -7272 -18688 -18099 772 10013 10131 20185 8181 14232 28776 34416 26545 18260 11751 24966
9750 24966 42100 29262 18344 18909 23347 9821 545 7940 13723 3673 440 1032 -8828 -6175
9736f175M188P665P35N340j16j247M881J735r198m175J374M164N959p560m809
9721B761J5870L610J805J2307q888j1219N446q727L911n732j2256l958L315J8948
9707A7193M942j916R292J1985j1935j6642l499R920j0637r222o244k156j53j0129
9693a9201J0410J4376Q955l210j5656J0918P305J80Q492K917l017j242n88m881
9679A5758j2278l552M601J5387M443r026j3440L267K793l347N128O022p499O185
9665A4442N263J0746m519l918L115J4337q35J0816j578o168J1227R72P286o882
9651E4304m906j1067j3531P95J474J0811p047K67K339L154j3447p79J638l852
9637B0153Q59N426J50j587J0484j155j0177J278p085p993K5914J0663j5031m819
$$ plain form
9736 -6175 -1987 5678 6413 11753 11637 10390 15271 17006 7808 3633 5007 9171 15130 7570 2761
9721 2761 18631 22241 24046 36353 27465 16246 21692 12965 16876 11144 -1112 -5070 -1755 17193
9707 17193 22135 20219 29511 41496 29561 12919 9420 19340 8703 -519 -6763 -8919 -9072 -19201
9693 -19201 -8791 5585 14540 11330 -4326 6592 13897 14077 22569 25486 22469 21227 20639 15758
9679 15758 3480 -72 4529 19916 24359 15333 1893 5160 7953 4606 9734 15756 8257 14442
9665 14442 19705 30451 25932 22014 25129 39466 38631 49447 47869 41701 52928 53900 61186 54304
9651 54304 49398 38331 24800 25595 27069 37880 30833 31100 33439 36593 23146 22367 24005 20153
9637 20153 21012 26438 26588 25001 35485 34330 24153 25431 18346 10353 36267 46930 31899 27080
9623B7080o120K537r75j5137r224J67J6594K3257N288l142J6452m125j6913r367
9609B6372R242J4191L560L931k600j2687K604J0779K0620K8797K6574Q262j841
9596A37804p618j1783k7380l0525m881o556n356Q613K136o009j0561j1129j2811
9583A3944J5454J0617J11L26r612l768Q787m770j0437k913M264Q529M060k331
9569C2261j628P377r474j5285M939J2690Q557L886l755m79n549J230J7551K2018
9555G4339K3207K4108R272L773j0156l3823j4029r81j4034n369n106k807Q511
9542E6905K92r495q232r109O541j0697q762M098Q674J060j731N59m256J4891L630
9527D4368j167P517m844j2641n872l318J1178J0928m325o817N205L730j3775k779
$$ plain form
9623 27080 20960 23497 22522 7385 -1839 -1672 14922 38179 43467 40325 56777 52652 35739 26372
9609 26372 35614 49805 53365 57296 54696 42009 44613 55392 76012 104809 131383 139645 137804
9596 137804 130186 118403 91023 60498 55617 49061 43705 52318 54454 48445 37884 26755 13944
9583 13944 29398 40015 40126 40452 30840 27072 35859 31089 20652 17739 22003 30532 34592 32261
9569 32261 30633 38010 28536 13251 18190 30880 39437 43323 39568 39089 33540 34770 52321 74339
9555 74339 97546 121654 130926 134699 124543 90720 76691 75710 61676 56307 51201 48394 56905
9542 56905 57197 47702 39470 30361 36902 26205 17443 21541 30215 31275 29544 30103 25847 40738 44368
9527 44368 43201 50718 45874 33233 27361 24043 35221 46149 41824 35007 40212 43942 30167 27388
9513B7388L779J811J5334P922m125j0660j3782r995j5012J7438J3954J279l188
9500C2143j8877l199J1730J0472n605L619R887m680n78J1003j155j0272R67m826
9486C0629M063j82N947J9420m247j5454n507Q346L439J0029K301L168O765M329
9472G3046Q934J301p402R713J7158K9707O3124P0758P3272Q5469P2362M1251N316
9459E44009k9377m4827o6044p3307m0683n0628l2948j6888j5754j2664p630j5530
9447A37729j6609k1466l1067J098l176m492N559j1973j0404m033Q530P13J8556
9434F8965o575k2514n506N46N656J0267m644j6748j0270J8605J3996q445j4046
9421B9287q984O08Q429L780J627j4532j2510L109Q698J0657p722j0967o280k265
$$ plain form
9513 27388 31167 32978 48312 56234 52109 41449 27667 17672 2660 20098 34052 35331 32143
9500 32143 13266 10067 21797 32269 26664 30283 40170 35490 34912 45915 44760 34488 35455 30629
9486 30629 34692 34510 40457 59877 55630 40176 34669 43015 46454 56483 58784 61952 68717 73046
9472 73046 81980 83281 75879 85592 102750 132457 195581 266339 339611 425080 497442 538693 544009
9459 544009 514632 469805 403761 330454 289771 239143 206195 189307 173553 160889 153259 137729
9447 137729 121120 99654 68587 69685 66509 62017 67576 55603 45199 41166 49696 50409 68965
9434 68965 62390 39876 34370 34916 40572 50839 46195 29447 19177 37782 51778 43333 29287
9421 29287 20303 20911 29340 33120 34747 20215 7705 10814 19512 30169 22447 11480 5200 2935
9407B935Q408Q339L268L761M853j1808J1403p91j0512p092J965r491L168L941
9393A2347P05J2030P852j2998j9089k89J4090P044k307j6809P771Q038r411M53
9379I427J527N379P309j394n96j075q896J923J5019k293j5089r488J1412J238
9365A4403o323o419r404Q105J47M758k857k125K606q79J606m274j2560n654J4571
9350d299K1067J107M046k336O896P64N996r372n021M4k16p326K419R846j0421
9335A3194Q10M927m716R203p956R214L014j8928j6801r556J3451R849p155o468
9321g918J4676J62J1742J105L568N283j097r428m472j1191j8495J1301K555J947
9307b62O363P33O837j3396j8907R961K177q088L820L662J6204r23q216j3104q242
$$ plain form
9407 2935 11343 19682 22950 26711 31564 19756 31159 30368 19856 12764 14729 5238 8406 12347
9393 12347 13052 25082 32934 19936 847 558 14648 21692 19385 2576 10347 18385 8974 9427
9379 9427 10954 16333 23642 22248 21652 20577 11681 13604 28623 26330 11241 1753 13165 14403
9365 14403 8080 1661 -7743 362 509 5267 2410 285 2891 2012 3618 -656 -13216 -18870 -4299
9350 -4299 16768 17875 21921 19585 26481 27245 33241 23869 18848 18892 18676 11350 13769 23615 13194
9335 13194 14004 18931 14215 23418 15462 24676 27690 8762 -8039 -17595 -4144 5705 -1450 -7918
9321 -7918 6758 6920 18662 19767 23335 28618 27521 18093 13621 2430 -16065 -4764 -2209 -262
9307 -262 6101 6834 13671 275 -18632 -8671 -6494 -14582 -10762 -7100 9104 8181 -35 -13139 -21381
9292b1381N238J6174J2994j3207J853N653R204P532q680j2935p170p560K942P269
9278b074J3837N820j0170k055J4325L200K529m476L39j0445p249J5005m513n017
9264I056k090o21J508q195p137Q005J973K91O412p496j283P516J135O643p037
9249H680j0600l100l375Q650K804J937l062L583J9574M359l597l485J0509r283
9235B3594n205J555m942J904k778k216N360L287L285q961o146J2734o55o567J201
9220A5450k6297j1244J3208n16k32J408K30L106P537P278J093Q592j3979J753
9206G387N283M888K074o068j2244r17J828l913k772m260L11J6660J5848q543n852
9191I710J3192O773j3031L044o325R820J680r218j1438J0470J439q90j877J001
$$ plain form
9292 -21381 -16143 31 13025 -182 1671 7324 16528 24060 15380 2445 -4725 -12285 -9343 -2074
9278 -2074 11763 17583 7413 5358 19683 22883 25412 20936 21275 10830 3581 18586 14073 9056
9264 9056 6966 6345 7853 -342 -7479 526 2499 2790 9202 1706 423 7939 9074 15717 8680
9249 8680 -1920 -5020 -8395 255 3059 4996 1934 5517 25091 29450 25853 22368 32877 23594
9235 23594 18389 19944 15002 16906 14128 11912 17272 20559 23844 14883 8737 21471 20816 14249 15450
9220 15450 -10847 -22091 -8883 -9399 -9631 -8223 -7993 -4887 2650 9928 11021 19613 5634 7387
9206 7387 12670 17558 19632 13564 1320 403 2231 -1682 -4454 -8714 -8403 8257 24105 15562 9710
9191 9710 22902 29675 16644 19688 13363 23183 24863 15645 4207 14677 16116 15226 13349 14350
9177A4350n399j0643M892P037M093O829P351J2347L137N991L726n641r410p258
9163C1402l538p67j3134K982K1696M236j3677p126O570Q499o973J859Jn476J275
9148B7829L117Q129M842k958j1030M873K201j747Q10n922R086J940N796r878k0243
9133A6845N56N391j949N38R094N244J1346p676m085J077J1437J5544j987P908
9119F9283J299m765j1259j4668j3040N510L846r20m060J3719m323P216R466n066
9105E2238L734j1549K019J0649k399J791k807m047P780K0131R682m673j0157l311
9091F9081L633Q833j3162j9702N544J7417J818r263L977J3989J6770R077J3417
9078A21429K0952K1303K7242N4359P7391O0575O2196M9679j3206n0424m3322l1004
$$ plain form
9177 14350 8951 -1692 3200 10237 14330 21159 28510 40857 43994 49985 53711 48070 38660 31402
9163 31402 27864 27097 13963 16945 38641 42877 29200 22074 28644 37143 30170 32029 32030 26554 27829
9148 27829 30946 39075 43917 40959 29929 34802 37003 35256 36066 30144 39230 41170 46966 37088 16845
9133 16845 17401 22792 20843 21381 30475 35719 47065 39389 35304 36381 47818 63362 61375 69283
9119 69283 70582 65817 54558 39890 26850 32360 36206 35286 31226 44945 40622 47838 57304 52238
9105 52238 55972 44423 46442 57091 54692 56483 53676 49629 57409 77540 87222 82549 72392 69081
9091 69081 72714 81547 68385 48683 54227 71644 73462 64199 68176 82165 98935 108012 121429
9078 121429 142381 163684 190926 245285 322676 383251 445447 495126 481920 431496 388174 357170
9066C57170Q649M793M175O511K3814M8276N7860Q6534J09905J62090K05448K93277
9054A368502M12694N29753O08067N83339M21440J39332j89189m44361n29931m94920
9044B404726m02563l08793k36005j95547j49863j20840r0270o4239o7376o3746
9034G05484l4402j6307k3253n615j2369k6081l1968k2017l4813k2444r389k3395
9022D43431j6512j3641q761j9351j3531j2986l730j1877R858O666j7063j7663
9010C24840J294J1603N130P111P298m262K81J8312J3483R381N554k197j548J2594
8996D08874M1692P2084J20372K00015K93548L35541K76010J58153n9438k41464
8986A605387l18777k65486j95887j26530r8356n3584l3494k6467l4007j7376l3581
$$ plain form
9066 357170 365819 370612 374787 381298 405112 453388 511248 597782 707687 869777 1075225 1368502
9054 1368502 1781196 2310949 2919016 3502355 3923795 4063127 3873938 3429577 2899646 2404726
9044 2404726 2002163 1693370 1457365 1261818 1111955 991115 900845 836606 769230 705484
9034 705484 671082 654775 631522 625907 613538 587457 555489 533472 498659 476215 466826 443431
9022 443431 426919 413278 404517 385166 371635 358649 354919 343042 352900 359566 342503 324840
9010 324840 326134 337737 342867 349978 357276 353014 353295 371607 385090 394471 400025 397828 396280 408874
8996 408874 450566 522650 643022 843037 1136585 1472126 1748136 1906289 1846851 1605387
8986 1605387 1286610 1021124 825237 698707 600351 546767 513273 486806 452799 435423 401842
8975D01842k6671j4514k6507k333P9k0083j5173J090j0853k814q052j4537m427
8962B57047J1149l885j0634M459M138J5781J283j1515k592j595l171J0992O763
8949B78220P779M86n688K2671R084J2721M2787M3513K9609L3823L5545O0262Q8083
8936F58895J61764K40879L81830N17386N45582L80864J35489k33859m59639m30782
8926A898409l48075k82473k31620j60978j13504p8724m2967k0955j1962k2941
8916E84210k3410j6584j7290n0603k8621j2853k2030j2734j7248k4246j1241j3386
8904C33964j4128r162P45P046j214L975Q87k1168o735o671p946J3247J8565m820
8890C06585l671k4162j9169L072K002j0161j4586k0116j5977p645J103j116j6226
$$ plain form
8975 401842 375171 360657 334150 331817 331896 311813 296640 297730 286877 284063 276011 261474 257047
8962 257047 268196 264311 253677 258136 262274 278055 279338 267823 265231 263636 260465 271457 278220
8949 278220 285999 286485 280797 303468 312552 325273 368060 411573 441182 475005 510550 570812 658895
8936 658895 820659 1061538 1443368 1960754 2506336 2887200 3022689 2788830 2329191 1898409
8926 1898409 1550334 1267861 1036241 875263 761759 683035 640068 619113 607151 584210
8916 584210 560800 544216 526926 476323 447702 434849 412819 400085 382837 358591 347350 333964
8904 333964 319836 310674 311419 318465 317251 321226 322113 300945 294210 287539 279593 292840 311405 306585
8890 306585 302914 278752 259583 262655 264657 254496 239910 219794 203817 196172 197275 196159 179933
8877A79933o832o493k0069R414K1895n065p532n551o066p718M712M785p970J609
8863A49052R585j0027j0809j418M108J368j4661O155O719j7889q816N800J6856
8850A36023J0751n934j4797p259J0035M359M65M232K715j3406K749m605j026P256
8836A31558R935R49j2545j8942Q650J2292K946Q522K854J3681m144j0995o978
8823A37783q835l827n490O892N009J3005j2483j4266m575j9873p644N31J0598
8810I6825O711m956r227J389j7886j4510N699N201J8791n992q817O940n441n868
8796F8859J642K3470J6045Q567m340m197p197j4874l874P532N440K047j5163j6698
8782F7259J70M154K351k948p34j1439P86N576j0502M659J1178P100q048n064m354
$$ plain form
8877 179933 173101 166608 146539 155953 177848 172783 165251 159700 153634 145916 150628 155413 147443 149052
8863 149052 158637 148610 137801 136383 140491 141859 127198 133353 140072 122183 113367 119167 136023
8850 136023 146774 140840 126043 118784 128819 133178 133643 137875 140590 127184 129933 125328 124302 131558
8836 131558 141493 142442 129897 110955 119605 131897 134843 143365 146219 159900 155756 144761 137783
8823 137783 128948 125121 119631 126523 131532 144537 132054 117788 113213 93340 85696 86227 96825
8810 96825 103536 98580 89353 90742 72856 58346 64045 69246 88037 82045 73228 80168 74727 68859
8796 68859 70501 93971 110016 118583 114243 110046 102849 87975 84101 91633 97073 99120 83957 67259
8782 67259 67429 71583 73934 70986 70252 58813 59599 65175 54673 59332 70510 77610 69562 64498 60144
8767F0144j545K883k464q035K3677r119N001P788q02M342j265J5984J1830J3269
8753A21688J6815j2410k0627m088R459N475L481J199J538j4149k605k701j02n970
8739I7003j0763r520J756j3081p231J817J5864p960j1838k200J6801J3541R457
8726I3646k078M216J4607J8648K5595J2755J4100J9276N593k1572l0596j1404
8714A42786M213R457J1080n444J6139K5725J0246j0720k1329k0112l7989k3716
8702A00336L266K1820M947k239m059p387Q406L092L352m646M325n387m65k1261
8688A04100k44j553K025j079P524l391P026J0358q931q307r7J4704j1338J0319
8674A21116J3858J508o519M439P191K137J7195J2888J2135Q175M084J2935R297
$$ plain form
8767 60144 58599 61482 59018 50983 74660 65541 70542 78330 77528 81870 80605 96589 108419 121688
8753 121688 138503 126093 105466 101378 110837 116312 119793 120992 122530 108381 105776 103075 102973 97003
8739 97003 86240 76720 78476 65395 58164 59981 75845 67885 56047 53847 70648 84189 93646
8726 93646 91568 95784 110391 129039 154634 167389 181489 200765 206358 184786 154190 142786
8714 142786 146999 156456 167536 162092 178231 203956 214202 203482 182153 162041 124052 100336
8702 100336 103602 125422 130369 128130 124071 116684 125090 128182 131534 126888 131213 125826 125361 104100
8688 104100 103856 102303 104328 103249 110773 107382 114408 124766 115835 107528 107431 122135 110797 121116
8674 121116 134974 136482 129963 134402 141593 143730 160925 173813 185948 194123 198207 211142 220439
8661B20439q928k088N76O123Q164Q760m010p462q6j811n599m817Q775P149j2888
8646B12297j284m45n327M870L3058L3656K3214J3201K1892J0775l3711m8976k3608
8633B39612k9119l3722l2548j9605l084J1712l683j0481j441R708q552j293Q374
8620A25878J9608J5826n935j2955k915n531R247j33r231R255K9337J7506K8062
8607B18019P5791P5615O3849N3285K296l2206m7865m5254l9616l0029q946N145
8595B90084k716k2433n711k9215k7630j7275j3578r490l546J976J2567n430l431
8582A64172k3161p772j107j3971p033J155O050p29K522j7814k1122J34J1031m191
8568H8164q388K203J0447Q433L0094J2400K216J397P267K3370J6199j6598p714
$$ plain form
8661 220439 211511 209423 209999 216122 224286 233046 229036 221574 221488 219677 214078 209261 218036 225185 212297
8646 212297 211013 210568 205241 210111 243169 276825 300039 313240 335132 345907 312196 263220 239612
8633 239612 210493 176771 144223 124618 121534 133246 129563 119082 117641 127349 118797 117504 125878
8620 125878 145486 161312 155377 142422 139507 133976 143223 143090 133859 143114 172451 189957 218019
8607 218019 293810 369425 433274 486559 488855 456649 408784 363530 323914 293885 284939 290084
8595 290084 287368 264935 259224 230009 202379 185104 171526 162036 158490 160466 173033 167603 164172
8582 164172 141011 133239 132132 118161 111128 112283 118333 117604 120126 102312 81190 81324 92355 88164
8568 88164 79776 81979 92426 100859 130953 143353 145569 146966 154233 177603 193802 177204 169490
8555A69490k1219j3838j0596l483N161R027M500r419j1519n962j693p361J36L134
8541A06358K558J4323n60r466j064Q43o814m072q142K699L663j9476r174Q34k15
8526G2295k134q911l222r199j0790O515J5947q026r271O483j2258r456k754J003
8512B6222L342R749J5252J0365l23n372o945k7849k776L484n435M537m479M212
8498B3984J6965l659M144K921K712j3167k629l646M627J8530J63m875R357R21
8484E6348o564o801R053M213m325J905j9830l604N752J1674R932j6417Q84J1653
8470E3873J4464o01m094R604l258J816Q645M717K3223J6321J9710N6163M5934
8457B46517L6479L5114P09k1583j8922j9854j0592n234r569l3538l3595j7191
$$ plain form
8555 169490 148271 134433 123837 120354 125515 134542 139042 129623 118104 112142 110449 103088 103224 106358
8541 106358 108916 123239 122679 113213 112149 112992 106178 102106 93964 96663 100326 80850 71676 72510 72295
8526 72295 70161 61250 58028 48829 38039 44554 60501 52475 43204 49687 37429 27973 25219 26222
8512 26222 29564 39313 54565 64930 64607 59235 52290 24441 21665 25149 19714 24251 19772 23984
8498 23984 40949 37290 41434 44355 47067 33900 31271 27625 32252 50782 50945 46070 55427 56348
8484 56348 49784 42983 52036 56249 51924 53829 33999 30395 36147 47821 57753 41336 42220 53873
8470 53873 68337 67736 63642 73246 69988 71804 80449 85166 108389 124710 144420 200583 246517
8457 246517 282996 318110 318819 297236 278314 258460 247868 242634 233065 199527 165932 148741
8445A48741k0303j7756J433j6743j4611o915M805J925o453M994m598N721j5577
8432F4663j1573R408P434J5568J3264O950o920n222q28l04r184j4253k9269r314
8418C0420R082N031j6896K408J0338R798N913j4307j4626P869N896L117O621j385
8404D9279j7534j46L045j4370M88K1701l084j4693j509J3018J3169j90j0535l235
8390C5404j52o104M925K280Q82j6909m280R52M50J803j1267K850L450K330L36
8375A6950q461r615p460J829J3057J5093L348K031M712n065r279o37j551M715
8361A9667K393K677k22o112Q88P33M513j612N019q209j2984J0131r447q556R326
8346H205j78l590O804j979j3782J532M421R507J422j4100J2250K2002m044o789
$$ plain form
8445 148741 128438 110682 112115 95372 80761 73846 78651 80576 74123 79117 74519 80240 64663
8432 64663 53090 62498 69932 85500 98764 105714 98794 93572 92744 92440 83256 69003 39734 30420
8418 30420 39502 44533 27637 30045 40383 50181 56094 41787 27161 35030 40926 44043 50664 49279
8404 49279 31745 31599 34644 20274 20762 42463 39379 24686 23177 36195 49364 49174 38639 35404
8390 35404 35252 29148 34073 36353 37235 20326 16046 16998 17448 19251 7984 10834 14284 16614 16950
8375 16950 8489 -1126 -8586 -6757 6300 21393 24741 26772 31484 26419 17140 16503 14952 19667
8361 19667 22060 24737 24515 18403 19291 20024 24537 22925 27944 19735 6751 16882 7435 -1121 8205
8346 8205 8027 4437 11241 9262 -4520 -2988 1433 10940 12362 -1738 10512 32514 28470 21681
8332B1681L980l490J745p73j2254m78M187k505q507Q782Q07j160m427l323j1493
8317g228J3340q16m666Q241o356p9m764J291J3575l538j9004J251m062r52J0175
8302c592K2727R034j0657J0144M657p342L36n726Q622M475r448o562m282q063
8288D323J5073J0703m828p777N593L164j116O920j6078j5166R873r249j21J3438
8274A4752m343m491J063o746Q663O243j383L750K692j53P207q79K01Q820O185
8259D1581N56K370n482m801l177L288Q946O354n083j2229o052L428L628O856N937
8244D6120j661O231O679L5774L8262N6531O5365L7894J1031k0235n7117n4661
8232A70213l2204k4947k6746j0853r530k045p864j6288j2174Q17P049N40R610
$$ plain form
8332 21681 25661 22171 23916 23143 10889 10411 14598 12093 3586 12368 13175 12015 7588 4265 -7228
8317 -7228 6112 5296 630 8871 2515 2436 -2328 -1037 12538 9000 -10004 -8753 -12815 -13767 -3592
8302 -3592 19135 28169 17512 27656 32313 24971 25307 19581 28203 32678 23230 16668 12386 4323
8288 4323 19396 30099 25271 17494 23087 26251 25135 32055 15977 811 10684 1435 1314 14752
8274 14752 10409 5918 6981 235 8898 15141 13758 17508 20200 20047 27254 26375 26576 35396 41581
8259 41581 42137 44507 39025 34224 31047 34335 43281 49635 44552 32323 26271 29699 33327 40183 46120
8244 46120 44459 50690 57369 93143 131405 187936 253301 291195 302226 281991 224874 170213
8232 170213 138009 113062 86316 75463 65933 63888 56024 39736 27562 28379 35428 35968 45578
8219D5578J3662N92p612Q193M259r590n480j244J982J975j1613Q77J6051O05r554
8204D8681k8890n522N311R43L109j580O038R777L647q190M822J9445n468r810
8190D2313j6721p56O842K080M448j003n993o413J3190K810o164m995K667L7063
8176F9368L3098L1491J4357O522r776k7637k6702j9856k1578j4588p63J872n493
8163C0315O505M446p865j9448l5J4865n308q915j473M026q337J994p173q082R568
8148E083J6374j880N704m019k172J137J3211K868j0861Q273p85j3303r500k736
8134G394J092N571j970R66K048j119K4186L172k830M471j7386j2024J4020j538
8120B6053l336P062K4375j1103j3405J1490K664r568j0055q317M32J4357J0971
$$ plain form
8219 45578 59240 59832 52220 60413 64672 55082 49602 48358 50340 52315 40702 41579 57630 58235 48681
8204 48681 19791 14269 19580 20523 23632 22052 28090 37867 41514 33324 38146 57591 52123 42313
8190 42313 25592 24836 31678 33758 38206 37203 31210 24797 37987 40797 34633 29638 32305 69368
8176 69368 102466 133957 148314 154836 145060 117423 90721 70865 49287 34699 33936 35808 30315
8163 30315 36820 41266 33401 13953 13918 28783 23475 14560 13087 17113 8776 10770 3597 -4485 5083
8148 5083 21457 19577 25281 21262 19090 20227 33438 36306 25445 33718 32933 19630 10130 7394
8134 7394 8486 14057 12087 13053 15101 13982 38168 41340 38510 42981 25595 13571 27591 26053
8120 26053 22717 29779 54154 43051 29646 41136 43800 34232 24177 15860 16292 30649 41620
8107D1620m486j4660K159O744K385j369l373L200K057q640N246M844q96o179l590
8092B5062j3427l33Q204R157P555j3880j282J0443k949j0358o70n62J1650J1295
8078C9905N940k027q015n702q43o817P24J566J3458j625j0277k2442l980J6254
8064A6119J6365M120l615L16O134L852N138R442k000j1823k4633K835J2766R694
8050D4710m257n088L114N039m697L180L297p553j1431p417J957P359j316M772
8036C1669J998j2167L286j1327r522J6564J5684k046P849p902j2184N22O698J4142
8022D3264J0692k143J342p591r24J3301j265q715K982n43j0044j865J1828J6536
8008F6855j0141j0801O40k42j3501j7908j58M405L471r957k053K2197j936l381
$$ plain form
8107 41620 37134 22474 24633 31377 33762 32393 29020 32220 34277 25637 30883 35727 34831 28652 25062
8092 25062 11635 11302 19506 28663 36218 22338 21056 31499 28550 18192 17522 16960 28610 39905
8078 39905 45845 43818 35803 30101 29258 22441 23165 24731 38189 36564 26287 3845 -135 16119
8064 16119 32484 36604 32989 33305 39439 43291 48429 57871 55871 44048 19415 22250 35016 44710
8050 44710 40453 35365 38479 43518 38821 42001 45298 37745 26314 18897 20854 28213 26897 31669
8036 31669 33667 21500 24786 13459 3937 20501 36185 34139 41988 34086 21902 22424 29122 43264
8022 43264 53956 51813 53155 45564 44640 57941 56676 47961 50943 50400 40356 38491 50319 66855
8008 66855 56714 45913 46553 46311 32810 14902 14744 19149 22620 12663 10610 32807 30871 27490
7994B7490l128m834K836J535r303l369m018Q166J5386O854n829l839N812M526
7980C8285l663j0887J405j405M448j248J182o13J593r3L519p098j0845J299J2352
7965B8231P766r542r713l825K215J1028o473J013n894Q37j7143n57J489J77J030
7950F39o374R226J444J2463j717o957q346j440q20R88m790J1384Q949J363J6440
7935C2452J3953j660r156j0874j0031L034M311n226o564o467p989J004L476L904
7921D167k978J319o362R704P699n348r107m3k0921j0367o043J5025P332J1211
7907d712J9807J0322o013n743j971m514P971J0144J056k66p303j4337j2956l383
7893a1898O068j1853J3884N159l686o354j3238o083K1805L939k327N838O300o627
$$ plain form
7994 27490 24362 19528 22364 23899 14596 11227 7209 15375 30761 37615 31786 27947 33759 38285
7980 38285 34622 23735 25140 23735 28183 26935 28117 27504 29097 29004 32523 25425 14580 15879 28231
7965 28231 35997 26455 16742 12917 15132 26160 19687 20700 14806 15643 -1500 -2057 -568 -391 639
7950 639 -5735 3491 4935 17398 15681 8724 378 -1062 -1882 -894 -5684 5700 14649 16012 32452
7935 32452 46405 44745 35589 24715 14684 17718 22029 16803 10239 3772 -4217 -3213 263 4167
7921 4167 1189 2508 -3854 5850 13549 8201 -906 -949 -21870 -32237 -38280 -23255 -15923 -4712
7907 -4712 15095 25417 19404 13661 11690 7176 15147 25291 26347 26081 18778 4441 -8515 -11898
7893 -11898 -5830 -17683 -3799 1360 -2326 -8680 -21918 -28001 -6196 -2257 -4584 1254 7554 927
7879I27m542k725J790R39J4689n779o620R835J0187l835l988O824r202j1505o29
7864c634K1088m874j0733j4458L629J555J6061J2796P451J840m845l800M149m578
7850B1647j2716q564k196J0969o294o104n777l042R407M154R193L837q439L603
7836I678n466m599r327j0982K914J5868Q710J163P461J188m242o437J4280K642
7822B2851k504o922j3825J393j1175j5862J2496Q266J980J105L425m25q224o835
7808a4256j477k77o47j238P928L861M948j1905q944p348N659J5185K446N935M328
7793D198o907j3331j7145l550L408J4225J580m691J2829M735j1176J7169N482
7780F826j021j7427j3195M194J0981p32j0767L738K476J461J2368P571p161j2299
$$ plain form
7879 927 -3615 -6340 -4550 -3611 11078 5299 -1321 8514 18701 14866 10878 17702 8500 -3005 -3634
7864 -3634 17454 12580 1847 -12611 -8982 -7427 8634 21430 28881 30721 25876 22076 26225 21647
7850 21647 8931 367 -1829 9140 2846 -3258 -9035 -12077 -2670 1484 10677 14514 6075 9678
7836 9678 4212 -387 -9714 -20696 -17782 -1914 6796 7959 15420 16608 12366 5929 20209 22851
7822 22851 20347 13425 -400 993 -10182 -26044 -13548 -5282 -3302 -2197 1228 803 -7421 -14256
7808 -14256 -15733 -16010 -16657 -17895 -9967 -6106 -1158 -13063 -22007 -29355 -23696 -8511 -6065 -130 4198
7793 4198 -2709 -16040 -33185 -36735 -33327 -19102 -17522 -22213 -9384 -4649 -15825 1344 6826
7780 6826 5805 -11622 -24817 -20623 -9642 -10374 -21141 -17403 -14927 -13466 -1098 6473 -688 -12987
7766a2987m272R842M393j1319q92J2159J3332K550o752j3148l732l371o829J4999
7752f027j663q500r250K291j67N637J3748k406k214K920j4734L995M266l945K719
7737a3330m173O719Q903m142J154j313Mj106J4394j005L225J2289j4111k0284
7723a2776p834R668j528k256j13J0180J5223O641m184o922L201O488O38j0412
7709F014j7081N41N522J7219L32j2847o658j362o824P563J199o776o986O94R381
7694a0069J1358j676k026j8981L26j541P784k176j0954l724m703N653m580J3785
7680b1524J8507L523m936n645L665J322p01j5909j695m872k69j1957l27Q352J2408
7665b0058N427P185l473L25P264k645m264o004Q457J923j1079J0406O872J468
$$ plain form
7766 -12987 -17259 -7417 -3024 -14343 -15235 -3076 10256 12806 6054 -7094 -10826 -14197 -21026 -6027
7752 -6027 -7690 -16190 -25440 -23149 -23316 -17679 -3931 -6337 -8551 -5631 -20365 -16370 -12104 -16049 -13330
7737 -13330 -17503 -10784 -1881 -6023 -4869 -6182 -6178 -7284 7110 6105 9330 21619 7508 -12776
7723 -12776 -20610 -10942 -12470 -14726 -14839 -4659 10564 17205 13021 6099 9300 15788 16426 6014
7709 6014 -11067 -10526 -5004 12215 12547 -300 -6958 -8320 -15144 -7581 -6382 -13158 -20144 -19450 -10069
7694 -10069 1289 -387 -2413 -21394 -21068 -22609 -14825 -17001 -27955 -31679 -36382 -30729 -35309 -21524
7680 -21524 -3017 506 -4430 -10075 -6410 -5088 -5789 -21698 -23393 -28265 -28534 -40491 -40818 -32466 -20058
7665 -20058 -14631 -7446 -10919 -10594 -3330 -5975 -10239 -16243 -7786 -5863 -16942 -6536 336 1804
7651A804j2011P999o720r614r492N784J846J02J5021O244n169n315o66J566k145
7636a0766j4225j2679K0476o083j137P209J1551q725r020j0679J4874Q086l818
7623a4936j621J1444J1123J952l001o877k373p17R074J1368p614j1364p187Q119
7609b610j345l731j0695j2663j966o852K1236m680M324M36J5324M703k951m076
7595e546N664k244M194k65j179j048k706L072k072O952m59p81j0790r414l182
7580a9804M73O717L593O937k374j099J518J908o826j7011p153J8915J0203m106
7566h109J531J2174o060j4590j1470m213Q025O707L485l093o156n362j1667J3602
7552b5196J0036J1185r837L755R379J0356K549j83k69K0446k965j9919j9090j0955
$$ plain form
7651 1804 -10207 -2208 -8928 -18542 -28034 -22250 -20404 -20302 -5281 963 -4206 -9521 -10187 -8621 -10766
7636 -10766 -24991 -37670 -17194 -23277 -24414 -17205 -5654 -14379 -23399 -34078 -19204 -11118 -14936
7623 -14936 -16557 -5113 6010 7962 4961 -1916 -4289 -5006 4068 15436 7822 -3542 -10729 -2610
7609 -2610 -3955 -7686 -18381 -31044 -33010 -39862 -18626 -23306 -18982 -18546 -3222 1481 -1470 -5546
7595 -5546 118 -2126 2068 1803 624 -424 -3130 -58 -2130 4822 4363 3582 -7208 -16622 -19804
7580 -19804 -19331 -12614 -9021 -2084 -4458 -5557 -4039 -2131 -8957 -25968 -33121 -14206 -4003 -8109
7566 -8109 -6578 5596 -464 -15054 -26524 -30737 -22712 -16005 -12520 -15613 -21769 -27131 -38798 -25196
7552 -25196 -15160 -3975 -13812 -10057 -678 9678 12227 12044 11775 32221 29256 9337 -9753 -20708
7538b0708M382j0971r100J446R923L3k623O405J0088k90r448q318o696q532J0890
7523c3519J8200P804L411O984j1680j1438l405K052K198M607p7M171N677p445
7509a2460m22R50O873K307p666j2535L400P05L897j4152r359N968J5368O696k221
7494a2651p236J026L333J1146m79r491m32J1058l365j0393n772K872j0443k261
7480c3088J4253j003Q925l049q069o59P697n74P708m493P172m090k163N646q099
7465a3886r024n21L07J470q172J4807K1941k359J1240r313j1512q202J3156j2160
7451a2228o456Q010K803m09K486l402j4820j163O888n550P787O403k0664o317
7437c6632J9445Q828N427j1512j2680L705J535J3816R248n311j859M577l915r423
$$ plain form
7538 -20708 -16326 -27297 -36397 -34951 -25028 -24995 -27618 -21213 -11125 -11415 -20863 -29181 -35877 -44409 -33519
7523 -33519 -15319 -7515 -4104 2880 -8800 -20238 -23643 -21591 -19393 -14786 -14863 -10692 -5015 -12460
7509 -12460 -12882 -11932 -5059 -2752 -10418 -22953 -19553 -18848 -14951 -29103 -38462 -32494 -17126 -10430 -12651
7494 -12651 -19887 -18861 -15528 -4382 -4861 -14352 -14784 -3726 -7091 -17484 -23256 -20384 -30827 -33088
7480 -33088 -18835 -19838 -10913 -13962 -22031 -22690 -14993 -15567 -7859 -12352 -5180 -9270 -11433 -5787 -13886
7465 -13886 -22910 -23431 -23124 -21654 -29826 -15019 6922 4563 15803 6490 -5022 -13224 -68 -12228
7451 -12228 -18684 -10674 -7871 -8280 -5794 -9196 -24016 -25179 -18291 -23841 -16054 -9651 -30315 -36632
7437 -36632 -17187 -8359 -2932 -14444 -27124 -23419 -21884 -8068 1180 -4131 -5990 -1413 -5328 -14751
7423a4751o7r57J2556P751M712K268r481j780J182r478q967k126J3622N139Q112
7408G735L861j2989j0743J185k613J4355m851j5570k1215N06J8382O70N671J3931
7394a685p644j5148K801P661N732o45n767l753R156L359p358j1959j199J6938
7380i511j270k751k452N048n038q418K718l576j724J2101J9368l628N42J1475
7366A2884p71k629J1086p337j3224O110j241n261N137q366j6671M163j086q96
7352a8102k271j0552L198o659N540J087J5133J7860k871L72R097P95q746j2509
7338h628r22L674J6988n371j3706o708N29n441p116M882R67k012l545n579K290
7323b9698J476M215K3086J0922p588p877j0371q208n301J3873J408m233K562K204
$$ plain form
7423 -14751 -14818 -15775 -3219 4532 9244 11512 2031 251 1433 -8045 -17012 -19138 -5516 -377 7735
7408 7735 11596 -1393 -12136 -10951 -13564 791 -4060 -19630 -40845 -40339 -21957 -21287 -15616 -1685
7394 -1685 -9329 -24477 -21676 -14015 -8283 -8928 -14695 -18448 -9292 -5933 -13291 -25250 -26449 -9511
7380 -9511 -10781 -13532 -15984 -10936 -15974 -24392 -21674 -25250 -26974 -14873 4495 867 1409 12884
7366 12884 12113 9484 20570 13233 9 6119 4878 -383 4754 -3612 -20283 -16120 -17206 -18102
7352 -18102 -20373 -30925 -27727 -34386 -28846 -27759 -12626 5234 2363 2735 11832 12627 3881 -8628
7338 -8628 -9550 -5876 11112 5741 -7965 -14673 -14144 -19585 -26701 -21819 -20852 -22864 -26409 -31988 -29698
7323 -29698 -28222 -24007 -921 10001 2413 -5464 -15835 -24043 -29344 -15471 -14063 -18296 -15734 -13530
7309a3530n957m233P337l845m533n663K140Q842K2303P304j4340r897J240P334
7295e498N316q02n694O684j0342R026M878M421l84j7316N045o573j1322q10L251
7280b0120p28J259O979P59J0465p028J101Q700o875k446q889p858M756m131J586
7265b2470R834n236j6637K579P297N823J0612O038n765P508K724j4624L383J159
7251g775J871M067P483j3985K491o219k517m739r688j1643R013J3805M301p190
7237b0725J3992N828M90o725k916K336n095R661j784q772J807J6047l041k504
7223a401j523n463J8058l235j0966m069J560Q122J0377K938n973j8231r283P843
7209a1246J1645J7369M93j356r061r692n662j796J0316l610j2265j424j914J0926
$$ plain form
7309 -13530 -19487 -23720 -16383 -20228 -24761 -30424 -28284 -19442 2861 10165 -4175 -14072 -12832 -5498
7295 -5498 -182 -984 -6678 6 -10336 -1310 3568 7989 7605 -9711 -4666 -11239 -22561 -23371 -20120
7280 -20120 -20848 -19589 -12610 -11851 -1386 -8414 -7313 1387 -5488 -7934 -16823 -24681 -19925 -24056 -22470
7265 -22470 -12636 -17872 -34509 -31930 -24633 -18810 -8198 -2160 -7925 -417 2307 -12317 -8934 -7775
7251 -7775 -5904 -1837 5646 -8339 -5848 -12067 -14584 -19323 -29011 -40654 -31641 -17836 -13535 -20725
7237 -20725 -6733 -905 -415 -7140 -10056 -7720 -12815 -3154 -4938 -13710 -11903 4144 1103 -1401
7223 -1401 -2924 -8387 9671 6436 -4530 -8599 -7039 1083 11460 14398 8425 -9806 -19089 -11246
7209 -11246 399 17768 18261 16905 7844 -1848 -7510 -9306 1010 -2600 -14865 -16289 -18203 -7277
7195g277J5098o037j6937l601O177K58R933l22m71J3692J990j615q187p601j645
7180f545J900K302J3359M335r605K469l394o970Lj063k863k627j64J4548j039
7165D646j8766p935k972J298r20K581M181k104l573Q389J1857j3761j3532K578
7151b8033J3997R149R232N632j8234j2954Q550R384r587j1295P690l159J1934
7138g694k079l391j698m890J3302O590j9385j0243m852l743K998Q254n742m29
7124c3002k031J1105Q762j1874J283J0964P329q393P482J823j1747N647L906L463
7110e283K497J7849J2640n594q771n40o169j0937j2145m500N288J238k672Q548
7096h551M931M801j1049m752n406p100J1225l056q748N477Q993k597O814R578
$$ plain form
7195 -7277 7821 1784 -15153 -18754 -12577 -12319 -2386 -2708 -3179 10513 12503 10888 2701 -4900 -6545
7180 -6545 -4645 -2343 11016 15351 5746 8215 4821 -2149 -2146 -3209 -6072 -8699 -8863 5685 4646
7165 4646 -14120 -22055 -25027 -23729 -24649 -22068 -17887 -19991 -23564 -15175 -3318 -17079 -30611 -28033
7151 -28033 -14036 -4887 4345 9977 -8257 -21211 -12661 -3277 -12864 -24159 -16469 -19628 -7694
7138 -7694 -9773 -13164 -14862 -19752 -6450 140 -19245 -29488 -34340 -38083 -35085 -26831 -32573 -33002
7124 -33002 -35033 -23928 -15166 -27040 -25757 -14793 -7464 -15857 -8375 -6552 -18299 -12652 -8746 -5283
7110 -5283 -2786 15063 27703 22109 13338 12798 6629 -4308 -16453 -20953 -15665 -14427 -17099 -8551
7096 -8551 -3620 1181 -9868 -14620 -20026 -27126 -15901 -18957 -27705 -22228 -13235 -15832 -9018 560
7082E60J424r811j5446n5R39J0303l180j6273n884P751L980J173J2831l383l391
7067a8462k946o398j4079j323J697J2550n13M985J3010N600n838K788P456J5748
7053A4275P703Q675R25p019j4223j0420k224j167J2089j439k1264n42j1208K905
7039b2934J3811j0643m401N035J3282R359j4678r021J6019M432j1879n358L778
7026a3198N383P020P00m461l221k777n594j7301J769J3490Q821k0224j4898p572
7012e2063J6602K1200J4280j1423q791O57m87L05L241m799Q362Q143j3458j1267
6998b9498m150k080Q814n993K0291K032J251l348J4701M814r248l038j9925n780
6984c1157L785J5290k971k703J7890L370r228j2056r395J981J2878R624j131Q881
$$ plain form
7082 560 1984 -7827 -23273 -23328 -22389 -12086 -15266 -31539 -37423 -29672 -25692 -24519 -11688 -15071 -18462
7067 -18462 -21408 -27806 -41885 -43208 -41511 -28961 -29474 -24489 -11479 -5879 -11717 -8929 -1473 14275
7053 14275 21978 30653 31578 24559 10336 -84 -2308 -3475 8614 7175 -14089 -14631 -25839 -22934
7039 -22934 -9123 -19766 -24167 -19132 -5850 3509 -11169 -20190 -4171 261 -11618 -16976 -13198
7026 -13198 -7815 -795 -95 -4556 -7777 -10554 -16148 -33449 -31680 -18190 -9369 -29593 -44491 -52063
7012 -52063 -35461 -14261 19 -11404 -20195 -19538 -20025 -19720 -16479 -21278 -12916 -4773 -18231 -29498
6998 -29498 -33648 -35728 -26914 -32907 -12616 -10584 -9333 -12681 2020 6834 -2414 -5452 -25377 -31157
6984 -31157 -27372 -12082 -15053 -17756 134 3504 -5724 -17780 -27175 -25194 -12316 -2692 -3823 5058
6970E058k59j5448j6177p11l24l553j716o143O455N151K5419j0501q858j85n979
6955b7771K1369P713Q03K656r7o957l026l807r843O249J1605N144q883r050O003
6940g892Q13j0779l972O764O876M589N672n423k4804r499o82J6858J5652J2053
6926F226l369n050n813j3118m301J056o142j3854O421J6768J5312Q992K435L286
6912H849k627l521K188m398l22l847N825M899n211J5687J583k1159j5484L503
6898a4035K025N232m537J526n774n904Q293J0816R970N921p772l343m704R18Q05
6883e63R066O030N714o978j1123j0584l997P61N279J0437K786m042o926j0025
6869a4165M004K270P49N484n34J0097M629j0670m797M695J2762J555K61J149j1142
$$ plain form
6970 5058 4799 -10649 -26826 -27537 -27861 -31414 -33130 -39273 -32818 -27667 -2248 -12749 -21607 -21792 -27771
6955 -27771 -6402 1311 2114 4770 4673 -2284 -5310 -9117 -18960 -12711 -1106 4038 -4845 -13895 -7892
6940 -7892 -7079 -17858 -21830 -15066 -8190 -3601 2071 -3352 -28156 -37655 -38337 -21479 -5827 6226
6926 6226 2857 -2193 -8006 -21124 -25425 -24369 -30511 -44365 -37944 -21176 -5864 3128 5563 8849
6912 8849 6222 2701 4889 491 169 -3678 2147 7046 1835 17522 19105 -2054 -17538 -14035
6898 -14035 -12010 -6778 -11315 -9789 -15563 -21467 -13174 -2358 7612 13533 5761 2418 -2286 -1368 -563
6883 -563 8503 14533 20247 13269 2146 -8438 -12435 -11674 -6395 4042 6828 2786 -4140 -14165
6869 -14165 -10161 -7891 -7142 -1658 -2192 7905 12534 1864 -2933 1762 14524 16079 16340 17489 6347
6854F347M075l571L649N318m036J2767l737j4040j6540j1079j1123J1134J7488
6841c348J0152M901k456j2670k353J0535P745Q13n723r412K710N432K128j6908
6827h454O662P0o938j5168j182K477Q258J3614L377j3047q001R548k502J681J4355
6812D750J3041J402M76l630j3828p261o569J8844J0795m798p370J1596N520q20
6798B2148m639p138J936M693J389j0268j5769J3093P165j1110M89k559o501N16
6784f555R42k005L01j0625K019j167m89n177O579j760M695q160K238N867J3133
6769a64l117K368n102j3531Q145K209Q240j0085o281O335K319n110j219l931r280
6754b8204O949J5121R879J2876m125k1793j3838j189L61K942J0340j034J0722
$$ plain form
6854 6347 10422 6851 10500 15818 11782 24549 20812 6772 -9768 -20847 -31970 -20836 -3348
6841 -3348 6804 11705 9249 -3421 -5774 4761 12506 13319 7596 -1816 894 6326 8454 -8454
6827 -8454 -1792 -1722 -8660 -23828 -25010 -22533 -14275 -661 2716 -10331 -18332 -8784 -11286 -9605 4750
6812 4750 17791 19193 19669 16039 2211 -5050 -11619 7225 18020 13222 5852 17448 22968 22148
6798 22148 17509 10371 12307 17000 18389 8121 -7648 5445 12610 1500 1989 -570 -7071 -6555
6784 -6555 -5613 -7618 -7317 -17942 -15923 -17090 -17579 -22756 -16177 -17937 -13242 -21402 -19164 -13297 -164
6769 -164 -3281 -913 -6015 -19546 -11401 -9192 -952 -11037 -17318 -10983 -8664 -13774 -14993 -18924 -28204
6754 -28204 -21255 -6134 3745 16621 12496 -9297 -23135 -24324 -23963 -21021 -10681 -11715 -993
6741i93N110m600K90R410o665q250k326J828L800k990p150j0497P677N056k904
6726a3204P423M301J3169j1125n059J1477k556l933n357p221j3395O166O227q866
6712b1953J0636Q280j6633j1329j86P65J3199J1079n678j3106m010J8879J2424
6699B367j4257k313j744P898p468p092J2539M340p060j4245P029J4654m188R35
6685h605Q844j65p288j5693j0012Q061P949R996N461M22P50R602J3401l523j3271
6670E929Q964p419j3612Q231k120j7323j0956m586L497K636O74R263N292Q446
6656c084P585m59M976o31J104j2456j0948J0148J1114K83q844M953j693p438P427
6641B037J3741K91J202r949j0704j5932j6880k540o686R493Q177N898p099j905
$$ plain form
6741 -993 4117 -483 -193 9217 2552 -5698 -8024 -6196 -2396 -5386 -12536 -23033 -15356 -10300 -13204
6726 -13204 -5781 -1480 11689 564 -4495 6982 4426 493 -4864 -12085 -25480 -19314 -13087 -21953
6712 -21953 -11317 -3037 -19670 -30999 -31185 -30420 -17221 -6142 -11820 -24926 -28936 -10057 2367
6699 2367 -11890 -14203 -15947 -8049 -15517 -22609 -10070 -5730 -12790 -27035 -20006 -5352 -9540 -8605
6685 -8605 239 74 -7214 -22907 -32919 -24858 -16909 -6913 -1452 -1030 -280 9322 22723 19200 5929
6670 5929 14893 7474 -6138 2093 -27 -17350 -28306 -32892 -29395 -26759 -26085 -16822 -11530 -3084
6656 -3084 4501 4042 9018 8387 9491 -2965 -13913 -3765 7349 7632 -1212 3741 2048 -5390 2037
6641 2037 15778 16069 17271 7322 -3382 -19314 -36194 -38734 -45420 -35927 -27750 -21852 -28951 -30856
6627c0856J6174J4232Q54l272m064n227O961j226p306j073j930j2806l428J525
6613c1442R923J3965J1642r730j2423J051J2660L883J176P482k223r077o255J101
6599h267N304J2201o356m566K429J2853L282n061j263K177k666J2655j4977j1105
6585c360q56K004K27P811J0011j716j2594r994o368R848O663j4038j0715J7930
6571e147L776o31q29N03n555j1314j950N190m684Q508k190j4903M178m16Q819
6556a6645R547N797N435j87k026o504j3765k5254O588J9537P007Q576j042q204
6542a1140j1784r302j860J2095Q543J1745p233q071J2813P803r60j2078N61k0530
6528b9398O484R689K464R307n231P373l120n451j8223k018Q375J4512N238n78
$$ plain form
6627 -30856 -14682 -450 404 -2868 -6932 -12159 -5198 -6424 -13730 -14803 -16733 -29539 -32967 -31442
6613 -31442 -21519 -7554 4088 -5642 -18065 -17014 -4354 -471 705 8187 5964 -3113 -9368 -8267
6599 -8267 -2963 9238 2882 -1684 745 13598 16880 11819 10556 12733 10067 22722 7745 -3360
6585 -3360 -4216 -2212 -1985 5826 15837 14121 1527 -8467 -14835 -4987 1676 -12362 -23077 -5147
6571 -5147 -1371 -2002 -2831 -2328 -7883 -19197 -21147 -15957 -20641 -12133 -14323 -29226 -25048 -25464 -16645
6556 -16645 -7098 -1301 4134 3947 1921 -4583 -18348 -43602 -37014 -17477 -10470 -1894 -2936 -11140
6542 -11140 -22924 -32226 -34086 -21991 -13448 -1703 -8936 -17007 -4194 3609 2649 -9429 -8868 -29398
6528 -29398 -22914 -13225 -10761 -1454 -6685 688 -2432 -7883 -26106 -28124 -19749 -5237 1 -577
6514e77j3460K732J7093O893j0357j6195j5622j3217J7697J7596j398M372J8838
6501A4395M529k176r668j0946j0641j78J98l799m532J1140L394j792m203k109
6487a6388p008l671r124n327M421L935K0077K4707K58j8257q851J341n12J0394
6473d005k093j5917k115q444J2522K2436K35J766l41j570j4584K723Q543K505
6459A661l294j720Q896J2297k611k8533j8889Q301K459o828J2131K735Q377J2419
6445G401n845o853j0236J941J369K402P338L42n076K900P656j5777J546J3064
6431B172M622k734j081p617O11M700m052r606j898L549N475K775N913r983n388
6416a2542j3362o419J3858J8859k533j1274j0445Q122J2536j074j1380Q929P699
$$ plain form
6514 -577 -14037 -11305 5788 12681 2324 -13871 -29493 -42710 -25013 -7417 -8815 -4443 14395
6501 14395 18924 16748 7080 -3866 -14507 -14685 -14487 -18286 -22818 -11678 -8284 -10076 -14279 -16388
6487 -16388 -23396 -27067 -36191 -41518 -37097 -33162 -13085 11622 11880 -6377 -15228 -13887 -14399 -4005
6473 -4005 -6098 -22015 -24130 -32574 -20052 2384 2619 4385 4044 2474 -12110 -9387 -844 1661
6459 1661 -1633 -3353 5543 17840 15229 -13304 -32193 -23892 -21433 -28261 -16130 -13395 -5018 7401
6445 7401 1556 -5297 -15533 -13592 -12223 -9821 -2483 -2141 -7217 -4317 3339 -12438 -10892 2172
6431 2172 6794 4060 2979 -4638 -4027 673 -3379 -12985 -14883 -11334 -5859 -3084 2829 -7154 -12542
6416 -12542 -25904 -32323 -18465 394 -2139 -13413 -23858 -15736 -3200 -4274 -15654 -6725 974
6403I74l877l614r535J0587J1543M847q533n695J3869p359j2815O576R613o085
6389D96L495k632j1427J5169q90q034K984j645j361R68Q024q976P162j4910j1684
6374b3261J1085J6688Q696j1811n734q672O112J1998l054J0719J406J279K133
6361A7584j2514j0739q011M859o774n473o383M452q755P196N281J4575J46M59
6347d097Q34q836N144j2556l317J2545l819o176P13M825J3908P849K255j0271
6333i99j7907n105n958L29P596j3177n202K0211K716M710L613n098O053J5899
6319G681q385j3209j672L686J626l845j1208m205P035N983K40O82R257J3454j755
6304E365j2227P08J8627O143J425j5089J432j532j6345j285l422Q908j3389m526
$$ plain form
6403 974 -2903 -6517 -16052 -5465 6078 10925 2392 -3303 10566 3207 -9608 -3032 6581 496
6389 496 3991 1359 -10068 5101 4211 -3823 -839 -2484 -3845 -2877 5147 -3829 3333 -11577 -23261
6374 -23261 -12176 4512 13208 1397 -4337 -13009 -6897 5101 2047 12766 14172 15451 17584
6361 17584 5070 -5669 -13680 -8821 -15595 -21068 -27451 -22999 -31754 -24558 -19277 -4702 -4556 -4097
6347 -4097 -3263 -12099 -6955 -19511 -22828 -10283 -14102 -20278 -19565 -14740 -832 7017 9272 -999
6333 -999 -18906 -24011 -29969 -29640 -22044 -35221 -40423 -20212 -17496 -12786 -9173 -14271 -8218 7681
6319 7681 -704 -13913 -15585 -11899 -10273 -14118 -25326 -29531 -22496 -16513 -16273 -15591 -6334 7120 5365
6304 5365 -6862 -6154 12473 18616 20041 4952 6384 4852 -11493 -12778 -16200 -7292 -20681 -25207
$$ [...]
##END NTUPLES=NMR SPECTRUM
##END=
