##TITLE=Analysis number 317536
Compound Code cc 46104
Book Reference 451/123
Project Code qc-cat
Chemist Name evam
##JCAMPDX= 6.0         $$ Bruker NMR JCAMP-DX V2.0
##DATA TYPE= NMR SPECTRUM
##DATA CLASS= NTUPLES
##ORIGIN= Bruker BioSpin GmbH
##OWNER= nmr
$$ XWIN-NMR		Version 3.5
$$ Thu Feb 23 09:06:45 2006 GMT Standard Time (UT+0h)  MAYBRIDGE\nmr@NMR_250MHZ
##.OBSERVE FREQUENCY= 250.131544655141
##.OBSERVE NUCLEUS= ^1H
##.ACQUISITION MODE= SIMULTANEOUS (DQD)
##.ACQUISITION SCHEME= undefined
##.AVERAGES= 16
##.DIGITISER RES= 18
##SPECTROMETER/DATA SYSTEM= dpx250
##.PULSE SEQUENCE= zg30
##.SOLVENT NAME= CDCl3
##.SHIFT REFERENCE= (INTERNAL, CDCl3, 0, 16.522)
##AUDIT TRAIL= $$ (NUMBER, WHEN, WHO, WHERE, WHAT)
$$ ##TITLE= Audit trail, XWIN-NMR		Version 3.5
$$ ##JCAMPDX= 5.01
$$ ##ORIGIN= Bruker BioSpin GmbH
$$ ##OWNER= nmr
$$ C:\u/data/dgb/nmr/ADRS/16740/pdata/1/auditp.txt
$$ ##AUDIT TRAIL=  $$ (NUMBER, WHEN, WHO, WHERE, WHAT)
(   1,<2006-02-23 09:06:20.82 +000>,<MAYBRIDGE\nmr>,<NMR_250MHZ>,
      <created by zg, POWCHK disabled, PULCHK disabled
       configuration hash MD5:
       84 BC 41 DB A1 6E 1D 46 DA 25 12 A5 C1 ED C5 3A
       data hash MD5: 64K
       1C 30 72 A0 2E A6 43 76 8B BC D8 E9 C0 28 1A BD>)
(   2,<2006-02-23 09:06:34.31 +000>,<MAYBRIDGE\nmr>,<NMR_250MHZ>,
      <Start of raw data processing
       ef LB = 0.3 FT_mod = 6 PKNL = 1 SI = 32K 
       data hash MD5: 32K
       89 50 0F 5B AF 99 CF 9F 49 F0 D8 78 F5 7F 09 90>)
(   3,<2006-02-23 09:06:36.10 +000>,<MAYBRIDGE\nmr>,<NMR_250MHZ>,
      <apk 
       data hash MD5: 32K
       F1 D9 40 C5 EF 32 D0 05 EE 28 26 59 60 EB 2D 3F>)
(   4,<2006-02-23 09:06:36.95 +000>,<MAYBRIDGE\nmr>,<NMR_250MHZ>,
      <abs ABSG = 5 
       data hash MD5: 32K
       45 9D AF 31 B4 89 96 DA 0B FA B3 8C 1C CA 03 DA>)
$$ ##END=
$$ 
$$ hash MD5
$$ 24 02 25 C3 A4 D9 B2 E6 E1 AC F0 8F EC 05 7C 51
##$RELAX= 
##$RELAX= 
##$RELAX= 
##$RELAX= 
##$RELAX= 
##$RELAX= 
##$RELAX= 
$$ Bruker specific parameters
$$ --------------------------
##$DU= <C:\u>
##$EXPNO= 16740
##$NAME= <ADRS>
##$PROCNO= 1
##$TYPE= <nmr>
##$USER= <dgb>
##$AMP= (0..31)
100 100 100 100 100 100 100 100 100 100 100 100 100 100 100 100 100 100 
100 100 100 100 100 100 100 100 100 100 100 100 100 100 
##$AQSEQ= 0
##$AQ_mod= 3
##$AUNM= <au_zg>
##$AUTOPOS= <1 >
##$BF1= 250.13
##$BF2= 250.13
##$BF3= 250.13
##$BF4= 250.13
##$BF5= 500.13
##$BF6= 500.13
##$BF7= 500.13
##$BF8= 500.13
##$BYTORDA= 1
##$CFDGTYP= 0
##$CFRGTYP= 5
##$CHEMSTR= <none>
##$CNST= (0..31)
1 1 145 1 1 1 1 1 1 1 1 1 1 1 1 1 1 1 1 1 1 1 1 1 1 1 1 1 1 1 1 1 
##$CPDPRG= <>
##$CPDPRG1= <>
##$CPDPRG2= <>
##$CPDPRG3= <>
##$CPDPRG4= <mlev>
##$CPDPRG5= <mlev>
##$CPDPRG6= <mlev>
##$CPDPRG7= <mlev>
##$CPDPRG8= <mlev>
##$CPDPRGB= <>
##$CPDPRGT= <>
##$D= (0..31)
0 1 0 0 0 0 0 0 0 0.06 0 0 0 0 0 0 0.0002 0 0 0 0 0 0 0 0 0 0 0 0 0 0 
0 
##$DATE= 1140685579
##$DBL= (0..7)
120 120 120 120 120 120 120 120 
##$DBP= (0..7)
150 150 150 150 150 150 150 150 
##$DBP07= 0
##$DBPNAM0= <>
##$DBPNAM1= <>
$$ [...]
##$SUBNAM7= <"">
##$SUBNAM8= <"">
##$SUBNAM9= <"">
##$SW= 20.6930455092707
##$SWIBOX= (0..15)
0 0 3 0 0 0 0 0 0 0 0 0 0 0 0 0 
##$SW_h= 5175.983436853
##$TD= 65536
##$TD0= 1
##$TE= 293.16
##$TE2= 300
##$TE3= 300
##$TEG= 300
##$TL= (0..7)
0 120 120 120 120 120 120 120 
##$TP= (0..7)
150 150 150 150 150 150 150 150 
##$TP07= 0
##$TPNAME0= <>
##$TPNAME1= <>
##$TPNAME2= <>
##$TPNAME3= <>
##$TPNAME4= <>
##$TPNAME5= <>
##$TPNAME6= <>
##$TPNAME7= <>
##$TPOAL= (0..7)
0.5 0.5 0.5 0.5 0.5 0.5 0.5 0.5 
##$TPOFFS= (0..7)
0 0 0 0 0 0 0 0 
##$TUNHIN= 0
##$TUNHOUT= 0
##$TUNXOUT= 0
##$USERA1= <user>
##$USERA2= <user>
##$USERA3= <user>
##$USERA4= <user>
##$USERA5= <user>
##$V9= 5
##$VALIST= <valist>
##$VCLIST= <CCCCCCCCCCCCCCC>
##$VD= 0
##$VDLIST= <DDDDDDDDDDDDDDD>
##$VPLIST= <PPPPPPPPPPPPPPP>
##$VTLIST= <TTTTTTTTTTTTTTT>
##$WBST= 1024
##$WBSW= 4
##$XGAIN= (0..3)
0 0 0 0 
##$XL= 0
##$YL= 0
##$YMAX_a= 438016
##$YMIN_a= -588488
##$ZGOPTNS= <>
##$ZL1= 120
##$ZL2= 120
##$ZL3= 120
##$ZL4= 120
##$ABSF1= 16.522
##$ABSF2= -4.171173
##$ABSG= 5
##$ABSL= 3
##$ALPHA= 0
##$AQORDER= 0
##$ASSFAC= 0
##$ASSFACI= 0
##$ASSFACX= 0
##$ASSWID= 0
##$AUNMP= <proc_1d>
##$AZFE= 0.1
##$AZFW= 0.1
##$BCFW= 0
##$BC_mod= 0
##$BYTORDP= 0
##$COROFFS= 0
##$CY= 12.5
##$DATMOD= 1
##$DC= 0
##$DFILT= <>
##$DTYPP= 0
##$F1P= 14.0000005364418
##$F2P= -0.99999901652339
##$FCOR= 0.5
##$FTSIZE= 32768
##$FT_mod= 6
##$GAMMA= 0
##$GB= 0
##$INTBC= 1
##$INTSCL= 1
##$ISEN= 128
##$LB= 0.3
##$LEV0= 0
##$LPBIN= 0
##$MAXI= 10000
##$MC2= 0
##$MEAN= 0
##$ME_mod= 0
##$MI= 0
##$NCOEF= 0
##$NC_proc= -4
##$NLEV= 6
##$NOISF1= 0
##$NOISF2= 0
##$NSP= 0
##$NTH_PI= 0
##$NZP= 0
##$OFFSET= 16.522
##$PC= 1
##$PHC0= 246.4298
##$PHC1= 3.219579
##$PH_mod= 1
##$PKNL= yes
##$PPARMOD= 0
##$PSCAL= 4
##$PSIGN= 0
##$REVERSE= no
##$SF= 250.13
##$SI= 32768
##$SIGF1= 0
##$SIGF2= 0
##$SINO= 400
##$SIOLD= 32768
##$SREGLST= <1H.CDCl3>
##$SSB= 0
##$STSI= 32768
##$STSR= 0
##$SW_p= 5175.98343685301
##$SYMM= 0
##$S_DEV= 0
##$TDeff= 65536
##$TDoff= 0
##$TI= <Analysis number 999999
Compound Code 99
Book Reference 9
Project Code 9>
##$TILT= no
##$TM1= 0
##$TM2= 0
##$TOPLEV= 0
##$USERP1= <user>
##$USERP2= <user>
##$USERP3= <user>
##$USERP4= <user>
##$USERP5= <user>
##$WDW= 1
##$XDIM= 32768
##$YMAX_p= 533879780
##$YMIN_p= -607088
$$ End of Bruker specific parameters
$$ ---------------------------------
##NTUPLES= NMR SPECTRUM
##VAR_NAME=  FREQUENCY,     SPECTRUM/REAL,   SPECTRUM/IMAG
##SYMBOL=    X,             R,               I
##VAR_TYPE=  INDEPENDENT,   DEPENDENT,       DEPENDENT
##VAR_FORM=  AFFN,          ASDF,            ASDF
##VAR_DIM=   32768,         32768,           32768
##UNITS=     HZ,            ARBITRARY UNITS, ARBITRARY UNITS
##FACTOR=    0.157963299565203, 1,           1
##FIRST=     4132.6476996994, 0,             0
##LAST=      -1043.33573715361, 0,           0
##MIN=       -1043.33573715361, -607088,     0
##MAX=       4132.6476996994, 533879780,     0
$$ Real data points
##PAGE= N=1
##DATA TABLE= (X++(R..R)), XYDATA
$$ [...]
28322e9931O1128K7792Q13k6202l9214j3750J3249l0382N2648M0409o1646k7556
28310f2642M7596J5123O753Q337P482L1228l7125l2812k5915Q619L1910Q4288
28298H2842k0189k9258J3026J3666m2438K5939L8010L1523k3282n0374j8622P545
28286B8388K8842r400j0645m451M8267M50k8551N811j3353n5331M6645J7151j7209
28273C6614o9894k0186J5419N5830L1468l6141k0383M6542o060K5400L6634j6168
28261G9075J6522k2451l1380R753J2898J070l6149o052J8859l6837l1937l552
28249c0181M2495N3410j5806l3827N9067J3917l0750p419M0319l1389k8831K899
28237C3904K045j946m052q695K3216j482N9632r100O276m5098m5895R600R19k355
$$ y = [-59931, 1197, 28989, 29802, 3600, -35614, -49364, -36115, -66497, -13849, 26560, -35086, -62642, -15046, 77, 6830, 15167, 22649, 53877, 16752, -16060, -41975, -33356, -1446, 82842, 62653, 33395, 46421, 60087, 17649, 43588, 81598, 113121, 89839, 39465, 20843, 28388, 57230, 47830, 37185, 32734, 81001, 81451, 52900, 58711, 45358, -9973, 36672, 53823, 36614, -33280, -53466, -38047, 17783, 49251, 13110, -7273, 39269, 33209, 58609, 95243, 79075, 95597, 73146, 41766, 51519, 64417, 65487, 29338, 23286, 42145, 5308, -26629, -30181, 12314, 65724, 49918, 16091, 75158, 89075, 58325, 50906, 91225, 59836, 31005, 33904, 35949, 34003, 29951, 21256, 44472, 42990, 102622, 93522, 99798, 54700, 8805, 18405, 19324, 16969]
28223A6969L7872J2906k0839j7792j6722J3639n8112J2350L9748J7785K4070j3092
28211D8782o1663L2058J0763N0700N0859m9734j9341j8638P495L5398m0334l4158
28199A2187k8758k974l9956N3090K4946P81j7664j4116K7995N7938P622K3367
28187A04458J0490p500j2024J2938o614l8436KL2192L4335r022l0478q9661k2793
28174b2113N8342k2607m1946Q776k964L2090J565K7105K6116k0363n9886m6031
28162f1916L827q724M7166N6242K296n8110m7076N0725j1487p8179j7989R5127
28150b8098Q1106k2255l3965k873k8051L2632Q261m3083k0021O1083K7797j244
28138C1289L723K4219J9588o3178n2739o5482K3133J068K8572M7628P6587j3597
$$ y = [16969, 54841, 67747, 46908, 29116, 12394, 26033, -32079, -19729, 20019, 37804, 61874, 48782, -12881, 19177, 29940, 80640, 131499, 81765, 62424, 43786, 51281, 86679, 46345, 12187, -16571, -19545, -59501, -6411, 18535, 19316, 1652, -12464, 15531, 73469, 81091, 104458, 114948, 107448, 95424, 108362, 101748, 63312, 63314, 95506, 129841, 120819, 90341, 680, -22113, 36229, 13622, -28324, -19548, -22512, 9578, 11143, 38248, 64364, 44001, -15885, -61916, -58089, -66813, -19647, 36595, 38891, -19219, -66295, -15570, -27057, -105236, -123225, -28098, 53008, 30753, -3212, -6085, -34136, -1504, 6757, -36326, -56347, 4736, 32533, 31289, 35012, 59231, 78819, 15641, -37098, -102580, -79447, -78379, -49807, -2179, 74408, 60811]
28126F0811m5336K3978o149j839J451j4698j7370K4994J0103j0079J6074n78n1275
28113i913L3425L9714N02k8499L049n7307n9823L6624O0551l0529j060J9125P810
28100A3669J918K696l5341j7946J3576j0094K2385L9068l6830N051M5780k2182
28088B1750j3991m7601N7533N3980L4788q9490j26348J5246L2409p888N8708M2021
28076C1117K8841L3085L2466p0739k5319J230j3597j1386O407M8733L6821m5946
28064E1713p2113k9505M010k1441m582j0010N8049K3007n035k6942K1364P031
28052d454q554L3121k3653n7957n6638K9261O3168k4583j0032k9331K7906J1560
28040e0186l078M8167J209m9175j8955O5828P4188J5820o1419p8074L871J6156
$$ y = [60811, 15475, 39453, 33304, 31465, 32916, 18218, 848, 25842, 35945, 25866, 41940, 41362, -9913, 23512, 63226, 63728, 35229, 38278, -19029, -78852, -42228, 18323, -12206, -13266, 5859, 13669, 15587, 18283, -17058, -35004, -21428, -31522, -9137, 29931, -6899, -1848, 43932, 21750, 7759, -39842, 17691, 71671, 106459, 16969, -109379, -94133, -61724, -69612, -10904, 31117, 59958, 93043, 125509, 54770, 29451, 30681, 17084, 5698, 12105, 60838, 97659, 51713, -20400, -49905, -45895, -67336, -71918, -81928, -23879, -872, -5907, -32849, -11485, -4454, -13008, 20113, -3540, -61497, -118135, -88874, -25706, -50289, -60321, -89652, -61746, -50186, -53264, -5097, -3888, -53063, -72018, -6190, 67998, 83818, 22399, -55675, -51804, -35648]
28028c5648M3826J5456M7828j9367k3008K1220O5537K5002l2668l0616k2767j0660
28016D4135m4160j8519K462L152k2627L627M8670j6680l7595l248J2464M5561
28004A7242N983m2472k577J2906J4166k1454m8111p1223k7757L0480N1543J0509
27992g0765L34M0225P1897K6553l2452q553j5983m4412J8275M9453J1520k7513
27980A8579l4783j4237K5142o576k8668j1278l0025K6017P6453N3813L3984k2316
27968H6105l0702o8597J3818K7050k9939l9115o931J8814l0301K856k9090L8356
27956d7676J8913L8024l2286k5710O473O1565K2097J2096j2326l3733j7464j3660
27944b3687K9922L2412l5631j4535l73M060K3926K5441j3901j8665K2900l4567
$$ y = [-35648, 8178, 23634, 71462, 52095, 29087, 50307, 115844, 140846, 108178, 77562, 54795, 44135, -25, -18544, -16082, -12930, -35557, -31930, 16740, 60, -37535, -40783, -28319, 17242, 23225, -19247, -21824, -8918, 5248, -16206, -64317, -135540, -163297, -132817, -81274, -70765, -70431, -30206, 41691, 68244, 35792, 27239, 11256, -33156, -14881, 34572, 46092, 18579, -16204, -30441, -5299, -11875, -40543, -51821, -81846, -55829, 20624, 74437, 108421, 86105, 55403, -13194, 624, 27674, -2265, -41380, -48311, -29497, -59798, -56942, -86032, -47676, -28763, 9261, -23025, -48735, -42262, 19303, 41400, 53496, 41170, 7437, -10027, -23687, 6235, 38647, 3016, -11519, -11892, -7832, 16094, 41535, 27634, 8969, 31869, -2698]
27932b698J7691J3162J1556m9803k5501K4348L4326P5384L9798N0915q3875r4385
27920A0918J3226l2473k1037n0303M4106N2900P745j9658R002m0823K4075K3647
27908B1325l5395l7536K6991k5683K1254M0505j4303k597m6192j2083K0423k0959
27896f4250m0300R1980P7585o248M0827l5857q0502M2922L1823p79l276n0753
27884C172P368l6161j9202L6354k9506J3933M5653p908m2940q907J5245J320J6158
27871e421N4924j1867o7577K5487L6365K2210m4878k5519o1436L3690L535J4706
27859b5781l219j3911l5483l3496K7006M7440K5480K5040N392K7614L2142L9398
27847A17622j2556o830L7519J2328m8328r6312J5866J838J9958J9219Q123l2491
$$ y = [-2698, 14993, 28155, 39711, -10092, -35593, -11245, 23081, 98465, 138263, 189178, 105303, 10918, 24144, -8329, -29366, -79669, -35563, 17337, 25082, 5424, 14426, -26397, -2322, 21325, -14070, -51606, -24615, -50298, -29044, 11461, -2842, -5439, -51631, -63714, -43291, -64250, -104550, -12570, 65015, 58767, 99594, 63737, -16765, 26157, 57980, 57201, 53925, 3172, 10540, -25621, -44823, -8469, -37975, -24042, 21611, 13703, -29237, -38144, -22899, -21579, -5421, 49503, 37636, -29941, -4454, 31911, 54121, 9243, -16276, -77712, -44022, -40487, -25781, -29000, -42911, -78394, -111890, -84884, -37444, -11964, 13076, 18468, 46082, 78224, 117622, 105066, 98236, 135755, 148083, 99755, 3443, 19309, 21147, 41105, 60324, 68447, 35956]
27835C5956q3994m2392J5939J2217r130R624P354j0170J0670L9704L0515K7810
27823D4103j1546J1886k8438L3742j9797p5951m5463M1306K3089L1553j6579N062
27811g033L5949J9279k0405j8631M7980k7322n2900k8043j3967J1130K5134j6666
27799d5495J3753Q652r684k0451J1437O287J7385M8023J6750M1105l9453n2431
27787d122j0915l0242P623j9667K3576L4799K4601k875j6745J7329J3158j8987
27775A7533K359n516J5220L5223q757q2778n7481K0669N7603p049K86r209K3318
27762A421n670m3721K3582J8987m263L0851J3715l2203q603l6420n1430Q280k2101
27749a07575P789M2965L264j1801J9629M5158N3739P245m0272K6765J7714m0256
$$ y = [35956, -48038, -90430, -74491, -62274, -71404, -61780, -54426, -64596, -53926, -14222, 16293, 44103, 32557, 44443, 16005, 49747, 29950, -46001, -91464, -50158, -27069, 4484, -12095, -7033, 28916, 48195, 27790, 9159, 57139, 29817, -23083, -51126, -65093, -53963, -28829, -45495, -31742, -23090, -32774, -53225, -41788, -35501, -18116, 29907, 46657, 87762, 48309, -4122, -15037, -45279, -37656, -57323, -33747, 1052, 25653, 22778, 6033, 23362, 36520, 17533, 19892, 14376, 29596, 64819, 56062, -26716, -84197, -63528, -5925, -12974, -12688, -21897, 1421, -4249, -47970, -24388, -5401, -9664, 21187, 34902, 2699, -5904, -42324, -93754, -85474, -107575, -99786, -56821, -53557, -65358, -45729, -571, 53168, 60413, 20141, 46906, 64620, 24364]
27737B4364k6897R219k0431Q397K2379L8124m306k0819k7370p5691Q178l1018
27725i5871j5743O1420J3620K0334j241L8117M4114L3897l1535l8518o0916l3357
27713f5679N2150K2485k9266n9892l2067J2617Q4078M7669k0449j341L729k541
27701A1493k302M8862M2865j3027m0688J770K4773r406q8263j5796r662K5131
27689b4250J7929J3157j732j7360J1401J1120K8207J4159J5219o124l6783J1737
27677C6680J6451m503n7147m149J0182J5350k4947n0075J4425k7823O0528J0203
27665d825k2804j9065J6346K4410M947J7694r595K1055K0509p1894o1836L0696
27653e4362J6170m713n830J5461L3067L7205M6084L3388j09881o7499M824N579
$$ y = [24364, -2533, 6686, -13745, -5348, 17031, 55155, 50849, 30030, 2660, -73031, -64853, -95871, -111614, -50194, -36574, -16240, -17481, 20636, 64750, 98647, 67112, 28594, -32322, -65679, -13529, 8956, -20310, -80202, -112269, -99652, -15574, 32095, 11646, 10305, 14034, 11493, 9191, 58053, 100918, 87891, 47203, 48973, 73746, 64340, -23923, -39719, -49381, -24250, -6321, 6836, 5104, -12256, -855, 10265, 38472, 52631, 67850, 61726, 24943, 36680, 53131, 48628, -8519, -12668, -2486, 12864, -12083, -62158, -47733, -75556, -15028, -4825, -27629, -46694, -30348, -5938, -991, 16703, 7108, 28163, 48672, -23222, -85058, -54362, -38192, -42905, -48735, -33274, -207, 36998, 83082, 116470, 6589, -60910, -56086, -50507]
27641e0507P038L4716M5751M5279l0632j04510k5307Q246P604M5921M3917k6435
27629A081J7074l4847J3032N3940k4837j7360Q611K011q765m8485j2910K135M879
27616d4441J7467k8212Q996n469j41j8208K3396O46Q1783L1443l7171k1384k1787
27603a3082K2720k9654k1455l0524M4437N3247j6295j6650m624M3430O279o9168
27591c1339n5359L7219R0854J2182K8226l6124o7103n651M0135L0547J470j0866
27579C4191m2056j0782J9775l103n391J3768K8137j1067k1434k9900J8376l3494
27567d2980q438L8986L5071k2362l9288l115R6525K1040l9972k1935N1527j009
27555F4050k8309l9883K2060p9063m718N9859r760K2746P0314K9817m2383k5254
$$ y = [-50507, -43469, -8753, 36998, 82277, 51645, -52865, -78172, -69926, -62322, -16401, 27516, 1081, 18155, -16692, -3660, 50280, 25443, 8083, 16694, 18705, 9940, -38545, -51455, -49320, -44441, -26974, -55186, -46190, -51659, -51800, -70008, -46612, -45966, 35817, 67260, 30089, 8705, -13082, 9638, -20016, -41471, -71995, -27558, 25689, 9394, -7256, -11880, 31550, 37829, -31339, -86698, -49479, 41375, 53557, 81783, 45659, -21444, -27095, 13040, 43587, 45057, 34191, -7865, -18647, 1128, -1975, -7366, 6402, 34539, 23472, 2038, -27862, -9486, -42980, -51418, -12432, 22639, 277, -39011, -42126, 54399, 75439, 35467, 13532, 65059, 64050, 35741, -4142, 17918, -61145, -65863, -6004, -15764, 6982, 77296, 107113, 64730, 39476]
27543C9476M420o0082r073m0965j5975P547K4209J7327Q4376N4017K583p0498
27531C7362n4391r76L3336K4292q881L513J0617j3067j6524k023L9205M3325l7662
27518E8126o4415L04J6732K6813M1275j8089k4880L9234q680o1038l859l9156
27506c7633K7977N7954K9572m2695j0122l6052m182j9187j8630m91O0946N8553
27494F6010N524j1476m6039q196J9280k8725q0294l85O0122M9184N9424L5110
27482A19539n8436p5894j2047j3667N4244j0830n394K3049l8131r1796L6918J3385
27470e9060j1193R85K8400M4269L8122J8674N568n9775J1595M0278k828k9910
27458B5125n5788J7399o900n494O872K128m2989K1012K6238M6085j528n8147J4573
$$ y = [39476, 43896, -16186, -25259, -66224, -82199, -74652, -50443, -33116, 51260, 105277, 107860, 37362, -17029, -18005, 15331, 39623, 30742, 34255, 44872, 31805, 15281, 13258, 52463, 95788, 58126, -6289, -5985, 10747, 37560, 78835, 60746, 35866, 75100, 66420, 5382, 1523, -37633, -9656, 48298, 77870, 35175, 25053, -10999, -15181, -34368, -52998, -53489, 7457, 66010, 71534, 60058, 14019, 5823, 25103, -3622, -83916, -84301, -24179, 25005, 84429, 119539, 61103, -14791, -26838, -40505, 13739, 2909, -2485, 20564, -17567, -109363, -72445, -59060, -70253, -69268, -40868, 3401, 41523, 60197, 65765, 5990, 17585, 57863, 55035, 25125, -30663, -13264, -20164, -25658, -18786, -16658, -59647, -38635, -12397, 33688, 32160, -25987, -11414]
27445a1414O2149j6713p2722l8670K6308Q0896N2566l3705o9723j2814M7441M2317
27433E5916N4513o0239n5877L8902j733o1335K5027J3093k6481m533L7419k6244
27421a1572m0378K9258J1211o7724r460L3432M1830k8482N269l0600N2154N7394
27409D2332l6754o1213k864K4656n498k8543L1529j7452J5557k5269J6190o63
27397d7992O044O2772J6985P825o7340L6361O2060l5049k1178L704m8684m9386
27385g3878K0303K5332J5310N6896K4156k4085o4365m7555P212J9100k3669J2307
27373e2936N500N901M6367q489k9289o466M3496L0144J6236J8121p886r882p4020
27360b3203l0913O2184J2110j2268J3153m8350n262J8979J7702M3614k4495j3822
$$ y = [-11414, 50735, 34022, -38700, -77370, -51062, 29834, 82400, 48695, -21028, -33842, 13599, 55916, 110429, 50190, -5687, 33215, 31482, -29853, -4826, 8267, -18214, -22747, 14672, -11572, -51950, -22692, -11481, -79205, -88665, -55233, -13403, -41885, -36616, -67216, -15062, 42332, 5578, -55635, -58499, -33843, -39341, -67884, -36355, -53807, -38250, -63519, -47329, -47992, -41948, 20824, 37809, 45634, -21706, 14655, 76715, 41666, 20488, 24192, -24492, -73878, -53575, -28243, -12933, 43963, 68119, 44034, -20331, -67886, -60674, -41574, -65243, -52936, -47436, -41535, 4832, -3657, -32946, -39412, 4084, 34228, 50464, 68585, 60699, 50817, -23203, -54116, 8068, 20178, 7910, 21063, -27287, -32549, -13570, 4132, 47746, 23251, 9429]
27348I429J8168L651l6733j00747o797M4766N3110L0942K9176k1821K2129L1466
27336G6739r685L601q209k9995p037N9645J6499L703j3144l7373m485P323n798
27323E1784l0611k7743o279J5857k349j977j3487J8297k532J4358K3259l3044
27311E533M4376m6980n2335n6361J427N7360K0830O064l5741k245M6358K2659
27299A0945J9635j0453j9653j7621l303q042N9082L7796N841m1699n7209L2378
27287G697j4111L2668j9478K2224k6708J1804R510M665k8837j7926K7954L0957
27275D0419J4841j5152l8616k0797k2721k3293J3361M0597l164l0405p525l388
27263e5843O349k8808N0020L2589j2623L5951R166L260q602o2097r894K749J1519
$$ y = [9429, 27597, 31248, -5485, -106232, -113029, -68263, -15153, 15789, 44965, 23144, 45273, 76739, 67054, 70655, 62446, 32451, 25414, 85059, 101558, 105261, 92117, 54744, 50259, 57582, 51784, 21173, -6570, -12849, 3008, 659, -1318, -14805, 3492, 960, 15318, 38577, 5533, 49909, 2929, -49406, -105767, -104340, -46980, -26150, -20086, -55827, -58072, -11714, 10945, 30580, 20127, 474, -17147, -20450, -28492, 30590, 68386, 74227, 32528, -24681, 7697, -6414, 26254, 6776, 29000, 2292, 14096, 23606, 28271, -566, -18492, 9462, 40419, 55260, 40108, 1492, -19305, -42026, -65319, -51958, -11361, -14525, -44930, -52455, -55843, -49494, -78302, -28282, 4307, -8316, 27635, 36801, 40061, 31459, -30638, -40532, -37783, -26264]
27250b6264j4667K3764O0256k5221k9731M735l7037l7677l3950j8484l711O754
27238a31233L6972M5690O4301K5549K9009n0739j14q29J1293n1127q0889M3062
27226e9055K4396O024J4743n0099l652Q191l9638p5508M5266J19469o669K1019
27214D487j1113Q685L7289J5147k7026j0475L5742r68m5505k521k5194m0904l3597
27201i5953l9191O849P2194K523k7036o1443K0816L8467P167l1131O893J8829
27189h1016k463m661J8015M0304M9390m5985l7657J78J8902R3056K1630K7021
27177I6714o805k4387j1701K3257P8725j944l6287r4783q7196K8462J6510j2506
27165c1941o614j6342L5734L7588m0081j2362K8961j2269k9824Q231j0527L4720
$$ y = [-26264, -40931, -17167, 43089, 17868, -11863, -7128, -44165, -81842, -115792, -134276, -137987, -131233, -94261, -48571, 15730, 41279, 70288, 19549, 19435, 18606, 29899, -21228, -102117, -59055, -34659, -28635, -13892, -63991, -67643, -59452, -99090, -174598, -129332, -9863, -16532, 4487, -6626, 2059, 39348, 54495, 27469, 16994, 52736, 51768, 6263, 3742, -21452, -62356, -95953, -135144, -128295, -56101, -53578, -80614, -142057, -121241, -82774, -75607, -106738, -99845, -81016, -83479, -88140, -70125, -29821, 19569, -26416, -64073, -63895, -44993, 48063, 69693, 96714, 89909, 65522, 53821, 77078, 155803, 153859, 117572, 22789, -64407, -35945, -19435, -31941, -38555, -54897, -19163, 18425, -21656, -34018, -5057, -17326, -47150, -38919, -49446, -14726]
27153a4726N9734J1847k6855j4922m275l122Q830K2395k0809M0738p124j7231
27141C4480l994K7048Q5404j0975l5072m7390m2425R512o27p26M2960N4927r084
27128A04038J7046K7254j3781k784m8198l0362q2935m6305K6041N4366n054K3551
27116B2877k1995K8179J9046M0112p8952p8592n4694N7010R1965P2124k6840q2457
27104a2217n5083L7577M6004j394j9792j952Q228R502n6372j6837K9320K9549
27092c467p4953k7880N6602J7899n5879K6243K6010o529J0485k3632K4897m2423
27080g2627k2237O994K2114L6842J7798K6511l0707k0722n695M9114n185J5654
27068A7854L057K9745j6595o1369j1353J8890r709n3028J9369P1505P2235l4043
$$ y = [-14726, 45008, 56855, 30000, 15078, 10803, 7681, 16511, 38906, 18097, 58835, 51711, 34480, 30486, 57534, 142938, 131963, 96891, 49501, 7076, 16588, 15961, 15235, 58195, 113122, 104038, 121084, 148338, 134557, 131773, 83575, 53213, -29722, -76027, -49986, 4380, -674, 22877, 882, 29061, 48107, 88219, 9267, -69325, -124019, -67009, 24956, 97080, 70240, -12217, -67300, -29723, 16281, 14887, -4905, -6857, 1371, 10873, -45499, -62336, -33016, -3467, -78420, -106300, -49698, -31799, -87678, -61435, -35425, -41954, -31469, -55101, -30204, -72627, -94864, -87870, -65756, -28914, -11116, 15395, -15312, -36034, -41729, 7385, 2200, 17854, 20911, 50656, 34061, -27308, -38661, -19771, -29480, -82508, -63139, 8366, 80601, 46558]
27056D6558j8925J0041l9538O1267N0957n133k4291j4487J4484J9061k8428m6607
27044B4959l957M5119M4227J0371k720j2287J8240p270n0942k1483M2965l1373
27032E5849l9892l9311N9305P613J4713m3496r572j0273P277L5418j0983j8551
27020H097Q617N983K8049K0649k545j2389j8005l0685N918J0402k6061j1068j8626
27007c1664L8607k3313j375N5298L6448k404l5175o838r045l0977j4407K0270
26995d575L6271k3401k374N8725r912K3959j0050O361K4346m1424K7593K78k8876
26982E6921p224J0935K5781J8633m7476n9394K515J2330j785o8205j9240j0003
26970h6212M6430N7699O2750K1604l9230M3774J2609m0151J2945k2379k1053l5836
$$ y = [46558, 27633, 37674, -1864, 59403, 110360, 105227, 80936, 66449, 80933, 99994, 71566, 24959, 21002, 66121, 110348, 120719, 117999, 105712, 123952, 116682, 65740, 44257, 87222, 55849, 15957, -23354, 35951, 43564, 58277, 14781, 5209, -5064, 2213, 37631, 26648, 8097, 16714, 22697, 50746, 71395, 68850, 56461, 38456, 7771, 13689, 24091, -1970, -13038, -31664, 6943, -16370, -17745, 37553, 74001, 71597, 36422, 29584, 20539, -10438, -24845, -4575, 31696, 8295, 5921, 64646, 54734, 78693, 68643, 75004, 99350, 57926, 85519, 85797, 56921, 49697, 60632, 86413, 105046, 57570, -1824, 691, 13021, 11236, -56969, -76209, -86212, -39782, 17917, 80667, 102271, 63041, 106815, 119424, 79273, 92218, 69839, 48786, 12950]
26958A2950j296r085p57j1419M3117M2847k3724q137j3942J0269j3418j1079k4460
26945h134K5432J6526L3626q528k10L3165m2487k1879L115j0264l154J1449o0602
26932c1945R929J9725j0878K5329L7696k711j7238j4017J6861m9573O531J6717
26920F426j5569l7347k1208K0130M5624L4672l9157j9871J9051L3405k5386L208
26908C978L118k5368n455m9546O6917O9749L0785k2948l607j3797j5146P7865
26896A16545r576p4836m5506k3819k3407J00929L8360o3231m7811k5733n7441
26885a15526L4493L1143N4346M8302j2698j4277j6693p5539M2780P4942J8085
26874F9358j3487m1403J1342m2719o7370K6176m150m5320j3017K781M626K9107
$$ y = [12950, 11654, 2569, 1812, -9607, 33510, 76357, 52633, 44496, 30554, 40823, 27405, 16326, -8134, 17298, 33824, 67450, 58922, 58712, 91877, 49390, 27511, 30626, 20362, 17208, 28657, -31945, -22016, -2291, -13169, 12160, 49856, 47145, 29907, 15890, 32751, -16822, -10291, 6426, -9143, -46490, -67698, -47568, -1944, 32728, -6429, -26300, -7249, 26156, 770, 3978, 7096, -18272, -23727, -73273, -6356, 63393, 94178, 71230, 67623, 53826, 38680, 116545, 106969, 32133, -13373, -37192, -60599, 40330, 78690, 15459, -32352, -58085, -115526, -81033, -49890, 4456, 52758, 40060, 25783, 9090, -66449, -23669, 51273, 69358, 55871, 14468, 25810, -16909, -84279, -58103, -62253, -107573, -120590, -117809, -113183, -84076]
26862h4076l224M778Q1164Q0128k227j1375l3779J8644J862o36J8656K869q668
26849F4116q468m0928r681k7708K2667m8541m9059k3492j3525O8046R1461j343
26837B3545K04k1922m0889L4192m612m7634L8584L3408J0338k7120L3397L3247
26825F4738k8330j4975n9447k3601M268q654N1714L8183J4074p9357j7264L4464
26813b4187M7975M8784n0674j4056P442K0364j1050n6352l7694r752N7502N1938
26801C0240n9068k4778M5326k21k3749o1082K9450K4905J0596P969o0807K2261
26789e8958K6973O1186L1173j8180m3013l8933K0768J849L1765l4768L4125q542
26777E445n0763M3443L5449q622N11J7751K2820l022O257m3296p5105K968O774
$$ y = [-84076, -87300, -82522, -1358, 78770, 76543, 65168, 31389, 50033, 51895, 51259, 69915, 72784, 64116, 55648, 14720, 5039, -22669, -2, -48543, -97602, -121094, -134619, -66573, 24888, 23545, 23749, 1827, -39062, -4870, -9482, -57116, -18532, 14876, 25214, -1906, 31491, 64738, 36408, 21433, -38014, -61615, -57347, -66001, -14287, 23896, 37970, -41387, -58651, -24187, 23788, 72572, 21898, 7842, 15284, 35648, 24598, -31754, -69448, -79200, -21698, 30240, -28828, -53606, -8280, -8501, -32250, -93332, -63882, -38977, -28381, -20412, -81219, -58958, -31985, 29201, 60374, 42194, -819, -39752, -18984, -17135, 14630, -20138, 13987, 5445, -45318, -1875, 33574, 24952, 25463, 43214, 66034, 63012, 69269, 25973, -49132, -46164, -39390]
26764c9390L7785J0746p5212l8416N3368K846N2472j798K8046j1431l9205k3123
26752d3312O519K1008j0486l032N2041L9359l8686p009K248M372J7426m6983K6255
26739A9720q454j5049k9388L588O725L7688P030Q0513K0628q3041o3008m5230
26727f8278j5909J8050l0967O5159O9315k9467l6474K142J3843Q782n2149M138
26715e1815O3915k9848j1587N5050l8350j0638N5905n3100J5301n736M1275m0688
26703a0316j9740N0393J4107K5210m4159j3570p86p888P2639J4790p2251l0476
26691b2047J2414o224m437K6663j1910m1495m5124L5113p19J9210k8729L0542
26679c6743N5480k7580k3694j2835j2067K5350M0067J7611Q661J0217K2946j5045
$$ y = [-39390, -1605, 9141, -66071, -104487, -51119, -48273, 4199, 2401, 30447, 19016, -20189, -43312, -36793, -15785, -26271, -29303, 22738, 62097, 23411, 16402, 18650, 23022, 40448, -6535, 19720, 11266, -3783, -33171, -29583, -22858, 14830, 21860, 102373, 123001, 39960, -23048, -68278, -84187, -66137, -97104, -31945, 37370, 7903, -28571, -26429, -12586, -3804, -55953, -51815, 12100, -17748, -29335, 25715, -12635, -23273, 32632, -20468, -5167, -10903, 30372, -10316, -30056, 20337, 34444, 59654, 15495, 1925, 1139, -6749, 65890, 80680, 8429, -22047, -9633, -15857, -20294, 6369, -5541, -47036, -92160, -57047, -57766, -38556, -67285, -36743, 18737, -8843, -32537, -45372, -57439, -32089, 7978, 25589, 34250, 44467, 67413, 52368]
26667E2368K6252m8729K2774R071m576p911q488L0045k8579l4239L6891M1142
26655H6021q19K0158m4097o539o72J1137k2648Q180K2676M19l3067o9087K7598
26642g40L0110p964k1737K927j3957K0910j1672n0230J328K8195J4252K2093n3536
26629d0021m0098l18M5661O2289j2334m2482O3292K9952q416l3003k4503J625
26617A644r698K4153L7965K6740n3164j0132n4068J2779K9061m9674J4979L8603
26605I188k3569k6793k8501k577L4473J6853O1949l0702m0661O6320L2545k4634
26593D3891J6595K812m0370l8567J3082J2872O757m931l926J3801M389k0613Q771
26580A4563L5371j3958k5544K3483K2389m2275k4594J1125j7783n6746K8701K1954
$$ y = [52368, 78620, 29891, 52665, 61736, 57160, 49249, 40761, 70806, 42227, 7988, 44879, 86021, 85202, 105360, 61263, 54724, 54052, 65189, 42541, 50721, 73397, 73816, 40749, -28338, -740, 29370, 21406, -331, 2596, -11361, 9549, -2123, -52353, -51025, -22830, -8578, 13515, -40021, -80119, -80437, -34776, 27513, 15179, -27303, 35989, 65941, 57525, 24522, 19, 1644, -8054, 16099, 54064, 80804, 27640, 17508, -36560, -23781, 5280, -44394, -29415, 9188, -14381, -41174, -69675, -72252, -37779, -20926, 41023, 10321, -30340, 35980, 68525, 43891, 60486, 63298, 22928, -15639, -2557, 10315, 17072, 12141, 8215, 22016, 26405, 5792, 14563, 49934, 35976, 10432, 33915, 56304, 14029, -10565, 560, -17223, -73969, -45268, -23314]
26568b3314o3381m9794J9270K9520J2572k3850R6R17J5230M0077M0047p771J2497
26555B116n420K0161K9942j0344k8390j9784K1977o8203K7269J3126p003N4102
26543B9549M5051r15j7395K911L614k1907K9595j6951p8133k3633l024Q997j9313
26530f1554K3159Q786J6370j1868k7214m0006L309K4340N863L0615M6351p2657
26518e4506l9341q071J5882j8218Q7946Q1277L9184j7818K0751k8378k7982j461
26506D9265K0377l092k8376n608o0694n4680L5440K918m7028K556L0735J6204
26494d1983l906k5321j2133L0021K5188R063R876N755K4450k5449o6889j1265
26482h2593R48L7067M5586K7621J124n4024l9285l305j8396P6030K3489q283j8069
$$ y = [-23314, -86695, -136489, -117219, -87699, -75127, -98977, -98881, -97964, -82734, -42657, -2610, -10381, 2116, -3304, 16857, 46799, 36455, 8065, -11719, 10258, -57945, -30676, -17550, -24553, 29549, 74600, 73685, 56290, 59201, 62815, 40908, 70503, 53552, -24581, -48214, -51238, -42241, -61554, -38395, -29609, -13239, -25107, -52321, -92327, -89018, -64678, -58815, -28200, 18151, -54506, -93847, -101918, -86036, -104254, -16308, 64969, 104153, 86335, 107086, 78708, 50726, 49265, 69642, 66550, 38174, 32566, -28128, -82808, -47368, -44450, -91478, -88922, -58187, -41983, -45889, -71210, -83343, -53322, -28134, -19071, -9195, -3440, 21010, -4439, -71328, -82593, -81645, -44578, 1008, 28629, 29753, -24271, -63556, -66861, -85257, -9227, 14262, 5979, -12090]
26469a2090J9384R488n4553l0514K3930K5045R5128l2960n6660m2932M1838P064
26457g832L210j3095l1136m9937N8459R2460k5254k9128N64J4278l7931K1737
26445c605N7299j2258n2822k4980p813n605J2620j614M1972M364j9013K2845K7901
26432C9291K4129j2676j0722J3197k7969k1504K7871j3912j2404J403q6034M10
26420g8920P3364N9495K4036l1359R338K01n1695l3868K8954J3037l6236K7992
26408D339L4052J3468K1061M097k3225l3554J4222L561k8917m7915Q5403P647
26396E4239k0254K3898M5409k2353o4760m1543J439M8968o3038j7374O255J3331
26384c5783j5765J1972L1132L0173k2526j1153p3489j4302P3504P7650p105J2400
$$ y = [-12090, 7294, 16782, -37771, -68285, -44355, -19310, 75818, 42858, -13802, -56734, -14896, -7832, -4622, -17717, -48853, -98790, -40331, 52129, 26875, -2253, -1689, 12589, -25342, -3605, 53694, 41436, -11386, -36366, -44179, -49784, -37164, -38778, 3194, 7558, -11455, 11390, 39291, 63420, 50744, 40022, 53219, 25250, 3746, 31617, 17705, 5301, 6704, -79330, -78920, -5556, 53939, 77975, 46616, 55954, 56155, 4460, -29408, -454, 12583, -23653, 4339, 38391, 51859, 72920, 77017, 53792, 20238, 34460, 38021, 9104, -38811, 46592, 54239, 33985, 57883, 103292, 80939, 16179, -25364, -23925, 25043, -37995, -55369, -49114, -35783, -51548, -39576, -8444, 21729, -797, -11950, -85439, -99741, -26237, 51413, 44308, 56708]
26372E6708L0345l7109k5522o5484l0252L3266j0211l0254L0379J7366L9793n3040
26360d4015n3963N535N3990r842j1367m097K1248J9713m1849K0353J1148n8063
26348i1209p627L383R560M6587Q934j8201N97L3115J7084l3760m3284J435J5751
26335e7635j9136k2236k3934K9418M9952j0605j2143K9894K6200m9819M2454M0905
26323B3315J7250l9925q56J4190k1612k1582L1151j5887M5966Q168K8050j2880
26311E5348m7357R342r72J4443L8488N011j5707k1878l9973k2669k0954k2044
26299f8922J0526J2637O9166q163J8528P034J6898J3791n279m5902P693j0785
26287A7222M75m7711l4288R3361J9491k454J8307k3225K3009M1620k0825J0804
$$ y = [56708, 87053, 49944, 24422, -41062, -71314, -38048, -48259, -78513, -48134, -30768, 9025, -44015, -97978, -92443, -38453, -48295, -59662, -63759, -42511, -22798, -64647, -44294, -33146, -91209, -98836, -95453, -85893, -39306, -30372, -48573, -47976, -14861, 2223, -31537, -74821, -73386, -57635, -76771, -99007, -122941, -93523, -43571, -54176, -66319, -36425, -10225, -60044, -17590, 23315, 40565, 640, -216, 13974, -7638, -29220, 1931, -13956, 32010, 40178, 68228, 55348, 7991, 17333, 16361, 30804, 69292, 74303, 58596, 36718, -3255, -25924, -46878, -68922, -58396, -45759, 23407, 15244, 33772, 40806, 57704, 71495, 66216, 20314, 28007, 17222, 17697, -30014, -64302, 29059, 48550, 46096, 64403, 41178, 64187, 105807, 84982, 95786]
26275I5786K878K9740n7727Q153k4615l0544j08086J1879K3067O845N7152K5513
26263D0041n5336k874J8118k4487j5858k1604J7147K4288O078K4338K9328l4589
26251D590n1379J754M0492j4087l794J1028l5026J698J08354J7248m2985n0532
26239a2639k5955L970j6230N2008l043L6558k7001K992n13R301J9707j528m0842
26226c215k8112J2984k310K2738O4520J1736k2345m0225k5668L3482O662K2389
26214E2636K1853j3496P819k0154l2386O5475J1890n7976L5352m034o289M3184
26202A03874k8203k2287j7918l4656n7906j7937l3659j5471M2289M7221J7912
26191a6741j115l386p980N502K0569L122k3016l8229j1938m865R666k1701O6418
$$ y = [95786, 98664, 128404, 70677, 78830, 54215, 23671, -84415, -72536, -49469, -42624, 14528, 40041, -15295, -18169, -51, -24538, -40396, -62000, -44853, -20565, -14487, 9851, 39179, 4590, -46789, -45035, -4543, -18630, -22424, -11396, -46422, -44724, 63630, 80878, 37893, -12639, -38594, -34624, -50854, 1154, -1889, 34669, 7668, 10660, 10147, 19448, 39155, 37627, -3215, -31327, -18343, -20653, 2085, 66605, 78341, 55996, 15771, -9897, 23585, 30247, 52636, 74489, 60993, 68812, 48658, 16272, 81747, 93637, 35661, 71013, 66979, 60690, 103874, 75671, 53384, 35466, 810, -57096, -75033, -108692, -124163, -81874, -34653, -16741, -17856, -21242, -29222, -23720, -3151, -29, -23045, -61274, -73212, -78077, -68411, -90112, -23694]
26178b3694Q3123K7441l1395q9548l6611L8865M0839j3519L1519N2809j1350o9869
26166a390l9103J9477l0247o5622O3345O8495K6739m0700m8127N4000k6548J2121
26154g560J930q3665o9239M1332P9035L1482J4587k8557J3130o43j8532j0799
26142c7499o751L2996j690K6567M9307q724L1018o816m7948m6617n7745j1965
26130h5867K5702L4671J9038o180P34Q190m955K0716k6280L2680K1219l4759k3892
26117a8983l5288K6753M0585J462K7015n246j8655j824J7127J0322J1510r118
26105D5660j3048L3132Q076j8150q556J474l7355n9166n8244m1030P040M4773
26093i5394L0528Q890J9298L9480K877l8220l1673K9833k8926m497k2613m5148
$$ y = [-23694, 59429, 86870, 55475, -34073, -70684, -31819, 9020, -4499, 27020, 79829, 68479, -1390, -40493, -21016, -51263, -116885, -53540, 14955, 41694, 994, -47133, 6867, -19681, -7560, -5630, -89295, -158534, -117202, -38167, -6685, 7902, -20655, -7525, -8168, -26700, -37499, -44250, -11254, -12944, 13623, 62930, 54206, 85224, 78408, 30460, -16157, -73902, -85867, -60165, -25494, -6456, -12636, -11902, -3712, -8667, 12049, -14231, 18449, 39668, 4909, -18983, -54271, -27518, 13067, 14529, 41544, 36298, 17643, 15819, 32946, 43268, 54778, 45660, 32612, 65744, 73820, 55670, 47114, 48588, 11233, -47933, -106177, -147207, -140167, -95394, -64866, -55976, -36678, 2802, 5679, -32541, -64214, -34381, -63307, -67804, -90417, -135565]
26081a35565K7200N3461j8529M2634M6118M2312Q3641L4031j08722r8590J150
26070c0859Q6270q345k883L5631r266p587M221l3097o5980j0276m4509J5520O7860
26057c300M2774j8543l3326j6563j4001k4641p4765M2718P7172N5651k096J7454
26045D8534L027K1390k6357l7070l1398L7334L907r2819o9253j1512j6559L5859
26033a34917N5731O0652L9078j1736k2514K2013r903k8165l7012L2002J0882j760
26021b5649R432j1320m4477n7527J2636O2867J7614L8022k9564n95j6999l2114
26009g7674L9079K3359J5870k0796k1734Q37M6483J5211k5216p810O788k0102
25997b5705j714K7738k3714k8344r689j4821j4467K8205j5237j5274J4558K7487
$$ y = [-135565, -108365, -54904, -73433, -30799, 15319, 57631, 141272, 175303, 66581, -32009, -30859, 55411, 47066, 44183, 79814, 70548, 62961, 67182, 34085, -31895, -42171, -86680, -71160, -3300, 39474, 20931, -12395, -28958, -42959, -67600, -142365, -99647, -22475, 33176, 31080, 48534, 51561, 72951, 46594, 9524, -21874, 15460, 19367, -73452, -142705, -154217, -170776, -134917, -79186, -18534, 20544, 8808, -13706, 8307, -1596, -29761, -66773, -34771, -23889, -25649, -16217, -27537, -72014, -129541, -116905, -54038, -36424, 1598, -27966, -28561, -45560, -77674, -38595, -15236, 634, -20162, -41896, -41059, 5424, 20635, -4581, -12391, -5603, -25705, -27419, 319, -23395, -51739, -61428, -76249, -90716, -62511, -77748, -93022, -78464, -50977]
25985e0977J8741J8672j2933q6904j9824L8043N4474L7535l2478J8739L3972j4336
25973B724K6468L792n6402n1281N479J4531o262r773p773J7128M9553k4402J7599
25960a8619K4776J4186L3609j5454k953L276r784n615K7335O1074j6465p5545
25948A9821l6911k822N910J1832M1688J8521j8484l9388l2866L5461L0170Q114
25936D1046k028m7276M953J6399K9268k5326l2868p578O204J7162L7910j3353
25924B4513j1135r070j3635L9248o74j6473Q46l7334J9973O4669P358K4471l3016
25911E9741n6653Q75L3221N872k6556M139r832k6877L5347J5671k549j4123J0304
25898B8580J6910m6444n104k4306k4026L3407K6929P549K6201K7420l0022m4588
$$ y = [-50977, -32236, -13564, -26497, -113401, -133225, -95182, -40708, -3173, -35651, -16912, 17060, 2724, 29192, 32984, -23418, -74699, -69220, -54689, -60951, -70724, -78497, -61369, -11816, -36218, -18619, 6157, 20343, 53952, 38498, 35545, 38821, 29037, 23422, 50757, 111831, 95366, 19821, -17090, -19912, -14002, -2170, 39518, 58039, 39555, 167, -32699, 2762, 32932, 41046, 39018, -8258, -3305, 13094, 42362, 17036, -15832, -23410, -17206, -44, 37866, 24513, 13378, 4308, -9327, 29921, 29247, 12774, 13620, -23714, -3741, 60928, 68286, 92757, 59741, 3088, 3963, 37184, 43056, 16500, 20639, 10807, -16070, 19277, 34948, 32399, 18276, 28580, 45490, -954, -6058, -30364, -54390, -20983, 5946, 13495, 39696, 67116, 37094, -7494]
25886g494M2277K4462k3696k8644k1312Q645K7366o2013k2552j2398j8846L3783
25874f0422l1546j7750K0527K6459J7635O2997m2525l7289k5911N5951O2006j1005
25862A9127m9243k2545j7273N0026L2401K0878J6567l0095m4951Q649J2995m3383
25850d6847m1638M4703O4413n2067l2082M3107M3459j2284M5566p14J8841j8929
25838E5528n283n8238l85L1778J7164J0186K1032L4845r390p993r783j8818K6060
25825H6703q922j9706n123j8910k0364j7923j0828j0634K8855p999j810J7917
25813A1256Q682O6314k1282o8952O5961k2924n3908m2602J3978O2872J6158l4832
25801G21n0658j9585M8425J6556M2652n989k5557n018r770k4746L9678P2065p0341
$$ y = [-7494, 34783, 59245, 35549, 6905, -14407, -5762, 21604, -40409, -62961, -75359, -94205, -60422, -91968, -109718, -89191, -62732, -45097, 17900, -24625, -61914, -87825, -31874, 30132, 19127, -30116, -52661, -69934, -19908, 12493, 33371, 49938, 19843, -25108, -16459, -3464, -46847, -88485, -43782, 20631, -31436, -63518, -20411, 23048, 10764, 56330, 55616, 74457, 55528, 50245, -7993, -8378, 23400, 40564, 50750, 71782, 106627, 97237, 89244, 79461, 60643, 86703, 77781, 58075, 52952, 34042, 13678, -4245, -15073, -25707, 3148, -4851, -6661, 11256, 19938, 86252, 64970, -3982, 61979, 39055, -14853, -57455, -43477, 19395, 35553, 721, -49937, -69522, -21097, -4541, 38111, 32122, 6565, 1547, -8223, -32969, 6709, 78774, 8433]
25788H433m2074n1890P1112O7604l7254j787L0781j7037k9097l8418K2719K7947
25776A1039p5794N6298K3532r7k6179l0145K4798k2276K3088q416L0500K9894
25764C6242j983l4484o855p659j0738k829l5449N866l9494P2288L7509j0297m3140
25751d1023j7782j9337m7234L8227O2919J5455l3348j3742K0808n1898J9239L1335
25739c6381O3152L2243m033n2872j2887J3556J3445N946N8642J6406n7335l4035
25727E847L778j8407l6727J0733M7641Q843m447O5203j4538m2106k2087K6955
25715C0688l6305J6136N3229J5510N5790o3754q2302R780l234l282K0762K4814
25703C7832J0470K6541J7488l4182j3653n5500m3177J9921j411K3183q85n6436
$$ y = [8433, -33641, -85531, -14419, 53185, 15931, 14144, 44925, 27888, -1209, -39627, -16908, 11039, -64755, -8457, 15075, 14978, -11201, -41346, -16548, -38824, -15736, -24152, 6348, 36242, 34259, -225, -7080, -14739, -25477, -28306, -63755, -57889, -97383, -25095, 12414, 2117, -41023, -58805, -78142, -125376, -87149, -24230, -8775, -42123, -55865, -35057, -86955, -67716, -36381, 26771, 59014, 54981, 2109, -10778, 2778, 16223, 22169, 80811, 97217, 39882, 5847, 9625, -8782, -45509, -34776, 12865, 21708, 17261, 82464, 67926, 25820, 3733, 30688, -5617, 10519, 63748, 79258, 135048, 71294, -11008, -1228, -4462, -7744, 13018, 37832, 48302, 74843, 92331, 58149, 44496, -11004, -54181, -34260, -35671, -12488, -13373, -69809]
25691f9809k9945Q6620J05695O2354K2227l6364r6952k6639J5194m2684l3819
25680d4122q64K5459p4626K1589O8732L1470R387L58M244m8851M8530K4624m8239
25667A7691m7843J4403L0149j0320j705J7712N678J966j5194m6053M988N6362
25655B7834K2703k6129J2776N1253k0277k4830m0245l5306m287J3493l1156j8299
25643g2470N349J8965M9941M940m1793k291L5136L6429j2530k7803M9134m8995
25631e988n3905K6479j0260J066M511j6863k5704k2015J5239j6637K9248Q4512
25619I683J5989J89r217N4657J2493j4828j0031n9973k6722n492l5012L8525R6122
25606F6383K5996J1550l6706l7131o7497j1568L9551M193k597k6387O838K3869
$$ y = [-69809, -99754, -13134, 92561, 154915, 177142, 140778, 43826, 17187, 32381, -10303, -44122, -44986, -19527, -94153, -72564, -3832, 27638, 37025, 37383, 41627, -7224, 41306, 65930, 17691, -30152, -15749, 14400, 4080, 2375, 20087, 25765, 27731, 12537, -33516, -28528, 27834, 50537, 24408, 37184, 88437, 68160, 43330, 3085, -32221, -36508, -23015, -54171, -72470, -67121, -48156, 1785, 6725, -35068, -37359, -2223, 34206, 21676, -6127, 43007, -5988, -59893, -33414, -43674, -42608, -38097, -54960, -80664, -102679, -87440, -104077, -74829, 9683, 25672, 25861, 16644, 71301, 83794, 68966, 58935, -1038, -27760, -33252, -68264, -29739, 66383, 92379, 103929, 67223, 30092, -37405, -48973, -9422, -5229, -7826, -34213, -27375, -3506]
25594c506l4544J5160n085J592r554k7881j6115J1362M0867l7666l1014J00531
25582D147J1771k2280k7985O287L5382j6027j5143j6959k2845j7807j1978l8648
25570a32085J3817N8538J2279n2330K2738O1675P267l8864l0349K6929P306M4165
25558A086L4896K0849j933N287m534j749M8176j000o5162l2167j3631k94L8157
25545B7981k8794p9445j4061K5059L1134N4661N8451M0653m5114l7482k2329L8083
25533D8797n0637O8819K9329Q397k4875m9477o5895k1337O445o597Q6902L4529
25521F4400J2774k5084m2406j0113m0128K3803O299L4540l903k4019l7431k163
25509d3431j5193K078M9692P478j487l820J8453j9487k3361k7236k2639P3071
$$ y = [-3506, -38050, -22890, -27975, -26383, -35937, -63818, -79933, -68571, -27704, -65370, -96384, 4147, 15918, -6362, -34347, -28060, 7322, -8705, -23848, -40807, -63652, -81459, -93437, -132085, -118268, -59730, -47451, -99781, -77043, -15368, -8101, -46965, -77314, -50385, -43079, 1086, 35982, 56831, 54898, 60185, 55651, 53902, 102078, 101078, 35916, 3749, -9882, -10176, 27981, -813, -80258, -94319, -69260, -38126, 16535, 74986, 115639, 70525, 33043, 10714, 48797, -1840, 66979, 96308, 104705, 79830, 30353, -35542, -56879, -50434, -57031, 29871, 64400, 77174, 52090, 9684, -429, -40557, -16754, -10455, 24085, 20182, -3837, -41268, -43431, -58624, -56546, -6854, 624, -863, -4683, 13770, -5717, -29078, -56314, -78953, -5882]
25497e882N7091l4086M6273r513L0434O0234j6141m5933k9032l7108R673n986
25485B0024J1422J3567q7639K1960P01K48N7868Q149M6594J351m1333N884m9347
25472I449j6737k3148p948K0344J4338R050L5046j14m0066o9662K4141K9743j9241
25459c4805M8154r528L4197J8505k7641k1741l2039R192J3797m943n3640r8501
25447a58993M3819L9776P0708j7297n3994O837R420L2778k9204J1208L9944l3653
25435c8651o736k6392J6582N52L6038J7573k623n598O255l3195j0927K3756N3641
25422C0275K9067m0810l4073M2858P3658N512q2318l0733p534l769L5098m8591
25410c1360k2686j0222k5019l8645m0524M5650J6139n450R0595J495n8060j4802
$$ y = [-5882, 51209, 17123, 63396, 53883, 84317, 144551, 128410, 82477, 53445, 16337, 26010, 20024, 31446, 45013, -42626, -20666, -19965, -19717, 38151, 46300, 92894, 94245, 52912, 58796, 9449, -7288, -30436, -38384, -18040, -3702, 5348, 40394, 40280, 214, -69448, -45307, -15564, -34805, 13349, 3821, 38018, 56523, 28882, 7141, -24898, -15706, -1909, -6852, -60492, -158993, -115174, -75398, -4690, -21987, -75981, -69144, -59724, -26946, -56150, -44942, -4998, -38651, -45387, -71779, -55197, -54645, -18607, -1034, -3657, -9255, -3000, -36195, -47122, -23366, 30275, 59342, 18532, -15541, 27317, 100975, 106487, 24169, -6564, -14098, -17867, 17231, -31360, -54046, -64268, -89287, -127932, -168456, -122806, -106667, -112117, -21522, -20027, -78087, -92889]
25398i2889j457m2000k582O299R7538J35288J3652r3489j1881P474k2264K4923
25386A8612p8342L157J2344p756j0783j2181N2322Q5909m3254m2697r5697K1336
25374i7030L1459J6206K8145o8464o0175Q6867O1105j5219M6465J8766O01K8129
25362G6855n6457k1016j3151N1279K8471j414o5892J5648n4567r597L0978K9606
25350A0743K0686m452o3847k8608k0895L7038O8153Q210r837N4548M245l5052
25338D0932m8217l9370J287L8046j1359l2662J7309L6793J9423K5847p540m6934
25326f445k3615L6055n816l4033N217j2411o616k4280K6653M4294L6555j8742
25314A6816J8089j6687n793j5232j6967Q932J0325J0937k4991J2711K0066o3306
$$ y = [-92889, -94346, -136346, -138928, -132629, -35091, 100197, 113849, 20360, 8479, 15953, -6311, 18612, -59730, -56573, -44229, -51985, -62768, -74949, -22627, 63282, 20028, -22669, -118366, -97030, -65571, -49365, -21220, -89684, -149859, -62992, -1887, -17106, 29359, 48125, 48726, 76855, 20398, -618, -13769, 37510, 65981, 64567, -1325, 14323, -40244, -49841, -18863, 10743, 31429, 26977, -36870, -65478, -86373, -49335, 18818, 27028, 17191, 71739, 75984, 40932, -7285, -46655, -45368, -7322, -18681, -51343, -34034, 2759, 22182, 48029, 40489, -6445, -30060, 5995, 179, -33854, -28637, -41048, -47664, -71944, -45291, -997, 35558, 16816, 34905, 18218, 12425, -2807, -19774, -10842, -517, 10420, -14571, -1860, 18206, -45100]
25302d5100n387J2188J3367l924j1043J2515n268m7317J998j551L6424K5960j3887
25289c1025K4765K2300l5942Q482m1937r674P9881L5089L0533m6793n7782j7077
25277c9180J699k5059J601K8187J4765L6531K7539k7653m3333l1720k441k5961
25265h5025J7123R462k4616N724l821R4398K1978p055k125m0936j8052j6773R21
25252d8797K1149k9168K0703j9130n576O7375L2779j8030J5594J0749m5603j1286
25240i241o5512k5268j7777J5702J0180L6219K0489J0108R60p003j6987k2175
25228g0305N6550M6553k163r158k5876l3330R687M8369M835r669n921M8991j3641
25215D4922n4171o032N911m4912k5416j7817J0028R864K3644L3424l396l6547
$$ y = [-45100, -50487, -38299, -24932, -28856, -39899, -27384, -32652, -79969, -77971, -79522, -43098, -17138, -31025, -6260, 16040, -19902, -11420, -53357, -63031, 16850, 51939, 82472, 35679, -22103, -39180, -37481, -62540, -60939, -32752, -17987, 18544, 46083, 18430, -24903, -56623, -59064, -85025, -67902, -58440, -83056, -77332, -81153, 13245, 35223, 28168, 26043, -14893, -32945, -49718, -48797, -27648, -56816, -36113, -55243, -60819, 6556, 39335, 21305, 36899, 47648, 2045, -9241, -74753, -100021, -117798, -102096, -91916, -55697, -35208, -25100, -24140, -31143, -48130, -70305, -13755, 32798, 30635, 21477, -4399, -37729, -28042, 20327, 25162, 15493, 9572, 58563, 44922, -9249, -15281, -9370, -54282, -79698, -97515, -87487, -77623, -53979, -20555, -23951, -60498]
25203f0498k2592O7048K9337J1413m0471p0067N8052M1474k5877J4388m6266k3633
25191f7692j0960M9847O3811N5499l1911o2300K5011N8944j151l8993m3585j0820
25179a4300N1110r177o9267N3589M5797o9559l0977K9374N2155k4299k6875J0823
25167a606M4461q973l792j8047p478k1080K1831p091j106j1565m3113J4160K8160
25154a5239L0225j7563N957L8760l027J4336m246N083Q566l6542q423N197l6865
25141a3781K8417m26j0507j5560l0487l4555K1048N7585J08480M6713q7137m5188
25129B4602K5520J924q8767j8475L8659j6607L5612K1763m5590M24Q548J7073
25117D686k1376k1814n5997K0508J14360r616n4235l807N282K1354K9056P5k0205
$$ y = [-60498, -83090, -16042, 13295, 24708, -15763, -85830, -27778, 13696, -12181, 2207, -44059, -67692, -78652, -28805, 35006, 90505, 58594, -3706, 21305, 80249, 79098, 40105, -3480, -14300, 36810, 27633, -41634, 11955, 57752, -11807, -42784, -13410, 38745, 14446, -12429, -1606, 42855, 33882, 30090, 12043, 4565, -16515, 5316, -1775, -2881, -14446, -57559, -43399, -15239, 14986, -2577, 3380, 42140, 39113, 53449, 49203, 54286, 62852, 26310, 17887, 23084, -13781, 14636, 14210, 3703, -11857, -42344, -76899, -55851, 1734, 110214, 156927, 69790, 24602, 50122, 52046, -36721, -55196, -16537, -33144, 2468, 24231, -21359, -20935, -12387, 4686, -16690, -38504, -94501, -73993, 40367, 30751, -23484, -27291, -22009, -655, 28401, 28476, 8271]
25104H271l076J5948N487m2339L8725K0116j7128K7340k5497m0528K1537O220
25092A5076J661J0834O560K3372o0402m2357q351R070O1839L8637m8648j6670
25080i379M0846O000J1208o00n1098o7035o5093O584N3167L2381J1567l9294o0229
25067a30975J14080O6568p0722k4071L6804k5165K2471j8201n5445J0004k380
25056g7032M9548j8646k0053n2937J6744O5823L7622K4980J3572J303l2138R883
25044A8669K1105j7346k8457J4897P1324J2736k9957l2621J522L7417L122N645
25032G8056K3269j4769M01o7871m6623n85M5766J8956M048N1202P1697r641q7372
25019F6534j14503J1572M6311M8091k1493l935M585j3715j1376n6463m2113k1562
$$ y = [8271, 5195, 21143, 26630, -15709, 23016, 43132, 26004, 53344, 27847, -12681, 8856, 15076, 16737, 27571, 34131, 57503, -2899, -45256, -53607, -44537, 17302, 55939, 7291, -9379, 31467, 37467, 48675, 48075, -3023, -70058, -135151, -128567, -75400, -43019, -31452, -70746, -130975, -16895, 49673, -21049, -45120, -8316, -33481, -11010, -29211, -84656, -74652, -77032, -27484, -46130, -66183, -119120, -102376, -36553, 1069, 26049, 39621, 40924, 8786, 18669, 39774, 22428, -6029, 8868, 80192, 92928, 62971, 30350, 31872, 69289, 72411, 78056, 101325, 86556, 86957, 19086, -27537, -28122, 17644, 36600, 40648, 91850, 163547, 153906, 66534, -47969, -36397, 9914, 58005, 36512, 32577, 37162, 23447, 12071, -44392, -86505, -108067]
25007a08067r213L8833M6525O9714N0636k6730J4366j0645m445o3982k0039L0281
24995G234K0119K7196k7832p8646p648Q0886k640o0456m0380k1110l455K8861
24983g7871M8785L093K5287l8615L041n475k5889k942M1647k8050k5630J6365
24971f6254N8450q789l3791P027Q2623N28n0115Q749M4314N6K263N7872L667K0422
24957A27022j8874n6762o2419J3629j4070M482P001J8036l4744l175L9856J6284
24945C6266J6412l8388j6862q017M9417K5867l6760k3641l4243N2288M8837L8396
24933A09572m3333M518k4674Q591m1373o6683j9742r31K7739K321L3588J1553
24921A146n8246l1687K0493M2579K1228N8108K4025k2723L0760l2008q1143j03893
$$ y = [-108067, -117280, -78447, -31922, 37792, 88428, 61698, 76064, 65419, 60974, -3008, -23047, 7234, 27353, 54549, 26717, -51929, -59577, 21309, 18669, -41787, -82167, -103277, -106732, -77871, -29086, -25993, -706, -39321, -36280, -41755, -67644, -70586, -28939, -56989, -82619, -66254, -7804, -16593, -50384, -43357, 39266, 39794, -10321, -1572, 42742, 42798, 45061, 102933, 106600, 127022, 108148, 51386, -11033, 2596, -11474, -6992, 9, 18045, -16699, -19874, 19982, 36266, 52678, 14290, -2572, -10589, 38828, 64695, 27935, 4294, -29949, 22339, 71176, 109572, 66239, 70757, 46083, 54674, 13301, -53382, -73124, -74055, -46316, -43995, -10407, 1146, -57100, -88787, -68294, -25715, -4487, 53621, 77646, 54923, 85683, 53675, -27468, -131361]
24909a31361K5774M9379j4493K6039J0309L1785M0445L5388n593q6914k4691j8555
24897f2488m0142K1831L9653K1230N1191j2066n7588j5752N8333N4504j7992n2710
24885a1996L4J3732j0364l9316O0175O8997n2227k4186K7152M4822M3070o1885
24873E8008k8180l6341m4934M3174J4859L4156l4287o1790M3424L2157j3957m7416
24861d1127n87m870N7316J9290m2484K164o96M7712l0748J697j4416l0388k4323
24848f1460q426L2769M7288J1954n6807k384j0844Q089j5008K8031K0016L0851
24836B4069J8011K5753p2851o5201l889k5460K2641K0104K3030l054j658k7019
24824f5524j1813P4991J5568j2557L2256l7845m7714j1208j226L6688j9546n2971
$$ y = [-131361, -105587, -56208, -70701, -44662, -34353, -2568, 37877, 73265, 67672, -19242, -43933, -62488, -102630, -80799, -41146, -19916, 31275, 19209, -38379, -54131, 4202, 58706, 40714, -11996, -11962, 1770, -8594, -47910, 12265, 81262, 29035, 4849, 32001, 76823, 119893, 58008, 29828, -6513, -51447, -8273, 6586, 40742, 6455, -55335, -11911, 20246, 6289, -41127, -41714, -46584, 10732, 30022, -12462, -10298, -10994, 36718, 5970, 7667, -6749, -37137, -61460, -69886, -37117, 10171, 22125, -34682, -37066, -47910, -39821, -54829, -26798, -6782, 24069, 42080, 67833, -5018, -70219, -74108, -99568, -76927, -56823, -33793, -36847, -38505, -65524, -77337, -2346, 13222, 665, 32921, -4924, -52638, -63846, -65072, -28384, -47930, -100901]
24812a00901n036M5884L6637k919K5665J8418l9861k6608L6074l9012K8256K8788
24800E385J328q145M890j3783K356J7123L1458j6505m6124R73p060J0092k8185
24787d6197l701Q9192N5352m7692m6369L0419K3101P923m3086m677N9569n2125
24775B1709o5235N999O6839P1921K026O770j0235k2929m9492O670L1598k682J8711
24762H1670l2422m4532K3328k9999l5166M4711M2629K1163n5790n8644J4141o749
24750c5660O2482r858K7716k8929J2999J0493l723P49l0915m0078J5925K9854
24738A1055J5926J724N205k4148J1176J6649n6825r1539p2806L6206J30733N3781
24726C7137L046j8410k3007k4540j3626k584K5396n1352J3449K771J5486p261
$$ y = [-100901, -105937, -60053, -23416, -26335, -670, 17748, -22113, -48721, -12647, -51659, -23403, 5385, 6713, -1432, 3458, -10325, -7969, 9154, 40612, 24107, -22017, -21044, -28104, -18012, -46197, -49898, 39294, 94646, 46954, 585, 31004, 54105, 62028, 18942, 14265, 73834, 21709, -43526, -37527, 29312, 101233, 103259, 110029, 99794, 76865, 27373, 34043, 65641, 62959, 81670, 49248, 4716, 28044, -1955, -37121, 7590, 50219, 71382, 15592, -43052, -28911, -35660, 26822, 16964, 44680, 15751, 28750, 39243, 35520, 36269, 5354, -34724, -18799, 11055, 26981, 28705, 33910, 9762, 20938, 37587, -19238, -110777, -183583, -147377, -16644, 37137, 40183, 21773, -1234, -25774, -39400, -41984, -16588, -67940, -54491, -51720, -36234, -43495]
24714d3495K7954N2640k4554q2494r814k4045M1877L1174j1801l1326m1117J9448
24702i5553K8672K8061p060j8631k2904k5480l2446M9055N4736J5821L0463k5114
24690b0380j38K0397J9202m8308m134j5649J049K9479L0337P407l1850M8217N7087
24677I2716p1939l2603j353M6463j0901k9275O0858o993q3430j7851R3526J4558
24665E3776j3668k9430k9213r879M7871J5625P212j9761j8291K3264o5305j1302
24653d9101L0640J0409L9511K6310j1203k887k5111l2266P825L9535L6324j0595
24641E9391n2488n2900K0427K232N0679j7370l6449m1862j5319M1541M0622J0610
24629I114k4058L2511L7504j9327k3851J6220j5653l1014L8418J3198k1520Q705
$$ y = [-43495, -15541, 37099, 12545, -69949, -79763, -103808, -61931, -30757, -42558, -73884, -115001, -95553, -66881, -38820, -45880, -64511, -87415, -112895, -145341, -96286, -41550, -25729, 4734, -20380, -20518, -121, 19081, -29227, -33361, -49010, -47961, -18482, 11855, 19262, -12588, 35629, 92716, 20777, -11826, -13179, 33284, 22383, -6892, 53966, 46973, -36457, -54308, 39218, 53776, 40108, 10678, -18535, -28414, 19457, 35082, 42294, 22533, 4242, 27506, -37799, -49101, -18461, -8052, 31459, 57769, 46566, 43679, 18568, -13698, -5873, 33662, 69986, 59391, 6903, -45997, -25570, -23338, 27341, 9971, -26478, -68340, -83659, -42118, -1496, 9114, -14944, 17567, 55071, 35744, 11893, 28113, 12460, -18554, 19864, 33062, 11542, 20247]
24617B0247m974K4272L461m577r384K9506j9078K478j0757Q437k1513o031o349
24604E738J0134N1689J8518j5744K1222j1606r603n7989l1363M4167n7500o9199
24592a01536K796R1388m402p4496j2831M5556J1530n2528j8766R2505J13909j010
24580I2115J201n5695P135k7363K210K5314l0365J9318L239m413j4166p787K1964
24567C2707O018l8462J0536j4129j1666K6554M4179n302m3996l2584l5345N8198
24555c292N5915J8780J3927n2985M423J8615q074L9227K5582j8320l8121o381
24543D9296j3723o2889m4203P607o963R920L2636K2282o053l0142M2234j7890
24531a7888J5292L2024j5471Q04L8669M8377n306k5374n3458m0155q2691J4138
$$ y = [20247, 15273, 39545, 43006, 38429, 29045, 58551, 39473, 41951, 31194, 39631, 18118, 12087, 5738, 15872, 67561, 86079, 70335, 91557, 79951, 70348, 12359, -19004, 25163, -32337, -101536, -98740, -7352, -11754, -86250, -99081, -53525, -41995, -94523, -113289, -20784, 93125, 92115, 93316, 37621, 44756, 17393, 19603, 44917, 14552, 33870, 37109, 32696, 18530, 10743, 32707, 38725, 263, 10799, -3330, -14996, 11558, 55737, 50435, 6439, -26145, -61490, -3292, 52623, 71403, 85330, 32345, 36768, 55383, 47309, 86536, 112118, 93798, 55677, 49296, 35573, -27316, -71519, -63912, -70875, -60955, -28319, -6037, -12090, -42232, 2, -17888, -2596, 29428, 13957, 14761, 53430, 101807, 96501, 71127, 17669, -22486, -105177, -91039]
24519i1039O3683l6555o881N2857L5312M5881j7293m3466K307Q577J2059O149
24507C1591J007M245m0294K574J6004n668P927L6747M004N793o233q58o5371l3960
24493d2492M5092K5664m2031j7179J3620L5530J2998k8333J1692K5048M0202m0441
24481C9370j0141K1769L3525L7295k0408j3478J2983p1599m3776j4939j4169k0564
24469f4132N1794M5880M565N6965j9434l1073l3011p0461k3945N3709N2683M9775
24457G3315L0874k6443L2187O579m5682p3516o1304k9256O3920K9842K0013o902
24445A3627k4749k8069j8364j2490M7794q517L218K6921l7304M865P016l1047
24433e7099R190N02k3844P323K6629r411n211m5886p109L7886K4710k2496k4113
$$ y = [-91039, -27356, -63911, -70792, -17935, 17377, 63258, 45965, 2499, 4806, 13383, 25442, 31591, 32598, 36843, -3451, -877, 15127, 9459, 17386, 54133, 58137, 63930, 57697, 56839, -8532, -42492, 2600, 28264, -13767, -30946, -17326, 18204, 31202, 2869, 14561, 39609, 79811, 39370, 29229, 50998, 84523, 121818, 101410, 87932, 100915, 29316, -14460, -29399, -43568, -64132, -12338, 33542, 38107, 95072, 75638, 44565, 11554, -58907, -82852, -29143, 23540, 73315, 104189, 77746, 109933, 116512, 70830, -2686, -63990, -93246, -29326, 516, 20529, 13627, -11122, -39191, -57555, -70045, -22251, -30768, -27550, -629, -37933, -33068, -26052, -57099, -47909, -47407, -71251, -63928, -37299, -46710, -51921, -97807, -104916, -67030, -42320, -64816, -88929]
24420h8929N8543l2107j009K776p31J6779l3542P745K7131K5353K9763J8222J0018
24407D0012N3742j5001p5743m0598p944L5337l0497K1120J397L76R6741r926n6018
24394A2998k9617l0606n580L7228j8536q6048K7127O6575J1246J0376k0660o995
24382c2492O8129J3364j047q975j7524k7283q201n945l5170L1488M9133m4192
24370a8715n3066J5694J3963J5348j5294L3582N9128k7538k3135j4690m2708K2507
24358c4924K5331r426l3638L0344K2986l4275j9619k9315k88L9426K7645M494
24346a1259P739k554m3646l2555l7759J4646o780j4695K9889L9445L1811J6584
24334i134k3838J786k94j4747M510l742L7192J1779l0372l1014k0216L3837Q0892
$$ y = [-88929, -30386, -62493, -63502, -60726, -61457, -44678, -78220, -70475, -43344, -17991, 11772, 29994, 40012, 93754, 78753, 3010, -37588, -45532, -10195, -40692, -19572, -18175, -17799, 78942, 69016, 12998, -16619, -47225, -52805, -15577, -34113, -120161, -93034, -26459, -15213, -4837, -25497, -32492, 35637, 49001, 47954, 38979, 21455, -5828, -14029, -19974, -55144, -23656, 25477, -18715, -71781, -56087, -42124, -26776, -42070, -8488, 50640, 23102, -33, -14723, -57431, -34924, -9593, -19019, -52657, -22313, 673, -33602, -53221, -82536, -82824, -43398, -15753, -11259, -3520, -6074, -49720, -82275, -120034, -105388, -112168, -126863, -96974, -57529, -25718, -9134, -32972, -31186, -31480, -46227, -41717, -45459, -8267, 3512, -26860, -57874, -78090, -44253, 36639]
24321C6639k8440j0057J602j6983k6761j0708L0290K6348l921k8148K9156M6644
24309D5661o996o8833k3587M3000J3214L6293j0522j3498k1381L6707M0482j9039
24297E1501o2934o5182M8464N9529K007j5034l5577M356K6405j9621J0532J5979
24285B0425j9724k009j1497k8872k8117K1066M0354j0607K535l0785j8128l1984
24273i7343k0624L5176p890M5495L8177n0765J4057J2835K7305R5449Q970m0227
24261F0615l6122P3739P741m0944l4238l2995L0259Q003l3057j9319K5572O6770
24249G6024J2864m7943n867j4166k4730k1231k5285l3311r40M7740J0034k4077
24237e0888O5220K5418K7629K3160m4578l2132k4r369n0002P135M1612m4229l8042
$$ y = [36639, 8199, -1858, -256, -17239, -44000, -54708, -24418, 1930, -1991, -30139, -983, 45661, 38665, -30168, -53755, -10755, 2459, 38752, 28230, 14732, -6649, 30058, 70540, 51501, -11433, -76615, -28151, 31378, 33385, 18351, -17226, -12870, 13535, -6086, 4446, 20425, 701, -1308, -12805, -41677, -69794, -48728, -8374, -18981, -16446, -47231, -65359, -97343, -117967, -82791, -90681, -45186, -7009, -57774, -43717, -30882, -3577, 91872, 100842, 60615, 24493, 98232, 105973, 65029, 30791, -2204, 28055, 36058, 3001, -16318, 9254, 76024, 88888, 40945, 35078, 20912, -3818, -25049, -50334, -83645, -84585, -36845, -26811, -50888, 14332, 39750, 67379, 90539, 45961, 13829, 13805, 4436, -45566, -38431, 3181, -41048, -79090]
24224g9090J0105P1383M9952k6785l6712l3253j6185j2900M0335P3868L8576J845
24212H1139n8L7399p3261m2642P2307J3978n4778M652J9353j0369k5575P8586
24200A00731K0395l5720k9861j07265p2207J1494K2255Q0997O9875k385K979k6473
24188C4815q233j8853K861K7411R1292M421r8298l4739P393j1431p302N249K2063
24175A6649M441k7096J1819q723r9064L7943L0284J1376q430K563k8329m5338
24163a01905K0661L6056L77J1445K1736J0337M2502p355k4256K177R742L8278
24151E9795K8222m5838j9687J22l6199J6733P3268J7586j6959j0857o2455o423
24139b692P4355L7689k8768K5196K5424j5505m5500k5807l8318J9764K7184r391
$$ y = [-79090, -68985, 2398, 52350, 25565, -11147, -44400, -60585, -73485, -33150, 40718, 79294, 81139, 81081, 118480, 45219, 2577, 74884, 88862, 34084, 38736, 58089, 47720, 22145, 100731, 121126, 85406, 55545, -51720, -123927, -112433, -90178, -9181, 60694, 58309, 61288, 34815, 26582, 7729, 10590, 38001, 129293, 133714, 35416, 677, 8070, -3361, -10663, -5414, 16649, 21090, -6006, 5813, -2910, -101974, -64031, -33747, -22371, -30801, -28238, -56567, -101905, -81244, -45188, -44811, -33366, -11630, -1293, 41209, 33854, 9598, 11775, 21517, 59795, 88017, 42179, 22492, 22614, -13585, 3148, 76416, 94002, 77043, 66186, 3731, -2692, 71663, 109352, 80584, 105780, 131204, 115699, 70199, 44392, 6074, 25838, 53022, 43631]
24127D3631j5469k2012J070o2894k1241J6424j7363P05J6482n0174n3041J2569
24115a51313N6965M7590R535n038p709k7718J5024m8571n9056L8634M9801O0284
24103b1572R1271K3401n2745n9314n419K8634k1951K4290J4715l2967k6356l3543
24091g1556N7088M6247K4955j2342L9007n8290n3447J0748L0291l0041J1823L3071
24079B7554P233l4716j0109j2772j4781m8438K2193M8200J3920K040l7199J4214
24067b2661L6805M8603j3927q1488j2831P2720J6972m1921J4362n5515k3102K3732
24055c8251K7475L651J9102K6056Q262j8676M2357k2466o1689l217N438L8492
24043B6534J666j5111k5573K4964K8429k3753K3083J7356p191O791j4833j4485
$$ y = [43631, 28162, 6150, 7220, -55674, -76915, -60491, -77854, -77149, -60667, -110841, -163882, -151313, -94348, -46758, -37223, -42261, -49970, -77688, -62664, -111235, -170291, -131657, -81856, -21572, 69699, 93100, 40355, -18959, -24378, 4256, -17695, 6595, 21310, -11657, -38013, -71556, -14468, 31779, 56734, 44392, 83399, 25109, -28338, -17590, 12701, -17340, -5517, 27554, 34787, 71, -10038, -22810, -37591, -86029, -63836, -15636, -1716, 324, -36875, -22661, 14144, 62747, 48820, -32668, -45499, 27221, 44193, 2272, 16634, -38881, -61983, -38251, -10776, -7125, 11977, 38033, 46295, 27619, 69976, 47510, -14179, -17396, -11958, 26534, 28200, 13089, -12484, 12480, 40909, 17156, 40239, 57595, 50404, 57195, 42362, 27877]
24031B7877K7171o8205o9003N2401N9813K9030o3039k8035K2288q596K4701J4827
24019B1230O555Q477k081K914j6261o6102J6900J653l8189J378J5929O542N1385
24006A0330P335j6967L119N3664M3416k6425m4678l4041n4128k0483m0249K7406
23994i1701O8542j7152l6930O45l0547l0671J316m361J7036N5421l416k583j1917
23981h6318R693J8963K868o583j1666L2084m1871k1944M2882K6530j0274K1011
23969b4625R851J8607q788P558j6421j6159K9465N3270N5724Q079o7948r1284
23957d2671p984M9844m7943l945k1261J1849N3193j9681M447L8902m340j1073
23945f63p1202j0275L2413j698k7741K203K8738k6425K3096l1259l1674k0606
$$ y = [27877, 55048, -13157, -82160, -29759, 30054, 59084, -3955, -31990, -9702, -18298, 6403, 21230, 27785, 36262, 34181, 37095, 20834, -45268, -28368, -26715, -64904, -63526, -47597, -41055, 10330, 17665, 698, 3817, 57481, 100897, 74472, 29794, -4247, -58375, -78858, -119107, -91701, -23159, -40311, -77241, -76596, -107143, -137814, -136498, -140859, -123823, -68402, -71818, -74401, -86318, -76625, -57662, -54794, -61377, -73043, -40959, -82830, -104774, -61892, -35362, -45636, -24625, -14774, 3833, -4955, 2603, -13818, -29977, -512, 52758, 108482, 116561, 48613, -42671, -50655, -811, -48754, -52699, -73960, -62111, -8918, -28599, -24152, 14750, 10410, -663, -71865, -82140, -49727, -51425, -79166, -76963, -48225, -74650, -51554, -82813, -114487, -135093]
23933a35093j041K5313K5158k454k4756j2885m5661k9774N0808M2226J9988J2842
23921g5329j6792j5807J6368Q7604M9350m0226o9818j7576L500l126k246O0525
23909b3573J8174k3348O637L2317O7162L7320j4631q0877n0956l3665K6859L4788
23897c793J1850k7079K2533J4918J2161J2188M0186j4045k1286r903L3213K3205
23885I4148j163k2953J6756j9669p8142L9409J4942n591n3518K0731j4258J734
23873g574K4655J7920J1675m662m9397j943L5776K3002k9624n7105k7236l1469
23861i5982l198k1508K2765K7337M1541M1241M3766m6840n1125j8172J6670J3706
23849b9799N7531J8615l2160m2718l399K9141Q8160J5769m2577q999q1403m4013
$$ y = [-135093, -136134, -110821, -85663, -88117, -112873, -125758, -171419, -201193, -150385, -108159, -88171, -75329, -92121, -107928, -91560, -3956, 45394, 5168, -64650, -82226, -78726, -81852, -84098, -23573, -5399, -28747, -22110, 10207, 77369, 114689, 100058, 19181, -31775, -65440, -38581, -3793, 8057, -19022, 3511, 18429, 30590, 42778, 82964, 68919, 47633, 37730, 70943, 94148, 92985, 70032, 86788, 67119, -11023, 28386, 43328, 37737, -15781, 4950, -9308, -7574, 17081, 35001, 46676, 42014, -7383, -9326, 26450, 49452, 19828, -37277, -64513, -95982, -99180, -120688, -97923, -70586, -29045, 12196, 55962, 9122, -42003, -60175, -43505, -29799, 27732, 46347, 14187, -28531, -31930, -2789, 85371, 101140, 58563, 49564, -31839, -75852]
23837g5852j3879J083j3833o5419M21J23562R3218P693j3225m8516r273J6489
23825B469M6619N5844k3235l5056J6727N331l5433n2641l3781j0922k430n311
23813g1819L873n035P0042j5603M0929O9635l5785l4861L5806N385J7153j690
23801G8030q365j6738l574j6131o4546M7840L4686l4444k4705M9386P546j1030
23789C7955M3959O665k1213l4862k8203l6284j0760J0741J1060p904j1580L6382
23777d044N9268M3728q800m9196q2480j2903K7080j7079M3768l589j1445K5021
23765I329k6841J724l5659j2048J3831j8094p1542P6586O9133j5132K935j5068
23753b0846j128j0351J4325L5772j1553m4119j8015n341K7706O6245L6347O311
$$ y = [-75852, -89731, -88648, -102481, -167900, -167479, -43917, 49301, 56994, 43769, -4747, -14020, 2469, 49088, 104932, 81697, 46641, 63368, 68699, 33266, -19375, -53156, -64078, -66508, -71819, -67946, -72981, -2939, -18542, 22387, 92022, 56237, 21376, 57182, 62567, 79720, 78030, 69665, 52927, 49353, 33222, -31324, 16516, 51202, 16758, -7947, 41439, 48985, 37955, 81914, 88579, 67366, 32504, 4301, -31983, -42743, -32002, -20942, -28846, -40426, -4044, 55224, 98952, 90152, 40956, -41524, -54427, -27347, -44426, -658, -4247, -15692, 9329, -17512, -15788, -51447, -63495, -49664, -67758, -139300, -62714, 6419, -8713, -5778, -20846, -21974, -32325, -18000, 17772, 6219, -37900, -55915, -61256, -33550, 32695, 69042, 75353]
23741G5353p0550o3930J6779K6597J7801m026N953q381K8595M4669R524m8988
23729B9396j3720j8543J8346j8782j3597J2278K9451J2811J0248m6798K4764K8378
23717E4232k5074p2988n745p541K273l4890j5378M7263J3592J9774M0119J2985
23705B8622o7448K313K3725j0366l2920n500J6560J0079J0750j0634j4498N331
23693d3986L3559N335j4654j6647j6841L9600N786K7438L4029j596m0517k3419
23681a1913J6219o21J745o823k9133M1504j7801J6026K8703n7782j6054k7591
23669f3521R331J682J7759J3035l2023P8031P1168p891l0852n2084o7380n2264
23657a15009M4714k1014k1071J1726M1709N9704l5604l8834j9778L2509N7386
$$ y = [75353, 4803, -59127, -42348, -15751, 2050, -1976, 3977, -4404, 24191, 68860, 78384, 29396, 15676, -2867, 15479, -3303, -16900, -4622, 24829, 37640, 47888, 1090, 25854, 54232, 29158, -43830, -49575, -57116, -54843, -89733, -105111, -57848, -44256, -24482, 15637, 28622, -38826, -36513, -12788, -23154, -56074, -61574, -45014, -34935, -24185, -34819, -49317, -43986, -10427, -5092, -19746, -36393, -53234, -13634, -7848, 19590, 53619, 52023, 11506, -11913, 4306, 3685, 5430, -1393, -30526, 10978, -6823, 9203, 37906, -19876, -35930, -63521, -54190, -52508, -34749, -21714, -53737, 24294, 95462, 87571, 56719, 4635, -62745, -115009, -70295, -91309, -112380, -100654, -58945, 759, -34845, -73679, -93457, -60948, -3562]
23646c562Q801R797L6775L2985q149k2249r439k6463j8784J0537N689m4022l3316
23633f1400J9549K3689O497k8009l3292j0503N0064N7690j4371p7023k4291J8843
23621g2557r639J7910L8161M4526M6283m0412k4585K8113l5458k9759k5147j8882
23609h1446J4600k3492k7307M9265l3554o7615L7210J4723J9738K7510j1079J1900
23597f9547K8996L8709m078k8856l1453m5059j1722K5880K2126L6844L0521k6846
23585c4485J196L2034n308n3687m6396K314O1703K5426R721m3144m4509n001N8482
23572d1654K1967j8030n2284j7225K3900O446K8849J7725k8146R589J1726L1420
23560e717J3000k0014l4615o92N9806K4048J8399p294l5623j6042j5230n2166
$$ y = [-3562, 5239, 15036, 51811, 84796, 76647, 54398, 44959, 18496, -288, 10249, 15938, -28084, -61400, -41851, -18162, -11665, -39674, -72966, -83469, -33405, 24285, 9914, -67109, -91400, -72557, -82196, -64286, -26125, 18401, 64684, 24272, -313, 27800, -7658, -37417, -62564, -81446, -66846, -90338, -117645, -68380, -101934, -169549, -132339, -117616, -97878, -70368, -81447, -69547, -40551, -1842, -5920, -34776, -66229, -111288, -123010, -97130, -75004, -38160, -7639, -34485, -33289, -1255, -6563, -60250, -106646, -104332, -42629, -17203, -7482, -50626, -95135, -100136, -41654, -19687, -37717, -90001, -107226, -83326, -76880, -48031, -30306, -58452, -48863, -37137, -5717, 7283, -12731, -47346, -48038, 11768, 35816, 54215, 46921, 11298, -4744, -19974, -72140]
23548g2140K4730P3771K1519N4199j828k9583m3421l7121n8033l393P202L1225
23536c2873J2723K8423j369K1246j5348L1753J5277r141k5625K6175L407L1949
23524H6597k3654m3239k0587l3044k7123n396m8425n1719K3011N2828L1823k991
23512f1919M9870K4148j4774o633J536n3887J565k1284L071N981L4219M9242J304
23499A2439K486l2374k3425L3396J4560K0936j5680k873J440k81j0603j1206j7230
23486b8415J2520m7344l4890M6220P8047P702n2902l9223M3991J9551j3146l3691
23474d1580l40Q164K4106L3353k5887q947J5943O3080J2472n1148L0J2340r1894
23461e0308k7741p283L3242M9881r441p8732J7918M1486N9007J0492k9514o6844
$$ y = [-72140, -47410, 26361, 47880, 102079, 100251, 70668, 27247, -9874, -67907, -71300, -64098, -32873, -20150, 8273, 6904, 28150, 12802, 44555, 59832, 50691, 25066, 51241, 54648, 86597, 62943, 19704, -883, -33927, -61050, -66446, -114871, -166590, -143579, -90751, -58928, -61919, -12049, 12099, -2675, -9308, -7772, -61659, -60094, -81378, -78307, -72326, -38107, 11135, 12439, 14925, -17449, -40874, -7478, 7082, 28018, 12338, 9465, 10905, 10624, 21, -11185, -28415, -15895, -63239, -98129, -51909, 26138, 33840, -19062, -58285, -14294, 5257, -7889, -41580, -41920, -33756, -9650, 23703, -2184, -11131, 4812, 67892, 80364, 29216, 29246, 41586, -50308, -78049, -85332, -52090, -2209, -11650, -90382, -72464, -30978, 28029, 38521, 9007, -57837]
23449e7837J7756M656O8533R703n6468R438K2018k9976p5401l3424P7684P7632
23437C4314J6352J6828J3045O733n7885l0299n1535l8461M2538R8998N4432O232
23425A11292r959j4028M696p242j6026J8577m0889j8831J548O77k2080K131l3609
23412b3743m3092r87K3754P892l8364L6176J8163L5239J4213Q397K3345L1723
23400I2716m3250m8029N001k0659j8440n927K2709J7989l7008n505j5181R274
23388d6310J6096K075K3702k9920k5443K1649M3513J9450J4557J56J2167l2080
23376A9612o8526q395J6734K3510L589j0560k989J5104m1270j7791J0843M4582
23364a5557P9716K2988o8945m8963K9901N2727K5760k3701r0792k0015L4735m1818
$$ y = [-57837, -40081, -35425, 33108, 42811, -13657, -4219, 17799, -12177, -87578, -121002, -43318, 34314, 50666, 67494, 80539, 87272, 29387, -912, -52447, -90908, -48370, 50628, 105060, 111292, 101333, 87305, 92001, 84759, 68733, 87310, 46421, 27590, 29138, 29815, 7735, 9866, -23743, -66835, -67822, -44068, -36176, -74540, -38364, -20201, 15038, 29251, 37648, 60993, 92716, 49466, 1437, 6438, -14221, -32661, -38588, -15879, 2110, -34898, -40403, -55584, -46310, -30214, -28139, -4437, -34357, -59800, -38151, 5362, 24812, 39369, 39525, 51692, 19612, -48914, -57309, -40575, -17065, -13476, -24036, -27025, -11921, -53191, -70982, -60139, -15557, 64159, 87147, 18202, -30761, -860, 51867, 77627, 53926, -36866, -56881, -22146, -63964]
23352f3964q0052N7881Q5390R384K3487K4174J6876k1943l2051n84K1524J4056
23340E4178n1360Q338J7555o7466P171j6060j8132j7703L4461M304r138m5643
23328i9495o623J5092J5537J784k6229J9045L8242M476m256K5593J12017K3965
23316A19148K98k3205J5741n1221n0909k5941k5236K1226k1084l6340m6978K1039
23304a03462L3067K155k6700j3015j6741N4222L1202l749M7386n649R646L1481
23292C9843p101J904L2544j8012m6098n4929o7619K1494P0028L2729N173l8974
23280b9018K4762K923k8863M2124M2563m517k3149l6823p151L5021k7352m3040
23268e2520l8741K533M6664K3748O7782K0142k2081j0016r599l9135r733l3672
$$ y = [-63964, -144016, -86135, -745, 8639, 32126, 56300, 73176, 51233, 19182, 18598, 40122, 54178, 2818, 11156, 28711, -38755, -31584, -47644, -65776, -83479, -49018, -44714, -53852, -99495, -106118, -91026, -75489, -73705, -99934, -80889, -42647, -38171, -42427, -16834, 95183, 119148, 119446, 96241, 111982, 60761, 9852, -16089, -41325, -20099, -41183, -77523, -124501, -103462, -70395, -68240, -94940, -107955, -124696, -70474, -39272, -43021, 4365, -1284, 8362, 39843, 32742, 34646, 67190, 49178, 3080, -51849, -119468, -97974, -27946, 4783, 9956, -29018, -4256, -1333, -30196, 11928, 54491, 49974, 26825, -9998, -17149, 17872, -9480, -52520, -91261, -88728, -42064, -18316, 49466, 69608, 47527, 37511, 27912, -11223, -20956, -54628]
23256e4628N619N594o857K8752j0622K9305K8822l5006K287l9968n2221J7791
23244h1132J2330j38J021O4412j3426m5633J2371R673l623M7600m3849m2136n7067
23231a39597L2910R893M8113Q879p219K0052J4090M832l2306L8283M3763n255
23219C6438j3563N020n1525p2151K257O4591K3688J9759J7654L4799r016j5195
23207D2756P073k1547m8411O4281j7582m6675K360O5069n729m732j9218k932j4905
23194a92M5295M2722l6159l7993j0027n8167P1882K8602j6219k7425m7643l762
23182d9086J6802N4446K5770n3322j843K2233R897j9326l93K9386P936K8633m3650
23169B7483p7779n628P0583m4899n0598K0709L0737K5967O547j5106Q681k0708
$$ y = [-54628, -49009, -43415, -50272, -21520, -32142, -2837, 25985, -9021, -6734, -46702, -98923, -81132, -68802, -68940, -67919, -3507, -16933, -62566, -50195, -40522, -44145, 3455, -40394, -82530, -139597, -106687, -96794, -48681, -39802, -47021, -26969, -12879, -8047, -40353, -2070, 41693, 36438, 22875, 27895, -23630, -95781, -93524, -28933, -5245, 14514, 32168, 66967, 57951, 42756, 49829, 28282, -20129, 44152, 26570, -20105, -17745, 47324, 41595, 36863, 17645, 14713, -192, 45103, 87825, 51666, 13673, 3646, -54521, 17361, 45963, 29744, 2319, -45324, -49086, -32284, 22162, 47932, -5390, -7233, 15000, 24897, 5571, 5178, 34564, 42500, 71133, 27483, -50296, -55924, 14659, -30240, -80838, -60129, -29392, -3425, 3122, -11984, -3303, -24011]
23157b4011n6861l7857Q808p541K5032J3110O3347R5105N3253k0730q8217m3587
23145b0149k3109N1232L2220l029j3227j092m3474k3975L8213K9907J563j0760
23133A4320q450p124k8575k4253J244L983j2271N7462k374n7426p6004K982L6370
23120a00116j5698k3732J1192N2796j5744N307P1417L8846L5840m7676o5138N2611
23108i5p439o7071J6669n587L472P668j5496L1618M242j3550J0562j9865l1840
23095h6712J6855K2172M3233r072J1048L9303j2961l1315J8900J4550J7792N6617
23083A00410O5449O1324J02753J77531K75271M35716M96923M64115L38916J82037
23073B700445j95058m33179m78547m87369l87396j73052j32780j19430j15382
$$ y = [-24011, -80872, -118729, -109921, -117462, -92430, -79320, -15973, 79132, 132385, 111655, 23438, -20149, -43258, 7974, 40194, 37165, 23938, 22846, -20628, -44603, -6390, 23517, 25080, 14320, 5870, -1254, -29829, -54082, -52838, -48855, -61126, -3664, -6038, -63464, -139468, -136486, -100116, -115814, -139546, -128354, -75558, -91302, -85995, -14578, 24268, 60108, 12432, -52706, -95, -7534, -74605, -57936, -63523, -60051, -52383, -67879, -36261, -32019, -45569, -35007, -54872, -86712, -69857, -47685, -4452, -13524, -2476, 36827, 23866, -7449, 11451, 26001, 43793, 100410, 165859, 227183, 329936, 507467, 782738, 1218454, 1715377, 2179492, 2518408, 2700445, 2505387, 2072208, 1593661, 1106292, 718896, 545844, 413064, 293634, 178252]
23064A78252L5166q30k0897K9810k664p4737n1593o1331q623J2569N4985k6218
23052F3889r0647j1159l7109m2369L8043L5454K840j0652r438j3371M0300k1118
23040e5337l7713L9874L3180j2643m6793j672M1171K7444l7153n2963j7523J6045
23028a04083M571N5905L236J2864o941j4932k9371l6642L3741K1634M5587M7996
23016C3565j6052p113j0262k8611k9377M777j6204K7964K3112k3279l7863j9307
23004i8650N9255J7733k5603K6092K4363o3127p132R3414L9579l985J0149J4479
22992H6567O8695M4169L3237n4491o0117K4849J9322K3266k2689o8488l2528L2646
22980I4438M4056j0354k1795p1275j12698j7245P0593O5594K777j101j1539j3455
$$ y = [178252, 213418, 212588, 191691, 221501, 218837, 144100, 92507, 31176, 22553, 35122, 90107, 63889, -26758, -37917, -75026, -117395, -79352, -43898, -41058, -51710, -61148, -74519, -34219, -55337, -93050, -53176, -19996, -32639, -79432, -81104, -39933, -12489, -49642, -102605, -120128, -104083, -99512, -43607, -40371, -27507, -34448, -49380, -78751, -115393, -81652, -60018, -14431, 33565, 17513, 10400, 138, -28473, -57850, -53073, -69277, -41313, -18201, -41480, -79343, -98650, -39395, -21662, -47265, -21173, 3190, -59937, -67069, 26345, 65924, 61939, 72088, 86567, 155262, 199431, 232668, 178177, 118060, 142909, 162231, 185497, 162808, 94320, 61792, 94438, 138494, 128140, 106345, 35070, -77628, -94873, -24280, 41314, 44091, 42990, 31451, 17996]
22968A7996m1689k4054l3675J3125L9569L1782J5073l117j7270L6942l3276p54
22956F52M9995M1077m0200l0787l4263J307J721j0928n545K4146p127q358K625
22943a5685j0266N3185l893J6315k0417q915n4911j3457O0433M3422J5830j8989
22931D2652K5710K5681p3244n4715L4578k3587l1412j8835K3037K5227m649J6256
22919a3301k8135j4364O8978N2157k742J6945K9925J7896o2652o4993j5326M6829
22907C1217L4880k0398L1916k4913l7349J4773J69M8804L0931j2736O7660m6075
22895A18879q2355L1068N2418j5721l0497k4046N2430K7836k3236l3676K7747
22884A00847m0185m0308n1244k8745L5413K0637m6045k537J301O4026K9135N0496
$$ y = [17996, -23693, -47747, -81422, -68297, -28728, 3054, 18127, 15010, -2260, 34682, 1406, 652, 50647, 91724, 51524, 20737, -13526, -12219, -10498, -21426, -26971, -2825, -9952, -18310, -15685, -25951, 27234, 23341, 39656, 19239, 10324, -44587, -58044, 2389, 45811, 61641, 42652, 68362, 94043, 20799, -33916, 662, -22925, -54337, -73172, -50135, -24908, -29557, -13301, -41436, -55800, 13178, 65335, 62593, 79538, 109463, 127359, 64707, -286, -15612, 31217, 66097, 45699, 77615, 52702, 15353, 30126, 30295, 79099, 110030, 97294, 164954, 118879, 36524, 67592, 120010, 104289, 73792, 49746, 102176, 130012, 106776, 73100, 100847, 60662, 20354, -30890, -59635, -24222, -3585, -49630, -52167, -50866, 13160, 42295, 92791]
22872I2791M2577M3827k0670j35012m3604R516K3525O0492L5387l40k6016L114
22860H5587M8239j6900l9298j6553o3110o2902k7020K8806J9341K5777p837L8962
22848A3092P0000O958M6938O5779r5460m0658j9338K8088M853J0101o265m9949
22836C4139j2174o3527n3798n3771J0668M1826L3713J1068k7489K8081J0770K453
22824c8041N1503L6372m0707l2166l974L6324j2698L642O3634J0790k5005m906
22812D4768m6245k8995N528K0784P1546O4402K0861m2159o3497o1109J4913M6651
22800D7448K3074L0704n025K9968j5961j9914k8776L666J3735Q135k3016k7573
22788C6465J92j6263M2634N0982M0458j306J1063O4184J01519L6804m6554m5912
$$ y = [92791, 135368, 179195, 158525, 23513, -20091, -10575, 12950, 73442, 108829, 108489, 82473, 85587, 133826, 116926, 77628, 61075, -2035, -64937, -91957, -63151, -43810, -18033, -25870, 13092, 83092, 90050, 136988, 202767, 107307, 66649, 47311, 75399, 80252, 90353, 84088, 34139, 21965, -41562, -95360, -149131, -138463, -96637, -62924, -51856, -79345, -51264, -40494, -38041, 13462, 49834, 9127, -23039, -27013, 9311, -3387, 255, 63889, 74679, 49674, 44768, -1477, -30472, -24944, -4160, 67386, 131788, 152649, 110490, 46993, -14116, 797, 47448, 70522, 101226, 96201, 126169, 110208, 90294, 61518, 65184, 78919, 87054, 64038, 36465, 36657, 20394, 63028, 114010, 154468, 153162, 164225, 228409, 329928, 366732, 320178, 274266]
22776B74266o9676k7642p5648k1598K174o3092J5560J9978l7485N4456M7381o3898
22764E4776K1260J2875K0943K5121n094N8736N2155p1171m4391n0011k6531M6231
22752I4899J7302p223O3880K6176k4957o544L684q465j4994Q1924l6044r806k6398
22739A53434k0025j0325m1939l121L8166O4123p522M156m9391K795K4683J0187
22727A65221l0042n0179k8076L9157Q2891N0073J7231N5269J03068K297j01072
22716C05838k37363k84761k47731j33879r192O7058L7762M3290L8835O0603M7769
22705c11771K2715R543j2080K6308J5224L8470M69l3791J6483J358R662L6883
22693a80527o581L5324M5037N9936o174L5437k2975m8081j9469l8389l9982j9909
$$ y = [274266, 204590, 176948, 101300, 79702, 81876, 18784, 34344, 54322, 16837, 71293, 118674, 54776, 76036, 88911, 109854, 134975, 129881, 188617, 240772, 169601, 125210, 75199, 48668, 94899, 112201, 104978, 168858, 195034, 170077, 163533, 167217, 158752, 143758, 225682, 189638, 179832, 153434, 133409, 123084, 81145, 78024, 116190, 180313, 172791, 176947, 127556, 130351, 155034, 165221, 135179, 85000, 56924, 96081, 178972, 229045, 246276, 301545, 404613, 406910, 305838, 68475, -216286, -464017, -597896, -607088, -540030, -502268, -458978, -420143, -359540, -311771, -289056, -279513, -291593, -265285, -250061, -211591, -211122, -244913, -228430, -227072, -217410, -180527, -187108, -151784, -106747, -46811, -52985, -17548, -40523, -88604, -108073, -146462, -186444, -206353]
22681b06353N808N9720K2254K8361k0961K6789M6770o551J7668k5205k9273j8181
22669i9154M1994m2543N48L1107R027M1654K8134k308L7378k809o5793l923K1788
22656d900O8787O2558r824m1227p2351p5066K5349N6095o672Q772N76J0910L6072
22643E9079k2021j410j6942k975n9116n0725O8281N95K5390O1211l1767m0709
22631a1109k7752J5761J00651M686j5272N1354l733j4593K1156m306K0167L1228
22619A68238J0819J6046m5713n2720N919k1041K3402J36850O6511N6102L1901
22608C96314J06705J69386K40325L52452N34925O13602M24765K19790j14217m61806
22598B482241n60390n13705m33223l06509k20619r7237k7892l6092P359k1610
$$ y = [-206353, -200545, -140825, -118571, -90210, -111171, -84382, -37612, -44163, -26495, -51700, -80973, -99154, -57160, -99703, -99155, -68048, -59021, -17367, 10767, 8459, 45837, 43028, -22765, -26688, -4900, 63887, 126445, 116621, 75394, 3043, -72023, -46674, 9421, 2749, 11521, 12097, 23007, 59079, 37058, 35648, 18706, 15731, -43385, -94110, -25829, -25234, 156, 61367, 29600, -11109, -38861, -23100, 77551, 82237, 66965, 118319, 114586, 99993, 121149, 116843, 137010, 168238, 179057, 195103, 149390, 96670, 102589, 81548, 104950, 241800, 308311, 364413, 396314, 503019, 672405, 912730, 1265182, 1800107, 2413709, 2838474, 3058264, 2944047, 2482241, 1921851, 1408146, 974923, 668414, 447795, 350558, 322666, 286574, 293933, 272323]
22588B72323k4053L2143L9262J8070k3233j06n1519J5534P903j9621L8959J10681
22576D16343k7198N3472J01171R4242R1305Q1680J4834q280Q934J9720J5132J1237
22564H72592K4800P4121R6993J07526J53040J78364J02019J31762J12483J01758
22554A955458J18558J42755J92773K72500L55617M62385N42241N47635O18830
22545E208752O10324O24097P57310R19154J184683J656381K188045K887271L843365
22536A9879382N047723O570683Q871039J2853882K0310211L5439883O4837219
22529A73810022J04163118J16593361Q7277073N2036206q382332q1094418j03840999
22522C40562031r8125170q1045379n3002662l0790500j8878564j2841349r266255
$$ y = [272323, 248270, 280413, 319675, 337745, 314512, 314406, 262887, 278421, 286324, 266703, 305662, 416343, 389145, 442617, 543788, 638030, 729335, 811015, 825849, 817569, 826503, 846223, 861355, 872592, 897392, 971513, 1068506, 1176032, 1329072, 1507436, 1609455, 1741217, 1853700, 1955458, 2074016, 2216771, 2409544, 2682044, 3037661, 3500046, 4042287, 4589922, 5208752, 5819076, 6443173, 7200483, 8119637, 9304320, 10960701, 13148746, 16036017, 19879382, 24927105, 31497788, 40368827, 53222709, 73532920, 108972803, 173810022, 277973140, 394566501, 481843574, 533879780, 525497448, 444403030, 340562031, 242436861, 161391482, 108388820, 77598320, 58719756, 45878407, 36612152]
22515C6612152o806047n008478l647992k728110k114124j765505j498230j306810
22507A1736856j101193q52297o54183n21747m36070m27349n43452n38230m31486
22498F230849l88662m30286l71778l01242l29846k53629k39796j72464j94673
22489C548473j95470k24639k25703k48902k41627k16936k15810j64712r3256j10971
22479A610447p6021k328n6567l8178k1605n373n0472o3868n0496m6371p1479p6331
22467A051358n6690q2116r508O7962L587K5758M9510J7228J4875k2609j2953L5236
22455A081638J46061K20694L54063N18011N36274M28525K38994j10401n55251
22446B858608o61477n68247l25756k07731j96820j35807o2053m2501m6239p6029
$$ y = [36612152, 29806105, 24797627, 21149635, 18421525, 16307401, 14541896, 13043666, 11736856, 10635663, 9783366, 9129183, 8607436, 8171366, 7744017, 7200565, 6662335, 6230849, 5842187, 5411901, 5040123, 4738881, 4409035, 4155406, 3915610, 3743146, 3548473, 3353003, 3128364, 2902661, 2653759, 2412132, 2195196, 1979386, 1814674, 1721418, 1610447, 1534426, 1532098, 1475531, 1437353, 1415748, 1410375, 1359903, 1296035, 1245539, 1199168, 1127689, 1051358, 994668, 912552, 903044, 971006, 974593, 1000351, 1049861, 1067089, 1081964, 1059355, 1046402, 1081638, 1227699, 1448393, 1802456, 2320467, 2856741, 3285266, 3524260, 3413859, 2858608, 2197131, 1628884, 1303128, 1095397, 898577, 762770, 700717, 658216, 611977, 535948]
22436E35948m818J5158k8919L477q468j1386O0597M0126J2044j953M126R603q2371
22423E43164m5245l2307k965K8712K3996k3711q027k1243j1461l9695l0444k8970
22411C51804L8704k4571J4538n905n5465m866K0440L8063l9604L0353P2810j1015
22399D25286r32Q919p8416n4472n2810O572Q533K1231q685m485J02105M6991k1047
22386C98790m0553k124k8994k5871J0317j897l6376K7932R0686Q1142J10956m1593
22374E42415m5661k8701n242l7455m4210o2390M478k8014j9874N5317r369j5867
22362C05427L0437M2708M575K7042M0778k188o3993P094K662K2978N3394Q119
22350D79033r490n2109m2829L229K0095J7853L4388O6055Q2313J03861J03436
$$ y = [535948, 531130, 546288, 517369, 520846, 512378, 500992, 561589, 601715, 613759, 611806, 615932, 625535, 543164, 497919, 465612, 462647, 491359, 515355, 491644, 483617, 462374, 450913, 411218, 380774, 351804, 390508, 365937, 380475, 374570, 319105, 314239, 334679, 372742, 333138, 363491, 436301, 425286, 424354, 433273, 354857, 300385, 247575, 254147, 262680, 283911, 275226, 270741, 372846, 419837, 398790, 358237, 356113, 327119, 301248, 311565, 309668, 273292, 301224, 391910, 473052, 584008, 542415, 496754, 468053, 462811, 425356, 381146, 318756, 323234, 295220, 275346, 330663, 321294, 305427, 335864, 378572, 383147, 410189, 450967, 448779, 384786, 391880, 394542, 417520, 470914, 479033, 469543, 417434, 374605, 377834, 397929, 415782, 450170, 516225, 598538, 702399, 805835]
22339H05835K3378l8040j86031k59862k40402j96827p1468j068O030M1495L905
22328a13055j1234L7006L6273j7065l476J3881j9549l5728R047M2190K8320o9320
22316a02710l851J2116L6017O8178P2841K9179n4168o6810m6515K2569O278K4581
22304b295L8799k5570n9708N8547M0992n8099k9152j7475j8622O7051M363j9377
22292b0546N5265L0498N264M380l4096m8929n499N4599O3239M5720n57m2679k9907
22279G6752j7667P829N2952p9385q570k7673l781O5040K3744l0522j1860n801
22267D1058l1307l2260J3068j1972m7757k5654L1470P7866M6665n534j4150r281
22255C2212k9861J7668O719n767N912J8766k9460K2663K8253L2418M021L1055
$$ y = [805835, 829213, 791173, 605142, 345280, 104878, -91949, -163417, -164485, -158455, -116960, -113055, -124289, -87283, -51010, -68075, -71551, -57670, -77219, -112947, -103900, -61710, -33390, -102710, -106561, -94445, -58428, 9750, 82591, 111770, 57602, -9208, -55723, -33154, -26876, -2295, 36504, 10934, -48774, 9773, 50765, -7334, -36486, -53961, -72583, -5532, -1169, -20546, 34719, 65217, 70481, 74861, 40765, -8164, -13663, 40936, 104175, 149895, 149338, 106659, 76752, 59085, 66914, 119866, 40481, 31911, 4238, 457, 65497, 89241, 58719, 46859, 41058, 9751, -22509, -9441, -21413, -69170, -94824, -63354, 14512, 61177, 55643, 41493, 32212, 2351, 20019, 26738, 20971, 26883, 45649, 16189, 38852, 67105, 99523, 103544, 134599]
22243A34599j9373R354m134m6657j0412k1309q743n60j5857K570M0561L8319J4699
22230A13057J875k1357m2952n5379p237K7704O9388P7613m5171l8193l0240j9222
22218B9886j689l6004j4345J1819J2384J3708P910l9945k2579K3930M0196J0781
22206C6052K2500k9270q3j2696k4814k3020l6949n9123R536J6042O5842k2021
22194e8004k8230N5888K4910K0170K9758J5556r917O718o773j7542j1393k0513
22182F28m2173l232j338r789j3232L4074j2795l1157M7956R0674j0579m5583M4843
22169D8297K3072k2461j5707q703L2038L6835n878k3927j1680L0368l7523Q725
22157E3456r614m5600l4875M9451O3014j7263l3101l5193j7477K6247L8972J6333
$$ y = [134599, 115226, 124580, 120446, 73789, 63377, 42068, 33325, 32765, 16908, 19478, 60039, 98358, 113057, 114932, 93575, 50623, -4756, -11993, 15711, 85099, 162712, 117541, 79348, 49108, 29886, 28197, -7807, -22152, -10333, 2051, 15759, 23669, -16276, -38855, -14925, 25271, 36052, 58552, 29282, 29199, 16503, -8311, -31331, -68280, -127403, -117867, -101825, -35983, -58004, -86234, -30346, -5436, 14734, 44492, 60048, 50131, 56849, 50076, 32534, 21141, 628, -41545, -44777, -46115, -55904, -69136, -35062, -47857, -79014, -31058, 59616, 49037, 3454, 48297, 71369, 48908, 33201, 24498, 56536, 93371, 87493, 63566, 51886, 82254, 44731, 53456, 43842, -1758, -36633, 12818, 75832, 58569, 25468, -9725, -27202, -955, 38017, 54350]
22145E4350L5791L866j9867o4608m5702J7071K4776O2431J2608K8803k811o2050
22133D4658l2347N53n11k3822J1346r732n361n4097k7312N5424j0085K3132O2731
22120C4577o128l9361o6839j2184K0353M2441P6992k1897p5112M5222R849J9808
22108B7721N2885n816o9030N859M243M3974j2233K1763K6795m377j7870L5027
22096A08941k3997m4090l2973o266M1666l5375n6574K38L4788M8503R088l6522
22084G427j125J8334M3049K869k2277l815o01k7135k3897K8642M6279m579l0587
22071C2584m610l5921k7800j6751m1423J8913k2638l5654o2283k2267R717k815
22059b10948l4778P5436J13026J11286J9949R394L7487K4520j0391l0116l3149
$$ y = [54350, 90141, 94007, 74140, 9532, -36170, -19099, 5677, 68108, 80716, 109519, 106708, 44658, 12311, 12864, 12353, -11469, -123, -9855, -15216, -69313, -96625, -41201, -51286, -28154, 34577, 28449, -10912, -77751, -89935, -69582, -27141, 49851, 27954, -47158, -1936, 7913, 27721, 80606, 74790, 5760, 11619, 15862, 59836, 47603, 69366, 96161, 91784, 73914, 108941, 84944, 40854, 7881, 1615, 43281, 7906, -48668, -48430, -13642, 34861, 43949, 7427, 6302, 24636, 67685, 70554, 48277, 44462, 43861, 16726, -7171, 21471, 67750, 63171, 32584, 27974, -7947, -35747, -52498, -93921, -75008, -97646, -133300, -195583, -217850, -208133, -210948, -245726, -170290, -57264, 54022, 73971, 83365, 120852, 145372, 134981, 104865, 71716]
22048G1716n0018K0137q7001j8804L6358N6196o3113k0848L5290J9432J8359L8266
22036E5970j2582q6249J8887O7365K3108l2475J5500L3929l4805r316P8686J7393
22024A35411o2052J6549J8018r0603j3171m454M0434L1880J5810m4638L3339O848
22012H3371n920o551j3542J7673K4080l4498m3995l5354P01P6526K4728m0574
22000D6645m8059M8061j3159m8846N7416M999k7100j6580m844K0219M6292J8540
21988H3584l9275Q634j4231m3573r198Q4076L2635k0459P746O2210J0698J1725
21976A74572R9808J24400J43215J90447L11329M55876N84404N15997K74843m3237
21966B831654l64349n66182n47105m39805k73247j49404j16034j30093q5451j5821
$$ y = [71716, 21698, 41835, -45166, -63970, -27612, 28584, -34529, -55377, -20087, -655, 17704, 55970, 43388, -42861, -23974, 43391, 66499, 34024, 49524, 83453, 48648, 39332, 118018, 135411, 73359, 89908, 107926, 17323, 4152, -302, 40132, 72012, 87822, 43184, 76523, 83371, 77451, 70900, 57358, 75031, 99111, 64613, 20618, -14736, -14035, 62491, 87219, 46645, -1414, 46647, 33488, -15358, 42058, 47057, 19957, 3377, -1467, 18752, 65044, 83584, 44309, 52943, 38712, -4861, -14059, 70017, 102652, 82193, 89939, 152149, 162847, 174572, 274380, 398780, 541995, 732442, 1043771, 1499647, 2084051, 2600048, 2874891, 2831654, 2467305, 1901123, 1354018, 914213, 640966, 491562, 375528, 245435, 159984, 144163]
21956A44163r272n9169m77j0907j3860O9055K559j5608j0903m4958J0026K9489
21944I0138P720L3319l8232p8854n9694m935M9861J1301L7540N572j4427R711
21932D9020k3230m2063l9397J7175M7484J9194K5262J5524L202m225j6439j5921
21920C5586N2614j0127l2878j4607M9321M1247J6100l0118p8979r3251J2429O8554
21908A5891L2462l9973k9545n140j9730Q983J5244r136K6057m3831j6798m88J3023
21895e2981L6585L5439k3748J0930k5213J3833Q4781j6342m1049n2849J2377J0577
21883g660j5901J8562k3826k2569N0397O4595k9710K3477o1939o9302j778k1198
21871i6852O1497K4032K3783J9479l0695p702l3814O693N2695j0225K1785L7679
$$ y = [144163, 134891, 75722, 75245, 64338, 50478, 119533, 122092, 106484, 95581, 50623, 60649, 90138, 97858, 131177, 92945, 14091, -45603, -50538, -677, 10624, 48164, 53736, 39309, 49020, 25790, -16273, -55670, -38495, 8989, 28183, 53445, 68969, 72171, 67946, 51507, 35586, 88200, 78073, 45195, 30588, 79909, 121156, 137256, 107138, 28159, -65092, -52663, 15891, 48353, 8380, -21165, -26305, -46035, -37052, -21808, -30944, -4887, -48718, -65516, -66004, -52981, -16396, 19043, -4705, 6225, -18988, -5155, 79626, 63284, 22235, -30614, -18237, -7660, -23561, -4999, -28825, -51394, -997, 63598, 33888, 57365, -4574, -73876, -75654, -96852, -35355, -11323, 12460, 31939, 1244, -6458, -40272, -33579, 19116, 8891, 30676, 68355]
21859F8355m6865o90K059J8991O2227j7890p1075J6479K9633J6539J9755j2507
21847H5011j02455n791m643J5987N686J5492M7903M4965R952k9400K2380N120
21835A10207o2416n7362K773K7103m9888j4854M7955R748k5266k2232J4004k210
21823b2438o326n064L8095J023L7754P3268q90n2710q6645k0404r228L3695J860
21810a8010K530k1365O8300m567n3809j0135L9124K0139K2682N7976l9865q180
21798E4820l75J9718L1414o8163p386M2299k1178p793m7662J8052J6917K7277
21786E7940m4469j07571P030R0797P5004j6433m5530j8325l7032q077j6630P0754
21774G458J8682K2792m7876l68M1693k8638j6353L6644l1680m495N0882j2809
$$ y = [68355, 21490, 20800, 22859, 41850, 104077, 86187, 15112, 31591, 61224, 77763, 97518, 85011, -17444, -23235, -27878, -11891, -6205, 9287, 57190, 102155, 112107, 82707, 105087, 110207, 47791, -9571, -6798, 20305, -29583, -44437, 3518, 13266, -12000, -34232, -20228, -22438, -28764, -33828, 4267, 5290, 43044, 116312, 115422, 62712, -23933, -44337, -53565, -19870, -18010, -15480, -36845, 31455, 26888, -26921, -37056, 2068, 22207, 44889, 102865, 63000, 54820, 54445, 74163, 105577, 37414, 30028, 72327, 51149, 43356, -4306, 13746, 30663, 57940, 13471, -94100, -87070, 3727, 78731, 62298, 16768, -1557, -38589, -46666, -63296, 7458, 26140, 48932, 1056, 688, 42381, 13743, -2610, 34034, 2354, -2141, 48741, 35932]
21762C5932k388K4928o961l0557O071k4696j4011j7849M5787M9902m1625k2628
21750A905L3043n5920j0670J2836l3960J1648P051k323K2605K0573M2762m2678
21738F872m570M4415l8434j2693K5688J4185J8670K2963K6459n725l9163k3971
21726C4696k7977j4139K6842j2203j8336K8630K0855k404k0510k0334l4528J1968
21714b7440L1752L4489n3306j02011m946m189L4236M6892L7118N3275L4786j8407
21702F2249r024P4899m1524q0588j6386M867k1595j2236K416r743j049P0797L0787
21689E3870k0404j6418j9441q107m6823L9789O0763M0253J7637r799o7910l0865
21677g455J8878k8546K656M5541k777m3821n2851K53O00r3M1450L5999k8001o0648
$$ y = [35932, 33544, 58472, 51511, 20954, 27025, 2329, -11682, -29531, 16256, 66158, 24533, 1905, 34948, -20972, -31642, -18806, -52766, -41118, -34067, -36390, -13785, 6788, 49550, 6872, 2302, 46717, 8283, -4410, 21278, 35463, 54133, 77096, 103555, 97830, 58667, 34696, 6719, -7420, 19422, 7219, -11117, 17513, 38368, 35964, 15454, -4880, -39408, -27440, 4312, 38801, -14505, -116516, -121462, -125651, -91415, -44523, -7405, 45870, 80656, 62249, 53225, 128124, 86600, 6012, -10374, -5507, -27102, -39338, -36922, -46665, -47714, 23083, 53870, 33466, 17048, -2393, -10500, -57323, -17534, 43229, 83482, 101119, 91320, 23410, -7455, 11423, -17123, -14467, 31074, 28297, -15524, -68375, -68122, -67522, -67615, -26165, 9834, -18167, -78815]
21663g8815M0912j1162L7091K1839M496l7413l6751K0845L3581M2662M633K1420
21651F3338q571o4426j7756L0577N972m6959K590L6429J6653o943l7894J3609
21639a3381J6725J3939L9492m0461o9191o323O018J7507K3742k601L0107j1648
21627C925j7756N4811k8753p821k0754j1995M214M9269N719L6798p3325n6176
21615f1844j6457L0957L3892j9228L053P2793l071L7745o0251p7668j5737Q1657
21603E841M6336K0753J0893J3793j1015l0784l0506j960k22m1953J6736L0797
21591B8709l1515k578m4911m4868K4028K5606M0392O2574J8897R593m0312q3337
21579c7722k727J8339k7633l064K0026j8802L8094l353M7087M5568J091j7822
$$ y = [-78815, -37903, -49065, -11974, 9865, 14361, -23052, -59803, -38958, -5377, 37285, 41918, 63338, 54767, -9659, -27415, 3162, 9134, -37825, -35235, 1194, 17847, 10904, -26990, -13381, 3344, 17283, 56775, 16314, -52877, -59200, -53182, -35675, -11933, -14534, 15573, 3925, -13831, 40980, 12227, 4406, -16348, -28343, -24129, 25140, 30859, 67657, -5668, -61844, -78301, -47344, -13452, -32680, -29627, 43166, 40095, 77840, 17589, -60079, -75816, 5841, 52177, 72930, 83823, 97616, 86601, 55817, 25311, 23351, 23129, -18824, -2088, 28709, -2806, -5384, -50295, -95163, -71135, -45529, -5137, 57437, 76334, 85927, 45615, -37722, -40449, -22110, -49743, -52807, -32781, -51583, -13489, -16842, 30245, 75813, 76904, 59082]
21567E9082r812J464j8048k1496o0737j856L0391r324O0448j81j3644k9149m476
21554a7338k4617M5745m923N13k1995r684l7886j0573N1579m168l533J8478P975
21541a0427J2845n9129j6387j234K2072k2834j9682L8280J6863N410P86q553J7347
21528b4643P2251O8214n9736p7517o133K0828M9586q690n4365L9578J0156J2018
21516D1547o9977k1766k0081J936K2996K4084l298Q244k3351k6297j4732J9232
21504f1463L2145J8139k4328o5219Q105M6445j8584L8765L7611r565q933k8287
21492c5169l6197p722L0352O8738R619J6974l0149n8683M666O1303L4593K1383
21480G9708Q0908n1710r8528l6504n0705j7348N9541j083l9972J4955P3313K5422
$$ y = [59082, 49270, 50734, 32686, 11190, -49547, -51403, -21012, -30336, 30112, 29931, 16287, -12862, -17338, -41955, 3790, -1133, -620, -22615, -32299, -70185, -80758, -29179, -33347, -36880, -18402, -10427, 2418, -56711, -73098, -74332, -52260, -75094, -94776, -56496, -39633, -34223, -33437, -41990, -24643, 47608, 115822, 56086, -21431, -27564, -6736, 42850, 34160, -20205, 19373, 29529, 41547, -28430, -50196, -70277, -68341, -45345, -21261, -24559, -16315, -39666, -65963, -80695, -61463, -29318, -11179, -35507, -100726, -92621, -46176, -64760, -25995, 11616, 2051, -6882, -35169, -71366, -79088, -48736, 20002, 29621, 46595, 16446, -42237, -37571, 23732, 58325, 79708, 160616, 108906, 10378, -26126, -76831, -94179, -34638, -35721, -75693, -60738, 12575, 37997]
21468C7997J0201j1695K031l6440m4765K5982k472K9367J274n0253M888j5015
21456d8900L8627K6644L363q0169J7301j3629m2875L5222M3418O4774N8206j8808
21444H3174n5517j5572m266K9485O3537l0253l4727n5880Q184J8131o438k8256
21432b8398j4403K9970j1330J2961k549N8759P673n2517j9253K7456M832k3432
21420a0231n0443j6841N1420K0841k1213n1261o781J04860K3802l7980k4031J3355
21408d503n48m506J7057P850l6960j7578P4921K3232M3316j1374k730K9439l6967
21395H0649j9372n061o0017l3794J8960l7303m3511q362M0148K5374J0455j2054
21383d3888J001p823l0416m549K2167R223R956q486L3481L8884L546J2124o9q103
$$ y = [37997, 48198, 36503, 38534, 2094, -42671, -16689, -19161, 10206, 11480, -38773, -33885, -48900, -10273, 16371, 19734, -60435, -43134, -56763, -99638, -64416, -20998, 43776, 101982, 83174, 27657, 12085, 7819, 37304, 100841, 70588, 35861, -20019, -11835, 6296, -142, -28398, -42801, -12831, -24161, -11200, -13749, 45010, 52683, 166, -19087, 8369, 13201, -10231, -60674, -77515, -26095, -5254, -26467, -77728, -84509, 20351, 44153, 6173, -17858, -4503, -5051, -9557, 7500, 15350, -21610, -39188, 35733, 58965, 102281, 90907, 88177, 117616, 80649, 61277, 56216, -3801, -37595, -18635, -55938, -99449, -107811, -67663, -42289, -31834, -43888, -42887, -50710, -81126, -85675, -63508, -54285, -44329, -52815, -19334, 19550, 23096, 35220, 35151, 27048]
21369B7048q399l1909j4039N1988O3217K1788k2719l4648o6555J0202k645k264
21357h935k3008K8494L2864k0585k6371l212N351k5584l347K7704J008J6541O7872
21344F8792j7365l9485k4479l3725l6852K3907M0972k050m3149k8951M9244J7476
21332b5665j3124J139p317j858J9181j6283L3421K6651j8285k786j0065J4462
21320e29P598K3559J7824P4808k5335r292k130k2062p7131o7991L6800k151j5631
21307f1663K7022R323O294J1805J8188m403m8125O777O527K4365K7539N5436R174
21294H8259m5316J732k5015j0118n8477k7258K2477R0821M8645n1846k0616j8958
21282e670k8697l3486N972K718O678J3926k0018J6769L6667n83L4373N4809k2840
$$ y = [27048, 18649, -13260, -27299, 24689, 87906, 109694, 86975, 52327, -14228, -4026, -6671, -8935, -31943, -3449, 29415, 8830, -17541, -20753, -15402, -40986, -44333, -16629, -15621, 920, 68792, 51427, 11942, -12537, -46262, -83114, -59207, -18235, -20285, -63434, -92385, -43141, -25665, -38789, -37650, -44967, -46825, -27644, -43927, -10506, 16145, -2140, -4926, -14991, -529, 7069, 30628, 48452, 123260, 97925, 88633, 86503, 64441, -12690, -80681, -43881, -46032, -61663, -34641, -25318, -19024, -7219, 10969, 6566, -41559, -34782, -28255, -3890, 23649, 79085, 88259, 42943, 44675, 19660, 9542, -48935, -76193, -53716, 37105, 85750, 33904, 13288, -5670, -34367, -67853, -61881, -59163, -52485, -38559, -58577, -41808, -5141, -5724, 28649, 83458, 60618]
21269F0618m1356Q05j7106k3955L6490m7541p0935K0539M9787k1932q21J1229
21257d4178l5491k9281O8618M3310l0769q009N4150J5098n929P479j1520n7099
21245c3621o745L2658K5995M3628j6435l1922O683K4614l6487J6766M0720K4255
21233I0109k2623k6903j8509L565M1271K8438k8862n123K9475j8639r1470q280
21221b7551k9440k4335k448L9778j4675k4232N0476P8211m0542o4635L0045j4456
21209d3804J8650K2328k5762j3822m583q90j406K4988l378k1082j7128L5362j809
21196c2336j9274j5964l5886j7811L937P41L27M5858K6220k0215N7081M7632J0618
21183E0928n2317P678m912l5756R4L3260Q584k3563J7884J0388p0392l8474K0698
$$ y = [60618, 19262, 20067, 2961, -20994, 15496, -32045, -102980, -82441, -32654, -54586, -55407, -44178, -79669, -108950, -40332, 2978, -27791, -35800, 18350, 33448, 27519, 34998, 23478, -33621, -40366, -7708, 18287, 61915, 45480, 13558, 20241, 44855, 8368, 25134, 65854, 90109, 67486, 40583, 22074, 25639, 66910, 95348, 66486, 61363, 90838, 72199, -19271, -27551, -56991, -81326, -83774, -43996, -58671, -82903, -32427, 45784, 5242, -59393, -29348, -43804, -25154, -2826, -28588, -42410, -46993, -47883, -49289, -24301, -27679, -48761, -65889, -30527, -32336, -51610, -67574, -103460, -121271, -117334, -116593, -116266, -70408, -44188, -64403, -7322, 40310, 50928, -1389, 6289, 1377, -34379, -34285, -1025, 7559, -16004, 1880, 12268, -58124, -96598, -75900]
21170g5900j2009J4289M6351Q361l6470k4472N9324N4467m62j8394O86l3518k4532
21157d2279J887n8136r076Q767L8955K6399O162m7294j2177R33l7408P814K7566
21144h7887K6256N1830J5451j5678l1295J8464N107j4470l9873o14m7375R813
21132a10271J02865Q1492q620l827n102j9830k3929M0252J8937r135n127o358
21120E1347k6188L011M2268p2895l7085m3227m1582N631j3064M2288O0434l2386
21108f1448j7676L2537J5744L761K8499j9753j7589J3464J1312q986r469l8279
21096f7883j0785O7831Q334j4982O6010O9202p0599k487q108n0583o1304L2708
21084d2646J8219P339J8557J8074R688m7623K6277J34223K7826r8155k6724J7841
$$ y = [-75900, -87909, -73620, -27269, -18908, -55378, -79850, -20526, 33941, 33479, 15085, 15771, -17747, -42279, -40392, -98528, -107604, -98837, -59882, -33483, -27321, -74615, -86792, -85859, -123267, -115453, -87887, -61631, -9801, 5650, -10028, -41323, -22859, -17752, -32222, -72095, -72709, -120084, -110271, -7406, 74086, 65466, 61639, 56537, 36707, 12778, 53030, 71967, 62832, 57705, 51347, 25159, 28170, 70438, -2457, -39542, -82769, -124351, -118720, -131784, -89496, -29062, -61448, -79124, -46587, -30843, -27082, 1417, -18336, -35925, -22461, -11149, -20135, -29604, -67883, -78668, -10837, -2503, -17485, 48525, 117727, 47128, 44641, 36533, -14050, -75354, -42646, -24427, -17088, 1469, 19543, 29231, -18392, 7885, 142108, 169934, 71779, 45055, 62896]
21072F2896j7793l8529K195K5732j2651j850n7396m9530L9903K658l0243m8454
21060a23062l8426l422M5311N7972M8187Q110J4362J8010j2067m4167k4962L5222
21048a8932k1039j3685L8021J6950n8643J7186j202j855j9894L4164L7161P244
21036A5476n8079N0464J6515k7725j6429J1283j157l5844l1334K9030K0863O0183
21024C3246K8975p8836k7792K1000Q96M3224K6875J5402l2954m1697o7121M4086
21012c4696j5372K8046O92L3085K9381q415j8977l2559l3013N049M2538M6580
21000D2339L4202m9530l6850k4178k6603j8493J4486J7845J5173p59K8467K0011
20988A6110k0285o343N0311j8841k6403k2728J5763P6306M682r087l1014j9262
$$ y = [62896, 45103, 6574, 8769, 34501, 21850, 20000, -37396, -86926, -47023, -44365, -74608, -123062, -161488, -164910, -119599, -61627, -13440, -5330, 9032, 27042, 14975, -29192, -54154, -18932, -39971, -53656, -15635, 1315, -57328, -40142, -41344, -43199, -63093, -28929, 8232, 15476, -42603, 7861, 24376, -3349, -19778, -8495, -9652, -45496, -76830, -47800, -26937, 33246, 62221, -16615, -44407, -23407, -22511, 20713, 47588, 62990, 30036, -11661, -78782, -34696, -50068, -22022, -21330, 11755, 41136, 32721, 13744, -18815, -51828, -46779, -4241, 42339, 76541, 27011, -9839, -34017, -60620, -79113, -64627, -46782, -31609, -32368, -3901, 16110, -4175, -10518, 39793, 20952, -5451, -28179, -12416, 63890, 68572, 59485, 28471, 9209]
20976I209q372J9569J2m7498j9134R363L4752K3783m1251l0452N5935P414r800
20963C530K7405q134p2888k0046R274J6033J1678O0613L4548m0508m5881M4582
20951B0206L2828J5282J7820K018n1424l1142K8030M0456J5949L7657K02k9927
20939I7955r7912m3646L6353K7738M7581K5744o2289l8448L1486N2367o0488l4661
20927a8220N0635n2272k186M091m0547K8161N1718j0956m3585r899J2890j9411
20915d9581R594J9292m3812K6632K2976j320O729o1837j6329p4777k5607M5564
20903a42476K8757O9565M5054k5523M1111k4208q5186J1347N3758J5925l1252
20892d3128p709J8084J8214j9683l25l4268k0641L2135p594L7410J8357L6599
$$ y = [9209, 837, 20406, 20418, -27080, -46214, -36851, -2099, 21684, -19567, -50019, 5916, 13330, 3530, 30935, 22801, -50087, -70133, -60859, -44826, -33148, 27465, 62013, 21505, -24376, 20206, 53034, 68316, 86136, 88154, 36730, 5588, 33618, 74074, 90023, 127680, 127882, 97955, 43, -43603, -7250, 20488, 68069, 93813, 31524, -6924, 24562, 76929, 16441, -18220, 32415, -19857, -22043, -17952, -58499, -30338, 21380, 10424, -33161, -43060, -30170, -49581, -39987, -20695, -64507, -37875, -14899, -16219, -9490, -71327, -87656, -162433, -188040, -142476, -113719, -44154, 900, -24623, 16488, -7720, -92906, -81559, -27801, -11876, -43128, -50837, -32753, -14539, -34222, -34547, -68815, -89456, -57321, -64915, -27505, -9148, 27451]
20880B7451J9551j024l2451n4356M3322L6743m8073m8151p2668K6605R2123J1159
20868B31p262Q68m5888K8760N8904n8943j8919k2142M47q7j3417M3538m690K6790
20854a1810j9674l0484L4679N2901J5047L2851R611n3931k0371R940j374R513
20842B6898k6756k3390l4796L4049M8432J4177N049j764L113m2032o751R570L8972
20829D4771K3358n0545l6928k4743j257L1716O9877L0451M1230k6163j2116l0136
20817E9515j6122j1370l2569l4948M7765j4862o8074K9000M5570l0764l1725L3264
20805b5320M0040k550J834P439K876l4340L564J242j3785j4146K1136Q719J7745
20792A4454K0950q5027m3917N0083K7395N9724K4065m576j3039m3205l9116J7043
$$ y = [27451, 47002, 45978, 13527, -40829, 2493, 39236, -8837, -56988, -129656, -103051, -10928, 231, -7031, -6163, -52051, -23291, 35613, -23330, -42249, -64391, -63944, -64031, -77448, -33910, -38600, -11810, -31484, -61968, -27289, 25612, 40659, 73510, 83121, 29190, 8819, 18759, 17385, 26898, 142, -23248, -58044, -23995, 24437, 38614, 43663, 41899, 45012, 2980, -3771, 5799, 44771, 68129, 17584, -19344, -44087, -45344, -13628, 56249, 86700, 127930, 101767, 89651, 59515, 43393, 32023, -546, -35494, 12271, -2591, -70665, -41665, 3905, -26859, -58584, -25320, 14720, 12170, 14004, 21443, 24319, -10021, -6457, -5215, -19000, -33146, -12010, -3291, 14454, 35404, -49623, -93540, -43457, -16062, 43662, 67727, 63151, 50112, 6907, -32209, -15166]
20780a5166k943M4854j1839P172m4923k8274M1756j492L5406M9583k1355n8672
20768e893p707Q6358K517m136J4123o804O558l5184l9598l495j6420M4904J9419
20755E4642L5k5463k9841J5871o508K2123l7592l8422n8938L5033P4107M5927
20743E0974K9193J9241o7707m5995M1750m5829p616N2481j309n0822K8374O4696
20731F7431l9970l3507j4247k6427K8120l942j2983j1489K8225k9228k6830O1447
20719a3400k611o0164R362J9146N707K4877n905M2419j1783j5069k5075L0120
20707b376l3153K6271j8806q6588R744P4407O8603K9349l3065k6945k1823k2996
20695c7378m471M3766J0701k2062j3940J3793j175l2668j4582K2824j6551K1799
$$ y = [-15166, -18109, 26745, 14906, 22078, -22845, -51119, -9363, -10855, 24551, 74134, 52779, -5893, -13600, 72758, 75275, 71139, 85262, 78458, 85016, 49832, 10234, 6739, -9681, 35223, 54642, 54677, 29214, -627, 15244, 8736, 30859, -6733, -45155, -104093, -69060, 5047, 50974, 80167, 99408, 31701, -14294, 27456, -18373, -25989, 26492, 25183, -25639, 2735, 67431, 27461, -6046, -20293, -46720, -18600, -22542, -35525, -47014, -18789, -48017, -74847, -13400, -16011, -76175, -66813, -47667, -41960, -17083, -22988, 19431, 7648, -7421, -32496, -2376, -35529, -9258, -28064, -114652, -104908, -30501, 38102, 67451, 34386, 7441, -14382, -37378, -41849, 1917, 12618, -9444, -23384, -9591, -10766, -43434, -58016, -35192, -51743, -29944]
20683b9944K3501m4530L4547K0184r049j3826n7645M2551n3418L899N2262J3178
20671a8290J4974K2911l1385k2982J135n152M3644O1138l3105m0712K3455k1331
20659e700k7983K5978r355j5838K5054j2405m0063J7878J7417K4819j5754K0735
20647D783p753j2852N1034m313j861l4896n0706L2181k0316p575L6014N2616m6909
20634a0553m0207O2719K1923l8766n0382L3691J9222k5641l2328J0170L4233k6510
20622d2429j909Q003N885j4685K4763K7359k0330k004J0486m782J1193J4873n008
20609A1415n8983l3731r654K9580J6766N123N1775j448o9372J6319K6480j3007
20597b8737J2844J5827k6583M5060L7057m2508j9040k4858l9114l2175K0251P8908
$$ y = [-29944, -6443, -50973, -16426, 3758, -5291, -19117, -76762, -34211, -87629, -83730, -31468, -18290, -3316, 19595, -11790, -34772, -33637, -38789, 4855, 65993, 32888, -7824, 15631, -5700, -33683, -7705, -17060, -32898, -7844, -20249, -60312, -42434, -25017, -198, -15952, 4783, -2970, -15822, 35212, 30899, 29038, -5858, -56564, -24383, -44699, -52274, -16260, 36356, -10553, -50760, 11959, 33882, -4884, -55266, -21575, -2353, -27994, -60322, -50152, -15919, -42429, -44338, -36335, -30450, -45135, -20372, 6987, -13343, -15347, -4861, -9643, 1550, 16423, 11415, -47568, -81299, -90953, -61373, -44607, -39484, 12291, 10843, -58529, -42210, -15730, -28737, -15893, -66, -26649, 18411, 55468, 12960, -6080, -30938, -70052, -102227, -81976, -3068]
20585c068O8413J4970n1311l8214J4755P374j1483k6639J0241J02073j3495k5292
20573D8324m3365l1453q322R872p29j1453N6887K5853K6506m3722l4198n469j1743
20560b3012M578J5806j80j4418J7427j1648l1861l1302P214l56m0187J0392J8344
20547g9203q97J0452K4598o6677m0574K7381N9091N8774l8727n0983N2648N3445
20535I328k2711j5383Q711M2820N3065k1240m2677K1283N0244k8342j0834M4993
20523H9257Q209j8643m9283k6327k6009L6238J5764j4160J070L0423M0779j8056
20511F9262l4436l4207p7657l3122Q0202L4279k854J0999j8359L1181k0572L8230
20499D2946J8030J5095j5866j0238K0621k3013n9237n051K0984l529N4822J4320
$$ y = [-3068, 65345, 80315, 29004, -9210, 5545, 12919, 1436, -25203, -14962, 87111, 73616, 48324, 4959, -26494, -34816, -24944, -25673, -37126, 19761, 45614, 72120, 28398, -5800, -11269, -23012, -18434, -2628, -2808, -17226, 201, -11447, -43308, -74610, -67396, -67752, -107939, -97547, -79203, -80100, -69648, -45050, -111727, -152301, -124920, -65829, -7055, -45782, -96765, -44117, 9328, -13383, -28766, -20055, 22765, 75830, 54590, 11913, 33196, 83440, 55098, 44264, 89257, 97466, 78823, 29540, 3213, -22796, 13442, 29206, 15046, 16116, 46539, 87318, 69262, 34826, 619, -77038, -110160, -29958, 4321, 1467, 12466, -5893, 25288, 4716, 42946, 60976, 76071, 60205, 49967, 70588, 47575, -11662, -16713, 4271, 742, 55564, 69884]
20487F9884k1333P109m7284j1958L4540K0493k7116j5300K4335K2985K3431q6902
20475g116k6176m0814m766J6837m351l844Q104k7353q523L1928O6325R535N5477
20462F5263K8652k5642j9868r3890n2668Q979L2166N2342m4874j2985L6030M4684
20450A8189M02K7334j9111K3869N487J4293J4698o1901r021K8286R673k4863n0368
20437b3033K3384j9602l3069J1762R2272M755N729m3741j0220o507K3508L9187
20425F4425k9328j8334N6086K6991o094o7324m2276K7873L5980o7642K017K5253
20413G627K5550k685J220n799l6295L9368m0693j6579k0559k30j2972L8040k501
20400b6508m404j2716J4872L3571k655k3850n2216L7020L8032j0260J2641Q0500
$$ y = [69884, 48551, 55660, 8376, -3582, 30958, 51451, 24335, 9035, 33370, 56355, 79786, -7116, -33292, -74106, -78872, -62035, -66386, -70230, -62126, -89479, -98002, -66074, 251, 9786, 65263, 93915, 68273, 48405, -45485, -98153, -89174, -57008, -4666, -49540, -62525, -26495, 18189, 18591, 45925, 26814, 50683, 56170, 70463, 85161, 23260, 14239, 42525, 52198, 27335, -23033, 351, -19251, -52320, -40558, 51714, 56469, 62198, 18457, 8237, 1730, 25238, 64425, 35097, 16763, 72849, 99840, 93746, 26422, -15854, 12019, 47999, -19643, -17626, 7627, 33177, 30492, 31712, 25913, -10382, 28986, -11707, -28286, -48845, -49075, -62047, -24007, -26508, -30912, -43628, -28756, 4815, 2160, -21690, -73906, -36886, 1146, -9114, 3527, 84027]
20388H4027J5851l631J804q0J4114m6904k5282n8626n1575K1037P0711K1271r676
20375C3041l4823K5054j758j2350M5903L689K4754m5412l2845m7452m747O7020
20363B0074N9723j5405m5213r729n53l1313N3451J3072r491q431j8878l2781m4247
20350f9721k6292L7357J00816L4682q0039j8277P30O0850Q0743P849j6359o1552
20338E0787M1961M1606l0284q4431l5040j6336l8555K056N5992N34l7588M166
20326d5132N9349P7549J284j9916n9920p1648R401M6870N8708L882o7607M5247
20314C8067J8590j1938J636K7233L937k5579R963K5882k6166k9892K1689k2468
20302C0954P870j9738n4316q803L1371J6654o4p754O326j4819k2719J5593J5869
$$ y = [84027, 99878, 96247, 98051, 97971, 112085, 65181, 39899, -18727, -70302, -49265, 21446, 42717, 33041, -1782, 23272, 21514, 9164, 55067, 58756, 83510, 38098, 5253, -42199, -46946, 20074, 79797, 64392, 19179, 9450, 8897, -22416, 31035, 44107, 34616, 26185, 7307, -25474, -69721, -96013, -58656, 42160, 76842, -3197, -21474, -20744, 40106, 120849, 128698, 112339, 50787, 92748, 134354, 104070, 19639, -15401, -31737, -70292, -68236, -12244, -11710, -49298, -45132, 14217, 91766, 93050, 73134, 13214, -58434, -49033, -2163, 56545, 60427, -7180, 38067, 56657, 44719, 46355, 73588, 77525, 51946, 61909, 87791, 61625, 31733, 53422, 30954, 38824, 19086, -35230, -44033, -12662, 3992, 3928, -3826, 2500, -12319, -35038, -19445, -3576]
20289c576o7017l8452M0386P6213N5551L961k1282O0368J2719L573k1079l9798
20277F1567n8245l0755q616O3153K8378l4351o6441k5090N5569K8498L3552M3742
20265I0961j5006j2862m1012k8033O704J4304k4477N72J9186J0466K3737l3366
20253A1174l5583J0944r064J8813o7157l284R235L5014K2430N2512k0978P905
20241C1961N3043m1513m0009o9020l1623l5523K9126K0864K3599l1442l119L9549
20229e4107N5227K5014j0979K6285q812k4844J1840M8464J6412m5181K4161J5313
20217G8793j3642m4503o235p244L6315k7144k0313O653k8769n6593J2454M7276
20205b2952P1081J4122j520j5329k6681J8599J5469k0880o0254j6097M0506m4928
$$ y = [-3576, -70593, -109045, -68659, 7554, 63105, 67066, 45784, 106152, 118871, 122444, 101365, 61567, 3322, -27433, -36049, 27104, 55482, 21131, -45310, -70400, -14831, 13667, 47219, 90961, 75955, 63093, 22081, -5952, 752, 15056, -9421, -8849, 10337, 20803, 44540, 11174, -24409, -13465, -22529, -3716, -70873, -74157, -64922, -29908, -7478, 45034, 24056, 31961, 85004, 43491, 3482, -65538, -97161, -132684, -103558, -82694, -59095, -90537, -93656, -54107, 1120, 26134, 15155, 41440, 32628, 7784, 19624, 68088, 84500, 39319, 63480, 78793, 65151, 20648, 14413, 7169, 43484, 16340, -3973, 2680, -26089, -82682, -70228, -22952, 48129, 62251, 60731, 45402, 18721, 37320, 52789, 31909, -28345, -44442, -3936, -48864]
20193d8864J3489j0859j4739L0166K0242K7750K6932j4871j3951Q31O893m411
20181A8608j7310j8584j2012J1341l1009r3464O775P5050L9893P2258L5953m8910
20169C8589J1235n5545j2270j1203K2216L2514K3800l0135n5732J0742K3190L0455
20157B7856K0225l388k5437m948M9224L6514j1159o3873L8219L5418k3748o9414
20145E489K3914k848L8516J9490k2133l7180m8405k0480k4624L2178j235n83l888
20132d1789Q521L1717J2095J6001k487l6491j2591p244M2270M8026l8157p7956
20120e8085n7021K0066K7246O2996O9272k225J5524N3432j9802l2723m3967K1920
20108E6633N7184Q947J658m6659o3442L3998K0136J416r037o473o767m9560J6839
$$ y = [-48864, -35375, -46234, -60973, -30807, -10565, 17185, 44117, 29246, 15295, 16126, 23019, 18608, 1298, -17286, -29298, -17957, -48966, -142430, -135655, -60605, -20712, 51546, 87499, 38589, 49824, -5721, -17991, -29194, -6978, 25536, 49336, 19201, -36531, -25789, -2599, 27856, 48081, 44693, 19256, 14308, 63532, 100046, 88887, 25014, 63233, 98651, 74903, 5489, 29403, 26555, 65071, 84561, 62428, 25248, -23157, -43637, -68261, -36083, -37318, -37901, -41789, -33268, -1551, 10544, 26545, 24058, -12433, -25024, -32268, 10002, 58028, 19871, -58085, -115106, -95040, -67794, -4798, 64474, 62249, 77773, 131205, 111403, 78680, 34713, 56633, 113817, 122764, 124422, 77763, 14321, 48319, 68455, 69871, 60834, 54361, 47594, -1966, 14873]
20095A4873L9141O439K428k0194k2415o676K5995J6902K7759r567o4399l4909
20083b4623k0573l0653J4920L4215L7878j9087k6678l9694J1227J13199N512m1901
20071A3742m1837K7843L4172q67N1481P2718R069p3637l3969p066K7772n799r784
20058F3838N5205K7206N8161M7993O2940J08736N9402P5700K3317k5389r7358
20047D59751l0093R9320J01868J31180R8207J43950J66246Q4224L3680j08470
20037A179863j46424j49490j27274r0043K509l267N5493K0760k5112n1350n8705
20026F06960n6846j12398j40008m9222k7980l3264m6038J050m0200n0831j1246
20015C9977j1200j6032J6768K9094L089J2019n0771K7947J01530r008k948k892
$$ y = [14873, 54014, 60453, 62881, 42687, 20272, 13596, 39591, 56493, 84252, 74685, 10286, -24623, -45196, -75849, -60929, -26714, 11164, -7923, -34601, -74295, -63068, 50131, 55643, 13742, -28095, -252, 33920, 33053, 84534, 157252, 166321, 92684, 58715, 51649, 79421, 73622, 63838, 119043, 146249, 204410, 252403, 315343, 424079, 483481, 559181, 582498, 557109, 459751, 429658, 528978, 630846, 762026, 860233, 1004183, 1170429, 1254653, 1288333, 1179863, 1033439, 883949, 756675, 666632, 669141, 665874, 721367, 742127, 717015, 665665, 606960, 550114, 437716, 297708, 248486, 220506, 187242, 141204, 142254, 102054, 51223, 39977, 28777, 12745, 29513, 58607, 61696, 73715, 22944, 50891, 152421, 143413, 140465, 137573]
20003A37573l9808P257j4487j7011k8896N2146J4004L5588M318j4410n5804k2031
19991E8439J2810P4282O6601o801j1591k1237r918L7643p708n2035j2724N6855
19979A84616m3014p7446J5252j8208n4478l7148K867j794K8437O6703N40n8628
19967G699j6284J6951J9481M5644L8637M031J1372m3231j9432m8265k7453k1469
19955c2319j8481J092M066O1308O4293j5144L4644l6668J0214l9596k303J1853
19943D2959L8128O3993m1183n2610o2804K1147L3109O074L2673J6397J668O761
19931A06312j3555J0790k1307l8022p716K3352l7255k2076J0845j0522r45P7798
19919G7699O4250R206k528l9820m7483J3507j2204L189K2463k895L0114L6645
$$ y = [137573, 97765, 105022, 90535, 73524, 44628, 96774, 110778, 146366, 150684, 136274, 80470, 58439, 71249, 145531, 212132, 205331, 193740, 172503, 162585, 200228, 192520, 140485, 127761, 184616, 141602, 64156, 79408, 61200, 6722, -30426, -27559, -29353, -916, 65787, 66327, 7699, -8585, 8366, 27847, 73491, 112128, 116159, 127531, 84300, 64868, 16603, -10850, -32319, -50800, -49708, -45642, 15666, 79959, 64815, 99459, 62791, 73005, 33409, 31106, 42959, 81087, 145080, 103897, 51287, -11517, 9630, 42739, 48813, 81486, 97883, 99551, 106312, 92757, 103547, 82240, 44218, 36502, 59854, 22599, 523, 11368, 846, -99, 77699, 141949, 151155, 148627, 108807, 61324, 74831, 62627, 65816, 88279, 85384, 115498, 152143]
19907A52143q632j7266j0541n4395l8425J09L6911R78k9888j2495O0085N2658
19895A31242r635K2476r254n3249k87Q822l4106N361L3633o641o987r914q6346
19882a4885K6520L2501j6089L4579l427o834k7894K9441M5402K7656m0209o5753
19870B1008P4410L5362k0310k0643L344j0169l278k0764k6804L6649K0532k0668
19858F8669j2447Q011M6895j8859l3085L073Q415L506j0947J2981M3614L8013
19846A57839m6914m3602J6004J8704l3580l8934K4505m5112j1371O832P6027N1729
19834A32127l8054k6280J8976K3204m073j1912P458m709J865J1837K8513k3376
19822A15576J4703k241J9425k4697n655j8350n2799N1328K0969K9529q174m5548
$$ y = [152143, 143511, 126245, 115704, 61309, 22884, 22993, 59904, 60882, 30994, 18499, 78584, 131242, 121607, 144083, 134829, 81580, 81293, 90115, 56009, 61370, 95003, 88362, 81375, 71461, -14885, 11635, 44136, 28047, 62626, 59199, 52365, 24471, 53912, 99314, 126970, 86761, 21008, 95418, 130780, 110470, 89827, 93171, 83002, 79724, 58960, 32156, 68805, 89337, 68669, 56222, 64233, 111128, 92269, 59184, 62257, 70672, 74178, 63231, 76212, 119826, 157839, 110925, 67323, 83327, 102031, 68451, 29517, 54022, 8910, -2461, 4371, 80398, 132127, 94073, 67793, 86769, 109973, 105900, 93988, 101446, 96737, 98602, 110439, 138952, 115576, 130279, 128038, 147463, 122766, 117111, 98761, 45962, 97290, 118259, 147788, 139614, 94066]
19810I4066J3537M594k8129j9656M8487M9356J3293M0140j6935l1894K179L9867
19798B08905J5797k5826r209M1372j5947m5651K2759J3919N8706L9678m5667K5723
19786B84559K3654o974k3941j6684j5479R356k0714j9829n2013J4603Q6983k1120
19774B42401n5124j5884K3186Q5091k0783l28k6338k4115r209m4632L747k1397
19762A36615J420K9575J6553J8892o0282j6317M1446j893k5803L0139m0636K5764
19750A55473O1811K1428o0120k5321j6593J293L6040K5652J223K9722J6756l4952
19738B12412m758R237n8503n0214r315m4337m0708m1487m6551k9511m7153P6129
19726g4759J17426N1681L9063J2739j02995p9143j07916j14747m2943Q26O8513
$$ y = [94066, 107603, 112197, 84068, 64412, 112899, 162255, 175548, 215688, 198753, 166859, 169038, 208905, 224702, 198876, 189667, 231039, 215092, 169441, 192200, 206119, 264825, 304503, 258836, 284559, 308213, 301239, 277298, 260614, 245135, 254491, 233777, 213948, 161935, 176538, 263521, 242401, 187277, 171393, 194579, 279670, 258887, 258559, 232221, 208106, 198897, 154265, 158012, 136615, 138035, 167610, 184163, 203055, 142773, 126456, 167902, 166009, 140206, 170345, 129709, 155473, 217284, 238712, 178592, 153271, 136678, 137971, 174011, 199663, 200886, 230608, 247364, 212412, 207654, 216891, 158388, 108174, 98859, 54522, 13814, -27673, -74224, -103735, -150888, -74759, 42667, 94348, 133411, 146150, 43155, -35988, -143904, -258651, -301594, -300768, -232255]
19715b32255J14937N555o1717q9563L2381O2783r553m5953n1794j6326M2112N915
19703b43478K2262j5890k5450K896M9940o017k480P9136J37956R0766L9819J29972
19691B59432K5637p4422n1620K9836j837O8225J59982R8270R9109N7108j9486
19680F50234n2381j31059r8144p9645j4733J769N1160O2633N2986p5467l2276
19669C35077j0497o2698n4818j3831L7699K4715o5281l8065M0342o984k1472L2747
19657A96934n541n3879J5036M5827J3506J8159N1397K0349k8898q5208q890N0384
19645B29176J03513P4155J02465M0949j6104l9986o145K2815N7659O2691N6471
19634F87659r074N6627N1594q611p8084n1118m4112p0042j951J10402J39414J3974
$$ y = [-232255, -117318, -111763, -173480, -263043, -230662, -167879, -177432, -223385, -275179, -291505, -249393, -243478, -221216, -237106, -262556, -259660, -209720, -215737, -218217, -139081, -1125, 89641, 129460, 259432, 285069, 210647, 159027, 188863, 187026, 255251, 415233, 513503, 612612, 669720, 650234, 597853, 466794, 368650, 289005, 274272, 276041, 327201, 389834, 442820, 367353, 335077, 324580, 261882, 207064, 193233, 230932, 255647, 190366, 152301, 192643, 185659, 164187, 196934, 191393, 137514, 152550, 198377, 211883, 230042, 281439, 301788, 272890, 187682, 178792, 229176, 332689, 406844, 509309, 550258, 534154, 494168, 488023, 510838, 568497, 631188, 687659, 678585, 735212, 786806, 778195, 700111, 648993, 604881, 534839, 532888, 643290, 782704, 796678]
19622G96678l7387j23243j07889m4059o9390q0836n2684M4954O1482J0111m2717
19611C55020o4214J1063K1015K312o61l7791J335N8563j5156m2103K1561L4919
19599C45863N518l4750L8702M0900J7585l617K4251J3024M8665N1738P009J9860
19587E74748k1107j306Q7043J7069m552P1669R0607J04958O1974K3588L0424Q7397
19575A122512J6194J16555J17252P4429R0490J30630J81028L38518L82750L72103
19565B942461M17294N17624M83906M45714M45269L53872L99846N47039P60185
19556G313210R22565J142737J365572J752925K360516L209213M753057P638407
19548C0458202J2656533J8603157K0721000J6111887J0796330Q230145L317551
$$ y = [796678, 759291, 636048, 528159, 484100, 414710, 333874, 281190, 326144, 387626, 397737, 355020, 290806, 301869, 322884, 325196, 324535, 286744, 288079, 346642, 331486, 289383, 310944, 345863, 351381, 316631, 355333, 396233, 413818, 410201, 434452, 447476, 496141, 547879, 554888, 574748, 553641, 552335, 639378, 656447, 651895, 723564, 814171, 919129, 981103, 1004691, 1035115, 1122512, 1138706, 1255261, 1372513, 1446942, 1537432, 1668062, 1849090, 2187608, 2570358, 2942461, 3359755, 3877379, 4361285, 4806999, 5252268, 5606140, 6005986, 6553025, 7313210, 8235775, 9378512, 10744084, 12497009, 14857525, 18066738, 22819795, 30458202, 43114735, 61717892, 82438892, 98550779, 109347109, 117577254, 120894805]
19541A20894805m451347q827858p228516J79686J3637911K7351480L2183488K6792820
19533B00532469J7645302Q505079l066003j7087184k7812468l0665289k5208962
19526A22842944j2927703J709284R664206P429696L038266J004785m546476j3550233
19518A14664769j9233898k0517851j8991737j4800326r914365o356807m209526
19511B0640259k898579k112933j621520j297833j162625r73835p41458p00209
19503I131267o34061o61011o07794n67967n61868n05553m49185m22972m39512
19494D281344l78912k97341k41678l59864k07691j68569j88421j88873j94127
19485B055868j40341q5949q1271q3677l4191m615n9349n2235o6055q3274r9050
$$ y = [120894805, 116443458, 107615600, 100387084, 100566770, 114204681, 141556161, 173739649, 200532469, 218177771, 226682850, 223616847, 206529663, 178717195, 148051906, 122842944, 109915241, 111624525, 121288731, 128718427, 131756693, 132761478, 128215002, 114664769, 95430871, 74913020, 55921283, 41120957, 31206592, 24849785, 20640259, 17741680, 15628747, 14007227, 12709394, 11546769, 10572934, 9831476, 9131267, 8497206, 7836195, 7228401, 6660434, 6098566, 5593013, 5143828, 4720856, 4281344, 3902432, 3605091, 3363413, 3003549, 2795858, 2627289, 2438868, 2249995, 2055868, 1915527, 1829578, 1748307, 1664630, 1630439, 1625824, 1566475, 1514240, 1448185, 1364911, 1265861]
19474A265861p3135k7828j21868o9281q871k4270k8281K903J791L7540k2384m7775
19462H84402K911K2230o6066o5395k1534M333m1810l939o576K6287l1292o5767
19450F37784K1331O4923N5138O008q057O4210N0452P3645K0010k8589l4311J3806
19438I36350K2523J55849J24639J6663m72p6688r4864p3761o1321m473n7300L9230
19426I26375K172m9742k9430p1455p6765n5905r720O9572r20o1386l4108n6080
19414E52608J1684N42J6691j5868j705j275j2676J3963K5974J6378k5019j9557
19402E61740K3620K8309M1054L5311j1868N3598J19390P5121Q7080L38m6398J1783
19390I79078O6604O5595K2757J3895K2766K5715p2209p4956J359j2215o0877j5323
$$ y = [1265861, 1192726, 1164898, 1043030, 973749, 964878, 940608, 912327, 915230, 917021, 954561, 932177, 884402, 887313, 909543, 843477, 778082, 756548, 760881, 719071, 715132, 708556, 734843, 703551, 637784, 659115, 724038, 779176, 785184, 777127, 841337, 891789, 965434, 985444, 956855, 922544, 936350, 958873, 1114722, 1239361, 1256024, 1255552, 1178864, 1084000, 1010239, 948918, 944445, 887145, 926375, 928547, 878805, 849375, 777920, 701155, 645250, 635530, 705102, 704182, 642796, 608688, 552608, 564292, 564834, 581525, 565657, 563952, 562677, 550001, 563964, 589938, 606316, 581297, 561740, 585360, 613669, 654723, 690034, 678166, 731764, 851154, 926275, 1013355, 1013693, 967295, 979078, 1045682, 1111277, 1134034, 1147929, 1170695, 1196410, 1124201, 1049245, 1050604, 1038389, 977512, 962189]
19378I62189N1187L7454o6262r9955p6238r1308p2877p812j9675J9615m3900n1126
19366E41292q1018m6825N130J9260L4567O1083K602k8303J6797M3863n6574p4900
19354D36974o1547m0265j0174l3664M219N7257O1314M9323N7071R806l3221n4148
19342D42945n3581k9445l3121p1004j19051m1173K5450O5372P459j7339K3554
19331B00066K5769K7022k9762q727l2333m9979o3613m4386l9479l048N0408J2199
19319D4137j1503J3771k9481o2121m3942M2602M5641J1045K187m41M1073L5141
19307H8109l3010l5316o3843J569N003k2361j2532K2620O2984K2654R8207K5463
19295A59547l461r863o6773k2003k0837K4416P059K1637K9615l8942l0189O2961
$$ y = [962189, 1013376, 1050830, 984568, 884613, 808375, 717067, 644190, 636378, 616703, 636318, 592418, 541292, 460274, 413449, 418579, 437839, 472406, 533489, 536091, 507788, 524585, 568448, 511874, 436974, 375427, 335162, 324988, 291324, 295543, 352800, 414114, 463437, 520508, 530314, 497093, 442945, 389364, 359919, 326798, 255794, 136743, 95570, 121020, 186392, 193851, 176512, 200066, 225835, 252857, 223095, 214368, 182035, 132056, 68443, 24057, -15422, -18470, 31938, 44137, 32634, 46405, 16924, -45197, -89139, -46537, -896, 10149, 12336, 11895, 52968, 88109, 55099, 19783, -44060, -42491, -37488, -59849, -72381, -49761, 13223, 35877, 134084, 159547, 156086, 146223, 79450, 57447, 36610, 61026, 68085, 89722, 119337, 80395, 50206, 113167]
19283A13167K9429n0096j0671j5619R9598K8264l4586m6348l9580O742O3820K5945
19271A70065K3792l2477n8500j7129O8887O8701L570l910m2020j7439k1272K330
19259A44598J6269P8058K4028K083k4136K227j2410J4957j3786M4083L7049K0508
19247C33528K3262J3813j1535j834o884l7334J1605M6584J0335m5869J6882N6098
19235D08651p3091j8865j4137k0766K9038L4039O7700R9391L8988m4188l5559
19224D71201M2964l2936L1954O1927J09385J4320M3353N1767M9436K4610J8850
19213H86831J28018K75317K08095J43129J03351J32833J38407J53418J99252K29620
19203B598271K27389K07754L43517M18605L45770L12273M40838N30602O99165
$$ y = [113167, 142596, 92500, 81829, 66210, 165808, 194072, 159486, 113138, 73558, 80300, 144120, 170065, 193857, 161380, 102880, 85751, 154638, 223339, 226909, 222999, 180979, 163540, 142268, 144598, 160867, 238925, 262953, 265036, 240900, 243127, 230717, 245674, 231888, 275971, 313020, 333528, 356790, 370603, 359068, 357234, 350350, 313016, 324621, 371205, 381540, 335671, 352553, 408651, 335560, 316695, 302558, 281792, 310830, 344869, 412569, 511960, 550948, 506760, 471201, 514165, 481229, 513183, 575110, 684495, 698815, 742168, 793935, 843371, 867981, 886831, 1014849, 1290166, 1498261, 1641390, 1744741, 1877574, 2015981, 2169399, 2368651, 2598271, 2825660, 3033414, 3376931, 3795536, 4141306, 4453579, 4894417, 5425019, 6124184]
19194F124184R45299J318610J912538K909979M661087P960878J3063045J7400036
19186E6295656J4294018L850494m688414q016194o867521L529J0049275J6527329
19178H1448172J3096207M947631K114857J318731l952351j0275715j2836958j2352479
19170F3508095q522806m49083Q411025J1139520L601784o723909j2240640j4217642
19162D4506344j2476849q390450n117289l187253k122042j464974r92503n67157
19154A0187827j55790M3782J12796K35921K65921J54838K71804M75517N78021
19145A2170637P14050J125702J733072K787777M746656Q196594J3883687J9755962
19137F5114137J8282551P066016l945769q948276q744405k130366R015388J7929411
$$ y = [6124184, 7069483, 8388093, 10300631, 13210610, 17871697, 25832575, 38895620, 56295656, 70589674, 74440168, 69751754, 61735560, 54868039, 54871568, 64920843, 81448172, 94544379, 99492010, 101606867, 102925598, 98973247, 88697532, 75860574, 63508095, 54985289, 54536206, 62947231, 74086751, 77688535, 70964626, 58723986, 44506344, 32029495, 23639045, 18521756, 15334503, 13212461, 11747487, 10754984, 10187827, 10032037, 10075819, 10188615, 10424536, 10690457, 10845295, 11117099, 11592616, 12170637, 12884687, 14010389, 15743461, 18531238, 23277894, 31474488, 45358175, 65114137, 83396688, 90462704, 86516935, 77568659, 68824254, 66693888, 75709276, 93638687]
19129I3638687J6268066P133852K861857K396668k735296j0763851j4859461j4961826
19121G8978696j1322912k662982Q077491J3220482O203004o161104j3881020j6998766
19113E5452889j5895768j1344893p056743m489171l044236k166440j441612j055514
19105H958512p51668n69274n29074n35752m99551n35282m14475l47946l17837
19096D457653l02643k88899k59222j75165j86087k19941k75712k47287j89207
19087B313490k16910j35041j06787o7350o2741o9070J646N7123J07633J06873
19077A928866J7819l5266J6737K9460j6121k7615j01176j36941j47120k04413
19067A324230j43847j90128j59088j11122o1665q855J8370j697l1859k0897l5365
$$ y = [93638687, 109906753, 117040605, 119902462, 122299130, 119563834, 108799983, 93940522, 78978696, 67655784, 64992802, 73070293, 86290775, 92493779, 86332675, 72451655, 55452889, 39557121, 28212228, 21155485, 16666314, 13622078, 11455638, 10014026, 8958512, 8206844, 7637570, 7108496, 6572744, 6073193, 5537911, 5123436, 4775490, 4457653, 4155010, 3866111, 3606889, 3431724, 3245637, 3025696, 2749984, 2502697, 2313490, 2096580, 1961539, 1854752, 1787402, 1724661, 1655591, 1657237, 1714360, 1821993, 1928866, 1946685, 1911419, 1928156, 1957616, 1941495, 1913880, 1812704, 1675763, 1528643, 1324230, 1180383, 990255, 831167, 720045, 658380, 649525, 667895, 666198, 634339, 613442, 578077]
19056E78077l8563j10904K6757J8024l4543j3532r105O252J8117K8666j1881M1412
19044D98777M9649L7523j8300j4997J6461J0128J2924L1455O5940M7035N1441
19033G88036J00853J67546J15284P9147J02369J06912M3290j4505k8848Q6775
19023A546859R7028Q8045O9240L1552L0902L1705m3232j09707j40908j68836k00940
19012A231708j08529N1234K453P3604L2885L5303J2347o8428q0367j16527j41219
19001I24464l5624j3017N2929P6392p867q1543p7432n3155n4364l7578J6021k8779
18989F80447m0901M358k0117m1229n2199J2840J8464k0333n895N1472O9456M6879
18977G03242M3934k6556n6409q943J25420M5062J9067L1475j7240K0476L6028
$$ y = [578077, 539514, 428610, 455367, 473391, 438848, 425316, 416211, 422463, 440580, 469246, 457365, 498777, 548426, 585949, 567649, 552652, 569113, 579241, 592165, 623620, 689560, 736595, 788036, 888889, 1056435, 1171719, 1250866, 1353235, 1460147, 1503437, 1488932, 1460084, 1546859, 1643887, 1731932, 1801172, 1832724, 1863626, 1895331, 1852099, 1742392, 1601484, 1432648, 1231708, 1123179, 1174413, 1176866, 1250470, 1283355, 1318658, 1331005, 1262577, 1182210, 1065683, 924464, 888840, 875823, 928752, 1005144, 997277, 915734, 838302, 785147, 730783, 693205, 709226, 680447, 639546, 643904, 623787, 582558, 530359, 543199, 561663, 541330, 535435, 586907, 656363, 703242, 747176, 720620, 664211, 655268, 780688, 825750, 844817, 876292, 859052, 879528, 915556]
18966I15556J656M0225Q6090J16253J10995J24394J74957J69973J39309J41737
18956B021145J45570J51344J07383J02529K02319K91250L28961L33877K67289
18947C951667K81991L50861M50552N41619P00927R19481J264360J699975K653488
18938A2814921M379576P438030J2253603J6214196J3371047L980982l891945p001842
18930E9558568n641878Q66953J0436667J7483140J7077949J1480062L578435p735541
18922A07104355j5851970j6583230j3170995o471665K348811Q687034O654327
18915G2716667k144649r381915j2633795j2605611r508359n982873l713224k452530
18907A4293711j674156j231462q24568n09205l47251j27878L2009J60572J18061
$$ y = [915556, 917212, 957437, 1043527, 1159780, 1270775, 1395169, 1570126, 1740099, 1879408, 2021145, 2166715, 2318059, 2425442, 2527971, 2730290, 3021540, 3350501, 3684378, 3951667, 4233658, 4584519, 5035071, 5576690, 6277617, 7197098, 8461458, 10161433, 12814921, 17194497, 24632527, 36886130, 53100326, 66471373, 70452355, 66560410, 59558568, 53916690, 54783643, 65220310, 82703450, 99781399, 111261461, 114839896, 107104355, 91252385, 74669155, 61498160, 55026495, 57375306, 66062340, 72716667, 70572018, 61190103, 48556308, 35950697, 26442338, 20459465, 16746241, 14293711, 12619555, 11388093, 10563525, 10054320, 9707069, 9579191, 9611200, 9771772, 9889833]
18898I889833R7953K63555L72615O50508Q67072J286705J956348L075613N102863
18889B3563065Q778177J4790335K1389168K0793602R408730l244807r604513r943656
18881G5930101l257732Q708093J9826163K3095484J8550131J0081048m290225
18874A48643063j8348672k2911281k0383953j2955367j655586Q474284R814312
18867I0676800N77202r803034j5198090j6622167j3971942r487742n962064l914005
18859A6294958k716797j871485j332594r93181p10003n44242n57444o35125o73975
18850F260112o24877m76019l07190k80012k93884k43710k17241j93689j92324
18841C431166k72486k89934l17089j81712j58175j19169j21757j79271o7165o7762
$$ y = [9889833, 9987786, 10251341, 10623956, 11274464, 12141536, 13428241, 15384589, 18460202, 23563065, 32341242, 47131577, 68520745, 89314347, 98723077, 95478270, 85873757, 75930101, 72672369, 81380462, 101206625, 124302109, 142852240, 152933288, 148643063, 130294391, 107383110, 86999157, 74043790, 72388204, 80862488, 90676800, 91254002, 81450968, 66252878, 49630711, 35658769, 26171027, 20208963, 16294958, 13578161, 11706676, 10374082, 9380901, 8670898, 8126656, 7569212, 6934087, 6260112, 5635235, 5159216, 4852026, 4572014, 4278130, 4034420, 3817179, 3623490, 3431166, 3158680, 2868746, 2551657, 2369945, 2211770, 2092601, 1970844, 1791573, 1724408, 1656646]
18831A656646q7763p2012j2520M3919K869j16963j39124N489m8396K8997O684
18820A267826o2495p6543L583M0119J1931j09287n4861R4248m1912m0651l1517
18809A000441o7151o150m3466o1322m3189m8317n6869m5173N60k5497n176k4632
18797E74059n6497j9831K8229J9476j794m4278N1098O6718N5980n3180k8358O149
18785E97771k5822j7449j6257R637J9281K1931K5008J9034m7518j6438K6961M0303
18773F36442L1772O2254M5046l604K5985M9279L3693Q5365J54067J32737O0748
18762A313784L0119l6215j24418j56283j34161q1663m9247n3484j9594j1706m8612
18751F28520j6827m8883q9505m7097N0796j5782k5004l0029o84M2527J6141J2937
$$ y = [1656646, 1568883, 1496871, 1484351, 1528270, 1531139, 1414176, 1275052, 1280541, 1232145, 1261142, 1267826, 1205331, 1128788, 1132371, 1172490, 1184421, 1075134, 1020273, 1114521, 1072609, 1031958, 1000441, 933290, 927140, 883674, 822352, 779163, 730846, 673977, 628804, 629364, 603867, 598691, 574059, 517562, 497731, 525960, 545436, 543642, 499364, 550462, 617180, 673160, 619980, 591622, 597771, 571949, 554500, 538243, 547880, 567161, 589092, 614100, 633134, 585616, 569178, 596139, 636442, 668214, 730468, 775514, 771910, 797895, 847174, 880867, 966232, 1120299, 1253036, 1313784, 1343903, 1307688, 1183270, 1026987, 892826, 811163, 761916, 708432, 688838, 677132, 628520, 611693, 562810, 473305, 426208, 477004, 461222, 436218, 406189, 405505, 448032, 464173, 477110]
18739D77110l506k8661L359J1785j8868k56j889j4413k8203m4254j7075K7481
18727C62610M8715n040J1668M7542K3442N036o1543n738J3104n1365k4553M1701
18715D05579j8217P868L1079N3701J428k2079L6068L4141O3892K573n067j01455
18703D89511q260P2199o5493k4478o6806l9931J2411k2157m7610r2554J0911J20971
18691C38714P5869p2m7874p5401j44441j09473o7156m6997J2681M5903N6640P5458
18679A13851L2701l6904o8736j4645k324K8786J9039Q1146J18963J42127q209
18668D05795m9941n1422n1988j5368N4852J0462j8451K9358N0615J33908J02042
18657E99862J3599m490k7179p1064K576N2796N0682O7300O4296J5889L2983M5895
$$ y = [477110, 473604, 444943, 448302, 460087, 441219, 440963, 439074, 424661, 396458, 352204, 335129, 362610, 411325, 406285, 417953, 465495, 488937, 493973, 432430, 426692, 439796, 388431, 363878, 405579, 387362, 395230, 426309, 480010, 481438, 459359, 495427, 529568, 593460, 596033, 590966, 489511, 481251, 553450, 487957, 463479, 396673, 356742, 369153, 346996, 299386, 206832, 217743, 338714, 414583, 414511, 366637, 291236, 146795, 37322, -29834, -76831, -64150, -18247, 38393, 113851, 146552, 109648, 40912, 26267, 23943, 52729, 71768, 152914, 271877, 414004, 405795, 355854, 304432, 252444, 237076, 291928, 302390, 283939, 313297, 363912, 497820, 599862, 613461, 608971, 581792, 510728, 513304, 566100, 616782, 684082, 748378, 764267, 797250, 843145]
18645H43145Q2021J18865O7610J89397K07625K53970L31015L15068K65143K00232
18635B874091K04129J86557K10132J59200J06422L6579L9936J06736K26204M73266
18625D623252O40331R95797J340841J739603K359501L186907M666220P480106
18617B7032558J2408241J8650750K0623803J8356562J9195202J3605604J541108
18610A31413828n412502j0009147j8772399k1852840j8852016j6233408j1796402
18603B8485114p446456m613393k941777j934745j378669r78981p44982n90991
18595G855120l29972k41983j27535M9426K40197L08988K70152K15067J16642N440
18585H361542j05778k95226l35591l16623j04643L1331J48408M50516P29459R91395
$$ y = [843145, 925166, 1044031, 1111641, 1301038, 1508663, 1762633, 2093648, 2408716, 2673859, 2874091, 3078220, 3264777, 3474909, 3634109, 3740531, 3777110, 3817046, 3923782, 4149986, 4623252, 5263583, 6259380, 7600221, 9339824, 11699325, 14886232, 19552452, 27032558, 39440799, 58091549, 78715352, 97071914, 116267116, 129872720, 131413828, 126001326, 115992179, 97219780, 75366940, 56514924, 40281516, 28485114, 21038658, 16425265, 13483488, 11548743, 10170074, 9191093, 8446111, 7855120, 7525148, 7283165, 7155630, 7205056, 7445253, 7754241, 8024393, 8239460, 8356102, 8361542, 8255764, 7960538, 7624947, 7308324, 7203681, 7235012, 7383420, 7833936, 8563395, 9554790]
18575I554790J351852J852894K608014L701048N520161Q487579J3762262K2134138
18567F8972738L0270415L1453348K9457377K8180671J6752790l26581j0409596
18560A94351162j9475190l0615561l3085138k8845676k3722958j6788674j0461529
18553C1356436o452630m267876l021309k221114j664097j268050r85336p35722
18545A0740302n35766l52463L1360K61069K78783J88849K5838K4634m1640k08157
18535A0412809k58202k43148k03001j8591J85499L25493M59890N76515P00824
18526A1938088R41089J273902J694019K457518L571093N249320Q220785J2809793
18518D8155607J7309257J8462066K1408159K8009401L2798742L7458220L2889627
$$ y = [9554790, 10906642, 12759536, 15367550, 19068598, 24588759, 33076338, 46838600, 68972738, 99243153, 130696501, 160153878, 188334549, 205087339, 204760758, 194351162, 174875972, 144260411, 111175273, 82329597, 58606639, 41817965, 31356436, 24903806, 20635930, 17614621, 15393507, 13729410, 12461360, 11476024, 10740302, 10204536, 9852073, 9883433, 10144502, 10423285, 10612134, 10637972, 10662606, 10620966, 10412809, 10154607, 9911459, 9708458, 9689867, 9875366, 10200859, 10660749, 11237264, 11938088, 12879177, 14153079, 15847098, 18304616, 21875709, 27125029, 35345814, 48155607, 65464864, 83926930, 105335089, 133344490, 166143232, 203601452, 236491079]
18511B36491079J0803398r224251r081445j583525k306279j3700272k3667870
18504A87730835k4049127j3665708P236842K3939389J9380252L134680l607091
18497B00100072J106206M229389n907047k2750216l3229733l6173484l1726119
18490G5649068k1947182j3394733q349774n596141m003964k999610k168402j746486
18482A5442776j386819j156507r92064p00848n66981o11907o63733o23265n17947
18473H222705n02489n25419n09706l81249k96624k96624l32601k78399k17243
18464D882351k13747j94850k55295k88711j93356j03618k8671k1808o1093j74226
18454C346976j84800j13320m6964j25853k88735l01634j40461j43072j60506r420
$$ y = [236491079, 247294477, 238070226, 228988781, 227405256, 225098977, 211398705, 187730835, 163681708, 150016000, 157252842, 181192231, 200572483, 203707163, 200100072, 201206278, 205435667, 199528620, 176778404, 143548671, 107375187, 75649068, 53701886, 40307153, 31957379, 26361238, 22357274, 19357664, 17189262, 15442776, 14055957, 12899450, 11907386, 11206538, 10639557, 10027650, 9363917, 8740652, 8222705, 7720216, 7194797, 6685091, 6303842, 6007218, 5710594, 5377993, 5099594, 4882351, 4668604, 4473754, 4218459, 3929748, 3736392, 3632774, 3604103, 3582295, 3521202, 3346976, 3162176, 3048856, 3001892, 2876039, 2587304, 2285670, 2145209, 2002137, 1841631, 1832211]
18444A832211n9865r1384p7988o1443Q909M343m217m6891o4335n3920m5186m8611
18432A291623m8571n92N0759K6776l4120j3962m2497r3881n3560n1633j04441
18421I25901m4105r179k8506j8412J0820P0668Q5857N4238J26867R7271k9050
18410A242370m7229K027m8713k3899O9409J58150J41633J23895J5527j01887j60656
18399A370627j46045o2281o6587M7177P0345J5327m1362j3861q2638p1704l7505
18388I81493p2852n0948n4891J3974K0935J0580L3341M2816k9725K2054N1816
18377I68593l2437o6959n7356j6374n4112j46582j00711J9808P018l7183N5124
18366E38829O5449O8972P5066N5595p904o881M0272K1645O0793O2444J16966J00588
$$ y = [1832211, 1772346, 1680962, 1602974, 1541531, 1550440, 1554783, 1550566, 1503675, 1439340, 1385420, 1340234, 1291623, 1243052, 1242460, 1293219, 1319995, 1285875, 1271913, 1229416, 1135535, 1081975, 1030342, 925901, 881796, 872617, 844111, 825699, 836519, 907187, 993044, 1047282, 1174149, 1271420, 1242370, 1195141, 1197168, 1148455, 1124556, 1193965, 1352115, 1493748, 1617643, 1633170, 1531283, 1370627, 1224582, 1162301, 1095714, 1142891, 1213236, 1228563, 1187201, 1173340, 1090702, 1018998, 981493, 908641, 857693, 802802, 816776, 837711, 848291, 881632, 924448, 894723, 916777, 968593, 936156, 869197, 811841, 795467, 741355, 594773, 494062, 513870, 520888, 483705, 538829, 604278, 673250, 748316, 803911, 796007, 789126, 829398, 851043, 911836, 974280, 1091246, 1191834]
18354A191834k897p7995j47365j08069q6364M819P3549N3359L3965j1198O280
18343I29918o6771m7632K5100k6161m6708k472K6814J7153L1945N0029M0331k0771
18331I10775j1774P1379R1011J5187J3289L3526K1162O9808J9369j50972j36584
18320I46176m9975M0763K820l1248o7288k7426P6305L3665M6852k2534q8778j0771
18308H48561M094l5262p2856n5433o0189j3485j7722J7713J0568N4387P1355L4848
18296G86579n9145j00148k7528o5629K8206M5069K5089k6462O4079O7184K0731
18285G58025J4537M5573O2753Q1594K5473N0452L6852L7827M0925K4659M4870
18274A223540N2794J7568M7407n218o5403k4701K4171L0290Q6328L9686o545L804
$$ y = [1191834, 1188937, 1110942, 963577, 855508, 769144, 773963, 847512, 900871, 934836, 923638, 929918, 863147, 815515, 840615, 814454, 767746, 765274, 792088, 809241, 841186, 891215, 931546, 910775, 899001, 970380, 1061391, 1076578, 1089867, 1123393, 1144555, 1214363, 1233732, 1082760, 946176, 896201, 936964, 939784, 908536, 841248, 813822, 890127, 923792, 970644, 948110, 859332, 848561, 852655, 817393, 744537, 689104, 628915, 615430, 597708, 615421, 625989, 680376, 751731, 786579, 727434, 627286, 599758, 534129, 562335, 607404, 632493, 606031, 670110, 737294, 758025, 772562, 818135, 880888, 962482, 987955, 1038407, 1075259, 1113086, 1154011, 1178670, 1223540, 1276334, 1293902, 1341309, 1336091, 1270688, 1245987, 1270158, 1300448, 1386776, 1426462, 1419917, 1423721]
18262A423721k7357l736J3767o784n7150k0211O51p1342o11n533K8391R260o0995
18249A222071j7836J3132K6849j3516J2054j9713J4007j3595q1070l7054J8112
18238A123441L3541J5811k3435O6334M692L5755Q957k7464L5127L2308j1687j3602
18226A279778J2460O8311n142l5431K8277L9445j4101n4099l7961o1705k0101
18215A199731L4764n426j4218k459l920m4618k8277J8144m8226k955l2753m0870
18203A028917k526j1028m2668p907j2061j2957j5672j3451K5429J1616m1147r833
18191H96712k2337m2341J6938m0582n2476Q6943L0023j8160k2362k1521l7408
18180G73429M654N9928j1037K6027M9432j9911o4381k2042N585L4274L1338M8957
$$ y = [1423721, 1396364, 1392628, 1406395, 1399611, 1342461, 1322250, 1322901, 1251559, 1250948, 1245415, 1273806, 1283066, 1222071, 1204235, 1217367, 1244216, 1230700, 1242754, 1223041, 1237048, 1223453, 1142383, 1105329, 1123441, 1156982, 1172793, 1149358, 1215692, 1220384, 1256139, 1265096, 1237632, 1272759, 1305067, 1293380, 1279778, 1292238, 1360549, 1355407, 1319976, 1348253, 1387698, 1373597, 1319498, 1281537, 1219832, 1199731, 1234495, 1229069, 1214851, 1212392, 1208472, 1163854, 1135577, 1153721, 1105495, 1102540, 1069787, 1028917, 1026391, 1015363, 972695, 964788, 952727, 939770, 924098, 910647, 936076, 947692, 906545, 896712, 874375, 832034, 848972, 808390, 755914, 842857, 872880, 854720, 832358, 810837, 773429, 778083, 838011, 826974, 853001, 902433, 882522, 818141, 796099, 801684, 835958, 867296, 916253]
18168I16253k932J7230j5983M271L6613K5314N5626K9103J2441r510Q6580M8874
18156A203880M3004R5851R7872N4938J17793Q1868K9407L3817P9420J30801P2825
18145B041476M3946J0960n687J5286P6226J08733P3840P8102R7372O6352M0834
18134B647440P7317N0194K4015K2172O9757O9860R3779J09155J39094J23080M9726
18123C475589K1503J07941J82564K02717K18591L45975M03004M82083N51068P33943
18113F724978Q37872J201245J926942L031110N079186R256129J8309481L2210278
18105G8577221K9419094l120690j5954295k1007316k4655786j5817119q286882
18098A9154227m600803k767734j839574j395027r66812p38866o71359n24411m70500
$$ y = [916253, 913321, 930551, 914568, 918839, 955452, 980766, 1036392, 1065495, 1077936, 1068426, 1155006, 1203880, 1246884, 1342735, 1440607, 1495545, 1613338, 1695206, 1724613, 1758430, 1837850, 1968651, 2041476, 2085422, 2096382, 2090695, 2105981, 2182207, 2290940, 2364780, 2442882, 2540254, 2606606, 2647440, 2724757, 2774951, 2798966, 2821138, 2890895, 2960755, 3054534, 3163689, 3302783, 3425863, 3475589, 3497092, 3605033, 3787597, 3990314, 4208905, 4554880, 4957884, 5439967, 5991035, 6724978, 7562850, 8764095, 10691037, 13722147, 18801333, 28057462, 46366943, 78577221, 107996315, 104875625, 88921330, 67914014, 43258228, 27441109, 19154227, 14553424, 11785690, 9946116, 8551089, 7584277, 6845411, 6174052, 5649641, 5179141]
18089E179141m29078l74480l64064l15839l06728j37291j08489j66526j79493
18080B797153j59871j28176p4093j05389j59845j07082O642k3582o1781r7595
18070A886381k5639o3110r8846m5688J8300o5748m3191j19401r4955n9928J651
18059A289826O059K9031K5378l1336j870K0532J00471J23792R4360K3387Q6139
18048A765769P4780K016o665n0721j85829j51570j61755j66622r1496j35485j32089
18037G60333o4020o4285q4926k363J2803r086l6571k8704j2574O683R257Q480
18025D95027l4118K8796J3371Q335m6379k2359L8403j802m5019m9336o662j171
18013C77086j241P039K3288K7081M9663m04O018P6340J5153Q755P0608P7436M5091
$$ y = [5179141, 4750063, 4375583, 4011519, 3695680, 3388952, 3251661, 3143172, 2976646, 2797153, 2637282, 2509106, 2435013, 2329624, 2169779, 2062697, 2069339, 2045757, 1983976, 1886381, 1860742, 1797632, 1698786, 1653098, 1671398, 1605650, 1562459, 1443058, 1348103, 1288175, 1289826, 1295885, 1324916, 1350294, 1318958, 1317088, 1337620, 1438091, 1561883, 1656243, 1679630, 1765769, 1840549, 1842565, 1835900, 1785179, 1599350, 1447780, 1286025, 1119403, 1027907, 892422, 760333, 696313, 632028, 547102, 544739, 557542, 548456, 511885, 483181, 470607, 477290, 486547, 495027, 460909, 489705, 503076, 511411, 465032, 442673, 481076, 479274, 434255, 384919, 378257, 377086, 375845, 382884, 406172, 433253, 482916, 482512, 488530, 564870, 580023, 588778, 659386, 736822, 781913]
18000G81913R1855K6805k4482k1720n26K7331o6462o5230m1521q1918N3366J4196
17988F93607J3177K4039n976k1177j8722n4901K5814l0693n1883j1867n0671n1336
17976D59411l0782l610l3900k3774J263L4771k8769l7008l6038j6809K1531L5821
17964C42107r650k8857k5469P2879K1197O2229M2666k443r4424J0412O4913L0494
17952D86054N8624N078K0112n2640j7101N8974L0398k3514k2485N5112M4850M56
17940F43918q960K5142J04461P3898L8883j4250m3246p7956K9045K0818k9773
17929G61980R5662J0501q7183k4761L4875j611l6781L8204R5717o653R589Q4976
17917I74515J6445n175j05488r4195P837j2364L7243j023m1181k4260K7105J1101
$$ y = [781913, 873768, 900573, 876091, 854371, 853845, 881176, 814714, 749484, 707963, 626045, 679411, 693607, 706784, 730823, 724847, 703670, 684948, 630047, 655861, 625168, 573285, 561418, 510747, 459411, 428629, 425019, 391119, 367345, 368608, 403379, 374610, 337602, 301564, 284755, 306286, 342107, 332457, 303600, 278131, 351010, 372207, 434436, 477102, 474659, 380235, 390647, 455560, 486054, 544678, 549756, 569868, 517228, 500127, 559101, 589499, 565985, 543500, 598612, 643462, 643918, 634958, 660100, 764561, 838459, 877342, 863092, 819846, 741890, 770935, 791753, 761980, 857642, 868143, 780960, 756199, 791074, 789463, 752682, 790886, 886603, 879950, 889539, 974515, 990960, 985785, 880297, 786102, 793939, 781575, 818818, 817795, 776614, 752354, 779459, 790560]
17905G90560N6311l950L2139M6059P0077N7270M2268J8319q139J5799N8605N2143
17893A227461K4751K1608P7337O5955O3752J11322J00134J81233K18035K18772
17883B310360O4327J26660P8913N2215N6015o0205j45397j19279j66604j64574
17873B032431q0041J0361o720N572M4546N7625J16634K68669L46562L09738K23883
17862C329260P1216N1139R8742L9720r3242j62791k15210j99208j01723p0483
17852B747420o416m8775n7098m9362P675n5457j44027j70199j79978j04838p0272
17841A868673j00668r7624l2293J5684N569O238J8827J968k0568o1670r864N4954
17829A649226j6898l9431J8274l0500m9829J136l7864m8080n1039m6352k1476
$$ y = [790560, 846871, 842921, 875060, 921119, 991196, 1048466, 1090734, 1109053, 1100914, 1116713, 1175318, 1227461, 1252212, 1273820, 1351157, 1417112, 1480864, 1592186, 1692320, 1873553, 2091588, 2310360, 2374687, 2501347, 2580260, 2632475, 2688490, 2628285, 2482888, 2363609, 2197005, 2032431, 1952390, 1962751, 1956031, 1961603, 2006149, 2063774, 2180408, 2449077, 2795639, 3105377, 3329260, 3400476, 3451615, 3550357, 3590077, 3496835, 3334044, 3118834, 2919626, 2817903, 2747420, 2741004, 2692229, 2635131, 2585769, 2593444, 2537987, 2393960, 2223761, 2043783, 1938945, 1868673, 1768005, 1670381, 1638088, 1653772, 1659341, 1665579, 1684406, 1686374, 1665806, 1604136, 1594272, 1649226, 1632328, 1592897, 1611171, 1580671, 1530842, 1531978, 1494114, 1446034, 1394995, 1348643, 1327167]
17818A327167l1934l2486j9806N5162J7148j17045m3632m676k604M8953L5254
17807A231501L7878m563n510K4305N0470k562K0881m4932K7416L4481j8746k4502
17795A326117l069o5883j9261J5073Q56m7611o0329m7480R39J4555L1526k8658
17783A116775n5512l21N5356K9583M5442J4169R96k77l7370o8237p7384N350L658
17770A032228k9336j507j4343l3286k8575k7606n4649J4205K4847L1196n83l7627
17758H74964J9814K627k3286K0216J8434j3281K5149K9621l6754l5211J2818L6791
17746I31902l3236m5380N1709k426j0160p6396l50K1217j1440m9287K6126M4916
17734H47195n1733r047N1225l7472j07875j8945J6071O6671n9044n7036k5137
$$ y = [1327167, 1295233, 1262747, 1242941, 1298103, 1315251, 1198206, 1154574, 1149898, 1147294, 1196247, 1231501, 1269379, 1264816, 1259306, 1283611, 1334081, 1331519, 1352400, 1307468, 1334884, 1369365, 1350619, 1326117, 1323048, 1257165, 1237904, 1252977, 1253833, 1206222, 1145893, 1098413, 1099352, 1113907, 1145433, 1116775, 1061263, 1060942, 1116298, 1145881, 1191323, 1205492, 1206488, 1206211, 1168841, 1100604, 1023220, 1028570, 1032228, 1002892, 1001385, 987042, 953756, 925181, 897575, 842926, 857131, 881978, 913174, 912591, 874964, 894778, 897405, 874119, 894335, 912769, 899488, 924637, 954258, 917504, 882293, 895111, 931902, 898666, 853286, 904995, 902569, 892409, 816013, 815663, 836880, 825440, 776153, 802279, 847195, 795462, 786415, 837640, 800168, 692293, 673348, 689419, 756090, 697046, 640010, 614873]
17723F14873K051J6039R684L1242O4854m6770o7335j0899l1513K0052K9802p6720
17711E55360j3374L7728K8854J5172Q452l6731m3660K0922j839K821l9185J5631
17699E50151J6030l6443r2856k9166L0187L3049L1234l876m8418J4559L3195l8433
17687D59213n6227n6552P4222L9651L0667L8122o264j9987K5941l2636j7762m8328
17675D30060j4779j6611O9643K1844m1445Q733K3650j2684n7148K6749M2125L3574
17663E13711K0647m1442q4388O820n826n4312m4601l806K7908J0169L6193j6584
17651C64489m3328L9225j3285J6675k526j6231M7715J2325R945P812j1301N2985
17639D64500o3837k7765N64M984l601j2041O145Q3206M1625k4914m6920K7802
$$ y = [614873, 616924, 632963, 642647, 673889, 738743, 691973, 624638, 613739, 582226, 602278, 632080, 555360, 541986, 579714, 608568, 623740, 632192, 595461, 551801, 572723, 570884, 573705, 534520, 550151, 566181, 529738, 436882, 407716, 437903, 470952, 502186, 498310, 449892, 464451, 497646, 459213, 402986, 346434, 420656, 460307, 490974, 529096, 522832, 502845, 528786, 496150, 478388, 430060, 415281, 398670, 468313, 490157, 448712, 457445, 481095, 468411, 411263, 438012, 480137, 513711, 534358, 492916, 408528, 415348, 409522, 355210, 310609, 306803, 334711, 344880, 381073, 364489, 321161, 360386, 347101, 363776, 361250, 345019, 392734, 405059, 415004, 422816, 411515, 464500, 400663, 372898, 373462, 378446, 374845, 362804, 368949, 452155, 493780, 468866, 421946, 449748]
17627D49748J6277j6703j6701P1630J4352k9272l8475k4018K8234j1704k5889
17616D17479m2212M2299P730l0985j0130k7051j470K5411K0467J0241P3299J3861
17604D98939j3082o4891o178J529P625M2027N910o3620k9468N8189K425L6995
17592D76400M0393m3722k1819J5696J4455N6005N4152l2828Q465k5259j4848q3682
17580D43408n3650R121K8211k833M5060N3189k3202Q654J2415L5524K5365Q661
17568E89923k2252M0182q3381K2731Q4931j7748K4810J3513p2142n6803j0590
17557E13174J349j7493o683n1386j6942n137J9189J0428Q045K5236Q478k1655
17545D66603l8142N7253N4007J6124m7088j8099k9371N3359M4533L3774l0626
$$ y = [449748, 466025, 449322, 432621, 504251, 518603, 489331, 450856, 426838, 455072, 443368, 417479, 375267, 417566, 425296, 394311, 384181, 357130, 355660, 381071, 401538, 411779, 485078, 498939, 485857, 420966, 414788, 416317, 423942, 465969, 471879, 408259, 378791, 436980, 439405, 476400, 516793, 473071, 451252, 466948, 481403, 537408, 591560, 558732, 567197, 541938, 527090, 443408, 389758, 398879, 427090, 424257, 469317, 522506, 499304, 507958, 520373, 555897, 581262, 589923, 567671, 607853, 524472, 547203, 632134, 614386, 639196, 652709, 580567, 523764, 513174, 514523, 497030, 490347, 438961, 422019, 416882, 436071, 446499, 454544, 479780, 488258, 466603, 428461, 485714, 539721, 555845, 508757, 490658, 461287, 514646, 559179, 592953, 562327]
17534E62327n0326n2706J4491l166k466L455R37m5517m551n4569r7651o1585N8088
17521B66761n0059p1106m4591K0170l923K1867p10P1183M5146J6614M2013j205
17509C12160J5485L4230N1833q0924l8316k3337p7693k7802J1675j4230O901j05529
17497F4453p5421j0106P6267J08323R0850J74037K40466J04513m5176m6606j09598
17486E72002j12676j17857j12641q860R5657J61100J71575J83604M3474k8166
17476H47212j10465j82082m0321k4531P1580R8200K11851K46976R9582q5887j96634
17465I35481k13328j79956j04289l0513M1117J57604J88766K90203J97077p8788
17455A203374j76418k28846j70344j38749o8252j2879n7167q659K075O0586j8406
$$ y = [562327, 512001, 459295, 473786, 470620, 468154, 471609, 472546, 427029, 422478, 367909, 270258, 208673, 266761, 216702, 145596, 101005, 121175, 117252, 139119, 138409, 209592, 254738, 271352, 313365, 312160, 327645, 361875, 413708, 332784, 294468, 271131, 193438, 165636, 177311, 163081, 169982, 64453, -10968, -21074, 55193, 163516, 254366, 428403, 668869, 773382, 728206, 681600, 572002, 459326, 341469, 228828, 219968, 315625, 476725, 648300, 831904, 875378, 847212, 736747, 554665, 514344, 489813, 561393, 659593, 871444, 1118420, 1218002, 1132115, 935481, 722153, 542197, 437908, 407395, 448512, 606116, 794882, 1085085, 1282162, 1203374, 1026956, 798110, 627766, 489017, 420765, 407886, 350719, 342060, 344135, 404721, 386315]
17444C86315L2290P885L4023Q1604J38952K26812L5962r4159r6296j63753p2648
17433E16987p8734J0027L3925n2352L4670O025o058J1798l6415l5319M5899O1195
17421E11648M7229N197L0305N4654R737L4365m6034n4739k2053m4041n2956k9620
17409D43692N6553N3379M6497Q86j7866J0525j5180o2344K0497O1722K2287M2441
17397F63089L5845J3791K4518M1277n3101q7035j3818J5653K8421j8395J3704
17386F63949l5511o605M0928L3518J44820J02579N5388P3229K3640j1640L8115
17375A122410L3098P0293R2869P1591J31606J16811J26704J95647K83020K72723
17365B516772K30588J75075K35373L22869M02972K72816P0413K5079Q6735J26891
$$ y = [386315, 418605, 426490, 460513, 542117, 681069, 907881, 943843, 849684, 753388, 589635, 516987, 438253, 448280, 482205, 429853, 464523, 470548, 464490, 476288, 439873, 404554, 450453, 511648, 558877, 564074, 594379, 649033, 658770, 693135, 647101, 592362, 570309, 526268, 473312, 443692, 500245, 553624, 600121, 601007, 583141, 593666, 578486, 516142, 536639, 598361, 620648, 663089, 698934, 712725, 737243, 778520, 725419, 638384, 624566, 640219, 668640, 650245, 663949, 628438, 621833, 662761, 696279, 841099, 943678, 999066, 1072295, 1095935, 1084295, 1122410, 1155508, 1225801, 1318670, 1390261, 1521867, 1638678, 1765382, 1961029, 2244049, 2516772, 2747360, 2922435, 3157808, 3480677, 3883649, 4156465, 4226878, 4251957, 4338692, 4465583]
17355D465583J58273J98217J85417K14434K78267N24784P81732J014624J242609
17346I063940J638509K116899K542213L427301N158080Q287636J3856894K3699405
17338F9790877L5703923L8492728K3731111N903640R51091N280248N568063p105278
17330A78316403k2970562l1158562l2544814k6809981j7175144r435478m828097
17323C3393765k118341q5637K145894N170536R876411J8164196L1248432M2707900
17315A40503156L7289104J6109561J418069J498414O265808P02104j6682653l0884231
17307A56219332l6825292l5260936k6438689j6449859r845010o301499m238796
17300B0859251k949260k262775j758898j541009j317230j163121r43178p21891
$$ y = [4465583, 4623856, 4822073, 5007490, 5221924, 5500191, 6024975, 6806707, 7821331, 9063940, 10702449, 12819348, 15361561, 18788862, 23946942, 32234578, 46091472, 69790877, 105494800, 143987528, 167718639, 173622279, 174573370, 179853618, 185421681, 178316403, 155345841, 124187279, 91642465, 64832484, 47657340, 38221862, 33393765, 31275424, 31189787, 33335681, 38506217, 48382628, 66546824, 97795256, 140503156, 177792260, 193901821, 195319890, 196818304, 203084112, 203786216, 187103563, 156219332, 119394040, 84133104, 57694415, 41244556, 31399546, 25098047, 20859251, 17909991, 15647216, 13888318, 12347309, 11030079, 9866958, 8923780, 8201889]
17292H201889n15337l95065l90495m21613l00168k59616k12539k40230j99274
17283E267552j37310j96955k00949k39337k51331j99131k33745l01573l20308
17274C186913k48155k78023k61881k33396j81193j31715j21401k6399j22404j03033
17264A479313q792m5397p1957J1083m6081M0256K679k9866m0524n9051q5336n8756
17252A087571o6254k9490m078q6940r796J6313J4503J2711j023L77K9711k4847
17240I38758o8766O72k9209q4261o6408L0631L0245p456o3582J6244J0839l8041
17228F69666k6099l9056k2312o4381k2682K4651o46P539J2214j1102K5716k0852
17216E32656M0000M3396m5059p5748j6805K2334L6742L0269M3674k0726Q53N7405
$$ y = [8201889, 7686552, 7291487, 6900992, 6479379, 6179211, 5919595, 5707056, 5466826, 5267552, 5130242, 4933287, 4732338, 4493001, 4241670, 4042539, 3808794, 3507221, 3186913, 2938758, 2660735, 2398854, 2165458, 1984265, 1852550, 1731149, 1704750, 1582346, 1479313, 1470521, 1425124, 1353167, 1364250, 1318169, 1358425, 1361104, 1331238, 1290714, 1231663, 1146327, 1087571, 1021317, 991827, 987749, 900809, 891013, 907326, 921829, 934540, 933517, 933894, 963605, 938758, 869992, 870664, 841455, 757194, 690786, 721417, 751662, 744206, 680624, 696868, 707707, 669666, 643567, 604511, 582199, 517818, 495136, 519787, 519141, 526680, 538894, 527792, 553508, 532656, 572656, 616052, 570993, 495245, 478440, 500774, 537516, 567785, 611459, 590733, 591586, 648991]
17204F48991j2746q3335K5443J5435o1091j2760n4028O7708N5438j5270n1924
17193E21861n1803K098K0217M7079L4318M156K3561j8432l0054p2024l3515k9461
17181D18001L0800O3892P5840P305l9251l8015j1843r100j1629N6091M2990j9646
17169E65435M2295L1507n0191k9613L9365k3118k0786N1569Q053j1329J339j3533
17157E90993O7997K3144k9093M481J8312j1659P793P73N485J794n0840l7864o1573
17144E29743m4609m2247o5957l4113j2487l3623m3018J8926J4143M8971P6444
17133D12173M4637K4114K8344J5328N7924M5200m2485j16400j72658j01520n4268
$$ y = [648991, 636245, 552910, 578353, 593788, 532697, 519937, 465909, 533617, 589055, 573785, 521861, 470058, 472156, 492373, 539452, 573770, 577926, 601487, 583055, 553001, 480977, 447462, 418001, 448801, 512693, 588533, 595838, 556587, 518572, 506729, 497629, 486000, 542091, 585081, 565435, 607730, 639237, 589046, 559433, 598798, 575680, 554894, 606463, 614516, 603187, 604526, 590993, 658990, 682134, 653041, 657522, 675834, 664175, 671968, 672741, 678226, 680020, 629180, 591316, 529743, 485134, 442887, 376930, 342817, 330330, 296707, 253689, 272615, 286758, 335729, 412173, 456810, 480924, 509268, 524596, 582520, 627720, 585235, 468835, 296177, 194657, 140389]
$$ [...]
##END NTUPLES=NMR SPECTRUM
##END=
