##TITLE=Analysis number 318993
Compound Code cc 46109
Book Reference 451/137
Project Code adrs
Chemist Name evam
##JCAMPDX= 6.0         $$ Bruker NMR JCAMP-DX V2.0
##DATA TYPE= NMR SPECTRUM
##DATA CLASS= NTUPLES
##ORIGIN= Bruker BioSpin GmbH
##OWNER= nmr
$$ XWIN-NMR		Version 3.5
$$ Wed Apr 26 15:30:56 2006 GMT Daylight Time (UT+1h)  MAYBRIDGE\nmr@NMR_250MHZ
##.OBSERVE FREQUENCY= 250.131544655141
##.OBSERVE NUCLEUS= ^1H
##.ACQUISITION MODE= SIMULTANEOUS (DQD)
##.ACQUISITION SCHEME= undefined
##.AVERAGES= 16
##.DIGITISER RES= 18
##SPECTROMETER/DATA SYSTEM= dpx250
##.PULSE SEQUENCE= zg30
##.SOLVENT NAME= CDCl3
##.SHIFT REFERENCE= (INTERNAL, CDCl3, 0, 16.522)
##AUDIT TRAIL= $$ (NUMBER, WHEN, WHO, WHERE, WHAT)
$$ ##TITLE= Audit trail, XWIN-NMR		Version 3.5
$$ ##JCAMPDX= 5.01
$$ ##ORIGIN= Bruker BioSpin GmbH
$$ ##OWNER= nmr
$$ C:\u/data/dgb/nmr/ADRS/3250/pdata/1/auditp.txt
$$ ##AUDIT TRAIL=  $$ (NUMBER, WHEN, WHO, WHERE, WHAT)
(   1,<2006-04-26 15:30:30.51 +100>,<MAYBRIDGE\nmr>,<NMR_250MHZ>,
      <created by zg, POWCHK disabled, PULCHK disabled
       configuration hash MD5:
       84 BC 41 DB A1 6E 1D 46 DA 25 12 A5 C1 ED C5 3A
       data hash MD5: 64K
       8E 08 1E B9 4C 7E E3 0C 58 B1 BB 86 0A 72 3F 78>)
(   2,<2006-04-26 15:30:46.04 +100>,<MAYBRIDGE\nmr>,<NMR_250MHZ>,
      <Start of raw data processing
       ef LB = 0.3 FT_mod = 6 PKNL = 1 SI = 32K 
       data hash MD5: 32K
       F8 CF F7 5F 43 C9 5A 0C C1 D0 08 B2 A0 8A 74 03>)
(   3,<2006-04-26 15:30:47.73 +100>,<MAYBRIDGE\nmr>,<NMR_250MHZ>,
      <apk 
       data hash MD5: 32K
       DD 37 CA 42 7E 3E AA 42 D7 F0 51 5F 27 BF 47 28>)
(   4,<2006-04-26 15:30:48.65 +100>,<MAYBRIDGE\nmr>,<NMR_250MHZ>,
      <abs ABSG = 5 
       data hash MD5: 32K
       A5 C3 D8 84 E9 92 74 EC BE 81 B5 48 56 AE 56 D6>)
$$ ##END=
$$ 
$$ hash MD5
$$ E4 E4 E4 B0 04 4D 5B B3 71 F9 C8 F0 7F 0A AC 65
##$RELAX= 
##$RELAX= 
##$RELAX= 
##$RELAX= 
##$RELAX= 
##$RELAX= 
##$RELAX= 
$$ Bruker specific parameters
$$ --------------------------
##$DU= <C:\u>
##$EXPNO= 3250
##$NAME= <ADRS>
##$PROCNO= 1
##$TYPE= <nmr>
##$USER= <dgb>
##$AMP= (0..31)
100 100 100 100 100 100 100 100 100 100 100 100 100 100 100 100 100 100 
100 100 100 100 100 100 100 100 100 100 100 100 100 100 
##$AQSEQ= 0
##$AQ_mod= 3
##$AUNM= <au_zg>
##$AUTOPOS= <47 >
##$BF1= 250.13
##$BF2= 250.13
##$BF3= 250.13
##$BF4= 250.13
##$BF5= 500.13
##$BF6= 500.13
##$BF7= 500.13
##$BF8= 500.13
##$BYTORDA= 1
##$CFDGTYP= 0
##$CFRGTYP= 5
##$CHEMSTR= <none>
##$CNST= (0..31)
1 1 145 1 1 1 1 1 1 1 1 1 1 1 1 1 1 1 1 1 1 1 1 1 1 1 1 1 1 1 1 1 
##$CPDPRG= <>
##$CPDPRG1= <>
##$CPDPRG2= <>
##$CPDPRG3= <>
##$CPDPRG4= <mlev>
##$CPDPRG5= <mlev>
##$CPDPRG6= <mlev>
##$CPDPRG7= <mlev>
##$CPDPRG8= <mlev>
##$CPDPRGB= <>
##$CPDPRGT= <>
##$D= (0..31)
0 1 0 0 0 0 0 0 0 0.06 0 0 0 0 0 0 0.0002 0 0 0 0 0 0 0 0 0 0 0 0 0 0 
0 
##$DATE= 1146061829
##$DBL= (0..7)
120 120 120 120 120 120 120 120 
##$DBP= (0..7)
150 150 150 150 150 150 150 150 
##$DBP07= 0
##$DBPNAM0= <>
##$DBPNAM1= <>
$$ [...]
##$SUBNAM7= <"">
##$SUBNAM8= <"">
##$SUBNAM9= <"">
##$SW= 20.6930455092707
##$SWIBOX= (0..15)
0 0 3 0 0 0 0 0 0 0 0 0 0 0 0 0 
##$SW_h= 5175.983436853
##$TD= 65536
##$TD0= 1
##$TE= 295.16
##$TE2= 300
##$TE3= 300
##$TEG= 300
##$TL= (0..7)
0 120 120 120 120 120 120 120 
##$TP= (0..7)
150 150 150 150 150 150 150 150 
##$TP07= 0
##$TPNAME0= <>
##$TPNAME1= <>
##$TPNAME2= <>
##$TPNAME3= <>
##$TPNAME4= <>
##$TPNAME5= <>
##$TPNAME6= <>
##$TPNAME7= <>
##$TPOAL= (0..7)
0.5 0.5 0.5 0.5 0.5 0.5 0.5 0.5 
##$TPOFFS= (0..7)
0 0 0 0 0 0 0 0 
##$TUNHIN= 0
##$TUNHOUT= 0
##$TUNXOUT= 0
##$USERA1= <user>
##$USERA2= <user>
##$USERA3= <user>
##$USERA4= <user>
##$USERA5= <user>
##$V9= 5
##$VALIST= <valist>
##$VCLIST= <CCCCCCCCCCCCCCC>
##$VD= 0
##$VDLIST= <DDDDDDDDDDDDDDD>
##$VPLIST= <PPPPPPPPPPPPPPP>
##$VTLIST= <TTTTTTTTTTTTTTT>
##$WBST= 1024
##$WBSW= 4
##$XGAIN= (0..3)
0 0 0 0 
##$XL= 0
##$YL= 0
##$YMAX_a= 460969
##$YMIN_a= -389472
##$ZGOPTNS= <>
##$ZL1= 120
##$ZL2= 120
##$ZL3= 120
##$ZL4= 120
##$ABSF1= 16.522
##$ABSF2= -4.171173
##$ABSG= 5
##$ABSL= 3
##$ALPHA= 0
##$AQORDER= 0
##$ASSFAC= 0
##$ASSFACI= 0
##$ASSFACX= 0
##$ASSWID= 0
##$AUNMP= <proc_1d>
##$AZFE= 0.1
##$AZFW= 0.1
##$BCFW= 0
##$BC_mod= 0
##$BYTORDP= 0
##$COROFFS= 0
##$CY= 12.5
##$DATMOD= 1
##$DC= 0
##$DFILT= <>
##$DTYPP= 0
##$F1P= 14.0000005364418
##$F2P= -0.99999901652339
##$FCOR= 0.5
##$FTSIZE= 32768
##$FT_mod= 6
##$GAMMA= 0
##$GB= 0
##$INTBC= 1
##$INTSCL= 1
##$ISEN= 128
##$LB= 0.3
##$LEV0= 0
##$LPBIN= 0
##$MAXI= 10000
##$MC2= 0
##$MEAN= 0
##$ME_mod= 0
##$MI= 0
##$NCOEF= 0
##$NC_proc= -5
##$NLEV= 6
##$NOISF1= 0
##$NOISF2= 0
##$NSP= 0
##$NTH_PI= 0
##$NZP= 0
##$OFFSET= 16.522
##$PC= 1
##$PHC0= 14.39415
##$PHC1= 6.438595
##$PH_mod= 1
##$PKNL= yes
##$PPARMOD= 0
##$PSCAL= 4
##$PSIGN= 0
##$REVERSE= no
##$SF= 250.13
##$SI= 32768
##$SIGF1= 0
##$SIGF2= 0
##$SINO= 400
##$SIOLD= 32768
##$SREGLST= <1H.CDCl3>
##$SSB= 0
##$STSI= 32768
##$STSR= 0
##$SW_p= 5175.98343685301
##$SYMM= 0
##$S_DEV= 0
##$TDeff= 65536
##$TDoff= 0
##$TI= <Analysis number 999999
Compound Code 99
Book Reference 9
Project Code 9>
##$TILT= no
##$TM1= 0
##$TM2= 0
##$TOPLEV= 0
##$USERP1= <user>
##$USERP2= <user>
##$USERP3= <user>
##$USERP4= <user>
##$USERP5= <user>
##$WDW= 1
##$XDIM= 32768
##$YMAX_p= 321942029
##$YMIN_p= -165216
$$ End of Bruker specific parameters
$$ ---------------------------------
##NTUPLES= NMR SPECTRUM
##VAR_NAME=  FREQUENCY,     SPECTRUM/REAL,   SPECTRUM/IMAG
##SYMBOL=    X,             R,               I
##VAR_TYPE=  INDEPENDENT,   DEPENDENT,       DEPENDENT
##VAR_FORM=  AFFN,          ASDF,            ASDF
##VAR_DIM=   32768,         32768,           32768
##UNITS=     HZ,            ARBITRARY UNITS, ARBITRARY UNITS
##FACTOR=    0.157963299565203, 1,           1
##FIRST=     4132.6476996994, 0,             0
##LAST=      -1043.33573715361, 0,           0
##MIN=       -1043.33573715361, -165216,     0
##MAX=       4132.6476996994, 321942029,     0
$$ Real data points
##PAGE= N=1
##DATA TABLE= (X++(R..R)), XYDATA
$$ [...]
$$ plain form
19147 344495 313347 320320 309917 355390 368901 351785 379733 384766 407592 444527 477916 506238
19135 506238 544111 588641 613810 664665 708678 735501 732982 735694 764054 809479 842002 908162
19123 908162 967596 1051017 1091854 1064152 1029258 979545 944979 914304 893641 882061 868316
19112 868316 838556 806920 798338 777625 706314 611611 568651 526572 477786 445171 413366 401173
19100 401173 388115 404369 433430 428184 393199 379008 407069 392806 383917 417807 482103 498065
19088 498065 532095 631530 778909 997799 1181199 1339124 1466808 1531511 1549459 1597965
19078 1597965 1618535 1570787 1498450 1396428 1371899 1456539 1560402 1654857 1685977 1671419 1666230
19067 1666230 1663910 1600684 1504460 1288313 1039910 876905 749818 690966 669185 627925 604007
$$ packed form
19147C44495l1148O973j0403M5473J3511j7116K7948N033K2826L6935L3389K8322
19135E06238L7873M4530K5169N0855M4013K6823k519K712K8360M5425L2523O6160
19123I08162N9434Q3421M0837k7702l4894m9713l4566l0675k0663j1580j3745
19112H68316k9760l1636q582k0713p1311r4703m2960m2079m8786l2615l1805j2193
19100D01173j3058J6254K9061n246l4985j4191K8061j4263q889L3890O4296J5962
19088D98065L4030R9435J47379K18890J83400J57925J27684O4703J7948M8506
19078A597965K0570m7748p2337j02022k4529Q4640J03863R4455L1120j4558n189
19067A666230k320o3226r6224k16147k48403j63005j27087n8852k1781m1260k3918
$$ plain form
19056 604007 577832 564909 564849 532136 527011 503335 452700 417673 406410 432559 473288 498096
19044 498096 491459 481639 480976 459787 431249 433776 429055 412063 391855 355377 369104 399912 430322
19031 430322 416248 401631 384342 360808 379854 388032 398995 388724 334117 342199 340447 326017
19019 326017 318918 312278 346100 342755 314959 335312 333787 349043 364311 373971 361412 362792 386269
19006 386269 363267 368928 394173 392286 398142 426767 402095 375386 378578 384342 385970 400770 436831
18993 436831 434671 445368 467830 432222 415882 432673 437164 426516 406105 422902 425320 437880
18981 437880 400656 389715 393869 376332 378213 361119 355322 354662 328354 303660 302432 307555 346853
18968 346853 326413 303487 296481 269954 289781 291977 279320 301039 324555 318021 302839 282081
$$ packed form
19056F04007k6175j2923o0l2713n125k3676n0635l5027j1263K6149M0729K4808
19044D98096o637r820o63k1189k8538K527m721j6992k0208l6478J3727L0808L0410
19031D30322j4074j4617j7289k3534J9046Q178J0963j0271n4607Q082j752j4430
19019C26017p099o640L3822l345k7796K0353j525J5256J5268R660j2559J380K3477
19006C86269k3002N661K5245j887N856K8625k4672k6709L192N764J628J4800L6061
18993D36831k160J0697K2462l5608j6340J6791M491j0648k0411J6797K418J2560
18981D37880l7224j0941M154j7537J881j7094n797o60k6308k4694j228N123L9298
18968C46853k0440k2926p006k6527J9827K196j2657K1719K3516o534j5182k0758
$$ plain form
18956 282081 257056 274931 289296 288093 300913 323326 372361 398372 381321 371658 390197 348495
18944 348495 295367 318821 328659 356184 357955 374040 361403 368134 420262 421888 398413 422163
18932 422163 415621 421440 417719 414610 405782 443731 452399 461397 493032 521848 545193 531134 534280
18919 534280 575453 573644 543687 562924 616178 626246 596817 601710 620995 637882 655960 644208
18907 644208 613403 576832 612540 631670 614066 579159 576433 593213 640988 701072 734209 760342
18895 760342 773150 776862 843176 955047 1039835 1103478 1173220 1241201 1271973 1371559 1463624
18884 1463624 1546143 1632830 1766279 1935553 2093143 2198315 2294064 2378478 2430004 2443048
18874 2443048 2422623 2350793 2264728 2212734 2161176 2150156 2140172 2116430 2108429 2094994 2068331 1991771
$$ packed form
18956B82081k5025J7875J4365j203J2820K2413M9035K6011j7051r663J8539m1702
18944C48495n3128K3454R838K7525J771J6085j2637O731N2128J626k3475K3750
18932D22163o542N819l721l109q828L7949Q668Q998L1635K8816K3345j4059L146
18919E34280M1173j809k9957J9237N3254J0068k9429M893J9285J6887J8078j1752
18907F44208l0805l6571L5708J9130j7604l4907k726J6780M7775O0084L3137K6133
18895G60342J2808L712O6314J11871Q4788O3643O9742O7981L0772R9586R2065
18884A463624Q2519Q6687J33449J69274J57590J05172R5749Q4414N1526J3044
18874B443048k0425p1830q6065n1994n1558j1020r984k3742q001j3435k6663p6560
$$ plain form
18862 1991771 1910418 1776673 1674833 1580775 1514481 1471353 1395686 1294792 1254320 1270868 1294259
18851 1294259 1315728 1339711 1335404 1320892 1296021 1297857 1297818 1317764 1302141 1280638 1304207 1296620
18839 1296620 1261253 1215905 1214888 1245007 1209375 1178335 1177732 1194242 1210621 1252137 1269021 1271871
18827 1271871 1289904 1319738 1336140 1380434 1441339 1496983 1549268 1600018 1634744 1661229 1675149
18816 1675149 1690772 1634641 1607369 1550974 1510307 1477687 1490954 1543017 1603163 1664350 1688844
18805 1688844 1790800 1925134 2044730 2121144 2213570 2333322 2437300 2503577 2601064 2749357
18795 2749357 2932558 3140884 3305109 3460101 3630840 3802391 4028641 4257154 4532116
18786 4532116 4857096 5244895 5659842 6113228 6561586 7037358 7570130 8181520 8889174
$$ packed form
18862A991771q1353j33745j01840r4058o6294m3128p5667j00894m0472J6548K3391
18851A294259K1469K3983m307j4512k4871J836l9J9946j5623k1503K3569p587
18839A296620l5367m5348j017L0119l5632l1040o03J6510J6379M1516J6884K850
18827A271871J8033K9834J6402M4294O0905N5644N2285N0750L4726K6485J3920
18816A675149J5623n6131k7272n6395m0667l2620J3267N2063O0146O1187K4494
18805A688844J01956J34334J19596P6414R2426J19752J03978O6277R7487J48293
18795B749357J83201K08326J64225J54992J70739J71551K26250K28513K74962
18786D532116L24980L87799M14947M53386M48358M75772N32772O11390P07654
$$ plain form
18777 8889174 9775028 10941183 12423813 14325252 16952984 20756264 26151560 33085340
18769 33085340 41234429 50878413 62182959 74199299 85847615 96870313 106638410
18762 106638410 113886667 119968089 128120038 137790464 146114464 154989996 168732804 186014789
18754 186014789 202365207 216546032 228145400 233720017 233236741 231662949 228686731 219142252
18746 219142252 204993142 194682092 189911858 185967445 181086629 176631237 171368135 163890472
18738 163890472 155910912 147092591 134363954 118295115 103426279 91474241 80775999
18731 80775999 70539139 62025786 55936347 51639065 48419158 45814970 43613968 41691487
18723 41691487 39962417 38320170 36692237 35135705 33708165 32417851 31207314 30054414
$$ packed form
18777H889174Q85854J166155J482630J901439K627732L803280N395296O933780
18769C3085340Q149089R643984J1304546J2016340J1648316J1022698R768097
18762A06638410P248257O081422Q151949R670426Q324000Q875532J3742808J7281985
18754A86014789J6350418J4180825J1599368N574617m83276j573792k976218r544479
18746B19142252j4149110j0311050m770234l944413m880816m455392n263102p477663
18738A63890472p979560q818321j2728637j6068839j4868836j1952038j0698242
18731H0775999j0236860q513353o089439m297282l219907k604188k201002j922481
18723D1691487j729070j642247j627933j556532j427540j290314j210537j152900
$$ plain form
18715 30054414 28915153 27897747 26989706 26171728 25366380 24614002 23914872 23336231 22797756
18706 22797756 22309348 21875410 21451611 21069976 20706621 20422268 20211992 19950222 19687892
18697 19687892 19443985 19281668 19105871 18949205 18847753 18792508 18783764 18833212 18943187 19141756
18687 19141756 19418675 19877350 20665985 21944416 24095419 27742877 33412999 41226282
18679 41226282 50917260 61976802 72599634 80754623 86354916 89561761 90288632 91051281
18671 91051281 94592445 100960649 108849893 116646887 123546738 127267622 125181654 119275055
18663 119275055 112145987 103630308 95454480 90399968 88407880 87824381 87027353 85235246
18655 85235246 81625268 74965516 66389426 58113213 50545903 44118359 39436125 36200446
$$ packed form
18715C0054414j139261j017406r08041q17978q05348p52378o99130n78641n38475
18706B2797756m88408m33938m23799l81635l63355k84353k10276k61770k62330
18697A9687892k43907j62317j75797j56666j01452n5245q744M9448J09975J98569
18687A9141756K76919M58675P88635J278431K151003L647458N670122P813283
18679D1226282R690978J1059542J0622832Q154989N600293L206845P26871P62649
18671I1051281L541164O368204P889244P796994O899851L720884k085968n906599
18663A19275055p129068q515679q175828n054512j992088n83499p97028j792107
18655H5235246l609978o659752q576090q276213p567310o427544m682234l235679
$$ plain form
18647 36200446 33996977 32479078 31326528 30463789 29826588 29350533 28996862 28759481 28679395
18638 28679395 28811199 29269221 30211802 31887696 34816860 39742827 47271613 57346109
18630 57346109 69631296 83408609 95999608 105170628 111472477 114677987 115049350 116350656
18622 116350656 121431956 129942840 140056284 150177767 159341510 163887950 161071042 154160569
18614 154160569 145482402 134593147 124555175 118775249 116598373 115781946 114444373 111760576
18606 111760576 106222512 96379565 84402972 73001604 62543225 53778350 47410903
18599 47410903 43038225 39902195 37534878 35651900 34033284 32599648 31291866 30049754
18591 30049754 28887089 27844470 26882475 25992326 25141975 24354706 23593200 22828965 22117848
$$ packed form
18647C6200446k203469j517899j152550q62739o37201m76055l53671k37381q0086
18638B8679395J31804M58022R42581J675894K929164M925967P528786J0074496
18630E7346109J2285187J3777313J2590999R171020O301849L205510L71363J301306
18622A16350656N081300Q510884J0113444J0121483R163743M546440k816908o910473
18614A54160569q678167j0889255j0037972n779926k176876q16427j337573k683797
18606A11760576n538064r842947j1976593j1401368j0458379q764875o367447
18599D7410903m372678l136030k367317j882978j618616j433636j307782j242112
18591C0049754j162665j042619r61995q90149q50351p87269p61506p64235p11117
$$ plain form
18582 22117848 21452185 20803778 20154862 19575024 19050194 18616920 18295042 18078501 17957215
18573 17957215 17834124 17644348 17362242 17077558 16787297 16452875 16071144 15667466 15226856
18564 15226856 14851068 14580878 14430567 14292711 14151320 14016729 13831494 13607080 13355634
18555 13355634 13006015 12631981 12257560 11844515 11534895 11317039 11133776 10987100 10860941
18546 10860941 10768189 10640853 10511027 10469217 10393042 10341892 10262055 10141547 9984523 9791033
18536 9791033 9572814 9350035 9147205 8928233 8746250 8571825 8382225 8151682 7932669
18527 7932669 7715182 7489478 7281790 7140318 7032386 6945002 6876500 6806139 6731235 6635100
18517 6635100 6530427 6399525 6273554 6169056 6065710 5996352 5895146 5782728 5734268 5737313
$$ packed form
18582B2117848o65663o48407o48916n79838n24830m33274l21878k16541j21286
18573A7957215j23091j89776k82106k84684k90261l34422l81731m03678m40610
18564A5226856l75788k70190j50311j37856j41391j34591j85235k24414k51446
18555A3355634l49619l74034l74421m13045l09620k17856j83263j46676j26159
18546A0860941r2752j27336j29826m1810p6175n1150p9837j20508j57024j93490
18536I791033k18219k22779k02830k18972j81983j74425j89600k30543k19013
18527G932669k17487k25704k07688j41472j07932q7384o8502p0361p4904r6135
18517F635100j04673j30902j25971j04498j03346o9358j01206j12418m8460L045
$$ plain form
18507 5737313 5736479 5719210 5688617 5694086 5713529 5725675 5733219 5775153 5775467 5774002 5803748 5889673 5943761
18494 5943761 5995523 6143868 6314065 6474904 6648212 6817973 7000037 7146927 7234837 7309303
18484 7309303 7387099 7477812 7555495 7611242 7577224 7500463 7466134 7512321 7593668 7681491 7761518
18473 7761518 7834522 7948138 8199185 8547180 8899301 9241297 9592882 9962025 10345198 10645046
18463 10645046 10879401 11172561 11489556 11882417 12446604 13272487 14436217 16048045 18255938
18454 18255938 21339016 25711568 32244898 42945628 61750897 92748979 133753782
18447 133753782 174795906 206965422 226288246 232366613 232997738 237130983 241620832 235815386
18439 235815386 215105632 194799102 195972382 217052613 241802912 259375620 264894569
$$ packed form
18507E737313q34j7269l0593N469J9443J2146P544M1934L14j465K9746Q5925N4088
18494E943761N1762J48345J70197J60839J73308J69761J82064J46890Q7910P4466
18484G309303P7796R0713P7683N5747l4018p6761l4329M6187Q1347Q7823Q0027
18473G761518P3004J13616K51047L47995L52121L41996L51585L69143L83173K99848
18463A0645046K34355K93160L16995L92861N64187Q25883J163730J611828K207893
18454A8255938L083078M372552O533330J0700730J8805269L0998082M1004803
18447A33753782M1042124L2169516J9322824O078367O31125M133245M489849n805446
18439B35815386k0709754k0306530J173280K1080231K4750299J7572708N518949
$$ plain form
18432 264894569 260390631 255542979 253460042 244969883 218468766 174448809 130692970
18425 130692970 100950542 83569273 72970776 65923920 60767837 56672683 53264857
18418 53264857 50326774 47731844 45493515 43542096 41799864 40224875 38773028 37341528
18410 37341528 35966187 34597818 33260007 32091955 31011037 30073208 29280634 28557100
18402 28557100 27875260 27199193 26574257 26058575 25535878 24948705 24323218 23740649 23363179
18393 23363179 23125993 22925658 22716208 22431970 22097664 21593880 20996770 20353432 19610719
18384 19610719 18770339 17942432 17215460 16603818 16111955 15646220 15192983 14804393 14457981
18375 14457981 14163272 13851381 13583341 13344524 13111012 12859934 12651916 12466183 12250160
$$ packed form
18432B64894569m503938m847652k082937q490159k6501117m4019957m3755839
18425A30692970k9742428j7381269j0598497p046856n156083m095154l407826
18418E3264857k938083k594930k238329j951419j742232j574989j451847j431500
18410C7341528j375341j368369j337811j168052j080918r37829p92574p23534
18402B8557100o81840o76067o24936n15682n22697n87173o25487n82569l77470
18393B3363179k37186k00335k09450k84238l34306n03784n97110o43338p42713
18384A9610719q40380q27907p26972o11642m91863m65735m53237l88590l46412
18375A4457981k94709l11891k68040k38817k33512k51078k08018j85733k16023
$$ plain form
18366 12250160 12021926 11807123 11621865 11414455 11170359 10926641 10699238 10493862 10330373
18357 10330373 10191248 10015716 9919713 9809183 9679158 9560358 9420547 9287072 9148987
18348 9148987 9004169 8917059 8849906 8870130 8955061 9053746 9198609 9320648 9443767 9530361
18338 9530361 9607945 9630846 9549095 9392662 9166991 8994908 8819926 8675431 8572003 8561948
18328 8561948 8681537 8974421 9450832 10075080 10907857 12046234 13600852 15773173 18989141
18319 18989141 23952427 31773063 43429458 59103855 77506779 95717659 110538435
18312 110538435 120017176 122146885 117917092 108162699 94096979 76927179 60752984
18305 60752984 47845356 39002732 33460787 29817027 27158980 25076438 23413096 22022149
$$ packed form
18366A2250160k28234k14803j85258k07410k44096k43718k27403k05376j63489
18357A0330373j39125j75532r6003j10530j30025j18800j39811j33475j38085
18348I148987j44818q7110o7153K0224Q4931R8685J44863J22039J23119Q6594
18338I530361P7584K2901q1751j56433k25671j72083j74982j44495j03428j0055
18328H561948J19589K92884M76411O24248Q32777J138377J554618K172321L215968
18319A8989141M963286P820636J1656395J5674397J8402924J8210880J4820776
18312A10538435R478741K129709m229793r754393j4065720j7169800j6174195
18305F0752984j2907628q842624n541945l643760k658047k082542j663342j390947
$$ plain form
18297 22022149 20940842 20113746 19507977 19077221 18807007 18690355 18771299 18968717 19187874
18288 19187874 19289226 19142888 18792429 18335721 17754257 17161543 16679614 16405074 16344032
18279 16344032 16556619 17071615 17881155 19039673 20738294 23257098 27014270 32620259
18271 32620259 41464744 55878501 78278585 109499692 147683324 187511758 222313256
18264 222313256 246705024 256694074 251668137 234248066 206269580 170584397 133853246
18257 133853246 103038809 80834575 66688739 57612793 51429155 46947793 43415529
18250 43415529 40499844 38037325 35945359 34157444 32662467 31517371 30679529 30091071
18242 30091071 29681447 29361405 29013689 28519401 27835691 27021597 26105286 25129842 24185537
$$ packed form
18297B2022149j081307q27096o05769m30756k70214j16652Q0944J97418K19157
18288A9187874J01352j46338l50459m56708n81464n92714m81929k74540o1042
18279A6344032K12587N14996Q09540J158518J698621K518804L757172N605989
18271C2620259Q844485J4413757K2400084L1221107L8183632L9828434L4801498
18264B22313256K4391768R989050n025937j7420071k7978486l5685183l6731151
18257A33853246l0814437k2204234j4145836r075946o183638m481362l532264
18250D3415529k915685k462519k091966j787915j494977j145096q37842n88458
18242C0091071m09624l20042l47716m94288o83710q14094r16311r75444r44305
$$ plain form
18233 24185537 23373531 22744665 22348977 22069721 21988394 22047570 22369556 23121705 24479862
18224 24479862 26706845 30298093 36174581 45788595 60355000 79945729 102541322 124538611
18216 124538611 142101826 152763216 154267502 148132697 135300088 117133334 95405947
18209 95405947 75252106 59396999 48717977 41986997 37525470 34286597 31798245 29754000
18201 29754000 28008484 26536283 25258728 24160603 23194944 22390293 21708031 21117249 20619742
18192 20619742 20150489 19672475 19178508 18674545 18168869 17602752 17011951 16460840 15939317
18183 15939317 15446045 15014550 14579017 14129431 13663132 13237037 12901724 12612291 12354912
18174 12354912 12118462 11908962 11694366 11496388 11358732 11228610 11071370 10907977 10769403
$$ packed form
18233B4185537q12006o28866l95688k79256q1327N9176L21986P52149J358157
18224B4479862K226983L591248N876488R614014J4566405J9590729K2595593K1997289
18216A24538611J7563215J0661390J504286o134805j2832609j8166754k1727387
18209I5405947k0153841j5855107j0679022o730980m461527l238873k488352k044245
18201B9754000j745516j472201j277555j098125r65659q04651o82262n90782m97507
18192B0619742m69253m78014m93967n03963n05676n66117n90801n51111n21523
18183A5939317m93272m31495m35533m49586m66299m26095l35313k89433k57379
18174A2354912k36450k09500k14596j97978j37656j30122j57240j63393j38574
$$ plain form
18165 10769403 10637680 10524741 10404220 10260795 10151491 10022286 9855773 9669970 9450350
18156 9450350 9232572 9071833 8980150 8930817 8922876 8886613 8834617 8778158 8645651 8470167 8318452
18145 8318452 8241146 8190260 8196852 8281993 8362775 8446814 8567310 8634968 8611622 8489030 8277886
18134 8277886 7986563 7658923 7339407 7070759 6836431 6665828 6540433 6469894 6441217 6467874
18124 6467874 6465264 6494818 6607212 6719013 6872455 7044502 7242942 7508659 7854628 8257091
18114 8257091 8694858 9209281 9850866 10721597 11900992 13721534 17082849 23718004 33790532
18105 33790532 42961560 48771155 50656013 45226909 35215775 31181162 32602880 37709208
18097 37709208 45207200 53958080 63673075 74086814 83913274 92816507 101585675 109274315
$$ packed form
18165A0769403j31723j12939j20521j43425j09304j29205j66513j85803k19620
18156I450350k17778j60739r1683m9333p941l6263n1996n6459j32507j75484j51715
18145H318452p7306n0886O592Q5141Q0782Q4039J20496O7658k3346j22592k11144
18134H277886k91323l27640l19516k68648k34328j70603j25395p0539k8677K6657
18124F467874k610K9554J12394J11801J53442J72047J98440K65717L45969M02463
18114H257091M37767N14423O41585Q70731J179395J820542L361315O635155J0072528
18105C3790532R171028N809595J884858n429104j0011134m034613J421718N106328
18097C7709208P497992Q750880R714995J0413739R826460Q903233Q769168P688640
$$ plain form
18089 109274315 114182000 119110268 127673005 137873888 145789744 152173020 158640964 162014263
18081 162014263 160345971 157448996 154417251 147942035 139512368 133479166 129521112 124577674
18073 124577674 119123164 114032506 106725546 95962110 85283111 76524709 67934161 58753854
18065 58753854 50848477 45342145 41643865 39052982 37126336 35595170 34392344 33430578
18057 33430578 32657459 32001804 31600964 31523295 31813781 32723641 34649650 37983351 42528068
18048 42528068 47665139 53352655 59676320 65746541 71095862 76275834 80814254 83503458
18040 83503458 85812769 90467337 96574532 101433081 105179094 109149375 111680767 111063920
18032 111063920 109219692 107101526 102749905 96842014 92329902 89374456 85906600 82000204
$$ packed form
18089A09274315M907685M928268Q562737J0200883P915856O383276O467944L373299
18081A62014263j668292k896975l031745o475216q429667o033202l958054m943438
18073A24577674n454510n090658p306960j0763436j0678999q758402q590548r180307
18065E8753854p905377n506332l698280k590883j926646j531166j202826r61766
18057C3430578p73119o55655m00840p7669K90486R09860J926009L333701M544717
18048D2528068N137071N687516O323665O070221N349321N179972M538420K689204
18040H3503458K309311M654568O107195M858549L746013L970281K531392o16847
18032A11063920j844228k118166m351621n907891m512112k955446l467856l906396
$$ plain form
18024 82000204 78486511 73995438 67292348 60279547 54408471 48765021 42715884 37354041
18016 37354041 33469644 30793063 28818006 27267187 26003994 24907483 23884669 22953837
18008 22953837 22076244 21236758 20487305 19790979 19158870 18609121 18010185 17412243 16887993
17999 16887993 16376575 15905127 15463621 15062589 14749595 14462020 14223091 13999390 13805764
17990 13805764 13625355 13395434 13101765 12736551 12316829 11917905 11543562 11221802 10944669
17981 10944669 10727691 10536814 10353733 10219839 10052457 9864717 9632843 9372422 9133329
17972 9133329 8924397 8775395 8651084 8550915 8449330 8326130 8242899 8175819 8084615 7950576
17962 7950576 7852987 7776637 7723610 7676874 7631546 7564170 7466775 7376661 7256143 7090422 6945648
$$ packed form
18024H2000204l513693m491073o703090p012801n871076n643450o049137n361843
18016C7354041l884397k676581j975057j550819j263193j096511j022814r30832
18008B2953837q77593q39486p49453o96326o32109n49749n98936n97942n24250
17999A6887993n11418m71448m41506m01032l12994k87575k38929k23701j93626
17990A3805764j80409k29921k93669l65214m19722l98924l74343l21760k77133
17981A0944669k16978j90877j83081j33894j67382j87740k31874k60421k39093
17972I133329k08932j49002j24311j00169j01585j23200q3231o7080r1204j34039
17962G950576r7589p6350n3027m6736m5328o7376r7395r0114j20518j65721j44774
$$ plain form
17951 6945648 6797073 6658081 6508679 6354519 6236149 6155232 6042656 5941270 5844331 5721553
17941 5721553 5608735 5475906 5345511 5174783 4978172 4788188 4629448 4497137 4421796 4330702
17931 4330702 4260445 4201592 4138497 4075981 4013103 3931465 3860396 3810181 3772236 3753567 3740010
17920 3740010 3708175 3684133 3680343 3681926 3653360 3649616 3639826 3622084 3616761 3632169 3625328 3591617
17908 3591617 3553241 3524665 3460485 3410094 3371347 3318314 3267968 3228761 3210747 3157541 3091698
17897 3091698 3055927 3019334 2941476 2859321 2806551 2743837 2671933 2640139 2577584 2510321 2413979
17886 2413979 2344050 2285144 2238248 2199454 2162808 2141019 2126520 2096631 2067411 2037176 2007076
17875 2007076 1940198 1919265 1903000 1794601 1712512 1681091 1633819 1602415 1576672 1575706 1580545 1575747
$$ packed form
17951F945648j48575j38992j49402j54160j18370q0917j12576j01386r6939j22778
17941E721553j12818j32829j30395j70728j96611j89984j58740j32311p5341r1094
17931D330702p0257n8853o3095o2516o2878q1638p1069n0215l7945j8669j3557
17920C740010l1835k4042l790J583k8566l744r790j7742n323J5408o841l3711
17908C591617l8376k8576o4180n0391l8747n3033n0346l9207j8014n3206o5843
17897C091698l5771l6593p7858q2155n2770o2714p1904l1794o2555o7263r6342
17886B413979o9929n8906m6896l8794l6646k1789j4499k9889k9220l0235l0100
17875B007076o6878k0933j6265j08399q2089l1421m7272l1404k5743r66M839m798
$$ plain form
17863 1575747 1521371 1500840 1493878 1487477 1495992 1483913 1465011 1424717 1393600 1373264 1349222 1327065
17851 1327065 1357407 1364579 1338052 1334373 1290744 1289901 1342766 1352827 1326315 1285299 1255513 1261510
17839 1261510 1252506 1207341 1221939 1193071 1141206 1152838 1154732 1126137 1101868 1130724 1116564 1119663
17827 1119663 1138960 1103907 1089647 1071579 1050082 977390 921005 935476 931463 862615 887502
17816 887502 890167 896443 908010 928497 970876 963396 967655 968238 989234 1050725 1115975 1243875
17804 1243875 1478970 1774705 2094254 2401444 2648660 2783774 2785143 2730224 2644520 2539558
17794 2539558 2349921 2111749 1975235 1961264 2043019 2178938 2290213 2278651 2200611 2119834
17784 2119834 2114186 2042648 1865604 1618372 1374298 1199874 1117374 1008874 965628 933207
$$ packed form
17863A575747n4376k0531o962o401Q515j2079j8902m0294l1117k0336k4042k2157
17851A327065L0342P172k6527l679m3629q43N2865J0061k6512m1016k9786N997
17839A261510r004m5165J4598k8868n1865J1632J894k8595k4269K8856j4160L099
17827A119663J9297l5053j4260j8068k1497p2692n6385J4471m013o8848K4887
17816H87502K665O276J1567K0487M2379p480M259N83K0996O1491O5250J27900
17804A243875K35095K95735L19549L07190K47216J35114J369n4919q5704j04962
17794B539558j89637k38172j36514j3971Q1755J35919J11275j1562p8040q0777
17784B119834n648p1538j77044k47232k44074j74424q2500j08500m3246l2421
$$ plain form
17774 933207 890945 858342 841119 796165 744362 733676 751101 749180 745369 746311 715898 735381
17762 735381 742713 723230 695454 713337 764391 848894 936745 1053431 1258835 1485653 1672376
17751 1672376 1794340 1853147 1853865 1747576 1600620 1429763 1233197 1058770 912038 873653
17741 873653 827742 753015 673531 620113 582960 612299 614438 606849 599202 597242 587928 590676 612016
17728 612016 591338 607885 699640 878666 1085471 1292993 1495451 1590079 1616023 1587520 1570984
17717 1570984 1554250 1503212 1356301 1160478 972211 839401 767692 732579 712277 735802
17707 735802 796256 898157 1066374 1262336 1525641 1808989 2007800 2107657 2108273 2032230 1939707
17696 1939707 1869523 1789472 1612478 1355525 1080834 885002 741891 681919 637778 606546
$$ packed form
17774I33207m2262l2603j7223m4954n1803j0686J7425j921l811R42l0413J9483
17762G35381P332j9483k7776J7883N1054Q4503Q7851J16686K05404K26818J86723
17751A672376J21964N8807P18j06289j46956j70857j96566j74427j46732l8385
17741H73653m5911p4727p9484n3418l7153K9339K139p589p647j960r314K748K1340
17728F12016k0678J6547R1755J79026K06805K07522K02458R4628K5944k8503j6536
17717A570984j6734n1038j46911j95823j88267j32810p1709l5113k0302K3525
17707G35802O0454J01901J68217J95962K63305K83348J98811R9857O16p6043r2523
17696A939707p0184q0051j76994k56953k74691j95832j43111n9972m4141l1232
$$ plain form
17686 606546 589313 547578 491554 472226 463362 459812 452119 450654 428352 435934 466735 473813 455880
17673 455880 438408 400676 354189 371926 376589 341967 327268 321017 295447 298603 338170 314935
17661 314935 269382 264475 284105 273827 248855 272406 266854 254878 263785 269819 281382 302978
17649 302978 317292 293663 276173 275318 266523 229541 238929 253821 233944 219483 218534 192205 174772
17636 174772 157949 151153 173604 188645 158130 156867 167678 173948 169182 198947 191085 175984
17624 175984 182196 179869 181221 173177 162822 138994 127931 143817 184549 210237 180275 150952
17612 150952 144916 177595 172510 148623 139865 142132 140693 178161 174998 175414 191833 188451 187056
17599 187056 183828 193848 209755 218033 261687 309844 338299 390272 454134 495675 533177 552437
$$ packed form
17686F06546j7233m1735n6024j9328q864l550p693j465k2302P582L0801P078j7933
17673D55880j7472l7732m6487J7737M663l4622j4699o251k5570L156L9567k3235
17661C14935m5553m907J9630j0278k4972K3551n552j1976Q907O034J1563K1596
17649C02978J4314k3629j7490q55q795l6982R388J4892j9877j4461r49k6329j7433
17636A74772j6823o796K2451J5041l0515j263J0811O270m766K9765p862j5101
17624A75984O212k327J352q044j0355k3828j1063J5886M0732K5688k9962k9323
17612A50952o036L2679n085k3887q758K267j439L7468l163M16J6419l382j395
17599A87056l228J0020J5907Q278M3654M8157K8455N1973O3862M1541L7502J9260
$$ plain form
17587 552437 590230 641149 673988 725332 777986 837388 887121 913619 945411 951086 933910 926181
17575 926181 914438 897421 871281 813287 736052 708312 675857 655747 644590 628154 560344
17564 560344 480359 456896 439852 410200 395352 370784 359481 329154 310281 298715 306253 297656
17552 297656 282302 296263 323141 312495 291546 296643 302114 310466 350423 387208 419206 447597
17540 447597 467614 507698 540134 582102 634210 656294 716428 757321 787324 808564 810454 818036
17528 818036 843897 854407 837830 786728 723765 680362 683574 646234 619603 561632 531483 500144
17516 500144 457702 391838 371730 332406 301225 275201 229219 236339 239918 253048 283205 280728
17504 280728 253577 229217 240568 220884 210408 218709 203204 196437 197922 186467 148290 144136
$$ packed form
17587E52437L7793N0919L2839N1344N2654N9402M9733K6498L1792N675j7176p729
17575I26181j1743j7017k6140n7994p7235k7740l2455k0110j1157j6436o7810
17564E60344p9985k3463j7044k9652j4848k4568j1303l0327j8873j1566P538q597
17552B97656j5354J3961K6878j0646k0949N097N471Q352L9957L6785L1998K8391
17540D47597K0017M0084L2436M1968N2108K2084O0134M0893L0003K1240J890P582
17528H18036K5861J0510j6577n1102o2963m3403L212l7340k6631n7971l0149l1339
17516E00144m2442o5864k0108l9324l1181k6024m5982P120L579J3130L0157k477
17504B80728k7151k4360J1351j9684j0476Q301j5505o767J485j1455l8177m154
$$ plain form
17492 144136 157978 172899 198501 202453 191211 161538 166324 181549 215604 205244 198836 143021
17480 143021 97140 82258 96991 145364 148895 147789 178030 207598 182029 139475 177922 182631
17468 182631 174238 156312 159557 174271 172423 185396 205008 202834 183291 155258 162472 178306
17456 178306 173331 179948 190005 224211 205890 183697 151507 154900 169895 202712 239344 254835
17444 254835 266165 266071 249214 256355 285043 324483 414169 466082 569341 665119 786613 962124
17432 962124 1103504 1139074 1034464 820878 658494 564513 582384 630708 705797 855917
17422 855917 1031327 1173548 1227165 1194808 992178 786375 678682 664528 744055 899768
17412 899768 1129555 1346297 1445112 1412367 1211887 1002837 890987 869186 876392 923778 1051332
$$ packed form
17492A44136J3842J4921K5602L952j1242k9673M786J5225L4055j0360o408n5815
17480A43021m5881j4882J4733M8373L531j106L0241K9568k5569m2554L8447M709
17468A82631q393j7926L245J4714j848J2973J9612k174j9543k8033P214J5834
17456A78306m975O617J0057L4206j8321k2193l2190L393J4995L2817L6632J5491
17444B54835J1330r4j6857P141K8688L9440Q9686N1913J03259R5778J21494J75511
17432I62124J41380L5570j04610k13586j62384r3981J7871M8324P5089J50120
17422H55917J75410J42221N3617l2357k02630k05803j07693j4154P9527J55713
17412H99768K29787K16742R8815l2745k00480k09050j11850k1801P206M7386J27554
$$ plain form
17401 1051332 1224214 1410068 1525731 1501321 1310778 1036354 817012 683699 593282 531214
17391 531214 503868 456458 414952 422885 414943 404841 397678 375386 402696 401243 369598 378542
17379 378542 397966 363063 284839 284522 305682 294650 340825 315692 258461 230649 226706 206229
17367 206229 178557 189477 193797 200112 205468 234772 242788 227650 219809 256296 302025 306853 331342
17354 331342 321532 296297 313139 272831 247872 233035 213528 199765 203357 205597 231466 263324
17342 263324 302791 340842 371227 385847 433349 451212 488570 519519 563142 596118 598481 608850
17330 608850 604220 573371 522025 463500 396012 384022 383600 345815 325109 334129 336425 350267
17318 350267 330207 344400 367647 406458 465457 537980 629800 679646 711701 759851 843162
$$ packed form
17401A051332J72882J85854J15663k4410j90543k74424k19342j33313r0417o2068
17391E31214k7346m7410m1506P933p942j0102p163k2292K7310j453l1645Q944
17379C78542J9424l4903p8224l17K1160j1032M6175k5133n7231k7812l943k0477
17367B06229k7672J0920M320O315N356K9304Q016j5138p841L6487M5729M828K4489
17354C31342r810k5235J6842m0308k4959j4837j9507j3763L592K240K5869L1858
17342B63324L9467L8051L0385J4620M7502J7863L7358L0949M3623L2976K363J0369
17330F08850m630l0849n1346n8525o7488j1990m22l7785k0706R020K296J3842
17318C50267k0060J4193K3247L8811N8999P2523R1820M9846L2055M8150Q3311
$$ plain form
17307 843162 939063 1053979 1253726 1484175 1727685 1945092 2058662 2088231 2097881 2074534
17297 2074534 2038784 1937176 1784748 1550410 1328649 1128553 987120 928142 902759 943455
17287 943455 1009451 1092661 1223426 1419996 1684237 1991110 2301566 2503924 2618484 2678734
17277 2678734 2697335 2641562 2530262 2359207 2082105 1769817 1506088 1297793 1185027 1114075
17267 1114075 1058801 1051574 1097271 1107733 1118185 1116262 1114416 1127451 1125753 1103050 1079091 1037560
17255 1037560 1010847 1025541 1047806 1062124 1058610 1069513 1085041 1067400 1042065 1045964 1037359 982249
17243 982249 987003 943885 922913 942769 960903 937095 941379 935956 954036 945708 960807 968846
17231 968846 963937 964442 988184 1041485 1063372 1039512 990171 991112 998192 1007077 1023062 1044258 1070527
$$ packed form
17307H43162R5901J14916J99747K30449K43510K17407J13570K9569R650k3347
17297B074534l5750j01608j52428k34338k21761k00096j41433n8978k5383M0696
17287I43455O5996Q3210J30765J96570K64241L06873L10456K02358J14560O0250
17277B678734J8601n5773j11300j71055k77102l12288k63729k08295j12766p0952
17267A114075n5274p227M5697J0462J0452j923j846J3035j698k2703k3959m1531
17255A037560k6713J4694K2265J4318l514J0903J5528j7641k5335L899q605n5110
17243I82249M754m3118k0972J9856J8134k3808M284n423J8080q328J5099Q039
17231I68846m909N05K3742N3301K1887k3860m9341R41P080Q885J5985K1196K6269
$$ plain form
17218 1070527 1090101 1134256 1224409 1280307 1321199 1421381 1490978 1568669 1705794 1833691 2043705
17207 2043705 2307064 2590281 2867989 3156789 3393116 3688007 4031296 4380938 4696851
17198 4696851 4850120 4874517 4977838 5199870 5441224 5679394 5845348 6061895 6513392 7248814
17188 7248814 8274592 9618649 11275656 13298078 15885197 19383163 24494138 32619110
17180 32619110 46614954 70601358 105819257 145546971 179695517 202601106 212010989
17173 212010989 211249363 210162040 211066200 205215486 182345799 143359478 105011700 79964035
17165 79964035 66494121 59545422 56286076 55622670 57409641 62391472 72941530 93509680
17157 93509680 127749248 171374706 212723873 243064014 258294122 258821459 254772246
$$ packed form
17218A070527J9574M4155R0153N5898M0892J00182O9597P7691J37125J27897K10014
17207B043705K63359K83217K77708K88800K36327K94891L43289L49642L15913
17198D696851J53269K4397J03321K22032K41354K38170J65954K16547M51497P35422
17188G248814J025778J344057J657007K022422K587119L497966N110975Q124972
17180C2619110J3995844K3986404L5217899L9727714L4148546K2905589R409883
17173B12010989p61626j087323R04160n850714k2869687l8986321l8347778k5047665
17165G9964035j3469914o948699l259346o63406J786971M981831J0550058K0568150
17157I3509680L4239568M3625458M1349167L0340141J5230108N27337m049213
$$ plain form
17150 254772246 254055049 250411739 231299007 191124384 143385335 106999289 85218160
17143 85218160 72378688 64228228 58627934 54385400 50827889 47653859 44858917 42337444
17135 42337444 40053404 38036652 36293756 34815678 33525802 32363311 31299434 30271299
17127 30271299 29342663 28559694 27906599 27240744 26523591 25724025 24924987 24184312 23460907
17118 23460907 22774294 22165782 21558794 20819594 19977236 19223408 18601882 18091812 17611109
17109 17611109 17154963 16701057 16334661 15957443 15583415 15212508 14869273 14472238 14067709
17100 14067709 13689346 13336196 12979325 12616517 12302997 11990484 11735079 11478280 11167771
17091 11167771 10876283 10617489 10350813 10084575 9867881 9622086 9396888 9152975 8929444
$$ packed form
17150B54772246p17197l643310j9112732m0174623m7739049l6386046k1781129
17143H5218160j2839472q150460n600294m242534l557511l174030k794942k521473
17135D2337444k284040k016752j742896j478078j289876j162491j063877j028135
17127C0271299r28636p82969o53095o65855p17153p99566p99038p40675p23405
17118B3460907o86613o08512o06988p39200q42358p53828o21526n10070m80703
17109A7611109m56146m53906l66396l77218l74028l70907l43235l97035m04529
17100A4067709l78363l53150l56871l62808l13520l12513k55405k56799l10509
17091A1167771k91488k58794k66676k66238k16694k45795k25198k43913k23531
$$ plain form
17082 8929444 8720509 8536300 8383296 8196280 7974903 7738298 7538691 7376166 7231758
17073 7231758 7120934 6992294 6805139 6665957 6558885 6406719 6260816 6129364 6003707
17064 6003707 5839584 5713505 5587978 5461481 5391229 5339826 5332238 5336386 5313950 5275460 5273638
17053 5273638 5329481 5401355 5515953 5659999 5790918 5885136 5872633 5718816 5573552 5506302
17043 5506302 5399964 5182573 4929939 4697041 4533292 4474858 4441823 4433711 4448078 4450585 4494662
17032 4494662 4560894 4659486 4825158 5011162 5176134 5249853 5237783 5125893 4993638 4897290
17022 4897290 4779310 4552430 4260597 3997997 3784894 3646393 3552170 3490928 3450675 3450611 3492169
17011 3492169 3566161 3668177 3916006 4194440 4343207 4333868 4204121 3889087 3575035 3314518
$$ packed form
17082H929444k08935j84209j53004j87016k21377k36605j99607j62525j44408
17073G231758j10824j28640j87155j39182j07072j52166j45903j31452j25657
17064F003707j64123j26079j25527j26497p0252n1403p588M148k2436l8490j822
17053E273638N5843P1874J14598J44046J30919R4218j2503j53817j45264o7250
17043E506302j06338k17391k52634k32898j63749n8434l3035q112J4367K507M4077
17032D494662O6232R8592J65672J86004J64972P3719j2070j11890j32255r6348
17022D897290j17980k26880k91833k62600k13103j38501r4223o1242m0253o4M1558
17011C492169P3992J02016K47829K78434J48767r339j29747l15034l14052k60517
$$ plain form
17001 3314518 3197629 3170250 3160402 3283223 3501213 3698541 3727277 3669788 3497718 3206138
16991 3206138 2997524 2884018 2876191 2996646 3233863 3461837 3476405 3413659 3193141 2922728
16981 2922728 2760163 2650758 2624578 2680885 2793663 2950196 3175054 3263864 3246291 3128441
16971 3128441 2843387 2568309 2371167 2248445 2134758 2085174 2018437 1941403 1872662 1825674
16961 1825674 1830368 1883672 1913039 1932015 1991272 2014340 1926989 1840858 1780511 1724744 1697458
16950 1697458 1651817 1602969 1607631 1653789 1682246 1749805 1768537 1794680 1763298 1721607 1675237
16939 1675237 1651671 1632557 1616708 1644565 1717922 1775511 1805974 1820116 1821491 1754357 1687546
16928 1687546 1577863 1551333 1607711 1648929 1715440 1788961 1877301 1929462 1946999 1945192 1962157
$$ packed form
17001C314518j16889k7379r848J22821K17990J97328K8736n7489j72070k91580
16991C206138k08614j13506p827J20455K37217K27974J4568o2746k20518k70413
16981B922728j62565j09405k6180N6307J12778J56533K24858Q8810j7573j17850
16971C128441k85054k75078j97142j22722j13687m9584o6737p7034o8741m6988
16961A825674M694N3304K9367J8976N9257K3068q7351q6131o0347n5767k7286
16950A697458m5641m8848M662M6158K8457O7559J8732K6143l1382m1691m6370
16939A675237k3566j9114j5849K7857P3357N7589L0463J4142J375o7134o6811
16928A687546j09683k6530N6378M1218O6511P3521Q8340N2161J7537j807J6965
$$ plain form
16917 1962157 2010868 2153051 2335702 2529493 2806860 3082757 3235334 3272639 3167949 3059835
16907 3059835 3098081 3361952 3789955 4279960 4806423 5283666 5577235 5617247 5641294 5664251
16897 5664251 5726376 6051074 6725275 7718989 9028522 10440757 11813780 13284698 15117421
16888 15117421 17677781 21791101 28800235 41368173 65691896 107772046 155867573
16881 155867573 190661798 206247316 194043084 144229500 98436912 76100397 68043809
16874 68043809 69512299 81855603 110922521 155000921 194542601 217450827 219327703
16867 219327703 186900737 133924173 101824328 90968067 96049677 119498537 156632051
16860 156632051 188561192 205848510 203730146 169470750 121993888 93961947 81488380
$$ packed form
16917A962157M8711J42183J82651J93791K77367K75897J52577L7305j04690j08114
16907C059835L8246K63871M28003M90005N26463M77243K93569M0012K4047K2957
16897E664251O2125L24698O74201R93714J309533J412235J373023J470918J832723
16888A5117421K560360M113320P009134J2567938K4323723M2080150M8095527
16881A55867573L4794225J5585518j2204232m9813584m5792588k2336515q056588
16874F8043809J468490J2343304K9066918M4078400L9541680K2908226J876876
16867B19327703l2426966n2976564l2099845j0856261N081610K3448860L7133514
16860A56632051L1929141J7287318k118364l4259396m7476862k8031941j2473567
$$ plain form
16853 81488380 77965441 82808915 100224757 133729877 170681459 195199657 203016109
16846 203016109 185750675 137565700 96259140 73901618 61440347 53809047 48999660
16839 48999660 45752338 43330991 41335852 39605935 37949286 36290228 34634092 32897603
16831 32897603 31171536 29622023 28459508 27654200 27011233 26433967 25855864 25158999 24281103
16822 24281103 23333443 22333052 21453202 20759906 20192196 19661552 19233934 18889857 18566525
16813 18566525 18207393 17804086 17321911 16785471 16191820 15647175 15144232 14690830 14278033
16804 14278033 13910710 13576913 13269125 12979639 12703961 12390689 12082407 11776315 11466484
16795 11466484 11167784 10873341 10629554 10353975 10108864 9889147 9698990 9475805 9215775
$$ packed form
16853H1488380l522939M843474J7415842L3505120L6951582K4518198P816452
16846B03016109j7265434m8184975m1306560k2357522j2461271p631300m809387
16839D8999660l247322k421347j995139j729917j656649j659058j656136j736489
16831C2897603j726067j549513j162515q05308o42967n77266n78103o96865q77896
16822B4281103r47660j000391q79850o93296n67710n30644m27618l44077l23332
16813A8566525l59132m03307m82175n36440n93651n44645n02943m53402m12797
16804A4278033l67323l33797l07788k89486k75678l13272l08282l06092l09831
16795A1466484k98700k94443k43787k75579k45111k19717j90157k23185k60030
$$ plain form
16786 9215775 8977176 8771725 8548487 8348638 8156853 7964859 7810384 7693997 7528000
16777 7528000 7375135 7230013 7048906 6851798 6677410 6526678 6384753 6223365 6102267
16768 6102267 6038732 5979311 5892020 5766750 5632591 5520289 5477331 5433392 5389258 5362498 5390704
16757 5390704 5477296 5609442 5709913 5797435 5763390 5578663 5278223 5014652 4869762 4815028
16747 4815028 4801472 4857199 5000944 5147671 5303775 5384439 5288267 5053080 4787276 4599350
16737 4599350 4495592 4496961 4573095 4665977 4786461 4809535 4725096 4472564 4229976 4059902
16727 4059902 3980959 3960951 4017432 4086470 4173354 4231598 4289070 4225861 4016722 3731858 3467768
16716 3467768 3303426 3188220 3082587 3024705 2953142 2889844 2811523 2742275 2703291 2680982 2647575
$$ packed form
16786I215775k38599k05451k23238j99849j91785j91994j54475j16387j65997
16777G528000j52865j45122j81107j97108j74388j50732j41925j61388j21098
16768F102267o3535n9421q7291j25270j34159j12302m2958m3939m4134k6760K8206
16757E390704Q6592J32146J00471Q7522l4045j84727l00440k63571j44890n4734
16747D815028j3556N5727J43745J46727J56104Q0664r6172k35187k65804j87926
16737D599350j03758J369P6134R2882J20484K3074q4439k52532k42588j70074
16727D059902p8943k0008N6481O9038Q6884N8244N7472o3209k09139k84864k64090
16716C467768j64342j15206j05633n7882p1563o3298p8321o9248l8984k2309l3407
$$ plain form
16705 2647575 2576151 2515494 2455295 2360489 2317986 2320861 2288595 2207392 2153222 2079164 1999919
16694 1999919 1929767 1840923 1817449 1844174 1863248 1873521 1854229 1796066 1743254 1700783 1650222
16683 1650222 1594654 1542209 1504789 1500224 1477603 1505223 1488553 1447759 1407152 1349859 1282791
16672 1282791 1240319 1236844 1256712 1277969 1311979 1323577 1285735 1251970 1236542 1183552 1116066
16661 1116066 1091622 1042427 990152 1006179 1023150 1039857 1018387 970802 955664 968754 986295
16650 986295 983497 956132 937471 915326 874837 831629 831655 804465 801159 819750 857851 855930 870152
16637 870152 864420 838036 824826 875716 875725 899975 925865 934704 980716 1099830 1215531 1397422
16625 1397422 1615790 1868974 2038620 2148944 2222541 2217008 2172027 2151243 2154790 2159863 2068899
$$ packed form
16705B647575p1424o0657o0199r4806m2503K875l2266q1203n4170p4058p9245
16694A999919p0152q8844k3474K6725J9074J0273j9292n8163n2812m2471n0561
16683A650222n5568n2445l7420m565k2621K7620j6670m0794m0607n7293o7068
16672A282791m2472l475J9868K1257L4010J1598l7842l3765j5428n2990o7486
16661A116066k4444m9195n2275J6027J6971J6707k1470m7585j5138J3090J7541
16650I86295k798k7365j8661k2145m0489m3208K6k7190l306J8591L8101j921J4222
16637H70152n732k6384j3210N0890RK4250K5890Q839M6012J19114J15701J81891
16625A397422K18368K53184J69646J10324P3597n533m4981k0784L547N073r0964
$$ plain form
16614 2068899 1901944 1740281 1614073 1432492 1288052 1188348 1181053 1251319 1369893 1511202
16604 1511202 1695701 1831929 1929256 2040369 2082170 2059985 2019571 1986721 1990792 2034869 2054702
16593 2054702 1980878 1802454 1616044 1409166 1236975 1098233 975620 902188 864763 793724
16583 793724 731119 694800 662456 658990 657014 670544 634369 604181 581640 558652 547780 547375
16571 547375 522234 523120 508106 524081 515248 508164 503121 487853 492661 459139 424086 371623 345367
16558 345367 374918 405436 380431 409597 411455 370613 343239 343908 329813 300204 320734 326464
16546 326464 306885 336981 348913 337605 345348 338231 305466 304546 316584 322728 306058 238567
16534 238567 195745 195359 219216 204512 183401 163464 190567 194662 220495 216520 187130 209767
$$ packed form
16614B068899j66955j61663j26208j81581j44440r9704p295P0266J18574J41309
16604A511202J84499J36228R7327J11113M1801k2185m0414l2850M071M4077J9833
16593B054702p3824j78424j86410k06878j72191j38742j22613p3432l7425p1039
16583G93724o2605l6319l2344l466j976J3530l6175l0188k2541k2988j0872m05
16571E47375k5141Q86j5014J5975q833p084n043j5268M808l3522l5053n2463k6256
16558C45367K9551L0518k5005K9166J858m0842k7374O69j4095k9609K0530N730
16546C26464j9579L0096J1932j1308P743p117l2765r20J2038O144j6670o7491
16534B38567m2822l86K3857j4704k1111j9937K7103M095K5833l975k9390K2637
$$ plain form
16522 209767 225257 193813 207353 229287 201950 170207 168211 167933 163200 180648 158768 169522
16510 169522 169925 172770 176058 177972 199621 189090 160664 128941 147486 177651 178870 169813 157143
16497 157143 160719 156021 153585 123637 90091 97154 86592 136929 148654 134603 164881 209158
16485 209158 188950 142144 155616 161122 141989 119976 148438 152784 126665 107240 95987 112235
16473 112235 143819 156429 153012 172934 171937 133219 94233 103669 89237 98931 71130 56559
16461 56559 61666 63595 106056 122566 69760 31351 79851 77059 49008 59314 103904 120510
16449 120510 85961 85744 74982 57851 24820 25811 66804 87576 91105 73505 35115 11560
16437 11560 56409 55698 48006 53871 41893 50741 28006 15266 75271 104075 123073 66743 50535
$$ packed form
16522B09767J5490l1444J3540K1934k7337l1743j996k78m733J7448k1880J0754
16510A69522M03K845L288J914K1649j0531k8426l1723J8545L0165J219r057j2670
16497A57143L576m698k436k9948l3546P063j0562N0337J1725j4051L0278M4277
16485B09158k0208m6806J3472N506j9133k2013K8462M346k6119j9425j1253J6248
16473A12235L1584J2610l417J9922r97l8718l8986R436j4432R694k7801j4571
16461E6559N107J929M2461J6510n2806l8409M8500k792k8051J0306M4590J6606
16449A20510l4549k17j0762j7131l3031R91M0993K0772L529j7600l8390k3555
16437A1560M4849p11p692N865j1978Q848k2735j2740O0005K8804J8998n6330j6208
$$ plain form
16424 50535 83447 101770 120843 125705 102908 76915 95573 115687 89222 82276 85784 87617
16412 87617 84632 60208 66614 56770 56727 89377 50471 24665 47251 112008 150217 133740 106198
16399 106198 107870 95280 134597 131512 144533 158950 150022 140269 101303 60683 49358 38697
16387 38697 55724 79554 56125 81610 68792 72251 94670 85894 56909 37244 38925 42316
16375 42316 56729 63293 34211 12751 15489 20737 37921 30899 3591 13970 53107 67322
16363 67322 49971 41061 69453 61632 48930 65097 58763 35629 53862 33678 4511 28599
16351 28599 40900 22629 23110 62608 69009 85545 99402 100721 101349 67031 26532 39241 56026
16338 56026 69496 92048 126305 188650 159252 152225 177248 229105 306455 359297 405454 516333
$$ packed form
16424E0535L2912J8323J9073M862k2797k5993J8658K0114k6465o946L508J833
16412H7617k985k4424O406r844m3L2650l8906k5806K2586O4757L8209j6477k7542
16399A06198J672j2590L9317l085J3021J4417q928r753l8966m0620j1325j0661
16387C8697J7027K3830k3429K5485j2818L459K2419q776k8985j9665J681L391
16375D2316J4413O564k9082k1460K738N248J7184p022k7308J0379L9137J4215
16363F7322j7351q910K8392p821j2702J6167o334k3134J8233k0184k9167K4088
16351B8599J2301j8271M81L9498O401J6536J3857J319O28l4318m0499J2709J6785
16338E6026J3470K2552L4257O2345k9398p027K5023N1857P7350N2842M6157J10879
$$ plain form
16326 516333 678738 920289 1161540 1309628 1328818 1160572 976322 888092 853084 936669
16316 936669 1066111 1242358 1419410 1528526 1599063 1595975 1465515 1203227 971734 861724
16306 861724 838408 926971 1141094 1357918 1468783 1485961 1374737 1226655 1096125 1045861
16296 1045861 1073844 1111874 1202911 1337719 1431471 1508659 1520650 1386207 1108383 831612
16286 831612 660732 575196 520645 473951 465264 442881 428586 390287 388349 377829 371502 359585
16274 359585 322776 316131 296805 285222 278461 254028 244276 233841 179256 179641 189182 179691 163284
16261 163284 158996 145358 178927 192933 191474 178378 135771 111455 133273 127776 111431 117098
16249 117098 107106 87861 76775 72308 78223 53903 44210 66625 38501 30912 49986 116507
$$ packed form
16326E16333J62405K41551K41251J48088J9190j68246j84250q8230l5008Q3585
16316I36669J29442J76247J77052J09116P0537l088j30460k62288k31493j10010
16306H61724k3316Q8563K14123K16824J10865J7178j11224j48082j30530n0264
16296A045861K7983L8030R1037J34808R3752P7188J1991j34443k77824k76771
16286H31612j70880q5536n4551m6694q687k2383j4295l8299j938j0520o327j1917
16274C59585l6809o645j9326j1583o761k4433r752j0435n4585L85R541r491j6407
16261A63284m288j3638L3569J4006j459j3096m2607k4316K1818n497j6345N667
16249A17098r992j9245j1086m467N915k4320r693K2415k8124p589J9074O6521
$$ plain form
16237 116507 116843 85042 80490 83964 93733 96747 91837 60072 59575 84145 81335 75339 87411 72659
16223 72659 20586 -17491 -33857 -18751 2812 13785 32184 55249 67724 71067 73450 73638
16211 73638 51869 29410 31273 29110 -1520 30946 25805 10984 11289 34123 78504 105494 101153
16198 101153 91042 69983 39928 18502 1314 9812 8667 22956 12054 -16143 7676 44107
16186 44107 61598 66362 29932 -33337 -44524 -47036 -66524 -64593 -29360 21140 22786 20214 -5560
16173 -5560 -22589 -34918 -11553 25862 37484 30887 33754 56359 59213 33069 41304 26016 25211
16160 25211 9867 20660 35643 10503 -23240 -8772 -26964 7053 36020 29494 37634 37187
16148 37187 27066 25881 46683 38255 36546 43759 38657 25158 5037 27085 36939 29713 28481
$$ packed form
16237A16507L36l1801m552L474R769L014m910l1765m97K4570k810n996J2072j4752
16223G2659n2073l8077j6366J5106K1563J0973J8399K3065J2475L343K383J88
16211G3638k1769k2459J863k163l0630L2466n141j4821L05K2834M4381K6990m341
16198A01153j0111k1059l0055k1426j7188Q498j145J4289j0902k8197K3819L6431
16186D4107J7491M764l6430o3269j1187k512j9488J931L5233N0500J646k572k5774
16173e560j7029j2329K3365L7415J1622o597K867K2605K854k6144Q235j5288q05
16160B5211j5344J0793J4983k5140l3743J4468j8192L4017K8967o526Q140m47
16148C7187j0121j185K0802q428j709P213n102j3499k0121K2048R854p226j232
$$ plain form
16135 28481 38469 23263 18602 46189 60022 33938 13963 3034 -9218 -16161 -4229 -14374
16123 -14374 -12796 22681 38794 38870 17212 13535 -2722 -44399 -39603 23611 50994 46903 42825
16110 42825 45339 33997 60772 54314 29489 -3731 -11200 -24558 -9341 2495 -28191 -51962
16098 -51962 -15978 -29181 -47208 -47698 1322 15983 -5097 -18726 -11270 -5046 13563 26360
16086 26360 5165 1087 24192 16256 -3179 11575 24080 16831 -27016 -44244 -22616 -59396
16074 -59396 -59274 -87346 -67903 -49839 -40373 -51510 1989 7151 -7532 14410 -7540 -9485 8236
16061 8236 18128 -8601 -15013 -37797 -30688 -5609 -6282 -39876 -57855 -49669 -61267 -92375 -94361
16048 -94361 -92024 -84656 -58917 -40102 -3213 10373 5767 -35439 -48044 -24820 -20020 -30096
$$ packed form
16135B8481R988j5206m661K7587J3833k6084j9975j0929j2252o943J1932j0145
16123a4374J578L5477J6113P6k1658l677j6257m1677M796O3214K7383m091m078
16110D2825K514j1342K6775o458k4825l3220p469j3358J5217J1836l0686k3771
16098e1962L5984j3203j8027m90M9020J4661k1080j3629P456O224J8609J2797
16086B6360k1195m078K3105p936j9435J4754J2505p249m3847j7228K1628l6780
16074e9396J22k8072J9443J8064R466j1137N3499N162j4683K1942k1950j945J7721
16061H236R892k6729o412k2784P109K5079o73l3594j7979Q186j1598l1108j986
16048i4361K337P368K5739J8815L6889J3586m606m1206j2605K3224M800j0076
$$ plain form
16036 -30096 -27373 -34527 -20059 25783 34386 15206 -19688 -51857 -38184 -28317 -19094 -8986 -16436
16023 -16436 -18928 -16509 -9570 -15091 30347 53754 74650 59127 28985 17210 8509 6290 13281
16010 13281 37109 21691 -10916 -22735 -37786 -77189 -60989 -43292 115 4899 -12851 16432
15998 16432 7821 20634 42248 56727 -2397 -18604 11957 16641 20974 39426 -33954 -62162
15986 -62162 -39790 -3954 -5782 -10291 4670 8572 5855 11121 15596 -19255 -45064 -21513 8767
15973 8767 7140 1810 3359 21989 6888 -27476 -17110 -26077 -26462 -13039 7226 44679 19841
15960 19841 16396 16146 869 6156 21987 7415 12998 9912 -4593 21398 2497 -2359 26456
15947 26456 46738 20622 -35353 -50118 -42169 -24845 -18701 16042 35681 23783 19129 5064
$$ packed form
16036c0096K723p154J4468M5842Q603j9180l4894l2169J3673R867R223J0108p450
16023a6436k492K419O939n521M5438K3407K0896j5523l0142j1775q701k219O991
16010A3281K3828j5418l2607j1819j5051l9403J6200J7697M3407M784j7750K9283
15998A6432q611J2813K1614J4479n9124j6207L0561M684M333J8452p3380k8208
15986f2162K2372L5836j828m509J4961L902k717N266M475l4851k5809K3551L0280
15973H767j627n330J549J8630j5101l4364J0366q967l85J3423K0265L7453k4838
15960A9841l445k50j5277N287J5831j4572N583l086j4505K5991j8901m856K8815
15947B6456K0282k6116n5975j4765P949J7324O144L4743J9639j1898m654j4065
$$ plain form
15935 5064 -36478 -78142 -78541 -73989 -50971 -13603 1463 -18079 -24499 -51757 -50159 -32152 -28245
15922 -28245 -21061 -34864 -37368 -31603 -2212 18596 30039 53284 36389 25343 28237 59165
15910 59165 50583 23604 17999 40440 30475 21772 18687 41753 48160 43451 51498 63331 53911
15897 53911 60653 25906 16652 11732 -12074 -30599 -43065 -50339 -45301 -10421 7267 -6230 -17632
15884 -17632 -23632 -59382 -51946 -36744 -31420 8961 31320 7219 -5931 16050 37719 79120
15872 79120 83681 93834 98356 75521 81670 102097 85671 63314 40361 45638 65298 51025
15860 51025 37952 59673 67189 68523 76176 25546 17308 1734 36018 46722 68069 86568
15848 86568 42460 5700 60568 47986 24128 43026 95176 113133 108590 102769 100164 76443
$$ packed form
15935E064m1542m1664l99M552K3018L7368J5066j9542o420k7258J598J8007L907
15922b8245P184j3803k504N765K9391K0808J1443K3245j6895j1046K894L0928
15910E9165q582k6979n605K2441r965q703l085K3066O407m709Q047J1833r420
15897E3911O742l4747r254m920k3806j8525j2466p274N038L4880J7688j3497j1402
15884a7632o000l5750P436J5202N324M0381K2359k4101j3150K1981K1669M1401
15872G9120M561J0153M522k2835O149K0427j6426k2357k2953N277J9660j4273
15860E1025j3073K1721P516J334P653n0630q238j5574L4284J0704K1347J8499
15848H6568m4108l6760N4868j2582k3858J8898N2150J7957m543n821k605k3721
$$ plain form
15836 76443 78594 87539 50026 -2155 5492 34309 64356 72615 53606 51631 56716 85717 85044
15823 85044 54297 74375 72292 62947 67387 92677 80823 65855 59773 53492 50824 37248 8307
15810 8307 1405 15453 11822 -1399 7795 26108 -2643 6422 4294 -9692 37661 28319 -17215
15797 -17215 15744 27686 46396 19256 12601 15809 -9882 -21429 -27001 -24485 -9313 15200
15785 15200 21617 2299 -12136 -16847 -21469 -2231 -13441 -10671 5488 33871 42193 26543 9438
15772 9438 17918 50417 40217 32311 -6578 28089 18792 14077 13457 -6763 -12291 -8931 -7092 41652
15758 41652 86158 73521 60133 19897 -28422 -29673 -14022 -18152 -15039 -30614 -9661 -23156
15746 -23156 -25033 -2460 42457 67491 102028 136979 145479 177501 233434 263418 248127 249314
$$ packed form
15836G6443K151Q945l7513n2181P647K8817L0047Q259j9009j975N085K9001o73
15823H5044l0747K0078k083r345M440K5290j1854j4968o082o281k668j3576k8941
15810H307o902J4048l631j3221R194J8313k8751R065k128j3986M7353r342m5534
15797a7215L2959J1942J8710k7140o655L208k5691j1547n572K516J5172K4513
15785A5200O417j9318j4435m711m622J9238j1210K770J6159K8383Q322j5650j7105
15772I438Q480L2499j0200p906l8889L4667r297m715o20k0220n528L360J839M8744
15758D1652M4506j2637j3388m0236m8319j251J5651m130L113j5575K0953j3495
15746b3156j877K2573M4917K5034L4537L4951Q500L2022N5933K9984j5291J187
$$ plain form
15734 249314 212354 233382 308303 332133 299924 273054 259888 237611 231957 245785 276911 263752
15722 263752 252523 240570 230870 220209 222558 259547 272781 327788 333081 300453 259699 254148
15710 254148 269740 270953 277093 286027 328978 367088 368835 310168 277640 262755 284359 242509
15698 242509 210089 145400 101838 93213 98856 92053 83728 55455 50598 82324 69752 67693 73875
15685 73875 79961 63409 77197 73724 78412 111316 109444 63047 28882 31603 67656 93140 101228
15672 101228 72032 19821 -2173 12575 26225 16118 54206 44536 11807 -8904 -5063 6520
15660 6520 14371 31145 60305 62799 36764 60693 44543 13736 39395 16015 -11288 25521
15648 25521 32541 18707 36541 43655 12842 -21641 -7813 6957 28695 47958 31754 33805
$$ packed form
15734B49314l6960K1028P4921K3830l2209k6870j3166k2277n654J3828L1126j3159
15722B63752j1229j1953r700j0661K349L6989J3234N5007N293l2628m0754n551
15710B54148J5592J213O140Q934M2951L8110J747n8667l2528j4885K1604m1850
15698B42509l2420o4689m3562q625N643o803q325k8273m857L1726j2572k059O182
15685G3875O086j6552J3788l473M688L2904j872m6397l4165K721L6053K5484Q088
15672A01228k9196n2211k1994J4748J3650j0107L8088r670l2729k0711L841J1583
15660F520P851J6774K9160K494k6035K3929j6150l0807K5659k3380k7303L6809
15648B5521P020j3834J7834P114l0813l4483J3828J4770K1738J9263j6204K051
$$ plain form
15636 33805 27895 -8754 1437 50700 65847 47727 42545 60174 48372 60352 35241 -2019
15624 -2019 33814 69556 57416 62245 49100 20010 -18097 -44477 -44253 -25935 -2213 12528
15612 12528 3817 -9026 -44391 -64234 -29874 -20409 9858 17438 3017 9523 -8411 -8678 9402
15599 9402 -9990 -29140 -52563 -50693 -31296 -17430 4938 3164 -19237 24350 11632 9656
15587 9656 18647 37500 22745 -28392 -78259 -56583 424 75920 77394 22405 -30798 -4030
15575 -4030 42919 67529 39231 30229 26409 -10142 -31318 -11705 1624 -31492 -54575 -46924
15563 -46924 -66057 -69646 -34573 -28287 -19608 -8915 -49338 -68465 -42686 -44273 -25617 -35694
15551 -35694 -57237 -58595 -69180 -65951 -51673 -55472 -75431 -60990 -6973 13247 6939 4144 20199
$$ packed form
15636C3805n910l6649J0191M9263J5147j8120n182J7629j1802J1980k5111l7260
15624b019L5833L5742j2140M829j3145k9090l8107k6380K24J8318K3722J4741
15612A2528q711j2843l5365j9843L4360R465L0267P580j4421O506j7934k67J8080
15599I402j9392j9150k3423J870J9397J3866K2368j774k2401M3587j2718j976
15587I656Q991J8853j4755n1137m9867K1676N7007P5496J474n4989n3203K6768
15575d030M6949K4610k8298r002l820l6551k1176J9613J3329l3116k3083P651
15563d6924j9133l589L5073O286Q679J0693m0423j9127K5779j587J8656j0077
15551c5694k1543j358j0585L229J4278l799j9959J4441N4017K0220o308k795J6055
$$ plain form
15538 20199 7704 13299 3832 55 2538 -24237 -44996 -41161 -66311 -100145 -96455 -95562 -113386
15525 -113386 -108641 -101835 -107239 -102619 -64230 -68603 -52616 -63585 -86353 -31150 5291 5080 8382
15512 8382 19152 25646 8918 -28090 -55733 -83030 -76626 -52237 -20581 -4135 18151 1620
15500 1620 -4761 -6266 -59313 -35954 -21145 -25625 -27466 -29771 -21929 -22168 -32414 -19111 9399
15487 9399 40788 5815 -39320 3654 -17149 -47163 -10244 26582 29780 33035 15037 7567
15475 7567 -1265 -6361 -7086 -9421 -14845 33251 33692 30550 22980 9932 -1786 -27969 -44655 -72952
15461 -72952 -59794 -26939 -5942 -25662 -37087 -31776 -5261 16681 15576 15740 13282 -12706 -13367
15448 -13367 -26728 -60265 -58027 -42310 2914 39860 49731 42009 33260 17920 4331 18346
$$ packed form
15538B0199j2495N595r467l777K483k6775k0759L835k5150l3834L690Q93j7824
15525a13386M745O806n404M620L8389m373J5987j0969k2768N5203L6441k11L302
15512H382J0770O494j6728l7008k7643k7297O404K4389L1656J6446K2286j6531
15500A620o381j505n3047K3359J4809m480j841k305P842k39j0246J3303K8510
15487I399L1389l4973m5135M2974k0803l0014L6919L6826L198L255j7998p470
15475G567q832n096p25k335n424M8096M41l142p570j3048j1718k6183j6686k8297
15461g2952J3158L2855K0997j9720j1425N311K6515K1942j105J64k458k5988o61
15448a3367j3361l3537K238J5717M5224L6946R871p722q749j5340j3589J4015
$$ plain form
15436 18346 23387 1735 -6320 -22131 -26359 -14257 -10386 -10149 -10237 -16148 -30626 -49382 -72961 -82150
15422 -82150 -80686 -68271 -36543 -28504 -37672 3112 45699 4986 -23677 -67264 -50200 -38681
15410 -38681 -46899 -49584 -42456 -47586 -8415 1018 -11898 -23190 -42195 -52431 -40629 -12176 -42137
15397 -42137 -84875 -94265 -55940 -25329 -35527 -37908 -49350 -52320 -48918 -42397 -3594 36351 39881
15384 39881 36516 23284 931 -8320 -9559 -13344 5038 20637 -8434 -14852 -15805 -42747 -40003
15371 -40003 3184 51923 37750 1296 -5268 -16611 -11355 -2540 -2510 -15289 -22228 -27678 -28923
15358 -28923 -6821 -31046 -38445 -27305 -14278 -6328 8491 -13073 -25315 -20852 -31423 -57302
15346 -57302 -82389 -52818 -24959 -2625 -17155 -29220 -33029 -31169 -10981 6113 4045 32
$$ packed form
15436A8346N041k1652q055j5811m228J2102L871K37q8n911j4478j8756k3579r189
15422h2150J464J2415L1728Q039r168M0784M2587m0713k8663m3587J7064J1519
15410c8681q218k685P128n130L9171R433j2916j1292j9005j0236J1802K8453k9961
15397d2137m2738r390L8325L0611j0198k381j1442k970L402O521L8803L9945L530
15384C9881l365j3232k2353r251j239l785J8382J5599k9071o418r53k6942K744
15371d0003M3187M8739j4173l6454o564j1343N256Q815L0j2779o939n450j245
15358b8923K2102k4225p399J1140J3027P950J4819k1564j2242M463j0571k5879
15346e7302k5087K9571K7859K2334j4530j2065l809J860K0188J7094k068m013
$$ plain form
15334 32 -44131 -34781 -52430 -43090 -42875 -43815 -63814 -76477 -52312 -35414 -1410 -8960 -12286 -19678
15320 -19678 -18805 -20291 4095 7962 18903 22564 9118 19203 50753 53100 75709 69770 69831 24574
15306 24574 4624 -5340 -11765 -886 37138 48108 68177 80859 82187 97850 141451 117936
15294 117936 64168 20040 -16756 1784 12299 15523 6024 -2340 26910 -15909 -14595 -10162
15282 -10162 -61581 -47341 5264 -964 4256 -9037 -7796 -13346 3323 21300 24415 23858 12195
15269 12195 8184 -841 11660 -4957 2501 -2240 48087 50478 39751 25012 -5679 4318 9567
15256 9567 41316 20319 -16745 -15700 27903 3531 -54270 -82624 -102676 -105063 -58593 -51288
15244 -51288 -80243 -92343 -75853 -54471 -15918 9338 22674 3183 7591 -9114 -11072 -8483
$$ packed form
15334C2m4163R350j7649R340K15r40j9999j2663K4165J6898L4004p550l326p392
15320a9678Q73j486K4386L867J0941L661j3446J0085L1550K347K2609n939O1m5257
15306B4574j9950r964o425J0879L8024J0970K0069J2682J328J5663M3601k3515
15294A17936n3768m4128l6796J8540J0515L224r499q364K9250m2819J314M433
15282a0162n1419J4240N2605o228N220j3293J241n550J6669J7977L115n57j1663
15269A2195m011r025J2501j6617P458m741N0327K391j0727j4739l0691R997N249
15256I567L1749k0997l7064J045M3603k4372n7801k8354k0052k387M6470P305
15244e1288k8955j2100J6490K1382L8553K5256J3336j9491M408j6705j958K589
$$ plain form
15232 -8483 -3003 -25638 -35126 -11463 5059 40200 40517 13608 -21529 -38460 -46864 -39355 -27104
15219 -27104 -28024 -25840 -17383 1932 -26748 -42039 1654 4169 817 -27745 -8775 13562 5508
15206 5508 -7258 -13680 -39857 -47582 -49261 -71975 -57856 -14049 28078 3876 -8497 -5910 -15932
15193 -15932 -18914 -13237 -188 4498 -36676 -48333 -4306 19282 23382 32202 33724 8573 -1955
15180 -1955 -7676 -6046 2792 52091 40025 -13338 -50910 -69690 -54700 -55547 -48950 -18714 -33385
15167 -33385 -58204 -66306 -78045 -62206 -28239 -34943 -36819 -36303 -37166 -68423 -67003 -28301 -14456
15154 -14456 -31713 -39164 -25507 -33339 -58434 -56179 -44511 -14631 -22559 -41123 -60454 -67351 -14398
15141 -14398 -8700 -28913 -29138 -55957 -32413 -15398 -18759 -12423 -22393 2889 31598 -7930 -53377
$$ packed form
15232h483N480k2635r488K3663J6522L5141L17k6909l5137j6931q404P509J2251
15219b7104r20K184Q457J9315k8680j5291M3693K515l352k8562J8970K2337q054
15206E508j2766o422k6177p725j679k2714J4119M3807M2127k4202j2373K587j0022
15193a5932k982N677J3049M686m1174j1657M4027K3588M100Q820J522k5151j0528
15180a955n721J630Q838M9299j2066n3363l7572j8780J4990q47O597L0236j4671
15167c3385k4819q102j1739J5839L3967o704j876N16q63l1257J420L8702J3845
15154a4456j7257p451J3657p832k5095K255J1668K9880p928j8564j9331o897N2953
15141a4398N698k0213k25k6819K3544J7015l361O336r970K5282K8709l9528m5447
$$ plain form
15128 -53377 -87301 -70330 -32190 9093 17393 21292 32596 27572 18404 -21815 -35068 7832
15116 7832 1930 14557 25264 13544 2669 -42589 -48104 -13518 -17177 -49241 -44225 -24088 -37019
15103 -37019 -37338 -29999 -26214 -4098 -12440 -6692 -15554 -22586 -21368 -51601 -52696 -34811 -12920 -25459
15089 -25459 -40746 -49503 -38484 -14765 -26613 -46447 -18781 -25848 -42071 -56344 -25694 -23859
15077 -23859 -62306 -50339 -41459 -28378 -14093 9026 19313 17005 24409 44465 30854 21550
15065 21550 44341 19225 31717 51619 54167 25962 26495 867 -25056 -31740 -24916 -12939 -28233
15052 -28233 -51908 -47772 -69167 -51310 -62823 -71979 -73039 -64627 -50002 -35404 -33107 14581 34960
15039 34960 7789 -5822 3484 -16827 -8961 -8588 -6323 -5824 -2854 -30745 -50035 -40547 -30987 -25542
$$ packed form
15128e3377l3924J6971L8140M1283Q300L899J1304n024r168m0219j3253M2900
15116G832n902J2627J0707j1720j0875m5258n515L4586l659l2064N016K0137j2931
15103c7019l19P339L785K2116q342N748q862p032J218l0233j095J7885K1891j2539
15089b5459j5287q757J1019K3719j1848j9834K7666p067j6223j4273L0650J835
15077b3859l8447J1967Q880J3081J4285K3119J0287k308P404K0056j3611r304
15065B1550K2791k5116J2492J9902K548k8205N33k5628k5923o684O824J1977j5294
15052b8233k3675M136k1395J7857j1513r156j060Q412J4625J4598K297M7688K0379
15039C4960k7171j3611R306k0311P866L73K265M99K970k7891j9290R488R560N445
$$ plain form
15025 -25542 4560 4256 -6079 -4937 -25344 -8585 -3590 -8157 5667 13572 42548 48356 41018
15012 41018 -2444 -9045 -6814 -32106 -20411 -3457 -20231 14751 21828 21181 11199 5046 33024
14999 33024 45716 32877 17128 -37929 -74743 -42912 9467 6986 -42994 -68552 -68508 -19582
14987 -19582 6607 13320 10266 -25142 -27343 -26263 -21526 -17883 -45058 -50119 -16381 22090 -12887
14974 -12887 -60677 -60635 -36155 -60526 -65282 -74720 -48626 -1778 6628 -11498 -16333 -33026 -54271
14961 -54271 -63615 -28896 747 14447 20971 22243 17630 7751 11774 2158 -24356 -35441 -50997
14948 -50997 -45646 -9852 -8343 16832 18549 34968 27776 28866 23466 7522 -14334 -41954 -22669
14935 -22669 -2464 -11902 7338 -27930 -21066 -666 8532 -1170 -21637 2014 15145 -9231
$$ packed form
15025b5542L0102l04j0335J142k0407J6759M995m567J3824P905K8976N808p338
15012D1018m3462o601K231k5292J1695J6954j6774L4982P077o47r982o153K7978
14999C3024J2692j2839j5749n5057l6814L1831N2379k481m9980k5558M4M8926
14987a9582K6189O713l054l5408k201J080M737L643k7175n061L3738L8471l4977
14974a2887m7790M2K4480k4371m756r438K6094M6848Q406j8126m835j6693k1245
14961e4271r344L4719K9643J3700O524J272m613r879M023r616k6514j1085j5556
14948e0997N351L5794J509K5175J717J6419p192J090n400j5944k1856k7620J9285
14935b2669K0205r438J9240l5268O864K0400R198r702k0467K3651J3131k4376
$$ plain form
14923 -9231 -18893 -2037 -2792 23786 11005 -3034 -9679 -21081 -16970 27707 50966 30093 31915
14910 31915 16381 25786 37071 4479 10087 12482 2667 -3653 2332 1524 -1726 -24127 -22741 -13210
14896 -13210 -11851 -5133 -17540 -24824 -26436 -63241 -66251 -17317 13268 34879 6009 -19169 -58855
14883 -58855 -77799 -77697 -53951 -43385 -15874 19439 12602 -2437 -10920 3466 11176 -14601 -13752
14870 -13752 -16067 -43182 -34765 -19710 -40684 -33864 -13722 -12300 2863 16595 5843 -28300
14858 -28300 -21148 -6738 -3007 -23442 -21521 -23733 -15735 12045 -18290 -16963 8529 15496 24354
14845 24354 24100 11306 7812 13511 812 -9458 -32303 -32198 -9335 207 -40069 -42494 -43225 -64353
14831 -64353 -42415 -42339 -23854 -15055 10605 -15402 -19847 11246 42425 35638 23862 30693 51504
$$ packed form
14923i231r662J6856p55K6578j2781j4039o645j1402M111M4677K3259k0873J822
14910C1915j5534R405J1285l2592N608K395r815o320N985q08l250k2401J386R531
14896a3210J359O718j2407p284j612l6805l010M8934L0585K1611k8870k5178l9686
14883e8855j8944J02K3746J0566K7511L5313o837j5039q483J4386P710k5777Q49
14870a3752k315k7115Q417J5055k0974O820K0142J422J5163J3732j0752l4143
14858b8300P152J4410L731k0435J921k212P998K7780l0335J327K5492O967Q858
14845B4354k54j2794l494N699j2699j0270k2845J05K2863R542m0276k425p31k1128
14831f4353K1938P6J8485Q799K5660k6007m445L1093L1179o787j1776O831K0811
$$ plain form
14818 51504 43121 59135 60591 40575 24219 6381 2164 26159 47122 49843 39338 50918
14806 50918 32722 11747 28765 64066 58764 15951 -36028 -55873 -85427 -56229 -37669 -40397
14794 -40397 -29310 -19062 -15472 -15891 -28821 -26976 -54915 -37923 -11155 -8650 -25810 -21996 7485
14781 7485 20423 35513 35320 46016 65643 73677 28139 22457 43168 17074 -13422 -13268 2794
14768 2794 -4040 4142 26238 19258 474 -6706 838 -27092 -28611 -8599 29660 10771 20616
14755 20616 5850 -8422 -3054 33549 51692 37630 10765 -18083 -22372 -16652 23852 16167
14743 16167 12049 15358 19087 7521 20071 36447 81138 74312 71856 67764 61289 17169 1662
14730 1662 17201 14550 5604 -5925 -16738 10470 26062 54085 54660 57501 76554 61554 57219
$$ packed form
14818E1504q383J6014J456k0016j6356j7838m217K3995K0963K721j0505J1580
14806E0918j8196k0975J7018L5301n302m2813n1979j9845k9554K9198J8560k728
14794d0397J1087J0248L590m19j2930J845k7939J6992K6768K505j7160L814K9481
14781G485J2938J5090j93J0696J9627Q034m5538n682K0711k6094l0496J54J6062
14768B794o834Q182K2096o980j8784p180P544k7930j519K0012L8259j8889R845
14755B0616j4766j4272N368L6603J8143j4062k6865k8848m289N720M0504p685
14743A6167m118L309L729j1566J2550J6376M4691o826k456m092o475m4120j5507
14730A662J5539k651q946j1529j0813K7208J5592K8023N75K841J9053j5000m335
$$ plain form
14717 57219 76487 90172 54566 39123 45388 53074 64522 50690 20889 46408 52437 45253
14705 45253 22273 57055 55130 53328 74961 85128 80952 90857 55060 27889 35366 55114 60252
14692 60252 51610 51638 83533 92738 72486 30297 23755 20221 10801 51055 70710 35596 6700
14679 6700 -11775 4892 9889 -850 -30929 -41581 18774 54996 74194 73084 54477 48144
14667 48144 60380 54964 66516 97526 102871 99315 91252 87995 85243 74638 80817 82928 73828
14654 73828 42728 24372 56353 66633 54518 38893 19666 22985 62643 73263 31842 16467
14642 16467 5870 16575 68297 89202 67439 62378 64985 15508 15863 47352 43377 22632 7164
14629 7164 22268 35330 25682 45141 45951 53114 70544 46156 24375 44271 50629 32411 5226
$$ packed form
14717E7219J9268J3685l5606j5443O265P686J1448j3832k9801K5519O029p184
14705D5253k2980L4782j925j802K1633J0167m176R905l5797k7171P477J9748N138
14692F0252q642K8L1895R205k0252m2189o542l534r420M0254J9655l5114k8896
14679F700j8475J6667M997j0739l0079j0652O0355L6222J9198j110j8607o333
14667D8144J2236n416J1552L1010N345l556q063l257k752j0605O179K111r100
14654G3828l1100j8356L1981J0280j2115j5625j9227L319L9658J0620m1421j5375
14642A6467j0597J0705N1722K0905k1763n061K607m9477L55L1489l975k0745j5468
14629G164J5104J3062r648J9459Q10P163J7430k4388k1781J9896O358j8218k7185
$$ plain form
14616 5226 7599 16440 26401 45155 43492 -4769 -2879 12069 15941 44857 44944 27779 37478 49190
14602 49190 43503 26884 15446 31596 22227 37440 49434 47817 54969 60907 63479 20733 32283
14589 32283 70403 70000 64126 100303 78246 32180 -4732 6204 31936 38894 59117 65495 38763
14576 38763 38445 41751 9445 14052 25809 44932 47875 72395 86709 93103 69855 68590 82108
14563 82108 75782 28738 2980 10852 -4639 14701 33179 19406 25150 27297 28886 63355 40532
14550 40532 4411 19135 48093 52251 50009 24888 14934 19409 1953 23021 50719 40469
14538 40469 63487 84609 73419 91053 107655 107294 100996 95929 88595 56315 55597 74346 98687
14525 98687 96081 117401 134940 85042 92985 113635 70987 42604 49696 44398 33098 23475 48975
$$ packed form
14616E226K373Q841R961J8754j663m8261J890J4948L872K8916Q7j7165R699J1712
14602D9190n687j6619j1438J6150r369J5213J1994j617P152N938K572m2746J1550
14589C2283L8120m03n874L6177k2057m6066l6912J0936K5732O958K0223O378k6732
14576C8763l18L306l2306M607J1757J9123K943K4520J4314O394k3248j265J3518
14563H2108o326m7044k5758P872j5491J9340J8478j3773N744K147J589L4469k2823
14550D0532l6121J4724K8958M158k242k5121r954M475j7456K1068K7698j0250
14538D0469K3018K1122j1190J7634J6602l61o298n067p334l2280p18J8749K4341
14525I8687k606K1320J7539m9898P943K0650m2648k8383P092n298j1300r623K5500
$$ plain form
14512 48975 45636 69689 116715 129590 144006 160394 162649 178722 190623 156207 163202 224968
14500 224968 254595 273223 335355 385675 488544 619319 755543 859304 976161 1103893
14490 1103893 1205454 1329028 1438490 1511595 1526961 1513174 1486767 1456791 1399402 1322637 1255310
14479 1255310 1168313 1103925 1062570 959912 846417 821599 863281 863577 833163 786243 735819
14468 735819 722088 718729 719963 713618 725203 756850 795661 836360 909198 989815 1104762 1163028
14456 1163028 1248715 1371657 1510957 1636813 1730898 1786804 1805400 1784486 1740480 1681819 1619206
14445 1619206 1518908 1373162 1244506 1150364 1068111 945254 869868 842528 777548 647835
14435 647835 603403 580636 558463 505111 474145 450906 422483 366719 349271 347424 337553 340616
$$ packed form
14512D8975l339K4053M7026J2875J4416J6388K255J6073J1901l4416O995O1766
14500B24968K9627J8628O2132N0320J02869J30775J36224J03761J16857J27732
14490A103893J01561J23574J09462P3105J5366j3787k6407k9976n7389p6765o7327
14479A255310q6997o4388m1355j02658j13495k4818M1682K96l0414m6920n0424
14468G35819j3731l359J234o345J1585L1647L8811M0699P2838Q0617J14947N8266
14456A163028Q5687J22942J39300J25856R4085N5906J8596k0914m4006n8661o2613
14445A619206j00298j45746j28656r4142q2253j22857p5386k7340o4980j29713
14435F47835m4432k2767k2173n3352l0966k3239k8423n5764j7448j847r871L063
$$ plain form
14423 340616 324174 284614 274224 272967 288391 307872 319319 283364 262380 268449 252764 250870
14411 250870 262963 259978 253376 255104 229118 204627 225571 224132 228100 252419 270442 277439 291652
14398 291652 277758 208055 171484 155074 160367 146782 122476 115574 113977 121881 128780 154355
14386 154355 162548 136840 154059 164084 160636 145565 113377 137232 159946 153872 110381 81248
14374 81248 103510 83073 56676 69749 97966 122292 150975 159216 133481 106918 113084 123835
14362 123835 138982 146965 136124 138131 148185 139425 134525 142521 112796 123975 171653 185915
14350 185915 177245 167010 165059 167704 197953 205872 174321 153632 143988 134727 138296 165130 181163
14337 181163 141834 140846 152558 145009 125245 153790 143577 149163 169433 181016 187881 172793
$$ packed form
14423C40616j6442l9560j0390j257J5424J9481J1447l5955k0984O069j5685j894
14411B50870J2093k985o602J728k5986k4491K0944j439L968K4319J8023O997J4213
14398B91652j3894o9703l6571j6410N293j3585k4306o902j597P904O899K5575
14386A54355Q193k5708J7219J0025l448j5071l2188K3855K2714o074m3491k9133
14374H1248K2262k0437k6397J3073K8217K4326K8683Q241k5735k6563O166J0751
14362A23835J5147P983j0841K007J0054q760m900P996k9725J1179M7678J4262
14350A85915q670j0235j951K645L0249P919l1551k0689r644r261L569K6834J6033
14337A81163l9329r88J1712p549j9764K8545j0213N586K0270J1583O865j5088
$$ plain form
14325 172793 161403 112071 89885 116186 109830 127718 144651 181768 173076 156364 156390 137268
14313 137268 126232 141489 159564 195122 187187 166001 142577 158538 156060 139536 146836 149542
14301 149542 171654 155358 194932 187238 170051 233729 299986 329638 366451 340735 313293 311795
14289 311795 323405 293175 290395 249068 256144 260602 259143 258377 223547 229843 233520 262214 269091
14276 269091 247372 251606 275478 284355 298849 307214 308678 290408 253620 227621 227952 225795 203697
14263 203697 226095 270815 296071 299619 294133 307264 305884 307177 309886 327634 302838 321187
14251 321187 339776 311603 288498 297147 275875 250394 225397 216030 200983 227194 269870 294386
14239 294386 310502 290843 276555 282674 266237 250912 263340 294567 263243 251767 274250 285904
$$ packed form
14325A72793j1390m9332k2186K6301o356J7888J6933L7117q692j6712K6j9122
14313A37268j1036J5257J8075L5558p935k1186k3424J5961k478j6524P300K706
14301A49542K2112j6296L9574p694j7187O3678O6257K9652L6813k5716k7442j498
14289C11795J1610l0230k780m1327P076M458j459p66l4830O296L677K8694O877
14276B69091k1719M234K3872Q877J4494Q365J464j8270l6788k5999L31k157k2098
14263B03697K2398M4720K5256L548n486J3131j380J293K709J7748k4796J8349
14251C21187J8589k8173k3105Q649k1272k5481k4997r367j5047K6211M2676K4516
14239B94386J6116j9659j4288O119j6437j5325J2428L1227l1324j1476K2483J1654
$$ plain form
14227 285904 282659 310525 307281 311983 347951 356630 324617 301119 292365 275670 280520 281688 285232
14214 285232 262651 253365 260202 244057 251112 249751 260250 266342 262214 235260 238485 239265 261351
14201 261351 252869 273768 273343 244559 264306 252269 255128 277809 298729 335513 345899 363703
14189 363703 384002 407047 410218 404645 439201 440897 436050 428484 450471 499654 530136 545787
14177 545787 636571 737111 847464 953737 1094735 1270438 1465284 1697382 1920951 2129731
14167 2129731 2349505 2466218 2545334 2611022 2679472 2692085 2628368 2541784 2481088 2374270 2224267
14156 2224267 2083351 1973080 1847562 1771288 1709873 1666028 1636515 1605701 1577530 1562736 1549074
14145 1549074 1546629 1579272 1595671 1639697 1681014 1763667 1880002 2001865 2148108 2318640 2507524
$$ packed form
14227B85904l245K7866l244M702L5968Q679l2013k3498q754j6695M850J168L544
14214B85232k2581r286O837j6145P055j361J0499O092m128k6954L225P80K2086
14201B61351q482K0899m25k8784J9747j2037K859K2681K0920L6784J0386J7804
14189C63703K0299K3045L171n573L4556J696m847p566K1987M9183L0482J5651
14177E45787R0784J00540J10353J06273J40998J75703J94846K32098K23569K08780
14167B129731K19774J16713P9116O5688O8450J2613o3717q6584o0696j06818j50003
14156B224267j40916j10271j25518p6274o1415m3845k9513l0814k8171j4794j3662
14145A549074k445L2643J6399M4026M1317Q2653J16335J21863J46243J70532J88884
$$ plain form
14134 2507524 2665444 2857019 3058052 3218082 3363150 3464512 3486758 3467277 3432404 3379746
14124 3379746 3261838 3141737 3019660 2838332 2653383 2498047 2390684 2285139 2192890 2149814
14114 2149814 2091786 2062399 2065987 2030795 2000459 1999761 2000832 2025372 2021730 2025416 1994183 1990748 2027966
14101 2027966 2057699 2067827 2077756 2094845 2114164 2156953 2181029 2240311 2299097 2308840 2365941 2467436
14089 2467436 2527690 2526572 2580386 2670036 2770382 2872662 3024082 3171821 3333129 3467880
14079 3467880 3647050 3813238 4000489 4246047 4483393 4769634 5089354 5428688 5742928
14070 5742928 6138049 6617629 7083218 7601366 8219373 8978188 9856642 10858951 11990282
14061 11990282 13276386 14806498 16596658 18696034 21156756 24064497 27523810 31677730
$$ packed form
14134B507524J57920J91575K01033J60030J45068J01362K2246j9481l4873n2658
14124C379746j17908j20101j22077j81328j84949j55336j07363j05545r2249m3076
14114B149814n8028k9387L588l5192l0336o98J071K4540l642L686l1233l435L7218
14101B027966K9733J0128R929J7089J9319M2789K4076N9282N8786R743N7101J01495
14089B467436O0254j118N3814Q9650J00346J02280J51420J47739J61308J34751
14079C467880J79170J66188J87251K45558K37346K86241L19720L39334L14240
14070E742928L95121M79580M65589N18148O18007P58815Q78454J002309J131331
14061A1990282J286104J530112J790160K099376K460722K907741L459313M153920
$$ plain form
14053 31677730 36709519 42826707 50352342 59719024 71292392 85548822 102766621 122964399
14045 122964399 145793972 170602414 196266734 221422936 244580081 264146427 278810074
14038 278810074 287688296 290386948 287104721 278476976 265633743 249932339 232772709
14031 232772709 215401375 198878602 183933937 170951258 160002136 151008893 143756578
14024 143756578 138088373 133743399 130529641 128299339 127084646 126922148 127901935 130021374
14016 130021374 133366317 138171010 144656675 153141099 163936766 177277208 193157021
14009 193157021 211299298 231176428 251942318 272361074 290978944 306307978 316976372
14002 316976372 321942029 320644555 313111574 299859838 281924146 260729084 237760487
$$ packed form
14053C1677730N031789O117188P525635R366682J1573368J4256430J7217799K0197778
14045A22964399K2829573K4808442K5664320K5156202K3157145J9566346J4663647
14038B78810074Q878222K698652l282227q627745j2843233j5701404j7159630
14031B32772709j7371334j6522773j4944665j2982679j0949122q993243p252315
14024A43756578n668205m344974l213758k230302j214693j62498R79787K119439
14016A30021374L344943M804693O485665Q484424J0795667J3340442J5879813
14009A93157021J8142277J9877130K0765890K0418756J8617870J5329034J0668394
14002C16976372M965657j297474p532981j3251736j7935692k1195062k2968597
$$ plain form
13995 237760487 214479127 192166213 171682528 153516478 137900957 124734043 113715769
13988 113715769 104470142 96617093 89829353 83952009 78766265 74175989 70038772 66360387
13980 66360387 63074684 60102947 57412606 54976633 52756625 50740206 48885951 47168309
13972 47168309 45532786 44036589 42605560 41263821 40010297 38819238 37695681 36654754
13964 36654754 35598857 34548046 33595623 32757931 31896799 31065485 30309555 29549564 28793632
13955 28793632 28046081 27324643 26605457 25940081 25281865 24623545 23997852 23388341 22777902
13946 22777902 22218266 21689690 21155686 20645919 20157513 19689184 19256392 18818703 18411774
13937 18411774 18015588 17595135 17194893 16822775 16467293 16115256 15782035 15459754 15190318
$$ packed form
13995B37760487k3281360k2312914k0483685j8166050j5615521j3166914j1018274
13988A13715769r245627p853049o787740n877344n185744m590276m137217l678385
13980F6360387l285703k971737k690341k435973k220008k016419j854255j717642
13972D7168309j635523j496197j431029j341739j253524j191059j123557j040927
13964C6654754j055897j050811r52423q37692q61132q31314p55930p59991p55932
13955B8793632p47551p21438p19186o65376o58216o58320o25693o09511o10439
13946B2777902n59636n28576n34004n09767m88406m68329m32792m37689m06929
13937A8411774l96186m20453m00242l72118l55482l52037l33221l22281k69436
$$ plain form
13928 15190318 14967973 14786212 14591766 14400281 14291866 14199582 14154443 14137590 14140918 14124388
13918 14124388 14176841 14225137 14226708 14149887 14004926 13827586 13624793 13415651 13126414 12805895
13908 12805895 12506862 12215429 11879498 11575499 11280353 11022951 10781910 10543518 10337760
13899 10337760 10160363 9978676 9806533 9643863 9478029 9326255 9214053 9102899 9043230
13890 9043230 9012265 9006043 9028800 9070599 9112751 9160166 9205770 9308887 9390959 9519284 9652933
13879 9652933 9697741 9662669 9595912 9463003 9268297 9049315 8810798 8512540 8222796 7920858
13869 7920858 7648674 7370532 7108499 6897355 6709458 6504949 6330188 6180294 6016917
13860 6016917 5854145 5696715 5589129 5457738 5313296 5167925 5003960 4873983 4746636
$$ packed form
13928A5190318k22345j81761j94446j91485j08415r2284m5139j6853L328j6530
13918A4124388N2453M8296J571p6821j44961j77340k02793k09142k89237l20519
13908A2805895k99033k91433l35931l03999k95146k57402k41041k38392k05758
13899A0337760j77397j81687j72143j62670j65834j51774j12202j11154n9669
13890I043230l0965o222K2757M1799M2152M7415M5604J03117Q2072J28325J33649
13879I652933M4808l5072o6757j32909j94706k18982k38517k98258k89744l01938
13869G920858k72184k78142k62033k11144j87897k04509j74761j49894j63377
13860F016917j62772j57430j07586j31391j44442j45371j63965j29977j27347
$$ plain form
13851 4746636 4635508 4553222 4439159 4337650 4282149 4216479 4087257 3974089 3876330 3771771
13841 3771771 3676453 3601947 3570109 3508056 3446928 3401279 3348064 3270784 3186509 3115123 3050029
13830 3050029 3024475 3015611 2972861 2931640 2858055 2775843 2716925 2691786 2618530 2580003 2531096
13819 2531096 2502603 2483255 2415665 2348427 2316835 2308223 2270825 2221513 2156285 2105276 2061460
13808 2061460 2013778 1986682 1973742 1933211 1884544 1860183 1847803 1811711 1777934 1736451 1727802
13797 1727802 1678332 1651077 1611614 1575085 1597048 1612857 1604845 1598193 1580686 1560798 1528654 1538211
13785 1538211 1506687 1439109 1419062 1438161 1429358 1407829 1389228 1378280 1344410 1306633 1287466
13774 1287466 1300084 1311642 1283283 1234588 1202462 1156419 1162338 1186923 1168817 1124310 1117434 1134866
$$ packed form
13851D746636j11128q2286j14063j01509n5501o5670j29222j13168r7759j04559
13841C771771r5318p4506l1838o2053o1128m5649n3215p7280q4275p1386o5094
13830C050029k5554q864m2750m1221p3585q2212n8918k5139p3256l8527m8907
13819B531096k8493j9348o7590o7238l1592q612l7398m9312o5228n1009m3816
13808B061460m7682k7096j2940m0531m8667k4361j2380l6092l3777m1483q649
13797A727802m9470k7255l9463l6529K1963J5809q012o652j7507j9888l2144R557
13785A538211l1524o7578k0047J9099q803k1529j8601j0948l3870l7777j9167
13774A287466J2618J1558k8359m8695l2126m6043N919K4585j8106m4507o876J7432
$$ plain form
13762 1134866 1144022 1156543 1157688 1120036 1113188 1086768 1085564 1069381 1036062 1030398 988332 946064
13750 946064 962654 980378 945709 960197 963554 916147 901792 901287 850412 827417 826037 821803
13738 821803 798076 800287 787234 782059 772532 796370 809191 794189 766867 781250 800320 751065
13726 751065 691223 654913 635920 631370 615776 578985 585275 600478 607728 611617 642743 632497
13714 632497 610676 605842 598870 595710 563734 510958 499107 466386 464833 418782 418071 453103 481259
13701 481259 464529 441427 443639 439059 432904 431209 431032 450155 427126 377217 366533 384292 401112
13688 401112 395227 385838 356902 357885 370308 358684 372763 354846 364139 417653 422493 418748 412746
13675 412746 377459 364035 358647 343912 330821 298368 267578 258833 268671 264669 262990 264073 281284
$$ packed form
13762A134866R156J2521J145l7652o848k6420j204j6183l3319n664m2066m2268
13750I46064J6590J7724l4669J4488L357m7407j4355n05n0875k2995j380m234
13738H21803k3727K211j3053n175r527K3838J2821j5002k7322J4383J9070m9255
13726G51065n9842l6310j8993m550j5594l6791O290J5203P250L889L1126j0246
13714F32497k1821m834o972l160l1976n2776j1851l2721j553m6051p11L5032K8156
13701D81259j6730k3102K212m580o155j695j77J9123k3029m9909j0684J7759J6820
13688D01112n885r389k8936R83J2423j1624J4079j7917R293N3514M840l745o002
13675D12746l5287j3424n388j4735j3091l2453l0790q745R838m002j679J083J7211
$$ plain form
13662 281284 288522 261240 258795 261393 242221 239335 285501 288068 251999 229112 230528 232003 218258
13649 218258 215120 202720 205745 228846 210664 245135 233728 215607 226362 244908 240374 247094
13637 247094 200055 159200 178426 167381 131223 108351 96037 119957 158538 182224 194647
13626 194647 201129 196689 164516 131268 124882 134118 150727 162359 172546 163217 148722 144053 129384
13613 129384 131027 140401 140589 148169 151593 151073 157203 166795 152096 189641 217830 210949 230612 268309
13599 268309 269712 257078 285917 319087 375878 470759 564608 640645 734225 842924 960264
13588 960264 1086580 1200310 1324374 1451913 1534937 1598787 1646458 1617971 1597021 1517987 1447552
13577 1447552 1348255 1268525 1181733 1133524 1075254 1001450 922087 864392 827820 818524 808564 798120
$$ packed form
13662B81284P238k7282k445K598j9172k886M6166K567l6069k2887J416J475j3745
13649B18258l138j2400L025K3101j8182L4471j1407j8121J0755J8546m534O720
13637B47094m7039m0855J9226j1045l6158k2872j2314K3920L8581K3686J2423
13626A94647O482m440l2173l3248o386R236J6609J1632J0187r329j4495m669j4669
13613A29384J643R374J88P580L424n20O130R592j4699L7545K8189o881J9663L7697
13599B68309J403j2634K8839L3170N6791R4881R3849P6037R3580J08699J17340
13588I60264J26316J13730J24064J27539Q3024O3850M7671k8487k0950p9034p0435
13577A447552r9297p9730q6792m8209n8270p3804p9363n7695l6572r296r960j0444
$$ plain form
13565 798120 783960 788358 798848 803275 825484 850206 882990 936105 1005156 1067488 1149948 1231023
13553 1231023 1292208 1393954 1531419 1625239 1715917 1784321 1791201 1800784 1771073 1691133 1567788
13542 1567788 1429078 1329553 1241615 1183138 1093381 910702 803475 750413 684504 641352 579748
13531 579748 569417 535390 478966 454337 407723 368839 343407 358682 370674 360064 338802
13520 338802 330242 334139 325458 330833 309327 274587 236761 203283 203070 179110 189824 210300 209650
13507 209650 210446 214463 214868 214182 198777 194280 206312 181645 151917 140373 158487 154844 175412
13494 175412 195922 183766 216550 223398 169090 144886 125033 109392 84836 111972 116778 119832
13482 119832 125297 143557 164142 157356 158717 156431 164397 173765 164252 137992 118344 91327 109555
$$ packed form
13565G98120j4160M398J0490M427K2209K4722L2784N3115O9051O2332Q2460Q1075
13553A231023O1185J01746J37465R3820R0678O8404O880R583k9711p9940j23345
13542A567788j38710r9525q7938n8477q9757j82679j07227n3062o5909m3152o1604
13531E79748j0331l4027n6424k4629m6614l8884k5432J5275J1992j0610k1262
13520C38802q560L897q681N375k1506l4740l7826l3478k13k3960J0714K0476o50
13507B09650P96M017M05o86j5405m497J2032k4667k9728j1544J8114l643K0568
13494A75412K0510j2156L2784O848n4308k4204j9853j5641k4556K7136M806L054
13482A19832N465J8260K0585o786J361k286P966R368r513k6260j9648k7017J8228
$$ plain form
13469 109555 152573 160402 139750 111628 120716 120106 120237 155559 155370 186263 179140 156692 139707
13456 139707 82124 50531 64977 104829 144184 135788 136533 101128 88152 73531 40804 55569
13444 55569 52266 41014 68281 109734 112280 131906 166089 160586 152461 137756 141419 129478 98725
13431 98725 92918 63025 45356 53646 8285 -21749 -14429 4546 27419 42077 26727 42463
13419 42463 75215 89823 80376 87089 65456 75933 98740 94887 61318 44050 27522 1186
13407 1186 -16650 -12518 7890 34295 44258 41269 59912 86305 73501 91344 114076 142944
13395 142944 115406 70343 80175 56377 16345 -30377 -28690 15150 3227 -28396 -12349 16197
13383 16197 66345 73079 76400 88569 102360 103526 75563 64160 70401 48634 23964 7612
$$ packed form
13469A09555M3018P829k0652k8122R088o10J31L5322j89L0893p123k2448j6985
13456A39707n7583l1593J4446L9852L9355q396P45l5405j2976j4621l2727J4765
13444E5569l303j1252K7267M1453K546J9626L4183n503q125j4705L663j1941l0753
13431I8725n807k9893j7669Q290m5361l0034P320J8975K2873J4658j5350J5736
13419D2463L2752J4608r447O713k1633J0477K2807l853l3569j7268j6528k6336
13407A186j7836M132K0408K6405R963k989J8643K6393j2804J7843K2732K8868
13395A42944k7538m5063R832k3798m0032m6722J687M3840j1923l1623J6047K8546
13383A6197N0148O734L321J2169J3791J166k7963j1403O241k1767k4670j6352
$$ plain form
13371 7612 -7470 -16567 -45163 -54704 -16776 -7911 -765 2554 15240 5643 30896 29800 34012
13358 34012 39011 -10948 19622 40288 53279 46918 32928 14346 21448 42362 58964 74600
13346 74600 76552 64521 47107 53480 39285 23507 36696 38578 30713 -16047 -41978 3338
13334 3338 25487 20177 44980 67240 57703 56037 10518 -16600 -9471 12064 42178 24093 25667
13321 25667 43952 63095 79038 73260 97483 84977 62094 47222 55302 101329 102567 90439
13309 90439 55190 15685 5028 25942 6934 18992 5488 11911 335 -34430 -7217 15684
13297 15684 -4529 -21188 -9368 -18828 -25477 -9051 5077 -2131 16676 63954 45916 39249
13285 39249 77108 98491 69782 39248 23338 25318 35358 28152 14258 -10164 -8625 8283
$$ packed form
13371G612j5082r097k8596r541L7928Q865P146L319J2686r597K5253j096M212
13358C4012M999m9959L0570K0666J2991o361j3990j8582P102K0914J6602J5636
13346G4600J952j2031j7414O373j4195j5778J3189J882p865m6760k5931M5316
13334C338K2149n310K4803K2260r537j666m5519k7118P129K1535L0114j8085J574
13321B5667J8285J9143J5943n778K4223j2506k2883j4872Q080M6027J238j2128
13309I0439l5249l9505j0657K0914j9008J2058j3504O423j1576l4765K7213K2901
13297A5684k0213j6659J1820r460o649J6426J4128p208J8807M7278j8038o667
13285C9249L7859K1383k8709l0534j5910J980J0040p206j3894k4422J539J6908
$$ plain form
13273 8283 5984 -21795 -30231 -18033 -2954 40416 79274 51449 17533 24854 23153 482 -9781
13260 -9781 -13951 -1957 6121 14862 44272 42789 41555 25668 -29270 -36421 -13291 21965 53799
13247 53799 39759 -22707 -19211 -10234 -22666 -8102 -13208 6825 -39028 -61177 -47672 -54262
13235 -54262 -27031 4739 21200 11138 3357 7329 9244 -3434 14524 30417 22558 32507 26330
13222 26330 12855 -2400 -7319 6171 46804 48754 28974 39869 7528 -18356 -434 -8198
13210 -8198 -26635 -30338 -22763 -6328 10714 14662 50867 -1173 -30368 -51516 -76512 -45016
13198 -45016 -59374 -50416 -20455 -19125 -41293 -51153 -80458 -67231 -42852 -35556 -26736 -12264 -62246
13185 -62246 -37847 -16507 -11894 -20961 7245 12677 1250 8288 -5213 -15760 -3916 -22214
$$ packed form
13273H283k299k7779q436J2198J5079M3370L8858k7825l3916P321j701k2671j0263
13260i781m170J1994Q078Q741K9410j483j234j5887n4938p151K3130L5256L1834
13247E3799j4040o2466L496Q977j2432J4564n106K0033m5853k2149J3505o590
13235e4262K7231L1770J6461j0062p781L972J915j2678J7958J5893p859R949o177
13222B6330j3475j5255m919J3490M0633J950j9780J0895l2341k5884J7922p764
13210h198j8437l703P575J6435J7042L948L6205n2040k9195k1148k4996L1496
13198d5016j4358Q958K9961J330k2168r860k9305J3227K4379P296Q820J4472m9982
13185f2246K4399K1340M613r067K8206N432j1427P038j3501j0547J1844j8298
$$ plain form
13173 -22214 -5469 8102 17291 29103 14164 19467 8748 4904 -2878 -16231 -13967 -6890 2568
13160 2568 -19730 -40598 -43125 -32212 -21926 -10965 -14779 -35599 -16616 -24695 -15901 17921 23193
13147 23193 25201 17465 14172 12173 9279 -15969 -633 7940 -4404 -386 12539 -2647 10967
13134 10967 27799 38079 50701 32622 8620 32630 38143 40192 22309 -271 19200 47892
13122 47892 57319 53118 42096 36813 -1220 10289 29714 38098 22662 27101 3066 5392 9793
13109 9793 6138 331 648 5416 -6550 -19073 -52854 -31792 -26488 -6123 12427 -806 8682
13096 8682 5080 11977 20906 812 1985 9382 7344 19583 26679 31346 43839 24622 -6402
13083 -6402 7849 -783 -13400 1778 4637 27641 19819 -871 -14704 -25282 -46808 -56109 -77747
$$ packed form
13173b2214J6745J3571R189J1812j4939N303j0719l844p782j3353K264P077R458
13160B568k2298k0868k527J0913J0286J0961l814k0820J8983q079Q794L3822N272
13147B3193K008p736l293j999k894k5248J5336Q573j2344M018J2925j5186J3614
13134A0967J6832J0280J2622j8079k4002K4010N513K049j7883k2580J9471K8692
13122D7892R427m201j1022n283l8033J1509J9425Q384j5436M439k4035K326M401
13109I793l655n807L17M768j1966j2523l3781K1062N304K0365J8550j3233R488
13096H682l602O897Q929k0094J173P397k038J2239P096M667J2493j9217l1024
13083f402J4251q632j2617J5178K859K3004p822k0690j3833j0578k1526r301k1638
$$ plain form
13070 -77747 -96561 -112698 -63715 -13408 10618 -2579 -28620 -74107 -60449 -20717 -14888 -24298
13058 -24298 -19881 6734 3290 -3431 -2584 12088 12114 9137 2346 -43242 -38585 -54031 -72369 -56668
13044 -56668 -32299 -48883 -66556 -33961 -57270 -53901 -33890 -19089 -41336 -67932 -85097 -92194
13032 -92194 -82068 -49669 -47926 -33424 12701 11964 -12167 -53512 -57366 -46616 -52216 -43994 -41605
13019 -41605 -38315 -68668 -55850 -43507 -58731 -43303 -28450 12877 41306 17191 37281 39759
13007 39759 40095 50750 18547 -11502 19303 16872 -17572 -44136 -50563 -41405 -26178 -15583 -4961
12994 -4961 -21718 -28669 -18469 -10599 -31221 -75628 -113051 -147695 -124823 -101535 -78982 -48469
12982 -48469 -28556 -19862 -5922 -32158 -45692 -26310 8458 9857 4502 20657 22977 3974
$$ packed form
13070g7747j8814j6137M8983N0307K4026j3197k6041m5487J3658L9732N829r410
13058b4298M417K6615l444o721Q47J4672K6k977o791m5588M657j5446j8338J5701
13044e6668K4369j6584j7673L2595k3309L369K0011J4801k2247k6596j7165p097
13032i2194J0126L2399J743J4502M6125p37k4131m1345l854J0750n600Q222K389
13019d1605L290l0353J2818J2343j5224J5428J4853M1327K8429k4115K0090K478
13007C9759L36J0655l2203l0049L0805k431l4444k6564o427R158J5227J0595J0622
12994d961j6757o951J0200P870k0622m4407l7423l4644K2872K3288K2553L0513
12982d8469J9913Q694J3940k6236j3534J9382L4768J399n355J6155K320j9003
$$ plain form
12970 3974 -21178 -30473 -51371 -62548 -53331 -37083 -34644 -38120 -62431 -46199 -45776 -5325 34635
12957 34635 33952 6336 -22797 -57379 -37735 -45079 -38202 -6645 -20470 -2350 46839 42790 16993
12944 16993 13576 5684 18418 -10281 -52241 -50445 -58584 -44524 -32616 -28007 -56867 -43140 -25026
12931 -25026 -2702 -38470 -72908 -55357 -20167 -35134 -14050 -399 25634 27409 29121 62882
12919 62882 42731 41921 79964 84628 73832 21525 -4127 4088 24097 29045 37464 10295 -4443
12906 -4443 -23693 -34800 -18700 -4303 -30989 -37492 -17159 17145 28217 39 -24360 -46628
12894 -46628 -65732 -33458 -38389 -40653 -52375 -72673 -56617 -32581 9159 18015 -6320 -5952 -23007
12881 -23007 -26798 -11889 17758 38962 47552 22934 -12986 -42269 -61355 -53767 -63933 -47359
$$ packed form
12970C974k5152r295k0898j1177R217J6248K439l476k4311J6232M23M0451L9960
12957C4635o83k7616k9133l4582J9644p344O877L1557j3825J8120M9189m049k5797
12944A6993l417p892J2734k8699m1960J796q139J4060J1908M609k8860J3727J8114
12931b5026K2324l5768l4438J7551L5190j4967K1084J3651K6033J775J712L3761
12919F2882k0151q10L8043M664j0796n2307k5652Q215K0009M948Q419k7169j4738
12906d443j9250j1107J6100J4397k6686o503K0333L4304J1072k8178k4399k2268
12894d6628j9104L2274m931k264j1722k0298J6056K4036M1740Q856k4335L68j7055
12881b3007l791J4909K9647K1204Q590k4618l5920k9283j9086P588j0166J6574
$$ plain form
12869 -47359 -40905 -28920 -35142 -47219 -36334 -31786 -48294 -23633 -12217 37405 29052 16119
12857 16119 -11591 -7704 3139 -7514 -26717 -31519 -30568 -9398 39355 62029 35653 43350 68542
12844 68542 105008 139124 168370 251514 297852 333429 346769 327083 192173 78945 44999
12833 44999 62071 33887 34959 57358 46894 22163 20589 36446 -4913 -29079 -43796 -57348
12821 -57348 -13182 764 -15237 -10464 -4997 15114 33517 27696 41164 39448 24591 -2055
12809 -2055 -5057 15864 -4913 -29 15477 14713 -19479 -38757 -33342 -9826 -2287 -25365 -5013
12796 -5013 -16107 -17271 2550 16676 171 3583 13476 -14018 8799 -1456 -596 23776 120168
12783 120168 236392 275471 294644 292777 211295 129726 52596 9818 32107 42980 15262
$$ packed form
12869d7359O454J1985o222j2077J0885M548j6508K4661J1416M9622q353j2933
12857A6119k7710L887J0843j0653j9203m802R51K1170M8753K2674k6376P697K5192
12844F8542L6466L4116K9246Q3144M6338L5577J3340j9686j34910j13228l3946
12833D4999J7072k8184J072K2399j0464k4731j574J5857m1359k4166j4717j3552
12821e7348M4166J3946j6001M773N467K0111J8403n821J3468j716j4857k6646
12809b055l002K0921k0777M884J5506p64l4192j9278N415K3516P539k3078K0352
12796e013j1094j164J9821J4126j6505L412R893k7494K2817j0255Q60K4372R6392
12783A20168J16224L9079J9173j867q1482q1569p7130m2778K2289J0873k7718
$$ plain form
12772 15262 -4310 12011 24258 30235 9254 10943 -13769 -5620 26397 14434 -30705 -51450
12760 -51450 -75219 -67742 -36794 1431 -10523 -15776 20872 18836 20697 19170 17656 30111 66555
12747 66555 59111 25236 46531 37498 12584 -9203 -17731 -28636 -20453 -13786 -17247 -44336 -41170
12734 -41170 -44948 -63257 -45438 -42535 -55824 -26895 -43001 -49575 -26221 -20054 10036 -23557
12722 -23557 -52556 -39168 -41526 -53843 -57638 -58776 -75946 -87200 -59897 -37692 -29215 -17896
12710 -17896 -55004 -65515 -57234 -47778 -39901 -3942 -4974 -17829 -56180 -69568 -73118 -45691 -34489
12697 -34489 -12788 4570 -18536 -26324 -25578 -44169 -67351 -95874 -105597 -36305 6558 -27371
12685 -27371 -91306 -74768 -66431 -47216 -18064 -50873 -73252 -51058 -38606 -61507 -63635 -36299
$$ packed form
12772A5262j9572J6321J2247N977k0981J689k4712Q149L2017j1963m5139k0745
12760e1450k3769P477L0948L8225j1954n253L6648k036J861j527j514J2455L6444
12747F6555p444l3875K1295r033k4914k1787q528j0905Q183O667l461k7089L166
12734d1170l778j8309J7819K903j3289K8929j6106o574K3354O167L0090l3593
12722b3557k8999J3388k358j2317l795j138j7170j1254K7303K2205Q477J1319
12710a7896l7108j0511Q281R456P877L5959j032j2855l8351j3388l550K7427J1202
12697c4489K1701J7358k3106p788P46j8591k3182k8523r723O9292M2863l3929
12685b7371o3935J6538Q337J9215K9152l2809k2379K2194J2452k2901k128K7336
$$ plain form
12673 -36299 -20625 -18758 -19300 1463 19907 -5380 -19765 -31907 -30590 -30045 -12169 3244 23107
12660 23107 226 -4799 -5765 -14690 -19087 -8961 -11081 -9427 -32780 -27956 9554 -3143 -18439
12647 -18439 -22693 13697 39387 13507 -29352 -28154 -44631 -20234 7020 -13037 -33441 -10171
12635 -10171 -6796 -21539 -40243 -28281 -28996 -50456 -69502 -55922 3175 37842 17271 230
12623 230 -1128 -19787 -34084 -20877 -1958 2138 2388 -18574 -45640 -51413 -48086 -36701 -33622
12610 -33622 -52190 -58540 -58133 -51079 -20788 4405 49525 38835 -5358 -2421 -14423 -39508 -48210
12597 -48210 -33098 -28275 -14598 15955 -7467 -36596 -41417 6780 32463 10373 15135 27961
12585 27961 28281 13059 -34708 -54205 -41909 -74327 -106611 -132744 -107632 -85342 -85634 -90154 -81580
$$ packed form
12673c6299J5674J867n42K0763J8444k5287j4385j2142J317N45J7876J5413J9863
12660B3107k2881n025r66q925m397J0126k120J654k3353M824L7510j2697j5296
12647a8439m254L6390K5690k5880m2859J198j6477K4397K7254k0057k0404K3270
12635a0171L375j4743j8704J1962p15k1460j9046J3580N9097L4667k0571j7041
12623B30j358j8659j4297J3207J8919M096K50k0962k7066n773L327J1385L079
12610c3622j8568o350M07P054L0291K5193M5120j0690m4193K937j2002k5085q702
12597d8210J5112M823J3677L0553k3422k9129m821M8197K5683k2090M762J2826
12585B7961L20j5222m7767j9497J2296l2418l2284k6133K5112K2290k92m520Q574
$$ plain form
12572 -81580 -64127 -82210 -61683 -62950 -82887 -82297 -55394 -39481 -26753 -46781 -63398 -30958
12560 -30958 -21365 20708 17145 -1361 -16822 -43555 -43901 -11542 38910 42244 21349 14832 8431
12547 8431 -3686 -2985 -19101 -17202 18787 8986 -4103 -6873 165 -5547 -188 5157 35999 19631
12533 19631 -23630 -23105 -16862 -3082 -15620 -32885 -40657 -46449 -5892 17884 11553 -17693 -49887
12520 -49887 -38721 2398 -21342 -36683 -18951 -4076 -15020 -19504 -20180 -32515 -36973 -33055 -33112
12507 -33112 -61269 -46139 1318 -607 -14191 -14151 -2858 7881 -10559 -25992 -48031 -59769
12495 -59769 -65105 -65613 -76588 -80154 -40856 -42737 -13775 27422 47637 40414 3400 -6548 -2805
12482 -2805 -2342 4855 -27725 -20552 14674 5050 -22236 -3717 -15689 -37660 -42370 -43370 -66472
$$ packed form
12572h1580J7453j8083K0527j267j9937N90K6903J5913J2728k0028j6617L2440
12560c0958R593M2073l563j8506j5461k6733l46L2359N0452L334k0895o517o401
12547H431j2117P01j6116J899L5989r801j3089k770P038n712N359N345L0842j6368
12533A9631m3261N25O243J3780j2538j7265p772n792M0557K3776o331k9246l2194
12520d9887J1166M1119k3740j5341J7732J4875j0944m484o76j2335m458L918n7
12507c3112k8157J5130M7457j925j3584M0J1293J0739j8440j5433k2039j1738
12495e9769n336n08j0975l566L9298j881K8962M1197K0215p223l7014r948L743
12482b805M63P197l2580P173L5226r624k7286J8519j1972k1971m710j000k3102
$$ plain form
12469 -66472 -54009 -36747 -53374 -66250 -61492 -67218 -57787 9503 17715 32031 -2754 -46140
12457 -46140 -46272 -36043 -36521 -25546 -26299 -86421 -98891 -97872 -95686 -56910 -26731 -40195 -57947
12444 -57947 -46579 -56090 -68906 -31870 24481 56498 42363 41430 18336 -7599 -3360 -5009 -12640
12431 -12640 -21200 -20696 -40195 -22698 -2647 -10274 -23459 -2802 16394 12753 40378 40604 29080
12418 29080 17992 6209 675 51843 72883 41121 19271 -8882 -12700 -20276 -27108 -27211 -13421
12405 -13421 -27415 -4818 10007 16865 26917 9215 -20856 -31115 -879 -10533 -4898 -7907
12393 -7907 14121 28939 25042 1794 -32435 -34831 -23710 -12280 -12369 -31096 -7213 13182 17464
12380 17464 34838 17106 46153 55521 51279 94683 107894 102402 50457 3107 -24259 -33957
$$ packed form
12469f6472J2463J7262j6627j2876M758n726R431O7290Q212J4316l4785m3386
12457d6140j32J0229m78J0975p53o0122j2470J019K186L8776L0179j3464j7752
12444e7947J1368r511j2816L7036N6351L2017j4135r33k3094k5935M239j649p631
12431a2640q560N04j9499J7497K0051p627j3185K0657J9196l641K7625K26j1524
12418B9080j1088j1783n534N1168K1040l1762k1850k8153l818p576o832j03J3790
12405a3421j3994K2597J4825O858J0052j7702l0071j0259L0236r654N635l009
12393g907K2028J4818l897k3248l4229k396J1121J1430q9j8727K3883K0395M282
12380A7464J7374j7732K9047R368m242M3404J3211n492n1945m7350k7366r698
$$ plain form
12368 -33957 -35782 -25219 -30873 -48677 -50537 -61509 -53005 -30809 -25669 -16971 -13864 -32537 -40413
12355 -40413 -53168 -40954 -46727 -43363 -39878 -39943 -47055 -35489 -15623 37952 33474 8649 -20283
12342 -20283 -35677 -24804 -22292 -29052 -9217 39771 33154 25120 23661 8273 -16071 26374 26880
12329 26880 8314 -2760 -8896 -24344 -43276 -35097 -10514 -6901 -30338 -37774 -26306 -1773
12317 -1773 8586 -5418 -2597 11268 43772 46284 4965 -16659 -14853 -36002 -63240 -87318
12305 -87318 -86238 -47262 -30905 -27416 -11295 -26732 -44674 -49780 -48637 -59693 -64325 -78520 -88044
12292 -88044 -18114 -9288 -45937 -42747 -4658 17252 11071 -18217 -28430 -51100 -38823 -41467
12280 -41467 -19314 -15139 -19249 -16413 -47884 -24599 -36992 -43053 -36339 -14674 5633 -13776 -39151
$$ packed form
12368c3957j825J0563n654j7804j860j0972Q504K2196N140Q698L107j8673p876
12355d0413j2755J2214n773L364L485o5p112J1566J9866N3575m478k4825k8932
12342b0283j5394J0873K512o760J9835M8988o617q034j459j5388k4344M2445N06
12329B6880j8566j1074o136j5448j8932Q179K4583L613k3437p436J1468K4533
12317a773J0359j4004K821J3865L2504K512m1319k1624J806k1149k7238k4078
12305h7318J080L8976J6357L489J6121j5437j7942n106J143j1056m632j4195r524
12292h8044O9930Q826l6649L190L8089K1910o181k9288j0213k2670J2277k644
12280d1467K2153M175m110K836l1471K3285j2393o061O714K1665K0307j9409k5375
$$ plain form
12267 -39151 -10287 -11180 -30889 -47328 -25518 -17149 -10714 -38991 -39405 -35817 -55812 -51343 -26032
12254 -26032 -13999 -27060 -23427 -20761 -685 9111 -4356 -11131 -9893 -5960 6577 42275 73460
12241 73460 63068 33620 4113 -24187 2248 29582 10096 4605 -25309 -50743 -76500 -85328
12229 -85328 -76046 -45397 -26492 -8969 -1649 12341 121 -14967 -6639 -33392 -27900 -14309
12217 -14309 -1834 -10549 -21915 15562 46645 -187 -42857 -46361 -29201 -51007 -40332 -28626
12205 -28626 -3018 9921 6216 15029 1719 -27028 -30989 -17962 -26169 2858 31689 -3609
12193 -3609 -34538 19651 27610 4738 -71532 -92359 -75440 -94209 -93695 -88585 -84629 -88382 -46998
12180 -46998 -30264 -58363 -42323 7324 12703 -14500 -40351 -63086 -40649 -58795 -61284 -53302
$$ packed form
12267c9151K8864q93j9709j6439K1810Q369O435k8277m14L588j9995M469K5311
12254b6032J2033j3061L633K666K0076R796j3467o775J238L933J2537L5698L1185
12241G3460j0392k9448k9507k8300K6435K7334j9486n491k9914k5434k5757q828
12229h5328R282L0649J8905J7523P320J3990j2220j5088Q328k6753N492J3591
12217a4309J2475q715j1366L7477L1083m6832m2670l504J7160k1806J0675J1706
12205b8626K5608J2939l705Q813j3310k8747l961J3027q207K9027K8831l5298
12193c609l0929N4189P959k2872p6270k0827J6919j8769N14N110L956l753M1384
12180d6998J6734k8099J6040M9647N379k7203k5851k2735K2437j8146k489P982
$$ plain form
12168 -53302 -12400 32843 27252 16799 -7086 -17893 -1841 -2328 -23882 -7384 233 -14097
12156 -14097 -3257 -3246 4704 -37809 -60022 -79706 -90342 -38790 -39275 -11368 -13860 -26068 -14246
12143 -14246 -29484 -28081 -23309 -16646 2278 -7476 -8384 -11 9904 14659 25209 22044 33588 41000
12129 41000 20017 -10999 -42744 -33553 -31097 -17116 -26947 -27348 -28414 -33114 -8488 12746 -18163
12116 -18163 -55075 -32265 -13277 -11044 -46015 -45501 -73483 -35816 -26890 -38979 -49181 -46433 -33092
12103 -33092 437 -22270 -37871 -23445 -2749 26379 7582 -23338 -19719 8794 -362 -489
12091 -489 13469 23260 5421 -13159 -49278 -56378 -56900 -69502 -32826 -31985 -4734 -19862 -10492
12078 -10492 -31884 -50697 -20346 15190 1857 -17560 -10991 -32266 -57286 -61506 -75069 -63978
$$ packed form
12168e3302M0902M5243n591j0453k3885j0807J6052m87k1554J6498P617j4330
12156a4097J0840J1P950m2513k2213j9684j0636N1552m85K7907k492j2208J1822
12143a4246j5238J403M772O663J8924r754r08Q373R915M755J0550l165J1544P412
12129D1000k0983l1016l1745R191K456J3981r831m01j066m700K4626K1234l0909
12116a8163l6912K2810J8988K233l4971N14k7982L7667Q926j2089j0202K748J3341
12103c3092L3529k2707j5601J4426K0696K9128j8797l0920L619K8513r156j27
12091d89J3958R791j7839j8580l6119p100n22j2602L6676Q41K7251j5128R370
12078a0492k1392j8813L0351L5536j3333j9417O569k1275k5020m220j3563J1091
$$ plain form
12066 -63978 -60523 -25642 -1835 -9007 -17085 -2173 1563 -20415 8184 9924 -4671 -27848 -39852
12053 -39852 -44678 -3885 5327 6463 -5363 -22381 -40412 -36478 -50098 -47981 -47150 -26938 -33333
12040 -33333 -15217 -5846 11521 -3553 -32091 -29096 -68572 -64012 -32158 -10976 -15339 -14207 -27517
12027 -27517 -50350 -45180 -26893 -6003 37726 14280 -1490 -549 -6513 -30793 -36491 -90499 -70128
12014 -70128 -75166 -43467 -28143 -50540 -55634 -5782 8022 7195 -11094 -17438 -12292 -10280 -43185
12001 -43185 -54845 -17851 -6604 8354 52468 15959 -4945 7627 -25474 -35230 -7810 810
11989 810 -19888 -14983 -18530 -31170 -70271 -62689 -39563 -54269 -65977 -46387 -43134 -29961 -2831
11976 -2831 10268 23555 4587 -16957 11313 -24247 -80523 -84377 -62394 -61278 -59415 -69637
$$ packed form
12066f3978L455L4881K3807p172q078J4912L736k1978K8599J740j4595k3177j2004
12053c9852m826M0793R212J136j1826j7018j8031L934j3620K117Q31K0212o395
12040c3333J8116R371J7367j5074k8538K995l9476M560L1854K1182m363J132j3310
12027b7517k2833N170J8287K0890M3729k3446j5770R41n964k4280n698n4008K0371
12014g0128n038L1699J5324k2397n094M9852J3804q27j8289o344N146K012l2905
12001d3185j1660L6994J1247J4958M4114l6509k0904J2572l3101r756K7420Q620
11989H10k0698M905l547j2640l9101P582K3126j4706j1708J9590L253J3173K7130
11976b831J3099J3287j8968k1544K8270l5560n6276l854K1983J116J863j0222
$$ plain form
11964 -69637 -77044 -47228 -45307 -66528 -50715 -51422 -52732 -18893 -15020 -9791 -29616 -44561 -38871
11951 -38871 -63156 -80828 -99101 -74853 -27512 -26679 -67964 -57430 -32945 -68658 -58394 -24835
11939 -24835 -41315 -50379 -62637 -59538 -26758 -37678 -64290 -62900 10861 39607 5124 -21206
11927 -21206 -55989 -33594 -37144 -23835 9502 53487 127679 179594 172955 195778 243238 200315
11915 200315 137664 61835 8882 -7747 -21668 -23554 -34927 -32517 -10411 12891 18624 -1570
11903 -1570 -11897 -8036 -28710 -19312 32178 47856 32029 17404 -2407 -6345 -23959 -33699 -58682
11890 -58682 -61432 -36675 -64438 -49452 -2867 3254 -16083 -10091 -21386 -28059 -25703 4477 -10306
11877 -10306 -11040 21862 27938 -9644 -17849 8774 -1108 -14880 -18296 1763 -7202 3339 8746
$$ packed form
11964f9637p407K9816J921k1221J5813p07j310L3839L873N229j9825j4945N690
11951c8871k4285j7672j8273K4248M7341Q33m1285J0534K4485l5713J0264L3559
11939b4835j6480r064j2258L099L2780j0920k6612J390P3761K8746l4483k6330
11927b1206l4783K2395l550J3309L3337M3985P4192N1915o639K2823M7460m2923
11915B00315o2651p5829n2953j6629j3921j886j1373K410K2106K3302N733k0194
11903a570j0327L861k0674R398N1490J5678j5827j4625j9811l938j7614r740k4983
11890e8682k750K4757k7763J4986M6585O121j9337N992j1295o673K356L0180j4783
11877a0306p34L2902O076l7582q205K6623r882j3772l416K0059q965J0541N407
$$ plain form
11864 8746 -13844 -15404 6096 -34021 -39311 -21462 -24346 -46399 -11259 -4597 -10185 573 9695
11851 9695 7904 -2035 14975 24045 4631 6673 12764 -2974 -23966 -4207 3236 -18899 -59058
11838 -59058 -69652 -62523 -67938 -56859 -83900 -82338 -81911 -79532 -68277 -64775 -75646 -37893 -33708
11825 -33708 -23889 -31817 -14445 -14127 3605 5575 -14316 -25034 -42529 -34003 -3419 -15946 12022
11812 12022 11089 -9657 -22399 -43975 -38875 -11096 -13118 -40894 -57817 -63278 -33958 -15281 -8937
11799 -8937 -31291 -61840 -92598 -100780 -56475 -56060 -55614 -23222 -13012 -30240 -49428 -21759 25675
11786 25675 40031 29118 20790 14683 29508 8251 -9475 -21154 6057 602 -23915 -16571
11774 -16571 12743 4127 -23572 -33259 -77510 -87163 -63153 -54240 -44965 -62929 -56639 -35228 -30656
$$ packed form
11864H746k2590j560K1500m0117n290J7849k884k2053L5140O662n588J0758R122
11851I695j791r939J7010R070j9414K042O091j5738k0992J9759P443k2135m0159
11838e9058j0594P129n415J1079k7041J562M27K379J1255L502j0871L7753M185
11825c3708R819p928J7372L18J7732J970j9891j0718j7495Q526L0584j2527K7968
11812A2022r33k0746j2742k1576N100K7779k022k7776j6923n461K9320J8677O344
11799h937k2354l0549l0758q182M4305M15M46L2392J0210j7228j9188K7669M7434
11786B5675J4356j0913q328o107J4825k1257j7726j1679K7211n455k4517P344
11774a6571K9314q616k7699r687m4251r653K4010Q913R275j7964O290K1411M572
$$ plain form
11761 -30656 -29632 15647 27555 12670 -44242 -48988 -27435 -36031 -32113 -20642 -9493 2331
11749 2331 12107 -22609 -55101 -34189 -24455 -21313 -27060 -33332 -46545 -48409 -61674 -64902 -21228
11736 -21228 -13320 -37626 -35253 -2907 -36840 -49666 -40570 -21502 -24433 -50189 -20591 -33056
11724 -33056 -19883 21565 2464 -39718 -67713 -50657 -15682 -4893 5119 178 8963 7769
11712 7769 9722 -8956 -1510 -29184 -67928 -51958 -39611 -38722 -31884 -36150 -28314 -21576 -43987
11699 -43987 -30669 -13948 21814 14942 -4994 -15381 -43790 -69320 -64963 -66336 -32352 -3983
11687 -3983 -16817 8614 16550 1653 -33846 -53313 -66040 -57168 -60782 -38401 -29785 -45554 -21169
11674 -21169 7318 -3345 -52320 -45458 -23769 -40281 -53016 -47285 -43353 -43282 -51918 -7799 36639
$$ packed form
11761c0656J024M5279J1908j4885n6912m746K1553q596L918J1471J1149J1824
11749B331R776l4716l2492K0912R734L142n747o272j3213j864j3265l228M3674
11736b1228P908k4306K373L2346l3933j2826R096J9068k931k5756K9598j2465
11724c3056J3173M1448j9101m2182k7995J7056L4975J0789J0012m941Q785j194
11712G769J953j8678P446k7674l8744J5970J2347Q89O838m266P836O738k2411
11699d3987J3318J6721L5762o872j9936j0387k8409k5530M357j373L3984K8369
11687c983j2834K5431P936j4897l5499j9467j2727Q872l614K2381Q616j5769K4385
11674b1169K8487j0663m8975O862K1689j6512j2735N731L932P1q636M4119M4438
$$ plain form
11661 36639 35025 -14663 -44220 -16910 -16564 -7738 -26107 -34044 -10637 -7836 6394 29972 -10441
11648 -10441 -37885 -54313 -44207 -10315 15105 -5600 13408 32205 23264 -21453 -9983 -26075
11636 -26075 -38381 -23158 -19708 -11386 -22589 -18041 -17188 -9218 1751 23194 48235 45938 49585
11623 49585 40838 11697 19172 6582 28177 17068 2191 28596 10674 28617 44929 44766
11611 44766 20193 28743 60011 75068 71120 89454 91760 105480 161300 159260 158592 185044 177047
11598 177047 159480 170578 166139 178012 207461 195573 198212 211301 207316 195562 198664 194391
11586 194391 174790 163122 161687 170096 190410 219184 217513 193029 224838 232178 205237 184093
11574 184093 195357 230225 242470 262064 280079 282535 287688 277147 288542 319424 295439 241596
$$ packed form
11661C6639j614m9688k9557K7310L46Q826j8369p937K3407K801J4230K3578m0413
11648a0441k7444j6428J0106L3892K5420k0705J9008J8797q941m4717J1470j6092
11636b6075j2306J5223L450Q322j1203M548Q53P970J0969K1443K5041k297L647
11623D9585q747k9141P475j2590K1595j1109j4877K6405j7922J7943J6312j63
11611D4766k4573Q550L1268J5057l948J8334K306J3720N5820k040o68K6452p997
11598A77047j7567J1098m439J1873K9449j1888K639J3089l985j1754L102m273
11586A94391j9601j1668j435Q409K0314K8774j671k4484L1809P340k6941k1144
11574A84093J1264L4868J2245J9594J8015K456N153j0541J1395L0882k3985n3843
$$ plain form
11562 241596 203200 182899 159732 180549 203100 179292 177645 174024 182235 146921 112256 74295
11550 74295 110052 100844 92506 54030 40327 67831 77640 80556 56350 22363 30396 41675 35601
11537 35601 79646 93267 65645 31110 3136 1516 22295 34399 28843 40683 66879 49584
11525 49584 7291 -4983 -29335 -29711 -39521 -40597 -26880 -9166 -30954 -18969 13571 -3447
11513 -3447 -17138 -21576 -44907 -50465 -35969 -17820 -11391 12004 9132 21454 4799 22983 38055
11500 38055 36070 45643 36119 14156 18341 9544 47866 47760 40012 38680 45052 50141 46448 55402
11486 55402 31081 10667 27047 34219 62751 60253 30940 20505 22724 30122 54054 111491
11474 111491 96287 76603 59347 25668 7601 -12760 -25555 12092 62287 51788 16263
$$ packed form
11562B41596l8396k0301k3167K0817K2551k3808j647l621Q211l5314l4665l7961
11550G4295L5757r208q338l8476j3703K7504R809K916k4206l3987Q033J1279o074
11537C5601M4045J3621k7622l4535k7974j620K0779J2104n556J1840K6196j7295
11525D9584m2293j2274k4352l76r810j076J3717J7714k1788J1985L2540j7018
11513c447j3691m438k3331n558J4496J8149O429K3395k872J2322j6655J8184J5072
11500C8055j985R573r524k1963M185q797L8322j06p748j332O372N089l693Q954
11486E5402k4321k0414J6380P172K8532k498k9313j0435K219P398K3932N7437
11474A11491j5204j9684j7256l3679j8067k0361j2795L7647N0195j0499l5525
$$ plain form
11463 16263 10627 17021 14458 6131 21108 52303 42979 68854 57479 31369 37031 48483 58238
11450 58238 22736 -37244 -48058 -15621 3068 -193 -14479 2262 37941 47968 21634 -4895
11438 -4895 -15257 -21450 -14036 -11673 -25854 -58099 -57529 -42758 -13851 12847 -29639 -75573 -57557
11425 -57557 -32432 -24741 -26289 -21030 8152 9225 12674 -12524 -10590 -14179 -10698 -2403 33317
11412 33317 44711 10782 32193 37313 5675 8960 9922 4871 -8767 -18979 3637 4018 17585
11399 17585 3027 -21486 -15229 -17866 -59022 -64273 -41427 -36978 -42445 -66022 -72190 -28062 17087
11386 17087 37271 34270 -738 -1377 -5018 -10259 -23909 -40915 -38829 -43437 -47394 -54341 -46869 -49693
11372 -49693 -50057 -54291 -70451 -45677 -3333 -36945 -49103 -21660 -18530 -31165 -42432 -47347 -41821
$$ packed form
11463A6263n636O394k563q327J4977L1195r324K5875j1375k6110N662J1452R755
11450E8238l5502n9980j0814L2437J8689l261j4286J6741L5679J0027k6334k6529
11438d895j0362o193P414K363j4181l2245N70J4771K8907K6698m2486m5934J8016
11425e7557K5125P691j548N259K9182J073L449k5198J934l589L481Q295L5720
11412C3317J1394l3929K1411N120l1638L285R62n051j3638j0212K2616L81J3567
11399A7585j4558k4513O257k637m1156n251K2846M449n467k3577o168M4128M5149
11386A7087K0184l001l5008o39l641n241j3650j7006K086m608l957o947P472k824
11372d9693l64m234j6160K4774M2344l3612j2158K7443L130j2635j1267m915N526
$$ plain form
11359 -41821 -73155 -73443 -55759 -39881 -49279 -44026 -9368 -3922 -7224 -24736 -39806 -45320 -49155
11346 -49155 -42504 -57856 -49113 -43677 -4004 10873 5895 -26662 -13124 2166 -25289 -32351 -29769
11333 -29769 -12644 -31068 -14016 -5591 -18669 -38212 -37787 -57206 -67821 -69128 -47643 -53237 -43041
11320 -43041 -24878 -7893 -8005 -12270 -8548 -1001 -40197 -31505 -9100 -22535 -35279 -22443 -53626
11307 -53626 -67793 -24424 -18158 -61074 -67685 -52771 -43686 -20040 23637 24418 21905 10845 -2633
11294 -2633 -8136 8306 56438 52460 51083 48086 -2617 -18918 -27737 -35972 -48331 -45770 -59646
11281 -59646 -23533 -118 -22552 -48892 -44328 -53630 -70455 -62203 -45296 -41411 -22181 -48604
11269 -48604 -64598 -34410 -14083 -31739 -38268 -33010 -16112 9785 -11699 -45424 -47695 -34938
$$ packed form
11359d1821l1334k88J7684J5878r398N253L4658N446l302j7512j5070n514l835
11346d9155O651j5352Q743N436L9673J4877m978l2557J3538J5290k7455p062K582
11333b9769J7125j8424J7052Q425j3078j9543M25j9419j0615j307K1485n594J0196
11320d3041J8163J6985j12m265L722P547l9196Q692K2405j3435j2744J2836l1183
11307e3626j4167M3369O266m2916o611J4914R085K3646M3677P81k513j1060j3478
11294b633n503J6442M8132l978j377k997n0703j6301q819q235j2359K561j3876
11281e9646L6113K3415k2434k6340M564r302j6825Q252J6907L885J9230k6423
11269d8604j5994L0188K0327j7656o529N258J6898K5897k1484l3725k271J2757
$$ plain form
11257 -34938 -28445 -36023 -50558 -45285 -37825 -11471 884 -27465 -35669 -40538 -32677 -44941 -79709
11244 -79709 -87885 -63351 -35470 -7049 11771 -6341 -41210 -47078 -40207 -1773 -24767 -29727
11232 -29727 -36846 -60639 -33212 -37393 -51037 -40758 -62437 -46606 -25137 -17038 -35476 -51016
11220 -51016 -42790 -29924 -29673 -16824 -28990 -47121 -44767 -35778 -31656 -72638 -64493 -19789 7485
11207 7485 -25150 -39058 -9973 -12642 -14596 -22179 -16306 1480 -4100 -7450 -38919 -49712 -46533
11194 -46533 -35003 -8382 -13892 -16154 4917 29147 31453 20737 -7764 -24523 -30116 -14551
11182 -14551 -523 -8346 -26626 -26676 -44990 -65712 -64805 430 9476 -43474 -48730 -38038 16638
11169 16638 68943 51043 8928 -37563 -59432 -50173 -11471 -25371 -19171 -6544 7247 37457
$$ packed form
11257c4938O493p578j4535N273P460K6354J2355k8349q204m869P861j2264l4768
11244g9709q176K4534K7881K8421J8820j8112l4869n868O871L8434k2994m960
11232b9727p119k3793K7427m181j3644J0279k1679J5831K1469Q099j8438j5540
11220e1016Q226J2866K51J2849j2166j8131K354Q989M122m0982Q145M4704K7274
11207G485l2635j3908K9085k669j954p583N873J7786n580l350l1469j0793L179
11194d6533J1530K6621n510k262K1071K4230K306j0716k8501j6759n593J5565
11182a4551J4028p823j8280n0j8314k0722R07O5235R046n2950n256J0692N4676
11169A6638N2305j7900m2115m6491k1869R259L8702j3900O200J2627J3791L0210
$$ plain form
11157 37457 45079 36737 -8609 -63264 -81999 -54431 -60320 -43658 -29311 -47160 -86586 -82226
11145 -82226 -26995 -4610 -15370 -47057 -46883 -16872 -37152 -39493 -30751 -24685 -18369 -12956 11327
11132 11327 6034 8744 -15108 -31308 -16805 -12165 -11421 -13408 -41234 -68485 -62170 -59066 -44598
11119 -44598 -30031 98 38447 40590 42089 34610 44911 37377 37069 30467 6622 2491 -11562
11106 -11562 -18493 -29928 -57369 -67660 -51015 -27402 -44116 -38998 -29249 -36731 -56438 -57998 -36396
11093 -36396 -22133 -21596 -21884 1957 -12967 -21081 -23129 -35038 -31629 -15507 -15379 -39210 -52418
11080 -52418 -30528 27429 32156 -22306 -44183 -41921 -25986 -35785 -17227 13053 20052 -382
11068 -382 -19252 10106 12577 7927 12789 -6242 8821 22578 16673 -29773 -7351 9667 48324
$$ packed form
11157C7457P622q342m5346n4655j8735K7568n889J6662J4347j7849l9426M360
11145h2226N5231K2385j0760l1687J74L0011k0280k341Q742O066O316N413K4283
11132A1327n293K710k3852j6200J4503M640P44j987k7826k7251O315L104J4468
11119d4598J4567L0129L8349K143J499p479J0301p534l08o602k3845m131j4053
11106a1562o931j1435k7441j0291J6645K3613j6714N118R749p482j9707j560K1602
11093c6396J4263N37k88K3841j4924q114k048j1909L409J6122J28k3831j3208
11080e2418K1890N7957M727n4462k1877K262J5935r799J8558L0280O999k0434
11068c82j8870K9358K471m650M862j9031J5063J3757n905m6446K2422J7018L8657
$$ plain form
11055 48324 71457 68502 53791 10559 -12804 -20254 -9569 -15018 -32750 -29564 -39890 -40046 -32431
11042 -32431 951 18916 45148 22056 -17511 -27141 -49157 -60703 -54512 -53188 -53153 -64440 -33182
11029 -33182 -19130 -19393 -8571 -8952 -16287 -17320 -30137 12271 28407 1492 -13142 2165 -13906
11016 -13906 -26024 -41208 -58510 -11843 -22466 -38874 -37431 -18648 2267 29539 29456 20453 10733
11003 10733 13098 19445 6842 8408 14001 38483 51497 7164 -6566 -35542 -48218 -23848
10991 -23848 -37456 -61583 -33587 36933 37202 24224 40717 48548 33785 -13025 -3638 8203
10979 8203 12675 40918 39359 16125 -17504 -23350 12132 5799 3790 42608 62471 64027 54005
10966 54005 28183 31143 46872 62064 42137 -1021 -5593 -32449 -44802 -40252 -34356 -2123
$$ packed form
11055D8324K3133k955j4711m3232k3363p450J0685n449j7732L186j0326j56P615
11042c2431L3382J7965K6232k3092l9567r630k2016j1546O191J324L5j1287L1258
11029c3182J4052k63J0822l81p335j033j2817M2408J6136k6915j4634J5307j6071
11016a3906j2118j5184j7302M6667j0623j6408J443J8783K0915K7272q3r003r720
11003A0733K365O347j2603J566N593K4482J3014m4333j3730k8976j2676K4370
10991b3848j3608k4127K7996P0520K69j2978J6493P831j4763m6810R387J1841
10979H203M472K8243j559k3234l3629n846L5482o333k009L8818J9863J556j0022
10966E4005k5822K960J5729J5192j9927m3158m572k6856j2353M550N896L2233
$$ plain form
10954 -2123 12953 8864 -21517 -67285 -40543 -27741 -44079 -22990 -18428 -24897 -39712 -45644 -53424
10941 -53424 -38957 -20240 11686 20707 15890 -18182 -34042 -8708 19992 8301 -22476 -15662
10929 -15662 -1208 13582 27516 47282 23736 20250 30732 35966 26836 59371 41462 -25870
10917 -25870 -36146 -28142 -62877 -60552 -51995 -23507 -15656 -13314 20843 54397 52934 24325 4178
10904 4178 47220 105399 98834 73786 58943 20434 29416 59951 55414 48514 59112 86314 65856
10891 65856 51728 29903 3387 34135 71064 74664 80558 45098 38928 36735 60159 54829 32077
10878 32077 9696 10945 7408 -14275 -53876 -42638 -12110 12078 35167 38101 51916 47140
10866 47140 34161 11068 16002 49315 40222 6367 -11337 -12156 -18806 -17342 9721 14086 -2542
$$ packed form
10954b123J5076m089l0381m5768K6742J2802j6338K1089M562o469j4815n932p780
10941e3424J4467J8717L1926R021m817l4072j5860K5334K8700j1691l0777O814
10929a5662J4454J4790J3934J9766k3546l486J0482N234r130L2535j7909o7332
10917b5870j0276Q004l4735K325Q557K8488P851K342L4157L3554j463k8609k0147
10904D178M3042N8179o565k5048j4843l8509Q982L0535m537o900J0598K7202k0458
10891F5856j4128k1825k6516L0748L6929L600N894l5460o170k193K3424n330k2752
10878C2077k2381J249l537k1683l9601J1238L0528K4188K3089K934J3815m776
10866D7140j2979k3093M934L3313r093l3855j7704q19o650J464K7063M365j6628
$$ plain form
10853 -2542 -47795 -72754 -48113 -3821 21153 2764 -18592 -28828 -25105 -40356 -11542 -25991
10841 -25991 -11948 11806 47095 33157 33619 30710 54660 43738 -17509 -51017 -31997 20133
10829 20133 76878 61419 69120 83604 117342 65522 30941 13844 -2901 6393 -10892 -37480
10817 -37480 -28208 28555 72768 29021 21530 34458 25846 -4538 -9595 -34557 1625 14107
10805 14107 -751 3847 39755 35729 30642 51151 43187 30397 52300 75402 66805 51178 49444
10792 49444 62685 68751 41126 34476 22026 -20857 -21885 -12635 4490 16926 53047 32319
10780 32319 22289 36590 41495 10120 -18451 -15523 27988 47132 58259 52117 39730 29600
10768 29600 10951 6072 36463 63414 51175 21870 15854 1659 37986 52425 57335 53143
$$ packed form
10853b542m5253k4959K4641M4292K4974j8389k1356j0236L723j5251K8814j4449
10841b5991J4043K3754L5289j3938M62k909K3950j0922o1247l3508J9020N2130
10829B0133N6745j5459P701J4484L3738n1820l4581j7097j6745R294j7285k6588
10817c7480R272N6763M4213m3747p491J2928q612l0384n057k4962L6182J2482
10805A4107j4858M598L5908m026n087K0509p964j2790K1903K3102q597j5627j734
10792D9444J3241O066k7625o650j2450m2883j028R250J7125J2436L6121k0728
10780C2319j0030J4301M905l1375k8571K928M3511J9144J1127o142j2387j0130
10768B9600j8649m879L0391K6951j2239k9305o016j4195L6327J4439M910m192
$$ plain form
10756 53143 32933 40534 39402 19635 27154 33648 20072 28499 60056 84955 78148 52797 55727
10743 55727 49634 42266 48885 39217 22975 20975 -10601 -6113 -38151 -48697 -31815 -2763 -11226
10730 -11226 -906 -5533 -11668 10144 25656 22543 14498 -7373 -2497 35258 57609 5935 8496
10717 8496 -9825 -6303 1326 9243 2103 2891 17077 24748 44637 27707 13800 19009 25400 61715
10703 61715 68706 43445 31394 37067 31005 47303 43535 56445 79306 95066 85388 54659 47153
10690 47153 53308 55319 49882 -11057 -42553 -51061 -28862 -24759 -6594 20752 8744 57946 47575
10677 47575 15191 7650 30596 53790 36372 2937 1223 10038 25515 -92 16196 49251
10665 49251 25449 33965 41032 43269 37124 17972 14460 23417 22297 11639 28293 44879 39293
$$ packed form
10756E3143k0210P601j132j9767P519O494j3576Q427L1557K4899o807k5351K930
10743E5727o093p368O619r668j6242k000l1576M488l2038j0546J6882K9052q463
10730a1226J0320m627o135K1812J5512l113q045k1871M876L7755K2351n1674K561
10717H496j8321L522P629P917p140P88J4186P671J9889j6930j3907N209O391L6315
10703F1715O991k5261j2051N673o062J6298l768J2910K2861J5760r678l0729p506
10690D7153O155K011n437o0939l1496q508K2199M103J8165K7346j2008M9202j0371
10677D7575l2384p541K2946K3194j7418l3435j714Q815J5477k5607J6288L3055
10665D9251k3802Q516P067K237o145j9152l512Q957j120j0658J6654J6586n586
$$ plain form
10652 39293 62454 52159 -10806 -50144 -43690 -20336 43285 42918 28626 -3332 -7543 7304
10640 7304 27899 20421 34411 47247 7186 -11258 -15522 -24350 -18282 27166 57497 51749 56855
10627 56855 36406 40574 33357 39069 45060 32789 7321 5965 11531 12539 8974 -26936 -23930
10614 -23930 11006 25630 -2041 11360 28084 35809 30155 22195 26246 24978 28106 30936 13289
10601 13289 -7182 -10391 7410 15462 -10447 -25040 -10692 -4456 48636 84756 59370 10301
10589 10301 -22345 -840 30757 42121 37323 44630 57496 84909 78776 57461 71112 54506
10577 54506 24792 -417 -11729 14687 37789 60208 115701 120262 93236 76710 87180 121083
10565 121083 101805 72542 32087 19380 43421 62788 66331 65411 61398 38860 64330 70345
$$ packed form
10652C9293K3161j0295o2965l9338O454K3354O3621l67j4292l1958m211J4847
10640G304K0595p478J3990J2836m0061j8444m264q828O068M5448L0331n748N106
10627E6855k0449M168p217N712N991j2271k5468j356N566J008l565l5910L006
10614b3930L4936J4624k7671J3401J6724P725n654p960M051j268L128K830j7647
10601A3289k0471l209J7801Q052k5909j4593J4348O236N3092L6120k5386m9069
10589A0301l2646K1505L1597J1364m798P307J2866K7413o133k1315J3651j6606
10577E4506k9714k5209j1312K6416K3102K2419N5493M561k7026j6526J0470L3903
10565A21083j9278k9263m0455j2707K4041J9367L543r20m013k2538K5470O015
$$ plain form
10553 70345 83187 81427 97428 113559 94027 85928 103052 112174 87929 75142 62132 67999
10541 67999 79312 90617 92547 103477 141872 136471 158257 143113 119078 106622 87277 80658
10529 80658 78617 64999 80352 92190 68906 66662 67074 75987 81810 93069 105176 124552 146255
10516 146255 171901 155922 168972 172615 185821 179901 179468 154499 178203 192126 183438 180503 172781
10503 172781 159071 171754 172275 163579 191012 214150 185086 169862 159250 139818 135420 137331
10491 137331 200648 222816 235747 254572 254226 265679 297080 323547 358969 363245 393282 414258
10479 414258 453070 464353 505028 498713 486666 476408 474274 439428 438623 380979 338844 325859
10467 325859 323200 315685 299080 277060 271184 260905 233104 232323 275593 291939 307125 317436
$$ packed form
10553G0345J2842j760J6001J6131j9532q099J7124R122k4245j2787j3010N867
10541F7999J1313J1305J930J0930L8395n401K1786j5144k4035j2456j9345o619
10529H0658k041j3618J5353J1838k3284k244M12Q913N823J1259J2107J9376K1703
10516A46255K5646j5979J3050L643J3206n920m33k4969K3704J3923q688k935p722
10503A72781j3710J2683N21q696K7433K3138k9064j5224j0612j9432m398J911
10491A37331O3317K2168J2931J8825l46J1453L1401K6467L5422M276L0037K0976
10479D14258L8812J1283M0675o315j2047j0258k134l4846q05n7644m2135j2985
10467C25859k659p515j6605k2020n876j0279k7801p81M3270J6346J5186J0311
$$ plain form
10455 317436 310328 329031 337756 322882 351836 423301 496114 567707 605167 632597 666039 760086
10443 760086 906883 1096053 1328195 1583506 1864884 2177690 2420833 2593925 2708368 2722337
10433 2722337 2711792 2716895 2717470 2762591 2851607 2914947 2944274 2920952 2813938 2677753 2531261
10422 2531261 2335425 2080283 1825800 1627069 1497383 1396139 1271361 1223487 1178340 1112893
10412 1112893 1092928 1065361 1040565 1019099 1002591 1010797 1026346 1041644 1069262 1103678 1126074
10401 1126074 1171641 1200196 1188991 1203556 1259699 1295553 1366832 1461001 1563878 1684402 1814213
10390 1814213 1918948 2029537 2109427 2156032 2128846 1998062 1891121 1756874 1648642 1563028
10380 1563028 1447013 1355430 1330086 1279332 1229376 1182858 1154329 1138436 1138828 1132274 1142398 1150523
$$ packed form
10455C17436p108J8703Q725j4874K8954P1465P2813P1593L7460K7430L3442R4047
10443G60086J46797J89170K32142K55311K81378L12806K43143J73092J14443J3969
10433B722337j0545N103N75M5121Q9016O3340K9327k3322j07014j36185j46492
10422B531261j95836k55142k54483j98731j29686j01244j24778m7874m5147o5447
10412A112893j9965k7567k4796k1466j6508Q206J5549J5298K7618L4416K2396
10401A126074M5567K8555j1205J4565N6143L5854P1279R4169J02877J20524J29811
10390A814213J04735J10589P9890M6605k7186j30784j06941j34247j08232q5614
10380A563028j16015r1583k5344n0754m9956m6518k8529j5893L92o554J0124Q125
$$ plain form
10368 1150523 1121930 1113033 1156359 1187971 1232406 1244323 1228614 1273738 1336386 1382044 1392002 1439202
10356 1439202 1522480 1590630 1636432 1718578 1762920 1795117 1841655 1869724 1859774 1842207 1816818
10345 1816818 1783681 1782418 1783993 1831858 1860689 1900887 1952266 1983471 2031045 2116174 2231595
10334 2231595 2321288 2379172 2464250 2568722 2703030 2845543 2992306 3190528 3422017 3689032
10324 3689032 3961289 4258684 4614139 4969847 5394788 5886366 6408472 7032898 7796149
10315 7796149 8693949 9773830 11082602 12580345 14390969 16564242 19164809 22316024
10307 22316024 26121880 30646551 35947713 42026185 48626650 55441012 61814712 67112088
10299 67112088 70706497 72223462 71639408 69309053 65789924 61692286 57466074 53516013
$$ packed form
10368A150523k8593q897M3326L1612M4435J1917j5709M5124O2648M5658R958M7200
10356A439202Q3278O8150M5802Q2146M4342L2197M6538K8069r950j7567k5389
10345A816818l3137j263J575M7865K8831M0198N1379L1205M7574Q5129J15421
10334B231595Q9693N7884Q5078J04472J34308J42513J46763J98222K31489K67015
10324C689032K72257K97395L55455L55708M24941M91578N22106O24426P63251
10315G796149Q97800J079881J308772J497743J810624K173273K600567L151215
10307B2316024L805856M524671N301162O078472O600465O814362O373700N297376
10299F7112088L594409J516965n84054k330355l519129m097638m226212l950061
$$ plain form
10291 53516013 49972595 46906337 44253304 42055798 40272635 38862078 37736488 36867694
10283 36867694 36273496 35957898 35899212 36079128 36581418 37409609 38622247 40189993 42323927
10274 42323927 45103331 48604128 53090157 58738329 65887175 74822438 85897546 99444569
10266 99444569 115441903 133274449 151273030 166968340 177633868 181130925 176826425
10259 176826425 165904314 150911468 134766366 119582501 106319593 95281545 86212771
10252 86212771 78773629 72688392 67606890 63364270 59849916 56925794 54449434 52385785
10244 52385785 50689803 49340990 48326314 47620384 47210401 47119821 47353233 47885608 48808860
10235 48808860 50142343 51913214 54160131 56968428 60331688 64250218 68612627 73155330
$$ packed form
10291E3516013l543418l066258k653033k197506j783163j410557j125590q68794
10283C6867694n94198l15598n8686J79916N02290Q28191J212638J567746K133934
10274D2323927K779404L500797M486029N648172P148846Q935263J1075108J3547023
10266I9444569J5997334J7832546J7998581J5695310J0665528L497057m304500
10259A76826425j0922111j4992846j6145102j5183865j3262908j1038048r068774
10252H6212771p439142o085237n081502m242620l514354k924122k476360k063649
10244E2385785j695982j348813j014676p05930m09983r0580K33412N32375R23252
10235D8808860J333483J770871K246917K808297L363260L918530M362409M542703
$$ plain form
10227 73155330 77492122 81114248 83461566 84007850 82490048 79081076 74224709 68495568
10219 68495568 62563416 56890446 51695883 47134573 43149971 39758664 36850659 34294000
10211 34294000 32081604 30116756 28387037 26846625 25422922 24223196 23127946 22100427
10203 22100427 21148800 20323778 19575101 18860652 18217480 17622742 17030884 16491122 16026060
10194 16026060 15546378 15090581 14660933 14264334 13838003 13424934 13058011 12724133 12430874
10185 12430874 12125018 11835055 11573219 11310819 11082638 10853729 10611272 10382177 10190779
10176 10190779 9985933 9810076 9665709 9473688 9314611 9137750 8906128 8658689 8467156
10167 8467156 8270429 8074087 7869675 7709463 7543336 7406786 7213503 7038548 6878638
$$ packed form
10227G3155330M336792L622126K347318N46284j517802l408972m856367n729141
10219F8495568n932152n672970n194563m561310l984602l391307k908005k556659
10211C4294000k212396j964848j729719j540412j423703j199726j095250j027519
10203B2100427r51627q25022p48677p14449o43172n94738n91858n39762m65062
10194A6026060m79682m55797m29648l96599m26331m13069l66923l33878k93259
10185A2430874l05856k89963k61836k62400k28181k28909k42457k29095j91398
10176A0190779k04846j75857j44367j92021j59077j76861k31622k47439j91533
10167H467156j96727j96342k04412j60212j66127j36550j93283j74955j59910
$$ plain form
10158 6878638 6783317 6683612 6552306 6360399 6236266 6118650 6015622 5932069 5822369 5746918
10148 5746918 5691201 5643937 5580872 5534650 5485892 5438155 5407300 5397074 5415328 5452419 5508581
10137 5508581 5536351 5541264 5502428 5408481 5247600 5124387 4974205 4834014 4724283 4585890
10127 4585890 4450003 4314813 4197136 4127485 4064492 4002208 3932435 3879813 3789444 3712194 3699588
10116 3699588 3638429 3562038 3486759 3390458 3333029 3306888 3245171 3194823 3157838 3126746 3078120
10105 3078120 3037279 2987952 3007607 3013769 3030302 3012961 2958630 2936521 2921641 2905079 2855368
10094 2855368 2774933 2695562 2614119 2537065 2516757 2476772 2384643 2327755 2269874 2206851 2167905
10083 2167905 2127303 2097985 2105187 2076572 2010435 1955342 1901518 1841344 1818438 1790423 1746633
$$ packed form
10158F878638r5321r9705j31306j91907j24133j17616j03028q3553j09700p5451
10148E746918n5717m7264o3065m6222m8758m7737l0855j0226J8254L7091N6162
10137E508581K7770M913l8836r3947j60881j23213j50182j40191j09731j38393
10127D585890j35887j35190j17677o9651o2993o2284o9773n2622r0369p7250j2606
10116C699588o1159p6391p5279r6301n7429k6141o1717n0348l6985l1092m8626
10105C078120m0841m9327J9655O162J6533j7341n4331k2109j4880j6562m9711
10094B855368q0435p9371q1443p7054k0308l9985r2129n6888n7881o3023l8946
10083B167905m0602k9318P202k8615o6137n5093n3824o0174k2906k8015m3790
$$ plain form
10072 1746633 1719638 1693789 1627479 1588195 1578887 1561805 1551931 1501997 1415782 1414250 1434621 1428158
10060 1428158 1381567 1359991 1313617 1256566 1224305 1202579 1173627 1161807 1148830 1179089 1193927
10049 1193927 1177503 1172846 1152672 1106286 1077271 1067133 1076853 1052786 1053345 1032552 1011081 1002638
10037 1002638 981424 960547 926644 882885 906465 935628 930339 903471 882244 837608 819157
10026 819157 830757 827728 790017 785222 769902 751086 717745 704455 724935 736720 744236 748615
10014 748615 774552 796857 761361 738682 685859 670017 633057 627913 628520 660679 625311 591542
10002 591542 583985 567308 566234 536912 541062 561735 530887 533678 549906 518309 532290 581138
9990 581138 582219 559396 557079 537639 503544 531357 521984 535777 537869 500235 448889 433159
$$ packed form
10072A746633k6995k5849o6310l9284r308j7082r874m9934q6215j532K0371o463
10060A428158m6591k1576m6374n7051l2261k1726k8952j1820j2977L0259J4838
10049A193927j6424m657k0174m6386k9015j0138R720k4067N59k0793k1471q443
10037A002638k1214k0877l3903m3759K3580K9163n289k6868k1227m4636j8451
10026H19157J1600l029l7711m795j5320j8816l3341j3290K0480J1785P516M379
10014G48615K5937K2305l5496k2679n2823j5842l6960n144O07L2159l5368l3769
10002E91542p557j6677j074k9322M150K0673l0848K791J6228l1597J3981M8848
9990E81138J081k2823k317j9440l4095K7813r373J3793K092l7634n1346j5730
$$ plain form
9978 433159 421687 441347 450645 438890 471241 494120 496284 510765 470273 444262 396566 358953
9966 358953 344920 378461 386019 406682 416242 439624 455872 442485 405565 386810 410686 433416
9954 433416 420165 362404 323045 329381 357218 377192 370687 340020 314653 321463 319714 313803 294915
9941 294915 279565 275558 294255 303875 298179 291953 294227 306875 295922 313707 311653 269152 253172
9928 253172 266959 275411 266056 247110 319656 331666 296783 299299 301080 292630 261388 255968 279250
9915 279250 266947 238131 235327 249001 212286 224889 246066 226788 237366 223656 218464 213508
9903 213508 231581 209153 193028 150506 176881 176603 153501 145462 142862 136994 164996 201082 187477
9890 187477 172303 154912 151157 161987 178718 185955 183165 186106 176969 167452 156751 152355 172330
$$ packed form
9978D33159j1472J9660R298j1755L2351K2879K164J4481m0492k6011m7696l7613
9966C58953j4033L3541P558K0663R560K3382J6248j3387l6920j8755K3876K2730
9954D33416j3251n7761l9359O336K7837J9974o505l0667k5367O810j749n911j8888
9941B94915j5350m007J8697R620n696o226K274J2648j0953J7785k054m2501j5980
9928B53172J3787Q452r355j8946P2546J2010l4883K516J781q450l1242n420K3282
9915B79250j2303k8816k804J3674l6715J2603K1177j9278J0578j3710n192m956
9903B13508J8073k2428j6125m2522K6375k78k3102q039k600n868K8002L6086j3605
9890A87477j5174j7391l755J0830J6731P237k790K941r137r517j0701m396J9975
$$ plain form
9877 172330 165369 187875 213838 216911 185322 172344 175304 147188 131139 105351 72773 86126
9865 86126 108767 139647 156120 143991 149767 175222 196151 199558 186397 194562 193801 198270 204265
9852 204265 186714 218610 237076 195353 193601 154114 87350 77398 102810 106527 103452 109189 110765
9839 110765 105135 111022 105631 124894 113970 120882 116755 131416 148288 157407 131938 101010 93704
9826 93704 112242 146465 141511 161974 175031 217758 266462 230681 170469 165929 175474 183655 138129
9813 138129 111850 140831 170654 165313 169695 153436 149809 158187 137343 109712 106315 110186 119413
9800 119413 137413 103775 86485 102894 120927 142778 138708 74759 88773 100616 122507 131003
9788 131003 149874 160791 182580 160853 141553 132335 111151 86857 97165 145360 159031 162693
$$ packed form
9877A72330o961K2506K5963L073l1589j2978K960k8116j6049k5788l2578J3353
9865H6126K2641L0880J6473j2129N776K5455K0929L407j3161Q165p61M469N995
9852B04265j7551L1896J8466m1723j752l9487o6764r952K5412L717l075N737J576
9839A10765n630N887n391J9263j0924O912m127J4661J6872R119k5469l0928p306
9826I3704J8538L4223m954K0463J3057M2727M8704l5781o0212m540R545Q181m5526
9813A38129k6279K8981K9823n341M382j6259l627Q378k0844k7631l397L871R227
9800A19413J8000l3638j7290J6409J8033K1851m070o3949J4014J1843K1891Q496
9788A31003J8871J0917K1789k1727j9300r218k1184k4294J0308M8195J3671L662
$$ plain form
9776 162693 139291 124191 125453 153447 164336 190252 182916 169628 163812 160809 153300 151191 158733
9763 158733 175860 154210 112920 85936 76606 78731 68720 85148 149289 175809 220876 246637
9751 246637 230807 199285 167188 197727 198537 187987 181974 164731 168643 141284 160628 138846
9739 138846 136828 146853 150071 172252 168856 188030 199930 202174 200644 193680 204935 216586 211029
9726 211029 192080 186004 169002 151039 128005 120677 104973 112676 140393 191154 189677 183051 222861
9713 222861 236065 219264 192451 211091 223089 210212 194466 163919 149766 157643 175989 168541
9701 168541 179691 191735 196569 186070 155730 140056 170254 176231 185234 223887 234173 240457
9689 240457 266303 276096 277867 285954 299908 313047 321778 288654 289551 307343 303549 302633 340977
$$ packed form
9776A62693k3402j5100J262K7994J0889K5916p336j3288n816l003p509k109P542
9763A58733J7127k1650m1290k6984r330K125j0011J6428O4141K6520M5067K5761
9751B46637j5830l1522l2097L0539Q10j0550o013j7243L912k7359J9344k1782
9739A38846k018J0025L218K2181l396J9174J1900K244j530o964J1255J1651n557
9726B11029j8949o076j7002j7963k3034p328j5704P703K7717N0761j477o626L9810
9713B22861J3204j6801k6813J8640J1998j2877j5746l0547j4153P877J8346p448
9701A68541J1150J2044M834j0499l0340j5674L0198N977R003L8653J0286O284
9689B40457K5846R793J771Q087J3954J3139Q731l3124Q97J7792l794r16L8344
$$ plain form
9676 340977 348898 353756 345536 371794 361118 380810 435184 399474 370073 375848 407991 443267
9664 443267 424843 405652 415561 426095 406460 418030 463419 485993 525861 519719 534253 554374
9652 554374 536948 540681 586882 596982 591029 624052 673900 731468 720426 725980 784466 808037
9640 808037 830411 851000 883590 915722 944602 984037 1009908 1020237 1076512 1112905 1142997 1201229
9628 1201229 1236412 1277632 1345617 1414060 1477710 1536060 1585822 1686938 1780077 1907098 2004628
9617 2004628 2047735 2136519 2263916 2349834 2431140 2531007 2637065 2726119 2821525 2906132 3032819
9606 3032819 3136085 3226840 3313020 3368559 3384160 3405564 3462631 3553577 3581414 3552319 3544250
9595 3544250 3518151 3461359 3387473 3329924 3227239 3143405 3076148 3026046 2935884 2853279 2772348
$$ packed form
9676C40977P921M858q220K6258j0676J9692N4374l5710k9401N775L2143L5276
9664D43267j8424j9191R909J0534j9635J1570M5389K2574L9868o142J4534K0121
9652E54374j7426L733M6201J0100n953L3023M9848N7568j1042N554N8486K3571
9640H08037K2374K0589L2590L2132K8880L9435K5871J0329N6275L6393L0092N8232
9628A201229L5183M1220O7985O8443O3650N8350M9762J01116R3139J27021R7530
9617B004628M3107Q8784J27397Q5918Q1306R9867J06058Q9054R5406Q4607J26687
9606C032819J03266R0755Q6180N5539J5601K1404N7067R0946K7837k9095q069
9595C544250k6099n6792p3886n7549j02685q3834o7257n0102r0162q2605q0931
$$ plain form
9584 2772348 2697713 2602961 2524914 2456944 2373921 2291702 2209468 2128057 2106397 2041965 1932003
9573 1932003 1839360 1792786 1780965 1747214 1669977 1604635 1533070 1497656 1462391 1433347 1384894
9562 1384894 1333871 1301751 1256990 1224600 1200789 1140985 1101058 1117529 1104711 1034530 970786
9551 970786 938920 920002 909003 871233 823733 788913 800166 802105 799684 772336 734805 720752
9539 720752 701272 706062 703372 676887 647729 648199 650540 620723 579478 576952 567508 559305 550607
9526 550607 524214 502896 480206 456741 401906 391240 391026 386737 428843 466288 487792 440836
9514 440836 423071 398826 396286 382279 355108 350204 345993 334581 293797 310391 348238 338629
9502 338629 327526 318433 356539 373987 362419 356800 387080 394450 358546 339677 337397 333901 329123
$$ packed form
9584B772348p4635r4752p8047o7970q3023q2219q2234q1411k1660o4432j09962
9573A932003r2643m6574j1821l3751p7237o5342p1565l5414l5265k9044m8453
9562A384894n1023l2120m4761l2390k3811n9804l9927J6471j2818p0181o3744
9551I70786l1866j8918j0999l7770m7500l4820J1253J939k421k7348l7531j4053
9539G20752j9480M790k690k6485k9158M70K341k9817m1245k526r444q203q698
9526E50607k6393k1318k2690k3465n4835j0666k14m289M2106L7445K1504m6956
9514D40836j7765k4245k540j4007k7171m904m211j1412m0784J6594L7847r609
9502C38629j1103r093L8106J7448j1568n619L0280P370l5904j8869k280l496m778
$$ plain form
9489 329123 325245 317926 333482 324744 269151 255439 284030 291925 311522 304948 291504 281615 273209
9476 273209 284681 262284 262396 264924 272636 276648 226492 234240 243695 205537 191232 168244 145197
9463 145197 155352 141349 150814 169027 179815 184078 202296 213611 220988 219431 191234 234238
9451 234238 237305 194973 173209 174635 186768 191071 206451 210057 186707 188194 214747 191633 172398
9438 172398 204608 158827 152726 157139 156155 165983 210075 208904 151353 145719 137400 125164 98424
9425 98424 127724 144897 134251 117437 91906 91728 118016 131474 115096 127345 157967 181457
9413 181457 186904 159324 148692 125217 116175 65438 62212 64699 79957 82371 82606 105632 118189
9400 118189 91546 58925 73503 142518 123460 111024 66786 22314 30529 56455 76192 72626
$$ packed form
9489C29123l878p319J5556q738n5593j3712K8591P895J9597o574j3444r889q406
9476B73209J1472k2397J12K528P712M012n0156P748R455l8158j4305k2988k3047
9463A45197J0155j4003R465J8213J0788M263J8218J1315P377j557k8197M3004
9451B34238L067m2332k1764J426J2133M303J5380L606k3350J487K6553k3114j9235
9438A72398L2210m5781o101M413r84R828M4092j171n7551n634q319j2236k6740
9425I8424K9300J7173j0646j6814k5531j78K6288J3458j6378J2249L0622K3490
9413A81457N447k7580j0632k3475r042n0737l226K487J5258K414K35K3026J2557
9400A18189k6643l2621J4578O9015j9058j2436m4238m4472Q215K5926J9737l566
$$ plain form
9388 72626 88340 89724 109771 147232 154246 104757 68555 73866 86270 110586 126007 115379
9376 115379 96761 83127 85287 65828 18117 54789 90384 90956 52177 37454 55366 87684
9364 87684 99909 71609 64839 92624 75512 24567 49071 72918 50305 42926 46255 58270
9352 58270 28658 23588 85917 130372 125407 94809 99224 86282 100482 104956 103090 111420 116835
9339 116835 75521 61697 79793 111439 150502 169088 145460 123425 130736 108753 90705 86424
9327 86424 107156 110619 122558 131782 115241 107874 112406 66353 25465 17140 4287 23174 52005
9314 52005 38797 52942 67780 93896 94179 89208 89448 76581 77909 69335 81629 130881 127802
9301 127802 67283 60615 83031 92283 95527 112291 113724 158652 187927 218074 257033 273597
$$ packed form
9388G2626J5714J384K0047L7461P014m9489l6202N311J2404K4316J5421j0628
9376A15379j8618j3634K160j9459m7711L6672L5595N72l8779j4723J7912L2318
9364H7684J2225k8300o770K7785j7112n0945K4504K3847k2613p379L329J2015
9352E8270k9612n070O2329M4455m965l0598M415j2942J4200M474j866Q330N415
9339A16835m1314j3824J8096L1646L9063J8586k3628k2035P311k1983j8048m281
9327H6424K0732L463J1939R224j6541p367M532m6053m0888q325j2853J8887K8831
9314E2005j3208J4145J4838K6116K83m971K40j2867J328q574J2294M9252l079
9301A27802o0519o668K2416R252L244J6764J433M4928K9275L0147L8959J6564
$$ plain form
9289 273597 234576 173449 149800 185213 224757 236527 233553 215048 203320 168777 169072 181366
9277 181366 189979 178453 180537 183491 170134 139123 127096 133589 148037 184818 189359 197963 183290
9264 183290 148465 134669 127594 122276 100000 115196 99340 94431 103223 122659 159629 166881 175684
9251 175684 166129 213838 247757 217173 182581 197908 226722 239460 304484 307147 298495 297768 299949
9238 299949 303043 371974 439525 447281 374454 324396 299594 304953 320290 308449 282703 291354
9226 291354 314191 279156 237972 181221 141431 156968 200880 244620 238299 247078 260739 259217
9214 259217 214081 205877 189511 162206 173152 148905 166843 165614 161275 142585 128923 134001
9202 134001 143185 177713 179616 183996 199895 223995 262145 304826 333815 362528 362674 362519 390033
$$ packed form
9289B73597l9021o1127k3649L5413L9544J1770k974j8505j1728l4543K95J2294
9277A81366Q613j1526K084K954j3357l1011j2027O493J4448L6781M541Q604j4673
9264A83290l4825j3796p075n318k2276J5196j5856m909Q792J9436L6970P252Q803
9251A75684r555M7709L3919l0584l4592J5327K8814J2738O5024K663q652p27K181
9238B99949L094O8931O7551P756p2827n0058k4802N359J5337j1841k5746Q651
9226B91354K2837l5035m1184n6751l9790J5537M3912M3740o321Q779J3661j522
9214B59217m5136q204j6366k7305J0946k4247J7938j229m339j8690j3662N078
9202A34001R184L4528J903M380J5899K4100L8150M2681K8989K8713J46j55K7514
$$ plain form
9189 390033 406569 403311 392829 373236 385669 375951 341672 312890 280031 240543 232688 234433
9177 234433 236237 216626 196896 204149 229503 261400 270427 264097 269785 294601 253243 226996 196101
9164 196101 168684 149282 147608 128150 93155 88227 124276 135331 118883 107620 111087 125592
9152 125592 127619 51307 17441 34140 72208 67375 72327 81360 114826 167308 224922 254237
9140 254237 247488 244937 254719 245445 231097 269354 303499 278938 254539 213257 209431 173379 154378
9127 154378 137386 112430 94961 117934 146209 147048 145517 147454 160049 138354 127871 114907
9115 114907 94414 80047 68853 73077 69861 72361 82753 128188 126939 98501 93011 92239 81272
9102 81272 98287 112388 103836 109077 94034 89283 102139 114422 133119 106538 117350 139777
$$ packed form
9189C90033J6536l258j0482j9593J2433r718l4279k8782l2859l9488p855J745
9177B34433J804j9611j9730P253K5354L1897R027o330N688K4816m1358k6247l0895
9164A96101k7417j9402j674j9458l4995m928L6049J1055j6448j1263L467J4505
9152A25592K027p6312l3866J6699L8068m833M952R033L3466N2482N7614K9315
9140B54237o749k551R782r274j4348L8257L4145k4561k4399m1282l826l6052j9001
9127A54378j6992k4956j7469K2973K8275Q39j531J937J2595k1695j0483j2964
9115A14907k0493j4367j1194M224l216K500J0392M5435j249k8438n490p72j0967
9102H1272J7015J4101q552N241j5043m751J2856J2283J8697k6581J0812K2427
$$ plain form
9090 139777 145996 162238 177562 171319 172595 199285 252198 228260 157528 102691 87410 139595
9078 139595 142560 114551 117034 132482 105021 123170 131797 154598 142479 110190 92079 92048 97640
9065 97640 102480 113073 89596 87609 114928 113916 127671 133347 120370 108401 71609 64584 93403
9052 93403 102693 121490 110274 97662 132137 112619 62778 80704 146952 145119 152480 194411
9040 194411 222130 191126 207903 207664 212252 245820 250055 219406 204915 157010 129506 170146
9028 170146 165991 180828 198256 181259 163475 169832 163608 152412 127482 116621 126167 167492
9016 167492 203595 185873 153655 152652 115348 129216 149230 181403 157744 154945 161816 183439
9004 183439 179371 187079 167060 157638 121010 124471 148056 180700 185328 198077 214621 233441 255790
$$ packed form
9090A39777O219J6242J5324o243J276K6690N2913k3938p0732n4837j5281N2185
9078A39595K965k8009K483J5448k7461J8149Q627K2801j2119l2289j8111l1N592
9065I7640M840J0593k3477j987K7319j012J3755N676j2977j1969l6792p025K8819
9052I3403R290J8797j1216j2612L4475j9518m9841J7926O6248j833P361M1931
9040A94411K7719l1004J6777k39M588L3568M235l0649j4491m7905k7504M0640
9028A70146m155J4837J7428j6997j7784O357o224j1196k4930j0861R546M1325
9016A67492L6103j7722l2218j003l7304J3868K0014L2173k3659k799O871K1623
9004A83439m068P708k0019r422l6628L461K3585L2644M628J2749J6544J8820K2349
$$ plain form
8991 255790 235245 259837 309161 256773 216867 223959 217975 248923 223489 162970 168036 195063
8979 195063 192571 186123 165813 194823 190562 159712 144355 172193 198295 172772 134511 125662
8967 125662 174852 190294 192455 189823 161558 147455 159155 167474 161735 181683 165668 173933 183367
8954 183367 208234 190595 178886 195698 207282 215419 214958 199231 217205 251384 262807 244801
8942 244801 263397 265861 267035 240440 199611 213242 209914 172571 176970 200765 204520 170484 178202
8929 178202 138753 140946 145995 121222 140554 176257 168113 141085 148572 192587 191537 166982 170687
8916 170687 169423 198888 172479 172236 166494 162106 170452 212953 250481 255061 219556 166555 113963
8903 113963 108718 137639 124918 121730 104708 93934 116653 150656 150146 177674 194050 177240
$$ packed form
8991B55790k0545K4592M9324n2388l9906P092n984L0948k5434o0519N066K7027
8979A95063k492o448k0310K9010m261l0850j5357K7838K6102k5523l8261q849
8967A25662M9190J5442K161k632k8265j4103J1700Q319n739J9948j6015Q265R434
8954A83367K4867j7639j1709J6812J1584Q137m61j5727J7974L4179J1423j8006
8942B44801J8596K464J174k6595m0829J3631l328l7343M399K3795L755l4036P718
8929A78202l9449K193N049k4773J9332L5703q144k7028P487M4015j050k4555L705
8916A70687j264K9465k6409k43n742m388Q346M2501L7528M580l5505n3001n2592
8903A13963n245K8921j2721l188j7022j0774K2719L4003n10K7528J6376j6810
$$ plain form
8891 177240 151323 145659 172517 168583 125860 129960 117604 111126 132634 126804 155819 136481 101710
8878 101710 124909 135552 142652 174187 177589 189621 194254 205260 180313 154391 169069 186009
8866 186009 234903 289161 354212 389609 428461 453324 431171 403607 363322 286247 248900 255315
8854 255315 241265 207763 224099 217551 227672 203599 205973 229786 210731 159342 160286 185583
8842 185583 161361 166362 160584 159960 164295 206329 189758 167263 205371 224832 273894 264984 271592
8829 271592 290164 328046 367726 440027 515853 622631 735388 837067 951010 1049862 1170229
8818 1170229 1221061 1231555 1220593 1144211 1061181 959732 872988 826605 722244 654249 612025
8807 612025 596257 572553 516747 484236 453341 439212 428134 436148 418451 423396 452639 446769
$$ packed form
8891A77240k5917n664K6858l934m2723M100j2356o478K1508n830K9015j9338l4771
8878A01710K3199J0643P100L1535L402J2032M633J1006k4947k5922J4678J6940
8866A86009M8894N4258O5051L5397L8852K4863k2153k7564m0285p7075l7347O415
8854B55315j4050l3502J6336o548J0121k4073K374K3813j9055n1389R44K5297
8842A85583k4222N001n778o24M335M2034j6571k2495L8108J9461M9062q910O608
8829B71592J8572L7882L9680P2301P5826J06778J12757J01679J13943R8852J20367
8818A170229N0832J0494j0962p6382q3030j01449q6744m6383j04361o7995m2224
8807F12025j5768k3704n5806l2511l0895j4129j1078Q014j7697M945K9243n870
$$ plain form
8795 446769 405568 403834 375128 399010 408277 428439 480280 548733 597443 623195 616922 629018
8783 629018 638642 633424 655497 721555 767489 800679 802469 837334 898385 956396 1005827 1052328
8771 1052328 1104575 1148586 1195083 1215186 1246036 1276567 1302550 1298190 1236159 1175765 1082416 990971
8759 990971 913688 854739 774114 693544 642153 592061 598214 587694 539044 511673 481745 458095
8747 458095 459952 408919 418054 464276 448531 434665 449201 443989 427419 486743 533190 533380 581667
8734 581667 641469 640052 621845 615997 676870 721416 739242 784225 827189 838150 840890 853447
8722 853447 904528 914973 857852 821127 792534 805510 789633 803259 774401 685080 608996 570199
8710 570199 557617 528726 466312 413625 426204 448225 463169 464714 440581 400647 377321 378885
$$ packed form
8795D46769m1201j734k8706K3882R267K0162N1841O8453M8710K5752o273J2096
8783F29018R624n218K2073O6058M5934L3190J790L4865O1051N8011M9431M6501
8771A052328N2247M4011M6497K0103L0850L0531K5983m360o2031o0394r3349r1445
8759I90971p7283n8949q0625q0570n1391n0092O153j0520m8650k7371k9928k3650
8747D58095J857n1033R135M6222j5745j3866J4536n212j6570N9324M6447J90M8287
8734E81667N9802j417j8207n848O0873M4546J7826M4983M2964J0961K740J2557
8722H53447N1081J0445n7121l6725k8593J2976j5877J3626k8858q9321p6084l8797
8710E70199j2582k8891o2414n2687J2579K2021J4944J545k4133l9934k3326J564
$$ plain form
8698 378885 365548 370187 381082 365915 360366 340369 345426 388466 386016 363887 348087 370685
8686 370685 421436 438515 433751 438674 426437 439748 466337 484063 505664 487059 447466 398357
8674 398357 382556 359221 328909 323343 307459 282222 273346 262781 254405 307649 347101 334519
8662 334519 293955 280341 248431 231573 193924 152747 154565 178175 186612 208387 241053 245984
8650 245984 241919 279050 281387 286464 324116 360228 363915 358915 340911 311152 299401 335495 340329
8637 340329 316538 324726 312566 280211 231947 228175 227453 229585 205689 160908 143914 187111 180360
8624 180360 177032 188442 168819 175662 180496 171394 181972 172017 166086 182375 203011 171785 134212
8611 134212 145408 169704 164041 130063 91063 95265 77081 105304 122714 101334 80914 68956
$$ packed form
8698C78885j3337M639J0895j5167n549j9997N057M3040k450k2129j5800K2598
8686C70685N0751J7079m764M923j2237J3311K6589J7726K1601j8605l9593m9109
8674C98357j5801k3335l0312n566j5884k5237q876j0565q376N3244L9452j2582
8662C34519m0564j3614l1910j6858l7649m1177J818K3610Q437K1775L2666M931
8650B45984m065L7131K337N077L7652L6112L687n000j8004k9759j1751L6094M834
8637C40329k3791Q188j2160l2355m8264l772p22K132k3896m4781j6994M3197o751
8624A80360l328J1410j9623O843M834r102J0578r955n931J6289K0636l1226l7573
8611A34212J1196K4296n663l3978l9000M202j8184K8223J7410k1380k0420j1958
$$ plain form
8599 68956 78882 67963 66878 91396 111267 96534 102057 105207 125437 89974 57428 69419 71270
8586 71270 45565 34350 20168 18003 15435 37896 52646 47856 57166 72685 84589 85007 77563
8573 77563 105419 108541 102103 94244 98512 144331 130801 101998 114731 107791 69592 58992 29953
8560 29953 48735 66781 59516 37260 54305 50764 51798 36455 41359 11435 -29772 -4097 48880
8547 48880 70927 50090 31596 48876 74343 77006 88081 75487 65273 81581 105274 85692
8535 85692 44202 58478 74097 98515 118516 123102 104757 76503 53556 61173 55794 33910
8523 33910 65678 76183 64099 21187 18720 31757 35411 37616 23836 -11950 -46745 -85472
8511 -85472 -66853 -43945 -20467 14399 21794 52644 73746 27203 -6299 965 13903 4360
$$ packed form
8599F8956R926j0919j085K4518J9871j4733N523L150K0230l5463l2546J1991J851
8586G1270k5705j1215j4182k165k568K2461J4750m790R310J5519J1904M18p444
8573G7563K7856L122o438p859M268M5819j3530k8803J2733o940l8199j0600k9039
8560B9953J8782J8046p265k2256J7045l541J034j5343M904k9924m1207K5675N2977
8547D8880K2047k0837j8494J7280K5467K663J1075j2594j0214J6308K3693j9582
8535H5692m1490J4276J5619K4418K0001M586j8345k8254k2947P617n379k1884
8523C3910L1768J0505j2084m2912k467J3037L654K205j3780l5786l4795l8727
8511h5472J8619K2908K3478L4866P395L0850K1102m6543l3502P264J2938r543
$$ plain form
8499 4360 19240 16507 -17466 -34374 -21986 -28500 -8309 27179 49667 37395 23232 3727
8487 3727 -5789 -8194 -10485 -39531 -19991 -18073 -10695 5437 34717 71867 47954 11592 -2037
8474 -2037 3844 9508 36944 61731 36108 24590 14994 3123 18619 20584 23435 9925 -25016
8461 -25016 -26427 14653 30708 6069 -1558 9342 -2256 9042 -883 17888 8374 -21524 -1762
8448 -1762 13237 9371 -1497 -3344 9719 24603 57267 54817 94526 93786 95243 93947 84655 67251
8434 67251 30914 25864 18814 5759 176 -16319 -42636 -37078 -13214 7992 12911 21201 7186
8421 7186 24362 31045 18373 31472 51505 19017 -20964 -32928 -31447 -19178 -1318 -6439 -1902
8408 -1902 -7433 -14914 4422 29814 33610 35784 23742 43421 20894 4431 17134 42668 34836
$$ packed form
8499D360J4880k733l3973j6908J2388o514K0191L5488K2488j2272j4163j9505
8487C727r516k405k291k9046J9540J918P378J6132K9280L7150k3913l6362j3629
8474b037N881N664K7436K4787k5623j1518r596j1871J5496J965K851j3510l4941
8461b5016j411M1080J6055k4639p627J0900j1598J1298r925J8771r514k9898J9762
8448a762J4999l866j0868j847J3063J4884L2664k450L9709p40J457j296r292j7404
8434F7251l6337n050p050j3055n583j6495k6317N558K3864K1206M919Q290j4015
8421G186J7176O683j2672J3099K0033l2488l9981j1964J481J2269J7860n121M537
8408a902n531p481J9336K5392L796K174j2042J9679k2527j6463J2703K5534p832
$$ plain form
8395 34836 55442 69721 46113 -17649 -30679 12334 46461 20432 -21168 -40573 -49918 -10684
8383 -10684 -12919 -16504 -33261 -23650 -51144 -67088 -54822 -35771 14867 44300 49583 90100 89482
8370 89482 63181 94572 88807 70264 93520 103968 125611 122473 130932 117793 120707 94106 100396
8357 100396 84737 66832 48100 64400 66792 37441 8256 -38814 -8139 15863 24077 25838
8345 25838 35830 32649 -19350 -32508 -7992 21228 2627 -15653 850 49774 44077 -1551
8333 -1551 -29118 -21476 23128 63792 42132 537 62172 73248 52107 49344 66986 46881
8321 46881 31001 63460 95391 114417 86532 85668 81649 82006 71686 69853 94249 76063 73655
8308 73655 83599 71868 84778 96344 122779 136209 107395 69250 42844 35943 46772 71860
$$ packed form
8395C4836K0606J4279k3608o3762j3030M3013L4127k6029m1600j9405r345L9234
8383a0684k235l585j6757R611k7494j5944J2266J9051N0638K9433N283M0517o18
8370H9482k6301L1391n765j8543K3256J0448K1643l138Q459j3139K914k6601O290
8357A00396j5659j7905j8732J6300K392k9351k9185m7070L0675K4002Q214J761
8345B5838R992l181n1999j3158K4516K9220j8601j8280J6503M8924n697m5628
8333a551k7567P642M4604M0664k1660m1595O1635J1076k1141k763J7642k0105
8321D6881j5880L2459L1931J9026k7885q64m019L57j0320j833K4396j8186k408
8308G3655R944j1731J2910J1566K6435J3430k8814l8145k6406o901J0829K5088
$$ [...]
##END NTUPLES=NMR SPECTRUM
##END=
