##TITLE=Analysis number 318855
Compound Code cc 46110
Book Reference 451/143/7
Project Code adrs
Chemist Name evam
##JCAMPDX= 6.0         $$ Bruker NMR JCAMP-DX V2.0
##DATA TYPE= NMR SPECTRUM
##DATA CLASS= NTUPLES
##ORIGIN= Bruker BioSpin GmbH
##OWNER= nmr
$$ XWIN-NMR		Version 3.5
$$ Thu Apr 20 10:52:27 2006 GMT Daylight Time (UT+1h)  MAYBRIDGE\nmr@NMR_250MHZ
##.OBSERVE FREQUENCY= 250.131544655141
##.OBSERVE NUCLEUS= ^1H
##.ACQUISITION MODE= SIMULTANEOUS (DQD)
##.ACQUISITION SCHEME= undefined
##.AVERAGES= 16
##.DIGITISER RES= 18
##SPECTROMETER/DATA SYSTEM= dpx250
##.PULSE SEQUENCE= zg30
##.SOLVENT NAME= CDCl3
##.SHIFT REFERENCE= (INTERNAL, CDCl3, 0, 16.522)
##AUDIT TRAIL= $$ (NUMBER, WHEN, WHO, WHERE, WHAT)
$$ ##TITLE= Audit trail, XWIN-NMR		Version 3.5
$$ ##JCAMPDX= 5.01
$$ ##ORIGIN= Bruker BioSpin GmbH
$$ ##OWNER= nmr
$$ C:\u/data/dgb/nmr/ADRS/2790/pdata/1/auditp.txt
$$ ##AUDIT TRAIL=  $$ (NUMBER, WHEN, WHO, WHERE, WHAT)
(   1,<2006-04-20 10:51:56.44 +100>,<MAYBRIDGE\nmr>,<NMR_250MHZ>,
      <created by zg, POWCHK disabled, PULCHK disabled
       configuration hash MD5:
       84 BC 41 DB A1 6E 1D 46 DA 25 12 A5 C1 ED C5 3A
       data hash MD5: 64K
       7D CC 2E 23 B4 0A F9 A0 28 1B E8 0B 5F 3B 7F ED>)
(   2,<2006-04-20 10:52:08.99 +100>,<MAYBRIDGE\nmr>,<NMR_250MHZ>,
      <Start of raw data processing
       ef LB = 0.3 FT_mod = 6 PKNL = 1 SI = 32K 
       data hash MD5: 32K
       4F EC 30 1C 2F 0D 82 9A F0 01 AA 18 C8 51 F1 12>)
(   3,<2006-04-20 10:52:11.12 +100>,<MAYBRIDGE\nmr>,<NMR_250MHZ>,
      <apk 
       data hash MD5: 32K
       5F 2C CC FD 7B E6 D6 4C 10 B1 3E 27 16 E2 F8 3E>)
(   4,<2006-04-20 10:52:12.13 +100>,<MAYBRIDGE\nmr>,<NMR_250MHZ>,
      <abs ABSG = 5 
       data hash MD5: 32K
       99 DB 62 A3 67 15 C1 0B EE 0A B6 1F 73 AD 64 C6>)
$$ ##END=
$$ 
$$ hash MD5
$$ AA 88 9D D0 BC 94 81 33 A2 AF B9 41 A6 A6 50 04
##$RELAX= 
##$RELAX= 
##$RELAX= 
##$RELAX= 
##$RELAX= 
##$RELAX= 
##$RELAX= 
$$ Bruker specific parameters
$$ --------------------------
##$DU= <C:\u>
##$EXPNO= 2790
##$NAME= <ADRS>
##$PROCNO= 1
##$TYPE= <nmr>
##$USER= <dgb>
##$AMP= (0..31)
100 100 100 100 100 100 100 100 100 100 100 100 100 100 100 100 100 100 
100 100 100 100 100 100 100 100 100 100 100 100 100 100 
##$AQSEQ= 0
##$AQ_mod= 3
##$AUNM= <au_zg>
##$AUTOPOS= <14 >
##$BF1= 250.13
##$BF2= 250.13
##$BF3= 250.13
##$BF4= 250.13
##$BF5= 500.13
##$BF6= 500.13
##$BF7= 500.13
##$BF8= 500.13
##$BYTORDA= 1
##$CFDGTYP= 0
##$CFRGTYP= 5
##$CHEMSTR= <none>
##$CNST= (0..31)
1 1 145 1 1 1 1 1 1 1 1 1 1 1 1 1 1 1 1 1 1 1 1 1 1 1 1 1 1 1 1 1 
##$CPDPRG= <>
##$CPDPRG1= <>
##$CPDPRG2= <>
##$CPDPRG3= <>
##$CPDPRG4= <mlev>
##$CPDPRG5= <mlev>
##$CPDPRG6= <mlev>
##$CPDPRG7= <mlev>
##$CPDPRG8= <mlev>
##$CPDPRGB= <>
##$CPDPRGT= <>
##$D= (0..31)
0 1 0 0 0 0 0 0 0 0.06 0 0 0 0 0 0 0.0002 0 0 0 0 0 0 0 0 0 0 0 0 0 0 
0 
##$DATE= 1145526715
##$DBL= (0..7)
120 120 120 120 120 120 120 120 
##$DBP= (0..7)
150 150 150 150 150 150 150 150 
##$DBP07= 0
##$DBPNAM0= <>
##$DBPNAM1= <>
$$ [...]
##$SUBNAM7= <"">
##$SUBNAM8= <"">
##$SUBNAM9= <"">
##$SW= 20.6930455092707
##$SWIBOX= (0..15)
0 0 3 0 0 0 0 0 0 0 0 0 0 0 0 0 
##$SW_h= 5175.983436853
##$TD= 65536
##$TD0= 1
##$TE= 295.16
##$TE2= 300
##$TE3= 300
##$TEG= 300
##$TL= (0..7)
0 120 120 120 120 120 120 120 
##$TP= (0..7)
150 150 150 150 150 150 150 150 
##$TP07= 0
##$TPNAME0= <>
##$TPNAME1= <>
##$TPNAME2= <>
##$TPNAME3= <>
##$TPNAME4= <>
##$TPNAME5= <>
##$TPNAME6= <>
##$TPNAME7= <>
##$TPOAL= (0..7)
0.5 0.5 0.5 0.5 0.5 0.5 0.5 0.5 
##$TPOFFS= (0..7)
0 0 0 0 0 0 0 0 
##$TUNHIN= 0
##$TUNHOUT= 0
##$TUNXOUT= 0
##$USERA1= <user>
##$USERA2= <user>
##$USERA3= <user>
##$USERA4= <user>
##$USERA5= <user>
##$V9= 5
##$VALIST= <valist>
##$VCLIST= <CCCCCCCCCCCCCCC>
##$VD= 0
##$VDLIST= <DDDDDDDDDDDDDDD>
##$VPLIST= <PPPPPPPPPPPPPPP>
##$VTLIST= <TTTTTTTTTTTTTTT>
##$WBST= 1024
##$WBSW= 4
##$XGAIN= (0..3)
0 0 0 0 
##$XL= 0
##$YL= 0
##$YMAX_a= 278703
##$YMIN_a= -462134
##$ZGOPTNS= <>
##$ZL1= 120
##$ZL2= 120
##$ZL3= 120
##$ZL4= 120
##$ABSF1= 16.522
##$ABSF2= -4.171173
##$ABSG= 5
##$ABSL= 3
##$ALPHA= 0
##$AQORDER= 0
##$ASSFAC= 0
##$ASSFACI= 0
##$ASSFACX= 0
##$ASSWID= 0
##$AUNMP= <proc_1d>
##$AZFE= 0.1
##$AZFW= 0.1
##$BCFW= 0
##$BC_mod= 0
##$BYTORDP= 0
##$COROFFS= 0
##$CY= 12.5
##$DATMOD= 1
##$DC= 0
##$DFILT= <>
##$DTYPP= 0
##$F1P= 14.0000005364418
##$F2P= -0.99999901652339
##$FCOR= 0.5
##$FTSIZE= 32768
##$FT_mod= 6
##$GAMMA= 0
##$GB= 0
##$INTBC= 1
##$INTSCL= 1
##$ISEN= 128
##$LB= 0.3
##$LEV0= 0
##$LPBIN= 0
##$MAXI= 10000
##$MC2= 0
##$MEAN= 0
##$ME_mod= 0
##$MI= 0
##$NCOEF= 0
##$NC_proc= -5
##$NLEV= 6
##$NOISF1= 0
##$NOISF2= 0
##$NSP= 0
##$NTH_PI= 0
##$NZP= 0
##$OFFSET= 16.522
##$PC= 1
##$PHC0= 182.3865
##$PHC1= -28.07851
##$PH_mod= 1
##$PKNL= yes
##$PPARMOD= 0
##$PSCAL= 4
##$PSIGN= 0
##$REVERSE= no
##$SF= 250.13
##$SI= 32768
##$SIGF1= 0
##$SIGF2= 0
##$SINO= 400
##$SIOLD= 32768
##$SREGLST= <1H.CDCl3>
##$SSB= 0
##$STSI= 32768
##$STSR= 0
##$SW_p= 5175.98343685301
##$SYMM= 0
##$S_DEV= 0
##$TDeff= 65536
##$TDoff= 0
##$TI= <Analysis number 999999
Compound Code 99
Book Reference 9
Project Code 9>
##$TILT= no
##$TM1= 0
##$TM2= 0
##$TOPLEV= 0
##$USERP1= <user>
##$USERP2= <user>
##$USERP3= <user>
##$USERP4= <user>
##$USERP5= <user>
##$WDW= 1
##$XDIM= 32768
##$YMAX_p= 338594633
##$YMIN_p= -216760
$$ End of Bruker specific parameters
$$ ---------------------------------
##NTUPLES= NMR SPECTRUM
##VAR_NAME=  FREQUENCY,     SPECTRUM/REAL,   SPECTRUM/IMAG
##SYMBOL=    X,             R,               I
##VAR_TYPE=  INDEPENDENT,   DEPENDENT,       DEPENDENT
##VAR_FORM=  AFFN,          ASDF,            ASDF
##VAR_DIM=   32768,         32768,           32768
##UNITS=     HZ,            ARBITRARY UNITS, ARBITRARY UNITS
##FACTOR=    0.157963299565203, 1,           1
##FIRST=     4132.6476996994, 0,             0
##LAST=      -1043.33573715361, 0,           0
##MIN=       -1043.33573715361, -216760,     0
##MAX=       4132.6476996994, 338594633,     0
$$ Real data points
##PAGE= N=1
##DATA TABLE= (X++(R..R)), XYDATA
$$ [...]
23498b1853K9011k9807J3478L006k9912J3885j976m9225N2320K3247k0195J2087
23486e934L29J5896J6813L2381k0946J7490p036L5430m2831n3885k1722m5417
23474g9432P3672J3305n1827O700R6493q990o7556L3927M7615m722j0410k0438
23462B8337o8145M138K4366N105n8546P3019M7740Q389p2503n7161k5606R323
23450h1544l5737l3440L276k2249j3423N4051L7777L9629k1732N2091K0712k7273
23438b7862j3217J979J8745N6592o0200J6918Q913k4136N338K0664r753J9179
23426A3160p789k3588m828k3027M3097j047k9763K3170k4734L7257j5501l6515
23414e0108J7334L5529M6352l472n9173J2720J2745j0381j9570m9602K9172M5947
$$ y = [-21853, 7158, -22649, -9171, -6165, -36077, -22192, -24168, -73393, -21073, 2174, -18021, -5934, -5605, 10291, 27104, 59485, 38539, 56029, 48993, 84423, 41592, -12293, -34015, -79432, -5760, 7545, -44282, -37582, 58911, 49921, -17635, 16292, 63907, 59185, 48775, 28337, -39808, -35670, -11304, -6199, -64745, 8274, 56014, 64403, -8100, -65261, -90867, -81544, -117281, -150721, -147445, -169694, -183117, -129066, -91289, -51660, -73392, -21301, -589, -27862, -41079, -39100, -20355, 36237, -23963, -7045, 1868, -22268, -16930, 3734, -6019, 13160, 5371, -18217, -23045, -46072, -2975, -4022, -33785, -10615, -35349, 1908, -13593, -50108, -32774, 2755, 49107, 45635, -13538, -818, 11927, 1546, -18024, -67626, -38454, 7493]
23402G493M765J4413M948J6998j8609Q068J531O108m5927p4305j2869K0890K9907
23389c6589O8708Q603P4223l3988n794l0919k0223n1332o3835J2223N4149L3067
23377H293L7682k1179k6734J0020J7811k919o6647n1169L695j6511K5147q611
23365i1122J8755J2666M2400K8118l2310m859M6671M8205K6609p8746l1832J0934
23353d511o961j6263N737K7678J864K589J7467M4505L9897j2529k2896k8924k6121
23340B1532j16847o0965j841Q1456N6399R292L3774k8816k3496M1391k5619m0330
23328e4070j0337m7063K1630L1490N1682k502N515L272j0485O4726L1213l4991
23316E0080Q943p674n6720m513k105k44k8173K0508k3733K2280o0234J5457N0024
$$ y = [7493, 12258, 26671, 31619, 48617, 30008, 38076, 39607, 45715, -212, -74517, -87386, -66496, -36589, 32119, 40722, 114945, 80957, 75163, 44244, 24021, -27311, -91146, -78923, -24774, 8293, 45975, 24796, -1938, 8082, 25893, 22974, -43673, -94842, -91147, -107658, -82511, -91122, -72367, -59701, -17301, 10817, -21493, -26352, 20319, 68524, 95133, 16387, -15445, -4511, -11472, -27735, -21998, 5680, 7544, 10133, 27600, 72105, 112002, 99473, 76577, 47653, 21532, -95315, -156280, -158121, -76665, -20266, -10974, 22800, -6016, -29512, 11879, -13740, -54070, -64407, -111470, -89840, -58350, -6668, -9170, -3655, -383, -10868, 53858, 85071, 50080, 59023, 51349, -5371, -9884, -11989, -12233, -40406, -19898, -43631, -21351, -81585, -66128, -16104]
23303a6104M3749N299K0551j0373p067M3413k5627k4991m2197o1347l7391l6405
23291a48490K5904K3437K6527j8084j150M738M2542J2299k4103J5524r823l3927
23279h4606Q141J9054k2899J6928P1240k2709l3668K2390M2580o376m3336K376
23267c0885n3446j919N69L0621j6932P383N3825n755m782M827O344K1084J232
23254A2166k0358J3236M1346R953k9705k0501L6981K2912L755j2590o5380k6952
23242c5137L7182J6254l457k117m5691m3706j7854O2012P5303N883l8643j5580
23230e551J9864m1297L8112l9727m0363K6439M1145J2826k2627L418j0000K7458
23218I697J7075k1659r928j2314l622M4656M1996O8694k1939m9421o4030k0024
$$ y = [-16104, 27645, 32944, 53495, 43122, 36055, 79468, 53841, 28850, -13347, -74694, -112085, -148490, -122586, -99149, -72622, -90706, -91856, -87118, -44576, -32277, -56380, -40856, -50679, -84606, -76465, -57411, -80310, -63382, 7858, -14851, -48519, -26129, 16451, 10075, -33261, -30885, -84331, -86250, -85681, -55060, -71992, -64609, -10784, -16539, -21321, -16494, -10150, 10934, 12166, -8192, 5044, 46390, 56343, 26638, 6137, 43118, 66030, 69785, 57195, -8185, -35137, 2045, 18299, 14842, 12725, -32966, -76672, -94526, -32514, 42789, 48672, 10029, -5551, 14313, -26984, 11128, -28599, -68962, -42523, -1378, 11448, -11179, -7761, -17761, 9697, 26772, 5113, -4815, -17129, -20751, 23905, 65901, 134595, 112656, 63235, -795, -20819]
23206b0819M1L8217P092q037k1712o2886k8156K7095P8416M6879j0807l9626K44
23193E941k07n294L1219n264N1342n964r1792p3287J7130M10L9834K5019k0411
23180c1324o645M6472P1635l4594m8882j1724q664n1211J1905J7657J8995l8358
23168f4738l1478k7772J0156j3658P5703P725k4356K9450J6415L4605m0812P287
23156b1473M6791L5212o4279J6182N007q638L2786k0410j0786K0094L2466k5683
23144C7269o3097j2424M676J317K2596L1401K8698J2385n07n1621o349J2182j1075
23131E451k8827l4170l9322n6974N9781N8794L9722O547l8624m5853K8344N1074
23119E943J4297p043m7743m1214M3739O8979k4711j3626J4616p538J0629k1441
$$ y = [-20819, -20778, 17439, 24531, 16494, -5218, -68104, -96260, -69165, 9251, 56130, 45323, 5697, 5941, 5734, 440, 31659, 26395, 77737, 71773, -20019, -93306, -76176, -75766, -35932, -10913, -31324, -37969, 8503, 80138, 45544, -3338, -15062, -23726, -74937, -63032, -45375, -26380, -64738, -96216, -123988, -113832, -127490, -51787, -44062, -68418, -38968, -22553, 12052, -28760, -21473, 25318, 60530, -3749, 12433, 17440, 8802, 41588, 21178, 10392, 30486, 62952, 37269, -25828, -38252, -33576, -32259, -9663, 21738, 50436, 62821, 62314, 10693, 4344, 16526, 5451, -23376, -57546, -96868, -153842, -94061, -35267, 4455, 11002, -27622, -73475, -45131, 5943, 20240, 13197, -34546, -75760, -32021, 36958, 12247, -1379, 13237, 5699, 16328, -5113]
23107e113L6501N176q6414q184J3441j5005k7421Q472L0075o2726J9637J469m4699
23094a34791l548K4969N4648K5582O0367O3968m2638m6695k7481L1336R962L596
23082A9275O045K4203l800m2443L80K7934k4429L782j1443j0922m3191j6850O8991
23069b468N7204p324l309P677j0082l5309M0334L7609k3627n4571k7861m2161
23057f3888l7709k0165K5759N3968K8491O5515J901m3967l73k8451q119K3101
23045c937R305N3464M8839l493j3596l3943j3573l5044O940L0199J8741n7236
23033F666l4724J3006O6426K4372n6361n8583m7692L3744k1349k8907M0387M6653
23021a6362o37l6906K8632Q6821M4636J4906k3613p233o1665k5717L5786q23o0204
$$ y = [-5113, 31388, 36564, -49850, -58034, -44593, -59598, -87019, -78547, -48472, -111198, -91561, -90092, -134791, -138339, -113370, -58722, -33140, 27227, 91195, 48557, 1862, -25619, 5717, 15679, 19275, 25320, 49523, 45723, 3280, 3660, 31594, 7165, 10947, -496, -11418, -54609, -71459, -2468, 54736, 47412, 44103, 51780, 41698, 6389, 46723, 84332, 60705, 6134, -21727, -63888, -101597, -121762, -96003, -42035, -13544, 51971, 53872, 9905, 9532, -18919, -27038, -3937, 5368, 58832, 107671, 104178, 90582, 56639, 43066, 8022, 14962, 45161, 63902, 6666, -28058, -15052, 51374, 75746, 19385, -39198, -86890, -53146, -74495, -103402, -63015, -16362, -16999, -53905, -25273, 61548, 106184, 121090, 97477, 90244, 28579, 2862, 38648, 37825, -22379]
23008b2379M9135K5638P340p52M3163K0929j2470r2380l4850l99j3392p440O2209
22995B4352N0259l5205l2532l2608o199l6410P550K8606O1326L6025m7064J309
22983A9409K3345p21R447l8875j0011M4629L2647m984n2268j1020j1880j6110
22971a6392l453j7405l9773o548J788K072M4463M8603K4257l737J0669j249p034
22958C6261n8122k2159l9764K4039M5842m267l7977K5056L8898N228J2208q6956
22946f1713j4995O4916k520P6694p3239m4897q9416k3650R4312M9180M30J584
22934b3314q828J0166J7300p921l0493M78N826l6914k554R901L504k287k6956
22921i2092n621N122J2522J1302O0159O6792N713m3363q556J0320K2618J8346
$$ y = [-22379, 26756, 52394, 59734, 58982, 102145, 123074, 110604, 18224, -16626, -17025, -30417, -37857, 24352, 74611, 39406, 6874, -25734, -31933, -68343, -60793, -32187, 29139, 65164, 18100, 19409, 42754, 42033, 51480, 12605, 2594, 47223, 79870, 74886, 22618, 11598, -282, -16392, -19845, -37250, -77023, -83571, -81783, -79711, -35248, 13355, 37612, 33875, 44544, 43295, 36261, -21861, -44020, -83784, -59745, -13903, -18170, -56147, -31091, 7807, 13035, 25243, -61713, -76708, -11792, -14312, 62382, -10857, -55754, -145170, -168820, -74508, -25328, -24898, -23314, -32142, -21976, -4676, -12597, -43090, -42612, -36786, -73700, -76254, -66353, -62849, -65136, -92092, -97713, -92591, -80069, -68767, -8608, 58184, 63897, 20534, 11978, 22298, 44916, 63262]
22909F3262l8099l7963K4368K6659m578J3419J7829m881m406l4394k1962k3696
22897b4442J4230l4957k9793J1058R218J8217j8918J4610M865j5979M3137j1579
22885b0333k0117L0370N0789K1267K6369K5447n9705p5591N58K4962Q251j5793
22873c526K5155L6057P557p2627r4701N501R6228L0780J2557n0591r3401m6913
22861a47924J5587J5637p458p211P3475k3656k1481o541N639k1717K4483K1322
22849g9845K591M3618p362j2017k1855r698N6477L4810J4822J930R567k1925k5173
22836a4060Q798m0323L4559N6945l5474j6274L1831K6272l3559l1400J2877N2218
22824E2410Q575j0267J4126Q070j8698k0809L0645M6344l7877n4736K691j7730
$$ y = [63262, 25163, -12800, 11568, 38227, 33649, 47068, 64897, 60016, 55610, 21216, -746, -24442, -10212, -45169, -74962, -63904, -54686, -36469, -55387, -40777, -35912, -51891, -8754, -20333, -40450, -10080, 40709, 61976, 88345, 113792, 54087, -21504, -20946, 4016, 12267, -3526, 21629, 57686, 65243, -7384, -102085, -96584, -356, 30424, 42981, -7610, -101011, -147924, -132337, -116700, -124158, -131369, -57894, -81550, -103031, -109572, -103933, -125650, -101167, -79845, -77254, -33636, -40998, -53015, -74870, -84568, -28091, 6719, 21541, 23471, 33038, 11113, -14060, -5262, -45585, -11026, 45919, 10445, -5829, 26002, 52274, 18715, -12685, 192, 52410, 60985, 50718, 64844, 72914, 54216, 33407, 64052, 110396, 72519, 17783, 20474, 2744]
22812B744K2807M3061J731K3750p76M7848o2055m0639K4399m34j4749k3512o8080
22799d3905o837l9778L6494N0345J9094Q871J3850q098l5442k80m9649o6741k6742
22786a48818M5887L2507L8623R725o0168M2738K2221K6583j041q2383j8926M4215
22774d8837n2493j5425m9075k4161M8358L4625N6110N5375L9287J548p2058l4295
22762f1041P6938M0401l6103r451j6086j6674m9329j6595K8670N924q8615l6977
22750a78938N4814M5615P425j9342j94L786P679j5591L688j9520J795O4470L8634
22737e679l2624l3101J4875R370J4037N27K9401K0057J9059n4969m0825J7041
22725d2831k313k9828M6578N602l268k3891N490J4051j8759K7179O9860M8047
$$ y = [2744, 25551, 68612, 70343, 94093, 93317, 141165, 79110, 38471, 62870, 62436, 47687, 24175, -43905, -50742, -90520, -54026, -3681, 15413, 24284, 38134, 30036, -5406, -5686, -55335, -122076, -148818, -102931, -70424, -31801, -22076, -82244, -39506, -17285, 9298, 8257, -74126, -93052, -48837, -101330, -116755, -165830, -189991, -141633, -107008, -50898, 4477, 43764, 45312, -26746, -61041, 15897, 56298, 20195, 10744, -5342, -22016, -71345, -87940, -59270, -53346, -141961, -178938, -124124, -78509, -71084, -90426, -90620, -86834, -79155, -94746, -91058, -110578, -108783, -44313, -5679, -38303, -71404, -56529, -47159, -33122, -32595, -3194, 16863, 35922, -19047, -59872, -42831, -45144, -74972, -28394, -22792, -26060, -49951, -44461, -30410, -49169, -21990, 47870, 95917]
22713I5917j9786k9740r736k5509k4998o7888j5261J491P8456n420N540k14l262
22700b0410J3107K650n8934M142L6901K4700J5669l4784o1956j859J3078k4962
22688i2658L816K0573K3067P7411J2866K2755l8753J6734k4125l7135j1801o4503
22676i1753n4586M4199P8850N8154J8507q909n5918l2889n2102l9029j2901P11
22664a47666L0465M7942L1106M732o8811P4594N682m0664n5272L0329M5521K4546
22652a7496k1848O150L1330J1550n640Q919P62o104J5704J1366n3997m0249M8
22639e9505M1023l5627k1919l7926j5335m088J4414j4159L7704O0411L9160P0797
22627G4950n9085j8105L3506R635n5175J6023O7283J5713l9316l034J6360l1984
$$ y = [95917, 76131, 46391, 36655, 11146, -13852, -81740, -97001, -95510, -17054, -22474, -16934, -17148, -20410, -7303, -4653, -63587, -59445, -22544, 2156, 17825, -16959, -78915, -80774, -67696, -92658, -88842, -68269, -45202, 32209, 45075, 67830, 29077, 45811, 21686, -15449, -27250, -91753, -146339, -102140, -23290, 34864, 53371, 44462, -11456, -44345, -96447, -135476, -148377, -147666, -117201, -69259, -38153, -33421, -102232, -27638, -21956, -62620, -117892, -87563, -42042, -17496, -39344, -33194, -1864, 9686, 4046, 12965, 13727, 7623, 23327, 34693, -19304, -59553, -59505, -18482, -54109, -76028, -113954, -129289, -133377, -118963, -133122, -95418, -35007, 4153, 74950, 15865, -2240, 31266, 40901, -14274, 1749, 69032, 84745, 45429, 42395, 58755, 26771]
22615B6771m0031l1998L241j9333j4797J1208l467qm070j0755k5420N6357Q6803
22602C4501l2206J8244Q0343L5131j9723m7092j2207n7434k488J5707N4624L6340
22590A03740o3412M506j0893l6623m5377J918M0292j4104n576M8995J4066n8823
22578b1291J2197N015l4971l4568J8506O462K8040j0127j2450J3626K001k9086
22566e6646o6555N0663L7469m0527k8296M6894R334R619M5767l0280J9842n4819
22554e7535m7394L7507q012M150O3587N1453K775J6376k1135o4J1658j5534j0560
22541B7272j9865k5274k0098o1208J4365Q8575K8295R490J8726J2977L621l6801
22529D0075J489k8103n8282N4586q253m3039l7058O069L1265J9196p116j8780
$$ y = [26771, -13260, -45258, -42017, -61350, -76147, -64939, -68406, -68414, -72484, -83239, -108659, -52302, 34501, 2295, 20539, 100882, 136013, 116290, 69198, 56991, -443, -2931, 12776, 67400, 103740, 40328, 44834, 33941, -2682, -48059, -46141, -5849, -19953, -25529, 23466, 37532, -21291, -9094, -4079, -39050, -73618, -55112, -48650, -20610, -30737, -43187, -29561, -27560, -56646, -123201, -72538, -35069, -75596, -103892, -56998, -47664, -38045, 7722, -22558, -2716, -57535, -104929, -67422, -75434, -71284, -7697, 43756, 46531, 62907, 41772, 41708, 53366, 37832, 27272, 7407, -17867, -37965, -99173, -84808, 3767, 32062, 41552, 60278, 73255, 76876, 40075, 41564, 13461, -44821, 9765, 1512, -41527, -78585, -72516, -41251, -22055, -29171, -47951]
22517d7951j0560j5768m3456M5195M6236l183l156K7685L9451J7312J6708P704
22505G6217m1686k7252j3903L3615L9448l6882k3961k126M5425l09n8346j5726
22493b5486l2901l0944O4355K767J0562q576L4442O0071l1966p9944o140m0898
22481h4658M059K3532M2390K097P558k1937K5051J0678j2237K2501M0369l2838
22469B6565k3940L1141K8769l7354m1235m5233m3518N1364N065J8899j5408n588
22457e0473j8846j8089L640j5024k4008Q9804M3782l8102n3032K8224K7471k4914
22445d9567m3819m263N0647J2423K947m9070j2550M1526P356l4966k5171l7931
22433a42438M3869O5968N0485l5548m1583J8764p598K7129J6896K8278Q4805m6375
$$ y = [-47951, -58511, -74279, -117735, -72540, -26304, -29487, -32643, -4958, 34493, 51805, 68513, 76217, 34531, 7279, -6624, 26991, 66439, 29557, 5596, 3470, 48895, 48586, -9760, -25486, -58387, -89331, -24976, -22209, -11647, -20223, 14219, 74290, 42324, -37620, -43760, -84658, -80599, -57067, -14677, -12580, -5022, -26959, -1908, 8770, -3467, 19034, 59403, 26565, 2625, 33766, 62535, 25181, -16054, -61287, -104805, -53441, -48376, -29477, -44885, -50473, -69319, -87408, -83768, -98792, -122800, -32996, 10786, -27316, -80348, -52124, -24653, -49567, -93386, -97649, -47002, -34579, -31632, -80702, -93252, -51726, -44370, -79336, -104507, -142438, -98569, -32601, 17884, -17664, -59247, -40483, -48081, -20952, -4056, 24222, 109027, 62652]
22421F2652p099j7654m9664J7983J2662m0142L7637K8813l1083k0369M267L5297
22409C3300J9430p8656j2240N7523j6080j9255O378k6059j860J7540J5152L6309
22397C1482M6250l8487r2025m9909l843O402P7742J6848k2271k471J6813j4161
22385b7630l4248K4804K6433k224p431L9939o326r3578k9133j023K9832L8088
22373d2497L7025K1436r61J7275k5996j7046k2801J9585l2451n0303k4545J564
22361a19715L5203K4464L2577O6405N7445j7910j9531m2647m7204m520O554L4932
22349F053J2287o2501m9151j1202j4386O8214M0193J5873L5464N474K1654M8806
22337A16778k4284m4344n6816O906q298J3629k7197n263P0369K3000p0208n4522
$$ y = [62652, 55553, 37899, -11765, 6218, 18880, -21262, 16375, 45188, 14105, -6264, -1997, 33300, 52730, -25926, -38166, 19357, 3277, -15978, -9600, -35659, -37519, -19979, -4827, 31482, 77732, 39245, -52780, -102689, -106532, -100130, -22388, -5540, -27811, -30282, -13469, -27630, -61878, -37074, -10641, -12865, -20296, 19643, 13317, -80261, -109394, -110417, -80585, -42497, -5472, 15964, 15003, 32278, 6282, -10764, -33565, -13980, -46431, -96734, -121279, -119715, -84512, -60048, -27471, 38934, 96379, 78469, 58938, 16291, -30913, -35433, -28879, 6053, 18340, -44161, -93312, -104514, -118900, -50686, -10493, 5380, 40844, 46318, 67972, 116778, 92494, 48150, -8666, -1760, -10058, 3571, -23626, -28889, 41480, 64480, -5728, -60250]
22325f0250M8214n2436k0090j6455N6236K5450k3449J4223L9998l102m1161J1921
22313b0901N6310J7422k8032l8517R109J7089o873n019j0135o85o0066q3908m9691
22300b03897L7583P5609K3894m8526j2325N5929L3185m4199N618Q861J114N6594
22288a0560l6049k7131J3555K0833o627o4097r391J7940M6484L6015J768l447
22276b0707K6077N8898m4813k3806L5033n459O555l6663l8963K8157L578l3381
22264d5494J5682o615M8764K7378Q857k3878m8881j8101K2567J6217J7350m1323
22252b7477m2614Q311n176M5700J8556k2215J946K617J8423j1343m1752N79J0152
22239d4293m6542J2078L6430J8895M8143J5813l5634j2959j4853M881J2621k6112
$$ y = [-60250, -12036, -64472, -84562, -101017, -44781, -19331, -42780, -28557, 11441, 8339, -32822, -20901, 35409, 52831, 24799, -13718, -4609, 12480, 5607, 588, -9547, -10232, -70298, -154206, -203897, -166314, -90705, -66811, -115337, -127662, -71733, -38548, -82747, -77129, -68268, -67154, -10560, -46609, -73740, -60185, -39352, -45979, -110076, -119467, -101527, -55043, -19028, -17260, -20707, 5370, 64268, 19455, -4351, 30682, 25223, 31778, -4885, -43848, -15691, -12113, -45494, -29812, -36427, 12337, 39715, 48572, 24694, -24187, -42288, -19721, -3504, 13846, -27477, -70091, -61780, -66956, -21256, -2700, -24915, -22969, -20352, -1929, -13272, -55024, -54445, -44293, -90835, -78757, -42327, -23432, 24711, 40524, 4890, -8069, -22922, -18041, -5420, -31532]
22227c1532k0197Q076Q008R3535N8589n8440m4960O525q7693k8608M2203L1123
22215b3371l2736P050k966m8303O6305R7034l8631l8627m59m9560j4051J6902
22203f1413P2738J1951o0399j5269O9052o227o767j8217L0694K3494J283K1170
22191F2090J0488p8191o6493K8050j8029K976N405Q38O378N6895k3049p3550k3396
22178a09588M8754M9598M7525m0232k4164K0595K4128j3033l055n733K5268O5158
22166H5221J2065n9917p8900j0563Q741K4817J7000k1332K6005l3851n4263K7481
22154e7496L4761k0678m0050Q85Q849J1842K0093o9941J8672R0204P6317L1694
22142A05152o6620j2328l1873l1818M6885K9731J0873P404l946k1917j4258j255
$$ y = [-31532, -51729, -43653, -35645, 57890, 116479, 58039, 13079, 19604, -68089, -96697, -54494, -23371, -56107, -49057, -52023, -100326, -34021, 63013, 24382, -14245, -14704, -64264, -78315, -61413, 11325, 23276, -37123, -52392, 16660, 10433, 3666, -14551, 16143, 39637, 40920, 62090, 72578, -5613, -72106, -44056, -62085, -59109, -53704, -52866, -46488, 10407, -12642, -86192, -109588, -60834, -11236, 36289, -3943, -28107, -7512, 16616, 3583, 528, -5205, 20063, 85221, 97286, 37369, -41531, -52094, -43353, -18536, -1536, -22868, 3137, -30714, -84977, -57496, -22735, -43413, -83463, -82578, -73729, -61887, -41794, -111735, -93063, -2859, 73458, 105152, 38532, 26204, -5669, -37487, 9398, 39129, 50002, 57406, 53460, 31543, 17285, 16030]
22130A6030M69k2658J3464L5733p164K0344m15l4540l8015p1101k3014J07278
22118c589P4396o868l8378o6677L2116R7438O80k5424k1938N614n1624k803j8901
22105b5958k0843j9148k5242J5699N756P4748Q0094J3653r930j3714R469r900
22093G4684m6585o6718M4742P8874J1597j4243m5754k4660K6411j507J2193K5664
22081G4698k0304k1205o6403O0108O0696K3084l6353m2317k5093o2562j4508j1200
22069h1359l810k7659M9645M7361M8806j3691k4885K2889L9045k2548L69l1649
22057B514n7361r523L7525j6717n997k1087J8750K2386N0609m0326k3230O157
22045c6300L1702L9171k8798l7231l8611p652K6075L3286L9392J6230k465k2432
$$ y = [16030, 16499, -6159, 7305, 43038, 35874, 56218, 55803, 21263, -16752, -87853, -110867, -3589, 70807, 63939, 25561, -41116, -9000, 88438, 89118, 63694, 41756, 47370, -4254, -7057, -25958, -46801, -65949, -91191, -75492, -69736, 5012, 85106, 98759, 88829, 75115, 84584, 74684, 28099, -38619, 6123, 84997, 96594, 82351, 36597, 11937, 38348, 36841, 49034, 74698, 54394, 33189, -33214, 26894, 87590, 110674, 74321, 32004, 6911, -55651, -70159, -81359, -85169, -112828, -63183, -15822, 32984, 19293, -5592, 17297, 56342, 33794, 34163, 2514, -54847, -64370, -26845, -43562, -49559, -70646, -51896, -29510, 21099, -19227, -42457, -36300, -4598, 34573, 5775, -31456, -70067, -77719, -51644, -18358, 21034, 37264, 34799, 12367]
22033A2367M2620j9120o7213k8058L7332J9057N0343k1432o6167k1228L3924j2780
22021d0355j8881O908j1967l6272m3237p2956N9812Q0440L1461l1750K2170O2314
22009G687M1746k9201J3074m8251j3895N5039J1385m3123n3759j7032m7467l8376
21997a62173O1986M1094M4443J3518n4724j7534L0245K045k512o758j7515m266
21985g2151L6441R036J6075r539L7195k8772j6710j6345k2833N1659N5405j8349
21973B1112l4523k2594M364j131J1879K2917j7910L3871J8604Q503q5768n1087
21961i1763M1871J6125N368m7791l0256J9458j6460K6230N194l5497N1264N0749
21949e508J8570q231J7503J514j9571O948j4244m966M2932J1567K4974n4007l5156
$$ y = [12367, 54987, 35867, -31346, -59404, -22072, -3015, 47328, 25896, -40271, -61499, -27575, -40355, -59236, -52328, -64295, -100567, -143804, -216760, -156948, -76508, -45047, -76797, -54627, 7687, 49433, 20232, 33306, -14945, -28840, 26199, 37584, -5539, -59298, -76330, -123797, -162173, -100187, -59093, -14650, -1132, -55856, -73390, -43145, -41100, -43612, -50370, -67885, -72151, -35710, -26674, -10599, -20138, 17057, -11715, -28425, -44770, -67603, -15944, 39461, 21112, -13411, -36005, -31641, -32772, -20893, 2024, -15886, 17985, 36589, 45092, -40676, -91763, -49892, -33767, -28399, -76190, -106446, -86988, -103448, -77218, -72024, -107521, -56257, -5508, 13062, 4831, 22334, 23848, 4277, 11225, -3019, -7985, 34947, 46514, 71488, 17481, -17675]
21936a7675j4672q075K1760K1063r430L786L6631o6886m3311P9158L2609k8195
21924F763O55K4735k9430r8736k3700Q8005J09673K4578p0743l0820Q9980k0086
21912G0874n7722j1291k7945Q232K5305O0239j020J0499k5427n3740o869m367
21900a3232j1211J7284k1381R858P9116K4095J5495j6269Q801M3321j5991n0663
21888F9223r46k1562l2384Q822j4106j9423n708n3232J2644J9298k9714l9707
21876a06795J4442O1184K3983K786n122L0801J9856J0261n0264m5222p21p43J3548
21863c2006L03J1627n8377n9280J4086P6861O5952p5741m6555m243L328L0081
21851g3964J5118l925J4555m547N906P130K4171K8518q5271K0345N0391K480N1289
$$ y = [-17675, -32347, -40422, -18662, 2401, -7029, -3243, 33388, -33498, -76809, 2349, 34958, 6763, 7418, 32153, 2723, -96013, -119713, -31708, 77965, 102543, 31800, 980, 90960, 70874, 13152, 1861, -26084, -17852, 7453, 67692, 66672, 77171, 51744, -1996, -8865, -13232, -24443, -7159, -28540, -18682, 60434, 84529, 100024, 83755, 92556, 135877, 119886, 69223, 68277, 46715, 14331, 23153, 9047, -10376, -16084, -69316, -56672, -37374, -67088, -106795, -92353, -31169, -7186, -4400, -9522, 21279, 41135, 51396, 1132, -44090, -44811, -45554, -32006, -31703, -20076, -78453, -137733, -123647, -46786, 19166, -56575, -103130, -107373, -104045, -73964, -58846, -62771, -48216, -52763, -46857, -39727, -15556, 12962, -72309, -51964, -1573, 907, 52196]
21838E2196L1399m8231k5488j3755n7940L5012M3811M6967k1616j7265k072k7959
21826d941l488P86K1207k1000k2018n1084L7529M544j6080o4785L1895J8917P745
21813f0773k2335M3304l5433k5279L2934K5654K5635Q63p421K1229K1744J311
21801B1433k8560m8706j655k7327k1000J1712O5190O9432p482n7872j7811k9080
21789g1726K5407K3622m5376J1871j685J6129J1654K6175L1615J1078l7239j1284
21777i759j7894L0615j1636m3348L5350l9952j718M9675N927m8215k6871m847
21765h2673O140N7580L2600k6283K7899O2189P654j1146m2069n2023j0146k3057
21753e3335j7511Q5042j1674p7525k3084N1088O5727j674m1168l7376K0447J2381
$$ y = [52196, 83595, 35364, 9876, -3879, -61819, -26807, 17004, 63971, 42355, 25090, 23018, -4941, -8429, -7643, 13564, -7436, -29454, -80538, -43009, -38465, -54545, -119330, -87435, -68518, -60773, -83108, -39804, -75237, -100516, -67582, -41928, -16293, -15430, -22851, -1622, 20122, 21433, -7127, -55833, -57488, -84815, -105815, -94103, -28913, 40519, 33037, -24835, -42646, -71726, -46319, -22697, -68073, -56202, -57887, -41758, -30104, -3929, 27686, 38764, 1525, -9759, -27653, 2962, -8674, -52022, -16672, -56624, -58342, -8667, -2740, -50955, -77826, -82673, -76533, -18953, 13647, -12636, 15263, 77452, 85106, 73960, 31891, -20132, -30278, -53335, -70846, 14196, 2522, -75003, -98087, -46999, 18728, 17054, -24114, -61490, -41043, -28662]
21741b8662J1649M135M0314k0320q4193n7900N594p06R145n73K0797M7420M1999
21728a1301K8036M7977K467K950l2540m3802j0425j8577r63L5559P641k0086m924
21715a7988k9928N494L0142m346m269M6064J3485l7312r126r250J7691P0059P461
21702G8177p7305q5311Q553K0999N6424j7311l8551J0447Q952L8731N1175J9807
21690G4787l5662m1519o6144R70J2237p6892J643P4466L4445m5010j2959j423
21678h1061K0435j3658Q2785N4547J3757l220n4128m3144J2665J9291K0194L4544
21666F3007o9065L241J2042l9662n4031O116m508j4956l8440k4737M8513J8340
21654i4140M9110M1757J81p6781m1465P6905P0696Q592J2705k1793o4269n8273
$$ y = [-28662, -17013, -12878, 27436, 7116, -77077, -134977, -129383, -130089, -120944, -121517, -100720, -53300, -11301, 16735, 64712, 67179, 70129, 37589, -6213, -16638, -35215, -36178, -619, 7022, -13064, -17988, -47916, -42422, -12280, -16626, -20895, 25169, 38654, 1342, -7784, -17034, 657, 70716, 78177, 872, -84439, -75886, -54887, 1537, -15774, -54325, -43878, -34926, 3805, 54980, 74787, 39125, -2394, -68538, -67568, -55331, -132223, -130580, -56114, -21669, -66679, -79638, -81061, -60626, -74284, 8501, 63048, 76805, 73585, 19457, -23687, -11022, 8269, 28463, 63007, -6058, -2817, 9225, -30437, -84468, -78352, -82860, -97816, -136256, -160993, -112480, -94140, -45030, -3273, -3092, -79873, -121338, -44433, 26263, 34855, 47560, 25767, -38502, -96775]
21642i6775K1829r723R39K4427L152j9690K4856L0858j3964l9490N0693n707N049
21629b3546k3326j3805L257J1105r555n349M8704L7221r161N960k4322k6502q765
21616c8084N8489j14p8475m0328L7340M089K6500O2283l6175l4959p095j8722
21604f5251j8745o038n750L2553L610j2722M3762O965j9356l7756j2286J7731
21592g3283K9846l4097J8877N6049M598J7285k6908J3422K0824m6490k8526L812
21580d4591m326Q28N4177K1041M1695n821k5888j6778j22919n7890P0189Q5897
21568d386l9292p3974j9768l952L4696Q4817j2825r764k1615j5131M5971J2607
21556b2616N5237o548J5743L2845j7269j3119k5566j9618K9582o834J8611L6086
$$ y = [-96775, -74946, -84669, -83730, -59303, -56151, -75841, -50985, -20127, -34091, -73581, -22888, -28595, -23546, -46872, -60677, -57420, -46315, -55870, -61219, -12515, 24706, 15545, 21505, -2817, -29319, -38084, 20405, 20291, -58184, -98512, -61172, -57083, -30583, 31700, -4475, -39434, -46529, -65251, -83996, -90034, -95784, -63231, -59621, -72343, -28581, -21616, -40972, -78728, -91014, -73283, -43437, -77534, -58657, -2608, 1990, 19275, -7633, 5789, 26613, -19877, -48403, -44591, -48917, -48089, 6088, 27129, 68824, 63003, 37115, 20337, -102582, -160472, -90283, -4386, -43678, -117652, -137420, -141372, -106676, -21859, -34684, -44448, -66063, -81194, -35223, -22616, 32621, 26073, 41816, 74661, 57392, 44273, 18707, -911, 28671, 21837, 40448, 76534]
21544G6534k5835j1562l980J1183j4125L8487N561n001n9040o5105n2087L429
21532a01541M8991J9578J0818l9087l2641J3731O726M4278N681j1440j308m1052
21520g7266n8806k1989M9192N4418J2823k3321M9850L2273o0094j8076L5291O980
21508a8725l2618L1864M9605l3162O633K3524r542m3041m0441M930O3588J1810
21496A4425n0530N277m554k7278n1L8665Q318K0793J4162L9144K731j3265L3727
21483H1564m266l5973k7491l9936L3980j5732k7563J1027k014L8949N1373m1299
21471B2619l5034j2408J1483N0463j835m9391K607q891L0733j9296n020J375M3333
21458C0738J2283m2964L5876O214J2739n2719m7794N287J8981M1738K0045J2041
$$ y = [76534, 50699, 39137, 35157, 46340, 32215, 70702, 76263, 71262, 12222, -52883, -104970, -101541, -52550, -32972, -22154, -61241, -93882, -80151, -73425, -29147, -23466, -34906, -36214, -77266, -136072, -158061, -108869, -54451, -41628, -64949, -15099, 17174, -42920, -60996, -25705, -18725, -51343, -19479, 30126, -3036, 3597, 27121, 17579, -25462, -65903, -60973, 2615, 14425, -36105, -30828, -35382, -62660, -62711, -24046, -15728, 5065, 19227, 58371, 61102, 47837, 81564, 77298, 41325, 13834, -26102, 7878, -7854, -35417, -24390, -26404, 12545, 63918, 22619, -12415, -24823, -13340, 37123, 35288, -14103, -11496, -20387, 10346, -8950, -13970, -12595, 30738, 43021, 57, 35933, 42147, 54886, 2167, -45627, -40340, -21359, 20379, 40424, 52465]
21446E2465K107k8267l3238j8431K9248L1904J5978n7725j738K7891q3284m7571
21434a10661J0543J8322K3704O5915n163m4956m0043K3958M9593J7541J8044k406
21422B4391j7115m1468j5629O5669K241k5051j4928k4955l2764q0848m5480P5473
21410a30464R7222k5167m1725Q489K1999L5011J2601K6160K7427J0619j1979p7757
21398d7564m8799j2630M6643k2908K3772J2283M9585K6240m1200n1680l4769L8109
21386f2918n460n945L3391M4806r70Q846l742N1006l5609n2967J4063R0766n508
21373F9759l7476L9063k2557p1583l269J7339j2911p2092j7722l5054O1433J02794
21361A7724M8503J2568j6979o5538k5334J8780J5236K0589O242O814l5924K333
$$ y = [52465, 54572, 26305, -6933, -25364, 3884, 35788, 51766, -5959, -7697, 20194, -63090, -110661, -100118, -81796, -58092, 7823, 2660, -42296, -82339, -58381, -8788, 8753, 26797, 24391, 7276, -34192, -49821, 15848, 18089, -6962, -21890, -46845, -79609, -160457, -205937, -130464, -33242, -58409, -100134, -91645, -69646, -34635, -22034, 4126, 31553, 42172, 30193, -47564, -96363, -108993, -62350, -85258, -61486, -49203, 382, 26622, -14578, -66258, -101027, -62918, -68378, -74323, -40932, 3874, 2904, 11750, 8008, 59014, 23405, -29562, -15499, 75267, 69759, 32283, 71346, 48789, -22794, -26063, -8724, -21635, -93727, -111449, -146503, -85070, 17724, 66227, 78795, 61816, -3722, -29056, -10276, 4960, 25549, 31791, 38605, 2681, 5014]
21349E014J6250K0741l0554k5428n0858R281N7613K1262L0297K9537K3306o6834
21337C9627n1428L1140q0867J5010j2467L1077L0126o8898Q317L1335J7328j4952
21325b4652M7550L8451o0023q2113l6102K7381j144k4399N1419O5056m2989j6174
21313e7739j729J102j2871K801P780p059K0990K9342j0873m2098L6262O5450J4786
21300D6144n4336m5621K2842k0069m704N333J5693K3946J2128J7882O1514j4780
21288F5972p27Q467o1315n2028R372M9115J860J7262l3592m398j8090j7676l7984
21275g3762l8832J2216L7194M0240K2423J5481O8557j2868l9000L5055j5577R406
21263F0533K3524l840l0117l2646o771J8572K0761j9766j4778m6717K0304K3356
$$ y = [5014, 21264, 42005, 11451, -13977, -64835, -55554, 2059, 23321, 53618, 83155, 106461, 39627, -11801, 19339, -61528, -46518, -58985, -27908, 2218, -66680, -58363, -27028, -9700, -24652, 22898, 61349, 1326, -80787, -116889, -89508, -90652, -115051, -63632, 1424, -41565, -57739, -59468, -58366, -71237, -68436, -60656, -67715, -46725, -17383, -28256, -70354, -34092, 31358, 46144, -8192, -53813, -30971, -51040, -55744, -50411, -34718, -10772, 1356, 19238, 80752, 65972, 65245, 73712, 12397, -39631, -30259, 18856, 20716, 37978, 4386, -12, -18102, -35778, -73762, -112594, -100378, -63184, -22944, -521, 14960, 83517, 70649, 31649, 66704, 51127, 60533, 84057, 80217, 50100, 17454, 10683, 29255, 50016, 30250, 15472, -31245, -10941, 12415]
21251A2415J9641P560O230j7735o6023R573O7475M8883J0036j0635m4418k0037
21239B2965J0757L1153l2102n4163L1228Q2665O889n9795j06651k1341J9890R249
21227e9256K0345K1683n1182m6229L8117m1511l5877P9344N116j4139K1797L5410
21215b6382L3409N624o6946K6632L2838N17n82l8520J1289K117K6536K1620m4714
21202a6562o4139L2034K1829L2657j87J5296m653O6777n7476r843J3939L261n381
21189B7552n2162J3114m0583m2330M8500P6797l4339n2577n9276K1242M5777j0704
21177e8989l2239q968j8740L5873j440l4944l6547R039M1478N7815L6378K1370
21165A0086l7233K6847q4163N171L0122P395q507j2304J5070J5763j0779K2591
$$ y = [12415, 32056, 39616, 45846, 28111, -37912, -28339, 39136, 88019, 98055, 87420, 43002, 22965, 33722, 64875, 32773, -21390, 9838, 92503, 99392, 39597, -67054, -88395, -68505, -59256, -38911, -17228, -68410, -114639, -76522, -118033, -153910, -74566, -69450, -83589, -61792, -26382, 7027, 12651, -54295, -27663, 5175, 5692, 5110, -33410, -22121, -20004, 6532, 28152, -16562, -80701, -48667, -26838, 5819, 5632, 20928, 16275, 83052, 25576, 15733, 29672, 32933, 27552, -24610, -11496, -52079, -94409, -45909, 30888, -3451, -56028, -115304, -94062, -48285, -58989, -91228, -100196, -118936, -83063, -84503, -119447, -155994, -146955, -105477, -47662, -11284, 10086, -27147, -300, -84463, -79292, -49170, -41775, -50282, -62586, -47516, -31753, -42532, -19941]
21153a9941K602J8548L2771k2418K1935m7759j8046j1650K8637N3562L0206J7340
21141H5787n0087l9940k2664k7414m0132N5583P6469J4977m7755m3826J0159r565
21129c8408R506K306k5634J4327L2423j5165m0089o126o381R1044m7641p7468
21117a07306L6509L7162J9504M6312k1368k7080m1622m2601L4912r434k453K6590
21105e0875K8686l5054n2648R489N1814L2497l6666L5023n137l7293k2443k6148
21093a08755N1215P1198L6067k4732K304p013k2843J0308J0999N843n011m766
21081A4814M5722j0280j2455L7726k3383M1753K4612k0334J3103n0446l9106L1573
21069E3299J346m8894J6870K4697n494k1782j7989n2262l9284Q761P7392K9463
$$ y = [-19941, -17339, 1209, 33980, 11562, 33497, -14262, -32308, -43958, -15321, 38241, 68447, 85787, 35700, -4240, -26904, -54318, -94450, -38867, 37602, 52579, 4824, -39002, -28843, -38408, -28902, -26596, -52230, -37903, -5480, -20645, -60734, -66860, -73241, 17803, -29838, -107306, -70797, -33635, -14131, 32181, 10813, -16267, -57889, -100490, -65578, -75012, -77465, -50875, -22189, -57243, -109891, -100402, -48588, -16091, -52757, -17734, -22871, -60164, -82607, -108755, -57540, 13658, 49725, 24993, 27297, 20284, -2559, 7749, 18748, 24591, 19580, 14814, 60536, 50256, 37801, 75527, 52144, 93897, 118509, 98175, 111278, 60832, 21726, 53299, 54645, 5751, 22621, 47318, 41824, 20042, 2053, -50209, -89493, -80732, -3340, 26123]
21057B6123O966n361J8500k7179p5356k7584K3690O3929j7382m3685o7285o234
21045a30858K7914r400J9629L9386O9937M7978p31l9279l8934M3315j2467o06
21033A5884K4918l085l2412k4280k78M4194j4914r60k0617l1798j1689J7092N2286
21020A4341L266K2751J0630j1989q640l0889L5547m3987p5764K4978L4330j7824
21008d3250m4378j2121N5826Q7133J4532O873K080J2608l0999q005M1004l0390
20996E0913k9424j0371k2566j3308m503j9831m594J0040O9000K0828K9214J1117
20984H6515j6298k2825K1352J1894l8652j20118L0360O6860j7973L302k6441j4858
20972c6882m4410m6055J39Q3851K3490j8078l9664J2598Q620N3337L0026k2007
$$ y = [26123, 33089, 27728, 46228, 19049, -56307, -83891, -60201, 3728, -13654, -57339, -124624, -130858, -102944, -112344, -92715, -53329, 16608, 64586, 63855, 24576, -14358, 28957, 16490, 15884, 40802, 37717, 5305, -18975, -19253, 24941, 10027, 9067, -11550, -43348, -55037, -37945, 14341, 17607, 40358, 50988, 38999, 30359, -530, 35017, -8970, -84734, -59756, -25426, -43250, -87628, -99749, -43923, 43210, 57742, 64615, 66695, 79303, 48304, 40299, 81303, 50913, 21489, 11118, -11448, -24756, -29259, -49090, -53684, -43644, 25356, 46184, 75398, 86515, 70217, 47392, 68744, 80638, 41986, -78132, -47772, 19088, 1115, 4417, -22024, -36882, -81292, -127347, -127208, -43357, -19867, -37945, -77609, -65011, -56391, -3054, 26972, 4965]
20960D965l7651J9750l5930J8780L2806J4575k60p063K3113p458k7260m498N5118
20947D8987K7143p1550l8703k7146J6967j7180N7217K1445K5021R293N9088k0587
20935H9995l1041k8999j3366L9614k9495o3925n441K3679k2498j9082L3826L7794
20923A1061N7178j02883m3776L8043L5024l946n9985k8318N3182N4537k3207j8133
20911c1223j0107N154L2005o1166l0609k7667O4660P3026l3969o922M8363L1819
20899E3364n7665k9978j1471p7159l4692O2960Q430K6656O549K5343K8519l7483
20887c6627n4017N3980J8147L1175M2146k9921n2762k9276j7567n7509l033K6717
20875a08547O293L2559O0719P4134j2846k8658l9170M8376m749n4692k3997j2100
$$ y = [4965, -32686, -12936, -48866, -30086, 2720, 17295, 17035, 9972, 33085, 25627, -1633, -6131, 48987, 76130, 4580, -34123, -61269, -44302, -61482, -4265, 17180, 42201, 51494, 110582, 89995, 58954, 29955, 16589, 56203, 26708, -37217, -42658, -18979, -41477, -60559, -26733, 11061, 68239, -34644, -78420, -40377, -5353, -9299, -69284, -97602, -44420, 10117, -13090, -31223, -41330, -36176, -4171, -65337, -95946, -123613, -58953, 14073, -19896, -26818, 21545, 53364, -4301, -34279, -45750, -122909, -157601, -94641, -86211, -59555, -53006, -27663, 856, -36627, -90644, -36664, -18517, 12658, 54804, 24883, -27879, -57155, -74722, -132231, -135264, -108547, -102254, -69695, -8976, 65158, 52312, 23654, -15516, 32860, 28111, -26581, -50578, -62678]
20863f2678J8510K7548K1391k344J6558N5873L3578n6942o5184J7626l144N2236
20851E3028Q492m2575J9860R427R253j1866k3913k0066m9162L737k033K8786k3402
20838d0434k6090N5833N7491l8422n9403L278J1746K253J6625O0496J7414o9060
20826h273l3441l179J3096J0207l2461M4813J726m0576o181p720n81K3149l0631
20813g0052k5813O26P300K5701K6430m3209m1152j3188M6389M1331M303k07J0797
20800c0744M1764M9602L674N425m0101j5732j7091R310k6561m9911J0928J1235
20788d8202J5855l784m3800m2237k4696L8791j185o773M0233K8597K8076k9981
20776d9106l9504l5623K8427L5213N400O2369q735M5097j5965j1334L0749m1231
$$ y = [-62678, -44168, -16620, 4771, 2427, 18985, 74858, 108436, 51494, -13690, 3936, 792, 53028, 61520, 18945, 38805, 48232, 57485, 45619, 21706, 1640, -47522, -43785, -45818, -17032, -40434, -66524, -10691, 46800, 8378, -51025, -47747, -36001, -33748, -17123, 43373, 60787, -8273, -41714, -44893, -31797, -21590, -54051, -9238, -7512, -48088, -54269, -61989, -62570, -39421, -70052, -95865, -95239, -87939, -62238, -35808, -79017, -120169, -133357, -86968, -45637, -41334, -41541, -30744, 11020, 60622, 64296, 69721, 29620, 13888, -3203, 6107, -20454, -70365, -59437, -48202, -32347, -36131, -79931, -122168, -146864, -108073, -109258, -116031, -75798, -47201, -19125, -49106, -88610, -124233, -95806, -60593, -55193, 7176, -1559, 43538, 27573, 16239, 46988, 5757]
20764E757r5343L0582L0076J1495l3680k0691R4430K983o6993n1387K4158n0495
20752a19108j5617P2329k3335k9669K7222l301l2073N221M2820J02780M7344M601
20740G9214M249j9341J706p412L2409K2099n7443o4524k450P773j9787n1401j9984
20727i4892O1594P1833j0295m4404l7071n292O8045J3693l9618k4034j2900P153
20715d6188j2082N1522l3940n7312L5124K8597K7967j6880j5886j9976j1296J5751
20703e4599k4031J9521J3052m0676N2646O6488J9295k4187k6064r108J00503K6477
20691A19317m3373p91q0461k6426K4952n7724r236q642L0376L2565K4752m3159
20679c7850p6855O859M4660L8236J6523n0280o649M4477m644j6646L6614O349
$$ y = [5757, -89586, -59004, -28928, -17433, -51113, -71804, 22626, 25609, -41384, -92771, -68613, -119108, -134725, -62396, -85731, -115400, -88178, -91479, -123552, -118331, -75511, 27269, 74613, 79214, 83463, 64122, 65828, 58416, 90825, 112924, 55481, -9043, -11493, -3720, -23507, -74908, -94892, -33298, 38535, 28240, -16164, -53235, -58527, 9518, 23211, -16407, -40441, -53341, -46188, -58270, -6748, -40688, -98000, -62876, -34279, -6312, -23192, -39078, -59054, -70350, -54599, -78630, -59109, -46057, -86733, -34087, 32401, 51696, 27509, 1445, -7663, 92840, 119317, 75944, 75153, -5308, -31734, -6782, -64506, -73742, -82384, -52008, -19443, 5309, -37850, -114705, -107846, -63186, -24950, -8427, -58707, -65356, -20879, -25523, -42169, -5555, 794]
20667G94J1167j0896L3934j5869q464J0336J3151n1755P262K1774o0166j5306
20655f4038M9272J4063k3277j0436K348J1514k1403l1156M345k7641q8294M9512
20643a35191R0889J5265m182Q340m7903m3627J594P6081K3244K3189N293j06542
20631i3550L8654O9041l0743m9676O951R706L2253o421q777j9731L2737j1671
20619c1227q522l1314L8164K2430p9288j8445K5321L4043J3057J7809N2049j8729
20607A5348N8r0110m6237N6878L3535K2830J4653K1220Q962n5424q0490K5489
20595g3288J1142P9825J5444p0263r580k1413J8378N5092J1032j6944L0269M5602
20583G5296k2530J5875P836l5227J5100M2131L2088r588k4167l500o247m7802
$$ y = [794, 11961, 1065, 34999, 19130, 10666, 21002, 34153, -17602, -10340, 11434, -48732, -64038, -14766, -703, -23980, -34416, -32068, -20554, -41957, -73113, -68768, -96409, -184703, -135191, -44302, -29037, -33219, -24879, -72782, -116409, -114815, -38734, -15490, 7699, 12992, -93550, -54896, 14145, -16598, -66274, -59323, -49617, -17364, -23785, -32562, -52293, -19556, -31227, -39749, -71063, -32899, -10469, -89757, -108202, -82881, -48838, -35781, -17972, 34077, 15348, 15406, -74704, -120941, -64063, -30528, -7698, 6955, 28175, 37137, -18287, -98777, -73288, -62146, 17679, 33123, -37140, -46720, -68133, -49755, 5337, 16369, -575, 29694, 75296, 52766, 68641, 76477, 41250, 56350, 98481, 130569, 120981, 96814, 93314, 87067, 39265]
20571C9265p8985o2745K4556L3977K6660J5267J7734j3192j6126J5325K4488k1678
20559D546L495J5981K5855l3880n3118j0632K3480O1211k7347q8516K0376P8833
20547B0284J6660p397L2105J2375j1683K3039p7970n3638L5582k4062J7102j5225
20535c2828n4838J8831m367M4572M6322p338m1760j3580l496l4458Q476M7297
20523b7167o707l4385J551L3014K5170M0061n0306m7404O919N236K6380L4804
20511G166P0063l5371r4599p2208J8467K300k1244J3743k6022l43M4303K5231
20499f8514K6622N8492J1752k0572k0337m5354K820L5777l3859K4024k0721j813
20487e1683n253K0146J0284O469l5449j5655R25O3865M6969k7490m8645l754K0800
$$ y = [39265, -39720, -102465, -77909, -43932, -17272, -2005, 15729, 2537, -13589, 1736, 26224, 4546, 8041, 24022, 49877, 15997, -37121, -47753, -24273, 36938, 9591, -78925, -58549, 20284, 36944, 29547, 61652, 74027, 62344, 85383, 7413, -46225, -10643, -34705, -17603, -32828, -87666, -68835, -73202, -28630, 17692, 10354, -31406, -44986, -48482, -82940, -74464, -27167, -33874, -68259, -66708, -33694, -8524, 31537, -18769, -66173, -59254, -54018, -27638, 7166, 77229, 41858, -52741, -124949, -106482, -104182, -125426, -111683, -137705, -138048, -93745, -68514, -41892, 16600, 28352, 7780, -12557, -57911, -55091, -19314, -53173, -29149, -49870, -51683, -56936, -36790, -26506, -20037, -55486, -71141, -70216, -6351, 40618, 13128, -35517, -39271, -18471]
20474a8471J3897m60K7443J6278M73l7651j8850Q103k7685j5480m851L7168O9933
20461D9847K6827j6052L5336l2278n7252k0963j7922m4188k4188K3837L3601J9924
20449b3471J7590k2077n4342K9720L2888O2461k2690l3991o957L756L0925J4927
20437B8739L2509j5769k3868m6737K2801N1584o3240m5989N2822L8835n7139k9249
20425e4701Q456k9365K7492o87J5978J3814L4593K852l6529J5942k5153O177K0008
20412a123o347M5702k8388n0663k4834Q722J2765J5998k0880k6921N5200J3787
20400f982l0838k6246n938R443K4490N5464J4570p13P139m1717L2647J5505l851
20387D2973l1459O587o541p5980l8270J8007j073M5421K3642l0768K7774K2536
$$ y = [-18471, -4574, -5034, 22409, 38687, 39160, 1509, -17341, -9238, -36923, -52403, -57254, -20086, 49847, 76674, 60622, 95958, 63680, 6428, -14535, -32457, -76645, -100833, -76996, -43395, -23471, -5881, -27958, -82300, -52580, -19692, 42769, 20079, -13912, -20869, -17113, 13812, 28739, 61248, 45479, 21611, -25126, -2325, 49259, -13981, -59970, -7148, 31687, -25452, -54701, -46245, -75610, -48118, -48805, -32827, -19013, 15580, 18432, -18097, -2155, -27308, -21131, -1123, -7470, 38232, 9844, -40819, -65653, -56931, -44166, -28168, -49048, -75969, -20769, -6982, -37820, -64066, -70004, -60561, -36071, 19393, 33963, 33250, 40389, -1328, 31319, 46824, 42973, 11514, 18101, 11560, -64420, -102690, -84683, -85756, -40335, -16693, -47461, -19687, 2849]
20375B849p576J6045m6367K0720L9731J473K2874k2527j9911P2025M1632n6991
20363F3977n6279N3060J9428o2568N1698l2854o4532o410M3663L2700j4185n3829
20351b6131k2106K0019n387M791J0029k9204j925J6402L6119L00n5766J6703Q2252
20338D6096r438k4207l6602L1546K9730J068k7419m075k7007m3426j2985M3906
20326c2813m7839k1388O3460K5741J5625N0318j5836k011l8342p6967P0579L9300
20314B9827K362n5403k2629O77n398j3915k9932p242L3358M0219K3831K3445q812
20301A0388m3679l948K5977L2375k282k0603J3843o5029J0369L0603n165n199
20289b2350N879j8434Q1654L3850l9421k4292n8932l7754M372J0907j3092k4189
$$ y = [2849, -4727, 11318, -35049, -14329, 25402, 26875, 49749, 27222, 7311, 79336, 120968, 63977, 7698, 60758, 80186, 17618, 69316, 36462, -28070, -34480, 9183, 41883, 27698, -26131, -48237, -28218, -33605, -28814, -18785, -47989, -49914, -33512, 2607, 2907, -52859, -36156, 46096, 36658, 12451, -24151, 7395, 37125, 38193, 10774, 6699, -20308, -63734, -76719, -32813, -80652, -102040, -38580, -12839, 2786, 53104, 37268, 35257, -3085, -80052, -9473, 29827, 32189, -23214, -45843, -45166, -50564, -64479, -94411, -101653, -68295, -28076, -4245, 19200, 10388, -33291, -37239, -11262, 21113, 18831, -1772, 12071, -52958, -42589, -11986, -17151, -22350, -16471, -34905, 46749, 80599, 41178, 16886, -42046, -79800, -75428, -64521, -77613, -101802]
20277a01802j3742M1578L8061K3344J3117j2513k0342k8725J1332M6881m3007
20266d5818k2016K6080O1664L0215o4095m4072P298n711k4591l0658N716L9229
20254f6759L9264K0769J3184M8953J3494l5713j7243q096L6726N9563K3680k2020
20242A05802l476p9290r4593K7092K9897O7639K9006j2063n1659L0791q336m031
20230C6779n8659k4279M1114j1506R70M0506K5089j1030k2331N0165l7530k4481
20218D807j2082m3055M4472K5785k1855j8036M1112k3838O7898J0120m8597k6419
20206C12k0878k9749N453J2846K3592J5012j5662m7853p5727K6534L9165K9681
20194c7274O2802K6884J4457j9349k2097n978k7493l2448j9704L3477R694N918
$$ y = [-101802, -115544, -73966, -35905, -12561, 556, -11957, -32299, -61024, -49692, -2811, -45818, -67834, -41754, 19910, 50125, -13970, -58042, -50744, -56455, -81046, -111704, -105988, -66759, -27495, -6726, 6458, 55411, 68905, 33192, 15949, 7853, 44579, 104142, 127822, 105802, 102326, 23036, -71557, -44465, -14568, 53071, 82077, 70014, 18355, 49146, 40810, 36779, -21880, -46159, -5045, -16551, -15581, 24925, 50014, 38984, 16653, 66818, 29288, 4807, -7275, -50330, -5858, 19927, -1928, -19964, 21148, -2690, 65208, 75328, 26731, 312, -20566, -50315, -44862, -32016, -8424, 6588, -9074, -56927, -132654, -106120, -66955, -37274, 25528, 52412, 66869, 47520, 25423, 19445, -8048, -40496, -60200, -26723, -17029, -11111]
20182a1111m5207j9955K3152L7779j8064j9846K8299M9908j9853n0756m0181J7614
20170f8221L7952J0232l9372k2333N5352J9306m842K1135N8064K6679j038n1463
20158D1451r584k7261j4340J9309N0244J6547J9097m4628o0010K1508m952J3113
20146B0494j3619j4516l3592N99m0973K5041N226r223M0865J2073j8013M3257
20134A7619M1716J313j3499p717j0926j1286J6166m1774p592j683n454j1060j4347
20121d8524j6252N1387j0475j0969j0798J5411K8325j5844j9057K7432l5882j8037
20109f3283n3707n0317M1320J0817L8116M1698k1873K6225J6332O353L3231l459
20097B1453J6131n562K712q511l3927k3359K9941k0966K175L1334l2716M195K406
$$ y = [-11111, -56318, -76273, -53121, -15342, -33406, -53252, -24953, 24955, 5102, -45654, -85835, -68221, -30269, -20037, -59409, -81742, -26390, -7084, -11926, 9209, 67273, 93952, 92914, 41451, 31867, 4606, -9734, 9575, 59819, 76366, 95463, 50835, -9175, 12333, 7381, 20494, 6875, -7641, -41233, -40634, -81607, -56566, -51340, -60563, -19698, -7625, -25638, 17619, 59335, 60648, 47149, 39432, 28506, 17220, 33386, -8388, -15980, -17663, -23117, -34177, -48524, -64776, -13389, -23864, -34833, -45631, -30220, -1895, -17739, -36796, -9364, -45246, -63283, -116990, -167307, -125987, -115170, -77054, -35356, -57229, -31004, -14672, -8319, 24912, 21453, 37584, 32022, 34734, 26223, -7704, -31063, -1122, -22088, -19913, 11421, -21295, -17100, -14694]
20084a4694R79K5720o5359j9994j1594k4200j8577L0076M6974J4614l6939p754
20072h0748M2309L9636M3868R994j17050o8152O3334M8500K1979k385o0697l9011
20060i8423K3260K2416k292J4051K387K1606L3427k7464l2188n3589k5082L102
20048a18789L0820J0692K1702L3143L0571n2941q182Q6218q679j9736J6378j9505
20036A692L4950J9281k9829j3666l6149J4010O1630m3273n2695l0963l1854J8232
20024h8634J5587l4027j7454L5200M1343o917P680Q826j4168M9874N8n0616N996
20011d7252M720j7805J9871J1196l1861l2349O1571R587n3811K7706K0004m1786
19999g0209L5388J6845r2328N792l6192j8052n635J6425O8437O4253J9356l1911
$$ y = [-14694, -13715, 12005, -53354, -73348, -84942, -109142, -127719, -97643, -50669, -36055, -72994, -80748, -38439, 1197, 45065, 55059, -61991, -130143, -66809, -18309, 3670, 1285, -59412, -98423, -75163, -52747, -55039, -40988, -38601, -16995, 16432, -11032, -43220, -96809, -121891, -118789, -87969, -77277, -55575, -22432, 8139, -44802, -52984, 33234, 24555, 4819, 21197, 1692, 36642, 55923, 26094, 12428, -23721, -9711, 51919, 8646, -44049, -75012, -106866, -88634, -73047, -107074, -124528, -89328, -47985, -54902, -47222, -38396, -52564, -2690, -2632, -53248, -47252, -42532, -60337, -40466, -29270, -61131, -93480, -31909, -22322, -76133, -48427, -28423, -70209, -34821, -17976, -110304, -104512, -140704, -158756, -164391, -147966, -79529, -15276, 4080, -27831]
19987b7831J4484K6119M9369k2008n2767m4664K2218M355k0900J2879k9563l6298
19975a04607j7708K5017J4332M2799O1885m0400J4637M7880K4065m8801o8573
19964d9474p027j4251l2193J5324k7949o147K7553K7378l5942m4070N8645m129
19952i2282R186K5698M229O322L206Q3078O1598N893k8961K5976J9849k9442k3070
19939G1280p219r976J7397l8353P069K3102O42J4369j3258n974j5847J5354j8175
19926D0411j8470j01P1059K1256j1454p574l4631l8936k2122k4867L0401K4010
19914B8982K2515o937o967r911k9607o659M9626o801k8603k2717k9347J0853q611
19901d4184n7660k3896M079Q102J5394K6474L0963J2073j6746n608J4283M6918
$$ y = [-27831, -13347, 12772, 62141, 40133, -12634, -57298, -35080, -30725, -51625, -38746, -68309, -104607, -122315, -97298, -82966, -40167, 21718, -18682, -4045, 43835, 67900, 19099, -49474, -56501, -70752, -102945, -87621, -115570, -121717, -94164, -66786, -102728, -146798, -88153, -92282, -83096, -57398, -53169, -46847, -43641, 39437, 101035, 106928, 77967, 103943, 123792, 94350, 71280, 64061, 54085, 71482, 33129, 40198, 63300, 63942, 78311, 65053, 59079, 43232, 58586, 40411, 21941, 21840, 92899, 114155, 102701, 95127, 60496, 21560, -562, -25429, 4972, 28982, 51497, 44560, 37593, 27682, -1925, -8584, 41042, 34241, 5638, -17079, -46426, -35573, -44184, -101844, -125740, -121661, -113559, -98165, -71691, -40728, -28655, -45401, -51009, -36726, 10192]
19889A0192l1645j5691m7599J812K8433P9311L340l0426m4239j1776j6918L4862
19877d0344O2771k9178J1755J5279m4387j349J7673k9576k1464k5684k5533J3273
19865i6764O5738N7271o870n0768n9061l8649K5068j7622k1914j528J5378p19
19853a30440J151J6950j909k4360N6348M7456j0726r510j368M361K1444J016j6403
19840d5990j1550L3826J7474J8594M3796l0270j0404m6879k7924K1509K7892N401
19828d525l3057k8139R988L7716j8599p370l0120J9213N0262L9970l6505r4123
19816i5289l2186j812m381L4735N5478J4502j8763k718L5932K2990K1398r643
19804B0243P205j9187K7859L6374n273k5624l0727L6891K3757m1774l1145m683
$$ y = [10192, -21453, -37144, -84743, -82931, -54498, 24813, 28153, -2273, -46512, -58288, -75206, -40344, 22427, -6751, 5004, 20283, -24104, -25453, -7780, -37356, -58820, -84504, -110037, -96764, -31026, 26245, 19375, -31393, -90454, -129103, -104035, -121657, -143571, -145099, -129721, -130440, -129289, -112339, -114248, -138608, -82260, -34804, -45530, -55040, -56408, -52047, -30603, -29587, -45990, -57540, -23714, -6240, 12354, 56150, 25880, 15476, -31403, -59327, -37818, -9926, -4525, -37582, -65721, -55733, -18017, -36616, -43986, -74106, -54893, -4631, 35339, -1166, -95289, -127475, -129287, -133668, -98933, -43455, -28953, -47716, -50434, -14502, 8488, 29886, 20243, 27448, 8261, 36120, 72494, 67221, 41597, 10870, 47761, 71518, 29744, -1401, -6084]
19792f084m1601L3321M6348k9206k7148K1861Q471j2061j3921j8795Q21R407K4476
19779d111J3324k1074J137N0189L2286M7648q983k7469l5322n4691m6209J6215
19767c7060k3436L6312J8385N5226l7485j1364L7155l2397p786K2868k0203L0889
19755C1104L8028j0817m2036l6190K1537K1111L3775j0709P345K6878j2250m7909
19743A9867P672j619l2778J1823O344m2657p1472J7037P1600L6041n669J5063
19731C1252l1500J4627N9369M112m3626J1502l6451k8868L309L1039J3897n3886
19719b5224m1328K8207L5539l2757P014L2535R787K9399j5977K1690P0233j0853
19707A08265l1476j6194l4107J3868j8876k1556J9385J2286J5284N273j9103j1957
$$ y = [-6084, -47685, -14364, 31984, 2778, -24370, -2509, 5962, -6099, -20020, -38815, -37994, -28587, -4111, 9213, -11861, -10724, 39465, 71751, 119399, 110416, 82947, 47625, -7066, -53275, -37060, -60496, -24184, -5799, 49427, 11942, 578, 37733, 5336, -2450, 20418, 215, 31104, 69132, 58315, 16279, -19911, 1626, 22737, 56512, 45803, 53148, 80026, 67776, 19867, 27539, 25920, -6858, 4965, 11309, -31348, -102820, -85783, -14183, 21858, 16189, 31252, -248, 14379, 73748, 77860, 34234, 45736, 9285, -19583, -16274, 14765, 28662, -25224, -66552, -38345, -2806, -35563, -28549, 3986, 13773, 43172, 27195, 48885, 119118, 108265, 76789, 60595, 26488, 40356, 21480, -76, 19309, 31595, 46879, 52152, 33049, 21092]
19695B1092O327k575n347l947m1743j1431l8726k2101L7298L2707Q0734Q228l9010
19682B1506o4650r373j0066j1206L0347J8999K5531N6386m8710q0224J9836J7902
19670c3722L3923L4869M6759L6946n8671j5073k0773L8121J1864K9200K384n312
19658A00515q305J2008k1714l0469j446k1316k0539l2216o066M1204k8803L3571
19646A6424N4528n6132m504P545J4403p182N94r245l4037J9100j9885J9649N6246
19633E7504J694j4298k806N338N807O044m236o8011j5847L1429j6704J9168J2816
19620A7898k1283l0081k1773p826J7483K3106O766N484j2856l0356j2693l0223
19608i6354J3834O9021l5350j9784K4950J360k0920J5J7487k8470J1487K7855
$$ y = [21092, 27419, 24844, 19497, 15550, -26193, -37624, -76350, -98451, -61153, -28446, 52288, 60516, 21506, -43144, -52517, -62583, -73789, -43442, -24443, 1088, 57474, 8764, -71460, -51624, -33722, 201, 35070, 81829, 118775, 60104, 45031, 24258, 62379, 74243, 103443, 105827, 100515, 92210, 104218, 82504, 52035, 50589, 29273, 8734, -23482, -29548, 11656, -17147, 16424, 70952, 14820, 10316, 17861, 32264, 25082, 25676, 16431, -17606, 1494, -18391, 1258, 57504, 59198, 44900, 42094, 47432, 53239, 59283, 55047, -12964, -28811, 2618, -14086, 5082, 17898, -3385, -33466, -55239, -63065, -45582, -22476, -15710, -10226, -23082, -53438, -66131, -96354, -82520, -13499, -48849, -68633, -43683, -42323, -63243, -63228, -45741, -74211, -62724, -34869]
19596c4869M2167K5242j2289j6606o6138L4498M7292J566m6441m4935r640l9446
19584a19599K2091Q8424Q8894j0967K2264l6459j5122K0158j5711J912J7376L4507
19572I7768q014k9825N78n9823K5854L9724K6553l0786k2739l355J8454P797M6741
19559A08927l184L672l0155m3352j4993N9284Q2291j1308L4275o0j3560J7916
19547A89753J9218m0862R9892J21800J07093J44293J69961J36363L4034q125r9217
19536H74203j43946q4727L9478J10872K63034K81989K33157J53825J33826K263
19526A863974j48767k34051k08079j80454j07814j4119K1609Q0806J23268J34753
19516A331126j4140j43494j42839j32032j44435j60925q6967j26233k8529k5641
$$ y = [-34869, 7298, 32540, 20251, 3645, -62493, -27995, 19297, 20863, -25578, -70513, -80153, -119599, -97508, -9084, 79810, 68843, 91107, 54648, 39526, 59684, 43973, 45885, 63261, 97768, 89754, 59929, 60507, 684, 26538, 66262, 92815, 62029, 39290, 35935, 54389, 62186, 108927, 105743, 109415, 79260, 35908, 20915, 80199, 162490, 151182, 185457, 185397, 171837, 189753, 208971, 168109, 268001, 389801, 496894, 641187, 811148, 947511, 981545, 973420, 874203, 730257, 645530, 685008, 795880, 1058914, 1340903, 1574060, 1727885, 1861711, 1863974, 1715207, 1481156, 1273077, 1092623, 984809, 970690, 992299, 1073105, 1196373, 1331126, 1316986, 1173492, 1030653, 898621, 754186, 593261, 506294, 380061, 351532, 325891]
19506C25891J857k1321k3689M1035l9204n9759m522j2133j8249k6711j837K0159
19494A81517o939j4622n2660l0560j9191L6116k5568j5597Q6251J4116m8270j2539
19482I2054k8441p083J6476m3733J2199O7394j656q5156l6309J0911J4411r991
19470A076j8725l0754k3982P7499J7927L2556J7637m8684j6188J1215P5465K8873
19458A23915K1024J8955J0821r066m506k8020l0797l5066m7662o221J5477l977
19446B4877K6921L1940P011j0522M852j4093J2025p438k2489J317N6960J4266
19434A25627n8750k4213k1820L5969O647J0300J3518Q413K6058j6305l7883L131
19422G0692j2357J4048j0787M327M7626j6171m0650n2960m4072K6561L7477J3616
$$ y = [325891, 327748, 306427, 282738, 323773, 284569, 224810, 220288, 208155, 189906, 163195, 161358, 181517, 174578, 159956, 107296, 76736, 57545, 93661, 68093, 52496, 138747, 152863, 104593, 92054, 63613, 56530, 73006, 29273, 41472, 108866, 107210, 22054, -14255, -3344, 11067, 1076, -17649, -48403, -72385, 5114, 23041, 55597, 73234, 24550, 8362, 19577, 95042, 123915, 144939, 163894, 174715, 165649, 161143, 133123, 102326, 67260, 19598, 13377, 28854, 24877, 51798, 83738, 90749, 80227, 85079, 70986, 83011, 75573, 53084, 54401, 111361, 125627, 66877, 42664, 20844, 56813, 63460, 73760, 87278, 95691, 121749, 105444, 67561, 70692, 58335, 72383, 61596, 65923, 113549, 97378, 56728, 3768, -40304, -13743, 23734, 37350]
19410C7350O6593K9746k5606o9027o0569J00954J02062k8488j15093o306M9436
19399H1052J7337p684m8106j8273J3030O1967L2190o1830M8830M6849m054m1525
19387A19783n1831l3105M52n163O705l7921M550P8584J539m4988J0857L2851N8763
19374A41076J6482J7778n4771r7642p9671K6688M1099L4720M9836p187q796M931
19362H4543k8049k4122k8145K2109l5265J7259Q037M645L5185j8209m9882p515
19350a9409K154Q919N5752K1131l5859n2241k5071M8732j316L4579O5538m0101
19338F2808J0893k474L3895j1263J7152k940K581j9958p576j445l128k7234K2153
19325G3464k753J607J6698J3144l6335l0761l7056p1957O1086P1346O6791L3843
$$ y = [37350, 103943, 133689, 108083, 39056, -21513, 79441, 181503, 153015, 37922, 31616, 81052, 98389, 90705, 42599, 24326, 37356, 99323, 131513, 69683, 118513, 165362, 161308, 119783, 67952, 34847, 35299, 30136, 36841, -1080, 3470, 82054, 83593, 38605, 49462, 82313, 141076, 157558, 175336, 120565, 22923, -56748, -30060, 11039, 45759, 95595, 88408, 79612, 84543, 56494, 32372, 4227, 26336, -8929, 8330, 16367, 21012, 56197, 37988, -11894, -19409, -17255, -8336, 47416, 68547, 32688, -19553, -44624, 4108, 2792, 37371, 102909, 62808, 73701, 71227, 105122, 93859, 111011, 108071, 110652, 90694, 83118, 81673, 78545, 51311, 73464, 70711, 72318, 89016, 102160, 65825, 35064, -1992, -73949, -12863, 58483, 125274, 159117]
19313A59117K7547l632n9771l5569R00l6448l7865K3220l6016l1866N8017L9567
19301F7201J6042j4448L4204O2119j5136o5103k0029J6774J7253j2567k5547M8312
19289A09075M1433O8705M911k8742j11063l1445r281L717L7030k5960N4260j9273
19277I3367m7886J7618O5152l3020K1592J171j8424J4941O08j4943l829j7548
19265G8799O205K0876J08434M2763J0287p725n4561J9710k7257o4235R425P0864
19253B13585N1586L0187k170o502l2044O564o866J5960j79p552L7549j5517l0222
19240B54379m7510p4920j4928n0309q734O4700l7140N2647O5938m1781j6335K794
19228A48801l7115K8863j5200j029p785o1089k6150k419M2184J14p079J1863k5724
$$ y = [159117, 186664, 183032, 123261, 87692, 88592, 52144, 14279, 37499, 1483, -30383, 27634, 67201, 83243, 68795, 102999, 165118, 149982, 84879, 64850, 81624, 98877, 86310, 60763, 109075, 150508, 219213, 224124, 195382, 84319, 52874, 43593, 47310, 84340, 58380, 112640, 93367, 45481, 63099, 128251, 95231, 116823, 117994, 99570, 114511, 115119, 100176, 96347, 78799, 85004, 105880, 214314, 257077, 267364, 259639, 205078, 224788, 197531, 133296, 142721, 213585, 265171, 295358, 293188, 286686, 254642, 261206, 254340, 270300, 270121, 262569, 300118, 284601, 254379, 206869, 131949, 117021, 66712, 57978, 122678, 85538, 138185, 204123, 162342, 146007, 148801, 111686, 140549, 125349, 124320, 116535, 55446, 29296, 26877, 69061, 69175, 62096, 73959, 48235]
19215D8235l1202p388L113L5643K0636k0495L7329J3571J6034m4939L3168K6963
19203A30668P983m682M3827k1273o9872r7286o6903j5098N1850J3601J822K4544
19191h19R734j930K6608K9957M527l2508L0108j7083n7821j5204J962N4830M1973
19178G4334K8926M3981l264P964N6683J25202J26908P5997J9701J9703K5454J206
19166F02795O8453Q9459P8772O0992J6922o487m3265q7639o2911J9735p547L5324
19154G64603N7073k697m0296j18636p3015n0779L046p929M5704J33411O3604R5634
19142H69723P4285R5907R7275K3315J5369Q3089Q0009O2931P0958P9024J20439
19131A672324J54552J82877J11823J27773Q2599J5071Q73J8161M2376K4795J4225
$$ y = [48235, 17033, 9645, 12758, 48401, 69037, 48542, 85871, 99442, 115476, 70537, 103705, 130668, 138651, 133969, 177796, 156523, 86651, -10635, -77538, -92636, -40786, -27185, -25363, -819, 8915, 6985, 33593, 63550, 68077, 35569, 65677, 48594, -9227, -24431, -22469, 32361, 74334, 103260, 147241, 143977, 151941, 208624, 333826, 460734, 536731, 556432, 576135, 601589, 602795, 671248, 760707, 839479, 900471, 917393, 910906, 867641, 780002, 717091, 736826, 729279, 764603, 821676, 818979, 778683, 660047, 587032, 536253, 539299, 531370, 577074, 710485, 774089, 869723, 944008, 1039915, 1137190, 1160505, 1175874, 1258963, 1338972, 1401903, 1472861, 1551885, 1672324, 1826876, 2009753, 2121576, 2249349, 2331948, 2347019, 2347892, 2366053, 2408429, 2433224, 2447449]
19120B447449L483k6047O2372Q6847R1143N7935M0332o8652p2896r2738r8042
19109B431186j11810n7810P6509J30849J73432J74175J41080O5476K6748k6480
19099C023355m7272m4604o2595p0147r7792j18159o2427n484k3990R1934J30962
19088B713781R3135m9009q9750m3401j51833k28193l02193k83878j78854j31834
19078A347971p5858q378N302q553L5777M2809j2014l1274n7533Q766k1609L8481
19066A263887K9004J0556K1998M9209Q1508J8891K8683P5231P4053J6527l052
19055A666495j9987R544O9274J48274J07293J03536L4499P8169J49195J34865
19045B481157J54189J73835K74340K72730L27650L94284N14352O06521O70874
$$ y = [2447449, 2450932, 2424885, 2487257, 2574104, 2665247, 2723182, 2763514, 2694862, 2621966, 2529228, 2431186, 2319376, 2261566, 2338075, 2468924, 2642356, 2816531, 2957611, 3023087, 3049835, 3023355, 2976083, 2931479, 2868884, 2798737, 2700945, 2582786, 2520359, 2514875, 2490885, 2582819, 2713781, 2806916, 2757907, 2668157, 2624756, 2472923, 2244730, 1942537, 1658659, 1479805, 1347971, 1272113, 1263735, 1269037, 1260484, 1296261, 1339070, 1327056, 1295782, 1238249, 1247015, 1225406, 1263887, 1292891, 1303447, 1325445, 1374654, 1456162, 1475053, 1503736, 1578967, 1653020, 1669547, 1666495, 1646508, 1656052, 1725326, 1873600, 1980893, 2084429, 2118928, 2197097, 2346292, 2481157, 2635346, 2809181, 3083521, 3356251, 3683901, 4078185, 4592537, 5199058, 5869932]
19036E869932O46255N91997N69145N33253N92874Q47609J040034J270949J589885
19027A3551933K004287K668118L573678M964807P567848J2396385J9314881K5289275
19019I1331212K7126163K6393630K2502393J0155304n085355j2034356j3669541
19012A46719450j1564238O43822J9543558L5290142M4844806M7044627L7643313
19005C20165480J8429153l227948k4982413m0666409m2938507l6632553k3481676
18998A66665127m308542J1307684J7804611J8938721J5055081P35693j6387890
18991B09810485k4566924k8399867l0547041k5375347j6815694j0751291p329731
18984F6024590n390271m085832l347846k757156k324401k240684k085972j955648
$$ y = [5869932, 6516187, 7108184, 7677329, 8210582, 8803456, 9651065, 10691099, 11962048, 13551933, 15556220, 18224338, 21798016, 26762823, 34330671, 46727056, 66041937, 91331212, 118457375, 144851005, 167353398, 177508702, 172423347, 160388991, 146719450, 135155212, 135799034, 155342592, 190632734, 235477540, 282522167, 320165480, 338594633, 335366685, 310384272, 269717863, 226779356, 190146803, 166665127, 162356585, 173664269, 191468880, 210407601, 225462682, 226198375, 209810485, 185243561, 156843694, 126296653, 100921306, 84105612, 73354321, 66024590, 60634319, 56548487, 53200641, 50443485, 48119084, 45878400, 43792428, 41836780]
18976D1836780j874976j794519j681058j535494j425041j339252j241850j193858
18968B9750732j117634j080559r73686q58073p77188p17856o96821o23900o17671
18959B2287344n67389n46126n76918n49950n11311m24019m61366n34060l80788
18950A7735417l79180m18504l78871l42149l66804l15666l13085l05701l29453
18941A4586004l19142l39305l05306k80411k59810k83529k70372k65796k63288
18932A1999045k65454k25241k13169k67909k71826k36833k52775k18825j44170
18923I902843j51825j82586j88179j79640j87405k13015k02160j75367n2122j33352
18913H237192j57667j01570j79491k02637j41200j33501q0438j06911j56224j27017
$$ y = [41836780, 39961804, 38167285, 36486227, 34950733, 33525692, 32186440, 30944590, 29750732, 28633098, 27552539, 26578853, 25720780, 24943592, 24225736, 23528915, 22905015, 22287344, 21719955, 21173829, 20596911, 20046961, 19535650, 19111631, 18650265, 18116205, 17735417, 17356237, 16937733, 16558862, 16216713, 15849909, 15534243, 15221158, 14915457, 14586004, 14266862, 13927557, 13622251, 13341840, 13082030, 12798501, 12528129, 12262333, 11999045, 11733591, 11508350, 11295181, 11027272, 10755446, 10518613, 10265838, 10047013, 9902843, 9751018, 9568432, 9380253, 9200613, 9013208, 8800193, 8598033, 8422666, 8370544, 8237192, 8079525, 7977955, 7798464, 7595827, 7454627, 7321126, 7240688, 7133777, 6977553, 6850536]
18903F850536n4777m2894K1571j5037n4434l5737l9485m0096q4344k4409k4768
18892F456126l3651j10336n6518M0677J04323J14485J26559N4090n92P050p7088
18881F625125j45409j39463p0833q1701q2450j00433m1958R33n205q2058n0759
18870E825789J2224j15849j11482j43139j03065p3799q3955j17574m9738q9174
18860D950238j8072J04617M6308l0587k9255r9789r0678j2057p5169j60950k1863
18849D562743l3119j30605j77647j09367j00002o9220l6570l3335o8698k1716
18839C782464q2893p4917o0480j37030j51611j07831n6744p2856k8477l4906m1872
18828B932847l6358q1386k8925J2708k9079n8786l4410N4905M6415k5741m0096
$$ y = [6850536, 6795759, 6752865, 6774436, 6759399, 6704965, 6669228, 6629743, 6589647, 6505303, 6480894, 6456126, 6422475, 6312139, 6255621, 6296298, 6400621, 6515106, 6641665, 6695755, 6695163, 6702213, 6625125, 6479716, 6340253, 6269420, 6187719, 6105269, 6004836, 5962878, 5963811, 5958606, 5876548, 5825789, 5838013, 5722164, 5610682, 5467543, 5364478, 5290679, 5206724, 5089150, 5039412, 4950238, 4932166, 5036783, 5083091, 5052504, 5023249, 4923460, 4832782, 4820725, 4745556, 4584606, 4562743, 4529624, 4399019, 4221372, 4112005, 4012003, 3942783, 3906213, 3872878, 3804180, 3782464, 3699571, 3624654, 3564174, 3427144, 3275533, 3167702, 3110958, 3038102, 3009625, 2974719, 2932847, 2896489, 2815103, 2786178, 2798886, 2769807, 2711021, 2676611, 2731516, 2777931, 2752190, 2712094]
18817B712094O9748M0844k8168J5899k0800n3909J7060j5618N9433J46997R5480
18806C039060K6733j6941p4303o0123N447J3481k6994r0431r6518J5555O7848
18795B802814K6248k3963N1409L6623j8976j3334P706r750P842K2030l1267m5152
18783B812230j11760m9135p139l8232J0997P1230K2186j7091j1691j505O532q2596
18771B604026n7504J2711M6553J8133K8091M6634P8243L9586l927m0425L0903
18760B803024m8991j39964j21295n9153J3612L7042N7218l666k660q6100j08178
18749B340889q4465q4760p8364j3687k704M4874N0991N8597J09162R0604J9845
18738B450982L658K5597Q6600J01003Q8838m655l5311l3816j0569J0647M6845
$$ y = [2712094, 2781842, 2822686, 2794518, 2810417, 2789617, 2735708, 2752768, 2737150, 2796583, 2943580, 3039060, 3065793, 3048852, 2974549, 2914426, 2919873, 2933354, 2906360, 2815929, 2719411, 2734966, 2802814, 2829062, 2805099, 2856508, 2893131, 2874155, 2860821, 2868527, 2858777, 2866619, 2888649, 2857382, 2812230, 2700470, 2651335, 2644196, 2605964, 2616961, 2688191, 2710377, 2693286, 2681595, 2680090, 2686622, 2604026, 2546522, 2559233, 2605786, 2623919, 2652010, 2698644, 2776887, 2816473, 2812546, 2772121, 2803024, 2754033, 2614069, 2492774, 2433621, 2447233, 2484275, 2541493, 2537827, 2535167, 2449067, 2340889, 2256424, 2171664, 2093300, 2079613, 2076909, 2121783, 2172774, 2231371, 2340533, 2431137, 2450982, 2454640, 2480237, 2566837, 2667840, 2756678, 2752023, 2716712, 2682896, 2672327, 2682974, 2729819]
18727B729819M1480k8448K086J2975n5493l5297K0776k6503m1615p2367m2662
18716B504751M190L0654J7901K4439J6450k5267J6070k2286l3744J7716M6228
18705B597102K7953O4944Q9147N85J4759P7719M9867m2937r28O397M3811j3723
18693B914696J4411J27928J42090J71247K26312K56892L03133K48154J77811J66059
18683D748733J53438J50415K95754L80399M22709M40874M83907N76441O54602
18674H307272O36892P38024J078423J562002K196253L129577M735359P702610
18666C0086412J2612302J7744088J8121907J3219462Q405335L881087k696356
18659A01374237l551572N448859J3710734J5458988J6043714J3396547O70294
$$ y = [2729819, 2771299, 2742851, 2744937, 2757912, 2702419, 2667122, 2687898, 2661395, 2619780, 2547413, 2504751, 2508941, 2539595, 2557496, 2581935, 2598385, 2573118, 2589188, 2566902, 2533158, 2550874, 2597102, 2625055, 2689999, 2779146, 2779731, 2794490, 2872209, 2922076, 2879139, 2878211, 2884608, 2928419, 2914696, 2929107, 3057035, 3199125, 3370372, 3596684, 3853576, 4156709, 4404863, 4582674, 4748733, 4902171, 5052586, 5348340, 5728739, 6151448, 6592322, 7076229, 7652670, 8307272, 8944164, 9682188, 10760611, 12322613, 14518866, 17648443, 22383802, 30086412, 42698714, 60442802, 78564709, 91784171, 100189506, 104070593, 101374237, 97822665, 103271524, 116982258, 132441246, 148484960, 161881507, 162551801]
18652A62551801j1622563j2872912j2135870j2882166o679575K888810N194468
18645A14441993J679551k018224q820076j7805264j9421704j3536193q038807
18638D6481276n042168l388398k427684j853277j300888q06513n57812l66031
18630C0738505k24130k04651m35566l32302m3305J32768L95506P05536J157926
18621C1890287J739525K559411M384872P791655J3464691J9753543K1181279J6018573
18613A18783836J0302982N300763k160966m691198M633096J5110504J8009928
18606A65288945J8872987J6520530K645768j2594434j5457072j4812603j5880324
18599A44583797r167891K163850N684381J993702k466060j0060044k0589822k3436131
$$ y = [162551801, 150929238, 138056326, 125920456, 113038290, 106358715, 109247525, 114441993, 116121544, 114103320, 105283244, 87477980, 68056276, 54520083, 46481276, 41439108, 38050710, 35623026, 33769749, 32468861, 31662348, 31104536, 30738505, 30514375, 30309724, 29874158, 29541856, 29498551, 29631319, 30026825, 30732361, 31890287, 33629812, 36189223, 40574095, 48365750, 61830441, 81583984, 102765263, 118783836, 129086818, 134387581, 132226615, 127535417, 132168513, 147279017, 165288945, 184161932, 200682462, 203328230, 190733796, 175276724, 160464121, 144583797, 135415906, 137579756, 143264137, 145257839, 142791779, 132731735, 112141913, 88705782]
18591H8705782j7177014j0514330o634632m461524l297751k607630k041377j715957
18583D0255567j597507j442684j403080j550302j651897j477776j150149r67591
18575B9014581q41154q47276q61700q73211q61016q06622q20003q50740q57574
18566B1395285p67573o84241o07152n82926n25339n11974m41911m11455l95057
18557A6467657l71308l24031l52787l70299k70339k53969k70147k54512k19651
18548A3780614j71723j40160j09273j83260k41119j31023j54956j73047j45245
18539A2330808r6003k1347L7924K5907Q1271O8192m3393k34751k22160l13099
18529A1613349l12393j62555j02093j99648r5063q2708j87839j97588k16070j98185
$$ y = [88705782, 71528768, 61014438, 54379806, 49918282, 46620531, 44012901, 41971524, 40255567, 38658060, 37215376, 35812296, 34261994, 32610097, 31132321, 29982172, 29014581, 28173427, 27326151, 26464451, 25591240, 24730224, 23923602, 23103599, 22252859, 21395285, 20627712, 19943471, 19336319, 18753393, 18228054, 17716080, 17274169, 16862714, 16467657, 16096349, 15772318, 15419531, 15049232, 14778893, 14524924, 14254777, 14000265, 13780614, 13608891, 13468731, 13359458, 13176198, 12935079, 12804056, 12649100, 12476053, 12330808, 12234805, 12213458, 12251382, 12277289, 12358560, 12426752, 12383359, 12148608, 11926448, 11613349, 11300956, 11138401, 11036308, 10836660, 10741597, 10658889, 10471050, 10273462, 10057392, 9859207]
18519I859207j98015k63967k02431m4393j16254q9774m884l6643n5247k3947r596
18508H814056m0358P0266J38870J16358J02118J02854J14421L2043j677o7073
18498I381878n0282O457J28130K09708K99801L60869L42779L60378M13182M22132
18488A1875032M62586N43625N31171N12345N07913N88951O35864P14041P76824
18479A7148352Q36334Q78111R14018J179424J457042J710666K281504L387002
18471B9792453M901521P229411J1476917J9137078L0863860M1356644M1837513
18464A86595397L4062920K8892202K4412178J2142103j885274o613395m619106
18457B72987025p673673j4316651q013234Q672880J7032106J7577506J7745109
$$ y = [9859207, 9661192, 9397225, 9194794, 9150401, 9034147, 8944373, 8939489, 8902846, 8847599, 8823652, 8814056, 8773698, 8843964, 8982834, 9099192, 9201310, 9304164, 9418585, 9450628, 9448951, 9381878, 9331596, 9338053, 9466183, 9675891, 9975692, 10336561, 10679340, 11039718, 11452900, 11875032, 12337618, 12881243, 13412414, 13924759, 14432672, 15021623, 15657487, 16371528, 17148352, 17984686, 18862797, 19776815, 20956239, 22413281, 24123947, 26405451, 29792453, 34693974, 41923385, 53400302, 72537380, 103401240, 144757884, 186595397, 220658317, 249550519, 273962697, 286104800, 284219526, 277606131, 272987025, 265313352, 250996701, 242983467, 251656347, 268688453, 286265959, 304011068]
18450C04011068J1400146l439090j4409022j6343716j9276309l2731390m5925989
18443A83285698m2829633k9044092j7518115j1117694p758335n917501m821566
18436F4278762l829184l240076k900393k589158k224699j991469j879760j744673
18428D3879350j655327j573420j594636j504630j234746j156207j089363j047314
18420C3023707j000487p80690p27278q18465q02807q09912p26927o72203o29385
18411B6055553m62832l68849l97028l96837l49452m44393n08577n89612n36463
18402B2001510n98811n94250n35822m99956m50441m45699n28182l68459k79908
18393A7699982l01656l24398l74981l80709l26078k72388k27742k85181l29126
$$ y = [304011068, 315411214, 311972124, 297563102, 281219386, 261943077, 229211687, 183285698, 140456065, 111411973, 93893858, 82776164, 75017829, 69100328, 64278762, 60449578, 57209502, 54309109, 51719951, 49495252, 47503783, 45624023, 43879350, 42224023, 40650603, 39055967, 37551337, 36316591, 35160384, 34071021, 33023707, 32023220, 31242530, 30515252, 29696787, 28893980, 28084068, 27357141, 26684938, 26055553, 25592721, 25223872, 24826844, 24430007, 24080555, 23636162, 23127585, 22537973, 22001510, 21402699, 20808449, 20272627, 19772671, 19322230, 18876531, 18348349, 17979890, 17699982, 17398326, 17073928, 16698947, 16318238, 15992160, 15719772, 15492030, 15206849, 14877723]
18384A4877723k97260k91190l05153l04394k80050k23682k07012k21265j68344
18375A2579373j40677j55256j50428j99661k01379j60300j80127j42840j18903
18366A1129802j36665q2772o8734r3327j08134r5138j0012o3711k0430J10168
18356A0561047Q6541Q7647R7789K44485K26086J88969J67097K23429K54922K78357
18346A2416369N01442P31100Q55847J055291J332790J725331K380334L750057
18338B4748561O241786J0458547J4934051J5387113J0857803O831142L417725
18331I2876728k725583m374555L196192R144641P872123N881285M923049P85323
18323A17579203l243970l219467j907852j355209m545942q197576l671550M330536
$$ y = [14877723, 14580463, 14289273, 13984120, 13679726, 13399676, 13175994, 12968982, 12747717, 12579373, 12438696, 12283440, 12133012, 11933351, 11731972, 11571672, 11391545, 11248705, 11129802, 10993137, 10910365, 10841631, 10748304, 10640170, 10545032, 10535020, 10471309, 10450879, 10561047, 10647588, 10735235, 10833024, 11077509, 11303595, 11492564, 11659661, 11883090, 12138012, 12416369, 12917811, 13648911, 14504758, 15560049, 16892839, 18618170, 20998504, 24748561, 30990347, 41448894, 56382945, 71770058, 82627861, 89459003, 92876728, 90151145, 85776590, 88972782, 98117423, 105989546, 111870831, 116793880, 117579203, 114335233, 111115766, 109207914, 107852705, 103306763, 95109187, 91437637, 95768173]
18315I5768173N492080J788350j486124p474684j5786136j7035361j1547368o777769
18307D2941161m294606k989756k129773j573990j168195q10965n70409n45892
18299B8857575m32609k45777j68933J7881K47507N49980R11159J219785J786236
18290C2742804K911516M700385Q001565J3455624K1387405K6400126K2083606
18283A31683031J3764884P992976q51946j0508360n655341P482853J1712658R373520
18275A64994275R136740P324456J831923q60181j325353j337120m243423j3453899
18267A62067418j5012596k825331O006628L858137r09527o589421j8095359k6069785
18259A02430164k1649935j3464389q359944n755817m073433l177105k632531k282220
$$ y = [95768173, 101260253, 103048603, 101562479, 94087795, 78301659, 61266298, 49718930, 42941161, 38646555, 35656799, 33527026, 31953036, 30784841, 29973876, 29403467, 28857575, 28424966, 28179189, 28010256, 28028137, 28275644, 28825624, 29736783, 30956568, 32742804, 35654320, 40354705, 48356270, 61811894, 83199299, 109599425, 131683031, 145447915, 153440891, 152588945, 142080585, 136425244, 143908097, 155620755, 164994275, 174131015, 181455471, 183287394, 182427213, 181101860, 179764740, 175521317, 162067418, 147054822, 144229491, 150236119, 154094256, 153184729, 146595308, 128499949, 102430164, 80780229, 67315840, 58955896, 53200079, 49126646, 45949541, 43317010, 41034790]
18251D1034790k010337j967619j771624j528965j459984j313822j226878j176313
18243B8579248j128403r09689p43998o64152o64618o42742p25281p10470o30485
18234B1759410o44837o06697n50784m56674m74672l98799l47028l87172m11490
18225A7481257m59110m58256m64157l63723l75397l17212k46747k17560k17691
18216A4361404k56457j85352p8432j00258j59488j86971j77075k19921j08853
18207A2888597o951k2624L4330k071L458l5022j05484j89263k87071l66936l74033
18196A1536930l87354l26462j59603j53857j36288j27563k07018j51941j36594
18187I750250l5218l6502l0864m9884j52082j37684k03867k33299k08059j56822
$$ y = [41034790, 39024453, 37056834, 35285210, 33756245, 32296261, 30982439, 29755561, 28579248, 27450845, 26541156, 25797158, 25133006, 24468388, 23825646, 23100365, 22389895, 21759410, 21114573, 20507876, 19957092, 19500418, 19025746, 18626947, 18279919, 17892747, 17481257, 17022147, 16563891, 16099734, 15736011, 15360614, 15043402, 14796655, 14579095, 14361404, 14104947, 13919595, 13841163, 13740905, 13581417, 13394446, 13217371, 12997450, 12888597, 12881646, 12859022, 12893352, 12891281, 12894739, 12859717, 12754233, 12564970, 12277899, 11910963, 11536930, 11149576, 10823114, 10663511, 10509654, 10373366, 10245803, 10038785, 9886844, 9750250, 9715032, 9678530, 9647666, 9597782, 9445700, 9308016, 9104149, 8870850, 8662791, 8505969]
18177H505969j72531j12001k3996J3955o2474l1799J9467J0485O2020J49162K25825
18166H584082L10989K36318J80098R2939m9280N4257Q6976J5192N8554J71104
18156I741229K50157L18195J56551L1524O1111Q5536O8913J58692K44960K86231
18146A1403099K22705K09368L85743N64169P49369J029962J418896J932901K699031
18137B0615243L781747N199265P677509J2058769K0125579L1727750L8411006
18130A39596868L4723872L3975640K7115751k498925k6059273k6749294l5444319
18123A44660320m0062243k6971612j5436564r402823o128692m025050k756849
18116C9876487j914617j341527j031003p29001k33339L64603J423755L723204
$$ y = [8505969, 8333438, 8221437, 8197441, 8211396, 8148922, 8117123, 8136590, 8147075, 8209095, 8358257, 8584082, 8895071, 9131389, 9311487, 9404426, 9355146, 9409403, 9496379, 9511571, 9570125, 9741229, 9991386, 10309581, 10466132, 10497656, 10558767, 10644303, 10713216, 10871908, 11116868, 11403099, 11625804, 11835172, 12220915, 12785084, 13534453, 14564415, 15983311, 17916212, 20615243, 24396990, 29596255, 37273764, 49332533, 69458112, 101185862, 139596868, 174320740, 208296380, 235412131, 232913206, 206853933, 180104639, 144660320, 104598077, 77626465, 62189901, 52787078, 46658386, 42633336, 39876487, 37961870, 36620343, 35589340, 34860339, 34627000, 34991603, 36415358, 40138562]
18108D0138562Q098622J3979314J4019680N946592K467971l3883j1921957j8286558
18100E4408343j1338226n856426l165892j957309j253287q00696m43275R9456
18092B9692688N67990R44518J593120K370072L435200N156576P951899J2432323
18084F4144386K0681570L3824643M6861184N1315271N0124028M3631537K1186184
18077C31768803j2090703l4073363m5570907n1672486m8553348l4598524k0598104
18070H4611368j2758675q452507n911242m506552l554264k950349k599293k535172
18062D1343314k266754k024910j898544j672803j351477j017735p79759o48854
18054B9682478o93710n85738m77158n75256o87884p13812o45680n86531m62026
$$ y = [40138562, 48237184, 62216498, 76236178, 82182770, 84650741, 84616858, 72694901, 54408343, 43070117, 37213691, 34047799, 32090490, 30837203, 30036507, 29593232, 29692688, 30260678, 31205196, 32798316, 35168388, 38603588, 43760164, 51712063, 64144386, 84825956, 118650599, 165511783, 216827054, 266951082, 310582619, 331768803, 319678100, 285604737, 240033830, 188361344, 139807996, 105209472, 84611368, 71852693, 63400186, 57488944, 52982392, 49428128, 46477779, 43878486, 41343314, 39076560, 37051650, 35153106, 33480303, 32128826, 31111091, 30331332, 29682478, 28988768, 28403030, 27925872, 27350616, 26662732, 25948920, 25303240, 24716709, 24254683]
18045B4254683k48530n7231m0453m7314l5444K06727L87677Q50531J611304K719128
18035B9601078M401124P421723J2692549J8889142K0308537J7925778J7736417
18028A28976348R426858q578666j5825888j6149164k2309625j9701505j1764964
18021D4073394o850446m402005l030621k184970j707571j422498j247587j052341
18013B2175355r00190q64212p90510o26724m95718m26670l81420l16049l68072
18004A7005790m02390m52977l68230l71944m17395m38954l83627l93523l56755
17995A3419995l42081k67820k55069k31981l60843l66470l86295m08275l24674
17986A0476487k57700k47538j84459p3435j38805k02702k35262j77624j53702
$$ y = [24254683, 24006153, 23948922, 23908469, 23861155, 23825711, 24032438, 24420115, 25270646, 26881950, 29601078, 34002202, 41423925, 54116474, 73005616, 93314153, 111239931, 128976348, 138403206, 129824540, 113998652, 97849488, 75539863, 55838358, 44073394, 37222948, 32820943, 29790322, 27605352, 25897781, 24475283, 23227696, 22175355, 21275165, 20410953, 19620443, 18993719, 18498001, 18071331, 17689911, 17373862, 17005790, 16603400, 16150423, 15782193, 15410249, 14992854, 14553900, 14170273, 13776750, 13419995, 13077914, 12810094, 12555025, 12323044, 11962201, 11595731, 11209436, 10801161, 10476487, 10218787, 9971249, 9786790, 9713355, 9574550, 9371848, 9136586, 8958962, 8805260]
17977H805260j89933j42471j83636j54296k04925k00362j39446j34955q3621l6538
17967G335077j13285j50491q8315o1571n1605M772J3277R1882J69435J70580Q4662
17956G404418J0329o6478j67364k32078k49384j94184k25567j62652j45270j42061
17946E829709p4949j33933k03762j65755n2362r0808j10518n0084n0971p2570
17936D823997j23019q4769r4555p4318q8835q0303n6944p5130r8106o8895r5507
17925C883616r4480q5735j8553m3591p9065o5798n7227m5186m3192J4513p1228
17914C294074k1715J3910J2237L0743J9581L3199Q9224N760k0175j9287q8508
17903C349043j10008n3273o0922j43584q5122m2614m4617o9214j0901K920l6744
$$ y = [8805260, 8615327, 8472856, 8289220, 8134924, 7929999, 7729637, 7590191, 7455236, 7371615, 7335077, 7221792, 7071301, 6982986, 6921415, 6869810, 6874582, 6887859, 6979741, 7149176, 7319756, 7404418, 7414747, 7348269, 7180905, 6948827, 6699443, 6505259, 6279692, 6117040, 5971770, 5829709, 5754760, 5620827, 5417065, 5251310, 5198948, 5108140, 4997622, 4947538, 4896567, 4823997, 4700978, 4616209, 4521654, 4447336, 4358501, 4278198, 4221254, 4146124, 4048018, 3979123, 3883616, 3789136, 3703401, 3684848, 3641257, 3562192, 3496394, 3439167, 3393981, 3350789, 3365302, 3294074, 3272359, 3286269, 3298506, 3329249, 3348830, 3382029, 3471253, 3477013, 3456838, 3437551, 3349043, 3239035, 3185762, 3124840, 2981256, 2896134, 2853520, 2808903, 2739689, 2728788, 2731708, 2694964]
17892B694964r2089o6791J550j6210J7053J4149o3206q0909o3466k5448j4548
17881B305049n9381q9651k4176l0357n5778k3871k6609J2903k1869o4264J4250
17870A936246l6714n7552J3461Q267n0582l9599m0311n382k6354K275K125l0245
17858A675635n3650l7902p0439j7158k0537n8344Q951L7093N2802r439l5333k4391
17846A447288J3824j1466m7965j6667J5411k2376o300J2308L0632o243O032l1851
17834A382627j0406l3907l7709l7319q9796k1211k6299j3467L6872L6911N9397
17823A245693J36848R2347M1151J32851J93921K11939J83078J50458R2441K7495
17813B508222j6695j8037J7386l6699m0815k5214J8949J13235Q9309N1123O6930
$$ y = [2694964, 2602875, 2536084, 2537634, 2521424, 2538477, 2552626, 2489420, 2408511, 2345045, 2319597, 2305049, 2245668, 2156017, 2131841, 2101484, 2045706, 2021835, 1995226, 2008129, 1986260, 1921996, 1936246, 1899532, 1841980, 1855441, 1863708, 1813126, 1773527, 1733216, 1727834, 1701480, 1703755, 1705880, 1675635, 1621985, 1584083, 1513644, 1496486, 1475949, 1417605, 1426556, 1463649, 1516451, 1507012, 1471679, 1447288, 1461112, 1449646, 1401681, 1385014, 1400425, 1378049, 1371749, 1384057, 1414689, 1408446, 1414478, 1382627, 1372221, 1338314, 1300605, 1263286, 1173490, 1152279, 1125980, 1112513, 1149385, 1186296, 1245693, 1382541, 1474888, 1516039, 1648890, 1842811, 2054750, 2237828, 2388286, 2480727, 2508222, 2491527, 2473490, 2490876, 2454177, 2413362, 2388148, 2407097, 2520332, 2609641, 2660764, 2727694]
17802B727694k2381m8876L508M9975o6811j59671j46219j33832j16522r5481j04973
17791A886411l6016N0675L5304K8963l145J3672l3043l3884m9168j13244n8097
17780A688428k9620j5004M2919l9512o8837o569j02654j30367o0747o4020n8584
17769A155433p6430q2691o4229n732k491p168k1182K3758J3197J4101j8294k025
17757I26247j5471j1254P57k9227L3590L4645O7607O3933J41118J69201L4106
17746A415252j192M9040J21371R8606J54309K33923J94456K26323K03849J15766
17736B811703L4163j08021j04458q0613j29631k29552k50521j78052n5687Q450
17726A717781J0210l1123p2809l6739o7062M0354J85843K03886J56274J19376
$$ y = [2727694, 2705313, 2656437, 2659945, 2709920, 2643109, 2483438, 2337219, 2203387, 2086865, 1991384, 1886411, 1850395, 1901070, 1936374, 1965337, 1962192, 1975864, 1942821, 1908937, 1859769, 1746525, 1688428, 1658808, 1643804, 1686723, 1647211, 1578374, 1571805, 1469151, 1338784, 1278037, 1214017, 1155433, 1079003, 996312, 932083, 926351, 923860, 916692, 895510, 919268, 932465, 946566, 928272, 926247, 910776, 899522, 900279, 871052, 904642, 939287, 1006894, 1070827, 1211945, 1381146, 1415252, 1414060, 1463100, 1584471, 1683077, 1837386, 2071309, 2265765, 2492088, 2695937, 2811703, 2845866, 2737845, 2633387, 2552774, 2423143, 2193591, 1943070, 1765018, 1709331, 1717781, 1727991, 1696868, 1624059, 1587320, 1520258, 1560612, 1746455, 1950341, 2106615, 2225991]
17716B225991R8316N3329o5473k6646j3825j22423k34514l04910k56480j81068
17706A172297q8171j1461m0882l4781N95K632o1836j7146L7397L144n397J2411
17694I68802k897M259O337M6298p4386m7130l9133r1231k6434M3642L920k8225
17682G63822l8561m1382m9890L7174J4418P5533K4225K582n9376n7630n0637m4984
17670E75294j0888K0460L3342l4842l7854K5396L7584k6572L9385K8100L4414
17659F83819k9023l0819k1289j3456K35l4966r762L0787K685J0549M4281L4100
17647F67141O392j1906m919m2148j0386P226l4024J9209K5845o690o2503l7010
17635E16227J665M7017J6235l4378k2110N6615O3559n102p0005m3518N5212j3491
$$ y = [2225991, 2324307, 2377636, 2312163, 2285517, 2271692, 2149269, 1914755, 1609845, 1353365, 1172297, 1084126, 1072665, 1031783, 997002, 997597, 1000229, 938393, 921247, 958644, 961788, 956391, 968802, 965905, 970164, 976501, 1022799, 948413, 901283, 862150, 770919, 744485, 788127, 792047, 763822, 725261, 683879, 633989, 671163, 685581, 761114, 785339, 787921, 728545, 670915, 620278, 575294, 564406, 584866, 618208, 583366, 545512, 570908, 608492, 581920, 621305, 649405, 683819, 654796, 623977, 602688, 589232, 589467, 554501, 544739, 575526, 578211, 588760, 633041, 667141, 673533, 661627, 656708, 614560, 604174, 611400, 577376, 596585, 622430, 615740, 553237, 516227, 517892, 564909, 581144, 546766, 524656, 581271, 644830, 639728, 569723, 526205, 581417, 567926]
17623E67926J2146L055M3988J14830J67816K55444K10363J58046R2546l2504r3996
17612A499660j46613j58225j39738q6973j05461l6208m1513o9468m7890o927O17
17601F61261J2761n0339m4582M5436J6631N176L9022L3660J7542m4701r0066L451
17589F05252j2550k7400K1301O1916N88N1456N903k474k5285j3392p36k6547p577
17576F30455M1479j742K0980L7651N4675N6406J16928K80079K87925K68842K37340
17565B031018J90654P7402j20583k43801k67893k76022j74679j24562q7321q3241
17555I20972m0472J4816o4411o9227K0554L0993l3411J0238p9998j8995j5655
17544F75404p8901M3693K7129k4907J3842P9363L6718n7478m9744J3750k7386
$$ y = [567926, 580072, 583127, 627115, 741945, 909761, 1165205, 1375568, 1533614, 1626160, 1593656, 1499660, 1353047, 1194822, 1055084, 968111, 862650, 826442, 784929, 715461, 667571, 660644, 661261, 674022, 623683, 579101, 624537, 641168, 646344, 685366, 719026, 736568, 691867, 601801, 605252, 592702, 565302, 586603, 648519, 649107, 700563, 706466, 703992, 678707, 665315, 664579, 638032, 630455, 671934, 670192, 691172, 728823, 783498, 839904, 956832, 1236911, 1524836, 1793678, 2031018, 2221672, 2299074, 2178491, 1934690, 1666797, 1390775, 1216096, 1091534, 1004213, 920972, 880500, 895316, 830905, 761678, 782232, 813225, 779814, 790052, 710054, 691059, 675404, 596503, 640196, 667325, 642418, 656260, 735623, 772341, 714863, 665119, 678869, 651483]
17533F51483l6030n5034K8877N3167K6053r07J16o5335O668P8025Q3377K9458
17521G99918L1033L6522N1607K14166J66423J09579J18524p851q5704r8429j15889
17510A219899j36829j53442j16951m9907p959m8261p6973J7548M1283j6600l509
17499F68299M1684J2812j6267m8853k7948k770K0389J3729M8225K9463o2189l2669
17487F43905J6417J1984L4042n2003o9959L4342j7946n9975m9727K2800M7716
17476E61596K1504m093N0710M6170m1363l634L2869j1151K6367J1432L1521J4841
17464G36769J8529J4098L2314m344L5696k4107o2982J4869K486N295N3681R4604
17452I16908L5446R6364J74850K08926J77006J16697M0526j9421j69855k07238
$$ y = [651483, 615453, 560419, 589296, 642463, 668516, 667609, 667725, 602390, 609058, 687083, 770460, 799918, 830951, 867473, 919080, 1133246, 1299669, 1409248, 1527772, 1519921, 1434217, 1335788, 1219899, 1083070, 929628, 812677, 762770, 754811, 706550, 629577, 647125, 688408, 671808, 668299, 709983, 722795, 706528, 657675, 629727, 626957, 647346, 661075, 709300, 738763, 676574, 643905, 660322, 672306, 706348, 654345, 584386, 618728, 600782, 540807, 491080, 513880, 561596, 583100, 579007, 629717, 675887, 634524, 630890, 663759, 652608, 678975, 690407, 721928, 736769, 755298, 769396, 801710, 797366, 833062, 808955, 745973, 760842, 763328, 768623, 822304, 916908, 952354, 1048718, 1223568, 1432494, 1609500, 1726197, 1766723, 1747302, 1577447, 1370209]
17442A370209k6466Q0883J26653J95447K06291J74349L7789o4473r7496j13064
17432A890122j80280j55093j05632N5414J71007K07190Q6891P0239L2038j11652
17422A960244k67081j91161r1965J2798L5884J45736K60970J91639P2967M3097
17412B173128m0930k31521k76240k07622j45073r0566n0174j14548m2008n3604
17402I20842o6658m109L5433M4161L042M336k7682m3880K7282K1437m2682M0620
17390I12142j0607m4482m0280j0447m2967r64k4415p1326o7542o6243L3167N1332
17378F17368m144j1400O8651R2863M0400J4261k0428J601l270J0976m3134l1977
17366G31767J4107M4827n1570m7272m3397n6559j7653M1567R9513L0606k9326
$$ y = [1370209, 1343743, 1424626, 1551279, 1746726, 1953017, 2127366, 2165155, 2100682, 2003186, 1890122, 1709842, 1554749, 1449117, 1504531, 1675538, 1882728, 1969619, 2039858, 2071896, 1960244, 1693163, 1502002, 1410037, 1422835, 1458719, 1604455, 1865425, 2057064, 2130031, 2173128, 2132198, 1900677, 1624437, 1416815, 1271742, 1181176, 1131002, 1016454, 974446, 920842, 854184, 850075, 885508, 929669, 932711, 937047, 909365, 865485, 892767, 914204, 871522, 912142, 901535, 857053, 816773, 806326, 763359, 762395, 737980, 666654, 599112, 532869, 566036, 617368, 613224, 601824, 670475, 763338, 803738, 817999, 797571, 799172, 795902, 806878, 763744, 731767, 745874, 790701, 739131, 691859, 648462, 591903, 574250, 615817, 715330, 745936, 716610]
17355G16610K3559o408K1216L1829K8441j0200L6795n376o6847M9529N0189n5863
17343H13474M2699P230Q4218k1206l4680l556Q083L2420j033M1968N0336m7717
17331I72236l244J2078L3384K8098M0196L5772K8085K7332L1894M6738J25625
17320A378194J28289J55341J25127J29604J94369J57314J30222L4900j8854K129
17310B416635n1470q0613o1023p6394o1454j9162J8017n5035n0208N6520R8285
17299B134098J08068J48007J58786J33653J44827J80318J46210M7737k2499l8098
17289C141107J7125l2793r0535j09698j24855j33283j23970j21428n8308K7967
17279B391329j177k5646q7577k8563K240K037o5722k549J2078J3181m08j7565
$$ y = [716610, 740169, 733761, 754977, 786806, 815247, 805047, 841842, 836466, 769619, 819148, 869337, 813474, 856173, 863403, 947621, 926415, 891735, 888179, 896262, 928682, 927649, 969617, 1019953, 972236, 968992, 981070, 1014454, 1042552, 1082748, 1118520, 1146605, 1173937, 1205831, 1252569, 1378194, 1506483, 1661824, 1786951, 1916555, 2110924, 2268238, 2398460, 2433360, 2414506, 2416635, 2365165, 2284552, 2223529, 2147135, 2085681, 2066519, 2084536, 2029501, 1979293, 2035813, 2134098, 2242166, 2390173, 2548959, 2682612, 2827439, 3007757, 3153967, 3201704, 3179205, 3141107, 3158232, 3125439, 3034904, 2925206, 2800351, 2667068, 2543098, 2421670, 2363362, 2391329, 2390152, 2364506, 2276929, 2248366, 2250606, 2252643, 2186921, 2184372, 2196450, 2209631, 2209223, 2191658]
17267B191658j3140J3014L2796J0132k1166n1591L719j7385J979K2453M5120R247
17255B226836k4159L7306O3768J565N5269K8807N3457L2688J8245K2228N2487
17244B568497J6201L4227M5798J9092Q845K4678N7892O4317M6389M2159N9223
17233B987318R0740Q6708J12622J91311R8230J12503J23019J99719K92520L33082
17223D627772L49242L71066L45236M05398M40143N08719M23408L20118L44487
17214H135589L21144L14087K65271K93518M01750L74692L77302N45828Q13043
17205A1842224J156145J533966J877561K374847L011867L913665N359970P940167
17197C9010412J2470600K0551336L1927035M0180694L7731115K9454752K4681011
$$ y = [2191658, 2178518, 2191532, 2224328, 2234460, 2213294, 2161703, 2165422, 2148037, 2150016, 2172469, 2217589, 2226836, 2202677, 2239983, 2303751, 2305316, 2360585, 2389392, 2442849, 2475537, 2493782, 2516010, 2568497, 2584698, 2618925, 2664723, 2683815, 2692660, 2717338, 2775230, 2839547, 2885936, 2928095, 2987318, 3078058, 3164766, 3277388, 3468699, 3566929, 3679432, 3802451, 4002170, 4294690, 4627772, 4977014, 5348080, 5693316, 6098714, 6538857, 7047576, 7470984, 7791102, 8135589, 8456733, 8770820, 9036091, 9329609, 9731359, 10106051, 10483353, 11029181, 11842224, 12998369, 14532335, 16409896, 18784743, 21796610, 25710275, 31070245, 39010412, 51481012, 72032348, 103959383, 144140077, 181871192, 211325944, 236006955]
17190B36006955J8468439M576751q280726j2432981j3832832k3603029l8237524
17183A62665053l9863116k7662711j5161510p638476l119253J92007L322749P693296
17175H0428039J4968877K6791721M0011477M4571492L7033075K9041667K4477127
17168B97323475J2939241m562311j4767831j6101424k0851692l6730522m8943673
17161A68305263m2552834k7447516j6240293j0170976o945999n177055m260023
17154E5510567l682844l179805k839981k563635k292799j957367j722266j497671
17146C5774199j271769j160172j095691j063952q81780p89687p22323p78868q99417
17137B7110540q32685p67178p70905p63978q11288q42678q00796q11625q06036
$$ y = [236006955, 254475394, 259052145, 250771419, 238338438, 224505606, 200902577, 162665053, 122801937, 95139226, 79977716, 72339240, 69219987, 69411994, 72734743, 80428039, 95396916, 122188637, 162200114, 206771606, 243804681, 272846348, 297323475, 310262716, 305700405, 290932574, 274831150, 253979458, 217248936, 168305263, 125752429, 98304913, 82064620, 71893644, 64947645, 59770590, 55510567, 51827723, 48647918, 45807937, 43244302, 40951503, 38994136, 37271870, 35774199, 34502430, 33342258, 32246567, 31182615, 30300835, 29511148, 28788825, 28009957, 27110540, 26277855, 25510677, 24739772, 23975794, 23164506, 22321828, 21521032, 20709407, 19903371]
17128A9903371o83292n78781n41760m33114m54097m31748l75628l09495k70017
17119A5825439l46101m33894m02169l73196l85857l41596l21568k93820k59620
17110A2667618k49105k92879k48546k74919k34864k34027k09720k11804k25293
17101A0486461k18874k94071k21068k07865k04978k50834k18028j97793k02758
17092H470192j85776j48558p0421j33658j76978j57520j55302j48363j46201j76592
17082F970823j52434j14480j03285p3523n6278o2033p1610l6283K5010P985L6396
17071F370288J08332O0355k0457j1913j07856o4115J0820k6349j58537j96399
17061E964169j19379r5177r2879q6568q0282o8730n6949l3491K8839J152M6611
$$ y = [19903371, 19220079, 18641298, 18099538, 17666424, 17212327, 16780579, 16404951, 16095456, 15825439, 15479338, 15045444, 14643275, 14270079, 13884222, 13542626, 13221058, 12927238, 12667618, 12418513, 12125634, 11877088, 11602169, 11367305, 11133278, 10923558, 10711754, 10486461, 10267587, 9973516, 9752448, 9544583, 9339605, 9088771, 8870743, 8672950, 8470192, 8284416, 8135858, 8065437, 7931779, 7754801, 7597281, 7441979, 7293616, 7147415, 6970823, 6818389, 6703909, 6600624, 6527101, 6470823, 6408790, 6337180, 6300897, 6325907, 6333892, 6370288, 6478620, 6538975, 6518518, 6506605, 6398749, 6334634, 6345454, 6319105, 6160568, 5964169, 5844790, 5749613, 5656734, 5570166, 5489884, 5421154, 5364205, 5330714, 5359553, 5360705, 5407316]
17050E407316P1851J35543J16108L6259M252m4972k7359r6742q8035j73154j55400
17039E185667p2839p5984j16409j36552j09675r1625n2213r8310q5533j21306
17029D225221j31596j3490r3358p1991o0069j2425J14020J50215K9415J6748L444
17018D156134P7221J37828J5576j07723n6409r1529l9864k378l7105l3399j2175
17007D006177N7652K7944N3299K083l3420O6275L0822r1403j14763J727K3064
16996D029457O7259N251l7046j59548j20495n924K2424j5142L7149L8546l8572
16985C823359K5130R7314M5291j5461k4748j23235j26878n9276n7998m7232q877
16974C527389q1454m6961m938j16153m3198k7110k8834p6088q5290l3310R181
$$ y = [5407316, 5479167, 5614710, 5730818, 5767077, 5771329, 5726357, 5698998, 5602256, 5514221, 5341067, 5185667, 5112828, 5036844, 4920435, 4783883, 4674208, 4582583, 4530370, 4432060, 4346527, 4225221, 4093625, 4080135, 3986777, 3914786, 3854717, 3842292, 3956312, 4106527, 4135942, 4152690, 4156134, 4233355, 4371183, 4386759, 4279036, 4222627, 4131098, 4091234, 4088856, 4051751, 4018352, 4006177, 4063829, 4091773, 4145072, 4147155, 4113735, 4180010, 4210832, 4119429, 4004666, 4006393, 4029457, 4096716, 4101967, 4064921, 3905373, 3784878, 3778954, 3801378, 3786236, 3823385, 3861931, 3823359, 3848489, 3945803, 3991094, 3975633, 3950885, 3827650, 3700772, 3641496, 3583498, 3536266, 3527389, 3445935, 3398974, 3394036, 3277883, 3234685, 3207575, 3178741, 3102653, 3017363, 2984053, 2993234]
16963B993234j1616L6479j3734j3436n8535l052K374r4394L6596N3261K9484J7106
16951B973767r132M6103M7022J2269k4488J8079k1919k1059N5732N7466R2496
16940C226336K7731j5235J9765R5676J30378L6886M6086J75368O6453O8274J76885
16929D054603K33353K57838L19530L51583K69611K47916P7538P076j2805J51866
16919E958109L51348N78880O37613O67009P28093N14180K22239K95013K91296
16910A0243780K62066N99233J113430J461410J723919J999458K142067K384263
16902B1929626L166677M582136P043197J1866424K1241172L7102595N0070517
16895A57002344L7877601J6390723Q501376r558431m6974540m5727523k2456704
$$ y = [2993234, 2981618, 3018097, 3004363, 2990927, 2932392, 2929340, 2931714, 2837320, 2873916, 2927177, 2956661, 2973767, 2964635, 3010738, 3057760, 3070029, 3045541, 3063620, 3041701, 3020642, 3076374, 3133840, 3226336, 3254067, 3238832, 3258597, 3354273, 3484651, 3521537, 3567623, 3742991, 3809444, 3877718, 4054603, 4287956, 4545794, 4865324, 5216907, 5486518, 5734434, 5811972, 5819048, 5806243, 5958109, 6309457, 6888337, 7525950, 8192959, 8921052, 9435232, 9657471, 9952484, 10243780, 10505846, 11105079, 12218509, 13679919, 15403838, 17403296, 19545363, 21929626, 25096303, 29678439, 36721636, 48588060, 69829232, 106931827, 157002344, 194879945, 211270668, 219772044, 210213613, 163239073, 117511550, 95054846]
16888I5054846n961784O862360K2162432M0063984M3623132K2743009Q845069
16881B33393048Q72625k8625708n1509891l2079745q350576J1370747L0380258
16874A55450758L6257027J9109128O828008L97857k5335924m7749237l2532878
16867A12424739j4153493k190735R299582K4409531L7521563K9483436J0320377
16860B07115000L107393j0364822m3095090m6389649k7399493j5166673r073370
16853E8733296n897112m097094l109419k369304j805334j748179j926584j900644
16845C5879626j909823j955006j595318j290359r94874p78502o54369n93144o64170
16836B5444061q70268r91205j104306r78622p47463o38052n32499m02609l88572
$$ y = [95054846, 89093062, 95955422, 118117854, 158181838, 201804970, 224547979, 233393048, 234265673, 205639965, 154130074, 122050329, 113699753, 125070500, 155450758, 191707785, 210816913, 217644921, 218042778, 192706854, 144957617, 112424739, 98271246, 96080511, 105380093, 129789624, 167311187, 196794623, 207115000, 210222393, 199857571, 156762481, 110372832, 82973339, 67806666, 58733296, 52836184, 48739090, 45629671, 43260367, 41455033, 39706854, 37780270, 35879626, 33969803, 32014797, 30419479, 29129120, 28134246, 27355744, 26701375, 26108231, 25444061, 24573793, 23582588, 22478282, 21499660, 20752197, 20114145, 19581646, 19179037, 18790465]
16827A8790465m10489m19232m06860m07306n39318o12269m75117m23430m59539
16818A4636905m87468m04375l66170k85964l32416l44066k51883k63405l23974
16809A1577184k34860k54388k66948k87362k42519k16676k34150k20711j99826
16800I419744j97189k00495j87774k06128k26438k00138k17575j85035j15146
16791G683826r3539k08978k13985j69962j25317j33023j14422j11129j36309j20670
16781F256492j12370j01443j51570o4715J1918p291j9308J762K2000L1512o9902
16770E797085j64255j85536j88206o9423P8810J71791j5918o2421Q677l9193q0220
16759E251191j17488j31728j32616q1847r97L0198O6188m6658o6700o159p3426
$$ y = [18790465, 18379976, 17960744, 17553884, 17146578, 16607260, 15994991, 15519874, 15096444, 14636905, 14149437, 13745062, 13378892, 13092928, 12760512, 12416446, 12164563, 11901158, 11577184, 11342324, 11087936, 10820988, 10533626, 10291107, 10074431, 9840281, 9619570, 9419744, 9222555, 9022060, 8834286, 8628158, 8401720, 8201582, 7984007, 7798972, 7683826, 7590287, 7381309, 7167324, 6997362, 6872045, 6739022, 6624600, 6513471, 6377162, 6256492, 6144122, 6042679, 5891109, 5826394, 5838312, 5831021, 5811713, 5813475, 5835475, 5866987, 5797085, 5632830, 5447294, 5259088, 5189665, 5268475, 5440266, 5424348, 5361927, 5370604, 5331411, 5251191, 5133703, 5001975, 4869359, 4787512, 4786515, 4816713, 4882901, 4836243, 4769543, 4763384, 4689958]
16748D689958k06193j42479n6281j2383J3445l941k5309L1172j9062o6310j42054
16737D060563j92416j12981j44518q1564l8926q2242p2678m1656p9441p1125j19042
16726C023974j00315p7953q9049p2056J0785m5031o3259n3927p7581q0360o7091
16715B308137r8231k7982m1237p1169j9430J3562j7919l4064q575P147l4061r1362
16703A884816o2144l2855j0620j1853p6710n7470j2977j1873l635m2303j1072
16692A551304j5247m0129m9351J6317k8823n5960j03710O573M2814K364m8438
16681A277714k8299o9780o4902q7642l1377M6663M9598p578L7066j1421m1038
16670A069004n7269n7235j854L024L275l2038n7710n3335n2890j4039M38J319
$$ y = [4689958, 4483765, 4341286, 4285005, 4272622, 4286067, 4282126, 4256817, 4287989, 4268927, 4202617, 4060563, 3868147, 3755166, 3610648, 3529084, 3490158, 3407916, 3335238, 3293582, 3214141, 3143016, 3023974, 2923659, 2845706, 2756657, 2684601, 2695386, 2650355, 2587096, 2533169, 2455588, 2375228, 2308137, 2209906, 2181924, 2140687, 2069518, 2050088, 2063650, 2045731, 2011667, 2003092, 2010239, 1976178, 1884816, 1822672, 1789817, 1779197, 1767344, 1690634, 1633164, 1620187, 1608314, 1604679, 1562376, 1551304, 1536057, 1495928, 1446577, 1462894, 1434071, 1378111, 1274401, 1280974, 1323788, 1326152, 1277714, 1249415, 1179635, 1114733, 1027091, 995714, 1042377, 1091975, 1084397, 1121463, 1110042, 1069004, 1011735, 954500, 952646, 955670, 958945, 926907, 869197, 815862, 762972, 748933, 749371, 750690]
16658G50690m4622j6829L6653j2329k7525O4345P261n0474j03483K5743O9065
16647F98495K9071q734l3263m1023P7543J14955R4525J73345J79155K05585K64138
16636A753792J53990J20960M1793q7264j31654j32408k01014k31991j97914j20996
16626I67294j04842o9681j19893l9296L9652Q4647M5219J78592J89709K20462
16616A391863J05734Q0624J37122N6153o5163r4377p6733j04467j71401k45104
16606A014251j73913j53080j20587j03791o8292j2340L17L1255k7220l3821P63
16595C53542n5191n6270K0847J2276j9071J6819k5348l153M963k167K613M7m4798
16582B05109K5364r325j9111k5478j1208L4707J4721J1243l9935J0638K3458m2556
$$ y = [750690, 706068, 689239, 725892, 713563, 686038, 750383, 757644, 707170, 603687, 629430, 698495, 727566, 718832, 685569, 644546, 722089, 837044, 931569, 1104914, 1284069, 1489654, 1753792, 1907782, 2028742, 2070535, 1983271, 1851617, 1719209, 1518195, 1286204, 1088290, 967294, 862452, 792771, 672878, 633582, 673234, 757881, 803100, 981692, 1171401, 1391863, 1497597, 1578221, 1715343, 1771496, 1706333, 1611956, 1535223, 1430756, 1259355, 1014251, 840338, 687258, 566671, 462880, 394588, 382248, 382565, 413820, 386600, 352779, 353542, 298351, 242081, 262928, 275204, 256133, 272952, 247604, 244451, 249414, 247247, 249860, 249907, 205109, 230473, 221148, 202037, 176559, 165351, 200058, 214779, 226022, 186087, 196725, 220183, 177627]
16570A77627l8420n3163k7381M9697L9403K4987l0198o6253p3217l951M3801J9094
16558F2026Q898J6676k5340M740K5209l6036j3280M80P63M689k1271K7367J0548
16545F5469o3211K1233P6038O1932n096n8176j0046j3836k3554k2988M5796N1431
16533A24992N0513l1221n3285M039o2885q5189o959l5332m628L1725P880J7702
16521d2648R569K6771M250o7458q1630m4131P842k8887L9666P5573P3782M7924
16509B0623L7769k3095Q73r0713l8619l7855J6630Q0267N7290K6207m2736p8865
16497g2224m3402K7297J1563k3626O4893K4966J7329J1824o0122n0014m2493l0447
16485a64456K1785j0967k5324L020O9308N0549K4466k3705l4605n4938L0161N9822
$$ y = [177627, 139207, 86044, 58663, 108360, 147763, 172750, 142552, 76299, 3082, -869, 42932, 62026, 70924, 87600, 62260, 67000, 92209, 56173, 42893, 43373, 44136, 48825, 27554, 54921, 65469, 2258, 23491, 99529, 161461, 156365, 98189, 88143, 74307, 50753, 27765, 73561, 124992, 175505, 144284, 90999, 95038, 32153, -53036, -59995, -95327, -99955, -68230, -60350, -42648, -33079, -6308, -2058, -69516, -151146, -195277, -187435, -216322, -176656, -101083, -27301, 20623, 58392, 35297, 36170, -54543, -93162, -131017, -114387, -34120, 23170, 49377, 6641, -72224, -115626, -88329, -76766, -100392, -35499, -10533, 6796, 18620, -41502, -91516, -134009, -164456, -142671, -153638, -178962, -175942, -106634, -56085, -31619, -55324, -89929, -144867, -114706, -54884]
16473e4884J1354L1072K6077j5765k8908r649k047Q368K4598j093k5299j2756
16461d8932O2137l5271m7309k2305M5177M6205l4301k8377m1289J4952L0405P294
16449e1614K990J0279M7883k2425m7258N129J8401K5650o3952n5890J164k861
16437a32504J0768J3254J9214K2051l4096j1489L7592J9623k3423O380K1634j8975
16425f9971n340L5320l5900k2268m9898j1397J7628M7440O7868j574k6600J0015
16413d4677M496k4286l7029m1312j3235Q7864K3174J1945N0098j0033n3732m8731
16401i5458j5882P844j4474M225N9629P7584l696J183j2720n0443j6105j0061
16389f8374M918J2721k6662k6954j7896J3274M6286Q616l2658l4613p1675O2215
$$ y = [-54884, -43530, -12458, 13619, -2146, -31054, -40703, -42750, -34382, -9784, -10877, -36176, -48932, 13205, -22066, -69375, -91680, -46503, -298, -34599, -62976, -104265, -89313, -58908, -51614, -48624, -38345, 9538, -12887, -60145, -55016, -36615, -10965, -74917, -130807, -129643, -132504, -121736, -108482, -89268, -67217, -101313, -112802, -75210, -55587, -79010, -72630, -50996, -69971, -75311, -39991, -75891, -98159, -148057, -159454, -141826, -94386, -26518, -28092, -54692, -44677, -40181, -64467, -101496, -142808, -156043, -68179, -45005, -33060, 17038, 7005, -46727, -95458, -111340, -103496, -117970, -113745, -54116, 23468, 19772, 20955, 8235, -42208, -58313, -68374, -63456, -50735, -77397, -104351, -122247, -108973, -62687, -54071, -86729, -121342, -193017, -130802]
16377a30802J0821J5548M3754j8111K1108J7027K5789L2569M2222N360k3986L472
16365D4771j4231j9612l7054P981j4178m1063J5685K2697P215k3981n4963l269
16353a10002J02461L7676l3700J4935J5672j0998N4967L0765J7736l6022K3443
16342A06933J00454Q0212M1516J33910K44904J86248J09157O4938P366j22072
16332I53566k66131j75161q9550j8536R3885J89787K17325J61646N5652j0553
16322A111930n5400j85733k47129p1940L0381J17428J52737J56772J18607K6107
16312A153760j7106j74129j96638j23347r1997K1712K0722J40578K08117R3131
16302A034803Q850L7481j02245l07680k10092q3446m6914j6276p87p6384p2785
$$ y = [-130802, -119981, -104433, -60679, -78790, -57682, -40655, -14866, 17703, 59925, 65285, 41299, 44771, 30540, 10928, -26126, -18145, -32323, -73386, -57701, -35004, -27789, -51770, -106733, -110002, -7541, 30135, -3565, 11370, 27042, 16044, 71011, 101776, 119512, 83490, 106933, 207387, 287599, 329115, 463025, 707929, 894177, 1003334, 1068272, 1075638, 953566, 687435, 512274, 422724, 404188, 498073, 687860, 905185, 1066831, 1122483, 1111930, 1056530, 870797, 623668, 551728, 582109, 699537, 852274, 1009046, 1127653, 1153760, 1136654, 962525, 765887, 642540, 550543, 572255, 592977, 733555, 941672, 1034803, 1043653, 1081134, 978889, 671209, 461117, 377671, 330757, 314481, 313694, 237310, 164525]
16291A64525o00n2631J0047K1975l3924j014k671l9848L431K1675m2125r836l675
16278C5329J1635k535L7924L5412p297k6895q9637p1996k8638J3141K4153N9073
16266a0331M288p067K9453Q854k0986m289l3638j0377L840M5197K1460j1255l404
16253A1745L0686j3058k3835l1937K4799L5041k0156j0195p8828j9480J8437N1439
16241b5342M4146M235o3159l1443N856N8340Q845j9015P604l6776K6005N0981
16229C0277k9928r95l4562l9241N9891l8278p1850L484j8711P745M3896L0055
16217e8217L842k6208L5096L3392k4119j5294N0028O0262m4016k463P353m9811
16205c0155J539L7027J2686m9871l6762O925K1020J2945J0006J011j5997k8228
$$ y = [164525, 163925, 111294, 121341, 143316, 109392, 108378, 105707, 65859, 69290, 90965, 48840, 39004, 35329, 46964, 44429, 82353, 117765, 110468, 83573, -6064, -78060, -106698, -93557, -69404, -10331, -6043, -13110, 16343, 25197, 4211, -78, -33716, -44093, -40253, 4944, 26404, 15149, 11745, 42431, 29373, 5538, -26399, -1600, 33441, 13285, 3090, -75738, -95218, -76781, -25342, 18804, 23039, -40120, -71563, -65707, -7367, 1478, -17537, -9933, -46709, -20704, 30277, 349, -646, -35208, -74449, -14558, -52836, -124686, -121202, -139913, -132168, -88272, -58217, -54375, -80583, -45487, -12095, -36214, -51508, -1480, 58782, 14766, 12303, 19656, -30155, -28616, 8411, 21097, -28774, -65536, -58611, -37591, -24646, -14640, -13629, -29626, -57854]
16193e7854M9629l0449k3507m915O647N9878P215n4767o6553m494k407P9885k0227
16180f1919K8875M0191p724K2965N697m9451j9290K589K3729N0137k5466K3029
16168C3362K620L876o1411n5846L712k0664j1715j304O254M0578L0600K5541k854
16155g251n4300r937J6239K550j3743L6048o122J3717l9749r919p945k2791L9587
16142f3616k0844O0136M424k5334m4473o7302j6171K6522k787M1593L0633J4404
16130f2815R76k613M253p5927k3443O3748J3782P1088N597j1062L8390k4839J4162
16117A1297l651k7616n1562j7155L5070J8693N876l8020l9983K682M5944M92J4707
16104d3226m0822p2172N812r727j0021L1061L9219k2835J7572J4593m5650m1730
$$ y = [-57854, -8225, -38674, -62181, -67096, -60449, -571, 6644, -48123, -114676, -119170, -121577, -41692, -61919, -33044, 7147, -577, 22388, 28085, -21366, -40656, -38067, -14338, 35799, 10333, 33362, 35982, 39858, -21553, -77399, -73687, -94351, -106066, -107370, -101116, -60538, -29938, -4397, -7251, -61551, -71488, -55249, -52699, -66442, -30394, -36516, -22799, -62548, -72467, -80412, -103203, -63616, -84460, -24324, -19900, -45234, -89707, -157009, -173180, -146658, -149445, -107852, -77219, -62815, -61839, -64452, -60199, -136126, -159569, -95821, -82039, -10951, -5354, -16416, 21974, -2865, 11297, 7646, -19970, -71532, -88687, -53617, -34924, -29048, -67068, -107051, -104369, -58425, -57933, -43226, -84048, -156220, -150408, -160135, -170156, -139095, -99876, -122711, -105139, -90546, -136196, -177926]
16092a77926j2245J9408L098o765O8788J8152J9982j878K0857k1806m11P45m3354
16079a13355p899L0317L7399l4142K1354r873r0394K1596P204N5643J8556k451
16067f6045q222m0955K5769N1292j048k6009j8492m317m5322K6094M4976r960
16055g2239j1597j7493J7463j6095Q93L9331K0865j4170k4721n3963M0822N9364
16043c1540k2568p094L8420L8891m9558o592Q326n8177O048J8718O7283M251l2393
16030b5985k1324k1352l1764L3853L1540p5416n6629L1518K9636k8325l3062M3602
16018a23708L0182J8465J4924p0732R000K7421r269L7663k5959k774N6232L4068
16006d487O585K6396J2095n5697l2930l9273M8147L2590R599K6716k5509j9349
$$ y = [-177926, -190171, -170763, -167665, -174430, -105642, -87490, -67508, -69386, -48529, -70335, -70746, -70001, -113355, -121254, -90937, -53538, -87680, -66326, -76199, -166593, -144997, -137793, -82150, -63594, -66045, -74267, -115222, -89453, -38161, -39209, -65218, -83710, -88027, -133349, -107255, -62279, -72239, -83836, -101329, -83866, -99961, -99068, -59737, -38872, -53042, -77763, -131726, -90904, -31540, -54108, -61202, -22782, 16109, -33449, -40041, -31715, -89892, -83844, -65126, 2157, 6408, -25985, -47309, -68661, -100425, -66572, -35032, -110448, -167077, -135559, -105923, -134248, -167310, -123708, -93526, -75061, -60137, -130869, -121869, -94448, -103717, -66054, -92013, -94787, -38555, -4487, 2098, 28494, 40589, -15108, -48038, -87311, -39164, -6574, 3025, 29741, 4232, -15117]
15994a5117N921j1557K7760m570j7277m5665k5442K5191Q7192M4771l6043j09825
15982g4661p3653M9583Q6763L3202N1916K0636k2666m7945j0481k8701K538J6559
15970C090L0749L0292j2237N259l5632J6324L5249J6037m5300o6683m796j5922
15958d3570M3339L3811k8683o2446p4304o516N740J6301P111K6807K3114k3400
15946h2696O1497K4050M657k1135m0143j4370J5745K0271r103p269J645N2949
15934F098K9503M021o3731n2894n2769q866N4435O4466K0373K8765m7346P983
15922i962R705j1869m9027J5250M555m6657L436L6809j3243o8383L4994N0672
15910d3720o945O4018L4579k5786l8679k6985M0841K869m983K4910O964l3645
$$ y = [-15117, -9196, -20753, 7007, 2437, -14840, -60505, -85947, -60756, 26436, 71207, 35164, -74661, -148314, -98731, -11968, 21234, 73150, 93786, 71120, 23175, 12694, -16007, -13469, 3090, 33839, 64131, 51894, 57153, 21521, 37845, 73094, 89131, 43831, -22852, -27648, -43570, -231, 33580, 4897, -57549, -131853, -138369, -132629, -116328, -109217, -82410, -59296, -82696, -21199, 2851, 7508, -13627, -53770, -68140, -52395, -32124, -41227, -48496, -46851, 6098, 35601, 39622, -24109, -77003, -129772, -138638, -84203, -19737, 636, 29401, -17945, -9962, -257, -12126, -61153, -45903, -41348, -88005, -84569, -47760, -61003, -129386, -94392, -43720, -50665, 13353, 47932, 22146, -16533, -43518, -2677, 192, -4791, 20119, 27083, -6562]
15898f562J7949L2293l0765n7036Q894l3332k9237k2532J5997j7776j8620k128
15886a42855K8131O6554L5891k8287r1118m0220l7621L7230O4832P2400L3925
15875a138n136l4303j5692k2720j4415N3282L1497o7330K7373M8941m3024K9022
15863a3643r180N44L8237K8776n9057k0706J9987k5876l0575J3305j959Q837L2064
15850a9246M5019K7372q0965m6910L6149j0832j2204k1693J3355J540r631l8665
15838a16711k2262P0141L7099k859p2293k0925P3538J9908m613k6126m138L9034
15826c0207k3997p6877n0093P1647N7154l7295l6510K5154O9304J9548j9074k967
15814c4213Q6725J7842k1888N849J5966n7586M6259K98m9001q3031n6432O247
$$ y = [-6562, 11387, 43680, 12915, -44121, -35227, -68559, -97796, -120328, -104331, -122107, -140727, -142855, -114724, -48170, -12279, -40566, -131684, -171904, -209525, -172295, -107463, -35063, -1138, -6274, -40577, -56269, -78989, -93404, -40122, -8625, -75955, -48582, 359, -42665, -13643, -22823, -22279, 15958, 44734, -14323, -35029, -15042, -40918, -71493, -58188, -60147, -51310, -19246, 25773, 53145, -27820, -74730, -38581, -49413, -61617, -83310, -69955, -68415, -78046, -116711, -138973, -68832, -31733, -34592, -106885, -127810, -54272, -34364, -38977, -65103, -69241, -30207, -54204, -131081, -181174, -109527, -52373, -89668, -126178, -101024, -31720, -12172, -31246, -34213, 52512, 70354, 48466, 54315, 70281, 12695, 58954, 59252, 10251, -72780, -129212, -122965]
15802a22965J846N807j8925M1666L9189k1788L783J32Q062O151K9840M676k872
15789b5398L4921K4954L4562l7659k5721j8963o0266M8661K6492m7363K3403Q0438
15777E8061O4727m7832l8384j1608l0853m5818K4116K9462J0849M4413N894q706
15765E4321k1193M650j322j2927O828J0173R779n3920k160o795m1576L1640L6602
15752A4100Q819j0121L8244j7997j2908j3645q0221M0334L6170k0399o9465m807
15740i1896M5217N1357r403k9749L4582J2731L304K0634n1025k92N8346L3391
15728G7197o18l9096m4416L3772K4154k0214l9902L5608m7994K924P5336j6356
15716D0395R181K7559k8426p9291L1242P5681n8968l8480j3209j324K6817J3876
$$ y = [-122965, -121119, -115312, -134237, -92571, -53382, -75170, -71387, -71255, -63193, -57042, -27202, -22526, -25398, 9523, 34477, 69039, 31380, 5659, -13304, -73570, -24909, 1583, -45780, -22377, 58061, 122788, 74956, 36572, 24964, -5889, -51707, -27591, 1871, 12720, 57133, 63027, 54321, 33128, 37778, 36456, 23529, 30357, 40530, 50309, -3611, -5771, -12566, -54142, -22502, 14100, 22919, 12798, 51042, 33045, 20137, 6492, -73729, -33395, 2775, -17624, -87089, -91896, -46679, 4678, -4725, -34474, 108, 12839, 16143, 36777, -14248, -14540, 43806, 77197, 76579, 37483, -6933, 26839, 50993, 30779, -9123, 26485, -21509, -18585, 56751, 40395, 49576, 77135, 48709, -30582, 660, 76341, 17373, -21107, -34316, -35640, -8823, 5053]
15704E053J043n0051j1884k8591J0692M6431K9974l2762o8308l3272L662P983
15692a20030L5413P7135J6651N42k5827k8784j1148J6322M1484J559J9202j0626
15680A1893k8115l3442m470M5950q641j8718M0212p3497J0833M5121M780j1600
15668a9694k38p265N595N0964M6199N1994J166o6513o2291m2096l9783J391K6333
15655e4238J7220j0994M0736l5652N65J5618p7800l1291L7250k1470L351M9921
15643f6784J2766o512N2570O802m1429l6771m1078l7758N3484M2747K2634p762
15631d7091m6618K9608j4775j6429J4482K3867M3055J2628j4098o7630j6737J3189
15619h6549K8571L4034m3474j82l6099J522j6034L5010J1965P119J7949k583n202
$$ y = [5053, 6096, -43955, -55839, -84430, -73738, -27307, 2667, -30095, -98403, -131675, -128013, -120030, -84617, -7482, 9169, 9711, -16116, -44900, -56048, -39726, 1758, 3317, 22519, 11893, -16222, -49664, -54134, -8184, -16825, -35543, 4669, -68828, -57995, -12874, -8094, -19694, -19932, -27197, -21602, 29362, 75561, 127555, 128721, 62208, -83, -42179, -81962, -80571, -54238, -37018, -48012, -7276, -42928, -42363, -26745, -104545, -135836, -98586, -120056, -116705, -66784, -54018, -60530, -7960, -1158, -42587, -79358, -120436, -158194, -104710, -61963, -39329, -47091, -93709, -64101, -78876, -95305, -80823, -56956, -13901, -1273, -15371, -83001, -99738, -86549, -57978, -23944, -67418, -67600, -103699, -102177, -118211, -83201, -71236, -64117, -46168, -48751, -53953]
15606e3953J8695J886O9720o722l5027J0094N425m7428Q609K9361L9803n2979
15594a2516n1237j8851N5754k0170k1205k8874k1544O240L8589k4441n0987O784
15582a42458K0756R1129M3121o7383n3452L3540P8871r164k5685o497L3851l8931
15570d2302m7049M007O3144J8781M4488j2501l5398K821j5723o4247O6208L1472
15558A3701L4398M797j4568k1764m9455o7261n824J0566R222L5705K7942l2720
15546e5261n287M5968K0042l2258J0291J9077L8586k0168o1261k6452L8628K6585
15534a510p606K1489n664n0118j3273N7856j9370Q857J8378m7886m6615k1528
15522a06990n935j1967J8704l9109K3318J3915q93J5253J4759j0425J2235L4034
$$ y = [-53953, -35258, -33372, 36348, 29626, -5401, 4693, 10118, -37310, -28701, 660, 40463, -12516, -63753, -82604, -26850, -47020, -68225, -97099, -118643, -112403, -73814, -98255, -149242, -142458, -121702, -30573, 12548, -54835, -108287, -74747, 4124, -5040, -30725, -37222, -3371, -42302, -89351, -85344, -22200, -3419, 41069, 28568, -6830, -4009, -19732, -83979, -17771, 13701, 48099, 52896, 38328, 16564, -32891, -100152, -105976, -95410, -86188, -50483, -22541, -55261, -60548, -14580, 5462, -26796, -16505, 2572, 41158, 20990, -40271, -66723, -28095, -1510, -9116, 12373, 6709, -43409, -56682, 1174, -18196, -9339, 9039, -38847, -85462, -106990, -112925, -124892, -106188, -145297, -121979, -108064, -108957, -93704, -78945, -89370, -77135, -43101]
15510d3101n487K0929J8143J5283N4363k4796m4093m2993J9385J5521l5855n936
15498e8637M8210K7062k4480j1484k4310j6336o7344p065J2696J777O095M2587
15486g1229R760j9518K4390J6309N3030K7193J6886l1042k0299l7483M700M1089
15474A3786N4023K9924M759l7612j3377l501j9426q209J6502j9591M645k2718
15462g95k9365q906M2593J816J0116L1311J4211n4411j6001R572K0792J4913J3504
15449D9350K7272J497k8617m3344m9109N5212P230K1452J2955r2927K183N354
15437c1492J5316M5923j1457l172O637K7971K7223l4280o1488N659J6213L5221
15425C8274k8285l7085q311K7325L3011K2137K1940P3070r628j29125r9141J3522
$$ y = [-43101, -48588, -27659, -9516, 5767, 60130, 35334, -8759, -51752, -32367, -16846, -52701, -58637, -10427, 16635, -7845, -19329, -43639, -59975, -127319, -134384, -121688, -119911, -113816, -71229, -61469, -80987, -56597, -40288, 12742, 39935, 56821, 25779, 5480, -32003, -27303, 13786, 67809, 97733, 102492, 64880, 51503, 48002, 28576, 20367, 36869, 17278, 21923, -795, -30160, -39066, 3527, 5343, 15459, 46770, 60981, 6570, -9431, 141, 20933, 35846, 49350, 76622, 78119, 49502, 6158, -42951, 12261, 19491, 40943, 53898, -39029, -36846, -31492, -16176, 29747, 18290, 15118, 21755, 49726, 76949, 42669, -18819, -13160, 3053, 38274, 9989, -27096, -35407, -8082, 24929, 47066, 69006, 142076, 132448, 3323, -95818, -82296]
15413h2296L2003O581K9206P7488k2496j06813m090L7381J3508l4388p8550J5768
15401a16698P7362M5164R281l0373k925m1796j7948L9565K4465q11p095R4807
15389G2998l2439r7430j2846N2465n5711m566L8107K4169o3251o8309L3677N3557
15377e9579k1640k892L539J8056P1207J8542m3782l582O391j8889O7460l8663
15365c832k9724J0135m2221O1641K6731L4204J5909k8262n4168P247L1629R708
15353C8997n9632j9281j2893j9493J8830m4760k6414N6783J8932R324n379j0178
15341e5164M7091O695l813m0839M2147N0879k4006j0357k8618N6852J03213k2088
15329A21992p5839o4613l904J2183J208m164n397k2526j2347Q292k8751L0561
$$ y = [-82296, -50293, -43712, -14506, 62982, 40486, -66327, -70417, -33036, -19528, -53916, -132466, -116698, -39336, 5828, 15109, -15264, -18189, -59985, -77933, -38368, -13903, -14714, -21809, 72998, 40559, -56871, -69717, -17252, -72963, -77529, -39422, -15253, -78504, -146813, -113136, -59579, -81219, -84111, -80572, -62516, 8691, 27233, -16549, -20131, -13740, -32629, 34831, -3832, -33556, -23421, -65642, -4001, 22730, 56934, 72843, 44581, -9587, -2340, 29289, 38997, -20635, -39916, -52809, -72302, -53472, -98232, -124646, -67863, -48931, -39607, -44986, -55164, -8073, -1378, -5191, -46030, -3883, 46996, 22990, 12633, -15985, 40867, 144080, 121992, 46153, -18460, -22364, -10181, -8973, -13137, -18534, -41060, -53407, -45115, -73866, -43305]
15317d3305K247N9956O2635L921j4616o2382l5976J5044M9110J6671j4724j3063
15305B5518k090J9932j2384m2734j514k0979K7732L9688o6066m6081q386m932
15293i2296J5894J3031N80j289n3355J1771K0276O7016M0598L5546j0032m049
15281D3691K7405P369J9876q251k3758p6161m3210l7743N8623P919K298N892l612
15268a9662K9681l596m0175k3359j0216L8690M3492J0172J1697j8187k0807K7963
15256B5693o7548j5623m0001L760M1624Q723k7041j450M3362l3288k5452r12R0949
15243B796Q6583J0965j1374j0056l171m1444j12519p629O0687Q9856p751k788
15231E4155o0757j6957j1098l6j8205j8087P8774J8203m3552M7353K5368j7711
$$ y = [-43305, -41058, 18898, 81533, 85454, 70838, 8456, -27520, -12476, 36634, 53305, 38581, 25518, 23428, 43360, 30976, -11758, -13272, -34251, -6519, 33169, -32897, -78978, -87364, -92296, -76402, -63371, -62791, -64080, -117435, -105664, -85388, -18372, 22226, 57772, 47740, 43691, 71096, 78465, 98341, 90090, 66332, -9829, -53039, -90782, -32159, -24240, -21942, -16050, -19662, 10019, 6423, -33752, -57111, -67327, -28637, 14855, 25027, 36724, 18537, -2270, 25693, -41855, -57478, -97479, -93719, -52095, -43372, -70413, -71863, -28501, -61789, -87241, -88153, 2796, 89379, 100344, 88970, 78914, 75743, 34299, -78220, -85849, -25162, 64694, 56943, 54155, -6602, -23559, -34657, -34693, -52898, -70985, 7789, 25992, -17560, 29793, 55161, 37450]
15219C7450k5436k3410k6528O533O6749l5837J5408m173l8891N439k4805o75J9508
15206b8668M5984Q9597J2183m0326l3243l7450L7179j4237l2920k7311L1208J8115
15194B0111k2000n8151M4557O9237m8273L77j411J6321n322K4890L1375M912l0503
15181D6120n0912n6311M7134L8739l5858m5854k9743j8698j3465N2693P0649K497
15169F991m6827P201J5624N3657K583M7377K9576l3034p3254n3434j7252J0858
15157d9934N3052J2970N45j6883K1847L0769k2773n0949J1407j9202q517r595
15145d7263p626J0230k0114L2956k0715j1323J147K0418J2871k9097N780j7447
15133g0183O906J8556o3759J9839O5482r584q487K0712j5681P768r75O1776K8088
$$ y = [37450, 12014, -11396, -37924, -31391, 35358, -479, 14929, 10756, -28135, -22696, -47501, -48176, -28668, 17316, 106913, 119096, 78770, 45527, 8077, 45256, 31019, -1901, -29212, 1996, 20111, -1889, -60040, -15483, 53754, 5481, 5858, 4447, 20768, 15446, 40336, 71711, 76623, 46120, -4792, -61103, -13969, 24770, -11088, -56942, -86685, -105383, -118848, -66155, 4494, 6991, -39836, -32635, -17011, 36646, 39229, 86606, 116182, 83148, 9894, -43540, -60792, -49934, 3118, 16088, 16633, -250, 21597, 52366, 29593, -21356, -9949, -29151, -37668, -47263, -54889, -44659, -64773, -31817, -52532, -63855, -62708, -42290, -29419, -58516, -52736, -70183, -63277, -44721, -108480, -88641, -23159, -32743, -41230, -20518, -36199, -28431, -29406, 32370, 60458]
15120F0458j5489j4859k6409N9m0744j3990Q8626n7k233J6064q2904m556R834
15107b6200j5163J5945k5244L5594L305l4498K0858l3494l2132K3003M8043J5434
15095d549j1236l2305M6051L1618j3566l23j6311J2549L054p3293oP293L3988
15082a7036O7994j3771n2906j982K0570Q6095r7443p1931J664J1657n0323r969
15070a27381m123j1663K0937P3356p870K2096K237K7671K7965L2564P605L9797
15058A03191N5790n2500p7643j9358p940R618O4015N373m9386j3336K7170j6411
15046B8583m1850N4864N0209j2608p6591m9944K7455N8171N917j4724j0823M675
15034B3334M454J3072J6157O476j3879M1311L8966l8145q55N882L4073P0250o563
$$ y = [60458, 44969, 30110, 3701, 3760, -36984, -50974, 37652, 37595, 35362, 51426, -31478, -36034, -26200, -41363, -25418, -50662, -15068, -11763, -46261, -25403, -58897, -91029, -68026, -19983, -4549, -15785, -48090, -2039, 29579, 16013, 15690, -621, 11928, 14982, -58311, -58317, -51024, -17036, 50958, 37187, -15719, -17701, 2869, 88964, -8479, -80410, -78746, -67089, -117412, -127381, -131504, -143167, -122230, -48874, -56744, -34648, -32411, -4740, 23225, 55789, 63394, 103191, 158981, 106481, 28838, 9480, 1540, 11158, 75173, 80546, 31160, 17824, 44994, 28583, -13267, 41597, 91806, 79198, 2607, -47337, -19882, 38289, 44206, 29482, 18659, 23334, 27788, 40860, 57017, 63493, 49614, 90925, 129891, 91746, 90891, 96773, 130846, 201096, 194533]
15021A94533o8971j10584k8314r971N3853J4252J0417k4231m3299n3061J9971
15010d5405m393n5017J5334L9944Q436j127j1091j934N4023O3624l933l9596K7892
14997D6757j7248K0243q238k291k1349k9194n6982p589K3191n672O5909L7142
14985D4679j7393k5420L374n517r165M4265R939o9457O691M5964l1282j5034K5313
14972F957P708r5819k1942O409K0579k6812K0911k1537o8308J0420N4181j936
14960a09189K2485P3028L2723J3024m0684k4122J1089J5459l1163J300J7286L6017
14948A7253K8437L0430K710m365p1576q1035J7151k0164m872N5905Q400N782m5746
14935f1690n1452k1926Q0215J8164l5733j994j4867L055M4877J63j8923M9444
$$ y = [194533, 125562, 14978, -13336, -23307, 30546, 44798, 55215, 30984, -12315, -65376, -45405, -49798, -104815, -89481, -49537, -41101, -42228, -53319, -55253, -1230, 62394, 58461, 18865, 46757, 29509, 49752, 41514, 39223, 17874, -11320, -68302, -75891, -52700, -58372, 7537, 44679, 27286, 1866, 5240, -277, -9442, 34823, 44762, -24695, -18004, 27960, -3322, -18356, 6957, 14665, -81154, -103096, -96687, -76108, -102920, -82009, -103546, -171854, -161434, -107253, -109189, -86704, -13676, 19047, 32071, -8613, -32735, -21646, -6187, -37350, -36050, -18764, 17253, 45690, 76120, 78830, 74465, 2889, -78146, -60995, -81159, -86031, -30126, -21726, -15944, -61690, -113142, -135068, -54853, -36689, -72422, -74416, -89283, -86228, -41351, -41188, -60111, -10667]
14923a0667J3991j5358l845J8314L7434K6899K714q7629P498p76J2344k3951M722
14910a8310J3117k0007k2846K3583O2105n653J1455j5058j790R261K9218j5456
14898D9619j1698K0331k7998l2693n4964J8601K7237q945j7519L4378O4850j5252
14886D5947p6796K9282R277o3627J8976M4854m807l7284l7745k5375K6998L0578
14874c9722m002m604L7642k2484l7318j7788M1637Q0338O2022r9132p7900m844
14862h6155M2460O3290m575l0812K1079l8996k3741M332N0877M7413J5137j2051
14850D8258n054O2328L0072J7453j7123o5483l0389K844p578m1536j2292m609
14838b3109o377P230r929J5570M4525J8973J1474q439n6842n0350K8858M720J5096
$$ y = [-10667, 3324, -12034, -15879, 2435, 39869, 66768, 69482, -18147, -10649, -11425, 919, -23032, -18310, -5193, -25200, -48046, -24463, 37642, 31989, 43444, 28386, 26596, 35857, 65075, 49619, 37921, 58252, 30254, -2439, -57403, -38802, -11565, -20510, -38029, -3651, 61199, 45947, -30849, -1567, 7710, -55917, -36941, 7913, 3106, -34178, -71923, -97298, -70300, -39722, -43724, -48328, -10686, -33170, -70488, -88276, -46639, 33699, 95721, -3411, -81311, -86155, -43695, 19595, 15020, -15792, 5287, -33709, -57450, -53118, -2241, 45172, 60309, 48258, 43204, 105532, 135604, 153057, 135934, 70451, 40062, 42906, 35328, -6208, -18500, -23109, -29486, -22256, -32185, -16615, 27910, 46883, 58357, 49918, -6924, -57274, -28416, -23696, -8600]
14825h600o889m9199J5600K0337o687J9692M1522j7889L6393j5763m1715l0862
14813d4060n6796J2534M6019j9838L1461J474m9126J8527l1543k7819l1622L6435
14801a14354O2006j5109N0670Q0489q401o3691J1654R0016K461o2003n6238L334
14789a9166J9818o91j2218l2871l7768J2187J2924R352p365L4059J4967m5160
14777e1932J8088R2566K7523n7014p239j0698l6385K7359O0814K1934M7620j0018
14765A22618m5703r577P4297J5342o7484m3522p09k0651j0235p574j8095q743
14753b0036J7719J2130R379k5371J1315k2477k5235j4537P496K6957J25P961M1940
14740B7366R87k7633j1010N6319J2433j7246K5403l3689p2267j3607m185N8160
$$ y = [-8600, -15489, -64688, -49088, -28751, -35438, -15746, 25776, 7887, 44280, 28517, -13198, -44060, -100856, -88322, -42303, -62141, -30680, -29206, -78332, -59805, -91348, -119167, -150789, -114354, -52348, -67457, -16787, 63702, 55301, -8390, 3264, 93280, 95741, 33738, -22500, -19166, 652, -39, -12257, -45128, -82896, -70709, -57785, -48433, -55798, -21739, -6772, -51932, -33844, 58722, 86245, 29231, 21992, 11294, -25091, 2268, 63082, 85016, 132636, 122618, 76915, 67338, 141635, 156977, 89493, 45971, 45262, 24611, 14376, 6802, -11293, -20036, -2317, 9813, 19192, -6179, 5136, -17341, -42576, -57113, -49617, -22660, -22535, -14574, 27366, 28353, 720, -10290, 46029, 58462, 41216, 66619, 32930, -39337, -52944, -57129, 1031]
14728A031O3357k3195k3324r9422k0218n2489J1671R7575P1551j1091J9514J8429
14716E3389j0326k9843L790k114L3514k6297j6322k21j1256k2547N89Q512J8850
14703b82l237J2014J3872p3590K5349P3850L1627k3454k8921j6662J0353N6709
14691G7628o1085j13288K3212M5348N722J720L0554R768J3177l0367J3289k214
14679A3464k4594j4795J3734J1983J2441K5719J0946J5693k949l8230n271K9653
14667D7794L8102k4943J5749o277p876j7289k1956j7086n4524q740K3233p80L455
14654c1138O6921N241m0482J8083M3980L6938N1992k6333q831j93r0995l5452
14642a0269j1474J1219L407q543k7820J1378J4829J9035n1984M2576R978P9114
$$ y = [1031, 64388, 41193, 17869, -81553, -101771, -154260, -142589, -45014, 26537, 15446, 34960, 53389, 43063, 13220, 17010, 14896, 48410, 22113, 5791, 5570, -5686, -28233, -27644, -19132, -282, -3519, 8495, 22367, -51223, -25874, 47976, 79603, 56149, 27228, 10566, 20919, 77628, 16543, -96745, -73533, -28185, -22463, -20743, 9811, 19579, 32756, 2389, 15678, 13464, -11130, -25925, -12191, -208, 12233, 37952, 48898, 64591, 61642, 23412, 18141, 47794, 85896, 60953, 76702, 70425, 62549, 45260, 23304, 6218, -48306, -57046, -33813, -34593, -31138, 35783, 41024, 542, 18625, 62605, 99543, 151535, 125202, 116371, 116178, 25183, -10269, -21743, -10524, -7117, -15660, -43480, -32102, -17273, 1762, -50222, -7646, 2332, 81446]
14630H1446J3099P253M945n4406l9371L96J8642M039J6874Q870k6063L458m2742
14617c560k6713J8195J7080k2930k0569P2297L3570n4789n837K4284q105j0486
14605A2437m3835J2982m8245R281J36250M8356m1854o1219m723m7341N428M0870
14593A8387m7247m1238J4182l771J25K6426l5462j983N9449M9280O2559l1494
14581F9213m7300n8949J5984K7444K2206j0834J5134J9014L6037J0733l2722K7066
14569I3026J1647N2450j0331l9506j32905q2795J5292J02933M6683J6092K5420
14558I8006k8071l6790K3248M5757r1976m3152K2435K3003K1140j7053J2395j3509
14546A5433k1800j2094m6127l840J9206k1071j4167J243r974J6996M0982J9953
$$ y = [81446, 94545, 101798, 106743, 52337, 12966, 13362, 32004, 36043, 52917, 61787, 35724, 39182, -3560, -30273, -12078, 5002, -17928, -38497, 33800, 67370, 12581, 6744, 31028, 22923, 12437, -31398, -18416, -66661, -57380, 78870, 127226, 85372, 24153, 19430, -27911, -22483, 18387, -28860, -70098, -55916, -59687, -59562, -33136, -68598, -70581, -11132, 38148, 100707, 69213, 21913, -37036, -21052, 6392, 28598, 17764, 32898, 51912, 87949, 98682, 65960, 93026, 104673, 157123, 146792, 107286, -25619, -108414, -93122, 9811, 56494, 72586, 98006, 69935, 33145, 56393, 102150, 10174, -32978, -10543, 12460, 33600, 16547, 28942, 15433, -6367, -18461, -64588, -68428, -49222, -70293, -84460, -83217, -93191, -76195, -35213, -15260]
14534a5260N7117L7224k627j9186M718l3688j9417m631Q6448L3084q8698k0332
14522A4752M4154M5143j6091k254J9848k0875o8433q0784p4006M0728M3122l0387
14510h5083K0814O0049K8913K0547O199j9221J5108K5445m853m143k6343m9733
14498a2301j9746Q527J3015M687p097j4989k4174L7788M3157K684N327l2990l3581
14485b9693k9677K4733L1635J6526K0121L4441O559l382o9014k6733J7773o786
14473a3497M9224P393m7208k211J872K1215r478j7990k3595J6284m291L3627K9207
14460D0552K8844N065k6988k0796l7460l753J7553k6380M0153K9152n0791k5031
14448b9880N9410k7154m9229l913M019k6544p111K5290L3311q189j5488l5521
$$ y = [-15260, 41857, 79081, 76454, 57268, 61986, 28298, 8881, 4250, 90698, 123782, 35084, 14752, 58906, 104049, 87958, 85704, 105552, 84677, 16244, -64540, -138546, -97818, -54696, -85083, -64269, -4220, 24693, 45240, 51439, 32218, 47326, 72771, 67918, 63775, 37432, -12301, -32047, -23520, -10505, -5818, -12915, -27904, -52078, -14290, 28867, 31551, 36878, 3888, -29693, -59370, -34637, -3002, 13524, 33645, 68086, 74645, 71263, 2249, -24484, -6711, -13497, 35727, 43120, -4088, -6299, -4427, 16788, 7310, -10680, -34275, -17991, -22282, 11345, 40552, 69396, 74461, 47473, 26677, -10783, -14536, 3017, -23363, 16790, 45942, -4849, -29880, 29530, 2376, -46853, -50766, -46747, -73291, -80402, -55112, -21801, -29990, -45478, -80999]
14436h0999K6360N2023J2175k2040k344j5635o1370N1523M2301l2186R156M2771
14424B1735L7166r999l6455M743m165k4288r6630L3748Q714m337K0200J1621o1558
14411i9505k0953P917N3087M8881M5357j6037k1238K3840K4819k4431J0489m0878
14399h652l1368j9186K184K6139J9096m264J8437j359k4798k2106N5796j1730
14387a811m2481J9215L2980k9478N1517L3057k7901m0000J8787k7251k3450q988
14375d5804J9664J6236M6467K6047j3329N870k3926l4621o0547k7517O8873k2060
14363d4647L69j1771j326L9395M125N5331N1613k7259q6107m7667O1261K3898
14351A7215j5897J62M0306M1174r1584p2382J4089L2122J0246J8403J1416j1050
$$ y = [-80999, -54639, -2616, 9559, -12481, -14825, -30460, -91830, -40307, 1994, -30192, -21036, 21735, 58901, 48902, 12447, 17190, 13025, -11263, -107893, -74145, -65431, -69768, -49568, -37947, -99505, -120458, -112541, -59454, -10573, 34784, 18747, -2491, 21349, 46168, 21737, 32226, -8652, -40020, -59206, -57022, -30883, -11787, -16051, 2386, 1027, -23771, -45877, 9919, -1811, -44292, -25077, 7903, -21575, 29942, 62999, 35098, -4902, 13885, -13366, -36816, -45804, -26140, -9904, 36563, 62610, 49281, 55151, 31225, -3396, -63943, -91460, -22587, -44647, -44278, -56049, -57375, -17980, -13855, 41476, 93089, 65830, -20277, -67944, -6683, 17215, 1318, 1480, 41786, 82960, -8624, -81006, -66917, -34795, -24549, -6146, 5270, -5780]
14339e780L590m0537J9447N4349J9116K4516n528k4279m0530K9054M2284J950
14327G7652p81q3253n2854Q9614j3977k2813n6690K5531j0013m0790O106K2253
14315f0015M7344N2044l5010j9420R508L7517K1634M436K1268m758l9328k4621
14303A0599J3039O9699l1738K8506J6558j4716q293M104o5940j7162k2944l2286
14291e0574o163K2604r745j1745N0664R4010L57n5424r5059L4754P7234R623K229
14278F2765p8026l0685M2515N306N283Q4175k3636l6731o5450k1704J6413M5036
14266E261j2818m982o777K6182j7122j0951J5225K6334L8498m348j3752J0647
14254E1397j3105p6655j8120L8099J9199k1305l9295K5939N114K0923m552j0995
$$ y = [-5780, -2190, -42727, -23280, 31069, 50185, 74701, 69173, 44894, 4364, 33418, 75702, 77652, 76871, -6382, -59236, 30378, 16401, -6412, -63102, -37571, -47584, -88374, -82268, -60015, -12671, 39373, 4363, -15057, -5549, 31968, 53602, 58038, 79306, 74548, 35220, 10599, 23638, 93337, 61599, 90105, 106663, 91947, 83654, 87758, 21818, 4656, -18288, -50574, -56737, -34133, -43878, -55623, -4959, 89051, 89408, 33984, -61075, -26321, 50913, 60536, 62765, -15261, -45946, -3431, 1875, 7158, 91333, 67697, 30966, -34484, -56188, -39775, 5261, -7557, -12539, -19316, 6866, -10256, -21207, -5982, 20352, 58850, 54502, 40750, 51397, 38292, -38363, -56483, -18384, 815, -20490, -59785, -33846, -28732, -7809, -12361, -23356]
14242b3356j5346N0710J4280n918r511N201k8778M7207l3118j9354m1053J4289
14230d4747N5493K5988L7308m7024k8535j398R23o0495l71L2163r827k9787k6310
14217i6619P5135L3729k830j925r2145j814L9755m5522L0825O9625M534n651o704
14204C93j3342L2128k0624k170k2381n0258P4841O1175J3407n304q0672m8909
14192f1716L4618P8947l9549o1287q108N9522P591n0705j0633M7738P234k8645
14180b4993k1014M1270k0437K375M1664K6269K6550J5297m3546o4473k9174j8382
14168f8594M4531P139l9865j9434J8305l2693Q790k0420K9389N0469P0646L4825
14156H3088k4199p1272M73l5526l8506J9788J6919k4417K3973j3414k886o1325
$$ y = [-23356, -38702, 12008, 26288, 20370, 10859, 16060, -12718, 34489, 1371, -17983, -59036, -44747, 10746, 36734, 74042, 27018, -1517, -2915, -1992, -62487, -62858, -30695, -40522, -70309, -96619, -21484, 12245, 9415, 7490, -84655, -86469, -46714, -92236, -61411, 8214, 12748, 7097, 393, -12949, 19179, -1445, -3615, -25996, -76254, -1413, 59762, 73169, 67865, -12807, -61716, -27098, 51849, 12300, -48987, -57095, 2427, 10018, -40687, -51320, -3582, 3652, -24993, -46007, -4737, -25174, -22799, 18865, 45134, 71684, 86981, 43435, -21038, -50212, -68594, -24063, -16924, -56789, -76223, -57918, -90611, -81821, -102241, -72852, -22383, 48263, 83088, 58889, -12383, -11910, -47436, -85942, -66154, -49235, -73652, -49679, -63093, -65979, -127304]
14144a27304Q488O4557k7594L9608N0871L0698m2055l3269Q867L104m3638J1309
14132e6358O0456J3343J018k935k222K9033o0459j5450M9634J2605n644J4782
14120C7803j2331J3101k22j5137L6769N316m9787p557N0831J8378Q363J1691J8414
14107A15632l1738l7865J2830p128l0805L1358L0547j3431j7737k3325k1j5636
14095A2681O940m7067j4673n32j4045P0537j5426k3729J9130j1001R542l6011
14083d3654K8635j6334m2627j4140M6851j3808O1428N3707j6457m2217l4920j8249
14071e1785k440o452J1993M8600j1386k052n24j754J3558r497j1981k8824J8847
14058c3697K7715L0147m3143l4738k3172n8062J3740N6300N6741k4416R732L9029
$$ y = [-127304, -118816, -54259, -81853, -42245, 8626, 39324, -2731, -36000, -27133, -24029, -67667, -56358, 4098, 17441, 18459, 15524, 13302, 42335, -18124, -33574, 16060, 28665, 23021, 37803, 25472, 38573, 38351, 23214, 59983, 65299, 15512, 7955, 58786, 77164, 85527, 97218, 115632, 83894, 46029, 58859, 51731, 20926, 52284, 82831, 69400, 51663, 28338, 28317, 12681, 19621, -27446, -42119, -42651, -56696, 13841, -1585, -25314, -6184, -17185, -7643, -43654, -15019, -31353, -73980, -88120, -41269, -55077, 6351, 60058, 43601, 1384, -33536, -51785, -54225, -60677, -48684, -84, -11470, -13522, -14046, -15800, -2242, -11739, -23720, -52544, -33697, -5982, 24165, -18978, -53716, -76888, -134950, -121210, -64910, -8169, -32585, -22853, 16176]
14046A6176L7086k6330o5821k5207L9320K9591k8900M1168K9686p261k0292L9420
14034E8636j3296l008M615o13k9891j4063L0183o2743K5373K9149O453m198k3690
14021B907k3512o2676k157K4710K9876l1138N4988P3501R216j8697l7877j4975
14009D166K6475M5764k4282p4801l1437J9628L0687J5530J247O1919l6428q6455
13997d7987n128M2423M4496M3257R669l369l0784p0725K27J04088J0903q1499
13985A5571l2222n0932J5076P7688K7240Q625k2341J6781L2584j2688o1880k4265
13973a0763P20L1084J3635N123Q0846k6997l0780j7651j9555l6766k041J0933
13961b212J0890K5991L9804j6473m3954j2962Q2917J6418m6831l0480l379J5606
$$ y = [16176, 53262, 26932, -38889, -64096, -24776, 4815, -24085, 17083, 46769, 39508, 19216, 58636, 45340, 42332, 46947, 46334, 16443, 2380, 32563, -30180, -4807, 24342, 30795, 26597, 2907, -20605, -83281, -85438, -60728, -30852, -61990, -7002, 66499, 75715, 57018, 19141, 4166, 30641, 76405, 52123, -22678, -54115, -34487, -3800, 11730, 12977, 74896, 38468, -47987, -53115, -10692, 33804, 77061, 86730, 83361, 52577, -18148, -17921, 86167, 97070, 15571, -16651, -67583, -52507, 25181, 52421, 61046, 38705, 55486, 88070, 75382, 13502, -10763, -10043, 21041, 34676, 39799, 120645, 93648, 62868, 45217, 25662, -11104, -13145, -2212, 8678, 34669, 74473, 58000, 14046, 1084, 84001, 100419, 53588, 23108, 19729, 35335]
13949C5335N034m2544l0588O313L860K807N0740j9183n8568r32j635N0116O771
13936G526l1962l8398L6798J5093j9866K8738k4103j3291l632L9691M6448p982
13924C5060o6548q870j20n4782K4841r312Q4887K8090l549k0639J0599K1287n0955
13911a0011M5946O5219K6459P249k47n8287n7217m2527k9827j4729n8198m3004
13899a69174O7177N7944Q823k2115J4048L1704O07k9552m8971m6202J332J3802
13887a20577l6506l1709K1645Q7371N4895k2793J5509R1k6070K4752K3720L5943
13875B6271M1885K5127n9115p8474L439O235k0925j9029K7167N4004J4508L74
13863B1467l667K6487J7868O0821j1555o4897m3902k5198k9297M1973M7980o29
$$ y = [35335, 40369, -2175, -32763, -26450, -22590, -19783, 30957, 11774, -46794, -47726, -49361, 755, 7526, -24436, -62834, -26036, -10943, -30809, -2071, -26174, -39465, -43097, -3406, 43042, 35060, -31488, -40358, -40478, -95260, -70419, -79731, 5156, 33246, 29697, 9058, 19657, 40944, -10011, 35935, 101154, 127613, 134862, 134615, 76328, 19111, -23416, -53243, -67972, -126170, -169174, -101997, -44053, -35230, -57345, -43297, -11593, -10986, -40538, -89509, -135711, -134379, -120577, -157083, -188792, -167147, -79776, -24881, -47674, -32165, -32074, -58144, -33392, -9672, 26271, 68156, 93283, 34168, -44306, -40867, -34632, -55557, -74586, -47419, 6585, 21093, 21467, 17800, 44287, 62155, 122976, 111421, 46524, 2622, -22576, -51873, -9900, 38080, 37451]
13851C7451o1791j376k823J540k8844j0913R0200J04313k8196r5022k2218J8813
13839A134r026M402J810j3930K7107K7879K9589j830m5324q708J1586l060O0239
13826H1868l6620l4308q9238M2038O7303P0769K613n8086m172n2967n4683k6897
13814i2380R171O584k1549Q1465N4124p634j6375l4535M62L9630M4662n1938m3680
13801c1993J4728J1569k589N738M1382P6473L6698m1752p1326m0817J2836P415
13789A8362Q836K199j5892J543k3493j4369K7051l4023K6273K2946M0113j3000
13777D6546l6711o035J0802p399N17N9804l8960n5921l2616J01274N5118l6602
13765E9817l2555J1500K0330J5578k9642M3410K9487l279p4621p1730k131K8252
$$ y = [37451, -24340, -25716, -28539, -26999, -55843, -66756, 23444, 127757, 99561, 4539, -17679, 1134, -7892, -3490, -1680, -15610, 11497, 39376, 68965, 67135, 21811, 13103, 24689, 21629, 81868, 45248, 10940, -78298, -36260, 31043, 101812, 104425, 46339, 42167, -10800, -65483, -92380, -83209, -76625, -98174, -16709, 37415, 29781, 13406, -21129, -20667, 18963, 63625, 11687, -31993, -17265, -5696, -8285, -2547, 38835, 115308, 152006, 110254, 38928, -1889, 10947, 18362, 27198, 29397, 13505, 15048, -8445, -22814, 4237, -29786, -3513, 19433, 59546, 46546, 9835, 3800, 14602, 7203, 7720, 67524, 28564, -27357, -59973, 41301, 96419, 59817, 27262, 38762, 59092, 74670, 45028, 88438, 117925, 114646, 40025, -31705, -33836, -5584]
13753e584N2425l4947m7177p769L2651K0192M671k248M116L90k5682J3385J0010
13740A4433l2572k8144K8804L688l6028j4566k7129L0552M0893K0960l1575R925
13728b0759L0373R864J7245J9657m0167k9082l8528L661J9631R541M223L8011
13716B3670J3590R943n6067J5974o350J1106L9177l8396k6517J2435K6492k7941
13704b884M9366L9398l0120k5620k7713L200l8710K6030M9107l6638J628n2115
13692d5071j1861K887M7235M1162k5045q4591j963K8835O2294P554R847P118K8656
13679F7057K7225k8804n3416l5017K0334L4192k7249N866P108O118J9219M2432
13667H5065j196m7032l3924j7245j5846o960l796J273L8195q743O1446O3006J1586
$$ y = [-5584, 46841, 11894, -35283, -43052, -10401, 9791, 14462, 12214, 16330, 16720, -8962, 4423, 14433, -18139, -46283, -17479, -13791, -49819, -64385, -91514, -60962, -20069, 891, -30684, -20759, 9614, 19478, 36723, 56380, 16213, -12869, -51397, -47736, -28105, -18564, -14341, 23670, 37260, 47203, -8864, 7110, 760, 11866, 51043, 12647, -13870, -1435, 25057, -2884, 46482, 85880, 55760, 30140, 2427, 5627, -33083, -7053, 42054, 5416, 7044, -45071, -56932, -54045, -6810, 34352, 9307, -75284, -77247, -48412, 13882, 21436, 31283, 38401, 67057, 94282, 65478, 12062, -22955, -2621, 31571, 4322, 10188, 17296, 23414, 42633, 85065, 83869, 36837, 2913, -14332, -30178, -37138, -40934, -39661, -1466, -10209, 51237, 114243, 125829]
13654A25829n1406m5825n3555m3518K5112N4467M1290m3636m1782K6236M2573
13643C5785M4006M921J0852j9841o5582k7617L2678j3542l1643K3993p6178l5979
13631a18147O7013M6353J4148N873k8997l3155J7698M3916K6883j2027j01036
13620g1478l425P2176q815R863L1718J1076L0476j541J1714k4357r652L5939O0933
13607A44627m8219p9083j03850j2393P1493J5539l3953N4909L5986l8160m6671
13596c9775K2032M5968o60o040j2921L9441o291O639K5518l1306m8047k6604M6070
13583A4024J9158K3919l4717q144K160j3237K234M4508O6092j1457r663o7617
13571B7260m1128O292K1825l2635j7609k4153l8541j886Q9709J06230l07j2582
$$ y = [125829, 74423, 28598, -24957, -68475, -43363, 11104, 52394, 8758, -33024, -6788, 35785, 79791, 84712, 95564, 75723, 10141, -17476, 15202, 1660, -29983, -5990, -82168, -118147, -51134, -4781, 9367, 15240, -13757, -46912, -29214, 14702, 41585, 29558, -71478, -74903, -2727, -11542, -1679, 30039, 41115, 71591, 70050, 81764, 57407, 47755, 83694, 144627, 96408, 17325, -86525, -98918, -27425, -11886, -45839, 9070, 45056, 6896, -39775, -17743, 28225, 27565, 21525, 8604, 48045, 41754, 48393, 73911, 42605, -5442, -32046, 14024, 33182, 57101, 22384, 14240, 16400, 3163, 5397, 49905, 115997, 104540, 94877, 27260, -13868, -7576, 14249, -18386, -35995, -60148, -98689, -100575, -10866, 95364, 95057, 82475]
13559H2475j1951n8783l8197K2212M5479j0789m9363M0250P3530n8934P997l154
13547D0772k15n7570P3831P8884k6569j8198m102o3545R192K9307l8665j7553
13535E569j1399k109L7796k320P793L4516L6437J2740j7998k1124P968p1331o7075
13522e0537L5616j0273o715k4735m0465K1000J15549N2171J8338M287l5538n7215
13510B1483M7884j1499l3627K7783Q374k761k2332K2835J1336j2515p77P241l0458
13497C2967m3692k5374L9717n382K7451L0378j0778k9710K8344p526K1276j2607
13485D5064m663k7616j4074j5004k3632M3656O1865M174k8267k0837r5618m1342
13473a16294L772J09187O2751R662n5568l1300R244N612j7735l9350N0845K1401
$$ y = [82475, 70524, 11741, -26456, -4244, 41235, 30446, -18917, 21333, 94863, 35929, 43926, 40772, 40557, -17013, 56818, 135702, 109133, 90935, 86833, 23288, 32480, 61787, 23122, 5569, -5830, -7939, 29857, 27537, 35330, 69846, 106283, 119023, 101025, 79901, 87869, 16538, -50537, -14921, -25194, -31909, -56644, -97109, -76109, 39440, 91611, 109949, 114236, 78698, 21483, 69367, 57868, 24241, 52024, 60398, 57637, 35305, 58140, 69476, 56961, 56184, 63425, 32967, -10725, -36099, 3618, -1764, 25687, 56065, 45287, 15577, 43921, 36395, 57671, 45064, 40401, 12785, -1289, -16293, -39925, 3731, 65596, 69770, 41503, 20666, -74952, -116294, -112522, -3335, 59416, 69078, 13510, -17790, -8546, -2934, -20669, -60019, -9174, 12227]
13461A2227L6472M3529l6565k3528K6220R895k2161m0710J3899l7344p980N1722
13449B5676M3343j7362o3253r022M2078k4705m2964J2452k082n2596O8752J2228
13437g455p518j0301K605M0616K2218n445L11K370j605K2242k1135J9342k5230
13424C1015n9400K286K8661j1960J6582O608N1498J1970K7157l6142J1641j241
13412G8675l7365m2335j9634n511M9890K2214j7357J9212k5776m7692o2319O123
13400h1875N7543M77N216J8971J3428J5247k2058k7276j5241m5460l52k1220m385
13387a06985L8812J5245o1459n978N5118N7213K3157R2552K3490m2795m3124J8951
13375F4197k9553o7432m741K4189L5037q868j0913L9189O36k0971J0377r577L7072
$$ y = [12227, 48699, 92228, 55663, 32135, 58355, 68250, 46089, 5379, 19278, -18066, -26046, 25676, 69019, 51657, -11596, -20618, 21460, -3245, -46209, -33757, -35839, -88435, -19683, -7455, -14973, -25274, -22669, 17947, 40165, 34720, 35031, 37401, 35796, 58038, 36903, 56245, 31015, -28385, -26099, 2562, -9398, 7184, 13792, 65290, 77260, 104417, 68275, 79916, 78675, 41310, -1025, -20659, -26170, 23720, 45934, 28577, 47789, 22013, -25679, -87998, -81875, -24332, -23855, -18639, 332, 13760, 29007, 6949, -20327, -35568, -81028, -81380, -102600, -106985, -68173, -52928, -114387, -120365, -65247, -8034, 15123, 107675, 131165, 88370, 45246, 64197, 34644, -32788, -37529, -13340, 21697, 12829, 1916, 41105, 41741, 20770, 31147, 21570, 58642]
13362E8642l1175j4736J8404K2859K078l4759l9044l2394L552J970K815K5217
13350a6571k8454k9378L4388R775J7759L695j1115l8078K4130L3392j4739k4427
13338c9623k0089L4814L0125k475o1274K3540k3846m0898M8215n1850j7362Q3326
13326c7397K4508r1103n8748L8639Q466M2303M9344O5087J3454J2956j8108k0403
13314B8998r826J2169M031n014l5779q9501K3748L4747J2379P9777J8666o8852
13302E543j1268l2573l4934M1643N5492l8253J1396k6452m886o564o048K8950
13290a7954j0759J3732l7488Q826j1560K414M3694J3672J0554m527P852p219n0041
13277c8804q363K2160K068L1136l2461O6L5190m9519R650L3195L1343N5245J392
$$ y = [58642, 27467, 12731, 31135, 53994, 56072, 21313, -17731, -50125, -46573, -44603, -41788, -16571, -45025, -74403, -40015, -30240, -12481, -8786, -19901, -57979, -33849, -457, -15196, -39623, -59712, -24898, 5227, 2752, -58522, -34982, -58828, -99726, -51511, -103361, -120723, -37397, -12889, -103992, -162740, -124101, -115635, -73332, -23988, 41099, 54553, 67509, 49401, 28998, 19172, 31341, 35372, 30358, -5421, -94922, -71174, -36427, -24048, 55729, 74395, 5543, -5725, -38298, -73232, -31589, 23903, -14350, -2954, -29406, -34292, -40856, -46904, -17954, -28713, -14981, -52469, -43643, -55203, -52789, -9095, 4577, 15131, 10604, 18456, 11237, -38804, -47167, -25007, -22939, 8197, -24264, -24198, 10992, -38527, -28877, 4318, 35661, 90906, 92298]
13264I2298J0805o3941n0201l2174j1596L244N620j2199j3672j4826k9630L1339
13252h4933L7476j0290K4501J7933N0302K7162j4011l6639L4669L908m0955j7364
13240h241l5708M3484K8999K9629m546L5438P383j6166m3822j8441L9540L2838
13228I0387N1587j0336j4591k3822m9500l7048P761k4547q011M1096L3250k9343
13216B6883o6906M8809Q0480M40P445j3691j4011o5663n2623O6237k3126p8739
13204h4465M0902L2109J1360K826m9596j462l0770L1765N0738k0368m7342M757
13192e9546j2838O3828O0322J6620k0142j9071l9498M752L0273K840L6918K6790
13180I1248L84o1089l9971R0694k503l2934l2581m3067L2094J5732k4280m2839
$$ y = [92298, 103103, 39162, -11039, -43213, -54809, -51565, -45945, -58144, -71816, -86642, -116272, -84933, -47457, -57747, -33246, -15313, 34989, 62151, 48140, 11501, 46170, 50078, 9123, -8241, -43949, -465, 28534, 58163, 53617, 89055, 96438, 80272, 36450, 18009, 57549, 90387, 141974, 131638, 117047, 93225, 43725, 6677, 14438, -10109, -18120, 22976, 56226, 26883, -40023, 8786, 89266, 89706, 97151, 83460, 69449, 3786, -48837, 17400, -5726, -84465, -43563, -11454, -94, 2732, -46864, -48326, -79096, -47331, 3407, -16961, -64303, -59546, -72384, -8556, 51766, 68386, 48244, 29173, -10325, -5573, 24700, 27540, 64458, 91248, 91632, 30543, -9428, 81266, 78763, 45829, 13248, -29819, 2275, 18007, -6273, -49112]
13168d9112L7253O1401M5786M6245L2308o4138p6581J5884K4650j6799j6235K8632
13156F9294K8010J7362j8198o2207m1950k6823O81l6811k1594M717R489L4535
13144d3495M9631M9834r399l864M683J05139K6561l3804r7369p3576j9248K6599
13132a8308L6726O0910j1360j426o2347m9758J4171J2522k9133K0534K0691K9575
13120B2797Q772q0086k860O5616j1171j0481P406K8213O0027O560k0199m2524
13108C2070J5799K148K7208j3459k6216m0387k1108J724k3761K4321J04099o4226
13096A8212l2812L4544J8762P652j2362R146J8109j5483r411n383k9829j1084
13084i939r222k2267k976m497K0956K6975J29K1319P303K8883J7075n3640o6997
$$ y = [-49112, -11859, 49542, 95328, 141573, 173881, 109743, 33162, 49046, 73696, 56897, 40662, 69294, 97304, 114666, 96468, 34261, -7689, -34512, -33831, -70642, -92236, -87519, -78030, -43495, 6136, 55970, 46571, 42707, 47390, 152529, 179090, 145286, 47917, -25659, -44907, -18308, 18418, 79328, 67968, 66542, 4195, -45563, -31392, -18870, -48003, -27469, -6778, 22797, 31569, -48517, -51377, 14239, 3068, -7413, -7, 28206, 88233, 94793, 74594, 32070, 47869, 50017, 77225, 63766, 37550, -2837, -23945, -22221, -45982, -21661, 82438, 18212, -14600, 19944, 38706, 46358, 33996, 43142, 61251, 45768, 36357, 30974, 1145, -9939, -19161, -41428, -44404, -48901, -27945, -970, -841, 20478, 27781, 56664, 73739, 20099, -46898]
13071d6898k7483k4850N5845n8239J3366L3093r238O0084N2582J4230j9209J9367
13059F2650K231n5891j0153J4842L4257j9646L681K1404j7042q923n9371j8889
13047e0850M328R681J2661K2150K0258l4118j5573M399j7539J9771Q069N1306
13035C4543J793J8056l5669m0118K1147l5848O756J5255K2962r197l4535L3326
13023a529K586n2309l0355M1058P9556K0966n5672j0616K4047l6662M0405O27
13011B2102r550j3195J5007M6594k4842r4943k9750L5953O5868J609k3637J8224
12999I440M1905K5688M2928m2790p5432q661L7846j4299j4M6625o146o6940k7031
12986c6881K3088N3198l6061l61J0436j9293M8675P2783O773j2703o8926j04228
$$ y = [-46898, -74381, -99231, -43386, -101625, -88259, -55166, -64404, -4320, 48262, 62492, 43283, 62650, 64881, 8990, -1163, 13679, 47936, 28290, 31971, 53375, 36333, 27410, -31961, -50850, -46522, -36841, -24180, -2030, 18228, -15890, -31463, -27064, -44603, -24832, -16763, 34543, 36336, 54392, 18723, -21395, -248, -36096, -29340, -14085, 8877, -320, -34855, -1529, 1057, -51252, -81607, -40549, 39007, 59973, 4301, -6315, 17732, -18930, 21475, 22102, 12552, -643, 14364, 60958, 36116, -58827, -88577, -52624, 13244, 14853, -8784, 9440, 51345, 77033, 119961, 77171, 1739, -6922, 30924, 16625, 16611, 63236, 57090, -9850, -36881, -13793, 39405, 3344, 2983, 13419, -5874, 42801, 115584, 122357, 109654, 40728, -63500]
12974f3500r597L4904J4489r8j6803j1846J1886L4626j7349J3933Q880L9638M7734
12961H6897n8150n5679L751k843M2542j0917J6193M0987J1427k4409o2879L441
12949i639N5852K9554M1153k757K9054l7220p8684l0307n6694j1008J1956O754
12937e1986L2101N0907R90j4960L9796N2348l3178p0369K1742N7060q982l6009
12925C9460m438M2284J0331j6785o723J6985M04k4787j03n747k5153L1464j9469
12912C7723n3662m1652M1690m5451j5370M2186L3291j8650k2678O6883L3031J2694
12900G0035k1800l8769M9084N202m6763j6023J9077l8997m1913K0065O9046N6262
12888H4506l0553l9848j0801o0782L1844L0477k5056M7267Q2n1007j3318j2085
$$ y = [-63500, -73097, -38193, -23704, -23802, -40605, -52451, -40565, -5939, -23288, -9355, -475, 39163, 86897, 28747, -26932, -23181, -26024, 16518, 5601, 21794, 62781, 74208, 49799, -13080, -9639, 46213, 75767, 116920, 114163, 143217, 105997, 27313, -2994, -59688, -70696, -58740, -51986, -19885, 31022, 32012, 17052, 56848, 109196, 76018, 5649, 27391, 84451, 75469, 39460, 35022, 77306, 87637, 70852, 64129, 81114, 81518, 56731, 56628, 50881, 25728, 57192, 37723, -15939, -57591, -15901, -61352, -76722, -34536, -1245, -19895, -42573, 24310, 57341, 70035, 48235, 9466, 58550, 63752, 16989, 966, 20043, -18954, -60867, -40802, 28244, 84506, 53953, 14105, 3304, -57478, -25634, 4843, -20213, 27054, 27136, -23871, -37189, -49274]
12876d9274j5394n4028L4403N0826P4825L9284q264j5231m9814l3185J4984K6609
12864A5741j613k5276k0158L2694L8838m4164n1216L8982j8549k2054N2363P7812
12852G3400L6006k6438m3182R437l9048o3154j9547l0397k628M0931L1467k8587
12840f1740k3349j5096K3851L7282J6398J9144P3359K3748m4515l8377p693K8097
12828C1109L2456L9993j9696k5715r439l6060l0390L0060J5182k7138k7670Q949
12816a8359N154k9367R816L6931L9990L3463k6926l1367O0561j2769r6226p1225
12804a00324K6468N8255O851l807J3247m9611M3454R498J9292k8570J0570Q0400
12792H5723o7752n7253j8888L4901O5236J1045o8453l6983n3171j4546N6702K8560
$$ y = [-49274, -64668, -118696, -84293, -33467, 41358, 80642, 72378, 57147, 7333, -25852, -10868, 15741, 14128, -11148, -31306, 1388, 40226, -3938, -55154, -16172, -34721, -56775, -4412, 73400, 109406, 82968, 39786, 49223, 10175, -52979, -72526, -102923, -105551, -64620, -33153, -61740, -85089, -100185, -76334, -39052, -22654, -3510, 69849, 93597, 49082, 10705, 3012, 31109, 63565, 103558, 83862, 58147, 48708, 12648, -17742, 12318, 27500, 362, -27308, -18359, -13205, -42572, -32756, 4175, 44165, 77628, 50702, 19335, 79896, 67127, -29099, -100324, -73856, -15601, -8750, -12557, 690, -48921, -5467, 4031, 23323, -5247, 5323, 85723, 17971, -39282, -58170, -23269, 41967, 53012, -15441, -52424, -105595, -120141, -63439, -34879]
12780c4879J2460K4035L5104q025L2742n0037j9380p917J2033k6667K6438k8613
12768c2706L7145J4840q267l0568P0086N2886m4526l4792k6257N7031L912j6039
12756D2745k6889r035K0671N319R487o1483m7307N3642K9337N0k7841n9323M9899
12743b0728j443j3641J2151K9876j756J4794L3387j6927m9420k1726J8732P5936
12731E9235K0629l853n3795p4474J1558N1339N6709r555l3860j3932n4534R146
12719c5387P323K2969l3732J9880j7352j6659J0204J115M6383j8207L7813L1705
12707E6055l0723k4417J2543L0084R540l9808j4752k1151K31o2444m5785M2079
12695h8548K4451K2188k642R044L1707o1342k4988k473K981M221K9210K3261L0516
$$ y = [-34879, -22419, 1616, 36720, 28695, 61437, 11400, -7980, -15897, -3864, -30531, -4093, -32706, 4439, 19279, 11012, -19556, 50530, 103416, 58890, 24098, -2159, 54872, 58784, 42745, 15856, 6821, 27492, 32811, 42298, -19185, -66492, -12850, 16487, 16537, -11304, -70627, -20728, -22171, -35812, -23661, 6215, 4459, 19253, 52640, 35713, -13707, -35433, -16701, 59235, 79864, 76011, 22216, -52258, -40700, 10639, 67348, 57793, 23933, 10001, -44533, -35387, -28064, -5095, -38827, -18947, -36299, -52958, -42754, -41639, 4744, -13463, 24350, 56055, 25332, 915, 13458, 43542, 53082, 13274, -1478, -22629, -22398, -84842, -130627, -88548, -64097, -41909, -44551, -35507, -3800, -65142, -90130, -92603, -89622, -85401, -56191, -32930, -2414]
12682b414K8148K1350j9667l0184k9053l9172L1807K20j9016q480J6805J5369
12670c4287m153M4084j3449L297J8215p8624j6873N5852J6021k8490m794K5766
12658a7435P2601M6922L3503P35n222p8437j3288k8716k8933J4467k8856K5178
12646g481k4318m7003J0572N1841P0049R24J4133l5843n4405n8222L0631K5583
12634b3539P6959O3138K1554L670p9811k5469k3322J8263Q073m9600j7758J1894
12622a5948j3759K3356J0240j1850r610j7007j8818K3661O5914R223j9916j4770
12610A0716O0818p9458k7684L978J4037J8392r329m8242l7916N706q447K8659
12598f8770L0878L6552K8119N42m79l9615l2202k8513K0820J8563P9699P5186
$$ y = [-2414, 25734, 47084, 27417, -2767, -31820, -70992, -39185, -38965, -57981, -66461, -49656, -34287, -38440, 5644, -7805, -4508, 13707, -64917, -81790, -25938, -9917, -38407, -43201, -17435, 55166, 102088, 135591, 136326, 131104, 52667, 39379, 10663, -18270, -3803, -32659, -7481, -31799, -78802, -68230, -16389, 53660, 54584, 68717, 32874, -21531, -79753, -49122, -23539, 53420, 116558, 138112, 141782, 61971, 36502, 13180, 31443, 39516, -10084, -27842, -15948, -29707, -6351, 3889, -7961, -17571, -34578, -53396, -29735, 36179, 45402, 25486, 10716, 71534, -7924, -35608, -31630, -17593, 799, -8530, -56772, -94688, -88982, -97429, -68770, -37892, -1340, 26779, 27321, 26842, -12773, -44975, -73488, -52668, -34105, 45594, 120780]
12586A20780L5702o3879o7853k6891o417j2079k4169j7017R875Q1703J5194k2945
$$ y = [120780, 156482, 92603, 24750, -2141, -8558, -20637, -44806, -61823, -51948, 29755, 44949, 22004]
$$ [...]
##END NTUPLES=NMR SPECTRUM
##END=
