##TITLE=Analysis number 318722
Compound Code cc 46113
Book Reference 451/141
Project Code adrs
Chemist Name evam
##JCAMPDX= 6.0         $$ Bruker NMR JCAMP-DX V2.0
##DATA TYPE= NMR SPECTRUM
##DATA CLASS= NTUPLES
##ORIGIN= Bruker BioSpin GmbH
##OWNER= nmr
$$ XWIN-NMR		Version 3.5
$$ Tue Apr 11 11:59:18 2006 GMT Daylight Time (UT+1h)  MAYBRIDGE\nmr@NMR_250MHZ
##.OBSERVE FREQUENCY= 250.131544655141
##.OBSERVE NUCLEUS= ^1H
##.ACQUISITION MODE= SIMULTANEOUS (DQD)
##.ACQUISITION SCHEME= undefined
##.AVERAGES= 16
##.DIGITISER RES= 18
##SPECTROMETER/DATA SYSTEM= dpx250
##.PULSE SEQUENCE= zg30
##.SOLVENT NAME= CDCl3
##.SHIFT REFERENCE= (INTERNAL, CDCl3, 0, 16.522)
##AUDIT TRAIL= $$ (NUMBER, WHEN, WHO, WHERE, WHAT)
$$ ##TITLE= Audit trail, XWIN-NMR		Version 3.5
$$ ##JCAMPDX= 5.01
$$ ##ORIGIN= Bruker BioSpin GmbH
$$ ##OWNER= nmr
$$ C:\u/data/dgb/nmr/ADRS/2540/pdata/1/auditp.txt
$$ ##AUDIT TRAIL=  $$ (NUMBER, WHEN, WHO, WHERE, WHAT)
(   1,<2006-04-11 11:58:55.89 +100>,<MAYBRIDGE\nmr>,<NMR_250MHZ>,
      <created by zg, POWCHK disabled, PULCHK disabled
       configuration hash MD5:
       84 BC 41 DB A1 6E 1D 46 DA 25 12 A5 C1 ED C5 3A
       data hash MD5: 64K
       31 AA 60 5F 49 22 BB B4 CD 34 F4 6E 1C 13 62 A6>)
(   2,<2006-04-11 11:59:09.14 +100>,<MAYBRIDGE\nmr>,<NMR_250MHZ>,
      <Start of raw data processing
       ef LB = 0.3 FT_mod = 6 PKNL = 1 SI = 32K 
       data hash MD5: 32K
       95 54 2E 02 24 F6 CA F9 0C 97 7A 7D A5 30 BB 7B>)
(   3,<2006-04-11 11:59:10.76 +100>,<MAYBRIDGE\nmr>,<NMR_250MHZ>,
      <apk 
       data hash MD5: 32K
       E3 28 C1 0C B0 70 9D 6B 6C ED F8 E0 8D 5F 14 2C>)
(   4,<2006-04-11 11:59:11.55 +100>,<MAYBRIDGE\nmr>,<NMR_250MHZ>,
      <abs ABSG = 5 
       data hash MD5: 32K
       3C A8 C5 D6 B7 DC 5C 19 6E 85 4E 13 4E F9 C1 18>)
$$ ##END=
$$ 
$$ hash MD5
$$ 9C 2C 9B 67 A4 26 E7 87 FC 83 28 A3 DB E0 01 88
##$RELAX= 
##$RELAX= 
##$RELAX= 
##$RELAX= 
##$RELAX= 
##$RELAX= 
##$RELAX= 
$$ Bruker specific parameters
$$ --------------------------
##$DU= <C:\u>
##$EXPNO= 2540
##$NAME= <ADRS>
##$PROCNO= 1
##$TYPE= <nmr>
##$USER= <dgb>
##$AMP= (0..31)
100 100 100 100 100 100 100 100 100 100 100 100 100 100 100 100 100 100 
100 100 100 100 100 100 100 100 100 100 100 100 100 100 
##$AQSEQ= 0
##$AQ_mod= 3
##$AUNM= <au_zg>
##$AUTOPOS= <35 >
##$BF1= 250.13
##$BF2= 250.13
##$BF3= 250.13
##$BF4= 250.13
##$BF5= 500.13
##$BF6= 500.13
##$BF7= 500.13
##$BF8= 500.13
##$BYTORDA= 1
##$CFDGTYP= 0
##$CFRGTYP= 5
##$CHEMSTR= <none>
##$CNST= (0..31)
1 1 145 1 1 1 1 1 1 1 1 1 1 1 1 1 1 1 1 1 1 1 1 1 1 1 1 1 1 1 1 1 
##$CPDPRG= <>
##$CPDPRG1= <>
##$CPDPRG2= <>
##$CPDPRG3= <>
##$CPDPRG4= <mlev>
##$CPDPRG5= <mlev>
##$CPDPRG6= <mlev>
##$CPDPRG7= <mlev>
##$CPDPRG8= <mlev>
##$CPDPRGB= <>
##$CPDPRGT= <>
##$D= (0..31)
0 1 0 0 0 0 0 0 0 0.06 0 0 0 0 0 0 0.0002 0 0 0 0 0 0 0 0 0 0 0 0 0 0 
0 
##$DATE= 1144753134
##$DBL= (0..7)
120 120 120 120 120 120 120 120 
##$DBP= (0..7)
150 150 150 150 150 150 150 150 
##$DBP07= 0
##$DBPNAM0= <>
##$DBPNAM1= <>
$$ [...]
##$SUBNAM7= <"">
##$SUBNAM8= <"">
##$SUBNAM9= <"">
##$SW= 20.6930455092707
##$SWIBOX= (0..15)
0 0 3 0 0 0 0 0 0 0 0 0 0 0 0 0 
##$SW_h= 5175.983436853
##$TD= 65536
##$TD0= 1
##$TE= 294.16
##$TE2= 300
##$TE3= 300
##$TEG= 300
##$TL= (0..7)
0 120 120 120 120 120 120 120 
##$TP= (0..7)
150 150 150 150 150 150 150 150 
##$TP07= 0
##$TPNAME0= <>
##$TPNAME1= <>
##$TPNAME2= <>
##$TPNAME3= <>
##$TPNAME4= <>
##$TPNAME5= <>
##$TPNAME6= <>
##$TPNAME7= <>
##$TPOAL= (0..7)
0.5 0.5 0.5 0.5 0.5 0.5 0.5 0.5 
##$TPOFFS= (0..7)
0 0 0 0 0 0 0 0 
##$TUNHIN= 0
##$TUNHOUT= 0
##$TUNXOUT= 0
##$USERA1= <user>
##$USERA2= <user>
##$USERA3= <user>
##$USERA4= <user>
##$USERA5= <user>
##$V9= 5
##$VALIST= <valist>
##$VCLIST= <CCCCCCCCCCCCCCC>
##$VD= 0
##$VDLIST= <DDDDDDDDDDDDDDD>
##$VPLIST= <PPPPPPPPPPPPPPP>
##$VTLIST= <TTTTTTTTTTTTTTT>
##$WBST= 1024
##$WBSW= 4
##$XGAIN= (0..3)
0 0 0 0 
##$XL= 0
##$YL= 0
##$YMAX_a= 485781
##$YMIN_a= -683534
##$ZGOPTNS= <>
##$ZL1= 120
##$ZL2= 120
##$ZL3= 120
##$ZL4= 120
##$ABSF1= 16.522
##$ABSF2= -4.171173
##$ABSG= 5
##$ABSL= 3
##$ALPHA= 0
##$AQORDER= 0
##$ASSFAC= 0
##$ASSFACI= 0
##$ASSFACX= 0
##$ASSWID= 0
##$AUNMP= <proc_1d>
##$AZFE= 0.1
##$AZFW= 0.1
##$BCFW= 0
##$BC_mod= 0
##$BYTORDP= 0
##$COROFFS= 0
##$CY= 12.5
##$DATMOD= 1
##$DC= 0
##$DFILT= <>
##$DTYPP= 0
##$F1P= 14.0000005364418
##$F2P= -0.99999901652339
##$FCOR= 0.5
##$FTSIZE= 32768
##$FT_mod= 6
##$GAMMA= 0
##$GB= 0
##$INTBC= 1
##$INTSCL= 1
##$ISEN= 128
##$LB= 0.3
##$LEV0= 0
##$LPBIN= 0
##$MAXI= 10000
##$MC2= 0
##$MEAN= 0
##$ME_mod= 0
##$MI= 0
##$NCOEF= 0
##$NC_proc= -4
##$NLEV= 6
##$NOISF1= 0
##$NOISF2= 0
##$NSP= 0
##$NTH_PI= 0
##$NZP= 0
##$OFFSET= 16.522
##$PC= 1
##$PHC0= 169.5064
##$PHC1= 8.031928
##$PH_mod= 1
##$PKNL= yes
##$PPARMOD= 0
##$PSCAL= 4
##$PSIGN= 0
##$REVERSE= no
##$SF= 250.13
##$SI= 32768
##$SIGF1= 0
##$SIGF2= 0
##$SINO= 400
##$SIOLD= 32768
##$SREGLST= <1H.CDCl3>
##$SSB= 0
##$STSI= 32768
##$STSR= 0
##$SW_p= 5175.98343685301
##$SYMM= 0
##$S_DEV= 0
##$TDeff= 65536
##$TDoff= 0
##$TI= <Analysis number 999999
Compound Code 99
Book Reference 9
Project Code 9>
##$TILT= no
##$TM1= 0
##$TM2= 0
##$TOPLEV= 0
##$USERP1= <user>
##$USERP2= <user>
##$USERP3= <user>
##$USERP4= <user>
##$USERP5= <user>
##$WDW= 1
##$XDIM= 32768
##$YMAX_p= 447322792
##$YMIN_p= -169755
$$ End of Bruker specific parameters
$$ ---------------------------------
##NTUPLES= NMR SPECTRUM
##VAR_NAME=  FREQUENCY,     SPECTRUM/REAL,   SPECTRUM/IMAG
##SYMBOL=    X,             R,               I
##VAR_TYPE=  INDEPENDENT,   DEPENDENT,       DEPENDENT
##VAR_FORM=  AFFN,          ASDF,            ASDF
##VAR_DIM=   32768,         32768,           32768
##UNITS=     HZ,            ARBITRARY UNITS, ARBITRARY UNITS
##FACTOR=    0.157963299565203, 1,           1
##FIRST=     4132.6476996994, 0,             0
##LAST=      -1043.33573715361, 0,           0
##MIN=       -1043.33573715361, -169755,     0
##MAX=       4132.6476996994, 447322792,     0
$$ Real data points
##PAGE= N=1
##DATA TABLE= (X++(R..R)), XYDATA
$$ [...]
22644 17693 26334 46273 64051 60263 36086 16614 8962 -22542 -57866 -50542 -42746 -45206 -50609
22631 -50609 -13279 -31022 -37929 -18909 -16855 -29435 -22840 26198 32185 6517 -705 305 19384
22618 19384 19510 13 -666 9291 6095 11825 -11952 -31110 -26187 -33285 -16437 -5580 -27413
22605 -27413 -41006 -40527 -36323 -47752 -51530 -25265 -15047 -8438 -17110 -3326 12377 -6899 -597
22592 -597 3286 16572 20922 3121 8689 4041 -25894 -33252 -20317 -23560 -32149 -44900 -543
22579 -543 -24671 -46515 -47263 -30876 -13472 -12090 9310 25232 24568 16996 25796 21304 1923 -10781
22565 -10781 -16388 -32639 -18144 -337 6324 35342 38009 -6150 -17496 -11290 -14242 14093 7508
22552 7508 -6403 -15462 -40632 -47122 -54252 -39721 -20664 -25745 -60729 -55776 -7990 -3990 -25856
22539 -25856 -36076 -44409 -27101 -2647 -5472 -30437 -61362 -42074 -29642 -24003 16276 28994
22527 28994 14539 -1143 105 9867 27940 16913 841 5384 -4088 4739 3352 -12240 -5263
22514 -5263 -14601 -20336 178 16879 10903 5326 13984 -4522 -10653 -9098 -25654 -37817 -20565
22501 -20565 -23712 -1260 13640 36143 32385 15644 16606 7911 3722 581 -9288 2896 -15643
22488 -15643 -15326 -23835 -18976 -6152 -4126 -4732 -8620 -4649 -3558 -7297 -20956 -24720 -30370 -26119
22474 -26119 -13755 -16370 -19230 1129 -4711 -15132 -21889 -17234 677 12521 1678 1713 32252
22461 32252 63468 46364 51007 26115 34275 50544 9905 -4894 -5178 -12557 -21795 -21793 -37452 -34163
22447 -34163 576 50245 49381 -1328 -23544 -34385 -15382 -3911 -11225 -2061 -5756 -20245 -46276
22434 -46276 -16853 -1988 -26842 -30525 -26964 -26228 -50205 -56936 -49885 -63879 -49251 -10238 -4487
22421 -4487 -24782 -27013 -37278 -15149 8728 -9047 -17071 -7714 -4585 14626 15774 17041 14884
22408 14884 18470 27771 19569 8710 -12096 -14008 -4414 -5896 -20547 -18853 -6444 -13124 -36530
22395 -36530 -28994 -12515 -2010 -18197 -18502 -24266 -21184 -20101 -364 -15403 -63969 -74908 -70667
22382 -70667 -41664 -28319 -33903 -19694 -17854 16518 13578 -8164 -13514 -3321 28710 45695
22370 45695 32321 10375 35588 32339 617 -29842 -48688 -47920 -33723 -49143 -3490 35883
22358 35883 30815 20974 2143 4167 7592 -16805 -61051 -70741 -48156 -28600 -8104 8804 13785
22345 13785 33269 37902 -324 -18006 -20925 -26390 -42311 -42779 -36670 -19405 -10258 -7645 -4697
22332 -4697 -16787 -22828 1822 -7778 8116 32371 17825 -9302 -15403 -33283 -24744 11823 13011
22319 13011 8351 21758 13042 6517 -22313 -25555 -19043 -1643 10954 6293 -1787 -19894 -29520
22306 -29520 -33335 -35570 -31470 -29577 -24889 -34763 -37736 -49610 -21376 14014 28318 17503 -976
22293 -976 -28782 -53992 -45395 -56335 -64190 -57765 -39293 -40951 -34780 -19748 -4175 6257 -6398
22280 -6398 -20217 -17432 584 20491 9943 -2692 -19175 -13115 -14859 -10944 -28205 -44806 -37425
22267 -37425 -22820 -22390 -17085 -23196 -33664 -42992 -41826 -25450 -34689 -3999 19461 21452 30496
22254 30496 26838 7813 22908 56840 37595 20378 -11823 -35554 -16954 766 2187 -17385
22242 -17385 -8930 -4120 542 11238 1918 -10640 -9554 -10217 -21827 -25747 -23213 -18301 -18997 -866
22228 -866 21920 10097 27676 36118 32117 5063 6139 -16983 -27207 3516 24644 -10343 -18606
22215 -18606 -12055 10249 8266 -23688 -57308 -20140 -12105 -5048 18338 29255 12361 -20532
22203 -20532 -13473 -14487 -16563 -3736 1094 5196 4109 -1955 3069 8592 4567 -9685 -12573 -21492
22189 -21492 -16750 -24339 -37086 -28749 -23750 -21689 -28703 -37371 -36669 -49351 -36734 -40824 -44830 -18049
22175 -18049 -4461 6333 23572 37241 33778 13923 13048 9965 353 7061 16063 27065 48350
22162 48350 38755 9702 -12360 -23149 -35711 -18274 -19339 -45210 -69571 -81336 -49951 -22132
22150 -22132 6671 22474 34367 3862 -1837 -5065 -26934 -16676 21401 26599 -4714 6240
22138 6240 39685 19863 -8767 22119 40771 41500 17516 11303 12714 3030 9411 3674 -12134
22125 -12134 -26621 -53127 -61785 -38170 -40745 -14347 -5745 -44675 -43232 5806 26626 -1451
22113 -1451 -22199 -22147 -20275 -30791 -22365 -19886 -39750 -25503 -10323 -21135 -32424 -29879 -11929
22100 -11929 -23171 -21857 20206 53418 26673 1210 7341 18024 -1165 -12764 -11883 1895
22088 1895 -4500 13383 16031 8446 33374 29732 25323 53516 50823 9556 -30826 -13345 11959
22075 11959 19784 7353 14477 -10194 -28530 -18131 12226 25375 2458 1204 9930 23859
22063 23859 14003 -12783 -40474 -33686 -20807 -21553 -33909 -21393 -16383 -13804 -34266 -39672 -53564
22050 -53564 -77087 -49311 -19629 -14616 -18417 -28714 -47869 -54601 -40872 -19647 -22319 -14928 -15391
22037 -15391 -34648 -25155 -26714 -43061 -17882 -24655 -31994 -46856 -52418 -30840 -5378 -25294 -38003
22024 -38003 -20342 -50 -5483 -14764 -16332 -29524 -36372 -34449 -39192 -18070 -2629 3189 -9339
22011 -9339 -34833 -35388 -2216 -22619 -47048 -42486 -24736 -38842 -33857 -1730 4985 -4517 -51507
21998 -51507 -74945 -63689 -51250 -46873 -28176 -36538 -31628 -24472 -10118 5335 -9631 -20435
21986 -20435 25968 37442 25452 28253 1316 -8765 -20205 -15834 6343 28091 30785 13790
21974 13790 11331 9127 3650 -5295 -41516 -33922 -18148 -9155 -4247 16628 16291 -362 -13859
21961 -13859 -20478 5958 20470 -13720 -34731 -30370 -29174 -6384 10644 -9121 -38130 -27820
21949 -27820 -13726 -18137 -28479 -12156 1856 17557 34045 22239 22295 15661 12021 -24658 -35228
21936 -35228 -6553 637 26798 13528 -14964 -13359 -10224 13456 25394 24121 26826 26340 29272
21923 29272 20789 14225 8193 15738 22865 38083 35390 -15879 -32090 -47844 -28597 -40960 -50453
21910 -50453 -61588 -66894 -52528 -32170 -17297 7900 -16072 -53232 -44491 -16185 -17478 11931
21898 11931 43274 26704 18538 -794 -1286 25162 30057 12304 -1767 -21855 -9246 -9994 -10068
21885 -10068 -4674 -27062 -29309 -16888 -19104 -4850 12040 -2822 -9923 12859 14613 15442 10506
21872 10506 16024 41717 39506 27518 24859 16123 6388 -16846 -34818 -6891 16344 33941 38666
21859 38666 35881 27039 -292 -9953 3627 23550 6142 14998 -1425 -21368 -30337 -28654 4712
21846 4712 8736 50 -25345 -20764 -21853 -35253 -32317 1888 36880 25896 -19958 2879 27395
21833 27395 13717 -8806 -8333 -12100 -34598 -34320 -26610 -12640 -19997 -1154 -18740 -32147 -18713
21820 -18713 -44428 -48105 -35337 -37062 -32132 -26120 -6215 -10972 -22344 -43744 -28249 -27330 -16070
21807 -16070 -45480 -48665 -23125 -26640 -26529 -20819 -33711 -53455 -40384 -48301 -49308 -38224 -56074
21794 -56074 -57223 -45036 -55231 -42467 -12870 5198 -6786 -29379 -25479 974 8465 886
21782 886 14378 -10430 -26580 -29075 -27362 -23650 1461 -1759 -28238 -45067 -51534 -60891 -65427
21769 -65427 -62889 -56521 -77484 -86466 -57402 -41210 -18660 -4435 -24928 -26428 -8143 -6329 3270
21756 3270 6954 -3230 -566 410 -2495 -4618 18932 27673 30061 19428 19769 1132 -16375 3377
21742 3377 29636 24224 -10525 -4478 -9411 -4230 -7955 11066 11673 4653 3400 6956 -3228 -7691
21728 -7691 -35185 -4861 13093 1092 2356 37195 78333 84886 48393 15841 18892 31434
21716 31434 2887 -12870 -37009 -16692 -13308 -445 5028 -23173 -3921 5974 3917 -11536
21704 -11536 -8810 14761 25682 16753 37889 14108 -21614 -23477 -30866 -43721 -41853 -32519 -611
21691 -611 5557 513 -24857 -44982 -56604 -59790 -58703 -21670 6164 7105 -24658 -37156 -5782
21678 -5782 2675 -5443 8886 -15652 -28620 -30812 -36136 -33967 -15492 -36743 -59896 -57363 -56608
21665 -56608 -42402 -29573 -19873 -13501 -15792 4406 3272 -12608 -5969 -29399 -38689 -17388 19089
21652 19089 31566 13674 24859 17313 1565 2769 10027 -6770 -15637 -28034 -3870 -21516
21640 -21516 -40263 -17803 -7762 -18582 -38795 -55487 -41431 -3370 24061 19706 24742 6618
21628 6618 -2218 13724 7403 -38078 -62651 -14703 1559 -3676 -8797 6671 -6581 -26747 -6190
21615 -6190 1556 -13733 -29816 -48715 -46143 -27105 -30849 -31957 -13651 -4163 -2639 -764 -484 5529
21601 5529 7312 20868 23717 -16977 6107 20554 33 -36516 -51134 -56583 -33144 -10216
21589 -10216 -10094 -4970 1943 -20436 -28487 -5176 -11582 9477 24182 20821 14107 12278 10786 -15556
21575 -15556 -37928 -38799 -60731 -70015 -21245 7153 30239 36992 31084 27841 21499 15717 -22396
21562 -22396 -36276 -32704 -4110 -11640 -25943 -43950 -39640 -39654 -7471 11189 26779 25094 12456
21549 12456 4486 -1855 13449 59330 45819 40063 8188 -10148 -14730 -25917 -38573 -24379
21537 -24379 -15934 -22538 -29518 -2078 -24870 -55513 -38343 -18432 -3044 9291 48386 14468
21525 14468 -2967 4561 21354 17284 20010 13707 11255 10239 24632 5727 32149 52492 37115
21512 37115 -14423 -11554 -3183 -10468 -2690 14069 -6938 -4110 7418 -24713 -39814 -15568 8190
21499 8190 -14073 -1206 6391 -8461 -15259 -20521 -19566 -34094 -57309 -74495 -37126 -23339 -33518
21486 -33518 -22803 -11803 14827 12586 -2239 10019 6214 -13212 -13670 -6238 -8872 -10766 -24876
21473 -24876 -8526 -690 -4938 -17591 -27673 -9275 5359 -6481 -20256 -15562 -23606 -6976
21461 -6976 -2151 18572 42223 26461 -28314 -30446 -33567 -24383 -4068 -10600 -15855 -22914 -44607
21448 -44607 -43209 -37130 -42282 -35018 -9819 -30473 -33773 -1846 -15671 -35294 -40091 -38319 -32398
21435 -32398 -11690 -613 27883 30532 986 -9693 -23379 -28617 -21441 -23311 -26474 -6405 -10873
21422 -10873 -26222 -14112 13564 12339 -21444 -18827 -11947 6003 2768 -16434 -47226 -76689
21410 -76689 -59426 -46122 -20852 3601 6534 26224 16497 5288 -17594 -3978 -15012 -52905
21398 -52905 -47336 -26582 -25680 -21059 -17190 -22835 -27916 -27744 -5743 -4205 -20230 -17286 -17748 -32080
21384 -32080 -30468 -26644 -18440 1122 7020 4805 -6134 10472 -6079 -12651 -28904 -34367 -29787
21371 -29787 -11058 -6943 3222 13553 -1070 -26652 -28435 -7024 22114 25462 25814 35214 21931
21358 21931 6892 6582 -1628 -5079 -6364 -10111 1276 -15294 -13792 -4889 -2820 -9140 -32831 -56074
21344 -56074 -41837 -43985 -39425 -16085 -8745 -24085 -32839 -40639 -40469 -46531 -64679 -46635 -46021 -43150
21330 -43150 -53754 -51379 -45078 -19701 -33202 -36509 -7159 -5664 -24444 -12440 -7881 -22650 -25493
21317 -25493 -13943 4913 5218 2374 14874 -4197 -1042 -8988 -24410 -24368 -21309 -25703 -23037 -13920
21303 -13920 3120 -22806 -28315 -32516 -29593 -34618 -52273 -60371 -58723 -45505 -35507 31486 55611
21290 55611 34944 13467 7726 8215 21862 13918 27784 33401 1486 -21823 -7853 14481 -12914
21277 -12914 -23580 10976 22535 8005 -5233 -5489 6011 -13694 -34165 -12694 10751 5583
21265 5583 4069 23924 2423 12386 10273 1280 -22818 -19883 -27498 -44070 -66044 -65059 -45932
21252 -45932 -50957 -34462 -28330 -29641 -32185 -46664 -31900 -24652 -34156 -34505 -25892 -16512 -8460 -30259
21238 -30259 -5647 24630 44257 14769 8764 36994 25109 21153 31785 9844 5647 3510
21226 3510 7279 5926 1604 -4719 -16111 -21257 -37999 -11841 13920 18160 18743 39087 31613 21467
21212 21467 12644 13642 -21548 -43472 -43757 -54347 -55867 -40322 -35823 -50175 -56396 -59107 -43175
21199 -43175 -32661 -46103 -35977 -71755 -74859 -65788 -46424 -22249 7911 7574 -9885 -14521 -2380
21186 -2380 -6740 -32156 -46029 -60950 -52034 -30580 -8714 -2690 -5395 -12360 148 -3686 8986
21173 8986 2221 27724 34817 15145 -12267 -39387 -68648 -50800 -66565 -54821 -35757 -45052
21161 -45052 -32993 -8555 20185 22543 -960 -11397 8574 -15217 -49437 -49895 -27776 846
21149 846 7818 -22345 -34916 -3246 12881 4945 -14585 -26781 -19243 -7264 -11118 -14009 -9898
21136 -9898 4945 -13278 -22955 -25145 -42663 -49705 -33481 -11240 -464 -5886 7439 -11980 -8023
21123 -8023 -24949 -14590 3914 761 6479 5253 -14074 -23486 -29826 -44358 -54418 -41760 -13877
21110 -13877 -25218 -24517 -52618 -49935 -51301 -34243 -4648 -31067 -21720 -4394 -11878 -5037 35269
21097 35269 32729 5615 2364 13023 -7448 9456 21394 17603 -3200 -47502 -52742 -66596
21085 -66596 -95246 -84864 -68378 -56833 -41139 -4314 2807 -9302 -35962 -47186 -37048 -24743
21073 -24743 -13624 -452 -21163 -44617 -41978 -24776 -39755 -48326 -52050 -57899 -37188 -28478 -3965
21060 -3965 2594 -15670 -50685 -60383 -57171 -43968 -43239 -51167 -58569 -34791 -14287 -2718 11428
21047 11428 -6899 -20218 -17437 -5743 13267 27246 56453 52651 28072 -6505 -37374 -42447
21035 -42447 -23149 -20252 -39300 -45576 -38811 442 -6678 -31949 -45831 -54152 -39732 -46412 -43092
21022 -43092 -31231 -14101 -14538 16118 39012 24332 -244 16510 36625 22693 15182 -3761
21010 -3761 969 16419 1425 -4769 -19434 -35878 7724 12113 25475 36428 44265 58008 22020
20997 22020 2621 -11446 -38089 -28517 -14732 -31499 -40272 -10446 12994 -24 -35178 -62298
20985 -62298 -48688 -50271 -61907 -55199 -43553 -43717 -44794 -49499 -16817 10076 1517 13663 9251
20972 9251 676 6467 -5922 -18089 -21082 -31603 -43829 -42106 -24372 7967 393 -27048 -25326
20959 -25326 -16124 -2433 -2684 -7716 7388 30817 44824 13405 -26838 -45463 -47883 -50443 -44503
20946 -44503 -21554 3394 -7876 -10073 -14299 -35947 -19649 2531 -4204 -4071 20270 10131 -2529
20933 -2529 860 -8398 5202 -7761 -10549 -113 3484 -21638 -36133 -34678 -23508 -13627 8221
20920 8221 -4222 -9734 -41291 -28864 -1808 4154 -1687 11299 15493 18376 3208 129 -15335
20907 -15335 -34303 -19718 5913 16991 22757 -10654 -21492 -1925 5057 12813 32270 29975
20895 29975 6153 -33695 -45420 10311 33553 -1453 -16169 -33787 -45898 -69244 -92326 -103942
20883 -103942 -77616 -59119 -30172 15789 31891 17349 -1648 -36253 -16295 -11699 -33328 -17849
20871 -17849 -22335 -31967 -27711 -52142 -42495 -15655 -18943 -14027 -22421 -44397 -42186 -20085 6092
20858 6092 4223 -11483 -18922 -1442 -768 -2565 -7204 -64160 -66844 -18075 9168 -8466 -9895
20845 -9895 -10904 -4736 12099 14771 10497 2078 4123 -13385 -46505 -57344 -31820 -25721 -25253 -52773
20831 -52773 -34115 -19205 -28521 -44596 -30132 -11651 20678 3810 3252 -32424 -45352 -28130
20819 -28130 -47572 -50543 -23912 5610 -14127 -23777 -26067 -17889 -7896 -3119 11362 1852 9675
20806 9675 11184 -15690 -21557 -5187 19149 6334 -24295 -31598 -16556 -8050 22388 13627 -6602
20793 -6602 -20326 -12328 -26292 1554 5531 -4222 -17361 -44057 -45385 -60700 -78163 -49420 -29284
20780 -29284 -41808 -46623 -3487 3418 -12434 -20353 -26258 -20801 -3056 -22450 -37235 -50390 -44997
20767 -44997 -37784 -40210 -19627 -21849 -35429 -32460 -23848 -54778 -48750 -16745 -7248 -6492 -9710 12132
20753 12132 -3324 -13106 -9987 -6508 -9323 -8308 17969 19322 -4835 -27096 -43424 -33562 -4183
20740 -4183 6986 -8475 -23432 -19613 13580 3668 -7520 -39365 -55987 -39283 -24538 -674
20728 -674 -12241 -15855 -17871 -34005 -13928 6857 8930 -8827 14375 -7468 -31637 -13993 13157
20715 13157 24608 4868 -10073 -47834 -45088 -31194 -29361 -1797 18642 37908 72578 66944
20703 66944 35565 16314 16881 -14279 -24180 -13776 -23369 -54829 -62148 -41700 -36015 -43285 -46335
20690 -46335 -25794 -26683 -35254 -18726 -18646 -10216 -14531 -22891 -27756 -30611 -33295 -42222 -47754 -20485
20676 -20485 -10789 -3531 -14383 -53420 -35447 -27400 -18771 -48771 -50683 -41386 -55359 -72635 -45440
20663 -45440 -22672 -1242 33164 45193 41764 39218 -204 -14464 -21200 -28229 -29773 -9165 -7836
20650 -7836 -8193 14053 9853 10203 6481 -23956 -32363 -22692 -31951 -47800 -45922 -35785 -36641 -13687
20636 -13687 -17519 -22065 -35463 -13355 5260 -25896 -43881 -34058 -47196 -26753 -25052 -33236 -31701
20623 -31701 -52231 -49528 -25515 -29732 -14097 10498 5169 -22486 -35187 -22667 -32284 -24720 -16625
20610 -16625 -26696 -32180 7692 24556 14620 15886 11666 7037 2083 -18828 -42566 -70979 -40551
20597 -40551 -9825 -13372 -9015 -9979 -10999 -24991 -40248 -27269 -19805 -23303 -17198 -24789 -19475 -21884
20583 -21884 -11376 -11501 -24860 -52575 -42044 -12424 -5903 -16284 -24091 -52917 -61663 -39668 -45943
20570 -45943 -35843 -32930 -43341 -35260 -21226 -20631 -6105 -22486 -37519 -29442 -25877 -33293 -43786
20557 -43786 -63673 -48416 -23711 -13781 -7165 -13223 -58491 -62107 -44888 -13990 4939 13824 18355
20544 18355 13802 15038 22181 18553 7038 -22911 -17963 -18526 -24946 -42362 -56794 -51852 -37194
20531 -37194 -39932 -63247 -43644 -21600 -8812 -4533 9003 28615 -1870 -20307 -28407 -24544
20519 -24544 -17726 -33019 3276 33606 14493 6394 -6652 9607 -508 -13373 11705 33467
20507 33467 2129 -36017 -22563 -2301 1305 -509 6684 -10023 4467 6577 -33472 -30464 -13674
20494 -13674 -12096 -15982 -10274 -23160 1999 -13222 -40503 -66872 -68551 -84614 -81735 -68499 -53802
20481 -53802 -55019 -49707 -59973 -64083 -69130 -61924 -69276 -69129 -67919 -50089 -41645 -30775 -22740 -26133
20467 -26133 -37726 -69889 -100694 -93323 -40770 -42876 -61954 -52361 -28023 -25857 -40052 -47817 -38764
20454 -38764 -30694 -39385 -31707 -4699 -24962 -56163 -55402 -61848 -36813 -15948 -905 24123 17686
20441 17686 -2496 -4072 -20486 -14171 -31792 -26299 -19457 -32353 -32139 -7070 3216 2672 -7239
20428 -7239 -14125 -14320 4873 -5342 6511 6449 -12629 -22461 -36950 -41678 -44191 -35606 -36156 -18522
20414 -18522 -8211 4289 3674 -54156 -50003 -42559 -62960 -62040 -56970 -69513 -101133 -90807 -40599
20401 -40599 -31055 -11354 22110 35258 36427 19899 11566 4599 626 -18002 1820 16564 13278
20388 13278 29818 21193 -30324 -51436 -44504 -42443 -40100 -40989 -37158 -28511 -21468 -28225 -17537 -5044
20374 -5044 -844 -7913 -13498 -8781 -5026 -16879 -49814 -22516 -19322 -20771 -5963 -14465 -19454 -57839
20360 -57839 -78680 -59996 -47285 -27558 -23028 -20268 -33492 -16326 -6443 5659 -930 -34660
20348 -34660 -32097 -16564 -34627 -20460 720 44022 54109 37069 8417 -6297 -4669 4106
20336 4106 -3610 -3977 -5674 9906 -343 -18945 -13212 -21906 -38415 -19102 -11110 -2292 -18154
20323 -18154 -17581 -18999 -1017 16824 9742 37465 54201 34011 23199 4613 26828 43451
20311 43451 12225 -1640 -19586 -5627 13804 -493 12566 10608 21397 -683 -21930 -27723
20299 -27723 -24455 -27896 -14211 19012 6557 -21506 -63339 -93867 -100770 -62804 -35904 -39073
20287 -39073 -31403 -10759 -30108 -27751 -13709 -4337 9617 12180 -15316 -35667 -16070 -24696 -48590
20274 -48590 -55114 -32337 -25142 8795 38020 31117 10438 18832 36091 23898 -10669 -25781
20262 -25781 -29647 -20002 -23689 -13083 -26182 -48167 -41680 -29487 -23818 -3347 -20646 -16915 -35176
20249 -35176 -42205 -47777 -51607 -46615 -51873 -60980 -36268 -2323 -6401 -18216 -5150 -6126 -14901 -18025
20235 -18025 -5941 -37387 -54174 -50593 -34529 -30681 -12604 14947 24469 -12516 -38707 -62047
20223 -62047 -55309 -47528 -31057 -23740 -55908 -60423 -65012 -70939 -34975 -20961 -11927 -16717 -17459 -2209
20209 -2209 17594 2845 18019 -11967 -13730 -21076 -38680 -32580 -3230 -1998 8244 6963 -8861
20196 -8861 -2190 -15424 -60946 -62438 -75237 -58198 -82742 -80572 -67608 -67223 -71415 -42986 -61922
20183 -61922 -77368 -68445 -47255 -28638 -37333 -43975 -58448 -33580 -25084 -29924 -28114 -15705 -15401
20170 -15401 -29877 -239 16992 10203 13667 7411 16292 10108 -2989 -14098 -20705 -17830 -25040
20157 -25040 -61183 -63851 -46192 -76770 -83835 -74211 -62192 -25439 -10715 -5203 -9010 -29684 -51861
20144 -51861 -30651 -13279 10095 2038 -19512 -31070 -40624 -35621 -17610 -22556 -41970 -83703
20132 -83703 -69411 -39357 -28923 -47254 -26037 2560 5881 -7933 -28764 -30991 -22400 -2359
20120 -2359 14332 13214 -15896 -38477 -47385 -46750 -44411 -41330 -13095 12959 28206 21787 16297
20107 16297 12179 -9297 -51322 -75634 -24894 -10659 -4429 21362 18047 -2318 10362 8789
20095 8789 -21508 -25638 -22654 -23933 -24646 -41827 -35102 -30872 -42331 -20314 -5723 -15101 -544
20082 -544 17978 6740 -6218 -24843 -39665 -45879 -36329 -33792 -31032 -37745 -8686 -10829 -11967
20069 -11967 -6614 -17168 201 17271 9910 -27748 -29960 -42994 -33380 -16079 -19747 -35816 -49243
20056 -49243 -38990 -27482 -61516 -79632 -77673 -70843 -35369 2285 -6521 -18542 -5177 5722
20044 5722 6052 21440 13438 4991 27575 21806 -21754 -22391 -15086 -3893 -18434 -13305 -38646 -47318
20030 -47318 -54804 -38109 -7216 31082 48156 8445 -13680 -16949 -38060 -38415 -36530 -4958 7717
20017 7717 6598 6523 -7894 6332 10036 8125 -11716 -33415 -28487 -34650 -37402 -45072 -3202 17437
20003 17437 51391 36602 8415 -25119 -24139 -7534 -12627 -34092 -35471 -26214 -9405 -20582 -28163
19990 -28163 -17784 -4320 7400 -3428 -25974 -18198 -11619 8079 22068 5323 -17690 -31891
19978 -31891 -42412 -19063 -16527 -34922 -33582 -24165 13797 24046 2261 -20648 -36230 -39672
19966 -39672 -34216 2084 38543 21923 4362 28062 28747 36046 11715 -18449 -22320 -38972 -26743
19953 -26743 -22165 -28746 -22033 -14964 20105 39796 5896 7930 1865 -7148 -19260 -28532 -49368
19940 -49368 -53334 -32942 -30929 -68405 -68123 -59154 -32911 -32705 -53888 -50520 -50334 -63807 -49267 -47000
19926 -47000 -24347 632 -3659 -10804 -12244 -41497 -63000 -66154 -57012 -50656 -63406 -89066 -76802
19913 -76802 -30080 -22764 -13929 -18925 -25616 4348 14534 19206 3759 -10548 -25867 -23929 -10031
19900 -10031 -26469 -33899 -39886 -46872 -44610 -17859 -4348 24620 19277 21448 27548 -7595 -8262
19887 -8262 3409 -11164 -6183 -21390 -30236 -46405 -62506 -40908 -32303 -31840 -34004 -37335 -60286
19874 -60286 -55418 -42031 3562 4371 -10489 -23384 -11169 13118 -18032 -27620 -25186 -45584 -48606
19861 -48606 -22678 -10471 -8282 -10733 -54407 -57615 -45545 -46657 -30140 -49279 -56194 -56235 -41443
19848 -41443 -18595 -7484 5761 12000 497 -21919 -8352 -28585 -62006 -81050 -79863 -43022
19836 -43022 -39978 -41625 -45065 -34748 -39440 -47176 -40737 -20163 -8261 -33671 -16956 20979 3674
19823 3674 -4642 -10622 -11318 -11316 -15201 -20229 -32506 -36076 -25464 -8708 -3854 11426 11300 -2027 -4062
19808 -4062 -3206 569 1447 -31464 -29342 -28110 -40099 -20819 -15374 -14299 -29337 -37042 -56118 -73607
19794 -73607 -58086 -44300 -33575 -26161 -40902 -46193 -60242 -46300 -25384 -20619 -4058 -3041
19782 -3041 3477 -5625 -15449 -15814 -32772 -13371 1112 -1773 36200 30805 1055 -4303 7474
19769 7474 18014 16326 -11907 -33394 -69811 -86659 -76926 -63515 -70078 -76464 -75256 -77407 -78747
19756 -78747 -66004 -60410 -59769 -43826 -28435 -24653 -8691 -4511 3314 9533 -17126 -28658 -10504
19743 -10504 -33890 -22703 -5241 2293 16188 20862 3216 22475 2542 -3756 -29088 -41852
19731 -41852 -57044 -66420 -73175 -38430 -30056 -16214 -36857 -59600 -33616 -31668 -26328 -39242 -46632
19718 -46632 -37217 -39946 -53461 -58666 -48289 -19151 -6115 6830 -723 -5700 8027 1013 11713
19705 11713 2916 817 -16339 -9888 4837 -2893 14714 -10803 -43579 -22910 -16507 -29166 -18122
19692 -18122 -12591 4312 9210 -7173 -33108 -46821 -41013 -62378 -81877 -80022 -57342 -49965 -56669
19679 -56669 -62680 -36303 -15521 -4997 -5206 -3596 -14212 -3401 2552 -6231 -13459 -5959 11020
19666 11020 -22928 -44105 -60549 -44127 -27099 -14184 -29619 -33014 -52606 -58331 -41955 -35639
19654 -35639 -29481 -29572 -36258 -55997 -71838 -60423 -71149 -55479 6637 20961 16384 5934 25566
19641 25566 36847 12321 17630 -5032 -4354 3179 -8861 -12718 9479 5244 -4099 -3159 -31193
19628 -31193 -17248 -13131 -13867 -14791 -32889 -31782 -40501 -24413 -7068 28004 16651 3715 -23075
19615 -23075 -41986 -26652 -17366 -29932 -63326 -66351 -79405 -54013 -58197 -64578 -84360 -79866 -62431
19602 -62431 -44130 -31026 -8203 12270 24752 15222 417 -32309 -32564 -8044 -27378 -47658
19590 -47658 -19527 1681 -17366 -40593 -30373 -9583 -39960 -95757 -79516 -61668 -50621 -29902
19578 -29902 -30794 -31439 -17217 -3625 -12130 13769 14500 5340 656 2956 -9173 -29743 -11257 9131
19564 9131 25292 14446 -9490 -2049 35713 36489 25326 20101 29140 12413 8828 22514 3332
19551 3332 -2075 -301 -6461 -2889 -33508 -49735 -23925 -23543 -11849 -19562 -35712 -71511 -55746
19538 -55746 -40840 -31459 11059 15174 -1531 -4650 -17870 -7626 -1997 -5967 -3967 5346 -13993
19525 -13993 -43133 -55211 -68422 -63682 -48631 -31007 -29444 -20846 -43112 -32920 -22468 -22047 -18037
19512 -18037 -8683 1600 -6582 -7564 -14442 -28546 -33016 -27844 -16607 -37442 -35723 -45385 -54653 -66160
19498 -66160 -80007 -58228 -45218 -43737 -29308 -22031 -20069 -39342 -50275 -31506 -21087 -31358
19486 -31358 -27245 -36813 -31615 -13041 -8329 -15048 884 15371 15506 7610 12777 8907 -25696 -36713
19472 -36713 -36555 -38126 -40565 -44205 -15068 -12710 -17160 -16178 -1026 -24643 -27332 -6093 8948 -14089
19458 -14089 -32192 -27133 -17167 564 38696 35723 63042 50009 31864 13638 34623 33777 -4409
19445 -4409 -36047 -14994 -3418 25100 38435 30569 -4544 -10685 7212 14254 23313 33665 6082
19432 6082 -9634 -17735 702 4603 1739 -4726 2982 1378 12930 16166 18050 30369 44306
19419 44306 37955 21102 10879 20763 -1124 8547 45776 64292 49931 37171 36632 39309 38980
19406 38980 48402 57670 44618 35122 20502 -8637 -34488 -13889 -15815 -6275 -9824 -49020 -70451
19393 -70451 -75271 -22637 1480 -11240 -11953 -28360 -5669 21732 23604 16930 23202 44549 53188
19380 53188 37721 7228 -46 18128 11052 7777 3677 -24565 -53347 -57892 -40131 -22046 -2377
19367 -2377 9197 32358 8173 -13128 -39033 -36770 -23802 -18439 -26699 -28277 -31353 -32459 -5614
19354 -5614 12877 1851 -21193 -30976 -9607 -9849 -2740 -9549 -20395 -22770 -1800 -19367 3420
19341 3420 21140 14966 -3285 -22136 -2464 31536 30998 56122 66854 66066 50340 24568 5981
19328 5981 20620 22416 20001 52578 59413 37086 33339 55220 50641 39590 43270 20058 -12735
19315 -12735 11032 55474 58870 61838 50666 34583 27914 34508 36911 3005 1736 11165 2449
19302 2449 -8892 32377 34655 25937 35112 34570 3737 -31536 -26014 -3127 -19095 -12135 22982
19289 22982 29530 15817 12728 11626 6511 -12119 7049 9388 -1540 -6858 12251 20240 19831
19276 19831 -34 -11232 -13686 3402 33225 20337 -8741 -16917 445 5863 3017 -8097
19264 -8097 -17266 -1753 7606 -31006 -44655 -21321 14276 16171 943 11004 23069 46516
19252 46516 56708 10312 -17711 -13057 7648 12066 40549 62324 66363 73026 59721 41780
19240 41780 22492 -11370 -22314 4429 54120 60260 52021 25847 17645 31112 55154 46023
19228 46023 54464 79276 65083 64833 69903 46415 61224 60123 35559 22835 41871 54822 79142
19215 79142 108095 143480 212912 271374 294339 313143 335637 332696 341220 384671 443623 492724
19203 492724 511196 537784 572983 607753 648593 703696 734502 733046 730222 711964 675033 593896
19191 593896 549911 543643 529916 528487 547063 525464 492893 482340 448924 426804 401819 397182
19179 397182 388370 334537 287044 235289 178085 187593 211134 189047 158034 153863 148369 153095
19167 153095 162496 164095 169531 157480 117710 96275 111769 116599 97060 87145 61450 57789 74856
19154 74856 70453 66873 90837 121733 105025 44816 21187 10836 53764 73414 51505 63249
19142 63249 71177 65150 71779 67919 90648 93267 118163 131381 107817 80563 76858 108300 122916
19129 122916 116016 99257 109684 116623 124377 149408 165252 204570 272676 301666 330889 311722
19117 311722 310822 320904 327162 358965 387806 388515 421366 438212 433579 424080 397025 376654 359140
19104 359140 366655 363499 364124 347688 320495 281607 263247 249133 237609 232949 232094 235935 210857
19091 210857 183472 186563 193625 220952 227161 233505 246687 282917 319889 393945 483559 590238
19079 590238 681394 773631 837124 903745 958394 1005433 1028885 1020525 1006348 996339 1015879 1075773
19067 1075773 1139540 1189368 1234623 1234610 1208347 1208595 1185914 1082472 966265 857044 740329
19056 740329 661267 611466 573240 548921 497417 457864 404125 368555 320786 316769 299792 268195
19044 268195 253155 252269 246229 216891 198818 205136 216299 189828 179750 182618 159496 140426
19032 140426 130912 134673 129709 153074 164297 152535 163882 172419 148534 125850 125493 116480 100015
19019 100015 101788 104629 83493 87815 85536 80585 101133 127437 118688 126502 132488 148281 171516
19006 171516 146113 115795 100962 112250 114400 95631 90395 91296 93644 112179 105682 85129 103228
18993 103228 105049 126483 134370 144870 117107 118122 109373 82941 87049 105392 113833 97134 74374
18980 74374 98438 98001 118218 101529 88435 114746 126715 135642 126016 107028 85152 107040
18968 107040 146607 175769 178554 196320 145576 158378 211289 214157 164380 161730 186530 214321
18956 214321 235668 235444 224006 186237 171950 178246 176979 177620 159785 159494 194219 217645 231632
18943 231632 211856 203810 194021 153604 170361 169608 147348 141636 105881 113512 135812 160705 136316
18930 136316 123805 137695 143970 126165 115052 125999 107231 101925 103311 109274 113896 106865 99147
18917 99147 125845 130947 108412 89858 88274 108916 114997 129632 151633 160197 137972 137863 140941
18904 140941 131839 121393 112450 61540 42590 82008 99694 97738 102929 113761 85173 54198
18892 54198 43883 38692 32013 36265 79884 114975 108658 80355 78174 108279 128323 126965 103438
18879 103438 94351 93845 86813 109576 141992 162964 177110 180469 210406 229664 244515 250977 234723
18866 234723 209305 197741 212643 219661 210150 201847 184433 192208 205855 168046 166486 162043 158858
18853 158858 186000 236589 252870 235010 216867 222397 235011 275197 300337 330511 364204 404896
18841 404896 431509 453925 469696 509938 540009 569281 589242 681727 765102 822237 874923
18830 874923 944056 969935 977867 995856 1003324 981185 975179 986974 1011320 1006194 999341 980610
18818 980610 979451 969240 954017 967030 945622 908396 838347 795928 804533 798085 805404 806753
18806 806753 825696 853301 872803 875914 883371 905424 939266 923923 883075 851622 808917 766205
18794 766205 734969 704328 702708 694465 681022 647844 635283 637337 642434 634891 634075 602293 578227
18781 578227 567777 566877 580106 609109 648025 680391 709253 719356 734866 727385 713442 723763
18769 723763 747255 771931 812580 797029 791601 795194 781682 781250 815254 881050 973758 1061512
18757 1061512 1124273 1198054 1317578 1446969 1534245 1615966 1672763 1686343 1698344 1713169 1678013
18746 1678013 1665817 1702874 1789169 1874785 1993426 2117063 2263010 2454984 2656365 2896876
18736 2896876 3124280 3347469 3613223 3940334 4282658 4705327 5189211 5725440 6422241
18727 6422241 7332927 8513284 10090962 12211200 15129718 18925228 23486613 28765433
18719 28765433 34627886 40859899 47324526 53697708 59208985 63549196 67604789 72338332
18711 72338332 77488241 82486706 87964048 94860619 102882331 111226480 119152675 125357990
18703 125357990 128342470 128852613 128563342 126940687 122359295 115967421 110543482 106834323
18695 106834323 103884718 101163487 98507139 95214063 91153919 86919041 82097929 75550565
18687 75550565 67602448 59848578 53051611 46830954 41055042 36061665 32157734 29174799
18679 29174799 26819960 24893361 23259876 21890452 20709410 19623128 18622952 17732445
18671 17732445 16928711 16157992 15449850 14786450 14186759 13621107 13075951 12588039 12150684
18662 12150684 11776332 11403908 11036196 10714689 10433780 10139301 9879076 9641948 9403621
18653 9403621 9175899 9009349 8857139 8690188 8515574 8344504 8195297 8065559 7946080
18644 7946080 7894111 7832007 7756985 7699278 7641055 7570654 7540657 7523193 7535000 7552805 7572368
18633 7572368 7632360 7736021 7877340 8023654 8227502 8547038 9001149 9679359 10701914
18624 10701914 12176090 14344929 17381330 21344322 26173939 31555682 36876707 41463947
18616 41463947 44973281 47265837 48562964 49879335 52004426 55023059 58671588 62396523
18608 62396523 65535013 66971224 66218849 63975099 60715502 56725982 53068224 50490749
18600 50490749 48954849 48009588 47115878 45765999 43353658 39691637 35423810 31166974
18592 31166974 27234956 23935049 21419530 19556869 18186319 17149792 16427306 15877861
18584 15877861 15480604 15220242 15030625 14942151 14981085 15203310 15675798 16509124 17799539
18575 17799539 19735964 22606638 26636340 31891899 38224184 45172987 51847099 57405470
18567 57405470 61607589 64135317 65505950 67192892 70057257 74166273 79068743 84111190
18559 84111190 88302606 90210210 89397368 86724309 82542696 77357293 72700197 69521792
18551 69521792 67616597 66311037 64889921 62710224 58950183 53514028 47376564 41222221
18543 41222221 35535248 30836956 27222260 24529674 22462239 20827583 19477489 18373356
18535 18373356 17400878 16509674 15700418 14994558 14341179 13723363 13173463 12688517 12217497
18526 12217497 11770774 11322216 10937593 10597956 10284843 10001337 9704149 9398499 9155774
18517 9155774 8910777 8703567 8525262 8350366 8189038 8048950 7912979 7795053 7678963
18508 7678963 7543319 7412038 7283319 7145464 7078355 7027492 6939688 6816456 6700186 6631783
18498 6631783 6566510 6482484 6391805 6322464 6273454 6195141 6131843 6099736 6033473 5949941 5902067
18487 5902067 5881010 5873305 5916089 5976294 6006434 5996744 5986556 5941428 5882131 5832145 5783491 5726395
18475 5726395 5661595 5632630 5614996 5638106 5669726 5693963 5714132 5706780 5750869 5864105 5972476
18464 5972476 6097985 6261508 6422239 6579969 6778302 6986334 7238017 7537446 7912387
18455 7912387 8373096 8963904 9803909 10986172 12652652 15024399 18398028 23247755 30249393
18446 30249393 40446837 54837469 73277116 93365287 111175474 122650099 126605335
18439 126605335 127709333 130649148 134183620 133317218 125953663 117895461 116871669 124092374
18431 124092374 135039499 143964478 146362502 143263255 140076465 138391645 133919932 121257797
18423 121257797 101149189 80582254 64669819 53726532 46238685 40810741 36668426
18416 36668426 33394940 30761664 28662271 26931256 25451225 24157512 22982893 21931945
18408 21931945 21010054 20089856 19163663 18289852 17472829 16720895 16052135 15449365 14918326
18399 14918326 14435221 13985136 13549093 13145771 12801106 12504930 12175885 11806993 11451989
18390 11451989 11164772 10935457 10720971 10534140 10309253 10099218 9893463 9732465 9603709
18381 9603709 9433791 9198279 8984233 8806252 8634594 8507872 8373336 8227942 8071521
18372 8071521 7891195 7692157 7455432 7241350 7073581 6911257 6738305 6557429 6393034
18363 6393034 6276971 6155070 5989339 5856403 5754680 5653424 5580837 5495900 5401532 5272235
18353 5272235 5150005 5037790 4931470 4813192 4735292 4648597 4572853 4520433 4436449 4364720
18343 4364720 4298365 4224094 4149105 4064911 3990589 3967680 3937135 3892642 3847826 3807198 3790516
18332 3790516 3768754 3786009 3844088 3910695 3982918 4044538 4111089 4172400 4230171 4347565 4441175
18321 4441175 4524205 4620141 4688575 4761499 4800253 4831723 4900176 5017390 5145314 5308123 5546127
18310 5546127 5850595 6296028 6956775 7901873 9236155 11113062 13766366 17576146 22878606
18301 22878606 29898994 38506289 47855863 56451309 62912704 66059630 65843251 62616851
18293 62616851 56705703 48629719 39930659 32098342 25991327 21607640 18506372 16282036
18285 16282036 14629721 13345569 12360608 11569876 10942239 10458161 10132983 9909679 9779327
18276 9779327 9698602 9674671 9679825 9668289 9596493 9448292 9233378 8997931 8730976 8514537
18266 8514537 8384708 8404272 8573357 8926358 9475196 10269182 11426799 13101936 15513883
18257 15513883 19012474 24066687 31289615 41479030 55179024 72315046 91620434
18250 91620434 110246512 125162707 133842844 135427673 130502805 119813658 104305966
18243 104305966 86408283 69361620 55379488 45126156 37859966 32632152 28765772
18236 28765772 25791129 23439467 21554196 20024226 18776201 17716103 16878930 16224674
18228 16224674 15710289 15338525 15023320 14678500 14333333 13939147 13486051 13013592 12527217
18219 12527217 12080434 11724819 11423823 11236376 11176794 11239287 11412685 11748702 12327498 13260449
18209 13260449 14649512 16753934 19865933 24343233 30565941 38791242 48784984 59465277
18201 59465277 68989485 75782412 78619940 77715937 73442675 66192167 56648163 46648963
18193 46648963 37794347 30932816 26043879 22556857 20005520 18056691 16517815 15271676
18185 15271676 14260861 13430255 12730708 12140367 11650826 11268738 10960658 10716504 10486196
18176 10486196 10232378 9989113 9739143 9483928 9235629 8975625 8674064 8368441 8066098
18167 8066098 7786145 7530651 7314200 7073398 6849134 6650402 6504505 6345699 6201290
18158 6201290 6040892 5878792 5731608 5644164 5533892 5422721 5276176 5116831 4998979 4880682
18148 4880682 4793971 4705422 4627053 4524228 4418852 4329096 4226498 4127531 4082010 4026669 3969937
18137 3969937 3939800 3886058 3864701 3884083 3895339 3913209 3925356 3970517 3989028 4041765 4155191
18126 4155191 4278733 4392034 4491971 4597854 4716241 4831047 4930311 5057252 5241104 5505651
18116 5505651 5951258 6664218 7793714 9544905 12216496 16226745 21883560 28122016
18108 28122016 32863529 34564491 30088360 22468244 16677613 13087622 10891631 9436491
18100 9436491 8407599 7620671 7032388 6579616 6210156 5956221 5762563 5565597 5394354
18091 5394354 5242262 5084611 4949615 4824999 4714311 4637228 4601790 4592431 4577562 4570274 4604244
18080 4604244 4656651 4744976 4869347 5006434 5166109 5296157 5436174 5607223 5806632 6077704
18070 6077704 6352714 6641108 7017939 7538401 8221401 9161659 10452136 12270929 14817709
18061 14817709 18284037 22660112 27739159 33212665 38645100 43929201 49214717 54331194
18053 54331194 58540916 61708046 65023220 69182849 73567333 77505914 81175238 84213772
18045 84213772 85559054 85384729 84813777 83555017 80691705 77056857 73919203 71156125
18037 71156125 68231059 65313806 62327871 58305464 53032605 47711527 42881144 38114960
18029 38114960 33294675 28973554 25583657 23095453 21259653 19877567 18815958 17965517
18021 17965517 17275787 16723122 16382016 16228120 16271271 16561174 17283429 18506072 20375847
18012 20375847 22881356 25832987 29074706 32373755 35588227 38844107 42000349 44549019
18004 44549019 46292515 48059286 50485047 53127445 55512561 57739252 59659340 60543576
17996 60543576 60476148 60129825 59293969 57286268 54651288 52386377 50411243 48273386 46168470
17987 46168470 44063346 41357362 37864635 34292620 31032773 27831827 24559930 21577353
17979 21577353 19197929 17388352 16020433 14925180 14036120 13275244 12626492 12089148 11565828
17970 11565828 11048743 10599985 10158062 9768812 9406173 9039103 8721491 8420364 8125777
17961 8125777 7844618 7612191 7386453 7167361 6944826 6744924 6582344 6438957 6295377
17952 6295377 6121417 5938678 5786176 5650615 5532627 5377351 5267036 5143340 5023650
17943 5023650 4954988 4865408 4770299 4687983 4606012 4519839 4435863 4370693 4286880 4237319 4211702
17932 4211702 4171515 4148079 4106342 4052746 4020704 3973758 3898269 3856937 3860122 3840206 3798555
17921 3798555 3759934 3715200 3682607 3689436 3645089 3565921 3503404 3441757 3371502 3323010 3277820
17910 3277820 3221573 3177219 3093301 3039864 3009799 2955193 2867220 2783423 2713988 2650338 2580027
17899 2580027 2517576 2474114 2435564 2368770 2315985 2301026 2272504 2227231 2177559 2146353 2121435
17888 2121435 2100215 2070935 2044704 2043929 2012254 1969010 1974789 1970098 1968194 1990515 1967684 1945524
17876 1945524 1918034 1903409 1903905 1893324 1899165 1886410 1861753 1847422 1808266 1792948 1751418 1719731
17864 1719731 1691660 1712474 1702901 1686245 1661674 1608602 1590701 1600785 1588075 1545334 1504013
17853 1504013 1470181 1412320 1393096 1399197 1408255 1395643 1383647 1354132 1320129 1297244 1272945 1251161
17841 1251161 1220619 1191555 1166098 1142017 1099262 1113414 1125827 1099095 1093007 1096703 1091591 1061728
17829 1061728 1029280 990667 979712 968173 948662 942519 943459 910564 876879 840063 817753 803395
17817 803395 817336 801827 785501 756615 749642 764059 776437 769238 776090 782917 761222 736362
17805 736362 745004 748049 772986 821191 862021 943776 1029733 1138371 1252626 1329486 1379700
17794 1379700 1413144 1437195 1466468 1485776 1500452 1509140 1554225 1627180 1724043 1776290 1766726 1752259
17782 1752259 1695590 1619440 1548941 1447616 1301094 1150303 1018459 896191 821537 767692
17772 767692 760461 748241 700756 659436 631508 625740 622309 595071 580138 586119 589205 566453
17760 566453 546434 519039 490025 503711 496977 496844 488660 454790 463061 436675 429025 433335 437214
17747 437214 462688 474785 504223 535547 578949 618498 683605 760209 872325 960530 1020440
17736 1020440 1036087 1008346 984784 937079 833784 756197 724446 733745 744627 755836 829916
17725 829916 929299 985170 1014729 1031931 1021779 997938 984819 965550 881626 740659 618350
17714 618350 558246 525517 516365 508432 516151 526885 550972 572282 631607 714228 844635 951839
17702 951839 1020836 1051850 1032967 1029599 1005304 944356 884782 796435 749343 725186 739739 744025
17690 744025 730905 730736 775745 839790 870472 922468 956912 1008808 1057163 1122201 1184364 1235733
17678 1235733 1257914 1276905 1253120 1200188 1119463 997408 873632 789388 704086 634926 580483
17667 580483 559800 521661 476558 445963 443715 431666 405962 384328 371169 370388 357839 332012
17655 332012 307260 312339 325442 322040 294740 278608 296602 318353 287053 256297 238550 231202
17643 231202 232427 252900 273077 298440 288265 289559 263834 249203 232520 247405 265226 272706
17631 272706 236890 210819 189403 162020 144212 148519 190512 213910 200651 195713 227496 252178
17619 252178 256002 244448 237435 237163 243297 249074 249868 234313 202024 173177 166982 166430 190692 199925
17605 199925 178430 171865 164485 196953 215910 230597 237550 214935 202787 204023 218379 194878
17593 194878 185059 178714 127566 127817 125291 134706 130071 105132 117109 129375 130574 123857 116563
17580 116563 120342 96814 93684 105263 104701 119686 127639 149309 156799 155202 150574 157680 152417
17567 152417 153834 146742 136356 147383 178591 220227 197508 184934 215947 249601 268465 274747
17555 274747 290232 352239 383876 395673 411863 436161 434718 434810 451170 501625 522389 535362
17543 535362 547103 537129 542289 516370 490350 474758 462438 432550 416793 395315 365791 324930
17531 324930 300344 300171 285241 277502 258589 210729 189431 182663 185542 186335 173963 155124 167609
17518 167609 148331 104746 107023 129882 139518 159398 186293 214743 233282 250555 271895 306494
17506 306494 312834 307688 333543 369628 400489 410509 411180 422255 432067 432211 413651 416787 438259
17493 438259 453756 425974 396943 421768 375480 347846 354502 346929 356274 364962 340433 294496
17481 294496 269963 272184 267903 259182 267908 246066 200691 158650 131686 118917 132522 157106
17469 157106 173121 159235 130756 110505 118468 144248 154705 153713 134346 126291 127278 118865 86491
17456 86491 80319 64499 67110 76685 104692 116256 120979 152482 144244 139230 166266 188361 223966
17443 223966 287093 328033 339088 328141 300657 263571 269325 285498 306081 310395 332514 354002
17431 354002 416146 500234 584715 652891 693138 689330 628543 544681 457181 388312 375838 390137
17419 390137 443551 488786 570007 638353 687877 671192 594040 537639 549355 573199 619036
17408 619036 691443 772929 775141 800556 750310 634075 533135 461307 451992 462411 513633
17397 513633 595419 706604 766863 783370 756940 630746 524247 431643 369500 326630 289578
17386 289578 250322 227113 196663 155210 159498 183170 167212 201444 227037 232932 245359 236367
17374 236367 198633 176081 174115 151882 128661 104531 81706 82045 83424 73415 94302 103204
17362 103204 107818 110427 95677 122453 138910 131195 126340 114364 107713 106786 72080 82123 105371
17349 105371 118438 109636 100768 82284 52582 51059 109112 122785 76235 63227 64116 96466
17337 96466 112428 115930 122662 146631 158265 135252 100790 97505 91984 96314 78049 68694 79078
17324 79078 81035 98464 112093 125514 110728 96363 99217 86973 119822 163264 156331 182380
17312 182380 204736 229102 264604 329195 408844 462367 506642 578771 638301 692692 706685
17301 706685 651102 620645 591971 583877 551254 463308 424947 427075 436675 452103 457254 481830
17289 481830 547770 639192 754123 839810 899277 973877 1029436 1085963 1113173 1065525 976505
17278 976505 946372 949707 905096 821705 730392 688763 670394 638724 620207 585069 580782 613892
17266 613892 651920 638470 606556 590203 595341 606088 621259 613166 619493 636062 614111 596449
17254 596449 618878 605188 584001 571816 594900 596325 566553 537057 518677 550107 579076 573495
17242 573495 571694 594412 600225 579279 551002 544834 561939 553332 539194 518397 512687 508192 527685
17229 527685 542949 560611 586586 608104 647958 677225 716808 747729 769615 764861 778760 792538
17217 792538 815350 810288 820533 844657 907699 991895 1061537 1176234 1336462 1540372 1735468
17206 1735468 1925592 2120940 2319767 2513938 2682630 2794039 2816423 2827298 2869266 2928664
17196 2928664 3025867 3157749 3298409 3532114 3975860 4604630 5396087 6426394 7780939
17187 7780939 9563148 12033958 15517187 20447032 27539344 37693366 51802151 69424684
17179 69424684 87895166 103406712 112280806 113914484 112957104 113116947 112262548 105243256
17171 105243256 90027448 71655213 56488159 46338023 40202492 36900170 35679598
17164 35679598 36319015 39037292 44349387 53153105 66494588 84478900 104855701 123512488
17156 123512488 135833367 139204329 137395742 136121737 135199828 129302718 114065830 92567015
17148 92567015 72456917 57642076 47611676 40804325 35955835 32324448 29477414 27158650
17140 27158650 25220010 23564870 22088477 20785406 19657847 18652564 17772902 17009362
17132 17009362 16292808 15603836 14971830 14402075 13916187 13534008 13193483 12813937 12411161
17123 12411161 12044166 11703939 11384073 11041951 10704612 10343071 9948798 9524953 9143410
17114 9143410 8814597 8512658 8282073 8060427 7847789 7665441 7534412 7388674 7221861
17105 7221861 7074967 6941659 6814889 6663781 6523763 6419580 6274797 6103414 5932400
17096 5932400 5758862 5574093 5408237 5258673 5125424 4987309 4864821 4747216 4645050
17087 4645050 4580127 4502486 4405144 4317826 4210784 4108009 4037217 3976264 3922535 3864876 3779680
17076 3779680 3688441 3564116 3460251 3375123 3293879 3223098 3160643 3099763 3038407 2975013 2903605
17065 2903605 2828278 2759440 2687051 2643067 2645517 2647300 2668945 2674204 2680299 2761650 2819208 2842145
17053 2842145 2859372 2859624 2867027 2868048 2820598 2788360 2760102 2700579 2608078 2495909 2392205 2314351
17041 2314351 2258380 2218601 2196674 2197355 2219961 2254387 2294790 2319099 2384512 2449229 2497937 2555183
17029 2555183 2573952 2572287 2567155 2500280 2444194 2391709 2305957 2215880 2079518 1968493 1904631
17018 1904631 1817907 1771086 1721681 1692794 1667749 1663588 1701643 1708014 1687288 1663378 1665395 1712529
17006 1712529 1757998 1795817 1773471 1740436 1736074 1747724 1730783 1667242 1610611 1585532 1589566 1632124
16994 1632124 1666503 1667053 1692830 1715895 1729478 1690982 1595367 1545661 1584110 1640149 1673665 1680140
16982 1680140 1658439 1666205 1694056 1624416 1538841 1489749 1482598 1486294 1506792 1563302 1615745 1623573
16970 1623573 1593679 1589964 1551251 1459695 1373667 1316073 1291135 1294948 1296942 1280992 1236643 1205016
16958 1205016 1167351 1143813 1130622 1125518 1113581 1080117 1056944 1054741 1052120 999823 971185 1010357
16946 1010357 1028868 1027788 1014620 984195 943339 953451 958460 948960 938213 917132 921212 904158
16934 904158 883505 880765 881726 921505 935208 947404 954352 975012 972602 969026 961092 979594 1005176
16921 1005176 1031337 1028512 1042027 1053157 1044367 1045718 1055353 1084783 1109312 1167167 1248297 1379011
16909 1379011 1525761 1670259 1783516 1853464 1846716 1838170 1851155 1920986 2059057 2243619 2496779
16898 2496779 2713715 2874021 2987861 3087654 3193430 3363708 3619255 3951374 4448986 5093258
16888 5093258 5876603 6788368 7916252 9401296 11501602 14662319 19417520 26440337
16880 26440337 36791498 51835842 71116045 89718078 102350151 102774136 86454938
16873 86454938 67020093 54191439 48265426 47785748 52020743 61323601 76053595 93508553
16865 93508553 107784275 114328977 105596600 86100663 70501532 62875163 62424978 68360070
16857 68360070 80008901 93904788 104548429 107550360 96235096 77364211 62772688
16850 62772688 54584218 51593865 52869630 58419516 68792280 82857798 95839913 103328052
16842 103328052 99369071 81496825 62401839 48738779 39847439 33969141 29899785
16835 29899785 26944193 24679020 22879766 21467320 20269892 19207286 18226754 17288216
16827 17288216 16365268 15559135 14894288 14311374 13803905 13347109 12952565 12530568 12046398
16818 12046398 11549872 11026173 10545751 10143143 9808796 9532036 9298130 9070786 8892426
16809 8892426 8767724 8628684 8437828 8170751 7890761 7630531 7397241 7189238 6984253
16800 6984253 6796288 6612910 6442330 6329607 6221225 6075817 5926187 5773267 5620422
16791 5620422 5497166 5369811 5264569 5148977 5033133 4916691 4815380 4726485 4636094 4548813
16781 4548813 4447959 4343069 4232589 4125880 4043830 3965824 3897808 3832827 3757804 3677717
16771 3677717 3600233 3546977 3457279 3372072 3303812 3237619 3187353 3119036 3054829 2986080 2930910
16760 2930910 2900589 2862338 2824130 2810125 2812174 2811913 2818154 2825073 2839562 2875570 2905562 2899098
16748 2899098 2828162 2731267 2680142 2659095 2635522 2611126 2620175 2639235 2690951 2707406 2663807
16737 2663807 2604389 2569260 2516056 2487047 2480185 2460572 2464944 2486821 2489678 2464806 2406070 2314039
16725 2314039 2263461 2228547 2199658 2165297 2163969 2140929 2161189 2190120 2193787 2185203 2106268 2034107
16713 2034107 1964046 1887046 1807440 1746396 1690845 1667811 1636264 1612660 1604536 1577405 1536019
16702 1536019 1465112 1394144 1368158 1367703 1346968 1352096 1365938 1356381 1314946 1273899 1233028 1180925
16690 1180925 1175511 1167333 1124163 1098891 1081657 1115661 1116777 1086903 1052397 1063776 1035815 1040538
16678 1040538 1060282 1062738 1049419 1015253 1003036 998029 983276 969071 954758 952884 935442 921486
16666 921486 917657 897334 840373 819617 797739 784023 781047 748101 723440 710955 691824 681524
16654 681524 666346 693031 698647 683704 679859 700124 695238 669580 655070 615396 596597 613489
16642 613489 590573 585737 590245 568566 581001 596174 570217 556336 552343 569332 573227 591049
16630 591049 629464 698321 742776 794722 881565 1017609 1122848 1133870 1161234 1182887 1166531
16619 1166531 1125299 1042668 936539 837506 803026 766742 723321 665776 663038 699920 711561
16608 711561 711092 733238 784536 846255 930241 1002078 1034834 1024073 996455 968436 965521 924719
16596 924719 857171 761516 691675 637883 572704 543987 520981 462139 436181 399421 397048 384107
16584 384107 351183 354941 331869 326501 328371 341710 356991 342266 300099 278266 294351 314510
16572 314510 308662 279226 261011 263620 279344 306064 307967 307479 294242 270414 237484 226774
16560 226774 206877 216263 225956 239349 232114 224283 231841 263512 284591 227716 198624 193722 181078
16547 181078 176631 201666 226985 220678 220693 198080 158572 151993 167868 167584 173678 173458 137275 119893
16533 119893 149501 149974 117328 99557 101704 113716 129001 156127 161775 161170 187115 202772 194418
16520 194418 193708 189930 166502 158325 140475 141643 163718 168658 168286 153826 168722 164184 155637
16507 155637 132130 112370 122596 122866 137981 139162 144177 155831 140697 166985 165335 143723
16495 143723 129960 143797 117492 103512 131046 156912 143409 120028 120940 133066 110525 81920
16483 81920 73745 83924 89735 75322 64290 93915 100582 110850 106207 121316 157104 160796 131839
16470 131839 131232 130152 126222 143347 151817 166563 156495 139904 135353 143404 159468 183361 200622
16457 200622 164515 106210 99573 113911 103704 88816 85668 120808 116899 86996 68731 78750
16445 78750 98782 103932 104124 100804 105590 100770 105668 124890 153709 190142 198833 198848 185883 174798
16431 174798 169321 151128 120531 117063 123091 80941 58656 78625 91638 79000 74802 72221
16419 72221 94292 100849 82878 98377 98637 80659 74265 71693 65961 47919 58322 70182 60895
16406 60895 55172 50889 89924 73745 65934 85961 85566 88696 89535 71629 55517 68662 74389
16393 74389 58525 16911 14019 36801 44539 37510 40647 46917 55173 48778 54242 49986 51924 53877
16379 53877 63303 58695 63436 66500 69540 93976 82285 85017 84825 57385 45357 61849 62842 49276
16365 49276 46275 16333 16370 15720 36007 75786 75052 69541 53018 36474 18455 27754 68894 102423
16351 102423 109353 95962 98042 104129 104561 106215 78105 70849 96829 101603 90560 72755 69948
16338 69948 69916 67344 77823 98616 117239 122211 96187 67709 81676 96195 67604 77898 116436
16325 116436 149869 199084 236451 302683 419919 523230 540760 498779 447345 396340 340431
16314 340431 324995 333729 378668 427201 481517 576953 658621 687452 619985 538897 497689 471011
16302 471011 464640 482095 527121 582487 603463 589869 531210 454471 401545 346178 332181 364166
16290 364166 411431 469426 535630 567676 604345 574751 478959 372997 303276 269292 226806
16279 226806 181704 160274 128852 106728 106155 118836 112704 128252 143262 134714 91082 59726
16267 59726 60304 77487 84922 82454 83382 84899 62827 70272 45027 51182 70920 77268 74189 99830
16253 99830 115943 117817 80173 76910 78950 81768 118861 111665 86686 72688 49617 13847 3552
16240 3552 9913 21746 31957 54782 36969 47550 79208 64624 47202 36890 35875 61909
16228 61909 33363 15984 24930 47021 45214 49198 36659 33611 61634 66851 70963 86575 80847
16215 80847 61051 54954 43153 38646 43685 42439 58952 64100 43088 41603 45041 27205 11834
16202 11834 11322 41896 64060 73118 45998 40944 55270 58062 57350 71193 82774 86704 91030
16189 91030 82701 84149 89049 95232 107171 86507 71355 90398 77550 78374 64127 36124 26171
16176 26171 44835 45344 40027 52472 39754 18163 46620 56601 52816 55624 61957 63444 57593
16163 57593 51749 45254 37055 14658 12096 19619 -4853 -8207 11049 6378 10819 53616 62298
16150 62298 57702 64741 63834 48910 24270 9401 3589 35426 44748 47466 29133 5074 8784
16137 8784 -592 -183 15144 40342 77535 73544 49909 37064 14999 21245 57552 64717 91553
16124 91553 89100 63793 60310 32554 32127 45375 74365 91078 77885 57788 50369 37138 44091
16111 44091 30114 14544 18962 16337 12354 31708 56249 45463 22666 -13221 -30187 -19062
16099 -19062 12328 58341 75793 54474 30110 41421 62044 49410 37904 40776 10885 2439
16087 2439 -16584 10505 30011 23992 36655 44624 58661 68528 75663 29201 10600 41757 41519
16074 41519 39247 44176 48151 45121 12551 9373 36951 57682 60448 52006 31425 57054 81769
16061 81769 46948 33847 40705 43615 54625 89174 93115 67681 48774 50836 59929 61785 62149
16048 62149 73341 66501 64020 31833 -4290 36723 48063 30893 13984 16088 13120 3251 9544
16035 9544 5818 9340 9512 22429 43684 35042 8675 -6727 -3173 17318 25066 23076 26535 13853
16021 13853 17205 41242 64132 57887 41585 16088 22337 21135 37033 41021 23971 6911 -14628
16008 -14628 13357 16582 11711 24503 20860 26028 19500 4815 30770 52629 43969 32706 26911
15995 26911 20286 15554 38360 30780 -2734 -17001 -1234 32112 35553 4780 -26256 -2247
15983 -2247 31635 32749 44752 33716 40409 38129 7295 3552 8140 9962 14934 6978 14930 8791
15969 8791 14732 14436 16668 31879 24917 12203 -592 24873 64713 54354 19588 12548 43302
15956 43302 37581 42618 48378 27183 11186 -2088 2343 1776 22198 22441 21795 37680 31810 12313
15942 12313 9549 13107 -745 -10665 -8328 -11088 -24278 -21554 -10781 -267 9585 21004 30850
15929 30850 49600 72989 79049 76147 57265 54487 44727 34698 47035 54043 29427 17975 16907
15916 16907 4508 2260 2406 -3247 19132 30482 41226 32356 21308 46912 64110 39214 2829
15903 2829 -3193 7750 2299 -13587 -7156 29849 48874 46363 32401 34386 10533 -21341 -29356
15890 -29356 -19088 -16969 12802 17979 17737 39757 57685 74645 65789 45507 31464 7576 -15119
15877 -15119 -12072 -9536 -9611 8352 18388 28910 36913 39144 50469 39489 66814 81069 58551
15864 58551 37789 38068 22027 11299 10590 31231 45048 50611 20387 13220 22246 22647 39566
15851 39566 36005 13954 11103 32933 50885 46509 33980 27103 -3219 -19783 -15147 21652 26208
15838 26208 48346 84552 103726 94935 48688 26987 25801 23276 15859 9558 -6902 -11559 9986
15825 9986 27017 38760 47080 45461 16074 8874 19974 28305 11028 28942 36797 20140 13412
15812 13412 34040 28523 10304 419 -3316 -11660 -25156 -35843 -40210 19227 45978 36137 43221
15799 43221 30596 -6268 -7867 41273 50935 29734 695 4482 2299 8885 8353 -5440 9278
15786 9278 4186 2601 11679 30487 44693 40771 30534 27857 31890 12445 -2244 7964 -20530
15773 -20530 -24164 -7255 -5370 5119 11187 -20895 -29222 -22097 -34397 -32571 -7805 -14955 -21972
15760 -21972 -21833 -11467 -15108 -9025 -6719 28359 21082 15493 29554 19284 725 545 -224 11258
15746 11258 33709 39397 34692 14231 13766 28282 31065 11992 -7947 -485 -9569 -30682 -17522
15733 -17522 -2454 -4710 13413 13693 48948 67187 55575 20985 20690 18065 -7700 -13335 8409
15720 8409 5775 24 8703 31883 18537 11135 16773 2638 -9506 -7551 10088 17526 -9844
15707 -9844 -22162 -23314 -23543 -36267 -23287 -16664 6906 9105 5088 44251 59435 17400 25854
15694 25854 37112 30795 8061 -13477 -25077 -360 44811 37087 22710 27199 41146 50736
15682 50736 44791 41794 23187 -13612 -18237 -19532 -4883 20782 20154 26791 30379 25898 15389
15669 15389 -7181 3398 -22711 -17683 -15904 171 6939 3484 -6679 -14558 5170 -5226 -22373
15656 -22373 -6992 31948 47682 37624 37021 30386 6607 -3763 19921 23174 6422 20859
15644 20859 51419 43293 35810 67242 31016 14723 26551 36135 51878 51607 63528 66888 27142
15631 27142 28521 25733 40869 45308 70038 31110 15959 3015 -18903 -27714 -6212 5947
15619 5947 -9219 -18252 -26312 420 23934 19757 10712 29198 37465 33286 36246 49389 42547
15606 42547 2113 -16440 7660 32951 9810 -39058 -48832 -27045 -12456 -2803 6013 -13226
15594 -13226 6280 18978 32586 510 -26696 7902 39188 39650 29018 16809 27721 -412
15582 -412 37245 63621 58044 25305 14430 5649 656 21795 42960 67563 86202 102616 72399
15569 72399 82135 51909 66991 71312 59465 72270 97465 108924 109258 82706 83061 74480 54765
15556 54765 52639 58691 56271 37112 34445 33216 47149 43839 37558 43586 31523 11492 12758
15543 12758 33475 41813 17083 25788 47946 46456 38118 60623 57617 35373 -6656 4488 20629
15530 20629 29494 10002 9052 10223 7542 4227 26854 49902 33103 33938 46004 63937 37359
15517 37359 7606 16802 51829 47314 31171 47854 34249 13770 21745 -6421 -27412 -6208
15505 -6208 -25086 -48844 -48676 -29414 -3174 -1234 -13107 -2626 12020 44141 80986 66784
15493 66784 23871 8288 -13639 -38746 -60754 -52645 -25678 -20442 -23141 -31019 -17560 -10085 1153
15480 1153 115 10327 5043 -27617 -32341 -17147 388 -558 -5372 2024 9155 4109 12903 31258
15466 31258 16034 -4762 -12783 12700 10246 12414 36272 30461 -10451 -29594 -26041 -10300 -3334
15453 -3334 18145 18666 4014 9395 20844 13122 7940 4575 10277 4699 -17498 -9365 2399 -9796
15439 -9796 -9275 -1899 36116 31238 4223 -3883 -10125 -20279 -21443 -9120 16551 24844 3671
15426 3671 -14284 -17787 -12741 5863 7795 -13210 -11595 1329 12775 38201 26496 18964 -11133
15413 -11133 -18675 4309 20803 -11110 -51075 -19532 25253 3801 -29707 -15438 -14457 -7983
15401 -7983 -8544 12104 23654 7599 11158 51780 50087 15546 -18047 -19010 -24903 -30064 -23542 -2602
15387 -2602 -8976 -25032 -28622 -18460 9491 21345 38387 34772 5090 -6523 -22116 -23573 -20603
15374 -20603 -3236 -3614 10633 23879 22720 19797 -2178 -24659 -18998 -3269 -4359 2281 6893
15361 6893 13100 16103 76556 72721 63192 52465 44465 9248 206 9062 1051 3509 18682 40893
15347 40893 22007 90 -22716 -11948 6090 13133 994 17035 22908 30116 19504 26842
15335 26842 8575 -27720 -31628 -26542 -21550 -24061 -28269 -8401 595 20239 18591 -10429 -24392
15322 -24392 -35330 861 -6710 -14184 -6705 -5579 -24182 -29545 -17336 -19239 -21781 -13617 -21037
15309 -21037 -25103 -39617 -45643 -30544 -28935 -25439 -24584 7128 24581 52960 55405 51360 50240
15296 50240 51838 50269 25971 6025 15041 39186 44626 14641 -2901 6159 -13031 2965 11885
15283 11885 4124 15275 22723 2490 -23315 -44909 -37128 -19333 -20026 -27703 -8243 -2124 15262
15270 15262 20631 28529 28935 21861 10684 -5706 -39692 -54579 -44946 -35605 -16523 -12519 -14268
15257 -14268 -8259 -20477 -17867 5860 -10098 -19775 -3229 -17355 -56838 -34034 -27728 -48340
15245 -48340 -61018 -67737 -38913 -20734 -1538 9847 1087 -11505 11617 11121 46482 36175
15233 36175 -13431 -7306 16743 -3943 5214 20851 18409 32501 31826 6039 -3779 42087 62053
15220 62053 48605 31692 42163 23140 13763 11041 15561 33311 31042 18514 4078 -19345
15208 -19345 -23359 -25197 -20897 -1277 40040 35380 13265 54 -3922 -4392 -34772 -55959 -47915
15195 -47915 -35345 -28856 -17437 1489 2375 15175 5579 2508 -3035 -39772 -21383 -8061 -20351
15182 -20351 -11791 11168 14378 -1587 33787 61264 47817 48931 37217 -4768 -41781 -42065 -33851
15169 -33851 -19701 3305 33612 57305 34882 2131 8376 8495 19999 -7258 7575 28001
15157 28001 8962 24885 31800 6867 8333 13356 15646 12161 -726 20833 42298 32152 5699
15144 5699 8720 16270 17453 28212 16601 3678 9842 -3774 6102 32319 25508 12323 8802
15131 8802 16853 6871 -21771 -31421 -34183 -2197 46115 51020 45598 17993 -15491 -23039 -10084
15118 -10084 2883 19027 -5201 -12582 -11350 17280 7454 -2606 17392 18734 7037 -16281
15106 -16281 -15106 30462 2321 461 18767 41262 39404 26444 37215 18398 4500 -4907
15094 -4907 18589 34941 21717 9763 2280 10517 -3426 1921 -15391 -14426 9558 18632 42461
15081 42461 10700 -4076 -11662 -16787 3571 -472 3250 24992 18621 18352 16245 -6489 -11993
15068 -11993 20887 30860 24838 22204 -7726 -33571 -8859 18242 10528 11063 -5415 -10163 23558
15055 23558 -1000 -34994 -19409 -8676 12217 33367 43983 8593 -14557 -19021 -14324 -2336
15043 -2336 14748 16598 -7458 -15986 -13212 10730 32470 -8745 -28839 -13072 -4402 -18739 -50380
15030 -50380 -44667 -9940 28639 63492 66253 79715 53566 39681 25349 8131 6583 17320
15018 17320 -15394 -16007 19610 46811 37501 43887 33940 30153 11727 -4040 9472 22622 -4695
15005 -4695 -23034 -37072 -29660 7317 165 5902 -1425 -3706 -677 -17255 -29897 -46130 -39120
14992 -39120 -15875 -5747 -12692 -21548 -25878 2834 12567 320 -661 -6325 -10560 291 5799
14979 5799 14800 9258 -8322 -1247 12362 24864 -154 16653 13877 -29123 -51393 -19867 10982
14966 10982 14178 28051 27388 36173 48424 41623 23513 -2483 -15515 -22421 -30866 -55029 -36411
14953 -36411 -14228 -19743 -34434 -35826 -20370 5367 15048 12739 7051 -25945 -22307 -32015 -18693
14940 -18693 11553 24285 -9139 -27086 -12286 -1394 -9788 -12653 -6661 7617 13711 46757
14928 46757 40511 27119 6190 11937 7822 -11849 -44260 -50597 -56029 -66382 -80465 -69491 -63137
14915 -63137 -45916 -24330 -3765 6403 -12675 -10530 13395 48479 43285 7519 -1082 1784
14903 1784 -4083 31971 56269 22196 21926 6473 5205 23509 27832 22864 27651 31177 12496
14890 12496 26914 51917 62525 48543 45400 48459 45568 48033 27837 4488 9334 32321 41299
14877 41299 42510 39418 23560 14832 1241 -5656 -12610 -14805 -32935 -30546 -24585 -21905 -18349 -4688
14863 -4688 18812 28900 27275 25655 18619 7624 11665 8036 17583 20297 580 -2993 -14024
14850 -14024 -36382 -13361 12472 15048 -4889 -19534 -42939 -30064 -7088 -5883 2549 21370
14838 21370 14312 -1564 -20588 25454 31316 6183 8536 3869 34960 28484 27840 21580 28475
14825 28475 29147 40857 42832 25957 32190 19365 25609 95013 91176 79104 50127 53899 38771
14812 38771 -627 -27758 1480 15488 9496 -11023 6210 7987 936 3129 5448 12181 14239
14799 14239 17947 2132 -7344 11058 40598 19075 3423 3386 14829 5909 6403 20243 -3908
14786 -3908 -9061 13910 29564 33660 15134 8312 35444 36137 20044 -5839 -9511 8184 12072
14773 12072 -10614 -11318 -28383 -60299 -38715 -5663 5682 -17250 -30415 -12868 20310 28052
14761 28052 24689 5275 -3454 -34321 -59657 -68750 -33615 -28544 -33502 -42918 -23812 12296 34030
14748 34030 -7110 -26156 -7793 26782 41440 34629 10633 -14444 -18481 -14424 -3032 -7415
14736 -7415 -26550 -23897 7409 41833 61479 36462 40067 61329 82825 66831 33121 20840
14724 20840 145 -13181 -284 865 29 11784 25861 31479 15598 -7603 -9487 -3936 2097
14711 2097 -7237 -3470 -2289 -7519 12338 16078 -6163 -27283 -277 11030 22423 -6719 -5355
14698 -5355 1804 13666 21562 13260 31747 25763 22583 10295 4258 21212 22700 15681 5637
14685 5637 -7404 -3336 -12883 -6814 13589 15305 28486 18748 36163 39025 42287 34315 27890 38481
14671 38481 80440 53938 48425 24455 11475 26799 14169 7609 16194 65311 84858 47836
14659 47836 38469 45561 58097 54669 56615 51839 52094 40709 38702 28612 27191 26957 38511 37450
14645 37450 13819 25198 16122 -20192 -17005 -12236 11761 25838 8442 -11845 -18711 -16182 -39426
14632 -39426 -22110 -8377 9094 22701 24122 3036 -21181 -29304 -33037 -14701 19788 26146
14620 26146 19656 25789 29819 25843 6942 -5241 6887 19824 25164 35005 26388 42245 26628
14607 26628 -4967 -3458 6400 17087 16478 9350 -1730 723 -1051 -34633 -29546 -33377 -14839
14594 -14839 12133 18001 -20290 -33562 -24880 17182 28449 9018 -2971 34859 39428 12999
14582 12999 5322 15116 12034 36420 23710 17999 20993 10473 -2413 -3229 18863 22363 26791
14569 26791 11320 19357 40778 51873 43281 74166 42912 16942 -9213 22640 60896 76847
14557 76847 47435 51584 51690 28544 10495 -3911 1206 29141 55770 65920 85401 52281
14545 52281 56619 57234 30808 43328 12441 362 -2494 -13088 -24453 -19836 -10829 -14536 21672
14532 21672 19372 20741 2204 8285 9008 -8453 -19608 3893 34141 10964 16447 28428 24524
14519 24524 2709 8198 25577 20395 23561 29574 40065 43264 50952 54495 80038 77636 58886
14506 58886 27588 23606 26040 18540 5150 21067 55782 46287 11673 500 6711 -8201 -20395
14493 -20395 3550 3369 -4593 -1832 -9923 1604 32860 16054 -8543 -20535 -2392 39144 45711
14480 45711 63600 54940 4038 1889 25230 27680 9052 -15608 -8882 -29431 -56238 -60837 -52833
14467 -52833 -42358 -29373 -4684 1065 41031 28610 4663 -15780 -15091 8093 -47 -11905
14455 -11905 -25859 -16431 -11016 -7780 13363 21283 28111 -9991 -32260 -18178 -12396 -15099 -29410
14442 -29410 -23050 -29704 -26902 -39457 -61984 -62913 -25400 -17898 -10868 17692 28602 34927 19842
14429 19842 -11957 -3069 -16070 -13985 -13251 -13263 -15097 -16514 -12150 6078 -16239 -45388 -37996 -20420
14415 -20420 -25704 -28916 14523 27940 53978 64849 42380 33038 36744 40226 33848 -8504 -33235
14402 -33235 -48786 -33345 -32869 -12062 12324 34670 62119 47317 42927 28822 10511 19897
14390 19897 19832 6063 -13624 -28591 -37785 -42258 -34338 4773 18401 22982 16571 -19317 -23689
14377 -23689 -14421 -34701 -13630 -7201 21018 40631 39021 39942 41273 29113 17227 30146 14951
14364 14951 33 -9490 3733 -14761 -4941 15759 -1184 -18596 -35380 -33032 -22402 -4798
14352 -4798 -11346 -6745 -32701 -57255 -37568 -27597 -3983 28472 42143 36755 17235 -2807 -41855
14339 -41855 -48829 -19516 -9141 -19867 -26453 326 -5479 -9464 -27951 -54588 -44908 -28930 -43421
14326 -43421 -49911 -51699 -68627 -40902 -26297 -21629 -41296 -47010 -20050 -8725 15182 12032 11733
14313 11733 31544 -1851 -42291 -57776 -32654 -22220 -7022 11859 8378 8218 2179 8284 21142
14300 21142 4853 -36174 -45930 -28884 6038 30682 29121 22351 5497 -9593 -24507 -52067
14288 -52067 -47062 -50374 -60586 -61036 -49974 -64754 -72851 -47218 -14613 6127 9849 4337 1002
14275 1002 10423 7629 -10165 -21733 -24138 -14824 -6239 -30679 -45231 -39611 -23559 -30607 -23137
14262 -23137 -14065 -18886 -12038 -4849 -12074 -49160 -66918 -54623 -35472 -15591 5309 3866 -17064
14249 -17064 -40405 -54831 -47985 -25041 -2001 797 -27529 -41483 -55075 -70159 -68932 -55057
14237 -55057 -53594 -49898 -63281 -58990 -27176 11968 4742 -9053 -14375 -18028 -17608 -7091 16926
14224 16926 -11763 -4646 3654 -26336 -11772 8667 5361 27223 14673 -21199 -32917 -48850
14212 -48850 -38139 -22734 -9117 -21356 2209 4669 8028 -5724 -3723 -581 -12358 -19519 -7529
14199 -7529 9359 7735 -1274 -20710 -7722 1896 -3634 -14936 -36484 -51093 -23921 -39354 -25217
14186 -25217 -15253 -30709 -33396 -41550 -35571 -35344 -31729 -20137 -22177 -45373 -57578 -58911 -57064 -100018
14172 -100018 -74039 -56007 -59995 -40724 -16018 -15177 -14272 4242 20375 19584 26951 18896 21231
14159 21231 36437 25242 14616 -13155 -5446 -4450 -12171 -20233 -4704 -12726 -7811 -25919 -43050
14146 -43050 -57809 -57183 -30313 -13844 -12353 -4316 6059 16902 697 -11464 8060 18872
14134 18872 28170 -2215 -39676 -27638 -25127 -2872 3464 15659 -13263 -49418 -53512 -41429
14122 -41429 -38499 -9205 -545 -2323 -17581 -46485 -66732 -60520 -35983 -13991 5262 25009
14110 25009 10831 4357 13402 -358 -37784 -48140 -27528 -8605 15509 19264 -24269 -43084
14098 -43084 -30779 -53584 -64551 -55645 -48112 -34696 -51440 -58555 -31828 -43860 -36821 -32289 -28866
14085 -28866 -28800 -24046 -34218 -41693 -26924 -2158 10316 -14175 -4555 -4623 -9109 -6401 -33882 -16795
14071 -16795 -10693 -2701 5252 15522 10470 -4967 -16546 -26265 -38603 -17019 -8348 -1647 -287
14058 -287 -10202 -9429 5863 -12878 -27461 -9374 6774 4124 20392 11834 -11526 -8638 7919
14045 7919 11662 1826 -30446 -22507 -26932 -12049 -806 6262 -3683 -35179 -38901 -35288 -28695 -13737
14031 -13737 -8269 -5878 -41437 -21646 -17881 -12063 6246 13300 24245 38606 50668 46211 61523
14018 61523 81229 107997 152230 191743 221153 265312 330055 375199 407713 412267 383689 347376
14006 347376 291731 228909 173163 111867 93599 99584 59847 51311 67765 66940 36155 14261
13994 14261 7460 11216 28368 49659 60542 84046 87284 43851 -6326 -18099 6130 18555
13982 18555 31851 27637 36348 31729 38933 43509 51849 31336 20392 7160 16125 39705 40898
13969 40898 -1844 -11219 -17734 -20953 -18487 2602 29433 24354 10226 -8841 -3002 -30266 -25548
13956 -25548 -41859 -14922 -5616 -17457 -20483 -12267 -183 -12593 -6050 23466 43253 9212
13944 9212 10713 12473 -15282 -16658 -8979 18242 19104 18923 -8037 -28350 -9506 -26667 -44758
13931 -44758 -53675 -45156 4144 -12992 -48431 -53067 -45579 -32306 -6408 13010 -7692 -40632
13919 -40632 -34760 -45314 -65081 -69056 -67010 -45983 -25839 -30432 -5910 -15496 -27248 -30174 -31094
13906 -31094 -21615 -19999 -41316 -49427 -36533 -26457 -26673 -32882 -25011 -19282 -45501 -44706 -20093 -12885
13892 -12885 -19838 -10856 3788 13141 13822 11153 -18061 -31711 -16217 -27176 -34051 -37415 -14020
13879 -14020 10358 13000 31932 11295 4928 15972 23564 9202 20297 33371 31826 22848 13148
13866 13148 22597 -22219 -49262 -25221 -27430 -14646 -11287 -12281 -22263 -6511 -5628 -5882 -13423 8596
13852 8596 15615 12265 11472 -141 -28405 -20121 -13023 -20167 -20751 -34551 -55475 -48068 -36497 -21414
13838 -21414 -11595 -38212 -42566 -36803 -30979 5153 -547 -3389 -33766 -49628 -21073 -4030 -20021
13825 -20021 -20334 -45503 -35722 -24016 -21112 -27445 -44349 -36356 -44658 -49840 -62712 -50252 -54176
13812 -54176 -54874 -41600 -12658 1155 10585 32915 24314 17996 -6449 -23181 -21842 -52929 -53984
13799 -53984 -39864 -18585 -13052 -25695 -26969 -6788 11334 19546 -10462 -23585 -2596 25830
13787 25830 9997 -19651 -51271 -60291 -44519 -28681 717 17698 -2291 -30014 -54124 -52714
13775 -52714 -36766 -22253 -24431 -22554 -37866 -45967 -56829 -51803 -49701 -21307 -15970 -23293 -15901
13762 -15901 -16399 -18729 8570 6712 -27774 -63322 -63864 -80879 -92446 -63874 -16417 12466 20474
13749 20474 -25399 -75749 -68547 -52366 -21429 -2642 -716 2930 -21755 -32838 -28647 -15984
13737 -15984 6702 714 -3698 -23642 -50239 -49848 -32081 9012 -9260 -26747 -32305 8614 21708
13724 21708 6134 -13828 -35846 -35514 -38248 -53343 -27722 -4271 -35659 -41367 -6867 1565 -10440
13711 -10440 -46403 -49822 -40038 -61490 -60298 -26660 -45626 -38371 -8694 -17067 -36091 -27571 1520
13698 1520 20871 352 14636 51483 32637 25949 43471 60600 61799 52916 51394 84240 77711
13685 77711 59118 32177 34928 53718 54717 51264 28400 41704 60195 31794 12549 43921
13673 43921 26014 -8485 13308 38356 58460 65425 54618 35308 14390 -2559 -506 -2097
13661 -2097 -19407 -32993 -61293 -49401 -27366 -26075 -14719 -13538 -3132 -12178 -21784 -35406 -35851
13648 -35851 -11955 -11605 -17077 -7590 1234 -38170 -55059 -56484 -42832 -23680 -23972 -48351 -68778
13635 -68778 -66495 -58019 -34130 -22223 -15367 2849 12717 -14301 -11995 -41976 -22963 -7800 -21925
13622 -21925 -34357 -42697 -41160 -53806 -43895 -54958 -47514 -37243 -31908 -32965 -31630 -30922 -34144 -38767
13608 -38767 -25795 -34406 -42913 -42170 -58236 -75472 -66674 -48909 -69111 -61591 -31439 -27350 -23252
13595 -23252 2864 -6016 -30890 -52845 -54387 -54603 -71608 -85133 -57524 -52533 -43936 -35805 -25157
13582 -25157 -50999 -51718 -47915 -52883 -49761 -19746 -1211 10307 -12044 -28336 -33210 -36055 -43307
13569 -43307 -28139 -37082 -38498 -34642 -26343 -20941 -24287 -66070 -56667 -24737 -25924 -25861 -48602 -30903
13555 -30903 -56585 -72980 -44817 -25826 -33331 -20263 6445 2188 4303 12292 18855 25486 30883
13542 30883 28024 15349 11547 20432 22220 15173 20441 2457 -25189 -11655 10531 25455 -12966
13529 -12966 -35935 -27372 -666 31170 25368 -7888 -52385 -64657 -45986 -26631 -3853 17841
13517 17841 31307 42650 34869 27670 13797 22604 24099 15971 1213 10577 10332 -6189 -2234
13504 -2234 16587 10346 23139 17368 38977 53443 43804 25829 -4696 -21797 759 35896
13492 35896 25100 910 9876 12625 -12108 -21408 -22332 -14255 -1589 2839 14037 22081 29057
13479 29057 34654 43373 34548 13419 20594 33622 42051 35983 15303 14214 5914 2500 13057
13466 13057 17364 2224 -51959 -51803 -13629 -4415 11269 -20518 -16681 -19938 5976 19535 -14936
13453 -14936 -23666 -59452 -114932 -101388 -51928 -21098 -40832 -39192 -32041 -23587 -15064 -4202 -23968
13440 -23968 -45193 -40424 -61017 -90034 -71881 -48320 -29958 -19926 -6419 21458 37601 8271
13428 8271 -11623 14115 28604 27308 -7209 -32940 -24505 -8954 19838 542 -39081 -53986
13416 -53986 -34322 4905 -184 -19572 -29274 -38855 -28805 -2246 10863 24588 6550 -8859
13404 -8859 3346 22700 31032 26705 14456 24793 11953 -14432 -15722 -5731 -460 982 -17200
13391 -17200 -22087 -3250 -17488 -41686 -37377 -51921 -48944 -73790 -56846 -27353 -20792 -14939 2124
13378 2124 8768 -11603 -20482 -19036 -24782 -28490 -21096 -11794 -22846 -22740 -23273 -44744 -33238 -13649
13364 -13649 -10463 -24809 -25155 -31716 -49903 -65633 -73071 -77107 -63768 -50198 -27647 -6063 2601
13351 2601 -12260 -26644 -21484 -7493 5563 69 -9271 -30154 -29695 -52233 -40778 -27239 -19001
13338 -19001 -14048 -24378 -28403 -1136 -21186 -15056 -20213 -59698 -63307 -56889 -31642 -1031 13395
13325 13395 46739 81612 72738 21049 16473 14707 -1444 -22587 -65183 -70964 -39341 -25369
13313 -25369 -32334 -46765 -60712 -61729 -34981 -37517 -26271 -341 -23550 -22342 10451 1836 2455
13300 2455 -9228 6233 11717 18890 6227 -1421 4628 4197 1349 18623 -811 -13247 4560
13287 4560 27390 37690 5489 -26789 -47239 -54030 -24769 -11125 14581 35823 36488 34576 43373
13274 43373 67536 49078 43286 49652 32779 43008 43864 39094 10721 17945 17951 29549 24162 50091
13260 50091 38876 26432 38953 39267 19429 22447 31439 42330 60468 74352 57313 35250
13248 35250 21717 50225 46972 39216 3986 14045 19447 8763 5107 -12394 -18245 -17698 -18594
13235 -18594 -7817 15448 -5017 -12889 -25718 -14495 8912 27712 43172 82458 107428 105441
13223 105441 71008 72915 87961 124478 179874 213997 264249 317212 427753 571116 778898
13212 778898 1032620 1308898 1585738 1883294 2094025 2255168 2366968 2398921 2340119 2196494
13202 2196494 1987924 1708983 1445905 1191236 975541 792919 657609 561108 484542 420778
13192 420778 403798 370289 316223 296448 278048 261952 244730 233933 207893 171286 140770
13181 140770 152334 144500 132613 130531 126992 132770 118811 128422 128995 163322 143649 108353 93923
13168 93923 106959 93285 95102 125461 126913 115506 100502 77509 52903 50591 68997 51058
13156 51058 39138 45819 53986 61381 62619 113437 105786 83620 54989 44931 61825 76368 69607
13143 69607 60210 45344 39263 65457 54173 43882 47362 38913 46070 44906 44878 13585 14505 9895
13129 9895 -18333 -3328 6231 -18624 -57557 -40591 -33125 -26847 -45356 -64803 -46813 -25969
13117 -25969 -4065 19768 58355 50827 25224 30836 42648 43348 35178 27956 -546 -37496 -46006
13104 -46006 -37222 -45934 -26590 -10398 3707 -380 -42026 -55302 -49914 -29558 -19499 -22377 -6701
13091 -6701 44129 34661 8029 26014 49200 41867 41447 71830 60682 46443 67309 65373 47477
13078 47477 50458 64672 73868 50469 37215 38750 27112 10003 36817 17114 -290 -19964
13066 -19964 -7549 23105 43285 37016 30873 37827 23645 37314 56689 55934 29003 25857 15694
13053 15694 -13370 19651 27276 41418 77406 90650 77906 119192 164938 183925 215254 242854
13041 242854 264861 281832 297696 322425 340968 379116 418376 426620 389918 356879 330698 292630
13029 292630 255908 220188 192920 166753 153607 138732 139416 114982 110787 82042 33350 14290
13017 14290 -7758 -9682 -6670 3776 -6606 1329 16996 10175 -15375 -23326 1017 -26478 167
13004 167 40830 33802 40282 60804 67233 37256 34031 33655 27957 -4117 -6795 24583 43888 40211
12990 40211 29881 17426 34369 24575 25929 30715 14083 -13742 -11829 -17299 -20605 -53667 -54668
12977 -54668 -58189 -69454 -68363 -72505 -99254 -131462 -149143 -151536 -146612 -138275 -139708 -140504 -123477
12964 -123477 -122445 -96828 -75862 -67737 -43639 -33980 2932 48582 49635 73915 109204 96327
12952 96327 93400 87711 104752 111184 111580 77418 52246 33498 20664 28302 74859 49897 -17721
12939 -17721 -20181 -4041 -10336 -65253 -99084 -129569 -163317 -148116 -138043 -133510 -162259 -169755
12927 -169755 -139578 -111584 -77707 -21794 43226 94812 165610 260431 386534 556397 734821
12916 734821 920422 1155975 1438638 1707879 1942448 2154856 2329761 2426190 2435460 2420814
12906 2420814 2346021 2234072 2089215 1898955 1715789 1591796 1518098 1447935 1378475 1341192
12896 1341192 1298138 1268662 1235569 1240176 1258911 1249646 1209954 1160321 1117366 1088736 1052537 1041364
12884 1041364 1001642 936928 910695 893788 878712 863163 890499 899567 884665 888101 864105 848773
12872 848773 833552 808574 804347 855888 894086 907468 918974 914067 904921 894643 923151 904463
12860 904463 885324 892385 894428 883412 885168 866438 852655 846301 857456 885573 921004 935328
12848 935328 973175 981538 948006 889758 849673 837284 872500 894174 922354 952990 977526 1042302
12836 1042302 1120849 1210315 1281064 1364766 1414222 1472812 1524390 1605798 1678806 1777760 1838556
12825 1838556 1894712 1951955 2024192 2113747 2175187 2285146 2421943 2550530 2668463 2828719
12815 2828719 3032729 3275816 3564359 3913960 4246242 4606615 5033456 5496171 6064380
12806 6064380 6752940 7563223 8588000 9857310 11416111 13305295 15523964 18067262
12798 18067262 21056294 24655432 29091379 34792957 42456514 53016717 67891161 88916949
12790 88916949 117596090 154330572 198516979 247479120 298006648 347329221 391192285
12783 391192285 424870167 443655696 447322792 435875453 410774307 374174570 330150249
12776 330150249 284592091 241028249 201554448 166977135 139454200 119273214 104689672
12769 104689672 93832987 85284170 78249868 72246492 66934366 62117240 57704892 53713295
12761 53713295 50064265 46735919 43784228 41146075 38829555 36808023 34985826 33419943
12753 33419943 32064143 30805086 29644907 28561689 27564753 26675312 25814551 24983954 24192603
12744 24192603 23410060 22712169 22070133 21467842 20879467 20285248 19739057 19229359 18753827
12735 18753827 18304797 17873651 17477552 17077409 16724758 16357826 15990971 15660226 15350289
12726 15350289 15052353 14734302 14428345 14123178 13782897 13440578 13103742 12744827 12432534
12717 12432534 12143443 11866100 11597414 11351985 11102494 10877223 10666364 10482167 10299006
12708 10299006 10075895 9902790 9721867 9580282 9484754 9364049 9270348 9207331 9146473 9066873
12698 9066873 8991233 8903262 8733785 8536240 8301077 8060219 7827960 7601962 7361093 7100251
12688 7100251 6873165 6675622 6490708 6333783 6202059 6105093 5970610 5803382 5681671 5555889
12678 5555889 5427022 5285705 5146354 5070696 5015814 4943957 4867749 4846438 4815993 4777597 4772791
12667 4772791 4820040 4894693 4999733 5091821 5238606 5430633 5651023 5913969 6142547 6331964
12657 6331964 6502341 6593308 6584724 6477706 6314287 6140078 5958009 5715584 5478807 5197916
12647 5197916 4947976 4772000 4601014 4434150 4308795 4214296 4130117 4048539 3959118 3906675
12637 3906675 3822624 3754602 3736615 3688548 3633096 3538896 3450484 3360116 3270099 3168729 3086138
12626 3086138 2984117 2907694 2858497 2801804 2739444 2679690 2632336 2573728 2542582 2519273 2475867
12615 2475867 2422045 2359125 2316143 2264476 2217397 2183205 2143056 2110173 2075133 2025935 2015870
12604 2015870 2005468 2004576 1984771 1978691 1966091 1950104 1947046 1970438 1995496 1989445 1954462 1926364
12592 1926364 1916317 1909294 1880231 1812366 1785679 1776759 1694472 1648181 1629947 1588346 1559184 1504458
12580 1504458 1452988 1427274 1401570 1392437 1382124 1355132 1330315 1286854 1239135 1240897 1211366 1140117
12568 1140117 1105466 1115224 1142013 1155602 1114600 1065793 1044954 1062509 1055750 1042724 1040205 1031536
12556 1031536 1024249 1008040 998796 992135 974646 967372 948657 938112 906666 878319 882869 880926
12544 880926 842361 816706 784068 756971 727388 713967 676409 668927 668897 656657 651178 659731 673007
12531 673007 690048 688658 684755 671050 668964 694647 665730 638796 636564 641441 621408 606298
12519 606298 605610 594406 587824 567783 556861 566251 553123 548376 531566 509073 489412 485697 506661
12506 506661 510809 503697 487410 478558 478267 482482 437708 418987 416534 400570 391557 388483 377747
12493 377747 396545 413605 391312 390837 369814 329424 288008 275341 263084 306745 333082 328885
12481 328885 331470 334784 324874 313729 265223 267307 281470 274063 283945 309756 329885 335929 319010
12468 319010 285666 286713 273276 267877 282689 320857 346100 339120 326256 287012 259388 236607
12456 236607 255933 293425 317076 311341 311207 312639 310972 306895 295041 298544 316968 303851 306587
12443 306587 312503 284366 286086 290004 278293 288656 275133 275021 264455 226704 206375 232301
12431 232301 263410 252714 228106 217789 213318 227981 224223 243107 268381 274154 267895 282750
12419 282750 314756 294375 286972 273148 285222 277384 267387 263943 256749 235032 215679 206093 216009
12406 216009 215665 198851 174939 177855 175665 179402 202647 215699 221782 223842 263541 250811 202601
12393 202601 203850 225616 227315 232088 243384 248245 266971 277883 308700 355299 334682 326831
12381 326831 325534 360459 349464 321279 313873 324625 303602 293151 307872 328762 330359 348855
12369 348855 360037 368242 390746 370456 389182 425842 470391 531112 612198 737895 903154
12358 903154 1165942 1454844 1736453 1989395 2238930 2455657 2603564 2628824 2559899 2432880
12348 2432880 2268983 2042611 1828778 1589914 1345188 1142165 974904 846059 779793 708746
12338 708746 653789 612097 588737 579814 557603 507703 456395 435837 424303 411920 371152 329207
12326 329207 314362 314493 287927 268266 251601 252248 251324 240090 226707 220639 205938 207549 205125
12313 205125 159057 142787 152498 143031 127290 162203 176818 177549 177883 175077 148932 141835 149767
12300 149767 162134 154723 144035 103931 93944 83610 74372 95953 120285 149070 179888 189381
12288 189381 165341 159319 142500 103145 106795 149777 155688 147726 115714 109872 95652 103546 88804
12275 88804 84123 77198 73357 66876 74034 73593 75231 98459 129214 121161 135824 135605 128586 109795
12261 109795 71994 69118 82599 85579 98816 115481 104324 101864 89676 89067 108265 112859 91808
12248 91808 76876 85761 91418 56258 2439 -12177 21377 70940 81438 61333 59271 49110
12236 49110 65381 67360 86322 89578 78864 96861 99552 101171 107768 114793 112352 109581 96071
12223 96071 91435 83601 71437 67272 74060 78642 109354 109044 96503 63971 45107 39538 34124
12210 34124 31853 31478 42981 44708 30051 11242 22807 41142 45118 30653 28467 48114 71764
12197 71764 76945 70745 53187 41981 44475 38930 47060 77313 82408 65890 34019 39431 46918
12184 46918 45944 47267 45523 34735 39560 47116 28723 43328 72123 76234 47766 72873 108527
12171 108527 99890 92415 83393 75878 32042 15036 44441 59582 29925 17617 56807 74398
12159 74398 54325 27874 34270 57362 38263 25188 12143 696 27323 40533 37443 39737
12147 39737 48089 63755 67290 63073 82878 86516 93203 102056 109768 113912 103009 61690 34096
12134 34096 10402 46564 56137 49620 22748 4153 27105 55656 39079 43175 49057 53787 58168
12121 58168 102119 90949 44500 24684 26351 49911 47781 41941 54152 25489 -10598 -5004
12109 -5004 22479 24028 8812 10313 27638 7198 20498 40028 62084 48110 31625 18822
12097 18822 10842 18114 41521 41327 16688 4980 -6378 -7025 -6662 10924 22198 -762 4297
12084 4297 9432 11321 12791 35884 48318 48650 40727 42009 42525 52401 48239 29734 33135 44563
12070 44563 66395 57119 56894 21963 1144 9313 29516 48522 28033 43255 60138 78936
12058 78936 79716 51574 26953 23197 48584 55490 43923 34674 30291 26518 2036 19122 26067
12045 26067 43410 48920 21535 201 3379 -4285 1676 3442 7404 16534 15353 15350 -1827 -12143
12031 -12143 -5597 16326 18502 5350 -15688 -32477 -36973 -14374 -8655 -11337 -12370 -18798 -27956
12018 -27956 -17595 2321 22152 23068 -2895 16434 28874 -6619 2407 26975 15498 41183
12006 41183 68017 85921 87400 54664 31431 -11266 -35426 -30441 -39892 -6152 1294 -6407 2433
11993 2433 19998 33889 23841 12477 -6589 -4816 25331 39603 21408 32906 36802 33874
11981 33874 64047 80733 30264 6171 37188 51164 41299 12682 -20220 -11966 -12528 -3031 16390
11968 16390 27279 24142 34046 42588 38895 16167 4822 14814 27131 55576 43831 57612 67321
11955 67321 74766 43568 10966 -10606 -7392 13790 -6506 3153 -3304 14602 49691 58960 74552
11942 74552 63125 39358 39246 35961 63422 49761 38924 60577 42068 3787 25893 34705
11930 34705 40593 24741 36089 46337 16768 -16587 -16996 -4379 18113 27645 15366 -8109
11918 -8109 -27645 2430 33364 39476 23195 -5367 -22764 -17350 -5355 -7366 16964 40544
11906 40544 40892 23546 4254 -14033 -31609 -16765 18896 24637 22285 36911 65397 75200 44878
11893 44878 26171 39727 61862 60603 24750 3027 -6132 -8350 -7422 -1065 12419 39883 22427
11880 22427 -15004 -1194 1777 -2553 30703 3550 -38130 -44441 -17222 98 -7418 13990
11868 13990 20928 6468 30470 49240 71278 54913 43876 47060 52359 52117 49613 31665 31763
11855 31763 5575 3146 11748 -12408 -2947 39506 47893 57788 73176 31007 12531 23962 31329
11842 31329 33546 29495 27689 43042 26582 9766 20695 21619 -13193 6620 13119 19261 2626
11829 2626 -2936 -5539 2198 3197 11267 50317 86377 99280 112001 118096 118969 122932 119587 118007
11815 118007 146841 141519 153266 151089 151300 145181 144757 136249 116671 72635 48568 70044 86393
11802 86393 40848 14460 29511 53292 72312 66038 40635 47415 26673 -5353 -9987 8380
11790 8380 13748 43527 19094 17416 18866 11812 37241 45309 7844 -16626 -19187 -10727 10213
11777 10213 39060 64558 64274 33412 1861 -14280 -5840 -20015 -15118 -29123 -29557 -25097 -8878
11764 -8878 16306 3207 -6158 5083 49042 51648 32244 11216 -11013 -21684 -28524 -1001
11752 -1001 -5986 -22394 -8759 7251 25716 8901 -15934 -14588 5236 -4613 -499 37809 54975
11739 54975 64830 58385 22317 -13516 1392 -8594 -22038 -17313 -27550 -35568 -24796 -18666 29215
11726 29215 49206 51449 21287 -17680 -14490 -13775 -31077 -22662 -27644 -23080 -22830 -31900 3236 16621
11712 16621 18756 13809 22181 30310 -6687 3973 968 7048 11239 687 -20100 -48923 -53789
11699 -53789 -46258 -44340 -46472 -17669 21399 37403 54467 57521 71161 47730 14426 2929
11687 2929 11324 9155 9158 -2157 -30101 -25320 -24411 -24545 -20260 -12311 3402 10246 5148 -1699 -925
11672 -925 11451 9325 36021 18298 24364 4558 -1088 15567 4337 -35841 -11877 37985 45347
11659 45347 7551 -20102 -22123 -16702 -12302 -26227 -45427 -63495 -41209 -32738 -54796 -57644 -55492
11646 -55492 -32675 -29557 -25362 -7572 -25768 -2270 44466 47754 24257 21645 2253 -6046 10419
11633 10419 26916 20355 1409 15253 11992 25832 29928 -1181 -34078 -30736 -43782 -37873 -29469
11620 -29469 -7361 9669 11534 8519 -6873 -13926 298 13246 -9734 -36492 -17307 3431
11608 3431 4441 -9129 -25153 -33976 -22884 -21469 -48574 -43264 -17998 -2475 14033 21856 15931
11595 15931 14875 23526 15288 -15306 -36831 -41710 -6707 -21723 -38475 -10796 -18721 -33486 -22208
11582 -22208 -18085 -41845 -21411 -18067 -36147 -61434 -74708 -65711 -44309 -26791 -18495 -668
11570 -668 -20753 -7609 11206 1873 -23850 -42206 -37868 -37837 -35562 -54679 -59475 -43280 -26804
11557 -26804 -27687 -23115 -39227 -50824 -34751 -27758 -24899 -7629 17037 2193 1660 16976 -17498
11544 -17498 -31969 -19740 -16938 -41179 -35754 -26484 -3695 -16847 -44914 -29356 -2839 -2466 14336
11531 14336 8204 11516 6224 7999 -18794 -17756 -1191 -10119 -9062 9236 8603 12716 8427 8379
11517 8379 -7488 -7946 9893 31657 26728 29163 35847 23549 21437 7628 -10469 -3741 11541
11504 11541 13491 13234 36362 22557 24688 20106 22040 23174 46715 24210 32268 26056 43574
11491 43574 38220 14345 -19893 -39525 -29565 -37194 -68392 -72541 -60770 -79105 -67730 -50352
11479 -50352 -41522 -23396 -9301 -2654 2596 -10901 -1544 13697 13696 -1963 -1703 -28353 -23726 -18406
11465 -18406 -24115 -70682 -69273 -19517 -7574 -14935 -44597 -48391 -24287 -14886 -24376 -36221 -46412
11452 -46412 -69136 -67178 -37999 -5137 -6749 2274 6036 -30253 -29331 -9876 -7578 -30759 -55345
11439 -55345 -35934 -5233 966 -3892 10664 58776 40673 -11932 -47793 -83641 -65902 -35801
11427 -35801 -29344 -1081 -4361 -36747 -65566 -46423 -43339 -49292 -47872 -32261 -26272 -18717 -11922
11414 -11922 -284 21436 15147 7715 16264 34644 12668 22609 19789 -99 -9762 -13797 -4528
11401 -4528 715 2726 6350 -1758 -26028 -63797 -60045 -26445 11095 -2766 3499 -7159 -34391
11388 -34391 -29812 -9694 -14707 -19077 -30674 -43607 -55675 -50862 -26048 -31578 -23567 -30633 -25212
11375 -25212 -40871 -47285 -47357 -51384 -26830 -9449 -29997 -41672 -66044 -82891 -78196 -69059 -85880
11362 -85880 -87303 -101396 -74461 -43712 -34937 -25886 -25882 -22914 -18307 -19743 -32376 -35352 -28970 -12295
11348 -12295 -33053 -45110 -31799 -10014 -15083 -23910 -4264 -22956 -48694 -35867 -32157 -24093
11336 -24093 -27560 -9828 4225 -1732 -2097 -939 -19695 18017 36487 31836 34845 56350 53134
11323 53134 52547 49066 19023 -9002 -32577 -24825 -3852 2278 -19135 -51817 -39583 -52014 -69605
11310 -69605 -90689 -85103 -62678 -30297 -53936 -58859 -25101 -18400 -35066 -29368 -15420 1648
11298 1648 640 5121 19743 -5613 -28455 -38188 -36087 -30373 -43295 -65337 -70733 -39481 -26593
11285 -26593 -23885 -10550 1861 -17630 -11529 -10790 -2972 -2116 -21199 -1510 -22872 -12897 -13362 -11708
11271 -11708 -19783 -19391 -29105 -41509 -35626 -4509 -5957 -26956 -20389 -8543 -4168 13617 23803
11258 23803 17866 14723 -3308 -21267 -45360 -53796 -44183 -29187 -26607 -31418 -35550 -34752 -11058
11245 -11058 -21596 -32877 -39400 -29795 -19651 -35841 -31912 -23366 -16930 -15767 -12999 298 8410
11232 8410 33548 61262 44571 19349 7750 -10066 -25612 -21074 -27981 -6246 22509 43040
11220 43040 67838 89233 79188 71706 84313 82553 68140 65025 75368 104306 117095 146441
11208 146441 146011 173864 211609 211189 190628 153764 120233 99838 107516 97426 74678 79941 92623
11195 92623 85433 69239 69765 81288 62541 43743 42107 34217 34586 56809 89492 90027 71276
11182 71276 43967 23067 1229 -18997 -37917 -40515 -27879 -3718 9834 -3509 -13498 7172
11170 7172 32229 38197 43755 41888 22324 -2592 -18038 -21599 -10866 -19439 -31721 -6848 10317
11157 10317 1672 1919 26639 30282 41648 13951 -27335 -42358 -58828 -58534 -39618 -46889 -46475
11144 -46475 -35846 -31588 -33490 -45283 -35318 -26087 -12523 -2833 -7316 -25109 -14622 -7931 14051
11131 14051 -3551 -18332 -21183 -18373 -31366 -5694 -6979 -33314 -33478 -28580 -30907 2795 -10815
11118 -10815 -15547 5833 -29451 -36929 -17559 -21783 -43635 -51746 -18333 -16751 -7388 -9389 -24798
11105 -24798 -4626 33231 35167 18111 12836 8681 -8312 -15668 -16100 -16606 -20371 -9710 -25709
11092 -25709 -33471 -19293 911 7742 32426 15300 -10513 -39414 -41349 4539 4881 -10174 -33520
11079 -33520 -13737 -26558 -26594 -9219 -5996 -6440 11869 -15776 5274 4459 -14606 -1566 9479
11066 9479 18588 39567 71303 85782 46943 3490 -32123 -4565 43977 38290 11654 3967
11054 3967 3756 -9138 -10977 -15841 1558 -20728 -23625 -26879 -18756 13025 21568 1675 -2435 -7531
11040 -7531 15440 2899 5132 3073 10557 31553 29943 5580 -2311 10983 16111 21189 27469
11027 27469 25780 5511 -6028 -20727 -10833 -42854 -47284 -36727 -38748 -24691 -34121 -70239 -73439
11014 -73439 -55906 -46050 -14126 14704 26382 -9734 -20113 7605 21026 18436 20203 5217
11002 5217 -4554 30356 31545 22899 10290 11964 17746 1474 -16830 -31050 -36468 -30113 -3290
10989 -3290 1981 -581 25238 21467 17361 12343 -2427 -26888 -38182 -32693 -21062 -6190 -4865
10976 -4865 -11426 11023 43339 39994 4641 20553 52538 61954 22246 9015 17849 21593 19644
10963 19644 -2414 -20743 -26247 -3897 10552 -20473 -33318 -21845 -11754 -22336 -2083 20561
10951 20561 813 -7625 -437 23121 31250 49316 85712 66773 45831 42706 28537 -22057
10939 -22057 -35170 -29527 -14618 11136 11776 -4889 -25970 -56359 -53721 -40182 -49041 -41509 -11103
10926 -11103 3870 11320 37549 25378 10820 -7028 -5998 -15777 -10567 -6845 -4098 -39728 -57974
10913 -57974 -43494 -34677 -32565 -39964 -18926 -26617 -46828 -26389 -33977 -56414 -56064 -49393 -25633
10900 -25633 -30228 -40653 -44301 -46723 -69822 -73362 -43198 -21235 -21666 -42818 -56799 -68926 -78544
10887 -78544 -63795 -57479 -68872 -55162 -54683 -30134 164 3594 -15143 -23908 -30411 -31182 -58443
10874 -58443 -69426 -59181 -22963 -14769 -3640 34242 47908 12974 -2865 17146 17868 8019
10862 8019 -29403 -54476 -37289 -35426 -59944 -33794 -7159 -28293 -40004 -56587 -54619 -32943
10850 -32943 -24241 -14601 -23620 -53201 -68441 -51230 -47830 -61958 -58370 -15039 4275 -6638 -15481
10837 -15481 -6235 -24294 -12613 -15251 -42090 -33550 -29562 -18910 -6809 -15919 -7956 -923 2894
10824 2894 12164 -648 3824 17321 -6738 -7717 -9599 3485 10037 5600 -8623 -23321 -17440
10811 -17440 -19211 -17976 -29697 -35236 -18817 -17467 -25356 -11168 -8313 -9213 -974 36950 40311 34872
10797 34872 26330 26985 8515 -13127 -14939 24728 30345 34757 32745 48997 60524 24578 -25187
10784 -25187 -11682 12715 711 -16489 -39373 -42632 -35831 -18535 5055 3005 -2799 23168
10772 23168 39121 2348 -46826 -66159 -72047 -44135 -18073 -5389 -40127 -47782 -33836 -22538
10760 -22538 -26840 -32224 -34929 -34656 -10594 -15885 -39914 -26766 -17167 -31670 -46718 -30785 294
10747 294 22120 24478 28084 40466 32881 19844 18571 30543 30731 53371 74915 72941 49671
10734 49671 50678 58365 45161 27422 18039 4961 3716 -5016 -15750 -5819 -5192 -22053 -40759
10721 -40759 -64908 -75761 -74331 -63460 -28642 -25655 -52419 -35756 -12580 -12134 -8037 -12345 -43942
10708 -43942 -41248 -28301 -14781 -25989 -40706 -45231 -57969 -16789 28705 46313 32147 19506
10696 19506 29905 18828 8850 -10061 -9910 6370 -741 9884 62191 86777 65630 37936
10684 37936 7028 -20353 15107 36918 8428 -116 -10628 -28474 -54264 -68556 -39021 -20158
10672 -20158 -32330 -42508 -74388 -79797 -81898 -77085 -56358 -42696 -36627 -26116 -33107 -21613 -23838
10659 -23838 -35972 -46930 -47544 -46367 -53168 -41709 -13086 16643 20550 12098 -1344 -14515 -44630
10646 -44630 -76938 -58367 -19597 -4008 -10618 6825 -1849 -14436 -6188 6980 -15402 -33077
10634 -33077 -39803 -47344 -24232 2359 -3188 -8173 -20604 -31400 -29240 -38626 -33936 -21161 -24225
10621 -24225 -43100 -60312 -31135 -7554 -8801 -8149 36997 27825 27215 13404 -10959 3602 -13599
10608 -13599 -13442 -24535 -41559 -15312 -15720 -29051 -51564 -48990 -20622 -26609 -50022 -71042 -46511
10595 -46511 -23034 -33945 -49133 -57261 -67731 -74592 -44116 -44763 -56886 -64025 -71115 -59069 -27543
10582 -27543 1418 -7084 -27315 -4767 -9151 -29005 -13530 10308 43636 26785 13173 -15722
10570 -15722 -24705 -30997 -37150 -28231 -5800 -281 -18357 -33539 -30180 -28879 -43121 -47603 -15066
10557 -15066 11297 34664 36650 19696 8594 16509 10719 -978 -8866 -6134 -5449 -14438 24795
10544 24795 41887 45263 20179 -23156 -27685 3099 36477 45290 28902 7977 10736 -138
10532 -138 -8288 -27259 -27379 -23419 -28156 5410 26248 9541 17079 5256 -3378 12540 -141
10519 -141 -18054 -39630 -42777 -40000 -38579 -44925 -49801 -31516 -731 6499 -2719 -20408 -35673
10506 -35673 -37985 -29467 -31479 -10795 17130 -7219 -11292 -19727 -17258 -31778 -46503 -16384 2056
10493 2056 -7652 -41315 -34685 -32157 -22023 -36905 -42218 -49898 -45628 -76501 -67613 -54450 -33021
10480 -33021 -54483 -86303 -87027 -33431 -14189 -24973 -51036 -37887 -1673 -3153 -21938 -31644
10468 -31644 1636 8833 9826 6273 14339 4259 -2303 12729 8862 -33196 -57239 -61488 -50369
10455 -50369 -58195 -43569 -35544 -27645 -16417 -15380 -3801 100 8187 19771 30456 21090 14577
10442 14577 -16489 -30535 256 -15556 -55051 -68883 -66293 -58105 -37446 -15827 -17032 2925
10430 2925 9792 1278 -34760 -37805 -12872 -923 -5043 -27673 -9021 -21547 -31584 -38123 -27652
10417 -27652 -6283 2542 -982 -24501 -24686 -20494 -22011 -24665 -6187 13691 35096 75220 84352
10404 84352 70244 74250 91688 82773 76958 108709 87125 53617 49885 116549 188409 233025
10392 233025 299504 368605 451327 566763 650435 729869 811858 855075 899367 906455 856243
10381 856243 827920 765435 662285 572818 471618 413093 334309 267852 209999 174834 145511
10370 145511 129940 124396 135345 112284 116601 92203 76927 65179 73534 90095 79517 38760
10358 38760 35026 54294 29588 48225 63137 18432 1254 12939 33521 49555 67521 55444
10346 55444 48197 42715 47473 47836 40046 44069 39953 29318 31948 27277 35592 32627 28301 23444
10332 23444 -2573 -25941 -22269 -11508 12747 23406 19715 10748 19592 12557 31164 15761 -15099
10319 -15099 -18646 23608 13025 -2601 10401 21648 32380 35090 38068 54105 51417 89258
10307 89258 114283 127859 148578 157220 163405 171532 147304 122294 108642 112693 97844 69433
10295 69433 39356 41050 43786 30266 28890 39596 53688 52262 71558 76784 43932 6358 -7651
10282 -7651 -41191 -52907 -9412 15678 7914 -33874 -64423 -67191 -42550 -16452 -26770 -23105
10270 -23105 1267 -20693 -13632 1275 1896 30955 31981 4564 -10802 -17544 -24882 -28447 1975
10257 1975 20143 18588 12941 10387 7930 -19677 -33073 -16071 3321 -10448 -4545 22121 14132
10244 14132 1982 1597 45156 62496 43163 33371 60786 93812 97469 78240 93255 152400
10232 152400 138992 135125 157711 214248 292532 425190 578579 734239 933938 1117723 1278890
10221 1278890 1407953 1510883 1574076 1533140 1377191 1223767 1077613 898372 721648 575649
10211 575649 472154 368287 282021 232130 221401 210297 227210 185709 151785 154036 142769
10200 142769 139775 127363 123964 138851 107818 104624 117576 107072 116467 123572 112603 122071 122442
10187 122442 134185 136821 123365 105211 87577 106502 97946 64919 38360 46920 71612 78052
10175 78052 94160 106933 91660 72524 54183 65393 80356 76376 66406 66347 85092 35081 -9859
10162 -9859 10116 34693 48262 62737 86217 93993 73939 72060 86861 91751 100656 98306 69196
10149 69196 88846 94085 89594 63911 76179 97511 97873 97073 82526 68770 68248 46961 15057
10136 15057 3926 7878 10855 5738 -7366 -10581 9351 37609 32415 18046 32564 26502 36267
10123 36267 18628 -12668 16047 1834 2990 3287 7410 31477 46905 33953 14544 33126
10111 33126 52701 62143 89754 71046 64214 51165 55670 42254 19451 49172 47815 53041 34953
10098 34953 2330 -15797 -29919 -48936 -12382 -4388 1971 -8206 -1699 18343 24435 4484
10086 4484 8830 -2467 -9671 -10105 401 -14718 11726 7049 -35814 -40701 -32316 -47411 -41387
10073 -41387 -22703 4787 -12297 -8442 -4013 -6421 -27378 -24769 -8684 -13609 -3415 -13073 -42828
10060 -42828 -20337 -12572 -24765 -11192 -6989 1205 879 -1684 -11221 -31390 -32808 -25276 -17101 -19634
10046 -19634 -7238 24016 45452 40483 20477 8730 58283 88951 91900 125123 219928 349268
10034 349268 465402 516124 489352 370155 240001 159734 124430 98707 68243 36634 16710
10023 16710 14244 3866 -28043 -14051 14616 23774 4560 -19711 -26664 -12990 -3481 -870 -24304
10010 -24304 -62190 -64568 -14301 5033 40893 57535 43776 37984 40849 41684 15445 -9676 -11758
9997 -11758 -13107 3507 -5798 987 7657 -9122 -21564 -34414 -43700 -47818 -49143 -55127 -36833
9984 -36833 -17622 -8988 24059 23602 20054 -9233 3304 4462 -26697 -44414 -45566 -39200 -13800
9971 -13800 -3002 20231 -5725 -15764 -8766 -5510 -27468 -32969 -7804 -61 15972 51582 60487
9958 60487 49753 84238 85152 78985 64376 33890 51874 85992 135796 160093 181397 208686
9946 208686 207061 178278 151039 132850 128000 106893 105320 110126 79056 52737 25701 38549
9934 38549 59723 49522 65527 43850 18760 -4022 737 16330 -6055 -23968 -21070 -23549
9922 -23549 -15202 -13761 807 21027 27899 54612 43492 20732 25831 3483 -28871 -27160 -12521
9909 -12521 -25321 -41142 -45980 -27343 -2575 -829 -42890 -47801 -36443 -31105 -17203 -20404 -8229
9896 -8229 -21174 -36121 -39233 -29390 -31451 -42341 -47246 -28939 -9334 -15585 -12293 -23959 -46492
9883 -46492 -54060 -48713 -18410 -11376 -29949 -34146 -30375 -33788 -17841 -22917 -43297 -28220 12373
9870 12373 4038 -6361 -1383 -27051 -32052 -16910 9678 12933 -3271 -16331 -19504 4864 14634
9857 14634 3290 -19346 -14314 -16081 -939 15332 39230 47080 38843 34990 71708 107571 107706
9844 107706 103427 117983 114608 117660 106540 63849 55679 36427 8973 -11237 -23881 -1560
9832 -1560 10412 -13384 -37833 -20127 -15546 -11665 -4042 -14052 12112 29825 22840 30275 59046
9819 59046 90474 80752 71064 73763 59817 37046 43206 45577 40542 17497 -14423 -18789 698
9806 698 2369 10235 2958 12712 30717 32083 -4628 -16702 -16603 -31647 -21425 -16394 -35238 -43181
9792 -43181 -58323 -72317 -55479 -33564 -14558 -26951 -37150 -17533 -2346 -184 10574 1301
9780 1301 -21261 -3500 -8964 -18910 -35442 -71872 -67183 -30655 -27454 -43923 -62125 -66298 -41880
9767 -41880 -25880 -24280 -22311 -20838 -44879 -35242 -19817 -13383 -39690 -33266 -28552 -58737 -66976
9754 -66976 -44470 -33337 -35246 -16568 -18074 -30313 -11407 -7196 -25431 -11813 -34507 -53739
9742 -53739 -33588 -50733 -54855 -54216 -46222 -40844 -6223 7125 4987 -22211 -40412 -46943 -39812
9729 -39812 -18910 -14836 809 10199 14186 25836 28215 10060 28 -19291 -17427 -31121 -34002
9716 -34002 -30374 -31513 -44328 -55746 -30405 22962 51985 42588 19011 20986 7961 -9115 4418
9703 4418 14881 8348 13170 17696 58937 85548 103745 123110 167187 198622 211166 171307 135513
9690 135513 117169 117305 109775 91546 85520 71141 5945 -39536 -53798 -50017 -39351 -31254 -47228
9677 -47228 -68924 -53266 -32180 -18264 1496 -21022 -39737 -18650 -17233 -9914 -768 -13439
9665 -13439 -32860 -3157 27902 17142 385 10801 20935 -500 936 13726 -15907 -34220
9653 -34220 -29592 -26621 -40790 -42375 -44986 -51554 -48755 -10826 2758 8820 -3398 1210 25095
9640 25095 26182 12078 -13168 6936 26729 22389 57284 71238 13087 -30067 -31970 19615
9628 19615 16582 -18242 -33712 -14935 -5574 -19465 -36019 -16981 -12148 -44575 -58390 -28672
9616 -28672 11745 19532 21703 30783 33958 52466 65556 56888 43258 58179 49895 54324 17055
9603 17055 -30398 -25595 -2678 4478 -11400 -14624 -23702 -14249 -15270 -18255 -15675 -25657 -35015 -7285
9589 -7285 978 11835 -5503 -10869 -13899 -7872 -4137 22175 34132 37681 22433 6635 -6907
9576 -6907 3902 19390 32455 39026 38765 50469 43907 27096 35643 64037 68142 65044 58334 43705
9562 43705 60336 43061 27030 8451 -3076 24001 29653 15804 11909 4672 -11935 11651
9550 11651 -7655 -38617 -30041 -15984 -2937 9233 10291 18713 22393 -1967 -31181 -26386 -28209
9537 -28209 -28844 -13778 -15348 14442 23404 -2225 -7428 21565 3450 9434 18019 35266 34341 -78
9523 -78 8299 35124 24955 18715 -5147 -5474 -1357 -19207 -26032 -4085 11321 19356 20399 27883
9509 27883 41873 11444 989 -1171 14938 9707 4658 21874 17735 20363 -1466 -21034 -9863
9496 -9863 3298 14062 17549 30375 30676 23323 26596 16336 14725 16957 -254 22145 29490 29018
9482 29018 13380 9432 39416 38016 24758 20696 5418 7783 19492 11454 3745 18065 17982 37642
9468 37642 56553 43926 48095 47180 61417 48448 -2587 -53422 -46715 -15213 -13563 2217 18914
9455 18914 43625 44341 37455 9963 20311 24921 23494 23230 24619 -5098 -1608 33387 52651 47115
9441 47115 9546 1544 10474 20751 19127 11484 12824 13965 -3679 -15494 4314 4483 -10279
9428 -10279 -21141 3441 18061 1610 -36730 -16712 -7841 4770 19542 22068 23259 12868
9416 12868 29141 20421 -20033 -6504 12456 20572 22179 29102 33308 24836 31549 28396 36857 14095
9402 14095 7529 24377 64052 69323 69125 23635 25790 45907 34985 27582 26248 7775 -18791
9389 -18791 -8040 -21609 -12766 -2729 16264 36823 52020 71225 77607 75320 64570 50869
9377 50869 53653 49043 68383 78264 86961 101227 92297 61795 55072 66327 74219 71330 54911
9364 54911 31352 29128 53983 79138 91850 63008 74010 50354 34099 37372 52629 19033
9352 19033 13944 50900 69564 49169 51108 53908 52103 25474 12200 6409 18210 44073 42390
9339 42390 15915 2401 12552 55687 43043 19719 34404 43904 43904 59992 42163 32743 25362
9326 25362 18215 35908 37609 32270 35424 42085 -1548 4148 12313 21453 11240 1972 34658 48831
9312 48831 56688 53596 13253 -8497 2152 15593 17639 36253 42709 49853 73316 69898 85896
9299 85896 70639 40531 31035 28844 37150 40631 34992 51720 46372 30186 57775 86707 72641
9286 72641 43865 38536 67650 96941 104928 134878 163472 165324 177805 185155 158496 165479 156108
9273 156108 127477 119790 124678 121745 147447 148433 130446 124358 146684 159523 155461 174947 187428
9260 187428 187460 163551 193326 187761 162041 157204 156649 149598 146667 158645 161487 161741 147417 139662
9246 139662 146166 183666 229000 243109 228519 249799 262193 244972 190807 148882 148738 128611
9234 128611 115213 110035 136154 151515 148194 169297 196346 211735 229867 207289 178568 175743
9222 175743 183064 184335 226870 238386 237030 248132 238953 247328 261320 267074 304573 294176 255573
9209 255573 281850 284086 295262 325198 339490 340805 337227 307681 288940 290834 278411 263951
9197 263951 285277 262612 257251 288697 261034 242337 241949 250561 276208 283251 264175 241833 248533
9184 248533 222497 228194 277893 294835 300214 345209 350870 303912 285062 299598 305167 297029 306270
9171 306270 297366 322038 342527 342064 366813 390664 394256 409047 416027 425356 455234 445298 429227
9158 429227 435573 484498 520636 563188 597892 593659 582907 618887 654774 656618 634119 576814
9146 576814 563237 531801 490758 510858 570848 566405 571753 526512 477680 440658 417448 405276
9134 405276 386720 379156 352625 337390 313265 340002 354062 359812 360997 383011 353482 358415
9122 358415 369419 380782 397700 392008 395539 411812 426435 430029 443662 446442 430749 417349
9110 417349 427068 451205 451364 428113 398628 402410 409219 412143 440155 464986 434653 421693 409043
9097 409043 386968 413433 453382 448931 466506 497185 486054 454517 454547 463327 445768 440046 450348
9084 450348 444254 466024 498283 506474 524571 514305 504417 536843 588254 601599 590147 596087
9072 596087 596199 617507 628604 653502 647539 633053 641736 646747 651656 660672 663546 690712 686066
9059 686066 695563 716180 755065 773061 770947 793051 810187 834097 858798 895845 950380 995516
9047 995516 1032980 1087620 1098519 1120508 1144609 1189927 1216056 1257410 1290313 1335449 1432789 1516970
9035 1516970 1588327 1690001 1799883 1937580 2071427 2206913 2360154 2484903 2605137 2711276
9025 2711276 2809272 2864094 2868743 2879991 2860464 2847003 2811114 2761042 2710818 2671876 2639380 2641537
9013 2641537 2648905 2622400 2604562 2591525 2586020 2624845 2660213 2675901 2685778 2706627 2744413 2755882
9001 2755882 2758033 2802756 2849685 2908112 2937252 2970325 3015216 3049397 3089925 3119866 3143690 3173308
8989 3173308 3222077 3249693 3252426 3258635 3222848 3206807 3227926 3288284 3331636 3362034 3395110 3410035
8977 3410035 3421805 3447855 3480893 3527464 3580340 3629758 3695785 3755825 3829421 3901944 3975015
8966 3975015 4064918 4152979 4252656 4364405 4484417 4576865 4664149 4797929 4929376 5081347
8956 5081347 5245863 5408970 5579908 5744928 5954539 6194503 6465830 6761762 7045614 7310558
8946 7310558 7613278 7916121 8221267 8506854 8798255 9099405 9421033 9752129 10099637 10461486
8936 10461486 10900718 11392010 11933489 12534834 13211078 13966056 14760451 15640543 16604866
8927 16604866 17649410 18788529 19995676 21334947 22805134 24442043 26284594 28337648
8919 28337648 30696656 33343034 36343624 39785595 43739831 48323646 53632065 59815336
8911 59815336 66991270 75369862 85135134 96529195 109828165 125266183 142961072 162876260
8903 162876260 184737428 207941489 231385951 253413362 272051864 285320808 291588818
8896 291588818 290194137 281705521 267620485 250029710 230959327 212031819 194413839
8889 194413839 178671215 165072914 153404035 142914580 132910695 122629987 112192632
8882 112192632 102613673 94346200 87317024 81258345 75970170 71295009 67113791 63336786
8874 63336786 59928988 56799958 53955543 51367162 48969912 46773656 44736544 42877976
8866 42877976 41138763 39555115 38066626 36680107 35379848 34171985 33015403 31923806
8858 31923806 30880139 29924243 29011392 28158984 27365677 26613566 25890309 25167030 24481190
8849 24481190 23851837 23255047 22644488 22061129 21520778 21013089 20481575 19969369 19494808
8840 19494808 19035851 18593561 18132222 17667564 17275430 16919364 16497986 16126776 15751757
8831 15751757 15450678 15171264 14865984 14556681 14239815 13951601 13701788 13423023 13117137
8822 13117137 12820317 12551109 12317161 12066964 11815318 11559941 11334831 11135528 10922569
8813 10922569 10758328 10555759 10321597 10110585 9919805 9752164 9583078 9406298 9232532
8804 9232532 9074918 8899588 8708691 8533968 8400001 8287804 8151169 8048524 7928592 7778383
8794 7778383 7641263 7504827 7370935 7279925 7224004 7150895 7083706 7026987 7013975 7001035 6973439
8783 6973439 6959797 6971877 7005210 7045941 7100505 7169387 7217121 7273164 7338147 7390441 7437746
8772 7437746 7469761 7495111 7499957 7474108 7384885 7278820 7172842 7065340 7005950 6868435 6730954
8761 6730954 6586907 6443210 6284548 6122558 5990068 5871303 5729324 5602793 5493608 5381986
8751 5381986 5284144 5183141 5074144 4990758 4900218 4776762 4704670 4634068 4530404 4453815 4394522
8740 4394522 4343050 4292610 4245012 4154802 4111155 4092750 4071188 4041070 4007250 3956972 3950482 3940474
8728 3940474 3926849 3936907 3948889 3963736 4001887 4023919 4016843 4030481 4071448 4054895 4022842 4020014
8716 4020014 3993302 3972664 3946046 3857342 3733607 3646334 3598122 3531674 3452661 3369047 3291416
8705 3291416 3175648 3091650 3060389 3016650 2949717 2917670 2893493 2820589 2769077 2779799 2789578
8694 2789578 2778532 2749496 2710601 2666106 2633144 2626721 2627064 2575952 2554110 2525979 2517538 2513421
8682 2513421 2552433 2595847 2625083 2636169 2646358 2677336 2700636 2713100 2741692 2778614 2791504
8671 2791504 2804393 2808452 2802516 2780013 2757808 2684101 2587393 2476464 2379010 2329107 2290276 2221837
8659 2221837 2150930 2056039 1973209 1906916 1845912 1802768 1771163 1740063 1724276 1723134 1698503 1685588
8647 1685588 1701614 1677769 1676451 1690372 1691121 1716330 1708962 1706904 1713431 1726341 1696897 1682576 1700680
8634 1700680 1697257 1721920 1746293 1752407 1764500 1773223 1788139 1810643 1840870 1848743 1823625 1787509
8622 1787509 1723423 1675746 1648261 1624302 1606178 1584629 1570391 1524322 1489687 1476785 1464046
8611 1464046 1467668 1463712 1463960 1458261 1454787 1450557 1416005 1373705 1339956 1339538 1280787 1222758 1185674
8598 1185674 1156411 1106221 1108838 1138074 1127068 1121839 1097594 1070481 1056562 1053538 1030145 1000869
8586 1000869 982507 991339 1051332 1096288 1072601 1025412 1020073 1005998 988371 982593 920511 871521
8574 871521 841601 829026 820604 833677 803390 751239 733446 717272 734167 723905 718033 713516
8562 713516 709752 712550 692328 693682 703672 711291 731399 721815 685275 694392 668354 649320 617219
8549 617219 585947 602780 622274 598165 559774 567184 591489 566483 559828 559324 574868 583151 554374
8536 554374 534702 522240 524352 507505 507952 534767 546304 553829 555975 544164 545375 535386 514902
8523 514902 527737 536195 539013 526062 518199 491151 461451 468048 481337 484942 471880 463990 454087
8510 454087 440501 443955 456770 448366 426536 402727 407551 424360 440274 457692 467684 449693
8498 449693 434282 421622 433547 412635 401665 397088 379951 380243 376255 394512 415708 421999 436204
8485 436204 456301 456557 450626 462850 443624 440299 435168 441692 444805 412413 401849 439184 430622
8472 430622 405606 352456 344646 387488 419363 399990 359443 380698 399296 399839 396869 379708
8460 379708 354161 336438 343664 350302 365766 363700 339445 320798 316378 343686 362056 387387
8448 387387 360542 332009 320052 312217 325293 293258 278970 303095 296400 277880 264288 277784
8436 277784 292225 270253 244720 233840 235738 239773 225759 241126 246407 288685 307212 279366
8424 279366 239578 239025 206590 192888 172579 161387 166583 165473 185838 204624 194263 203551 215323
8411 215323 223437 218610 230266 244559 245280 246093 223516 218021 180193 166824 157065 193121 195325
8398 195325 192835 226747 248009 262602 313497 332396 345041 392935 412535 409137 386599 341835
8386 341835 285264 263871 265198 245926 240873 242594 210826 201413 192368 177180 164365 166100 200984
8373 200984 232555 244420 241421 253240 255174 280672 291397 294245 286516 254297 244812 239828 239878
8360 239878 227748 223555 215858 216874 194327 208853 246378 251259 232473 235319 256886 290653 312479
8347 312479 328871 351784 398828 438978 472821 477119 467141 442076 399733 333070 296314 275720
8335 275720 275837 268065 232892 234220 259545 255930 246618 227601 237203 249655 239294 237627 206896
8322 206896 208205 232638 254230 249097 269258 287670 269604 255032 235035 195403 197363 229731
8310 229731 239381 200456 182091 178795 209584 211986 185354 164907 185609 248370 277593 291299
8298 291299 323252 344423 342388 341224 314329 267051 257402 258454 252261 249915 263017 236424 233405
8285 233405 239909 250435 254657 259307 267358 251943 240077 212765 201825 191856 220261 223829 214377
8272 214377 217261 226692 194289 193723 188545 164854 180646 196717 191945 195082 196981 198453 180497
8259 180497 172772 160461 149970 160967 179303 197367 219764 215215 185678 189089 195645 190428 159800
8246 159800 149791 186572 215463 215549 221547 239175 238428 258834 273074 276512 277658 295260 286363
8233 286363 256718 265303 272405 246399 241765 236307 185070 152747 163949 194828 194775 192045 223436
8220 223436 235789 213500 202058 227065 195702 184881 204697 241089 250602 266906 260302 237201
8208 237201 238364 261433 294965 359173 410913 466708 535287 664643 812884 924305 1010808
8197 1010808 1044251 1020752 915694 826531 733919 652659 576955 521474 495435 453663 422465
8186 422465 413214 387185 360137 359088 360007 347241 352905 363195 352661 323035 310882 306062 324160
8173 324160 341767 353611 386068 403530 454199 492868 513454 519422 527003 554617 561618 565847
8161 565847 568351 567460 568259 574088 614501 633947 646057 665576 702949 740653 780627 776619 826318
8148 826318 890497 952342 989440 996081 946983 906325 870554 836662 805047 786086 784499 808417
8136 808417 795148 790804 792143 781128 768827 725739 707218 681872 646938 624780 606511 592223
8124 592223 588467 581919 592644 614369 652073 686421 735843 755950 767805 729942 657876 632869
8112 632869 629571 573723 520246 514397 516201 507572 525763 564686 608821 695713 744487 815130
8100 815130 869904 959052 1053488 1159198 1246206 1330322 1412446 1434504 1523056 1690742 1894188
8089 1894188 2203372 2539423 2853482 3121176 3286951 3292945 3143485 2907818 2592666 2238791
8079 2238791 1981457 1752416 1616754 1556629 1513811 1519754 1543359 1560266 1602280 1606838 1521544
8068 1521544 1435556 1302189 1205947 1116683 1040472 996303 969579 911200 902063 888804 876229
8057 876229 874996 861796 837474 860854 882331 900507 927674 989060 1114442 1298726 1497445
8046 1497445 1755477 2161444 2667127 3298982 4009148 4729626 5304915 5572829 5437846 4979535
8036 4979535 4370808 3750247 3161425 2686586 2393845 2202588 2046624 1915895 1817217 1766787
8026 1766787 1691996 1623434 1563583 1472429 1376821 1281944 1203055 1122481 1075209 1059329 1060363 1032767
8014 1032767 989320 944715 921004 917808 893182 879504 860756 847949 859351 896318 922357 957554
8002 957554 1045852 1200114 1371971 1555868 1739984 1941527 2131855 2282881 2385147 2379195
7992 2379195 2286704 2146629 1967610 1752032 1543377 1360626 1235268 1113485 1011009 964385
7982 964385 926676 892621 871155 829228 814460 770278 734159 694741 651623 624844 610272 579816
7970 579816 558609 540642 541263 547071 563488 567125 573570 576221 524902 482203 478662 462955 454202
7957 454202 465273 469436 445863 450414 433298 417598 407948 383452 371577 420196 444052 419025
7945 419025 405953 397478 372172 351533 365872 377777 413798 429016 444385 437465 425722 467355
7933 467355 511118 550984 607083 651496 684779 708023 695777 684089 659133 603834 537407 494460
7921 494460 440131 385509 360856 356511 331635 318130 317306 322045 332472 335798 325251 314597 317958
7908 317958 338292 341143 319282 345781 354678 358724 355755 382738 384784 407804 428658 448035 416622
7895 416622 414520 427343 404750 414123 434022 414870 425008 434014 413478 408957 430623 433702 454928
7882 454928 499140 499439 510874 522233 534677 559352 575189 585676 569373 540315 537670 508600
7870 508600 479646 489376 454015 424742 439403 435684 412489 389443 353469 338031 297748 275290
7858 275290 299409 317110 305948 288115 271365 273992 262997 265990 262758 233920 247379 258790
7846 258790 268793 256998 250108 247053 244021 243308 238546 238186 244859 246752 245647 218197 220356 248927
7832 248927 255324 269737 310248 343943 404061 453469 473280 484455 455002 444638 408091 374007
7820 374007 333294 265920 247697 226852 209210 169541 166937 161907 131291 134398 147614 134210
7808 134210 142853 163884 180811 188238 180754 157415 144599 123934 100207 87452 96260 111428
7796 111428 127425 123349 111955 104388 95455 110845 117912 114908 134016 160848 162306 141366 124603
7783 124603 118913 108811 93224 105474 110757 108880 127743 122377 128376 119532 137391 170161 155123
7770 155123 123367 116727 105899 80893 53265 49985 84960 92639 68556 47681 56397 82590
7758 82590 97569 77210 55307 54852 73219 64641 40027 44109 33830 52439 118319 124520 80285
7745 80285 91227 114772 124333 114945 86947 57833 65741 76940 78675 58234 49974 64037 82950
7732 82950 109296 127702 128515 108323 111568 134295 128646 116029 132992 163536 150481 124251 115205
7719 115205 111003 105515 98623 81394 75113 90916 89811 101240 108049 105819 69715 46019 76318
7706 76318 67442 68859 55994 56122 66701 57291 43441 34319 23831 29651 54365 62754 75337
7693 75337 101121 133344 134701 123206 86246 73879 59668 56705 68662 79985 46263 60080
7681 60080 83116 94675 95712 74144 67997 84801 121623 113189 88074 87610 71810 61731 75261
7668 75261 78055 67961 59850 66652 37061 31804 26955 8149 47883 45622 39499 50062 69726
7655 69726 81738 71969 38244 33120 56370 43861 76771 78799 70819 96497 114254 102710 104434
7642 104434 98940 102155 114106 105116 78497 78270 61344 52756 54407 48151 48950 55853 61760 62771
7628 62771 61503 74435 62717 37031 32442 41584 41344 22991 18570 20665 25091 50924 45577 20069
7614 20069 7724 21058 28814 41857 62795 37043 -14335 -4064 4324 31525 48411 36739
7602 36739 46644 55277 60402 72620 45793 26919 22156 22292 38857 62837 70200 67193 55225
7589 55225 44652 43316 61660 78534 57098 36948 39865 70806 91217 96514 71829 75111 54853
7576 54853 38217 17627 2018 6522 21453 20577 20792 30574 56272 88479 87271 67444 34926
7563 34926 26177 57014 74700 71362 48522 39729 32966 42090 36033 24469 17847 26872 41947
7550 41947 63671 64321 40708 36276 42414 21257 -2313 19660 20857 1151 -6972 -2329 11676
7537 11676 33185 58699 69400 54546 21999 4361 12547 3594 -17296 4520 16729 9110
7525 9110 27594 36018 67209 97308 76418 66957 60255 61000 49906 20115 4233 9140 11045
7512 11045 3276 2833 15028 16639 7155 263 10306 11967 3985 39740 66396 70608 58807 47621
7498 47621 31174 38868 26398 26490 10054 -1577 498 2788 5667 14832 -7928 5564 11873 44690
7484 44690 62653 62222 31437 26780 36283 34798 21826 22548 23639 32074 31921 11252 3395 4225 13471
7469 13471 -6082 -7177 -12573 5235 -1619 -8292 4925 -1535 15846 27789 22844 23072 42685
7456 42685 56888 64804 67033 68077 60595 53740 30945 24181 31335 24648 25533 44320 43793 34812
7442 34812 43716 15799 8458 -21297 -28408 -682 35136 30828 32801 14364 -10465 6183 28937
7429 28937 48648 64053 62108 45189 41704 44115 49153 35022 23655 37558 62034 54887 21985
7416 21985 8300 10888 23529 36093 23865 8029 10891 56662 78557 44740 6568 -5147
7404 -5147 -3204 2686 2637 23446 10297 12173 5181 19918 33104 52681 41989 41303 31190 1202
7390 1202 -31572 -20800 -13971 -8436 34256 42845 18659 1047 36 -15115 -15435 6746 8175
7377 8175 21419 1685 -18843 -35913 -36455 -50265 -43630 -17736 12839 32923 33781 43018 47547
7364 47547 72196 74567 13196 -4406 6476 -15016 -552 -1474 -11151 -462 -622 2321 10699
7351 10699 -11043 -3076 5987 10049 17917 12363 14392 23139 37117 22998 27131 26880 31540 60426
7337 60426 29120 -2442 -9230 -13458 -23376 -5112 -178 2168 -10732 388 1325 4510 -1712 -183
7323 -183 -12233 20826 49175 78253 82954 38967 26717 20530 16440 14483 9164 -1206 409
7310 409 -4907 -6684 -25591 -32607 5683 21813 26647 16711 -4036 -2534 5340 5078 27081 47563
7296 47563 25169 -3260 7221 19464 3145 -28697 -35169 -28146 12974 18686 7181 -14714
7284 -14714 -22008 -11882 -8744 -168 -16158 -36896 -10548 1031 4629 9964 4700 6037 24147
7271 24147 10140 15288 32669 39343 63845 51415 38195 24616 36132 32112 56752 73018
7259 73018 83657 86016 77110 55218 29104 26181 40274 28901 10388 -1566 -2621 19402 45318
7246 45318 43664 49888 60234 41640 24307 15271 14659 13939 6241 5667 31845 66511 68400 38932
7232 38932 5565 -3855 -10565 -19679 -18187 161 21024 23233 10707 15829 4461 -4318 -14780
7219 -14780 1927 -9274 -12074 -13837 707 -18836 -15840 -13118 16434 25663 14290 896 -10259
7206 -10259 3002 25848 27637 32281 22703 34197 35767 57210 74352 56031 17498 11115 31806
7193 31806 37900 35938 40560 33215 -1080 14462 32963 13849 -4087 -7649 -853 -13634 -4934
7180 -4934 5368 32361 77668 89670 72739 52997 30666 19709 8036 -6304 -9666 10930
7168 10930 25772 44216 48326 14521 874 24708 20340 14754 20376 42576 36008 18318 -3615
7155 -3615 -11387 27149 53692 48998 45621 25024 -12181 -29562 -35924 -42574 -21617 -10142 -3302
7142 -3302 18176 17814 10170 -16634 -5185 54128 53392 15568 -5113 24132 24570 6887 6272 46267
7128 46267 49187 28402 20774 36615 59008 98836 110629 71245 24549 16433 33568 21923
7116 21923 1316 5458 -6980 -23945 -32478 -27817 -9939 3098 4686 21588 56251 54210 27425
7103 27425 15828 14104 -12616 -16317 1554 32510 43706 14244 18785 31535 31416 42586 63291
7090 63291 32127 18963 16674 16502 22730 50318 74059 27593 1701 7140 -1568 1396 35174
7077 35174 12093 -12240 -8137 -552 4598 7288 -17176 -24248 671 20653 7193 -5129 -6631
7064 -6631 -5613 16239 6151 -25561 -26422 -25997 -16826 8610 40291 37917 15343 -21 30000
7051 30000 38661 44962 63950 42981 28858 26016 20144 23987 16620 382 2940 10436 25654
7038 25654 19157 15680 18088 28327 26374 21013 -3251 22689 28413 8376 10481 25636 -2034
7025 -2034 4391 18660 32458 18473 6693 -16765 -17030 -36308 -53129 -32820 -14759 -26009 -8988
7012 -8988 15470 13010 28793 36983 19176 -4964 -9669 12567 18371 35379 46344 29933 26971
6999 26971 41783 37931 39282 45103 45369 47184 15999 -11729 9374 4195 -20807 -26465 -16683 3131
6985 3131 -23885 -53526 -46590 -5965 21648 12088 14164 38741 46963 20622 -12246 -18332 547
6972 547 17404 26523 11577 24771 13482 -898 -10670 -11405 -9949 -15730 9928 19149 1815 4120
6958 4120 -2620 -21772 -26611 8689 27169 24704 21175 11896 18784 14363 665 5137 32006 41319
6944 41319 38060 9180 -14737 -12747 1530 -8180 11150 41259 42966 20010 15226 2104 19169
6931 19169 12050 -3500 -4311 7084 13695 8709 -108 14268 37523 43192 32901 15281 8007
6918 8007 -7710 11654 22105 21392 16887 12968 23025 32295 39194 37029 35961 16953 -27535 -28908
6904 -28908 -25986 -31111 3817 42607 44929 35838 16301 14954 -1326 -4066 18152 12729 11164
6891 11164 -8899 -42268 -44334 -35813 -28192 -18653 -11742 14014 5348 1830 -2465 -14699 -14377 -6904
6877 -6904 1306 -6386 -32415 -25244 1975 -510 -13804 -1110 -2798 14021 37946 34218 38067
6864 38067 44469 53137 51348 44043 43658 45895 47578 14765 105 29774 61727 70473 76343 60323
6850 60323 37831 5511 16875 28913 41331 24055 10020 10297 28921 33661 14677 13679 10004
6837 10004 20622 21684 16872 43583 41507 30728 12027 6324 -2122 -6281 -20859 -25578 -11664
6824 -11664 -3391 777 -12034 -14674 4755 25492 29928 7504 -6775 23888 35943 40674 47016
6811 47016 50298 35827 17365 -29443 -29103 -29074 -27123 -29123 -38656 -46771 -32374 -27979 -27264 -4444
6797 -4444 1445 6055 -3144 -4413 5808 -3671 -9848 -6003 -16218 -25668 2472 -994 3669 3989
6783 3989 4183 19644 4324 10074 21835 35929 37506 34739 45658 24100 -4943 -13225 -6387
6770 -6387 -8779 9943 11520 -7937 -11392 -5695 11725 -2715 32066 56078 50388 52004 50426
6757 50426 24566 25006 66881 57442 59976 60319 74195 52832 39330 18599 -1552 5629 -17815
6744 -17815 -58423 -50068 -45983 -39703 -26248 -15897 -23232 -3750 8080 27118 48090 43664 38294
6731 38294 16809 6278 21402 19172 35863 37514 18031 20583 21464 4174 -16678 -14325 -11880
6718 -11880 -16236 -6981 -8078 -26041 -47458 -29923 -13710 -28184 -31094 -13009 -16355 27281 43111
6705 43111 16689 -3641 11345 20078 19830 36402 46154 25315 15759 2052 -17087 -14005 -34851
6692 -34851 -44437 -29759 -20199 -1007 32598 50799 63580 57461 16725 -13474 -29185 -16923
6680 -16923 21985 21192 -10532 2016 12484 -1521 14650 8638 7046 9415 -10825 -15724 7031
6667 7031 10347 14514 1217 2711 -54 19790 23136 38002 38418 32717 21101 -5640 -19001 -1529
6653 -1529 -3655 -44122 -65701 -67441 -60698 -44322 -22877 -17490 3876 15898 5671 -8049 -6548
6640 -6548 -9030 -24175 -30357 -35572 -34827 -20666 -46513 -60550 -46366 -81115 -74918 -43594 -19074
6627 -19074 -32039 -10014 -3642 -37127 -44416 -37061 -8948 -17088 -42684 -31288 -25382 -5334 5834
6614 5834 987 -12477 -9627 -29462 -50527 -45011 -26878 -9487 -16929 -22876 -2515 6698 -9434
6601 -9434 4535 -9218 -29927 -23796 -23400 -27818 -23351 -2330 11906 10535 -9685 -381 -688 -22970
6587 -22970 -28224 -24460 1497 3612 49093 96022 121628 151186 121412 113557 122862 103287 64412
6574 64412 45238 45050 48385 23600 12731 12443 24307 39596 41522 52854 52790 55141 42580 33255
6560 33255 8203 -10784 -7383 -19397 -18678 -13591 18935 20971 -8055 -22655 -31422 -51968 -42877
6547 -42877 -11875 4638 10372 24724 -18872 -47174 -61539 -75607 -51087 -34573 -33413 -22884
6535 -22884 -14859 -18038 -16186 3840 -19315 -17083 -14770 -5955 17130 28150 23698 29419 26619 1235
6521 1235 -30744 -47704 -41666 -12680 10600 51690 46351 32183 -10651 -19965 -8694 -4171 1744
6508 1744 -3712 -8063 -5920 3307 -4121 -19864 7670 21696 34859 10562 -21837 -25948 -17601
6495 -17601 -35061 -24062 -20552 -36093 -61025 -50244 -2109 -18274 -13636 26101 47717 46542
6483 46542 25942 -390 3706 10397 9164 19805 29861 10809 -3412 21572 20932 -14688 -67374
6470 -67374 -60010 -47729 -24313 6293 13981 23854 27293 34471 32178 34209 64380 77008 72471
6457 72471 56523 53679 63897 64688 45736 19870 17662 9829 -4166 -27653 1440 7734 -6101
6444 -6101 15372 32419 34622 29046 22736 22520 9455 -2309 624 -536 5433 2851 -3511 12873
6430 12873 20413 -5596 -25735 -18653 -34073 -3945 21699 15378 -1390 -4670 -5409 -12023 2248
6417 2248 -5253 -10666 -2295 13425 -13270 -25777 -21224 -21591 -11100 25355 40799 34145 21252
6404 21252 -576 -4138 -27055 -30617 -10207 -32134 -30478 -5605 -4375 -16253 -29468 -45711 -13445
6391 -13445 -5149 29441 42827 27505 -21078 -12464 -16600 -28248 -1799 15242 5438 -4934 903
6378 903 7790 9226 -3358 593 -932 -9207 -9661 8431 12376 -8456 -18324 -28305 -37192 -34251 -33894
6363 -33894 -20075 -10636 -26330 -7659 6058 31667 28800 13911 9982 5311 -1483 -5224 4912
6350 4912 -5215 7651 4739 -2353 -23068 -39171 -42674 -9312 10156 4965 -6607 -14134 -7734
6337 -7734 -8440 -7694 -15045 -15586 17842 9863 18068 38398 32838 215 -6858 -17870 1049 23600
6323 23600 707 -20041 -37879 -24399 -27872 -13215 -33705 -48345 -50166 -28475 -1491 5226
6311 5226 -13820 -22857 -12517 -17778 -38480 -53316 -46191 -34770 -12873 -3450 -3351 -22997 -6752
6298 -6752 -15230 -35695 -25280 -4126 -29276 -28452 -6070 3241 25971 52016 59669 47550 40642
6285 40642 16113 -1596 15048 16688 7806 9443 15730 3893 4245 -4070 -37033 -24069 9063
6272 9063 -1343 1312 7803 -11228 -23130 7731 2916 -16829 -21494 -11681 -15616 -1828 -4208
6259 -4208 -5330 -19057 7179 18758 3178 -1931 -3555 -5404 11838 9570 10940 26436 26106 41556
6245 41556 54245 33012 7901 6971 3876 7281 14691 -596 18713 35226 46288 44605 41447
6232 41447 4963 -8284 10238 10637 6644 -3110 6548 9383 -3310 -13793 -40940 -35736 -21207
6219 -21207 -17671 -11993 -24078 -40577 -39183 -12731 -18950 -31505 -10280 -841 12857 16007 19829
6206 19829 1418 -8718 -13833 11060 12968 -10707 -22090 -26790 -9060 -8092 -24960 -28559 -20263
6193 -20263 -5292 4823 4227 748 16085 8302 24260 49419 64805 55237 30276 33884 38887
6180 38887 19432 28066 46386 62114 53323 47355 10816 1574 -8689 -35541 -39645 -18212 -12770
6167 -12770 -24222 -8056 -5553 -33732 -51452 -26825 -11594 3150 486 -20603 -37137 -19903
6155 -19903 -34032 -25945 -15295 23174 5842 -12361 -13131 9958 27435 23659 -26796 -29926 -1948
6142 -1948 2673 5882 12878 20617 11965 75 -1255 13783 22299 8285 -1257 14899 -12524 -27982
6128 -27982 -30183 -33779 -28514 -14974 -34548 -29437 -7084 -9152 -15941 -30933 4787 27785 16249
6115 16249 -15387 -40915 -16436 17222 36247 13527 2146 -4900 33104 6935 -29145 -9243
6103 -9243 -10843 -13313 7800 -3099 -17676 -16848 -6750 -15889 -28846 -51729 -33205 -24546 -36141
6090 -36141 -32460 -20452 -3316 24699 33569 27215 48568 40767 23841 16084 -8991 -27120 -15184
6077 -15184 -9399 -13163 -12024 -12602 -8727 -15958 -13093 -4393 -25002 -21006 -7233 140 9913 -27744
6063 -27744 -45438 -33791 -30808 -15406 8049 9855 -15 -30743 -29430 -5423 73 25051 -3648
6050 -3648 2340 29825 15883 -10287 -13541 -23160 4098 19574 20305 18095 25974 13629 8126 2933
6036 2933 19705 25989 6794 10669 -7664 -17769 -44711 -41256 -33114 -13817 9447 25445 1865
6023 1865 -1448 52893 78508 42316 -7776 -16131 4494 14231 20649 25639 45453 82649 131032
6010 131032 169647 177272 186440 220226 249292 270918 255027 198833 135262 84820 56639 49181
5998 49181 54025 44128 8542 23892 24601 38467 16800 -1975 8245 13304 19097 28012 2097
5985 2097 1326 25353 25874 35529 80868 92034 63976 23749 26277 434 4078 -9734 -23846
5972 -23846 -21239 -4076 694 -11240 -25245 -27282 -19447 20756 11457 547 -4493 -10362 24248
5959 24248 29499 5151 -17303 -6470 3448 17392 23096 -4660 -26497 -35183 -30731 -25227 2360
5946 2360 9053 -19842 -23786 -16013 -15851 -29521 -2884 11010 26167 46599 59487 41409 11148
5933 11148 4511 22374 -11401 -10226 -13124 4899 14467 -3795 -9498 -19636 -24525 -9455 -4506
5920 -4506 22315 43862 55965 18440 -28039 -31431 -16634 -10320 -23824 -23905 4688 575 -8744
5907 -8744 -4729 9784 -8359 -20294 -8781 -24036 -13732 -1244 3443 -16563 -39824 -52759
5895 -52759 -47328 -53685 -89241 -77370 -56410 -39845 -11578 -28586 -46175 -53547 -54125 -39934 -50847
5882 -50847 -30269 5048 23307 41060 51712 30784 -1546 -1915 21475 37999 46783 63049
5870 63049 51786 45774 29670 26239 54381 30397 28346 13511 -1262 -19454 -912 6651 -1525
5857 -1525 7984 11658 27809 7625 -22210 -12875 -7304 -13892 -2773 -8960 -24610 -4113 -14904
5844 -14904 -33453 -858 27352 34857 51448 52468 40240 10996 2820 -7528 10624 6587 15214
5831 15214 31940 20177 27353 61784 62953 46289 43193 59133 29362 11835 15514 40865 8430
5818 8430 6471 21711 27930 32819 38026 30696 22238 30932 8944 38997 26412 6560 -32237
5805 -32237 -44839 -34577 -40300 -42235 -33751 -13786 4896 11981 21276 37821 26756 29143 47627
5792 47627 40413 41075 42649 -6414 -11733 -9377 -13053 -1863 -14111 -20999 3145 -9022 -15554 7243
5778 7243 13355 -5501 -12025 -23508 -13755 -11337 -7298 -20803 -31024 -14665 -6807 1797 13725
5765 13725 -6730 -14711 -4970 5473 -1578 12178 8057 -930 -18806 -14470 -512 -10033 -16959
5752 -16959 -21323 -41755 -39680 -44598 -11053 12039 16202 40525 4867 -7357 11823 39959 12607
5739 12607 10955 10874 19843 -933 -12209 -14486 -21148 -5693 2202 921 9838 15054 12293 -13557
5725 -13557 -6294 23031 62688 70880 52365 37114 21954 7541 15941 47895 21260 -9730
5713 -9730 -16644 -14556 -31490 -21306 -8637 11392 8097 17305 -20908 -28084 -17179 -11587 -21383
5700 -21383 -40193 -38959 -36055 -42217 -30124 -23192 -19714 -16501 -14790 3436 18948 -23568 -34579
5687 -34579 3682 -3582 -9664 -1108 27147 17671 5847 -1372 4289 42389 44098 9986 10164 23360
5673 23360 26626 35356 35950 -3462 -20973 -6221 -20748 -4603 4645 21227 22607 22180 33325
5660 33325 12578 -10380 -30154 -39667 -36985 -21351 18721 17644 -5848 -13172 -2748 15932 10961
5647 10961 -1865 2014 -18528 -17769 -19918 -22201 2193 18680 8640 11225 8144 -22607 -10060
5634 -10060 25026 471 -9953 3136 4136 -9337 -39660 -51549 -40101 -30044 -41202 -42458
5622 -42458 -50224 -44058 1096 27869 1378 -28670 -48902 -27737 -11588 -10991 -18791 -26998 -14450
5609 -14450 -10418 16618 6965 -6656 10509 17405 26232 23634 9055 -10909 -37808 -55513 -60750
5596 -60750 -34843 -3160 -24963 -26689 5730 14843 26268 11913 -2577 -20049 -16826 836
5584 836 -1763 -7686 2633 11284 22299 21266 3510 11799 6367 -4411 1983 6403 2244 -19466
5570 -19466 -45896 -18465 -5074 -15612 -15632 -3980 -9860 -19493 -11212 -10131 -20827 -17844 -9161 -10748
5556 -10748 -8479 -35118 -37568 -41704 -40305 -1068 45683 40510 13139 18292 12477 -9060 -2120
5543 -2120 -9500 -8569 -15534 -15825 14339 8054 -13082 -21749 -23329 -33704 -18920 -17429 -36583 -18346
5529 -18346 -2371 17238 5579 912 -3602 -414 2311 -8311 13449 -2928 8384 8707 -22399
5516 -22399 -44153 -36165 -28614 -20153 15296 25023 -8978 -15226 6595 39273 60084 30296 13187
5503 13187 2472 5231 161 1800 8923 32027 18775 8487 -23838 -15367 -5811 -29761 -47871
5490 -47871 -47047 -14661 -1317 -7354 -26176 -15403 -24110 -40365 -49369 -61592 -50930 -28325 10173
5477 10173 16039 -20045 -29467 2104 12939 -5818 24158 22653 19073 8411 -3916 -22630 -33455
5464 -33455 -39265 -46774 -11247 5975 25413 23889 32998 21636 -14730 -18858 -12034 8387 -10948
5451 -10948 -2367 7826 32165 6690 -6300 -1706 -24620 -46092 -49007 -30428 -3596 -4423 2402
5438 2402 15716 5885 -845 15923 -10503 -36058 -11706 -35216 -49150 -19651 11755 43280
5426 43280 50699 22052 28211 36127 744 509 24940 6080 -15262 -20844 -58195 -42945 -45557
5413 -45557 -45404 -20828 18685 9520 8686 1380 -30754 -55844 -85986 -86246 -78139 -75791 -53659 -31875
5399 -31875 -16522 14790 27591 32444 36639 21493 -14151 -36134 -51377 -73522 -67934 -42399
5387 -42399 -37904 -44331 -19608 3857 953 360 12351 28551 26422 3657 -18607 -24667 -37856
5374 -37856 -40035 -40914 -13036 14207 9832 33608 35655 -7932 -29283 -30682 -11774 19022 28361
5361 28361 31396 -2568 -11847 -11587 -19014 -21621 -19667 -29665 -3668 16666 18847 17140 9825 -279
5347 -279 -8874 -38024 -22821 -12563 -35463 -38191 -19567 24071 40004 32772 63019 43956 4289
5334 4289 -576 -22390 -21644 2575 1972 -10307 -25549 -35021 -66622 -53516 -44310 -42654 -28527 -5862
5320 -5862 7174 -4401 -20776 -20816 1488 -5760 -23420 -18696 -34527 -32806 -17477 -12458 -18167 -2126
5306 -2126 -18600 -30908 -44712 -32248 -15934 -14908 -11106 1092 -9555 -25923 -13630 -9975 11427
5293 11427 8470 -19282 -33965 -27561 -30108 -18440 -19379 -47499 -78691 -71490 -49702 -47940 -37458
5280 -37458 -22536 -21975 13313 58986 57262 40981 15849 -4978 -19411 -21073 -23103 -20168 -40159
5267 -40159 -33646 -29741 -43536 -51719 -64815 -50034 -43329 -22477 -13725 -21543 6248 26970 -13482
5254 -13482 -43446 -72411 -92168 -66941 -26304 -8500 29308 15308 -1166 -32341 -54406 -41991
5242 -41991 -21781 -18090 -27119 -49600 -72030 -58908 -24192 -22539 -21812 -42823 -34851 -17417 -19303
5229 -19303 -41983 -27905 -20622 -20975 -30791 -6337 -4653 -14727 3426 -8224 -24758 -38623 -36521
5216 -36521 -15145 -37292 -35913 -21469 -14622 -7412 -962 -6958 8260 2843 4014 1534 -7591 -50004
5202 -50004 -57388 -37187 -37133 -54188 -45938 -42490 -36249 -47187 -47948 -34601 -20757 -48740 -55982 -38899
5188 -38899 -41520 -46167 -35036 -29748 -40416 -59929 -37725 -34481 -23297 -10897 2642 6688 -18261
5175 -18261 -30166 -51779 -47883 -18587 -9686 740 -9645 -26639 -44614 -58080 -46635 -47488 -42814
5162 -42814 -35098 -31356 -30653 -14819 -24820 -33868 -13534 16782 32517 -9813 -17114 -4073 96
5149 96 15351 1935 -5953 -14241 -23703 -12819 14845 5998 -9005 16834 26128 14250 3005
5136 3005 -5446 -18205 -18202 -23434 -37355 -32170 -27454 -12088 -4761 57 -36762 -28424 -13273 -7395
5122 -7395 19300 10929 -35774 -41834 -18084 -6217 -27561 -32095 -25864 628 26438 40343 36784
5109 36784 17627 38620 40494 43048 44681 44464 42839 18215 2321 -12978 -7222 4093 16955
5096 16955 18084 19850 14609 14389 10353 15541 -17957 -60569 -30640 17367 42723 24766 28324
5083 28324 18280 -15972 -13000 -16684 151 13380 22661 3364 -15624 -36698 -37406 -28322 -14746
5070 -14746 15822 49026 51692 27919 5073 -14122 -17407 -38137 -55527 -57236 -45700 -17231
5058 -17231 -38211 -50208 -5941 -18322 -28717 -21910 -26200 -35358 -18202 -2377 -49864 -76445
5046 -76445 -58984 -33707 83 8056 15361 27782 7824 -1698 -15943 -48294 -15860 1057
5034 1057 -8991 -29766 -33682 -43199 -10043 9441 25955 22703 26482 34362 39160 13866 13000 -18563
5020 -18563 -40563 -44298 -16483 -9427 -3211 5525 -2904 -10011 8271 -7785 -45532 -36625 -28279
5007 -28279 -9227 3649 -18283 -15574 -18306 -48262 -25405 -12803 -9432 5640 -4670 -707 -9890
4994 -9890 -5685 18988 -9438 -25586 -11303 8544 23604 47989 28137 6605 18673 15718
4982 15718 -5385 -15592 -25351 -3367 14524 33389 28090 11895 2165 17926 31686 10845
4970 10845 2158 -16031 -7030 18717 38899 24382 2683 1062 -35449 -57237 -65466 -58917 -35788
4957 -35788 -5784 26987 89 -22396 -35659 -50316 -50264 -34324 -62912 -83800 -79630 -68712 -32211
4944 -32211 -20107 -22292 -19786 -18370 -18215 -14151 -6819 454 24459 42259 16696 -13927 -2529
4931 -2529 9929 24712 24447 21085 7436 -14881 -48802 -78072 -38782 3972 16705 17870 8513
4918 8513 4568 7047 10408 1288 -1900 -13836 -27276 -32817 -41019 -31513 -8351 29985 55293 31666
4904 31666 9597 -18955 -6327 39120 46338 22133 1449 6058 197 -12401 -13954 -9529 -11318
4891 -11318 -26 -23236 -36905 -54645 -75013 -65313 -40753 -60606 -58620 -17803 -3802 -14365
4879 -14365 3363 -23980 -47508 -6858 1089 -11954 -39828 -17790 -6283 -38216 -52346 -34533
4867 -34533 -23724 -32484 -13367 -17599 -30407 -21642 -22905 -11937 -11991 -12571 4427 11916 2727 1706
4853 1706 -35409 -14723 -11192 -14377 -2564 14730 20401 12934 -7200 -21674 -4548 2220 5550
4840 5550 -4368 -1968 -11383 -32014 -28048 -10178 -12056 -17920 -27080 -34737 -33157 -7445 18790 16881
4826 16881 -5552 16042 7777 -5934 -15928 -29627 -19493 -10264 -8741 2 17941 -344 5030
4813 5030 4533 22734 36955 25141 -3837 -10035 -4260 -14198 -18487 8985 -9235 13626 25295
4800 25295 -9555 -12024 18573 30804 37286 9419 -44564 -26886 11870 19695 21236 -2341 -18581
4787 -18581 -14225 -8266 -9 -67 528 10631 12420 3070 2761 15143 8243 4973 7897 -4006 -17327
4772 -17327 4721 17228 -4044 -35498 -37840 -21433 -44577 -71054 -80611 -81272 -51445 -16398 1585
4759 1585 12781 1291 -30332 -26990 -28193 -47363 -54269 -45874 -32600 -12410 3455 2371 14985
4746 14985 39972 33040 30575 46513 41336 23691 21359 5130 4773 -8311 -4777 -5950 -50608
4733 -50608 -71547 -60354 -66941 -76122 -26690 -11685 -39248 -54849 -56456 -25533 -11751 -10438 -22214
4720 -22214 -24099 -20940 -38118 -71562 -78312 -66939 -28693 -25103 -17716 -33419 -43564 -8352 -6771
4707 -6771 -28942 -15783 -44868 -38455 -34220 -47724 -45212 -39788 -62745 -38662 -8300 28788 28919
4694 28919 6275 -30706 -22375 4804 18195 6951 -3194 -3792 16746 30838 30538 21654 2395
4681 2395 6627 18335 -3670 -22952 -27556 -13205 -27581 -20020 4523 9262 16540 25845 17629
4668 17629 6935 8437 -4914 -27693 -22734 -6600 269 9560 11129 -18217 -5229 27815 38815
4655 38815 40895 18046 -10743 -1311 34054 2554 -28742 -23481 -34079 -34379 -17545 -30048 -42682
4642 -42682 -49707 -37220 -48075 -23006 3636 14885 143 -4984 -13360 -20269 -15914 -13463 -6985
4629 -6985 -5106 -14558 -5899 10988 -6666 524 22987 31947 8084 9627 29965 14495 16067
4616 16067 40299 13932 -12840 -46596 -46741 -30918 -6929 -252 -6106 -4976 -26888 -40382 -15333
4603 -15333 1195 4256 -18142 -50765 -50186 -35346 -57044 -57164 -2103 15816 -8026 -25189 -16749
4590 -16749 -16951 -12460 4986 14027 25571 38222 45624 38581 20797 -23859 -38352 -34685 -32480
4577 -32480 -19158 -24187 -25458 -20024 -7912 -20070 -22142 -5651 -406 -7213 -20200 -23276 -6928
4564 -6928 21466 47199 30078 4700 -4184 -7008 -5426 -6662 -2474 -26051 -40094 -9359 5989
4551 5989 7859 11199 1033 -26254 -37058 -17526 -20871 -9569 -15712 -33289 -27153 -11322 -3012
4538 -3012 -18989 -18186 -34884 -26294 -24978 -13 10329 18338 8387 18282 23435 24730 51127 59276
4524 59276 28397 16642 14524 7901 -22866 -21954 -11646 -22938 -25937 -33618 -15338 6087 -11443
4511 -11443 -19849 -12773 -18598 -8813 -22590 -11963 26449 12825 1721 2238 -4956 1785 -21079
4498 -21079 -18501 -8215 -6146 20944 57557 70668 69634 32524 8982 -3569 -34269 -47929
4486 -47929 -70537 -40929 -14574 -14319 -22802 -9822 -4941 2345 2607 -29787 -28668 -7686 4103
4473 4103 -14824 -22925 -52120 -43408 -11894 -11200 -25035 -45401 -50916 -5535 27509 4777 -7278
4460 -7278 -35683 -7752 -9928 -23776 159 -4330 -45751 -79591 -52834 -26760 -29053 -7582 390
4447 390 10247 21010 17372 11996 -5819 -1346 3174 16985 35582 12502 -3397 140 -13481
4434 -13481 -27192 -26960 -33084 -40952 -70813 -59061 -48198 -48646 7000 37182 46465 14298 -17239
4421 -17239 -42913 -39230 -39535 -44017 -12908 -8435 -6512 -720 3100 907 -17497 1101 9756 -23309
4407 -23309 -19013 -1275 -27418 -40498 -47477 -32151 -21639 -22038 -31446 -41761 -60854 -57159 -34134
4394 -34134 -12107 -9892 926 -10110 -15312 -228 -141 -22027 -30037 -13642 9908 13413 25535
4381 25535 6500 -13245 -27157 -19623 -18894 -17377 -13544 -43083 -33728 -23924 4600 39148 33879
4368 33879 41180 49579 30269 32312 40276 36343 34704 35399 40076 32768 35628 34411 17027 -16605
4354 -16605 -226 23171 11311 11521 33744 16379 -18830 -28345 -15183 -15064 1414 14842 17747
4341 17747 14028 4192 -20811 -48666 -32396 -6952 -6234 -16762 -24920 -27990 -55207 -45134 -3688
4328 -3688 737 -8689 3762 -5035 -27285 -19141 20893 7158 11628 -620 -16921 -31927 -25938
4315 -25938 -14850 4350 -4938 -8503 -3962 -32218 -20634 -15079 -18409 -5314 2138 28516 30495
4302 30495 48214 74615 74186 47953 -7942 -29844 -49875 -32034 -28116 -36972 -30701 -45526 -31461
4289 -31461 -26297 -16275 3613 5754 -19425 -25425 -4353 17744 8968 12388 28078 4387 -36978
4276 -36978 -51037 -40484 5798 31030 34237 -1896 -28751 -31673 -10279 15071 11232 12092 15809
4263 15809 -5849 7809 36206 62076 54577 26599 1588 -7564 -7151 -36706 -43069 -20176 -15909
4250 -15909 -16188 1021 -15457 -21529 -17748 -30412 -23323 -44103 -46100 -37778 -52935 -50004 -21758
4237 -21758 -10596 1241 6114 18269 9487 7166 5533 6301 -14186 -38237 -13283 4623 3789
4224 3789 13170 6811 -484 -10927 -19270 -21308 13166 7312 25154 13451 23489 20137 -11282
4211 -11282 -9564 4563 12447 6736 -889 -17321 -13211 -3290 -3278 34 18982 56273 20676 -18934
4197 -18934 -16159 -17334 -41787 -40167 -23847 -40644 -26993 -10581 -17658 -33645 -21782 -25685 -53666
4184 -53666 -43657 -24307 -24266 -11635 18595 3912 17409 24391 34589 841 -51558 -49157 -27664
4171 -27664 -8787 3783 -18163 -42971 -42842 -36226 -61542 -68756 -30737 -243 934 -28320 -20517
4158 -20517 18209 57382 50110 28316 46574 52042 48117 50456 50096 61119 28822 18935 16441
4145 16441 4712 -14850 -12136 3536 17828 -23250 -14411 780 -13656 -21297 -25248 -15459 -25168
4132 -25168 -38806 -37392 -32190 -30541 -24964 -12164 -4361 7974 6674 9281 6054 19004 32245
4119 32245 18783 18746 13312 6606 -10050 252 18479 34321 43372 24396 -8097 -30540 -7630
4106 -7630 -3043 -32801 -25459 21231 56801 54059 36474 14368 16680 16732 -4460 -13948 -15163 -4488
4092 -4488 -4895 -14287 -26016 -22391 -2810 3877 22699 44080 30938 15037 9931 6693 23708
4079 23708 29458 23933 13519 13991 -8595 6439 31564 24152 2073 -7592 387 -2185 8020
4066 8020 18549 14241 -3535 -38307 -19964 13748 -529 -11988 -25891 -47176 -47065 -25496 3524
4053 3524 -13845 -38309 -27986 -27549 -30121 -27969 -28786 -8046 12466 17639 17381 36730 26549 27993
4039 27993 31581 32796 9874 -9650 -17218 -1624 41451 34444 -1287 -35236 -35607 -31450 -16361
4026 -16361 6282 -5308 441 -6623 -17889 -688 5741 -19631 -36466 -46304 -54314 -68888 -58829
4013 -58829 -34597 -372 15152 22434 57721 78323 56467 16516 -11665 -22305 -50195 -50169 -33468
4000 -33468 -16917 -14200 -34726 -18374 12895 -9794 -18182 -32006 -38498 -51513 -63945 -26331
3988 -26331 20954 21429 -4630 -919 -13520 -24467 -36946 -41478 -10862 -13193 -21620 -20693 -11212 5475
3974 5475 10422 19579 27142 26493 -2439 4402 -7593 -30068 -30096 16213 2463 -11839 -16340 -35294
3960 -35294 -44227 -24244 -45468 -78082 -72034 -45310 -51398 -47646 -28779 -11554 -23315 -46907 -63836
3947 -63836 -52662 -41743 -27788 -9767 -15539 -28981 -9186 -15028 -18710 -11823 -35076 -58884 -38624
3934 -38624 -56694 -52182 -34285 -33032 -41847 -41256 -32682 -38831 -66905 -56271 -8426 -20661 -47148
3921 -47148 -51284 -23419 -23002 -30973 -46735 -42066 -17669 2909 -11143 6081 22526 -879 -23012
3908 -23012 -13257 -12212 -26285 -31933 -23476 -9529 -988 -45 3792 -16397 -29065 -21030 -5016 -28328
3894 -28328 -22342 -31943 -29487 -18073 3443 6550 8180 30216 34269 7796 -12288 -29541 -36192
3881 -36192 -44167 -47551 -49794 -48527 -20271 -11026 -41934 -26375 -9676 -8145 -22580 -19153 -41804
3868 -41804 -56647 -40824 -18695 9722 10343 2449 -8265 -5084 8149 23597 17064 20520 8440
3855 8440 2664 -12761 -24014 -24066 -28036 -35441 -30437 -42190 -22282 -13596 -32352 -64633 -34265 10730
3841 10730 14546 5751 7605 -28861 -31733 -5744 -34614 -31390 2773 3744 -27913 -11018 -11022 -34633
3827 -34633 -12950 -5757 -11205 -27823 -24358 -26080 -33285 -46556 -45236 -36301 -30086 -29619 10980 52692
3813 52692 21775 -16967 -31616 -29526 -28816 -16302 -13826 6800 21941 32953 42447 46626 24549
3800 24549 10681 9204 18330 -134 -75 -166 9935 -4946 -42125 -50830 -29233 -3279 19628 19022
3786 19022 4308 -2891 -13775 -7926 -7788 3074 -5650 221 -2409 -11838 1404 18378 42836
3773 42836 26582 -5953 4586 19436 24312 46502 46583 42832 14954 21984 24024 24781 25981 25613
3759 25613 46417 52146 40124 53073 63225 55398 54544 65320 53372 27062 7429 11297 13126
3746 13126 19462 -13261 -1339 14368 21436 22794 17364 21498 4996 -7725 -3950 -26599 -29497
3733 -29497 -23036 -13450 -22073 -27800 -9235 22001 43371 24053 -6480 18213 -5158 -819 -18373
3720 -18373 -52446 -42706 -36545 -54606 -52141 -48882 -38842 -39426 -31462 -43004 -77076 -67789 -53020
3707 -53020 -30563 -23402 -23708 -15202 -23676 442 1808 -4325 10710 29494 12656 22146 49423
3694 49423 43315 21441 7303 13558 33525 23915 29933 57973 60071 58376 58366 21801 -13201 -37065
3680 -37065 -34847 -14295 6157 25742 1811 4160 -13021 -47486 -26451 -9873 -38668 -43995
3668 -43995 -18788 -13402 -8053 -28281 -29365 -24957 -25366 -41138 -22133 -4961 2286 12793 -10382
3655 -10382 5803 5389 -7440 -17756 -32166 -28196 -23738 14732 20007 -9710 -31059 -21858 -10084
3642 -10084 -11695 13537 10243 4046 16195 24735 9598 7068 -6498 -27205 -39018 -18923 11711
3629 11711 4631 -34392 -61196 -42498 1190 22920 11749 -7152 -37754 -29842 -28365 -32762 -35913
3616 -35913 -27176 -15172 -29431 -27027 -19427 -26120 -23451 -38382 -45598 -22331 -9994 15735 38121
3603 38121 7553 -11012 -5532 -3565 -5933 7864 -3414 -6542 3570 722 28546 16052 -7630
3590 -7630 -26939 -20883 23177 53008 41939 14558 -36233 -45037 -55210 -64848 -49947 -39287 -20743
3577 -20743 -5758 -2693 -783 7692 2359 -20331 -30751 -20873 -17026 -10099 -1072 -46014 -90119
3564 -90119 -95943 -80466 -45808 -8143 11005 9029 17923 28938 6771 -13515 -34049 -54211
3552 -54211 -64209 -64813 -62190 -61399 -56572 -19069 159 2080 9649 18696 22229 35341 46921 31519
3538 31519 12446 11836 1936 5037 -11884 -35519 -55476 -43479 -6690 -10016 -16761 -4459 -20207
3525 -20207 -54402 -61121 -57255 -37878 -9155 -14694 -4952 14881 16173 42339 44001 9504 9450 -8370
3511 -8370 -15980 -28012 -5717 -19096 -19913 -13173 -38912 -46461 -45647 -52828 -36573 -57517 -62983 -10401
3497 -10401 -15003 -27573 -298 29642 14661 -10173 772 19898 27410 8407 -7970 -6184
3485 -6184 1864 -5670 -8817 4012 -9491 -15848 -25958 -15226 -1242 30638 53712 40789 11052
3472 11052 -25712 -13085 16887 42555 38071 13783 -1523 10559 -6149 -24910 -12597 -28031
3460 -28031 -47762 -72213 -19019 36837 25777 -28106 -18109 5528 -11972 7727 21070 17723
3448 17723 34410 28044 27689 30384 41472 29976 -4607 -5519 -3843 10728 30361 32511 -5707
3435 -5707 -14757 5805 16353 -15862 -34003 -29870 -66724 -47393 2334 22687 941 -25322
3423 -25322 -11076 -20633 -19055 -44431 -64365 -51455 -27997 3567 10616 12362 23643 -21022 -53093
3410 -53093 -49522 -18038 -32888 -30905 -1229 14374 -23889 -81607 -83860 -33503 -17361 -53846
3398 -53846 -52614 -23788 18729 21527 -7314 -8912 29082 27474 14760 9594 11018 30958 22901
3385 22901 25804 22692 17142 36753 20850 12488 8615 7585 -15048 -24514 -40074 -37801 -14430
3372 -14430 -14753 -7734 -13351 -30292 -45813 -49686 -62822 -41836 -2389 30011 17222 -22757 -40571
3359 -40571 -48167 -39340 -21516 -36849 -33423 -28206 -10793 -34366 -43662 -61083 -57632 -35134 -41972
3346 -41972 -26246 -29155 -9740 -21506 -47220 -47119 -680 -10986 -24455 -41784 -23318 442
3334 442 465 -26347 -28574 -13441 4216 -4222 -1744 25137 10882 -8188 1855 14219 4472 2140
3320 2140 23026 13806 8176 -9526 -23144 -43766 -9383 25123 11105 -9716 -21617 -42929
3308 -42929 -73484 -66222 -17743 11666 14223 -1474 -7194 -1861 -6543 -10802 -35476 -51173 -34963
3295 -34963 -21885 -17498 -24902 -16123 4127 -24756 -65766 -58715 -35871 -42499 -22390 -25078 -5031
3282 -5031 12981 -3644 -47886 -68498 -61239 -48765 -65770 -29872 -8737 13161 15430 -13133
3270 -13133 -22630 -11526 -2200 4899 8317 -5840 -18302 -17421 10082 -10492 -44578 -57391 -51002
3257 -51002 -37033 -13465 23428 65041 72246 77467 72778 50418 37978 66742 61794 56177 39504
3244 39504 47411 60790 46280 36971 17293 534 10621 3030 -2161 -22063 -13577 -15246 -669
3231 -669 -3245 -5259 -4831 18270 32669 21915 -31058 -44042 -26907 4906 19652 17506 16482
3218 16482 7253 -8929 -9542 -27255 -23360 -22670 -5793 4748 6793 8602 -8815 843 -15195 -1002
3204 -1002 8804 10313 11211 40128 40139 37862 5991 2793 735 -16364 -14149 -2922 9337 8573 9831
3189 9831 15516 5798 -13777 9291 -12980 -22862 -16345 -11859 -22105 -31314 -27592 -36035 -63576 -59644
3175 -59644 -78075 -72856 -53307 -42509 -37185 -25837 -8318 -6071 20562 39107 41061 49111 18064
3162 18064 -6365 -8389 10864 28796 55431 48554 21112 26318 32084 35896 -1301 -5481 -23862
3149 -23862 -26934 7622 112 5828 9627 13791 26727 28657 34453 21059 -9222 -15745 -31572
3136 -31572 -36880 -28101 -6390 10982 897 4710 1170 -7990 -6305 20370 9429 -11714 4504
3123 4504 15202 17917 14345 26158 9491 -21 7945 2974 -573 -932 -11032 8190 -12905 -54924
3109 -54924 -37623 -37172 -25125 -15507 -14832 14869 13253 4273 3546 7860 6555 3000 -1872 1155 -106
3094 -106 -11010 -21244 -32814 -45448 -28737 -18629 -1428 -11839 -13497 -14832 -47031 -65261 -43037
3081 -43037 -27044 -25179 -16035 -13291 4277 54533 67082 67581 24470 -10159 2205 4671 -15865
3068 -15865 -32589 24355 69828 55129 7028 -726 8914 -3196 -361 -19136 -10590 -10094 7226
3055 7226 32689 37621 66740 47548 10668 -18415 -35295 -42840 -32594 -19708 -11674 -20118 -10914
3042 -10914 7085 20779 26168 1047 -20708 -6150 16257 16873 19344 27978 15730 849 21202
3029 21202 9608 -7650 -29137 -50802 -65052 -50089 -29113 -9675 8913 -29263 -43997 -49896
3017 -49896 -60031 -33163 -36757 -37541 -20810 10305 1142 -11892 -17497 -43169 -61317 -27842 19071
3004 19071 17201 18863 49368 23575 15006 55892 84459 56853 -717 -26226 -14850 -28323
2992 -28323 -28788 -2146 7600 11360 -1642 -20594 6982 41968 40597 46169 39639 47748 44478 18451
2978 18451 21742 9715 2157 14234 27953 16260 18430 18723 4681 -2609 -24237 -3799 12515
2965 12515 32728 23369 -8017 -36709 -29915 -9477 383 -11346 -12548 2942 -13344 -38517 -32300
2952 -32300 -29508 -7884 -10773 -1263 1504 7511 -3558 -29154 -7112 2884 22412 34902 46225
2939 46225 32454 5474 20778 29206 14719 16279 -518 -4329 18925 -20842 -34940 -29438 -48017
2926 -48017 -37056 -15956 -18027 -15780 -24499 -14716 -2610 642 -22658 -21481 -8027 -17191 -39318
2913 -39318 -48382 -62206 -36300 -12912 -21283 -27445 16123 11221 7024 11169 27298 48146 50887
2900 50887 48099 27224 6792 16548 17019 1388 -13548 -30607 -39068 -36000 -11979 -4595 582
2887 582 -446 -30587 -43013 -41122 -11942 19260 -7909 -15020 5249 30938 28657 18604 9376
2874 9376 10340 1623 -11478 -4597 19835 16690 12338 14382 -8077 -35807 -31996 -27370 -22760 2131
2860 2131 31317 39908 26766 13239 -8408 -27426 -24035 28323 32955 11050 13951 18492 25351
2847 25351 65333 80257 49235 13983 -437 16166 -511 -247 26039 31763 5570 -4128 10512
2834 10512 35403 7823 -25246 -18451 -18610 -7057 4045 -762 20376 3784 -7146 788 5415
2821 5415 15907 -1742 -21160 -3405 22084 57563 63897 43996 52176 41257 27972 2396
2809 2396 -22709 -12198 2413 24450 32864 29569 20753 5037 18846 19415 33006 18503 20594
2796 20594 26881 37723 23706 -1945 -2183 15904 6959 -3796 -26133 -18794 -7606 13397 30068
2783 30068 26498 1290 -4718 -12055 -13992 -15121 -16431 -22320 -9233 17643 14378 21916 5554 -15993
2769 -15993 -31382 -36421 -23692 -25424 -44679 -31982 -16553 -34098 -59706 -56138 -30635 9749
2757 9749 -8724 -39029 -49050 -35843 -5952 18212 15803 -8156 -23390 -47845 -84484 -65504
2745 -65504 -38195 -27077 -38564 -42638 -34341 -40778 -27638 -32908 -51365 -53869 -50355 -27686 -13226
2732 -13226 -15260 23911 20944 -2285 -18456 -13391 -14905 6379 29137 27551 -3397 -25979 -37780
2719 -37780 -26486 -15077 10929 -10936 -40012 -48365 -6573 5478 2788 3567 -2196 3193 9127
2706 9127 13093 18114 27534 1880 35178 79510 58482 33260 6072 -20446 -24999 -29880 -44140
2693 -44140 -46290 -35557 -29162 -10116 -15419 -30605 -1642 239 -25615 -20438 -11710 -5499 -32674
2680 -32674 -45595 -3203 13887 2121 -7258 -37217 -37504 -19195 -26385 -23106 -13953 -3192 12603
2667 12603 -6847 -26443 -20657 -18107 -25716 -39806 -40122 -16089 5858 10508 -6329 884 21563
2654 21563 25927 13826 14819 42235 31524 4596 -8357 -22949 -43838 -57803 -27218 13916
2642 13916 10197 -2438 -7422 -24360 -52128 -25415 1405 10050 42705 37759 13533 17485 15684
2629 15684 37218 1781 -58478 -55324 -53704 -57976 -59290 -41158 -19955 -13048 -25533 -41296 -29337
2616 -29337 -1874 4644 -27213 -45281 -49569 -60130 -42733 -28250 -2137 878 -664 -9026 16732
2603 16732 888 -13136 -20139 3114 36948 36497 14032 4322 14083 42632 41801 12689 7806
2590 7806 12910 27906 -7170 -12046 1898 12813 20182 -3826 -10260 -5744 -24632 -52524 -79649
2577 -79649 -68723 -50136 -61079 -57723 -39436 -22034 -6235 16091 32017 23883 8828 15598
2565 15598 23195 4049 -3395 9434 28811 27295 12979 33475 34304 25168 -11173 1295 -10973
2552 -10973 -13275 -13005 -26161 -35260 -21795 -12384 8215 32692 18960 14528 -7748 5422 29092
2539 29092 30229 46524 35731 27395 20318 33050 30603 1909 28423 43189 43475 33717 8786
2526 8786 -10125 13190 8227 -27764 -24788 -30005 -9223 5378 -4409 -5178 5462 -3069 -14108
2513 -14108 -25163 -20690 8759 23681 16426 19928 36309 15193 -13510 -6532 -33262 -39743 -18442
2500 -18442 -15471 -24359 -43054 -17385 12747 25406 -440 -6163 -10035 -8385 10140 23090 19720
2487 19720 30531 73742 55413 12853 -9326 -5339 -1371 23837 8895 10175 15939 3592 11077
2474 11077 -119 10665 3911 651 -9085 -26216 -31722 -56374 -48324 -35511 -31579 -25263 -19072
2461 -19072 -30684 16028 38078 9763 21714 31125 38648 33549 27949 -4475 -12906 2542 29185
2448 29185 35741 25644 9625 -11336 18220 28359 40841 40167 36900 41236 39517 25426 14445
2435 14445 -4159 -9213 -15528 -9104 -10037 -31672 -15736 2391 14213 19663 43666 34074 22560
$$ [...]
##END NTUPLES=NMR SPECTRUM
##END=
