##TITLE=Analysis number 319102
Compound Code cc 46114
Book Reference 451/147
Project Code adrs
Chemist Name evam
##JCAMPDX= 6.0         $$ Bruker NMR JCAMP-DX V2.0
##DATA TYPE= NMR SPECTRUM
##DATA CLASS= NTUPLES
##ORIGIN= Bruker BioSpin GmbH
##OWNER= nmr
$$ XWIN-NMR		Version 3.5
$$ Tue May  2 08:38:56 2006 GMT Daylight Time (UT+1h)  MAYBRIDGE\nmr@NMR_250MHZ
##.OBSERVE FREQUENCY= 250.131544655141
##.OBSERVE NUCLEUS= ^1H
##.ACQUISITION MODE= SIMULTANEOUS (DQD)
##.ACQUISITION SCHEME= undefined
##.AVERAGES= 16
##.DIGITISER RES= 18
##SPECTROMETER/DATA SYSTEM= dpx250
##.PULSE SEQUENCE= zg30
##.SOLVENT NAME= CDCl3
##.SHIFT REFERENCE= (INTERNAL, CDCl3, 0, 16.522)
##AUDIT TRAIL= $$ (NUMBER, WHEN, WHO, WHERE, WHAT)
$$ ##TITLE= Audit trail, XWIN-NMR		Version 3.5
$$ ##JCAMPDX= 5.01
$$ ##ORIGIN= Bruker BioSpin GmbH
$$ ##OWNER= nmr
$$ C:\u/data/dgb/nmr/ADRS/3510/pdata/1/auditp.txt
$$ ##AUDIT TRAIL=  $$ (NUMBER, WHEN, WHO, WHERE, WHAT)
(   1,<2006-05-02 08:38:21.29 +100>,<MAYBRIDGE\nmr>,<NMR_250MHZ>,
      <created by zg, POWCHK disabled, PULCHK disabled
       configuration hash MD5:
       84 BC 41 DB A1 6E 1D 46 DA 25 12 A5 C1 ED C5 3A
       data hash MD5: 64K
       56 A1 4A 6D 5E 8F 91 F0 F3 06 99 AE 32 D8 07 65>)
(   2,<2006-05-02 08:38:35.29 +100>,<MAYBRIDGE\nmr>,<NMR_250MHZ>,
      <Start of raw data processing
       ef LB = 0.3 FT_mod = 6 PKNL = 1 SI = 32K 
       data hash MD5: 32K
       52 FE AD 2B DC 3C 0F C3 E4 7E 32 93 C7 5A E5 EE>)
(   3,<2006-05-02 08:38:39.85 +100>,<MAYBRIDGE\nmr>,<NMR_250MHZ>,
      <apk 
       data hash MD5: 32K
       F5 28 3E 27 EF 01 CD 06 AF D2 08 D4 FC 5F 71 16>)
(   4,<2006-05-02 08:38:41.29 +100>,<MAYBRIDGE\nmr>,<NMR_250MHZ>,
      <abs ABSG = 5 
       data hash MD5: 32K
       85 37 A5 78 DF 58 45 01 E6 CA 58 91 F7 8D 40 00>)
$$ ##END=
$$ 
$$ hash MD5
$$ D8 A1 EE F2 19 9D 83 67 13 32 0F 44 11 87 84 8B
##$RELAX= 
##$RELAX= 
##$RELAX= 
##$RELAX= 
##$RELAX= 
##$RELAX= 
##$RELAX= 
$$ Bruker specific parameters
$$ --------------------------
##$DU= <C:\u>
##$EXPNO= 3510
##$NAME= <ADRS>
##$PROCNO= 1
##$TYPE= <nmr>
##$USER= <dgb>
##$AMP= (0..31)
100 100 100 100 100 100 100 100 100 100 100 100 100 100 100 100 100 100 
100 100 100 100 100 100 100 100 100 100 100 100 100 100 
##$AQSEQ= 0
##$AQ_mod= 3
##$AUNM= <au_zg>
##$AUTOPOS= <2 >
##$BF1= 250.13
##$BF2= 250.13
##$BF3= 250.13
##$BF4= 250.13
##$BF5= 500.13
##$BF6= 500.13
##$BF7= 500.13
##$BF8= 500.13
##$BYTORDA= 1
##$CFDGTYP= 0
##$CFRGTYP= 5
##$CHEMSTR= <none>
##$CNST= (0..31)
1 1 145 1 1 1 1 1 1 1 1 1 1 1 1 1 1 1 1 1 1 1 1 1 1 1 1 1 1 1 1 1 
##$CPDPRG= <>
##$CPDPRG1= <>
##$CPDPRG2= <>
##$CPDPRG3= <>
##$CPDPRG4= <mlev>
##$CPDPRG5= <mlev>
##$CPDPRG6= <mlev>
##$CPDPRG7= <mlev>
##$CPDPRG8= <mlev>
##$CPDPRGB= <>
##$CPDPRGT= <>
##$D= (0..31)
0 1 0 0 0 0 0 0 0 0.06 0 0 0 0 0 0 0.0002 0 0 0 0 0 0 0 0 0 0 0 0 0 0 
0 
##$DATE= 1146555499
##$DBL= (0..7)
120 120 120 120 120 120 120 120 
##$DBP= (0..7)
150 150 150 150 150 150 150 150 
##$DBP07= 0
##$DBPNAM0= <>
##$DBPNAM1= <>
$$ [...]
##$SUBNAM7= <"">
##$SUBNAM8= <"">
##$SUBNAM9= <"">
##$SW= 20.6930455092707
##$SWIBOX= (0..15)
0 0 3 0 0 0 0 0 0 0 0 0 0 0 0 0 
##$SW_h= 5175.983436853
##$TD= 65536
##$TD0= 1
##$TE= 294.16
##$TE2= 300
##$TE3= 300
##$TEG= 300
##$TL= (0..7)
0 120 120 120 120 120 120 120 
##$TP= (0..7)
150 150 150 150 150 150 150 150 
##$TP07= 0
##$TPNAME0= <>
##$TPNAME1= <>
##$TPNAME2= <>
##$TPNAME3= <>
##$TPNAME4= <>
##$TPNAME5= <>
##$TPNAME6= <>
##$TPNAME7= <>
##$TPOAL= (0..7)
0.5 0.5 0.5 0.5 0.5 0.5 0.5 0.5 
##$TPOFFS= (0..7)
0 0 0 0 0 0 0 0 
##$TUNHIN= 0
##$TUNHOUT= 0
##$TUNXOUT= 0
##$USERA1= <user>
##$USERA2= <user>
##$USERA3= <user>
##$USERA4= <user>
##$USERA5= <user>
##$V9= 5
##$VALIST= <valist>
##$VCLIST= <CCCCCCCCCCCCCCC>
##$VD= 0
##$VDLIST= <DDDDDDDDDDDDDDD>
##$VPLIST= <PPPPPPPPPPPPPPP>
##$VTLIST= <TTTTTTTTTTTTTTT>
##$WBST= 1024
##$WBSW= 4
##$XGAIN= (0..3)
0 0 0 0 
##$XL= 0
##$YL= 0
##$YMAX_a= 246485
##$YMIN_a= -466388
##$ZGOPTNS= <>
##$ZL1= 120
##$ZL2= 120
##$ZL3= 120
##$ZL4= 120
##$ABSF1= 16.522
##$ABSF2= -4.171173
##$ABSG= 5
##$ABSL= 3
##$ALPHA= 0
##$AQORDER= 0
##$ASSFAC= 0
##$ASSFACI= 0
##$ASSFACX= 0
##$ASSWID= 0
##$AUNMP= <proc_1d>
##$AZFE= 0.1
##$AZFW= 0.1
##$BCFW= 0
##$BC_mod= 0
##$BYTORDP= 0
##$COROFFS= 0
##$CY= 12.5
##$DATMOD= 1
##$DC= 0
##$DFILT= <>
##$DTYPP= 0
##$F1P= 14.0000005364418
##$F2P= -0.99999901652339
##$FCOR= 0.5
##$FTSIZE= 32768
##$FT_mod= 6
##$GAMMA= 0
##$GB= 0
##$INTBC= 1
##$INTSCL= 1
##$ISEN= 128
##$LB= 0.3
##$LEV0= 0
##$LPBIN= 0
##$MAXI= 10000
##$MC2= 0
##$MEAN= 0
##$ME_mod= 0
##$MI= 0
##$NCOEF= 0
##$NC_proc= -6
##$NLEV= 6
##$NOISF1= 0
##$NOISF2= 0
##$NSP= 0
##$NTH_PI= 0
##$NZP= 0
##$OFFSET= 16.522
##$PC= 1
##$PHC0= 170.0626
##$PHC1= 6.01205
##$PH_mod= 1
##$PKNL= yes
##$PPARMOD= 0
##$PSCAL= 4
##$PSIGN= 0
##$REVERSE= no
##$SF= 250.13
##$SI= 32768
##$SIGF1= 0
##$SIGF2= 0
##$SINO= 400
##$SIOLD= 32768
##$SREGLST= <1H.CDCl3>
##$SSB= 0
##$STSI= 32768
##$STSR= 0
##$SW_p= 5175.98343685301
##$SYMM= 0
##$S_DEV= 0
##$TDeff= 65536
##$TDoff= 0
##$TI= <Analysis number 999999
Compound Code 99
Book Reference 9
Project Code 9>
##$TILT= no
##$TM1= 0
##$TM2= 0
##$TOPLEV= 0
##$USERP1= <user>
##$USERP2= <user>
##$USERP3= <user>
##$USERP4= <user>
##$USERP5= <user>
##$WDW= 1
##$XDIM= 32768
##$YMAX_p= 523380223
##$YMIN_p= -950124
$$ End of Bruker specific parameters
$$ ---------------------------------
##NTUPLES= NMR SPECTRUM
##VAR_NAME=  FREQUENCY,     SPECTRUM/REAL,   SPECTRUM/IMAG
##SYMBOL=    X,             R,               I
##VAR_TYPE=  INDEPENDENT,   DEPENDENT,       DEPENDENT
##VAR_FORM=  AFFN,          ASDF,            ASDF
##VAR_DIM=   32768,         32768,           32768
##UNITS=     HZ,            ARBITRARY UNITS, ARBITRARY UNITS
##FACTOR=    0.157963299565203, 1,           1
##FIRST=     4132.6476996994, 0,             0
##LAST=      -1043.33573715361, 0,           0
##MIN=       -1043.33573715361, -950124,     0
##MAX=       4132.6476996994, 523380223,     0
$$ Real data points
##PAGE= N=1
##DATA TABLE= (X++(R..R)), XYDATA
$$ [...]
25906 -269083 -126413 -163669 -244586 -171084 -33879 -14210 -82978 24114 349689 322826 134169
25895 134169 -56597 -156158 -18605 214856 308610 149570 32062 -188146 -50951 -2377
25885 -2377 265930 496864 180482 -68260 104990 203051 285696 316939 150279 170885 125828
25874 125828 108808 99421 292308 271396 315974 159805 112347 278526 585748 468541 246109
25863 246109 50217 -116871 51462 -100496 87140 250064 175820 275893 155388 -21825
25853 -21825 -56447 205824 426869 412578 108864 -160996 -10650 -149309 -252544 98787
25843 98787 217528 257773 107305 40118 285205 336266 335658 291150 79327 -268698 -318670
25832 -318670 -42859 118596 374120 484493 408152 494894 542108 387669 386699 172113 222049
25821 222049 509110 211747 177565 134889 383442 210538 -222108 -79517 14896 -53208
25811 -53208 -200954 -95650 -309610 -464679 -375329 -261910 -170813 -262104 -201768 63769
25801 63769 53547 -121919 -86696 80143 83989 -66930 -285150 -147141 -94386 -153750 -270555
25790 -270555 -285678 -44044 146828 101050 -270742 -371671 -268810 -112878 -155524 122488
25780 122488 133629 -41013 42985 205804 161697 -15629 -182765 -284784 -154172 -80776
25770 -80776 -152113 -296907 -227799 -49439 8673 -90946 4039 89592 -8796 135159 190700
25759 190700 74138 -13013 -117460 -177874 -33995 22273 -42472 -28838 23581 104749 93922
25748 93922 224930 440697 628981 527000 301782 159410 69834 -83578 -176402 -174700
25738 -174700 -300095 -299074 -3625 192967 189623 -25045 -134379 -243001 21331 213246
25728 213246 17407 -203703 -250010 576 314601 291933 67955 -179878 -303802 -302557
25718 -302557 -59966 -154663 -335505 -295926 -208282 -139623 60733 47943 -98146 92955
25708 92955 348744 229750 215136 264706 101529 192757 296920 363898 151174 130855 199880
25697 199880 275451 307476 317246 64138 -133754 -79518 -98274 69020 113555 178231 -4436
25686 -4436 -5140 -49118 68319 209032 52419 -46292 -37288 27092 -201890 -197897 85699 35193
25674 35193 -13075 109477 207172 133860 1287 -236245 -352755 -146259 -50615 -43025 -126496
25663 -126496 -53008 -165817 -136987 -115826 -94537 -23519 57823 145198 -83340 -218161 -413259
25652 -413259 -461703 -459367 -395360 -527255 -288977 11628 144311 153981 18902 40692 -50106
25641 -50106 -54748 -15827 -113253 -357921 -316311 -43921 -60617 -196663 -337330 -260665 156302
25630 156302 249401 491494 253182 78454 129675 328639 246898 162807 83512 -30285
25620 -30285 -168879 -470619 -361448 -61877 64972 74014 86478 69462 177136 384985
25610 384985 303881 188845 139302 184348 334369 533790 443518 346563 284532 5782 -118243
25599 -118243 -249590 -12405 -40516 11340 67308 34668 -19026 -187912 -159641 -207754 -400441
25588 -400441 -386983 -345182 -216459 -250817 -369092 -524372 -448647 -362927 -177937 -73161
25578 -73161 64331 217938 115898 1511 4348 143250 183649 37532 109671 136673 160055
25567 160055 284726 194692 28532 -87752 -110209 199245 529063 420457 412188 229607
25557 229607 204046 265291 222625 146295 100890 99532 -78799 -61000 68153 253556 285761
25546 285761 177166 143813 36325 277793 420306 326167 -8944 -379881 -411561 -281191
25536 -281191 -49562 186795 140485 -72617 82005 236886 265748 264664 224327 282638 322197
25525 322197 264703 65903 -195158 -262641 -269202 -387205 -234478 -81515 -9509 -128988
25515 -128988 30413 -148010 -188749 -4817 153850 132409 21851 90168 -54122 -199405
25505 -199405 -234856 -223226 -92535 17049 -2958 -23961 -209906 -369521 -153232 119511
25495 119511 276204 439367 642042 722745 448782 320487 332516 311234 128387 161629
25485 161629 232616 212251 210882 243881 182690 254304 173377 219278 298184 72739 -160381
25474 -160381 -228859 -231869 -155233 -18085 -50537 -106703 -49920 249574 458518 330105 106433
25463 106433 51508 -132797 -251072 -161719 -87687 118012 356011 423606 337850 192768
25453 192768 71460 134282 -53839 -280365 -299742 -188587 -116006 31445 231223 332856
25443 332856 273206 201103 -45006 -261561 -210822 29093 55229 78239 98689 103343 107393
25432 107393 11838 15299 -144934 -172019 -159531 -286312 -319414 -284056 78475 150284 247663
25421 247663 -17963 -186854 -83661 77265 178183 90104 115381 155353 273998 338931
25411 338931 188713 117944 4189 83832 86654 -18302 -55407 54069 124351 75307 -302174
25400 -302174 -353350 128434 399482 527194 451782 183622 119835 -184513 -303102 37840
25390 37840 110566 37924 -29120 42442 92234 26663 123516 319417 53318 -53598 88275
25379 88275 50998 24677 77165 209191 45981 -42142 -256627 -529637 -431252 -331497 -376571
25368 -376571 -325545 -94309 -7767 -1613 -140621 -204751 103478 295691 129188 -51
25358 -51 -109080 -179921 -119096 42729 264775 158475 71363 400750 469540 129530 114571
25347 114571 112824 -97091 -33344 139257 46521 192185 44256 89506 29245 180219 226682
25336 226682 89060 -19123 141953 318498 382347 303363 243909 183897 291372 201762
25326 201762 -27169 -31329 205730 483183 580383 473142 324629 258008 289519 60707
25316 60707 -61836 -172355 -246736 -191308 97415 482029 617145 685106 584504 407334
25306 407334 431929 317107 -26857 -439390 -334992 -69391 -79121 -127588 -103938 83163
25296 83163 90091 -36439 139242 210901 283535 236198 314693 250225 205724 328606 228364
25285 228364 118258 169076 212095 132644 232977 474111 657421 582027 16332 -323813
25275 -323813 -330953 -361505 38197 -76949 -177316 -235297 -275739 -375606 -284803 56911 224828
25264 224828 320377 101840 -193851 -332048 -80962 -128084 -178795 -287522 -213591 -57786
25254 -57786 24214 135798 -134287 -297203 -123635 -147676 -363213 -336517 -159733 41023
25244 41023 145834 -33422 -193643 -37188 139439 277546 42048 -185068 -118239 -256684
25234 -256684 -157252 45254 -38667 -141467 -190551 -133548 100269 -79154 -100498 -18732 -99418
25223 -99418 -78708 67284 108382 168095 121894 265443 397857 180035 217502 76397 155251
25212 155251 285518 -15963 -283964 -68531 77235 -102139 91704 -20077 -115655 -150002
25202 -150002 161690 280094 101129 20873 -30162 62783 170836 288743 344523 244740
25192 244740 -78924 -187296 -154040 -99168 -19624 57423 13290 -160301 -261509 -41627
25182 -41627 202005 114451 19849 221673 279591 223585 17209 -155269 15622 154508
25172 154508 -103350 8461 133896 99528 -93445 -138885 -238243 -357238 -196193 -90947
25162 -90947 -204803 -357557 -414318 -664523 -446080 -105006 -139590 -134244 -154168 -92963 51024
25151 51024 235427 260841 177706 114224 136685 -245385 -376035 38682 239267 297810 82766
25140 82766 41379 16211 67363 -78024 -259361 -264467 -268191 -332241 -316864 -8056 165750
25129 165750 12523 10341 342289 363077 377063 464269 374323 393661 186881 161122 -40965
25118 -40965 -146633 55339 77259 -103276 -199894 134832 240978 98298 -123621 -241177
25108 -241177 99767 49102 -68581 139479 96783 -120361 -159574 68130 2821 197278
25098 197278 525415 553883 489494 69954 -86392 -210743 -65051 27310 -183132 -264518
25088 -264518 -163112 -138225 -37503 158263 207296 428890 555730 498316 513952 319750
25078 319750 224260 93907 156746 381445 194683 59300 62585 15506 -86763 -56861 -32991
25067 -32991 34928 -3656 74471 -126254 -216556 -21974 339205 101195 -121463 -205913 -95925
25056 -95925 58671 -61 -5173 -53527 173758 60812 -283277 -167549 186962 187279 81445
25045 81445 206140 245069 178226 86398 -43077 -150318 15383 349336 327346 195779
25035 195779 -54515 -86595 24142 40739 -137607 -143971 -48900 -59971 -124998 155758 176165
25024 176165 226648 632577 646144 534014 292879 -14269 -145529 -69333 155319 230123
25014 230123 200635 86169 40279 180439 69454 -13569 794 -100935 8705 418917
25004 418917 591874 494304 338634 115584 -170963 -413305 -506887 -542673 -378059 -269421
24994 -269421 -119142 42932 167598 306399 306616 158859 -55460 -23083 -54304 -164955
24984 -164955 -151788 -27105 -10200 -77465 76453 405170 404163 394049 406923 101344 -152567
24973 -152567 -71367 175837 412236 179941 106231 76094 85041 222379 167226 -38705 -204581
24962 -204581 -148768 193664 90003 256917 508043 357639 214032 181754 67475 -156534
24952 -156534 -222033 -216177 -200578 2536 -124628 -28698 -155446 -234663 89721 348362 237175
24941 237175 -92541 -147464 -4017 -113262 -463814 -498082 -90479 103235 88317 28412
24931 28412 -385578 -563475 -555301 -565578 -281311 -7579 102303 42973 -62359 -68619 -215753
24920 -215753 -129084 60961 95250 86856 143490 -38577 -17605 186131 40675 65950 198055
24909 198055 68499 7708 -53705 -52517 80316 339161 336244 418159 422441 255287 163978
24898 163978 345497 487899 259516 12702 -73405 107901 -18693 -199402 -212440 -180696
24888 -180696 80054 104926 57911 -64421 58480 218760 233785 178535 125887 143772 200479
24877 200479 175544 284745 270257 216673 72918 -13773 -118139 -95476 -15326 150931 56423
24866 56423 -206685 -335531 -245269 -164404 -82771 71359 -118163 -340191 -412556 -66158
24856 -66158 144565 210183 196199 169339 136064 146416 177204 239775 212578 -3901 63431
24845 63431 175296 121688 103608 168954 128134 -106502 94174 363483 197996 -215829
24835 -215829 -363644 -347752 -101861 -94854 68016 52903 2339 -51139 106077 74854 85497
24824 85497 1964 -164038 -397116 -56968 140209 725 -1068 4011 72277 102312 98457
24813 98457 -151724 -115117 5313 6399 54535 -63069 -167595 -43264 -114544 -168815 -194727
24802 -194727 -272168 -94652 -17015 -91799 -12717 38138 261416 231035 243886 337808 255643
24791 255643 39517 -216240 -214431 -185865 31145 -61947 -295108 -133808 -115251 -201936 -379106
24780 -379106 -92626 143548 174540 377239 243018 40972 -55774 44567 82881 237131
24770 237131 528488 759032 644298 389796 311575 293816 340901 177358 -25854 -55777
24760 -55777 85458 112397 -90647 -125136 -95343 -135441 -130374 -122039 -167795 -48633 -37949
24749 -37949 173071 101168 -243418 -265131 -118877 -217835 -181562 -172270 -104704 -122555 -54406
24738 -54406 341596 454461 187583 -130155 -106751 -5749 -59545 53525 284299 71439
24728 71439 102505 191488 -119342 28394 257766 61872 -81604 -14987 377611 342227
24718 342227 270341 267414 362832 350571 21180 -533101 -723539 -788481 -733860 -453492 -432450
24707 -432450 -450157 -135526 56126 22342 -18208 -260827 -379197 -222351 93458 111438
24697 111438 -95514 -106701 -180812 -12532 116426 272217 160956 -8788 -170836 -225682
24687 -225682 -227367 -93346 75809 -50824 -30287 -139710 -259009 -280386 -174671 -218749
24677 -218749 -94849 -91358 107154 85201 188918 298626 152136 31699 -35274 17592
24667 17592 26703 -59653 -113936 50828 -139450 2451 236135 269636 210403 372263 363739
24656 363739 145941 -96111 78379 363450 465588 486361 586416 422290 427049 515800
24646 515800 548115 459955 188249 225048 346182 344915 157986 16796 74006 24489 140599
24635 140599 96154 64606 42717 185076 269691 212546 291636 149447 -44168 271973 50840
24624 50840 -206139 -207291 -183054 -97040 79488 57535 96993 86918 -7227 -170273 -230279
24613 -230279 -8355 156559 43296 33092 29658 -21253 58656 200652 61961 -94024
24603 -94024 11172 334377 364765 181064 178659 -16441 -114772 -191523 -271260 -292811 -254496
24592 -254496 -73984 -147623 -235544 -304279 -242118 -199857 -162262 -43019 -25546 -89366 -182665
24581 -182665 -178299 3542 135375 3916 -300162 -384116 -278872 -191319 -99497 12063
24571 12063 179638 262398 489018 528389 199787 77290 212184 521523 602851 252764
24561 252764 107908 78229 80160 -130546 -411888 -429737 -324236 -363744 -490759 -516817 -489444
24550 -489444 -581502 -597998 -295271 -172109 -63913 -49355 -210104 -38434 520792 487719
24540 487719 178189 117252 -66934 -407331 -456512 -240691 -191663 -292035 -371139 -130848
24530 -130848 -125927 -16374 -59572 -313963 -514339 -425546 -221767 -86520 173211 283016
24520 283016 301991 66724 -133766 -96459 -59476 113813 188657 90638 287130 364236 39168
24509 39168 -222137 -185767 -61929 160444 207958 -1347 86059 64089 93011 192219 175019
24498 175019 -42097 -88816 -27198 -12045 -62729 -181486 -179865 -26202 -20455 -72283 -53598
24487 -53598 -114278 114636 240634 -109770 -146685 22890 38099 17000 160935 -167992
24477 -167992 -393645 -182897 46212 -80313 -137203 41386 52982 89361 190565 262597
24467 262597 368633 132709 -143236 -276177 -140655 198174 149507 -137609 -186812 -271288
24457 -271288 -268476 -462955 -527354 -506486 -274200 -146496 -86703 261853 334396 115020 -310084
24446 -310084 -344915 -31823 8843 4024 -35854 -164623 -56633 -89118 -258732 -242383 -172328
24435 -172328 -282054 -234269 -96666 9609 26510 97802 134920 184296 54815 74907 77097
24424 77097 -110032 -186353 -199034 -147197 -176282 248349 378868 288685 218249 175399 124605
24413 124605 116801 -12005 208634 181392 81071 -36565 -56285 -219758 -354120 -353381 -302624
24402 -302624 -279983 -315140 -510132 -503000 -327116 82156 146311 190696 163587 -12762 -238939
24391 -238939 -239306 -342778 -421349 -349946 -67336 22586 -102417 -232614 -288218 -238898 -97286
24380 -97286 39567 18575 71857 164096 77253 249801 249303 3934 52876 2409 -208260
24369 -208260 -31243 188376 252798 238462 211060 92554 243173 329113 218705 150515
24359 150515 -177687 -263316 43437 -868 -39809 250495 312137 219794 304820 228843 22154
24348 22154 -60933 -168225 -87455 -101891 56272 108744 215406 -9846 -282992 -229171 -103011
24337 -103011 35682 150020 8681 -1592 -212769 -259581 -122822 -105283 -21444 -67704
24327 -67704 -89126 -162718 35445 191577 404081 309033 101530 139723 63064 -109100 -75756
24316 -75756 95688 205184 161108 -144967 -266190 -17992 400260 341559 218025 245625
24306 245625 318685 176367 -85593 -97828 -23885 -370135 -678613 -719080 -496330 -178937
24296 -178937 -6229 115270 292093 115123 -57455 -367793 -414653 -154148 10982 -81518
24286 -81518 -182719 -81568 112389 176971 -40761 170530 196580 116605 252944 290375
24276 290375 242073 9195 -98460 -37213 67754 29021 49093 255523 205524 297620 391592
24265 391592 370635 389655 291430 122883 -44878 -177897 -32597 -55191 34957 273299
24255 273299 284404 169103 166971 238472 219040 107845 93064 14740 -72906 -155358 -427358
24244 -427358 -317046 -208428 -111739 -19088 159914 260169 485764 252428 96832 121071
24234 121071 -23281 14047 -48473 267876 103449 -82278 156612 178218 -57878 -191115
24224 -191115 75661 435331 496131 575291 351013 104385 -81871 -77655 164020 251313
24214 251313 255719 172059 128032 96717 24927 101904 303945 34367 -92788 130179 229672
24203 229672 441305 263734 289709 229817 183883 339136 310119 63047 -7623 207176
24193 207176 133409 110262 -29950 -13873 1877 -186327 -62764 25437 36484 77077 -182942
24182 -182942 -218392 172028 152029 126334 -65005 -173962 -266806 -176727 -13927 1632 -91311
24171 -91311 28569 75154 -68584 -215805 -454911 -424776 -371720 -237660 -593918 -565092
24161 -565092 -424370 -61938 302196 208339 110166 242505 190423 -13622 16016 -129840
24151 -129840 -238068 -253733 -276819 -189727 -258244 -113118 -184412 -208362 -148061 -19672 -47093
24140 -47093 190546 29659 -13883 24573 145264 246436 299574 240536 223886 417342 393055
24129 393055 118644 124504 84644 26791 -135466 -332889 -293684 -8585 -63024 37296 -25912
24118 -25912 -239668 -243845 127181 337683 245294 252569 410356 108427 -278541 -213947 -51504
24107 -51504 63479 -286709 -339009 -207393 -56530 -13461 -73639 1993 147659 -109304
24097 -109304 -394081 -230466 -239073 -197653 29372 293952 180297 161612 179889 -65223
24087 -65223 -158788 57937 89372 28638 -59444 155456 384411 547571 491880 211548 172571
24076 172571 102258 334573 400107 457931 533389 427854 -34836 -268010 -290791 -243115 -77595
24065 -77595 239114 -1260 -93783 -23958 -88161 -120675 158660 364307 166294 22678
24055 22678 -10649 196667 253234 -62808 -302465 -201336 -161747 124088 205314 187307 77032
24044 77032 -156366 -57066 312471 440786 445819 317709 259051 253999 149584 -27487 -7939
24033 -7939 -60369 -291504 -94500 229831 403334 303382 59083 276764 383946 359660
24023 359660 296542 50964 -54310 7595 64951 -130949 -51577 252716 376918 18254
24013 18254 -38245 82198 19483 36286 291848 353377 330227 410033 206757 -46845 -44944
24002 -44944 189323 148241 297308 327761 220546 198014 339759 267998 -6486 -23815 -237419
23991 -237419 -162248 342936 637583 523028 366651 344962 116798 -53835 98995 105794
23981 105794 142538 183057 93946 87957 116541 57295 92000 90981 25413 -210823 -312108
23970 -312108 -234748 -178795 -122187 -262324 -447750 -442845 -220624 -65577 -24428 5351 -140198
23959 -140198 -99998 64803 369225 236323 60255 -218310 -272810 -180969 -214273 132523
23949 132523 334713 284554 74578 52629 198853 192355 144774 214570 -27575 -340865 -340697
23938 -340697 -353228 -338784 -207069 -116637 -219189 -473892 -476864 -392979 -505347 -518714 -588699
23927 -588699 -410010 -476899 -309938 -52526 -82731 -218988 -441865 -410900 -277462 -176156
23917 -176156 292545 413620 175978 -36547 139591 447477 285400 37272 104567 220393
23907 220393 2262 86649 200583 60761 69819 244804 56406 130017 120069 -24842 -108036
23896 -108036 172082 310791 141447 207150 30508 -68817 -5916 99283 237850 161927
23886 161927 210299 -6493 -359804 -368730 -348839 -162986 51304 206459 134186 50632 -53578
23875 -53578 130797 260641 261738 177991 131150 87239 50626 67993 -58395 -140348 -58860
23864 -58860 -5084 111456 63288 26323 140953 223436 207398 114020 67840 -46191 -3006
23853 -3006 356393 400298 416538 155769 37932 68789 87065 107893 106901 91868 36136 117994
23841 117994 159736 46762 -132847 -31893 73003 -340170 -278000 -239658 -276004 -294758
23831 -294758 -213295 114498 93603 128885 222258 311454 98734 -66363 -101007 38952 73707
23820 73707 41683 -237479 -162281 -65153 -10986 111922 -83670 -107009 -10784 36308 46438
23809 46438 325368 390430 393694 142332 -97514 -113671 -126280 -242880 -153302 324 142338
23798 142338 321316 203150 23498 162714 166364 108256 -29991 -128668 -38344 6784 167729
23787 167729 140592 -104013 -317689 -195914 -101018 -76856 13298 90112 66607 226116 89996
23776 89996 -95494 -68448 -113287 -157701 -69609 -15832 18260 95056 186053 79719 -151591
23765 -151591 -260211 -141681 154249 -59395 -139562 -35030 43535 -76146 -108025 -261287
23755 -261287 -284280 -165886 -189582 -82525 -59490 -13631 -58712 -55582 241876 420058 355667
23744 355667 202307 154455 55357 90062 141901 334416 391119 273544 337394 322333 106284
23733 106284 7837 -9198 -156854 -129145 -403082 -527134 -377831 -307652 -130712 7158
23723 7158 157051 86762 226405 170254 79263 -88936 -95840 -46909 -56163 -136589 -89360 -170087
23711 -170087 983 -88138 -389 52241 291767 740223 782132 715074 546458 274847
23701 274847 172015 64716 44268 166440 -120957 -157287 -83992 -81186 -131435 -166742 -186737
23690 -186737 -232626 -144587 72130 30244 95680 -370513 -290259 38229 11546 94927 3550
23679 3550 -104509 -55995 -10111 194986 414675 495985 366997 54254 -189150 -263385 -373491
23668 -373491 -298340 -237462 -283691 -240800 2732 -228320 -340900 -353105 -166449 -4774
23658 -4774 -76259 -33779 -1731 -142860 -196443 -137226 -113925 -24225 108844 97763 -130393
23647 -130393 -208419 2808 -68582 -278530 -271945 -190771 -235800 -170330 -19739 -43810 -205816
23636 -205816 -151913 -6572 152512 97431 -40956 -245491 -120112 83837 218219 224234
23626 224234 120267 82434 10874 -73480 12877 14195 -139858 -19523 -34043 -180258 23655
23615 23655 162718 153671 77267 67540 -97012 -165274 -146162 -315258 -134622 -49290 -207055
23604 -207055 -218241 -96764 -63105 83781 88149 -43430 -85948 -69334 -146388 -272167 -160767
23593 -160767 -263480 -461242 -454104 -266225 -382868 -108787 -95532 -175176 -52997 101766
23583 101766 -109062 -332581 -97305 217427 172592 193339 296745 387596 254770 357338
23573 357338 286606 215760 53066 -131872 -284944 -221390 -81518 -135156 -18122 -19091 -39761
23562 -39761 32656 -52400 -30676 56693 188061 377004 439235 246194 -24848 -140367 -45895
23551 -45895 -13796 -44242 -251704 -219800 -172615 -83292 8603 -25649 -105871 -198614 -402076
23540 -402076 -318426 -138519 -57089 1806 137078 245315 387405 338530 211796 89845
23530 89845 -45923 25465 -113939 -50932 331597 157180 -160582 -222112 -257291 -319341 -328255
23519 -328255 -138454 -182747 -102533 87556 -38236 -184524 -200990 -99104 33034 192935
23509 192935 83381 40000 -24322 -69245 -91121 -97433 -212879 -224957 -356604 -371304 -154800
23498 -154800 -16713 46520 -756 -92319 -74967 -85815 123283 248269 237658 238714 76729
23487 76729 -131140 -35931 144206 575502 526392 269499 22977 -155192 -329796 -244233
23477 -244233 -242545 -115519 -36706 -93969 71503 16756 -24416 -31396 -79218 59390 320109
23466 320109 337638 243874 362237 253290 146319 256090 225025 155686 160160 186729 138992
23455 138992 134590 283985 290287 107713 -29649 126221 237745 53311 -234608 -380963
23445 -380963 -340959 -154706 41371 -155342 -278367 -116769 -261643 -488630 -353328 -235010
23435 -235010 -35524 71805 61110 -142349 -161808 -38243 -141365 -251385 -222162 -201616
23425 -201616 -181267 -262811 -362513 -237443 -116423 47202 101973 32256 -196292 -272713 -241091
23414 -241091 176603 451616 229049 95934 113756 95182 -27126 -55198 -68239 200455
23404 200455 508024 513594 383016 390373 106293 116049 349794 517146 433577 320072 61009
23393 61009 67911 -64849 -55214 14032 49595 -14552 149135 96055 -66549 -160787 -117770
23382 -117770 248852 364988 206859 118320 200315 196043 286955 320752 247653 363099 428220
23371 428220 364610 345744 111545 240301 199593 358141 281409 135311 7072 -149960
23361 -149960 -353027 -450289 -275368 15135 198163 245823 149138 85205 169843 144083 -40734
23350 -40734 88195 441618 297163 396725 296162 313484 155006 178419 58720 28313
23340 28313 -85307 32435 128020 99598 316089 187396 -173858 -107210 72445 207222
23330 207222 238291 159039 125412 194735 204639 278971 114402 60047 52824 -122567 -119833 -310577
23318 -310577 -263179 -94040 -142948 76465 -82954 -150705 50415 -8503 185505 344806
23308 344806 164907 -185013 -123744 52963 183406 448809 556106 446519 320786 316254
23298 316254 261279 144027 163004 115463 -3238 32872 213543 390570 473437 212713
23288 212713 89168 130005 -121530 -223624 -392556 -109633 1699 123849 174766 115483
23278 115483 59833 300227 282603 206472 115037 -131930 -389345 -177803 -82510 63632
23268 63632 168128 101865 -3999 80323 46151 -225867 -207689 -376863 -59858 268598
23258 268598 316569 184455 145182 -84763 -31833 264384 330516 308073 65215 -31456 26279
23247 26279 134453 -106780 -173230 -84660 -417119 -444953 -294752 -261532 -294633 -257346 -181455
23236 -181455 -397790 -569975 -553687 -368596 -81413 -315203 -352775 -35110 57660 -7258
23226 -7258 -286931 -343912 -367626 -231289 -168815 -111517 -149289 -211106 -220050 152769 36130
23215 36130 -201954 -97026 -18837 -466124 -349263 -155609 -234858 -275970 -100932 -23519
23205 -23519 -166316 -103687 -17583 136216 182195 179660 44493 -210130 -161679 -87583 -145653
23194 -145653 -81468 -27506 250064 495159 418462 323060 185310 85586 -23741 10192 -167905
23183 -167905 -291862 -227462 -113057 42263 84015 78228 -89224 -85377 -74077 -9942 69669
23172 69669 95153 -149515 -595063 -537277 -383337 -282645 -378416 -412738 -229047 -186489 -188703
23161 -188703 52238 17214 -209712 -204395 23988 -21236 51333 9320 46558 126333 -14645
23150 -14645 -302401 -447207 -230383 -248574 -222607 -258204 -312465 -167351 -5538 -62586 122825
23139 122825 143798 351030 463055 409241 298428 83017 -47625 17098 -198006 -209155
23129 -209155 -222600 -35428 26696 28160 -348049 -260745 -242715 -284313 -269019 -44568 174250
23118 174250 33243 -211803 -213519 -62061 -98024 -214147 -318895 -264413 -236415 -93264
23108 -93264 -11120 21232 -351716 -558931 -627886 -536324 -428277 -134647 45597 8311 204710
23097 204710 134468 102591 117425 39429 -215590 -146534 39428 169569 245727 257354 80544
23086 80544 -283996 -487663 -173723 -166297 -313092 -235113 -99328 61691 85951 -148156
23076 -148156 -407489 -321688 66435 73828 -341591 -363728 -475766 -217803 -34045 -109727
23066 -109727 -433898 -537145 -501866 -342497 -322329 -21131 256350 257913 -251790 -324895
23056 -324895 -309570 -176149 -19753 135168 -21032 -43689 -212522 -150938 48040 -36436
23046 -36436 82110 140464 -82932 -240031 -506488 -338738 -248372 -122688 -22114 -186119
23036 -186119 -310071 -43114 248208 391161 448782 376469 308665 270636 177815 -67965
23026 -67965 -215707 -252931 -135688 19538 123246 313052 233305 94759 335148 243576
23016 243576 160145 305962 171239 135760 53772 -111732 -288603 -292719 -62961 74609
23006 74609 22690 -40038 175127 58034 -2526 158053 142871 -50000 -91455 -16738 74218
22995 74218 260394 378714 425675 318108 156712 114055 -199782 -133358 -95248 -368790
22985 -368790 -354479 -146730 -197825 -229133 -221391 -186587 -309177 -230366 -51893 136849 20522
22974 20522 -61817 -88873 -19146 -182152 -204278 1442 -45900 26074 -155712 -347640 -386101
22963 -386101 -150269 -154289 -175416 -180101 -187799 -166563 -102855 -32793 -123052 -139313 -344643 -325496
22951 -325496 -150839 -186040 12973 125750 77168 -16706 22912 -34824 -3704 -64921 -290126
22940 -290126 -553674 -226036 -76069 -3225 -12693 -79260 -216971 -22310 115620 217044
22930 217044 282538 262486 156216 -84191 -184920 -268860 -152589 -102184 -170417 -10627
22920 -10627 174276 349815 229412 58258 276566 246094 79547 -10824 117588 251866
22910 251866 241119 -35400 -17380 141974 -152799 -317897 -399671 -192292 111004 28097
22900 28097 -279760 -421072 -295744 -137576 23117 153942 397913 488253 221113 -47878
22890 -47878 -135550 -108923 77883 39145 -5203 -123996 -184037 -67835 21850 18546 137976
22879 137976 531402 555008 315329 206001 358565 237152 -5618 -191756 -25113 231362
22869 231362 176279 111595 155876 -77185 -106076 152762 -14438 -106525 -100111 -40729 -172921
22858 -172921 -276002 -572435 -526727 -440643 -290041 -270577 -251203 -97401 -62698 -123884 -101346
22847 -101346 -35963 272099 148616 64119 44639 63725 147320 200216 22789 19205 -58138
22836 -58138 -24939 52209 -12531 4754 99869 -61741 -331425 -463415 -343760 -281203 -141849
22825 -141849 196822 117360 -349190 -542007 -384151 -107189 -179913 -172500 -258432 -393106
22815 -393106 -224001 62440 6082 -14174 67202 4374 24531 -19450 -81071 -235842 -171463
22804 -171463 -340136 -342482 -390058 -384775 -289096 -229394 -7638 108174 124542 169035 151469
22793 151469 -134332 -183077 -56441 41622 183681 2136 -260254 -241044 -221352 -178964
22783 -178964 -51379 239033 141329 117623 347537 290006 203125 2694 -22155 -25160 -44535
22772 -44535 -26825 -91300 -184597 -148313 -292556 -395937 -202345 -57310 -166966 66020
22762 66020 346350 148621 -109061 -227890 -214951 -295965 -247751 -307043 38583 57825 238621
22751 238621 371911 500035 486581 96281 -108139 -145002 104024 315941 186295 248359
22741 248359 189047 -56625 -258887 -89796 65312 106906 -62436 -219384 -239187 -216457
22731 -216457 -99295 -45468 -278096 -722020 -739331 -401873 -210811 -220727 -294649 -193773
22721 -193773 -96586 -177793 -88212 135407 327138 152199 33972 53618 33020 -119152
22711 -119152 -122361 -160221 -263900 -24606 -34316 -218320 -318065 -376663 -328142 -255714 -201838
22700 -201838 129372 290467 496313 452139 376849 388965 434354 6899 -172665 218090
22690 218090 206661 -46807 -305628 -377404 -417619 -387551 -201560 59265 274897 39172
22680 39172 -76774 -219682 -374120 -185747 292480 373368 166049 195701 218368 268872
22670 268872 43654 -218189 -215437 -93776 72804 43283 -44173 105590 -158295 51659
22660 51659 332988 252670 12623 36905 -30619 81429 330532 297756 337427 278808 291848
22649 291848 213794 207691 234652 455 -24494 -16023 88755 14832 46151 -37538 -192519
22638 -192519 -66113 -178263 -288043 -12991 187788 242939 -40944 11714 293962 74002
22628 74002 -136827 -212663 -349283 -277077 -129872 -38985 144954 35159 -109810 -235782
22618 -235782 -136167 -139139 -108450 -322601 -398518 -331214 -219033 -128761 -335873 -232807 83663
22607 83663 276635 195446 -166422 -360580 -181214 -7530 91496 201927 180596 176314 17731
22596 17731 75239 136011 236587 4515 -391111 -798941 -825981 -576496 -316131 -215861
22586 -215861 -192793 -193380 -457725 -311474 -180608 -110316 -98861 -150374 -274363 -109178 10563
22575 10563 76127 119974 77901 168977 71760 122055 67958 70523 -162818 -392205 -147991
22564 -147991 -144813 -122502 -74943 5943 169258 358802 204970 -14350 -154492 -179189 -84248
22553 -84248 -267407 -458458 -340210 -323182 -195426 43362 87722 -128169 -155514 -81583
22543 -81583 237908 185565 126451 -14746 -160085 -157897 -144754 -111159 -79397 -41159 -226796
22532 -226796 -191857 -110236 16874 -225712 -370567 -288709 -382244 -86649 -11023 27432 20843
22521 20843 3185 -75138 -182803 -189747 89839 -61142 -156030 53183 125104 -91635 -251059
22510 -251059 -170720 143834 355602 342763 215845 -56807 -222457 -303856 -329228 -195041
22500 -195041 -78406 -112690 -153004 -33754 178795 114172 124920 257388 391752 210301
22490 210301 -5597 -91549 -356452 -302020 200698 415203 593836 595685 541173 399418
22480 399418 457336 368279 253960 36221 214618 391493 578937 447787 343799 406562
22470 406562 248142 189648 92146 37152 104539 136932 150006 279981 411420 287587 -95334
22459 -95334 -167075 6274 96113 -35068 -333346 -396883 -285043 -196724 -282493 -189386 89175
22448 89175 101353 -109415 -172277 -186286 -191776 -62754 -72345 58409 41540 -43547 -211848
22437 -211848 -242916 29545 131102 179013 227636 29761 -353779 -160429 -309579 -390787
22427 -390787 -217885 170547 386889 241154 174201 30497 -17003 47744 237651 447632
22417 447632 312232 99933 184509 251413 154570 192436 128098 -14342 -108461 24010 55711
22406 55711 69720 213977 401008 353904 268727 24545 -28977 117000 383333 396261 246576
22395 246576 -31473 -249957 -259261 -11613 59680 -213387 11811 46415 -27131 -126847 -123459
22384 -123459 15767 19626 -174707 -310299 19190 -34892 -364254 -73712 48691 -176759
22374 -176759 -399504 -342136 -189726 -183699 -188626 -143380 106890 60496 -23993 154608 85521
22363 85521 -35702 -178968 -497505 -682253 -420858 -18710 74647 -86597 -134589 -235850
22353 -235850 -260646 -224994 -314459 -382246 -348887 -178438 60913 239471 490883 450605 362224
22342 362224 142641 -13743 132328 221590 54910 194395 169821 227955 80678 -125209
22332 -125209 69945 -72739 22328 143314 39312 -85505 -30256 189198 87887 47638
22322 47638 105536 204233 392711 129228 54534 -120870 -244093 -301400 -500784 -500691 -380881
22311 -380881 -200540 -42270 95394 -48579 -53350 -98417 -96252 -44497 -118346 -155590 52580
22300 52580 3496 -24260 -48411 8595 2781 46792 -11424 -160391 -406019 -496124 -408498
22289 -408498 -79691 -215880 -182440 -338935 -139634 -211444 -312843 -209010 -73123 -261244
22279 -261244 -336152 64576 248420 102670 126250 53770 -357646 -587964 -295395 -120323
22269 -120323 -352095 -765398 -772087 -628116 -531608 -333273 -231221 -434266 -292603 20102
22259 20102 336536 82577 -340839 -275297 44584 64045 63925 65532 68270 109858 -36247
22248 -36247 -47037 -25497 -130372 -116156 13914 -32938 -36497 142608 253132 249825 172503
22237 172503 135964 -296857 -273966 7065 -106744 -95799 22570 -331930 -447735 -178724
22227 -178724 -11393 130019 188486 65268 -252210 -495339 -418638 -424440 -432483 -106678 135651
22216 135651 31489 -118930 -177485 -193855 -274019 -84551 -28293 -410751 -614516 -515063
22206 -515063 -305192 -412694 -311343 -114971 -112886 -214631 -264586 -176908 30643 -37058
22196 -37058 -50264 -99511 -57373 -162450 -108200 -2103 -15261 -76142 -79746 61107 105254
22185 105254 52336 211882 -44341 -100990 -92860 86309 50172 59026 143981 104373 214128
22174 214128 62556 -270609 -230736 -130441 -261332 -293243 -242588 -282745 -112395 -179482
22164 -179482 -374918 -444312 -232931 226 34911 29737 76746 118178 -116723 -147585 -128181
22153 -128181 -373968 -314564 27749 -7346 -100958 -44616 171344 345746 266708 148299
22143 148299 121498 -40545 -193597 -107238 -125334 -281337 -245514 -197229 -311716 -149061
22133 -149061 -26029 46442 97913 112993 218550 215760 45230 -165791 -274582 -249618 39475
22122 39475 255993 162375 204333 113101 67918 335328 487248 493926 262503 73740 152556
22111 152556 174239 35194 -5416 -16758 108948 25768 -107656 -102775 104064 -38891 -147879
22100 -147879 -273222 -253469 -107395 -71972 -207876 -316259 -128611 8797 43272 230445
22090 230445 178975 145875 17308 -75959 -60700 -14323 16180 -198073 -188966 -11959 94953
22079 94953 114268 -129561 -104366 -18106 61732 272943 238884 83007 280030 219184 68871
22068 68871 37173 113213 392429 257282 278495 250866 130047 -84098 -174976 -69709 -153260
22057 -153260 -114652 -30719 -146519 -284795 -355488 -198674 -146136 -74091 -2047 -28687 -206606
22046 -206606 -376358 -550796 -424704 -288757 -170356 -109625 -259513 -67081 -24339 -59731
22036 -59731 -105695 -79463 -231403 -250621 -426860 -438746 -371854 -380043 -364635 -151365 -197834
22025 -197834 -304602 -457433 -583792 -601074 -237474 -17776 -70722 -200808 -62577 10746
22015 10746 -153726 -21650 4324 -63652 -160475 -275043 -176294 -41363 39381 31841 -88419
22004 -88419 -250125 -217211 -163545 -183109 -178021 79201 204476 213581 106997 -86919 17292
21993 17292 323762 229764 -73632 71364 -113443 -129800 -80514 -134622 -143711 -57934 21474
21982 21474 54579 -39238 -303171 -248776 -36488 -20839 -169656 -218565 88485 159517 89666
21971 89666 13800 -314043 -145104 -7590 52844 80083 115205 48180 153188 242176 274659
21960 274659 254446 233930 222482 262607 283723 280025 323485 400713 530157 529592 293802 339615
21948 339615 550581 469510 128330 275 137817 270225 240246 174795 118206 -37615
21938 -37615 31125 -33632 -129083 86916 20201 -9243 19073 -2214 -85174 83479 127397
21927 127397 130149 36770 -76932 -160288 -335249 -472152 -377307 -264265 -301884 -28734 100420
21916 100420 26215 -19448 -49036 110678 88809 -61366 -240465 -261050 -58457 38097 84797
21905 84797 211455 352981 286537 262628 517971 375297 197462 225927 423989 400434
21895 400434 279051 191400 -51684 14005 81481 278035 290211 204692 113128 41760 25395
21884 25395 49028 289391 352622 322292 53888 -39420 2648 -330684 -377084 -167943 -105733
21873 -105733 -53107 -107514 -15274 190397 22371 -57781 -34200 41057 -3446 -107483 -13071
21862 -13071 -180351 -408090 -179284 -211091 -310142 -136206 193727 114406 -139019 -152401
21852 -152401 -126339 -348475 -391267 -226910 -71866 -35566 -117893 158269 185180 -98823
21842 -98823 -118214 -48051 -713 -90123 -172758 -88656 198499 278521 11624 -46949 -82490
21831 -82490 -37882 -67986 -192017 -231966 -33668 -165031 -278379 -371003 -431022 -271445 -158218
21820 -158218 -355360 -189287 -39369 -154008 -151925 -155397 -447617 -773417 -950124 -560325
21810 -560325 -239453 -290048 -287173 -307457 -126497 -140107 -118901 -94999 -239675 -523526 -693975
21799 -693975 -473825 -277841 -450093 -403909 -425428 -303433 -240271 -232483 -298323 -447943 -329258
21788 -329258 -41003 213178 -50911 -415023 -566809 -456829 -354791 -295140 -24991 86810
21778 86810 -55863 -66010 16150 24793 154167 12930 -293201 -432189 -410997 -337934 -215941
21767 -215941 -112642 -51899 30368 -35606 147829 102921 -64601 -222791 -325986 -278152
21757 -278152 -134357 -214326 -328158 -212616 -142534 -125798 -61063 -84011 -107352 -151130 -297495
21746 -297495 -382753 -330330 -30383 184127 188777 -58410 -167700 -308197 -382200 -352574 -338590
21735 -338590 -240152 -213830 -106966 -133186 -100209 -47023 -259551 -250869 -259311 -219910 7897
21724 7897 -1719 -128886 -268629 -63763 108773 12151 -74992 -37557 -153213 -333960 -340698
21713 -340698 -370392 -334081 -74746 94903 152013 197936 47193 -57292 -108414 -41575 -93911
21702 -93911 -26597 94966 -78186 79885 365454 455190 307179 39152 58780 -65168
21692 -65168 110688 264 -160381 -299362 16472 237628 210738 214843 -37642 -5790
21682 -5790 48522 -72098 -238600 -176927 76159 296533 186758 -10874 -204025 -90762
21672 -90762 693 -50194 137674 -5623 -88292 -76931 -162350 -232743 -278827 -159088 -220583
21661 -220583 -234540 -437 34896 -62675 -45682 -195866 -593828 -736391 -501893 -133537
21651 -133537 140745 198832 28145 106443 554705 550463 420129 305373 187639 79727
21641 79727 -34294 -153386 35865 129805 -10096 55840 16634 -161847 -148802 67478
21631 67478 155751 95470 182328 186205 290540 365685 243997 212880 101200 173280 274762
21620 274762 181632 188258 66232 -120335 -76191 -93527 -61438 -168872 162196 121204 58521
21609 58521 231643 181000 183635 92556 110942 202159 195538 119876 90773 -41570 -54762 -117680
21597 -117680 7080 117530 -55671 -24040 -53443 117773 -136992 -121123 143479 158624
21587 158624 -113752 -125886 -53602 -692 84417 134382 -31709 -438178 -491542 -451194 -282784
21576 -282784 -332670 -284511 -117075 -156059 -210236 -300557 -284654 -394498 -340816 -167233 -112653
21565 -112653 -92555 -142256 -413345 -579767 -440001 -344 -123846 -264169 -443024 -474120
21555 -474120 49474 116483 113616 145090 85979 -80212 -14503 47324 101068 237243 257243
21544 257243 -145153 -315633 -281335 -213426 -187459 23379 -32502 -90073 -110601 -145801 45740
21533 45740 100577 237311 279419 222855 131329 74333 148096 111672 124912 233091 68984
21522 68984 -41037 -184690 -111788 -212226 -77883 -293640 -440605 -378314 -320029 -189153
21512 -189153 107365 317356 248176 -16491 -119013 -71135 -52784 -169672 -496777 -538787
21502 -538787 -314181 -130781 -407801 -200487 7754 -178708 -150171 -215877 -211004 -49269
21492 -49269 -169949 -279426 -207947 -142171 -147118 -56308 -11202 81882 73112 -32427 9719
21481 9719 65222 189482 246228 -63531 -354729 -129075 94359 119525 316557 151810
21471 151810 -93908 -137282 22169 72882 -14029 -228947 -135367 -157551 -168508 -157589 74504
21460 74504 -198444 -475587 -336971 -148614 -41356 -413 290906 198018 111057 275
21450 275 -243623 -300670 -158254 83768 247565 15887 -54096 -99168 -140460 -88358 -89063
21439 -89063 -59749 57253 117802 154492 217476 152806 120573 219301 248479 342193 307186
21428 307186 38629 -112352 -185616 -386470 -326031 -283558 -39188 189416 127661 108837
21418 108837 153440 207939 83191 17496 -68950 -33874 34634 -34718 -140800 -226728 -73211
21407 -73211 1830 -159102 -208982 -389993 -324048 -129888 -23062 99927 -33443 -369220
21397 -369220 -465147 -367868 -257165 215809 343765 247274 146986 240951 293900 198730 157403
21386 157403 -113357 -101537 -268941 -199919 -16647 21654 -23107 28626 -134636 -222498 -407518
21375 -407518 -432280 -312155 125579 257202 195033 86928 95429 60061 -356153 -224172
21365 -224172 -152716 -41302 70129 25616 -79794 -262331 -207956 -84052 1584 -100938
21355 -100938 -159629 -202782 -230873 -11449 339376 525888 346509 100205 61 17315
21345 17315 105866 268020 160117 77573 66079 281365 188795 -49478 -86645 -244503 -453998
21334 -453998 -230747 -49132 -158654 -377460 -96164 114195 13816 -102552 -72913 -95392
21324 -95392 -133047 -86758 79018 38892 -317436 -389485 -69599 184916 140718 -18589 8079
21313 8079 -77128 -314636 -56724 77800 217049 329918 239047 -28720 4835 163832
21303 163832 189673 292577 273117 26982 7681 378030 458254 218449 15737 157654
21293 157654 162573 115827 151129 135733 166481 265990 236693 121967 183623 219770 144779
21282 144779 -44966 -103446 54311 81628 -48320 -150981 -29948 50627 71760 48766
21272 48766 176816 284718 162245 -177481 -370392 -354662 -299629 -317571 -96146 111579
21262 111579 37082 -319786 -274026 58086 -16088 -260607 -346018 -137264 126482 68026
21252 68026 -81994 -180030 -55576 135525 239228 218122 141410 -10769 -179843 -71078
21242 -71078 -179187 -122819 34021 -356243 -434730 -269713 -59047 34487 -17435 70168 112280
21231 112280 9657 355793 389004 290092 264606 253404 10984 -276482 -259453 -215650 -358813
21220 -358813 -191163 -113673 25361 -44660 -87479 51875 -13029 -171726 155 126398
21210 126398 57977 66970 104209 153276 267732 143007 -22067 68402 243218 405438 241617
21199 241617 399687 449798 233571 568 56231 171974 375553 331663 154975 -156096
21189 -156096 -187311 -236199 -403553 -431800 -328854 -324902 -351486 -339869 -111673 232332 220495
21178 220495 152489 318 -111283 3525 16530 -44727 -84856 -194585 -108648 -249461
21168 -249461 -108444 31257 114430 124557 103898 49605 -186924 -282778 -235086 -8516 302158
21157 302158 329086 396727 -48359 -420454 -239572 -255129 -373387 -362430 -429234 -284963
21147 -284963 -80813 -131445 -66681 -5751 -107121 -80925 -130986 -57295 -252812 -287440 -212756
21136 -212756 -388148 -422252 -401622 -159577 -62078 -29051 -70474 4903 196429 318804 56309
21125 56309 -32006 9827 10096 55522 -24373 -156629 -168641 -121971 -23068 -126850 -437880
21114 -437880 -476901 -263052 -185014 -220901 -122113 237013 255005 18378 -105716 13338
21104 13338 242096 568806 448766 139131 -5635 -196836 -2853 -6465 81964 294863
21094 294863 400882 348027 138078 -108044 4871 222209 286086 182234 -13314 -192308
21084 -192308 -248607 -163593 -53389 -146513 -320070 -292002 -267058 -273483 -149060 -79301 -98695
21073 -98695 -106306 -140055 -213330 -111975 -75346 166037 151038 24484 331935 449708 359204
21062 359204 146017 200530 242921 208100 -1590 -274802 -385956 -456001 -405757 -285285
21052 -285285 -80747 -38691 -63274 166523 510612 365747 103111 150181 363113 318864
21042 318864 242879 126167 -40307 477294 733464 637771 399396 205370 86166 -257713
21032 -257713 -109724 -1696 -206302 -248107 -232231 -59456 213816 129366 -109447 -201836
21022 -201836 -87392 -169702 50330 -21710 120741 327013 161580 -3640 -145763 -218160
21012 -218160 -341427 -503788 -468851 -293222 -360002 -298935 -122368 -198886 -263942 -287647 -152504
21001 -152504 55617 158365 -20840 -81935 -117911 -70686 -80227 -245236 -203263 6249 290143
20990 290143 280065 186279 74007 -35291 -304309 -251390 -162560 -268841 -92735 -140995
20980 -140995 -298120 -376592 -437860 -668304 -639707 -264702 -199399 -136920 125383 185494 35483
20969 35483 104536 98806 -140825 -214160 -83110 -54757 -91057 -305804 -370933 -491765 -642632
20958 -642632 -693562 -380052 -267731 -376156 -172981 31026 120864 -231239 -307824 -236978
20948 -236978 -134332 -198603 -103689 14150 41691 139 36006 196845 -30709 -47549 323217
20937 323217 328157 -45195 -251624 -286093 -270034 -400849 -423133 -252929 96499 197908
20927 197908 180556 -102722 -382409 -450250 -263440 54607 191204 88029 -51622 6535
20917 6535 82635 224976 256128 156075 -60475 -68053 146913 278437 332051 182905 -25185
20906 -25185 -162127 -182501 -97727 284061 401202 323244 177144 -9799 -22337 -86643 -143639
20895 -143639 -83927 -136170 -53322 -8455 82129 154233 126096 -42326 -128370 54040 -80439
20884 -80439 -100776 -76423 15398 -35173 59190 181041 203124 134116 -114841 -236982 -363883
20873 -363883 -299862 -377512 -377015 -203764 -381663 -544574 -367555 -213595 13112 167457
20863 167457 150258 78473 75362 -47931 186535 516957 418982 539113 398438 112857
20853 112857 -142180 -127818 -82858 -83633 -190321 -416493 -171750 -98246 -157217 76754 233063
20842 233063 211139 399928 376616 325841 -104097 -428012 -193371 -60299 -58749 -295120
20832 -295120 -435368 -355474 -118984 -202281 -289865 -319845 -450435 -530527 -412535 -474549 -361477
20821 -361477 -25251 -174925 -224957 -94813 -346616 -564904 -610588 -548449 -304177 -60677
20811 -60677 52868 -102198 -19756 182445 54279 2862 65543 -162091 -239339 -241255 -184291
20800 -184291 -12821 12998 -18549 -180447 -254878 -252543 -383059 -450892 -484675 -355387 -50710
20789 -50710 128113 88580 50410 -143549 -508592 -398265 -104222 62491 -30663 -1019
20779 -1019 99613 258671 -46367 -108117 42299 153658 358833 339113 258802 380068
20769 380068 165254 -113015 -265337 -214127 -121814 177520 332006 422755 287565 136377
20759 136377 -19633 81043 58160 47619 -102782 -65730 -24825 -65476 -102196 -349631 -501166
20748 -501166 -440561 -322412 -78421 -122665 -46623 140228 246688 123153 9712 47280
20738 47280 130368 149317 290720 244386 -19378 1038 -136964 6334 9373 29248 -13401
20727 -13401 -7196 -12015 -230638 -393905 -442663 -428231 -261989 -178911 -127029 -229721 -291921
20716 -291921 -156784 -136915 -178981 -142316 -10300 -204735 -398887 -488908 -546379 -536788 -488541
20705 -488541 -377382 -209420 -84582 -78826 31889 -147967 19237 59016 -182956 -466711
20695 -466711 -482159 -193615 77986 -36120 107776 21857 -137044 867 20153 -72810
20685 -72810 -377795 -403285 -266035 20130 87771 -25634 -132865 -68947 101405 121339
20675 121339 92719 84691 -39665 -188689 -108714 -312105 -166701 143592 454945 445696 271095
20664 271095 61034 53179 148609 191368 196354 280733 297787 376542 213844 -98606 -324486
20653 -324486 -275153 -115644 -47275 -47174 -35687 -115052 -62318 124519 29380 -14448 8458
20642 8458 -123885 -133684 -272996 -97114 -144983 -222117 -175319 -205211 38556 187868 121590
20631 121590 15600 133907 62179 -198932 -456310 -501370 -379828 -214748 -93018 111111
20621 111111 329770 33113 42157 226369 99153 -62998 -203060 -241539 -276006 -96545
20611 -96545 18863 -89018 -175077 9821 147545 43612 218834 371558 221252 141219
20601 141219 399768 423690 387011 323555 164759 243360 131624 -10161 96686 218989
20591 218989 176685 245592 288910 163236 67104 68371 109088 -25724 -85544 -64177 -25632
20580 -25632 212421 385756 162179 38265 -18215 43705 262945 236483 360915 320699
20570 320699 258647 256320 314678 277427 -88254 -328101 -342125 -491454 -348201 -273239 -52790
20559 -52790 102166 -159975 -210123 -181381 -125397 -73137 -43374 117143 295782 219203 28465
20548 28465 -24534 109051 157647 215486 137691 -215790 -93627 -25787 231481 306109 467612
20537 467612 492055 204640 -2756 -14393 90051 -117478 27803 -115597 -463106 -392604
20527 -392604 -413804 -364689 -21906 1161 -159383 10681 270021 224353 169773 205841 84894
20516 84894 94941 -148687 -261567 -100603 -92598 111755 251718 336725 289609 499384 332570
20505 332570 440891 257517 -56722 56372 55069 19514 -133193 -152111 -92089 -113326 -16462
20494 -16462 -210134 47838 153642 -172519 -1128 -66639 -78026 39889 -20894 -93156
20484 -93156 -82186 -149348 -133950 174872 177766 125756 200475 152351 -168710 -287820 -352704
20473 -352704 -286665 -401353 -546679 -487490 -234743 -86099 -173246 -165628 -263031 -149347 -18174
20462 -18174 175199 313331 161960 112176 112172 180442 -26697 -58887 107961 208806 184685
20451 184685 116744 -81612 -108084 -312326 -325668 -191932 -98621 48199 121423 -81371
20441 -81371 -343586 -238688 -107133 -14518 35887 15791 -92169 -19894 -198159 -6851
20431 -6851 320498 261595 19214 66695 171098 222853 194311 -56000 19326 224767 144759
20420 144759 5690 50445 -91070 -136588 -68062 -294608 -439492 -185714 -319182 -385171
20410 -385171 -242626 -35354 -1482 -43015 -72431 -70264 -73847 -19837 85894 92 -96222
20399 -96222 88872 38954 -52056 -189332 -176604 -49810 -46851 100097 177504 -104213 -3384
20388 -3384 167740 263251 362842 386196 215368 -102598 -548602 -227339 -107010 -364233
20378 -364233 -232375 -187167 -253375 -291571 -283574 -474967 -191502 -181320 -70671 216002 84042
20367 84042 -69050 -251711 -405616 -363535 -129434 -69620 -362154 -457894 -187549 237364
20357 237364 292655 186358 261185 418884 381887 50398 -351870 -462696 -351227 -138780
20347 -138780 -132022 -296574 -24345 -103999 -484697 -414681 -311602 -244418 -199710 -247460 -105063
20336 -105063 53640 -63931 -28452 -78472 -319204 -142624 -102413 -198902 -91723 -338941
20326 -338941 -445305 -547767 -492267 -514908 -509306 -401406 -370841 -242290 -149692 -54224 120992
20315 120992 315027 338331 357324 365773 367548 205646 300390 430345 412820 166993 -24704
20304 -24704 24142 -34282 -8373 2519 6424 46163 -187198 -398869 -380960 -86488 -22451
20293 -22451 67932 102734 245053 153920 -47708 -206319 -177240 -19450 200698 50220
20283 50220 -347504 -655130 -383269 -266237 -194860 -173761 -2172 -97824 -268835 -258805
20273 -258805 -60592 -306581 -366533 -295331 -147641 -99020 -259484 -393192 -203658 44957
20263 44957 -128978 -245469 -107612 10682 -313536 -390080 -334120 -74305 42607 -30813
20253 -30813 -67746 -61893 -129795 -173248 -132066 -49993 -173107 -112002 -42233 55107 -32104 -28413
20241 -28413 65976 53621 120238 -25557 -197075 -189080 59683 93417 181784 244870 4720
20230 4720 -154470 -119267 -134617 -111014 23432 26208 -59743 -217335 -147381 -128196 -78983
20219 -78983 -29234 -130124 -154905 51194 133900 72158 16861 -86045 13331 -14281 -196328
20208 -196328 43599 -94755 -371498 -307953 -291396 -258722 -237154 -126717 -183874 38391
20198 38391 155893 198924 135596 -79446 5939 347865 437174 221640 16949 -20544 -59223
20187 -59223 -253933 -394272 -238225 58365 80365 -38835 -293669 -387486 -321840 -131339
20177 -131339 -35335 -51169 -99785 -142143 -74967 -16992 -95595 -176242 206200 122428 46772
20166 46772 -24425 -61889 -196748 -258642 -391004 -182577 -205678 -234269 84894 198140 87548
20155 87548 -206905 -354684 -411238 -441117 -712350 -759286 -476620 -97013 -136898 -170445 -208446
20144 -208446 6232 232093 415516 347639 141420 74759 36799 -265547 -337051 -264754
20134 -264754 -110970 -44832 61365 155655 168802 181785 -48213 -63899 -64376 -175345 -223110
20123 -223110 -299642 -119660 124655 263746 301084 55582 147949 71391 -110680 -82388
20113 -82388 4180 79043 203308 330113 108754 -210680 -179019 148047 424187 437066
20103 437066 487691 50440 -359534 -326039 -288715 -419818 -315122 -200593 -322089 -290101
20093 -290101 -184420 -54444 118077 87612 91 -184873 -327056 -351692 -170297 -130781
20083 -130781 -110597 23653 225136 260388 243518 122528 -49070 32882 166020 267252
20073 267252 140389 215926 273291 16816 -80329 -13408 201112 278062 271663 138505 138812
20062 138812 173345 159919 -24891 24596 120539 97009 127406 282524 298504 190145 93690
20051 93690 -10320 237707 518769 302281 -73393 -101755 76311 329471 395236 236648
20041 236648 11371 91856 -23965 -180938 -351652 -183179 190655 -7517 -148338 -156582
20031 -156582 -40231 -64925 74772 100964 39836 117351 -67311 -156181 149054 327472
20021 327472 118505 -273171 -318620 -317515 -410665 -458252 -363158 -216484 -128236 -99132 -65341
20010 -65341 67622 276634 -59205 -116005 -23326 -170364 -299214 -184929 -159279 -158551 -317695
19999 -317695 -373361 -381978 -294387 -80143 -79748 -182766 -45299 212549 490986 273664 -60268
19988 -60268 -329936 -518110 -423432 -211632 -46853 -89011 84782 272948 297170 125904
19978 125904 86633 -3344 -367883 -321378 -227989 16738 261096 419587 387316 156666
19968 156666 91542 -20755 -58031 -97402 -219260 -105529 -25129 -307910 -450959 -496320
19958 -496320 -614080 -473110 -269328 -174078 47757 45037 -159754 -411267 -472508 -392367
19948 -392367 -378501 -188982 -237087 -130123 66206 -163329 22250 125464 -15642 -163206
19938 -163206 -365768 -290679 -331748 -269534 -264280 -313596 -111110 58715 82619 42677 -256153
19927 -256153 -296177 -181818 -262497 -397823 -332116 -35660 138706 49779 -128961 -54044
19917 -54044 140397 220756 -43203 -331073 -508470 -275669 -226935 -155602 -31985 235746
19907 235746 -24125 -173024 -109617 23853 136435 83874 -219226 -326849 -167389 -59171
19897 -59171 93605 126786 -131259 -312953 -278855 -184761 -108292 -237650 -446091 -447009 -379051
19886 -379051 -458525 -581885 -644172 -698365 -677580 -721123 -637197 -277153 -27047 -94306 -87573
19875 -87573 -190531 -168410 -87407 -100040 -120693 -371169 -268137 -174678 -33976 305714 143085
19864 143085 -141496 -424655 -367512 -343165 -450319 -592063 -307801 -45917 -190078 -23473
19854 -23473 -15942 165298 84088 35759 51294 -169565 -256543 -348713 -256351 -367927 -233582
19843 -233582 -141266 -225827 -553242 -380977 -114513 -265199 -402546 -424049 -578618 -444182
19833 -444182 -92066 224568 235108 186462 -131363 -141597 -270695 -343992 -364198 -335143 -300828
19822 -300828 -132448 -151766 -253803 -386348 -199363 262033 402005 251470 198540 -199669
19812 -199669 -259687 -99469 -29475 164876 290457 432479 274818 -183472 -153606 -154002 -287460
19801 -287460 -258687 -129459 -81131 -247925 -353272 -134180 -42695 -96863 -6624 25051 60690
19790 60690 129680 123289 118615 230132 162948 112496 -206134 -201019 -442044 -585169 -278849
19779 -278849 -126621 -38782 84487 -38812 -270688 -566133 -444243 -395120 -382113 -464679
19769 -464679 -584545 -534916 -428769 -260030 -410967 -448235 -260646 -320678 -315728 48815
19759 48815 109513 -214359 -333483 -353050 -282757 -65543 -29219 -48771 -120641 -241487 -291077
19748 -291077 -477540 -179761 -59994 -67382 -171634 -196739 41322 31847 -53983 94111 345617
19737 345617 434732 393013 -5045 -117566 5992 -74286 -62974 -55629 -223199 -240524 -195807
19726 -195807 -381458 -348216 -315466 -369248 -479346 -458806 -550011 -410742 -415440 -356775 -340957
19715 -340957 -53631 5163 -118722 -6232 62725 87435 127280 79346 -91419 -177767 -209720
19704 -209720 42143 82158 -47066 157258 316133 244185 112838 289288 305481 94497
19694 94497 199119 295601 63006 39796 9513 254263 422257 422028 315021 203387 25945
19683 25945 -43793 -216281 -343649 -185944 -95124 -30776 70577 147411 240135 190128 -17123
19672 -17123 -305293 -393291 -83929 253478 250231 25165 -100098 108209 192650 219822 223736
19661 223736 -3338 -127188 -93971 -23554 334792 458801 351971 242982 79093 160816
19651 160816 303615 396710 298681 132972 -80134 -195141 -16944 -198670 -178788 -22962
19641 -22962 -30398 1978 67986 -75100 -211104 -422367 -246657 74632 53667 -170614 -167553
19630 -167553 -136218 -160709 -104830 -63763 62734 75031 -89378 -39135 59583 -19263 -127844
19619 -127844 -105959 -114334 -41855 20923 -84074 93262 253426 342870 349051 443764 259689
19608 259689 -16598 -408520 -482207 -345928 -21590 155268 233106 359742 215633 -17556
19598 -17556 -159650 -108614 -170408 -181688 -88502 48277 -2670 -87060 -343670 -323149 78005
19587 78005 291388 196621 249736 277220 230837 116551 122906 192596 29416 161052 160704
19576 160704 158382 -26375 -257403 -83504 66289 13662 -180590 -162030 -53181 -55772 -229879
19565 -229879 -219699 -87542 296063 376401 199608 114918 -108326 -77954 106812 291310
19555 291310 265916 37456 -200205 -101137 -95257 -51256 107259 130382 169376 13660 -191559
19544 -191559 -157390 -82470 -177010 -188752 -197226 120909 470193 509383 388135 328221 441006
19533 441006 386669 272441 39161 -41875 -6155 135880 153295 201190 34070 -296117
19523 -296117 -420756 -506121 -446958 -251791 -79424 151908 245298 -95192 -171706 62180
19513 62180 81247 -32633 -142816 -353420 -227454 -41863 60386 -550 -56835 -321645
19503 -321645 -385341 -434888 -554714 -599041 -387241 -192838 -84440 -278931 -368029 -55534
19493 -55534 100434 276788 262745 120704 25689 196841 276974 196572 182835 198391 -47062
19482 -47062 -146609 -87309 38158 72112 -183681 -200866 -203748 -259964 -320669 -374847 -127853
19471 -127853 -16171 -63093 67406 55132 -187283 -296851 -324051 -392040 -490295 -315187
19461 -315187 -285539 -550475 -527777 -217737 -275679 -160064 -27327 -103150 -229562 -420075
19451 -420075 -558635 -447993 -100971 -62756 132135 51865 -57900 138366 252068 338552
19441 338552 173731 107668 -119556 -82959 -80809 127585 4732 92846 106949 -898 66547
19430 66547 206667 58189 63774 158795 11967 -424701 -413927 -262252 -49712 115767
19420 115767 84393 248105 243232 38648 -153128 -68592 -19595 -62730 -244769 -332308 -399999
19409 -399999 -582856 -74466 110670 -23769 -66217 -32078 123368 -75236 -272485 32132
19399 32132 -24344 -78673 -196184 -232346 -211417 -140622 115913 230899 40186 -237575 -381185
19388 -381185 -540782 -479686 -509315 -406678 -209319 -131344 -522344 -601478 -484326 -430202
19378 -430202 -361382 -203482 -233435 -293383 -89518 -62799 -172135 -311654 -293762 -90151
19368 -90151 -168902 -358175 -438284 -343112 5554 -57201 -35890 649 113540 -191213 -225359
19357 -225359 -215117 -239690 -303519 -279481 -27652 -153118 -210351 -258843 -67607 42705 255300
19346 255300 173209 218749 41004 -232309 -237839 -23622 288475 217574 114996 208442 224326
19335 224326 13398 -169412 9430 125449 154713 150665 -63863 -134059 -29759 223283
19325 223283 312975 286240 69681 -59573 -182434 94478 150287 104511 14668 74358 134518
19314 134518 -27028 -64584 -120643 -115694 -203797 -343024 -282453 -213599 -220278 -47474 -25349
19303 -25349 -226583 -346630 -210722 -93596 124420 487170 492738 317359 191520 -23713
19293 -23713 -121057 -60716 -99176 105824 307581 253126 -14104 -121439 -65269 -281271 -322994
19282 -322994 -295378 -12129 212482 244609 231396 210653 123177 82953 103316 168107 3782
19271 3782 -232903 -201421 -139863 -243697 -224911 -45670 146523 57805 197887 214735 -17272
19260 -17272 -77547 -149531 -54184 21431 221682 405913 276694 -40199 -129885 -317497 -334850
19249 -334850 -241782 -181309 -95114 -56740 -218636 -64502 -22562 -62529 19138 208617 383187
19238 383187 342818 113842 91911 55825 -115079 4217 -13443 -102923 -180058 -253652 -330046
19227 -330046 -401640 -431733 -480301 -478408 -431839 -511214 -304578 -289492 -278161 -413110 -595885
19216 -595885 -458073 -65189 81390 -5345 -105631 -252296 -495710 -478828 -206676 -91821
19206 -91821 -9137 236129 -65261 -119208 39952 44137 33207 -124729 -94536 -18726 -227975
19195 -227975 -265244 -444874 -659857 -562202 -470871 -266253 127768 262413 170922 -162359
19185 -162359 -199674 72156 230197 444774 580662 611786 591288 246935 112769 -80114
19175 -80114 -213874 -466100 -467611 -252991 -252134 -285739 -71766 -70698 -152499 97503 457686
19164 457686 365614 151028 115513 232029 169854 86230 69122 -100111 -32593 88812 188341
19153 188341 216770 -26948 -111413 -85569 14015 7411 72982 31675 123887 385475 317982
19142 317982 139812 120633 195089 73621 -209729 -505086 -424961 -147733 -45569 -159283
19132 -159283 20306 91885 235911 167294 -142344 -239234 -188116 -226957 -256815 -279961 -202067
19121 -202067 -267845 -316784 -308581 -446589 -159607 -50352 116453 3875 -188022 -250806
19111 -250806 -242017 -239292 -128423 -108610 29481 255557 247306 264840 108870 32762 95038
19100 95038 351776 234928 238950 113120 130105 217383 227859 167544 4680 -103111 -44718
19089 -44718 79492 153322 -33877 -49029 -165121 -96519 -170029 -283013 -275272 -201229 -166637
19078 -166637 190307 380292 217722 54798 -3512 -115485 72613 258697 294612 157652
19068 157652 125504 336338 356937 256422 307058 345248 550276 626278 376254 117009
19058 117009 353573 531135 631468 673273 456109 219820 423459 1059911 1628305 2088252
19048 2088252 2258908 2339520 2466274 2365207 2077808 1945051 1796626 1814537 2041123 2276448
19038 2276448 2352533 2130342 2106657 2453446 2528760 2631201 2472975 2329248 1984219 1489500
19028 1489500 1020666 606044 476945 396701 322469 279022 290224 256734 43717 -224536
19018 -224536 -186686 128624 415977 520642 436061 102195 20898 49852 82369 69612 418910
19007 418910 499863 607305 537328 475904 552022 745634 576810 401306 191406 233558
18997 233558 136582 -180049 -259867 110962 421585 200757 -180729 -531264 -463073 -324494
18987 -324494 -200188 -251095 -70681 124874 30502 59849 108082 86184 201224 359438
18977 359438 375839 248739 92260 69373 128327 153622 113045 -95019 -190508 3056 -16824
18966 -16824 -92980 -231838 -165276 22541 118587 114202 239201 272844 397150 407889 -14780
18955 -14780 -223657 -332677 -268046 -12111 123716 243843 145257 102419 311858 315843 450369
18944 450369 404406 -69831 -293578 -373814 -186746 -130107 -111784 61814 -1098 111018
18934 111018 44833 -72546 -106106 -130024 62165 82337 -67258 20663 890 -40288 -48719
18923 -48719 -15001 162429 29159 17988 -219468 -215721 -260238 -57932 -85855 -207952 -153026
18912 -153026 2329 333577 294326 278252 105062 98243 235678 213318 237189 527343 506282
18901 506282 297643 141531 40510 -27397 -63088 74441 159526 125613 158359 317836
18891 317836 299548 328790 164901 187518 31408 -145053 -213463 -129760 116581 322714
18881 322714 468473 439841 226582 73283 265523 222823 103591 202051 268160 278270
18871 278270 531161 658045 568453 591340 568935 716658 634571 589248 530434 465938 379387
18860 379387 9299 91829 356428 490894 541223 511169 670760 574383 411929 742416
18850 742416 778438 425594 -13657 -147750 173390 329113 292604 354941 593029 583496
18840 583496 519131 511019 840828 943931 671769 719610 511379 453889 244385 2702
18830 2702 -105224 -275938 -286994 -60377 -86837 -169341 -50396 92671 205939 276054 386508
18819 386508 104458 99314 333459 209108 203913 190191 151667 316009 294743 177387 237103
18808 237103 351264 378848 296047 192292 296614 283119 201282 85270 270496 631329
18798 631329 951869 917258 643248 382890 525125 493512 469722 441387 314846 226590
18788 226590 288904 367068 450928 378128 588208 886221 711101 359930 322459 264126 124710
18777 124710 91720 47264 -35652 117052 207080 101986 158060 382180 447848 460257 624176
18766 624176 924458 1263041 1437424 1421752 1456104 1270942 873567 547711 167043 68620
18756 68620 38667 15181 222113 309392 108652 93025 202596 323376 438420 321248
18746 321248 242977 269149 497327 563403 376524 448892 218547 91914 116270 11553
18736 11553 -207825 -127981 131695 -7293 -185230 62513 66768 28684 31604 472900 427391
18725 427391 208183 320443 381221 166716 105349 6588 -59123 -151399 85895 96848 101277
18714 101277 45448 148191 297865 393625 162371 56914 132738 224020 14121 187971
18704 187971 515759 418638 249550 186496 314514 311961 304320 449754 600898 509524 397617
18693 397617 61472 -27088 -196854 128070 392390 181241 128654 119321 121982 296941 427414
18682 427414 570993 491743 359580 504824 149320 -176328 -41627 -77319 -197439 -33714
18672 -33714 -5005 30683 47557 229170 397081 423260 709849 611196 543362 709912 703351
18661 703351 428993 67633 108211 339978 424500 596005 736477 704077 537066 249334
18651 249334 26770 15192 123479 167216 275880 430123 397232 464105 246126 82613
18641 82613 -45697 110710 17953 20576 240849 437892 299126 340875 205870 -10082
18631 -10082 -210369 -356894 -323992 -215156 -77062 57815 284088 443384 376015 32643
18621 32643 116196 261781 211483 296758 227854 241729 205515 184663 197745 221153 217991 210188
18609 210188 415119 164714 -43058 199196 448612 462465 366727 380772 394188 308105
18599 308105 497114 378779 197569 303336 277806 420404 440244 511457 187829 182295
18589 182295 224491 212572 148877 155476 389675 444441 418728 470435 579624 763914 771492
18578 771492 508714 346941 602730 679490 668945 614476 502255 383471 435528 454493
18568 454493 187226 83025 156965 221324 483851 620648 458274 322865 320767 386737
18558 386737 526821 598088 455127 440340 620763 697880 741413 735636 592715 334033 106943
18547 106943 134254 250563 460546 874017 1036080 1256443 1605651 1955149 2547719 3132883
18537 3132883 3563376 3525739 3692240 3761098 3765243 3713977 3577205 3489233 3719609 4002175
18527 4002175 4088032 4171327 4358924 4381308 4382630 4646280 4511586 4507198 4484197 3974487 3709261
18516 3709261 3211608 2617526 2384607 2307842 2199899 2219329 2104490 2068434 2040949 1895926
18506 1895926 1610569 1490367 1573710 1618002 1843499 2017657 1994401 1674059 1451173 1646761
18496 1646761 1750215 1720750 1863467 1894870 1598389 1723881 2036454 2241872 2232079 2112733
18486 2112733 1975404 1983550 1801998 1800547 1633327 1424266 1208320 1344258 1581334 1772654
18476 1772654 1738730 1770887 1964557 2331641 2713634 3166266 3652055 3878235 3835382 3815167
18466 3815167 3882877 3760459 3427264 3347955 3316380 3005798 2812003 2738437 2779828 3279211
18456 3279211 3743274 4375721 4629670 4557038 4954656 5219315 5264565 5368349 5491272 5607913
18446 5607913 5773515 6032182 6290067 6453395 6534370 6702044 7456030 7892584 8308276 8934201
18436 8934201 9943057 10569959 11239382 11721661 12512317 13570820 14183315 14733515 15373943
18427 15373943 16534075 17853006 19487054 21623429 24417016 27704336 32116470 38818813
18419 38818813 48686648 63818760 89527858 132198694 190374240 250603724 301822832
18412 301822832 346143368 382877581 397956372 392511963 384746496 383907820 379728430 360844334
18404 360844334 342270314 347945348 371135670 398255775 426545485 443004256 434950050
18397 434950050 413939721 395772664 377020835 336526155 267714426 198431268 152543593
18390 152543593 126739512 111135999 100602430 92555459 85983322 80966979 76831632
18383 76831632 73007180 69754925 66584317 63950689 61621872 59638435 57780416 55594374
18375 55594374 53150534 50987785 49218435 47567759 46041837 44645642 43643182 42790737
18367 42790737 41683166 40213341 39093614 37990305 37042460 35961571 35026772 34118566
18359 34118566 33214004 32384198 31456905 31017715 30323856 29518883 28613091 27596291 26666347
18350 26666347 25765499 24572225 23479426 22687791 22276388 21800110 21121747 20429217 20041666
18341 20041666 19758336 19226845 18783516 18213868 17768249 17302166 16879511 16632691 16262751
18332 16262751 15773961 15643019 15605785 15685371 15541694 15300961 14963416 14659455 14325932 14307517
18322 14307517 14214726 13860949 13535793 13417132 13025073 12660222 12275362 11917690 11547938
18313 11547938 11626821 11774553 11525641 10995787 10310223 9890855 9711606 9458391 9290528
18304 9290528 9119362 8950953 8705707 8567222 8365406 8514498 8461279 8427471 8209627 8205143
18294 8205143 8191333 8189218 7949191 7908120 8134877 8409301 8969725 8982816 9335428 9578553
18284 9578553 9646450 9677488 9814892 9746933 9551693 9027644 8562011 8506578 8821509 9274319
18274 9274319 9445295 9186182 8988562 8996827 8857442 8774087 8404374 7837255 7233667 6737852
18264 6737852 6530913 6310018 6203173 6119492 5759936 5707958 5617786 5403216 5278860 5313050
18254 5313050 5209111 5131651 4989198 4749930 4656200 4572966 4220406 4130416 4242374 4471745
18244 4471745 4401285 4567130 4824784 4884964 5033414 5141041 5144808 5015360 4897776 4821189
18234 4821189 4941449 5315358 5871826 6645753 7351980 7636747 7088978 6393160 5963439
18225 5963439 5776005 5520935 5242011 4876068 4707037 4654150 4251961 4040362 4022643 4256933
18215 4256933 4299296 4170716 4204194 4112959 3838492 3687969 3773731 3652189 3340415 3093720
18205 3093720 3195714 3386301 3432395 3183993 2913732 2563064 2495983 2620107 2517143 2532080
18195 2532080 2302248 2292878 2553606 2571202 2280609 2075432 1966047 1888203 2261394 2521539
18185 2521539 2537354 2578598 2387380 2139272 2206715 2256285 2065079 1954048 2096939 2268759
18175 2268759 2405687 2472867 2251055 1983998 2044252 2134924 1945871 1788251 1891362 2120897
18165 2120897 1915478 1893554 1840172 1857046 1726277 1657647 1743258 2019892 2329571 2367477
18155 2367477 2494631 2677984 2641638 2642506 2671887 2712379 2874254 2758987 2885404 3046427
18145 3046427 3050066 2879566 2581706 2605293 2551807 2424027 2597492 2606905 2619947 2768154 2613770
18134 2613770 2502405 2631985 2869005 2997490 3130542 3508423 3942629 4075902 4529741
18125 4529741 4856027 5062261 5125593 5322645 5703023 6078239 6528346 7190369 8030511 9288594
18115 9288594 10820888 12962370 16126442 20677346 27366802 38964116 61335342 103864850
18107 103864850 161707639 207098051 229873437 243044072 236703398 169747995 102642438
18100 102642438 69699764 53548305 44245563 38467018 34382926 31128043 28082328 25658838
18092 25658838 23660706 21903969 20462397 19361056 18558082 17744149 17030586 16589250 15956230
18083 15956230 15405872 14849771 14421460 13990164 13539960 12828305 12462552 12025985 11837846
18074 11837846 11685336 11386444 11201529 11349397 11530809 11357323 10864729 10396539 10098582
18065 10098582 10036821 10118327 10068918 9689141 9292405 9107795 8958034 9119315 9082593 9342519
18055 9342519 9765015 10075325 10577893 11384038 11864343 12041683 12108578 11804113 11374490 10873781
18045 10873781 10278381 9832068 9447237 9062425 8923925 9154810 9348822 9557965 9932403
18036 9932403 10304800 10856505 12052120 14051715 16831041 20733430 26773055 36257754
18028 36257754 50456460 69784128 92310463 115424506 136205640 150375337 153682447
18021 153682447 145492355 130345145 110532282 87822390 67959107 52840163 42871341
18014 42871341 36726875 32583701 29486058 27149183 25333268 24024115 22869612 22270448
18006 22270448 21887698 21652590 21775500 22327208 22961030 23109527 23087081 22797266 22580872
17997 22580872 22416855 22075212 21689079 21197266 21103815 21461656 22000301 22713706 23878024
17988 23878024 25430398 27433403 29970402 33324827 38268892 45722663 57437899 75911149
17980 75911149 105094001 147250336 202265709 264578760 327290901 382406789 418247610
17973 418247610 422373455 396188494 351818684 294728238 231119470 176166796 135414168
17966 135414168 108545168 92047660 81056232 72994468 66650723 61586307 57305143
17959 57305143 53754193 50906423 48856093 47150658 45738015 44754661 43864143 43126534
17951 43126534 42954733 42654519 42108242 41120443 39922339 38787634 37561697 36661738 35874416
17942 35874416 35015253 34925280 35129775 35763390 36534861 37920836 40404236 43982177 49454258
17933 49454258 58229879 72329771 94786836 127446103 169863756 217836838 266170528
17926 266170528 308083385 334459981 336105845 314616269 279301960 235025221 185835722
17919 185835722 142975602 111178193 90825628 78177613 69870572 63517811 58481136
17912 58481136 54526579 51227190 48197248 45627699 43586202 41923099 40467427 39294265
17904 39294265 38329034 37760061 37099767 36690419 36647367 35939707 35212799 34430964 33067124
17895 33067124 31658110 30451617 29228020 28317639 27819410 27306275 27136785 26772568 26349510
17886 26349510 26288115 26195617 26149070 26335533 26766036 27316689 27752051 28337583 29497377 30716176
17876 30716176 31682274 32563722 33939801 35548816 38159501 41866977 47010375 55273353
17868 55273353 69475607 91680336 122114890 154431769 180686170 198695271 207119460
17861 207119460 202436086 193571991 200623259 230725377 274699877 321579657 360473199
17854 360473199 377104321 363626049 330583390 291262578 257106978 243441561 251709311
17847 251709311 266581842 275514678 273878649 254728340 213647963 165621876 129831285
17840 129831285 108421830 95119009 85972115 79461083 74558381 70857866 68013632 65529821
17832 65529821 63194241 61188498 59111681 57190612 55389643 53852374 52837274 51882751
17824 51882751 51332919 51520297 52554494 54318895 57579568 63782418 74654055 89472032
17816 89472032 104243016 115408775 122419527 124341139 118997737 111948483 113731263 127379805
17808 127379805 148996924 173789532 195409186 205425283 201144491 186959322 166001800
17801 166001800 145638848 136440981 138905420 144215622 146821588 144702979 134151294 113024779
17793 113024779 89923520 73773874 63983483 57798243 53304037 50138793 47750509 45939201
17785 45939201 44369365 42900630 41603331 40202726 38614563 37292148 36046094 35109390
17777 35109390 34310136 33967676 33856025 33580797 33031603 32579624 32456000 32463966 32654803 33093162
17767 33093162 33449309 34032268 34530160 35169020 35492136 35791496 36328853 37120493 38131096
17758 38131096 40011668 43165104 47644331 54089838 63751918 79230165 102871912 134830419
17750 134830419 172165917 211129847 248117341 275622480 284989151 277303892 261461455
17743 261461455 242616402 225744706 220626147 231867638 256524759 289899079 326335155
17736 326335155 357524793 379820649 395194285 403634457 400284572 381856343 352943921
17729 352943921 322668935 294782245 270223339 256190123 256740266 267718701 282620878
17722 282620878 292449489 288161815 269427004 242499595 210803726 176022399 144520585
17715 144520585 121399514 106099716 95820479 88186897 82222531 77451429 73555675
17708 73555675 70366551 67381681 64647549 62462077 60581231 58917615 57012154 54997921
17700 54997921 53140919 51060791 48715976 46748642 45247503 43894124 42338009 40923926
17692 40923926 39551434 38796625 37991507 36958888 36059440 35022897 34044392 33107000 32196181
17683 32196181 31625039 30866084 30383865 29928302 29408438 28682912 27751702 26996516 26473403
17674 26473403 26120291 25736159 25319039 25014402 24578857 23931150 23586145 23391536 23104944
17665 23104944 22548677 21811265 21101835 20530680 20079350 19598179 19391184 18989332 18438072
17656 18438072 18356437 18147524 17770061 17149498 16704410 16494966 16212223 16189301 16056233 15606908
17646 15606908 14992323 14462938 14109667 13671312 13342062 13109008 12868596 12671278 12435147
17637 12435147 12461773 12531111 12453798 12506990 12735559 12805841 12886106 12799071 12687620 12683294 12668298
17626 12668298 12609469 12348801 11972001 11991664 12119592 12182753 12090190 11793040 11674321 11575530
17616 11575530 11614294 11426283 11601331 12278559 12733305 13072185 13281889 13364564 13112185 13021414
17606 13021414 12975302 12608812 12109660 11438380 10628844 10035362 9739048 9483397 9436528 9437577
17596 9437577 9234654 8972758 8776451 8699754 8646080 8491753 8269065 8196472 8038156 7577369
17586 7577369 7482182 7276505 7313643 7211061 7265623 7126549 7103379 7018214 6692994 6471273
17576 6471273 6499595 6435497 6246940 6167159 5849475 5549285 5669210 5607090 5596363 5431115
17566 5431115 5489798 5333837 4994312 4715682 4781016 4786423 4808014 4469414 4254193 4154683
17556 4154683 4018385 3900996 3921815 3803020 3766810 3840367 3717477 3442481 3390462 3670296
17546 3670296 3789856 3672816 3890791 3965919 3914334 3715088 3548872 3878856 4077622 3843294
17536 3843294 3616775 3832281 3854629 3870112 3891601 3631173 3776961 3986106 4013744 4057124
17526 4057124 4293045 4344467 4451315 4481209 4637743 4794141 5044504 5106161 5158918 5268718
17516 5268718 5345806 5279286 5429748 5512385 5715731 5746236 5545967 5674625 5388234 4972609
17506 4972609 4715677 4355810 4248684 4057857 3746136 3480082 3400139 3183417 3428875 3529013
17496 3529013 3405818 3253125 2888570 2675838 2529566 2554036 2595363 2624758 2499591 2172684
17486 2172684 1928388 1888799 1941820 2120131 2013207 2048304 1814395 1839877 2031744 2106348
17476 2106348 2203342 2303259 2135893 1981297 2242169 2519902 2900360 3068328 3244541 3530288
17466 3530288 3704708 4048959 4330452 4268754 4046810 3606862 3305747 2939491 2922320 2789625
17456 2789625 2625243 2337475 2172830 2222160 2040996 1667798 1647484 1784401 2047447 2275392
17446 2275392 2545938 2806400 2752176 2893454 2942981 3042435 3051023 2956020 2935002 3015367 2815758
17435 2815758 2536185 2437787 2625095 2614145 2623666 2690267 2792831 2492569 2063300 2042988
17425 2042988 2209433 2211663 2088014 2187900 2431551 2622969 2583483 2606249 2761880 2890962
17415 2890962 2956323 2840627 2563668 2130484 2120736 2155777 1989168 1959259 1995234 2108965
17405 2108965 2318373 2575606 2815722 2900428 2950904 2880903 2527862 2280951 1938170 1638097
17395 1638097 1548439 2009567 2156608 2322515 2741845 2762466 2628192 2483057 2185720 1939049
17385 1939049 2120615 2414828 2790787 3239217 3492481 3195579 3254304 3104064 2573776 2216599
17375 2216599 1995543 2015356 2319570 2743270 2830253 2871937 2715603 2786748 2839370 2341929
17365 2341929 1734295 1643365 1462967 1471841 1425224 1257632 1398610 1365699 1462402 1381063 1726435
17354 1726435 1941141 2092583 2254080 2306893 2227534 2076699 1826603 1740048 1949334 1991111
17344 1991111 2139928 2361374 2439514 2417426 2413532 2280153 2028707 2091071 2284331 2478571
17334 2478571 2439048 1974167 1605254 1605403 1558121 1612206 1453852 1593354 1459403 1138169
17324 1138169 1092463 1320905 1411480 1474216 1435039 1393774 1168395 1026285 1068279 1172688
17314 1172688 1132735 1277534 1157063 864938 910347 1068646 1331515 1414693 1558321 1626177
17304 1626177 1863320 2201421 2380048 2404852 2074923 1998034 2055557 2185024 2226103 2251374
17294 2251374 2234614 2057723 1978509 1790279 1773575 1919166 2093086 1992812 1700245 1551027
17284 1551027 1408366 1433056 1567621 1568860 1333846 1109890 971612 1179732 1185223 1165914
17274 1165914 1103483 1057928 1044901 1058270 1061653 928091 850150 945137 1054902 1256285 1227473
17263 1227473 1136130 1248463 1241371 1130454 1239760 1153073 1121073 1355027 1448997 1536995 2041783
17252 2041783 2491430 2611640 2630009 2522924 2484243 2576270 2443892 2485936 2444749 2391416
17242 2391416 2502667 2354278 2531766 3056025 3377447 3496710 3212162 2970188 3092265
17233 3092265 3086872 2907587 2835460 3069820 2855855 3034155 3172808 3253302 3360888 3452650
17223 3452650 3444392 3880822 3884028 3585270 3531524 3532836 3590354 3607335 3807195 4458542 5171127
17212 5171127 5498224 5757573 5815540 6076647 6306534 6401181 6530436 6234104 5664130 5076944
17202 5076944 4624369 4562422 4592983 4905416 4662732 4598031 4569204 4442144 4545964 4913763
17192 4913763 5311678 5927925 6470327 6438205 6487533 6352904 6370987 6275083 5813039 5044565
17182 5044565 4224997 3738090 3383848 3426471 3428910 3328453 3267503 3483946 3553306 3745323
17172 3745323 3785730 3864309 3922583 3691539 3524680 3586037 3939877 4255380 4294152 4441249
17162 4441249 4456915 4258702 4269022 4305310 4247207 4423275 4755951 4858867 4974104 4902305
17152 4902305 4731185 4664474 4864669 5209956 5061136 4949519 4764290 4389317 4142810 4170823
17142 4170823 4266463 4233672 4196300 4114349 4240479 4288228 4426491 4557680 4678178 4923913
17132 4923913 4878244 5030691 5149178 5180148 4875150 4925397 5182449 5391757 5965727 6484430
17122 6484430 6969583 7655306 8340069 9196131 10184658 10859229 11767540 12692377 13491340
17113 13491340 14474974 15654823 16662924 17555552 18263941 19020013 19862753 21491321 23943161
17104 23943161 27039142 30984138 36726933 45323684 59078747 80372310 109031816 139906813
17096 139906813 167190937 187850260 200390357 204551951 209183739 234002578 288573250
17089 288573250 360112976 425770295 475093292 510108866 523380223 511834588 497678510
17082 497678510 495277107 494833517 473976812 418989136 347815568 291988544 263736090
17075 263736090 258366550 264151920 271564346 277125767 279196263 281169877 297704935 337152019
17067 337152019 385449411 427761242 465277448 495079441 498951187 479307255 457913974
17060 457913974 440629219 411407705 349943527 271638649 211854954 177505832 159228856
17053 159228856 150179434 147676624 152016644 164047160 182587248 202120931 217300654
17046 217300654 225585026 225087828 214566720 200487495 194671867 200553566 211578583 220928748
17038 220928748 224923968 220397445 207598942 195274081 193285031 200772827 209990707 215468210
17030 215468210 214268457 204093162 189743866 181691505 184335688 191750150 196736278 195647780
17022 195647780 184732978 161953519 134246186 111336519 96004528 86014605 79372514
17015 79372514 74819705 71089247 67717923 64546966 61660379 59213960 57162433 55580971
17007 55580971 54086833 52628071 50750325 49112563 47567069 46081986 44502412 43114107
16999 43114107 42209696 41093376 39651028 38769382 37505964 36443610 35963525 35213334 34390143
16990 34390143 33664347 32951312 32067388 31112456 30261546 29755109 29320869 29017799 28638870
16981 28638870 28114762 27751437 27445845 27370248 27376179 27066502 26467088 25632726 25062036 24555658
16971 24555658 23989840 23602991 23523296 23831265 24003510 24008413 24324483 24412184 24156473 24115894
16961 24115894 24220855 24081827 23594463 23168964 23094611 23106555 23110066 22733651 21798787 20590351
16951 20590351 19638206 18954551 18321640 17729461 17766415 18110842 18315590 18496073 18558814 18275944
16941 18275944 18026035 18063424 17757040 17255432 16799274 16043808 15681921 15688224 15598533 14933546
16931 14933546 14311569 13857010 13383807 13227623 12932622 12572660 12395607 12259766 11945926
16922 11945926 11535241 11429125 11579175 11648215 11310547 11217210 11273833 11071903 10758282 10767998
16912 10767998 10901865 10798252 10417718 10332674 10704638 10859185 10884284 10895056 10633684 10279470
16902 10279470 9940576 9920704 9827690 9681095 9621010 9737736 9709526 9810601 9366321 8939510
16892 8939510 8667428 8432385 8259578 8465455 8376126 8311398 8770614 9174745 9537393 9915167
16882 9915167 10212012 10256225 10039807 9760980 9845158 10183512 10884548 11641515 12408533 13050273
16872 13050273 13590643 14273773 14639584 14644163 14719042 14972196 15850442 17348802 19291097
16863 19291097 21842610 24182192 26434525 29673910 34494292 41824468 53381763 74963915
16855 74963915 116024425 181179821 249574397 293770095 318238216 328163264 288177720
16848 288177720 201654866 145982650 124157422 123570093 143131992 189127436 254105377
16841 254105377 307236015 335619155 350568675 341196517 269819362 196192933 165233846
16834 165233846 169700514 204596499 254787373 292129257 311140399 320319262 300867864
16827 300867864 229356280 168881433 140848481 132382637 140415187 169794077 219550279
16820 219550279 267605167 294261168 306828888 305186839 255030104 177402765 129338736
16813 129338736 104132310 89537550 80699332 74640319 70258388 66787552 64381894 61860180
16805 61860180 58974575 56208147 53533879 50827744 48217271 46250738 44850164 43730061
16797 43730061 42838609 41996713 41024031 39621804 38181754 36704664 35051501 33575121
16789 33575121 32452980 31506606 30805970 30207124 29968510 29748013 29190869 28414132 27448490
16780 27448490 26216252 25141838 24369491 23707579 22999659 22379504 21966605 21759941 21362873
16771 21362873 20828666 20216474 19448697 19108637 18644320 18131887 17442950 16854523 16473074
16762 16473074 16232041 16229013 16004533 15635689 15144172 14411395 13906671 13580236 13168183 12694465
16752 12694465 12299304 11933848 11648546 11677830 11636858 11490650 11453639 11480787 11037258 10614303
16742 10614303 10271841 10088036 9988668 9899951 9875204 9743719 9818383 9776464 9832406 9418981
16732 9418981 9101329 9144520 9249161 9077838 9230782 9555884 9850208 10076872 10251882 9929136
16722 9929136 9251007 8460086 8054686 7963638 7834439 8017998 8426411 8654247 8792112 9270418
16712 9270418 9277272 8810238 8152212 7639627 7253615 7311675 7442403 7696317 7986289 8114292
16702 8114292 7848549 7437334 7164471 7056873 6962450 6745637 6597507 6535786 6853099 7177691
16692 7177691 7281313 7197621 6470140 5850414 5477385 5212818 4980248 4694238 4639331 4673016
16682 4673016 4507164 4252671 4237390 4144491 4013079 4102825 4150860 3997933 3831483 3730601
16672 3730601 3417480 3208828 3071796 3023020 3267463 3545658 3696262 3764398 3629220 3416359
16662 3416359 3132087 3256765 3201169 3016235 3043981 2945550 2691937 2613455 2534705 2344588
16652 2344588 2405311 2627771 2609939 2627260 2611011 2246254 2115370 2334804 2612140 2526079
16642 2526079 2210490 1889552 1944293 2009411 2125318 2163847 2002053 1805272 1567954 1569492
16632 1569492 1808523 1927508 1918641 1935792 1924821 1920711 1633024 1566789 1522042 1537893 1507039
16621 1507039 1620664 1565338 1446360 1270805 1043873 1013357 1230754 1467149 1653557 1675267
16611 1675267 1712608 1563444 1265409 1171644 1164895 1091467 995207 989473 932308 876384 936180
16600 936180 1375402 1651305 1699504 1639649 1763880 1909635 2026511 1931998 1666118 1382063
16590 1382063 1357420 1403343 1596226 1625347 1538840 1434888 1405645 1362074 1438418 1353949 1577556
16579 1577556 1785564 1861599 1847891 1851609 1918542 1874693 1916917 2085191 1995328 1858744 1668518
16568 1668518 1499623 1590955 1342898 1065133 948777 997911 1086900 1286160 1236098 1092230
16558 1092230 950776 873229 964884 867673 1095980 1117238 1336749 1239379 898219 993850
16548 993850 1207149 1327158 1600767 1723269 1396220 1500022 1328555 1278815 1548434 1742111
16538 1742111 1732977 1695244 2119181 2630763 2971547 3263655 3342428 3391373 3364902 3456373 3323263
16527 3323263 3100798 2845629 2322209 1831762 1828385 1939921 1849531 1603847 1590782 1676588
16517 1676588 1698978 1785285 1863924 1976160 2117315 2376391 2429423 2334908 2272998 2270341 2086301
16506 2086301 1908227 1682237 1513290 1373690 1363234 1359617 1139255 918233 1009951 1245634
16496 1245634 1182052 997696 925107 751073 745818 756383 742491 762959 664022 502758 571898
16485 571898 804230 645801 442607 496131 222220 108464 259642 395372 176841 347091
16475 347091 591815 354630 72259 -15422 124717 121034 166314 302696 513992 509925 353172
16464 353172 439190 425304 435273 394911 519214 531636 242436 183098 386888 256718 318239
16453 318239 233194 248826 162597 121147 146547 187808 323073 308783 210156 183056 226599
16442 226599 193608 304106 177890 -125947 -75748 -9090 -7712 -20119 -147824 -83464 -4322
16431 -4322 126157 -62349 -57160 128212 200293 159780 94739 191837 366974 173014 30243
16420 30243 -198547 55839 244150 390151 428920 371429 290449 385730 263040 404982
16410 404982 596748 478718 297590 464540 585943 623618 450914 244558 161238 315834
16400 315834 249364 234820 -30519 -7273 56442 70072 145729 115121 245399 267019 333949
16389 333949 215637 121923 16840 -37575 5314 261849 296975 353000 471445 466038 440810
16378 440810 528670 372752 121938 -23475 95953 165444 202691 332791 451759 567845
16368 567845 333717 338947 242862 75389 66347 -96397 -99791 -89687 -9199 187654 115594
16357 115594 -52367 47967 -48852 -61302 -62702 -103535 60449 52104 -37764 165277 256559
16346 256559 115280 150750 282524 234558 78884 -61773 -39745 2233 22177 -18901 -316753
16335 -316753 -330823 -54680 -138874 -112217 -195678 -43526 94579 -16631 -254122 -378792
16325 -378792 -377093 -428588 -313358 -117087 29040 59608 212047 144732 -306361 -569618
16315 -569618 -230793 -371859 -383717 -1665 -130816 -184304 -114432 -288548 -180465 -68869
16305 -68869 96134 89906 68964 270948 206573 -6756 174716 344968 831847 1209473
16295 1209473 1538663 1731548 1434133 990210 887180 872871 1136755 1339036 1291950 1179006
16285 1179006 1346898 1712073 2119546 2096973 1590035 1132786 1201567 1362702 1507859 1747908
16275 1747908 2077302 2009650 1855013 1936102 1627402 1122018 767064 496205 619909 955610
16265 955610 1480134 1680919 1682522 1989753 2070695 1645563 914226 499409 400307 299828
16255 299828 521155 578141 748446 752608 464202 235076 2050 -50382 73399 192089
16245 192089 433051 410202 509074 547985 457424 599652 631101 430700 431124 444974 244196
16234 244196 -48067 -106684 80700 186567 141693 215559 94602 2546 15814 58394 90363
16223 90363 -115344 -95353 46389 111418 70692 -8693 237163 308791 303333 1331 -132415
16212 -132415 -246987 -401918 -523429 -492994 -350027 -364252 16189 384215 440789 462222
16202 462222 271782 108369 127044 173062 119634 -172488 -325579 -206060 -42872 180958
16192 180958 230212 -37255 -59240 99451 262536 60876 -53161 -133632 -138937 -140177 -254281
16181 -254281 -430703 -534219 -258737 24407 191966 179451 248166 56053 -13835 -17070
16171 -17070 208967 159249 -67997 -147103 4199 197108 415039 373152 254308 280464
16161 280464 177492 38776 121065 176840 310496 302147 309615 691521 597996 563939 349683
16150 349683 117222 -59579 -269104 -334115 -62011 337913 54358 -74754 235837 330438
16140 330438 305554 182551 34737 -72287 -163474 36370 269440 3912 -50832 -177812
16130 -177812 -329449 -289865 -79622 -232472 -243939 -377534 -670941 -458939 -251007 -370669
16120 -370669 -427203 -470009 -507816 -376066 -209747 -100652 -364227 -514817 -576490 -521223
16110 -521223 -474695 -324624 -222011 -261532 -308543 -386862 -492885 -489656 -127948 11339 111348
16099 111348 -27806 -175707 -155769 147218 184799 170278 26036 -50906 47195 -9504 9191
16088 9191 117764 -31038 -127270 -119854 -101090 -69717 -27809 -170356 -55312 -128782 -91318
16077 -91318 -230235 -378342 -345332 -253694 -238682 -31659 -98833 -255527 -209722 -162559 -183580
16066 -183580 -460291 -392984 -242851 -216658 -243091 -96933 156770 -18029 -115870 -25875
16056 -25875 36578 58216 164673 143630 -165900 -261309 -124979 -112600 30098 -8598 -260815
16045 -260815 -217593 -109346 19777 181485 79116 17202 79385 -125103 97389 156668
16035 156668 -6605 -156572 -12109 92456 135053 196071 308531 111205 -80050 101335
16025 101335 237406 417448 159835 -94591 -101996 -351998 -454447 -374572 -287242 -157173
16015 -157173 97368 182962 165449 144390 241630 167844 17756 65314 72445 149606 196156
16004 196156 46221 -89997 -61942 90707 -25035 91744 104306 6371 -223017 -179252
15994 -179252 -28221 -236140 -240692 -175901 3365 -43757 37293 -60453 -186236 -248723 48255
15983 48255 265934 353828 144026 2573 150131 150289 13349 183959 335085 251780 247477
15972 247477 233375 180291 369429 190111 -152690 -99257 -3611 131647 78885 -23653
15962 -23653 -192511 -158546 -263667 -271701 -206738 -149674 -100936 -300045 -284772 -24158 -109876
15951 -109876 -267469 -252425 -214701 -279471 -293308 -297859 -318652 -243424 -58421 -159397 -328070
15940 -328070 -351595 -382777 -352348 -68826 -137215 -149188 -119341 -299397 -418928 -245302 -428789
15929 -428789 -306703 162286 246151 360443 388842 338802 352055 -41972 -134002 -67845 41734
15918 41734 345046 541930 357055 205846 203853 369765 432522 295344 174345 265560
15908 265560 403348 207602 106013 -42001 -76056 65307 133362 55672 103597 59582
15898 59582 78244 -80159 -104166 -102189 -249504 -101821 56376 12650 -314042 -319927 -319917 -369251
15886 -369251 -404675 -499267 -382361 -127945 -64123 -73925 75656 134740 32649 -88896 -16426
15875 -16426 -8560 -57629 -78409 169930 225368 152099 334086 387410 192148 248653 273994
15864 273994 322932 334407 101770 8192 -56513 -107472 -38193 89250 174617 54013 68484
15853 68484 -5171 142692 179860 198773 -4373 107934 436468 532309 292594 220115 56760
15842 56760 163683 168070 -146600 -310646 -208497 -133281 -4307 45288 -5879 -88415 -186129
15831 -186129 -47219 88008 199307 255485 377288 198171 102014 -89384 -152569 -153845
15821 -153845 -125651 -57349 176429 121413 95802 267962 201992 270288 183449 149037 7163
15810 7163 -25768 49077 62631 -189220 -168651 -98337 49497 147747 153058 -160521 -376380
15799 -376380 -411749 -296400 -281751 -236523 -19861 171743 104797 7470 3915 43616 -22942
15788 -22942 -32030 57691 10515 -51425 -78586 -36355 -178818 -146892 -355373 -471595 -550309
15777 -550309 -440296 -191511 -70436 -5424 56959 157739 -119684 -237796 -327180 -371618
15767 -371618 -142656 79151 50377 -6176 -73008 -21028 -119463 -181149 93931 180350 -142581
15756 -142581 -317689 -169195 -54378 42748 -11401 -212431 -300830 -230584 38800 307714
15746 307714 362666 291725 280245 144409 -303879 -339059 -242977 -160344 -124188 -241945 -129432
15735 -129432 35221 -48179 -90739 -143950 -282562 -343814 -296683 -267515 -400003 -378289 -215395
15724 -215395 97102 340408 204879 86815 141064 214383 476407 607935 173907 -294867
15714 -294867 -176689 64447 192327 259050 -181404 -55694 162211 213498 90984 -75758
15704 -75758 -31797 -24799 21347 -56266 80606 71262 -10082 -7274 -88716 102597 67517 117752
15692 117752 42315 -120006 -226546 -111060 53066 158951 63603 -331680 -384654 -463715
15682 -463715 -687461 -641522 -307782 -61259 14481 120325 176201 27171 41034 -29271
15672 -29271 93685 255461 482554 350008 121951 215451 -19416 -2299 -136324 137267
15662 137267 408881 305340 114110 154 -11443 -26608 41278 -28333 -36696 -132877 3462
15651 3462 -156752 -308316 -193044 -202615 -262166 -296328 -249274 28751 32244 97700 147108
15640 147108 236693 189016 43373 -31813 -239623 -492671 -538053 -446613 -49742 106330
15630 106330 -184413 -360306 -281241 -289427 -229174 83284 142795 135789 89585 -63463 19463
15619 19463 31147 -78754 -105453 -35813 -23568 -12386 55455 110606 98660 115801 130387
15608 130387 61563 119592 422288 431991 505442 470987 172754 46208 143977 327683 385797
15597 385797 448656 244832 -152254 -356956 -577634 -506634 -304423 -135116 -261785 -406820
15587 -406820 -57674 -44410 -232743 -40885 100342 157859 19809 -1600 232231 461857
15577 461857 389448 28420 -166441 -86244 72156 224001 -16711 175665 254539 403356
15567 403356 263874 181573 -20722 -296594 22308 420698 359129 193614 213427 284644
15557 284644 332759 43739 -84023 184238 190357 68094 -204752 -276605 -61565 -55288 -317109
15546 -317109 -497163 -547153 -442054 -256359 -97036 214492 217391 -33943 -14065 -81981
15536 -81981 -440951 -439691 -435441 -535652 -186204 -147918 -249032 -210633 81535 26829 14315
15525 14315 42387 361599 263253 139494 -7147 -72546 5733 188715 228457 417374 558617
15514 558617 494471 349248 112135 -177714 -83675 -47933 -78191 -159248 -70041 62182 85332
15503 85332 95183 157107 27633 -92889 -101870 -308992 -135173 -83978 95310 215730 252028
15492 252028 211953 164205 36908 -163840 39342 79697 40573 149600 40585 118089
15482 118089 233253 42668 -191404 -347116 -307857 -271435 -63281 175952 342931 391346
15472 391346 246632 114172 33812 -113886 -302512 -103856 122714 -42152 65385 90362
15462 90362 -59150 -161270 -145307 -212836 -56565 39596 123758 112452 244500 321595 83579
15451 83579 78051 200825 112990 -99189 -110334 -108548 -124125 -91579 100374 271214 -120936
15440 -120936 -529271 -497225 -170578 -4053 -5190 -88554 -340927 -399453 -162957 140427
15430 140427 210163 286635 68885 28470 -156448 -187931 -273012 -281467 -178218 -244864 -378445
15419 -378445 -7887 79886 -197005 -297398 -259110 -230757 -59958 -130890 -95276 -30089 763
15408 763 -159178 -235144 -333555 -292825 -312541 -75417 -60519 -217311 -256650 -229613 -218534
15397 -218534 -246921 -128729 -172410 -36278 29950 28657 -512 74230 321989 286707 231119
15386 231119 137495 -44170 -493318 -309631 -80511 -177767 -128669 -80339 -109748 -224910
15376 -224910 -435613 -486935 -476644 -575868 -467883 -265975 -195477 14793 45878 151400
15366 151400 -63445 -84821 -20377 6366 126964 199897 375561 295335 184037 118941 24601
15355 24601 -31208 -288847 -165042 87866 290414 157922 138824 114815 -121284 -459715
15345 -459715 -429209 -244437 -123439 -151739 97625 119886 -103473 -75025 80943 190866
15335 190866 125754 -40554 -2276 116111 248540 294236 135416 52241 352089 413975
15325 413975 145596 -89673 -103543 46299 -12795 9229 55350 -120641 -109487 -47636 -22560
15314 -22560 125149 -72238 -292026 -407012 3276 317767 339340 20652 -225102 -176805
15304 -176805 -330426 -372835 -194189 190166 292633 79899 -12736 -208392 -280667 -297273
15294 -297273 -440743 -219867 -23994 -160831 -547718 -538204 -352185 -329950 -270814 -140565
15284 -140565 -337658 -444320 -506491 -441020 -247743 -53761 -196635 -331468 -171386 -72412
15274 -72412 -228082 -139440 137789 167386 36005 -51584 -164084 -262333 -71676 -23599 64843
15263 64843 -14318 -97053 48858 7586 -192605 -79400 121686 153295 215386 491335 395317
15252 395317 39315 -19486 -3961 -117729 -236123 -233253 140981 423727 475912 220306
15242 220306 3245 74125 289739 379077 505430 422262 222928 -46861 -118098 -310645
15232 -310645 -332194 -80205 4931 -1444 -19230 5907 25329 -201627 -338123 -84845 -173658
15221 -173658 -284494 -203375 -169743 -93825 55420 -51526 -251839 -119498 -42393 -95630
15211 -95630 3008 88176 -7412 -208475 -395703 -198821 -16407 -31314 -48046 -190183 -11267
15200 -11267 200846 227608 -16197 152169 473341 418346 74626 -16985 141469 -1903
15190 -1903 -316699 -180877 -112062 -81544 -69229 -50167 18039 150981 185046 86415 198563
15179 198563 100093 136026 29905 -58559 28361 77051 203519 160661 190392 209468 181511
15168 181511 123941 -170876 -358053 -311713 -153825 -136906 -268658 -125781 90190 -41234
15158 -41234 -130120 -354197 -475223 -553883 -352804 -246321 -399583 -572291 -432095 -301097
15148 -301097 -31310 250376 276970 130989 -71422 -93980 71809 -23107 -115804 -248955
15138 -248955 -316051 -70094 -162702 -215152 -287298 -126725 -19310 -15482 -164294 -186904 -313663
15127 -313663 -407727 -115476 7978 -55168 20942 117415 -76659 -207816 -242962 -69337
15117 -69337 84682 374901 200871 72017 67100 130199 116910 16910 9969 182763 134540
15106 134540 43181 151304 -26580 -167149 -22189 25346 -53278 -63019 -121286 -348948 -450135
15095 -450135 -157239 -194450 -270484 -154173 -44362 -68966 42325 -61614 -192918 -348242
15085 -348242 -229148 -324194 -246933 -274484 -419691 -514751 -273423 -9156 -43961 -40782 29303
15074 29303 -130950 -241654 -313396 -531397 -501818 -229400 106222 90047 57173 48801 47787
15063 47787 -181084 -236611 -239122 -301734 -324764 -490331 -476979 -266571 -100493 -164699 -116358
15052 -116358 -167368 -422265 -343574 -216390 -306137 -181258 -313649 -299518 -26593 53121
15042 53121 38629 389663 357269 199523 -65101 6607 164705 153063 -38054 -75298 -118281
15031 -118281 -166589 -266173 -394144 -315264 132146 166013 139644 114315 129666 92194 189831
15020 189831 169149 14184 207491 200344 -95256 -303944 -297666 -64836 91813 -220447
15010 -220447 -425269 -451772 -315555 -113784 3324 19284 -48743 -93264 77219 191769
15000 191769 187631 2849 150535 180799 284888 299766 198527 218364 192962 -46125 -58815
14989 -58815 124203 207981 227729 279609 220559 81576 178310 458800 211192 151991 329042
14978 329042 303031 329058 356653 271578 199039 -25925 -27253 8436 -9803 36874 47418
14967 47418 -12241 -131644 -152240 -127471 -235555 -176970 -283863 -438712 -402132 -145503 4880
14956 4880 -98146 -263776 -451394 -357518 -243106 -69709 -51125 -10108 182775 158387 6144
14945 6144 61424 -55297 -131637 74132 122518 131353 158892 166942 252744 446579 186498
14934 186498 12759 197598 31739 -29594 154290 102858 216464 197178 360215 334018
14924 334018 -23297 -263851 -93049 164873 212302 96780 76161 63034 188844 167767
14914 167767 -15212 -288520 -346109 -362490 -274205 -210955 -209875 -164415 -12463 131791 235677
14903 235677 338394 432800 348810 24320 52479 -3802 -116320 -155860 56759 51258 39155
14892 39155 37958 -215466 -291559 -474857 -354454 -291425 -340522 -188547 -121982 -317740 -260836
14881 -260836 69287 103488 20953 -182028 124841 250630 22653 -7581 95370 -118528
14871 -118528 -196643 -120185 -195569 -351585 -609227 -567034 -373065 -393657 -423556 -244440 -447346
14860 -447346 -510630 -267746 -66683 -50048 39812 247411 141172 -166028 -330132 -521419
14850 -521419 -561196 -285143 -170869 -128688 2171 130427 -34799 -105977 -214669 -270120
14840 -270120 8787 363986 418792 157884 189240 70630 -227382 -312585 -87999 118139
14830 118139 -25839 182059 48841 107382 244324 134318 -120458 -204375 -571963 -521384
14820 -521384 -307041 -233610 -230362 -252304 -139881 -173073 -240431 -236654 -251351 -204328 21525
14809 21525 83127 -275139 -284988 -167284 184209 392528 408748 314733 310992 116361 38969
14798 38969 -42793 52256 117001 253480 272479 232174 238684 352886 237180 158551 38561
14787 38561 -103571 -55331 -32075 -18797 214166 237514 232818 391064 202239 -89453 -208331
14776 -208331 -29612 53590 92330 254818 335770 323762 82988 -144421 -199834 -225692 -356260
14765 -356260 -421121 -591847 -593873 -541523 -387128 -338233 -498027 -412664 -226402 51396 189934
14754 189934 61381 11883 -17966 -155477 -324514 -136722 25007 137772 132640 -3844
14744 -3844 -107052 164126 120762 -31980 29047 142302 280883 61365 -87678 -175941
14734 -175941 -231227 -334397 -326218 -150661 -1312 78710 90554 -77943 -108826 -30181 21163
14723 21163 268912 254267 40520 -139309 -149636 127214 188071 167100 344454 395169 219918
14712 219918 -77544 -134051 -156666 -20490 -181487 -296078 -157023 -10549 -145817 -141540
14702 -141540 -11119 135659 81043 157992 150500 59462 -229375 -482807 -559187 -599634 -511143
14691 -511143 -444105 -387018 -345337 -29241 12493 -24837 -6868 -126305 33524 251377 199034
14680 199034 160411 240388 117006 -94961 -223555 -360642 -155922 22783 -71444 -161401
14670 -161401 -83714 132167 7427 -37076 105432 112101 22170 -215039 -431561 -603875
14660 -603875 -280814 -104674 -80279 -199504 -171393 -293338 -334517 -540526 -179690 1483
14650 1483 115064 -26386 -101156 96400 210597 50420 -136990 -84307 -219107 -24018
14640 -24018 6635 -109360 -181223 -125497 54262 367646 542367 437947 113677 154803
14630 154803 237076 557651 686219 578589 449900 424658 175345 -94198 -187553 -146657
14620 -146657 34086 296556 393378 144187 71135 121736 114526 38869 -33260 -270543 -324199
14609 -324199 -347185 -233400 10124 172664 179847 205718 131366 -2221 -111070 -142690 -114912
14598 -114912 -121645 -112533 -27674 -76439 -180542 -140603 74805 350067 748540 709077 462766
14587 462766 624072 556159 578051 359158 240990 185485 226531 206460 150715 -38117 -14815
14576 -14815 -124431 2453 78603 55191 123319 212478 145523 127643 272325 612961 295037
14565 295037 -12715 -149109 -65498 119198 101210 241589 115677 181948 107629 -10850
14555 -10850 -23009 -97640 -83406 107949 260324 210667 113558 152163 -36611 -191884 107203
14544 107203 212770 77212 -81676 -125867 -50065 37050 -26789 -156085 -131873 -126499 -13516
14533 -13516 -24861 -307129 -406803 -378128 -185583 33595 93387 127816 44491 -185214 -251834
14522 -251834 -161684 46469 237017 232173 6642 -24236 41845 -42303 7609 100964 41468
14511 41468 -97869 -107516 -176843 -333467 -398950 -225593 -144872 49087 12904 -339519 -505253
14500 -505253 -621703 -700577 -447285 -440626 -585545 -368648 -211296 -249271 -444214 -196715
14490 -196715 -48880 2239 -61980 -86480 -60548 -44303 106644 42732 -7529 224172 300521
14479 300521 272346 108500 -8147 -89155 -159992 -133421 -57221 25040 91316 -151542 -199035
14468 -199035 -449509 -415708 -370076 -3740 163958 145438 -86609 -202954 -160187 -51946
14458 -51946 161158 190108 84219 143946 124489 250090 144311 12856 93127 -212929
14448 -212929 -350636 -281615 -274486 -85210 -128677 -208815 -209583 -275151 -158022 -123247 -154833
14437 -154833 -197511 -15285 557737 416616 166233 68033 96456 20768 13485 -90558 -293675
14426 -293675 -338351 -311049 -150924 -150170 -321751 -176993 -139995 -84252 -162055 -228990 -303117
14415 -303117 -393840 -177684 -78978 -421529 -369422 -325674 -285075 -178330 -18884 -71147 -216910
14404 -216910 -197802 -76408 -185613 -300583 -640752 -594723 -387998 -24356 -11758 -108613
14394 -108613 179144 256339 33214 -65275 -402350 -433620 -303854 -165639 -118525 -133068
14384 -133068 -362090 -153060 -119635 -167229 -99374 -334111 -436629 -361352 -151627 22850
14374 22850 -94006 -209569 -122608 -62146 -269501 -66036 -177603 -449871 -447957 -187905
14364 -187905 -311532 -281373 -96327 -49348 -169982 -90853 116205 155680 159478 307596 330854
14353 330854 260487 -169824 -130591 80204 -171112 -466788 -367043 56955 172129 -85900
14343 -85900 -258248 -332944 -167261 94485 135585 287575 362498 115101 -78328 -129411
14333 -129411 -159170 -99233 -62722 46664 298294 159523 21255 119387 -52008 -103021
14323 -103021 -268897 -188186 74635 225122 231070 87746 99416 73771 192792 259755 337353
14312 337353 171862 154463 221620 257695 237320 30334 82774 -70414 -217132 -248218 -273713
14301 -273713 -203777 -150290 -114845 -153061 -137766 -33966 22724 75956 -158308 -174840 -366270
14290 -366270 -340122 -54477 145594 -9054 -143932 -43125 -178334 -603001 -595722 -486076
14280 -486076 -432065 -336961 -218942 -153130 -146499 5123 89563 77429 -241238 246127 370266
14269 370266 403851 145784 100271 62070 -53702 -205137 -2924 279062 112865 -260712
14259 -260712 -274577 -69336 -131444 -269317 -445661 -241200 -81443 -17440 -22519 -410340
14249 -410340 -635075 -557461 -381062 -299866 -253247 -185038 -161789 -192582 -164694 -125588 -132311
14238 -132311 -176663 -49785 231871 215931 48868 -65337 -7569 225871 333939 233654
14228 233654 201853 245009 260038 -52860 -85231 -38418 120318 115680 107776 53828 -212206
14217 -212206 -232764 -209199 10501 201713 410460 262198 107919 94573 -80214 100965
14207 100965 319023 251211 118374 366581 391571 189127 209954 105167 79300 244313
14197 244313 329850 221660 119950 77453 78316 104526 313457 146462 -169425 -146682 -148070
14186 -148070 -250523 208410 299659 151559 -83487 -217930 -52462 179254 291297 88298
14176 88298 24311 22807 -49952 -174522 -149946 -92786 -128190 65144 67268 -229152 -398382
14165 -398382 -355243 -291889 -216964 37553 -112967 -313717 -441018 -462881 -129168 -19621
14155 -19621 61314 380628 449378 243820 236032 396160 311823 322369 214593 51973 74355
14144 74355 174911 208396 10484 -123353 -174246 -65594 140487 268239 145652 -74251
14134 -74251 -140511 -128742 69069 103486 50928 -89615 -134172 -268907 -383628 -458725 -434213
14123 -434213 -343463 -248591 -357086 -226826 121149 241143 30622 -210369 121046 326306
14113 326306 294502 -7802 -146027 224257 334414 436042 255118 132844 -157224 -515674
14103 -515674 -492363 -359677 -447044 -295162 -155390 -200565 -179091 -276 -13912 297403
14093 297403 311593 290644 256921 201530 321486 516640 607384 648223 743163 528567 324355
14082 324355 247366 178975 217316 327437 332845 186350 107728 226991 234550 178478 288957
14071 288957 156349 288013 484389 310830 519056 601421 500485 119051 202618 157705
14061 157705 228068 432918 250429 -11292 -271081 -310609 -146532 146485 262914 -32123
14051 -32123 -76440 51030 215528 -4224 97338 215124 117801 19126 -12332 75173 308987
14040 308987 671178 550619 639927 654476 473243 309153 43473 -8612 42296 11789
14030 11789 171874 276383 155649 -91976 -200227 92918 149086 156211 188172 172112 100637
14019 100637 94903 91854 39621 -168460 -275991 -109430 43720 191213 258834 420262 137210
14008 137210 -73153 -151041 35297 -1017 46653 267529 263711 -5387 -326502 -305316 -149698
13997 -149698 -44501 77596 178272 366032 504663 224797 -109604 -103050 -8114 -115344
13987 -115344 -13969 -143269 -48322 127986 168041 161826 189222 186505 16440 138292 453417
13976 453417 485815 416900 280228 239642 200734 -135001 -155472 -204301 -36428 164564 5668
13965 5668 -268766 -156669 -162466 -234293 -267282 -26410 66461 160608 322629 127069 -45840
13954 -45840 141752 87790 -115252 -99470 -57486 -25991 -87356 147701 -55980 -48099 -99360
13943 -99360 -351118 -343996 -125458 123975 316770 -28773 -21062 16466 -66886 24939 106063
13932 106063 93632 160875 321067 41709 84999 93650 -39027 140419 244244 256431 390261
13921 390261 226875 54421 8037 -102687 -26261 -98423 -26511 208020 258300 324122 209759
13910 209759 37328 54097 -6565 -82400 -23523 -206829 -283596 -198424 -275788 -377417 -274154
13899 -274154 -201116 -390441 -322190 -407657 -442026 -543575 -267150 10248 154077 -58110
13889 -58110 -23206 -40474 -104337 -433884 -401132 -17645 341702 448326 334109 163351
13879 163351 179077 131405 189165 441458 621086 425639 481021 253704 60849 -93558
13869 -93558 -149898 -164552 75836 132298 210527 228392 283433 77207 -90972 -32886 -39405
13858 -39405 85386 198668 104218 111926 88958 -17253 -132994 -156613 10911 100941 -128934
13847 -128934 -222812 -205659 -254198 -46281 108381 269498 272994 116019 89694 208904 317952
13836 317952 164275 117123 45414 158977 9753 -149253 5926 82867 -54831 -61088
13826 -61088 172243 13741 -95156 -303517 -411449 -321460 -273401 -398761 -385039 -528695
13816 -528695 -547384 -311155 -31818 35104 4555 133681 68225 -69281 -124008 71536
13806 71536 31436 -186403 -39335 211725 403593 199576 106387 -11446 113776 319974
13796 319974 2038 -217718 -66461 119100 330777 313789 -4641 -409671 -297189 -19616
13786 -19616 117376 -329071 -400440 -76116 -18806 -147283 -98775 88376 -87910 -98118
13776 -98118 -35597 216407 145285 108924 137340 243220 394842 515237 496917 331191 195614
13765 195614 125726 14790 -5507 208398 324772 315869 70965 46935 -66893 -39863 172915
13754 172915 2439 -96741 -141791 -129585 -255938 -641425 -583625 -198108 137579 198
13744 198 -406561 -329569 -242799 -212143 -247817 -281331 -29989 32555 67205 -77103 40200
13733 40200 17990 110826 476910 614367 380741 296774 206695 149512 69341 -105660 -167864
13722 -167864 -18461 30728 -40193 -128592 -73910 137910 85107 117700 -43704 107942 361138
13711 361138 353212 300477 277411 152259 96334 -25472 -179767 -20640 -26474 -353394 -394493
13700 -394493 -219088 -26993 -31678 -29860 108025 231604 420209 432880 557906 440779
13690 440779 354083 432066 141792 213643 197251 59770 20997 33003 -64583 -82630 -58002
13679 -58002 -159435 -169377 -166998 25519 143378 209981 199697 183423 -130034 -77056 197488
13668 197488 285843 53719 -7148 141660 141392 29155 -96246 -79980 107989 309604 398924
13657 398924 349934 129653 151682 15915 -115441 -328784 -253115 44884 -67659 -26792
13647 -26792 271922 203002 116683 -80320 -141487 -92097 -132540 -91460 358475 243172 -133179
13636 -133179 -98856 -183127 86021 -95756 -246188 -114171 -195938 -295139 24034 44914
13626 44914 -154421 -183442 -168043 122521 49303 197642 284823 177975 208604 249183 -69669
13615 -69669 -267761 -57423 312505 520635 394745 302758 187597 137853 193035 144606
13605 144606 -7785 -47140 -25291 -29018 -54239 84400 257638 154630 272479 339213 248407
13594 248407 67142 209309 493565 468236 345339 298138 313419 -39177 -197673 -194595
13584 -194595 -72374 139590 -19288 -63488 -87550 -206541 -328965 -261485 104999 420304
13574 420304 488331 762547 858141 525558 304998 239320 39076 6080 95621 170625 -154617
13563 -154617 -51061 282605 344075 401516 180562 -49278 119822 251305 311783 373567
13553 373567 432044 455434 216895 49267 48328 92751 357926 427459 92232 30730 178964
13542 178964 352983 435158 374859 404709 200422 59630 126686 -45086 99328 195168
13532 195168 330707 279143 252069 -88714 -193901 219712 338128 215190 61269 -29066
13522 -29066 180065 334829 328284 409244 356670 124904 123913 70427 18575 166307 174889 250946
13510 250946 422600 322986 82817 51887 24555 373962 566763 425455 291347 115994
13500 115994 94757 -166967 -258506 42329 103959 -83084 109707 234802 294341 396467
13490 396467 345313 536128 374873 213036 138656 165530 433234 396684 161008 175297
13480 175297 349701 199523 89418 63127 243498 423286 454915 472231 520648 440628
13470 440628 419883 302171 470785 745483 536232 273056 266796 112200 -96891 -37523
13460 -37523 157219 142289 11208 -144860 -131527 343912 140591 -138498 -69832 255424
13450 255424 462444 541530 461417 220411 322447 279192 131429 -88013 -152580 -34491
13440 -34491 63642 -685 -47413 -68285 -13825 135307 288787 318451 189240 146088 11324
13429 11324 49216 132571 232003 416340 356900 220858 80921 -27573 43115 -110066 -90799
13418 -90799 189216 345087 235203 92086 21473 -322300 -320268 -230039 -131755 11674 241783
13407 241783 223012 251080 401628 76971 -172769 -18602 181734 131589 187555 301986
13397 301986 474423 582993 476709 149448 83303 243358 -59078 -54021 322004 317510
13387 317510 267451 181263 108124 -67897 85246 11621 -68863 -149616 -30643 230475 266277
13376 266277 267427 518003 642424 762019 762177 706202 473831 474847 456626 394558 294169
13365 294169 82552 71713 116407 71651 20354 156601 237690 233615 -63465 -262598 -77180
13354 -77180 120503 152234 425440 311990 -74821 -117368 -4535 300474 327715 168519
13344 168519 4718 65603 286461 242631 365561 206589 82593 -78071 -12018 155668
13334 155668 -22081 -30741 155344 163569 382732 498180 442998 443931 369312 280874 244967
13323 244967 232762 279956 194870 84200 132756 372690 288310 151602 282212 425248
13313 425248 565737 684149 468048 149926 48033 93117 359982 290102 322273 434918
13303 434918 387608 389843 233207 227127 199773 418981 608058 578350 447128 431520 384097
13292 384097 442772 150138 -42767 -92070 121048 406035 449219 502728 309748 1746
13282 1746 126555 557107 542060 696462 659404 565496 330989 449255 492923 687013 558843
13271 558843 391549 293433 268431 49491 -56995 17275 312888 332664 236203 264743 320371
13260 320371 497319 539360 628625 407893 -21862 118520 27648 124279 251010 293448
13250 293448 393160 428936 324768 138979 -148460 -166186 106620 376303 518695 470434
13240 470434 462874 389753 375343 328424 397437 142842 134631 193571 152180 467012 790883
13229 790883 722453 320918 391369 476551 560735 597410 541877 426243 525890 550951 597348
13218 597348 454837 395642 452317 497265 617482 944373 821195 448944 379923 396823
13208 396823 316462 431363 443428 495916 565793 652430 851455 790380 628787 594449 475037
13197 475037 415545 392058 291237 263427 65577 87629 197336 265159 544002 353805
13187 353805 271191 308174 358319 444141 616663 748645 588626 550888 745428 809952 614751
13176 614751 449537 355617 449478 484268 512918 1044707 971584 625187 628366 375975 316806
13165 316806 571102 353862 127823 233460 249680 571055 683483 552262 722971 717351
13155 717351 688736 762374 815693 747242 276027 19549 357721 655903 862509 811341
13145 811341 612602 722967 502813 282188 501433 747930 736742 642407 545307 706267
13135 706267 615196 367869 267448 242358 350502 442610 258086 321278 457881 338165
13125 338165 318667 595308 864018 1002823 787780 702145 687433 788799 864116 681132
13115 681132 450062 506154 567181 641140 714130 520402 630037 354721 534068 815910
13105 815910 717403 597639 682435 629202 680380 792517 727734 659180 612126 476180 645617
13094 645617 891042 794643 605432 659279 433072 325937 558419 587509 699722 771356
13084 771356 593229 300320 484972 701852 870038 769365 655228 616773 640449 826604
13074 826604 928730 961674 1105334 1065199 794847 494240 513911 735733 748747 607989
13064 607989 592608 549218 427428 323149 336755 313550 310398 455797 682358 732450 907018
13053 907018 770775 416414 558059 566984 701296 736536 676051 683473 755884 1039091 1078592
13042 1078592 938688 878172 645722 614268 531373 736937 1112281 1105311 968221 1052738
13032 1052738 1131288 1065994 1211993 1349988 1040564 671576 415302 558002 571625 575155
13022 575155 705632 1158766 1292775 987998 1071645 1182432 998755 742672 705862 571727
13012 571727 509837 793173 913680 834165 754095 779452 898497 765325 828594 881129 983602
13001 983602 1103687 1004703 986140 1208721 1276324 1165491 1095064 1093002 939121 723412 757548
12990 757548 827120 1015235 1201619 1202047 985626 941717 945633 999928 966029 990367 995614 735124
12978 735124 816528 1058681 1239676 1259407 1321754 1375252 1206642 1004987 925673 954792 948474
12967 948474 1005748 1026414 1264825 1213729 1022525 982623 868634 894274 1043624 1027233 1186545
12956 1186545 1532239 1461206 1197098 1396039 1458286 1281958 1222300 1334818 1204489 1062068
12946 1062068 1036792 1050902 926082 755874 615150 702663 810162 878539 1144586 1398063
12936 1398063 1422935 1415681 1343222 1226701 1390861 1512588 1544742 1323488 1205433 1391846
12926 1391846 1424315 1739191 1964420 1953207 2047994 2016037 1755086 1684335 1698554 1646447 1474823
12915 1474823 1335301 1235970 1511857 1622310 1559290 1599702 1453374 1431076 1360360 1741090
12905 1741090 1646567 1715651 1833155 1964506 1980899 1818176 1670911 1747543 1934912 2033330
12895 2033330 2014101 1736426 1789393 1929803 1988286 2135661 2079355 1902883 1805507 1922938
12885 1922938 1793295 1813484 1851909 1869628 1769921 1686593 1676833 1721022 1591984 1438622 1548148
12874 1548148 1720172 1944121 1742673 1734725 1676708 1793854 1747691 1906184 2011815 1764058
12864 1764058 1771306 1699103 1844579 1841677 1801300 1654876 1483944 1304578 1354685 1468163 1691892
12853 1691892 1721639 1966900 2071339 2110414 2069613 2118131 2098188 1826289 1810762 2075840
12843 2075840 2038676 2012071 1888598 1695161 1949496 2023748 1777604 1734718 1747816 2016765
12833 2016765 2437566 2501543 2400368 2280629 2189448 2061096 1913764 2325444 2411262 2271021
12823 2271021 2057413 2168945 2164454 2261729 2155414 2235916 1928849 2111406 2406819 2433667
12813 2433667 2329899 2311503 2423364 2590637 2729143 2822409 2753119 2739038 2709766 2554137
12803 2554137 2531417 2554963 2557379 2527043 2676547 2688875 2744535 2775552 2675194 2757072 2885328
12792 2885328 2933485 3035058 2950594 2810127 2677781 2565305 2765741 3076201 3166685 3279582
12782 3279582 3172342 3086314 3051933 3023434 3086839 3105980 2916859 3091225 3060858 2804503
12772 2804503 2739760 2732020 2850850 2966883 2960600 2932439 3284747 3602952 3509005 3498188 3483025
12761 3483025 3289435 3078060 3192861 3217222 3292505 3657756 3856236 3736189 3622096 3435687
12751 3435687 3581646 3791919 4178936 4299193 4305824 4292223 4372461 4533394 4392234 4366875
12741 4366875 4260181 4566146 5212246 5682570 6512087 7184525 7732320 8024275 7922354
12732 7922354 7759758 7084697 6217067 5633739 5535837 5408417 5205106 4781098 4719434 4788654
12722 4788654 4942475 5096488 5130946 4906507 4806592 5005871 5038495 5107133 5250623 5431470
12712 5431470 5569156 5706965 5577783 5283824 5390724 5229298 5377192 5565450 5485897 5522981
12702 5522981 5555853 5594089 5678698 5714358 5617225 5621645 5908074 5804798 5628432 5601850 5989274
12691 5989274 6265397 6168282 6152942 6281183 6458794 6807092 6873565 6816992 6660261 6749111
12681 6749111 6887500 6902452 6872442 6947851 7163178 7145181 7028072 7127974 7164930 7264488 7322880
12670 7322880 7311681 7315653 7428305 7794354 7855297 7731765 7552515 7685899 7818147 8095403
12660 8095403 8447584 8504681 8205347 8523164 8722553 8894744 8934504 8919680 9030604 9299375
12650 9299375 9741760 9821860 9573562 9642395 9894608 10200520 10288783 10296997 10175923 10308791
12640 10308791 10550302 10730273 11029712 11220102 11347269 11324829 11524725 11810071 12021427
12631 12021427 12300344 12749057 12788314 12859990 13105432 13292084 13535171 13729136 13712832 13919294
12621 13919294 14087079 14286696 14339906 14460026 14728976 15279262 15586543 15714376 16180050
12612 16180050 16589460 16717275 16778977 16869248 17165942 17512230 17711390 17981991 17968942 18213374
12602 18213374 18509669 18605305 18690185 18970873 19277872 19615970 19888354 20263986 20428282 20650126
12592 20650126 20948609 21251733 21863890 22245189 22642418 22964777 23102707 23195989 23591042
12583 23591042 24090672 24371146 24565223 24736497 25357102 26025598 26411691 26991583 27611824
12574 27611824 28120889 28267239 28992118 29922018 30451944 30914730 31628046 32224813 32711260
12565 32711260 33493253 34361937 34912647 35416341 36006882 36845404 38020881 38992621 39922030
12556 39922030 40809785 41734404 42806935 44015717 45068432 45980420 47029816 48185423
12548 48185423 49555971 50908705 52322296 53748188 55164292 56467592 57687889 59290187
12540 59290187 61139732 62560081 64083270 66029550 67840719 70187176 72241256 74520132
12532 74520132 76943816 79051462 81366424 84005871 86599121 89273960 92080577 94995908
12524 94995908 97827757 101163581 104557095 108043945 111501734 115306977 119331216 123395138
12516 123395138 127496811 131652120 135983169 140173370 144488584 149240374 154329329 159274764
12508 159274764 164168980 169299164 174585301 179956246 185079875 190229487 195564380 201156372
12500 201156372 206464506 211287615 215894695 220493253 224939810 229354385 233724659 237237050
12492 237237050 240235852 243351267 246100211 248453090 249986128 251025963 251655910 251860867
12484 251860867 251820350 251171155 249955830 248386053 246719113 244662989 242047020 239005987
12476 239005987 235733921 232386149 228695393 224772956 220619752 216361239 212126608 207692892
12468 207692892 203382160 199261600 194973702 190627890 186308924 182002817 177579242 173478961
12460 173478961 169867148 166036386 161968598 157797706 153778611 150112728 146575087 143050340
12452 143050340 139461928 136086587 133025299 129922163 126753343 123772029 120821275 117975538
12444 117975538 115401969 112944294 110422906 107718482 105061071 102852516 100465883 98256576
12436 98256576 96159712 94072262 92099711 90181906 88330677 86465451 84391240 82798457
12428 82798457 81141096 79623579 77961643 76088413 74411217 72913963 71325183 69874475
12420 69874475 68435338 67070751 65948702 64742291 63683421 62604418 61454892 60568381
12412 60568381 59426719 58220197 56984122 55639410 54666718 53801824 52697927 51740935
12404 51740935 50729070 49754090 48828316 48109687 47419823 46743735 46056521 45318148 44808356
12395 44808356 43924185 43161385 42486664 41780567 40988232 40524637 39993661 39579860 39050299
12386 39050299 38357325 37761721 37325899 36789375 36170545 35754575 35215711 34767785 34239195
12377 34239195 33708905 33227758 32693376 32341277 31954360 31596314 31388243 31128510 30753831
12368 30753831 30156695 29648041 29140825 28666091 28419695 28203235 27938440 27703280 27268161
12359 27268161 26749014 26337479 25848542 25341477 24980876 24647496 24438743 24352628 24166908
12350 24166908 23794928 23312755 23170564 23108667 23084482 22608370 22370319 21938613 21528584 21179225
12340 21179225 20930134 20731408 20369439 19929094 19647556 19635219 19596191 19267465 18873353 18758249
12330 18758249 18453683 17808278 17416384 17435911 17217823 16643569 16350710 16239536 16359260
12321 16359260 16313474 16081400 15780670 15437366 14922993 14792186 14846744 14947065 14793603 14428293
12311 14428293 13836739 13601447 13466649 13161263 12800597 12668690 12679373 12655839 12517651 12524087
12301 12524087 12343298 12193278 12412598 12467560 12319905 11887451 11617917 11426745 11338208 11061495
12291 11061495 10729541 10648916 10477632 10569994 10557964 10594069 10318653 9963760 9960055 10176217
12281 10176217 10036434 9665947 9386758 9482837 9798832 9712217 9463584 9276506 8952301 8840052
12271 8840052 8901275 8887895 8849457 8461654 8178128 8215092 8170382 8177166 8280519 8420758 8367790
12260 8367790 8364595 7991100 7869814 7739761 7518031 7444977 7523038 7345744 7067857 6867928
12250 6867928 6831474 6857370 6970801 7115421 7108650 7190699 7190659 7546110 7699149 8081286 8619064
12239 8619064 8959307 9312116 9583461 9559436 9062465 8407788 7811489 7237781 6948361 6812211
12229 6812211 6411005 6256695 6210571 6172472 5931267 5839976 5971676 5879009 5694783 5801245
12219 5801245 5778604 5744027 5725187 5528897 5663917 5698648 5466345 5332695 5268487 5090854
12209 5090854 5334812 5306144 4841894 4580941 4480308 4434708 4361353 4276639 4422709 4630302
12199 4630302 4451024 4388955 4400043 4236939 4042631 4076566 4161314 4180391 4322098 4397816
12189 4397816 4526278 4629570 4520335 4217286 4032339 3944371 3954841 3763823 3640064 3828799
12179 3828799 3798768 3621741 3525805 3449105 3609770 3608787 3554995 3485286 3548859 3620172 3702925
12168 3702925 3606505 3506804 3409357 3303155 3150563 3262440 3363988 3167944 2917531 2854823
12158 2854823 2889765 2916362 2822877 2792697 3004497 3126957 3292583 3237387 3196338 3145032 3088729
12147 3088729 2859622 2617325 2569080 2840276 2969238 2909140 2668236 2556795 2685695 2563728
12137 2563728 2763660 2907733 2897188 2570559 2441747 2235517 2395274 2567549 2505797 2504137
12127 2504137 2622400 2522967 2374659 2435859 2533003 2464081 2461835 2485337 2369823 2230300 2297994
12116 2297994 2436980 2489400 2409606 2351182 2274501 2210760 2152879 2032720 2046820 2055842 2084931
12105 2084931 2177128 2183354 2114270 1972598 2061960 2199704 2241057 2094250 2138070 1957555 1856851
12094 1856851 1916068 1734771 1539024 1469636 1624663 1641816 1783085 1903465 2021431 2134912
12084 2134912 2229831 1954835 1831643 1924887 2121092 2101190 1834546 1791279 1697145 1707507
12074 1707507 1738838 1800939 1951996 1861808 1991509 1873387 1725374 1751197 1593504 1690826
12064 1690826 1456442 1467642 1490226 1395346 1540951 1386126 1130851 1053258 1093375 1216292
12054 1216292 1385572 1264414 1355302 1356327 1472119 1611422 1470710 1367773 1229227 1174725
12044 1174725 1348416 1410296 1125527 1048937 1009465 1116011 1074573 1335585 1320726 1500298
12034 1500298 1472845 1324476 1370947 1284675 1145332 1164689 1381884 1402515 1355254 1329631 1114006
12023 1114006 1006598 1203083 1519160 1671776 1727953 1803409 1617533 1416081 1420089 1219558
12013 1219558 876648 921201 1307218 1409608 1272181 1302448 1612195 1606269 1288382 1216096
12003 1216096 1099917 1064513 960476 775727 661066 794669 826965 915489 943791 988740
11993 988740 1073375 1101181 1205873 1267965 1573305 1551678 1331706 1163270 1021491 886994
11983 886994 757738 872183 786990 659039 522457 476438 781537 1009436 1171769 1328422
11973 1328422 1232715 1213357 1072734 1043880 1250347 1354146 1009531 785663 645444 629715
11963 629715 654816 870346 826243 890247 830451 1074290 800850 545099 683010 797628
11953 797628 708820 543231 580303 644546 756432 633311 844598 944687 982453 1058292
11943 1058292 977249 1017120 1101194 793953 906387 1137851 973763 744660 813168 936311
11933 936311 992743 981146 914058 891133 819903 659927 828749 850521 655956 591054 568354
11922 568354 845938 815765 694308 621746 569685 357974 595337 653256 529948 428347
11912 428347 583818 862501 992216 910590 792150 596126 476145 562404 560593 591682
11902 591682 538747 433934 510705 534678 568052 621094 402973 339658 379597 739444 858033
11891 858033 847987 764147 576720 562820 545565 560662 764739 757801 556786 347312 221820
11880 221820 80065 43344 122327 213926 341100 653925 856784 924954 777380 622509
11870 622509 605676 606127 705183 532653 176853 80540 99929 318765 509493 639911 601690
11859 601690 826325 843013 994550 1268176 1140487 815024 673679 389162 240677 444858
11849 444858 440590 485203 722862 837510 731887 488105 478527 245820 316580 168012 109004
11838 109004 182676 71743 -68003 -26569 33324 189944 402639 407775 563162 641834 505063
11827 505063 550303 423198 230480 113208 265823 529380 644822 481855 291382 376825
11817 376825 286328 138690 109744 158603 202476 253198 227976 358206 537429 687818 644954
11806 644954 819804 641360 539538 652071 823116 600806 297880 470315 464823 553674
11796 553674 426463 638736 839867 802026 411466 296238 217214 312741 573943 790409
11786 790409 741121 395387 354184 311119 406101 388944 315710 53860 65097 169768 377437
11775 377437 537595 517353 520086 817284 928960 745499 495722 126275 -115856 225487
11765 225487 448355 508468 417438 337738 278706 232247 177365 360668 429895 343765 283852
11754 283852 237672 400622 340585 338189 554265 541368 439894 462667 439514 709014 692046
11743 692046 688522 636942 576651 660484 471403 302848 363584 397485 286140 265937 257404
11732 257404 275038 462237 613673 516269 591602 528949 329351 154235 171125 255159 324652
11721 324652 267346 200921 304627 354360 515391 409748 173533 168973 319365 310226 345607
11710 345607 572423 788232 444749 326494 327410 132229 69268 161530 485840 450797 257819
11699 257819 233227 143213 303906 483615 433327 126334 266116 296545 195687 233066
11689 233066 427757 466851 415750 211861 207579 177931 99032 -2006 208960 361962 136858
11678 136858 346011 426919 581344 562578 356712 581864 714152 672276 535910 343162
11668 343162 438106 543263 413541 364800 266768 246126 262689 157817 281605 319239 338152
11657 338152 152571 -97633 -140168 -220400 -247410 184628 612774 685889 615606 299200
11647 299200 -50120 233247 422864 446958 407907 502526 305554 425809 360857 285569
11637 285569 292475 385903 322897 245728 261988 187133 92757 -72482 -131312 32559 108151
11626 108151 34601 31279 51188 46066 147880 252640 199306 224491 163088 230728 141882
11615 141882 -69416 21378 -44428 124569 320520 445847 548072 328741 175432 80947
11605 80947 -53195 20062 138144 109070 232668 483040 531852 368619 676166 883225
11595 883225 864018 848670 672012 474751 420199 635705 675120 557600 470661 361294
11585 361294 84242 -134981 -105270 -278147 -326920 -68233 347714 507673 488747 478414
11575 478414 341504 326790 326629 270192 407296 424801 215827 39314 37331 212336 348178
11564 348178 446262 519113 623670 553891 510050 551736 687629 542179 120686 -56502
11554 -56502 8083 221963 249449 271892 267649 397488 489185 328524 225501 322832 436647
11543 436647 267913 314798 526633 442248 264649 322318 250450 210156 87233 232411
11533 232411 241044 52197 200212 412999 522568 521916 433705 103921 90707 221700 272160
11522 272160 326409 91755 32807 189356 70104 239335 288740 307411 49233 -210831
11512 -210831 -290345 -151024 136657 115741 68248 66337 147216 169282 336793 380053 100080
11501 100080 -33630 -67009 -134139 88523 223523 372486 405985 192237 250795 261392
11491 261392 74314 17252 38759 197514 431819 300368 488203 505410 654643 613272
11481 613272 228695 22333 71934 89544 52020 -288669 -345663 -235891 27330 301405
11471 301405 257538 217601 84091 -49458 -153962 -210074 -130436 131170 -8288 -229377
11461 -229377 -205454 165849 259746 88592 262795 430849 451807 441018 309616 171171
11451 171171 188461 153349 185268 107033 -86845 87903 104523 -170083 -167795 85691 354016
11440 354016 479010 274235 -132490 -143144 10344 31743 -45452 -184991 -374222 -204513
11430 -204513 22912 152267 195038 189354 356988 283214 383228 397789 199162 -8105
11420 -8105 -54150 -110117 -97314 -52189 17619 61508 122798 57577 180616 49489 68413
11409 68413 118687 372521 64979 -80333 48226 73453 -61478 -158296 -84172 -135521 88966
11398 88966 163897 221265 219727 -65724 199675 329702 435675 667112 471131 35456
11388 35456 313575 170846 -114174 -187406 -63485 -190942 -193700 -76874 -133793 -52150 74901
11377 74901 44972 89861 -47366 19047 -52329 -177317 20546 166490 319514 207285
11367 207285 179479 261007 273929 322900 304135 90134 -180109 -126282 -55600 -82511 -53930
11356 -53930 231835 455590 674808 468396 273799 333068 176369 348131 296116 424581
11346 424581 399715 11291 -13611 15054 -271203 -592604 -423453 -428398 -484555 -471680 -132559
11335 -132559 52254 21013 24947 78970 143869 218383 148613 220179 -112933 -35854 22482
11324 22482 32998 -55594 -157509 76182 389806 442664 506483 380065 222587 306472 615637
11313 615637 449881 167025 125435 123577 335125 292702 294950 110175 -62170 -208745 -245044
11302 -245044 -421127 -382327 -111347 52675 132740 182314 114655 -13164 96848 344089
11292 344089 450405 374723 200558 316312 309987 164992 58687 97046 34359 -160380
11282 -160380 -247273 -111708 -198076 -116050 225157 124277 132647 315393 333567 107807 -34450
11271 -34450 32829 51611 155381 61669 -236501 -447975 -143109 174124 256382 145349
11261 145349 235565 443763 529596 193439 -286901 -440542 -606406 -633387 -541930 -313654
11251 -313654 155616 418245 681135 538504 103573 127399 127755 215658 214220 20508 -183988
11240 -183988 -413997 -534315 -415663 -12594 84418 16539 -171072 -119290 -67828 -55887
11230 -55887 -227813 -44013 58208 145488 299742 332609 232916 44625 -17778 129800
11220 129800 74256 -22985 -34151 -300937 -340162 -135676 152597 115516 154575 343968 321139
11209 321139 209027 59147 -49469 -27846 -22338 21435 69915 68075 84293 404783 476405
11198 476405 357413 440330 294624 273180 -44731 -155973 -133044 -144982 -142758 -80900 -80479
11187 -80479 -141820 -380834 -442434 -531905 -296603 -309593 -268719 -209866 -62545 -40335 -6724
11176 -6724 281384 339321 290192 240015 272109 275318 294740 291786 127981 43647 47201 55636
11164 55636 -208148 -179911 -57178 74258 47266 -138891 -529562 -793670 -819086 -563445
11154 -563445 -266550 -123018 -25769 22559 49086 277154 401836 428339 14308 -159017
11144 -159017 -121247 -67552 -148607 -84858 -231890 -111228 88902 61640 -127185 -276851
11134 -276851 -388130 -488286 -318751 -229905 -161484 -227378 7116 186516 88867 -72542
11124 -72542 12280 103911 111693 2270 -40239 206543 372292 215817 541507 454828 215114
11113 215114 242127 -303390 -395812 -148970 -15862 31670 37263 11819 -286918 -207191 -141642
11102 -141642 -113921 -192577 -231571 -295454 -366877 -218644 10907 -21168 79596 145369 45464
11091 45464 -96839 -65762 -282419 -54519 144626 208267 340166 511789 459477 502678
11081 502678 388289 191084 -103646 -344557 -609682 -527431 -470327 -351307 -146119 -137930
11071 -137930 -36242 82130 70065 -136159 -171382 -311758 -463292 -512733 -434277 51121
11061 51121 38019 -219940 -198075 -109265 154547 17734 -194571 -61420 -39403 -85900 -198041
11050 -198041 -258827 -311081 -150917 217050 227162 123852 114559 68466 -103285 -127044 -262367
11039 -262367 -204330 -52068 -312899 -521664 -538509 -284768 -43060 12521 -36791 33108
11029 33108 -71379 -166117 -264655 -37208 100044 -66634 -84939 -148129 -173294 -901 215118
11018 215118 276369 104765 44677 -6102 -104985 -98751 -129153 -239505 -101032 139116 161360
11007 161360 -120263 -193016 -91912 35527 46805 50571 6488 -321404 -311704 -41252 270413
10996 270413 114348 94513 211672 215793 225887 241113 44989 -173925 -202716 -233809 116433
10985 116433 322756 137478 135298 -17483 -76781 38303 247819 435574 504269 477784
10975 477784 124207 41463 5762 25997 -146494 -143870 -351775 -430537 -262605 -31896 -86059
10964 -86059 -157468 -118426 -229336 -116688 -25680 -196112 -328934 -315143 -394678 -421090 -165989
10953 -165989 -136398 -183135 82826 151678 -35622 -244078 -131212 -132984 -311554 -436606
10943 -436606 -189363 -72814 -60784 -253904 -158371 9211 99155 -8944 -41436 -249911
10933 -249911 -154504 147199 366748 55871 92279 17188 -55340 -3568 -141867 -267417
10923 -267417 -53696 97604 64517 70483 167101 233771 189112 103410 38079 17719 -140461
10912 -140461 -297037 -93423 7157 -24205 2348 -218840 -243319 -43171 22659 -39545
10902 -39545 -40517 -118187 -168458 66803 218260 257658 -11121 -296159 -456333 -189182 121912
10891 121912 186900 224739 319017 377063 319417 51280 67150 -26151 112912 -107547 -62794
10880 -62794 -193285 -237255 -230547 -8963 69449 27323 -18731 -266162 -148986 -151114 -55329
10869 -55329 -98594 -213079 -321445 -253898 -411046 -407117 -362672 -506927 -288670 -57162 209749
10858 209749 2860 55618 22203 71570 45197 -99777 -144303 -128604 -295265 -78803 355788
10847 355788 432711 321668 115794 -110753 -311605 -282483 -291387 -187802 -49752 -147807
10837 -147807 -176951 -84423 -49134 -124579 -189416 -139874 140028 95124 86669 130540 -6287
10826 -6287 -260816 -393265 -338550 -232315 -189815 -167189 -66993 10442 -180769 -236117 -111043
10815 -111043 -125087 -174879 -96506 -32342 5853 -190464 -199455 -144609 31178 406369 473574
10804 473574 184992 -15261 -10050 -177258 -257590 -298118 -453237 -312090 -46532 38252
10794 38252 93023 170936 196017 41603 -37888 21059 240012 172300 40759 57082 -15659
10783 -15659 172438 39845 -340388 -171928 -24126 18937 161878 217247 46440 -136562
10773 -136562 39305 -100166 -379463 -396897 -122209 87037 -66079 169838 182673 31219
10763 31219 -87832 -245403 -96155 75024 169988 -5894 -132158 -395255 -75688 3555
10753 3555 124747 72989 125789 143475 -25264 -70609 -56317 -225532 -241993 -160832 -94022
10742 -94022 -28619 16622 85229 89237 -119530 -295404 -262747 -246150 -24337 -342 170500
10731 170500 223044 45466 -66980 -114875 -135792 -204406 -156801 -18526 -901 37011 -99848
10720 -99848 -61843 200978 -126111 -549459 -546680 -157588 30372 90843 86205 199077 158832
10709 158832 -195138 -235221 48832 -86535 -87009 -190650 42718 99531 -85900 -91210 27901
10698 27901 28663 76676 44467 104627 234557 303361 215047 91434 796 24624 76700 -16876
10686 -16876 -5485 -2861 47857 -39266 -24887 -76001 -73445 -12595 50009 -12366 212488 101767
10674 101767 49864 -28533 -258420 -320136 -136246 150073 81609 40918 124951 287098 186114
10663 186114 103538 81317 -62898 -41663 28674 -36699 1234 23495 -1046 103354 42059
10652 42059 -203134 -14701 204913 181027 -115973 -181510 -153423 -119542 -118559 -57386 72328
10641 72328 14318 -203030 -299656 -268224 -194490 -145483 136392 42398 73589 -12800 -158862
10630 -158862 -232227 -84947 -141029 -156619 -129303 -149546 -280969 -227876 -96271 -45633 -149465
10619 -149465 -175248 135688 238791 10610 -36335 -1306 94866 165099 62442 -21398 -5442
10608 -5442 -82384 -85051 -164775 -134985 107379 20778 -165409 -77245 91026 196313 53901
10597 53901 -405668 -329114 21592 135683 84599 -19146 19998 59847 181768 120458 250963
10586 250963 384407 195388 272719 415905 613798 559569 305615 96282 -56346 37855
10576 37855 183584 89749 -20217 -52731 30863 45410 -20014 -251590 -229331 89263 120862
10565 120862 267585 240133 155758 229620 422064 515826 269502 79961 137244 396436
10555 396436 363988 107529 64992 -86147 -182487 -111415 -137616 -171950 -228234 -237675 -104286
10544 -104286 261023 272520 83219 -73805 -57262 -94508 345090 504327 168315 55939
10534 55939 190757 227896 87599 -22066 159626 261698 -7598 -138608 -118478 -198689
10524 -198689 -69726 -91483 -188618 -261116 -192370 52188 186521 439057 285206 204979
10514 204979 29205 137593 274295 415964 552891 417222 52592 -194939 -83948 11763
10504 11763 221836 434126 155601 -165302 -214085 -158942 -87886 98737 222271 173963
10494 173963 9970 -136807 16612 177832 153474 -184644 -222609 -33854 45780 184539
10484 184539 281796 23608 -57717 -115240 -23386 -13941 -171348 -201386 -361347 -452010 -28465
10473 -28465 89194 242982 252990 260104 121022 35967 142900 157016 -8583 123829 -30157
10462 -30157 -215491 -391474 -175996 -167154 24853 243983 340767 421991 422862 257136 284796
10451 284796 476340 253232 -188715 107974 428218 202880 -30351 -221633 35229 57430
10441 57430 83822 132000 -34524 -121699 -139758 16101 -52588 -145620 -279371 -205614 -91217
10430 -91217 -43509 12448 -10934 7271 135150 141881 -77316 -229398 -229202 -91800 95733
10419 95733 346595 384946 434426 666727 863953 1375686 1924826 2224027 2438363 2315839
10409 2315839 2141908 2003634 2013043 2111575 2156910 1986419 1991009 1982793 1955015 1897640 1607369
10398 1607369 1509145 1591060 1228601 829322 553128 570336 424359 139753 365513 593052
10388 593052 880643 887373 857429 774695 710796 545434 634354 703809 522597 611334 454564
10377 454564 210127 162002 180232 124662 194089 306382 364419 426734 246521 231946 170424
10366 170424 21097 378001 420022 406354 458768 516626 380196 206143 337199 493258
10356 493258 558458 519845 367969 338125 255487 259269 151005 -339 -143593 -130021 -32408
10345 -32408 -117083 -37208 -8190 109250 229103 73270 -113800 -495184 -633543 -508299
10335 -508299 -370045 -358952 -102519 70802 -31122 53150 91736 -159903 -336951 -223943
10325 -223943 18551 37532 -207413 -380425 -231950 -125011 -100755 26372 -58276 -17911
10315 -17911 303928 3835 -46855 -112052 -176961 -323698 -164295 117253 301695 134833
10305 134833 292922 294690 267931 225462 10695 -205921 -61398 177219 214354 295250 364429
10294 364429 70010 -205651 -276535 -150267 -52100 154404 168662 315245 366723 260500
10284 260500 119113 34785 -65157 -229455 -452931 -501886 -521456 -348547 -173462 -200345
10274 -200345 -362671 -503789 -467113 -453136 -498867 -593752 -575714 -260833 114868 90410 108219
10263 108219 -10840 29848 -48863 -258801 -147213 41211 182125 227187 217673 309199 270660
10252 270660 345699 219854 74415 -170575 -244631 -79072 121856 322502 294870 318203
10242 318203 235337 44814 -129698 -366795 -466642 -706394 -643077 -395917 33401 104920
10232 104920 87256 -6661 -320442 -148020 -125744 -46469 283727 446288 384955 287280 122378
10221 122378 78361 44007 22351 -30986 31593 -52885 -384278 -616841 -419527 -405472 -494249
10210 -494249 -209892 -156392 -269906 -164158 -82098 -68005 -249083 -39179 152128 219844
10200 219844 209356 49880 11789 50271 201659 216064 191809 -6599 -53590 29869 67973
10189 67973 25944 -96126 -238464 -343340 -303240 -46092 161745 4973 -71234 -277398
10179 -277398 -470168 -309657 -183670 -115322 -50778 169929 -6779 -390894 -172801 -22607
10169 -22607 7599 218042 -70531 -212211 -253527 -100378 -127173 -361769 -470580 -328230
10159 -328230 -92222 -106665 -193543 -109497 -173711 -324082 -450811 -332566 177326 312263
10149 312263 95297 54219 292050 103376 79166 11272 -57831 242185 320702 1459
10139 1459 117884 255724 275936 398238 615572 689087 783881 751312 858892 648231 213443
10128 213443 -42718 -204564 -226521 -135656 -4621 29613 133478 104141 -72287 -5167
10118 -5167 224357 315979 448600 164550 -29258 -2244 20436 97559 -36990 -148417 -44720
10107 -44720 37153 193750 496098 521999 280228 115761 -113973 -307843 -211026 61763
10097 61763 -108008 -223018 -183462 -149359 -36093 64307 -33414 -140705 -48431 -5453 -197807
10086 -197807 -163176 -94267 11861 34691 -194340 -322454 -292652 -424026 -294698 -55135
10076 -55135 -17801 75982 298387 388303 410190 426246 380194 131429 99117 132764 106604
10065 106604 -61408 109818 374854 91181 -67929 -19162 123339 1689 -164105 8810
10055 8810 67366 99494 147387 -60622 -26939 -79450 -237788 -96047 69190 139227 182364
10044 182364 194844 134855 76735 96166 -103607 -50486 39944 -199412 -470850 -414214 -514562
10033 -514562 -416832 -393731 -170726 8313 -163768 -284060 -196639 -150891 -19884 6848
10023 6848 -71648 -44694 -109254 12906 68857 65931 -13449 -21741 7869 94099 -231723 -494589
10011 -494589 -362185 -132914 8948 4234 2280 22772 -177509 -108402 10829 181966 339610
10000 339610 144791 16802 212866 78276 -120848 -262972 -271421 -352716 -549584 -388376
9990 -388376 -1003 -70086 -494037 -418926 -248228 -131144 -184811 -75316 -140856 -276652
9980 -276652 -374851 -401307 -233687 -58264 -17459 -240294 -508728 -421624 -327287 -318748 -73556
9969 -73556 -93060 -8330 -201737 -334414 -103267 -12554 75403 15644 156885 365954 109770
9958 109770 -79951 -226957 -207467 -283266 -490907 -412568 -476828 -366785 -402845 -183433 -65675
9947 -65675 82094 151796 15213 -142451 -223723 -333379 -512843 -586727 -646593 -694879 -592091
9936 -592091 -667372 -498020 -199988 -66959 9234 53960 13472 -30716 51860 64004 10971
9925 10971 -126745 -123505 42674 104469 -30588 -226123 -176197 -185950 -370463 -261545 -345575
9914 -345575 -342749 -340564 -267848 -382985 -438066 -136640 -122818 -42967 143845 157066 -149150
9903 -149150 -206713 90489 126080 29317 -228999 -278257 -71770 212519 32516 -234364
9893 -234364 -248792 -127101 -109850 52913 156258 279598 288753 202994 162883 157968 190121
9882 190121 80930 64670 105082 17299 25915 177675 318782 192696 -82954 -139308 -46442
9871 -46442 66962 -110382 -140190 -176682 -248919 -288931 -236854 -93302 30701 150718 220940
9860 220940 295639 343004 407239 211167 103414 119160 92632 24510 -178723 -281704 -434479
9849 -434479 -476827 -565919 -389947 -184171 81930 34720 -133461 -253934 -405323 -532232
9839 -532232 -708473 -719224 -638531 -267482 -270705 -401654 -462301 -328070 -10286 -141307 -145378
9828 -145378 -395229 -333634 -247396 -423716 -325638 -112696 105210 155111 91057 -179879 -302887
9817 -302887 -465962 -689835 -580526 -458877 -130828 -155978 -126229 35595 201738 245914
9807 245914 358539 120110 -54950 -182092 -267792 -239439 -195169 -99514 91943 189203 337183
9796 337183 488006 473581 359461 -85517 -90897 -116873 -35026 102253 46353 -79241 83081
9785 83081 228913 28981 -254164 -98190 160957 329754 239095 30071 71801 108760
9775 108760 281640 472229 380828 171058 194439 89845 85758 105598 359876 228978 -138136
9764 -138136 -130726 8620 153002 206913 117150 -10780 67177 -71238 -22047 65802 1193
9753 1193 -75928 -185063 -59456 227045 871 -250852 -181643 24108 77657 128875 244901
9742 244901 259030 349643 496408 677913 568406 194114 114431 123664 -54500 -15420 204406
9731 204406 332120 254471 250385 262679 235228 10720 96501 -88226 -250701 -187455 35794
9720 35794 95672 93726 14225 78826 -8399 65694 88731 158935 143189 247856 106386 3014
9708 3014 -212372 82462 162030 125408 128027 -60991 -99256 -110751 -188989 -343120 -276206
9697 -276206 -139779 -41231 191995 178534 -81841 -6112 -165943 -574255 -577988 -322293 -178665
9686 -178665 -140214 41326 13410 22974 313 27359 43698 -191780 -41305 260383 331933
9675 331933 175316 -19030 -191228 -117519 241978 208597 122445 -99645 -334072 -140990
9665 -140990 84613 101445 -58334 2829 194030 137223 85401 56529 -23908 -194742 -182037
9654 -182037 -156896 -24313 159370 229604 193407 142222 300870 184266 244981 528674 495870
9643 495870 269732 85715 49192 207270 141433 -107044 -234352 -244334 -306797 -266800 -388504
9632 -388504 -297329 34489 17261 111748 51588 -312221 -347430 -482995 -404346 -415497 -260191
9621 -260191 -426176 -419522 -376417 -108941 4130 70521 219902 22238 -6080 -47423 -5535
9610 -5535 114230 473384 578127 456835 185687 37115 -25976 -208009 -171170 -205866 -413641
9599 -413641 6604 164059 181912 27002 -27280 -35204 -10727 44029 -103252 -268593 -363853
9588 -363853 -234544 -183222 -198487 19999 -4622 -64186 -187298 -192279 -128727 -83485 -134794
9577 -134794 -96726 -307749 -216023 -29303 309642 274704 208171 182562 10555 51925 -8209
9566 -8209 100114 233750 156311 -36481 102518 95942 -22508 -152764 -261530 -213193 -306778
9555 -306778 -211610 7455 -65846 -87068 -134881 -192328 -439235 -485845 -269904 -292138 -199810
9544 -199810 -90623 6566 59872 -65499 -245311 -357499 -361843 -245610 -232122 -340393 -165910
9533 -165910 -141314 -34741 178257 125883 23635 -14391 -75638 -88984 67624 104015 -109285
9522 -109285 -118515 -50224 -196588 -416688 -165423 -14799 -66868 -123557 -49747 201198 264890
9511 264890 236107 197918 -39725 -49740 -125765 36085 115152 236103 282397 89359 117101
9500 117101 168401 93297 -44368 -28169 -238003 -120354 -49043 -42970 -151738 -280913 -225857
9489 -225857 -126810 52535 -113313 -266365 -284467 -316405 -267964 -12322 71118 91142 -22758
9478 -22758 -187451 76020 285513 -99357 -202995 -479353 -322373 -328641 -501102 -338300
9468 -338300 -339338 -160509 57027 71147 -225462 -283800 -88657 -1468 75770 -128878 -250333
9457 -250333 -299693 -338273 -506467 -492921 -468789 -260131 -6723 42912 261668 346957 362814
9446 362814 200937 -1570 -86152 -152252 -183909 -12102 8666 -137362 -210619 -286398 -240887
9435 -240887 -127748 -24366 35769 165114 94178 -120325 -207227 -158604 -107259 144690 332379
9424 332379 395163 382321 177565 254687 204392 44226 -121071 -86530 -27468 -150024 22208
9413 22208 128900 300970 367615 295208 63982 118806 54596 13432 7506 198594 290044
9402 290044 117308 -47414 -119535 -43224 -123740 -96042 50447 -89935 -145627 -91989 164434
9391 164434 175467 206247 159711 135184 215047 48898 -100363 -117300 -98692 -14834 207668
9380 207668 -2529 -53380 -174724 -466095 -527186 -401559 -405131 -368244 -147960 -102390 -202118
9369 -202118 60353 53455 107680 120417 178264 385253 190553 117206 344180 369653 247111
9358 247111 180617 31660 183424 317502 180969 163378 98664 521 -145169 -221588 -115807
9347 -115807 -141127 -310749 -581673 -422817 -473151 -507641 -319402 -156587 47154 110540
9337 110540 74467 124668 -15067 130721 485904 349048 16166 123383 416932 517177
9327 517177 397996 366916 311391 -3771 -284526 2973 24449 138467 142704 135930 84876
9316 84876 -34735 -12112 44293 -86679 -86508 30152 41312 151517 241947 70320 186311
9305 186311 500449 711622 632145 426249 271100 251960 297290 106380 202908 471483
9295 471483 475227 187755 -30045 102896 121652 126457 62251 -123780 -308762 -446394 -232569
9284 -232569 73065 324130 235893 -33838 47545 238739 300912 242670 206895 237569 416942
9273 416942 441132 385997 285070 456718 789585 753826 682385 606495 480107 617986 748693
9262 748693 821684 775770 639629 435928 411389 381051 191711 101336 204305 288374 23021
9251 23021 -8110 187848 199066 383627 459143 231831 54998 79482 270604 503923 347795
9240 347795 226664 416657 384368 389197 625538 811969 1036402 1060045 862860 872816 821627
9229 821627 793642 563307 258581 123898 293349 530672 369742 348747 226587 78529
9219 78529 142417 477914 697033 872036 1053529 983741 1029880 1087485 743008 597415 734707
9208 734707 568133 502551 768787 924704 876395 492193 299316 512402 869621 907435
9198 907435 807466 866271 885207 739274 665688 652156 446579 355482 612099 768237 676258
9187 676258 656335 896316 878872 758247 658365 753894 877630 696733 744749 653675 803618
9176 803618 925787 1012979 928730 650846 538499 594899 544273 753815 799495 938917 898920
9165 898920 870384 769131 982601 1300957 1407263 1500075 1420269 1284300 1235056 1403890
9155 1403890 1466212 1323723 1439095 1086720 1089565 1153141 1006907 900837 967108 949011 1080594
9144 1080594 1101314 1208930 1300564 1390425 1482936 1469401 1332499 1088540 988244 1176908
9134 1176908 1332780 1521892 1758772 1756662 2016299 2087740 2207117 2295514 2587947 2620634
9124 2620634 2539277 2839430 3016141 3190888 3802107 4429321 5123402 5991226 7334929 9442462
9114 9442462 12508554 17666134 26554537 40896119 56129709 65473360 69789900 70391520
9106 70391520 59669632 39529350 26130195 19215273 15464677 13163898 11524782 10498813
9098 10498813 9678671 9129608 8558026 7997873 7567929 7203247 6949287 6546680 6049801
9089 6049801 5840896 5760019 5360083 4925365 4820920 4646241 4511068 4378720 4275367 4486932
9079 4486932 4760464 4867974 4745238 4304039 4163801 4098751 3820829 3606814 3307838 3188574
9069 3188574 3202561 3117719 3014079 3213388 3178432 2960558 3104481 3024482 2935957 2846511 2846996
9058 2846996 2835335 2465977 2224479 2202925 2371121 2396583 2272354 2096005 2082322 2042806
9048 2042806 2111434 2079872 1955327 1952531 1847332 1686587 1416514 1466427 1716019 1835107
9038 1835107 2016428 1988539 1894771 2058971 2184740 2170977 1742921 1504213 1336945 1281608
9028 1281608 1250969 1507999 1381507 1262378 1423478 1409938 1243849 1419830 1591514 1669892
9018 1669892 1448447 1101108 1038444 844583 630390 723235 765837 839345 908914 960283 938062
9007 938062 981003 1205338 1286914 1076628 881768 942502 1188213 1131981 897704 753372
8997 753372 748181 927924 1237204 1259628 1208430 1100161 1147637 1096956 1074190 1181753 1218882
8986 1218882 1266625 1504123 1552079 1270579 773268 797145 1035091 1060788 1024005 1143334
8976 1143334 837556 558091 437238 386547 303682 440414 600349 519212 729047 645577
8966 645577 423966 364381 806621 812743 852736 724605 569259 406574 320160 332747 186739
8955 186739 598784 839691 745882 811955 628968 543443 306129 513927 686603 706338
8945 706338 785166 856089 724911 697936 699052 607613 364683 67418 -57682 52344 40398
8934 40398 -68032 5998 193544 290567 387208 213259 136522 135786 192632 221481 294355 401750
8922 401750 500737 558332 423991 187509 153648 134806 356475 223474 124307 252550 371232
8911 371232 297558 231873 190820 428164 483296 124503 -62029 -185570 -128561 -166230 -41475
8900 -41475 238330 515188 620442 586931 697375 958024 1047951 824208 747993 745363 647242
8889 647242 535556 625962 541247 389490 200935 60995 238406 366298 414607 458932
8879 458932 712800 783849 1007015 760664 581256 576444 712078 687137 954415 818803
8869 818803 599997 440439 614415 598744 441046 632072 688841 872092 1014618 812634
8859 812634 535910 396583 138787 43917 122561 22257 104917 237430 -76422 -61692
8849 -61692 72778 374751 513405 412970 300762 398714 408823 517166 421274 248920
8839 248920 203597 441755 725705 820952 821098 989407 749243 615807 588639 659364 552671
8828 552671 490674 321384 499871 863027 964028 1208982 1372967 1076010 934428 932445
8818 932445 825148 863561 786973 679488 562257 426026 362283 524075 755432 867263
8808 867263 950190 969915 968506 977033 753353 607745 608056 378558 304714 487824 657730
8797 657730 732735 830129 816027 974748 1187260 1006101 983881 1039323 948395 657367 765706
8786 765706 829057 982612 1009841 1028210 1323411 1413500 1537936 1672025 1937882 1924160 1922806
8775 1922806 1932094 1680814 1767447 1625851 1343124 1397733 1440584 1234176 915608 728496
8765 728496 710925 673010 786644 813588 621514 466837 761167 875387 1123836 1243472
8755 1243472 1282961 1148673 826928 829522 1093553 1303835 1464404 1647468 1813155 1948559
8745 1948559 1974695 1756369 1664262 1799836 1766318 1684252 1858351 2042944 2139406 2073019 2118755
8734 2118755 1879952 1613770 1724444 2114138 2136421 2065531 1817388 1676341 1667151 1752977
8724 1752977 1789808 1848320 1774083 1759943 1656817 1554092 1123760 929829 920501 1055755 946203
8713 946203 930060 787269 684507 748505 777324 976881 1171265 1211105 1191669 1294614 1518623
8702 1518623 1516318 1702136 1558328 1447965 1545297 1545484 1577699 1735645 1791091 1799731 1800751 1605891
8690 1605891 1450026 1218551 1212133 1193742 1293756 1493008 1515110 1683380 1666112 1693318 1479239
8679 1479239 1240713 1091378 1114183 1190892 1068488 1023067 1105994 1218799 1188385 1412791
8669 1412791 1273033 1234278 1285590 1158711 1010467 657981 493730 853802 1109809 1230822
8659 1230822 1343458 1431006 1287365 1223260 1170209 1166608 1367129 1541388 1710696 1922010
8649 1922010 1902597 1719544 1454177 1225829 1149276 1012251 1118479 1441264 1678043 1762832
8639 1762832 1791807 1799339 1779393 1687030 1700474 1448524 1195244 1060511 1186325 1080125 1199299
8628 1199299 1481115 1713587 1793837 1706915 1640719 1586208 1540663 1452829 1247215 935693 1180287
8617 1180287 1614609 1705666 1538870 1275691 1299072 1265413 1113753 997279 1070410 1088796
8607 1088796 1110180 1010122 821274 863310 1014776 1021836 1139183 1043678 893199 918798 1051406
8596 1051406 842874 756277 382798 173747 213722 476758 438910 251911 319080 372955
8586 372955 483025 217278 121156 91598 185982 291078 380863 346936 443832 328853 324591
8575 324591 227392 291942 510443 688259 751981 531753 210050 86710 88499 -35908 38071
8564 38071 43983 54362 214154 338516 365227 471648 355303 142200 -118867 -123101 -203129
8553 -203129 62750 157557 90430 28670 91435 242286 239500 449423 624122 715090 532002
8542 532002 359073 368695 396774 337493 271436 463517 420025 345594 445345 307677 169276
8531 169276 187930 298353 -80694 5187 209657 106233 -150306 -333151 -236504 -211134
8521 -211134 -33003 194449 341236 324704 202077 131048 143333 200151 582676 509053 331498
8510 331498 235649 255988 395790 503659 479721 241648 305418 386289 248838 331531 322076
8499 322076 240241 192242 216060 230428 302546 539383 733542 729872 645169 502858 53397
8488 53397 72838 179863 131572 133474 227042 221665 233987 317728 227211 175992 218288 238542
8476 238542 176281 15327 -19450 -45215 107703 113441 302295 198817 59296 218004 397462
8465 397462 422644 432670 340011 119483 53143 92995 89114 363712 105481 -212323 -9076
8454 -9076 196413 91335 -183698 -201282 -116866 -12122 28477 29971 144485 248165 42500
8443 42500 169401 56753 7718 124631 148525 124656 41709 50743 79363 201265 390080
8432 390080 249329 51257 172848 409472 360282 311477 239779 489009 718197 957280
8422 957280 1483068 1842887 1573140 1211437 1049373 904024 722775 715129 792844 697014
8412 697014 686727 869980 725277 640811 669802 781071 884172 627299 560804 563326 389570
8401 389570 94862 -130107 -121573 -184624 -263271 -239099 -272077 -69590 98112 266505 337333
8390 337333 360928 367129 380670 428800 522847 532960 545874 328474 180605 167500 186494
8379 186494 500303 998556 1275436 1162679 1297982 1364247 1584851 1910659 2062852 2168588
8369 2168588 2307196 2587695 2706710 2738860 2770497 2390325 1992691 1805875 1664181 1432214
8359 1432214 1056834 924951 890594 854196 858470 779261 526639 643205 647736 705797 745749
8348 745749 848987 758676 580989 657804 722004 706993 595509 488071 310108 394358 544648
8337 544648 536118 732966 460894 587031 512451 455263 686033 897095 733347 675282 879708
8326 879708 1228177 1376220 1389162 1466415 1673549 2018721 1942941 2028249 2277276 2259668 1882748
8315 1882748 1836429 1875529 1656531 1620087 1552177 1445035 1332567 1294813 935915 950775 1301230
8304 1301230 1299253 1270691 1083362 936363 906515 864610 617722 350491 533988 708050
8294 708050 716659 638766 669528 651061 685493 655998 450827 401416 413447 254816 488364
8283 488364 591904 663691 537252 237143 92729 48325 -77241 48420 338424 581596
8273 581596 597631 483503 402629 299602 340898 742612 1002501 1109120 1200092 1129962 1149401
8262 1149401 937591 685822 508976 563773 540383 647588 779465 750702 929964 925554
8252 925554 845729 882265 859372 1001668 444339 199093 217516 168900 1599 -80543 119941
8241 119941 246424 451853 742449 620242 557895 231815 95878 237600 232401 336116
8231 336116 536574 682621 532297 388496 667455 621276 556087 543368 633998 405384
8221 405384 83419 66680 11854 133457 393696 473962 419926 262466 211429 419756 563462
8210 563462 487707 394077 286092 332067 217233 235536 424326 429324 328095 233635 158592
8199 158592 159686 517455 550199 172234 80408 152009 464916 637528 565800 330435 416186
8188 416186 251715 164795 167287 179550 200729 246592 208724 119282 -1253 -64165 83416
8177 83416 145300 371926 421562 352809 378715 358709 305732 176182 60323 -78856 -46420
$$ [...]
##END NTUPLES=NMR SPECTRUM
##END=
