##TITLE=Analysis number 318423
Compound Code cc 46116
Book Reference 451/127/8
Project Code adrs
Chemist Name evam
##JCAMPDX= 6.0         $$ Bruker NMR JCAMP-DX V2.0
##DATA TYPE= NMR SPECTRUM
##DATA CLASS= NTUPLES
##ORIGIN= Bruker BioSpin GmbH
##OWNER= nmr
$$ XWIN-NMR		Version 3.5
$$ Tue Mar 28 13:58:49 2006 GMT Daylight Time (UT+1h)  MAYBRIDGE\nmr@NMR_250MHZ
##.OBSERVE FREQUENCY= 250.131544655141
##.OBSERVE NUCLEUS= ^1H
##.ACQUISITION MODE= SIMULTANEOUS (DQD)
##.ACQUISITION SCHEME= undefined
##.AVERAGES= 16
##.DIGITISER RES= 18
##SPECTROMETER/DATA SYSTEM= dpx250
##.PULSE SEQUENCE= zg30
##.SOLVENT NAME= CDCl3
##.SHIFT REFERENCE= (INTERNAL, CDCl3, 0, 16.4369)
##AUDIT TRAIL= $$ (NUMBER, WHEN, WHO, WHERE, WHAT)
$$ ##TITLE= Audit trail, XWIN-NMR		Version 3.5
$$ ##JCAMPDX= 5.01
$$ ##ORIGIN= Bruker BioSpin GmbH
$$ ##OWNER= nmr
$$ C:\u/data/dgb/nmr/ADRS/1580/pdata/1/auditp.txt
$$ ##AUDIT TRAIL=  $$ (NUMBER, WHEN, WHO, WHERE, WHAT)
(   1,<2006-03-28 13:58:26.33 +100>,<MAYBRIDGE\nmr>,<NMR_250MHZ>,
      <created by zg, POWCHK disabled, PULCHK disabled
       configuration hash MD5:
       84 BC 41 DB A1 6E 1D 46 DA 25 12 A5 C1 ED C5 3A
       data hash MD5: 64K
       DC 6F 06 9B 65 CF 0F EF FC 88 1F 25 A0 6D 17 31>)
(   2,<2006-03-28 13:58:39.80 +100>,<MAYBRIDGE\nmr>,<NMR_250MHZ>,
      <Start of raw data processing
       ef LB = 0.3 FT_mod = 6 PKNL = 1 SI = 32K 
       data hash MD5: 32K
       B4 36 05 4E D3 6F 3E B7 9F A2 73 72 2A 69 3F A5>)
(   3,<2006-03-28 13:58:41.55 +100>,<MAYBRIDGE\nmr>,<NMR_250MHZ>,
      <apk 
       data hash MD5: 32K
       04 53 11 A6 85 F9 38 81 69 6A 82 03 A8 1B 38 4C>)
(   4,<2006-03-28 13:58:42.27 +100>,<MAYBRIDGE\nmr>,<NMR_250MHZ>,
      <abs ABSG = 5 
       data hash MD5: 32K
       EC E1 A7 58 92 62 69 8F E3 20 38 16 27 D7 41 80>)
$$ ##END=
$$ 
$$ hash MD5
$$ 44 F0 8A A9 88 F0 3E E8 BF D0 71 4C BE 08 C1 DA
##$RELAX= 
##$RELAX= 
##$RELAX= 
##$RELAX= 
##$RELAX= 
##$RELAX= 
##$RELAX= 
$$ Bruker specific parameters
$$ --------------------------
##$DU= <C:\u>
##$EXPNO= 1580
##$NAME= <ADRS>
##$PROCNO= 1
##$TYPE= <nmr>
##$USER= <dgb>
##$AMP= (0..31)
100 100 100 100 100 100 100 100 100 100 100 100 100 100 100 100 100 100 
100 100 100 100 100 100 100 100 100 100 100 100 100 100 
##$AQSEQ= 0
##$AQ_mod= 3
##$AUNM= <au_zg>
##$AUTOPOS= <33 >
##$BF1= 250.13
##$BF2= 250.13
##$BF3= 250.13
##$BF4= 250.13
##$BF5= 500.13
##$BF6= 500.13
##$BF7= 500.13
##$BF8= 500.13
##$BYTORDA= 1
##$CFDGTYP= 0
##$CFRGTYP= 5
##$CHEMSTR= <none>
##$CNST= (0..31)
1 1 145 1 1 1 1 1 1 1 1 1 1 1 1 1 1 1 1 1 1 1 1 1 1 1 1 1 1 1 1 1 
##$CPDPRG= <>
##$CPDPRG1= <>
##$CPDPRG2= <>
##$CPDPRG3= <>
##$CPDPRG4= <mlev>
##$CPDPRG5= <mlev>
##$CPDPRG6= <mlev>
##$CPDPRG7= <mlev>
##$CPDPRG8= <mlev>
##$CPDPRGB= <>
##$CPDPRGT= <>
##$D= (0..31)
0 1 0 0 0 0 0 0 0 0.06 0 0 0 0 0 0 0.0002 0 0 0 0 0 0 0 0 0 0 0 0 0 0 
0 
##$DATE= 1143550705
##$DBL= (0..7)
120 120 120 120 120 120 120 120 
##$DBP= (0..7)
150 150 150 150 150 150 150 150 
##$DBP07= 0
##$DBPNAM0= <>
##$DBPNAM1= <>
$$ [...]
##$SUBNAM7= <"">
##$SUBNAM8= <"">
##$SUBNAM9= <"">
##$SW= 20.6930455092707
##$SWIBOX= (0..15)
0 0 3 0 0 0 0 0 0 0 0 0 0 0 0 0 
##$SW_h= 5175.983436853
##$TD= 65536
##$TD0= 1
##$TE= 294.16
##$TE2= 300
##$TE3= 300
##$TEG= 300
##$TL= (0..7)
0 120 120 120 120 120 120 120 
##$TP= (0..7)
150 150 150 150 150 150 150 150 
##$TP07= 0
##$TPNAME0= <>
##$TPNAME1= <>
##$TPNAME2= <>
##$TPNAME3= <>
##$TPNAME4= <>
##$TPNAME5= <>
##$TPNAME6= <>
##$TPNAME7= <>
##$TPOAL= (0..7)
0.5 0.5 0.5 0.5 0.5 0.5 0.5 0.5 
##$TPOFFS= (0..7)
0 0 0 0 0 0 0 0 
##$TUNHIN= 0
##$TUNHOUT= 0
##$TUNXOUT= 0
##$USERA1= <user>
##$USERA2= <user>
##$USERA3= <user>
##$USERA4= <user>
##$USERA5= <user>
##$V9= 5
##$VALIST= <valist>
##$VCLIST= <CCCCCCCCCCCCCCC>
##$VD= 0
##$VDLIST= <DDDDDDDDDDDDDDD>
##$VPLIST= <PPPPPPPPPPPPPPP>
##$VTLIST= <TTTTTTTTTTTTTTT>
##$WBST= 1024
##$WBSW= 4
##$XGAIN= (0..3)
0 0 0 0 
##$XL= 0
##$YL= 0
##$YMAX_a= 444762
##$YMIN_a= -585412
##$ZGOPTNS= <>
##$ZL1= 120
##$ZL2= 120
##$ZL3= 120
##$ZL4= 120
##$ABSF1= 16.43687
##$ABSF2= -4.256302
##$ABSG= 5
##$ABSL= 3
##$ALPHA= 0
##$AQORDER= 0
##$ASSFAC= 0
##$ASSFACI= 0
##$ASSFACX= 0
##$ASSWID= 0
##$AUNMP= <proc_1d>
##$AZFE= 0.1
##$AZFW= 0.1
##$BCFW= 0
##$BC_mod= 0
##$BYTORDP= 0
##$COROFFS= 0
##$CY= 12.5
##$DATMOD= 1
##$DC= 0
##$DFILT= <>
##$DTYPP= 0
##$F1P= 14.0000005364418
##$F2P= -0.99999901652339
##$FCOR= 0.5
##$FTSIZE= 32768
##$FT_mod= 6
##$GAMMA= 0
##$GB= 0
##$INTBC= 1
##$INTSCL= 1
##$ISEN= 128
##$LB= 0.3
##$LEV0= 0
##$LPBIN= 0
##$MAXI= 10000
##$MC2= 0
##$MEAN= 0
##$ME_mod= 0
##$MI= 0
##$NCOEF= 0
##$NC_proc= -4
##$NLEV= 6
##$NOISF1= 0
##$NOISF2= 0
##$NSP= 0
##$NTH_PI= 0
##$NZP= 0
##$OFFSET= 16.43687
##$PC= 1
##$PHC0= 166.4455
##$PHC1= 10.05867
##$PH_mod= 1
##$PKNL= yes
##$PPARMOD= 0
##$PSCAL= 4
##$PSIGN= 0
##$REVERSE= no
##$SF= 250.130021292042
##$SI= 32768
##$SIGF1= 0
##$SIGF2= 0
##$SINO= 400
##$SIOLD= 32768
##$SREGLST= <1H.CDCl3>
##$SSB= 0
##$STSI= 32768
##$STSR= 0
##$SW_p= 5175.98343685301
##$SYMM= 0
##$S_DEV= 0
##$TDeff= 65536
##$TDoff= 0
##$TI= <Analysis number 999999
Compound Code 99
Book Reference 9
Project Code 9>
##$TILT= no
##$TM1= 0
##$TM2= 0
##$TOPLEV= 0
##$USERP1= <user>
##$USERP2= <user>
##$USERP3= <user>
##$USERP4= <user>
##$USERP5= <user>
##$WDW= 1
##$XDIM= 32768
##$YMAX_p= 423309566
##$YMIN_p= -136629
$$ End of Bruker specific parameters
$$ ---------------------------------
##NTUPLES= NMR SPECTRUM
##VAR_NAME=  FREQUENCY,     SPECTRUM/REAL,   SPECTRUM/IMAG
##SYMBOL=    X,             R,               I
##VAR_TYPE=  INDEPENDENT,   DEPENDENT,       DEPENDENT
##VAR_FORM=  AFFN,          ASDF,            ASDF
##VAR_DIM=   32768,         32768,           32768
##UNITS=     HZ,            ARBITRARY UNITS, ARBITRARY UNITS
##FACTOR=    0.157963299565203, 1,           1
##FIRST=     4111.35478688707, 0,            0
##LAST=      -1064.62864996594, 0,           0
##MIN=       -1064.62864996594, -136629,     0
##MAX=       4111.35478688707, 423309566,    0
$$ Real data points
##PAGE= N=1
##DATA TABLE= (X++(R..R)), XYDATA
$$ [...]
24372e8687J5564J8291Q571N04Q743j3154l6302m057L6431K6790p257q041J803
$$ -58687 -43123 -24832 -16261 -15757 -7014 -20168 -56470 -60527 -24096 2694 -4563 -12604 -10801
24359a0801J65J0692M740K490J0775k0524j7988J7013J6775m055r59k0156J1037
$$ -10801 -10636 56 4796 7286 18061 -2463 -20451 -3438 13337 9282 8323 -11833 -796
24346g96m3K3074j2635k06J4992M435J4335q508j5011J2644k770j7051J582n801
$$ -796 -839 22235 9600 9394 24386 28821 43156 34648 19637 32281 29511 12460 14042 8241
24332H241j4583k2715j014J7453J2997J2075K3174k6972k1969J0675P312J2428
$$ 8241 -6342 -29057 -30071 -12618 379 12454 35628 8656 -13313 -2638 4674 17102
24320A7102j5110k49J1216Q285m9911K66J5251J0451R679J7306k4148l5743N721
$$ 17102 1992 1743 12959 21244 -28667 -28401 -13150 -2699 6980 24286 138 -35605 -29884
24307b9884j761K5703m347k6379J2051J2599J8020J4501p399J1417j4413r939
$$ -29884 -31645 -5942 -10289 -36668 -24617 -12018 6002 20503 13104 24521 10108 169
24295A69L0573j6770l4700k6641J8395L0804J102j0346J2731M487Q847P793l588
$$ 169 30742 13972 -20728 -47369 -28974 1830 2932 -7414 5317 9804 18651 26444 22856
24282B2856l96j1207j4687k7052Q699q51Q443L6988J647l9989m015L3116n113
$$ 22856 22460 11253 -3434 -30486 -21787 -22638 -14195 22793 24440 -15549 -19564 13552 8439
24269H439P565n27j1666j0612K8436q981O748J9534l63k9013j2353k4166J7350
$$ 8439 16004 15477 3811 -6801 21635 12654 19402 38936 38573 9560 -2793 -26959 -9609
24256i609J4271k2829J1238l177j0038j5905j44j0966J959K1424o030K1946J0712
$$ -9609 4662 -18167 -6929 -10106 -20144 -36049 -36193 -47159 -45200 -23776 -29806 -7860 2852
24243B852R715j9933O564l015r396O825J6683P621q215k159q300J0306k716J567
$$ 2852 12567 -7366 -802 -3817 -13213 -6388 10295 17916 9701 7542 -758 9548 6832 8399
24229H399O218k6659j2263n579J583Q353L628n034J8026o44j3942L024j1088J8687
$$ 8399 14617 -12042 -24305 -29884 -28301 -19948 -16320 -21354 -3328 -3972 -17914 -14890 -25978 -7291
24215g291R470L1031m249K01j4710k0123m752J5658P495O158J873q560n956j0303
$$ -7291 2179 33210 28961 29162 14452 -5671 -10423 5235 12730 18888 20761 12201 6245 -4058
24201d058n43K113k3076R324K1406j7709j6042m370j3601m745K2548k728R189
$$ -4058 -4601 -2488 -25564 -16240 5166 -12543 -28585 -32955 -46556 -51301 -28753 -31481 -22292
24188b2292L5296k1689j2947P536J1622J5713l549k315j6171k7799M735K7529
$$ -22292 13004 -8685 -21632 -14096 -2474 13239 9690 7375 -8796 -36595 -31860 -4331
24176d331R109J0071J6122j6196j0905m609R89L578k2360j621M1509J7550k3455
$$ -4331 4778 14849 30971 14775 3870 -739 250 3828 -18532 -20153 21356 38906 15451
24163A5451q841j982K1882j1974l7568L0779K6971l84j4500j037j1764j6122j9259
$$ 15451 6610 4628 26510 14536 -23032 7747 34718 34334 19834 18797 7033 -9089 -28348
24150b8348K1067N709J990j3592J2598K9971n618j8295o775r418J4000O990L33
$$ -28348 -7281 -1572 418 -13174 -576 29395 23777 5482 -1293 -10711 3289 10279 10612
24137A0612j9632K5176J0404j2182j408J1194o378j1294Q88q373l9586j9153M0166
$$ 10612 -9020 16156 26560 14378 12970 24164 17786 6492 7380 -993 -40579 -59732 -19566
24124a9566K6112J9019l259K148o785l2451J8329J9914j8121m4999j9559M0034
$$ -19566 6546 25565 22306 24454 17669 -14782 3547 23461 5340 -39659 -59218 -19184
24112a9184J0587j6336J9066K5414j2108j9938P91R311Q874k0532j9818l628L0971
$$ -19184 -8597 -24933 -5867 19547 7439 -12499 -11708 -2397 6477 -14055 -33873 -37501 -6530
24099f530Q190J2039J6230J5712J8312l476k5841l0836L709p675k5493R180j1474
$$ -6530 1660 13699 29929 45641 63953 60477 34636 3800 7509 -166 -25659 -16479 -27953
24086b7953m01n925M798O007j1529k13K5424L1033P126j8551J4021r354o669R293
$$ -27953 -28354 -34279 -29481 -23474 -35003 -35216 -9792 21241 28367 9816 23837 14483 7814 17107
24072A7107J11k0220k7745j3174J8562J8262L9448L0612k7345k7125L394j4695
$$ 17107 17218 -3002 -30747 -43921 -25359 -7097 32351 62963 35618 8493 11887 -2808
24060b808j8215R057L070k0500j0601n835J8047O690j7184N05L2762r70k3604
$$ -2808 -21023 -11966 -8896 -29396 -39997 -45832 -27785 -21095 -38279 -37774 -5012 -5982 -29586
24047b9586j6831j588L3412L861j1311p70R092L4115K767n3768k3537K1492J1850
$$ -29586 -46417 -48005 -14593 -10732 -22043 -22813 -13721 20394 23161 -30607 -54144 -32652 -20802
24034b0802N231L4750J5511m8263j1040k4842j2095M108P640K8976J566K1575
$$ -20802 -15571 19179 34690 -13573 -24613 -49455 -61550 -57442 -49802 -20826 -19260 2315
24022B315L687m0924j2539P730j1301J3243J0988n964K2427K8494O23j8632r324
$$ 2315 6002 -34922 -47461 -39731 -51032 -37789 -26801 -32765 -10338 18156 18779 147 -9177
24009i177j5451M045m495K4838K3917K713l4065J4845L9397j084k3904M904J8495
$$ -9177 -24628 -20583 -25078 -240 23677 26390 -7675 7170 46567 45483 21579 26483 44978
23996D4978J8180j5209k7569j4183J7711j5745l1553k4093P1j3990J7919J9980
$$ 44978 63158 47949 20380 6197 23908 8163 -23390 -47483 -47412 -61402 -43483 -23503
23984b3503J0229j7949j2976J3896k5915M482J6225R899K2787l013N921j6992
$$ -23503 -13274 -31223 -44199 -30303 -56218 -51736 -35511 -25612 -2825 -5838 83 -16909
23972a6909O690K5407J24k559j6117k012R443Q149O412P815j2955j2720n9j8673
$$ -16909 -10219 15188 15312 12753 -3364 -5376 4067 12216 18628 26443 13488 768 709 -17964
23958a7964J0559n770M244N204n185j3746j522J425M53m237j6759J9268j414O098
$$ -17964 -7405 -13175 -8931 -3727 -8912 -22658 -24180 -22755 -22302 -26539 -43298 -24030 -25444 -19346
23944a9346J3343K039o02n583N458m432M0766K4638l736j2567j091n919j9602
$$ -19346 -6003 -3964 -4566 -10149 -4691 -9123 31643 56281 52545 39978 38887 32968 13366
23931A3366m206n977M794R38l1514k5507J3355M2256N17j8530k023l694j242k3214
$$ 13366 9160 3183 7977 8915 -22599 -48106 -34751 7505 8022 -10508 -12531 -16225 -17467 -40681
23917d0681J924M5278j12J0042j1489J919p087J6684m928j1658J2202m25l091
$$ -40681 -38757 6521 6409 16451 4962 6881 -206 16478 11550 -108 12094 11669 8578
23904H578k0312j438n129m189L600K8129L8103Q209k2820l3401n911r320o630
$$ 8578 -11734 -13172 -18301 -22490 -18890 9239 47342 55551 32731 -670 -6581 -15901 -22531
23891b2531m758K0982K1179O339j5253k2237k6926m600p667j155l216J6759K0920
$$ -22531 -27289 -6307 14872 21211 5958 -16279 -43205 -47805 -55472 -56627 -59843 -43084 -22164
23878b2164K709K15m066J2142N076K0289J9655j546O739j0216K5874p644j8698
$$ -22164 -19455 -19240 -23306 -11164 -6088 14201 33856 32310 39049 28833 54707 47063 28365
23865B8365O733M525j9175k9490L286j5174J5013J1317j3558r196K6710L1491
$$ 28365 35098 39623 20448 -9042 -5756 -20930 -5917 5400 -8158 -17354 9356 40847
23853D0847j4509j1590k1863k3725j6533Q289L5405R289j646K793N271l3857j7486
$$ 40847 26338 14748 -7115 -30840 -47373 -39084 -3679 5610 3964 6757 12028 -21829 -39315
23840c9315Q595O819K1565J6431l952J7154K6187j1373l7368m952L5337M761n824
$$ -39315 -30720 -23901 -2336 14095 10143 27297 53484 42111 4743 -209 35128 39889 34065
23827C4065r833k1115P506K0865L3372M579l2246k9223o121p970k055j5951K2921
$$ 34065 24232 3117 10623 31488 64860 69439 37193 7970 1849 -6121 -8176 -24127 -1206
23814a206l222K355Q313j8974m32M3802J1374K370j2454l8140l9185j9597N0979
$$ -1206 -4428 -2073 6240 -12734 -13166 30636 42010 44380 31926 -6214 -45399 -64996 -14017
23801a4017L0016k1389m63K5880K7452k4303j7721m101K619q12p141J4943p599
$$ -14017 15999 -5390 -5853 20027 47479 23176 5455 1354 3973 3161 -3980 10963 3364
23788C364M341j5103O708J3041o213k9526j3544j469J0815J7565J327J8632K7142
$$ 3364 7705 -7398 -690 12351 6138 -23388 -36932 -38401 -27586 -10021 -8694 9938 37080
23775C7080q299L105O897r297r603k048n802r225K0350j0419n3127m0334K5856
$$ 37080 28781 31886 38783 29486 19883 17835 12033 2808 23158 12739 -40388 -80722 -54866
23762e4866L2721j2466j5578K2030L9732K4245j6182n886O038l5108k4557J3296
$$ -54866 -22145 -34611 -50189 -28159 11573 35818 19636 13750 19788 -15320 -39877 -26581
23750b6581J0637p2k174J895K4320L1253j2239j8635j5125O724M069J8757O572
$$ -26581 -15944 -16016 -18190 -16295 8025 39278 27039 8404 -6721 3 4072 22829 29401
23737B9401O702k5942j6757l265J5443L155k8939n609L1070L82l657j4968j887
$$ 29401 36103 10161 -6596 -9861 5582 8737 -20202 -25811 5259 5641 1984 -12984 -14871
23724a4871K2264j5348j8202k0233k2084M016J7552J4026J9737O888j9641L045
$$ -14871 7393 -7955 -26157 -46390 -68474 -64458 -46906 -32880 -13143 -6255 -25896 -22851
23712b2851M2605J8584r945M928m4634R860J8862Q7k4804l2238Q188J3952q474
$$ -22851 19754 38338 28393 33321 -11313 -1453 17409 17496 -7308 -39546 -31358 -17406 -25880
23699b5880O625K849R212K1081P51k6700k2034J5198L5637N504k534p780L19j7388
$$ -25880 -19255 -16406 -7194 13887 14638 -12062 -34096 -18898 16739 22243 19709 11929 12248 -5140
23685e140j5044J5333N183n073n794L084J3147n782O89K2000K497k3533r911L0304
$$ -5140 -20184 -4851 332 -4741 -10535 -7451 5696 -86 603 22603 25100 1567 -8344 21960
23671B1960K644l707J4064L337j8658P071J6115l85N880m940j0768M743m827m1242
$$ 21960 24604 20897 34961 38298 19640 26711 42826 42441 48321 43381 32613 37356 32529 -8713
23657h713j4634o618J0439L4233J441j3258M039j7359n526Q558J5077P716r89
$$ -8713 -23347 -29965 -19526 14707 16148 2890 6929 -10430 -15956 -7398 7679 15395 14406
23644A4406j8733M048N345k912O150k7457J0053J4953P630J3303r507j5687K9889
$$ 14406 -4327 -279 5066 2154 8304 -19153 -9100 5853 13483 26786 17279 1592 31481
23631C1481m963k5830l3846K859L4448J8434k9286l3710L7431N6224J406l3237
$$ 31481 26518 688 -33158 -30299 4149 22583 -6703 -40413 -2982 53242 54648 21411
23619B1411k1118k656j5632k3363k707p566J5710K0695Q253J5679M865m4018k6576
$$ 21411 293 -2363 -17995 -41358 -44065 -51631 -35921 -15226 -6973 8706 13571 -30447 -57023
23606e7023n646L4696K5283O823j8074j0967J8008K716K5038J5549k7056k0005
$$ -57023 -62669 -27973 -2690 4133 -13941 -24908 -6900 -4184 20854 36403 9347 -10658
23594a0658j1724J5621K0782k6990l0742j9759R166K6834K8913j6424M478J4863
$$ -10658 -22382 -6761 14021 -12969 -43711 -63470 -54304 -27470 1443 -14981 -10503 4360
23582D360Q870l0244m094N960j3031Q742n373m551k2816k423j1402o205q25K3051
$$ 4360 13230 -17014 -21108 -15148 -28179 -19437 -24810 -29361 -52177 -54600 -66002 -72207 -73032 -49981
23568d9981j9088j3082K5552M5871L0645J8771k2318k3476O354k809j4485l2801
$$ -49981 -69069 -82151 -56599 -10728 19917 38688 16370 -7106 -752 -3561 -18046 -50847
23556e0847K7414P919l518j5747J0875K471l3984K5687J6544K0361M3788L732
$$ -50847 -23433 -15514 -19032 -34779 -23904 -21433 -55417 -29730 -13186 7175 50963 54695
23544E4695j0136l4195J5010j1495m709j07j7898j6641Q105J7058j0965q259R014
$$ 54695 44559 10364 25374 13879 9170 9063 -8835 -25476 -17371 -313 -11278 -19537 -10523
23531a0523M226M932K1200K2780L771k5809J4483k777l26k8232j9379J1387o609
$$ -10523 -6297 -1365 19835 42615 46386 20577 35060 32283 31957 3725 -15654 -4267 -10876
23518a0876L622L0961L0660O434r460k2992j0235j2443o628J7209N399j5888j7310
$$ -10876 -7254 23707 54367 60801 51341 28349 18114 5671 -957 16252 21651 5763 -11547
23505a1547K8693J9490o948l3001r289p005JK163J528J5810P261k0287j1386j4714
$$ -11547 17146 36636 29688 -3313 -12602 -19607 -19606 -17443 -15915 -105 7156 -13131 -24517 -39231
23491c9231J8802j005m753J5919J4127r337J975p13j9433l402J5279Q947L0792
$$ -39231 -20429 -21434 -26187 -10268 3859 -5478 -3503 -4216 -23649 -27051 -11772 -2825 27967
23478B7967j1567P734j7068k203j5034J0363K6014j2698k1837k4123M459K5464
$$ 27967 16400 24134 7066 4863 -10171 192 26206 13508 -8329 -32452 -27993 -2529
23466b529j6448l999P093J0083J119l14O602J7971K3667O340k5569k189k0918
$$ -2529 -18977 -22976 -15883 -5800 -4681 -4995 1607 19578 43245 49585 24016 21827 909
23453I09j1783J1156j902k0768m836J3139P766k745O124J8538m998l9574k0460
$$ 909 -10874 282 -1620 -22388 -27224 -14085 -6319 -9064 -2940 15598 10600 -28974 -49434
23440d9434Q949J1371j995J6499J2609k1044q070P718K4743K1218j9368k5681
$$ -49434 -40485 -29114 -31109 -14610 -2001 -23045 -31115 -23397 1346 22564 3196 -22485
23428b2485K1616j4392p104K1116L1272J8608n805l3472j3684J8799M553j4321
$$ -22485 -869 -15261 -22365 -1249 30023 48631 42826 9354 -4330 14469 19022 4701
23416D701k674J8142O573j3166n319J627o761j0138L0568J2522L987p443j2280
$$ 4701 2027 20169 26742 13576 8257 9884 3123 -7015 23553 36075 40062 32619 20339
23403B0339q892k1922j3242J9444R853O011j2865r909K1952j5805m230M5825k0563
$$ 20339 11447 -10475 -23717 -4273 5580 11591 -1274 -11183 10769 -5036 -9266 36559 15996
23390A5996k7981j7337q12J9249J7426L818q067j19j3561p788J2644K1204k1217
$$ 15996 -11985 -29322 -30134 -10885 6541 10359 2292 2173 -11388 -19176 -6532 14672 -6545
23377f545k9066j9847J0379k728j5456J040K2549J9614n60n168j661K694k4808
$$ -6545 -35611 -55458 -45079 -47807 -63263 -62223 -39674 -20060 -20620 -25788 -27449 -24755 -49563
23364d9563J3384M3296k4979k3080K054J1441N209M890p96j066J0285K2715O007
$$ -49563 -36179 7117 -17862 -40942 -38888 -27447 -22238 -17348 -18144 -19210 -8925 13790 19797
23351A9797J5610j4726j8177J1126k1109J3198j3722J238j7825o895J5664J2762
$$ 19797 35407 20681 2504 13630 -7479 5719 -8003 -6765 -24590 -31485 -15821 -3059
23339c059j034J4319P407P877k4771J9086L7285j5798j3698l126L710k355j3880
$$ -3059 -4093 10226 17633 25510 739 19825 57110 41312 27614 24488 28198 25843 11963
23326A1963k6668K9027k577l8791j5067O497J5169L7647P128K305k2614Q488L662
$$ 11963 -14705 14322 11745 -27046 -42113 -35616 -20447 17200 24328 26633 4019 12507 16169
23313A6169M391J8073J5483j2062m7004j4586M722Q254p628j5416N757K3258o749
$$ 16169 20560 38633 54116 42054 -4950 -19536 -14814 -6560 -14188 -29604 -23847 -589 -7338
23300g338J5990J8079K863l917J8381k318k1824j6667j1669J1944j8702j7504
$$ -7338 8652 26731 29594 25677 44058 41740 19916 3249 -8420 3524 -15178 -32682
23288c2682q060R74J5360l069r49m121R017q88J5807O42K272j2128K1419j0473
$$ -32682 -40742 -39768 -24408 -27477 -28426 -32547 -23530 -24418 -8611 -7969 -5697 -17825 3594 -6879
23274f879J729Q276m69k060n980k8951J3221k116j2190R344L2349r088j8258j6853
$$ -6879 -5150 3126 2657 597 -5383 -34334 -21113 -23229 -35419 -26075 6274 -2814 -21072 -37925
23260c7925k0895L4411J6530J0395K5874j1278J223o509K8146k1319j1497j2133
$$ -37925 -58820 -24409 -7879 2516 28390 17112 18335 11826 39972 18653 7156 -4977
23248d977o273O521K1743j3678k0575p669K5751K3204j7345k5129R583k779N266
$$ -4977 -11250 -4729 17014 3336 -17239 -24908 843 24047 6702 -18427 -8844 -11623 -6357
23235f357J0522r422J6758J6158k0043k9127J3188K6290L1991p372q401k6955
$$ -6357 4165 -5257 11501 27659 7616 -21511 -8323 17967 49958 42586 34185 7230
23223G230m6172j6235L6637J7085N31j0007J5760O57j053l5843Q528l634o845
$$ 7230 -38942 -55177 -18540 -1455 -924 -10931 4829 5486 4433 -31410 -22882 -26516 -33361
23210c3361P961K4522j2060j4953O185K4094q127K5850K219l3187j7835l754K391
$$ -33361 -25400 -878 -12938 -27891 -21706 2388 -5739 20111 22330 -10857 -28692 -32446 -30055
23197c0055K5538j1380j4507K1975Q078J9286J0491J305j4028J288o681m3396
$$ -30055 -4517 -15897 -30404 -8429 -351 18935 29426 30731 16703 17991 11310 -32086
23185c2086l052K3054K385M110k2288k0395O336J1464j8465M308o802L7591K2911
$$ -32086 -35138 -12084 -9699 -5589 -27877 -48272 -41936 -30472 -48937 -44629 -51431 -13840 9071
23172I071k8763M757n779j1333l235L5768L879j9169L912j663k6242l0188n079
$$ 9071 -19692 -14935 -20714 -32047 -35282 486 4365 -14804 -10892 -12555 -38797 -68985 -74064
23159g4064J1999L552L1623L1904l418j5631j4917q119L0436K4627n505L947J4923
$$ -74064 -62065 -58513 -26890 5014 1596 -14035 -28952 -37071 -6635 17992 12487 16434 31357
23146C1357j953q289r69L108M274k9844J981J9710j5593n890j9652l2330j8290
$$ 31357 29404 21115 20146 23254 27528 -2316 -335 19375 3782 -2108 -21760 -54090 -72380
23133g2380J6609M582J0201K328J3963P407o287m084J1863K4004J8911L867j5026
$$ -72380 -55771 -51189 -40988 -38660 -24697 -17290 -23577 -27661 -15798 8206 27117 30984 15958
23120A5958q282o466P018Q37Q089r106j4494K460O408k2765r162j3158P673K6376
$$ 15958 7676 1210 8228 9065 17154 8048 -6446 -3986 2422 -20343 -29505 -42663 -34990 -8614
23106h614P16l026l6572r995K2013K4704p727k0756l2794L0028L6573j4239j9471
$$ -8614 -7898 -10924 -47496 -57491 -35478 -10774 -18501 -39257 -72051 -42023 -5450 -19689 -39160
23093c9160p325L619j914J4250P374j6621k1350j6978K9466M3959J1938o083m923
$$ -39160 -46485 -42866 -44780 -30530 -23156 -39777 -61127 -78105 -48639 -4680 7258 1175 -3748
23080c748k3399Q208J4939J7922k8571l6328q904J9147N2516J590l492m382m870
$$ -3748 -27147 -18939 -4000 13922 -14649 -50977 -59881 -40734 11782 13372 9880 5498 628
23067F28o384o241J0446L88Q343K323j6556N199j1363M791j0107l3701p638J0008
$$ 628 -5756 -11997 -1551 -1163 7180 9503 -7053 -1854 -13217 -8426 -18533 -52234 -59872 -49864
23053d9864K61M6440K2578k4723k9222J2728P046J0923J0741j7494j3115m680
$$ -49864 -49603 -3163 19415 -5308 -34530 -21802 -14756 -3833 6908 -10586 -23701 -28381
23041b8381J018r064J5968K5094K3251j0761j4160o062k7170K254K26j5314j5542
$$ -28381 -27363 -36427 -20459 4635 27886 17125 2965 -3097 -30267 -28013 -27787 -43101 -58643
23028e8643R610K4301K742j7242J7670L825J136K6610J7479l2442m622j2982K498
$$ -58643 -49033 -24732 -21990 -39232 -21562 -17737 -16601 10009 27488 -4954 -9576 -22558 -20060
23015b0060L8469L8435J7287l1177k469J231M403j9076j5110Q391j0223n713l95
$$ -20060 18409 56844 74131 42954 40485 41716 46119 27043 11933 20324 10101 4388 3993
23002C993l2918k0777J1588J4123J9345l834j0536l306J9246J3838j4541j7586
$$ 3993 -28925 -49702 -38114 -23991 -4646 -8480 -19016 -22322 -3076 10762 -3779 -21365
22990b1365j9076J6392K3885J8328L633Q848j7353k3710M369J7686Q667m1420
$$ -21365 -40441 -24049 -164 18164 21797 30645 13292 -10418 -6049 11637 20304 -21116
22978b1116k837M1070K0126J6959j4913j7366k0892P039j476n056L832j361Q344
$$ -21116 -23953 17117 37243 54202 39289 21923 1031 8070 6594 1538 5370 4009 12353
22965A2353k3817m79r13k361L285J8556J3141r984k126k160K5624j2791j0654
$$ 12353 -11464 -11943 -12856 -15217 -11932 6624 19765 9781 7655 5495 31119 18328 7674
22952G674k2718j7218j8554J9854J6533o590J9097p92k4713L281J1072j4189l625
$$ 7674 -15044 -32262 -50816 -30962 -14429 -21019 -1922 -2714 -27427 -24146 -13074 -27263 -30888
22939c0888L6794o857j2675j4369N91k3271k320o64N521J5262J1686K1992j3586
$$ -30888 5906 -951 -13626 -27995 -27404 -50675 -52995 -53659 -48138 -32876 -21190 802 -12784
22926a2784r740J3767P0o622K0360J3830K763k6682l7310j836J4989P801r153
$$ -12784 -22524 -8757 -8687 -15309 5051 18881 21644 -5038 -42348 -44184 -29195 -21394 -30547
22913c0547j5619M719j281Q309L8614p700N829M4050J1205J872m670j4536m2192
$$ -30547 -46166 -41447 -42728 -34419 4195 -3505 2324 46374 57579 59451 54781 40245 -1947
22900a947L731r685K5661R666j417L150j0670j169M07l8009q823J5529j2555o224
$$ -1947 1784 -7901 17760 27426 26009 29159 18489 17320 17727 -20282 -29105 -13576 -26131 -32355
22886c2355m579Q635K4541J7625N470n597m3896R332J4120M886j0105L5521K7968
$$ -32355 -36934 -28299 -3758 13867 19337 13740 -30156 -20824 -6704 -1818 -11923 23598 51566
22873E1566o750l270k2767l8122j8630K3340O808j4800j784j5290l564N925j4034
$$ 51566 44816 41546 18779 -19343 -37973 -14633 -7825 -22625 -24409 -39699 -43263 -37338 -51372
22860e1372J7186K7142k061k77J6420l389o45l4673k0423o487k961M061K4639
$$ -51372 -34186 -7044 -9105 -9382 7038 3649 3004 -31669 -52092 -58579 -61540 -57479 -32840
22847c2840K5314K128r10j1196k6626j2403k3725j8246r978J4415K8699K7289
$$ -32840 -7526 -5398 -6308 -17504 -44130 -56533 -80258 -98504 -108482 -94067 -65368 -38079
22835c8079L0253l899K2808q678l15O08J281r713o262m185J2352j691j9720O034
$$ -38079 -7826 -11725 11083 2405 2090 2698 3979 -5734 -11996 -16181 -3829 -5520 -25240 -19206
22821a9206J8334j2224r144J8229K1891l2729K226J4415N270M952k0302L066k495
$$ -19206 -872 -13096 -22240 -4011 17880 -14849 -12623 1792 7062 12014 -8288 -5222 -7717
22808g717o648l5929j5307R957K3484K4102L023j0281O605J5571P40M970R582
$$ -7717 -14365 -50294 -65601 -55644 -32160 -8058 -5035 -15316 -8711 6860 7600 12570 22152
22795B2152Q4O51K6763m811k3636j0637K9120M137R505j2211r028j5849m671J5716
$$ 22152 22236 22887 49650 44839 21203 10566 39686 43823 53328 41117 32089 16240 11569 27285
22781B7285m817j2560K7647J54Q314k3981k2443n007J3002j930J5216K5078j6622
$$ 27285 22468 9908 37555 37709 46023 22042 -401 -5408 7594 5664 20880 45958 29336
22768B9336m7265o802K5889p949j6527j3931R606R33K222Q561k5707L411j6048
$$ 29336 -17929 -24731 1158 -6791 -23318 -37249 -27643 -26710 -24488 -15927 -41634 -38223 -54271
22755e4271K2614K7409l94J5896r022j1939J1501m320j8392p738M590N262P649
$$ -54271 -31657 -4248 -4642 11254 2232 -9707 1794 -2526 -20918 -28656 -24066 -18804 -11155
22742a1155l102l3295J1917K0627K0819o082l0836K0345J8596k1669J5029m4598
$$ -11155 -14257 -47552 -35635 -15008 5811 -271 -31107 -10762 7834 -13835 1194 -43404
22730d3404K288r079j6411L488PJ5784J5296p70J854j297Q32K0324p996r92O395
$$ -43404 -41116 -50195 -66606 -63118 -63111 -47327 -32031 -32801 -30947 -32244 -31412 -11088 -19084 -20076 -13681
22715a3681q052j1157k8181J8614O98r236k0635l494J9755L2996m290j6411J1003
$$ -13681 -21733 -32890 -61071 -42457 -41759 -50995 -71630 -75124 -55369 -22373 -26663 -43074 -32071
22702c2071K3784J042J4329o294j7764K124L6166o182J719j0473l2034j8013n149
$$ -32071 -8287 -7245 7084 790 -16974 -14850 21316 15134 16853 6380 -25654 -43667 -48816
22689d8816l758M0071J0835j0009m184k0822M950J8250J6949j5185j8330k274
$$ -48816 -52574 -12503 -1668 -11677 -15861 -36683 -31733 -13483 3466 -11719 -30049 -32323
22677c2323j3338k7036P496K2081K5279k4414Q843j767p032l1907L532J5571L8038
$$ -32323 -45661 -72697 -65201 -43120 -17841 -42255 -33412 -35179 -42211 -74118 -70586 -55015 -16977
22664a6977k1572K3769k268P442K1198p794l8035j5598K231K1097r88p187j6147
$$ -16977 -38549 -14780 -17048 -9606 11592 3798 -34237 -49835 -47604 -26507 -27495 -34682 -50829
22651e0829Q239K2162J2663K8045K039q110k5528M583j9512j3734N634K2561k0790
$$ -50829 -42590 -20428 -7765 20280 22319 14209 -11319 -6736 -26248 -39982 -34348 -11787 -32577
22638c2577Q699K7398j1896k6609k1242j3434k968r721L1912M0590k333m160k2211
$$ -32577 -23878 3520 -8376 -34985 -56227 -69661 -72629 -82350 -50438 -9848 -12181 -16341 -38552
22625c8552J1756J649M745q04l9622j1450J1143J896P732m147l692K2131L554
$$ -38552 -26796 -25147 -20402 -21206 -60828 -72278 -61135 -59239 -51507 -55654 -59346 -37215 -33661
22612c3661j0462j8836l2404J5171M7815L1123L299j3037j1627k229o856J3358
$$ -33661 -44123 -62959 -95363 -80192 -32377 -1254 2045 -10992 -22619 -24848 -31704 -18346
22600a8346N492Q450K0210N838j8480l192K883q925j2265R093l650n563J3695
$$ -18346 -12854 -4404 15806 21644 3164 -28 2855 -6070 -18335 -9242 -12892 -18455 -4760
22587d760j933O314k6351P148j2719j5186l182L022K4272R057k2248r87K7303
$$ -4760 -6693 -379 -26730 -19582 -32301 -47487 -50669 -47647 -23375 -14318 -36566 -37553 -10250
22574a0250q449j5051J1784p924j3060j5310k4139R408J5044M724j438L8338o846
$$ -10250 -18699 -33750 -21966 -29890 -42950 -58260 -82399 -72991 -57947 -53223 -54661 -16323 -23169
22561b3169J88L863j1725m566R958P90k0215l432J2175o451j2326J6421O373J7590
$$ -23169 -22981 -19118 -30843 -35409 -25451 -24661 -44876 -48308 -36133 -42584 -54910 -38489 -32116 -14526
22547a4526J5601M130j3112k3595j6758K7653O176M851K940k3840j1196j4947
$$ -14526 1075 5205 -7907 -31502 -48260 -20607 -14431 -9580 -6640 -30480 -41676 -56623
22535e6623M1707K9150n257p118o415k3132m749K1805k2822j2468N285k422K693
$$ -56623 -14916 14234 8977 1859 -4556 -27688 -32437 -10632 -33454 -45922 -40637 -43059 -40366
22522d0366l183q69L323R311j1508R65J0726j0251L152J1976n465k9567P405J8959
$$ -40366 -43549 -44418 -41095 -31784 -43292 -42327 -31601 -41852 -38700 -26724 -32189 -61756 -54351 -35392
22508c5392J3143J1054l668l583K07J3235j0626q149K012K3944K1947j6236l8157
$$ -35392 -22249 -11195 -14863 -18446 -18239 -5004 -15630 -23779 -21767 2177 24124 7888 -30269
22495c0269o897J204K6774K2119J5269q26O428k00N978k0083p854P335j9451k049
$$ -30269 -37166 -35962 -9188 12931 28200 27374 33802 33602 39580 19497 11643 18978 -473 -2522
22481b522j472r75j6658l685L489k936K9422p540J5958j3429O489o66k0825O832
$$ -2522 -3994 -4969 -21627 -25312 -21823 -24759 4663 -2877 13081 -348 6141 5475 -15350 -8518
22467h518j3531L439L3268K096j1151k0194J9969L891l0733k321J0710j6303k0434
$$ -8518 -22049 -18610 14658 16754 5603 -14591 5378 9269 -21464 -23785 -13075 -29378 -49812
22454d9812J2505K8814J2094r245j2218p855j0666J7707J3961j2054j9672q863
$$ -49812 -37307 -8493 3601 -5644 -17862 -25717 -36383 -18676 -4715 -16769 -36441 -45304
22442d5304J6379p024P167M5379n086j5982l6894K546J2802K805J250o481K312
$$ -45304 -28925 -35949 -28782 16597 11511 -4471 -41365 -38819 -26017 -23212 -21962 -28443 -26131
22429b6131J540l1128M045K9782K5397M117J8114K067k9150l7221l35Q388n081
$$ -26131 -24591 -55719 -51674 -21892 3505 7622 25736 27803 -1347 -38568 -38903 -30515 -35596
22416c5596J4974K2077J195J7958k9243L6J4084J5139o316j9719N333J060k1911
$$ -35596 -20622 1455 2650 20608 -8635 -8599 5485 20624 14308 -5411 -78 982 -20929
22403b0929J6248J2865m298O710j4712p552J841L1718j5308j3761L244K379M1338
$$ -20929 -4681 8184 3886 10596 -4116 -11668 -9827 21891 6583 -7178 -3934 -1555 39783
22390C9783m94k4987j8433j6739O542m567j9684K0036j2132k8065l099K033L1359
$$ 39783 39289 14302 -4131 -20870 -14328 -18895 -38579 -18543 -30675 -58740 -61839 -59806 -28447
22377b8447L4166k118J1036k3140k0751j5327k3802L0900L7946K0048J4579j4667
$$ -28447 5719 3601 14637 -8503 -29254 -44581 -68383 -37483 463 20511 35090 20423
22365B0423l4176j0614J2355J180l154N732J0036o864J8228J8444J6398k3629
$$ 20423 -13753 -24367 -12012 -10832 -13986 -8254 1782 -5082 13146 31590 47988 24359
22353B4359l6893K926O355p580K8251j8669r741N017l12j2637J4194K9763J2504
$$ 24359 -12534 -9608 -3253 -10833 17418 -1251 -10992 -5975 -6287 -18924 -4730 25033 37537
22340C7537P049j1049k4878j9678q298j2274P813j7103M64K6775K8333L4180j2354
$$ 37537 44586 33537 8659 -11019 -19317 -31591 -23778 -40881 -40417 -13642 14691 48871 36517
22327C6517j8900k0388j396J549j0650K3585K9403o757l5396P322N926R567J2311
$$ 36517 17617 -2771 -4167 -2618 -13268 10317 39720 32963 -2433 4889 10815 20382 32693
22314C2693l3135l4950N905L869Q486J9779J7697p556j6883l0822j5177L5570
$$ 32693 -442 -35392 -29487 -25618 -17132 2647 20344 12788 -4095 -34917 -50094 -14524
22302a4524r057j112J7228j242j5165m331j830J0690l821l741J3450n969p019
$$ -14524 -23581 -24693 -7465 -8707 -23872 -28203 -30033 -19343 -23164 -26905 -13455 -19424 -26443
22289b6443J2895J4157J8094n725k0550P42M766j5774J7193O239R504J1245q888
$$ -26443 -13548 609 18703 12978 -7572 -6830 -2064 -17838 -645 5594 15098 26343 17455
22276A7455l0638k4620k880J032K357p928j8068K0226K4465J8976N794l1188k5257
$$ 17455 -13183 -37803 -40683 -39651 -37294 -45222 -63290 -43064 -18599 377 6171 -25017 -50274
22263e0274K7405J4458j0903J7753L6238k1124l5131k0061L923o58r667k2816
$$ -50274 -22869 -8411 -19314 -1561 34677 13553 -21578 -41639 -37716 -38374 -48041 -70857
22251g0857L6948M4878j1095j1501j880J4069k992j7755J0881j3138o049K5915
$$ -70857 -33909 10969 -126 -11627 -13507 562 -2430 -20185 -9304 -22442 -28491 -2576
22239b576K0314K422o618R164K4960q482j7739m3546k4018j3987K6952J9765J913
$$ -2576 17738 20160 13542 22706 47666 39184 21445 -22101 -46119 -60106 -33154 -13389 -11476
22226a1476L2153J9445k3958m832o732J4526J359j6871j4902J7313j8447k609
$$ -11476 20677 40122 16164 11332 4600 19126 20485 3614 -11288 6025 -12422 -15031
22214a5031P48k8684O764O42M990J5900j3614j7749J367q430J2490L2901L4608
$$ -15031 -14283 -42967 -36203 -35561 -30571 -14671 -28285 -46034 -44667 -53097 -40607 -7706 26902
22201B6902J257r092j6147p085K8711j4456j4535j5769k326n950n682j891J5778
$$ 26902 28159 19067 2920 -4165 24546 10090 -4445 -20214 -22540 -28490 -34172 -36063 -20285
22188b0285j175K6794p51J4862j3385Q041o881k5774j4286J6162j3179P611J9414
$$ -20285 -21460 5334 4583 19445 6060 14101 7220 -18554 -32840 -16678 -29857 -22246 -2832
22175b832J273J3585j1466o067J2577k0586P481P266o217k9842j9854n175L956
$$ -2832 -1559 12026 560 -5507 7070 -13516 -6035 1231 -4986 -34828 -54682 -59857 -55901
22162e5901K4204J4355J0266p674O648j3221m68K870N421K7412l9245j6313L5930
$$ -55901 -31697 -17342 -7076 -14750 -8102 -21323 -21791 -18921 -13500 13912 -25333 -41646 -5716
22149e716J2632l0427j9212M691J3678K0574m752k4146j591q48J0040K7724J2269
$$ -5716 6916 -23511 -42723 -38032 -24354 -3780 -8532 -32678 -34269 -35117 -25077 2647 14916
22136A4916K627k3708l398J0811r869k3229j8208J1802L4085j0406l2945j81K17
$$ 14916 17543 -6165 -9563 1248 -8621 -31850 -50058 -38256 -4171 -14577 -47522 -47703 -47486
22123d7486J4163J9187l187k9851L2592K4358j9073k8322K2606K4130n621m1869
$$ -47486 -33323 -14136 -17323 -47174 -14582 9776 -9297 -37619 -15013 9117 3496 -38373
22111c8373k8945L2845L0421m895j0896K3348j5358O009l156j9410k3439J0285
$$ -38373 -67318 -34473 -4052 -8947 -19843 3505 -11853 -5844 -9000 -28410 -51849 -41564
22099d1564M023M625K2957p267J825O758O070P966k022J9860l4889P063K6494
$$ -41564 -37541 -32916 -9959 -17226 -15401 -8643 -2573 5393 3371 23231 -11658 -4595 21899
22086B1899J165J8139K1244k103k1970l6607j2181j2324r709O302j5294K844N3429
$$ 21899 23064 41203 62447 60344 38374 1767 -10414 -22738 -32447 -26145 -41439 -38595 14834
22073A4834K235J4400o523k7045k5996J9431J6037j0891j3191j439J0885J9844
$$ 14834 17069 31469 24946 -2099 -28095 -8664 7373 -3518 -16709 -18148 -7263 12581
22061A2581J7445l3783k4028k8613L558J3934L1548n55p159m20r442o42L2970
$$ 12581 30026 -3757 -27785 -56398 -52840 -38906 -7358 -7913 -15072 -15492 -24934 -25576 7394
22048G394K4278r916m5447J2547J7049L751k3768j0903K0825j9104k9090j6977
$$ 7394 31672 21756 -23691 -11144 5905 9656 -14112 -25015 -4190 -23294 -52384 -69361
22036f9361K5435J3376N393j676J4530J4832O501O383P133J5165k2035J2763j6474
$$ -69361 -43926 -30550 -25157 -26833 -12303 2529 9030 15413 22546 37711 15676 28439 11965
22023A1965j6421Q229O895O630j8041k9894l4860J2156J8494L2247K839k4010
$$ 11965 -4456 3773 10668 17298 -743 -30637 -65497 -53341 -34847 -2600 239 -23771
22011b3771J0060J9225p563R57K4395k430m025j6389p187l247J4315J3530r18
$$ -23771 -13711 5514 -2049 -1092 23303 20873 16848 459 -6728 -9975 4340 17870 16952
21998A6952K452j7817M483J5915J9686j7725L22J9005l3041r393k7283m719k486
$$ 16952 19404 1587 6070 21985 41671 23946 24268 43273 10232 839 -26444 -31163 -33649
21985c3649l252P999J1392O489L0648o609k3069n115J5730J0461L732n716k4799
$$ -33649 -36901 -28902 -17510 -11021 19627 13018 -10051 -15166 564 11025 14757 9041 -15758
21972a5758O152p86k7220j5571K4254K7639j1048k5417p25O301N0172n25p328
$$ -15758 -9606 -10392 -37612 -53183 -28929 -1290 -12338 -37755 -38480 -32179 17993 17468 10140
21959A0140j2880j1448j206k217L113k81k3749j2344K079J4036j449q020J4402
$$ 10140 -2740 -14188 -15394 -17611 -14498 -14779 -38528 -50872 -48793 -34757 -36206 -44226 -29824
21946b9824M0603K761m8742l0114J1703N427J8863K3985k3498J2338l9218O506
$$ -29824 10779 13540 -35202 -65316 -53613 -48186 -29323 -5338 -28836 -16498 -55716 -49210
21934d9210K0224J0357K1486m2609k4062L1417M2427J5021k9598m3007Q298L4942
$$ -49210 -28986 -18629 2857 -39752 -63814 -32397 10030 25051 -4547 -47554 -39256 -4314
21922d314J4261K1824j8799k4688K5604j1225j3726J6600J1496J4413p090q001
$$ -4314 9947 31771 12972 -11716 13888 2663 -11063 5537 17033 31446 24356 16355
21910A6355j9784Q340L165N558j3411p406N86Q969J2972k45M227j7528J3327J955
$$ 16355 -3429 4911 8076 13634 223 -7183 -6597 2372 15344 15099 19326 1798 15125 17080
21896A7080l461j752j7491k0765j41M5978J3272p332k3253L410P62k7611j2140
$$ 17080 13619 11867 -5624 -26389 -26530 19448 32720 25388 2135 5545 6307 -21304 -33444
21883c3444J9284k40p643K226J4532l0624l2610K922K2715L5211N911k5542p790
$$ -33444 -14160 -14400 -22043 -19817 -5285 -35909 -68519 -65597 -42882 -7671 -1760 -27302 -35092
21870c5092J647R26K2043N397M845r198L005q13M522j5195J969k302l442J3525
$$ -35092 -33445 -32519 -10476 -5079 -234 -9432 -6427 -7240 -2718 -17913 -15944 -18246 -21688 -8163
21856h163q126j2877l5033q329K1590L0564K2646J2328j8961j4095j5181o427
$$ -8163 -16289 -29166 -64199 -72528 -50938 -20374 2272 14600 -4361 -18456 -33637 -40064
21844d0064M0255K6840o689k5412j5109n524J1087L834j1093j7168r527l894l656
$$ -40064 191 27031 20342 -5070 -20179 -25703 -14616 -10782 -21875 -39043 -48570 -52464 -56120
21831e6120J7565J2389l930k6449J8514J9805q824J5968j1407k8662j4661R461
$$ -56120 -38555 -26166 -30096 -56545 -38031 -18226 -27050 -11082 -22489 -51151 -65812 -56351
21819e6351K4165J0846L6324M753m516J4272j5584q284k862r505J3943r186j6878
$$ -56351 -32186 -21340 14984 19737 15221 29493 13909 5625 2763 -6742 7201 -1985 -18863
21806a8863J6068Q765m690q55j5111J8751O672j1863r72l491j9619l1888K0021
$$ -18863 -2795 5970 1280 425 -14686 4065 10737 -1126 -2098 -5589 -25208 -57096 -37075
21793c7075K4192l636K3863K2970k400k1484k43N176j2934j6370p151K1568K6631
$$ -37075 -12883 -16519 7344 30314 27914 6430 6187 11363 -1571 -17941 -25092 -3524 23107
21780B3107n021p473j470O185r421j670J0083k4587o76n374J987M2900j1168k7135
$$ 23107 18086 10613 9143 15328 5907 4237 14320 -10267 -10943 -16317 -14330 28570 17402 -9733
21766i733R346J074P260m082o231P19j515M8328K969m554k428k8510k0499k741
$$ -9733 -387 687 7947 3865 -2366 -1647 -3162 45166 48135 43581 41153 12643 -7856 -10597
21752a0597M22o313n4J2507J4105j492l2227l2000Q377J1034J1259J8568J137
$$ -10597 -10175 -16488 -16542 -4035 10070 8578 -23649 -55649 -47272 -36238 -24979 -6411 -5274
21739e274L410m577r043M560K0034K9179r612m2947J0423K0608k6590J741J5486
$$ -5274 -1864 -6441 -15484 -10924 9110 38289 28677 -14270 -3847 16761 -9829 -8088 7398
21726G398N40o590O636j92l1428N274j0031J348l1518p767P703L0701L1567K29
$$ 7398 7938 1348 7984 7792 -23636 -18362 -28393 -27045 -58563 -66330 -58627 -27926 3641 3870
21712C870l4026K5148k51l5689j4976K8297J8658l569J89k4569J2703P840J0032
$$ 3870 -30156 -5008 -5259 -40948 -55924 -27627 -8969 -12538 -12349 -36918 -24215 -16375 -6343
21699f343J79j1654J3784k5602P083k3035K427k8492K9664L5128p093L725p455
$$ -6343 -6164 -17818 -4034 -29636 -22553 -45588 -43161 -71653 -41989 -6861 -13954 -10229 -17684
21686a7684r090j1367J0499J6245m752l277q013Q281r144K9493K4717j1421j1455
$$ -17684 -26774 -38141 -27642 -11397 -16149 -19426 -27439 -19158 -28302 1191 25908 14487 3032
21673C032j7315K4408L285j9578k4033J708J826Q869K8043j0742o444r465J2236
$$ 3032 -14283 10125 13410 -6168 -30201 -28493 -26667 -17798 10245 -497 -6941 -16406 -4170
21660d170M3707q65j5337J5771j745k2712m1257O44O13J4678J2221r973j2820
$$ -4170 39537 38672 23335 39106 37361 14649 -26608 -25964 -25351 -10673 1548 -8425 -21245
21647b1245j4727o719O584L3275j654o872r013n999J4153K0596L260M224K2784
$$ -21245 -35972 -42691 -36107 -2832 -4486 -11358 -20371 -26370 -12217 8379 11639 15863 38647
21634C8647o714p434j8238l4318k1025M012l181N972k0093o579J2358J2907J5457
$$ 38647 31933 24499 6261 -28057 -49082 -45070 -48251 -42279 -62372 -68951 -56593 -43686 -28229
21621b8229Q071K8612K7321K909q288j3889k5329j8060K893m92K2534J8562L880
$$ -28229 -20158 8454 35775 38684 30396 16507 -8822 -26882 -23989 -24481 -1947 16615 20495
21608B0495j8211o276J0675j241O958k911n093j2734r004K6445Q239J6550K1640
$$ 20495 2284 -3992 6683 5442 12400 9489 4396 -8338 -17342 9103 17342 33892 55532
21595E5532l4514j9467K0618j3177l3216J6010j6105j9784J8072J2003l469N463
$$ 55532 21018 1551 22169 8992 -24224 -8214 -24319 -44103 -26031 -14028 -17497 -12034
21583a2034J3949o508l2391N495J1359j5931n132L6114j077j6537J2612L506j0664
$$ -12034 1915 -4593 -36984 -31489 -20130 -36061 -41193 -5079 -6156 -22693 -10081 -6575 -17239
21570a7239K0122J5671k6396j0871L2471q736r153O388Q462j0305k8053j4239
$$ -17239 2883 18554 -7842 -18713 13758 5022 -4131 2257 10719 414 -27639 -41878
21558d1878J6135K1882O509L513j0192N775k145J5520q552j6652Q574q176J1241
$$ -41878 -25743 -3861 2648 6161 -4031 1744 -401 15119 6567 -10085 -1511 -9687 1554
21545A554p453J1359M502K831k470q773k0172j1822m1493k3848K9321J6231k0167
$$ 1554 -5899 5460 9962 12793 10323 1550 -18622 -30444 -71937 -95785 -66464 -50233 -70400
21532g0400j6766J6818Q584m999K724L4542O780M388Q398J6269l058P435m5818
$$ -70400 -87166 -70348 -61764 -66763 -64039 -29497 -22717 -18329 -9931 6338 3280 10715 -35103
21519c5103m2126J3470J1791K0245J6081m704O9K8153J9334J219k9003j7332N448
$$ -35103 -77229 -63759 -51968 -31723 -15642 -20346 -20277 7876 27210 28429 -574 -17906 -12458
21506a2458Q551k6463j1900j1917J2843K1958j7910k6269J9334K7108Q39m932
$$ -12458 -3907 -30370 -42270 -54187 -41344 -19386 -37296 -63565 -44231 -17123 -16284 -21216
21494b1216Q401J0684j0899n4M486J0320r141k1821J0125L066k2749o939K0814
$$ -21216 -12815 -2131 -13030 -13084 -8598 1722 -7419 -29240 -19115 -16049 -38798 -45737 -24923
21481b4923q09k9479J3935K2737N377j3887O850j2941K460J059l4613N433J9422
$$ -24923 -25732 -55211 -41276 -18539 -13162 -27049 -20199 -33140 -30680 -29621 -64234 -58801 -39379
21468c9379k1401k134M441J2884j1999J3473j3513Q44O336on980J909j866l970
$$ -39379 -60780 -62914 -58473 -45589 -57588 -44115 -57628 -56784 -50448 -50454 -56434 -54525 -56391 -60361
21454f0361n62j031O821l2620k6289L8103L1784L2460l087k1153j4981o172R431
$$ -60361 -60923 -61954 -55133 -87753 -114042 -75939 -44155 -11695 -14782 -35935 -50916 -57088 -47657
21441d7657J5447L5965j0639K0248J6894m5k1557q862N204j894N18j7522r576
$$ -47657 -32210 3755 -6884 13364 30258 30213 8656 -206 4998 3104 3622 -13900 -23476
21428b3476K243K2290K008J1767l3103j7307k1083N167K0970j0921o318j1029
$$ -23476 -21233 1057 3065 14832 -18271 -35578 -56661 -51494 -30524 -41445 -47763 -58792
21416e8792J6337K2006J1629K6091M900l0570j4715k9478P546J7010R824J6273
$$ -58792 -42455 -20449 -8820 17271 22171 -8399 -23114 -52592 -45046 -28036 -18212 -1939
21404a939k3112j9074j0604J9042j1137K6881L324j1779P873J4321n853j9716
$$ -1939 -25051 -44125 -54729 -35687 -46824 -19943 -16619 -28398 -20525 -6204 -12057 -31773
21392c1773l5970k989J0722P731K144J0493K9993j0951j5642j8007R355K1376
$$ -31773 -67743 -70732 -60010 -52279 -50135 -39642 -9649 -20600 -36242 -54249 -44894 -23518
21380b3518o973q775J5950K821R085m3702j6383M6601K3219M883o615n156o264
$$ -23518 -30491 -39266 -23316 -20495 -11410 -55112 -71495 -24894 -1675 3208 -3407 -8563 -14827
21367a4827j2893j468N603L231J9372J3554j536q196R87J8319R516j131l3533
$$ -14827 -27720 -29188 -23585 -20354 -982 12572 11036 2840 3827 22146 31662 30531 -3002
21354c002j6291J6942K71K7777J1876l8880m8865n326K1050r595K6695L6045o368
$$ -3002 -19293 -2351 -2080 25697 37573 -1307 -50172 -55498 -34448 -44043 -17348 18697 12329
21341A2329p824k637l4964j0259K2960j7243q032L3789L202J4662k251k2158p193
$$ 12329 4505 1868 -33096 -43355 -20395 -37638 -45670 -11881 -8679 5983 3732 -18426 -25619
21328b5619m5847j0802L0912K2299M720k9187j018k0876M404N721K8796R116K0190
$$ -25619 -71466 -82268 -51356 -29057 -24337 -53524 -54542 -75418 -71014 -65293 -36497 -27381 -7191
21315g191R614J5343K2333J3673m911j0477J880P453k3745k5175j5257j0403N022
$$ -7191 2423 17766 40099 53772 48861 38384 40264 47717 23972 -1203 -16460 -26863 -21841
21302b1841k50M909J3871q03J3755J4249j7600K694Q454J6206j3699p699J8592
$$ -21841 -22091 -17182 -3311 -4114 9641 23890 6290 8984 17438 33644 19945 12246 30838
21289C0838o819k4161R91J4287n500k0154l1163P160L3066L446k9122j2908j247
$$ 30838 24019 -142 849 15136 9636 -10518 -41681 -34521 -1455 1991 -27131 -40039 -41286
21276d1286j841l589J1091k53K178K4307K5933k4870l8471k3732L399J6756J5258
$$ -41286 -43127 -46716 -35625 -35878 -33700 -9393 16540 -8330 -46801 -70533 -67134 -50378 -35120
21263c5120K9528j949J3853Q217n001l7628j1492K8556R88l2921p435L2087M310
$$ -35120 -5592 -7541 6312 14529 9528 -28100 -39592 -11036 -10048 -42969 -50404 -18317 -14007
21250a4007l16J3280k196j1937Q783J52l945J6345l344r795O730K2024Q303M859
$$ -14007 -14323 -1043 -3239 -15176 -6393 -6241 -10186 6159 2815 -6980 -250 21774 30077 34936
21236C4936k5605j2217J6468J0598l1048K1342K6238l5373m6657o658K630L7792
$$ 34936 9331 -2886 13582 24180 -6868 14474 40712 5339 -41318 -47976 -45346 -7554
21224g554L8206m717l7157m6819J2378J9947j3680K7773L5471k1085m0602k5441
$$ -7554 30652 25935 -11222 -58041 -45663 -25716 -39396 -11623 23848 2763 -37839 -63280
21212f3280m138J1301q195k7497P470K3576q682J3417N9843K1375J325j5953k2682
$$ -63280 -67418 -56117 -64312 -91809 -84339 -60763 -69445 -56028 3815 25190 26515 10562 -12120
21199a2120q553n72j1404r882K471k6798j6643N913K9613K1421j0367J5647J0449
$$ -12120 -20673 -21245 -32649 -42531 -40060 -66858 -83501 -77588 -47975 -26554 -36921 -21274 -10825
21186a0825J134l666r979J3865j1604n698o830R117K4123O007p232j4967J3634
$$ -10825 -9691 -13357 -23336 -9471 -21075 -26773 -33603 -24486 -363 5644 -1588 -16555 -2921
21173b921r893O671Q472J254J1374l406l3133l2305l799J3833K1957l483q931
$$ -2921 -12814 -6143 2329 3583 14957 11551 -21582 -53887 -57686 -43853 -21896 -25379 -34310
21160c4310k526n277K0849j8814j1303J1336J582l0535J5075p80j7404j8873K8583
$$ -34310 -36836 -42113 -21264 -40078 -51381 -40045 -38463 -68998 -53923 -54703 -72107 -90980 -62397
21147f2397L5106N781k2896J7136L902p559J5256q247l4895K9954L080M235j9324
$$ -62397 -27291 -21510 -44406 -27270 -23368 -30927 -15671 -23918 -58813 -28859 -25779 -21544 -40868
21134d0868j2403J7774L9848K9061n667m5338K294p677j358j748J3959L5985n494
$$ -40868 -53271 -35497 4351 33412 27745 -17593 -15299 -22976 -24334 -26082 -12123 23862 18368
21121A8368l132l4012k7646L672J7161J8163p32K524N438J4609K671j0392j3579
$$ 18368 15236 -18776 -46422 -42750 -25589 -7426 -8158 -5634 -196 14413 17084 6692 -6887
21108f887k312N498n597p437j675J4930L7445m472l1731r531J9745N238m8926
$$ -6887 -9199 -3701 -9298 -16735 -18410 -3480 33965 29493 -2238 -11769 7976 13214 -35712
21095c5712j3024M3228J6657J5637k1153j6424L968K728k1752n308j1603R992
$$ -35712 -48736 -5508 11149 26786 5633 -10791 -6823 -4095 -25847 -31155 -42758 -32766
21083c2766K0343K046k4808k1851M909K5034M1989k982j3098j220J2140k1838
$$ -32766 -12423 -10377 -35185 -57036 -52127 -27093 14896 11914 -1184 -2404 9736 -12102
21071a2102q092J8119J2600p293k0613m002K7424M762L073k582n383j0257L440
$$ -12102 -20194 -2075 10525 3232 -17381 -21383 6041 10803 13876 11294 5911 -4346 -906
21058i06j564k7583k1735O79J6772L3186l860k2383K5645K995j7614R09Q368M123
$$ -906 -2470 -30053 -51788 -51109 -34337 -1151 -5011 -27394 -1749 1246 -16368 -15459 -7091 -2968
21044b968l4345n024K9493R938k4143P799J2979R191k0185o042k7186j2425j368
$$ -2968 -37313 -42337 -12844 -2906 -27049 -19250 -6271 2920 -17265 -23307 -50493 -62918 -64286
21031f4286r517Q022J5519L4773K4193j0466Q249j4438k5873P348J1981j0744
$$ -64286 -73803 -65781 -50262 -15489 8704 -1762 6487 -7951 -33824 -26476 -14495 -25239
21019b5239K0089J1588M5r100J4319k363k0098K6341O087k0346r424j0340m563
$$ -25239 -5150 6438 6483 -2617 11702 9339 -10759 15582 21669 1323 -8101 -18441 -23004
21006b3004r778o113J0492L4819J0019l045q441J665J0771j4349j2602j4162j3492
$$ -23004 -32782 -38895 -28403 6416 16435 13390 4949 6614 17385 3036 -9566 -23728 -37220
20993c7220q932K6860J0483p048L6831M454j5955j6507J5137M042j1507m453m548
$$ -37220 -46152 -19292 -8809 -15857 20974 25428 9473 -7034 8103 12145 638 -3815 -8363
20980h363K3411P210j2063k5911J1692Q939j3353j7791j3324p702q871L6200R690
$$ -8363 15048 22258 10195 -15716 -4024 4915 -8438 -26229 -39553 -47255 -56126 -19926 -10236
20967a0236j0777J3917j2348q745Q695M810p169m459j246J4013k1823J2801j5774
$$ -10236 -21013 -7096 -19444 -28189 -19494 -14684 -21853 -26312 -27558 -13545 -35368 -22567 -38341
20954c8341l516J0277J4741J6766M74l7965L017K1730J1177J1635M192o858j4484
$$ -38341 -41857 -31580 -16839 -73 401 -37564 -34547 -12817 -1640 9995 14187 7329 -7155
20941g155J3733k4535l5526m182J5237j8226k987J7464r236j2641m969K543J8849
$$ -7155 6578 -17957 -53483 -57665 -42428 -60654 -63641 -46177 -55413 -68054 -73023 -70480 -51631
20928e1631k51J3545o737j8994L0044J5934J0203J7900k7388k8329K3956K4319
$$ -51631 -51882 -38337 -45074 -64068 -34024 -18090 -7887 10013 -17375 -45704 -21748 2571
20916B571n566j8342J8996N875l0734Q125N536Q605l47k8724L274J2455L0211
$$ 2571 -2995 -21337 -2341 3534 -27200 -19075 -13539 -4934 -5281 -34005 -30731 -18276 11935
20903A1935J3052j6318l8243o903k921J3842J7615r773n936N136l5766K404L9807
$$ 11935 24987 8669 -29574 -36477 -39398 -25556 -7941 -17714 -23650 -18514 -54280 -51876 -12069
20890a2069L0820l1574k4675L2364K5744j1588J2578K0215o54j7259l3110q566
$$ -12069 18751 -12823 -37498 -5134 20610 9022 21600 41815 41161 23902 -9208 -17774
20878a7774R376J3264j2734M631j6286j485j043K0019k4411k8767K3029K9673
$$ -17774 -8398 4866 -7868 -3237 -19523 -21008 -22051 -2032 -26443 -55210 -32181 -2508
20866b508K743O496j5576l6871J0967J8532j4095M334P570K5095P746q994R745
$$ -2508 235 6731 -8845 -45716 -34749 -16217 -30312 -25978 -18408 6687 14433 5439 15184
20853A5184k8061M411O161l4460j3718P533k9524k2416M152L3672L9421J0501
$$ 15184 -12877 -8466 -2305 -36765 -50483 -42950 -72474 -94890 -90738 -57066 -17645 -7144
20841g144P429J6673L148j4893o273L487P51N23j7615p048N033j7653j9750K8011
$$ -7144 285 16958 20106 5213 -1060 2427 3178 3701 -13914 -20962 -15929 -33582 -53332 -25321
20827b5321P678m183L346j6099J0457k040j158K8827J1713q326j1380k985j5414
$$ -25321 -17643 -21826 -18480 -34579 -24122 -26162 -27320 1507 13220 4894 -6486 -9471 -24885
20814b4885q285j1777J8119J5317J572J0642j4407j8633K2424j4178p737K0744
$$ -24885 -33170 -44947 -26828 -11511 -9939 703 -13704 -32337 -9913 -24091 -31828 -11084
20802a1084j0126k3277P22K176J9864K1334Q316o409j7154J0024o65q853l3020
$$ -11084 -21210 -44487 -43765 -41589 -21725 -391 7925 1516 -15638 -5614 -6279 -15132 -48152
20789d8152P741L0678k724j0639k49J2840K0124R941k7921j8085J5603L0188M193
$$ -48152 -40411 -9733 -12457 -23096 -23345 -10505 9619 19560 -8361 -26446 -10843 19345 23538
20776B3538j7647k0473K48j935K804J8179J1128p356O147r796R432n12j6994l3979
$$ 23538 5891 -14582 -14334 -16269 -13465 4714 15842 8486 14633 4837 14269 13757 -3237 -37216
20762c7216n600L491M12L309N723m95j416j1977K1398K0260k6301r730k0050k4
$$ -37216 -42816 -39325 -38913 -35604 -29881 -30376 -31792 -43769 -22371 -2111 -28412 -38142 -58192 -58216
20748e8216J6610o097k440J8196l761R852K7591Q386k1883O489K3537k2673m5351
$$ -58216 -41606 -47703 -50143 -31947 -35708 -25856 1735 10121 -11762 -5273 18264 -4409 -49760
20735d9760o565Q85L6206J5938k8704k3235K0567j0161j4302L6444k476R236K9006
$$ -49760 -56325 -55440 -19234 -3296 -32000 -55235 -34668 -44829 -59131 -22687 -25163 -15927 13079
20722A3079j7345j283j0409l2121K9040K6557o385o49O378J9972J3274N113j3190
$$ 13079 -4266 -5549 -15958 -48079 -19039 7518 1133 484 6862 26834 40108 45221 32031
20709C2031k0665o869M750N619L357j9477k5717k8061J3496J6900p820r531q611
$$ 32031 11366 4497 9247 14866 18223 -1254 -26971 -55032 -41536 -24636 -32456 -41987 -50598
20696e0598j640O604K9641J8648m651k2745M351K9926j6044j3774r259J0247J2897
$$ -50598 -52238 -45634 -15993 2655 -1996 -24741 -20390 9536 -6508 -20282 -29541 -19294 -6397
20683f397M255R894j308l2233r480N942r750J6025o528K5530K0029k5023P34J4181
$$ -6397 -2142 7752 6444 -25789 -35269 -29327 -39077 -23052 -29580 -4050 15979 -9044 -8310 5871
20669E871J3608k2840k5186L372k231k0602J7573o33l6596j1880r509L0958N2215
$$ 5871 19479 -3361 -28547 -25175 -27406 -48008 -30435 -31068 -67664 -79544 -89053 -58095 -5880
20656e880K461j2839j7576r141K7841J8059J786K2460j7052k3134K2528K2671
$$ -5880 -3419 -16258 -33834 -42975 -15134 2925 4711 27171 10119 -13015 9513 32184
20644C2184o757j2393k649Q430L2n014J9051l0433k7678P84j2858k452Q266O72
$$ 32184 25427 13034 10385 18815 18847 13833 32884 2451 -25227 -24443 -37301 -39753 -31487 -30815
20630c0815K33l1580K9434K1023j2834k4047J9843L2635J0325k9877k4716k9896
$$ -30815 -30582 -62162 -32728 -11705 -24539 -48586 -28743 3892 14217 -15660 -40376 -70272
20618g0272j835J5440j503J8972j0127r362K2040L9556j6022J1620J8663k1287
$$ -70272 -72107 -56667 -58170 -39198 -49325 -58687 -36647 2909 -13113 -1493 17170 -4117
20606d117m196P716o942n392k916j0299o135P539L8134J2547K1506J1987l6697
$$ -4117 -8313 -597 -7539 -12931 -15847 -26146 -32281 -24742 13392 25939 47445 59432 22735
20593B2735j8226k5076lQ316Q911j6452k0845K772J4542k1352k1679J5869J2368
$$ 22735 4509 -20567 -20570 -12254 -3343 -19795 -40640 -37868 -23326 -44678 -66357 -50488 -38120
20580c8120q411J5660L1418J2294J9406k6128m7346l6945J9158K161M308j2601
$$ -38120 -46531 -30871 547 12841 32247 6119 -41227 -78172 -59014 -56853 -52545 -65146
20568f5146K718L0518k957k2832j0508K696K4721L2015n627K826J1778j1005k1133
$$ -65146 -62428 -31910 -34867 -57699 -68207 -65511 -40790 -8775 -14402 -11576 202 -10803 -31936
20555c1936k691Q303L059j2688j43M746K829J5000l587m281k5308l0031J6692
$$ -31936 -34627 -26324 -23265 -35953 -36096 -31350 -28521 -13521 -17108 -21389 -46697 -76728 -60036
20542f0036J4077K1506K5021J5012k5868k3596J9629o53K5006J3871l0750J95
$$ -60036 -45959 -24453 568 15580 -10288 -33884 -14255 -14908 10098 23969 -6781 -6586
20530f586L958l433j5478L824M208j8172k6456k0461J5685J2920K0020J0304R063
$$ -6586 -2628 -6061 -21539 -17715 -13507 -31679 -58135 -78596 -62911 -49991 -29971 -19667 -10604
20517a0604m616o080j0363L8229j5234j0677R413m867r224p358j2271K8821L6801
$$ -10604 -15220 -21300 -31663 6566 -8668 -19345 -9932 -14799 -24023 -31381 -43652 -14831 21970
20504B1970M533k8991O129J4236K1996k2825J401m964l411J7627l5506l28Q006
$$ 21970 26503 -2488 3641 17877 39873 17048 18449 13485 10074 27701 -7805 -8133 -127
20491a27n170J256K901j1905j241r603j4267j6410q461L5676J1820J1022J3824
$$ -127 -5297 -4041 -1140 -13045 -14286 -23889 -38156 -54566 -63027 -27351 -15531 -4509 9315
20478I315p743j876l2551k2963n183K0714N849j9805J2956L449M008O608o21j5768
$$ 9315 1572 -304 -32855 -55818 -61001 -40287 -34438 -54243 -41287 -37838 -33830 -27222 -27843 -43611
20464d3611q116Q869j6190l4571J4379L5344P681k7473J9522J0586o843J0844
$$ -43611 -51727 -42858 -59048 -93619 -79240 -43896 -36215 -63688 -44166 -33580 -40423 -29579
20452b9579R558j1432k5222J0481K6714J3562k0473R349O841L008j7995l088L636
$$ -29579 -20021 -31453 -56675 -46194 -19480 -5918 -26391 -17042 -10201 -7193 -25188 -28276 -24640
20439b4640k3262j1778M5055K6991k677O58M951m2227k7274K6612M278o375M26
$$ -24640 -47902 -59680 -14625 12366 9689 10347 15298 -26929 -54203 -27591 -23313 -29688 -29262
20426b9262n666N266K2121J1616j986j7654k0831l718J6991J0426N416K89J2438
$$ -29262 -34928 -29662 -7541 4075 2089 -15565 -36396 -40114 -23123 -12697 -7281 -6992 5446
20413E446l8196o599j0606K7483O044j7707m710K3171R921k990L761n348p140
$$ 5446 -32750 -39349 -49955 -22472 -16428 -34135 -38845 -15674 -5753 -8743 -4982 -10330 -17470
20400a7470K983j079J403k6772j7083J8118L172n465R120N2897J1828l8155l7500
$$ -17470 -14487 -15566 -14163 -40935 -58018 -39900 -36728 -42193 -33073 19824 31652 -6503 -44003
20387d4003J5656L0459L8208K685J117p164J4030j1569j0080k2174k4359L797
$$ -44003 -28347 2112 40320 43005 44122 36958 50988 39419 29339 7165 -17194 -13397
20375a3397j4623L38M0906K5241M021k076k1064j3214J5220k1484p431Q156k50
$$ -13397 -28020 -27682 13224 38465 42486 40410 19346 6132 21352 -132 -7563 593 343
20362C43J108P561j2000q651K323J3341K1859r173P412N530j4701N973J167K2351
$$ 343 1451 9012 -2988 -11639 -9316 4025 25884 16711 24123 29653 14952 20925 22092 44443
20348D4443K200k3971m071q478j5482K748n57J0092J2912j7931l419L151j3664
$$ 44443 46643 22672 18601 10123 -5359 -2611 -3168 6924 19836 1905 -1514 1637 -12027
20335a2027j6496l555J1996J1156P985K758Q570p727k5819j5843o871j7162P374
$$ -12027 -28523 -32078 -20082 -8926 -941 1817 10387 2660 -23159 -39002 -45873 -63035 -55661
20322e5661K4355M536J113j9137J1479J5911j6645l652L9282L1298o478j9119
$$ -55661 -31306 -26770 -25657 -44794 -33315 -17404 -34049 -37701 1581 32879 26401 7282
20310G282l129L400q437J9188L453j0908K933m1299j9058O924J2999o659j0756
$$ 7282 4153 7553 -884 18304 21757 10849 13782 -27517 -46575 -39651 -26652 -33311 -44067
20297d4067J4638J5235L2225K1450j494k0882j1822r331J1347r393j7724M011
$$ -44067 -29429 -14194 18031 39481 37987 17105 5283 -4048 7299 -2094 -19818 -15807
20285a5807L37m0821o994M7818o772j2595J282J0374j1012J7852J7980K1187k1836
$$ -15807 -15470 -56291 -63285 -15467 -22239 -34834 -33552 -23178 -34190 -16338 1642 22829 993
20272I93K3860J8762j2889q697j9282K3559l639j0188j0061K2680P454p696p052
$$ 993 24853 43615 30726 22029 2747 26306 22667 12479 2418 25098 32552 24856 17804
20259A7804j634n170K806K4085J4256j2421l2001o499j123r574J7659N049J9001
$$ 17804 16170 11000 13806 37891 52147 39726 7725 1226 103 -9471 8188 13237 32238
20246C2238j5805l9645l484J1645J7085J9513j1768O641k1875l6496j144J2134
$$ 32238 16433 -23212 -26696 -15051 2034 21547 9779 16420 -5455 -41951 -43095 -30961
20234c0961K5346O456j8733k3067J8922J4747K2771J6072j2081Q874Q710j8347
$$ -30961 -5615 841 -17892 -40959 -22037 -7290 15481 31553 19472 28346 37056 18709
20222A8709j9325j3487J0127l592J4723J2062P783k732k8027j8951K507J3673
$$ 18709 -616 -14103 -3976 -7568 7155 19217 27000 24268 -3759 -22710 -20203 -6530
20210f530M595p706j6945j599j8400K0170L3311j7920j9145L3827M101k2050J8062
$$ -6530 -1935 -9641 -26586 -28185 -46585 -26415 6896 -11024 -30169 3658 7759 -14291 3771
20197C771M797l4780L143P045q464L5415K0717o901k2770K872J8884r009K379
$$ 3771 8568 -26212 -23069 -16024 -24488 10927 31644 24743 1973 4845 23729 14720 17099
20184A7099k8066l0005r231J2332N814o585j264L1045K837J2467J0752k3653j0231
$$ 17099 -10967 -40972 -50203 -37871 -32057 -38642 -39906 -8861 -6024 6443 17195 -6458 -16689
20171a6689q139K415J6628J8437J858j5065j5325J496j1562m079K6908L8372J1335
$$ -16689 -24828 -22413 -5785 12652 14510 -555 -15880 -14384 -25946 -30025 -3117 35255 46590
20158D6590M170K5588R079k720k0186k9156l7673l447M561J4336o887r917j4754
$$ 46590 50760 76348 85427 82707 62521 33365 -4308 -7755 -3194 11142 4255 -5662 -20416
20145b0416J5912M5905J3496k1922l0684j3296l352j0070J6145K6823K1742j8618
$$ -20416 -4504 41401 54897 32975 2291 -11005 -14357 -24427 -8282 18541 40283 21665
20133B1665R626N041N547j5800K706m092j061J132q944j0092m517M95p139J2951
$$ 21665 31291 36332 41879 26079 28785 24693 23632 24764 15820 5728 1211 1706 -5433 7518
20119G518j4854k944j5562K302L4502J1209L741k099q44k0325l129Q589L617k3896
$$ 7518 -7336 -10280 -25842 -23540 10962 22171 25912 23813 22969 2644 -485 8104 11721 -12175
20105a2175j7129J3461K9626K9638j5100l3310Q9j3624P699r63p422J0052K3065
$$ -12175 -29304 -15843 13783 43421 28321 -4989 -4900 -18524 -10825 -11788 -19210 -9158 13907
20092A3907q036q725p412J6573J4839J1015r026j3432J2471J3096j3166j1525
$$ 13907 5871 -2854 -10266 6307 21146 32161 23135 9703 22174 35270 22104 10579
20080A0579o743Q888l3062j9182R667K1313J6569K810o056k8116j6734J2569l598
$$ 10579 3836 12724 -20338 -39520 -29853 -8540 8029 10839 4783 -23333 -40067 -27498 -31096
20067c1096L9927M3581O409m1853l2002j8182N101N3386L5616j3937n929l8124
$$ -31096 8831 52412 58821 16968 -15034 -33216 -28115 25271 60887 46950 41021 2897
20055B897k3406J0892o528j0092J7773M466J0174l566J7882k1753o934n320j2911
$$ 2897 -20509 -9617 -16145 -26237 -8464 -3998 6176 2610 20492 -1261 -8195 -13515 -26426
20042b6426j1672M576K1262K4190K908j5532O747j2414J6969J0142q700j1862
$$ -26426 -38098 -33522 -12260 11930 14838 -694 6053 -6361 10608 20750 12050 188
20030A88q697J0984j105K4738J3912r043j421j0225k0875K0050k8949m217j8583
$$ 188 -8509 2475 1370 26108 40020 30977 29556 19331 -1544 18506 -10443 -14660 -33243
20017c3243o333K5691L2184j0969L806J8357j7056j3686J1078L7186J7655j3458
$$ -33243 -39576 -13885 18299 7330 11136 29493 12437 -1249 9829 47015 64670 51212
20005E1212q240l1561j8528k1411k149P832J7042Q162l666O979L759o743Q377
$$ 51212 42972 11411 -7117 -28528 -30677 -22845 -5803 2359 -1307 5672 9431 2688 11065
19992A1065K7852k6364l3163L0796M6165l860j6860n025J1315k2833k6464o409
$$ 11065 38917 12553 -20610 10186 56351 52491 35631 30606 41921 19088 -7376 -13785
19980a3785O161J9640P484m1644n951K7216M1631M951o938r275j4093k5391j0955
$$ -13785 -7624 12016 19500 -22144 -28095 -879 40752 45703 38765 29490 15397 -9994 -20949
19967b0949J641J5402K6791o562j2383k3859K2352K7587k5572k9364j3211J0995
$$ -20949 -19308 -3906 22885 16323 3940 -19919 2433 30020 4448 -24916 -38127 -27132
19955b7132M1378r819k1545j0867K3997K3752r581M899l023P129J8763q44j3958
$$ -27132 14246 4427 -17118 -27985 -3988 19764 10183 15082 12059 19188 37951 37107 23149
19942B3149k6964N536K4457R938r294j7575l8180j316L4807J1383j3943K3317
$$ 23149 -3815 1721 26178 36116 26822 9247 -28933 -30249 4558 15941 1998 25315
19930B5315J7455j3925K734q231Q909J3989l471j7165m259j8218p256M3950N583
$$ 25315 42770 28845 31579 23348 32257 46246 42775 25610 21351 3133 -4123 39827 45410
19917D5410k9924j4763j4556J9004J3263p42K932n861j8660j6812N368K2951J3247
$$ 45410 15486 723 -13833 5171 18434 17692 20624 14763 -3897 -20709 -15341 7610 20857
19904B0857m101j9947J5941m122m940J141L023J34p217M680k3680J4986L522o879
$$ 20857 16756 -3191 12750 8628 3688 4829 7852 7986 769 5449 -18231 -3245 277 -6602
19890f602K2561K2320k704o447n173N854J1066j876j3713O209P065j8238j6407
$$ -6602 15959 38279 35575 29128 23955 29809 40875 38999 25286 31495 38560 20322 3915
19877C915k4587j4710l258L61J1627J5260K3608K944j6238k876L2070O115J166
$$ 3915 -20672 -35382 -38640 -38279 -26652 -11392 12216 15160 -1078 -3954 28116 34231 35397
19864C5397J3011R712n6551j7784J3349L1581K608j4698Q685p290O991r499J0031
$$ 35397 48408 58120 1569 -16215 -2866 28715 31323 16625 25310 18020 25011 15512 25543
19851B5543k0226j7924K295k4442N485J4584j1181L494K0003j3364j8623P382
$$ 25543 5317 -12607 -10312 -34754 -29269 -14685 -25866 -22372 -2369 -15733 -34356 -26974
19839b6974K8225J3538k0258M06k9875J7895J3972j732K6647R687j0057m9169
$$ -26974 1251 14789 -5469 -5063 -34938 -17043 -3071 -4803 21844 31531 21474 -27695
19827b7695l968L5143J5881o25R395P636p340J1543j7543o310l0781m833J0511
$$ -27695 -31663 3480 19361 18736 28131 35767 28427 39970 22427 16117 -14664 -19497 -8986
19814h986L0963j2284J405p61q55J1350J5679j9036J0445j3400k1676O164n046
$$ -8986 21977 9693 11098 10337 9482 20832 36511 17475 27920 14520 -7156 -992 -6038
19801f038K6275J2056J7509k501L600j6833J700j0597J8058j0998J5607j2352
$$ -6038 20237 32293 49802 47301 50901 34068 35768 25171 43229 32231 47838 35486
19789C5486k3418j4743N176J5258R301m915j8704j1621j4508K179K3232J7724
$$ 35486 12068 -2675 2501 17759 27060 22145 3441 -8180 -22688 -20509 2723 20447
19777B0447R877J8168J6549j3114k1529j1379p851k9364p042K6869Q084M835j4002
$$ 20447 30324 48492 65041 51927 30398 19019 11168 -18196 -25238 1631 9715 14550 548
19764E48J023J7980O708K915j1797j4655j0984r672n543K729O357J0892J1724
$$ 548 1571 19551 26259 29174 17377 2722 -8262 -17934 -23477 -20748 -14391 -3499 8225
19751H225J5263L0135l3442m8987j39N5824L7139j1410P622l0241R89n008r596
$$ 8225 23488 53623 20181 -28806 -28945 26879 64018 52608 60230 29989 30978 25970 16374
19738A6374K0438J0301J7583K6406k118l8366k1514k6619j1054K1211K8076J5390
$$ 16374 36812 47113 64696 91102 88984 50618 29104 2485 -8569 12642 40718 56108
19726E6108j1687l3695j317j490K7822Q51j8804P727r0J3712J7283j1279m0789
$$ 56108 44421 10726 9409 7919 35741 36592 17788 25515 25425 39137 56420 45141 4352
19713D352l1046o690K1431L8473L1650J3587o369k1211N094J7230O725o918k0013
$$ 4352 -26694 -33384 -11953 26520 58170 71757 65388 44177 49271 66501 73226 66308 46295
19700D6295j3757j7233J0656P098K9104j5114J6183P149N015L3167L8925J2213
$$ 46295 32538 15305 25961 33059 62163 47049 63232 70381 75396 108563 147488 159701
19688A59701j0029l4245o675L101K9544K4700M6124L0492J4593L4181K0811N4468
$$ 159701 149672 115427 108752 111853 141397 166097 212221 242713 257306 291487 312298 366766
19676C66766J30291J31316R8581O0201J6006j987L588L4385K5737O5084P0903
$$ 366766 497057 628373 726954 787155 803161 801174 804762 839147 864884 929968 1000871
19665A000871R4394J19048J11032P1933K5666n933p2778j35694j61617j45451
$$ 1000871 1095265 1214313 1325345 1397278 1422944 1417011 1344233 1208539 1046922 901471
19655I01471m6532L3862L2599m104j3059k7345o7373r4470j02119j21725j14647
$$ 901471 854939 888801 921400 917296 904237 876892 809519 715049 612930 491205 376558
19644C76558r4452o7743k1133k9726k5212N245O872j5823j2740k1472J7863L0318
$$ 376558 282106 214363 193230 163504 138292 143537 150409 134586 121846 100374 118237 148555
19632A48555O300k7374l440k7394l5939L761M7311K7734j5958P71n406m0623k6693
$$ 148555 154855 127481 124041 96647 60708 64469 111780 139514 123556 124327 118921 78298 51605
19619E1605k2994k4909J4914L5408n41J1982m973j1922J7062p738j0957k7782
$$ 51605 28611 3702 18616 54024 53483 65465 60492 48570 65632 57894 46937 19155
19607A9155k134R000K1143Q930l55k235k746o425K200M3059K499R257n478R02
$$ 19155 17021 26021 47164 56094 55739 53504 50758 44333 46533 89592 92091 101348 95870 96772
19593I6772L5006L5441j2191J5706L2262P5181J00012N5998l30l3766n2977o0244
$$ 96772 131778 167219 155028 170734 202996 278177 378189 434187 433857 400091 347114 286870
19581B86870J456L9620O7865R4919J41259J67680J08103j2421j12042j42413j49475
$$ 286870 288326 327946 395811 490730 631989 799669 907772 895351 783309 640896 491421
19570D91421q9295n2492k0922J3684R0767R5488O3492K239l3038q6546j18550
$$ 491421 402126 349634 328712 342396 433163 528651 592143 594382 561344 474798 356248
19559C56248q2288m9970m4214J8796r038m788R350k4844j7644j962j7255K1966
$$ 356248 273960 223990 179776 198572 189534 184746 194096 169252 151608 149646 132391 154357
19547A54357J7046K0303K5037K2461L127K3030M1756Q4380J02453Q6663q677n4511
$$ 154357 171403 191706 216743 239204 242331 265361 307117 391497 493950 580613 571936 517425
19535E17425n0986l9397p493R589N7913J38036J88615J55773N7920o1340j55258
$$ 517425 466439 427042 419549 429138 487051 625087 813702 969475 1027395 966055 810797
19524H10797j84799j40913q5469k4840m264M7661J28463O5553J0987l7006r6146
$$ 810797 625998 485085 399616 374776 370512 418173 546636 612189 623176 586170 490024
19513D90024r7803p5517n6705m0331m4029j0419k0845k2806Q566J4243J7648L4288
$$ 490024 392221 316704 259999 219668 175639 165220 144375 121569 130135 144378 162026 196314
19501A96314L300o8824l3356K0227J208l2890O41l744m123L1544o01k6724l7974
$$ 196314 199614 130790 97434 117661 118869 85979 86620 82876 78753 110297 109696 82972 44998
19488D4998K892K6769Q038Q142J0972k3324J99J7840O566J7131j689l1401j0286
$$ 44998 47890 74659 82697 90839 101811 78487 78686 96526 103092 120223 118534 87133 76847
19475G6847K2321K0845j8820k3280K0261L0245j2145j5332r070L690j8288J262
$$ 76847 99168 120013 101193 77913 98174 128419 116274 100942 91872 95562 77274 78536
19463G8536O929k056J4553J9649L349k2425K1276L5194R590k870l0707o602K4194
$$ 78536 85465 83409 97962 117611 120960 98535 119811 155005 164595 161725 131018 124416 148610
19450A48610K1337J613j6000j8933k1893L7913L6527J3788l88j6598k571j6180
$$ 148610 169947 171560 155560 136627 114734 152647 189174 202962 202574 185976 183405 167225
19438A67225k3467J0613L5749j519o128j232p401l559l5428J374j1232k6818j5597
$$ 167225 143758 154371 190120 188601 182473 181241 173840 170281 134853 136227 124995 98177 82580
19425H2580J6921K0510J2026J2539j8864o33K956J5830J3535n159L848j8307r224
$$ 82580 99501 120011 132037 144576 125712 125079 128035 143865 157400 152241 156089 137782 128558
19412A28558l06K4778O588R772O817m634J0315M6079K1384k0558m2872M298O086
$$ 128558 128252 153030 159618 169390 176207 171573 181888 227967 249351 228793 185921 190219 196305
19399A96305J0885L7607K3255n966p342P945J4675j4081J1793K3308j3102j2288
$$ 196305 207190 244797 268052 262086 254744 262689 277364 263283 275076 298384 285282 272994
19387B72994P61Q679K904J8556O161l4931n89J400l8732O832J73k855j4210l3959
$$ 272994 273755 282434 285338 303894 310055 275124 274535 275935 237203 244035 244208 241353 227143 193184
19373A93184k2841m005m4405Q035J8735k1028j5899R910r720l2934J0007J5497
$$ 193184 170343 166338 121933 129968 148703 127675 111776 121686 111966 79032 89039 104536
19361A04536k105P82p317m221j1881M188K1465L2202M8588j121j9210J947k0527
$$ 104536 102431 103213 95896 91675 79794 83982 105447 137649 186237 185116 165906 167853 147326
19348A47326J0455J0410o480K709O266K8605J9677n150J2576R745K0456j997k3806
$$ 147326 157781 168191 161711 164420 170686 199291 218968 213818 226394 236139 256595 254598 230792
19335B30792L5573K0239j7679j9804K9345M8365K2023l74p893L257O648P745r27
$$ 230792 266365 286604 268925 249121 278466 326831 348854 348480 340587 343844 350492 358237 357310
19322C57310j4460K0150L6692J9903K2542R201O802k5186o806J1366j8578l7028
$$ 357310 342850 363000 399692 419595 442137 451338 458140 432954 426148 437514 418936 381908
19310C81908j1275P547J0186K684J5037J6233P609k1131p47P772l46Q939j2039
$$ 381908 370633 378180 388366 391050 406087 422320 429929 408798 408051 415823 415477 424416 412377
19297D12377m4774j4596m0994l4636j4306k823k4769l2988k7363k4115o671j5779
$$ 412377 367603 353007 312013 277377 263071 260248 235479 202491 175128 151013 144342 128563
19285A28563n0073k9971O613j3765o8462k3747j2594j9361j1669q182L707K7139
$$ 128563 78490 48519 55132 41367 -27095 -50842 -63436 -82797 -94466 -102648 -98941 -71802
19273g1802M7079K3652L6392J5051L3529L5651K7960L6814M8221q750M647J6825
$$ -71802 -24723 -1071 35321 50372 83901 119552 147512 184326 232547 223797 228444 245269
19261B45269M3242M2952J4722K8566N2616L6171J7358J6168m009J1896K030l620
$$ 245269 288511 331463 346185 374751 427367 463538 480896 497064 493055 504951 506981 503361
19249E03361O559J0204n254K0717O905j5612Q146K2665L4784K0295j4213n1472
$$ 503361 509920 520124 514870 535587 542492 526880 535026 557691 592475 612770 598557 547085
19237E47085p029J9213K137j0345j2723J0513K1753o272l1200l696K3114K3166
$$ 547085 540056 559269 561406 551061 538338 548851 570604 564332 533132 529436 552550 575716
19225E75716k611p80l095P289J5152n470Q545L6688M197j2027j5613K8652L4893
$$ 575716 573105 572325 569230 576519 591671 586201 594746 631434 635631 623604 607991 636643 671536
19212F71536L7194N6081L8733M4918N2462N4596K8143l7391M0599M5067J7755
$$ 671536 708730 764811 803544 848462 900924 955520 983663 946272 986871 1031938 1049693
19201A049693J907n027J5958L8834P0829R4665P2115P9158Q6131P2732M7890M7466
$$ 1049693 1051600 1046573 1062531 1101365 1172194 1266859 1338974 1418132 1504263 1576995 1624885 1672351
19189A672351L6050k1710J15P4731J07533J20793J25737J23938J25393J71623
$$ 1672351 1708401 1686691 1686806 1761537 1869070 1989863 2115600 2239538 2364931 2536554
19179B536554J64825K08504K88970L67615L96534M43569M94712M84442N16709
$$ 2536554 2701379 2909883 3198853 3566468 3963002 4406571 4901283 5385725 5902434
19170E902434N26938N34709N84248O58961P66953R80846J267091J524781J826675
$$ 5902434 6429372 6964081 7548329 8207290 8974243 9955089 11222180 12746961 14573636
19161A4573636K265459K927564M082219O223878J0216129J6437923K0634363J6933636
$$ 14573636 16839095 19766659 23848878 30072756 40288885 56726808 77361171 94294807
19153I4294807R011966L787464L232298P340165J0589165J0636108J2820304J5791229
$$ 94294807 103306773 107094237 110326535 117666700 128255865 138891973 151712277 167503506
19145A67503506J6613489J8773225J7019142R482706P082595N540368k665084
$$ 167503506 184116995 202890220 219909362 229392068 236474663 242015031 239349947
19138B39349947j3556146k3169233k5186156j5560836o30386M853281J89447l374289
$$ 239349947 225793801 202624568 177438412 161877576 161247190 166100471 166289918 162915629
19130A62915629m377805n609103r669195j5759978k2182553k5455436k1184692
$$ 162915629 158537824 152928721 143259526 127499548 105316995 79861559 58676867
19123E8676867j3915499q866293o024615m347200l349020k670613k106926j738150
$$ 58676867 44761368 35895075 29870460 25523260 22174240 19503627 17396701 15658551
19115A5658551j400860j046535p88334o38884n68105n69167o54584p89424q91472
$$ 15658551 14257691 13211156 12422822 11783938 11215833 10646666 9992082 9202658 8311186
19106H311186q60122p93951o30917m32847k65675j38892n6754p5953q8381o9819
$$ 8311186 7451064 6657113 6026196 5593349 5327674 5188782 5132028 5056075 4967694 4897875
19096D897875p647J3984Q816Q1629J26420K05113L47914L88600M70468N28576
$$ 4897875 4890228 4904212 4913028 4994657 5121077 5326190 5674104 6062704 6533172 7061748
19086G061748N14274O03198P80849J095111J616527K412283L715235N966658J0135057
$$ 7061748 7576022 8179220 8960069 10055180 11671707 14083990 17799225 23765883 33900940
19077C3900940J6996393K2740650J8265153M869824p731209j6623999j7990725
$$ 33900940 50897333 73637983 91903136 96772960 89041751 72417752 54427027
19070E4427027j1538940m245433J410553P249390J5628061K7365647L5224399
$$ 54427027 42888087 38642654 40053207 47302597 62930658 90296305 125520704
19063A25520704K7630158O867704j5156636l0255852l2892044k4618283j4023439
$$ 125520704 153150862 160018566 144861930 114606078 81714034 57095751 43072312
19056D3072312o727215k126082J802865O816557J2840065J4799387Q450550k072039
$$ 43072312 36345097 34219015 36021880 42838437 55678502 70477889 78928439 76856400
19048G6856400j1076415j5781719j4322134r011265m623000k315845j297678q06480
$$ 76856400 65779985 49998266 35676132 26664867 22041867 19726022 18428344 17621864
19040A7621864l67007K404L10589O80465J369760K559478M514694P904754J3710337
$$ 17621864 17254857 17257261 17567850 18248315 19618075 22177553 26692247 34597001 48307338
19031D8307338K1346338K3345392J2414785k123712j3113946j9182798j5298804
$$ 48307338 69653676 92999068 105413853 103290141 90176195 70993397 55694593
19024E5694593o711831Q16866P921322J7042738K8369207L4583816K8852795J1886916
$$ 55694593 48982762 49799628 57720950 74763688 103132895 137716711 166569506 178456422
19016A78456422j1751825k8699919l3756160k9257974j8745873r381935l003154
$$ 178456422 166704597 138004678 104248518 74990544 56244671 46862736 43859582
19009D3859582K552860R515713J7068333J7363150O715048o023527j6028626k0521509
$$ 43859582 46412442 55928155 72996488 90359638 97074686 91051159 75022533 54501024
19001E4501024j6757703j0326702o115909l878860k623070j906444j389323r29350
$$ 54501024 37743321 27416619 21300710 17421850 14798780 12892336 11503013 10573663
18993A0573663o61668n21657m84709m63292n17905o10541o50244o12896n40828
$$ 10573663 9911995 9390338 8905629 8442337 7924432 7313891 6663647 6050751 5509923
18984E509923m44888l55876l18159l02538l32093l66457l47049k78007j83404
$$ 5509923 5065035 4709159 4391000 4088462 3756369 3389912 3042863 2764856 2581452
18975B581452j51576p6899k5993k0986M4383J50377L70341P33710J080271O79037
$$ 2581452 2429876 2352977 2326984 2305998 2350381 2500758 2871099 3604809 4685080 5364117
18965E364117P277l54600o58024l27662M22093R19294M33196l14331p86735j193223
$$ 5364117 5371394 5016794 4358770 4031108 4453201 5372495 5805691 5491360 4704625 3511402
18955C511402r90423n45930l08816j85820q2044J2599P0678J27882J38815O8817
$$ 3511402 2520979 1975049 1666233 1480413 1398369 1410968 1481646 1609528 1748343 1817160
18945A817160O4775M7652K1117p6810j15499j35514j53928j65084j30719r0586
$$ 1817160 1881935 1929587 1950704 1873894 1758395 1622881 1468953 1303869 1173150 1082564
18935A082564o6188r2700q2929n0472l2792k1000q945N961o273O862M447k1092
$$ 1082564 1016376 923676 840747 790275 757483 736483 727538 733499 727226 734088 738535 717443
18923G17443l2091k2714l9574j2815J8351K787J338m993jk5000j2611l8029k9678
$$ 717443 685352 662638 623064 610249 628600 631387 632725 627732 627731 602731 590120 552091 522413
18910E22413n419k992q457J5249J7621J5320k8918m7577m9015J331N2478N8886
$$ 522413 516994 514002 505545 520794 538415 553735 524817 477240 428225 429556 482034 540920
18898E40920O8660J01612P4104M6354P202L1281O885n9259j07894j21588r7387
$$ 540920 609580 711192 785296 831650 838852 870133 877018 817759 709865 588277 490890
18887D90890m4895l3331J148M6647M2503K8876L3753K9442l7637m4336m4248m1673
$$ 490890 445995 412664 413812 460459 502962 531838 565591 595033 557396 513060 468812 427139
18875D27139l2593l1069Q052M1464j847P080K1292m573j0210j0856K447o72k4785
$$ 427139 394546 363477 371529 412993 411146 418226 439518 434945 424735 413879 416326 415654 390869
18862C90869m1175m562K316P706j2835J4126J4926P733K2238L9118K2055J3467
$$ 390869 349694 345132 347448 355154 342319 356445 371371 379104 401342 440460 462515 475982
18850D75982r836j5725n4499o4046K8672L0939K422k4185m1641j0212M703o632
$$ 475982 466146 450421 395922 331876 360548 391487 393909 369724 328083 317871 322574 315942
18838C15942r660J8889r665r436j946j4507J936K2309j8218k6211j96l0451J8559
$$ 315942 306282 325171 315506 306070 304124 289617 291553 313862 295644 269433 269237 238786 257345
18825B57345K5303L9229M634O259R179j7225N682j3175m665p196K0898J2737j2063
$$ 257345 282648 321877 326511 332770 341949 324724 330406 317231 312566 305370 326268 339005 326942
18812C26942l711k2386Q361K4196J7809N684p828j8495l7725m6873P714N2556
$$ 326942 323231 300845 309206 333402 351211 356895 349067 330572 292847 245974 253688 306244
18800C06244K9366P24j7292O338J7032K7510J3825l3501j8730j169k634j4466
$$ 306244 335610 336334 319042 325380 342412 369922 383747 350246 331516 330347 327713 313247
18788C13247k8760L440R182R414J2645L788J537PO252j9047r161r743j968J4578
$$ 313247 284487 287927 297109 306523 319168 322956 324493 324500 330752 311705 302544 292801 290833 305411
18774C05411L9484l749n469o232j1139n40K157M546L4569L5842O9380Q8256R859
$$ 305411 344895 341146 335677 329445 318306 317766 319923 324469 359038 394880 464260 552516 562375
18761E62375l7469p1187m2385m1772q169P076k383M255k6694m7744J2594N2671
$$ 562375 524906 453719 411334 369562 361393 368469 366086 370341 343647 295903 308497 361168
18749C61168N4308J7049L0082k4306m6375r640R256J4183Q061k1743J2608L2964
$$ 361168 415476 432525 462607 438301 391926 382286 391542 405725 413786 392043 404651 437615
18737D37615K5080K7768J6413l244N161p782L446L8727L0428n0574l5963k0533
$$ 437615 462695 490463 506876 503632 508793 501011 504457 543184 573612 523038 487075 466542
18725D66542P360J1362j7470m0408j2812l6613k7901k4826O504L5935k9047k1640
$$ 466542 473902 485264 467794 427386 414574 377961 350060 325234 331738 367673 338626 316986
18713C16986j872J3379J0201O521J542k1970m1505k5459R01k5638J5100K3423
$$ 316986 315114 328493 338694 345215 346757 324787 283282 257823 258724 233086 248186 271609
18701B71609r118j8312R786k7820j0905L6475L1921M7337L2426L2066O9225Q302
$$ 271609 262491 244179 253965 226145 215240 251715 283636 330973 363399 395465 464690 472992
18689D72992j2754J4061n627P696M6346M5411N2369L8832M7450J6701P618M5525
$$ 472992 460238 474299 468672 476368 522714 568125 620494 659326 706776 723477 731095 776620
18677G76620L5033l5898l4863k6580q830M3137J2767j1366L6539M4539J78k8521
$$ 776620 811653 775755 740892 714312 705482 748619 761386 750020 786559 831098 831276 802755
18665H02755l9125m4011j2366m105j7147M284k0281o680K0698j5710L8899M6836
$$ 802755 763630 719619 707253 703148 686001 690285 670004 663324 684022 668312 707211 754047
18653G54047j5384k5400k3706k3879k6076p776k015L1609N2542M135R508j5039
$$ 754047 738663 713263 689557 665678 639602 631826 629811 661420 713962 718097 727605 712566
18641G12566k4658l5243k6462K210K1797k0736m1343k1091n134k3582k0818K4172
$$ 712566 687908 652665 626203 628413 650210 629474 588131 567040 561906 538324 517506 541678
18629E41678R5496J21457P1113M1876k2747m6975K1405R4911J64411J23549M7788
$$ 541678 637174 758631 829744 871620 848873 801898 823303 918214 1082625 1206174 1253962
18618A253962K3936K9559N4849N6190R3556M5433m8850j11432j45718p9369O149
$$ 1253962 1277898 1307457 1362306 1418496 1512052 1557485 1508635 1397203 1251485 1172116 1178265
18607A178265L3988K7186J8877r382k1561m3800k0220k3019l6719q6479m1616
$$ 1178265 1212253 1239439 1258316 1248934 1227373 1183573 1163353 1140334 1103615 1017136 975520
18596I75520R656Q1256R4729P2676J9796n0739k2705K6508P9487P6132P6285Q7311
$$ 975520 985176 1066432 1161161 1233837 1253633 1202894 1180189 1206697 1286184 1362316 1438601 1525912
18584A525912O5242j3926k9500o0898o5138p2565l0763R941J9089N7379M9991
$$ 1525912 1591154 1577228 1547728 1486830 1421692 1349127 1318364 1328305 1347394 1404773 1454764
18573A454764M2549M3319m7618o3025l0607j1400O0306R5440Q5861J1291O792
$$ 1454764 1497313 1540632 1493014 1429989 1399382 1387982 1448288 1543728 1629589 1640880 1647672
18562A647672j0397l4973J3809R0929J67256J54852J45973J54188J37924J41988
$$ 1647672 1637275 1602302 1616111 1707040 1874296 2029148 2175121 2329309 2467233 2609221
18552B609221J34273J74097K41786K63292K77002K79822K93701L16428L65496
$$ 2609221 2743494 2917591 3159377 3422669 3699671 3979493 4273194 4589622 4955118
18543D955118M64399O22965Q67867J139998J578392K459045M136565N716922M119646
$$ 4955118 5419517 6042482 6910349 8050347 9628739 12087784 16224349 21941271 26060917
18534B6060917O13069j815023l822396l244453q68367J429973L847369O118909
$$ 26060917 26673986 24858963 21036567 17792114 16923747 18353720 22201089 28319998
18526B8319998O601384P237424R849034Q355968J458641m245784q741005j0397600
$$ 28319998 34921382 42158806 52007840 60363808 61822449 57576665 48835660 38438060
18518C8438060o635803j839438K247845O704411J0668461Q583540J362056m210691
$$ 38438060 31802257 29962819 32210664 38915075 49583536 58167076 59529132 55318441
18510E5318441q447640q361211m240767o32219J824960L840100O326232J0140032
$$ 55318441 46870801 38509590 34268823 33636604 35461564 39301664 45627896 55767928
18502E5767928J7017291K9529811M5335695M9525637L3311284J2367953L007042
$$ 55767928 72785219 102315030 147650725 197176362 230487646 242855599 245862641
18495B45862641P404486J1769568K108274j3528385k2264701j1569193K4085640
$$ 245862641 253267127 265036695 267144969 253616584 231351883 219782690 243868330
18488B43868330O5459826P5038997L8942413j772557k2807714k9164033k4014262
$$ 243868330 309328156 384367153 423309566 421537009 398729295 369565262 345551000
18481C45551000k2284398k2240374j1104400R179392J2723734J1176770J4905860
$$ 345551000 323266602 301026228 289921828 299101220 311824954 323001724 337907584
18474C37907584J1253437J6725338Q416242k4802243l5145326l1960885m266399
$$ 337907584 349161021 365886359 374302601 349500358 314355032 282394147 278127748
18467B78127748K2046230J3055902M937083k3693643n0487639n0713740m8916879
$$ 278127748 300173978 313229880 318166963 294473320 243985681 193271941 144355062
18460A44355062l9398582k5027870j5168539j0018450p308308n722390m652181
$$ 144355062 104956480 79928610 64760071 54741621 47433313 41710923 37058742
18453C7058742l558272k504287j862431j511135j228334j284879j251130j353338
$$ 37058742 33500470 30996183 29133752 27622617 26394283 25109404 23858274 22504936
18445B2504936j283341j132971j103346q11659o35002l99840q5148R4955K63030
$$ 22504936 21221595 20088624 18985278 18173619 17538617 17138777 17053629 17148584 17411614
18436A7411614N58552J064683J766140K832619M452586O799258J0660111J8092992
$$ 17411614 17970166 19034849 20800989 23633608 28086194 34885452 45545563 63638555
18428F3638555L1242027M1373164K6868424J2608919J0311249P157224K246211
$$ 63638555 94880582 136253746 163122170 175731089 186042338 193199562 195445773
18421A95445773j4503869k4747538l4475469l2113726k1940180j4575005j2216896
$$ 195445773 180941904 156194366 121718897 89605171 67664991 53089986 40873090
18414D0873090r960738o523534m209888k847595k048515j675543j383543j118723
$$ 40873090 30912352 24388818 20178930 17331335 15282820 13607277 12223734 11105011
18406A1105011q60299o04407l59082k21045k03176j12197j9746q413j35882l09506
$$ 11105011 10244712 9640305 9281223 9060178 8857002 8744805 8725059 8716646 8580764 8271258
18396H271258m72814m66887m18208l75965l78627k90654j07648K3047J54816K67606
$$ 8271258 7798444 7331557 6913349 6537384 6158757 5868103 5760455 5783502 5938318 6205924
18386F205924L70004N56770R02156J425113K171530L568937O316356J0906711
$$ 6205924 6575928 7132698 8034854 9459967 11631497 15200434 21516790 32423501
18378C2423501J2712192N864827J634187q7287K38097o25266n183337p524125
$$ 32423501 45135693 51000520 52634707 52547420 52785517 52160251 46976914 39452789
18370C9452789j1321169r547108n485982l172658j971277j317229r17663o16698
$$ 39452789 28131620 18584512 13098530 9925872 7954595 6637366 5719703 5103005
18362E103005m54823l94809l83280l18835k12361o6179n3702n0993l0556k827
$$ 5103005 4648182 4253373 3870093 3551258 3338897 3272718 3219016 3168023 3137467 3134640
18352C134640N2542P9784P9393l16k9300j07012j72709k25569k08671j90567j51175
$$ 3134640 3187182 3266966 3346359 3346043 3316743 3209731 3037022 2811453 2602782 2412215 2261040
18341B261040q6969r8797j11192j26000j10602p9538n8651j0181m4820r8932q4188
$$ 2261040 2174071 2075274 1964082 1838082 1727480 1647942 1589291 1579110 1534290 1435358 1351170
18330A351170r0636n0300o5126o2391m5465o3596o8159n3356j9638r127j1463
$$ 1351170 1260534 1210234 1145108 1082717 1037252 973656 905497 852141 832503 823376 811913
18319H11913j1033k0006n773o1207p9857o0886o3530m4754k3858l1233p602l5248
$$ 811913 800880 780874 775101 713894 634037 573151 509621 464867 441009 409776 402174 366926
18307C66926n6144r113K2796J7847K8807N5921L5074J9934K1134M2762L9562L8147
$$ 366926 310782 301669 324465 342312 371119 427040 462114 482048 503182 545944 585506 623653
18295F23653K6288J4032j3932J9651q96O017L1226M665J747k6948l1346J4453
$$ 623653 649941 663973 650041 669692 668796 674813 706039 710704 712451 685503 654157 668610
18283F68610j3464k4003o897m116j2530l8384k651Q990K2899K9778L237J37j0524
$$ 668610 655146 631143 624246 620130 607600 569216 566565 575555 598454 628232 631469 631606 621082
18270F21082p914j6465n95K2286P140l3029p8201q4381k276M5975j5622m4849
$$ 621082 613168 596703 596108 618394 625534 592505 514304 429923 427647 473622 458000 413151
18258D13151j79j8321M74J575K4008O203m4014l3222N610J9962R798K3016k9282
$$ 413151 412972 394651 395125 396700 420708 426911 382897 349675 355285 375247 385045 408061 378779
18245C78779m1423L427K6566p271k0947r284j8294l6238p514j5597j132K5240
$$ 378779 337356 340783 367349 360078 339131 329847 311553 275315 267801 252204 251072 276312
18233B76312J3489k515n917l066p569J6465L2648K6665N295L7308l149r643Q238
$$ 276312 289801 287286 281369 278303 270734 287199 319847 346512 351807 389115 385966 376323 384561
18220C84561J3736k7662l8670k785j8034l9194j5324N250J159P662J4434K7114
$$ 384561 398297 370635 331965 329180 311146 271952 256628 261878 263037 270699 285133 312247
18208C12247L436J6348K676l159j2762L983J9583k7203P810L6849j636o308j2805
$$ 312247 315683 332031 334707 331548 318786 322769 342352 315149 322959 359808 358172 351864 339059
18195C39059n722n817j7368l1264k1289L400j5455l6446J0104j0211r551j3209
$$ 339059 333337 327520 310152 278888 257599 260999 245544 209098 219202 208991 199440 186231
18183A86231J7576M4571K8189j6382l8561l1913K4636Q469n336r646J5684j7830
$$ 186231 203807 248378 276567 260185 221624 189711 214347 222816 217480 207834 223518 205688
18171B05688q023J6764N805J948J9329j4130l242J0301j2697k3682L2336L6532
$$ 205688 197665 214429 220234 222182 241511 227381 224139 234440 221743 198061 230397 266929
18159B66929Q749J9186M146j0524k3979j0143j7444J3136L4529L2865J4322m7292
$$ 266929 275678 294864 299010 288486 264507 254364 236920 250056 284585 317450 331772 284480
18147B84480k5788n278J828j213R692J4490R85j4332l2490j345J3248l519J8072
$$ 284480 258692 253414 255242 254029 263721 278211 279196 264864 232374 231029 244277 240758 258830
18134B58830K1807L0440N3509L1573j2080J6234K5424K0624J2769L0843J3098
$$ 258830 280637 311077 364586 396159 384079 400313 425737 446361 459130 489973 503071
18123E03071P853M624K3376J10068J40447J54835J77137J97444K36874K92915
$$ 503071 510924 515548 538924 648992 789439 944274 1121411 1318855 1555729 1848644
18113A848644L59125N02956P52435J125637J769515L068481N775533J1558375
$$ 1848644 2207769 2710725 3463160 4588797 6358312 9426793 15202326 26760701
18105B6760701J6375345O010359l943064j0938862j4160047q143215m029291k176478
$$ 26760701 43136046 49146405 45203341 34264479 20104432 11961217 7931926 5755448
18097E755448j247127q30322o35420m71307l99831l20889k38116j43232j17894
$$ 5755448 4508321 3677999 3042579 2571272 2171441 1850552 1612436 1469204 1351310
18088A351310j13759p6061n3324o9455p6946o5970m6523n3897l2147J669j9182
$$ 1351310 1237551 1161490 1108166 1038711 961765 895795 849272 795375 763228 764897 745715
18077G45715k0883k607r788Q974Q49l3900q83J7226L3747P278J2401L1619j3844
$$ 745715 724832 722225 712437 721411 722260 688360 687477 704703 738450 745728 758129 789748 775904
18064G75904l6472q7357m2646j7290j967q829j9552k5119l4383j0589j1588l5995
$$ 775904 739432 652075 609429 592139 590172 581343 561791 536672 502289 491700 480112 444117
18052D44117n1847k4561q884k6227J679R108m926j7594N183K2278p602k043J1365
$$ 444117 392270 367709 358825 332598 334277 343385 338459 320865 326048 348326 340724 338681 350046
18039C50046j5371J7599k5923j9335L7226K0969l5448l5678j9742k0058k998K2171
$$ 350046 334675 352274 326351 307016 344242 365211 329763 294085 274343 254285 251287 273458
18027B73458o488l2700k6070R233k2744L153L8001j0477l1035m267j1551k1725
$$ 273458 266970 234270 208200 217433 194689 197842 235843 225366 194331 190064 178513 156788
18015A56788O143K5389J1370J4277l1943j4302K1840K0526M1691j0333J162j7305
$$ 156788 162931 188320 199690 213967 182024 167722 189562 210088 251779 241446 242608 225303
18003B25303m430M0992J7031k1464k7237l17M968N8471P2752N5125Q0197J06414
$$ 225303 220873 261865 278896 257432 230195 229878 234846 293317 366069 421194 501391 607805
17991F07805Q1018M6304m1693r2711l7255O7851J18412R1794Q4154J01444N420
$$ 607805 688823 735127 693434 600723 563468 631319 749731 841525 925679 1027123 1032543
17980A032543o5302j05587j15592r3238k9561N9090N9433q510n9152j03064j11981
$$ 1032543 967241 861654 746062 652824 623263 682353 741786 733276 674124 571060 459079
17969D59079m3303l8408k0090Q940N3601O6743J20963J68138J23257M9203Q076
$$ 459079 415776 377368 357278 366218 419819 486562 607525 775663 898920 948123 956199
17958I56199l9027n3462p5530j38592j46505j21000o6060l0460k0648l0026k913
$$ 956199 917172 863710 788180 649588 503083 382083 316023 285563 264915 234889 231976
17947B31976L0543N0179O3424Q1911J18790O7160J7088n1783l5657l371N8186
$$ 231976 262519 312698 376122 458033 576823 643983 661071 609288 573631 570260 628446
17936F28446J00235Q6062Q9545Q798o1921r4185p4292p6295o7368l909K8826N0697
$$ 628446 728681 814743 904288 913086 851165 756980 682688 606393 539025 535116 563942 614639
17924F14639m265m2117o4961j25926n4476j8005n736L4189N8447Q4275J88599
$$ 614639 610374 568257 503296 377370 322894 304889 299153 333342 391789 476064 664663
17913F64663K30567K25181J75347J00260L4512j8584j13479j83589k09126k02462
$$ 664663 895230 1120411 1295758 1396018 1430530 1411946 1298467 1114878 905752 703290
17903G03290j76866j06041p3000n7710j3912k0437n0883n0709O264J7234o998
$$ 703290 526424 420383 347383 289673 275761 255324 204441 153732 159996 177230 170232
17892A70232J0743j1544j4372O951j3092k1562J477K4813J4374k3713q487k1889
$$ 170232 180975 169431 155059 162010 148918 127356 128833 153646 168020 144307 135820 113931
17880A13931j258o8j405P063p488K0919M2024J2599j0110j8106l1301o037J3488
$$ 113931 112673 112605 111200 118263 110775 131694 173718 186317 176207 158101 126800 120763 134251
17867A34251K6568N5504P6118J06051J56522R7554P3430P7805L6054n651k493
$$ 134251 160819 216323 292441 398492 555014 652568 725998 803803 839857 834206 831713
17856H31713l6303p3401l8179M3151J30144K42304K21135J45706L4358j203L4926
$$ 831713 795410 722009 683830 726981 857125 1099429 1320564 1466270 1500628 1499425 1534351
17845A534351M1558n4622j18144j35602k1010R0441J69643J55526O4429M5338
$$ 1534351 1575909 1521287 1403143 1267541 1246531 1336972 1506615 1662141 1726570 1771908
17835A771908Q0152R8727J11978R9174k8610j44290k07079j38193m1909l7799
$$ 1771908 1852060 1950787 2062765 2161939 2133329 1989039 1781960 1643767 1601858 1564059
17825A564059j33193j93907k53735k16334j75791o9262J2009Q130j4396K627K5023
$$ 1564059 1430866 1236959 983224 766890 591099 521837 533846 541976 527580 530207 555230
17814E55230M0971R8461J42782K09897K15513K13923J05106L8813P092q59o8240
$$ 555230 596201 694662 837444 1047341 1262854 1476777 1581883 1620696 1627788 1626929 1558689
17803A558689j34092j96350k51447k31854j61544j05859o3617k0167q083l2390
$$ 1558689 1424597 1228247 976800 744946 583402 477543 413926 393759 385676 353286
17793C53286j6035L593M833r927k8682k1548r018k7842m3243j7527k0138N655
$$ 353286 337251 340844 345677 335750 307068 285520 276502 248660 205417 187890 167752 173407
17781A73407k5592O089J68k8699J8605j745K1462J5970l2714k3820j1139k148
$$ 173407 147815 153904 154072 125373 143978 142233 163695 179665 146951 123131 111992 109844
17769A09844J493L5795K6526J232l9899K145J6119m081j4944j0472J3675K3797
$$ 109844 111337 147132 173658 174890 134991 137136 153255 149174 134230 123758 137433 161230
17757A61230j0942k6437Q307K8329J8920Q152l572k0921N840k0161m0202M440
$$ 161230 150288 123851 132158 160487 179407 187559 183987 163066 168906 148745 108543 112983
17745A12983j7805l2261j5574O330j3390l2211J9367K0345l259J1L542n644J6819
$$ 112983 95178 62917 47343 53673 40283 8072 27439 47784 44525 44536 48078 42434 59253
17732E9253l254l091j4008k4204q374K840j2857Q801p227k7472J5070K2925K0921
$$ 59253 55999 52908 38900 14696 6322 9162 -3695 5106 -2121 -29593 -14523 8402 29323
17719B9323P343Q472j0305p28J8176Q330K0377J7623n665j8429o408N573j358
$$ 29323 36666 45138 34833 34105 52281 60611 80988 98611 92946 74517 68109 73682 72324
17706G2324l2078k968M440Q166L4241j7786k6121L342N992K0379j721m147K2313
$$ 72324 40246 37278 41718 49884 84125 66339 40218 43560 49552 69931 68210 64063 86376
17693H6376q0O593P36l6784l2468J6341M5536j8951k364J3910l1007J0682J2672
$$ 86376 86296 92889 93625 56841 24373 40714 86250 67299 64935 78845 47838 58520 71192
17680G1192j0769j6901K0758K143j8175Q355K6688k5275o198J9408J5480O321
$$ 71192 60423 43522 64280 66423 48248 56603 83291 58016 51818 71226 86706 93027
17668I3027k899M200q662K410j2138k9412m827p246L974O451j3983j5327J1461
$$ 93027 90128 94328 85666 88076 75938 46526 41699 34453 38427 44878 30895 15568 27029
17655B7029J9818P103R936M0372j0204m869k5551K241Q961K2843Q545r242M617
$$ 27029 46847 53950 63886 104258 94054 89185 63634 65875 74836 97679 106224 96982 101599
17642A01599J4806N859j9095j5314M380N726j0314q435l554O870m026J1334Q463
$$ 101599 116405 122264 103169 87855 92235 97961 87647 79212 75658 82528 78502 89836 98299
17629I8299k2783J4287M219k113k2287k0046J4251J0511J2538o718j6441O432
$$ 98299 75516 89803 94022 91909 69622 49576 63827 74338 86876 80158 63717 70149
17617G0149L2726L9830Q164k5572q556o071j0765j2547j2980j9097k4873r371
$$ 70149 102875 142705 150869 125297 116741 110670 99905 87358 74378 55281 30408 21037
17605B1037n818J1215m120m642m510n129R464K1244J8102l352j3897p467k4648
$$ 21037 15219 26434 22314 17672 13162 8033 17497 38741 56843 53491 39594 32127 7479
17592G479j8325J0871K6916N97J1041l999R414o354n870N444K1760M800J0520
$$ 7479 -10846 25 26941 27538 38579 34580 43994 37640 31770 37214 58974 63774 74294
17579G4294K3025k5038j1144R411j7897O657J61l852L0937l83j2837J3760L0191
$$ 74294 97319 72281 61137 70548 52651 59308 59469 55617 86554 86171 73334 87094 117285
17566A17285P347l6893r724L008O52J5984J8836J5100n261J2106n647j9548j7453
$$ 117285 124632 87739 78015 81023 81675 97659 116495 131595 126334 138440 132793 113245 95792
17553I5792j8949k8489J5202K2953r538K071J9624J9187J4930k7754k8496J7588
$$ 95792 76843 48354 63556 86509 76971 79042 98666 117853 132783 105029 76533 94121
17541I4121L3147J0711J0681j000K8458K5585N76j0997n2566k2836J3783r742
$$ 94121 127268 137979 148660 147660 176118 201703 202279 191282 138716 115880 129663 119921
17529A19921n359O495q447O00K4560L2613Q593Q829j2730j1124j3834P275j9161
$$ 119921 114562 121057 112610 113210 137770 170383 178976 187805 175075 163951 150117 157392 138231
17516A38231j5120J039k752j7542j1445J5309J1905K0177K7145K985j6460l3366
$$ 138231 123111 124150 121398 103856 92411 107720 119625 139802 166947 169932 153472 120106
17504A20106k0739O656o228j9074j8870j6866j0759o204K4583M0090O7169K128
$$ 120106 99367 106023 99795 80721 61851 44985 34226 28022 52605 92695 159864 161992
17492A61992l7948l0237J7794K160n016j0316L238N2830P4711J05753J86161K72597
$$ 161992 124044 93807 111601 113761 108745 98429 101667 154497 229208 334961 521122 793719
17480G93719J36722p551j09908k22770j40431j7440Q557K3241O7899J23318K10944
$$ 793719 930441 922890 812982 590212 449781 432341 440898 464139 532038 655356 866300
17469H66300K43655O4744q1645j81612k13316j28707k1342M8698J01878K53886
$$ 866300 1109955 1174699 1093054 911442 698126 569419 548077 596775 698653 952539
17459I52539K96640J05699o6977j92072k61098j77580m7857K8620L8507Q5973
$$ 952539 1249179 1354878 1287901 1095829 834731 657151 609294 637914 676421 762394
17449G62394J45076K84765K30404l04j23096k66037k64716j35477o5314m9971
$$ 762394 907470 1192235 1422639 1422335 1299239 1033202 768486 633009 567695 517724
17439E17724K3804P6270K7143l6317q1061j09451p8254m1833j8859l4931k8905
$$ 517724 541528 617798 644941 608624 527563 418112 339858 298025 279166 244235 215330
17428B15330k4662l5881R802q473n949j7344l7413j8423j3521N457l9422n5966
$$ 215330 190668 154787 164589 156116 150167 132823 95410 76987 63466 68923 29501 -26465
17416b6465j2012k6426n467J822L5426M8695Q598k3272m3387j5336L2818J2442
$$ -26465 -38477 -64903 -70370 -68548 -33122 15573 24171 899 -42488 -57824 -25006 -12564
17404a2564j1875m751O70J3824p932r97k5883P158j7679l0950m5650N327L6006
$$ -12564 -24439 -29190 -28520 -14696 -22628 -23625 -49508 -42350 -60029 -90979 -136629 -131302 -95296
17391i5296L6310L7524L4509M9042o240o134L2014N1047N4224K3685O087o540
$$ -95296 -58986 -21462 13047 62089 55849 49715 81729 132776 187000 210685 216772 210232
17379B10232Q780L3762L7967L7927J1793m0490p953K4001J1272k6268J2071j0973
$$ 210232 219012 252774 290741 328668 340461 299971 292018 316019 327291 301023 313094 302121
17367C02121j6341p308o044k1864L993L4795K3067l397j6800k5256J478L7281
$$ 302121 285780 278472 272428 250564 254557 289352 312419 309022 292222 266966 268444 305725
17355C05725M4468L5003k7690K877L1175L3823n145N416j6612K197J2337j658
$$ 305725 350193 385196 357506 360383 391558 425381 420236 425652 409040 411237 423574 421916
17343D21916L646J9741K0054K7663M1076M1261N5225K9050J721L6269K7432L7468
$$ 421916 425562 445303 465357 493020 534096 575357 630582 659632 661353 697622 725054 762522
17331G62522L4550N0040L4089N0213M2010P940J1522M0752Q9321M1435K7649P1815
$$ 762522 797072 847112 881201 931414 973424 981364 992886 1033638 1122959 1164394 1192043 1263858
17319A263858R6516J05995J17841J45138K46673L36202L60718K84249J92509K45300
$$ 1263858 1360374 1466369 1584210 1729348 1976021 2312223 2672941 2957190 3149699 3394999
17309C394999L90938M74138L50206J64052O8382M2084J00861K16342J89623J41797
$$ 3394999 3785937 4260075 4610281 4774333 4842715 4884799 4985660 5202002 5391625 5533422
17299E533422K21169M22188O87032R21627J174952J500984J958909K492896L095064
$$ 5533422 5754591 6176779 6863811 7785438 8960390 10461374 12420283 14913179 18008243
17290A8008243M031307N689317Q747353J4389289K4894927M0345514M8186965
$$ 18008243 22039550 27728867 36476220 50865509 75760436 116105950 164292915
17283A64292915L4500749J2568155l76442K03176N907866k641427k0847741l7448563
$$ 164292915 198793664 211361819 210985377 211188553 217096419 214454992 193607251 156158688
17275A56158688m4164852l4901178k0505083j0738628n477133k492121k96169
$$ 156158688 111993836 77092658 56587575 45848947 40371814 37879693 37583524
17268C7583524J984297M927908R243238J6826938L0717568M8416444N1703215
$$ 37583524 39567821 44495729 53738967 70565905 101283473 149699917 201403132
17261B01403132L1691647Q317074k928508J096889M572363r135814k9244245m6259323
$$ 201403132 233094779 241411853 238483345 239580234 244152597 235016783 205772538 159513215
17253A59513215m9161490l6041156k1298813j2352864p837147n482197l984461
$$ 159513215 110351725 74310569 53011756 40658892 32821745 27339548 23355087
17246B3355087k935480k379369k074239j894567j671770j358738r83670o92055
$$ 23355087 20419607 18040238 15965999 14071432 12399662 11040924 10057254 9365199
17238I365199m91648m78930m98848m90334m35732l31744l11774l33362k48375
$$ 9365199 8873551 8394621 7895773 7405439 6969707 6637963 6326189 5992827 5744452
17229E744452k33508k93965l45854l34450k66370k06650k48369l50101m36733
$$ 5744452 5510944 5216979 4871125 4536675 4270305 4063655 3815286 3465185 3028452
17220C028452l83033l03193j94003j44052j25985q0921j06152j11114p8078k6752
$$ 3028452 2645419 2342226 2148223 2004171 1878186 1797265 1691113 1579999 1501921 1475169
17210A475169k7021o5100o1713l4077k7386l5313n5175k2113l1489m8255k1179
$$ 1475169 1448148 1383048 1321335 1287258 1259872 1224559 1169384 1147271 1115782 1067527 1046348
17199A046348j2790j4180o5594j5342J9364j8513l3422k3882o1509n2823k0122
$$ 1046348 1033558 1019378 953784 938442 957806 939293 905871 881989 820480 767657 747535
17188G47535j0491k2254l679m95L230K7021J2439j2367k0928m6238m5648J439
$$ 747535 737044 714790 711111 710616 713846 740867 753306 740939 720011 673773 628125 629564
17176F29564L1309j0244j4195q999o246k2453l9652l2090N350k7322r075k0310
$$ 629564 660873 650629 636434 627435 621189 598736 559084 526994 532344 505022 495947 475637
17164D75637j2105k0833q227j0153K8456R446K673P614R086J5473K7148L6856
$$ 475637 463532 442699 434472 424319 452775 462221 464894 472508 481594 497067 524215 561071
17152E61071j5176k7978N247J9870L044K0302K1421J6156J3957j3421k9660j0661
$$ 561071 545895 517917 523164 543034 546078 566380 587801 603957 617914 604493 574833 564172
17140E64172j6968l076k1226o388k2404j9683j8718P871K0948j9378l3958k233
$$ 564172 547204 544128 522902 516514 494110 474427 455709 463580 484528 465150 431192 428959
17128D28959K6251J3219K4036p15n584N619J1965J048J3927r600J388l9072k0564
$$ 428959 455210 468429 492465 491750 486166 491785 503750 504798 518725 509125 510513 471441 450877
17115D50877o9256l4089q386j4778l3334r163k3323k2804r764k2122J5092r709
$$ 450877 381621 347532 339146 324368 291034 281871 258548 235744 225980 203858 218950 209241
17103B09241l2604k882K3403N383k3798j4281k1288k158K2766L6791q130J4023
$$ 209241 176637 173755 197158 202541 178743 164462 143174 141016 163782 200573 192443 206466
17091B06466M1146j936J0936J2581J0603K4489J9689K0203K522K0824J5525j6648
$$ 206466 247612 245676 256612 269193 279796 304285 323974 344177 346699 367523 383048 366400
17079C66400j7478l1111p805M133k0959m6224m7805p555o510J3726K8908k9435
$$ 366400 348922 317811 310006 314139 293180 246956 199151 191596 185086 198812 227720 198285
17067A98285l6505p826n220k0585k1786J0066L0011N5102J5532m1682o9204j2001
$$ 198285 161780 153954 148734 128149 106363 116429 146440 201542 217074 175392 106188 94187
17055I4187J7590L7376j69m8216p9434n1734k9501K2055K7802L2521M0858K3317
$$ 94187 111777 149153 148984 100768 21334 -30400 -59901 -37846 -10044 22477 63335 86652
17043H6652M3510J817l3197m2405l4906j4263J9958O7295M5174L5355K7947L3591
$$ 86652 130162 131979 98782 56377 21471 7208 27166 94461 139635 174990 202937 236528
17031B36528j5569n2640p5283l8692K3892O0154Q5900M7681J6271k224M3631K3131
$$ 236528 220959 168319 93036 54344 78236 138390 224290 271971 288242 286018 329649 352780
17019C52780k5000l4124k2259o455J3927L0376M1708K3916J5670j1618m1472J8152
$$ 352780 327780 293656 271397 264942 278869 309245 350953 374869 390539 378921 337449 355601
17007C55601j319j9371k4865J8849J3763K2096o745j0160j4292O345J7491Q395
$$ 355601 354282 334911 310046 328895 342658 364754 358009 347849 333557 339902 357393 365788
16995C65788k0155M283J8030M649L1615J3166p179J8492L1282L0180M8657N0424
$$ 365788 345633 349916 367946 372595 404210 417376 410197 428689 459971 490151 538808 589232
16983E89232Q676k0250L610j0064J8707J6885M1094K46J9470N3374M7762L3774
$$ 589232 597908 577658 581268 571204 589911 606796 647890 648136 667606 720980 768742 802516
16971H02516K3440K7692K4563K5524J9064M8718N3306P1734O1302P4307R0436
$$ 802516 825956 853648 878211 903735 922799 971517 1024823 1096557 1157859 1232166 1322602
16960A322602R3997J62428K72569L78626K53137O3716j5245q7342J4J73804K69062
$$ 1322602 1416599 1579027 1851596 2230222 2483359 2547075 2531830 2444488 2444502 2618306 2887368
16949B887368M75597N86669M36808L69131K14916j1848M1883Q3064K75460O46765
$$ 2887368 3362965 3949634 4386442 4755573 4970489 4958641 5000524 5083588 5359048 6005813
16939F005813J048505J350234J441502J417208J317754J466583K000398L175075
$$ 6005813 7054318 8404552 9846054 11263262 12581016 14047599 16047997 19223072
16931A9223072N161868Q442779J4320709K6215478M8400043O3287232K6370186
$$ 19223072 24384940 32827719 47148428 73363906 121763949 185051181 211421367
16924B11421367j0388322l5902404n3806586l4737505j5428197m180500M447178
$$ 211421367 201033045 165130641 111324055 76586550 61158353 56977853 61425031
16917F1425031J4600171L1505452N5249850M8263928K901628k2193375m8725673
$$ 61425031 76025202 107530654 162780504 211044432 213946060 191752685 143027012
16910A43027012m5969362k2719761o533565N830870K1549619M4285051M8912211
$$ 143027012 97057650 74337889 67804324 73635194 95184813 139469864 188382075
16903A88382075R989155j6101892m0211644m6551519k6690030j1711677k829148
$$ 188382075 198371230 182269338 142057694 95506175 68816145 57104468 54275320
16896E4275320M664170J4492137L1877152N1659981L2707705o155617k7094206
$$ 54275320 58939490 73431627 105308779 156968760 189676465 183520848 156426642
16889A56426642m9786789l9988967k1725145j1951848p064754m514690l072433
$$ 156426642 106639853 66650886 44925741 32973893 25909139 21394449 18322016
16882A8322016k068036j547146j171780j129267j199899j163571j164450j065273
$$ 18322016 16253980 14706834 13535054 12405787 11205888 10042317 8877867 7812594
16874G812594q31251n94940l37858p4944j21r4748k41447n02886n50213n86078
$$ 7812594 6981343 6386403 6048545 5973601 5973480 5878732 5637285 5134399 4584186 3998108
16864C998108m54789l42652k55592j47292r7102k0387L5846Q7107n2245j86748
$$ 3998108 3543319 3200667 2945075 2797783 2700681 2680294 2716140 2803247 2751002 2564254
16854B564254l08636l28321k22826j28851r9367n4943n9819p6104n1460l3975
$$ 2564254 2255618 1927297 1704471 1575620 1476253 1421310 1361491 1285387 1233927 1199952
16844A199952n5235m1037r669k4194l5427k7041r886m3395l4386j0185k9492j2591
$$ 1199952 1144717 1103680 1094011 1069817 1034390 1007349 997463 954068 919682 909497 880005 867414
16832H67414k6725l0079m3190k00R917j6692L869l222m3437l9232k6773L242K4076
$$ 867414 840689 810610 767420 767220 777137 760445 764314 761092 717655 678423 651650 654892 678968
16819F78968N216j5704j5415k8814L444J1054l6375n5224l1228l3282l4179m6120
$$ 678968 684184 668480 653065 624251 627695 638749 602374 547150 515922 482640 448461 402341
16807D02341J0971K8570P100R617l929K3647L1897q544l2286l9168l7916L946
$$ 402341 413312 441882 448982 458599 454670 478317 510214 501670 469384 430216 392300 396246
16795C96246J9666j8625K732M0141L8966O8561O9039N062n2460o8067m7821m0369
$$ 396246 415912 397287 400019 440160 479126 547687 616726 621788 569328 501261 453440 413071
16783D13071L679M1571P1304L5899N6975O614j7925m0962l0521M709j1405m4701
$$ 413071 416750 458321 529625 565524 622499 629113 611188 570226 539705 544414 533009 488308
16771D88308j8814L0974L4968M3881J5580l8908k6477o0092m0998K6188K8770
$$ 488308 469494 500468 535436 579317 594897 555989 529512 469420 428422 454610 483380
16760D83380k6652L387o530l9440q703N624J8265k7809k4595p017j4459l8769
$$ 483380 456728 460115 453585 414145 405442 411066 429331 401522 376927 369910 355451 316682
16748C16682l5083j3540J893k8223j5984N520j5516k3964l3297k6550J506L1345
$$ 316682 281599 268059 269952 241729 225745 231265 215749 191785 158488 131938 133444 164789
16736A64789k74J0111K5389O5234R3230J02321K28402L13969K50009J59862N6159
$$ 164789 164515 174626 200015 265249 358479 460800 689202 1003171 1253180 1413042 1469201
16725A469201l607K5398L0785n7958j74838k62972k73648j90052j21213o8099
$$ 1469201 1465594 1490992 1521777 1463819 1288981 1026009 752361 562309 441096 372997
16715C72997l7130M1898k0288J2653J9944O0212J05752J49614K39830K40689J03447
$$ 372997 335867 377765 357477 370130 390074 450286 556038 705652 945482 1186171 1289618
16704A289618K5798j8676j5490l2946r2021j50356k04544j78918j17367o6588
$$ 1289618 1315416 1296740 1281250 1248304 1156283 1005927 801383 622465 505098 438510
16694D38510m1003o167k4382m1650k8359k144o070k3428j6069O022J7701R412
$$ 438510 397507 391340 366958 325308 296949 294805 288735 265307 249238 255260 272961 282373
16682B82373j3943k1368J3541j9041k0116J372k0800K281r273j6715K5628K6747
$$ 282373 268430 247062 260603 241562 221446 222818 202018 204299 195026 178311 203939 230686
16670B30686J0849o31j7717j0753o542q123j0097j2446k869J0468L808k7163J2957
$$ 230686 241535 240904 223187 212434 205892 197769 187672 175226 172357 182825 186633 159470 172427
16657A72427L6945j101k365q425n21k7768J6284K243J0273m670O788J248K7232
$$ 172427 209372 208271 205906 197481 196960 169192 185476 187719 197992 193322 200110 201358 228590
16644B28590M6869J4408j0046N43r546Q530K7900P0726O4134K9609K760n843k7006
$$ 228590 275459 289867 279821 280364 270818 279348 307248 377974 442108 471717 474477 468634 441628
16631D41628o0568n3588j0296j3435k373j4558j2096j4889l1663l1303j9206R616
$$ 441628 381060 327472 317176 303741 301368 286810 274714 259825 228162 196859 177653 187269
16619A87269J157J6539l678j4000J1505K3901r2j6481J0458Q903o982m2343r935
$$ 187269 188426 204965 201287 187287 198792 222693 222601 206120 216578 225481 218499 176156 166221
16606A66221j5747L917j6040n486K6169J547k7367j0138p827q268L342p236n467
$$ 166221 150474 154391 138351 132865 159034 160581 133214 123076 115249 106981 110323 103087 97620
16593I7620m493J2459J1421k3365Q890L7051j3784m1348p358K2173K5913k2109
$$ 97620 93127 105586 117007 93642 102532 139583 125799 84451 77093 99266 125179 103070
16581A03070q178K3549K3779m0024n73J3376J3115J3276k3358m5940j2869N567
$$ 103070 94892 118441 142220 102196 101623 114999 128114 141390 118032 72092 59223 64790
16569F4790J2958o898J7408K0407k771k1613L380j3450p340j41N043J6638k2346
$$ 64790 77748 70850 88258 108665 105894 84281 87661 74211 66871 66730 71773 88411 66065
16556F6065j4743K2988L3180k4755p046J584k6005k3560j9484J8994J8775N70
$$ 66065 51322 74310 107490 82735 75689 77273 51268 27708 8224 27218 45993 46563
16544D6563n113J0495K5004J7505j6451p386K5499q740J056L0271l2567k6988
$$ 46563 41450 51945 76949 94454 78003 70617 96116 87376 88432 118703 86136 59148
16532E9148q690K8637o682k6351K6204J2662L402O082r380j4751k4355k114m717
$$ 59148 50458 79095 72413 46062 72266 84928 88330 94412 85032 70281 45926 43812 39095
16519C9095j5255M7944K2938K59l770M210p654k3215r295q679k050k388N242N257
$$ 39095 23840 71784 94722 94981 91211 95421 87767 64552 55257 46578 44528 42140 47382 52639
16505E2639Q212l078M871Q962J5406n763l5302j4799O469l941L0069K174M663
$$ 52639 60851 57773 62644 71606 87012 81249 45947 31148 37617 33676 63745 65919 70582
16492G0582k3054k0998j5051l522J9439P452Q95p149p436K2225K4315L0862k0628
$$ 70582 47528 26530 11479 7957 27396 34848 35743 28594 21158 43383 67698 98560 77932
16479G7932r772N572J3081m757o574K5644J7331k1918j2187r127o944J5264L75
$$ 77932 68160 73732 86813 82056 75482 101126 118457 96539 84352 75225 68281 83545 83920
16466H3920n441J6573J3139k34M645J946o347J458j1043k2793k6792k6682p325
$$ 83920 78479 95052 108191 107957 112602 114548 108201 109659 98616 75823 49031 22349 15024
16453A5024J2639K8909K9286K091J9512o658k2066j4562m44R344K2935J8449M833
$$ 15024 27663 56572 85858 87949 107461 100803 78737 64175 63731 73075 96010 114459 119292
16440A19292J2027j436k1166j999r547j6098n562j8064l1487m808P375J5793j7221
$$ 119292 131319 129883 108717 106718 97171 81073 75511 57447 25960 21152 28527 44320 27099
16427B7099P091J9113Q113J0916J0824j6363k0744l518O611J4542K3936p299n603
$$ 27099 34190 53303 61416 72332 83156 66793 46049 42531 49142 63684 87620 80321 74718
16414G4718K6559k554N064J289k8252J5198K2466j5288k2551l1198j730K2356
$$ 74718 101277 98723 103787 105076 76824 92022 114488 99200 76649 45451 43721 66077
16402F6077O406l771m224J9831K3143j4643J0199J2560j9241n283j1161m430j696
$$ 66077 72483 68712 64488 84319 107462 92819 103018 115578 96337 91054 79893 75463 73767
16389G3767j5962L5557P507l5086k9389j832M9764J9778J8066j808K439j4480
$$ 73767 57805 93362 100869 65783 36394 34562 84326 104104 122170 120362 122801 108321
16377A08321k0697j4009K1205L8044M3335O814k2824L2976P8971P4618J69931
$$ 108321 87624 73615 94820 132864 176199 183013 160189 193165 272136 346754 516685
16366E16685L03522K44761M1084r3476k22576k14018j46007n8489k1674L5785
$$ 516685 820207 1064968 1106052 1012576 790000 575982 429975 371486 349812 385597
16356C85597J08857K18459K86632J28462n4697j42698k28837j52773n6122j2113
$$ 385597 494454 712913 999545 1128007 1073310 930612 701775 549002 492880 480767
16346D80767O8038J53985K54214J32483j8612j42526k07829j81585j11272l2795
$$ 480767 548805 702790 957004 1089487 1070875 928349 720520 538935 427663 394868
16336C94868j1084M1928J06419K12076K40780Q3444q0301k08667k28913j47643
$$ 394868 383784 425712 532131 744207 984987 1068431 988130 779463 550550 402907
16326D02907j09787p7857m8277j1101J8114J3493j8126l3124j5053O752N856j275
$$ 402907 293120 215263 166986 155885 173999 187492 169366 136242 121189 127941 133797 132522
16314A32522J560j7781n0023k8769M559p792J729o63R870J1378j736j403j1780
$$ 132522 134082 116301 66278 37509 42068 34276 36005 35342 45212 56590 54854 53451 41671
16301D1671k8237o577J993O889o231O790N133k5673O463J4839K0258J2172J6649
$$ 41671 13434 6857 8850 15739 9508 16298 21431 -4242 2221 17060 37318 49490 66139
16288F6139K7290j6463j2854k6073j5249j0132K1243J7806j3733k4222j7614J8075
$$ 66139 93429 76966 64112 38039 22790 12658 33901 51707 37974 13752 -3862 14213
16276A4213K5174J7688J828l4023j8480K651J712N146K0039L6334K3531j0111
$$ 14213 39387 57075 58903 24880 6400 9051 10763 15909 35948 72282 95813 85702
16264H5702j3438j4282l0893j2243M1003O353p224K5587K5452L482J5286o957
$$ 85702 72264 57982 27089 14846 55849 62202 54978 80565 106017 109499 124785 117828
16252A17828k5546R879J785L453k9581k3932N969J1083l4437J247K5358p567j0465
$$ 117828 92282 102161 103946 107399 77818 53886 59855 70938 36501 37748 63106 55539 45074
16239D5074K5638K5986l4685j5046J6020l988j1789k2944j824J5890p34j520M872
$$ 45074 70712 96698 62013 46967 62987 58999 47210 24266 22442 38332 37598 36078 40950
16226D0950M907J6440J6978j9324R614j0651q897j5300k606j1629k5589P046q597
$$ 40950 45857 62297 79275 59951 69565 58914 50017 34717 32111 20482 -5107 1939 -6658
16213f658k3014j5148L8825J0880J0676L0619M6497P851M158j6739m6824p217
$$ -6658 -29672 -44820 -5995 4885 15561 46180 92677 100528 104686 87947 41123 33906
16201C3906J9161J334p722j8711L380l38Q137J3077j6581j637J5313N678j6922
$$ 33906 53067 54401 46679 27968 31348 31010 39147 52224 35643 34006 49319 54997 38075
16188C8075j78J6150k1520l3988J3086K6544K0190O882j5475J9026q630p547j9005
$$ 38075 37897 54047 32527 -1461 11625 38169 58359 65241 49766 68792 60162 52615 33610
16175C3610j8020J3028K8182K3459j7566j7482j8591m913K6916J998k6161j1330
$$ 33610 15590 28618 56800 80259 62693 45211 26620 21707 48623 50621 24460 13130
16163A3130J0587P344J5357J3463J024r369k8221k8961R4J3323K5287J8142K4210
$$ 13130 23717 31061 46418 59881 60905 51536 23315 -5646 -5552 7771 33058 51200 75410
16150G5410j94k6902l993k735L537r532j6235J9277K4885j6881N899J5360n284
$$ 75410 75216 48314 44321 41586 45123 35591 19356 38633 63518 46637 52536 67896 62612
16137F2612K1093J72k912k800o524k4692Q631m826k4649l424k482l3270L788K0486
$$ 62612 83705 83877 80965 78165 71641 46949 55580 50754 26105 22681 20199 -13071 -9283 11203
16123A1203J4054J639J275q205J7190K408K932K3475L145k1345j8958P232J1268
$$ 11203 25257 26896 28171 19966 37156 39564 42496 65971 69116 47771 28813 36045 47313
16110D7313J7739o644m9613l830n562k3530K602K7615L6840L3133j2200J6842
$$ 47313 65052 58408 8795 4965 -597 -24127 -21525 6090 42930 76063 63863 80705
16098H0705j0124k726j3444k0767k6108K611M611M765j6626k08p663J8612J34
$$ 80705 70581 67855 54411 33644 7536 10147 14758 19523 2897 2689 -4974 13638 13772
16085A3772k4507l6411O846M6976J1285J4479l229r566r351q123L809J4355K348
$$ 13772 -10735 -47146 -40300 6676 17961 32440 29211 19645 10294 2171 5980 20335 22683
16072B2683K1930J1006J2444m911l7335k7848J2781J6659m7145k1917L7270J9481
$$ 22683 44613 55619 68063 63152 25817 -2031 10750 27409 -19736 -41653 -4383 15098
16060A5098k6184K172M2186L1242j3694j688R030l3228k5220k1613L7248L6589
$$ 15098 -11086 -8914 33272 64514 50820 49132 58162 24934 -286 -21899 15349 51938
16048E1938M556j5297K2651K5733j6907k4345o502j2415K5251j4194k6556l122
$$ 51938 56494 41197 63848 89581 72674 48329 41827 29412 54663 40469 13913 10791
16036A0791k017k0338k9637n343K3020N7324l218k4439j591j1204l666J0940J0384
$$ 10791 8774 -11564 -41201 -46544 -23524 33800 30582 6143 4552 -6652 -10318 622 11006
16023A1006k1322L4070K7701J0989J1891k4305j3087j0179P391K112k3363l0190
$$ 11006 -10316 23754 51455 62444 74335 50030 36943 26764 34155 36267 12904 -17286
16011a7286M1275J7447j1707J4550o697j5263q511K389n455j1817M362j0877k3458
$$ -17286 23989 41436 29729 44279 37582 22319 13808 16197 10742 -1075 3287 -7590 -31048
15998c1048K0659K7608K35k5660j3797o49J3262L0293Q348N898j701K4951K0534
$$ -31048 -10389 17219 17454 -8206 -22003 -22652 -9390 20903 29251 35149 33448 58399 78933
15985G8933p461k2893l1506j0249M822K7502j4863p238K526J559J0588J9597j3752
$$ 78933 71472 48579 17073 6824 11646 39148 24285 17047 19573 21132 31720 51317 37565
15972C7565q148o88J3270L0805j4565q400k839p619k0192Q034K1253J4994m9300
$$ 37565 29417 28729 41999 72804 58239 49839 47000 39381 19189 27223 48476 63470 14170
15959A4170j9706q261L2250R879j4586K220j7569R904J5664k3468K3366j725P053
$$ 14170 -5536 -13797 18453 28332 13746 15966 -1603 8301 23965 497 23863 22138 29191
15946B9191R85m119l194O122k1739j2750K3958P504m129K2462j8887k4733N798
$$ 29191 30176 26057 22863 28985 7246 -5504 18454 25958 21829 44291 25404 671 6469
15933F469K0592m954n969K125j892J2117j1043j3589M524J2547k1852J1822K1391
$$ 6469 27061 22107 16138 18263 16371 28488 17445 3856 8380 20927 -925 10897 32288
15920C2288J3391j129J936M433l4722k2606L3056L2855r931k9038k74L6059P649
$$ 32288 45679 44550 46486 50919 16197 -6409 26647 59502 49571 20533 20259 56318 63967
15907F3967L626j0080l4724j6043K1252M204k346r841M090J1301j8543j0033O065
$$ 63967 67593 57513 22789 6746 27998 32202 29856 20015 24105 35406 16863 6830 12895
15894A2895q267N325K8306L467o525n813M781l341j9031l6688j600N207J4857
$$ 12895 4628 9953 38259 41726 35201 29388 34169 30828 11797 -24891 -26491 -21284 -6427
15881f427K0774J6597K4695j2573L500N054l9945m272m423j4470J3518K6495M5440
$$ -6427 14347 30944 55639 43066 46566 51620 11675 7403 2980 -11490 2028 28523 73963
15868G3963O483j7670o689j930k3256r395J4078K0611R610j4736k2843q218j0689
$$ 73963 80446 62776 56087 54157 30901 21506 35584 56195 65805 51069 28226 20008 9319
15855I319j406j8812J6229L081J6446k3676r709M208j3947J0022J5262J5837m630
$$ 9319 7913 -10899 5330 8411 24857 1181 -8528 -4320 -18267 -8245 7017 22854 18224
15842A8224m3772J7158M1965p075j4941k413J310K4081J3459L5990K168k5267
$$ 18224 -25548 -8390 33575 26500 11559 9146 10456 34537 47996 83986 86154 60887
15830F0887l2379M62N727j7922l134Q559J95J4402J88k5548j9502L3262N6118
$$ 60887 28508 28970 34697 16775 13641 22200 22395 36797 36985 11437 -8065 25197 81315
15817H1315k087l4258j5065l2099k9970K8247L5591K7792K2987j288j9274k5726
$$ 81315 79228 44970 29905 -2194 -32164 -3917 31674 59466 82453 81165 61891 36165
15805C6165k4467p4j8040K7167L638j1532l2795M607J9153l417j6497j559p22
$$ 36165 11698 11624 -6416 20751 24389 12857 -19938 -15331 3822 405 -16092 -17651 -18373
15792a8373L5596J1873j3316J954j4807j1785k1161K3783M9357J3238M457j6529
$$ -18373 17223 29096 15780 17734 2927 -8858 -30019 -6236 43121 56359 60816 44287
15780D4287N61j5610l574J2822k393k949k3054k1666J1565M518j9039p593j482
$$ 44287 44848 29238 25664 38486 36093 33144 10090 -11576 -11 4507 -14532 -22125 -23607
15767b3607O771j9332p153K2887K2246O999N589K7173R058J951J257j3728l0265
$$ -23607 -16836 -36168 -43321 -20434 1812 8811 14400 41573 50631 52582 53839 40111 9846
15754I846J3248K8639J6997N605j1247o129P595j6248k9666p209M465K0141o488
$$ 9846 23094 51733 68730 74335 63088 56959 64554 48306 18640 11431 15896 36037 29549
15741B9549l1538N888J4235L227j0148j4723q428p857P078K6609j6052j1867K5101
$$ 29549 -1989 3899 18134 21361 11213 -3510 -11938 -19795 -12717 13892 -2160 -14027 11074
15728A1074J0569r572j1997K4434L5897K0059p583q606j0787j2614L4728K5451
$$ 11074 21643 12071 74 24508 60405 80464 72881 64275 53488 40874 75602 101053
15716A01053k5025k8950k3315K0712j230k2846J1884L2700p425J5994q168l1855
$$ 101053 76028 47078 23763 44475 43245 20399 32283 64983 57558 73552 65384 33529
15704C3529L055j3079j0438K7198r367k0378j5336j0594J4100J5401j1222K0187
$$ 33529 36584 23505 13067 40265 30898 10520 -4816 -15410 -1310 14091 2869 23056
15692B3056k3815p381N357L0941K4125j5470j0536l0878q975M8010m226l0360
$$ 23056 -759 -8140 -2783 28158 52283 36813 26277 -4601 -13576 34434 30208 -152
15680a52p361M2251L2543l323l931L003k8491k5604R915J1074R146k894k1502
$$ -152 -7513 34738 67281 63958 60027 63030 34539 8935 18850 29924 39070 36176 14674
15667A4674j5247N597P418O648n41M012P882o560p566k593k889J686M011k513
$$ 14674 -573 5024 12442 19090 18549 22561 30443 23883 16317 13724 10835 12521 16532 14019
15653A4019O822n822K587J132k5619P790m78k4172o168K5353J4784j1871J3195
$$ 14019 20841 15019 17606 18738 -6881 909 431 -23741 -29909 -4556 10228 -1643 11552
15640A1552N080K3945Q154o035m661k8866K3170M141k241M321n858M083k373j4738
$$ 11552 16632 40577 48731 42696 38035 9169 32339 36480 34239 38560 32702 36785 34412 19674
15626A9674j0383J6571K2884J3312o035N8o077j6707J6311K297l495k3941p538
$$ 19674 9291 25862 48746 62058 56023 56081 50004 33297 49608 51905 48410 24469 16931
15613A6931l473K758J6483Q548O576j9927j2431Q926q404m065j353L963r385k798
$$ 16931 13458 16216 32699 41247 47823 27896 15465 24391 15987 11922 10569 14532 5147 2349
15599B349J3579O938P216J6924J4451k0082j9112q985m383K033j4670J3968K3961
$$ 2349 15928 22866 30082 47006 61457 41375 22263 13278 8895 10928 -3742 10226 34187
15586C4187J3222N724l905J506O550j88o668l8947k2667k5698K2484N227o074
$$ 34187 47409 53133 49228 50734 57284 57096 50428 11481 -11186 -36884 -14400 -9173 -15247
15573a5247O204n675j1859J494J6093M1111j999K300L92k5026m389O747J5747
$$ -15247 -9043 -14718 -26577 -25083 -8990 32121 30122 32422 32814 7788 3399 10146 25893
15560B5893o250J5076J7223J3039l851k3576K799R945n812k6410o049J2933O380
$$ 25893 19643 34719 51942 64981 61130 37554 40353 50298 44486 18076 12027 24960 31340
15547C1340L535p282p365l403k053N54L641q270J087k3681J0920J7190K9849J3088
$$ 31340 34875 27593 20228 16825 14772 15326 18967 10697 11784 -11897 -977 16213 46062 59150
15533E9150j9578k9491m6335k1696K7043L1392N214J5975j0543j6253J8050J0957
$$ 59150 39572 10081 -36254 -57950 -30907 485 5699 21674 11131 -5122 12928 23885
15521B3885Q35p684k1625k0190J1020J6012J0903j77J9969J0912J4202j4837k7525
$$ 23885 24720 17036 -4589 -24779 -13759 2253 13156 12979 32948 43860 58062 43225 15700
15508A5700j5493l2089l1024J1045J9840Q863J627n462K643M0897L585k4356K3889
$$ 15700 207 -31882 -62906 -51861 -32021 -23158 -21531 -26993 -24350 16547 20132 -4224 19665
15495A9665R740K4856k400r496j8245k0529N602J5648l082Lj7474K369J6617K6013
$$ 19665 29405 54261 51861 42365 24120 3591 9193 24841 21759 21762 4288 6657 23274 49287
15481D9287o998Q539R178J2382k3224j1067j1009k6325j4273P603N970P275j0192
$$ 49287 42289 50828 60006 72388 49164 38097 27088 763 -13510 -5907 63 7338 -2854
15468b854j3744L852K7789K045l8545O563K5458Q896m484p544k590q803R750M964
$$ -2854 -16598 -12746 15043 17088 -21457 -14894 10564 19460 14976 7432 4842 -3961 5789 10753
15454A0753J4216m291Q23k799P880J1425K162J5827K1887J691j2978k2053k0232
$$ 10753 24969 20678 21501 18702 26582 38007 40169 55996 77883 79574 66596 44543 24311
15441B4311m488j8390m268J0081j2268J140K4899L3344J633n1137n985L2120J4333
$$ 24311 19823 1433 -2835 7246 -5022 -3882 21017 54361 55994 4857 -1128 30992 45325
15428D5325j9186k1075n908k02j955j5159j5713q09K8864j904O356J8101j6261
$$ 45325 26139 5064 -844 -1046 -3001 -18160 -33873 -34682 -5818 -7722 -1366 16735 474
15415D74o992j0443L033O979K0861K5992j8448P92J0023P060o712J6724r163J7931
$$ 474 -6518 -16961 -13928 -6949 13912 39904 21456 22248 32271 39331 32619 49343 40180 58111
15401E8111R244k8640j8448p203k073O905O449k146q543q836K4945l465n162K9845
$$ 58111 67355 38715 20267 13064 10991 17896 24345 22199 13656 4820 29765 26300 21138 50983
15387E0983k1616k4467L00O377J0617k96j1202j1890J6069J1242j2205j8504j732
$$ 50983 29367 4900 5200 11577 22194 21898 10696 -1194 14875 26117 13912 -4592 -6324
15374f324L7793K5427J5455J8104k6596k4275j6222J718J911K6913N610K465J116
$$ -6324 31469 56896 72351 90455 63859 39584 23362 25080 26991 53904 59514 61979 63095
15361F3095j350Q180j2096k8660j5950J4286J033J5742K6135p971j8346k3895
$$ 63095 61745 69925 57829 29169 13219 27505 28538 44280 70415 62444 44098 20203
15349B0203l9225J2564K6125J8138M7386J3727j8845j4122l1885J0858k4727k7344
$$ 20203 -19022 -6458 19667 37805 85191 98918 80073 65951 34066 44924 20197 -7147
15337g147j8983j9208J5152L5066L9403k074r906k900j1519m1431l5663J8986
$$ -7147 -26130 -45338 -30186 4880 44283 42209 32303 29403 17884 -23547 -59210 -40224
15325d0224M5634m373M932J7247Q385J586J7718P952m2209k2539K584j1162k1631
$$ -40224 5410 1037 5969 23216 31601 33187 50905 58857 16648 -5891 -3307 -14469 -36100
15312c6100j3339L408N662k6579J2292M1877K0483Q750k092j2865l1197P534K3979
$$ -36100 -49439 -46031 -40369 -66948 -54656 -12779 7704 16454 14362 1497 -29700 -22166 1813
15299A813J4594j4462K2724J3092L625j8534k01J16J0767j1227k3550j1759n951
$$ 1813 16407 1945 24669 37761 41386 22852 22651 22767 33534 22307 -1243 -13002 -18953
15286a8953j373j0680J3485K9379J1267O190j1240m0462j8977L1977L0453J0484
$$ -18953 -20326 -31006 -17521 11858 23125 29315 18075 -22387 -41364 -9387 21066 31550
15274C1550j8650k7735k9433K5597L3351Q167N148l959j336m011k1070n766J1543
$$ 31550 12900 -14835 -44268 -18671 14680 22847 27995 24036 22700 18689 -2381 -8147 3396
15261C396R909R653r665K897n773Q371m082k2594j7344m905J5618L9566K200j2360
$$ 3396 13305 22958 13293 16190 10417 18788 14706 -7888 -25232 -30137 -14519 25047 27247 14887
15247A4887K181K7867N72J646j0230j1535j047p190O014J698n800m660o356j5993
$$ 14887 17068 44935 45507 47153 36923 25388 24341 17151 23165 24863 19063 14403 8047 -7946
15233g946K2589L225k5897j0451q67K9626K2727J2375M355N06j0797j7998r662
$$ -7946 14643 17868 -8029 -18480 -19347 10279 33006 45381 49736 50242 39445 21447 11785
15220A1785M12K0626j2500k0981L859J9773j2601J4374k021n436K0477J9755N90
$$ 11785 12197 32823 20323 -658 3201 22974 10373 24747 22726 17290 37767 57522 58112
15207E8112o070j0324l0994k2857j569m720R553J8428k592k421p137l0760L828
$$ 58112 52042 41718 10724 -12133 -13702 -18422 -8869 9559 6967 4546 -2591 -33351 -29523
15194b9523K4422L334l4138P683K2732J2855J8849Q94j5557J62P435j127q514
$$ -29523 -5101 -1767 -35905 -28222 -5490 7365 26214 27108 11551 11713 19148 18021 9507
15181I507j2035J7663n309Q446Q7j2011J4160L231j5831L369L1845n874j6765
$$ 9507 -2528 15135 9826 18272 18359 6348 20508 23739 7908 11277 43122 37248 20483
15168B0483L1791R238k9265r832k1934l673J0138K3747p209r776k717j4108j7767
$$ 20483 52274 61512 32247 22415 481 -3192 6946 30693 23484 13708 10991 -3117 -20884
15155b0884K4441K4076o417j0257o26j7111k9423K1433Q682o140j5848L0917j5158
$$ -20884 3557 27633 21216 10959 10333 -6778 -36201 -14768 -6086 -12226 -28074 2843 -12315
15142a2315j0801J6194L6002J2690l486j7325j2765j1199j402L321J3054l460
$$ -12315 -23116 -6922 29080 41770 38284 20959 8194 -3005 -4407 -1086 11968 8508
15130H508Q911K1401K1293O107j0400j7301J0216R28j7537J446p320O535P083
$$ 8508 17419 38820 60113 66220 55820 38519 48735 49663 32126 33572 26252 32787 39870
15117C9870p948l2900J9380K8101n118j9152J9296j0025K1931j7133j5004M024
$$ 39870 31922 -978 18402 46503 41385 22233 41529 31504 53435 36302 21298 25322
15105B5322R101R100j6576J0125k627Q065m096l3761J7834j7266J1597K0442K3870
$$ 25322 34423 43523 26947 37072 34445 42510 38414 4653 22487 5221 16818 37260 61130
15092F1130J1064p570q627m722J8553j2012l9316Q414J2456k3850n123M2007J86
$$ 61130 72194 64624 55997 51275 69828 57816 18500 26914 39370 15520 10397 52404 52590
15079E2590k5225p463J2681J7477j2012Q07N729p299J5622J4922j9290j8560j1741
$$ 52590 27365 19902 32583 50060 38048 38855 44584 37285 52907 67829 48539 29979 18238
15066A8238R54j8612O479Q605n446P05m432P264K067K9086j6248j1201j2056k901
$$ 18238 19192 580 7059 15664 10218 10923 6491 13755 15822 44908 28660 17459 5403 2502
15052B502k261J2387L6065k1471l2949P629O831N763J49K607j2760k7187j8133
$$ 2502 241 12628 48693 27222 -5727 1902 8733 14496 14645 17252 4492 -22695 -40828
15039d0828J2918k6337J1649L3605K8238J4549J4145m345k170p558J196k5706
$$ -40828 -27910 -54247 -42598 -8993 19245 33794 47939 43594 41424 33866 35062 9356
15027I356k49K8050J0896k251q683k4870R431K7213K1363J7286l0629q650R27
$$ 9356 9107 37157 48053 45802 37119 12249 21680 48893 70256 87542 56913 48263 49190
15014D9190K5937J181j2987K7766p347p939j0725k7639j2493N209J0788P48j8603
$$ 49190 75127 76308 63321 91087 83740 75801 65076 37437 24944 30153 40941 41689 23086
15001B3086j0524L1963L8432O755J9868O6997N9964O6990J20175K28858M59308
$$ 23086 12562 44525 82957 89712 109580 176577 236541 303531 423706 652564 1111872
14990A111872Q47849O47465l4941l32170p61338o47436l19479j34429o9211n1274
$$ 1111872 1959721 2607186 2572245 2240075 1478737 831301 511822 377393 308182 256908
14980B56908m5396m5930l5891p247r031k2801j1998L418j7106j7481L709P96R941
$$ 256908 211512 165582 129691 122444 113413 90612 78614 82032 64926 47445 51154 51950 61891
14967F1891L633j6663K458l018j0157k5977m944Q348o375K401L811l395J8628
$$ 61891 65524 48861 51319 48301 38144 12167 7223 15571 9196 11597 15408 12013 30641
14954C0641j244j3127P739l7558j3095K9453K6432k1316o621K1247M401k1578
$$ 30641 29397 16270 24009 -13549 -26644 2809 29241 7925 1304 22551 26952 5374
14942E374K6148M0419N761l0390j9192k0668K0979o494m2609o057K6731J4106
$$ 5374 31522 71941 77702 47312 28120 7452 28431 21937 -20672 -26729 2 14108
14930A4108m07o531j2573o552P88K1382j4068J979L1508L8704J501j337j9072
$$ 14108 13701 7170 -5403 -11955 -11167 10215 -3853 -1874 29634 68338 69839 68502 49430
14917D9430K657J9547J4323M504l9654m0879J0683r231L52k2071k0499K8928J7871
$$ 49430 52087 71634 85957 90461 50807 9928 20611 11380 11732 -10339 -30838 -1910 15961
14904A5961j2085q652K893n935j1726J7507L1208J2024k5924p180l132j1348M509
$$ 15961 3876 -4776 -1883 -7818 -19544 -2037 29171 41195 15271 8091 4959 -6389 -1880
14891a880L3361r073k5452o99J0479Q638J6719J4270J5503j3074n173r314m474
$$ -1880 31481 22408 -3044 -3743 6736 15374 32093 46363 61866 48792 43619 34305 29831
14878B9831R954Q494k2747k5390O036J2692Q078J2478K2180p562j6393j7545M008
$$ 29831 39785 48279 25532 142 6178 18870 26948 39426 61606 54044 37651 20106 24114
14865B4114K5275j7401k1013o650j1041m060q951Q5k9367j6603J4984M0165M1496
$$ 24114 49389 31988 10975 4325 -6716 -10776 -19727 -19642 -49009 -65612 -50628 -10463 31033
14852C1033o388K64L899m166j8652N150p406K3223R882l3243j1409p835m24J0178
$$ 31033 24645 24909 28808 24642 5990 11140 3734 26957 36839 3596 -7813 -15648 -16072 -5894
14838e894L7470L895k0398J6223K9709j681m425r558j3016j6012j2227P494j4977
$$ -5894 31576 35471 15073 31296 61005 59324 54899 45341 32325 16313 4086 11580 -3397
14825c397p075k616r12J2254L0792J8659O930k1931j9451l041k2492L9536L5608
$$ -3397 -10472 -13088 -14000 -1746 29046 47705 54635 32704 13253 10212 -12280 27256 62864
14812F2864j4793p962r494n970J2654M847l2295j8527k272P459K6447K6082n341
$$ 62864 48071 40109 30615 24645 37299 42146 9851 -8676 -10948 -3489 22958 49040 43699
14799D3699l077j5864j3656J2816J0130k4166j284J3274j6952p415J5236L4591
$$ 43699 40622 24758 11102 23918 34048 9882 8598 21872 4920 -2495 12741 47332
14787D7332M73j5726l7166K0661J8060J9772K1847J0697K0270J4638m0437M08
$$ 47332 47805 32079 -5087 15574 33634 53406 75253 85950 106220 120858 80421 80829
14775H0829j9301O566j6450m9524k8138J0997K6152L1949R202J6250j5176k3238
$$ 80829 61528 68094 51644 2120 -26018 -15021 11131 43080 52282 68532 53356 30118
14763C0118l3531j5143j171J6862Q026j0608K009J4273J7887K294M35j552p978
$$ 30118 -3413 -18556 -19727 -2865 5161 -5447 -3438 10835 28722 31016 31451 29899 21921
14750B1921p977k0100J7517L1513J3036J8021j1026j8152k0483q334k5100o831
$$ 21921 13944 -6156 11361 42874 55910 73931 62905 44753 24270 15936 -9164 -15995
14738a5995J7589J8733M473k2326j7505K2930K4659o400j9570j1254Q633k811
$$ -15995 1594 20327 24800 2474 -15031 7899 32558 26158 6588 -4666 3967 1156
14726A156j8103k447o991J5022J4331L986j1742J9128J4568l1234j2474L8023
$$ 1156 -16947 -19394 -26385 -11363 2968 6954 -4788 14340 28908 -2326 -14800 23223
14714B3223J0879k0987l225P343k0458K1672R784J9079j3048O24P135O18P542
$$ 23223 34102 13115 9890 17233 -3225 18447 28231 47310 34262 34886 42021 42639 50181
14701E0181k0407j368Q354k566j8817j4727r799j2276M10R53j3702j2662O404
$$ 50181 29774 28406 36760 34194 15377 650 -9149 -21425 -21015 -20062 -33764 -46426 -40022
14688d0022n701M0413L3661k0378l1552J7900m007M274j8678K0786N535J0127
$$ -40022 -45723 -5310 28351 7973 -23579 -5679 -9686 -5412 -24090 -3304 2231 12358
14676A2358J4098L2054j7195k5130M225M072p318J3150J0722p282J7114k783m5904
$$ 12358 26456 58510 41315 16185 20410 24482 17164 30314 41036 33754 50868 48085 2181
14663B181k4874r850K8055J7266k327m003J0423P280J1579R358o534J7275p760
$$ 2181 -22693 -32543 -4488 12778 10451 6448 16871 24151 35730 45088 38554 55829 48069
14650D8069l7333k0938p848p71l752M3763L0312k8606M95j8413o150R36J4737
$$ 48069 10736 -10202 -18050 -18821 -22573 21190 51502 22896 23391 4978 -1172 -236 14501
14637A4501K6551j3349j2916L7053J2608p634j413j3532q210J2912J2990n594
$$ 14501 41052 27703 14787 51840 64448 56814 55401 41869 33659 46571 59561 53967
14625E3967k6400k358K4866o24k6271r098j088K896P940l2975j043K2908j5695
$$ 53967 27567 25209 50075 49451 23180 14082 12994 15890 23830 -9145 -10188 12720 -2975
14612b975K359l326l664j5329l68K1323j9551j3450J0246K8326M2730k3461j6880
$$ -2975 -616 -3942 -7606 -22935 -23303 -1980 -21531 -34981 -24735 3591 46321 22860 5980
14599E980Q235K3726k797k8068J5600M280J1788J600n275p759k778r506o900r151
$$ 5980 14215 37941 35144 7076 22676 26956 38744 40344 35069 27310 24532 15026 8126 -1025
14585a025j7390K2511J1679j2746k836L446J4907k7157J1780k0935n577q121j4592
$$ -1025 -18415 4096 15775 3029 193 3639 18546 -8611 3169 -17766 -23343 -31464 -46056
14572d6056K3129L9236J1298K0702j0837j5886j8616M421J8070L2130K265q844
$$ -46056 -22927 16309 27607 48309 37472 21586 2970 7391 25461 57591 59856 51012
14560E1012q75j3462M366j4221L953m058j7158m248J444j9672j122L0902k2902
$$ 51012 50137 36675 41041 26820 30773 26715 9557 5309 6753 -12919 -14041 16861 -6041
14547f041k0103k4422l751J0636K2214j2142j1188R006M998K7099K3020j4410
$$ -6041 -26144 -50566 -54317 -43681 -21467 -33609 -44797 -35791 -30793 -3694 19326 4916
14535D916j338R492k3337P930r295J9603K2153m21p328N210J7227L299j1938k6972
$$ 4916 3578 13070 -10267 -2337 -11632 7971 30124 29703 22375 27585 44812 48111 36173 9201
14521I201k5409q045K7842N4019K1162l561k8339n3496j7927k032K4582K2383
$$ 9201 -16208 -24253 3589 57608 78770 75209 46870 -6626 -24553 -26585 -2003 20380
14509B0380K5946p357J3338J271k9293j9898p724K6039j9344J605n080k4507Q243
$$ 20380 46326 38969 52307 53578 24285 4387 -3337 22702 3358 4963 -117 -24624 -16381
14496a6381J1338O748K6483R059j413M474pj3955p240p662r334j098L3793j6061
$$ -16381 -5043 1705 28188 37247 35834 40308 40301 26346 19106 11444 2110 1012 34805 18744
14482A8744L831M147K2991O486j9153o686q174L818j7201J3394K0160J1579j4724
$$ 18744 22575 26722 49713 56199 37046 30360 22186 26004 8803 22197 42357 53936 39212
14469C9212j4148J0059o944j6639l163N713K1176j9734J6335K1153m3494j2436
$$ 39212 25064 35123 28179 11540 8377 14090 35266 15532 31867 53020 9526 -2910
14457b910J8346k507j7943L877n894l720K9872N958P965K6222K952k343R960R890
$$ -2910 15436 12929 -5014 -1137 -7031 -10751 19121 25079 33044 59266 62218 59875 69835 79725
14443G9725k571j6560l1620j7172k4362j9946k0069K0035N628R210q113k785K8788
$$ 79725 77154 60594 28974 11802 -12560 -32506 -52575 -32540 -26912 -17702 -25815 -28600 188
14430A88k6279k9715J2517M3945o637l567J0241K6111L2269k0490j3441j9926
$$ 188 -26091 -55806 -43289 656 -5981 -9548 693 26804 59073 38583 25142 5216
14418E216j8618J7401M083j0820q43J5611j8916L3120O028o004o997q136o461
$$ 5216 -13402 3999 8082 -2738 -3581 12030 -6886 26234 32262 26258 19261 11125 4664
14405D664j4191J1515q889k4512K9393K192m442K9804J9375q232p994k9955o928
$$ 4664 -9527 1988 -6901 -31413 -2020 172 -4270 25534 44909 36677 28683 -1272 -8200
14392h200L0609L0548J3160k0015k2965K4032Q954j2968j6998l3403p630q960
$$ -8200 22409 52957 66117 46102 23137 47169 56123 43155 26157 -7246 -14876 -23836
14380b3836K112J5767N3157J2188k7962j0230o270j608K9327J0034k4530r068
$$ -23836 -21724 -5957 47200 59388 31426 21196 14926 13318 42645 52679 28149 19081
14368A9081k8638m9613r461K3824M2609l444O141j0615N777j3627J0887J7119
$$ 19081 -9557 -59170 -68631 -44807 -2198 -5642 499 -10116 -4339 -17966 -7079 10040
14356A0040L4693J3539j4977J0862q395j9890r852r908J2874J3487O115n640p595
$$ 10040 44733 58272 43295 54157 45762 25872 16020 6112 18986 32473 38588 32948 25353
14343B5353k8439m076J7245K0169r379J027j0152j2525j8700j6870K2266K8122
$$ 25353 -3086 -7162 10083 30252 20873 21900 11748 -777 -19477 -36347 -14081 14041
14331A4041o406l4237p500J7521J2245M451N350j9303j1151m2565k445K6831L4307
$$ 14041 7635 -26602 -34102 -16581 -4336 115 5465 -13838 -24989 -67554 -69999 -43168 -8861
14318h861J3537n206L357J6148m237j5911J1800q518k0221J0541L5327K1460P362
$$ -8861 4676 -530 2827 18975 14738 -1173 10627 2109 -18112 -7571 27756 49216 56578
14305E6578k032N035Q122j4181l600O939o849M57p374q981J5148P358k3017m6018
$$ 56578 54546 59581 67703 53522 49922 56861 50012 50469 43095 34114 49262 56620 33603 -12415
14291a2415j2194L099J1513j6912j7285J3460j3197J4599j2064K976J1652L2103
$$ -12415 -24609 -21510 -9997 -26909 -44194 -30734 -43931 -29332 -41396 -38420 -26768 5335
14279E335L0893M8550J3615K7435K0507k147k5568l7485m2950j8299j0270m861
$$ 5335 36228 84778 98393 125828 146335 144188 118620 81135 38185 19886 9616 4755
14267D755j2452R846m139J4839L4970N18j6519j3350j3259O025p456m00q54J0156
$$ 4755 -7697 2149 -1990 12849 47819 48337 31818 18468 5209 11234 3778 3378 2524 12680
14253A2680j5217k0676K4399k0804k218L6659J6014r823r104o503Q972k3460k4159
$$ 12680 -2537 -23213 1186 -19618 -21836 14823 30837 21014 11910 5407 14379 -9081 -33240
14240c3240l038k875j8453p753N818K2719K4047K5010K1511K5098j5038l8936
$$ -33240 -36278 -39153 -57606 -65359 -59541 -36822 -12775 12235 33746 58844 43806 4870
14228D870J2861K2149k016q429J0243J0638m226q459J9730R399j1886p159m577
$$ 4870 17731 39880 37864 29435 39678 50316 46090 37631 57361 66760 54874 47715 43138
14215D3138k2536j2117J6317J132j5538l526k2502j612J0175j4116n152J7135
$$ 43138 20602 8485 24802 25934 10396 6870 -15632 -17244 -7069 -21185 -26337 -9202
14203i202K1568K575N633Q564K6037Q853o524k9624j2063j9732n94k0720J7498
$$ -9202 12366 14941 20574 29138 55175 64028 57504 27880 15817 -3915 -4509 -25229 -7731
14190g731M0915j0383J6098P961N699l390j4866N228r489l004r332K1388j3075
$$ -7731 33184 22801 38899 46860 52559 49169 34303 39531 30042 27038 17706 39094 26019
14177B6019j6696J5560m805L808o770N46j1997l142K8181J8513K398j7669m5629
$$ 26019 9323 24883 20078 23886 17116 17662 5665 2523 30704 49217 51615 33946 -11683
14164a1683J4117M7102j0900k5546P695k2076k1058k5299J6089K29q562K1591
$$ -11683 2434 49536 38636 13090 20785 -1291 -22349 -47648 -31559 -31330 -39892 -18301
14152a8301M4314j729l3393p612o210L3018J2777K835J4273J8321j4868k0562
$$ -18301 26013 24284 -9109 -16721 -22931 10087 22864 25699 39972 58293 43425 22863
14140B2863q64k630Q117j6497j6225p08l004M1143L358n738j6778n554m038l227
$$ 22863 21999 19369 27486 10989 -5236 -5944 -8948 32195 35553 29815 13037 7483 3445 218
14126B18J964p290m050J6764J0520q748L144r38J025R137k882j2648r154l611
$$ 218 2182 -5108 -9158 7606 18126 9378 12522 11584 12609 21746 18864 6216 -2938 -6549
14112f549J887N375K2115J1605j6325L344r635O74j154p501j1811j2711K439r279
$$ -6549 -4662 713 22828 34433 18108 21452 11817 12491 11337 3836 -7975 -20686 -18247 -27526
14098b7526J7514J4925m734k1931j6809p216J4199M6909M262j8109j3320o190
$$ -27526 -10012 4913 179 -21752 -38561 -45777 -31578 15331 19593 1484 -11836 -18026
14086a8026L866K5558J501P119j1910m64J8450K5986J40K009l1082j1287j844
$$ -18026 -14160 11398 12899 20018 8108 7644 26094 52080 52220 54229 23147 11860 10016
14073A0016J4072l0516n176M2452J3835l4637Q116J4250k9339O602j6288N421
$$ 10016 24088 -6428 -11604 30848 44683 10046 18162 32412 3073 9675 -6613 -1192
14061a192N323j1302J1810J6883L43j0848j5441K5671N592k9975k6168l212Q241
$$ -1192 4131 -7171 4639 21522 21865 11017 -4424 21247 26839 -3136 -29304 -32516 -24275
14048b4275N698K4061K1357R256j2286j8026j5917j024O03N544K421k228m551
$$ -24275 -18577 5484 26841 36097 23811 5785 -10132 -11156 -10553 -5009 -2588 -4816 -9367
14035i367n509J3638Q963J3697K5459j4388k8824k262j4813J922K7572J846k7683
$$ -9367 -14876 -1238 7725 21422 46881 32493 3669 1407 -13406 -11484 16088 17934 -9749
14022i749L4661N3941j4948l3472l0109R379Q406N712j1287j5717k455j1820P017
$$ -9749 24912 78853 63905 30433 324 9703 18109 23821 12534 -3183 -5638 -17458 -10441
14009a0441Q222p687m981J9533q738O853J3022K2309j2214k7229J5132J0784K242
$$ -10441 -2219 -9906 -14887 4646 -4092 2761 15783 38092 25878 -1351 13781 24565 26807
13996B6807j4426K61L867j9436J6123K211k1870K7582J8948o830k4965n610q126
$$ 26807 12381 12642 16509 -2927 13196 15407 -6463 21119 40067 33237 8272 2662 -5464
13983e464p142j2634k2739J2607K2995L6838L9166N7545K1156k0240m6322k2124
$$ -5464 -12606 -25240 -47979 -35372 -12377 24461 63627 121172 142328 122088 75766 53642
13971E3642p699r312J1164J905k1936k0784J3721L3105L99j7650j6443l314J0001
$$ 53642 45943 36631 47795 49700 27764 6980 20701 53806 54205 36555 20112 16798 26799
13958B6799k1384r693L983K1139k2123n720L20k0923j1115p886J3453r927M278
$$ 26799 5415 -4278 -295 20844 -1279 -6999 -6679 -27602 -38717 -46603 -33150 -43077 -38799
13945c8799j0993K967K4809N117k0028J8644N619J5685K7687N784j260j4027L7181
$$ -38799 -49792 -46825 -22016 -16899 -36927 -18283 -12664 3021 30708 36492 35232 21205 58386
13932E8386L5597n844j7794l2535r233l1137j8299J2833L5340k3691P227J132
$$ 58386 93983 88139 70345 37810 28577 -2560 -20859 -8026 27314 3623 10850 11982
13920A1982n504K96j4932j215J6580J2177J2154j2992l1432j8831J1953K1624
$$ 11982 6478 6774 -8158 -9373 7207 19384 31538 18546 -12886 -31717 -19764 1860
13908A860J6913J3946l0717j8907J4768j036k2597L2225N666k8148k6646K4079
$$ 1860 18773 32719 2002 -16905 -2137 -3173 -25770 6455 12121 -16027 -42673 -18594
13896a8594J3706R35o129k469J9536P514p699j49k0003J682J9940k1155m472j7
$$ -18594 -4888 -3953 -10082 -12551 6985 14499 6800 6651 -13352 -11670 8270 -12885 -17357 -17374
13882a7374o687r967J2001L1064K460j1406k666K708Q429O31r207k1383J157N760
$$ -17374 -24061 -34028 -22027 9037 11497 91 -2575 133 8562 9193 -14 -21397 -20240 -14480
13868a4480K1380K545P676o540j4711K7419j970j3310J4642J3328M678j589j5352
$$ -14480 6900 9445 17121 10581 -4130 23289 21319 8009 22651 35979 40657 39068 23716
13855B3716o346j3532K6057K040O21L1418j9802k6062M708o79m4338j9979K5292
$$ 23716 17370 3838 29895 31935 32556 63974 44172 18110 22818 22139 -22199 -42178 -16886
13842a6886j0845p912j9459J4206K0738J6284J1979k0755j5389k8014L4832K2660
$$ -16886 -27731 -35643 -55102 -40896 -20158 -3874 8105 -12650 -28039 -56053 -21221 1439
13830A439j2387k4712L706K5718J0531m025p733K1841J0293K1673O0977k7659
$$ 1439 -10948 -35660 -31954 -6236 4295 270 -7463 14378 24671 46344 107321 79662
13818G9662n1620j7939j0666j1826j3242J0623k3700j954K901J1906L9207j4309
$$ 79662 28042 10103 -563 -12389 -25631 -15008 -38708 -40662 -37761 -25855 13352 -957
13806i57n863K3000N571k0232k1412J2603K8325R975j5564J9350j3378j8624K6615
$$ -957 -6820 16180 21751 1519 -19893 -7290 21035 31010 15446 34796 21418 2794 29409
13793B9409M569k4080K3516R750l397j2720Q0L211O309L565k0801j8201O550J4588
$$ 29409 33978 9898 33414 43164 39767 27047 27127 30338 36647 40212 19411 1210 7760 22348
13779B2348R491o786k3054j2993J3722R96k238m516k0041j6271K3175M9778M1439
$$ 22348 31839 25053 1999 -10994 2728 3724 1486 -3030 -23071 -39342 -16167 33611 75050
13766G5050l7532o2262k2371J2006j4852q454J2353L5019R228J2851j0516J369
$$ 75050 37518 -24744 -47115 -35109 -49961 -58415 -46062 -11043 -1815 11036 520 1889
13754A889j6343k0599J1666k921P966J0175k1718P789K0464j438m841K7184L790
$$ 1889 -14454 -35053 -23387 -26308 -18342 -8167 -29885 -22096 -1632 -3070 -7911 19273 23063
13741B3063k1197O733k0587J1293N988J0358Q463J2868k0512l4554j0530P304
$$ 23063 1866 8599 -11988 -695 5293 15651 24114 36982 16470 -18084 -28614 -21310
13729b1310j1028J5155N632J1148L090O910k5384k7063J3824M013J1602l872K5414
$$ -21310 -32338 -17183 -11551 -403 2687 9597 -15787 -42850 -29026 -25013 -13411 -17283 8131
13716H131R451R643k2133k5185J6272j6992L199J6146j333R947j350R360m758
$$ 8131 17582 27225 5092 -20093 -3821 -20813 -17614 -1468 -2801 7146 5796 15156 10398
13703A0398r478l725K806N113J6356m3674N977K5291M1797J9782j6097l5743k3785
$$ 10398 920 -2805 1 5114 21470 -22204 -16227 9064 50861 70643 54546 18803 -4982
13690d982J2383J5215K978l677j0488n012J3869M6488J6681p178j9721m9075l4336
$$ -4982 7401 22616 25594 21917 11429 6417 20286 66774 83455 76277 56556 7481 -26855
13677b6855j2442j2133J4975M1696R654L692L81l7908k1553J4037J4061K0735
$$ -26855 -39297 -51430 -36455 5241 14895 18587 18968 -18940 -40493 -26456 -12395 8340
13665H340J8028k3958J4190Q127q495R848p102m666o269k7826j9213J0244J7972
$$ 8340 26368 2410 16600 24727 16232 26080 18978 14312 8043 -19783 -38996 -28752 -10780
13652a0780L0868o924L295J3091J3037o783l0911o51J7287J1959k4267m274J8873
$$ -10780 20088 13164 16459 29550 42587 35804 4893 4242 21529 33488 9221 4947 23820
13639B3820O926O03P154j1569j61N607p932J576J9953n8209o0255P352N986N2323
$$ 23820 30746 31349 38503 26934 26773 32380 24448 26024 45977 -12232 -72487 -65135 -59149 -6826
13625f826K5988L086K1967l574n0413j5152J4266J5737k2364j5204K7627L4808
$$ -6826 19162 22248 44215 40641 -9772 -24924 -10658 5079 -17285 -32489 -4862 29946
13613B9946r234n53K5245k3709k8845m08j000j8218j0658L2935L2872k042J0071
$$ 29946 20712 20159 45404 21695 -7150 -7558 -8558 -26776 -37434 -4499 28373 26331 36402
13600C6402O937j3253j0444k6593q157l2329j8202j7181K7950J8655J2302J5760
$$ 36402 43339 30086 19642 -6951 -15108 -47437 -65639 -82820 -54870 -36215 -23913 -8153
13588h153J9196J8029j510l0960q394K7130j120k8673J1541L5206j0604k7537
$$ -8153 11043 29072 27562 -3398 -11792 15338 14218 -14455 -2914 32292 21688 -5849
13576e849J797o405q689n94k767k1541n938K9053J2568j0629O586L6538j934j1351
$$ -5849 -4052 -10457 -19146 -19740 -22507 -44048 -49986 -20933 -8365 -18994 -12408 24130 22196 10845
13562A0845j2231Q480P9k0159J3196K9508l9457l0134q806L668N439R311L706
$$ 10845 -1386 7094 7173 -12986 210 29718 -9739 -39873 -48679 -45011 -39572 -30261 -26555
13549b6555K198J4499J429O502l130O083K8067m668j1406j3823k0987o886K1427
$$ -26555 -24357 -9858 -8429 -1927 -5057 1026 29093 24425 13019 -804 -21791 -28677 -7250
13536g250M0306L728k5973j6040r972N168j3251J8863J1722l878K0021J0265k9697
$$ -7250 33056 36784 10811 -5229 -15201 -10033 -23284 -4421 7301 3423 23444 33709 4012
13523D012k4398N017J4759n841j5015J3287J7817p005k2110P995K0397L5735J5173
$$ 4012 -20386 -15369 -610 -6451 -21466 -8179 9638 2633 -19477 -11482 8915 44650 59823
13510E9823j4677k2256j4930J227O05Q347j3998o226j2379L381K7001m063m0695
$$ 59823 45146 22890 7960 9187 9792 18139 4141 -2085 -14464 -11083 15918 11855 -28840
13497b8840p568k0900l7584K6655M4510K6067n801k4549j9824O492j462K2574
$$ -28840 -36408 -57308 -94892 -68237 -23727 2340 -3461 -28010 -47834 -41342 -42804 -20230
13485b0230J7912M131L261J65j6736p217N510J895O720M730k241k1832k7725n328
$$ -20230 -2318 1813 5074 5239 -11497 -18714 -13204 -11309 -4589 141 -2100 -23932 -51657 -56985
13471e6985J5728J6618K2421m000j413j8828j6626r206O500O108n41N713K5170
$$ -56985 -41257 -24639 -2218 -6218 -7631 -26459 -43085 -52291 -45791 -39683 -40224 -34511 -9341
13458i341K4604K6001J3278k6637l687k0179j2263p443P068K3350J5648k2922
$$ -9341 15263 41264 54542 27905 24218 4039 -8224 -15667 -8599 14751 30399 7477
13446G477j5373o898N26O281J7251J9121L466l6454J0959l736j965R170r32m880
$$ 7477 -7896 -14794 -14268 -7987 9264 28385 31851 -4603 6356 2620 655 9825 8893 4013
13432D013j3875q013q70J1855p762J0236J0271j5276o513K050n777K7450p64K252
$$ 4013 -9862 -17875 -18745 -6890 -14652 -4416 5855 -9421 -15934 -13884 -19661 7789 7025 9277
13418I277r880J4848l563K7068J7244j6981j5020J7232l861l5130j6749q62J5230
$$ 9277 -603 14245 10682 37750 54994 38013 22993 40225 36364 1234 -15515 -16377 -1147
13405a147k1779r551L3700J0130K213j0407k0444m823k3652J4005R707R456j0640
$$ -1147 -22926 -32477 1223 11353 13566 3159 -17285 -22108 -45760 -31755 -22048 -12592 -23232
13392b3232o925K1561n38r572j4317j2524J1677J3164K3659M081K083J5297k5008
$$ -23232 -30157 -8596 -9134 -18706 -33023 -45547 -33870 -20706 2953 7034 9117 24414 -594
13379e94k0293O705l728l4067j4240K1439K5048K5177J3357k5767J1299J537M05
$$ -594 -20887 -14182 -17910 -51977 -66217 -44778 -19730 5447 18804 -6963 4336 5873 6278
13366F278m657j0953J87m197J4526R428N202q244r738j4800o140k3079j3202K1643
$$ 6278 1621 -9332 -9145 -13342 1184 10612 15814 7570 -2168 -16968 -23108 -46187 -59389 -37746
13352c7746N874J1465M933j2226J6186J8855j5489J5011J2531p012r923j6893
$$ -37746 -31872 -20407 -15474 -27700 -11514 7341 -8148 6863 19394 12382 2459 -14434
13340a4434k0483O558J0250J1881n507j2081N528L9949m031J9591j3873r713n443
$$ -14434 -34917 -28359 -18109 -6228 -11735 -23816 -18288 21661 17630 37221 23348 13635 8192
13327H192k7158L375M599R767K3873K377L867J1362p592j8251k3796k9580l1k636
$$ 8192 -18966 -15591 -10992 -1225 22648 25025 28892 40254 32662 14411 -9385 -38965 -38996 -41632
13313d1632L1473o102J2045K8418K0501m990j4164o230j2677p274L040P502J1576
$$ -41632 -10159 -16261 -4216 24202 44703 39713 25549 19319 6642 -632 2408 9910 21486
13300B1486r601P417j773k234k3012j5213j158L8922r853l2117n11k725K6985
$$ 21486 11885 19302 17529 15295 -7717 -22930 -24088 14834 4981 -27136 -27647 -30372 -3387
13287c387j0631k5120j3379Q718m422J7343K3617K0036l1584M222L9310N435J4405
$$ -3387 -14018 -39138 -52517 -43799 -48221 -30878 -7261 12775 -18809 -14587 24723 30158 44563
13274D4563j4094m52k0991j6368L536m1115m7660J2644L2556L3969K7828L5568
$$ 44563 30469 30017 9026 -7342 -3806 -44921 -92581 -79937 -47381 -13412 14416 49984
13262D9984j4387j5484k8509Q639J1540j1426n695J3325J7571K852O932o711m839
$$ 49984 35597 20113 -8396 243 11783 357 -5338 7987 25558 28410 35342 28631 23792
13249B3792k2089j8841j4035m487L9924R049K940R667j8659j1252m184P518j2350
$$ 23792 1703 -17138 -31173 -35660 4264 13313 16253 25920 7261 -3991 -8175 -657 -13007
13236a3007j1460o455J9452L97k622J1871p106k477k706K9265K0673r313j1843
$$ -13007 -24467 -30922 -11470 -11073 -13695 -1824 -8930 -11407 -14113 15152 35825 26512 14669
13223A4669k0438k4337j888J573n838K2823P502k6098K952L6090M662j2692j6972
$$ 14669 -5769 -30106 -31994 -30421 -36259 -13436 -5934 -32032 -29080 7010 11672 -1020 -17992
13210a7992J4475j1422k119K0542J1507j8713J5264n940j8453Q981O655J0443
$$ -17992 -3517 -14939 -17058 3484 14991 -3722 11542 5602 -12851 -3870 2785 13228
13198A3228j9596m615L2708m390q685Q396K0128n428j3730j9706k5705J3635L8614
$$ 13228 -6368 -10983 21725 17335 8650 17046 37174 31746 18016 -1690 -27395 -13760 24854
13185B4854Q017l1594k5552k841J827m597M672o201K2806P325K0760J693k7192
$$ 24854 32871 1277 -24275 -27116 -25289 -29886 -25214 -31415 -8609 -1284 19476 21169 -6023
13172f023O479O442j2038J8571J7018K921J2188k19q937p913j0752k6763j0372
$$ -6023 456 6898 -5140 13431 30449 33370 45558 45339 36402 28489 17737 -9026 -19398
13159a9398N812J2289K853k391j0101j6705N394J2289P608j790j8370l6974l668
$$ -19398 -13586 -1297 1556 -835 -10936 -27641 -22247 -9958 -2350 -4140 -22510 -59484 -63152
13146f3152L2811L9997Q179J424J9824O093M288K239n5104o115K1141m581J1721
$$ -63152 -30341 9656 17835 19259 39083 45176 49464 51703 -3401 -9516 11625 7044 18765
13133A8765P180l3581q969j5014J0538Q943K6815l719k8745J8327q212m707j049
$$ 18765 25945 -7636 -16605 -31619 -21081 -12138 14677 10958 -17787 540 -7672 -12379 -13428
13120a3428M294R025k4066k3853L653J3816J914J3165K1142J570q038j203N493
$$ -13428 -9134 -109 -24175 -48028 -44375 -30559 -28645 -15480 5662 7232 -806 -2009 3484
13107C484j0376L1252k0706k3135J1928j2268N383J1817Q718j8319k7677n537
$$ 3484 -6892 24360 3654 -19481 -7553 -19821 -14438 -2621 6097 -12222 -39899 -45436
13095d5436j0922j98L155L8926j8222m1238n82J443K0573L8196J7411l9929J585
$$ -45436 -56358 -56556 -53401 -14475 -32697 -73935 -74517 -73074 -52501 -14305 3106 -36823 -35238
13082c5238K7407K1515p722k0094j0736p447J2058M042j4646q816K7149N7p507
$$ -35238 -7831 13684 5962 -14132 -24868 -32315 -20257 -16215 -30861 -39677 -12528 -12471 -19978
13069a9978K1992k7655j3060K574p238j1597J6657J7336o245L0726J1486j3302
$$ -19978 2014 -25641 -38701 -36127 -43365 -54962 -38305 -20969 -27214 3512 14998 1696
13057A696J0503P456O130k7803j6337Q510N16m515j4882m8920J4655K1435L6264
$$ 1696 12199 19655 25785 -2018 -18355 -9845 -9329 -13844 -28726 -77646 -62991 -41556 -5292
13044e292M105J422n824l686R22R728j9477J331L730J984j2406j2724q416L0869
$$ -5292 -1187 235 -5589 -9275 -8353 1375 -18102 -16771 -13041 -11057 -23463 -36187 -44603 -13734
13030a3734J5665j2247m1483m9627K4306M8656j6950L0094M8565P297j6679R459
$$ -13734 1931 -10316 -51799 -101426 -77120 -28464 -45414 -15320 33245 40542 23863 33322
13018C3322q569j2141o172k7587j1816N924J2378k681l2997m305J4757Q974O407
$$ 33322 24753 12612 6440 -21147 -32963 -27039 -14661 -17342 -50339 -54644 -39887 -30913 -24506
13005b4506M499J660r24k9269q872L4641M2724k5832l3654J7546O521R846R616
$$ -24506 -20007 -18347 -19271 -48540 -57412 -22771 19953 -5879 -39533 -21987 -15466 -5620 3996
12992C996j3729n3307Q75K702J8730J3884j6644J6155K2350J2069J2444k9301
$$ 3996 -9733 -63040 -62165 -59463 -40733 -26849 -43493 -27338 -4988 7081 19525 -9776
12980i776O562J7011j4477l5533n20J4907j098l865J4428J6929R490J6059K063
$$ -9776 -3214 13797 -680 -36213 -36733 -21826 -22924 -26789 -12361 4568 14058 30117 32180
12967C2180j3862n568q185N708K7479J3478j4752l488j3570n41j274j3620O592
$$ 32180 18318 12750 4565 10273 37752 51230 36478 32990 19420 18879 17605 3985 10577
12954A0577J3384L612K9067l5327k7078J9823j9158Q879K5047K8008j0254j931
$$ 10577 23961 27573 56640 21313 -5765 14058 -5100 3779 28826 56834 46580 44649
12942D4649j6506N884K4260M134J235j4211k8390k9355K06k788r883R93M510K1425
$$ 44649 28143 34027 58287 62421 63656 49445 21055 -8300 -8094 -10882 -20765 -19772 -15262 6163
12928F163j0045o352M830J9972k8967k296L540k7127k2587K3186K6883L435j6913
$$ 6163 -3882 -10234 -5404 14568 -14399 -16695 -13155 -40282 -62869 -39683 -12800 -9365 -26278
12915b6278p419K335r058M2701L1501k2073k5443L728j213M603K6327l523k2074
$$ -26278 -33697 -31362 -40420 2281 33782 11709 -13734 -10006 -11219 -6616 19711 16188 -5886
12902e886o746p029R876j9175J2490N944k6923o583J6129K1401J2600j190L0141
$$ -5886 -12632 -19661 -9785 -28960 -16470 -10526 -37449 -44032 -27903 -6502 6098 4908 35049
12889C5049J3766l174L613k8549L493K6784j1003k1490J5083l096j1211M9545
$$ 35049 48815 45641 49254 20705 24198 50982 39979 18489 33572 30476 19265 68810
12877F8810k8815k6759K9855j3837m8274j1560n048L4321N8459j5570q413j9858
$$ 68810 39995 13236 43091 29254 -19020 -30580 -35628 -1307 57152 41582 33169 13311
12865A3311K1942j4228j5467P993J5630m426j8403j624k482l2062l0718K3785
$$ 13311 35253 21025 5558 13551 29181 24755 6352 4728 2246 -29816 -60534 -36749
12853c6749K1139m651j674J4777N415J985K0271L822j8435j7009n890l284p160
$$ -36749 -15610 -20261 -21935 -7158 -1743 242 20513 24335 5900 -11109 -16999 -20283 -27443
12840b7443P32J8969N34r983l636M090J3120j2208k1355m220K0313N856Q987o61
$$ -27443 -26711 -7742 -7208 -17191 -20827 -16737 -3617 -15825 -37180 -41400 -21087 -15231 -6244 -6905
12826f905N691j7781j0639j3269L98O528J3293O750l838P583K8344J8064j664
$$ -6905 -1214 -18995 -29634 -42903 -42505 -35977 -22684 -15934 -19772 -12189 16155 34219 32555
12813C2555j4015p467J3281j1267k1492M28M3151m82j6523l5482j0326L2070L884
$$ 32555 18540 11073 24354 13087 -8405 -7977 35174 34692 18169 -17313 -27639 4431 8315
12800H315l752O963M2353k3839m9921l4400Q847L2269K0323M772L415K043m573
$$ 8315 4563 11526 53879 30040 -19881 -54281 -45434 -13165 7158 11930 15345 17388 12815
12787A2815K3565n102J251j2561j7018j413K164j4282l348j9717l921L9439j8824
$$ 12815 36380 31278 32529 19968 2950 1537 3701 -10581 -13929 -33646 -37567 1872 -16952
12774a6952j3292k262R996L4034K885J477N354j4306j410O39K9454l756j6457
$$ -16952 -30244 -32506 -22510 11524 14409 15886 21240 6934 5524 6163 35617 31861 15404
12761A5404P528N020n139j6681q092L566Q025L73m360K596j5791j4331J9483J5183
$$ 15404 22932 27952 22813 6132 -1960 1606 9631 10004 5644 8240 -7551 -21882 -2399 12784
12747A2784r544j4606J9030P910r535o965P061j3920l8796l979J7334J0938j3658
$$ 12784 3240 -11366 7664 15574 6039 -926 6135 -7785 -46581 -50560 -33226 -22288 -35946
12734c5946P435j6392k2840J2603p839L662J7923RN904K6589k0195n73J1006K2646
$$ -35946 -28511 -44903 -67743 -55140 -62979 -59317 -41394 -41385 -35481 -8892 -29087 -29660 -18654 3992
12720C992j7768J156j168o585j9110l2402q539K3258J1001K2045K8369K755q301
$$ 3992 -13776 -12620 -13788 -20373 -39483 -71885 -80424 -57166 -46165 -24120 4249 7004 -1297
12707a297q318P669p272n197J501J0275L750k6036J8734L4878j9512k4363o168
$$ -1297 -9615 -1946 -9218 -14415 -12914 -2639 1111 -24925 -6191 28687 9175 -15188 -21356
$$ [...]
##END NTUPLES=NMR SPECTRUM
##END=
