##TITLE=Analysis number 319501
Compound Code cc 46139
Book Reference 451/149
Project Code adrs
Chemist Name evam
##JCAMPDX= 6.0         $$ Bruker NMR JCAMP-DX V2.0
##DATA TYPE= NMR SPECTRUM
##DATA CLASS= NTUPLES
##ORIGIN= Bruker BioSpin GmbH
##OWNER= nmr
$$ XWIN-NMR		Version 3.5
$$ Wed May 17 11:19:19 2006 GMT Daylight Time (UT+1h)  MAYBRIDGE\nmr@NMR_250MHZ
##.OBSERVE FREQUENCY= 250.131544655141
##.OBSERVE NUCLEUS= ^1H
##.ACQUISITION MODE= SIMULTANEOUS (DQD)
##.ACQUISITION SCHEME= undefined
##.AVERAGES= 16
##.DIGITISER RES= 18
##SPECTROMETER/DATA SYSTEM= dpx250
##.PULSE SEQUENCE= zg30
##.SOLVENT NAME= CDCl3
##.SHIFT REFERENCE= (INTERNAL, CDCl3, 0, 16.4461)
##AUDIT TRAIL= $$ (NUMBER, WHEN, WHO, WHERE, WHAT)
$$ ##TITLE= Audit trail, XWIN-NMR		Version 3.5
$$ ##JCAMPDX= 5.01
$$ ##ORIGIN= Bruker BioSpin GmbH
$$ ##OWNER= nmr
$$ C:\u/data/dgb/nmr/ADRS/4570/pdata/1/auditp.txt
$$ ##AUDIT TRAIL=  $$ (NUMBER, WHEN, WHO, WHERE, WHAT)
(   1,<2006-05-17 11:18:54.26 +100>,<MAYBRIDGE\nmr>,<NMR_250MHZ>,
      <created by zg, POWCHK disabled, PULCHK disabled
       configuration hash MD5:
       84 BC 41 DB A1 6E 1D 46 DA 25 12 A5 C1 ED C5 3A
       data hash MD5: 64K
       8A BE B4 46 4A FA 11 4B 98 96 1A 81 CE F6 4A 6D>)
(   2,<2006-05-17 11:19:09.15 +100>,<MAYBRIDGE\nmr>,<NMR_250MHZ>,
      <Start of raw data processing
       ef LB = 0.3 FT_mod = 6 PKNL = 1 SI = 32K 
       data hash MD5: 32K
       A6 E9 70 C2 34 B2 C1 6A 2D 97 C8 6C 8E FF 08 AA>)
(   3,<2006-05-17 11:19:10.82 +100>,<MAYBRIDGE\nmr>,<NMR_250MHZ>,
      <apk 
       data hash MD5: 32K
       A0 BD BC 37 5F 3C 25 F5 35 2B 0C 08 34 12 E1 A9>)
(   4,<2006-05-17 11:19:11.56 +100>,<MAYBRIDGE\nmr>,<NMR_250MHZ>,
      <abs ABSG = 5 
       data hash MD5: 32K
       72 79 CC 29 1D 1B 30 D0 F9 45 0B 9B D3 72 E2 47>)
$$ ##END=
$$ 
$$ hash MD5
$$ 0F F3 CE 36 95 1C BE 1F 6D BD AC 24 9F 23 B4 C4
##$RELAX= 
##$RELAX= 
##$RELAX= 
##$RELAX= 
##$RELAX= 
##$RELAX= 
##$RELAX= 
$$ Bruker specific parameters
$$ --------------------------
##$DU= <C:\u>
##$EXPNO= 4570
##$NAME= <ADRS>
##$PROCNO= 1
##$TYPE= <nmr>
##$USER= <dgb>
##$AMP= (0..31)
100 100 100 100 100 100 100 100 100 100 100 100 100 100 100 100 100 100 
100 100 100 100 100 100 100 100 100 100 100 100 100 100 
##$AQSEQ= 0
##$AQ_mod= 3
##$AUNM= <au_zg>
##$AUTOPOS= <17 >
##$BF1= 250.13
##$BF2= 250.13
##$BF3= 250.13
##$BF4= 250.13
##$BF5= 500.13
##$BF6= 500.13
##$BF7= 500.13
##$BF8= 500.13
##$BYTORDA= 1
##$CFDGTYP= 0
##$CFRGTYP= 5
##$CHEMSTR= <none>
##$CNST= (0..31)
1 1 145 1 1 1 1 1 1 1 1 1 1 1 1 1 1 1 1 1 1 1 1 1 1 1 1 1 1 1 1 1 
##$CPDPRG= <>
##$CPDPRG1= <>
##$CPDPRG2= <>
##$CPDPRG3= <>
##$CPDPRG4= <mlev>
##$CPDPRG5= <mlev>
##$CPDPRG6= <mlev>
##$CPDPRG7= <mlev>
##$CPDPRG8= <mlev>
##$CPDPRGB= <>
##$CPDPRGT= <>
##$D= (0..31)
0 1 0 0 0 0 0 0 0 0.06 0 0 0 0 0 0 0.0002 0 0 0 0 0 0 0 0 0 0 0 0 0 0 
0 
##$DATE= 1147861132
##$DBL= (0..7)
120 120 120 120 120 120 120 120 
##$DBP= (0..7)
150 150 150 150 150 150 150 150 
##$DBP07= 0
##$DBPNAM0= <>
##$DBPNAM1= <>
$$ [...]
##$SUBNAM7= <"">
##$SUBNAM8= <"">
##$SUBNAM9= <"">
##$SW= 20.6930455092707
##$SWIBOX= (0..15)
0 0 3 0 0 0 0 0 0 0 0 0 0 0 0 0 
##$SW_h= 5175.983436853
##$TD= 65536
##$TD0= 1
##$TE= 296.16
##$TE2= 300
##$TE3= 300
##$TEG= 300
##$TL= (0..7)
0 120 120 120 120 120 120 120 
##$TP= (0..7)
150 150 150 150 150 150 150 150 
##$TP07= 0
##$TPNAME0= <>
##$TPNAME1= <>
##$TPNAME2= <>
##$TPNAME3= <>
##$TPNAME4= <>
##$TPNAME5= <>
##$TPNAME6= <>
##$TPNAME7= <>
##$TPOAL= (0..7)
0.5 0.5 0.5 0.5 0.5 0.5 0.5 0.5 
##$TPOFFS= (0..7)
0 0 0 0 0 0 0 0 
##$TUNHIN= 0
##$TUNHOUT= 0
##$TUNXOUT= 0
##$USERA1= <user>
##$USERA2= <user>
##$USERA3= <user>
##$USERA4= <user>
##$USERA5= <user>
##$V9= 5
##$VALIST= <valist>
##$VCLIST= <CCCCCCCCCCCCCCC>
##$VD= 0
##$VDLIST= <DDDDDDDDDDDDDDD>
##$VPLIST= <PPPPPPPPPPPPPPP>
##$VTLIST= <TTTTTTTTTTTTTTT>
##$WBST= 1024
##$WBSW= 4
##$XGAIN= (0..3)
0 0 0 0 
##$XL= 0
##$YL= 0
##$YMAX_a= 416298
##$YMIN_a= -443571
##$ZGOPTNS= <>
##$ZL1= 120
##$ZL2= 120
##$ZL3= 120
##$ZL4= 120
##$ABSF1= 16.44612
##$ABSF2= -4.247053
##$ABSG= 5
##$ABSL= 3
##$ALPHA= 0
##$AQORDER= 0
##$ASSFAC= 0
##$ASSFACI= 0
##$ASSFACX= 0
##$ASSWID= 0
##$AUNMP= <proc_1d>
##$AZFE= 0.1
##$AZFW= 0.1
##$BCFW= 0
##$BC_mod= 0
##$BYTORDP= 0
##$COROFFS= 0
##$CY= 12.5
##$DATMOD= 1
##$DC= 0
##$DFILT= <>
##$DTYPP= 0
##$F1P= 14.0000005364418
##$F2P= -0.99999901652339
##$FCOR= 0.5
##$FTSIZE= 32768
##$FT_mod= 6
##$GAMMA= 0
##$GB= 0
##$INTBC= 1
##$INTSCL= 1
##$ISEN= 128
##$LB= 0.3
##$LEV0= 0
##$LPBIN= 0
##$MAXI= 10000
##$MC2= 0
##$MEAN= 0
##$ME_mod= 0
##$MI= 0
##$NCOEF= 0
##$NC_proc= -2
##$NLEV= 6
##$NOISF1= 0
##$NOISF2= 0
##$NSP= 0
##$NTH_PI= 0
##$NZP= 0
##$OFFSET= 16.44612
##$PC= 1
##$PHC0= 170.1126
##$PHC1= 7.893443
##$PH_mod= 1
##$PKNL= yes
##$PPARMOD= 0
##$PSCAL= 4
##$PSIGN= 0
##$REVERSE= no
##$SF= 250.130018979431
##$SI= 32768
##$SIGF1= 0
##$SIGF2= 0
##$SINO= 400
##$SIOLD= 32768
##$SREGLST= <1H.CDCl3>
##$SSB= 0
##$STSI= 32768
##$STSR= 0
##$SW_p= 5175.98343685301
##$SYMM= 0
##$S_DEV= 0
##$TDeff= 65536
##$TDoff= 0
##$TI= <Analysis number 999999
Compound Code 99
Book Reference 9
Project Code 9>
##$TILT= no
##$TM1= 0
##$TM2= 0
##$TOPLEV= 0
##$USERP1= <user>
##$USERP2= <user>
##$USERP3= <user>
##$USERP4= <user>
##$USERP5= <user>
##$WDW= 1
##$XDIM= 32768
##$YMAX_p= 354861853
##$YMIN_p= -85080
$$ End of Bruker specific parameters
$$ ---------------------------------
##NTUPLES= NMR SPECTRUM
##VAR_NAME=  FREQUENCY,     SPECTRUM/REAL,   SPECTRUM/IMAG
##SYMBOL=    X,             R,               I
##VAR_TYPE=  INDEPENDENT,   DEPENDENT,       DEPENDENT
##VAR_FORM=  AFFN,          ASDF,            ASDF
##VAR_DIM=   32768,         32768,           32768
##UNITS=     HZ,            ARBITRARY UNITS, ARBITRARY UNITS
##FACTOR=    0.157963299565203, 1,           1
##FIRST=     4113.66813476601, 0,            0
##LAST=      -1062.315302087, 0,             0
##MIN=       -1062.315302087, -85080,        0
##MAX=       4113.66813476601, 354861853,    0
$$ Real data points
##PAGE= N=1
##DATA TABLE= (X++(R..R)), XYDATA
$$ [...]
$$ plain form
14988 6777 -2476 10573 -442 -23139 -28724 -29402 -6488 5002 -4714 -4714 12425 13058 -4236 5757
14974 5757 -9144 -27123 -21817 28525 32098 6522 13225 17152 6369 139 544 16731 12698
14961 12698 9083 14241 15369 9971 6988 14598 5552 3400 6586 8810 19726 20401 15337 -1181
14947 -1181 -9722 -10334 -7980 -17866 -27113 -20661 5607 14409 -2469 -3382 6956 -11441 -31107 -45644
14933 -45644 -33991 -22393 -8913 -20981 -34537 -40827 -47251 -41643 -31309 -14642 16162 3327
14921 3327 10505 18474 -2834 -1142 -12675 9103 29948 19444 4026 -3281 -17033 -11350 -13510
14908 -13510 -1858 15082 15064 21495 35032 30514 25981 28908 32130 37213 24624 3003 -2530 7396
14894 7396 16823 -2643 3517 15073 -13487 -22925 -22505 -10321 14453 22245 18510 18213 8554 -9505
$$ packed form
14988F777r253J3049j1015k2697n585o78K2914J1490r716%J7139O33j7294R993
14974E757j4901j7979N306N0342L573k5576O703L927j0783o230M05J6187m033
14961A2698l615N158J128n398k983P610r046k152L186K224J0916O75n064j6518
14947a181q541o12K354r886r247O452K6268Q802j6878r13J0338j8397j9666j4537
14933d5644J1653J1598J3480j2068j3556o290o424N608J0334J6667L0804j2835
14921C327P178P969k1308J692j1533K1778K0845j0504j5418p307j3752N683k160
14908a3510J1652J6940j8O431J3537m518m533K927L222N083j2589k1621n533R926
14894G396R427j9466O160J1556k8560r438M20J2184K4774P792l735k97r659j8059
$$ plain form
14880 -9505 1902 7099 3619 10395 14293 14573 3517 -13043 -984 32417 31374 2561 -8201
14867 -8201 9351 21512 22582 7375 -652 -9577 1762 13425 16189 11862 13506 -742 -5673
14854 -5673 1625 -752 -17750 -25384 -12049 -12215 -5578 -264 -3734 -7555 -10790 -3663 -14427 -26542
14840 -26542 -17510 -8970 2081 -6461 -24135 -27357 -17210 -25894 -15399 -24461 -39355 -33994 -13600
14827 -13600 -977 20634 31330 28533 24501 15164 -3522 -6368 -785 3045 -18926 -28278 -48217
14814 -48217 -29612 -8898 5110 9569 13311 6196 -5193 -9481 -8806 -10804 1008 4786 475
14801 475 -9838 -944 -6522 -20979 -1201 7295 18075 22623 -3152 2718 -4895 -14415 -23254 -9405
14787 -9405 4885 -5685 -12844 -40936 -54833 -41806 -14827 -15676 -26713 -44496 -37227 -23534 -31472
$$ packed form
14880i505J1407N197l480O776L898K80j1056j6560J2059L3401j043k8813j0762
14867h201J7552J2161J070j5207q027q925J1339J1663K764m327J644j4248m931
14854e673P298k377j6998p634J3335j66O637N314l470l821l235P127j0764j2115
14840b6542R032Q540J1051q542j7674l222J0147q684J0495r062j4894N361K0394
14827a3600J2623K1611J0696k797m032r337j8686k846N583L830k1971r352j9939
14814d8217J8605K0714J4008M459L742p115j1389m288O75j998J1812L778m311
14801D75j0313Q894n578j4457J9778Q496J0780M548k5775N870p613r520q839J3849
14787i405J4290j0570p159k8092j3897J3027K6979q49j1037j7783P269J3693p938
$$ plain form
14774 -31472 -33342 -23663 2549 25673 21789 20110 -1122 -6470 7442 -5644 -41539 -31569 -26550
14761 -26550 -7675 2111 -7443 -11764 -15463 -14617 -25697 -41164 -29553 -24340 -27576 -7528 6148
14748 6148 34 -25275 -25171 -14721 -18540 -17660 -12252 -18953 -26282 -35237 -6451 -3656 -11669 -5155
14734 -5155 1736 13580 11438 903 -16569 -31489 -14315 -16528 -26153 -39432 -49216 -30434 435
14721 435 5341 -3251 -5282 -37868 -34514 -11370 17826 37861 43248 43218 -755 -19676 -13141 -1231
14707 -1231 -8814 -17278 -42776 -39821 -7744 7226 3148 20767 26421 11743 17146 1977 -16716
14694 -16716 -32647 -27668 -15701 -9219 -18651 -15812 -6352 2021 6406 17957 29005 25101 21636
14681 21636 9715 3344 24708 39278 33793 26108 24465 36343 54553 48209 31483 39093 35230
$$ packed form
14774c1472j870R679K6212K3124l884j679k1232n348J3912j3086l5895R970N019
14761b6550J8875R786r554m321l699Q46j1080j5467J1611N213l236K0048J3676
14748F148o114k5309J04J0450l819Q80N408o701p329q955K8786K795q013O514
14734e155O891J1844k142j0535j7472j4920J7174k213r625j3279r784J8782L0869
14721D35M906q592k031l2586L354K3144K9196K0035N387l0m3973j8921O535J1910
14707a231p583q464k5498K955L2077J4970m078J7619N654j4678N403j5169j8693
14694a6716j5931M979J1967O482r432K839R460Q373M385J1551J1048l904l465
14681B1636j1921o371K1364J4570n485p685j643J1878J8210o344j6726P610l863
$$ plain form
14668 35230 5569 1026 -2608 397 -4514 -15993 -17300 -5716 16034 24502 23247 26427 26389 -5672
14654 -5672 -24676 -20370 -19385 -12898 18584 22231 11991 -1343 -13887 -27001 -15451 8009 16973
14641 16973 17494 26209 14917 12395 28534 21857 20286 7724 1537 -432 3887 17423 9698 -1650
14627 -1650 15899 38193 38587 29621 37998 22273 14555 4259 -34843 -29486 -15559 -11650 -20572
14614 -20572 -26337 -18289 -19673 -26608 -19705 -8422 517 4724 -2937 25536 37381 35498 36506 24037
14600 24037 8997 -3598 3354 14907 20261 9475 4440 4514 3995 -12399 -30718 -39514 -30773 403
14586 403 -4807 -16364 5039 10330 5639 6100 -16339 -7711 1298 -1006 10305 11319 19380 25829
14572 25829 16318 18662 11756 -7326 -3913 4276 22060 13088 9623 9456 -16010 -31166 -31942 -11451
$$ packed form
14668C5230k9661m543l634L005m911j1479j307J1584K1750Q468j255L180l8l2061
14654e672j9004M306R85O487L1482L647j0240j3334j2544j3114J1550K3460Q964
14641A6973N21Q715j1292k522J6139o677j571j2562o187j969M319J3536p725j1348
14627a650J7549K2294L94q966Q377j5725p718j0296l9102N357J3927L909q922
14614b0572n765Q048j384o935O903J1283Q939M207p661K8473J1845j883J008j2469
14600B4037j5040j2595O952J1553N354j0786n035P4n19j6394j8319q796Q741L1176
14586D03n210j1557K1403N291m691M61k2439Q628R009k304J1311J014Q061O449
14572B5829r511K344o906j9082L413Q189J7784q972l465j67k5466j5156p76K0491
$$ plain form
14558 -11451 -1673 1690 8373 5565 22353 15683 11590 22640 23929 18565 -6690 -26401 -29706
14545 -29706 -16462 1977 -267 -1205 -1350 -3683 -27973 -21824 1912 16589 30245 17497 -9384
14532 -9384 -17082 -12782 388 13729 778 8424 18704 4848 -12775 -27715 -35504 -31847 -3528
14519 -3528 -10344 -18028 11863 8782 -4951 3298 223 -10378 14989 26642 31708 8297 -4683
14506 -4683 -8096 3949 -12944 -17025 -31048 -9247 6943 -22588 -35216 1968 -5034 -18087
14494 -18087 -31546 -41656 -29288 -27152 -33022 -32318 -25249 -17377 -17723 -15530 -26423 -5197 -4211 -451
14480 -451 -12410 -7373 -1614 6394 10293 2234 -15431 -35974 -39630 -34228 -31466 -13809 -10923 -15468
14466 -15468 143 -21374 -28564 -40579 -55525 -49072 -24321 -26181 -16471 -8074 -12263 -18169 -13889
$$ packed form
14558a1451R778L363O683k808J6788o670m093J1050J289n364k5255j9711l305
14545b9706J3244J8439k244r38j45k333k4290O149K3736J4677J3656j2748k6881
14532i384p698M300J3170J3341j2951P646J0280j3856j7623j4940p789L657K8319
14519c528o816p684K9891l081j3733Q249l075j0601K5367J1653N066k3411j2980
14506d683l413J2045j6893m081j4023K1801J6190k9531j2628L7184p002j3053
14494a8087j3459j0110J2368K136n870P04P069P872l46K193j0893K1226R86L760
14480d51j1959N037N759Q008L899q059j7665k0543l656N402K762J7657K886m545
14466a5468J5611k1517p190j2015j4946O453K4751j860R710Q397m189n906M280
$$ plain form
14453 -13889 11017 10269 5034 -9317 -40739 -44874 -26607 -21670 -17145 -6196 -23613 -23582 -28271 -6182
14439 -6182 8386 3447 -11019 -9293 4864 17842 17838 5247 -4788 -19630 -18860 -10691 12939 17660
14425 17660 -3625 -38031 -15588 12791 26569 30844 18226 19456 21920 14142 -11229 -21067 -13134
14412 -13134 -4973 -19072 3092 10178 18949 25342 22610 21030 9148 -2416 -23518 -30228 -20247
14399 -20247 -4465 -4044 -11549 -5027 -7609 -3334 -16072 -16054 -21555 -30154 -1834 8974 508 -12818
14385 -12818 -20848 -812 14553 14744 5660 1764 -505 15339 10726 -156 4667 6589 437 -5538
14371 -5538 -3678 -18408 -16071 -17358 3178 22167 35001 52365 49853 15376 -19226 -21882 3286
14358 3286 -13963 -9300 4242 -5304 -15599 -19921 -6956 8299 1790 2929 -9003 -3248 4206
$$ packed form
14453a3889K4906p48n235j4351l1422m135J8267M937M525J0949j7417L1m689K2089
14439f182J4568m939j4466J726J4157J2978mj2591j0035j4842P70Q169K3630M721
14425A7660k1285l4406K2443K8379J3778M275j2618J230K464p778k5371r838P933
14412a3134Q161j4099K2164P086Q771O393k732j580j1882j1564k1102o710R981
14399b0247J5782M21p505O522k582M275j2738J8n501q599K8320J0808q466j3326
14385a2818q030K0036J5365J91r084l896k269J5844m613j0882M823J922o152n975
14371e538J860j4730K337j287K0536J8989J2834J7364k512l4477l4602k656K5168
14358C286j7249M663J3542r546j0295m322J2965J5255o509J139j1932N755P454
$$ plain form
14345 4206 18023 12473 8833 -9132 -10191 -1169 -11586 1972 11881 5307 -7596 -14291 -17800
14332 -17800 -5544 25854 15426 -12211 -12698 3651 -4044 -820 12575 7965 -7464 -33059 -30518
14319 -30518 -8735 6259 -4033 -20128 -16858 -28317 -13898 1398 2608 -25153 -45865 -42763
14307 -42763 -20537 -15772 -16102 -4587 4035 -805 5887 5850 -897 4754 -15773 -14545 -11903 -31144
14293 -31144 -43028 -41282 -15540 -4749 -13474 -15607 -10409 -3290 -590 10162 22867 17678 -3193
14280 -3193 -19008 -22437 -33868 -12803 -968 -1815 19074 23233 30945 35728 19559 22640 23014 18522
14266 18522 -464 3189 16111 9388 3401 22371 27470 -5648 -34563 -39455 -23861 6189 -1864
14253 -1864 -3250 -1794 11882 34178 25737 24431 5080 -12379 5930 4944 11604 4903 16818
$$ packed form
14345D206J3817n550l640j7965j059R022j0417J3558R909o574j2903o695l509
14332a7800J2256L1398j0428k7637m87J6349p695L224J3395m610j5429k5595K541
14319c0518K1783J4994j0292j6095L270j1459J4419J5296J210k7761k0712L102
14307d2763K2226M765l30J1515Q622m840O692l7o747N651k0527J228K642j9241
14293c1144j1884J746K5742J0791q725k133N198P119K700J0752J2705n189k0871
14280c193j5815l429j1431K1065J1835q47K0889M159P712M783j6169L081L74m492
14266A8522j8986L653J2922o723n987J8970N099l3118k8915m892J5594L0050q053
14253a864j386J456J3676K2296q441j306j9351j7459J8309r86O660o701J1915
$$ plain form
14240 16818 12670 22061 19277 27656 25259 30041 32058 13725 350 -9895 -2897 21103 17144
14227 17144 20664 28469 23007 8206 -24783 -41446 -24241 -9503 -16605 -16377 4324 8164 -2752
14214 -2752 -10314 -4987 16448 41007 27745 6860 -5161 8226 14353 23984 34235 46550 42371
14201 42371 29159 2368 -24572 -15666 -1050 4476 13333 24467 8978 21478 26883 12883
14189 12883 8971 26902 22346 10630 7712 -29516 -29353 -33338 -46538 -56878 -53854 -55432 -41548
14176 -41548 -32513 -30212 -22964 -25952 -37611 -16216 155 6485 439 -17389 -8551 19887 30764
14163 30764 35039 35081 8945 -15541 -29526 -12715 -35346 -32326 -9269 6979 -17644 -25010 -35414
14150 -35414 -30885 -22043 -20642 -11575 -1422 757 4035 1384 -370 -2871 -2537 -2886 946 -2546 -380
$$ packed form
14240A6818m148R391k784Q379k397M782K017j8333j3375j0245O998K4000l959
14227A7144L520P805n462j4801l2989j6663J7205J4738p102K28K0701L840j0916
14214b752p562N327K1435K4559j3262k0885j2021J3387O127R631J0251J2315m179
14201D2371j3212k6791k6940Q906J4616N526Q857J1134j5489J2500N405j4000
14189A2883l912J7931m556j1716k918l7228J63l985j3200j0340L024j578J3884
14176d1548R035K301P248k988j1659K1395J6371O330o046j7828Q838K8438J0877
14163C0764M275M2k6136k4486j3985J6811k2631L020K3057J6248k4623p366j0404
14150c5414M529Q842J401R067J0153K179L278k651j754k501L34l49L832l492K166
$$ plain form
14135 -380 -9514 -22184 -11600 -6204 -4112 1997 12684 6915 12210 16515 -3526 -11416 -7900 -604
14121 -604 8984 32068 33557 12737 2405 7544 25507 21158 1509 -1992 21825 53736 52325
14108 52325 35581 13718 -1582 1869 1630 4818 14202 -604 -23637 -27011 -14133 -4767 -895
14095 -895 -11205 6591 25761 25085 1430 -5017 -6977 -3894 -11706 -14052 -13174 -5903 -4061 -15841
14081 -15841 -21595 6254 27756 15241 22761 14290 5783 1160 32913 45489 21777 10891 -1714
14068 -1714 -3973 -3491 -1347 1347 -1837 -641 3619 12764 24695 30893 30582 12056 -3858 -12483
14054 -12483 -11216 -14321 -4775 15260 28577 18179 -4861 -6490 -10978 -7115 14287 25133 18439
14041 18439 13938 41770 37616 7802 -11401 -4336 -572 -28751 -19646 -16177 -12734 -4904 5619
$$ packed form
14135c80r134j2670J0584N396K092O109J0687n769N295M305k0041p890L516P296
14121f04R588K3084J489k0820j0332N139J7963m349j9649l501K3817L1911j411
14108E2325j6744k1863j5300L451k39L188R384j4806k3033l374J2878R366L872
14095h95j0310J7796J9170o76k3655o447j960L083p812k346Q78P271J842j1780
14081a5841n754K7849K1502j2515P520q471q507m623L1753J2576k3712j0886j2605
14068a714k259M82K144K694l184J196M260R145J1931O198l11j8526j5914q625
14054a2483J267l105R546K0035J3317j0398k3040j629m488L863K1402J0846o694
14041A8439m501K7832m154k9814j9203P065L764k8179R105L469L443P830J0523
$$ plain form
14028 5619 4933 -8840 -23016 -45494 -41564 -122 14076 8755 -10713 -24768 -20929 -27956 -1300
14015 -1300 21994 23271 28297 28125 21173 5190 -1616 -20020 -30931 -24474 4360 -5496 -17718
14002 -17718 9553 22668 10609 20164 36684 40867 26525 10137 26493 31084 6021 -10964
13990 -10964 -25520 -14654 11005 18309 35190 54210 78763 83295 76231 56674 49031 51795 59168
13977 59168 45939 43716 47817 50126 29239 29767 32621 34370 22337 28827 40694 44519 18298
13964 18298 22351 41998 32577 23872 40649 43599 38256 28297 25954 47833 33882 27495 32932
13951 32932 63600 68173 37818 -192 -32886 -31706 -29612 -29531 -18303 2347 23698 26906 5720
13938 5720 -24762 -26403 -3301 4842 4581 -554 17842 33663 17734 15283 32680 39558 58010
$$ packed form
14028E619o86j3773j4176k2478L930M1442J4198n321j9468j4055L839p027K6656
14015a300K3294J277N026j72o952j5983o806j8404j0911O457K8834r856j2222
14002a7718K7271J3115j2059R555J6520M183j4342j6388J6356M591k5063j6985
13990a0964j4556J0866K5659P304J6881J9020K4553M532p064j9557p643K764P373
13977E9168j3229k223M101K309k0887N28K854J749j2033O490J1867L825k6221
13964A8298M053J9647r421q705J6777K950n343r959k343K1879j3951o387N437
13951C2932L0668M573l0355l8010l2694J180K094Q1J1228K0650K1351L208k1186
13938E720l0482j641K3102Q143k61n135J8396J5821j5929k451J7397O878J8452
$$ plain form
13925 58010 42489 39656 26636 24486 10180 -28111 -35327 -43671 -24914 -9460 -3795 4421 9013
13912 9013 6001 10635 17854 38284 40294 25985 7500 6309 44882 55463 1338 -24960 -21245
13899 -21245 -15365 2758 -8926 -20113 -33831 -11893 26388 46314 39752 35773 44573 49393 42131
13886 42131 39381 40171 46246 35706 31858 44950 39273 18230 31459 63723 51281 41385 34808
13873 34808 14086 -10732 -8001 15957 35370 21256 19492 34498 31780 14196 -5881 -18839
13861 -18839 -29509 -1904 1268 -3394 10103 10371 401 -12402 -21309 -15121 -11888 -12571 1871 1208
13847 1208 -1748 24742 38144 28137 21268 -6678 -27616 -32662 -11280 9408 8822 -980 -2961
13834 -2961 1768 -4855 -14441 -18669 -30362 -32931 -8783 3995 -15821 -17244 -16050 -10045 652
$$ packed form
13925E8010j5521k833j3020k150j4306l8291p216q344J8757J5454N665Q216M592
13912I013l012M634P219K0430K010j4309j8485j191L8573J0581n4125k6298L715
13899b1245N880J8123j1684j1187j3718K1938L8281J9926o562l979Q800M820p262
13886D2131k750P90O075j0540l848J3092n677k1043J3229L2264j2442r896o577
13873C4808k0722k4818K731K3958J9413j4114j764J5006k718j7584k0077j2958
13861a8839j0670K7605L172m662J3497K68r970j2803q907O188L233o83J4442o63
13847A208k956K6490J3402j0007o869k7946k0938n046K1382K0688n86r802j981
13834b961M729o623r586m228j1693k569K4148J2778j9816j423J194O005J0697
$$ plain form
13821 652 -2145 5297 10752 14437 19834 8249 2928 10718 15454 -613 8801 15002 3281 -4259
13807 -4259 -22350 -15408 -11779 -29834 -29492 -27864 -34328 -21557 -6150 8843 3692 -20748 -19948 5708
13793 5708 -520 -4315 4276 -23431 -42686 -29303 694 6468 1156 -11227 -25044 -16418 4678
13780 4678 20273 20410 19511 10124 7582 6947 -3490 -158 14511 14624 -1817 -2681 -6869 11179 -11818
13765 -11818 -33556 -31470 -20802 16075 29936 35336 10399 -14155 -3091 11826 7919 -13207
13753 -13207 -12856 -9078 -21161 -29514 -15011 -5696 -1518 642 6306 -3159 -12457 -2365 16612 2659
13739 2659 -20319 -25970 -13612 6272 8974 -707 -26276 -30048 -23186 -30925 -47667 -47487 -15819
13726 -15819 23868 18720 13649 22460 18748 27770 38024 32580 19101 1038 5813 9646 1968
$$ packed form
13821F52k797P442N455L685N397j1585n321P790M736j6067R414O201j1721p540
13807d259j8091O942L629j8055L42J628o464J2771J5407J4993n151k4440Q00K5656
13793E708o228l795Q591k7707j9255J3383K9997N774n312j2383j3817Q626K1096
13780D678J5595J37q99r387k542o35j0437L332J4669J13j6441q64m188J8048k2997
13765a1818k1738K086J0668L6877J3861N400k4937k4554J1064J4917l907k1126
13753a3207L51L778j2083q353J4503R315M178K160N664r465r298J0092J8977j3953
13739B659k2978n651J2358J9884K702r681k5569l772O862p739j6742J80L1668
13726a5819L9687n148n071Q811l712R022J0254n444j3479j8063M775L833p678
$$ plain form
13713 1968 -4654 -19014 -10340 -5725 -391 9772 27084 8450 -2830 6437 -5367 -16835 -22176
13700 -22176 -8063 12560 27552 7157 -10600 -20409 -25395 2493 20440 11675 17527 -17969
13688 -17969 -22805 -34561 -47758 -30317 -7597 -12944 -12105 -13468 -3276 -5250 2230 16224 27376
13675 27376 31988 26401 33067 40917 36443 21693 5364 -4883 6647 23140 13435 7512 9276
13662 9276 19573 25040 30845 24560 14327 12294 12710 17221 -5706 -12974 -10604 -8704 -11346 -13820
13648 -13820 -5991 9733 1923 -27179 -33995 -37006 -44203 -32719 -13712 -4983 8813 -3890 3210
13635 3210 22531 16970 -11877 -9636 -4120 -17501 -8351 -17901 -27404 -32276 -39547 -26788 -2927
13622 -2927 -4453 -14462 -10687 -28983 -47346 -15224 5934 5860 3446 -15823 -25621 -34144 -39213 -24808
$$ packed form
13713A968o622j4360Q674M615N334J0163J7312j8634j1280R267j1804j1468n341
13700b2176J4113K0623J4992k0395j7757r809m986K7888J7947q765N852l5496
13688a7969m836j1756j3197J7441K2720n347Q39j363J0192j974P480J3994J1152
13675B7376M612n587O666P850m474j4750j6329j0247J1530J6493r705n923J764
13662I276J0297N467N805o285j0233k033M16M511k2927p268K370J900k642k474
13648a3820P829J5724p810k9102o816l011p197J1484J9007Q729J3796j2703P100
13635C210J9321n561k8847K241N516j3381R150r550r503m872p271J2759K3861
13622b927j526j0009L775j8296j8363L2122K1158p4k414j9269r798q523n069J4405
$$ plain form
13608 -24808 -36650 -30628 -30901 -15271 -4510 -15741 -22901 -27516 -25389 -33046 -20194 3842 3294
13595 3294 5401 2155 10822 27074 31301 9337 -586 14141 6448 -2482 -6109 -2634 9994 10228
13581 10228 10247 -10404 -14793 -5283 4168 12798 3866 -7797 -19570 -5812 263 10301 -3940
13568 -3940 -17475 -13575 -10054 -10839 -37434 -32130 -27382 -29194 -38405 -51433 -44526 -39541 -19919 -20132
13554 -20132 -18403 -37883 -54094 -39285 -21016 -22059 -836 20386 34771 20073 373 -10299
13542 -10299 -1095 7527 -981 -6294 -11682 -9652 1549 7999 20542 35795 26786 21703 15297 6554
13528 6554 -24587 -10496 14470 13719 22396 15022 14999 2366 14470 36851 21532 7810 998
13515 998 3104 8378 22015 17936 -610 -21398 -26440 -13150 2156 2429 -229 -1320 -4575 10366
$$ packed form
13608b4808j1842O022k73J5630J0761j1231p160m615K127p657J2852K4036n48
13595C294K107l246Q667J6252M227k1964r923J4727p693q930l627L475J2628K34
13581A0228J9k0651m389R510R451Q630q932j1663j1773J3758O075J0038j4241
13568c940j3535L900L521p85k6595N304M748j812r211j3028O907M985J9622k13
13554b0132J729j9480j6211J4809J8269j043K1223K1222J4385j4698j9700j0672
13542a0299R204Q622q508n313n388K030J1201O450J2543J5253r009n083o406q743
13528F554l1141J4091K4966p51Q677p374k3j2633J2104K2381j5319j3722o812
13515I98K106N274J3637m079j8546k0788n042J3290J5306K73k658j091l255J4941
$$ plain form
13501 10366 8685 -1001 -4484 10641 924 -20592 -18298 -16052 5694 1388 -4541 12658 20614
13488 20614 21791 5274 -2701 2539 -2897 -3656 2920 38626 58626 50693 28883 16736 29010
13475 29010 14566 -1914 -7009 -8788 8969 3627 3436 1682 -12911 -6356 16674 25209 4535
13462 4535 9312 30106 12048 4512 16528 7785 -7749 -16506 -992 -13123 -10604 -700 815
13449 815 12625 31526 21241 -12660 -42271 -56854 -51210 -43070 -41470 -40337 -30594 -26145 -17327
13436 -17327 -19988 -26757 -4868 10378 4418 -10323 -10009 12032 1010 -23670 -15479 -22770 -41651
13423 -41651 -32162 -18788 7733 9558 -8799 -23626 -16931 -9807 -9290 14287 36888 38995 35337
13410 35337 30316 9097 -3195 -4553 -12266 257 4025 -7047 -21263 -16690 -19437 -21254 -16348
$$ packed form
13501A0366j681r686l483J5125r717k1516K294K246K1746m306n929J7199P956
13488B0614J177j6517p975N240n436p59O576L5706K0000p933k1810j2147J2274
13475B9010j4444j6480n095j779J7757n342j91j754j4593O555K3030Q535k0674
13462D535M777K0794j8058p536J2016q743j5534q757J5514j2131K519R904J515
13449H15J1810J8901j0285l3901k9611j4583N644Q140J600J133R743M449Q818
13436a7327k661o769K1889J5246n960j4741L14K2041j1022k4680Q191p291j8881
13423d1651R489J3374K6521J825j8357j4827O695P124N17K3577K2601K107l658
13410C5337n021k1219j2292j358p713J2523L768j1072j4216M573k747j817M906
$$ plain form
13397 -16348 -9967 -18733 -24404 -29975 -21004 4650 8788 5939 16042 16109 -21915 -45928 -56499 -25517
13383 -25517 -9165 -15123 -26167 -7793 -17305 -29367 -19830 -7082 5152 30423 25146 21759 53
13370 53 -17664 -24498 -45767 -37929 -38617 -33569 -31855 -13121 877 34027 34416 29182 -1018 -10410
13356 -10410 -4461 1870 -68 12850 15521 19927 36214 47998 49724 29631 7859 13601 -2104
13343 -2104 -3291 21088 15224 -13041 -32570 -25131 -2656 16344 13219 -3737 -2504 -10957 -12881
13330 -12881 -2717 20209 33701 25356 34258 53320 52737 53575 40753 26037 7043 1671 5273
13317 5273 -1295 -6128 -3548 -11412 12824 7758 9283 8040 -2699 -12952 -5210 14311 27055
13304 27055 6624 1370 -4389 -8982 14385 23631 19598 13529 -15881 -35939 -27279 -22420 -18223
$$ packed form
13397a6348O381q766n671n571Q971K5654M138k849J0103O7l8024k4013j0571L0982
13383b5517J6352n958j1044J8374r512j2062R537J2748J2234K5271n277l387k1706
13370E3j7717o834k1269P838o88N048J714J8734J3998L3150L89n234l0200r392
13356a0410N949O331j938J2918K671M406J6287J1784J726k0093k1772N742j5705
13343b104j187K4379n864k8265j9529P439K2475J9000l125j6956J233q453j924
13330a2881J0164K2926J3492q345Q902J9062n83Q38j2822j4716j8994n372L602
13317E273o568m833K580p864K4236n066J525j243j0739j0253P742J9521J2744
13304B7055k0431n254n759m593K3367R246m033o069k9410k0058Q660M859M197
$$ plain form
13291 -18223 -12658 -20270 -25962 -27166 -23279 -26307 -24833 -38276 -27399 -34680 -42913 -22522 -4939
13278 -4939 -774 15060 21547 -7260 -21585 13482 18106 -2928 -22404 -24636 -20107 -5905 1139
13265 1139 -335 -502 -16307 -20129 -25031 -33628 -14860 -15676 -30625 -21493 -21234 -29697 -26151 -14150
13251 -14150 -6452 -27662 -23519 -5723 8575 -17900 -18117 5800 8402 -7876 -24389 -31127 -31525
13238 -31525 -7881 -2941 -10972 -37818 -23512 -13848 -22961 -7124 1001 3034 -14962 1415 14258
13225 14258 -4637 -32982 -27721 -11894 -18008 -7083 -20313 -36177 -29969 -27428 -24886 -35940 -19927
13212 -19927 -3041 -6790 9419 26111 20265 16067 2344 -11010 -9552 16238 3701 -9387
13200 -9387 -491 19775 -2079 -14566 12523 14617 19842 20392 -3867 11146 34938 26481 31807
$$ packed form
13291a8223N565p612n692j204L887l028J474j3443J0877p281q233K0391J7583
13278d939M165J5834O487k8807j4325L5067M624k1034j9476k232M529J4202P044
13265A139j474j67j5805l822m902q597J8768q16j4949R132K59q463L546J2001
13251a4150P698k1210M143J7796J4298k6475k17K3917K602j6278j6513o738l98
13238c1525K3644M940q031k6846J4306R664r113J5837Q125K033j7996J6377J2843
13225A4258j8895k8345N261J5827o114J0925j3230j5864O208K541K542j1054J6013
13212a9927J6886l749J6209J6692n846m198j3723j3354J458K5790j2537j3088
13200i387Q896K0266k1854j2487K7089K094N225N50k4259J5013K3792q457N326
$$ plain form
13187 31807 32801 18152 24170 32038 23344 15750 10967 11959 8431 -1554 -40492 -40936 -6923 -1030
13173 -1030 -21696 -15515 1220 6988 1002 5781 7828 37059 32244 22884 11705 -4526 -2641
13160 -2641 7031 -17676 -44411 -39192 -28232 -10634 1353 -11994 -16600 -4676 14994 3213
13148 3213 -8191 3518 8980 2750 -12804 -8857 3170 17788 12208 -3716 764 -8105 -9864
13135 -9864 22864 18806 2208 -6752 -13027 -11737 1761 -5497 -21621 -40844 -27473 -19096 -31734
13122 -31734 -32724 -23267 -28007 -31375 -27274 -15880 -30108 -37901 -32781 -13693 15802 19805 14762 11823
13108 11823 741 7223 7603 10116 -32714 -60350 -57806 -42495 -48014 -50357 -31120 -14107 -24171
13095 -24171 1060 24114 18916 19741 33697 18975 7129 21606 36041 38843 34241 30296 28519
$$ packed form
13187C1807R94j4649O018P868q694p594m783R92l528r985l8938m44L4013N893
13173a030k0666O181J6735N768n986M779K047K9231m815r360j1179j6231J885
13160b641R672k4707k6735N219J0960J7598J1987j3347m606J1924J9670j1781
13148C213j1404J1709N462o230j5554L947J2027J4618n580j5924M480q869j759
13135i864L2728m058j6598q960o275J290J3498p258j6124j9223J3371Q377j2638
13122c1734r90R457m740l368M101J1394j4228p793N120J9088K9495M003n043k939
13108A1823j1082O482L80K513m2830k7636K544J5311n519k343J9237J7013j0064
13095b4171K5231K3054n198Q25J3956j4722j1846J4477J4435K802m602l945j777
$$ plain form
13082 28519 23152 2997 -13264 -22349 -28230 -42047 -35867 -29323 -7669 4447 31244 37543 8261
13069 8261 321 7141 10855 18348 20757 13159 7936 -7579 -10115 2810 -10573 -17728 -7448 -8697
13055 -8697 -11867 4891 12627 6974 6048 5502 3080 6882 4105 -9689 -32588 -23584 -8632 10461
13041 10461 9659 -26635 -32675 -5511 7867 -13225 -35331 -7421 16155 26527 19378 22387 23660
13028 23660 35138 69399 64663 44096 12177 165 -14797 -29468 -7948 10189 -51 16300
13016 16300 12017 -4698 -4081 -4378 5340 8187 12871 14595 15991 6151 7900 29627 39900 29082
13002 29082 23769 15272 -4013 7919 19662 6794 4163 14497 12247 -2711 -7817 -4188 -2751
12989 -2751 -21443 -5446 15135 15926 12458 13982 31426 34515 26785 34838 28964 4286 17000
$$ packed form
13082B8519n367k0155j6261r085n881j3817O180O544K1654J2116K6797O299k9282
13069H261p940O820L714P493K409p598n223j5515k536J2925j3383p155J0280j249
13055h697l170J6758P736n653r26n46k422L802k777j3794k2899R004J4952J9093
13041A0461q02l6294o040K7164J3378k1092k2106K7910K3576J0372p149L009J273
13028B3660J1478L4261m736k0567l1919j2012j4962j4671K1520J8137j0240J6351
13016A6300m283j6715O17k97R718K847M684J724J396r840J749K1727J0273j0818
13002B9082n313q497j9285J1932J1743j2868k631J0334k250j4958n106L629J437
12989b751j8692J5997K0581P91l468J524J7444L089p730Q053n874k4678J2714
$$ plain form
12976 17000 13896 11463 26612 25157 34931 26991 -574 10948 31672 23854 -14749 -26902 -9447
12963 -9447 9673 10624 10483 11367 29975 44671 26898 6492 -14166 -33517 -33763 -12041 2779
12950 2779 -3122 5802 25738 26828 16650 11945 16433 -6874 -4364 16139 11258 26296 31897
12937 31897 37383 11573 2887 12854 18271 32004 39613 28088 726 -17012 -12809 7745 9661
12924 9661 4226 -6366 -11776 -2467 8455 37603 54734 55263 63367 66691 61876 48862 37511
12911 37511 10605 5810 20745 44506 37000 24416 23450 34915 38903 41520 44364 39624 39577 10644
12897 10644 16293 2624 -4839 -5984 13771 36347 49031 41506 23590 10113 15990 17935 22039
12884 22039 2831 -4441 -2259 415 2643 9824 17391 18712 11132 12523 25588 22006 -2782 -9264
$$ packed form
12976A7000l104k433J5149j455R774p940k7565J1522K0724p818l8603j2153J7455
12963i447J9120R51j41Q84J8608J4696j7773k0406k0658j9351k46K1722J4820
12950B779n901Q924J9936J090j0178m705M488k3307K510K0503m881J5038N601
12937C1897N486k5810q686R967N417J3733P609j1525k7362j7738M203K0554J916
12924I661n435j0592n410R309J0922K9148J7131N29Q104L324m815j3014j1351
12911C7511k6906m795J4935K3761p506j2584r66J1465L988K617K844m740m7k8933
12897A0644N649j3669p463j145J9755K2576J2684p525j7916j3477N877J945M104
12884B2039j9208p272K182K674K228P181P567J321p580J391J3065l582k4788o482
$$ plain form
12870 -9264 1488 21202 30964 29653 16841 1439 12767 19569 14169 19579 12153 -6044 -11334
12857 -11334 3147 16231 37289 49138 60055 57128 31717 2512 -11308 -12002 -7554 -2813 11668
12844 11668 20491 37769 9216 -12 7117 34521 36490 31908 11003 16456 34236 9435 -12167
12831 -12167 -8801 8310 -5053 12707 23744 20079 14786 -2019 -19635 -17178 -4030 10172
12819 10172 11410 -19872 -39448 2661 25859 29515 9194 -22113 -6238 -968 4962 293 -5955
12806 -5955 -16269 -15917 -762 -6183 -13656 -30549 -20216 -9998 -5268 5414 26258 34408 29590
12793 29590 23819 26234 19015 2510 -9934 -17398 -16346 -20494 -24011 -24036 -15890 -15239 3776 4353 23284
12778 23284 25275 7893 -848 12393 1335 -19344 -13729 -3685 1036 16111 36719 15006
$$ packed form
12870i264J0752J9714R762j311j2812j5402J1328O802n400N410p426j8197n290
12857a1334J4481J3084K1058J1849J0917k927k5411k9205j3820o94M448M741J4481
12844A1668Q823J7278k8553r228P129K7404J969m582k0905N453J7780k4801k1602
12831a2167L366J7111j3363J7760J1037l665n293j6805j7616K457J3148J4202
12819A0172J238l1282j9576M2109K3198L656k0321l1307J5875N270N930m669o248
12806e955j0314L52J5155n421p473j6893J0333J0218M730J0682K0844Q150m818
12793B9590n771K415p219j6505j2444p464J052m148l517k5Q146O51J9015N77J8931
12778B3284J991j7382q741J3241j1058k0679N615J0044M721J5075K0608k1713
$$ plain form
12766 15006 10564 14094 4148 7215 6615 17477 25195 43308 45870 12639 3982 9407 17225 11474
12752 11474 -6649 -20118 -9153 12664 26136 23222 2294 4910 19616 12197 4483 -20142
12740 -20142 -22898 -21871 -20457 -14856 -23689 -14995 -2322 -1466 -2890 -12028 2957 14165 702 6405
12726 6405 -24472 -37101 -38458 -24969 -6027 -1269 8551 16032 31077 31246 29819 17665 3510
12713 3510 -5906 -2666 -13416 -38140 -33338 -22675 -24030 -38543 -36532 -29004 -17631 -6720 -1031
12700 -1031 -6565 -1247 -267 -3358 -1315 10611 15175 3711 10700 -1153 -1985 -10873 -12464 -7377
12686 -7377 -12612 -15984 -12100 -7950 -4017 -11531 -9408 -19803 -3055 3408 6279 555 13380 19791
12672 19791 37676 49410 47197 32868 25378 18436 6131 10463 16983 27624 28786 3173 -3828
$$ packed form
12766A5006m442L530r946L067o00J0862P718J8113K562l3231q657N425P818n751
12752A1474j8123j3469J0965K1817J3472k914k0928K616J4706p419p714k4625
12740b0142k756J027J414N601q833Q694J2673Q56j424r138J4985J1208j3463N703
12726F405l0877j2629j357J3489J8942M758R820P481J5045J69j427j2154j4155
12713C510r416L240j0750k4724M802J0663j355j4513K011P528J1373J0911N689
12700a031n534N318R80l091K043J1926M564j1464O989j1853q32q888j591N087
12686g377n235l372L884M150L933p514K123j0395J6748O463K871n724J2825O411
12672A9791J7885J1734k213j4329p490o942j2305M332O520J0641J162k5613p001
$$ plain form
12659 -3828 -7851 -3298 -4930 -10661 20963 8828 -14917 12322 19993 19239 -741 -5890 -3740 13736
12645 13736 27103 31523 18363 -1006 -13803 -9398 -5040 -24259 -19011 -15786 -31131 -20977 1115
12632 1115 3059 -10340 -3884 21872 25447 32533 29504 13488 -1897 16651 24616 -3924 -9509
12619 -9509 5263 -892 -8822 -17453 -3390 9568 17714 1293 10120 2484 -29972 -27247 -17044
12606 -17044 -4228 -1915 -20240 -7074 3807 2995 13017 32790 42364 33892 12001 14270 13775
12593 13775 4042 6690 -4192 -17090 -24734 -24687 -9283 2199 2061 -3630 5094 -1750 -13049 -14030
12579 -14030 -11808 -4181 -12624 -17543 -20135 -9623 -19054 -5519 9822 22532 23378 10521 -14761
12566 -14761 -33610 -26215 -11267 -1585 -12723 -8486 11415 18586 12509 650 11910 34307 37810
$$ packed form
12659c828m023M553j632n731L1624j2135k3745K7239P671p54j9980n149K150J7476
12645A3736J3367M420j3160j9369j2797M405M358j9219N248L225j5345J0154K2092
12632A115J944j3399O456K5756L575P086l029j6016j5385J8548P965k8540n585
12619i509J4772o155p930q631J4063J2958Q146j6421Q827p636l2456K725J0203
12606a7044J2816K313j8325J3166J0881q12J0022J9773R574q472k1891K269m95
12593A3775r733K648j0882j2898p644M7J5404J1482j38n691Q724o844j1299r81
12579a4030K222P627q443m919k592J0512r431J3535J5341J2710Q46j2857k5282
12566a4761j8849P395J4948R682j1138M237J9901P171o077j1859J1260K2397L503
$$ plain form
12553 37810 43784 58798 41375 17036 26198 20996 10529 15803 20486 13567 17043 1500 10421
12540 10421 10440 3842 -14179 -10723 23429 28937 24413 30749 39889 32845 1744 -11947 13438 22698
12526 22698 10723 3066 -22385 -26395 -12739 6359 14856 301 -10012 -20499 -23212 -2903
12514 -2903 10525 18607 30969 36892 37388 40538 22376 13992 7725 -5667 -1045 19595 31976
12501 31976 30049 27792 1680 -21632 -28195 -16543 -1771 -16011 -6441 10167 13446 21071 29569
12488 29569 26072 12173 11757 3272 -10489 -24061 -12002 2924 -8926 -5230 5709 12673 6199
12475 6199 10302 18920 8502 6908 -3705 -6470 -3955 -14153 5140 6350 -4677 -5578 -10459 -25941
12461 -25941 -4441 3917 10752 -2741 -27162 -24991 -17807 -9934 3630 -6330 -3861 -2168 15435
$$ packed form
12553C7810N974J5014j7423k4339R162n202j0467N274M683o919L476j5543Q921
12540A0421J9o598j8021L456L4152N508m524O336R140p044l1101j3691K5385R260
12526B2698j1975p657k5451m010J3656J9098Q497j4555j0313j0487k713K0309
12514b903J3428Q082J2362N923M96L150j8162q384o267j3392M622K0640J2381
12501C1976j927k257k6112k3312o563J1652J4772j4240R570J6608L279P625Q498
12488B9569l497j3899m16q485j3761j3572J2059J4926j1850L696J0939O964o474
12475F199M103Q618j0418j594j0613k765K515j0198J9293J210j1027r01m881j5482
12461b5941K1500Q358O835j3493k4421K171P184P873J3564r960K469J693J7603
$$ plain form
12448 15435 19503 17322 4838 18028 5899 -13609 -170 -7482 -17163 -14111 4719 13893 14555
12435 14555 2284 8290 -6755 -1081 17180 26293 13979 -6511 -6972 -295 -7823 -13840 -18094
12422 -18094 -34282 -37062 -44990 -26240 -17696 -17763 -606 -8800 -13821 -3086 7317 14386 10769 -13689
12408 -13689 -22414 -26008 -17393 -17728 -29102 -21203 -200 4875 1370 -4311 -7275 -19920 -14622 6995
12394 6995 12786 18236 16707 6655 33227 41770 29604 7574 -21683 -36411 -36425 -44549 -38777 -20251
12380 -20251 -13017 -22700 -23827 1842 9774 1115 4903 3601 -5162 -9654 -13820 -15858 -3310 818
12366 818 -3238 23123 33730 35204 48743 45275 17500 -20357 -35938 -30739 -19150 4609 9393
12353 9393 20263 17287 -2739 -13817 1886 20457 14817 -5123 236 -3276 -19994 -18585 -19236
$$ packed form
12448A5435M068k181j2484J3190j2129j9508J3439p312r681L052J8830R174O62
12435A4555j2271O006j5045N674J8261R113j2314k0490m61O677p528o017m254
12422a8094j6188k780p928J8750Q544o7J7157q194n021J0735J0403P069l617k4458
12408a3689q725l594Q615l35j1374P899K1003N075l505n681k964j2645N298K1617
12394F995N791N450j529j0052K6572Q543j2166k2030k9257j4728j4q124N772J8526
12380b0251P234r683j127K5669P932q659L788j302q763m492m166k038J2548M128
12366H18m056K6361J0607J474J3539l468k7775l7857j5581N199J1589K3759M784
12353I393J0870k976k0026j1078J5703J8571n640j9940N359l512j6718J409o51
$$ plain form
12340 -19236 -31089 -25526 -19741 2028 10627 19152 11362 7972 12723 20795 29745 33268 9610 -5946
12326 -5946 -12322 9098 3030 9097 9693 -5318 1496 -458 -14812 -4864 6123 30346 26800 15699
12312 15699 -6855 -12853 -2077 4402 7467 8923 22649 12213 11922 21918 17443 3095 6963
12299 6963 6927 12655 34304 27802 1533 -16302 -17167 -8834 -15946 -20505 -10160 -23991 -36101 -34620
12285 -34620 -26334 -31880 -15367 -8396 -3536 2421 16844 21871 16157 565 -22204 -22287 -28503 -22025
12271 -22025 -27741 -36726 -27226 -15763 -25611 -35805 -30594 -16529 -7878 5626 21783 10593 -1882
12258 -1882 -2635 3346 -6729 -7659 15897 11469 6973 8793 10290 18300 9888 4668 -8001 -5947
12244 -5947 10503 32311 16259 6108 10220 16236 18262 -6548 -17554 -23381 -11525 -4558 2810
$$ packed form
12340a9236j1853N563N785K1769Q599Q525p790l390M751Q072Q950L523k3658j5556
12326e946o376K1420o068O067N96j5011O814j954j4354R948J0987K4223l546j1101
12312A5699k2554n998J0776O479L065J456J3726j0436k91R996m475j4348L868
12299F963l6N728K1649o502k6269j7835q65Q333p112m559J0345j3831j2110J481
12285c4620Q286n546J6513O971M860N957J4423N027n714j5592k2769q3o216O478
12271b2025n716q985R500J1463r848j0194N211J4065Q651J3504J6157j1190j2475
12258a882p53N981j0075r30K3556m428m496J820J497Q010q412n220j2669K054
12244e947J6450K1808j6052j0151M112O016K026k4810j1006n827J1856O967P368
$$ plain form
12231 2810 -6909 9681 37476 34656 28945 26590 13905 14644 23694 36119 29936 -12868 -23785
12218 -23785 -13266 -10063 -4361 20570 23298 24968 24711 21253 14357 13261 10556 7561 25890 24610
12204 24610 2131 -7529 4855 -10452 -12988 -12344 -14868 -5380 20941 7343 5542 21821 17679
12191 17679 680 -1603 24057 39846 22330 932 255 11347 7267 14454 -1669 2897 24094
12178 24094 28970 10386 -14109 -33069 -38385 -17212 4547 12640 27978 26401 8965 26250
12166 26250 42670 20152 19089 8301 11985 7514 7379 1636 4072 -497 2593 9162 2772 5833
12152 5833 26075 32040 43387 71272 98963 91543 82755 86711 95638 103570 103885 102348 104701 104938
12138 104938 108189 104981 82059 52273 60422 81437 75244 64542 47372 38899 48562 50714 60246
$$ packed form
12231B810r719J6590K7795k820n711k355j2685P39R050J2425o183m2804j0917
12218b3785J0519L203N702K4931K728J670k57l458o896j096k705k995J8329j280
12204B4610k2479r660J2384j5307k536O44k524R488K6321j3598j801J6279m142
12191A7679j6999k283K5660J5789j7516k1398o77J1092m080P187j6123M566K1197
12178B4094M876j8584k4495j8960n316K1173K1759Q093J5338j577j7436J7285
12166B6250J6420k2518j063j0788L684m471j35n743K436m569L090O569o390L061
12152E833K0242N965J1347K7885K7691p420q788L956Q927P932L15j537K353K37
12138A04938L251l208k2922k9786Q149K1015o193j0702j7170q473R663K152R532
$$ plain form
12125 60246 52657 40842 24451 19186 12610 14438 35409 28039 30575 17263 24627 30694 35442
12112 35442 41474 47504 33304 19923 20016 37215 32217 27315 25341 19365 23110 16393 -4742 13353
12098 13353 15225 12852 17569 15037 3005 4056 18877 26877 19876 9276 7826 9502 27238
12085 27238 29810 29463 20921 402 -3340 26326 29308 45037 36468 21148 3108 -2560 539
12072 539 19081 18397 27477 30148 18203 13684 2721 -9263 1383 1515 -17281 -12541 -6068 7774
12058 7774 20787 19364 3765 18227 3092 -4412 -8592 -3425 -5771 3349 8127 25278 31662
12045 31662 30521 26865 7979 16172 27495 22421 22682 22166 40392 31316 42296 34224 5631 -6000
12031 -6000 -4094 18589 22821 39554 59334 42262 16161 -4964 -22356 -30226 -23359 -8231 -15194
$$ packed form
12125F0246p589j1815j6391n265o576J828K0971p370K536j3312P364O067M748
12112C5442O032O030j4200j3381R3J7199m998m902j974n976L745o717k1135J8095
12098A3353J872k373M717k532j2032J051J4821Q000p001j0600j450J676J7736
12085B7238K572l47q542k0519l742K9666K982J5729q569j5320j8040n668L099
12072E39J8542o84R080K671j1945m519j0963j1984J0646J32j8796M740O473J3842
12058G774J3013j423j5599J4462j5135p504m180N167k346R120M778J7151O384
12045C1662j141l656j8886Q193J1323n074K61n16J8226r076J0980q072k8593j1631
12031f000J906K2683M232J6733J9780j7072k6101k1125j7392p870O867J5128o963
$$ plain form
12018 -15194 -1795 5128 9936 14660 2582 20449 25761 31603 29033 3690 3509 17299 39515
12005 39515 48166 45349 51319 44625 15713 2732 5256 3994 -12792 -27331 -22852 -8934 4150
11992 4150 10719 3259 8712 -10749 -22482 -16836 7426 26981 25719 25580 37946 30069 17090
11979 17090 20201 169 -1494 -7270 -10745 -24978 -17510 -3615 5030 14009 16932 18076 3659
11966 3659 -19119 -30911 -23674 678 23249 3883 -12052 -9789 -3883 -10238 -6927 14839 21712
11953 21712 17753 4836 -13765 -8207 -26994 -15605 4545 1370 3493 6076 2920 -8421 -15500
11940 -15500 -5126 -14504 -13 -8705 -9481 -11569 -6241 -14957 -25170 -11767 -19613 -19797 -4052 -21719
11926 -21719 -27582 -20861 -2084 2806 -14353 -17208 -30120 -31049 -1697 -9835 -23827 -3182 34583
$$ packed form
12018a5194J3399O923M808M724j2078J7867N312N842k570k5343j81J3790K2216
12005C9515Q651k817N970o694k8912j2981K524j262j6786j4539M479J3918J3084
11992D150O569p460N453j9461j1733N646K4262J9555j262j39J2366p877j2979
11979A7090L111k0032j663n776l475j4233P468J3895Q645Q979K923J144j4417
11966C659k2778j1792P237K4352K2571j9366j5935K263N906o355L311K1766O873
11953B1712l959j2917j8601N558j8787J1389K0150l175K123K583l156j1341p079
11940a5500J0374r378J4491q692p76k088N328q716j0213J3403p846j84J5745j7667
11926b1719n863O721J8777M890j7159k855j2912r29K9352q138j3992K0645L7765
$$ plain form
11913 34583 55017 50343 30918 12945 -3515 -12582 -6687 1205 -15796 -21085 -3735 -4092 -17135
11900 -17135 -15613 -9697 -11006 -11833 -433 -8789 -37707 -40861 -33620 -38608 -19698 11711 17572 10459
11886 10459 11221 -173 -8542 -6756 -26633 -39196 -21680 -14962 -2091 8626 17737 7348 -16889
11873 -16889 -8410 -4467 9039 35266 28657 11194 5584 -10125 -21684 -19572 -28831 -26821 -1726
11860 -1726 9305 20108 1196 -21551 -19122 -2482 12226 17473 14389 11765 6677 4770 9217
11847 9217 12483 -2030 -12105 -26268 -23102 -15674 -8685 -4606 6504 2060 6064 -11274 -32518
11834 -32518 -41792 -27648 -7668 8172 2081 603 13793 20380 30806 30204 20432 10771 15610
11821 15610 -4577 -4913 -17626 -2769 8798 -2045 2517 12422 12334 -2434 17311 3632 -2162
$$ packed form
11913C4583K0434m674j9425j7973j6460r067N895P892j7001n289J7350l57j3043
11900a7135J522N916j309q27J1400q356k8918l154P241m988J8910L1409N861p113
11886A0459P62j1394q369J786j9877j2563J7516O718J2871J0717R111j0389k4237
11873a6889Q479L943J3506K6227o609j7463n610j5709j1559K112r259K010K5095
11860a726J1031J0803j8912k2747K429J6640J4708N247l084k624n088j907M447
11847I217L266j4513j0075j4163L166P428O989M079J1110m444M004j7338k1244
11834c2518r274J4144J9980J5840o091j478J3190O587J0426o02r772r661M839
11821A5610k0187l36j2713J4857J1567j0843M562R905q8j4768J9745j3679n794
$$ plain form
11808 -2162 -15787 -30942 -20094 -11571 -17231 -16619 -1590 16864 8965 -2541 -2033 11259 25973
11795 25973 25692 5622 -2479 -10841 -11940 -11569 1247 2677 -23470 -18370 -11594 -6705 -13710 -21240
11781 -21240 -13541 -2974 -10932 -9357 -14605 -11726 15448 22202 25623 7883 3588 19948 25062
11768 25062 14116 4001 15280 18140 13973 -267 10854 3941 9657 16418 10621 12237 5766
11755 5766 8563 -5454 -11168 -12275 -4013 14239 13198 9549 19984 27365 -83 -2703 8124
11742 8124 14840 16707 1212 -12320 -10203 -835 1378 25558 23229 9041 -562 -19772 -4030
11729 -4030 6071 -1184 -7665 -3257 10576 10229 22527 11530 6937 -7901 -14846 -18834 -4852
11716 -4852 6475 -3919 -12109 3875 20979 42560 43799 51346 35316 16799 18053 10048 21544
$$ packed form
11808b162j3625j5155J0848Q523n660O12J5029J8454p899j1506N08J3292J4714
11795B5973k81k0070q101q362j099L71J2816J430k6147N100O776M889p005p530
11781b1240P699J0567p958J575n248K879K7174O754L421j7740m295J6360N114
11768B5062j0946j0115J1279K860m167j4240J1121o913N716O761n797J616o471
11755E766K797j4017n714j107Q262J8252j041l649J0435P381k7448k620J0827
11742H124O716J867j5495j3532K117R368K213K4180k329j4188r603j9210J5742
11729d030J0101p255o481M408J3833l47J2298j0997m593j4838o945l988J3982
11716d852J1327j0394q190J5984J7104K1581J239P547j6030j8517J254q005J1496
$$ plain form
11703 21544 18778 22410 21710 19078 17162 17830 21605 15145 4540 4936 14018 7735 20953 20686 28444
11688 28444 28415 41105 32013 19545 5718 23073 28225 14996 22557 12016 -3611 10183 28349
11675 28349 52250 36493 42294 50297 42089 50266 69979 87928 111422 149512 168670 181025
11663 181025 160246 134185 91637 44538 44461 50798 44059 30650 19287 18273 15639 17210 15977
11650 15977 6258 687 17373 28313 27872 15484 -2981 -15248 5489 5719 14650 13442 9442
11637 9442 10264 22918 24629 3198 -8682 -32909 -12993 21120 19583 17429 36609 37815 30141
11624 30141 38900 60227 92369 109054 139559 152278 141560 134968 145582 148846 122785 87893
11612 87893 80876 87838 81355 68614 38256 39652 36144 33231 48987 56166 46920 41801 56961
$$ packed form
11703B1544k766L632p00k632j916O68L775o460j0605L96R082o283J3218k67P758
11688B8444k9J2690r092j2468j3827J7355N152j3229P561j0541j5627J3794J8166
11675B8349K3901j5757N801Q003q208Q177J9713J7949K3494L8090J9158J2355
11663A81025k0779k6061m2548m7099p7O337o739j3409j1363j014k634J571j233
11650A5977r719n571J6686J0940m41j2388j8465j2267K0737K30Q931j208m000
11637I442Q22J2654J711k1431j1880k4227J9916L4113j537k154J9180J206p674
11624C0141Q759K1327L2142J6685L0505J2719j0718o592J0614L264k6061l4892
11612H7893p017O962o483j2741l0358J396l508k913J5756P179r246n119J5160
$$ plain form
11599 56961 58316 71489 57272 55065 55605 43148 29721 26738 -3380 -32553 -25938 1503 24984
11586 24984 23705 40265 54500 49559 22583 -4646 4758 16061 21233 30484 49311 64132 64729
11573 64729 49471 59554 59130 49690 66625 76078 66794 39280 29056 36081 46086 44327 53272
11560 53272 74273 83928 57273 29819 23184 30312 32355 41032 62206 64891 55846 73523 85638
11547 85638 70189 53818 40850 8733 19198 56183 58757 59993 53793 61107 66247 52242 40325
11534 40325 50088 51153 38996 23941 16129 -5536 -9889 2005 19846 8587 18287 41916 52536
11521 52536 50398 25695 16982 13815 7617 23390 40658 36452 29829 36915 45529 50736 58806 43015
11507 43015 29105 -406 -2103 15875 23014 36927 45645 46867 43655 48514 49080 26378 1337
$$ packed form
11599E6961J355J3173j4217k207N40j2457j3427k983l0118k9173O615K7441K3481
11586B4984j279J6560J4235m941k6976k7229R404J1303N172R251J8827J4821N97
11573F4729j5258J0083m24r440J6935R453r284k7514j0224P025J0005j759Q945
11560E3272K1001R655k6655k7454o635P128K043Q677K1174K685r045J7677J2115
11547H5638j5449j6371j2968l2117J0465L6985K574J236o200P314N140j4005j1917
11534D0325R763J065j2157j5055p812k1665m353J1894J7841j1259R700K3629J0620
11521E2536k138k4703q713l167o198J5773J7268m206o623P086Q614N207Q070j5791
11507D3015j3910k9511j697J7978P139J3913Q718J222l212M859N66k2702k5041
$$ plain form
11494 1337 5027 26493 23703 6880 3575 176 11204 17936 18304 26636 30452 2527 9257 14013
11480 14013 25107 52828 52886 52104 46860 50926 55280 42271 25079 20385 10674 9620 31133 32455
11466 32455 19720 -5318 -15238 16763 29125 1543 -9016 15900 19862 28601 28304 37379 42679
11453 42679 45617 48674 29602 24380 15561 17588 25827 31564 36813 31231 43068 26344 10165
11440 10165 11194 2424 16142 22260 14718 16225 12665 13821 27949 37558 26063 28026 29744 40689
11426 40689 21684 -1493 -12283 2008 36637 30339 23681 22494 6488 2178 -1474 18178 31700
11413 31700 46309 53897 51679 36421 16596 -3921 -18820 -4779 9969 -18787 -29895 -30118
11401 -30118 -34457 -42949 -29538 -38352 -33695 -26541 -11903 -29207 -34239 -32093 -32194 -6466 -1758 -9144
$$ packed form
11494A337L690K1466k790j6823l305l399J1028O732L68Q332L816k7925O730M756
11480A4013J1094K7721N8p82n244M066M354j3009j7192m694r711j054K1513J322
11466C2455j2735k5038r920L2001J2362k7582j0559K4916L962Q739k97R075N300
11453D2679K938L057j9072n222q819K027Q239N737N249n582J1837j6724j6179
11440A0165J029q770J3718O118p542J507l560J156J4128R609j1495J963J718J0945
11426D0689j9005k3177j0790J4291L4629o298o658j187j6006m310l652J9652J3522
11413C1700J4609P588k218j5258j9825k0517j4899J4041J4748k8756j1108k23
11401c0118m339q492J3411q814M657P154J4638j7304n032K146j01K5728M708p386
$$ plain form
11387 -9144 -14978 -24307 -32106 -12797 -4695 17336 23810 23795 14370 4449 24619 36395 23898 13149
11373 13149 14203 26427 13232 -9537 -30006 -38777 -21766 -13634 -16348 -16590 -11159 2358 17355
11360 17355 102 -2463 1340 3368 -27620 -54317 -47111 -35902 -27959 -21410 -22410 -28116 -15151
11347 -15151 -22900 -20333 -25054 -24041 -15312 2778 15541 34157 39614 40803 24337 -8335 -19738
11334 -19738 8717 31356 43902 40312 13636 -21015 -17921 -6754 -21388 -14778 -29658 -46196
11322 -46196 -29840 -34221 -27093 -32729 -29247 -19929 -23507 -31575 -41244 -53836 -48734 -53474 -66181 -67060
11308 -67060 -61915 -59908 -53644 -62170 -71823 -51803 -11451 20588 9086 -1412 9676 -3469 -14884
11295 -14884 -28130 -40803 -17724 4589 3026 11798 19617 6396 -15251 446 19779 21848
$$ packed form
11387i144n834r329p799J9309Q102K2031O474j5r425r921K0170J1776j2497j0749
11373A3149J054J2224j3195k2769k0469q771J7011Q132k714k42N431J3517J4997
11360A7355j7253k565L803K028l0988k6697P206J1209P943O549j000n706J2965
11347a5151p749K567m721J013Q729J8090J2763J8616N457J189j6466l2672j1403
11334a9738K8455K2639J2546l590k6676l4651L094J1167j4634O610j4880j6538
11322d6196J6356m381P128n636L482R318l578q068r669j2592N102m740j2707q79
11308f7060N145K007O264q526r653K0020M0352L2039j1502j0498J1088j3145j1415
11295a4884j3246j2673K3079K2313j563Q772P819j3221k1647J5697J9333K069
$$ plain form
11283 21848 17163 31460 58977 50489 29507 43205 43602 21729 6638 -11309 5535 7993 7326
11270 7326 4258 -4003 -6455 6830 -2057 -10164 -16649 -18421 -14499 -17777 -18034 -13246 -13121 -27895 -19303
11255 -19303 -4124 4524 -272 -32450 -16854 -9128 -16139 -26428 -49974 -38203 -31183 -19602 -7707
11242 -7707 -3989 10631 22396 32481 31185 61464 87707 93377 96782 94863 106057 88585 82128
11229 82128 86642 87802 57311 30018 28865 22675 7084 -3025 9560 16109 30698 48376 62512
11216 62512 52124 36152 37575 31622 12850 -7391 -2643 27268 27574 -750 3334 25175 20905
11203 20905 22957 32698 37292 48163 56530 35501 27035 31265 39056 44201 49180 48683 87718 100841
11189 100841 110194 124512 136788 125626 101929 57545 29458 31883 31462 34288 21137 10592
$$ packed form
11283B1848m685J4297K7517q488k0982J3698L97k1873j5091j7947J6844K458o67
11270G326l068q261k452J3285q887q107o485j772L922l278k57M788J25j4774Q592
11255a9303J5179Q648m796l2178J5596P726p011j0289k3546J1771P020J1581J1895
11242g707L718J4620J1765J0085j296L0279K6243N670L405j919J1194j7472o457
11229H2128M514J160l0491k7293j153o190j5591j0109J2585O549J4589J7678J4136
11216F2512j0388j5972J423n953j8772k0241M748K9911L06k8324M084K1841m270
11203B0905K052R741M594J0871Q367k1029q466M230P791N145M979m97L9035J3123
11189A00841R353J4318J2276j1162k3697m4384k8087K425m21K826j3151j0545
$$ plain form
11177 10592 16272 34680 26787 31879 27426 20543 15926 20802 40005 26897 -3305 -2107 18736
11164 18736 31776 47850 29667 13353 12381 6179 -9848 4975 -5302 463 14595 -10321
11152 -10321 -31839 -20681 -7181 3075 19572 28983 13502 17039 23910 6019 -1334 21851
11140 21851 25426 21694 29166 22212 10430 3837 -18652 -44675 -42966 -8982 17468 4921 -8995
11127 -8995 -4998 1433 23171 20961 1338 -915 -8982 8210 1941 -21275 -15155 -12800 -20581 -34203
11113 -34203 -23163 -8411 4487 19631 19950 18739 18479 24371 29815 22985 28910 28567 32632 24206
11099 24206 2798 -12352 -12546 1622 9005 -8620 -42741 -44350 -21053 -10712 1530 -18524
11087 -18524 -27609 -28677 -30452 -28933 -23436 -14879 -21761 -40507 -40875 -33060 -29172 -20489 -15581 -35864
$$ packed form
11177A0592N680J8408p893N092m453o883m617M876J9203j3108l0202J198K0843
11164A8736J3040J6074j8183j6314r72o202j6027J4823j0277N765J4132k4916
11152a0321k1518J1158J3500J0256J6497R411j5481L537O871j7891p353K3185
11140B1851L575l732P472o954j1782o593k2489k6023J709L3984K6450j2547j3916
11127h995L997O431K1738k210j9623k253q067J7192o269k3216O120K355p781j3622
11113c4203J1040J4752J2898J5144L19j211k60N892N444o830N925l43M065q426
11099B4206k1408j5150j94J4168P383j7625l4121j609K3297J0341J2242k0054
11087a8524r085j068j775J519N497Q557o882j8746l68P815L888Q683M908k0283
$$ plain form
11073 -35864 -28904 -21178 -32731 -42831 -28354 -7798 -8378 -26548 -45210 -60441 -33899 -23746
11061 -23746 -14230 -10414 -10327 -29803 -39022 -58141 -56475 -51766 -30464 -26306 -24220 -12677 -11775 1025
11047 1025 18902 40601 25025 -6387 -17429 -17476 -8869 7756 18834 16848 -2048 13932 43921
11034 43921 46337 37093 30449 22000 36944 27029 19031 2739 -3647 -420 9977 5571 -24259
11021 -24259 -26172 -29714 -31433 -16663 -4797 5830 -10912 -31252 -32334 -31340 -48602 -44121 -29260
11008 -29260 -14515 -19497 16207 38174 17880 -7075 -14299 -16936 -3520 -12289 -12435 -14804 17702
10995 17702 27800 12660 8984 17552 19801 37060 35918 13718 -6500 -6800 -2054 -22598 -28818
10982 -28818 -39842 -46152 -43376 -11404 19880 29438 19127 15133 19716 23928 3492 -17646 -23468
$$ packed form
11073c5864O960P726j1553j0100J4477K0556n80j8170j8662j5231K6542J0153
11061b3746R516L816Q7j9476r219j9119J666M709K1302M158K086J1543R02J2800
11047A025J7877K1699j5576l1412j1042m7Q607J6625J1078j986j8896J5980K9989
11034D3921K416r244o644q449J4944r915p998j6292o386L227J0397m406k9830
11021b4259j913l542j719J4770J1866J0627j6742k0340j082R94j7262M481J4861
11008b9260J4745m982L5704K1967k0294k4955p224k637J3416q769j46k369L2506
10995A7702J0098j5140l676Q568K249J7259j142k2200k0218l00M746k0544o220
10982b8818j1024o310K776L1972L1284R558j0311l994M583M212k0436k1138n822
$$ plain form
10969 -23468 -13280 9586 26057 34697 33265 38050 22509 -17032 -15525 3769 26186 7200
10957 7200 1461 1326 18872 20484 1709 -17731 -11661 2961 14250 1252 3681 2582 3964
10944 3964 6569 4569 5319 -4174 13250 14577 -1895 -8837 4740 -17384 -5605 8253 10732
10931 10732 15380 10471 9305 4635 1078 -4393 9523 18144 3474 -9210 16736 33046 18957
10918 18957 6753 15558 21010 36926 22599 7862 4643 211 -2996 -19444 -27741 -5346 3038
10905 3038 14721 11966 -1048 -7382 -7900 -9683 -18856 -14284 -31396 -48429 -30765 -16592 -9412
10892 -9412 -7217 7006 34389 15926 -6545 -45271 -60344 -51532 -26071 -28417 -26484 -23026 -29124
10879 -29124 -23760 -7460 -7595 -5641 -14939 -6289 16299 21934 3921 4101 19951 2630 -14175
$$ packed form
10969b3468J0188K2866J6471Q640j432M785j5541l9541J507J9294K2417j8986
10957G200n739j35J7546J612j8775j9440O070J4622J1289j2998K429j099J382
10944C964K605k000P50r493J7424J327j6472o942J3577k2124J1779J3858K479
10931A0732M648m909j166m670l557n471J3916Q621j4670j2684K5946J6310j4089
10918A8957j2204Q805N452J5916j4327j4737l219m432l207j6448q297K2395Q384
10905C038J1683k755j3014o334n18j783r173M572j7112j7033J7664J4173P180
10892i412K195J4223K7383j8463k2471l8726j5073Q812K5461k346J933L458o098
10879b9124N364J6300j35J954r298Q650K2588N635j8013J80J5850j7321j6805
$$ plain form
10866 -14175 -38094 -31535 -23059 -10782 12525 -1549 -3364 -5888 -3633 -6472 10067 14063 3556
10853 3556 6022 -2099 11810 2220 -8429 -1569 13730 91 4383 17968 7987 -4825 -9336
10840 -9336 -5639 -1148 -11879 -5725 -8018 -3803 20021 -3217 -31550 -17422 4110 6218 18767
10827 18767 12555 16441 10825 3062 -10225 -20714 -33057 -5598 11120 38587 30179 -9939 -26590
10814 -26590 -14198 -28535 -49836 -54267 -39785 -27438 -18938 -37753 -38440 -29025 -23533 -32255 -16603
10801 -16603 -14900 -19069 -16690 -26474 -17096 -7654 -19974 -31586 -26403 -21659 -2530 10519 9388
10788 9388 6582 -7210 -19122 -1363 22202 20450 9645 23638 30947 29329 16636 -3802 -4941
10775 -4941 4181 6995 6775 -2055 -5792 -9026 -15272 -5220 28770 27814 16401 -4578 -13806 -20714
$$ packed form
10866a4175k3919O559Q476J2277K3307j4074j815k524K255k839J6539L996j0507
10853C556K466q121J3909r590j0649O860J5299j3639M292J3585r981j2812m511
10840i336L697M491j0731O154k293M215K3824k3238k8333J4128K1532K108J2549
10827A8767o212L886n616p763j3287j0489j2343K7459J6718K7467q408m0118j6651
10814b6590J2392j4337k1301m431J4482J2347Q500j8815o87R415N492q722J5652
10801a6603J703m169K379r784R378R442j2320j1612N183M744J9129J3049j131
10788I388k806j3792j1912J7759K3565j752j0805J3993P309j618j2693k0438j139
10775d941R122K814k20q830l737l234o246J0052L3990r56j1413k0979r228o908
$$ plain form
10761 -20714 -11705 -1288 -22053 -21336 139 -13731 -5088 55601 90582 109860 85116 49106
10749 49106 24936 -57 -7715 -17818 -20012 -27100 -44697 -32041 -21115 -10931 -8231 -23208
10737 -23208 -3104 -11095 -21212 -19428 -539 17386 37818 27605 18193 25798 15827 -19425 -28650
10724 -28650 13160 25625 33153 23721 5768 -5350 -11432 -15946 -5808 13659 -2492 -29960
10712 -29960 -41905 -46024 -31563 -19364 -10617 -511 -12142 -31715 -26548 -10454 -5814 -120 24086
10699 24086 15932 -1185 -17029 -14030 -24792 -33448 -18089 -26137 -14451 -13041 -22208 -26007 -9974
10686 -9974 -18768 -25683 -20663 -29730 -31444 -16458 -824 -7813 -13834 -4017 3327 15544 14571 12907
10672 12907 -10199 -27388 -26037 -12686 -24958 -37601 -46022 -32818 -9511 -6413 -7862 -22739
$$ packed form
10761b0714R009J0417k0765P17K1475j3870Q643O0689L4981J9278k4744l6010
10749D9106k4170k4993p658j0103k194p088j7597J2656J0926J0184K700j4977
10737b3208K0104p991j0117J784J8889J7925K0432j0213r412P605r971l5252r225
10724b8650M1810J2465P528r432j7953j1118o082m514J0138J9467j6151k7468
10712b9960j1945m119J4461J2199Q747J0106j1631j9573N167J6094M640N694K4206
10699B4086q154j7117j5844K999j0762q656J5359q048J1686J410r167l799J6033
10686i974q794o915N020r067j714J4986J5634o989o021R817P344J2217r73j664
10672A2907k3106j7189J351J3351j2272j2643q421J3204K3307L098j449j4877
$$ plain form
10660 -22739 -18095 -28402 -20418 -34614 -29403 -15205 -30942 -26036 -19859 -8388 -9875 -22708 -27519
10647 -27519 -9545 -523 -17041 -6959 -6634 -10365 -9178 -19536 -14234 -28412 -32996 -34055 -20366
10634 -20366 -14476 -28145 -17758 -14470 4232 9676 442 -8279 -8289 267 -6823 -16760 -23913 1221
10620 1221 19069 35208 45602 64267 94850 106758 91265 42810 24925 2414 -16043 -27176
10608 -27176 -41148 -26496 19526 51310 61259 41039 11727 -5665 10210 8246 10927 -14416
10596 -14416 -37724 -48464 -38395 -30921 -20396 -13878 -9364 -7835 -11506 7421 3140 -15581 -30411
10583 -30411 -19145 3595 5926 697 20844 18511 6396 8169 14994 11040 18086 822 -15424
10570 -15424 -7261 -233 7878 -12233 -31563 -11728 -2110 -2299 -15567 -9753 -13105 -9861 -8972 -11888
$$ packed form
10660b2739M644j0307P984j4196N211J4198j5737M906O177J1471j487j2833m811
10647b7519J7974R022j6518J0082L25l731J187j0358N302j4178m584j059J3689
10634b0366N890j3669J0387L288J8702N444r234q721j0Q556p090r937p153K5134
10620A221J7848J6139J0394J8665L0583J1908j5493m8455j7885k2511j8457j1133
10608b7176j3972J4652M6022L1784R949k0220k9312j7392J5875j964K681k5343
10596a4416k3308j0740J0069P474J0525O518M514J529l671J8927m281j8721j4830
10583c0411J1266K2740K331n229K0147k333j2115J773O825l954P046j7264j6246
10570a5424Q163P028Q111k0111j9330J9835R618j89j3268N814l352L244Q89k916
$$ plain form
10556 -11888 -26544 -40595 -36609 -24159 -17671 -6157 4202 -2861 4121 -846 -5629 3544 -9340
10543 -9340 -31319 -39665 -18778 -25335 -26574 -19859 -15506 -18748 -24893 -4381 15523 10557 16028 21471
10529 21471 2495 -2061 -5102 -316 961 -4641 -17430 -5314 5652 10618 22306 24888 16532
10516 16532 -5856 -7846 -24976 -15855 -19516 -33932 -43466 -33043 -23263 -16055 1262 10902 -8197
10503 -8197 -16277 -18453 -33049 -41932 -26942 -32553 -26723 -18398 5144 -7703 -7318 2436 -14557 -12784
10489 -12784 -19152 -17085 -5339 -3175 -7327 -1003 -10384 -2354 2968 -7512 -18135 -35329 -65711
10476 -65711 -57637 -28416 1696 2269 -4828 -13105 -12426 -1989 -15695 -16293 -14629 -18028 -20135 -29139
10462 -29139 -27202 -22488 -19759 -25430 -37267 -41331 -34802 -17789 -13478 -4543 -6043 22 -13074 -12189
$$ packed form
10556a1888j4656j4051L986J2450O488J1514J0359p063O982m967m783R173j2884
10543i340k1979q346K0887o557j239O715M353l242o145K0512J9904m966N471N443
10529B1471j8976m556l041M786J277n602j2789J2116J0966M966J1688K582q356
10516A6532k2388j990j7130R121l661j4416r534J0423R780P208J7317R640j9099
10503h197q080k176j4596q883J4990n611N830Q325K3542j2847L85R754j6993J773
10489a2784o368K067J1746K164m152O324r381Q030N322j0480j0623j7194l0382
10476f5711Q074K9221L0112N73p097q277O79J0437j3706n98J664l399k107r004
10462b9139J937M714K729n671j1837m064O529J7013M311Q935j500O065j3096Q85
$$ plain form
10448 -12189 -12844 -19617 -19422 -8369 -17789 -27701 -21687 -9348 -4841 -1718 -24638 -33383 -10597 -4273
10434 -4273 -8262 -17252 -27649 -38051 -46953 -27304 -31109 -58973 -58989 -31932 -27573 -37768 -26231
10421 -26231 -35554 -46426 -57053 -72613 -22100 6465 7148 4705 -1547 -1974 -2171 854 12414 17064
10407 17064 16132 6361 -8305 -6587 -7359 -1517 12970 37033 29481 23330 17409 7475 -7630 -15637
10393 -15637 -14400 -6617 -624 -32035 -27535 -11630 -12849 -14824 -33555 -40475 -41808 -13776 -1924
10380 -1924 -1148 -21928 -24850 -21914 -5128 3376 -5256 -27426 -39663 -19325 -3188 5649 7272
10367 7272 12780 19255 -10962 -28688 -48110 -55076 -35721 -36115 -37099 -29212 -10980 -7854 4162 61
10353 61 3924 23676 -1088 -9065 16445 7928 -26292 -45993 -32675 -15311 -17496 -10155 2641
$$ packed form
10448a2189o55o773J95J1053r420r912O014J2339M507L123k2920q745K2786O324
10434d273l989q990j0397j0402q902J9649l805k7864j6K7057M359j0195J1537
10421b6231r323j0872j0627j5560N0513K8565O83k443o252m27j97L025J1560M650
10407A7064r32r771j4666J718p72N842J4487K4063p552o151n921r934j5105q007
10393a5637J237P783N993l1411M500J5905j219j975j8731o920j333K8032J1852
10380a924P76k0780k922K936J6786Q504q632k2170j2237K0338J6137Q837J623
10367G272N508O475l0217j7726j9422o966J9355l94r84P887J8232L126J2016m101
10353F1L863J9752k4764p977K5510q517l4220j9701J3318J7364k185P341J2796
$$ plain form
10340 2641 -1819 2837 -9799 -24958 -30906 -32234 -35983 -20703 -13089 -9296 -17850 -22514 -20064 -15394
10326 -15394 -14941 -11511 -8923 -2997 -9962 -21060 -10122 -14150 -7844 14384 2618 -14159 -1789
10313 -1789 -10708 -36825 -29947 -11900 -7033 1215 -7022 -8887 -12646 -24736 -37113 -49993 -36106
10300 -36106 6329 31393 4809 3363 2494 -15771 -22849 -6899 4516 -13187 -19108 -14015 -8432
10287 -8432 -8875 1044 -2145 -21752 -26248 -10946 -194 16179 678 1621 1350 -6065 -23416 -22502
10273 -22502 -7772 -4928 -9920 4006 5361 -9005 -3798 -8622 -30561 -21220 -23997 -22784 -11891
10260 -11891 -2707 9985 7531 1350 -11278 -16942 -41239 -39738 -20200 -12633 -3704 5691 16971
10247 16971 16708 2050 -17306 -5387 -13045 13350 29230 24989 25367 10364 -1942 -12674 -15710
$$ packed form
10340B641m460M656j2636j5159n948j328l749J5280P614L793q554m664K450M670
10326a5394M53L430K588N926o965j1098J0938m028O306K2228j1766j6777J2370
10313a789q919k6117O878J8047M867Q248q237j865l759j2090j2377j2880J3887
10300c6106M2435K5064k6584j446q69j8265p078J5950J1415j7703n921N093N583
10287h432m43R919l189j9607m496J5302J0752J6373j5501R43k71p415j7351R14
10273b2502J4730K844m992J3926J355j4366N207m824k1939R341k777J213J0893
10260a1891R184J2692k454o181j2628n664k4297J501J9538P567Q929R395J1280
10247A6971k63j4658j9356J1919p658K6395J5880m241L78j5003j2306j0732l036
$$ plain form
10234 -15710 5214 11262 2042 13951 33547 23696 -10415 -45997 -38235 -11539 8020 21835
10222 21835 15352 19339 13447 7912 6015 -12771 -21952 -9811 644 14199 21511 12693 13562 -1652
10208 -1652 -13309 -19629 -16583 -7819 -4947 -17325 -26015 -21434 -32322 -48454 -56080 -34827 -15987
10195 -15987 -4314 4001 15876 13561 -8024 -31256 -34047 -22752 -26447 -24467 -23102 -26236 -38761
10182 -38761 -42201 -39569 -20995 -18490 -12512 361 -4499 -9016 1717 9194 23901 18625 -1119
10169 -1119 -17707 -19736 3395 -717 -32317 -39495 -18977 -35322 -31617 -19750 -25695 5309 21654
10156 21654 12568 -14495 -21195 -18744 2024 14861 15339 25104 27695 24396 21645 14364 22116 11122
10142 11122 -15207 -28650 -15066 11175 8564 -6011 -8946 1127 -2873 -13298 -5470 -11430 -14331
$$ packed form
10234a5710K0924O048r220J1909J9596r851l4111l5582P762K6696J9559J3815
10222B1835o483L987n892n535j897j8786r181J2141J0455J3555P312q818Q69j5214
10208a652j1657o320L046Q764K872j2378q690M581j0888j6132p626K1253J8840
10195a5987J1673Q315J1875k315k1585k3232k791J1295l695J980J365l134j2525
10182c8761l440K632J8574K505N978J2873m860m517J0733P477J4707n276j9744
10169a119j6588k029K3131m112l1600p178K0518j6345L705J1867n945L1004J6345
10156B1654r086k7063o700K451K0768J2837M78R765K591l299k751p281P752j0994
10142A1122k6329j3443J3584K6241k611j4575k935J0073m000j0425P828n960k901
$$ plain form
10129 -14331 12323 18197 5246 -2830 -12241 3502 17041 11947 -4019 -5110 8084 13450 -4667
10116 -4667 -13167 -1989 25554 22731 -412 -32958 -232 17000 3894 -21933 -19512 -20241 -27204
10103 -27204 -33812 -14956 2428 -6088 -26098 -13988 3860 6466 -5495 -3095 1435 -8075 -11585
10090 -11585 -5510 -21877 -48619 -35346 -12336 -13338 -25201 -15125 -23234 -23376 -28319 -27670 -18806
10077 -18806 7573 12058 12000 2797 -7887 -20694 -19504 -11019 -14996 -20608 -21079 5427 11552 3114
10063 3114 8603 -4117 -17536 -14353 -19340 -16051 -7672 1621 10193 8455 -5277 -6385 -2672 -4743
10049 -4743 -3225 -14054 -9940 -528 16793 22226 6101 5495 8383 11624 -325 -17347 -19611 -23844
10035 -23844 -7533 14955 3079 -9220 -6457 -1318 4520 -8367 -8655 10855 4778 2582 -4156
$$ packed form
10129a4331K6654N874j2951q076r411J5743J3539n094j5966j091J3194N366j8117
10116d667q500J1178K7543k823k3143l2546L2726J7232j3106k5827K421p29o963
10103b7204o608J8856J7384q516k0010J2110J7848K606j1961K400M530r510l510
10090a1585O075j6367k6742J3273K3010j002j1863J0076q109j42m943O49Q864
10077a8806K6379M485n8r203j0684j2807J190Q485l977n612m71K6506O125q438
10063C114N489j2720j3419L183m987L289Q379R293Q572j738j3732j108L713k071
10049d743J518j0829M114R412J7321N433j6125o06K888L241j1949j7022k264m233
10035b3844J6311K2488j1876j2299K763N139N838j2887k88J9510o077k196o738
$$ plain form
10022 -4156 -3614 -5485 1159 14679 8466 4880 2324 13967 -5156 -30221 -25210 -7988 -9532 -17431
10008 -17431 8345 7745 9077 13542 6346 20048 35253 17616 30607 21682 12341 -1518 8169
9995 8169 5209 8927 20506 9600 1633 -9483 15880 53378 32873 -7724 -23883 -19227 3369
9982 3369 -771 545 10744 15891 17128 23022 33151 35236 32946 6915 -2749 -5382 570 -11725
9968 -11725 -18106 -8929 -4210 -21140 -36431 -26600 -41425 -29629 -3492 7424 18716 21707 15958
9955 15958 -10235 -5302 27128 33483 15915 -6184 8684 34859 58554 45019 -451 -15116
9943 -15116 -17529 -23223 -4308 1360 -6328 -15615 -10465 -4149 5064 3619 -5313 -16523 -18966 -5525
9929 -5525 2149 20726 57677 57828 29853 -3038 -20586 -25140 -32329 -11714 -23245 -22703 -20506 -19949
$$ packed form
10022d156N42j871O644J3520o213l586k556J1643j9123k5065N011J7222j544p899
10008a7431K5776o00J332M465p196J3702J5205j7637J2991q925r341j3859R687
9995H169k960L718J1579j0906p967j1116K5363L7498k0505m0597j6159M656K2596
9982C369m140J316J0199N147J237N894J0129K085k290k6031r664k633N952j2295
9968a1725o381R177M719j6930j5291R831j4825J1796K6137J0916J1292K991n749
9955A5958k6193M933L2430O355j7568k2099J4868K6175K3695j3535m5470j4665
9943a5116k413n694J8915N668p688r287N150O316R213j445q932j1210k443J3441
9929e525P674J8577L6951J51k7975l2891j7548m554p189K0615j1531N42K197N57
$$ plain form
9915 -19949 -10775 -6907 -7625 2187 3460 5500 13522 26584 37290 41582 24055 19201 14503 26342
9901 26342 48730 30084 20170 26085 37000 18879 -3326 -27590 -21610 -17542 -32843 -41672 -18558
9888 -18558 -5906 -31427 -34388 -892 -10591 -4882 12520 17989 13719 8474 4950 -16118 -14006
9875 -14006 -889 1772 -12645 -15797 -12730 3084 -4911 -4027 5325 -2181 14393 30338 19367
9862 19367 13616 19123 28680 12035 -5824 -5355 -6805 2021 5839 6972 4340 2856 -5693 -11309
9848 -11309 -11439 -6107 -7462 -9430 -14454 -11828 -21058 -14377 -18497 -17148 -17078 -18432 -714 24652 21722
9833 21722 6527 -4994 -22420 -36198 -21854 -10773 2081 -5841 -9940 -3561 -23080 -34755
9821 -34755 -26445 -6428 11131 11820 -80 -17110 -20475 -7315 -6686 -5362 -6660 862 -19429 -21154
$$ packed form
9915a9949R174L868p18R812J273K040Q022J3062J0706M292j7527m854m698J1839
9901B6342K2388j8646r914N915J0915j8121k2205k4264N980M068j5301q829K3114
9888a8558J2652k5521k961L3496r699N709J7402N469m270n245l524k1068K112
9875a4006J3117K661j4417l152L067J5814p995Q84R352p506J6574J5945j0971
9862A9367n751N507R557j6645j7859M69j450Q826L818J133k632j484q549n616
9848a1309j30N332j355j968n024K626r230O681m120J349P0j354J7718K5366k930
9833B1722j5195j1521j7426j3778J4344J1081J2854p922m099O379j9519j1675
9821c4755Q310K0017J7559O89j1900j7030l365J3160O29J324j298P522k0291j725
$$ plain form
9807 -21154 -9926 -2243 -11977 -23017 -25835 -8036 -1486 -11720 -6466 -13611 -18069 -8593 -2236 -6523
9793 -6523 -23327 -32327 -43737 -62415 -36737 -1881 -9629 -21231 2125 22277 14652 24804 44480
9780 44480 46823 24275 9203 8659 7290 17152 37252 49093 21058 17632 31254 22411 12080
9767 12080 27067 20568 11604 24125 25829 11232 3965 14987 17856 2580 10044 21401 396
9754 396 -28252 -35279 -30456 -4892 30498 34528 15021 547 -22184 -29259 -5398 17458 16397
9741 16397 10129 9892 31908 21036 -14810 -16586 18040 12467 -11200 -12538 -14213 -315 15282
9728 15282 -2640 14548 27429 5290 -14770 -1249 20451 20783 17796 24070 20051 23458 9734
9715 9734 1569 83 -14327 -19141 -29901 -29312 -29475 -31241 -26479 -8085 -14417 -21303 -8711 251
$$ packed form
9807b1154J1228P683r734j1040k818J7799O550j0234N254p145m458R476O357m287
9793f523j6804r000j1410j8678K5678L4856p748j1602K3356K0152p625J0152J9676
9780D4480K343k2548j5072n44j369R862K0100J1841k8035l426J3622q843j0331
9767A2080J4987o499q964J2521J704j4597p267J1022K869j5276P464J1357k1005
9754C96k8648p027M823K5564L5390M030j9507j4474k2731p075K3861K2856j061
9741A6397o268k37K2016j0872l5846j776L4626n573k3667j338j675J3898J5597
9728A5282j7922J7188J2881k2139k0060J3521K1700L32k987O274m019L407j3724
9715I734q165j486j4410m814j0760N89j63j766M762J8394o332o886J2592Q962
$$ plain form
9701 251 16901 35944 28717 15347 11971 19088 11549 929 21441 29164 4004 -174 5269 3907
9687 3907 -16303 -18008 4394 17521 16313 9541 -7514 -22706 -27115 -23564 -20349 -18709 -22566 -4387
9673 -4387 17744 15180 -595 -1927 -18895 -6368 15120 1406 -19095 -24549 -8534 7492 491
9660 491 19937 21726 33462 30965 46586 44629 30910 38799 33769 20597 19223 21614 12727 7781
9646 7781 -13484 -28680 -15069 -2391 -14289 -2101 -3606 -13405 -42472 -37323 -6891 1301 -3104
9633 -3104 -13919 -12911 13696 14481 4583 2640 9823 4726 -5451 -2519 -2544 -4189 -5529 11401 8139
9618 8139 10617 14757 -13775 -34898 -28426 -12537 21896 6596 -885 -1537 5025 -3556 -13309 -2200
9604 -2200 627 22650 10652 361 -20419 -34725 -19520 7358 32991 36153 37362 35383 41135
$$ packed form
9701B51J6650J9043p227j3370l376P117p539j0620K0512P723k5160m178N443j362
9687C907k0210j705K2402J3127j208o772j7055j5192m409L551L215J640l857J8179
9673d387K2131k564j5775j332j6968J2527K1488j3714k0501n454J6015J6026p001
9660D91J9446J789J1736k497J5621j957j3719P889n030j3172j374K391q887m946
9646G781k1265j5196J3611J2678j1898J2188j505r799k9067N149L0432Q192m405
9633c104j0815J008K6607P85r898j943P183n097j0177K932k5j645j340J6930l262
9618H139K478M140k8532k1123O472J5889L4433j5300p481o52O562q581r753J1109
9604b200K827K2023j1998j0291k0780j4306J5205K6878K5633L162J209j979N752
$$ plain form
9591 41135 33144 9423 7863 22699 24122 17527 41633 45764 19473 15954 13617 11460 11483 33102
9577 33102 74142 60291 32501 -2992 -14660 5208 -2460 -9633 -6014 -23356 -14344 -6720 5558
9564 5558 14565 10232 11587 -954 4720 3212 -8580 -6207 -23737 -13018 3895 -3261 -17053
9551 -17053 -32296 -29387 -31337 -6617 27435 36167 20000 -7107 -13805 -3151 270 10972 7248
9538 7248 1856 -7721 -9109 -13450 -59026 -48598 -25436 -23926 -38041 -25808 -5840 10903 5631
9525 5631 6148 27303 22605 17816 11636 5888 -9428 -18751 -3476 25063 44144 26736 28216 21759
9511 21759 -7921 -37351 -57930 -38866 4579 16988 15200 5848 23285 47009 51224 25884
9499 25884 9781 27268 20134 -12083 -19818 -6534 -5783 8228 23847 22247 10010 -264 1010
$$ packed form
9591D1135p991k3721j560J4836J423o595K4106M131k6291l519k337k157K3K1619
9577C3102M1040j3851k7790l5493j1668J9868p668p173L619j7342R012P624J2278
9564E558R007m333J355j2541N674j508j1792K373j7530J0719J6913p156j3792
9551a7053j5243K909j950K4720L4052Q732j6167k7107o698J0654L421J0702l724
9538G248n392r577j388m341m5576J0428K3162J510j4115J2233J9968J6743n272
9525E631N17K1155m698m789o180n748j5316r323J5275K8539J9081j7408J480o457
9511B1759k9680k9430k0579J9064M3445J2409j788r352J7437K3724M215k5340
9499B5884j6103J7487p134l2217p735J3284P51J4011J5619j600j2237j0274J274
$$ plain form
9486 1010 13627 9649 25029 27338 6543 6411 41994 55368 34470 11904 14811 23805 22380
9473 22380 21442 41701 59176 67502 50576 32158 30387 38389 46739 47972 38640 18574 5373
9460 5373 19640 28436 25142 13944 15909 12246 9778 29341 35498 26798 28734 32946 34303 39872
9446 39872 65769 56276 58560 46621 12360 10543 17159 23686 33900 43004 29895 28960 31535 18320
9432 18320 18314 43487 35277 31465 58447 77240 56982 41163 31830 31767 37904 60370 46952 25940
9418 25940 19766 15281 2714 -14568 -10687 -9315 -2693 6300 25759 44056 60873 41346 22527
9405 22527 24073 37881 32893 31545 27772 32192 38646 25885 35105 24450 27311 39589 16801
9392 16801 11371 16575 24835 21291 33464 43308 36548 21371 -5085 -14169 -12874 -11909 8933 17480
$$ packed form
9486A010J2617l978J5380K309k0795j32L5583J3374k0898k2566K907Q994j425
9473B2380r38K0259J7475Q326j6926j8418j771Q002Q350J233r332k0066j3201
9460E373J4267Q796l294j1198J965l663k468J9563O157q700J936M212J357N569
9446C9872K5897r493K284j1939l4261j817O616O527J0214R104j3109r35K575j3215
9432A8320oK5173q210l812K6982J8793k0258j5819r333o3O137K2466j3418k1012
9418B5940o174m485j2567j7282L881J372O622Q993J9459J8297J6817j9527j8819
9405B2527J546J3808m988j348l773M420O454j2761R220j0655K861J2278k2788
9392A6801n430N204Q260l544J2173R844o760j5177k6456r084J295R65K0842Q547
$$ plain form
9378 17480 21355 34118 42820 45603 35037 31956 19369 21179 28187 22370 8732 -2718 -23274
9365 -23274 -30543 -21650 -19322 -23902 -10062 12028 7330 -1953 -3373 10060 -849 -17280 -19583
9352 -19583 -18495 -7221 19939 32539 47242 56420 46126 25772 20441 20380 26709 26832 19944 -564
9338 -564 4340 21777 32450 25806 22936 30505 27094 12406 17641 22328 45067 43907 19480 12532
9324 12532 29219 25296 17333 -6308 -1977 -16829 -12219 8368 22816 40471 74259 66849 54121
9311 54121 52650 42873 25154 37822 52471 28114 693 -19922 -9939 -10318 11509 5914 1207
9298 1207 9877 12099 -8702 -436 18338 29903 23002 6874 5611 11715 35873 49686 53977
9285 53977 51331 54088 67615 54953 33115 46218 47233 39739 33240 35173 17237 38307 65711
$$ packed form
9378A7480L875J2763Q702K783j0566l081j2587J810P008n817j3638j1450k0556
9365b3274p269Q893K328m580J3840K2090m698r283j420J3433j0909j6431k303
9352a9583J088J1274K7160J2600J4703R178j0294k0354n331o1O329J23o888k0508
9338e64M904J7437J0673o644k870P569l411j4688N235M687K2739j160k4427o948
9324A2532J6687l923p963k3641M331j4852M610K0587J4448J7655L3788p410j2728
9311E4121j471r777j7719J2668J4649k4357k7421k0615R983l79K1827n595m707
9298A207Q670K222k0801Q266J8774J1565o901j6128j263O104K4158J3813M291
9285E3977k646K757J3527j2662k1838J3103J015p494o499J933j7936K1070K7404
$$ plain form
9272 65711 80457 96825 85873 81372 73773 79246 82344 81731 80422 102347 91957 56345 53425
9259 53425 61024 57033 55094 28581 18916 26433 39350 28459 24326 4109 -10807 -13549 -17665
9246 -17665 -2077 16140 18027 16426 38568 33797 3856 -17564 -739 15863 9551 13945 36267
9233 36267 41593 44629 56212 44951 38042 55542 63792 56134 59989 56524 57612 50999 36066 25867
9219 25867 34193 46973 39880 15679 12245 15515 33641 35534 30187 37156 33846 20942 28151 43246
9205 43246 44552 58086 41459 56233 64956 66843 79688 89575 92854 84920 73774 61303 71990
9192 71990 77288 71661 72691 79204 102327 116058 114603 131697 158684 184680 206525 240685 300950
9179 300950 359640 434210 542427 671455 808034 934744 1054194 1154737 1233674 1272592
$$ packed form
9272F5711J4746J6368j0952m501p599N473L098o13j309K1925j0390l5612k920
9259E3425P599l991j939k6513r665P517J2917j0891m133k0217j4916k742m116
9246a7665J5588J8217J887j601K2142m771k9941k1420J6825J6602o312M394K2322
9233C6267N326L036J1583j1261o909J7500Q250p658L855l465J088o613j4933j0199
9219B5867Q326J2780p093k4201l434L270J8126J893n347O969l310j2904P209J5095
9205D3246J306J3534j6627J4774Q723J887J2845R887L279p934j1146j2471J0687
9192G1990N298n627J030O513K3123J3731j455J7094K6987K5996K1845L4160O0265
9179C00950N8690P4570J08217J29028J36579J26710J19450J00543P8937L8918
$$ plain form
9169 1272592 1252270 1167147 1062653 951908 848626 743232 643859 550786 473298 435723 398312
9158 398312 374547 325170 294918 311486 299217 272841 275805 269709 264201 239407 231696 230217 217232
9145 217232 226686 208304 192848 203139 207822 206085 190781 197340 204590 167206 147875 150628 147428
9132 147428 145106 138694 156739 183526 166941 164737 146712 134520 162264 189939 217570 226683
9120 226683 212585 219338 208940 185613 179304 169861 187878 201944 196112 183939 192515 198649 196631
9107 196631 207134 249182 279693 284860 273406 255077 260128 287619 287380 306209 345821 369196
9095 369196 407462 459987 503131 551185 611658 691933 768528 872539 1005144 1154892 1365283
9084 1365283 1646845 2002846 2397573 2851835 3321985 3752165 4043728 4115675 3951511 3602923
$$ packed form
9169A272592k0322q5123j04494j10745j03282j05394r9373r3073p7488l7575l7411
9158C98312k3765m9377l0252J6568j2269k6376K964o096n508k4794p711j479j2985
9145B17232R454j8382j5456J0291M683j737j5304O559P250l7384j9331K753l200
9132A47428k322o412J8045K6787j6585k204j8025j2192K7744K7675K7631R113
9120B26683j4098O753j0398k3327o309r443J8017J4066n832j2173Q576O134k018
9107A96631J0503M2048L0511N167j1454j8329N051K7491k39J8829L9612K3375
9095C69196L8266N2525M3144M8054O0473Q0275P6595J04011J32605J49748K10391
9084A365283K81562L56001L94727M54262M70150M30180K91563P1947j64164l48588
$$ plain form
9074 3602923 3200970 2797275 2462701 2176025 1930013 1729031 1558310 1407376 1308208 1222931
9064 1222931 1118194 1015268 941651 891193 851598 790915 749776 743787 721392 680195 633135
9053 633135 569171 533941 514477 493734 471871 456136 448852 424234 416850 430014 428177 408506
9041 408506 411930 417884 418485 432601 427253 432991 422148 398697 377360 375427 402272 434349 442417
9028 442417 453103 441358 415340 376925 350140 351447 324218 296819 281870 286612 266036 229717
9016 229717 210963 215004 210694 195897 190009 196917 191475 179930 177692 178084 166641 166885 185800 202775
9002 202775 205315 193137 173555 182141 184034 166925 181465 184001 176970 162069 174839 204392 224676
8989 224676 229991 236383 236093 221830 214170 190613 193275 204797 214998 208896 182875 164311 185077
$$ packed form
9074C602923m01953m03695l34574k86676k46012k00982j70721j50934r9168q5277
9064A222931j04737j02926p3617n0458l9595o0683m1139n989k2395m1197m7060
9053F33135o3964l5230j9464k0743k1863j5735p284k4618p384J3164j837j9671
9041D08506L424N954O01J4116n348N738j0843k3451k1337j933K6845L2077Q068
9028D42417J0686j1745k6018l8415k6785J307k7229k7399j4949M742k0576l6319
9016B29717j8754M041m310j4797n888O908n442j1545k238L92j1443K44J8915J6975
9002B02775K540j2178j9582Q586J893j7109J4540K536p031j4901J2770K9553K0284
8989B24676N315O392k90j4263p660k3557K662J1522J0201o102k6021j8564K0766
$$ plain form
8976 185077 187388 180622 157246 163327 158314 178864 182409 181158 179252 165715 173128 157351 142593
8963 142593 136281 131212 140548 170981 200594 201479 191993 210540 216042 206258 192503 155244 149605
8950 149605 153639 170917 172615 176659 175116 183543 174297 172324 174771 152575 152981 152753 146710 150274
8936 150274 173150 181917 176004 187119 206315 229566 244478 244154 258629 252699 240645 237878 233037
8923 233037 226681 247121 268327 273695 262626 243853 227570 227079 221574 218988 229693 255025 268059
8910 268059 288569 309116 324124 345633 382226 441983 501065 560963 636979 680758 708513 736735
8898 736735 768855 725798 631264 564711 524023 502572 465292 444901 433913 442442 442756 436892
8886 436892 458157 491631 514141 521410 510883 502242 510863 515861 521684 518086 524576 554240 602442
$$ packed form
8976A85077K311o766k3376O081n013K0550L545j251j906j3537P413j5777j4758
8963A42593o312n069R336L0433K9613Q85r486J8547N502r784j3755l7259n639
8950A49605M034J7278J698M044j543Q427r246j973K447k2196M06k28o043L564
8936A50274K2876Q767n913J1115J9196K3251J4912l24J4475n930j2054k767m841
8923B33037o356K0440K1206N368j1069j8773j6283m91n505k586J0705K5332J3034
8910B68059K0510K0547J5008K1509L6593N9757N9082N9898P6016M3779K7755K8222
8898G36735L2120m3057r4534o6553m0688k1451l7280k0391j0988Q529L14n864
8886D36892K1265L3474K2510P269j0527q641Q621M998N823l598O490K9664M8202
$$ plain form
8873 602442 592384 571113 563733 573981 595730 637651 669035 655222 635895 627133 590410 547457
8861 547457 539524 534079 542854 551036 551295 548444 548623 561053 555478 578275 598748 604956 633719 645353
8847 645353 655363 682954 699721 710415 740250 822735 906814 978150 1048898 1114393 1173494 1201223
8835 1201223 1204027 1212777 1221772 1236297 1278869 1316524 1350167 1433202 1525284 1602240 1645348 1684247
8823 1684247 1745644 1792798 1847358 1887026 1911258 1948592 2021896 2062218 2108552 2176869 2289444
8812 2289444 2443887 2623726 2831741 3044464 3268386 3456943 3606419 3762756 3884240 4001819
8802 4001819 4159581 4386234 4643615 4950736 5335327 5767126 6248902 6790854 7435973 8191884
8792 8191884 9096704 10192562 11490884 13030325 14903862 17221780 20045085 23383278
$$ packed form
8873F02442j0058k1271p380J0248K1749M1921L1384j3813j9327q762l6723m2953
8861E47457p933n445Q775Q182K59k851J79J2430n575K2797K0473O208K8763J1634
8847F45353J0010K7591J6767J0694K9835Q2485Q4079P1336P0748O5495N9101K7729
8835A201223K804Q750Q995J4525M2572L7655L3643Q3035R2082P6956M3108L8899
8823A684247O1397M7154N4560L9668K4232L7334P3304M0322M6334O8317J12575
8812B289444J54443J79839K08015K12723K23922J88557J49476J56337J21484J17579
8802D001819J57762K26653K57381L07121L84591M31799M81776N41952O45119P55911
8792H191884R04820J095858J298322J539441J873537K317918K823305L338193
$$ plain form
8784 23383278 27184831 31552601 36857963 43847208 53643180 67819750 88545786 118872483
8776 118872483 162229631 219101981 282287172 335687312 354861853 319674072 251918743
8769 251918743 190213361 146675167 117770784 98412420 85083003 75732279 69050872
8762 69050872 63994450 59829259 56138689 52796370 49769119 46904570 44115739 41482414
8754 41482414 39089971 37013643 35321121 34110543 33431030 33194478 33078132 32582506 30856022
8745 30856022 28047309 25427269 23387263 21829705 20563419 19486526 18521144 17690152
8737 17690152 16941918 16269770 15674755 15117345 14603623 14093495 13566729 13054632 12536053
8728 12536053 12023309 11555707 11143508 10783204 10452782 10163683 9915427 9710213 9529141
$$ packed form
8784B3383278L801553M367770N305362O989245R795972J4176570K0726036L0326697
8776A18872483M3357148N6872350O3185191N3400140J9174541l5187781o7755329
8769B51918743o1705382m3538194k8904383j9358364j3329417r350724o681407
8762F9050872n056422m165191l690570l342319l027251k864549k788831k633325
8754D1482414k392443k076328j692522j210578o79513k36552j16346m95626j726484
8745C0856022k808713k620040k040006j557558j266286j076893r65382q30992
8737A7690152p48234o72148n95015n57410n13722n10128n26766n12097n18579
8728A2536053n12744m67602m12199l60304l30422k89099k48256k05214j81072
$$ plain form
8719 9529141 9361802 9239497 9178181 9134775 9088253 8985038 8798158 8559295 8290360 7988011
8709 7988011 7690378 7432054 7232537 7061358 6866396 6705655 6559762 6417643 6271503 6153087
8699 6153087 6041498 5915304 5787604 5684541 5605757 5543279 5445820 5343871 5244286 5141863
8689 5141863 5046578 4958914 4878093 4811757 4731179 4634452 4528045 4423360 4359494 4312640 4239563
8678 4239563 4204015 4189005 4186577 4175190 4176003 4191262 4240390 4334314 4462136 4580118 4626908 4572434
8666 4572434 4393732 4169235 3963004 3782048 3630200 3490698 3368357 3244004 3137961 3059015
8656 3059015 2990769 2924543 2828205 2741574 2661588 2598444 2528852 2444284 2348354 2261377 2155648
8645 2155648 2030025 1913296 1810087 1733658 1669253 1603809 1532117 1497864 1473363 1402441 1345807
$$ packed form
8719I529141j67339j22305o1316m3406m6522j03215j86880k38863k68935l02349
8709G988011k97633k58324j99517j71179j94962j60741j45893j42119j46140j18416
8699F153087j11589j26194j27700j03063p8784o2478r7459j01949r9585j02423
8689E141863r5285q7664q0821o6336q0578r6727j06407j04685o3866m6854p3077
8678D239563l5548j5010k428j1387Q13J5259M9128R3924J27822J17982M6790n4474
8666D572434j78702k24497k06231j80956j51848j39502j22341j24353j06043p8946
8656C059015o8246o6226r6338q6631p9986o3144o9592q4568r5930q6977j05729
8645B155648j25623j16729j03209p6429o4405o5444p1692l4253k4501p0922n6634
$$ plain form
8634 1345807 1298028 1260885 1227707 1199877 1181518 1148984 1112755 1082759 1066322 1039928 1038245 1047874
8622 1047874 1061647 1027294 967132 889901 790687 744938 706191 657457 644082 647002 660363 686036
8610 686036 688749 694666 712225 724603 720779 746919 789628 805727 822859 826435 833412 847774 842119
8597 842119 835978 837795 821085 783196 770511 754941 750731 739310 727232 726929 729831 751258 790112
8584 790112 808819 817100 815174 786444 773415 766949 758655 756538 743639 745788 750895 739920 721542
8571 721542 702946 693582 677274 677539 695379 698460 708139 728574 722129 710358 706078 701216 688874
8558 688874 686455 654568 636103 649067 649353 641085 649639 650538 638686 636558 658119 700915 741449
8545 741449 760496 762860 774141 762246 750047 732429 728896 724218 707312 658497 608482 567913
$$ packed form
8634A345807m7779l7143l3178k7830j8359l2534l6229k9996j6437k6394j683R629
8622A047874J3773l4353o0162p7231r9214m5749l8747m8734j3375K920J3361K5673
8610F86036K713N917J7559J2378l824K6140M2709J6099J7132L576O977J4362n655
8597H42119o141J817j6710l7889j2685j5570m210j1421j2078l03K902K1427L8854
8584G90112J8707Q281j926k8730j3029o466q294k117j2899K149N107j0975j8378
8571G21542j8596r364j6308K65J7840L081R679K0435o445j1771m280m862j2342
8558F88874k419l1887j8465J2964K86q268Q554Q99j1852k128K1561M2796M0534
8545G41449J9047K364J1281j1895j2199j7618l533m678j6906m8815n0015m0569
$$ plain form
8533 567913 538226 515337 507640 508174 513194 497923 495541 490593 490692 480550 471241 467189 437186 426993
8519 426993 436276 427659 430432 446003 451295 451372 432591 423016 413942 430840 460324 452968 445412 452969
8505 452969 449244 434185 436617 456413 468387 508323 586707 642416 631347 587653 526739 469724
8493 469724 432212 397270 357218 331071 324847 319505 318583 314957 317431 308837 303435 293008 278107
8480 278107 288857 273236 236873 205511 201741 212406 222794 219663 242892 267660 256118 256190 259243
8467 259243 252825 257112 261625 262360 254508 252502 253586 251341 225663 208672 198991 206839 218217 230074
8453 230074 267980 315212 319997 303389 281914 274634 268065 230362 216598 222221 248628 245629 222842
8440 222842 232063 215412 212497 187273 162041 172959 179300 180123 191347 188745 178709 184022 184041 172416
$$ packed form
8533E67913k9687k2889p697N34N020j5271k382m948R9j0142r309m052l0003j0193
8519D26993R283q617K773J5571N292P7j8781r575r074J6898K9484p356p556P557
8505D52969l725j5059K432J9796J1974L9936P8384N5709j1069m3694o0914n7015
8493D69724l7512l4942m0052k6147o224n342r22l626K474q594n402j0427j4901
8480B78107J0750j5621l6363l1362l770J0665J0388l131K3229K4768j1542P2L053
8467B59243o418M287M513P35p852k006J084k245k5678j6991r681P848J1378J1857
8453B30074L7906M7232M785j6608k1475p280o569l7703j3764N623K6407k999k2787
8440B22842R221j6651k915k5224k5232J0918O341Q23J1224k602j0036N313J9j1625
$$ plain form
8426 172416 170833 178058 157254 153878 159188 165799 160808 157688 174840 170719 169899 153148 146807 152552
8412 152552 168305 182337 170782 164240 162386 158720 162929 148333 131440 134655 125343 121273 120268
8399 120268 136577 163076 145440 141002 135877 126699 130520 161467 180342 177529 183308 201043 195464
8386 195464 203447 225715 243505 259249 284544 311863 348922 379646 433815 523315 608423 716584
8374 716584 808952 935551 1094674 1225173 1301686 1347242 1348692 1294738 1192037 1085802 953493
8363 953493 822781 716121 619152 580571 556131 514741 488595 456593 420813 387974 378638
8352 378638 347988 311179 290002 273670 263015 263221 260582 274365 286508 284549 278810 264652 250294
8339 250294 256729 249095 229192 208368 206675 193274 175394 173832 182124 175423 159484 152191 163449
$$ packed form
8426A72416j583P225k0804l376N310O611m991l120J7152m121q20j6751o341N745
8412A52552J5753J4032j1555o542j854l666M209j4596j6893L215r312m070j005
8399A20268J6309K6499j7636m438n125r178L821L0947J8875k813N779J7735n579
8386A95464P983K2268J7790J5744K5295K7319L7059L0724N4169Q9500Q5108J08161
8374G16584R2368J26599J59123J30499P6513M5556J450n3954j02701j06235j32309
8363I53493j30712j06660r6969l8581k4440m1390k6146l2002l5780l2839r336
8352C78638l0650l6809k1177j6332j0655K06k639J3783J2143j959n739j4158j4358
8339B50294O435p634j9903k0824j693j3401j7880j562Q292o701j5939p293J1258
$$ plain form
8326 163449 162529 145413 157989 167089 164616 144069 130954 127925 126024 143404 146391 138732 128942
8313 128942 115282 119690 121053 123259 134635 146275 162568 174836 182245 146306 132959 129479 126781
8300 126781 144903 152408 141853 126652 123401 108937 103671 116936 136897 111013 102268 91614
8288 91614 91308 82969 67807 65536 85198 97587 125966 135381 111189 103296 115051 115210 115188 110338
8274 110338 109974 112239 115806 123121 113723 89530 78125 74723 79924 68144 71488 83878 80247 78178
8260 78178 95914 133861 127001 92751 98021 90507 83400 70588 76843 88075 91249 90722 82827 59684
8246 59684 64682 84923 86695 88182 83514 87602 83119 90709 90679 74080 76935 79970 74426 58514
8232 58514 52013 54005 69459 90657 87056 80898 71671 67701 61277 69755 58832 50194 48520 59997
$$ packed form
8326A63449r20j7116J2576R100k473k0547j3115l029j901J7380K987p659r790
8313A28942j3660M408J363K206J1376J1640J6293J2268P409l5939j3347l480k698
8300A26781J8122P505j0555j5201l251j4464n266J3265J9961k5884q745j0654
8288I1614l06q339j5162k271J9662J2389K8379R415k4192p893J1755J59k2m850
8274A10338l64K265L567P315r398k4193j1405l402N201j1780L344J2390l631k069
8260G8178J7736L7947o860l4250N270p514p107j2812O255J1232L174n27p895k3143
8246E9684M998K0241J772J487m668M088m483P590l0j6599K855L035n544j5912
8232E8514o501J992J5454K1198l601o158r227l970o424Q478j0923q638j674J1477
$$ plain form
8218 59997 58070 50892 64340 58071 56396 64167 72889 56247 69715 50711 37439 54040 65243
8205 65243 55537 48665 37284 41130 46341 55364 66623 72629 64942 68015 64113 65666 65237 66787
8191 66787 45133 23563 18118 38127 58116 69757 90243 97733 99062 73962 49750 42137 29789
8178 29789 55519 76150 84337 69212 59995 71876 82092 70109 36816 25999 42477 57893
8166 57893 69499 66877 67078 66143 52967 62964 68422 81430 99103 97024 88539 94507 82206 71632
8152 71632 40081 36288 47742 64956 77527 74351 51714 46875 55697 63846 54352 74291 78895
8139 78895 90463 95008 77308 87702 95708 83141 70063 42564 62037 70067 62766 83158 96970
8126 96970 112280 112944 90514 80701 74379 83115 114417 155579 192862 205635 221531 225111 200744
$$ packed form
8218E9997j927p178J3448o269j675P771Q722j6642J3468j9004j3272J6601J1203
8205F5243r706o872j1381L846N211R023J1259O006p687L073l902J553m29J550
8191F6787k1654k1570n445K0009J9989J1641K0486P490J329k5100k4212p613j2348
8178B9789K5730K0631Q187j5125r217J1881J0216j1983l3293j0817J6478J5416
8166E7893J1606k622K01r35j3176R997N458J3008J7673k079q485N968j2301j0574
8152G1632l1551l793J1454J7214J2571l176k2637m839Q822Q149r494J9939M604
8139G8895J1568M545j7700J0394Q006j2567j3078k7499J9473Q030p301K0392J3812
8126I6970J5310O64k2430r813o322Q736L1302M1162L7283J2773J5896L580k4367
$$ plain form
8113 200744 161951 137627 106697 80937 76797 78151 70245 51032 51343 78215 86195 73626 76727
8100 76727 92036 77641 84811 98653 94023 111844 127691 97745 73575 57406 53599 62616 78873
8087 78873 98443 111898 115250 102858 113168 142635 122084 107898 118331 140638 141880 119710
8075 119710 136496 181703 216757 231883 214003 189982 163670 133150 106650 79095 65480 57875
8063 57875 66521 76604 88232 89061 61648 49927 55142 79613 76302 65122 73762 74599 81097 106730
8049 106730 115159 121320 109412 101179 117622 102014 80014 73705 56390 90975 103167 101636 115852
8036 115852 112357 93766 80870 74592 68721 69762 75146 67436 70320 78310 82720 95745 102758 95847
8022 95847 71406 75877 74958 54389 36566 58783 72426 84090 78468 54962 33724 56200 96032
$$ packed form
8113B00744l8793k4324l0930k5760m140J354p906j9213L11K6872P980j2569L101
8100G6727J5309j4395P170J3842m630J7821J5847k9946k4170j6169l807R017J6257
8087G8873J9570J3455L352j2392J0310K9467k0551j4186J0433K2307J242k2170
8075A19710J6786M5207L5054J5126j7880k4021k6312l0520k6500k7555j3615p605
8063E7875Q646J0083J1628Q29k7413j1721N215K4471l311j1180Q640Q37O498K5633
8049A06730Q429O161j1908q233J6443j5608k2000o309j7315L4585J2192j531J4216
8036A15852l495j8591j2896o278n871J041N384p710K884P990M410J3025P013o911
8022I5847k4441M471r19k0569j7823K2217J3643J1664n622k3506k1238K2476L9832
$$ plain form
8009 96032 110178 107199 89987 84767 62636 52862 49410 44852 44301 56069 77728 91140 74920
7996 74920 71643 69099 62042 56851 46669 59243 64446 54072 67749 67369 67063 69338 78042 93010
7982 93010 92923 68737 62129 59760 60719 74944 83534 67159 62148 82422 81126 76307 75536 64957
7968 64957 71116 65320 53503 50858 93740 111110 103923 94476 93636 85596 87067 78209 68204 71606
7954 71606 65034 47239 48776 31082 40176 56138 61086 79424 70287 78861 73110 71345 69473 79174
7940 79174 69652 60498 77701 73887 54891 50026 48233 46611 24212 23734 22260 50340 88792 104730
7926 104730 109834 104147 106522 98473 80898 72367 51054 59891 59943 34397 30393 40921 48096 40873
7912 40873 30144 20058 21764 38934 64377 52652 50958 47716 18188 22766 13094 33764 68966
$$ packed form
8009I6032J4146k979j7212n220k2131r774l452m558n51J1768K1659J3412j6220
7996G4920l277k544p057n191j0182J2574N203j0374J3677l80l06K275Q704J4968
7982I3010q7k4186o608k369R59J4225Q590j6375n011K0274j296m819p71j0579
7968F4957O159n796j1817k645M2882J7370p187r447q40q040J471q858j0005L402
7954G1606o572j7795J537j7694R094J5962M948J8338r137Q574n751j765j872R701
7940G9174r522r154J7203l814j8996m865j793j622k2399m78j474K8080L8452J5938
7926A04730N104n687K375q049j7575q531k1313Q837N2k5546m004J0528P175p223
7912D0873j0729j0086J706J7170K5443j1725j694l242k9528M578r672K0670L5202
$$ plain form
7899 68966 69516 80766 80286 53694 50626 53707 57108 56878 47070 16000 4513 30279 37498 31246
7885 31246 38619 33981 46304 56753 41889 30716 56483 44159 32017 36303 36005 41944 22461
7872 22461 20971 14788 17856 29644 43380 43176 39557 25141 13502 25665 49635 46529 52918
7859 52918 69940 62642 50945 58407 64430 57199 66977 70386 44513 43905 43279 30800 23850 20342
7845 20342 1421 10088 17315 13679 1909 -7270 10901 9822 1666 26423 44778 38796 20475
7832 20475 21443 32055 44794 42779 38191 45558 27922 26440 36110 12929 22317 26740 16619 18712
7818 18712 40839 50140 43097 37254 42572 57325 41050 17625 12296 -382 4775 14364 40017
7805 40017 42632 39539 38670 36413 22407 -6091 -139 22786 47234 71917 62243 54043 61476 56453
$$ packed form
7899F8966N50J1250m80k6592l068L081L401k30r808l1070j1487K5766P219o252
7885C1246P373m638J2323J0449j4864j1173K5767j2324j2142M286k98N939j9483
7872B2461j490o183L068J1788J3736k04l619j4416j1639J2163K3970l106O389
7859E2918J7022p298j1697P462O023p231R778L409k5873o08o26j2479o950l508
7845B0342j8921Q667P227l636j1770r179J8171j079q156K4757J8355n982j8321
7832B0475R68J0612J2739k015m588P367j7636j482R670k3181R388M423j0121K093
7818A8712K2127R301p043n843N318J4753j6275k3425n329j2678N157R589K5653
7805D0017K615l093q69k257j4006k8498N952K2925K4448K4683r674q200P433n023
$$ plain form
7791 56453 35622 -3086 -24389 -26727 -22834 4168 29735 39499 50927 35149 24745 23842 31160
7778 31160 36350 22698 33966 42758 32058 14268 27547 31070 43367 39216 18846 -10582 -35590
7765 -35590 -18521 -2384 6793 30 24908 30156 15758 13728 3601 15912 43400 40480 20378
7752 20378 19445 27780 12864 10915 27767 41616 38887 24739 21033 32220 26830 11088 223
7739 223 -12846 9733 20963 -8443 -13087 -326 -11591 -23635 -1596 16625 7276 1931 11100
7726 11100 2932 -10510 -16248 -13114 14415 20236 38552 24687 15467 12816 3072 -12991 2608
7713 2608 20120 19110 3369 -4250 -9426 -6533 9827 34662 30927 31368 26313 34526 36313 35689
7699 35689 50230 37034 38233 42245 13794 -11377 6634 1835 -20873 -9775 23467 40050
$$ packed form
7791E6453k0831l8708k1303k338L893K7002K5567R764J1428j5778j0404r03P318
7778C1160N190j3652J1268Q792j0700j7790J3279L523J2297m151k0370k9428k5008
7765c5590J7069J6137R177o763K4878N248j4398k030j0127J2311K7488k920k0102
7752B0378r33Q335j4916j949J6852J3849k729j4148l706J1187n390j5742j0865
7739B23j3069K2579J1230k9406m644J2761j1265j2044K2039J8221r349n345R169
7726A1100q168j3442n738L134K7529N821J8316j3865r220k651r744j6063J5599
7713B608J7512j010j5741p619n176K893J6360K4835l735M41n055Q213J787o24
7699C5689J4541j3196J199M012k8451k5171J8011m799k2708J1098L3242J6583
$$ plain form
7687 40050 38022 30983 44402 47500 48125 57567 40661 20918 17060 7769 7219 25218 31633 25050
7673 25050 34945 22330 23323 20059 21220 32511 7330 -18275 -17937 -2986 -12326 -13450 -5146 -1361
7659 -1361 -11016 -10933 -6596 -12213 -10316 -9872 8268 15208 14959 15352 24737 16763 22706 38695 46136 41138
7643 41138 14991 4422 -8818 -10354 6041 -8098 -41 16870 -11277 -27859 -31974 -24874 -13259
7630 -13259 20376 49388 43211 6699 -10901 10126 9759 -5668 -5139 -3555 10638 15257 4860
7617 4860 2409 6493 10868 22856 24268 -5008 -20092 -7413 -13258 -8473 -21449 -21110 -30520 -41778
7603 -41778 -20023 -1370 5356 -10562 4075 24385 30101 43198 31041 25828 28069 20296 4673
7590 4673 -4567 -7666 9085 9742 -3551 4741 -2365 -2863 10534 -6516 -16117 2228 9349 7597
$$ packed form
7687D0050k028p039J3419L098O25R442j6906j9743l858r291n50J7999O415o583
7673B5050R895j2615R93l264J161J1291k5181k5605L38J4951r340j124Q304L785
7659a361r655Q3M337n617J897M44J8140O940k49L93R385p974N943J5989P441m998
7643D1138k6147j0569j3240j536J6395j4139Q057J6911k8147j6582m115P100J1615
7630a3259L3635K9012o177l6512j7600K1027l67j5427N29J584J4193M619j0397
7617D860k451M084M375J1988J412k9276j5084J2679n845M785j2976L39r410j1258
7603d1778K1755J8653O726j5918J4637K0310N716J3097j2157n213K241p773j5623
7590D673r240l099J6751O57j3293Q292p106m98J3397j7050r601J8345P121j752
$$ plain form
7576 7597 -23644 -28115 3401 30472 25422 8756 13189 20277 33137 39630 35900 8996 -5089
7563 -5089 -5211 13739 11550 3894 -11229 3883 16480 19867 25024 10165 21644 40968 36706
7550 36706 23942 25244 46499 40867 1408 -18709 -23764 -13233 12486 13758 15956 35643 13655
7537 13655 16102 19853 21312 7325 -1578 -1095 14381 4215 -13213 -13344 -8891 8063 27814 49276
7523 49276 56189 22100 532 -9201 -4940 11867 11500 -6165 -10425 -8192 9670 29010 24529
7510 24529 11799 19567 16428 21253 14829 12735 2948 6225 6256 -1025 6080 -6673 -21257 -25919
7496 -25919 -7717 7759 36984 61291 47297 15342 5876 7350 12016 12882 2034 16577 18476
7483 18476 11834 -792 -17675 -22466 -16589 -10255 -5055 -16987 1876 27296 23894 3596 -24355
$$ packed form
7576G597l1241m471L1516K7071n050j6666M433P088J2860O493l730k6904j4085
7563e089j22J8950k189p656j5123J5112J2597L387N157j4859J1479J9324m262
7550C6706j2764J302K1255n632l9459k0117n055J0531K5719J272K198J9687k1988
7537A3655K447L751J459j3987q903M83J5476j0166j7428j31M453J6954J9751K1462
7523D9276O913l4089k1568r733M261J6807l67j7665m260K233J7862J9340m481
7510B4529j2730P768l139M825o424k094r787L277L1p281P105j2753j4584m662
7496b5919J8202J5476K9225K4307j3994l1955r466J474M666Q66j0848J4543J899
7483A8476o642j2626j6883m791N877O334N200j1932J8863K5420l402k0298k7951
$$ plain form
7470 -24355 -30359 -19660 4426 8042 2927 -2674 -7278 -24138 -16560 -8250 -16143 -21022 -23114 12473
7456 12473 20013 19468 21128 11154 -8440 -21192 -10555 -5795 -14963 -7254 -1508 6197 14423 -722
7442 -722 -6775 -3487 11668 32055 31341 30779 24548 13297 8460 550 34774 36797 -1203 -8987
7428 -8987 -7822 4303 20946 17541 12239 -1374 1257 26283 22117 27828 17737 25259 32695 48109
7414 48109 26970 14483 7768 -7846 8062 10033 20150 9130 -3761 4413 19129 19992 7806
7401 7806 7777 849 1251 22710 38748 31290 8763 -3610 -2729 8985 17233 9842 -7617 -13386
7387 -13386 5838 3910 -21519 -7938 -7965 -5815 -8104 -9852 -10206 -4047 -10795 -2348 -4278 6544
7373 6544 9788 -8981 -21550 -15321 -3277 21320 33541 15841 -15889 -20800 -4957 18729 22375
$$ packed form
7470b4355o004J0699K4086L616n115n601m604j6860P578Q310p893m879k092L5587
7456A2473P540n45J660r974j9594j2752J0637M760r168P709N746P705Q226j5145
7442g22o053L288J5155K0387p14n62o231j1251m837p910L4224K023l8000p784
7428h987J165J2125J6643l405n302j3613K631K5026m166N711j0091P522P436J5414
7414D8109k1139j2487o715j5614J5908J971J0117j1020j2891Q174J4716Q63j2186
7401G806k9o928M02K1459J6038p458k2527j2373Q81J1714Q248p391j7459n769
7387a3386J9224j928k5429J3581k7K150k289j748l54O159o748Q447j930J0822
7373F544L244j8769j2569O229J2044K4597J2221j7700l1730m911J5843K3686L646
$$ plain form
7360 22375 7832 -6258 -6998 938 -8349 7121 8330 -16400 -8253 -19423 -32366 -33622 -22909
7347 -22909 8900 12846 11008 18190 41295 41504 27344 22447 14451 -5860 -16441 -18150 -19688 -14127
7333 -14127 5090 15628 19836 42197 46585 39104 31525 5048 2977 11934 30971 40741 35006
7320 35006 18504 195 -12877 -25548 -38159 -44174 -38395 -42083 -56136 -69092 -63688 -28548 -30706
7307 -30706 -38002 -35772 -24238 -3333 7586 -100 9037 17508 33336 25547 2693 -10198 -16862
7294 -16862 2800 -10647 -31342 -8849 -1185 -3271 -12005 -9826 6726 23468 14968 14276 12693
7281 12693 14826 23974 25271 -1540 -337 16008 -3015 -16647 -3173 9397 4112 -9005 -23489
7268 -23489 -17459 -9570 -318 10947 3543 -13733 -9057 -10071 -11863 -33032 -36117 -21259 -31794
$$ packed form
7360B2375j4543j4090p40P936r287J5470J209k4730Q147j1170j2943j256J0713
7347b2909L1809L946j838P182K3105K09j4160m897p996k0311j0581j709j538N561
7333a4127J9217J0538M208K2361M388p481p579k6477k071Q957J9037R770n735
7320C5006j6502j8309j3072j2671j2611o015N779l688j4053j2956N404L5140k158
7307c0706p296K230J1534K0905J0919p686R137Q471J5828p789k2854j2891o664
7294a6862J9662j3447k0695K2493P664k086q734K179J6552J6742q500o92j583
7281A2693K133R148J297k6811J203J6345j9023j3632J3474J2570n285j3117j4484
7268b3489O030P889R252J1265p404j7276M676j014j792k1169l085J4858j0535
$$ plain form
7255 -31794 -23943 -6298 -19009 -8191 -14327 -25726 2000 11803 -6456 -18492 -34154 -40810 -16642
7242 -16642 3531 484 -11035 -26725 -20159 -8146 4502 12495 8328 2075 7943 9305 17257
7229 17257 -3444 -13619 12117 19825 20549 444 -11428 -14973 7440 28474 8479 1336 7960
7216 7960 17827 19726 29180 34434 30719 22448 23460 10707 2791 22388 32497 23406 10742 11275
7202 11275 15077 9927 -12880 -8851 -1637 -849 -2139 7267 4633 3307 17536 14591 10050 8716
7188 8716 -1643 -4386 12695 18909 4683 -7800 -15929 -33749 -17498 5576 7659 6805 7309 2180
7174 2180 5240 2020 -945 -5190 -13754 -11159 -18270 -39120 -44498 -35263 -11003 9605 26842 14500
7160 14500 -2409 8135 8161 -5672 6329 24300 11103 9125 22007 28382 25716 18582 17857 13755
$$ packed form
7255c1794P851J7645j2711J0818o136j1399K7726R803j8259j2036j5662o656K4168
7242a6642K0173l047j1519j5690O566J2013J2648P993m167o253N868J362P952
7229A7257k0701j0175K5736P708P24k0105j1872l545K2413K1034j9995p143O624
7216G960R867J899R454N254l715q271J012j2753p916J9597J0109r091j2664N33
7202A1275L802n150k2807M029P214P88j290R406k634j326J4229k945m541j334
7188H716j0359k743J7081O214j4226j2483q129j7820J6251K3074K083q54N04n129
7174B180L060l220k965m245q564K595p111k0850n378R235K4260K0608J7237j2342
7160A4500j6909J0544K6j3833J2001J7971j3197j978J2882O375k666p134p25m102
$$ plain form
7146 13755 8258 9763 27476 25652 14649 14238 32914 58084 60193 39484 36008 17662 10779
7133 10779 10210 33571 52903 32640 2093 -535 7979 2593 -3351 -7755 -11271 -3558 1420 18946
7119 18946 3931 -8890 -40331 -35573 -38412 -42308 -46180 -16042 -1474 -22576 -45480 -56725 -32812
7106 -32812 4171 -3601 -4994 -23586 -22557 -11724 -4495 3697 -1738 -7345 11646 13984 -5595
7093 -5595 -13206 -6460 -11694 -9870 -24751 -20212 -16682 -3826 29199 25422 1496 -17937 -9419 -2195
7079 -2195 4752 -6262 -20119 -4134 -21339 -9856 5173 9726 11350 22033 17151 2779 -6281
7066 -6281 6337 11303 -1063 5652 10721 19277 35765 23071 -1188 -2161 -6148 -9397 -387 7034
7052 7034 12645 10541 17845 -2203 -21799 -22143 -11271 7039 8157 14660 17249 7191 4465 -7754
$$ packed form
7146A3755n497J505J7713j824j1003m11J8676K5170K109k0709l476j8346o883
7133A0779n69K3361J9332k0263l0547k628Q514n386n944m404l516P713M978J7526
7119A8946j5015j2821l1441M758k839l896l872L0138J4568k1102k2904j1245K3913
7106c2812L6983p772j393j8592J029J0833P229Q192n435n607J8991K338j9579
7093e595p611O746n234J824j4881M539L530J2856L3025l777k3926j9433Q518P224
7079b195O947j1014j3857J5985j7205J1483J5029M553J624J0683m882j4372r060
7066f281J2618M966j2366O715N069Q556J6488j2694k4259r73l987l249R010P421
7052G034N611k104P304k0048j9596l44J0872J8310J118O503K589j0058k726j2219
$$ plain form
7038 -7754 -15508 10627 37664 25706 14538 10856 -9294 -6578 14638 23244 28242 36242 13902
7025 13902 10338 41533 40770 29980 27884 22762 2929 -26730 -29203 -17831 -12396 -6688 -9572 1494
7011 1494 17566 29744 20112 7251 -6577 -18514 -11995 -7623 -5183 -4124 3023 5936 -5736
6998 -5736 -25628 -24680 -25358 -31866 -8425 -5944 -9492 -14950 -20867 -11502 -2103 25469 49566 35449
6984 35449 7305 1876 -31828 -23586 -4212 14468 25789 9488 8383 -11944 -15010 -5652 -15021
6971 -15021 -15363 -4864 -1843 -13239 -5852 -201 1285 -4225 -7049 3493 19708 20510 -9094 -38689
6957 -38689 -38524 -16125 3844 6223 6972 9892 8533 12611 5162 -4202 -2138 13306 21582 11519
6943 11519 1929 -3687 -12178 -15868 -18601 -9758 -14410 -18397 2722 1567 -3649 -6531 -25999 -34387
$$ packed form
7038g754p754K6135K7037j1958j1168l682k0150K716K1216Q606M998Q000k2340
7025A3902l564L1195p63j0790k096n122j9833k9659k473J1372N435N708k884J1066
7011A494J6072J2178r632j2861j3828j1937O519M372K440J059P147K913j1672
6998e736j9892R48o78o508K3441K481l548n458n917R365R399K7572K4097j4117
6984C5449k8144n429l3704Q242J9374J8680J1321j6301j105k0327l066R358r369
6971a5021l42J0499L021j1396P387N651J486n510k824J0542J6215Q02k9604k9595
6957c8689J65K2399J9969K379P49K920j359M078p449r364K064J5444Q276j0063
6943A1519r590n616q491l690k733Q843m652l987K1119j155n216k882j9468q388
$$ plain form
6929 -34387 -21515 13480 21815 26057 7117 -2242 -458 18809 34938 29881 35369 21495 3525
6916 3525 36 -2480 4150 4351 8808 -163 -6578 -11629 -7696 -9923 -13689 6514 12254 19146 871
6901 871 -17386 -43629 -50843 -24034 -8564 -4255 -22910 -31312 -8876 16049 33515 30539 39927
6888 39927 45765 32505 16347 5658 -12501 -6022 5315 -4000 -22237 -17401 -3847 -16895 -7005
6875 -7005 963 11724 15190 22627 26658 33492 21087 16239 22893 27601 44436 43746 26352 -8554
6861 -8554 -8979 6323 6627 -3359 -21769 -28286 -15422 20771 42058 38620 21038 32658 20452
6848 20452 4502 -5634 -11364 -864 12512 15562 -3517 1193 -951 -19701 -13379 8152 6978
6835 6978 9289 -1482 23371 54350 57039 45968 37215 18339 17644 22886 24094 21435 24953 30122
$$ packed form
6929c4387J2872L4995Q335M242j8940r359J784J9267J6129n057N488j3874j7970
6916C525l489k516O630K01M457q971o415n051L933k227l766K0203N740O892j8275
6901H71j8257k6243p214K6809J5470M309j8655q402K2436K4925J7466k976R388
6888C9927N838j3260j6158j0689j8159O479J1337r315j8237M836J3554j3048R890
6875g005P968J0761L466P437M031O834j2405m848O654M708J6835o90j7394l4906
6861h554m25J5302L04r986j8410o517J2864L6193K1287l438j7582J1620j2206
6848B0452j5950j0136n730J0500J3376L050j9079M710k144j8750O322K1531j174
6835F978K311j0771K4853L0979K689j1071q753j8876o95N242J208k659L518N169
$$ plain form
6821 30122 24671 26049 17028 22692 -2153 -5984 -25098 -37953 -18552 -13079 -10374 7249 11418
6808 11418 36499 47789 40756 23578 7132 3253 11909 14634 -19220 -25885 -24295 -14455 -4693
6795 -4693 -466 13894 21610 -368 -16521 -24647 -13747 -8971 -12371 -14633 -16841 -30821 -38108 -22610
6781 -22610 6004 27980 34899 27348 24257 15501 3593 -2076 -3166 7804 24596 21724 23021
6768 23021 25409 15553 10531 19467 51423 56807 61701 35047 38517 17322 18682 20408 12219 44196
6754 44196 50309 66016 71172 60285 49342 44077 45108 42134 58331 70022 71514 61830 65508
6741 65508 69178 63352 66163 82460 126433 130132 159449 227572 292916 387928 545287 769640
6729 769640 1099286 1534323 2006527 2375731 2477200 2101542 1496069 1064373 793114 630946
$$ packed form
6821C0122n451J378r021N664k4845l831j9114j2855J9401N473K705J7623M169
6808A1418K5081J1290p033j7178j6446l879Q656K725l3854o665J590R840R762
6795d693M227J4360P716k1978j6153q126J0900M776l400k262k208j3980p287J5498
6781b2610K8614K1976O919p551l091q756j1908n669j090J0970J6792k872J297
6768B3021K388r856n022Q936L1956N384M894k6654L470k1195J360J726q189L1977
6754D4196O113J5707N156j0887j0943n265J031k974J6197J1691J492r684L678
6741F5508L670n826K811J6297M3973L699K9317O8123O5344R5012J57359K24353
6729G69640L29646M35037M72204L69204J01469l75658o05473m31696k71259j62168
$$ plain form
6719 630946 528248 442132 382242 350816 338062 335745 295708 268739 257546 267102 244137 230017
6707 230017 220872 205718 177711 192426 218338 215672 193478 156827 155967 154479 141122 114852 97272
6694 97272 91248 87206 93844 96997 102476 115782 116539 107451 93337 83392 64997 48247 28437 29419
6680 29419 46438 61887 73068 58358 43379 60500 62288 34954 19208 47015 50511 41730
6668 41730 40022 57092 37047 25147 21005 21455 19288 28261 34343 49988 57791 40679 24715
6655 24715 36609 46648 54263 54247 56907 61149 50661 26714 7120 1543 -10222 3590 17485
6642 17485 13666 20632 31780 35579 6490 -14984 -26007 -19417 3808 4815 -18210 -36959 -34565
6629 -34565 -29365 -22143 13817 22190 31386 12312 21877 32576 43313 53232 32025 7999 2500
$$ packed form
6719F30946j02698q6116n9890l1426j2754k317m0037k6969j1193R556k2965j4120
6707B30017r145j5154k8007J4715K5912k666k2194l6651q60j488j3357k6270j7580
6694I7272o024m042O638L153N479J3306P57r088j4114r945j8395j6750j9810R82
6680B9419J7019J5449J1181j4710j4979J7121J788k7334j5746K7807L496q781
6668D1730j708J7070k0045j1900m142M50k167Q973O082J5645P803j7112j5964
6655B4715J1894J0039P615j6K660M242j0488k3947j9594n577j1765J3812J3895
6642A7485l819O966J1148L799k9089k1474j1023O590K3225J007k3025j8749K394
6629c4565N200P222L5960Q373R196j9074R565J0699J0737R919k1207k4026n499
$$ plain form
6616 2500 10497 9054 11612 2081 -3180 259 12262 21340 -3380 -28574 -42140 -29609 -32096 -9611
6602 -9611 2070 21427 30260 43695 37837 42354 35577 20582 14244 30056 38671 19108 23927
6589 23927 42554 35786 22271 10098 -14511 -14081 -1663 -22897 -39558 -40727 -21048 -3284 -8546
6576 -8546 12026 6281 -26459 -24173 -12645 2970 -2773 8139 -3548 -34105 -33872 -26121 -20630
6563 -20630 -19372 1902 -11234 -19012 -9924 -6204 -2731 -443 -12184 -20489 -11430 5967 10647 2654
6549 2654 20232 22673 24902 22365 31505 22044 17778 -1586 -14704 -34410 -40676 -32614 -38929 -28479
6535 -28479 -20164 -17280 -1287 6570 -9463 -6437 -9156 -11148 -10268 -5027 2960 12605 11129 5783
6521 5783 8483 30555 31904 34202 21591 14726 2216 -5215 -11929 -19942 -8695 9045 23782
$$ packed form
6616B500P997j443K558r531n261L439J2003R078k4720k5194j3566J2531k487K2485
6602i611J1681J9357Q833J3435n858M517o777j4995o338J5812Q615j9563M819
6589B3927J8627o768j3515j2173k4609M30J2418k1234j6661j169J9679J7764n262
6576h546K0572n745l2740K286J1528J5615n743J0912j1687l0557K33P751N491
6563b0630J258K1274j3136p778R088L720L473K288j1741q305R059J7397M680p993
6549B654J7578K441K229k537R140r461m266j9364j3118j9706o266Q062o315J0450
6535b8479Q315K884J5993P857j6033L026k719j992Q80N241P987R645j476n346
6521E783K700K2072J349K298j2611o865j2510p431o714q013J1247J7740J4737
$$ plain form
6508 23782 21731 14287 -5574 -13072 -4322 11285 18592 18714 15878 18916 10963 18611 12515 13819
6494 13819 -2354 -22228 -30227 -16544 8666 13627 -911 -17585 -6702 -3324 8568 5404 2175
6481 2175 -1851 -10765 -4057 7322 15906 29784 22786 14480 2055 -1882 12748 -3184 -1981 8498
6467 8498 23774 10291 1569 -792 -3722 -10875 1278 -2681 -5259 -20296 -19364 -24707 -36971 -32344
6453 -32344 -38610 -37507 -11345 2656 -1505 -2592 -8115 -18376 -10004 -6957 -9834 -11936 -10224 17990
6439 17990 35961 42926 11058 -37298 -27042 -2152 13473 8901 7330 7600 22580 33605 38742
6426 38742 26605 -6905 -16813 -9876 684 20887 29568 29466 12395 -4591 -1792 15448 8738
6413 8738 4240 25180 34753 35627 33367 39303 47607 39118 32953 42856 36826 19470 5269 11282
$$ packed form
6508B3782k051p444j9861p498Q750J5607P307J22k836L038p953P648o096J304
6494A3819j6173j9874p999J3683K5210M961j4538j6674J0883L378J1892l164l229
6481B175m026q914O708J1379Q584J3878o998q306j2425l937J4630j5932J203J0479
6467H498J5276j3483q722k361k930p153J2153l959k578j5037R32n343j2264M627
6453c2344o266J103K6162J4001m161j087n523j0261Q372L047k877k102J712K8214
6439A7990J7971O965l1868m8356J0256K4890J5625m572j571K70J4980J1025N137
6426C8742j2137l3510r908O937J0560K0203Q681j02j7071j6986K799J7240o710
6413H738m498K0940R573Q74k260N936Q304q489o165R903o030j7356j4201O013
$$ plain form
6399 11282 -186 -16823 -28187 -16661 -191 -2961 -32909 -31016 -11746 -2620 -12044 -31335 -19501
6386 -19501 -24824 -34441 -36336 -5719 4788 12643 -3845 -13503 -35225 -38052 -12210 6153 4927
6373 4927 -39382 -70197 -35639 -25179 -16869 -25361 -40744 -20161 -4355 -14209 -29314 -48628 -53718
6360 -53718 -39284 -14448 -10818 -13118 -16228 -25999 -32857 -37397 -31196 -20560 -10597 177 -13324
6347 -13324 -28757 -13748 8256 7834 -1401 6305 -12587 -15695 -23531 -15652 -26244 -37274 -37834 -29688
6333 -29688 -13213 -3384 908 6647 12776 -5289 -1906 970 8059 -5484 -11680 -25193 -37383
6320 -37383 -23827 -9653 -2215 -3846 -16660 -21119 -3256 -12684 -6423 9711 -3516 -13038 -12257
6307 -12257 -19808 -16662 -12072 -13762 -23874 -34894 -36643 -39095 -46565 -41427 -22472 -6762 5332
$$ packed form
6399A1282j1468j6637j1364J1526J6470k770k9948J893J9270R126r424j9291J1834
6386a9501n323r617j895L0617J0507P855j6488r658k1722k827K5842J8363j226
6373D927m4309l0815L4558J0460Q310q492j5383K0583J5806r854j5105j9314n090
6360e3718J4434K4836L630k300l110r771o858m540O201J0636R963J0774j3501
6347a3324j5433J5009K2004m22r235P706j8892l108p836P879j0592j1030n60Q146
6333b9688J6475R829M292N739O129j8065L383K876P089j3543o196j3513j2190
6320c7383J3556J4174P438j631j2814m459J7863r428O261J6134j3227r522P81
6307a2257p551L146M590j690j0112j1020j749k452p470N138J8955J5710J2094
$$ plain form
6294 5332 5582 11502 3764 11339 18154 23491 20939 13382 24463 14281 -8594 -13338 10866 27378
6280 27378 25355 23934 24880 30079 32329 27483 19971 21601 21453 16390 -23155 -34127 -25764 -7047
6266 -7047 9063 -3271 -27525 -16920 770 13336 3188 -29600 -33600 -26437 5424 29681
6254 29681 -2154 1936 480 -12894 -19439 -4639 -4902 627 14501 11961 -2400 -12308 -19400 -20946
6240 -20946 -24941 -31678 -33873 -44046 -34467 -2263 7252 -5160 -17019 -21163 -30239 -18083 -12876
6227 -12876 -2652 24685 31804 -10700 -35544 -33860 -30585 -40454 -40134 -26219 15601 34842 11683
6214 11683 -8119 -26823 -32013 -14549 2609 14257 -7141 -36535 -26775 -16103 8008 29549
6202 29549 21431 28112 16515 -2471 2188 -1226 5602 10551 31030 28290 25054 4545 -17081
$$ packed form
6294E332K50N920p738P575O815N337k552p557J1081j0182k2875m744K4204J6512
6280B7378k023j421R46N199K250m846p512J630j48n063l9545j0972Q363J8717
6266g047J6110j2334k4254J0605J7690J2566j0148l2788m000P163L1861K4257
6254B9681l1835M090j456j3374o545J4800k63N529J3874k540j4361r908p092j546
6240b0946l995o737k195j0173R579L2204R515j2412j1859m144r076J2156N207
6227a2876J0224K7337P119m2504k4844J684L275r869L20J3915M1820J9241k3159
6214A1683j9802j8704n190J7464J7158J1648k1398k9394R760J0672K4111K1541
6202B9549q118O681j1597j8986M659l414O828M949K0479k740l236k0509k1626
$$ plain form
6189 -17081 -45247 -48790 -24601 7813 16427 -6745 -21954 -16256 -1961 5157 10333 2901 1753
6176 1753 4021 19310 32698 966 -8115 12743 45716 43082 15344 -23595 -9790 -4564 -10205
6163 -10205 -605 -9122 -3188 13865 25967 -3500 10208 12234 -15520 -26753 -24216 -12756 -12399
6150 -12399 -28079 -28440 -16630 -4764 -11365 -13343 328 -6541 3828 30442 20171 20127 13051 807
6136 807 -18637 -11864 -30846 -52362 -46650 -62414 -61770 -63429 -46465 -31727 -27097 -33164 -55235 -57134
6122 -57134 -36076 -9527 1744 10428 19464 16540 12709 33180 31549 23107 17310 14255 15967 27379
6108 27379 9513 -20144 -9690 12743 12447 14055 13019 7200 -21241 -21353 12481 14234 21020 2712
6094 2712 5828 25531 20376 324 4203 9109 -2793 -8621 13462 22826 21853 2299 11616 -11270
$$ packed form
6189a7081k8166l543K4189L2414Q614k3172j5209N698J4295P118N176p432j148
6176A753K268J5289J3388l1732r081K0858L2973k634k7738l8939J3805N226n641
6163a0205R600q517N934J7053J2102k9467J3708K026k7754j1233K537J1460L57
6150a2399j5680l61J1810J1866o601j978J3671o869J0369K6614j0271m4p076j2244
6136H07j9444O773j8982k1516N712j5764O44j659J6964J4738M630o067k2071j899
6122e7134K1058K6549J1271Q684R036k924l831K0471j631q442n797l055J712J1412
6108B7379j7866k9657J0454K2433k96J608j036n819k8441j12L3834J753O786j8308
6094B712L116J9703n155k0052L879M906j1902n828K2083R364r73j9554R317k2886
$$ plain form
6080 -11270 -23281 847 5597 -34129 -21647 -5726 10348 10380 -5315 -9239 -2326 -4516 6055
6067 6055 17929 14206 11193 12766 23494 -4276 -7079 -16064 -17493 -3224 -5787 -9801 -6408 -4632
6053 -4632 -6634 2541 22887 37891 45001 49052 27557 8614 15113 22969 11932 -3667 -7859
6040 -7859 -4986 -863 7200 9118 -8488 -16707 1685 -3314 3772 -10470 -21736 -991 4790 12742
6026 12742 29811 20570 22008 14752 3118 -2750 6927 13129 7971 -11744 982 -4048 -13036 -13925
6012 -13925 -9238 24868 47895 29145 17319 28871 13420 -11293 -4370 -2425 12461 12306 -4284
5999 -4284 -36402 -37805 -17867 4400 -8374 -37078 -36333 -16853 20325 24288 12139 4885 -3353
5986 -3353 -774 7320 -8741 -228 10096 14394 17778 -9211 -12982 -30784 -38730 -47425 -37559 -32380
$$ packed form
6080a1270j2011K4128M750l9726J2482J5921J6074L2j5695l924O913k190J0571
6067F055J1874l723l013J573J0728k7770k803q985j429J4269k563m014L393J776
6053d632k002R175K0346J5004P110M051k1495j8943O499P856j1037j5599m192
6040g859K873M123Q063J918j7606q219J8392m999P086j4242j1266K0745N781P952
6026A2742J7069r241J438p256j1634n868R677O202n158j9715J2726n030q988q89
6012a3925M687L4106K3027j8750j1826J1552j5451k4713O923J945J4886j55j6590
5999d284l2118j403J9938K2267j2774k8704P45J9480L7178L963j2149p254q238
5986c353K579Q094j6061Q513J0324M298L384k6989l771j7802p946q695R866N179
$$ plain form
5972 -32380 -43268 -49191 -48977 -39721 -18339 -12530 -24655 -8769 16416 42184 50705 39573 14961
5959 14961 6571 7428 25872 41556 33525 16618 23619 21327 23476 18749 -2260 230 6917 18777
5945 18777 17304 9526 6327 753 -11091 -23823 -18262 -15486 19857 38382 19410 8397 11692
5932 11692 -8463 -8797 -4541 -15709 -24101 -29158 -16737 -17670 -28448 -3531 24148 13735 18119
5919 18119 21988 16035 16394 9165 -5669 -24649 -20116 2531 17952 10654 -23191 -52248 -62843
5906 -62843 -61581 -44666 -41152 -31597 -13605 -11154 -21251 -41136 -36340 -44547 -34779 -29894 -41460
5893 -41460 -39725 -14567 -2514 -8185 7407 16898 20028 27483 26045 4405 -5975 -11247 -27466
5880 -27466 -22759 -13449 -8611 -3997 7049 30116 25158 10845 -7551 -21772 -24165 -27892 -9988
$$ packed form
5972c2380j0888n923K14R256K1382N809j2125J5886K5185K5768Q521j1132k4612
5959A4961q390Q57J8444J5684q031j6907P001k292K149m727k1009K490O687J1860
5945A8777j473p778l199n574j1844j2732N561K776L5343J8525j8972j1013L295
5932A1692k0155l34M256j1168q392n057J2421r33j0778K4917K7679j0413M384
5919A8119L869n953L59p229j4834j8980M533K2647J5421p298l3845k9057j0595
5906f2843J262J6915L514R555J7992K451j0097j9885M796q207R768M885j1566
5893d1460J735K5158J2053n671J5592R491L130P455j438k1640j0380n272j6219
5880b7466M707R310M838M614J1046K3067m958j4313j8396j4221k393l727J7904
$$ plain form
5867 -9988 4861 11107 22484 3739 -38591 -43422 -41214 -23075 -22181 -27971 -26775 -789 16915
5854 16915 24786 26746 53547 53089 43484 47888 31207 19743 6190 -11590 -2481 6839 8990 -661
5840 -661 -8781 22000 2336 -16496 -7524 -10441 -9361 8506 7132 -1203 -12913 -21906 -12549 -2822
5826 -2822 20600 13861 -739 3307 -15447 -25166 -6126 6035 5083 6963 -1376 5837 -20 11467
5812 11467 9879 5002 -1852 -11846 -4730 6249 -7412 -7365 18681 24285 16024 8467 2115 459
5798 459 -1502 -9642 -270 4512 7576 4550 -2680 2827 9897 12819 6089 16016 22462 16657 -16761
5783 -16761 -18310 -4042 2374 3775 8457 9722 -8620 -12607 -17570 -7638 22009 27803 18267 4043
5769 4043 18512 12103 7909 -6853 -12418 -13117 -5551 13053 12817 7282 7717 -3272 -13878 -10493
$$ packed form
5867i988J4849O246J1377j8745m2330m831K208J8139Q94n790J196K5986J7704
5854A6915P871J960K6801m58r605M404j6681j1464j3553j7780R109R320K151r651
5840f61q120L0781j9664j8832Q972k917J080J7867j374q335j1710q993R357R727
5826b822K3422o739j4600M046j8754r719J9040J2161r52J880q339P213n857J1487
5812A1467j588m877o854r994P116J0979j3661M7K6046N604q261p557o352j656
5798D59j961q140R372M782L064l026p230N507P070K922o730R927O446n805l3418
5783a6761j549J4268O416J401M682J265j8342l987m963R932K9647N794r536j4224
5769D043J4469o409m194j4762n565o99P566J8604k36n535M35j0989j0606L385
$$ plain form
5755 -10493 -1519 5591 7016 991 6272 1831 679 3725 -659 -5400 -11543 5368 2811 5682
5741 5682 13787 3215 -13220 -23806 3826 -6964 -1724 4310 -8501 -20297 2661 26156 -2304
5728 -2304 -18651 -15410 -15751 -22074 2643 36817 23134 -2840 -8401 8619 17208 1667 10210
5715 10210 24993 29108 26569 13097 20782 587 -14462 -6696 -329 12427 23258 19254 23506
5702 23506 15071 4196 5742 3465 -14171 -10000 -5211 -24 9647 36428 33813 30164 18936 13349
5688 13349 8521 18270 10424 12013 18334 35167 30942 37067 41070 18667 15898 13002 17129 28800
5674 28800 11977 6455 3916 1555 -16837 -22734 -11099 -22582 -21079 -9367 3603 21033 27230
5661 27230 21905 14851 -4690 -22921 -46345 -35441 -40493 -52013 -40772 -14160 -14976 -32662 -33803
$$ packed form
5755a0493Q974P110J425o025N281m441j152L046m384m741o143J6911k557K871
5741E682Q105j0572j6435j0586K7632j0790N240O034j2811j1796K2958K3495k8460
5728b304j6347L241l41o323K4717L4174j3683k5974n561J7020Q589j5541Q543
5715A0210J4783M115k539j3472P685k0195j5049P766O367J2756J0831m004M252
5702B3506q435j0875J546k277j7636M171M789N187R671K6781k615l649j1228n587
5688A3349m828R749p846J589O321J6833m225O125M003k2403k769k896M127J1671
5674B8800j6823n522k539k361j8392n897J1635j1483J503J1712J2970J7430O197
5661B7230n325p054j9541j8231k3424J0904n052j1520J1241K6612q16j7686j141
$$ plain form
5648 -33803 -23811 -5659 -11343 -40320 -27592 -29663 -31426 -15403 -13194 -24179 -38996 -37142 -24660
5635 -24660 -22244 -13257 -7397 -18375 -23819 3517 3336 4218 14372 12940 8407 18920 16082 7696
5621 7696 -1965 12499 15029 18349 28207 30002 29644 35697 15666 -3792 -19660 -23156 -8053 19134
5607 19134 15117 -8753 6674 530 -4785 -10610 -8415 -4529 -26023 -13158 -1692 -18648 -27299
5594 -27299 -14919 -18437 -13244 5194 16253 -4553 -23335 -3521 -10349 -29829 -24165 -11830 -9348
5581 -9348 -12244 -23469 -30910 -39516 -53392 -44701 -35841 -9678 -12835 5989 16884 2394 -15691
5568 -15691 -4264 -4083 -35157 -48354 -32746 -20711 13420 23506 31895 25315 19282 7099 9801
5555 9801 5408 -23528 -33456 -2902 -526 17520 19094 11882 21283 18988 7764 380 19915 36399
$$ packed form
5648c3803R992J8152n684k8977J2728k071j763J6023K209j0985j4817J854J2482
5635b4660K416Q987N860j0978n444K7336j81Q82J0154j432m533J0513k838q386
5621G696r661J4464K530L320R858J795l58O053k0031j9458j5868l496J5103K7187
5607A9134m017k3870J5427o144n315n825K195L886k1494J2865J1466j6956q651
5594b7299J2380l518N193J8438J1059k0806j8782J9814o828j9480N664J2335K482
5581i348k896j1225p441q606j3876Q691Q860K6163l157J8824J0895j4490j8085
5568a5691J1427J81l1074j3197J5608J2035L4131J0086Q389o580o033j2183K702
5555I801m393k8936r928L0554K376J8046J574p212R401k295j1224p384J9535J6484
$$ plain form
5541 36399 22594 15325 19964 23016 28405 21695 25444 18526 12700 -2361 -1477 -4461 10113 6014
5527 6014 13024 4067 -19464 -30299 -22619 -17041 9491 12579 41980 46940 13777 -5053 2410
5514 2410 18015 21700 13471 -6976 -25315 -11112 -16183 -11248 -10643 -13365 -13655 -14433 -10245 -3312 13583
5499 13583 10843 591 -18620 -13730 -8270 -24475 -13969 -7840 -12146 -11310 -4237 -11552 -9355 10149
5485 10149 7847 6447 4176 12430 -3171 -15199 -11248 8879 12744 -2963 -10816 1674 14342
5472 14342 1128 6376 18336 16785 14923 5978 -1187 -964 -2138 -16586 -18948 -6930 11008 6857
5458 6857 -14455 -6158 8608 4323 11130 13660 14155 -138 -14395 -31834 -45940 -36273 -9083
5445 -9083 4966 -22174 -42962 -33644 -23201 -3880 7468 13663 23435 35021 40887 34046 10382
$$ packed form
5541C6399j3805p269M639L052N389o710L749o918n826j5061Q84k984J4574m099
5527F014P010q957k3531j0835P680N578K6532L088K9401M960l3163j8830P463
5514B410J5605L685q229k0447j8339J4203n071M935O05k722k90p78M188O933J6895
5499A3583k740j0252j9211M890N460j6205J0506O129m306Q36P073p315K197J9504
5485A0149k302j400k271Q254j5601j2028L951K0127L865j5707p853J2490J2668
5472A4342j3214N248J1960j551j862q945p165K23j174j4448k362J2018J7938m151
5458F857k1312Q297J4766m285O807K530M95j4293j4257j7439j4106R667K7190
5445i083J4049k7140k0788R318J0443J9321J1348O195R772J1586N866o841k3664
$$ plain form
5432 10382 5957 23250 36826 29014 35743 47670 59987 72488 66145 55214 59714 49780 34985
5419 34985 20526 7499 5068 5223 142 -1810 -10620 -10621 -5726 -5438 -22951 -16025 -19542 -10554 -10645 -19527
5403 -19527 -17915 -6147 -5139 -14754 -23594 -1135 37022 33175 20901 6623 4943 32186 31617
5390 31617 9872 -12576 -27089 -19097 17487 30420 4468 -14296 -3764 -4834 -9335 -1616 -7793
5377 -7793 -24362 -17058 -12934 -14996 -25169 -9235 5118 -9869 -33285 -24190 540 20510 17270
5364 17270 2283 8080 14088 12190 -203 12567 21507 6494 -2233 2986 4774 516 -1414 7130
5350 7130 2862 -11822 -5355 -17183 -25141 -14414 2017 6267 -4618 8560 21313 22002 29755
5337 29755 27788 18018 22709 34681 34000 10275 -6666 -4525 7050 886 -20082 -31923 -14529
$$ packed form
5432A0382m425J7293J3576p812O729J1927J2317J2501o343j0931M500r934j4795
5419C4985j4459j3027k431J55n081j952q810jM895K88j7513O926l517Q988r1q882
5403a9527J612J1768J008r615q840K2459L8157l847j2274j4278j680K7243n69
5390C1617k1745k2448j4513P992L6584J2933k5952j8764J0532j070m501P719o177
5377g793j6569P304M124k062j0173J5934J4353j4987k3416R095K4730J9970l240
5364A7270j4987N797O008j898j2393J2770Q940j5013q727N219J788m258j930Q544
5350G130m268j4684O467j1828p958J0727J6431M250j0885J3178J2753O89P753
5337B9755j967r770M691J1972o81k3725j6941K141J1575o164k0968j1841J7394
$$ plain form
5324 -14529 -330 -15707 17719 22781 16102 17668 6638 8149 -735 -11578 -21102 -9627 -7316
5311 -7316 -8300 -9345 -29994 -44389 -22686 -5404 5896 -1910 -4293 -11609 -26474 -7380 7570
5298 7570 14703 12692 449 518 17597 30814 34333 30579 25746 24455 18344 9360 3803 33313
5284 33313 29446 28269 3657 8048 19667 -1809 -7680 3381 6087 -18302 -29471 -15240 -14265
5271 -14265 -26484 -31732 -23900 -18235 -23218 -18618 -10443 -204 9899 1821 -10989 -7978 -12756 -23179
5257 -23179 -21420 -9651 4891 9742 10726 27304 27738 20979 14808 4569 -6560 -8626 6417 20660
5243 20660 -2692 -11232 -342 15736 30310 54043 51376 39211 27699 30811 14772 4623
5231 4623 15471 46400 44543 10389 -3133 -16183 -309 3968 19598 21687 25924 11885 -5350
$$ packed form
5324a4529J4199j5377L3426N062o679J566j1030J511q884j0843r524J1475K311
5311g316r84j045k0649j4395K1703J7282J1300p806k383p316j4865J9094J4950
5298G570P133k011j2243O9J7079J3217L519l754m833j291o111q984n557K9510
5284C3313l867j177k4612M391J1619k1476n871J1061K706k4389j1169J4231R75
5271a4265j2219n248P832N665m983M600Q175J0239J0103q078j2810L011m778j0423
5257b3179J759J1769J4542M851R84J6578M34o759o171j0239j1129k066J5043J4243
5243B0660k3352q540J0890J6078J4574K3733k667j2165j1512L112j6039j0149
5231D623J0848L0929j857l4154j3522j3050J5874M277J5630K089M237j4039j7235
$$ plain form
5218 -5350 -1027 6976 18572 18596 14429 5103 -6508 -26843 -32799 -30061 -29979 -8235 11938 21048 1991
5203 1991 -5253 -19288 -11889 -304 -2532 -8745 -6344 -20550 -14017 14058 29556 23125 -11853
5190 -11853 -20387 -14046 1109 17540 12258 -8011 -21333 -17701 -5124 1677 7133 12151 9945
5177 9945 -9230 -6441 13824 19321 3386 -3453 -22536 -5155 14001 18520 -22776 -37520 -22294
5164 -22294 -15774 -3263 7970 4823 11633 3590 2502 17291 5462 -19169 -30762 -11900 9821
5151 9821 15585 12979 9845 -13312 2894 7621 8870 -8385 -27971 -11805 11572 -7546 -18636
5138 -18636 692 -10757 -10505 -9782 -2161 -11532 -17431 -27479 -15440 -733 -7675 -27773 -36814 -10507
5124 -10507 898 -6959 -7105 15505 34586 30010 13721 14332 11682 5558 -12923 -28982 -19703 -21310
$$ packed form
5218e350M323Q003J1596K4m167r326j1611k0335n956K738Q2K1744K0173R110j9057
5203A991p244j4035P399J1585k228o213K401j4206O533K8075J5498o431l4978
5190a1853q534O341J5155J6431n282k0269j3322L632J2577O801N456N018k206
5177I945j9175K789K0265N497j5935o839j9083J7381J9156M519m1296j4744J5226
5164b2294O520J2511J1233l147O810q043j088J4789j1829k4631j1593J8862K1721
5151I821N764k606l134k3157J6206M727J249j7255j9586J6166K3377j9118j1090
5138a8636J9328j1449K52P23P621r371n899j0048J2039J4707o942k0098r041K6307
5124a0507J1405p857j46K2610J9081m576j6289O11k650o124j8481j6059R279j607
$$ plain form
5110 -21310 -9259 -14109 -19896 -4272 -2736 -8681 975 9167 10654 -5924 4363 5837 -4476
5097 -4476 -4582 24266 54252 51082 29623 7336 8444 12386 19734 21399 46312 51354 28626 13600
5083 13600 15554 20348 21101 17940 14599 32391 27292 3281 -23404 -29 37151 45272 19915
5070 19915 -2462 -2667 -4542 549 -7798 -12440 -5239 -5277 6943 194 -12991 -21870 -9288 -1985
5056 -1985 -26266 -38989 -25939 -10330 -3469 171 3574 -21577 -43092 -39772 -38243 -12672 -6867
5043 -6867 -19803 -832 -303 -13161 -12619 1784 -1738 -1106 5899 63 -2594 -774 7677 -159 -23537
5028 -23537 -20333 -5933 -24246 -36886 -48159 -30433 -6852 -5383 3847 19654 27427 32545 30018
5015 30018 19737 16878 12835 24501 31623 37458 34072 26391 14887 -17943 -29830 -21281 -12300
$$ packed form
5110b1310J2051m850n787J5624J536n945R656Q192J487j6578J0287J474j0313
5097d476j06K8848K9986l170k1459k2287J108L942P348J665K4913N042k2728j5026
5083A3600J954M794P53l161l341J7792n099k4011k6685K3375L7180Q121k5357
5070A9915k2377k05j875N091q347m642P201l8J2220o749j3185q879J2582P303
5056a985k4281j2723J3050J5609O861L640L403k5151k1515L320J529K5571N805
5043f867j2936J8971N29j2858N42J4403l522O32P005n836k657J820Q451p836k3378
5028b3537L204J4400j8313j2640j1273J7726K3581J469R230J5807P773N118k527
5015C0018j0281k859m043J1666P122N835l386p681j1504l2830j1887Q549Q981
$$ plain form
5002 -12300 7657 12918 925 1339 -9042 -10720 -12211 -7777 -12305 -10972 -22973 -14930 14008 6143
4988 6143 -4068 9547 12591 12575 16405 -10655 9459 11456 -22681 -30614 -6675 -3939 -15247 -3538
4974 -3538 2769 -7925 -21351 -28812 -15950 -3315 11425 9263 -3167 -19680 -26419 -34480 -20032
4961 -20032 -12251 2218 -5779 -22103 -17518 -22803 -30532 -35554 -30387 -21751 -5797 -3491 7827 9472
4947 9472 4434 -13960 -11968 3018 15986 -662 -21849 -16270 -9061 -3326 -1822 -1655 4234 2634
4933 2634 20793 18117 1221 6009 -9869 -21912 -13610 3597 8303 27071 19296 -3663 -10718
4920 -10718 1447 -3756 4582 20924 47689 48622 40393 38285 41895 43271 39900 34879 48042 44217
4906 44217 42119 17418 16399 -349 -1616 25293 32308 22536 15151 -8040 -28728 -14676 -21259
$$ packed form
5002a2300J9957N261j1993M14j0381j678j491M434m528J333j2001Q043K8938p865
4988F143j0211J3615L044j6L830k7060K0114J997l4137p933K3939K736j1308J1709
4974c538O307j0694j3426p461J2862J2635J4740k162j2430j6513o739q061J4448
4961b0032P781J4469p997j6324M585n285p729n022N167Q636J5954K306J1318J645
4947I472n038j8394J992J4986J2968j6648k1187N579P209N735J504J67N889j600
4933B634J8159k676j6896M788j5878j2043Q302J7207M706J8768p775k2959p055
4920a0718J2165n203Q338J6342K6765R33q229k108L610J376l371n021J3163l825
4906D4217k098k4701j019j6748j267K6909P015r772p385k3191k0688J4052o583
$$ plain form
4893 -21259 -13519 -14864 -223 13479 16971 22235 -4979 -24463 -7939 16202 -2968 -46333 -24937
4880 -24937 -19239 -9817 -6701 -4020 5711 120 -14023 -8157 13286 24686 18998 19104 24643 21924
4866 21924 18947 8195 13134 3485 -8159 21009 46133 43748 43119 33841 10235 8311 9379 11145
4852 11145 -10852 -39093 -37506 -29342 -13151 11413 13687 5598 12012 1587 -10902 -22427 -7896
4839 -7896 3638 13149 5812 5172 -769 -24716 -23163 1829 7703 -15 -1495 -8902 -23658 -33875
4825 -33875 -21807 -7682 -16222 -9439 -4481 -2870 7276 4010 10424 9087 -10382 4960 12399
4812 12399 8119 12686 15741 18074 5096 -32399 -40997 -18764 3315 25017 58839 75293 62371
4799 62371 36763 4961 -7484 566 13881 15546 10974 17422 38939 29869 30371 46370 42024
$$ packed form
4893b1259P740j345J4641J3702L492N264k7214j9484J6524K4141j9170m3365K1396
4880b4937N698R422L116K681R731n591j4143N866K1443J1400n688J06N539k719
4866B1924k977j0752M939r649j1644K9168K5124k385o29r278k3606j924J068J766
4852A1145k1997k8241J587Q164J6191K4564K274q089O414j0425j2489j1525J4531
4839g896J1534R511p337o40n941k3947J553K4992N874p718j480p407j4756j0217
4825c3875J2068J4125q540O783M958J611J0146l266O414j337j9469J5342P439
4812A2399m280M567L055K333j2978l7495q598K2233K2079K1702L3822J6454j2922
4799F2371k5608l1802j2445Q050J3315J665m572O448K1517r070N02J5999m346
$$ plain form
4786 42024 12621 -9973 -32544 -33840 -15750 -13275 6550 5101 16482 25774 26118 22534 23253 18760
4772 18760 4147 -8414 -16951 -21790 -8020 -6200 -3921 8087 9116 -9854 -21296 -8503 -14532
4759 -14532 -15911 -14499 -13328 12740 -3494 -27873 -29014 -18763 -16247 -7607 11489 28735 34557
4746 34557 45198 39820 41073 24874 8695 9746 9382 9813 -6077 9373 -16588 -26119 -10278
4733 -10278 -8396 -10979 -13178 -23229 -1582 24365 29501 32731 42578 25435 24636 9447 -12166
4720 -12166 -25625 -48455 -42129 -32356 -5052 5901 -9757 -13354 16846 36951 25896 1987
4708 1987 -15562 -14233 -16624 -3115 6157 10481 -19680 -42988 -47317 -45998 -18890 -26376 -30637 -35400
4694 -35400 -32774 -42684 -39677 -39651 -44525 -26836 -18517 3108 -14828 -12947 11867 9825 11649 20410
$$ packed form
4786D2024k9403k2594k2571j296J8090K475J9825j449J1381R292L44l584P19m493
4772A8760j4613j2561q537m839J3770J820K279J2008J029j8970j1442J2793o029
4759a4532j379J412J171K6068j6234k4379j141J0251K516Q640J9096J7246N822
4746C4557J0641n378J253j6199j6179J051l64M31j5890J5450k5961r531J5841
4733a0278J882k583k199j0051K1647K5947N136L230R847j7143p99j5189k1613
4720a2166j3459k2830O326R773K7304J0953j5658l597L0200K0105j1055k3909
4708A987j7549J329k391J3509R272M324l0161k3308m329J319K7108p486m261m763
4694c5400K626r910L007K6m874J7689Q319K1625j7936J881K4814k042J824Q761
$$ plain form
4680 20410 -1475 -26693 -11075 5335 2562 4609 -10508 -18081 -32634 -45407 -55393 -43114 -27971
4667 -27971 -17662 -4012 -3379 -4680 -2306 1330 -91 17501 17032 11950 15820 15230 4508 -2875
4653 -2875 -949 -955 -708 -1080 7349 5631 -10212 -15644 5357 14946 2718 8692 11388 2582 -14711
4638 -14711 -20409 -5111 -14977 -26989 -27798 -37339 -26901 -6565 -861 -13389 -9359 -5093 1674 5318
4624 5318 -1067 -5009 3433 6823 -757 2224 9914 16904 24777 19574 11091 27686 31630 21802 17384
4609 17384 5824 -6102 -11574 -5965 -5250 -26597 -30153 -30143 -24616 18190 33315 15328 13685 2678
4595 2678 -512 -8627 -23359 -39712 -19549 -10047 -16902 -3604 3987 -4835 -2527 1727 10794 3527
4581 3527 -9029 5914 9190 12454 2710 -22222 -28393 -28021 -41931 -32407 -14068 -15196 -11835 -12445
$$ packed form
4680B0410k1885k5218J5618J6410k773K047j5117p573j4553j2773r986J2279J5143
4667b7971J0309J3650O33j301K374L636j421J7592m69n082L870n90j0722p383
4653b875J926oK47l72Q429j718j5843n432K1001R589j2228N974K696q806j7293
4638a4711n698J5298r866j2012q09r541J0438K0336N704j2528M030M266O767L644
4624E318o385l942Q442L390p580K981P690O990P873n203q483J6595L944r828m418
4609A7384j1560j1926n472N609P15k1347l556J0N527M2806J5125j7987j643j1007
4595B678l190q115j4732j6353K0163R502o855J3298P591q822K308M254R067p267
4581C527j2556J4943L276L264r744k4932o171L72j3910R524J8339j128L361o10
$$ plain form
4567 -12445 -11504 -10800 -14186 -19916 -16236 -17752 -25501 -23201 -20430 -30442 -9154 3149 -5114 -24536
4553 -24536 -25659 -20034 -30533 -32051 -31362 -4466 15391 -1216 4996 -13110 -29629 -38200 -20892
4540 -20892 -11217 6095 18912 3685 -17641 -29173 -32595 -31101 -7310 8331 13432 9826 -2684
4527 -2684 -16032 -26232 -23238 -15350 -21450 -24261 -5781 -17478 -19776 1416 -10694 -20882 -17609
4514 -17609 -6694 -5678 -8148 -13087 -24465 -4386 11355 8653 16848 737 -22995 -24808 -35637
4501 -35637 -31355 -18714 -2489 2510 -4798 -20949 -20017 -23701 -9965 -26458 -45752 -46723 -37262 -30997
4487 -30997 -29916 -24390 -9716 -3628 -14203 -30740 -42890 -28927 -14780 1556 9256 12258 5724
4474 5724 -9730 -936 5490 18884 -777 -16011 -42836 -56170 -40570 -26625 -20229 -329 12843
$$ packed form
4567a2445R41P04l386n730L680j516p749K300K771j0012K1288J2303q263j9422
4553b4536j123N625j0499j518O89K6896J9857j6607O212j8106j6519q571J7308
4540b0892R675J7312J2817j5227k1326j1532l422J494K3791J5641N101l606j2510
4527b684j3348j0200K994P888o100k811J8480j1697k298K1192j2110j0188L273
4514a7609J0915J016k470m939j1378K0079J5741k702Q195j6111k3732j813j0829
4501c5637M282J2641J6225M999p308j6151R32l684J3736j6493j9294r71R461O265
4487c0997J081N526J4674O088j0575j6537j2150J3963J4147J6336P700L002o534
4474E724j5454Q794O426J3394j9661j5234k6825j3334J5600J3945O396J9900J3172
$$ plain form
4461 12843 12236 3487 15587 37632 30326 19581 -5292 -14327 -6661 -21171 -42893 -30589 -16432
4448 -16432 -3394 6189 10042 15965 2299 8754 8390 13950 28707 13233 19614 32273 27707 18614
4434 18614 26981 18776 -13173 -8034 797 34760 30500 6080 2586 29032 48511 45769 32627
4421 32627 26515 30503 27231 29864 31723 19437 38246 20122 15360 10546 -11135 -25987 -17019
4408 -17019 -7451 -2050 -7312 3059 27848 7889 -2825 2423 -17790 -19877 -10956 -18359 -12997
4395 -12997 -12616 -9419 -19035 -33046 -19697 -15657 -14042 -12757 -21902 -26833 -21368 -18410 -24796 1019
4381 1019 -3766 -11508 -10154 -19961 -13606 3199 8894 -24962 -40989 -41534 -35300 -24190 -21783 -23334
4367 -23334 -10455 -3606 -8317 -8140 -9668 -11420 -17491 -14907 -3134 -652 -13383 -25775 -20858 6978
$$ packed form
4461A2843o07q749J2100K2045p306j0745k4873r035P666j4510k1722J2304J4157
4448a6432J3038R583L853N923j3666O455l64N560J4757j5474O381J2659m566r093
4434A8614Q367q205l1949N139Q831L3963m260k4420l494K6446J9479k742j3142
4421C2627o112L988l272K633J859j2286J8809j8124m762m814k1681j4852Q968
4408a7019R568N401n262J0371K4789j9959j0714N248k0213k087Q921p403N362
4395a2997L81L197r616j4011J3349M040J615J285r145m931N465K958o386K5815
4381A019m785p742J354r807O355J6805N695l3856j6027n45O234J1110K407j551
4367b3334J2879O849m711J77j528j752o071K584J1773K482j2731j2392M917K7836
$$ plain form
4353 6978 10419 -1910 -16230 -41197 -37529 -20119 -1858 20724 27303 23527 21248 22679 41064
4340 41064 34031 26552 22857 -665 10208 18597 21260 29021 11941 -10796 -45268 -46966 -17118
4327 -17118 2642 -12694 -4521 12825 33357 22771 -5378 -9539 -15067 -6492 1558 4889 5417
4314 5417 11998 -6160 -18117 -20750 -28075 -11433 -26515 -41836 -37580 -10397 -2726 -19296 -37767
4301 -37767 -44743 -38912 -19536 -24388 -35942 -36929 -8594 17743 5683 -386 -6430 5519 -5898
4288 -5898 -9974 367 13198 5502 4840 4156 9202 -3581 -9796 -8300 -27585 -39232 -22968 -16678
4274 -16678 -8820 -14757 -22481 -20428 -20586 -7305 -15482 -19914 -22366 -30776 -24108 -14766 -34149 -39780
4260 -39780 -8045 -11087 -9486 3074 12806 8001 -14547 -29493 -26176 -15248 2636 16170 7119
$$ packed form
4353F978L441j2329j4320k4967L668J7410J8261K2582O579l776k279J431J8385
4340D1064p033p479l695k3522J0873Q389K663P761j7080k2737l4472j698K9848
4327a7118J9760j5336Q173J7346K0532j0586k8149m161n528Q575Q050L331N28
4314E417O581j8158j1957k633p325J6642j5082j5321M256K7183P671j6570j8471
4301c7767o976N831J9376m852j1554r87K8335K6337j2060o069o044J1949j1417
4288e898m076J0341J2831p696o62o84N046j2783o215J496j9285j1647J6264O290
4274a6678P858n937p724K053j58J3281q177m432k452q410O668R342j9383n631
4260c9780L1735l042J601J2560R732m805k2548j4946L317J0928J7884J3534r051
$$ plain form
4247 7119 -23010 -27827 -11086 1272 5455 22934 11986 -14763 -17569 -11794 -33784 -42407 -24044
4234 -24044 -21925 -47914 -53043 -60168 -36318 -14488 -7157 -1752 -13724 -15729 -7602 8425 6521
4221 6521 -13222 -21054 -28099 -18968 -9107 -11750 -24974 -20169 -7777 13374 19010 2321 -17184
4208 -17184 -15995 -13339 -13786 -15561 -8453 342 -6772 -14156 -26744 -29501 -14343 -27774 -27797 -35162 -21472
4193 -21472 -4769 -8808 -19305 -12404 -2559 -5760 11942 7132 11560 -9133 184 9810 6536 8965
4179 8965 24332 39762 41083 40101 4868 -18933 -3964 7201 -3288 7518 -1298 -12731 -10508
4166 -10508 -29281 -26109 -7889 -3451 -5969 -8818 -1593 3715 -11829 -27155 -31982 -32195 -45649 -45959
4152 -45959 -31409 -32787 -29954 -14649 -919 5249 16336 19279 14243 2672 3826 31575 23706
$$ packed form
4247G119l0129m817J6741J2358M183J7479j0948k6749k806N775k1990q623J8363
4234b4044K119k5989n129p125K3850K1830P331N405j1972k005Q127J6027j904
4221F521j9743p832p045R131R861k643j3224M805J2392K1151N636j6689j9505
4208a7184J189K656m47j775P108Q795p114p384j2588k757J5158j3431k3p365J3690
4193b1472J6703m039j0497O901R845l201J7702m810M428k0693R317R626l274K429
4179H965J5367J5430J321r82l5233k3801J4969J1165j0489J0806q816j1433K223
4166a0508j8773L172J8220M438k518k849P225N308j5544j5326m827k13j3454l10
4152d5959J4550j378K833J5305J3730O168J1087K943n036j1571J154K7749p869
$$ plain form
4139 23706 6456 13726 10240 -13666 -18067 -11152 -18899 -2761 14006 19294 6056 -10285 -42384
4126 -42384 -32805 -16188 -21658 -17623 -1658 -5076 -12897 -12436 -7608 -15266 -42977 -41380 -22147 -8765
4112 -8765 -8634 -7680 1773 14841 13279 -5327 -14961 -3475 2258 -2879 905 8247 22744 4933
4098 4933 -7131 -353 -11365 -4865 -1565 12603 -3963 -6290 -2057 1319 8023 -5452 -25981
4085 -25981 -22255 -18957 -25356 -13505 -17788 -29651 -25927 -15586 -14128 -19019 -6869 -8851 -23927
4072 -23927 -15189 -2412 6879 -14921 -21616 -14925 -14212 -29659 -25485 -23029 -8971 -1620 7283 2149
4058 2149 -15222 -19652 480 4434 15960 33386 15115 -10975 10640 6596 -6944 -10241 -27435
4045 -27435 -22861 -13800 -1667 9821 20272 13934 -10017 -10382 -13650 -12650 -5652 -25967 -22233 -14000
$$ packed form
4139B3706j7250P270l486k3906m401O915p747J6138J6767N288j3238j6341l2099
4126d2384R579J6617n470M035J5965l418p821M61M828p658k7711J597J9233J3382
4112h765J31R54R453J3068j562j8606r634J1486N733n137L784P342J4497j7811
4098D933j2064O778j1012O500L300J4168j6566k327M233L376O704j3475k0529
4085b5981L726L298o399J1851m283j1863L724J0341J458m891J2150j982j5076
4072b3927Q738J2777R291k1800o695O691P13j5447M174K456J4058P351Q903n134
4058B149j7371m430K0132L954J1526J7426j8271k6090K1615m044j3540l297j7194
4045b7435M574R061J2133J1488J0451o338k3951l65l268J000O998k0315L734Q233
$$ plain form
4031 -14000 -19952 -32479 -22152 -18654 -16735 -10754 -10455 -33190 -30046 -17343 606 -4283 -8002 17954
4017 17954 50128 26847 6535 -6225 -4896 2259 -10596 -18721 -17283 -19958 10581 14181 -3751
4004 -3751 -4706 -3080 -19074 -8797 -9621 1027 15870 17271 17551 7154 11789 17512 20149 -422
3990 -422 775 14189 39586 47184 24869 23113 -604 -33177 -37157 -18465 28221 46452 31796
3977 31796 14410 8535 12249 26528 31650 24006 27259 7017 -8087 7886 20768 13792 17311
3964 17311 24119 4782 -10173 -9069 -10876 -19547 -12748 -10537 -4829 5476 18318 27063 24074 5306
3950 5306 11944 13414 4858 7875 16012 9608 -6722 -18498 -15863 -9477 12909 26801 6876 -7275
3936 -7275 -11790 -13810 -4802 15954 -4845 1601 8719 12849 23865 41771 46631 26293 -1530
$$ packed form
4031a4000n952j2527J0327L498J919N981K99k2735L144J2703J7949m889l719K5956
4017A7954L2174k3281k0312j2760J329P155j2855q125J438k675L0539L600j7932
4004c751r55J626j5994J0277q24J0648J4843J401K80j0397M635N723K637k0571
3990d22J197J3414K5397P598k2315j756k3717l2573l980J8692M6686J8231j4656
3977C1796j7386n875L714J4279N122p644L253k0242j5104J5973J2882o976L519
3964A7311O808j9337j4955J104j807q671O799K211N708J0305J2842Q745k989j8768
3950E306O638J470q556L017Q137o404j6330j1776K635O386K2386J3892j9925j4151
3936g275m515k020R008K0756k0799O446P118M130J1016J7906M860k0338k7823
$$ plain form
3923 -1530 -2767 100 -1736 5285 3559 9607 16040 14232 29184 5175 -3625 -1792 9121 11158
3909 11158 15536 -1298 -13381 -10762 2780 17035 5608 6836 -5623 -4973 -14066 -24484 -19242
3896 -19242 -4755 8773 588 2891 9660 10479 -268 -4047 -11573 -16044 -476 8287 872 -15477
3882 -15477 8436 18050 -2787 -35288 -36878 -14586 -1569 12544 12150 -3032 -13280 -26028 -32315
3869 -32315 -35323 -7018 5247 -691 -11737 -27099 -17396 -2055 7002 -9722 10421 20484 609
3856 609 9333 36105 38656 38615 33675 2164 -41730 -35741 -17961 4997 13362 26179 31721 2394
3842 2394 -18503 -21252 -16360 -7437 432 -6460 -18736 -19531 -25096 -26064 -39595 -30839 -21660 11687
3828 11687 27032 3000 -1771 7850 5219 3628 -3717 -2231 -16020 -31801 -38939 -32894 -19359
$$ packed form
3923a530j237K867j836P021j726O048O433j808J4952k4009q800J833J0913K037
3909A1158M378j6834j2083K619J3542J4255j1427J228j2459O50r093j0418N242
3896a9242J4487J3528q185K303O769Q19j0747l779p526m471J5568Q763p415j6349
3882a5477K3913R614k0837l2501j590K2292J3017J4113l94j5182j0248j2748o287
3869c2315l008K8305J2265n938j1046j5362R703J5341R057j6724K0143J0063j9875
3856F09Q724K6772K551m1m940l1511m3894N989J7780K2958Q365J2817N542k9327
3842B394k0897k749M892Q923P869o892j2276p95n565r68j3531Q756R179L3347
3828A1687J5345k4032m771R621k631j591p345J486j3789j5781p138O045J3535
$$ plain form
3815 -19359 -29762 -45091 -32080 6056 7985 11506 13503 633 -3263 -2138 4718 -4418 -1777
3802 -1777 41448 22181 -207 3689 17728 7688 -224 11503 -1709 -27255 -11347 -3830 6131
3789 6131 9664 5372 10306 -8400 -19492 -35404 -24245 -18715 -14497 -28404 -29184 -13433 -3668 5233
3775 5233 -2682 -3443 16131 -10273 -37213 -47763 -9541 24390 15112 -2524 -476 -15439 -11031
3762 -11031 12534 -8172 -18404 -27610 -31387 -32699 -7131 -2195 -2760 -14195 -10750 -10648 -35880 -46928
3748 -46928 -23552 -16823 -25973 -26398 -17443 -3221 -14841 -17242 -8386 -22280 -14344 9323 14887 5642
3734 5642 17909 21890 14237 -14999 -40906 -26946 -3631 -10545 -15384 6871 8529 5325 -5028
3721 -5028 -30001 -30386 -17947 -5273 -11644 16010 30955 10324 15339 9364 16437 21405 12158 -2414
$$ packed form
3815a9359j0403j5329J3011L8136J929L521J997j2870l896J125O856r136K641
3802a777M3225j9267k2388L896J4039j0040p912J1727j3212k5546J5908P517R961
3789F131L533m292M934j8706j1092j5912J1159N530M218j3907p80J5751R765Q901
3775E233p915p61J9574k6404k6940j0550L8222L3931r278j7636K048j4963M408
3762a1031K3565k0706j0232r206l777j312K5568M936n65j1435L445J02k5232j1048
3748d6928K3376O729r150m25Q955J4222j1620k401Q856j3894P936K3667N564r245
3734E642J2267L981p653k9236k5907J3960K3315o914m839K2255J658l204j0353
3721e028k4973l85J2439J2674o371K7654J4945k0631N015n975P073M968r247j4572
$$ plain form
3707 -2414 -4262 -6783 -5093 1775 -17023 -14001 -302 -4593 -6111 -21007 -5666 12040 1740
3694 1740 3384 -11615 -29063 -27174 -9629 5563 418 -19308 -37684 -53725 -43689 -33129 -23939
3681 -23939 -11282 -3095 -20353 5984 28082 23840 15047 1902 -12428 -4951 -1955 6355 -4307
3668 -4307 -16271 -18454 -10526 -1063 578 -5543 -4215 -10955 -16417 -5087 -2985 -15081 -7038 -3452
3654 -3452 14954 23395 8569 -4407 -17197 -24357 4736 14744 13220 3115 -23906 -9018 4674
3641 4674 15998 14696 -6246 -19729 -13594 -8396 -9207 -14763 -5444 12084 23035 14853 8533 20524
3627 20524 24922 19638 17562 16253 19971 6958 -4153 11148 9916 -6695 -13123 -10917 13834
3614 13834 15299 -7754 -2848 13003 -1394 -22297 4442 14896 6912 -824 -9681 -23973 -5519
$$ packed form
3707b414j848k521J690O868j8798L022J3699m291j518j4896J5341J7706j0300
3694A740J644j4999j7448J889J7545J5192n145j9726j8376j6041J0036J0560R190
3681b3939J2657Q187j7258K6337K2098m242q793j3145j4330P477K996Q310j0662
3668d307j1964k183P928R463J641o121J328o740n462J1330K102j2096Q043L586
3654c452J8406Q441j4826j2976j2790p160K9093J0008j524j0105k7021J4888J3692
3641D674J1324j302k0942j3483O135N198q11n556R319J7528J0951q182o320J1991
3627B0524M398n284k076j309L718j3013j1111J5301j232j6611o428K206K4751
3614A3834J465k3053M906J5851j4397k0903K6739J0454p984p736q857j4292J8454
$$ plain form
3601 -5519 11985 -855 -25902 -18326 17265 35938 33217 47643 47619 48851 43685 6723 2087 3228
3587 3228 -28565 -23140 -12938 -21006 -15707 -2539 10096 16803 -6140 -21944 -25331 -31662 -48257
3574 -48257 -47896 -50731 -2877 7569 4514 -4827 -10638 -4221 2005 -16191 -13652 -13503 1504 18139
3560 18139 25072 33546 48310 35185 25409 18379 -2233 3562 20421 14778 4850 17364 29466
3547 29466 31546 26612 23422 17690 11618 7514 -922 4857 76 7757 -6679 -13488 -10010 -18004
3533 -18004 -42338 -70408 -59717 -42777 -35915 -13251 -4570 -6936 11466 17940 7292 -5012 -9539
3520 -9539 9072 22913 10697 7051 -5888 -1338 12340 15873 2882 -3410 5079 -6356 -4699
3507 -4699 -15765 -19509 360 11977 -18953 -24678 1987 21138 13622 3365 -13232 -13233 -7952 12907
$$ packed form
3601e519J7504j2840k5047P576L5591J8673k721J4426k4J232n166l6962m636J141
3587C228l1793N425J0202q068N299J3168J2635O707k2943j5804l387o331j6595
3574d8257L61k835M7854J0446l055r341n811O417O226j8196K539J49J5007J6635
3560A8139O933Q474J4764j3125r776p030k0612N795J6859n643r928J2514J2102
3547B9466K080m934l190n732o072m104q436N779m781P681j4436o809L478p994
3533a8004k4334k8070J0691J6940O862K2664Q681k366J8402O474j0648j2304m527
3520i539J8611J3841j2216l646j2939M550J3678L533j2991o292Q489j1435J657
3507d699j1066l744J9869J1617l0930n725K6665J9151p516j0257j6597jN281K0859
$$ plain form
3493 12907 7609 7344 3368 13037 23974 16483 5044 -16617 -38727 -19904 -9385 12256 13170
3480 13170 7316 -196 -2061 -19103 -22708 -12714 -6586 -22409 -11848 -11006 -11333 -2008 -12792 -5212
3466 -5212 -5778 12841 18700 21644 35133 35118 25111 7349 9798 -5646 -2086 -22896 -33197 -20598
3452 -20598 15483 19483 6684 8197 20090 7833 -10167 15110 18479 6282 -15407 -16169 -12401
3439 -12401 -16861 -22923 -37136 -26577 -8208 -14520 -41551 -44636 -23648 -30626 -30287 -15655 -13013
3426 -13013 -1495 15254 15114 20445 17371 20943 7369 20623 14879 -147 2347 -4230 -1768 -4949
3412 -4949 -6957 -2229 -6631 -7083 -4805 12793 3338 6940 -9479 -12570 -6648 -13733 11381 11701 -10527
3397 -10527 -19785 -28500 -22929 -6076 7192 13895 18337 22652 25382 26162 23714 26055 36065 27276
$$ packed form
3493A2907n298k65l976R669J0937p491j1439k1661k2110J8823J0519K1641R14
3480A3170n854p512j865j7042l605R994O128j5823J0561Q42l27R325j0784P580
3466e212n66J8619N859K944J3489j5j0007j7762K449j5444L560k0810j0301J2599
3452b0598L6081M000j2799J513J1893j2257j8000K5277L369j2197k1689p62L768
3439a2401m460o062j4213J0559J8369o312k7031l085K0988o978L39J4632K642
3426a3013J1518J6749j40N331l074L572j3574J3254n744j5026K494o577K462l181
3412d949k008M728m402m52K278J7598r455L602j6419l091N922p085K5114L20k2228
3397a0527r258q715N571J6853J3268O703M442M315K730P80k448K341J0010q789
$$ plain form
3383 27276 18710 22135 15371 6519 -13240 -12999 -13452 691 21165 22844 6548 14534 23930 -2509
3369 -2509 -22421 -33515 -26430 -15761 -27291 -33699 -15238 -18357 -34864 -25316 -29731 -24387 -21085
3356 -21085 -11593 1159 15944 18102 20392 13556 21587 15618 -8106 -18024 -1504 17086 17676 9142
3342 9142 -6245 2353 -6088 -29378 -29515 -17173 17483 6929 -12586 -9074 11250 1197 -12505
3329 -12505 -794 11863 -9547 -14974 -14292 -9390 17505 13898 23708 33850 37548 41112 45667 47348
3315 47348 31336 -7301 2805 -7761 -13993 -8684 9716 41420 44341 12777 8885 7743 10344
3302 10344 -7805 -1465 14487 21545 4252 -15704 -34518 -32042 -20453 -9537 -5444 -5862 -21169
3289 -21169 -12182 -10379 14585 10000 -10540 -19114 -34777 -39524 -31583 -12303 -15392 -17493 -23678 -6245
$$ packed form
3383B7276q566L425o764q852j9759K41m53J4143K0474J679j6296P986R396k6439
3369b509j9912j1094P085J0669j1530o408J8461l119j6507R548m415N344L302
3356b1085R492J2752J4785K158K290o836Q031n969k3724r918J6520J8590N90q534
3342I142j5387Q598q441k3290j37J2342L4656j0554j9515L512K0324j0053j3702
3329a2505J1711J2657k1410n427O82M902K6895l607R810J0142L698L564M555J681
3315D7348j6012l8637J0106j0566o232N309J8400L1704K921l1564l892j142K601
3302A0344j8149O340J5952P058j7293j9956j8814K476J1589J0916M093m18j5307
3289b1169Q987J803K4964m585k0540q574j5663m747P941J9280l089k101o185J7433
$$ plain form
3275 -6245 -3246 -5584 -2074 -6571 -1947 -15754 -24118 -43074 -45534 -59925 -56035 -37665 -19697 -14489
3261 -14489 -9491 -6541 -6103 3963 7436 -4012 -4565 -5069 -5209 7004 -7138 -6559 -9017 -13561 -32150
3246 -32150 -37834 -49776 -44720 -31037 -26690 -1661 96 -11075 -33190 -51441 -59182 -37174 -21732
3233 -21732 -5771 1476 17442 13207 -369 30161 19363 -4746 8070 23336 13176 26955
3221 26955 22841 25450 31828 32792 39748 37574 11002 -250 4040 5988 10152 28945 44832 41147
3207 41147 39626 21517 4660 12714 25607 34441 35666 40297 29858 12712 11223 16341 803
3194 803 3069 -1158 3177 31344 36026 12682 1355 -3912 -11976 -15488 -12267 -12370 -14147 -6871 669
3179 669 -10671 -30141 -33541 -17476 -8327 -7878 2648 13566 17824 24350 24513 24274 24417 23400 29279
$$ packed form
3275f245K999k338L510m497M624j3807q364j8956k460j4391L890J8370J7968N208
3261a4489M998K950M38J0066L473j1448n53n04j40J2213j4142N79k458m544j8589
3246c2150n684j1942N056J3683M347K5029J757j1171k2115j8251p741K2008J5442
3233b1732J5961P247J5966m235j3576L0530j0798k4109J2816J5266j0160J3779
3221B6955m114K609O378R64O956k174k6572j1252M290J948M164J8793J5887l685
3207D1147j521j8109j6857Q054J2893Q834J225M631j0439j7146j489N118j5538
3194H03K266m227M335K8167M682k3344j1327n267q064l512L221j03j777P276P540
3179F69j1340j9470l400J6065R149M49J0526J0918M258O526J63k39J43j017N879
$$ plain form
3164 29279 41843 34987 4534 3780 13346 8601 5493 9192 13873 -1955 -18968 -17692 -20781 -15593
3150 -15593 1959 6624 15460 30598 23982 17138 23874 14033 -5252 -11680 -28639 -36962 -27294 -25105
3136 -25105 -31571 -21316 -15724 1509 5138 23463 33677 33137 17704 15979 20371 31524 35293
3123 35293 29320 41536 46600 42947 23258 18687 21384 16420 15752 27838 59494 55033 25569 5165
3109 5165 510 -13064 -27450 -21634 -27075 -41908 -39166 -39993 -54705 -50392 -20268 -5900 12277
3096 12277 18211 3106 -20143 -29841 -24896 -26386 -4275 5070 4687 9068 7689 6442 -4101 -4335
3082 -4335 18171 18887 21648 24859 24745 34032 26881 716 -29662 -29839 -21056 1725 3546 5291 3808
3067 3808 -5258 7498 5948 -2770 -11434 -14813 -34730 -37438 -24739 -9090 -19863 -14151 11942
$$ packed form
3164B9279J2564o856l0453p54R566m745l108L699M681j5828j7013J276l089N188
3150a5593J7552M665Q836J5138o616o844O736r841j9285o428j6959q323R668K189
3136b5105o466J0255N592J7233L629J8325J0214n40j5433j725M392J1153L769
3123C5293n973J2216N064l653j9689m571K697m964o68J2086L1656m461k9464k0404
3109E165m655j3574j4386N816n441j4833K742q27j4712M313L0124J4368J8177
3096A2277N934j5105k3249r698M945j490K2111R345l83M381j379j247j0543k34
3082d335K2506P16K761L211j14R287p151k6165l0378j77Q783K2781J821J745j483
3067C808r066J2756j550q718q664l379j9917k708J2699J5649j0773N712K6093
$$ plain form
3054 11942 -3532 -14886 9193 15891 8851 19806 10412 7066 12146 -1202 -11349 -12578 4338
3041 4338 4993 -15083 -25492 -1521 9656 3678 10006 21503 2939 -3729 12803 18780 20716
3028 20716 9282 10820 2603 -4964 4300 660 14001 24983 18975 13987 26262 17762 9114 -5237
3014 -5237 -14085 -14317 -16482 -7593 1452 1577 6342 20837 22523 24828 15788 1010 -875 -3394 8698
2999 8698 17564 -4446 -25922 -21284 -15011 -3056 14257 124 3136 13155 7818 -20701 -27701
2986 -27701 -12219 -20212 -4430 -2828 -19850 -15011 -7907 5100 8654 5405 -8110 -26927 -27161
2973 -27161 -9835 5092 -5869 -9442 -332 -3784 -12938 -10082 -13995 -25534 -38634 -46648 -35416
2960 -35416 -48231 -48792 -28829 -30637 -21030 -24276 -16512 3353 -763 -6334 8941 -4361 1708 -4451
$$ packed form
3054A1942j5474j1354K4079O698p040J0955r394l346N080j3348j0147j229J6916
3041D338O55k0076j0409K3971J1177n978O328J1497j8564o668J6532N977J936
3028B0716j1434J538q217p567R264l640J3341J0982o008m988J2275q500q648j4351
3014e237q848k32k165Q889R045J25M765J4495J686K305r040j4778j885k519J2092
2999H698Q866k2010k1476M638O273J1955J7313j4133L012J0019n337k8519p000
2986b7701J5482p993J5782J602j7022M839P104J3007L554l249j3515j8817k34
2973b7161J7326J4927j0961l573R110l452r154K856l913j1539j3100q014J1232
2960c5416j2815n61J9963j808R607l246P764J9865m116n571J5275j3302O069o159
$$ plain form
2946 -4451 -2858 12530 9112 8560 19589 20124 7484 12914 10481 4412 -8477 -25895 -29526 -12360
2932 -12360 3781 7637 16393 26125 5455 5914 28358 12338 10266 16368 17591 12956 17557 9896
2918 9896 -4482 13327 7017 1696 21023 12744 -8889 -4039 14231 5943 -1638 25357 39460
2905 39460 48922 54692 31853 -14008 -31378 -16173 29 7420 3098 -3871 -6040 9898 19928
2892 19928 834 -11708 -12840 -10101 -7836 -16899 6161 33868 22325 3532 -11327 -7404 -14999
2879 -14999 -27354 -4510 4067 -16696 -51453 -33297 -259 8833 13996 1033 10722 49008 39422
2866 39422 36550 16037 19514 9695 -20309 -17006 -33656 -39057 -23421 -33422 -30981 -31466 -39834 -36985
2852 -36985 -20132 -7977 9187 20351 16885 11112 -6320 -493 -5348 -10281 4850 -13274 -17911
$$ packed form
2946d451J593J5388l418n52J1029N35j2640N430k433o069j2889j7418l631J7166
2932a2360J6141L856Q756R732k0670M59K2444j6020k072O102J223m635M601p661
2918I896j4378J7809o310n321J9327q279k1633M850J8270q288p581K6995J4103
2905C9460R462N770k2839m5861j7370J5205J6202P391m322o969k169J5938J0030
2892A9928j9094j2542j132K739K265r063K3060K7707j1543j8793j4859L923p595
2879a4999j2355K2844Q577k0763l4757J8156L3038R092N163j2963R689L8286r586
2866C9422k872k0513L477r819l0004L303j6650n401J5636j0001K441m85q368K849
2852c6985J6853J2155J7164J1164l466n773j7432N827m855m933J5131j8124m637
$$ plain form
2839 -17911 -26864 -30949 2394 9890 4111 12577 20795 14747 457 -9544 -13071 -10191 -22951 -45346
2825 -45346 -41656 -24959 -19011 4322 -16050 -10025 6745 5075 5801 2112 -13604 -16605 -12561 -5784
2811 -5784 1093 7644 16782 4230 10157 22151 21756 42047 29739 -646 -13162 -14956 -16439 -7450
2797 -7450 8508 18657 9132 -9749 -3140 -13222 -17821 -25665 -30765 -32989 -12582 3107 -16416
2784 -16416 -18114 9919 19341 12765 -12099 -7945 9207 12602 6243 -5784 -10808 7957 6979 -4230
2770 -4230 6421 4365 15324 17224 21484 11493 11170 15082 25070 41353 19233 -4822 -3924 3495
2756 3495 -11383 -9389 3143 -519 2054 -2025 6620 23702 11403 -8727 -17747 -47693 -56826
2743 -56826 -48915 -22959 2768 15505 12426 -13734 -13649 389 15718 15906 -7173 -3125 31187
$$ packed form
2839a7911q953m085L3343P496n779Q466Q218o048j4290j0001l527K880j2760k2395
2825d5346L690J6697N948K3333k0372O025J6770j670P26l689j5716l001M044O777
2811e784O877O551R138j2552N927J1994l95K0291j2308l0385j2516j794j483Q989
2797g450J5958J0149r525j8881O609j0082m599p844n100k224K0407J5689j9523
2784a6416j698K8033R422o576k4864M154J7152L395o359j2027n024J8765r78j1209
2770d230J0651k056J0959J900M260r991l23L912R988J6283k2120k4055Q98P419
2756C495j4878J994J2532l662K573m079Q645J7082j2299k0130r020k9946r133
2743e6826P911K5956K5727J2737l079k6160Q5J4038J5329J88k3079M048L4312
$$ plain form
2730 31187 23058 22730 34036 21836 32161 8965 -4625 11018 6578 6361 12072 26701 34286
2717 34286 18771 3279 -25567 -42485 -19723 4248 16364 22734 42378 43551 38805 33007 60560
2704 60560 64300 46923 14438 17002 -4342 -10368 13088 37371 25609 9197 24982 27424 46189
2691 46189 45677 53861 43692 26156 8815 -219 3735 794 18536 12440 13409 11053 -794 -21103
2677 -21103 -4345 -637 -2765 -8262 -2490 5715 15006 3474 -1179 -6003 -17789 518 3110 432
2663 432 4937 938 -6138 3319 -3680 -14690 -17929 -15643 -4086 12335 10102 16789 9977 -22671
2649 -22671 -47629 -48089 -20566 4092 -5170 -17949 -13593 -17130 -10261 -9752 -1901 4832 878 8315
2635 8315 6115 -17009 -14916 -18641 -25792 -41106 -54148 -41049 -20447 -9959 6937 10335 2695
$$ packed form
2730C1187q129l28J1306j2200J0325k3196j3590J5643m440k17N711J4629P585
2717C4286j5515j5492k8846j6918K2762K3971J2116O370J9644J173m746n798K7553
2704F0560L740j7377l2485K564k1344o026K3456K4283j1762j6412J5785K442J8765
2691D6189n12Q184j0169j7536j7341r034L954k941J7742o096R69k356j1847k0309
2677b1103J6758L708k128n497N772Q205R291j1532m653m824j1786J8307K592k678
2663D32M505l999p076R457o999j1010l239K286J1557J6421k233O687o812l2648
2649b2671k4958m60K7523K4658r262j2779M356l537O869N09P851O733l954P437
2635H315k200k3124K093l725p151j5314j3042J3099K0602J0488J6896L398p640
$$ plain form
2622 2695 -25873 -33105 -19967 -17683 -20606 -18433 -7473 -12645 -2888 9858 387 -2373 -1525 -15739
2608 -15739 -8352 -5733 8539 -902 -20872 -33149 -34857 -2219 21993 25786 6710 -18906 -16001
2595 -16001 9076 15964 -13864 -8532 9856 -7983 -11446 1298 16166 16332 10177 -11740 -33964
2582 -33964 -36087 -23963 -14581 24510 33441 30053 32151 33975 32753 8895 -3541 -20809 -24737
2569 -24737 22092 30796 24035 21682 21124 13652 -6980 -17114 -5824 -2860 -436 5230 -6788 -2163
2555 -2163 10407 10214 16501 18138 10499 3429 -1489 -3184 145 -4315 194 -6502 -12748 850 1049
2540 1049 -17661 -38074 -15641 -16647 -18575 -17919 -22223 -17892 4414 17094 -1236 11239 6838
2527 6838 7836 -5932 1090 9164 -5628 15832 33186 26853 2676 -6462 -10809 -6420 19783 19167
$$ packed form
2622B695k8568p232J3138K284k923K173J0960n172R757J2746r471k760Q48j4214
2608a5739P387K619J4272r441j9970j2277j708L2638K4212L793j9076k5616K905
2595a6001K5077O888k9828N332J8388j7839l463J2744J4868J66o155k1917k2224
2582c3964k123J2124R382L9091Q931l388K098J824j222k3858j2436j7268l928
2569b4737M6829Q704o761k353n58p472k0632j0134J1290K964K424N666j2018M625
2555b163J2570j93O287J637p639p070m918j695L329m460M509o696o246J3598J99
2540A049j8710k0413K2433j006j928O56m304M331K2306J2680j8330J2475m401
2527F838R98j3768P022Q074j4792K1460J7354o333k4177r138m347M389K6203o16
$$ plain form
2513 19167 -5758 4328 15805 28938 26686 14430 13792 9025 22432 16672 15660 13849 -1375
2500 -1375 12203 17335 15025 18593 18041 -4961 -6534 -9332 -4343 -2843 18129 29176 15581 19788
2486 19788 40422 29934 26691 -3728 -25010 -1602 8702 12566 15560 16630 -2041 -17945 -14430
2473 -14430 -10760 -13286 464 15573 15508 13176 -6077 -5617 -420 -12413 -24326 -24430 -13784 -1025
2459 -1025 17766 25490 10276 -11483 -9671 -2031 7247 8937 -9414 -29265 -18405 -4490 -8739
$$ packed form
2513A9167k4925J0086J1477J3133k252j2256o38m767J3407n760j012j811j5224
2500a375J3578N132k310L568n52k3002j573k798M989J500K0972J1047j3595M207
2486A9788K0634j0488l243l0419k1282K3408J0304L864K994J070j8671j5904L515
2473a4430L670k526J3750J5109o5k332j9253M60N197j1993j1913j04J0646J2759
2459a025J8791P724j5214k1759J812P640R278J690j8351j9851J0860J3915m249
$$ [...]
##END NTUPLES=NMR SPECTRUM
##END=
