##TITLE=Analysis number 318547
Compound Code cc 46146
Book Reference 451/135
Project Code adrs
Chemist Name evam
##JCAMPDX= 6.0         $$ Bruker NMR JCAMP-DX V2.0
##DATA TYPE= NMR SPECTRUM
##DATA CLASS= NTUPLES
##ORIGIN= Bruker BioSpin GmbH
##OWNER= nmr
$$ XWIN-NMR		Version 3.5
$$ Mon Apr  3 13:38:06 2006 GMT Daylight Time (UT+1h)  MAYBRIDGE\nmr@NMR_250MHZ
##.OBSERVE FREQUENCY= 250.131544655141
##.OBSERVE NUCLEUS= ^1H
##.ACQUISITION MODE= SIMULTANEOUS (DQD)
##.ACQUISITION SCHEME= undefined
##.AVERAGES= 16
##.DIGITISER RES= 18
##SPECTROMETER/DATA SYSTEM= dpx250
##.PULSE SEQUENCE= zg30
##.SOLVENT NAME= CDCl3
##.SHIFT REFERENCE= (INTERNAL, CDCl3, 0, 16.522)
##AUDIT TRAIL= $$ (NUMBER, WHEN, WHO, WHERE, WHAT)
$$ ##TITLE= Audit trail, XWIN-NMR		Version 3.5
$$ ##JCAMPDX= 5.01
$$ ##ORIGIN= Bruker BioSpin GmbH
$$ ##OWNER= nmr
$$ C:\u/data/dgb/nmr/ADRS/2000/pdata/1/auditp.txt
$$ ##AUDIT TRAIL=  $$ (NUMBER, WHEN, WHO, WHERE, WHAT)
(   1,<2006-04-03 13:36:37.66 +100>,<MAYBRIDGE\nmr>,<NMR_250MHZ>,
      <created by zg, POWCHK disabled, PULCHK disabled
       configuration hash MD5:
       84 BC 41 DB A1 6E 1D 46 DA 25 12 A5 C1 ED C5 3A
       data hash MD5: 64K
       9D 4F 66 B3 6A F8 B2 22 68 DA D9 8D 90 4E DD 93>)
(   2,<2006-04-03 13:37:26.59 +100>,<MAYBRIDGE\nmr>,<NMR_250MHZ>,
      <Start of raw data processing
       ef LB = 0.3 FT_mod = 6 PKNL = 1 SI = 32K 
       data hash MD5: 32K
       C1 F1 9A C3 93 68 8D 83 73 45 49 3C A3 BC BE E7>)
(   3,<2006-04-03 13:37:29.47 +100>,<MAYBRIDGE\nmr>,<NMR_250MHZ>,
      <apk 
       data hash MD5: 32K
       A4 A7 72 D8 EC 44 98 EB D6 E7 05 84 5A 6C 92 8D>)
(   4,<2006-04-03 13:37:31.34 +100>,<MAYBRIDGE\nmr>,<NMR_250MHZ>,
      <abs ABSG = 5 
       data hash MD5: 32K
       5F BD D0 34 7C 26 05 42 E7 22 A6 71 8F DB C7 6C>)
$$ ##END=
$$ 
$$ hash MD5
$$ 11 A2 D7 D0 CF C1 54 C7 84 9C 69 A4 8B C3 06 45
##$RELAX= 
##$RELAX= 
##$RELAX= 
##$RELAX= 
##$RELAX= 
##$RELAX= 
##$RELAX= 
$$ Bruker specific parameters
$$ --------------------------
##$DU= <C:\u>
##$EXPNO= 2000
##$NAME= <ADRS>
##$PROCNO= 1
##$TYPE= <nmr>
##$USER= <dgb>
##$AMP= (0..31)
100 100 100 100 100 100 100 100 100 100 100 100 100 100 100 100 100 100 
100 100 100 100 100 100 100 100 100 100 100 100 100 100 
##$AQSEQ= 0
##$AQ_mod= 3
##$AUNM= <au_zg>
##$AUTOPOS= <59 >
##$BF1= 250.13
##$BF2= 250.13
##$BF3= 250.13
##$BF4= 250.13
##$BF5= 500.13
##$BF6= 500.13
##$BF7= 500.13
##$BF8= 500.13
##$BYTORDA= 1
##$CFDGTYP= 0
##$CFRGTYP= 5
##$CHEMSTR= <none>
##$CNST= (0..31)
1 1 145 1 1 1 1 1 1 1 1 1 1 1 1 1 1 1 1 1 1 1 1 1 1 1 1 1 1 1 1 1 
##$CPDPRG= <>
##$CPDPRG1= <>
##$CPDPRG2= <>
##$CPDPRG3= <>
##$CPDPRG4= <mlev>
##$CPDPRG5= <mlev>
##$CPDPRG6= <mlev>
##$CPDPRG7= <mlev>
##$CPDPRG8= <mlev>
##$CPDPRGB= <>
##$CPDPRGT= <>
##$D= (0..31)
0 1 0 0 0 0 0 0 0 0.06 0 0 0 0 0 0 0.0002 0 0 0 0 0 0 0 0 0 0 0 0 0 0 
0 
##$DATE= 1144067778
##$DBL= (0..7)
120 120 120 120 120 120 120 120 
##$DBP= (0..7)
150 150 150 150 150 150 150 150 
##$DBP07= 0
##$DBPNAM0= <>
##$DBPNAM1= <>
$$ [...]
##$SUBNAM7= <"">
##$SUBNAM8= <"">
##$SUBNAM9= <"">
##$SW= 20.6930455092707
##$SWIBOX= (0..15)
0 0 3 0 0 0 0 0 0 0 0 0 0 0 0 0 
##$SW_h= 5175.983436853
##$TD= 65536
##$TD0= 1
##$TE= 294.16
##$TE2= 300
##$TE3= 300
##$TEG= 300
##$TL= (0..7)
0 120 120 120 120 120 120 120 
##$TP= (0..7)
150 150 150 150 150 150 150 150 
##$TP07= 0
##$TPNAME0= <>
##$TPNAME1= <>
##$TPNAME2= <>
##$TPNAME3= <>
##$TPNAME4= <>
##$TPNAME5= <>
##$TPNAME6= <>
##$TPNAME7= <>
##$TPOAL= (0..7)
0.5 0.5 0.5 0.5 0.5 0.5 0.5 0.5 
##$TPOFFS= (0..7)
0 0 0 0 0 0 0 0 
##$TUNHIN= 0
##$TUNHOUT= 0
##$TUNXOUT= 0
##$USERA1= <user>
##$USERA2= <user>
##$USERA3= <user>
##$USERA4= <user>
##$USERA5= <user>
##$V9= 5
##$VALIST= <valist>
##$VCLIST= <CCCCCCCCCCCCCCC>
##$VD= 0
##$VDLIST= <DDDDDDDDDDDDDDD>
##$VPLIST= <PPPPPPPPPPPPPPP>
##$VTLIST= <TTTTTTTTTTTTTTT>
##$WBST= 1024
##$WBSW= 4
##$XGAIN= (0..3)
0 0 0 0 
##$XL= 0
##$YL= 0
##$YMAX_a= 383983
##$YMIN_a= -277515
##$ZGOPTNS= <>
##$ZL1= 120
##$ZL2= 120
##$ZL3= 120
##$ZL4= 120
##$ABSF1= 16.522
##$ABSF2= -4.171173
##$ABSG= 5
##$ABSL= 3
##$ALPHA= 0
##$AQORDER= 0
##$ASSFAC= 0
##$ASSFACI= 0
##$ASSFACX= 0
##$ASSWID= 0
##$AUNMP= <proc_1d>
##$AZFE= 0.1
##$AZFW= 0.1
##$BCFW= 0
##$BC_mod= 0
##$BYTORDP= 0
##$COROFFS= 0
##$CY= 12.5
##$DATMOD= 1
##$DC= 0
##$DFILT= <>
##$DTYPP= 0
##$F1P= 14.0000005364418
##$F2P= -0.99999901652339
##$FCOR= 0.5
##$FTSIZE= 32768
##$FT_mod= 6
##$GAMMA= 0
##$GB= 0
##$INTBC= 1
##$INTSCL= 1
##$ISEN= 128
##$LB= 0.3
##$LEV0= 0
##$LPBIN= 0
##$MAXI= 10000
##$MC2= 0
##$MEAN= 0
##$ME_mod= 0
##$MI= 0
##$NCOEF= 0
##$NC_proc= -3
##$NLEV= 6
##$NOISF1= 0
##$NOISF2= 0
##$NSP= 0
##$NTH_PI= 0
##$NZP= 0
##$OFFSET= 16.522
##$PC= 1
##$PHC0= 18.23392
##$PHC1= 5.886525
##$PH_mod= 1
##$PKNL= yes
##$PPARMOD= 0
##$PSCAL= 4
##$PSIGN= 0
##$REVERSE= no
##$SF= 250.13
##$SI= 32768
##$SIGF1= 0
##$SIGF2= 0
##$SINO= 400
##$SIOLD= 32768
##$SREGLST= <1H.CDCl3>
##$SSB= 0
##$STSI= 32768
##$STSR= 0
##$SW_p= 5175.98343685301
##$SYMM= 0
##$S_DEV= 0
##$TDeff= 65536
##$TDoff= 0
##$TI= <Analysis number 999999
Compound Code 99
Book Reference 9
Project Code 9>
##$TILT= no
##$TM1= 0
##$TM2= 0
##$TOPLEV= 0
##$USERP1= <user>
##$USERP2= <user>
##$USERP3= <user>
##$USERP4= <user>
##$USERP5= <user>
##$WDW= 1
##$XDIM= 32768
##$YMAX_p= 324159812
##$YMIN_p= -41369
$$ End of Bruker specific parameters
$$ ---------------------------------
##NTUPLES= NMR SPECTRUM
##VAR_NAME=  FREQUENCY,     SPECTRUM/REAL,   SPECTRUM/IMAG
##SYMBOL=    X,             R,               I
##VAR_TYPE=  INDEPENDENT,   DEPENDENT,       DEPENDENT
##VAR_FORM=  AFFN,          ASDF,            ASDF
##VAR_DIM=   32768,         32768,           32768
##UNITS=     HZ,            ARBITRARY UNITS, ARBITRARY UNITS
##FACTOR=    0.157963299565203, 1,           1
##FIRST=     4132.6476996994, 0,             0
##LAST=      -1043.33573715361, 0,           0
##MIN=       -1043.33573715361, -41369,      0
##MAX=       4132.6476996994, 324159812,     0
$$ Real data points
##PAGE= N=1
##DATA TABLE= (X++(R..R)), XYDATA
$$ [...]
17096B083568n3799n1098m7147m0261m2729m0754m0625m2474k9372l5974l6292
17085A623043k9025l5079k9847j6883j9774j4815k4147k1216j6918j1159l551
17074A400629j1619j3531j877q2k848J675l855o141p405r829j5532j6869k0479
17061A292237j5229k3506k2817j4712j8544r529J4Q145J6578J5977J0653J9815
17049A259082L5671L5232K0219J5486O390j0747k7118k7360l7639m8242n5547
17038A165427m4716m0404l7827l5382j9626j2161r633L400L386O867J4339J9065
17026A012735J2185J516o932k1265j8118l1180m1429l7361l3211l0719l5437k9652
17014G41132k3328k7972k1692j7289j5064j4156n162p906l884J052j1035j0833
$$ y = [2083568, 2029769, 1978671, 1931524, 1891263, 1848534, 1807780, 1767155, 1724681, 1695309, 1659335, 1623043, 1594018, 1558939, 1529092, 1512209, 1492435, 1477620, 1453473, 1432257, 1415339, 1404180, 1400629, 1389010, 1375479, 1373602, 1373520, 1370672, 1372347, 1368492, 1362351, 1354946, 1345117, 1329585, 1312716, 1292237, 1277008, 1253502, 1230685, 1215973, 1197429, 1187900, 1187914, 1196059, 1212637, 1228614, 1239267, 1259082, 1294753, 1329985, 1350204, 1365690, 1372080, 1361333, 1334215, 1306855, 1269216, 1220974, 1165427, 1120711, 1080307, 1042480, 1007098, 987472, 975311, 965678, 969078, 972464, 979331, 993670, 1012735, 1024920, 1026436, 1019504, 998239, 980121, 948941, 907512, 870151, 836940, 806221, 770784, 741132, 717804, 689832, 668140, 650851, 635787, 621631, 616469, 608563, 604679, 605731, 594696, 583863]
17002E83863q769K0q325l563J1583K8453J9424P909l061J710j7863l3027l3191
16989E45163k9225j9498p050J9042K0546J0023J2839J2456N703j2322l1315k4858
16977E01504r642J5973J5741Q2M498J1154o939k1640l6047k9838k3883m796J8998
16964D35165K7379N556j225K151J980j9664k7952l1881j5042k282j4756q309k091
16951C49029k673j630j926J248P308J138p719n603l623l45n089p114r331q412
16937C05258O758M510n089n538j1974J085r4k039o913R852N686j15O52k046l976
16922B96017m55R38k053J464K580R20J808L261L782m818p279k15J567O942J063
16907C05522J782M927J1439Q087J6151Q476R461K2507M1593N2487M2946R687j9669
$$ y = [583863, 575094, 575114, 566789, 563226, 574809, 603262, 622686, 630595, 627534, 629244, 611381, 578354, 545163, 515938, 496440, 489390, 508432, 528978, 539001, 551840, 564296, 569999, 557677, 526362, 501504, 491862, 507835, 523576, 523658, 528156, 539310, 532371, 510731, 474684, 444846, 420963, 416167, 435165, 462544, 468100, 466875, 469026, 471006, 451342, 423390, 391509, 376467, 374185, 359429, 351120, 349029, 346356, 344726, 342800, 344048, 351356, 352494, 344775, 339172, 335549, 335204, 330115, 323001, 313670, 305258, 312016, 316526, 311437, 305899, 293925, 295010, 294916, 292877, 285964, 295816, 301502, 301387, 302039, 299993, 296017, 295562, 296500, 294447, 295911, 298491, 299411, 301219, 304480, 308262, 303444, 296165, 295950, 297517, 304459, 305522, 307304, 312231, 323670, 331757, 347908, 356384, 365845, 388352, 429945, 482432, 525378, 535065, 515396]
16894E15396j3000K949K3821L9119N9761O6467Q5038P3763L4483J0904l413K397
16882H97685M3262R3055J42330J81377K13235K19011K34430K56869L38444N26047
16872C145745Q41632J434817K572311M530865P101421Q180885N935868r55649
16864C2787895q518375p233514l937754j809212m06943R34826K702680N183884
16856A9703487P370635O889736K873365n641335q541826n318843k370136k02532
16848A4762551J942541M509096O412686N606325J346579o337782p559895m577758
16840A6104343k350148j003870J28183J490861L499303N788035O377570L985118
16832C4019395k620291q240599o426719l764117k231187j413972r40566o46168
$$ y = [515396, 502396, 505345, 529166, 568285, 628046, 694513, 779551, 853314, 887797, 898701, 895288, 897685, 940947, 1034002, 1176332, 1357709, 1570944, 1789955, 2024385, 2281254, 2619698, 3145745, 3987377, 5422194, 7994505, 12525370, 19626791, 27807676, 33743544, 32787895, 24269520, 17036006, 13098252, 11289040, 10882097, 11816923, 14519603, 19703487, 27074122, 33963858, 36837223, 31195888, 22654062, 17335219, 14965083, 14762551, 16705092, 21214188, 27626874, 33233199, 34579778, 28241996, 20682101, 16104343, 13754195, 12750325, 12878508, 14369369, 17868672, 23656707, 30034277, 34019395, 31399104, 23158505, 16731786, 12967669, 10736482, 9322510, 8381944, 7735776]
16824G735776m66293l62625l13276k99339k69118k55712k69539k64358k26110
16815E009406j85284j36363r9603q7119r6337j26380j63035j69598j66052j48287
16805C631348j28839j11921r1922r1341p7839o4887n5726n1044o7204r4068j01825
16794B694732q8274p6031o9082o9148o0249n2830n4406m9960n2318m5768n4583
16783B022083m8801m8624m8905m0264m3215m1524m0394l5291k3455k7145k9525
16772A594940k2546k4261j9858k6622k6693j2917k0026k3284j1805n841J416o220
16760A396283l832J448J815j0613j7742k1797j7275j9634k2509j1579j568j3662
16748A259335l077J416J15K697K422L687L796M795M880P012N683l212k3916l2174
$$ y = [7735776, 7269483, 6906858, 6593582, 6294243, 6025125, 5769413, 5499874, 5235516, 5009406, 4824122, 4687759, 4588156, 4501037, 4404700, 4278320, 4115285, 3945687, 3779635, 3631348, 3502509, 3390588, 3298666, 3207325, 3129486, 3064599, 3008873, 2957829, 2890625, 2796557, 2694732, 2606458, 2530427, 2461345, 2392197, 2331948, 2279118, 2224712, 2174752, 2122434, 2076666, 2022083, 1973282, 1924658, 1875753, 1835489, 1792274, 1750750, 1710356, 1675065, 1651610, 1624465, 1594940, 1572394, 1548133, 1528275, 1501653, 1474960, 1462043, 1442017, 1418733, 1406928, 1401087, 1402503, 1396283, 1392451, 1393899, 1395714, 1385101, 1367359, 1345562, 1328287, 1308653, 1286144, 1274565, 1272997, 1259335, 1256258, 1257674, 1257789, 1260486, 1262908, 1266595, 1270391, 1275186, 1280066, 1287078, 1292761, 1289549, 1265633, 1233459]
16734A233459k9582k6317q558r652n435q711j628R80j293j5261j9844j8647j7691
16721A071820j9746j9566j8767k0250j9720j5927l2950l8522l0735j4019n781
16710H35837n467j3917j2266l695n569k805j0545k7320l2027l3594k0469j8301
16698F49862k4482k2729j4707j9096j2950j2673r306r495p170j5561j1735j0361
16686D79597r031o596j0377m181l667j4508j5872j4433j0670q930j2618p906J277
16673C62085M64p336p911k137o939j2654m885J06j0423n997o583j0587m233q026
16659B74944p730l170l452p353n507j510J102J475p206J913J212m560j053K015
16645B41120k665q444n939J444J49n713l770o887p74m58l550l591o167N19J1342
$$ y = [1233459, 1203877, 1177560, 1169002, 1159350, 1153915, 1145204, 1143576, 1144556, 1143263, 1128002, 1108158, 1089511, 1071820, 1052074, 1032508, 1013741, 993491, 973771, 957844, 924894, 886372, 855637, 841618, 835837, 830370, 816453, 804187, 800492, 794923, 792118, 781573, 754253, 722226, 688632, 668163, 649862, 625380, 602651, 587944, 568848, 555898, 543225, 533919, 524424, 517254, 501693, 489958, 479597, 470566, 463970, 453593, 449412, 445745, 431237, 415365, 400932, 390262, 381332, 368714, 360808, 362085, 362549, 355213, 347302, 345165, 338226, 325572, 320687, 320793, 310370, 304373, 297790, 287203, 282970, 274944, 267214, 264044, 260592, 253239, 247732, 246222, 247324, 248799, 241593, 243506, 244718, 240158, 239105, 241120, 238455, 230011, 224072, 225516, 225665, 219952, 216182, 209295, 208521, 208063, 204513, 200922, 194755, 195274, 206616]
16630B06616L618j234n02J1624K4401L6046M0048L4244J6871j3018p393k46Q859
16617C59934m949k2836l3705l3279j9457j6717j6825j2252m703n124k841M472
16605A91718J4236K0633K6811L2008K4596N11j0014l057L122J702j1969k8595
16593B61702l3308k2770j6727j4926j3203l951o220n611n959o810l138o293n088
16580A17698k441K607J133k722K729j502o558l649J729r10n404j529k29J576J259
16565A03787j692r736m998k95K997Q995k578o542L605n52p217q786n517k861L343
16550G1953j7j477r24K077L673q810l539r590j347J003J773J902K151k903M45
16535E6370k475o00l380k571K87M644L544m432n045L719O481J413p211r147m796
$$ y = [206616, 210234, 209000, 208498, 220122, 244523, 280569, 320617, 354861, 371732, 358714, 351321, 351075, 359934, 354985, 332149, 298444, 265165, 245708, 228991, 212166, 199914, 195211, 190087, 187246, 191718, 205954, 226587, 253398, 285406, 310002, 310513, 300499, 297442, 300564, 302266, 290297, 261702, 228394, 205624, 188897, 173971, 160768, 156817, 150597, 144986, 139027, 132217, 129079, 122786, 117698, 115257, 117864, 118997, 116275, 119004, 117502, 110944, 107295, 109024, 108114, 102710, 101181, 100952, 102528, 103787, 102095, 92359, 87361, 87066, 90063, 99058, 96480, 89938, 93543, 92991, 85774, 76988, 71471, 68610, 71953, 71936, 70459, 69535, 71612, 75285, 66475, 62936, 53346, 51999, 53002, 54775, 56677, 58828, 55925, 56370, 53895, 53295, 49915, 47344, 47631, 52275, 55819, 51387, 46342, 50061, 56542, 57955, 50744, 41597, 36801]
16520C6801n340K047L464K177K352n079l962O824K991p062m313K667m455o65L291
16505C1738m982p654N416N021K12j906l475l400k209k833J319K798J288l226J914
16490B0021K077l448J291m630l239R5O714O489o129q624p344O70M523Q183O861
16475B3510K63n171j495K824L496O9l604m068l23l983L382P22m058n05o52n113
16459E294j212K866L310K701O798K176J350m279m981j739J0035K872o462o145
16445A2584l189j175Q761P246n610n451l442j679K047l064J327N437K957l293
16431A3456m562l642K904r78j096r111O35M347K206N380l242k928J916L51J153
16416F789k136l013J200k424l956K789M217j102L980p187q87k627k701L104Q930
$$ y = [36801, 31461, 33508, 36972, 39149, 41501, 36422, 32460, 39284, 42275, 35213, 30900, 33567, 29112, 28447, 31738, 26756, 19102, 24518, 29539, 29751, 27845, 24370, 20970, 18761, 15928, 17247, 20045, 21333, 18107, 20021, 22098, 18650, 19941, 15311, 12072, 12167, 18881, 25370, 19241, 10617, 3273, 3943, 8466, 16649, 23510, 23773, 18602, 17107, 19931, 23427, 23496, 19892, 15824, 15501, 11518, 14900, 15622, 11564, 11059, 10407, 5294, 4082, 6948, 10258, 12959, 19757, 21933, 23283, 19004, 14023, 12284, 22319, 25191, 18729, 12584, 9395, 8220, 16981, 24227, 18617, 13166, 9724, 8045, 10092, 7028, 8355, 13792, 16749, 13456, 8894, 5252, 8156, 7178, 6082, -3029, -2394, 1953, 4159, 9539, 6297, 3369, 5285, 5636, 6789, 4653, 1640, 2840, 416, -3540, -751, 3466, 2364, 6344, -843, -1730, -4357, -7058, -3954, 4976]
16401D976J342O56M244K05m330K801n47n165j2894l90R39n224K889O587J1224
16386G313m389m325M737P38j905n60M774K293k131N48J021M255K996L330k362
16371A6333n620l449K3N754L179j463o06M746R3m562r703l305o62k985q79J646
16355a460M364O0m122j100Q87j374K022J49K947J456o457m102Q96M547M175j912
16339I76m85k024K60k016M20L767j496l753O93R77l308L602J622N900K35n008
16323C62k635J437N85J9Q311J143M524M954J240P545K1109L4240L5127K8964J5151
16308A62076j8594l4885k9859j3792p239n44M125J2474L5759L6935K1693Q96k8768
16295A40277l1945j8053r261O384J7909K6563K5501K4981j927l0845l4376k3957
$$ y = [4976, 6318, 6974, 11218, 11423, 7093, 9894, 9347, 4182, -8712, -9102, -8163, -13387, -10498, -3911, 7313, 2924, -1401, 3336, 4074, 2169, 1609, 6383, 8676, 6545, 7093, 8114, 12369, 15365, 18695, 16333, 10713, 7264, 7287, 13041, 16220, 14757, 14151, 18897, 18990, 14428, 4725, 1420, 758, -2227, -3106, -1460, 2904, 2964, -1158, -2258, -1371, -2745, -723, -574, 2373, 3829, -2628, -6730, -5834, -1287, 2888, 976, 491, -1533, -1273, -3289, -2869, 898, -598, -4351, -3658, -2681, -5989, -2387, -765, 5135, 5370, 362, -2273, -836, -251, -232, 8079, 9222, 13746, 18700, 19940, 27485, 48594, 82834, 117961, 146925, 162076, 143482, 108597, 78738, 64946, 57707, 57163, 61288, 73762, 109521, 146456, 168149, 169045, 140277, 108332, 90279, 81018, 87402, 105311, 131874, 157375, 182356, 180429, 149584, 115208, 91251]
16283I1251j2214j482K540J6775K6143L3621K0951L843k8859l2520k6896k0562
16271G2591o817p292j996n13n214j337j159o440M796N26o269m701l612k790n387
16256B4386l306j539k442M274n27j845q215k146Q730J826m485r16P86k923M669
16241A6327n09m219j016k230p70k104n916n04O429j867o88J759J796J09Q334N235
16225B0166l615j391K424k90o797j529K196p879p002O84O510j5m610j509M979
16210B322Q36n781P37Q249M33J238k514m298M148J9m622m113J672K12M166l89
16194B315k799j253O798J790k806j080j340K348J205l371J169N532L179l351j456
16179F880K16R49L811J259m016l687M158m16n07k767N879J775j592p50k492J290
$$ y = [91251, 79037, 77555, 80095, 96870, 123013, 156634, 177585, 181428, 152569, 120049, 93153, 72591, 65774, 58482, 56486, 55973, 50759, 49422, 48263, 41823, 46619, 47145, 40876, 36175, 32563, 29773, 24386, 21080, 19541, 17099, 21373, 20846, 19001, 10786, 8640, 17370, 19196, 14711, 13795, 14581, 11658, 16327, 15818, 11599, 10583, 8353, 7583, 5479, -437, -941, 5488, 3621, 2933, 4692, 6488, 6597, 14931, 20166, 16551, 15160, 17584, 17294, 10497, 8968, 11164, 3285, -3717, -3033, 3477, 3462, -1148, -2657, 2322, 3158, -2623, -1886, 6363, 6796, 8034, 5520, 1222, 5370, 5389, 767, -3346, -1674, -1462, 2704, 2315, -484, -1737, 5061, 6851, 4045, 2965, 1625, 3973, 5178, 1807, 2976, 8508, 11687, 8336, 6880, 7096, 8045, 11856, 13115, 9099, 5412, 9570, 9154, 8647, 5880, 11759, 13534, 11942, 11192, 8700, 9990]
16163I990q95K892j09j074o903p057M734k64k266J642k630n437p41l949O43J693
16147i731N886M773P79k203l341o169l070J857L716M771l155L51j580M77K922
16132c717M279N867J121n982P5k561l77L247K348K50m440k315l418L273J661P13
16116B4k612o917K383l013O312K296k511m81j139n91J68m113k561l928L503P795
16100e385K186n097j20k631P365k134n382K880K248m807k273R21k274L97J346
16085a2760r2L180M889J567J180l318K377K101k459K638k710j488n687Q82L58
16070i342j609n34M9L858L337K129j092Q25p03K551L782p395k279j477L305Q647
16054D052n44l980l021m572J810m33Q100K636j32K025J120p468o743l171L409
$$ y = [9990, 9095, 11987, 11878, 10804, 3901, -3156, 1578, 1314, -952, 690, -1940, -7377, -8118, -12067, -11424, -9731, -3845, 928, 1707, -496, -3837, -10006, -13076, -11219, -7503, -2732, -5887, -5536, -7116, -6639, -3717, 562, 6429, 7550, 1568, 1643, -918, -1295, 1952, 4300, 4550, 110, -2205, -5623, -2350, -689, 24, -2588, -9505, -7122, -10135, -3823, -1527, -4038, -4519, -5658, -6249, -6081, -10194, -12755, -16683, -13180, -5385, -3199, -8296, -8416, -11047, -3682, -5816, -11198, -8318, -6070, -10877, -13150, -12229, -14503, -14106, -12760, -12852, -9672, -4783, -3216, -2036, -5354, -2977, -876, -3335, -697, -3407, -4895, -10582, -9700, -9342, -10951, -11485, -11436, -7578, -4241, -2112, -3204, -2379, -3082, -531, 3251, -4144, -6423, -7900, -4595, 4052, 3508, -472, -3493, -8065, -6255, -6688, 1412, 4048, 3916, 5941, 7061, -407, -7150, -10321, -6912]
16039f912P46k773J193J536j755l929p045O86J4452M168p912m315L938k846o8
16024a0836K903M023l459l203K891J815K041P090N351P75r238k697J442K674n024
16009c452q96q83q66K388K757o273q74N236n23L577l900l674M373L419K690J35
15993C234K936k049l062J833M164k1m116o03m873L347O095j84m583j143l283r81
15977c289J839k347p511j288k108k197L030M73L346l546l15L977N455K498L814
15962A831M955j364p854n849L364M018J151J897k059l956m171K356l695K438N146
15947a792n59R85q447J601M539K424O11J809L051j1n340m022m10m230J424L392
15931d975Q36L366p61j406O870j564n659j3k087m96l316j003o081n286O168Q829
$$ y = [-6912, -6166, -8939, -7746, -6210, -7965, -11894, -18939, -18253, -3801, 367, -7545, -11860, -7922, -10768, -10836, -7933, -3910, -7369, -10572, -7681, -5866, -3825, 3265, 8616, 9391, 153, -2544, -1102, 1572, -3452, -4348, -5231, -6097, -3709, -952, -7225, -8099, -2863, -3386, 191, -3709, -7383, -3010, 409, 3099, 3234, 6170, 4121, 1059, 2892, 7056, 7035, 2919, 2316, -2557, 790, 6885, 6701, 2118, 975, -2308, -3289, -1450, -3797, -11308, -12596, -14704, -16901, -13871, -13398, -10052, -13598, -13913, -9936, -4481, -1983, 1831, 6786, 5422, -2432, -8281, -4917, -899, 252, 2149, 90, -3866, -8037, -5681, -9376, -6938, -1792, -2351, -1366, -9813, -8212, -3673, -1249, -638, 1171, 4222, 4211, -1129, -5151, -5561, -9791, -8367, -4975, -4139, -773, -1534, -2940, 3930, 2366, -3293, -3306, -5393, -5889, -9205, -10208, -16289, -21575, -15407, -6578]
15915f578K263n146m897R476O574l581o242K599O369M710j111o662o763J876L869
15900c244M153Q59m326K214K148Q07J27j070n704L860R190J212j2148k083L094
15885i11l245p19n45o149J369o53R89P20J320n175P68N09k3l657J153N419K164
15868f666J43K150K571L687L035m865n74J907K183J14k555n059m640k61n25l21
15852i676L022r93P284p29K429J732l006m954j579k839n549M627J0058k359R01
15837a631k342K002L050Q23L214Q71l016j103j022m733k711M465O27j897K190
15822a213o671l926m870k27Q671K025l729k382K853R96l528J997N283M850k442
15807b313l687n791j220M640K484m89j00M055L215o09m446K324J32n389p315k940
$$ y = [-6578, -4315, -9461, -14358, -4882, 1692, -1889, -8131, -5532, 837, 5547, 4436, -2226, -8989, -7113, -3244, 909, 1768, -2558, -344, 1804, 2611, 2738, 1668, -4036, -176, 9014, 10226, -1922, -4005, -911, -4156, -4875, -5420, -11569, -10200, -10853, -9864, -9144, -7824, -12999, -12231, -11722, -11745, -15402, -14249, -8830, -6666, -6523, -4373, -1802, 1885, 4920, 55, -519, 1388, 3571, 3685, 1130, -3929, -8569, -8830, -9355, -9676, -6654, -7647, -363, -1092, 1337, 3069, 63, -4891, -6470, -9309, -14858, -10231, -173, -2532, -1631, -3973, -1971, 1079, 1902, 5116, 5987, 2971, 1868, 846, -3887, -6598, -2133, -1506, -3403, -1213, -7884, -11810, -16680, -16907, -8236, -6211, -9940, -12322, -9469, -8473, -12001, -10004, -4721, 129, -2313, -6000, -11791, -13011, -8371, -5887, -6376, -6476, -2421, 794, 185, -4261, -1937, -1805, -7194, -14509, -17449]
15791a7449l186j050N321J1509K962l420N496l559l794K190j954N595J963o312
15777e688l344l707J941l984j327K554L566J123n69m70O758J946P59k667J366
15762a743n39K114l716m873j203j245J943M23J490N187j865j463m17o131L429
15747h609N900K802j84J577k661J16p82J918J339p269j484L794q446p469M030
15732a5428M91J968l606o52M285R64J335k82J760L628J293n126J223J242q76J030
15716f751n161J11R08J449O484O2J147q88J858N636p795l424L009o174q50L177
15700g202q97K933n105m74L864L938m393k730J497N567j742m859k847J460K664
15685h326j858l734k761N914N439n73K361q397n100Q039O173n098l474L398O588
$$ y = [-17449, -20635, -21685, -16364, -4855, -1893, -5313, 183, -3376, -7170, -4980, -6934, -1339, 624, -5688, -9032, -12739, -10798, -14782, -16109, -13555, -9989, -8866, -9435, -9905, -3147, -1201, -442, -3109, -1743, -2282, -168, -3884, -8757, -9960, -11205, -9262, -8839, -7349, -2162, -4027, -5490, -5907, -12038, -8609, -2709, 93, -91, 1486, -1175, -1059, -1841, 77, 1416, -5853, -7337, -3543, -11989, -19458, -15428, -14937, -12969, -16575, -17227, -12942, -11978, -10643, -10925, -9165, -5537, -4244, -9370, -8147, -6905, -7781, -6751, -11912, -11801, -10893, -9444, -2960, -2898, -1751, -2639, -781, 4855, -2940, -6364, -3355, -9529, -10379, -7202, -8099, -5166, -10271, -10745, -6881, -2943, -7336, -10066, -8569, -3002, -4744, -9603, -12450, -10990, -8326, -10184, -13918, -16679, -10765, -5326, -5899, -3538, -11935, -17035, -8996, -2823, -7921, -11395, -7997, -1409]
15670a409j994q46L153n473N33L027K804p99o622m56m523L383M85J024L189L946
15654e78m100j130j05o087N264k431p90K632m706K020O050j82r0N44l901j409
15638h999O813k194n202K239L491J24k885K82L845k956K207K934k208l115n412
15623a1036K68q93R49L675L198M943N066m820o962l87K615j442Q66K719j981n46
15607c768K961N38L29j227o51O680m84r020r559j093J11L011J501K13m336P09
15591a4085L160N08J781k242L438m227n41J129L269l377J535J274M519O46m538
15576g751k279P169R476j205k194J955n941J573J222p93m189J73L022n902J911
15561c753l222o221m800n16N139N80N145J801K964l357M03M498J395q593j2721
$$ y = [-1409, -3403, -4249, -1096, -6569, -6036, -3009, -205, -1004, -7626, -8082, -12605, -9222, -8737, -7713, -4524, -578, -4678, -5808, -5913, -12000, -6736, -9167, -9957, -7325, -12031, -10011, -3961, -4143, -4233, -3689, -7590, -8999, -2186, -4380, -9582, -7343, -3852, -3728, -6613, -6331, -2486, -5442, -3235, -301, -2509, -5624, -11036, -10768, -11661, -10712, -7037, -3839, 1104, 6170, 1350, -5612, -5999, -3384, -4826, -3960, -1241, -3222, -3768, -807, -269, 60, -1167, -1818, 4862, 4378, -4642, -14201, -15294, -15183, -12172, -10671, -10458, -14794, -14085, -10925, -10417, -8636, -10878, -7440, -11667, -12208, -11079, -7810, -11187, -9652, -8378, -3859, -3213, -7751, -10030, -2861, 6615, 5410, 3216, 5171, -770, 803, 2025, 1232, -2957, -2784, 238, -5664, -3753, -6975, -13196, -17996, -18512, -13373, -12793, -7648, -5847, -2883, -6240, -5837, -1339, 56, -8537, -21258]
15546b1258J60M243R83l33j007J812l012P864K725m914o67o90N277P679n638k847
15530i623N59L530p211J998K761L073k983j313J382L977Q949M022r141j0808L22
15515a0506N066j837k666M652K805k160J72p97M92N851J409o931p234J717L404
15500f563K205L376J380k162k910J372k649r69K019J61j088k876p83Q92L859k055
15484f791q011N389m2p024J639j399M21l20J2532O426r35l284o13K557j032j351
15468a838k293k209l787j533K054R68N320K485K349l734Q68k702N960L52k32m287
15452b259m645J496K966m645n209L071O576N577J749K67k968o615L797m503q263
15437a3608K064J2976M659n336o807M425n124n654K818M680m783o662L289J324
$$ y = [-21258, -21098, -16855, -15872, -16205, -17212, -15400, -18412, -10548, -7823, -12737, -13404, -14094, -8817, -1138, -6776, -9623, -9064, -5534, -12745, -10747, -7986, -4913, -7896, -9209, -7827, -3850, 5099, 9121, -20, -10828, -10506, -5440, -7277, -9943, -5291, -2486, -4646, -4474, -5271, -4779, 1072, 2481, -4450, -11684, -9967, -6563, -4358, -982, 398, -1764, -4674, -3302, -5951, -6920, -4901, -4740, -5828, -8704, -9487, -8595, -4736, -6791, -14802, -9413, -9455, -16479, -14840, -16239, -15818, -16138, -3606, 2820, 1885, -1399, -2012, 545, -487, -1838, -4131, -6340, -10127, -11660, -9606, -8638, -3318, -833, 1516, -2218, -1350, -4052, 1908, 2260, 2028, -2259, -6904, -5408, -2442, -7087, -12296, -9225, -2649, 2928, 4677, 4944, 1976, -4639, -842, -5345, -13608, -11544, 1432, 6091, 755, -6052, -1627, -6751, -12405, -9587, -4907, -9690, -16352, -13063, -11739]
15423a1739L38k428J510O057M367k407k917p292m282N768l6j329o81L995L054
15408h022j810P0p90R37l219K736l508j992N483K492k936p21L038O826M754Q85
15392D223k499m481m410m637j147l845j00M513k519K838m552q1L118J182k409
15377a4806R718J042j691O503M531j392j817k806j356k405K720j458l283j142
15363g642N823j38l171r18m038M060j251L667L526J000k04k251n070n13Q347O093
15347G320J640j4117o075J2972L177r087l446N424j247m689J903K946Q9M168P03
15332A681n922p794Q861N525n305l040K98p5p91j376k718j700K204L7O14n588
15316a5089M768Q118N284j693j517n816m6p979l705P043O726L638j341K157j84
$$ y = [-11739, -11401, -13829, -12319, -6262, -1895, -4302, -7219, -14511, -18793, -13025, -13061, -14390, -15071, -11076, -8022, -9832, -9762, -10552, -9615, -12834, -10098, -13606, -15598, -10115, -7623, -10559, -11280, -8242, -1416, 3338, 4223, 1724, -2757, -7167, -11804, -12951, -16796, -16896, -12383, -14902, -12064, -16616, -16697, -13579, -12397, -14806, -5088, -4046, -5737, 766, 5297, 3905, 2088, -718, -2074, -4479, -1759, -3217, -6500, -7642, -1819, -1957, -5128, -6046, -10084, -6024, -7275, -3608, -82, 918, 714, -1537, -6607, -7120, 1227, 7320, 8960, -5157, -11232, 1740, 4917, -4170, -7616, -2192, -3439, -8128, -6225, -3279, -3190, 978, 1681, -4241, -12035, -3174, 2351, -2954, -5994, -5696, -5771, -6562, -7938, -10656, -12356, -10152, -10115, -9501, -15089, -10321, -2203, 3081, 1388, -129, -5945, -5991, -13970, -17675, -10632, -3906, -268, -1609, 548, 364]
15301C64n057J65o612Q45l043R613L488j4163O45J740o95J245k306l925m031Q362
15285a3365Q595o97o601J85O626l026j301M946j456J540J870j236n222j865L447
15270g560J950J132L942K709J11M208n232j733k438k559k611q06n093k2L253M497
15254f252l633K720N778q573O6o901p53J1385R201J416k33m767k13m52l677J274
15238c614L111j842p739l924L881L965O275k789n871m257L926N68o73K227L212
15223c544j878J153m915k418l559J452M864K051j556O727p554n249R503J070J018
15208b835m35O31k110o72K660J03o867P93J353K660K392J825n493l734l62J132
15192h959L029l707K312l731L17L274N329J488Q22o415P54m736o799o04N35L519
$$ y = [364, -4693, -4528, -11140, -10295, -13338, -3725, -237, -14400, -13755, -12015, -12710, -11465, -13771, -17696, -21727, -13365, -4770, -5467, -12068, -11883, -5257, -8283, -9584, -4638, -6094, -4554, -2684, -3920, -9142, -11007, -7560, -5610, -4478, -536, 2173, 2284, 6492, 1260, -473, -2911, -5470, -8081, -8887, -13980, -14002, -10749, -6252, -9885, -7165, -1387, -9960, -9894, -16795, -17548, -6163, 3038, 4454, 4221, -546, -759, -1211, -4888, -3614, -503, -2345, -10084, -14008, -10127, -6162, 113, -2676, -8547, -12804, -8878, -8310, -8983, -6756, -3544, -5422, -4269, -9184, -11602, -15161, -13709, -8845, -6794, -8350, -1623, -9177, -14426, -4923, -3853, -2835, -3270, -2639, -4749, -5421, -2761, -2658, -9525, -8732, -7379, -4719, -2327, -502, -5995, -9729, -10091, -8959, -5930, -9637, -7325, -11056, -10739, -7465, -2136, -648, 174, -6241, -5487, -10223, -17022, -17626, -17091, -13572]
15176a3572K87j217r79K385k099j62N006p44J203O072l409K757M979J560k450
15161c83l31J628o707r83L05l301L36k627L441m422n000q73K775L437K849K365
15145g491L268K492j795J556J638p11l222m998m640R87j663n690M455N25K065
15130a3224L687P922M364o26m944k381j79K829N527k359l800k779o06k522j289
15115a0380Q630N335l73k549M335M477J452j067q373l596M455n37m362p23M57
15100b819o320M369Q39k699j485l910r51J682J299M086K088O096j361J249Q25
15085B988O77m948k274k16J423n376j024M626M701l970r77j785j129L005M410
15070A31K610j332p19k289k677j40P637M003m284l586N547k611o939k201M598
$$ y = [-13572, -13285, -14502, -15481, -13096, -15195, -15357, -10351, -11095, -9892, -3820, -7229, -4472, 507, 2067, -383, -714, 914, -5793, -6776, -6471, -9772, -9436, -12063, -8622, -13044, -18044, -18917, -16142, -12705, -9856, -7491, -4223, -1731, -3526, -1970, -332, -1043, -4265, -9263, -13903, -12916, -14579, -20269, -15814, -15289, -13224, -9537, -1615, 2749, 2123, -2821, -5202, -5381, -2552, 2975, 616, -3184, -5963, -6569, -9091, -10380, -1750, 3585, 3212, 663, 4998, 9475, 10927, 9860, 1487, -2109, 2346, 1809, -2553, -3276, -2819, -9139, -4770, -3931, -6630, -8115, -12025, -12976, -11294, -9995, -5909, -3821, 2275, 914, 2163, 2988, 3665, -1283, -3557, -3773, -2350, -7726, -8750, -4124, 577, -3393, -4370, -6155, -7284, -4279, 131, 2741, 1409, 690, -1599, -4276, -4416, 3221, 7224, 2940, -646, 4901, 2290, -4649, -6850, -2252]
15055b252j525m596N029N701J044j0705k143K287K599k930k19j957J312j579j999
15040a1933K024R233l41m881q55M359j302r676p178O401Q370j737l073k882k054
15025a5525R899M343L425l912m426j167j125k133J524P092L809J264o444j0762
15011a4138k247R146L671K357K937l688k804K814k280q985L5M675N249K389M14
14996d55k057j987l753N150l509J787K992j130K38q78L686J664j02l454m702m386
14980a0896l99L336L853J290m35k161N077R55K416l679q230k598j289M495r79
14965i244m858K877k420q50O848O303J971m838n474k601J972P62J457m553j551
14950a4199R394K768K586l830k784r26J528J437q099J2925P131k626k064k469
$$ y = [-2252, -3777, -8373, -3344, 2357, 3401, -7304, -9447, -7160, -4561, -7491, -7710, -9667, -8355, -9934, -11933, -9909, -676, -1017, -5898, -6753, -2394, -3696, -13372, -20550, -14149, -5779, -7516, -10589, -13471, -15525, -5626, -1283, 2142, -1770, -6196, -7363, -8488, -10621, -9097, -2005, 1804, 3068, -3376, -14138, -16385, -7239, -3568, -1211, 1726, -1962, -4766, -1952, -4232, -13217, -13182, -8507, -3258, -869, -455, -2512, -4499, -8252, -3102, -6611, -4824, -1832, -2962, -2724, -3602, 84, 1748, 1646, -1808, -6510, -10896, -11295, -7959, -4106, -2816, -3251, -5412, -335, 620, 3036, -643, -8873, -11471, -12760, -8265, -9244, -14102, -11225, -13645, -14495, -7647, -1344, 627, -4211, -9685, -12286, -10314, -9552, -8095, -12648, -14199, -4805, -2037, 549, -3281, -6065, -6991, -5463, -4026, -12125, 800, 7931, 5305, 3241, 772]
14936G72l089n324K534k399j324n68O755K036J104j157k109J590o310m877n02
14921a2868l60m433P49L145o644J170O651K884k230J147R123K219p61O05q1j537
14905a221J295J486m424k647m294o81J789j122l230l773l431M331N504m721J567
14890a3572M031N547L480l285n746k100m085l230N268J706K91l099K606L124K311
14875f753K835O31k38J37j541j786n003n728K148J549M935j147J84R62M722N991
14859A898k652p156o240j368J04k309O102m32L624M533j742J520J549q08m703
14844h080m885l417N205N409L39K071j0959J252K833r73N212k049n351o357n312
14829b5062K801K581O829N824r02L68K142J773m824M941p27k126P998l071O34
$$ y = [772, -2317, -7641, -5107, -7506, -8830, -9398, -2643, -607, 497, -660, -2769, -1179, -7489, -12366, -12868, -13228, -17661, -16912, -13767, -20411, -19241, -12590, -9706, -11936, -10789, -1666, 553, -208, 397, 316, -1221, 74, 1560, -2864, -5511, -9805, -10486, -8697, -9819, -13049, -16822, -20253, -15922, -10418, -15139, -13572, -9541, -3994, -514, -3799, -9545, -11645, -15730, -18960, -13692, -11986, -11695, -14794, -12188, -9064, -6753, -3918, -3287, -3525, -3388, -4929, -6715, -11718, -17446, -15298, -13749, -8814, -9961, -9777, -8815, -4093, 1898, -754, -7910, -14150, -15518, -15414, -17723, -11621, -12053, -8429, -3896, -5638, -4118, -2569, -3377, -8080, -12965, -16382, -11177, -5768, -5429, -3358, -14317, -13065, -10232, -11205, -5993, -8042, -13393, -19750, -25062, -22261, -19680, -12851, -7027, -7929, -7561, -5419, -3646, -8470, -3529, -4256, -6382, 1616, -1455, -821]
14814h21K594l360j0417m404K592j096N65R94P040j601o351J260M408P321L42
14799i34k748Q96J52j838q67k216J656O901j780j106M857k569k635L141N905M144
14783A0959j0156o343o079j908P629M527k040O98l290m227l428K234O026j070
14769f468L135N51k78K227j327n558J529M00k850Rj802K923M601O619J734l367
14753B078k507n619r457J306P79N46K874M631k893j511j633R421j747m824K626
14738e930k867l857K741N611p42l415J319j558p46m87J467K106K763M68K80j483
14722d330k625q31l049O05j28O026k066n829j809m494K515M468j998J389M052
14707h104Q462k876l384P77K5K596j035j973o945m218r05j613N786R975L523o380
$$ y = [-821, 1773, -1587, -12004, -16408, -13816, -14912, -14347, -13353, -6313, -7914, -14265, -13005, -8597, -1276, -934, -3682, -2786, -2634, -4472, -5339, -7555, -5899, 1002, -778, -1884, 2973, 404, -2231, 910, 6815, 10959, 803, -5540, -11619, -13527, -5898, -1371, -3411, -2713, -6003, -10230, -13658, -11424, -5398, -6468, -3333, -2782, -3060, -833, -2160, -7718, -6189, -5789, -8639, -8630, -10432, -7509, -2908, 3711, 5445, 2078, -429, -6048, -15505, -14199, -13420, -12874, -10000, -5369, -8262, -9773, -11406, -1985, -3732, -8556, -5930, -8797, -12654, -9913, -4302, -5044, -8459, -7140, -8698, -9444, -9931, -8464, -6358, -3595, -3127, -2847, -4330, -6955, -7786, -10835, -10230, -10358, -4332, -6398, -12227, -14036, -18530, -16015, -11547, -13545, -12156, -8104, 358, -2518, -5902, -5125, -5100, -2504, -3539, -5512, -12457, -16675, -17580, -19193, -13407, -3432, 91, -6289]
14691f289K240L10j656K859K534m162k023N604j714p221k081K564P353M08J597
14676C23l737j31o43j00R23o458o595M659L775O737j623L996L13n759m140J252
14660g208R767K84J07P608J553r362m056L32L694M743j182j320m14j014p72J060
14644C820j257l921r5j854O29J959p632n593n373M900l24j409k838j127j193J1416
14628i892O796J540J172o80o806j564R10N118N466p699k546N884M242n063l737
14613f859L524J382n50m328o064J359J084L77N853J890J391k38j103q81l840n048
14597a2051J695N616K332j872k142l153k245o689j291N067L679m044N987J754
14583g357o05n472p94l428K533J674L625K459N118L522R70l464j350j766j444
$$ y = [-6289, -4049, -3739, -5395, -2536, -2, -4164, -6187, -583, -2297, -9518, -11599, -9035, -1682, -1274, 323, -3414, -3545, -4188, -4288, -3365, -9823, -16418, -11759, -7984, -1247, -2870, 1126, 1439, -4320, -8460, -7208, 2559, 2843, 2950, 10558, 12111, 2749, -1307, -975, 2719, 7462, 6280, 4960, 4546, 3532, 2760, 3820, 2563, -1358, -1453, -3307, -2678, -719, -8351, -13944, -19317, -14417, -14741, -16150, -18988, -20115, -21308, -9892, -3096, -1556, -384, -1064, -7870, -9434, -8524, -3406, 2060, -5639, -8185, -2301, 1941, -3122, -6859, -3335, -1953, -2503, -6831, -12895, -11536, -10452, -10075, -4222, -2332, -941, -1179, -2282, -3163, -7003, -12051, -10356, -4740, -2408, -4280, -6422, -9575, -11820, -18509, -19800, -14733, -11054, -15098, -9111, -7357, -7962, -13434, -14228, -17656, -15123, -13449, -9824, -7365, -2247, 1275, 2245, -1219, -2569, -4335, -5779]
14568e779K751K637o272J206k611o129l871k128Q383Q011O14J190j417k476M455
14553a436K62l858j083N118O50r336k588L436J932N64j152m91k070j94K084J081
14537g081k760O952L339J626l56J237l082k575k660k197l893k531K459N246j886
14522h162j402L592k517k398j22L358r39J432N571L285K162m517o20l319J818
14507b778j013n436j564k895j250Q491Q598l03o870k084m263K516K475n720K483
14492i613L012N94Q89m561o973L318Q434L689J957j379q337K919N294K057j037
14477B63k459m771k648K007J023J531K199M64k861K295M628r95n389o895J310
14462a0298J525p92l231L301L799j744M791l906j0308P176O34J347J917K410r38
$$ y = [-5779, -3028, -391, -6663, -5457, -8068, -14197, -18068, -20196, -11813, -3802, -3188, -1998, -3415, -5891, -1436, -1174, -5032, -6115, -997, -347, -9683, -12271, -8835, -6903, -6339, -7491, -7982, -10052, -10246, -8162, -7081, -9841, -2889, 450, 2076, 1720, 2957, -125, -2700, -5360, -7557, -11450, -13981, -11522, -6276, -8162, -9564, -5972, -8489, -10887, -11009, -7651, -8590, -7158, -1587, 1698, 3860, -657, -1277, -4596, -2778, -3791, -9227, -10791, -13686, -14936, -6445, 2153, 1850, -5020, -7104, -11367, -8851, -6376, -12096, -9613, -6601, -6007, -5118, -9679, -16652, -13334, -4900, -1211, 746, -633, -8970, -6051, -757, 1300, 263, -2196, -6967, -9615, -7608, -6585, -5054, -2855, -2391, -5252, -2957, 1671, 676, -4713, -11608, -10298, -8773, -9565, -12796, -9495, -5696, -7440, -2649, -6555, -16863, -9687, -9053, -7706, -5789, -3379, -4317]
14447d317r82k365j916M109O024L866k475l829M001o333k247q2l003n75J569l661
14431a2216n41M768p70M652O448q125k466L306K083N742p083m497O03j428L069
14416f455K878K454n432n109J673p05J352j555k703k854j558n813N817J883l171
14401a9298O198J144N826P169j730P21p37L747j943K143r63n777J850j265K98
14386b617J990L71K280K268k84J254j189j454K981r697m854M800l738j795Q335
14371a349l03k673J971L446K027k810l318L579K710n763j765m047M49K173M102
14356a571L822n395k514N63q18K902k905k764l724N047O54K79J248k690o962L185
14340a1643O90L98L661J886j332M5r8M25l190l843j854l44N486J529o900R14K406
$$ y = [-4317, -5299, -7664, -9580, -5471, 553, 4419, 1944, -1885, 2116, -4217, -6464, -6546, -9549, -10124, -8555, -12216, -12757, -7989, -8759, -4107, 2341, -5784, -8250, -4944, -2861, 2881, -4202, -8699, -8096, -9524, -6455, -3577, -1123, -6555, -11664, -9991, -10696, -9344, -10899, -13602, -16456, -18014, -23827, -18010, -16127, -19298, -13100, -11956, -6130, 1039, -691, 30, -707, 3040, 1097, 3240, 2277, -3500, -1650, -2915, -2617, -627, -256, 2024, 4292, 4008, 5262, 4073, 2619, 5600, -4097, -8951, -4151, -7889, -9684, -1349, -1652, -4325, -2354, 1092, 3119, 309, -3009, 570, 3280, -2483, -4248, -8295, -7846, -5673, -1571, 2251, -3144, -5658, -5095, -5913, -3011, -5916, -8680, -12404, -7357, -6703, -6424, -5176, -7866, -14828, -11643, -10953, -10555, -6894, -5008, -6340, -6295, -6393, -5968, -9158, -13001, -14855, -15199, -9713, -8184, -15084, -14170, -11764]
14323a1764L128K167j863J612k175o09k075M939L624N178k606m578m033M055N024
14308B4m979q65L80O869Q837n533j3178n357R606j392n902N072N044k616q230
14293a2220J539k249o17l538P87R640O972j107K37M238k425k676l204K377N272
14278C026q91J888q85k337o273n003k849K634J309l60J45L830l866K188M939m350
14262f855L35M822J11n162O762j235r528M51L364l819L426j417m357L028L550
14247f524P21J00l676J720O625l292j017n203p222K772l43m412n82j19l187Q818
14231a4821O209n48j609P896K197n220k595p67K346N243k161k601l488L14N80
14216i025Q46K642k666p04N499M584N444l05k200J283J828J554l284j322p33j489
$$ y = [-11764, -8636, -6469, -8332, -6720, -8895, -9504, -11579, -6640, -3016, 2162, -444, -5022, -9055, -5000, 24, -4955, -5820, -5440, 1429, 10266, 4733, -8445, -13802, -4196, -5588, -11490, -6418, -1374, -3990, -12220, -10681, -12930, -13547, -17085, -16298, -6658, 314, -793, -556, 3682, 1257, -1419, -4623, -2246, 3026, 2135, 4023, 3138, 801, -5472, -10475, -13324, -10690, -9381, -9741, -9596, -5766, -9632, -7444, -2505, -6855, -6520, -1698, -1587, -6749, 13, -1222, -10750, -10299, -6935, -10754, -7328, -8745, -13102, -10074, -6524, -5803, -5703, -9379, -7659, -1034, -4326, -5343, -10546, -17768, -14996, -15339, -19751, -20333, -20452, -23639, -14821, -8612, -9160, -10769, -2873, -676, -5896, -8491, -9258, -6912, -1669, -3830, -6431, -9919, -9605, -9025, -8179, -5537, -8203, -8907, -3408, 1176, 6620, 6315, 4115, 5398, 7226, 8780, 5496, 4174, 3441, 1952]
14200A952l584r42K740o665j787M264M161J332L426k788l19j856m395l690M20
14185g731K498o08K541Q66j348J371l720K445N093K170l468o139l445J07m73L942
14169e899P309O924K466k955o029j1919n381J1656N036n285J382O62j495L604
14155G6L829m122K20L610k44o73O12o30k344P64j466l932k888M352L234K512J821
14138D731l820n626n184m615J692M346J782j647L233j239O363J0360m649l804
14124A923m610l314K670J237l106K571r622M61l510k928J018P730M80m045j459
14109a4504L09O211k615m856n960N759J0189o47l624L646M473K209o974p651Q334
14094e701J517l310R698K91j241k744K46l46p405J095N29j091N685L544O952p191
$$ y = [1952, -1632, -2574, 166, -6499, -8286, -4022, 139, 1471, 4897, 2109, 1790, -66, -4461, -8151, -7731, -5233, -5841, -3300, -2434, -3782, -2411, -6131, -3686, 1407, 3577, 109, -6030, -9475, -9368, -9841, -5899, 1410, 8334, 10800, 7845, 1816, -10103, -15484, -3828, 1208, -4077, -2695, -2033, -3528, 76, 3905, -217, 3, 3613, 3369, 2696, 3308, 2678, 334, 1098, -368, -4300, -7188, -2836, 398, 2910, 4731, 911, -4715, -9899, -14514, -12822, -8476, -6694, -8341, -5108, -6347, 16, 10376, 5727, 1923, -2687, -6001, -3331, -2094, -5200, -2629, -12251, -11790, -15300, -18228, -17210, -9480, -9000, -13045, -14504, -14195, -7984, -10599, -15455, -21415, -15656, -5467, -6114, -9738, -6092, -1619, 590, -6384, -14035, -5701, -4184, -7494, 2204, 2495, 1254, -1490, -1244, -1590, -8995, -7900, -7371, -8462, -2777, 767, 7719, 528]
14078E28p065M500Q70j694K897p21M170K182o716o164R10j68m019L17j251l4L390
14061h068J012J264P43R360q142l280K663J733k654n770m342J448j401O425Q906
14046a03k843o1p38m701m834N337Q949l302p139n63K975q980L53m570o409M581
14030b2048K162L451O083M577P648k808p874J682O48k958L219Q06j243P97L191
14015b667N953j676J034K734k870r28M131K071j0077m890Q81M690J720k099J184
14000h09J464j190q47N61J509p22J007k484k381L191p04l713N297j523j05k88
13984a737K336K581m743m33m265j81%n780R761P36q345J322L531N641L442k179
13968A687l42n40k420J064l528M205L396o62K793k108j802m958k996M862L54K51
$$ y = [528, -6537, -2037, -1167, -2861, 36, -685, 3485, 5667, -1049, -7213, -6303, -6471, -10490, -10173, -11424, -11458, -8068, -7056, -5792, -5049, 4311, -3831, -7111, -4448, -2715, -5369, -11139, -15481, -14033, -15434, -9009, -103, -2946, -3007, -3745, -8446, -13280, -7943, 1006, -2296, -9435, -9998, -7023, -16003, -15650, -20220, -26629, -22048, -19886, -16435, -10352, -5775, 1873, -935, -8809, -7127, -6479, -9437, -6218, -5412, -6655, -5858, -2667, 3286, 1610, 2644, 5378, 2508, 1580, 5711, 7782, -2295, -7185, -6304, -1614, 106, -1993, -809, 655, -535, -1382, -821, 688, -34, 973, -1511, -3892, -701, -1405, -5118, 179, -1344, -1449, -1737, 599, 3180, -1563, -1996, -6261, -6442, -6442, -12222, -2461, -1725, -10070, -8748, -5217, 424, 3866, 1687, 1345, 805, -1615, -551, -4079, 126, 3522, 2860, 5653, 3545, 1743, -3215, -6211, -1349, -995, -744]
13952g44J38O464n08l742K782p547q887p4n0O23O278L160l037N453r27J227K213
13935B822K443R18k628m611r95j560M491K108l356o532P32o57L156l69n586L332
13919f292k212N863L89j3J51J503L956k84o313Q83N520j839k614k354Q2M195J342
13902A963M721o38J428p798j0336J453L178o727k113l787M643O807j872j229j920
13887a2227L08k330N356O07M274R716q14l466M07n04j455r92M543L337k795J011
13871D976R43l300M367M35l711p568K2M033M838L117n54j535n80m910q64m20p98
13854a509k95L755k227p551o910K244J1883O412K374j924k912K481J59k008j929
13839B043l970j286Q1L856K37m723r52K705J640k4L911r94P695L588j16j828L705
$$ y = [-744, -606, 5858, 5350, 1608, 4390, -3157, -12044, -12118, -12168, -11545, -5267, -2107, -5144, 309, -618, 609, 2822, 5265, 6183, 3555, -1056, -2051, -3611, 880, 2988, -368, -6900, -6168, -6825, -3669, -4038, -9624, -6292, -8504, -2641, -2252, -2265, -2114, -611, 3345, 3061, -3252, -2369, 3151, 1312, -1302, -3656, -3574, 621, 1963, 6684, 6046, 7474, -324, -10660, -9207, -6029, -12756, -14869, -18656, -14013, -7206, -9078, -10307, -12227, -11919, -14249, -8893, -8286, -4012, 5704, 4890, 1424, 1831, 1327, -128, -1120, 3423, 6760, 3965, 4976, 5919, 2619, 6986, 7421, 3710, -3858, -3836, 197, 5035, 8152, 7598, 6063, 5483, 573, -291, -711, -1509, -1804, 1951, -276, -7827, -14737, -12493, -610, 5802, 8176, 6252, 3340, 5821, 5980, 3972, 2043, -1927, -3213, -3132, 724, 961, -3762, -4714, -2009, -369, -393, 3518, 2524, 10219, 13807, 13691, 11863, 15568]
13822A5568Q936K863k395m89m794J117K322k764j504q71j933M400L746J531L120
13807B8853N117L157l772l817k425l48k484J2135M99j0661P11L836k676k094K603
13792B8634K652L889j871k256N870j819q590o858N929L243m424R66M142L411n366
13777B7552o528K011J493Q37p84j290k229J931l91K415M66q41K890K956J394l864
13761B8018o424j988m188l738J347q37J395K000k083K040j491n741o389J239Q728
13746A1888N628M854n212k940j415k126m873J512J850r320m185O013L567l27J445
13731F359O081K397M028p209r292l826n50J518K508j419J131M875O881L480n555
13716A1407l374p363j981J003O636J959o775m81K509k330n028j314M025N306L779
$$ y = [15568, 24504, 27367, 24972, 24483, 19689, 20806, 23128, 20364, 18860, 17989, 16056, 20456, 24202, 25733, 28853, 33970, 37127, 33355, 29538, 27113, 26765, 24281, 36416, 36915, 26254, 26965, 30801, 28125, 26031, 28634, 31286, 35175, 33304, 31048, 36918, 35099, 26509, 19651, 25580, 28823, 24399, 25365, 29507, 32918, 27552, 21024, 23035, 24528, 25365, 24581, 23291, 21062, 22993, 22602, 25017, 25483, 24642, 27532, 30488, 31882, 28018, 21594, 19606, 15418, 11680, 13027, 12190, 13585, 15585, 13502, 15542, 14051, 8310, 1921, 3160, 11888, 17516, 22370, 17158, 14218, 12803, 10677, 5804, 7316, 9166, -154, -4339, 1674, 5241, 4914, 6359, 12440, 14837, 18865, 11656, 2364, -1462, -2012, -494, 2014, 595, 1726, 6601, 13482, 16962, 11407, 8033, 670, -1311, -308, 6328, 8287, 1512, 1031, 3540, 1210, -3818, -5132, -1107, 4199, 7978]
13701G978p158k09L134k148K303N133m41M217o60j361m202j422M143k478o198
13686F31j644N77n244K784n235l657N378Q507m99n109R89k100m334j89J211O312
13670a622K376j958m415n477p19O844K248l047K347J795J359l121K400J014K722
13655B746j499l206N06k599K298M842o384n410k467L557P340k318L480L972N88
13640E446J900l32j65n364n4K564K681q02J610K198q13L96j204n381j63N147k75
13623G389K63m069p673j043L862K808k478Q614L296n531K157k628o196k260r040
13608a2529p056N401J1783j053L947M738k407j0936n470K592K382M198M28k38
13594d220m066K918P699N300o02J424j800n055m849K904M177O23l530l347m064
$$ y = [7978, 820, 611, 3745, 1597, 3900, 9033, 8592, 12809, 12149, 10788, 6586, 5164, 9307, 6829, 631, -1013, -436, -5680, -2896, -8131, -11788, -6410, 2097, 1598, -3511, -2522, -4622, -8956, -9145, -7934, -1622, 754, -1204, -5619, -11096, -11815, -4971, -2723, -5770, -3423, -1628, -269, -3390, -990, 24, 2746, 1247, -1959, -1453, -4052, -1754, 3088, -3296, -8706, -11173, -7616, -276, -2594, 886, 4858, 5446, 7346, 7014, 6849, 1485, 1431, 3995, 6676, 5874, 7484, 9682, 8869, 9265, 8061, 2680, 2517, 7664, 7389, 7652, 3583, -4090, -5133, -1271, 1537, -941, 7673, 10969, 5438, 7595, 4967, -1229, -3489, -12529, -19585, -14184, -2401, -3454, 493, 5231, 2824, -8112, -13582, -10990, -8608, -4410, -3982, -4220, -8286, -5368, 2331, 7631, 7029, 8453, 6653, 1598, -3251, -347, 3830, 4453, 923, -2424, -6488]
13579f488M053k505m367j713m542N751L435j748J338K666l364J702N777L325J008
13564D328M780j407j71R386P540Q6l198l356K792o310q385m407k907N83P681o33
13548F402R96M335J177o381j1288p51P455j212q77j372Q058k643k987J010L40
13533B262o132m04J070l407k054m59J055M707k057n173j747O592K103N333K265
13518C954l532l411n129K866M401Q152N349J357r90r611n380O99J999J969J39
13503B832m22j283N273k63l03J780m175J985m232j593N630m520j470J360N105
13488E704j107q54L335k968k597j358K438O186L129m927n918Q84J309p9J99n58
13472B818N792L470K380L514K296o061r441n031k804j672Q47j028j825L629k574
$$ y = [-6488, -2435, -4940, -9307, -11020, -15562, -9811, -6376, -8124, -6786, -4120, -7484, -5782, -5, 3320, 4328, 9108, 7701, 7530, 16916, 24456, 24542, 21344, 17988, 20780, 14470, 6085, 1678, -1229, -646, 7035, 6402, 7398, 11733, 12910, 6529, -4759, -5510, 1945, 733, -144, -1516, 6542, 3899, 912, 1922, 2262, -3870, -4274, -3204, -6611, -8665, -9124, -8069, -3362, -5419, -10592, -12339, -5747, -3644, 1689, 3954, 422, -2989, -8118, -5252, -851, 7301, 12650, 14007, 13017, 3406, -1974, -1275, 724, 2693, 2832, 2410, 1127, 6400, 6137, 5834, 7614, 3439, 5424, 1192, -401, 5229, 709, -761, 599, 5704, 4597, 3743, 7078, 4110, 1513, 155, 2593, 8779, 11908, 6981, 1063, 1947, 3256, 3177, 3376, 2818, 8610, 12080, 14460, 17974, 20270, 14209, 4768, -263, -3067, -4739, -3892, -4920, -6745, -3116, -5690]
13457e690k675q7L03P18M028j489K924j794L130M148K468J066L242K515j923j4808
13441c924l561K888N35L217n040j628j080J298k045m588J507P172O539N889o448
13426G31n190m354k993M634J0989M960o857p557n269k116l13M78N810R756j655
13411A054j858J649O411j776m242r08N009j927O20L92k91M671k481l232j996L206
13395D301m378K558P024O362m680n774j184q330l323p47M403L2M850J412p121
13380d595q20l072M57L876k916Q0O309K082l720q2j087k598P46K612M290J865
13364C427l516j225j521k691j986j748J158P320J580M521J227l0N837l172p952
13349A229k865M355J397o008n00J554q64L347N014K604L561R45r30k66No23k642
$$ y = [-5690, -8365, -8452, -8149, -7431, -3403, -4892, -1968, -3762, -632, 3516, 5984, 7050, 10292, 12807, 10884, -3924, -7485, -4597, -4062, -845, -5885, -7513, -8593, -7295, -9340, -13928, -12421, -5249, 1290, 7179, 731, -4459, -8813, -11806, -7172, 3817, 8777, 1920, -5637, -10906, -13022, -13335, -12857, -7047, 2709, 1054, -804, 845, 7256, 5480, 1238, 330, 5339, 3412, 4032, 4424, 4133, 8804, 6323, 3091, 1095, 4301, -77, 2481, 9505, 15867, 11187, 5413, 4229, -4101, -7424, -8171, -3768, -3736, 1114, 2526, -4595, -5415, -8487, -8030, -4154, -7070, -6990, -681, 1401, -2319, -2401, -3488, -6086, -5340, -2728, 1562, 3427, -89, -1314, -2835, -5526, -7512, -9260, -8102, -782, 798, 5319, 6546, 6516, 12353, 9181, 1229, -1636, 2719, 4116, -1892, -2392, -838, -1702, 1645, 6659, 9263, 12824, 13769, 12839, 12573, 12578, 11955, 9313]
13332I313l317l389k820M249L429M54K573N9m97N856j198m796m37k360l909Q91
13316D101L662J07m738l466j813J156K187J566K866p76J11K965J252l840n014
13301C26J921M666J487L219M8l931m626k051J350J395l646K175R472J096m613
13286H288N869n77n083J294M735K912J371k63j434j0057o838J107K403n543N508
13271C692n89Q12l40L297n58K005n57J134K66j819K03p301N89K457J673N118l36
13254I746j667k947l306K261R06q726P55M876M477k18M743O72m267q18j601p746
13238b860M747L699J266J680J304O661N52r713q09l885N606L277m793J71m3P255
13222A4115k840J69Q89M590N440j417j447M23O96l393Q7l211k377K754K772l2
$$ y = [9313, 5996, 2607, -213, 4036, 7465, 7919, 10492, 10551, 10054, 15910, 14712, 9916, 9479, 7119, 3210, 4101, 7763, 7870, 3132, -334, -2147, -991, 1196, 2762, 5628, 4852, 4963, 7928, 9180, 5340, 326, 2247, 6913, 8400, 11619, 11667, 7736, 3110, 1059, 2409, 3804, 158, 2333, 11805, 12901, 8288, 14157, 13580, 8497, 9791, 14526, 17438, 18809, 18546, 17112, 7055, 217, 1324, 3727, -1816, 3692, 3103, 3915, 3575, 6872, 6314, 8319, 7762, 8896, 9162, 7343, 7546, 245, 834, 3291, 4964, 10082, 9746, 8079, 5132, 1826, 4087, 4993, -3733, -2978, 1898, 6375, 6157, 10900, 11572, 7305, 6487, 4886, -2860, 1887, 5586, 6852, 8532, 9836, 16497, 17049, 7336, 6527, 2642, 8248, 11525, 6732, 6903, 6860, 14115, 11275, 11444, 12333, 16923, 22363, 20946, 19499, 19922, 20618, 17225, 17312, 14101, 11724, 14478, 17250, 17218]
13206A7218p502n229O309N097J260p207m349l323P297k839m898J341M298j71J936
13191I238l882j948p65k302J604O539m31J454P50K643M18o987J585M065o176J617
13175G422J633k890j912J04J473M63k708l549J079l017L449J5120N962k306p763
13160A2560K133R9m422o56M730k555j077J713n735k037J408o75o93l024J28M555
13144F452r9n33l738J669R575Q398m035l141J335J112M706l128n285m087k129
13129G072M734N516L295L693O09Q31o668j373o81k52K952n123m180j0573k120
13114b268K208K455M507K147k425j713Q703P660q35n436m175n98L687M946j645
13099A7218p112j424l469N005L250M774k221J112J42n18r63K23j799L039O340
$$ y = [17218, 9716, 4487, 10796, 15893, 17153, 9946, 5597, 2274, 9571, 6732, 1834, 3175, 7473, 7302, 9238, 5356, 3408, 2643, 341, 1945, 8484, 8053, 9507, 10257, 12900, 13318, 6331, 7916, 11981, 5805, 7422, 9055, 6165, 4253, 4357, 5830, 6293, 3585, 36, 1115, -1902, 1547, 16667, 22629, 20323, 12560, 14693, 14792, 10370, 9714, 14444, 11889, 10812, 12525, 6790, 4753, 6161, 5486, 4793, 1769, 1897, 6452, 6353, 5820, 2082, 3751, 13326, 21724, 17689, 14548, 15883, 16995, 21701, 18573, 13288, 9201, 7072, 11806, 17322, 20617, 24310, 24919, 25750, 19082, 17709, 17028, 16776, 19728, 14605, 10425, -148, -2268, -60, 2395, 6902, 9049, 6624, 4911, 13614, 21274, 20439, 15003, 10828, 10230, 13917, 18863, 17218, 10106, 8682, 5213, 10218, 13468, 18242, 16021, 17133, 17275, 16757, 15794, 16017, 14218, 17257, 23597]
13084B3597K033j250m728j186j214m297K181k98J934J386k060o373o082P857L751
13069A5251M085Q33k079k285p246m25M211J22J385l290l808K989N526P02o23L91
13053A5739N58o126l785k988m858M602J0637k089k617K876J156j0220o196R740
13039F429Q133K373M252O699K281j322K7L749M030p46J968J832L625Q99J4510
13024E8739O244L007O501M64R974J6541L3833M0886N2841P3008Q3180Q6462Q2382
13011E54062P3870N4934J9662p944k8315n4251p0915p4916p6820o1441n2099m9110
12999B26717l1207k1783k0234p873m625m590j714o409j8895o000q916l614R30
12986I1787l41K818l817j3266j658M918m095l3o25m963l753k019N405J677o554
$$ y = [23597, 25630, 24380, 19652, 18466, 17252, 12955, 15136, 14838, 16772, 18158, 16098, 9725, 3643, 11500, 15251, 19336, 20169, 18090, 15805, 8559, 8134, 12345, 12467, 13852, 10562, 6754, 9743, 15269, 15971, 15348, 15739, 16297, 10171, 6386, 3398, -1460, 3142, 13779, 11690, 9073, 11949, 13105, 2885, -3311, 6429, 14562, 16935, 21187, 27886, 30167, 28845, 28872, 32621, 36651, 35905, 37873, 39705, 43330, 44229, 58739, 64983, 67990, 74491, 74955, 84929, 101470, 135303, 176189, 229030, 302038, 385218, 471680, 554062, 627932, 682866, 702528, 694584, 666269, 612018, 541103, 466187, 389367, 327926, 275827, 226717, 195510, 173727, 153493, 145620, 140995, 136405, 134691, 128282, 109387, 103387, 94471, 90857, 91787, 91446, 94264, 90447, 77181, 75523, 80441, 76346, 76313, 75688, 70725, 66972, 64953, 70358, 72035, 65481]
12971F5481n827Q47K698J545m03J287Q93L659j679o340J765n007J162L23n319
12956E5085q19J399o363n698j149K702M850K97p242r329k604K907J238M000L302
12941D2576j154j853J644L05L49m48J630m649J11k166O651M373n562k979Q0j234
12925C7674j05J533L671Q29P00r54l669m912j042j259O045P897p11O325K51K273
12909E4546M487O996J0580J1501k808m609k628n203o792j4246j3395j6125j3252
12896I052k770q917j4309o987K224O074L542L720O627J0468O579l12j271K032
12882A5752L89M76M78K027P024q040k908L754l206r487j555O057M85o49m879n576
12866A42J805r92J607Q024K556J451N94M696O192J3621R044N476Q293Q1L936O569
$$ y = [65481, 59654, 60501, 63199, 64744, 64341, 65628, 66521, 70180, 68501, 62161, 63926, 58919, 60081, 60404, 55085, 54266, 55665, 49302, 43604, 42455, 45157, 50007, 50304, 43062, 33733, 31129, 34036, 35274, 39274, 42576, 41422, 39569, 41213, 41518, 41867, 41419, 43049, 38400, 38511, 36345, 42996, 47369, 41807, 38828, 38908, 37674, 37569, 39102, 42773, 43602, 44302, 43348, 39679, 34767, 33725, 32466, 38511, 46408, 45697, 52022, 52273, 54546, 59033, 66029, 76609, 88110, 85302, 80693, 78065, 72862, 66070, 51824, 38429, 22304, 9052, 6282, -2635, -16944, -23931, -21707, -15633, -12091, -8371, -1744, 8724, 15303, 14991, 13720, 15752, 16141, 16617, 17095, 19122, 26146, 18106, 15198, 18952, 15746, 6259, 4704, 10761, 11246, 10597, 5718, 142, 1947, 955, 2562, 10586, 13142, 14593, 15187, 19883, 26075, 39696, 48740, 54216, 62509, 62590, 66526, 73095]
12850G3095J924K237J2002O303j98j324p140n261j639K035j085j000l6K774L065
12835H5752j801o307k203m583l973l864m752j078j151j2207n345j725k274l034
12821C1455J803j2744o571K415R368Q140k570r046N88N892N971L561k530j056
12807C4676L252k208l412L895Q31j0104k048q53m837p584O429P149k741n414o67
12792A6364m812R69R040L442Q128P302N687L485Q509M064N323J3010J5087J0423
12778A06021Q112r78k271l838q82M95Q99l125o124K640l397n985K154n78K143
12763I5286N276L984R639j237k223Q57J170K284L748k253l191O443l90r037l153
12748A07203q785n450P014J109k248Q230j68Q37j637l92K116Q428J7145J2289
$$ y = [73095, 75019, 77256, 89258, 95561, 95363, 94039, 86899, 81638, 79999, 82034, 80949, 79949, 79913, 82687, 85752, 83951, 77644, 75441, 70858, 66885, 63021, 58269, 57191, 56040, 43833, 38488, 36763, 34489, 31455, 33258, 20514, 13943, 16358, 25726, 33866, 31296, 22250, 22838, 28730, 34701, 38262, 35732, 34676, 37928, 35720, 32308, 36203, 37034, 26930, 24882, 24029, 19192, 11608, 18037, 25186, 22445, 17031, 16364, 11552, 12521, 21561, 25003, 33131, 40433, 46120, 49605, 58114, 62178, 67501, 80511, 95598, 106021, 114133, 113155, 110884, 107046, 106164, 106659, 107558, 104433, 98309, 100949, 97552, 91567, 93721, 93143, 95286, 100562, 104546, 114185, 112948, 110725, 111582, 112752, 115036, 118784, 116531, 113340, 119783, 119393, 110356, 107203, 98418, 92968, 99982, 101091, 98843, 107073, 106905, 107742, 106105, 105713, 107829, 116257, 133402, 145691]
12734A45691P662M942M225O970J7702J5912J7743L5099M1433M8389O9953Q6044
12722E01765R4912Q8654P6272P2288N8878K4439l983k9095n1129p2069q5228o9037
12710F06667o5766m9750l3205l4389l3555j2523n185l526n43Q593K056p094o235
12697C65545k433n400o617j0627n173o007o286r543n387p262m688J575L785R219
12683C10701J918Q6Q060J716M886O091N366Q618m471j0311p07K692L83N646Q507
12668C49181N172l030J934j28M61M864L447j974l243n366K06j624L75M165O700
12653C61140J2496J3626P99K198R590J2965J9471R373L729J1189J3381J7713J6128
12640E03798J6290R764J4565J8472K1347Q026N397K1056L6157L3823L7394L3446
$$ y = [145691, 153353, 158295, 162520, 169490, 187192, 203104, 220847, 255946, 297379, 345768, 415721, 501765, 596677, 685331, 761603, 833891, 892769, 917208, 913225, 884130, 833001, 760932, 675704, 606667, 540901, 491151, 457946, 423557, 390002, 377479, 372294, 368768, 368225, 376818, 378874, 371780, 365545, 363112, 357712, 351095, 340468, 335295, 329288, 323002, 313459, 308072, 300810, 296122, 297697, 301482, 310701, 312619, 312705, 320765, 322481, 327367, 333458, 338824, 347442, 342971, 332660, 331953, 334645, 335028, 340674, 349181, 354353, 351323, 353257, 353129, 353590, 358454, 361901, 359927, 356684, 351318, 351524, 349900, 350275, 354440, 361140, 373636, 387262, 388061, 390259, 399849, 412814, 432285, 441658, 445387, 456576, 469957, 487670, 503798, 520088, 529852, 544417, 562889, 584236, 592262, 597659, 618715, 654872, 688695, 726089, 759535]
12628G59535M0889M5726N0894N1130N4626O0590O2336P2937P7080R1174J12837
12617A479754J23395J41139J63392K01249K45642L04571L84888M71830N63980
12608D079840O56511P39599Q12946Q95215R68664J085204J296443J689506K376563
12599A4600491L560409N427634P974084J0869229J3508777J5258021J5998067
12592H7196712J5514068J3269667R219429M177392j018538o049250j0374131j3325313
12584I8610036j4320071j3843523j2537656j0620205q087431n614683l809580
12577B9776887k670474j989312j586991j354845j232094j156250j105577j067038
12569A7614306j002484r27821q64007p90378p00328o21842n64957n13871m68462
$$ y = [759535, 800424, 846150, 897044, 948174, 1002800, 1063390, 1125726, 1198663, 1275743, 1366917, 1479754, 1603149, 1744288, 1907680, 2108929, 2354571, 2659142, 3044030, 3515860, 4079840, 4736351, 5475950, 6288896, 7184111, 8152775, 9237979, 10534422, 12223928, 14600491, 18160900, 23588534, 31562618, 42431847, 55940624, 71198645, 87196712, 102710780, 115980447, 125199876, 129377268, 128358730, 122309480, 111935349, 98610036, 84289965, 70446442, 57908786, 47288581, 39201150, 33586467, 29776887, 27106413, 25117101, 23530110, 22175265, 20943171, 19786921, 18681344, 17614306, 16611822, 15684001, 14819994, 14029616, 13329288, 12707446, 12142489, 11628618, 11160156]
12560A1160156m27953m02681l68934l40954l09591k92008k75821k51899k34803
12551H255512k07485j83940j65665j48503j15226q7008p4017p5681r5185j40615
12541F962187j84389k10295k28564k32617k19285k08608j92309j76945j59503
12532E149672j53595j40380j33504j32558j21050j15967j21326j16237j10768
12523D004287j05372r9778r1751r0617p9258p1281p2975o4650n8502o3496o4800
12512C141807o1985m8412m6423m1623m3780m1388m0888l9831m1642l5923k9862
12501B670050l0623k4017j0251n475l316m071o105J715M305N034J3610J3065J8175
12488B642096K1414L0102K7428L5906K8819K2686J6170M164j6743l4784m7974
$$ y = [11160156, 10732203, 10329522, 9960588, 9619634, 9310043, 9018035, 8742214, 8490315, 8255512, 8048027, 7864087, 7698422, 7549919, 7434693, 7347685, 7273668, 7197987, 7102802, 6962187, 6777798, 6567503, 6338939, 6106322, 5887037, 5678429, 5486120, 5309175, 5149672, 4996077, 4855697, 4722193, 4589635, 4468585, 4352618, 4231292, 4115055, 4004287, 3898915, 3799137, 3707386, 3616769, 3537511, 3466230, 3393255, 3328605, 3270103, 3206607, 3141807, 3079822, 3031410, 2984987, 2943364, 2899584, 2858196, 2817308, 2777477, 2735835, 2699912, 2670050, 2639427, 2615410, 2605159, 2599684, 2596368, 2592297, 2586192, 2587907, 2592212, 2597246, 2610856, 2623921, 2642096, 2663510, 2693612, 2721040, 2756946, 2785765, 2808451, 2824621, 2828785, 2812042, 2777258, 2729284]
12477B729284n5770o4690p5428p9784o9041n4777l6324j5309Q458K6730L9453
12466B352802M7490M9244M0969L2635K2205o857l8401n6721p3804r1488j00485
12455B177589r7504r8587r2412q4974p3557o8468o1580m7038l6808l2748l9582
12444A444331m0211l0682k3687k8417l4535l2814k7510k5206j7263k5437k3348
12433A135221k6572l1183k5633j9866j6316k0453j6315j5134j5161j9262k2553
12422I06773j7261j2557q466j2647j7309k2503k2089j4500j4634j2983j5303k3623
12410G12898j7007j4752j3802j1711j3179j5068j0783j1885j7888j8248k0188
12399E48387j1721j2999j1337j0410J792M233K742K457n274r097r520o072n040
$$ y = [2729284, 2673514, 2608824, 2533396, 2453612, 2384571, 2329794, 2293470, 2278161, 2286619, 2313349, 2352802, 2400292, 2449536, 2490505, 2523140, 2545345, 2538488, 2500087, 2443366, 2369562, 2278074, 2177589, 2080085, 1981498, 1889086, 1804112, 1730555, 1662087, 1600507, 1553469, 1516661, 1483913, 1444331, 1404120, 1373438, 1349751, 1321334, 1286799, 1253985, 1226475, 1201269, 1184006, 1158569, 1135221, 1108649, 1077466, 1051833, 1031967, 1015651, 995198, 978883, 963749, 948588, 929326, 906773, 889512, 876955, 868489, 855842, 838533, 816030, 793941, 779441, 764807, 751824, 736521, 712898, 695891, 681139, 667337, 655626, 642447, 627379, 616596, 604711, 586823, 568575, 548387, 536666, 523667, 512330, 501920, 503712, 507945, 510687, 513144, 507870, 498773, 489253, 483181, 478141]
12386D78141q425m837o710j3276o27Rj2317n109r111r361r056m811m164j0226
12372C80120n135n450p093p001l607m380M399J75o743j92j798l000l541J79k274
12357C34659K259L467n78o327l026l511o349j88p237j3375j0212M50o426q394
12343B75212q686q835j799M74j293m883o470J631N252p292r989o375p323j988
12329B17636j033K45o576p568J676L230L15j337L487J934k889n231j474R42p377
12314A95980j706j861o486l108m385o489n186m299q385L242O616m883r980k831
12300A46239K95M174o208j1216N682Q819j819p42N515L806k756j52Q439M584M012
12285A68672J586m670l537q983j8988j5176m827p896l107j1314j3272j3078n662
$$ y = [478141, 469716, 464879, 458169, 444893, 444266, 444275, 431958, 426849, 417738, 408377, 399321, 394510, 390346, 380120, 374985, 369535, 362442, 355441, 351834, 347454, 351853, 352028, 345285, 345093, 343295, 340295, 336754, 336933, 334659, 336918, 340385, 339807, 333480, 330454, 326943, 320594, 320406, 313169, 299794, 289582, 290032, 283606, 275212, 266526, 257691, 255892, 256366, 255073, 250190, 243720, 245351, 250603, 243311, 233322, 226947, 219624, 217636, 216603, 216848, 210272, 202704, 204380, 207610, 207925, 206588, 210075, 212009, 209120, 203889, 202415, 203357, 195980, 194274, 192413, 185927, 182819, 178434, 171945, 166759, 162460, 154075, 157317, 163933, 159050, 149070, 146239, 146534, 150708, 144500, 133284, 138966, 147785, 145966, 145224, 150739, 154545, 151789, 151637, 160076, 164660, 168672, 170258, 165588, 162051, 153068, 134080, 118904, 114077, 106181, 103074, 91760, 78488, 65410, 59748]
12272E9748o1K864N095l29k956J651j65M068J495j010M080j371k946k818l528
12257F3817o71O677P6p271m65p152m371m225m798l036P076N348J17J221n149n030
12241D2164M894k179p52Q489N514j025J741m537r963M128M77m318l900O65j494
12226C9904J199L419r55j65l347o156m185K487L818O77o09P121M467k938r522
12211C5215m444K457J501o520j970o06J817j29K45N746K614n531K50K658K908
12196C6211P57k991Q785J882k500o702j811Q997M064j31o322n59N728R29M36J65
12180D6938M566Q632M122P643P652J5465L105J3760K7860L7240N1142O7021P7140
12167C72286Q7249Q4836Q1345N6240K6700J289k7078m7691o6777p1186q0090p3552
$$ y = [59748, 59687, 62551, 67646, 67317, 64361, 66012, 65847, 69915, 71410, 70400, 74480, 73109, 70163, 67345, 63817, 63146, 69823, 69899, 62628, 62163, 55011, 50640, 46415, 41617, 38581, 45657, 51005, 51122, 52343, 47194, 42164, 47058, 44879, 44127, 52616, 58130, 57105, 58846, 54309, 44346, 48474, 48951, 44633, 40733, 41398, 39904, 41103, 44522, 43567, 43402, 40055, 33899, 29714, 32201, 36019, 36696, 36087, 43208, 47675, 44737, 35215, 30771, 33228, 34729, 28209, 26239, 25633, 27450, 27321, 27566, 33312, 35926, 30395, 30645, 33303, 36211, 36968, 33977, 42762, 44644, 42144, 35442, 33631, 42628, 46692, 46561, 40239, 39680, 45408, 46337, 46773, 46938, 51504, 60136, 64258, 71901, 79553, 95018, 98123, 111883, 139743, 176983, 228125, 295146, 372286, 459535, 544371, 625716, 681956, 708656, 709945, 682867, 635176, 568399, 497213, 417123, 343571]
12155C43571n3614m1547l7093k7057j2959r720p052q221j2546j3287k794J492
12143A19173q697j4984n469n67k535l663P38n625r19o471o433l384K69K67K492
12128F4192k394n037J638N983K429l089l655k119j946N086R00O320l833p181L025
12113F0319J419j3118o647J02L049j256q671j269J043o930n061O191M087L355
12099C6613j181m925J849J857M381J54l627j044M245K712j345K356m177k197Q84
12084C6555j112K300j528J1K694m0m691J481M722M536K161P424J3906J0029K2183
12069A00631J4694M358N017M404n96j677m911j3532r972n501n946j7153j1718
12056E8098p496n034n782L787L14K788l063m974k513o14K685l382m302l920K401
$$ y = [343571, 289957, 248410, 211317, 184260, 171301, 161581, 154529, 146308, 133762, 120475, 117681, 119173, 110476, 95492, 90023, 89456, 86921, 83258, 83996, 78371, 77452, 70981, 64548, 61164, 61433, 61700, 64192, 61798, 56761, 58399, 64382, 66811, 63722, 60067, 57948, 56002, 61088, 61988, 68308, 64475, 57294, 60319, 61738, 48620, 41973, 42075, 45124, 43868, 35197, 33928, 34971, 28041, 22980, 29171, 33258, 36613, 35432, 30507, 32356, 34213, 38594, 38748, 35121, 34077, 38322, 41034, 39689, 42045, 37868, 35671, 36555, 35443, 37743, 36215, 36226, 38920, 38880, 34189, 35670, 40392, 44928, 47089, 54513, 68419, 78448, 100631, 115325, 119683, 124700, 129104, 128508, 126831, 121920, 108388, 98416, 92915, 86969, 69816, 58098, 50602, 45568, 39786, 43573, 43887, 46675, 43612, 38638, 36125, 35511, 38196, 34814, 30512, 26592, 28993]
12041B8993q36L991l940m894m404R67M183r19j016l015j199n829M641k929j626
12026A2168j476L424M077J57k844K587l502k741M3q95m125K315M521L230N24N038
12010B2501l18q510l865n381K574L17L833j308j311l207j043o64J37o67o145M262
11994A205O341m52O10K598K73p9L142K999o181K679P68l063l602L883j420J975
11978A1676p675m478j88m287j232j229j055M579M063L178n139k825J29j348K024
11963c807o961J633P484O338M489m451j944l676M804J058J432k113l701K304R73
11948C862J55J237J891n753j65J394k196N63k362r77o38K404m75j142o343q817
11932a7362J0011J1943K982m931J29o418r04N610O115L395o68n872n127M387L30
$$ y = [28993, 28157, 32148, 28208, 23314, 18910, 19877, 24060, 23141, 22125, 19110, 17911, 12082, 16723, 13794, 12168, 10692, 14116, 18193, 18350, 15506, 18093, 14591, 11850, 11893, 10998, 6873, 9188, 13709, 16939, 17463, 22501, 22183, 13673, 9808, 4427, 7001, 7318, 11151, 9843, 8532, 5325, 4282, 3618, 3755, 3088, -3057, 1205, 7546, 7094, 7704, 10302, 10575, 10496, 13638, 16637, 10456, 13135, 13903, 10840, 7238, 11121, 9701, 11676, 4001, -477, -665, -4952, -6184, -7413, -8468, -3889, 174, 3352, -1787, -4612, -4483, -5831, -3807, -10768, -9135, -1651, 4687, 9176, 4725, 2781, -895, 3909, 4967, 6399, 4286, 585, 2889, 3862, 4017, 5254, 7145, 1392, 1227, 2621, 425, 988, -1374, -2351, -2989, -585, -1060, -2202, -8545, -17362, -7351, 4592, 7574, 2643, 2772, -3646, -4550, 1060, 7175, 10570, 9902, 4030, -1097, 3290, 3620]
11917C620Q23l404m825o2n760j843O582Q290Q89j075M95n48O57M063l725k668
11901A509N11P89J952R80n776K002n125k959J452l132K40l83Q63Q636O344Q38
11885H741k210Q192O080r293j1571k636N103k709l107k744O75L859M433n62l290
11870a039M587p82j717m273k619K686O03Q135j057O720k58q961o71Q41L874J087
11854G156J777O832L138m203m115m723n695l741L45J675L399J737j654p1o93q96
11838B68k415n796L194N42n365J884M026J5j793o288n537L301N761J834L264k779
11822e884K518J387O826N057l905q008k447M273L159n953o407j554J356M017L928
11807a637k08l299l245K129k154Mj218M328O903j848m259j716L393R8k245l471
$$ y = [3620, 4443, 1039, -3786, -3848, -9608, -11451, -4869, 3421, 4310, 3235, 3730, 3182, 3839, 7902, 4177, 1509, 2020, 2809, 4761, 5741, -35, 1967, -3158, -6117, -4665, -7797, -7557, -7940, -7077, 1559, 7903, 8741, 6531, 14723, 20803, 11510, -61, -2697, 2406, -303, -3410, -6154, -5479, -1620, 2813, 2251, -1039, 3548, 2766, 1049, -3224, -5843, -3157, -2554, 5581, 4524, 11244, 10986, 2025, 1354, 2195, 6069, 7156, 8933, 15765, 18903, 14700, 10585, 5862, 167, -3574, -3229, -1554, 1845, 3582, 1928, 1857, 1164, 268, -2147, -7943, -4749, -4207, -9572, -7688, -3662, -3647, -5440, -11728, -17265, -13964, -8203, -6369, -3105, -5884, -3366, -1979, 4847, 9904, 5999, -2009, -4456, -183, 2976, -2977, -9384, -10938, -9582, -5565, -1637, -1845, -5144, -8389, -6260, -8414, -8410, -9628, -5300, 1603, -245, -4504, -6220, -2827, -2729, -4974, -8445]
11791h445K21M929Q26m61K689K464k398p28J789%K314k083j996o374m244l10L130
11774h677K622N751L837k63k282L874k370q8L31k484m615k276J152K142M141k583
11758a788n864L746o65M059l16k3N89m788j16J861k924l11J872l69k359r54J268
11741g082K771K913K045j232q019L00P572J46P51L407q98p418R21O588j747n675
11725d657o617K614J742L91M44J146Q85K523k892l378L153M052k821j290K277
11710b428M14J080n919J838m26K922P971j515m870m082M350M025n373m450n70
11695g033P350M974Q01m77r41k999m795p432P31O515N647l508J349L263L24n351
11679a582j750J391n029o721N061J574J282k825r81J7K272l088j226M209N015
$$ y = [-8445, -8224, -3295, -2469, -2930, -241, 2223, -175, -903, 886, 886, 3200, 1117, -879, -7253, -11497, -11807, -8677, -6055, -304, 3533, 3270, 988, 4862, 2492, 2404, 2735, 251, -4364, -6640, -5488, -3346, 795, -1788, -7652, -3906, -4571, -512, -828, -851, -262, -5050, -5166, -3305, -6229, -6540, -4668, -5037, -7396, -8350, -7082, -4311, -1398, 647, -585, -8604, -8304, -732, -586, 165, 3572, 2674, -4744, -3823, 2765, 1018, -4657, -11274, -8660, -6918, -6527, -6083, -4937, -4052, -1529, -4421, -7799, -4646, -594, -3415, -4705, -2428, -2014, -934, -6853, -5015, -5441, -2519, 5452, 3937, -933, -5015, -665, 3360, -2013, -6463, -7033, 317, 5291, 6092, 5615, 4674, 1675, -3120, -10552, -9821, -3306, 2341, -1167, 182, 3445, 3769, -1582, -3332, -1941, -6970, -13691, -8630, -7056, -5774, -8599, -9580, -9563, -7291, -10379, -11605, -7396, -2381]
11664b381o78k495k15L220l856L77j378J485M362r85k343M150R99J484p34o190
11648e178l642J54J304l25O374N741k719k438j449J548k2O056J664l080n973q75
11632b860L247K733j983m799n479L467K91K303R71j132J446k823q58K480L376
11617C80K686M44o98j151m110K265Q38l411J300Q50Q0M904L402o965K88l141n856
11600g895N837k528n543J638Q778j802K719R40m872k351K175k824j219L58L267
11585c322m21l540J031J351Q453P267n637o544J599j371o030L137P871L894r950
11570b212l455n9N844O730J786j737m998m659j060l072l83k068m18Q45J927L375
11554c614k578j211M712Q131j151Q07l991k081O98J505O140P01l786l910j913
$$ y = [-2381, -3059, -5554, -5769, -2549, -6405, -6028, -7406, -5921, -1559, -2544, -4887, -737, 262, 1746, 1012, -5178, -8820, -8666, -7362, -7687, -1313, 4428, 1709, -729, -2178, -630, -652, 5404, 7068, 3988, -1985, -2860, 387, 3120, 1137, -3662, -9141, -5674, -5383, -3080, -2109, -3241, -1795, -4618, -5476, -2996, 380, 3066, 3510, 2812, 1661, -2449, -184, 654, -2757, -1457, -607, -527, 4377, 7779, 814, 1102, -2039, -7895, -2058, -4586, -10129, -8491, 287, -1515, 1204, 2144, -2728, -5079, -2904, -5728, -6947, -6589, -3322, -3743, -7283, -6252, -4901, 3552, 10819, 5182, -1362, 237, -1134, -7164, -4027, 3844, 7738, -2212, -5667, -5726, 118, 6848, 8634, 6897, 1899, -2760, -3820, -6892, -7275, -9343, -9761, -8916, -6989, -3614, -6192, -7403, -2691, 5440, 4289, 5096, 1105, -976, -278, 1227, 7367, 8068, 4282, 372, -1541]
11539a541L363l21K606L623n620k240o213K556R240J50o673o999J209L470M917
11524A527M014k284l19k883O295L219J345k81o012j216k265k376J927k52K533
11509B972K101k475o782J621M267M976J004n845j3307n025n598m368R817M231
11495a2411P882N08L575l334p809J571K51l713K193K43L773m266M580K324l777
11480h410n255o359M132J1904J204j035k752K779N776M838k133j458k39m843R17
11465i34O769N570M247P24K486L476m905m377k489j087j1431m375N20J08L807
11450a891J848K882L715L486J068l69k064R56K626J443k367j569n108m955L048
11435B749O317L240l3n323k802J518q46k363m96j517J923J991p048j076r65L100
$$ y = [-1541, 1822, 1501, 4107, 7730, 2110, -130, -6343, -3787, 5453, 5603, -1070, -8069, -6860, -3390, 1527, 5541, 3257, 2938, 55, 6350, 9569, 10914, 10633, 4621, 3405, 1140, -1236, 691, 439, 2972, 5073, 2598, -4184, -2563, 1704, 6680, 7684, 1839, -11468, -16493, -22091, -26459, -16642, -12411, -4529, -4021, -446, -3780, -11589, -10018, -9767, -13480, -11287, -11044, -7271, -11537, -6957, -4633, -8410, -13665, -20024, -15892, -3988, -2784, -3819, -6571, -3792, 1984, 6822, 4689, 3231, 2992, -1851, -934, 5835, 11405, 15652, 16376, 18862, 22338, 17433, 13056, 10567, 9480, -1951, -6326, -5806, -5698, -1891, -43, 2839, 6554, 10040, 11108, 10739, 8675, 9631, 12257, 13700, 11333, 9764, 4656, -299, 2749, 9066, 12306, 12273, 6950, 4148, 5666, 4820, 2457, 1961, 444, 2367, 4358, -2690, -3766, -4731, -1631]
11419a631J215l442k446L598Q123K567j227J859j119m94k472j468m598p629R03
11404h261O579l010N26L059P728Q702m18l184K844n007p609n521n489L679R925
11389D543j053j501j323j1902m943N047N867K476M492L463o805L877O464K348
11375A1050J74n084r241K439J80K636K943L331j271J931O624K727o552k244q515
11360A128K765P595J016j591M46J18m248j850K538m865l499L763j095k320L759
11345C660P544J345J373J372o82j1782n710j19N551J467M899O81m148j177J390
11330E664j459m93K83M411l86K612O40l863L967K596L722m329m123M99K061L394
11314A5196J84j281j656n370n191L353O901k00k916P4m552J173O465k64l597N123
$$ y = [-1631, -416, -3858, -6304, -2706, 5417, 7984, 6757, 8616, 7497, 7003, 4531, 3063, -1535, -9164, -8261, -1682, -4692, -4166, -1107, 6621, 15323, 14905, 11721, 14565, 9558, 1949, -3572, -9061, -5382, 4543, 3490, 1989, 666, -11236, -16179, -11132, -5265, -2789, 1703, 5166, -1639, 2238, 8702, 11050, 11224, 6140, -3101, -662, -482, 2154, 5097, 8428, 7157, 9088, 15712, 18439, 11887, 9643, 1128, 3893, 11488, 12504, 10913, 11359, 11477, 7229, 5379, 7917, 3052, -447, 3316, 2221, -99, 3660, 11204, 12549, 13922, 15294, 14612, 2830, -2880, -2999, 2552, 4019, 8918, 9599, 5451, 4274, 5664, 4205, 3712, 3995, 8406, 8020, 10632, 11272, 7409, 11376, 13972, 17694, 13365, 9242, 9741, 11802, 15196, 15380, 14099, 12443, 7073, 1882, 5235, 12136, 11936, 9020, 9094, 4542, 5715, 12180, 11916, 8319, 13442]
11298A3442K447n267p833K081N991N178L314L893o030m135K52O619K506o50n237
11283A6571j54J026m371q6l583j897Q726l920j453j065k773k800O356N643m85
11268A5735P12l739m000j284J317J069p45l099M212M340J095M668q39k716J888
11253A8614l479j197l574K315J361K548J351j54M356k898k557L67R79m873M765
11238A7924J1127l960l628J752j141j2695l912N564k99K117m232l05P902Q639
11224B4853O50k852K315m188K62L846O54N002L41M732j506N45N491L401L701M784
11208E2031n30o407N56L5k814J884o641J180j293N200M990L604O916P94J532M928
11192F5965O371k556o413J397j501O24J379M915M054l335k333j621m693l747J930
$$ y = [13442, 15889, 10622, 2789, 4870, 10861, 16039, 19353, 23246, 17216, 13081, 13333, 19952, 22458, 21808, 16571, 16417, 17443, 13072, 12986, 9403, 7506, 16232, 12312, 10859, 9794, 7021, 4221, 10577, 16220, 15735, 16447, 12708, 8708, 7424, 8741, 9810, 9065, 5966, 10178, 14518, 15613, 20281, 19442, 16726, 18614, 15135, 13938, 10364, 12679, 14040, 16588, 17939, 17785, 22141, 19243, 16686, 17053, 18032, 13159, 17924, 29051, 25091, 21463, 23215, 22074, 9379, 5467, 11031, 10732, 12849, 8617, 8312, 16214, 24853, 25503, 22651, 24966, 20778, 21040, 24886, 25540, 30542, 30883, 35615, 34109, 34654, 40145, 43546, 47247, 52031, 51501, 45094, 45650, 45685, 42871, 44755, 38114, 39294, 38001, 43201, 48191, 51795, 58711, 59505, 61037, 65965, 72336, 69780, 63367, 64764, 63263, 63887, 65266, 70181, 74235, 70900, 68567, 66946, 62253, 58506, 60436]
11177F0436M237O072l52m5l710m563n279j213j012m491k539J30L474J546J906
11162E4597l204n453k537j26J282O679k041l819r25O91J225k089O154L177R20
11147E4531k618r942J859l699m263J1514P315k888p924r004m811L051j830J923
11133C3214N327K122j2205r228%J1390M805L214n771n854M687K331L968L921j869
11118D0052J97n179l638k315j582l720L104Q958M223K008L085J2857Q295K899
11104F9244k618l468R45M04q022p967p482j987k786P83P937l8K303K318P27n155
11088D5138m902o127r169O65k700N23O695N341J891m333K354L410O163j290R47
11073D4606p76o740l40p96k11R7O926L017j287J085q203O79n685j280k335M451
$$ y = [60436, 64673, 70745, 70393, 70348, 66638, 62075, 56796, 55583, 54571, 50080, 47541, 47671, 51145, 52691, 54597, 51393, 45940, 43403, 43277, 44559, 51238, 49197, 45378, 44453, 45144, 46369, 44280, 50434, 53611, 54531, 51913, 41971, 43830, 40131, 35868, 47382, 54697, 51809, 43885, 34881, 30070, 33121, 31291, 33214, 38541, 40663, 28458, 19230, 19230, 30620, 35425, 38639, 32868, 27014, 31701, 34032, 38000, 41921, 40052, 40249, 35070, 31432, 29117, 27535, 23815, 26919, 35877, 40100, 42108, 45193, 58050, 66345, 69244, 66626, 63158, 64103, 64507, 56485, 48518, 41036, 39049, 36263, 37046, 44983, 44945, 47248, 49566, 50293, 45138, 40236, 34109, 24940, 25605, 22905, 23428, 30123, 35464, 37355, 33022, 35376, 38786, 44949, 43659, 44606, 43830, 37090, 36750, 35954, 35743, 35840, 42766, 45783, 44496, 45581, 37378, 38057, 32372, 31092, 28757, 33208]
11057C3208K631o73P23J20n584l820N775N25l625N114Q201J1439J4015O481M946
11042G9476r8o469n735n374p178o623l556M90M99K889ol122o351p555l466k333
11026B5488n55N0K122j161j2790k973J46m104l262M871N604L642N142L871L915
11011C0006K48O252R185Q35j442j302j739m804p227J413m06k961k329r46l08J74
10995B4649m487K667N738M8j012j325r761k124J0872M871N088O407O006r49l885
10980D2803p473l442k365K381M41o553N509J179K662l877K863K074j582J563M610
10965D0793N849O158O322J408K709l446j470J37Q988P488Q732J2338J0377K0768
10951A27151L0695M2073O0953R6039J60023K53266L47027L70605K47113n1383
$$ y = [33208, 35839, 35166, 35889, 36009, 30425, 26605, 32380, 32905, 29280, 34394, 42595, 54034, 68049, 74530, 79476, 79378, 72909, 67174, 61800, 54622, 47999, 44443, 44933, 45432, 48321, 48315, 45193, 38842, 31287, 27821, 25488, 24933, 24983, 27105, 25944, 13154, 10181, 10327, 6223, 2961, 7832, 13436, 17078, 22220, 26091, 30006, 30254, 36506, 45691, 46526, 45084, 43782, 42043, 37239, 30012, 31425, 31019, 28058, 25729, 24783, 24475, 24649, 20162, 22829, 28567, 28615, 27603, 26278, 16517, 14393, 25265, 30136, 35224, 41631, 47637, 46688, 42803, 35330, 31888, 29523, 31904, 32345, 25792, 31301, 32480, 35142, 31265, 34128, 36202, 34620, 36183, 40793, 46642, 52800, 59122, 60530, 63239, 59793, 58323, 58460, 67448, 74936, 83668, 96006, 106383, 127151, 157846, 199919, 260872, 356911, 516934, 770200, 1117227, 1487832, 1734945, 1683562]
10941A683562l41792l72342k64040j66836j05494p1925m9884l1573k5596j8524
10931B35556j6652j1511r259o540j1683r070k887o490j2042r172J682o610j768
10918A33554K83j0072k239j06K9j624p149n240L215r954m68M735l791j0596K207
10903I2784K287L297l633n055M598J0090K285o166o700o007J1404P930q741j5986
10889H2387j198M40m650k805j173m368N45M109k608L094k449n923k577p60M299
10874F6363J433o311j088M062J242O318J109m146O09K550r75n013l61j884m689
10859E9219o499n022P332Q800O242N958l753l040p242m984M292L990P326J1477
10845H4096K944P707J4672J2108O946P944N189M086l902j8945k9196l5879n1094
$$ y = [1683562, 1341770, 969428, 705388, 538552, 433058, 361133, 311249, 279676, 254080, 235556, 218904, 207393, 198134, 191594, 179911, 170841, 167954, 161464, 149422, 140250, 141932, 135322, 133554, 133837, 123765, 121526, 121420, 121449, 119825, 112676, 107436, 110651, 100697, 100229, 104964, 101173, 90577, 92784, 95071, 98368, 94735, 89680, 94278, 104368, 106653, 100487, 93787, 87780, 99184, 107114, 98373, 82387, 81189, 81629, 76979, 74174, 73001, 68633, 69178, 73287, 70679, 73773, 71324, 65401, 62824, 62064, 66363, 67796, 61485, 60397, 64459, 65701, 72019, 73128, 68982, 69591, 72141, 71166, 66153, 65792, 63908, 59219, 52720, 47698, 55030, 63830, 70072, 76030, 72277, 69237, 61995, 57011, 61303, 65293, 72619, 84096, 87040, 94747, 109419, 121527, 128473, 136417, 141606, 145692, 141790, 122845, 93649, 57770, 6676]
10832F676l3498q959N041J4656M56j5065j0676L246J7554J5009J5152J6470J5868
10819D1930J1698K451J786M594m621m083l515j871o214m457k358n859k526J806
10805B8761J328L807q294n922O602K24K511L609L593O128P093J0546Q906N968
10791G4860J674J1069P733O869J909P546J1452Q596R343j052N140Q586k431j1004
10777A40290P935J5193p386p316l15j1450j7778k0686j0996M42R240j819j0262
10764H5092r850p471k313n568M993L945n016j0646l633n658j916p843n036j072
10750B8008L627Q602J2160N881J1779J3308N344M681J0560J2648J3014J079k0471
10737A10220k7831j2801j7465j9380j3825r067L228J1389P411L258N355q32j484
$$ y = [6676, -26822, -35781, -30740, -16084, -15628, -30693, -41369, -38123, -20569, -5560, 9592, 26062, 41930, 53628, 56079, 57865, 62459, 57838, 53755, 50240, 48369, 42155, 37698, 35340, 29481, 26955, 28761, 30089, 33896, 25602, 19680, 26282, 26506, 29017, 32626, 36219, 42347, 49440, 59986, 68892, 74860, 76534, 87603, 95336, 102205, 104114, 111660, 123112, 131708, 141051, 139999, 145139, 153725, 151294, 140290, 148225, 163418, 156032, 148716, 148401, 136951, 119173, 98487, 87491, 87933, 97173, 95354, 85092, 75242, 67771, 65458, 59890, 64883, 68828, 63812, 53166, 49533, 43875, 41959, 34116, 29080, 28008, 31635, 40237, 52397, 58278, 70057, 83365, 88709, 93390, 103950, 116598, 129612, 130691, 110220, 82389, 69588, 52123, 32743, 18918, 9851, 13079, 24468, 31879, 35137, 40492, 39660, 38176]
10724C8176J313O204N828O298Q816J3568K0141K7085M0955L2765J7252Q842j3823
10711B13420j5358j0782j3168j5367j5813o527k194j694O506l741k722N279L488
10698A41327k114n895L523R114O584J455J882L923n907j0903j1413p466J1248
10685A35358K1304J5003P57o19j1908j5930j6752l191N448P219Q505K088J0536
10672A57818J1642O246N376l193N019K5594K4688K4459K2085J5922K6829M8749
10660C71234O9942R1037J24623J97946K85533K67714J75787J35839J07429r738
10650A817346j80723k95946l00081k35694j29360n3352k5195k6184j8715k519
10640E49577L338J404K061m462N149R229p321o913q364j7093j0755n113o749j7974
$$ y = [38176, 39489, 45693, 51521, 57819, 66635, 80203, 100344, 127429, 168384, 201149, 218401, 227243, 213420, 198062, 187280, 174112, 158745, 142932, 136405, 134211, 132517, 139023, 135282, 132560, 137839, 141327, 139213, 133318, 136841, 145955, 152539, 153994, 155876, 159799, 153892, 142989, 131576, 124110, 135358, 156662, 171665, 172422, 171803, 159895, 143965, 127213, 124022, 129470, 136689, 145194, 147282, 157818, 169460, 175706, 181082, 177889, 182908, 208502, 233190, 257649, 279734, 295656, 322485, 371234, 441176, 532213, 656836, 854782, 1140315, 1408029, 1583816, 1719655, 1827084, 1817346, 1636623, 1340677, 1040596, 804902, 675542, 622190, 596995, 570811, 552096, 549577, 552915, 554319, 556380, 551918, 557067, 566296, 558975, 552062, 543698, 526605, 515850, 510737, 503988, 486014]
10626D86014j0564r501j005o404p754q089M83J6119K1705J5739J5516J3714J1126
10613E37099R630P478q125j0191j2603j2081k772N834J942m871j908N742N105
10600E20279N95O372R791P069K369R304k462p958J590N903P981J3247J2907j0784
10586E76203m148j434M036J1751K1584M3977L6964L4397J9966M788R154L0444
10574G87682N2876M9545K4863o693k4010q714J9157L0923M1878M9946P1314P8805
10562A167572O4353N6147M7657N1829Q7815J21876J42844J38720J19552J19648
10552B118013J49836K03105K58773K89867K91818L35529M59471O08847P30933
10543E446192P87316P44335N97607M64548O02607R47127J311195J722494K288116
$$ y = [486014, 475450, 465949, 464944, 458540, 450786, 442697, 443180, 459299, 481004, 496743, 512259, 525973, 537099, 546729, 554207, 546082, 535891, 523288, 511207, 508435, 514269, 516211, 511340, 509432, 515174, 520279, 520874, 527246, 537037, 544106, 546475, 555779, 553317, 545359, 546949, 552852, 560833, 574080, 586987, 576203, 572055, 570621, 574657, 586408, 607992, 651969, 688933, 723330, 743296, 748084, 757238, 787682, 840558, 890103, 914966, 908273, 884263, 875549, 894706, 925629, 967507, 1017453, 1088767, 1167572, 1231925, 1288072, 1335729, 1387558, 1475373, 1597249, 1740093, 1878813, 1998365, 2118013, 2267849, 2470954, 2729727, 3019594, 3311412, 3646941, 4106412, 4715259, 5446192, 6233508, 6977843, 7575450, 8039998, 8642605, 9589732, 10900927, 12623421, 14911537]
10534A4911537L129602M375857O242926R136630J4085439K2932465L7612880N7120698
10526A69548034P0561508O1321497K2728773l8520897p3608085o2334625m0231190
10519A09465015k4980456j6093573j0861743p619380n563579m246163l362058
10512C6738063k710398k149639j667737j300798j014832q71001r13256j086159
10504B5024243j177090j137417j077442j008185q81277p04733n60935o00376p84047
10495A7092741q59344p48054o33624n51574n02052m62424m35950l80727l24308
10486A2194684k87748k63256k43833k29603k24280k08781k13166k32775k71557
10477A0019685k91157k82123k58142k32607k40776k69716k75942k59927k33725
$$ y = [14911537, 18041139, 22416996, 28659922, 37796552, 51881991, 74814456, 112427336, 169548034, 240109542, 301431039, 324159812, 285638915, 212030830, 149696205, 109465015, 84484559, 68390986, 57529243, 49909863, 44346284, 40100121, 36738063, 34027665, 31878026, 30210289, 28909491, 27894659, 27023658, 26110402, 25024243, 23847153, 22709736, 21632294, 20624109, 19742832, 19038099, 18477164, 17876788, 17092741, 16233397, 15485343, 14851719, 14300145, 13798093, 13335669, 12899719, 12518992, 12194684, 11906936, 11643680, 11399847, 11170244, 10945964, 10737183, 10524017, 10291242, 10019685, 9728528, 9446405, 9188263, 8955656, 8714880, 8445164, 8169222, 7909295, 7675570]
10468G675570k02532j78446j74011j77389j86624j88605j82949j82153j61212
10459F041649j50112j52936j46161j42890j33105j24498j20128j05234q8762q1088
10449D796735q2750p7189p2178p1201p0651n5270n6621n2605n7788o3485o2080
10438D074917o3801n1016m8067m2259l0580j7817Q68J7800J4254O297K672O585
10426C869853J0193J3643K9611L7502M0031N4912Q1780J00376J10751R5269M5198
10415D489119k8267j12517j58594j64799j67564j64702j43240j18284j10390r0067
10405C230695o2412j0770Q4252J82734K08532J73727J37181J18124Q5353J9963
10395D167379r8673j89050k31769k34245k07155j89555j67992j40239j10125j00318
$$ y = [7675570, 7473038, 7294592, 7120581, 6943192, 6756568, 6567963, 6385014, 6202861, 6041649, 5891537, 5738601, 5592440, 5449550, 5316445, 5191947, 5071819, 4966585, 4877823, 4796735, 4713985, 4636796, 4564618, 4493417, 4422766, 4367496, 4310875, 4258270, 4200482, 4136997, 4074917, 4011116, 3960100, 3912033, 3869774, 3839194, 3821377, 3822245, 3840045, 3854299, 3860596, 3863268, 3869853, 3880046, 3893689, 3923300, 3960802, 4000833, 4055745, 4137525, 4237901, 4348652, 4443921, 4489119, 4460852, 4348335, 4189741, 4024942, 3857378, 3692676, 3549436, 3431152, 3320762, 3230695, 3168283, 3157513, 3241765, 3424499, 3633031, 3806758, 3943939, 4062063, 4147416, 4167379, 4068706, 3879656, 3647887, 3413642, 3206487, 3016932, 2848940, 2708701, 2598576, 2498258]
10385B498258r5388p2866m7667l8227m4230n2179n7005m3001l7352l9794l9479
10374A931070m4201m4203k8320k1996l6802m9125n3768n6370l8606k6338k8490
10363A502851k3755k2701k5815l3018k6477k3058k4356j7920j9831k3269k4563
10352A238088k2657j8444k1995k0647k5135k3072j7019j9310j8430l1849l3888
10341I85642l1238l2686l6978l5251l4464m0526l4349j0386R062K1598J7701P151
10329G85276j227j2836j4994j1868p891r887l184p550j5755j6379l957L435k610
10316F80573j2143j6613j6471j2895j9061k1965j4086r419j3755p248r867q987
10304E18063k893j626K125K618M672P555J007k723L926L275k160j944k87k399
$$ y = [2498258, 2402870, 2330004, 2282337, 2244110, 2199880, 2147701, 2090696, 2047695, 2010343, 1970549, 1931070, 1886869, 1842666, 1814346, 1792350, 1755548, 1706423, 1652655, 1596285, 1557679, 1531341, 1502851, 1479096, 1456395, 1430580, 1397562, 1371085, 1348027, 1323671, 1305751, 1285920, 1262651, 1238088, 1215431, 1196987, 1174992, 1154345, 1129210, 1106138, 1089119, 1069809, 1051379, 1019530, 985642, 954404, 921718, 884740, 849489, 815025, 774499, 740150, 729764, 738826, 760424, 778125, 785276, 784049, 771213, 756219, 744351, 736460, 726573, 723389, 715839, 700084, 683705, 679748, 683183, 680573, 668430, 651817, 635346, 622451, 603390, 581425, 567339, 557920, 544165, 536917, 527050, 518063, 515170, 513544, 515669, 518287, 522959, 530514, 531521, 528798, 532724, 535999, 533839, 531895, 531608, 529209]
10290E29209j78o853K709p627p124q853j2912k3173j7074m516p856j6463p775
10277D11514p694m654j6110j1040M782K23j1247r867m538n20k206q013j936n763
10263C32931l970L46l569l617l587L364L848l700j3966n117j633j481K331j860
10249C00320J428j183q100p039o379L010m998n97m91n942p286q465q407q423l238
10234B34210j2207j3432k960J1035L563J465R956J2789J0649R408J1999L392j1530
10221B68337l889j823r71P190J872j7592k1775l3360m5983m3217k0376k30J2771
10208A00954J2863J1719K962L454J0278J5747R464R570J7135K9323N4231P1247
10196C48947R7789R9705P2037R703o2126r6795r7842p6703m1746l1792k4043j7549
$$ y = [529209, 529031, 522178, 524887, 517260, 510136, 501283, 488371, 465198, 448124, 443608, 435752, 419289, 411514, 403820, 399166, 383056, 372016, 376798, 377021, 365774, 355907, 351369, 350849, 348643, 340630, 338694, 332931, 328961, 329307, 325738, 322121, 318534, 321898, 325746, 322046, 308080, 302963, 301330, 299849, 302180, 300320, 301748, 300565, 292465, 285426, 279047, 282057, 277059, 276462, 275971, 270029, 262743, 254278, 245871, 237448, 234210, 222003, 208571, 205611, 216646, 220209, 221674, 231630, 244419, 255068, 264476, 276475, 279867, 268337, 264448, 262625, 261654, 268844, 270716, 253124, 231349, 197989, 152006, 108789, 88413, 88183, 100954, 113817, 125536, 128498, 131952, 142230, 157977, 167441, 177011, 194146, 223469, 277700, 348947, 446736, 546441, 618478, 628181, 566055, 469260, 371418, 294715, 252969, 221177, 197134, 179585]
10184A79585o138p800j5371n672j240p229N679k108m339j991l869p968N34M49
10170A22522l296Q35p073k801k686j273L959j426k583n186n821m797n010n798
10156G9566K4Q54K244j659p879q2N448j867J616N851Q00n229n920q607r52k010
10140F2198M53J150P86P920k864j206Q84k006o836P09M318J128K563K401n098
10125F6500n56N236L686J419O004J480J2510J2906K347k35M937k246L09K166M134
10110A20597J9314J6883K3408L6032N0950P8374J24121K06401L15119L84453L16746
10099A692398Q2258k47534l84081l09027j95100j17701q5092n4217m0518l7586
10089C03800k3092j3504j8494j3808j4732j5624j3440L084J091o49j5540j7274
$$ y = [179585, 173447, 165647, 150276, 144604, 143364, 136135, 141814, 139706, 135367, 133376, 129507, 121539, 122073, 122522, 119226, 120061, 112988, 110187, 107501, 106228, 110187, 108761, 106178, 100992, 95171, 90374, 85364, 79566, 79590, 80444, 82688, 81029, 73150, 73068, 78516, 76649, 78265, 84116, 84916, 79687, 73767, 65160, 64208, 62198, 62651, 63801, 64587, 72507, 69643, 68437, 69321, 67315, 60479, 61188, 65506, 66634, 69197, 71598, 66500, 65944, 71180, 74866, 76285, 82289, 83769, 96279, 109185, 111532, 111297, 116234, 113988, 114297, 116463, 120597, 139911, 156794, 180202, 216234, 267184, 345558, 469679, 676080, 991199, 1375652, 1692398, 1774656, 1527122, 1143041, 834014, 638914, 521213, 436121, 381904, 341386, 303800, 280708, 267204, 248710, 234902, 220170, 204546, 191106, 194190, 195281, 194632, 179092, 161818]
10077A61818n146k314q677p053j591k843k949n29o137j6124j1160q791l432N798
10063I0870R881L238J600j157m518o894q426l619L146R798l819j0255K163P569
10049H9577L132n493j222l403q323n132m196m41l67l541L33j324J547L309J908
10034F6364o351Q99P189J0425R192K0170K3928K3089J5277r890m4311k9281j6187
10021G0513n892l705q605r068l17R40N661k359M85m278l260j736m971m556M999
10006C3851J6154k442o440m742M241m195K129N385O370q65j1905q636O711O980
9992D2596n07M62o3m806m400n863L777O341m347l811o00J827J618k347k356j719
9976B5802L750P75J02j972m482l040M772j825j705m908M4K362L566k724k469N757
$$ y = [161818, 156672, 154358, 145681, 138628, 137037, 134194, 131245, 130716, 124579, 108455, 97295, 88504, 85072, 90870, 100751, 103989, 105589, 104432, 99914, 93020, 84594, 80975, 84121, 93919, 90100, 79845, 82008, 89577, 92709, 87216, 85994, 82591, 74268, 69136, 64940, 64499, 64132, 60591, 60924, 59600, 61147, 64456, 66364, 60013, 60912, 68101, 78526, 87718, 107888, 131816, 154905, 170182, 160292, 115981, 86700, 70513, 64621, 60916, 52311, 43243, 42926, 43866, 49527, 47168, 47653, 43375, 40115, 38379, 33408, 28852, 33851, 50005, 47563, 41123, 36381, 40622, 36427, 38556, 43941, 50311, 49446, 37541, 28905, 35616, 42596, 42089, 42551, 42488, 37682, 33282, 27419, 31196, 37537, 33190, 29379, 28779, 30606, 32224, 29877, 27521, 25802, 29552, 30327, 30429, 28457, 23975, 20935, 25707, 23882, 22177, 17269, 17313, 19675, 23241, 20517, 18048, 23805]
9960B3805j535n907K87O907o165l470K390K738J497P420K029J334k372r857m247
9945A4854j109N294L382k40L222o502q125K893l020q188L351L157K059P16j204
9930A0540O080r45j370m030q52K712N606j02k829L644K547p687J365q24K29m639
9914I445k263l353J761N691j239l271N560J268l822r151J711M035K419K27m939
9899D079m124J564j354P180R772j242o988o541L203J0189K20l712l509P79N738
9884A5254m095k310j03m557M437K570K023J749n12R75o18N389L168q107q828k920
9868C515n040j562Q13M70j391j274L046M92l701j588P357J706j028L075L329o454
9852A765k077N6k05o220N21L378J851J325L360O106k517m282K072k061k46N57
$$ y = [23805, 22270, 16363, 16650, 23557, 17392, 13922, 16312, 19050, 20547, 27967, 29996, 31330, 28958, 19101, 14854, 13745, 19039, 22421, 22181, 25403, 18901, 10776, 13669, 10649, 2461, 5812, 8969, 11028, 11744, 10540, 16620, 15675, 14305, 10275, 9423, 12135, 17741, 17639, 14810, 18454, 21001, 13314, 14679, 13855, 14084, 9445, 7182, 3829, 5590, 11281, 10042, 6771, 12331, 13599, 9777, 626, 2337, 6372, 8791, 9018, 4079, -45, 1519, 165, 7345, 17117, 15875, 8887, 2346, 5549, 15738, 15958, 12246, 8737, 9516, 15254, 11159, 8849, 8746, 4189, 8626, 11196, 13219, 14968, 14456, 15431, 14813, 20202, 23370, 15263, 6435, 3515, -1525, -3087, -2274, -1804, -3195, -4469, -1423, -931, -4632, -6220, 1137, 2843, 1815, 4890, 8219, 1765, -312, -256, -461, -6681, -6160, -2782, -931, 394, 3754, 9860, 7343, 3061, 5133, 3072, 2826, 3383]
9836C383K470P007Q08j131N862O99n584J285R746Q481m142p696k000n559M40K549
9820A6618o90j536J072k739k605p304P409j507q310L29Q073L227o413n489R07
9805A042k878J0157Q243M040J879p476p647l658J8m028k952J001L439J0006L180
9790A4366m739m031j920O418k584n355l11N007n45l082K832K583n066l599L347
9775C321J702m284L914j530m149K458k383J707M757l409m720L562M449j620O584
9760A0359m248q134M063M491j556K489O37j157n695J150P339K914k347k449P242
9745A5098M817o71o976p920n835j086j739r53m153M452O509L353o1n834j1926
9730a2925q42k01J544J1311P248Q04p407k430k258l245j080M976o373O301P90
$$ y = [3383, 5853, 12860, 13668, 12537, 18399, 19098, 13514, 14799, 24545, 33026, 28884, 21188, 19188, 13629, 14069, 16618, 15928, 14392, 15464, 12725, 10120, 2816, 10225, 8718, 408, 737, 8810, 12037, 5624, 135, 1042, -1836, 8321, 16564, 20604, 22483, 15007, 7360, 3702, 3720, -308, -3260, -2259, 1180, 11186, 14366, 9627, 5596, 3676, 10094, 7510, 2155, 1844, 6851, 6306, 3224, 6056, 8639, 3573, -26, 3321, 5023, 739, 4653, 3123, -1026, 1432, -951, 756, 5513, 2104, -2616, 946, 5395, 3775, 10359, 6111, -2023, 2040, 6531, 4975, 7464, 8101, 6944, 1249, 2399, 9738, 12652, 10305, 7856, 15098, 19915, 19244, 12268, 4348, -1487, -2573, -4312, -5265, -9418, -4966, 1543, 4896, 4835, -999, -12925, -13767, -13968, -12424, -1113, 6135, 6939, -468, -2898, -5156, -8401, -9481, -4505, -10878, -4577, -3787]
9715c787k823j998N545O76Q66N614k520J235p749m494k517K426k026L567K411
9700e574k785Q60Q62K187O855k537O87R789J465r406r330l690L092O619O760p739
9684a885q689K19Q367K196j63l087L489Q120J122l431l851k208j114K261J437
9669B783N494m449o57Q39O39L535L13n026L794P549o638o136j565n621L285N954
9653D093j326j574j216J547J04k100l132K03k8j356J98Q751m434m180Q896K370
9637F816m123k717l761j127O556M379k072r494MJ366L614j441n50K132R162n849
9621B895n313J796L894O86M484k478l304J21L011P571O420m736j1030n467n911
9606g361J989M182J463O592M724R21k496j040P041l438p069l489p524k463O40
$$ y = [-3787, -6610, -8608, -3063, -2387, -1521, 4093, 1573, 2808, -4941, -9435, -11952, -9526, -11552, -7985, -5574, -8359, -7499, -6637, -4450, 2405, -132, 555, 10344, 11809, 2403, -6927, -10617, -7525, -906, 5854, -1885, -10574, -10355, -1988, 208, 45, -3042, 447, 8567, 9689, 6258, 2407, 199, -915, 1346, 2783, 8277, 3828, 3171, 4010, 4649, 8184, 8497, 3471, 7265, 14814, 8176, 2040, 475, -5146, -1861, 4093, 2767, 1193, -23, 1524, 1628, -472, -3604, -3401, -3429, -4785, -4587, 4164, -270, -4450, 4446, 6816, 2693, -24, -3785, -4912, 1644, 6023, 3951, -5543, -5539, -4173, -559, -2000, -2550, -418, 8744, 2895, -2418, -622, 3272, 3958, 8442, 5964, 2660, 2781, 5792, 13363, 19783, 15047, 4017, -1450, -7361, -5372, -1190, 273, 6865, 11589, 12510, 10014, 8974, 16015, 12577, 5508, 2019, -5505, -7968, -7328]
9591g328j262J016L946j656r02O981O073K523n325K4K013M355K73m607j293N495
9575A0326K82l026j84N541m458o306K78K364k63J143n830o80M289P359O478n434
9559A1879j1487l535P376R767J585j0294j151O457l30m60l053l223l370J762K567
9544D490n54j457k720K665k984j759l186J759L779N581N05K971J798o607q37K386
9528E830m509p817J255Q573M429N85l71J094N518J634o257m898j069k112k435
9513e50L373Q5l215J882M563N129m6n161j655n1M50M761L691k985l509K909K38
9496I909m231J568J824P88l302o89M630K049l113p571M191M092m575m020K004
9481C554K102j666p654n66J342J602J795L353J651j580m76Q219O014n59Q76o974
$$ y = [-7328, -8590, -7574, -3628, -5284, -6186, 795, 6868, 9391, 4066, 4090, 6103, 10458, 10731, 6124, 4831, 10326, 10608, 7582, 7398, 12939, 8481, 2175, 2453, 4817, 4554, 5697, -133, -813, 3476, 10835, 17313, 11879, 392, -3143, 4233, 14000, 15585, 5291, 4140, 10597, 10267, 9807, 6754, 3531, 161, 1923, 4490, 3936, 2479, -241, 2424, -560, -2319, -5505, -3746, 33, 5614, 6119, 9090, 10888, 4281, 3444, 5830, 1321, -6496, -5241, 3332, 7761, 8346, 7975, 9069, 14587, 16221, 9964, 5066, 3997, 1885, -550, 2823, 2908, -307, 1575, 6138, 11267, 11221, 6060, 4405, 4354, 4804, 9565, 13256, 10271, 6762, 9671, 9909, 5678, 7246, 9070, 9858, 6556, 5867, 10497, 12546, 9433, 1862, 6053, 10145, 5570, 1550, 3554, 5656, 3990, -3664, -4230, -2888, -1286, 509, 3862, 5513, 3933, 3457, 11676, 17690, 17131, 18007, 11033]
9465A1033p769K326M244K983L568L770m961Q4N550N840j572n550o070o279o32
9450F565L691J176M254P208K86l047M054J845l821q227l258k901J754M05N056
9435A5040R946j474q626r798k495O169R819L512O92m160k879l358j361j1609O287
9420E705R933m318m426K80N89p175J45Q643O204N520K524m343J899L858k096J882
9404B4824m741o501L298L405r45l127L039N648o303n056N326o74p310l968j850
9389E065N645l018Q05k480j956M810J354l071m892M288Q909N518n14p146o399
9374F918J096k989K77J099q21k12M521Q075J492o12j761J053J1961j779p666J24
9358B0776m470n77p7K344L588M181m160N957n90n671l322k837L064J205k64m72
$$ y = [11033, 3264, 5590, 9834, 12817, 16385, 20155, 15194, 15278, 20828, 26668, 25096, 19546, 13476, 7197, 6565, 10256, 11432, 15686, 22894, 23180, 20133, 24187, 26032, 22211, 13984, 10726, 7825, 9579, 9984, 15040, 24986, 23512, 14886, 5088, 2593, 8762, 18581, 22093, 22785, 18625, 15746, 12388, 11027, -582, 5705, 15638, 11320, 6894, 7174, 7763, 588, 733, 9376, 15580, 21100, 23624, 19281, 21180, 25038, 22942, 24824, 20083, 13582, 16880, 20285, 19340, 16213, 19252, 24900, 18597, 13541, 18867, 18193, 10883, 6915, 5065, 10710, 7692, 8497, 6017, 4061, 8871, 10225, 7154, 2262, 6550, 15459, 20977, 20463, 13317, 6918, 8014, 5025, 5302, 6401, 5580, 5368, 9889, 17964, 19456, 18844, 17083, 18136, 30097, 28318, 20652, 20776, 16306, 15729, 15652, 17996, 21584, 25765, 21605, 27562, 26972, 21301, 17979, 15142, 18206, 19411, 19147, 18675]
9342A8675l108n789O793L255m519j775O473L521m250m569Q15M486J095n167n690
9327A0246n089P14O590k344l507q22O388L531J672n82k880o0J366N109M572K243
9311B7147n487r554K56M498L831L965P478l919k595k096l29k067p193J691P411
9296B3037K700L094l137P08K907l145j872K755q67r820k47K594n49K543m24R5
9280B0372M243K256K189l483J839L193m63p926j608J1245J0320k935m425l216
9266C1601l198N13j472L861J377N431n74M152N28m451j1655k883L39J91M778P53
9250B9291j409J453l345J941O811K063M589l442r329k768j416O011l571n619k904
9235A8356o651n468N748N281N293O775l716J67K030K955P84n06J629p53L731Q406
$$ y = [18675, 15567, 9778, 16571, 19826, 15307, 13532, 20005, 23526, 19276, 14707, 15522, 20008, 21103, 15936, 10246, 5157, 5871, 12461, 10117, 6610, 5788, 12176, 15707, 17379, 16797, 13917, 13857, 15223, 20332, 24904, 27147, 21660, 12106, 12362, 16860, 20691, 24656, 32134, 28215, 25620, 23524, 23195, 21128, 13935, 15626, 23037, 25737, 28831, 25694, 26402, 29309, 26164, 24292, 27047, 26180, 16360, 16113, 18707, 18158, 20701, 20277, 20372, 24615, 26871, 29060, 25577, 27416, 30609, 30146, 22220, 20612, 31857, 42177, 39242, 34817, 31601, 28403, 28916, 27444, 31305, 32682, 38113, 37539, 41691, 42219, 37768, 26113, 23230, 23569, 23760, 28538, 29291, 27882, 29335, 25990, 27931, 34742, 36805, 41394, 37952, 28623, 25855, 24439, 30450, 26879, 21260, 18356, 11705, 6237, 11985, 17266, 22559, 29334, 25618, 25785, 27815, 30770, 31554, 31048, 32677, 31924, 35655, 44061]
9219D4061K037l364j210r20P139N541n371k269L028l181o305k897o75l868J339
9204C3085J10n23N324p50m405p69N582j952R37l585r10L877J302m493l440M770
9188C4160N791m707M96J135L391m12k126n162J649K328N208j447j646j854L130
9173C9934l033J886K40O603O469R28L649M625o659q244o911j989k598l842O262
9158C7320J215l854N196J769j04j971l743q50R151l494o269K459J950K900n523
9143C6152k227k447J218M179m372Q64k628Q62L227j246J80k148J146Q044Q111
9128D8915L420n682o158j1476j832J0392J3523J389M408J008j3254o935N542N999
9114D9259J364K327L189J503o301j985p98j419O372M337M603L11l264l650K820
$$ y = [44061, 46098, 42734, 41524, 40604, 47743, 53284, 47913, 45644, 48672, 45491, 39186, 36289, 35614, 31746, 33085, 33195, 32672, 37996, 37246, 32841, 32072, 37654, 35702, 36639, 33054, 32144, 36021, 37323, 32830, 29390, 34160, 39951, 35244, 35740, 36875, 40266, 39854, 37728, 32566, 34215, 36543, 41751, 40304, 38658, 36804, 39934, 36901, 38787, 39027, 45630, 52099, 53027, 56676, 61301, 54642, 46398, 39487, 37498, 34900, 31058, 37320, 38535, 34681, 39877, 41646, 41542, 39571, 35828, 34978, 44129, 40635, 34366, 36825, 38775, 41675, 36152, 33925, 31478, 32696, 36875, 32503, 33367, 30739, 31601, 34828, 33582, 33762, 31614, 32760, 40804, 48915, 52335, 46653, 40495, 29019, 27187, 37579, 51102, 52491, 56899, 57907, 44653, 37718, 43260, 49259, 50623, 52950, 56139, 57642, 51341, 49356, 48558, 47139, 53511, 57848, 62451, 62762, 59498, 55848, 58668]
9099E8668p269q548p06M758O127P36J304q5P038K82N001k596n516p30k565r50
9083E4949k085m576L148K61M816M688l883j0335j870J52Q599N605q564N96k002
9068D9499J304L926j526M761L468N581J655N292j106J343K341k792m396L898k422
9053G0826l312O093J3258M276p529n390p44K05p41q401p847l807l565M057Q16
9038E8195n761j258k291p949L201J0443l014k358N191M899K741J681k225l798
9024E7697o448j775K267P846M265L609n89k139p48L734N427n44J719J939M595
9009H0855K099P33L54l317L588Q247N394M166L28K171J962k446K44m848l620J340
8993I7250J612M630J748L565m343Q31l997j726M443P83k427m949n244K137Q088
$$ y = [58668, 51399, 42851, 42145, 46903, 53030, 53766, 55070, 54985, 62023, 62305, 67306, 64710, 59194, 58464, 55899, 54949, 52864, 48288, 51436, 51697, 56513, 61201, 57318, 46983, 45113, 45265, 53864, 59469, 50905, 51501, 49499, 50803, 54729, 53203, 57964, 61432, 67013, 68668, 73960, 72854, 74197, 76538, 73746, 69350, 73248, 70826, 67514, 73607, 86865, 91141, 83612, 78222, 77478, 77683, 76942, 68541, 60694, 56887, 53322, 57379, 58195, 52434, 51176, 48885, 40936, 44137, 54580, 51566, 49208, 54399, 59298, 62039, 63720, 61495, 57697, 51249, 49474, 51741, 59587, 63852, 67461, 66872, 64733, 63985, 67719, 73146, 72602, 74321, 76260, 80855, 82954, 83687, 84041, 80724, 84312, 92559, 97953, 102119, 102447, 104618, 106580, 104134, 104378, 99530, 95910, 97250, 98862, 103492, 105240, 108805, 104462, 105293, 101296, 99570, 104013, 104796, 102369, 97420, 92176, 94313, 102401]
8978A02401M008K600m395l119J124J789r36K657K459R92j651K073J491k387n689
8963A03417m379r21N023M358L626l01o07P151P265M327r288k861k904L261R90
8948A18157l718k759j809L142j735M60K076L66k394l50L562K986M153N877Q02
8933A28816K296K570L13p947l263P414O293r12R10K794Oq39R077N872M38J292
8917A55130L110M177m319p735k44R17O58L267j05J3596N394r18N039J040K410
8902A81417K930K390m649J049O76M630L114O84M106J581k191L619L883M304J697
8887B09240M589J174j315L289O256J1038N521L373K620J3721P997J0509O954Q953
8873B93919J5192J5181J6699J8440J4321J1671K2060K0128J5091M155J1948J2489
$$ y = [102401, 106409, 109009, 104614, 101495, 102619, 104408, 103472, 106129, 108588, 109580, 107929, 110002, 111493, 109106, 103417, 99038, 98117, 103140, 107498, 111124, 110823, 110216, 117367, 124632, 128959, 119671, 116810, 113906, 117167, 118157, 114439, 111680, 109871, 113013, 111278, 111738, 113814, 114180, 111786, 111436, 114998, 117984, 122137, 128014, 128816, 131112, 133682, 133995, 126048, 122785, 130199, 136492, 135580, 136490, 139284, 139290, 138451, 147528, 153400, 153838, 155130, 158240, 162417, 158098, 150363, 150119, 151036, 151694, 154961, 154856, 168452, 173846, 172928, 177967, 179007, 181417, 184347, 186737, 182088, 183137, 183813, 188443, 191557, 192241, 196347, 197928, 195737, 199356, 203239, 207543, 209240, 213829, 215003, 213688, 216977, 223233, 234271, 239792, 243165, 245785, 259506, 267503, 278012, 284966, 293919, 309111, 324292, 340991, 359431, 373752, 385423, 407483, 427611, 442702, 446857, 458805, 471294]
8861D71294J0006L018j298p328n933p381m444j004q146p426k385o490o066M031
8847D30448L208N545l629l138M691L778k617j173P264N291o498J996K209M842
8833D52217J1057R123P914L723N955K917P060J1591J3226J2372K589R353O045
8820E55142O284O268O883J773J1665J0664J4479J5033J0745O158M598O071J0507
8807F66270J2015J3956J9223J5049J2982J8384J8979K8014K2567J4140J6880K4358
8795H82817K6045K9633K0733K2202L1985L8037L3891L3836L4348M0109M5909M6314
8783A285859M0400M4352M9117N8574O9043O5207O9563P3892P7948P3772Q2529
8772A990256Q5557Q6842R5796J10206J18231J31460J42578J46430J68189J82866
$$ y = [471294, 481300, 484318, 483020, 475692, 469759, 462378, 457934, 456930, 448784, 441358, 438973, 432483, 426417, 430448, 433656, 439201, 435572, 432434, 437125, 440903, 438286, 437113, 444377, 449668, 443170, 445166, 447375, 452217, 463274, 472397, 480311, 484034, 489989, 492906, 499966, 511557, 524783, 537155, 539744, 549097, 555142, 561426, 567694, 574577, 576350, 588015, 598679, 613158, 628191, 638936, 645094, 649692, 655763, 666270, 678285, 692241, 711464, 726513, 739495, 757879, 776858, 804872, 827439, 841579, 858459, 882817, 908862, 938495, 959228, 981430, 1013415, 1051452, 1085343, 1119179, 1153527, 1193636, 1239545, 1285859, 1326259, 1370611, 1419728, 1478302, 1547345, 1612552, 1682115, 1756007, 1833955, 1907727, 1990256, 2075813, 2162655, 2258451, 2368657, 2486888, 2618348, 2760926, 2907356, 3075545, 3258411]
8762C258411K03710K29072K42687K64249K93493L29214L61537L96591M52609N05653
8752F537226N58069O31859P18606Q17847R32280J055411J200029J360388J528138
8743A5339853J698989J885247K069240K241002K350229K369205K266417J993786
8735C2213968J554118R83191L23044l54145r48978j420884j748666j914705j952532
8726B6734411j901817j808424j677066j525038j377564j245921j125097j012439
8718A5061045r00862q09256p39286o76150o08224n52604n01043m67526m36465
8709I369629m03899l74810l51391l29473l09108k87198k60155k47621k32918k12460
8699F360596k05909j94796j81922j74975j65688j52656j43538j36797j31863j25006
$$ y = [3258411, 3462121, 3691193, 3933880, 4198129, 4491622, 4820836, 5182373, 5578964, 6031573, 6537226, 7095295, 7727154, 8445760, 9263607, 10195887, 11251298, 12451327, 13811715, 15339853, 17038842, 18924089, 20993329, 23234331, 25584560, 27953765, 30220182, 32213968, 33768086, 34751277, 35074321, 34720176, 33771198, 32350314, 30601648, 28686943, 26734411, 24832594, 23024170, 21347104, 19822066, 18444502, 17198581, 16073484, 15061045, 14160183, 13350927, 12611641, 11935491, 11327267, 10774663, 10273620, 9806094, 9369629, 8965730, 8590920, 8239529, 7910056, 7600948, 7313750, 7053595, 6805974, 6573056, 6360596, 6154687, 5959891, 5777969, 5602994, 5437306, 5284650, 5141112, 5004315, 4872452, 4747446]
8689D747446j23926j09612j16008j15894j02548j04715j05560r9707r9553r4381
8679C675542r4804q6974q7347q8503q6153q6479q0602p5392p3162p0361o5700
8668B780065n7624n6091n6351n4054n4970m8928n4276m7393m1722l9467l9730
8657B229459l4445l5291m1718l6989l0222l1632l1180k4177k2601k7501k3226
8646A890477j9889k0805k1006j7307j2856j0013j3518r080p183j0083j1415l344
8634A733978m085p655n090j0071j2381q904q790o048J914j8398j8049j2460l979
8621A619982j8860k4691k0348k0824j0207j0819n942p155j8238j1643j3705j1295
8609A446255n514m981j7985k3127j6971j6663k6857l5859k6852k4239j7425j9012
$$ y = [4747446, 4623520, 4513908, 4397900, 4282006, 4179458, 4074743, 3969183, 3869476, 3769923, 3675542, 3580738, 3493764, 3406417, 3317914, 3231761, 3145282, 3064680, 2989288, 2916126, 2845765, 2780065, 2722441, 2666350, 2609999, 2555945, 2500975, 2452047, 2397771, 2350378, 2308656, 2269189, 2229459, 2195014, 2159723, 2118005, 2081016, 2050794, 2019162, 1987982, 1963805, 1941204, 1913703, 1890477, 1870588, 1849783, 1828777, 1811470, 1798614, 1788601, 1775083, 1766003, 1758820, 1748737, 1737322, 1733978, 1729893, 1722238, 1717148, 1707077, 1694696, 1685792, 1677002, 1670954, 1672868, 1654470, 1636421, 1623961, 1619982, 1601122, 1576431, 1556083, 1535259, 1525052, 1514233, 1508291, 1501136, 1482898, 1471255, 1457550, 1446255, 1440741, 1435760, 1417775, 1394648, 1377677, 1361014, 1334157, 1298298, 1271446, 1247207, 1229782, 1210770]
8597A210770k5255k1284k0363k5585k9566k5274l1853k5454k2623j8270j3379
8586I51864k2502j7646k1759k2673j3605q977j6393j6809j8262k2471j6105r882
8574G44780j7013j5269j9191j9978j0196m921k671j0302o391q666p831j6471j3384
8561E92496p708j2089j0598j0846j3610j2344j0801q416Nl353n399k838Q82J372
8547D96753r91n596j3285k1904k1317j2127j1674n820j015r924o749L897J787
8534C92035j0099j6109p319L847n535j79o556m098k237n666m192m919m991p057
8520C16925k511L956n064q051j884o6m066m761m101o005J272q764j1179l40j057
8505B64304q516J611k957j255M785k271m901o190m753k431o932j702J031L833
$$ y = [1210770, 1185515, 1164231, 1143868, 1118283, 1088717, 1063443, 1031590, 1006136, 983513, 965243, 951864, 929362, 911716, 889957, 867284, 853679, 844702, 828309, 811500, 793238, 770767, 754662, 744780, 727767, 712498, 693307, 673329, 663133, 658212, 655541, 645239, 638848, 630182, 622351, 605880, 592496, 584788, 572699, 562101, 551255, 537645, 525301, 514500, 506084, 506089, 502736, 497337, 494499, 495381, 496753, 495762, 490166, 476881, 454977, 433660, 421533, 409859, 404039, 403024, 393100, 386351, 390248, 392035, 381936, 365827, 358508, 362355, 356820, 356641, 350085, 345987, 343750, 338084, 333892, 328973, 323982, 316925, 314414, 318370, 313306, 305255, 303371, 303305, 299239, 294478, 290377, 284372, 285644, 276880, 265701, 265361, 264304, 255788, 257399, 254442, 253187, 257972, 255701, 250800, 244610, 239857, 237426, 230494, 228792, 229823, 233656]
8491B33656q934q235J801K211k95m738o12j61L132M2l547j5045k556K613K786
8476B02118j0281q549j3006k238P670k148n154L816k323Q39J799J1796J1788M834
8462B00961Q590O929o009o100o554p910j4462j5130q022j0526m154j1151k986
8449A23476j846J739M576m591l97P97M281M355l236o002J739k667j532J406l83
8434A21715O931M952k363m769l233K399m282k680J710l701l842o023o390p472
8420I2952j401J471l919k386O397j201n897j733k329R24q72k750q250j546L629
8405G3089N982O07J885L89o996p22K6L102K217j650J161M17l911O114o244l627
8389G1839Q6K228o063r38L158L416O286J029o862l534m199j544Q44L749K887j853
$$ y = [233656, 224722, 216487, 218288, 220499, 220204, 215466, 214854, 214693, 217825, 217867, 214320, 199275, 196719, 199332, 202118, 191837, 183288, 170282, 168044, 175714, 173566, 168412, 172228, 169905, 170744, 172543, 184339, 196127, 200961, 209551, 216480, 210471, 204371, 197817, 189907, 175445, 160315, 152293, 141767, 137613, 126462, 123476, 121630, 123369, 127945, 123354, 122957, 123754, 128035, 132390, 129154, 123152, 124891, 122224, 120692, 122098, 121715, 128646, 133598, 131235, 126466, 123233, 125632, 121350, 118670, 120380, 116679, 112837, 106814, 100424, 92952, 91551, 93022, 89103, 86717, 93114, 91913, 86016, 84283, 81954, 82878, 82006, 79256, 71006, 69460, 73089, 79071, 79678, 81563, 81952, 74956, 74234, 74260, 77362, 79579, 77929, 79090, 79507, 75596, 81710, 75466, 71839, 71925, 74153, 68090, 67152, 70310, 73726, 80012, 81041, 74179, 70645, 66446, 64902, 65746, 69495, 72382, 70529]
8373G0529J008K69j1430q859K045M058M196J008L186j859p877K623j302n816k894
8358D8885m84K132o162l97N133O201L459o40M549K264q306o493N67K552Q93l052
8342E1101m294M246L675k673n20Q96j141p000m006l541Q870P45k79m963o347J856
8326C6625L434o769m000n60j715O102J249m40J039L043o84K840J0491j533r92
8311D8130M123J789l878p070j953j956P774N74l158m914m961r51O577K307O866
8296D9299j724l213o973n343l908K70L775K651K369o116j138M3J091m800J274
8281B7557k627k563m31m716l550J833J0094P887J445n209n235J002L226N329q40
8266C3202l895l217q981Q0J244l486N386P917P516J473J598M795L175k056k920
$$ y = [70529, 71537, 71806, 60376, 51517, 53562, 57620, 61816, 62824, 66010, 64151, 56274, 58897, 57595, 51779, 48885, 48401, 50533, 44371, 43974, 49107, 55308, 58767, 58127, 62676, 64940, 56634, 50141, 50708, 53260, 54153, 51101, 46807, 51053, 54728, 52055, 51535, 52431, 51290, 44290, 40284, 36743, 45613, 46358, 46079, 41116, 34769, 36625, 40059, 33290, 29290, 28730, 27015, 33117, 34366, 33926, 34965, 38008, 37324, 40164, 50655, 49122, 48130, 52253, 54042, 50164, 43094, 41141, 39185, 46959, 47533, 44375, 39461, 34500, 33549, 40126, 42433, 49299, 47575, 44362, 37389, 32046, 28138, 28408, 32183, 34834, 37203, 31087, 29949, 29992, 31083, 26283, 27557, 24930, 22367, 21936, 17220, 13670, 15503, 25597, 33484, 34929, 29720, 24485, 25487, 28713, 34042, 33202, 29307, 26090, 17109, 17189, 18433, 14947, 20333, 28250, 35766, 37239, 38837, 43632, 46807, 44751, 41831]
8251D1831Q31j843m793p58m242R514K172j078o933q357k831P143k16j837P55K8
8235B9386m869k834l980j145n248J452L039P67o510j3293J642J1968O375K868
8221A9618M45M251K97l318K850R347K547K745O130P705J1907J0755J3192J1667
8207A00138k459l830j1241j0341q377r653o880n853k025o679j1296k78N172P738
8193C4136j495k154J614o70k477P25j810N579J443p807n85N496J366j734L848
8178C5475k937O49o665l968R514L430m299M11J586P341M228l01p242J263M679
8163D3164P035P078J105J642L019J001M677j963p52n645q760k840L780k781k988
8148D6772K50J838K059k045n955o125o410k738M58j040R47l892M140L198l922
$$ y = [41831, 42662, 40819, 36026, 35268, 31026, 40540, 42712, 41634, 34701, 26344, 23513, 30656, 30440, 28603, 29358, 29386, 24517, 21683, 17703, 16558, 11310, 12762, 15801, 16568, 10058, -3235, -1593, 10375, 16750, 19618, 20063, 24314, 24611, 21293, 24143, 33490, 36037, 38782, 44912, 52617, 64524, 75279, 88471, 100138, 97679, 93849, 82608, 72267, 63890, 54237, 47357, 41504, 39479, 32800, 21504, 21226, 26398, 34136, 32641, 30487, 32101, 31431, 28954, 29679, 27869, 33448, 34891, 27084, 26499, 31995, 33361, 31627, 35475, 32538, 33187, 26522, 22554, 32068, 35498, 31199, 31610, 33196, 40537, 44765, 44464, 37222, 38485, 43164, 50199, 57277, 58382, 60024, 63043, 64044, 68721, 66758, 66006, 60361, 51601, 48761, 52541, 49760, 46772, 47022, 48860, 50919, 48874, 42919, 36794, 30384, 27646, 28104, 27064, 28011, 24119, 28259, 31457, 27535]
8133B7535m022K654r15L456N419O019K276m607M462J888k168m979q725J169K859
8118C2321J612n77P067M062K572n16L445O110M213R296J3634Q401M839J149K557
8103A00185L528P458J1265P604J040J313L209P006O825J390N70J502k944r671
8089A40280k1352j4166o792k362j334m312L541O771O99p003j5014j2499n760j660
8075E9037l513l221L601j112l602k769R156M951p50r283j350R896K192j307J1527
8060G3453J4599J3792J7447K1293K6371K2874J0935j808L424J6404K0536J6835
8048B56155J2492m08j6024k1530l3015k5092o872K47q539j1820r566r416o011
8035A20601p835q073n840q969p512J992k479M3K6l111J482j733k13K057L494l673
$$ y = [27535, 23513, 26167, 25252, 28708, 34127, 40146, 42422, 37815, 42277, 44165, 41997, 37018, 28293, 29462, 32321, 33933, 33356, 40423, 44485, 47057, 46541, 49986, 56096, 60309, 69605, 83239, 91640, 96479, 97628, 100185, 103713, 111171, 122436, 130040, 131080, 132393, 135602, 142608, 149433, 150823, 151393, 152895, 149951, 140280, 118928, 104762, 97970, 95608, 94274, 89962, 93503, 100274, 100973, 93970, 78956, 66457, 60697, 59037, 55524, 52303, 55904, 54792, 51190, 48421, 57577, 62528, 61778, 52495, 51145, 61041, 63233, 61926, 73453, 88052, 101844, 119291, 140584, 166955, 189829, 200764, 198956, 202380, 218784, 239320, 256155, 268647, 268239, 252215, 230685, 197670, 172578, 165706, 165953, 157414, 145594, 136028, 126612, 120601, 112766, 104693, 98853, 89884, 82372, 84364, 81885, 81928, 81954, 78843, 80325, 78592, 78379, 80436, 83930, 80257]
8019H0257m954L74P33J34j264j229MM005Q091R708J5336P145N186K479M600N271
8003A35876Q169K421m514m925n553m667j1274o739l741o292q098p987k444l012
7989G7220l508l419k959m928p876l065l541n958k070L629n76M963K080J329j950
7974D9371l313M874j49K507j700k708l095m499n652j716R235K727m13k087j994
7959D1388j0264k825O239L389M889k943k265k489j582N659j334l152l893m758
7945B6059P33O020L027J563m787J908J957R33m760o228J107M26l220J637O444
7930C2819P209L453k138m337j0450o358L976N792K265q948q781K364L949K636
7916B3451j311L191M887l479l349J223n183n683k299n92M510N671j136P394L233
$$ y = [80257, 75303, 75677, 76410, 76544, 75280, 74051, 74055, 78060, 86151, 95859, 111195, 118340, 123526, 126005, 130605, 135876, 144045, 146466, 141952, 137027, 131474, 126807, 115533, 108794, 105053, 98761, 90663, 82676, 80232, 77220, 73712, 70293, 67334, 62406, 54530, 51465, 47924, 41966, 39896, 43525, 42949, 47912, 49992, 51321, 49371, 46058, 50932, 50783, 53290, 51590, 48882, 45787, 41288, 35636, 33920, 43155, 45882, 45469, 43382, 41388, 31124, 28299, 34538, 37927, 42816, 39873, 37608, 35119, 33537, 39196, 37862, 34710, 30817, 26059, 26792, 32812, 35839, 37402, 32615, 34523, 36480, 37413, 32653, 26425, 27532, 27958, 24738, 26375, 32819, 40028, 43481, 41343, 37006, 26556, 20198, 24174, 29966, 32231, 23283, 14502, 16866, 20815, 23451, 22140, 25331, 30218, 26739, 23390, 24613, 19430, 13747, 11448, 10856, 15366, 21037, 19901, 27295, 30528]
7901C0528j765k002m969k308N856J888n135n334p57N047M407L346k651l041M507
7886B7617Q48m495m022l25K822m58k875k444L589n986o459J762J603p97J5j644
7870H751n039K437l67m005L53O604K056J523m69K210r90j572R09K594o719q27
7854G449M687R755L030P518J048j199m569n997n401R42L09k761L037l503l810
7839A0535l646p77p64k88J480j858L76L248l508L886R73l01L202P08n638M009
7823A1637L646k858k322J545p206o118o24l879o60P313J292m675N282O019j430
7808F962M41J144l305j635p70q31m369k032O387l15j964l522k157L354k976L363
7792b225m61L721N907l201n320m981o461o925J2R818J2287O459J665q11n254J246
$$ y = [30528, 28763, 26761, 21792, 19484, 25340, 27228, 22093, 16759, 16002, 21049, 25456, 28802, 26151, 23110, 27617, 28465, 23970, 19948, 19623, 22445, 21987, 19112, 16668, 20257, 14271, 7812, 9574, 11177, 10380, 10395, 8751, 3712, 6149, 5782, 1777, 2130, 8734, 10790, 12313, 11844, 14054, 13064, 11492, 12401, 14995, 8276, 7449, 12136, 21891, 24921, 32439, 33487, 32288, 27719, 21722, 16321, 17263, 17572, 14811, 17848, 14345, 10535, 6889, 6112, 5348, 5060, 6540, 4682, 5058, 8306, 4798, 8684, 9657, 9356, 12558, 13266, 7628, 11637, 15283, 12425, 10103, 11648, 4442, -1676, -2300, -6179, -6839, 474, 1766, -2909, 2373, 8392, 6962, 7403, 8547, 5242, 3607, 2837, 2006, -2363, -4395, 1992, 1677, -287, -3809, -5966, -2612, -5588, -2225, -2686, 1035, 6942, 3741, -1579, -6560, -13021, -19946, -19934, -10116, 2171, 8630, 10295, 9484, 4230, 5476]
7776E476j292J007j198K83l692L609J499q30O64N307l994K110L069n523J028k744
7760D779M744M400L375l729l624o811m801j003L159K658J57k447K700L551j600
7745E508n146m127K394K563L59k715j394M466J754J658N516O533J589o124K55
7730A3089m173L83l033n572j45m07l58l329M958P88R84k5j18j226J422k862P52
7713A128j562P117K710K91l642j184K621L122n738m568J280j889l225N317R381
7698A1159K777p424n102L354J519K365K569j171l602l373N06K297K43k53k717
7683C147L287k545p823j0738K13J0395K592L91J980p343k287J044k343m783K104
7668a2709Q084Q495M049l923N422M98m653j11L043m861j806l414o626J348Q695
$$ y = [5476, 4184, 5191, 3993, 4276, 584, 4193, 5692, 4862, 5526, 10833, 6839, 8949, 12018, 6495, 7523, 4779, 9523, 13923, 17298, 13569, 9945, 3134, -1667, -2670, 489, 3147, 3304, 857, 3557, 7108, 5508, 362, -3765, -1371, 1192, 1551, -1164, -2558, 1908, 3662, 5320, 10836, 17369, 18958, 12834, 13089, 8916, 9299, 6266, 694, 549, 142, -216, -3545, 1413, 2201, 3185, 3160, 3042, 1816, 3238, 376, 1128, -434, 6683, 9393, 9684, 6042, 4858, 7479, 10601, 4863, 295, 1575, -314, -3539, 1778, 11159, 13936, 6512, 1410, 4764, 6283, 8648, 11217, 10046, 6444, 3071, 3577, 5874, 6117, 5864, 3147, 6434, 3889, -3934, -14672, -14459, -4064, -1472, -1081, 899, -6444, -8731, -7687, -10030, -14813, -12709, -4625, 3870, 7919, 3996, 9418, 9916, 5263, 5152, 8195, 3334, 1528, -1886, -8512, -7164, 1531]
7653A531L474k986K083R31j112k385p67L306r02J672l853j150L395N337n062o613
7637c101k021n47L021k707n331k988L86K902j899j719M941M833K337J824K927
7622B858n349k280L236l094J128J995N123K507K378M810m861k480r05l670q53
7607E43m815J81r04O970O384J800n119p304m273L275K197j345K878R630o79r712
7591b93n500M70J591k150o336p008J896M43K959N094K944J161J615RL10K186j414
7574b023j01L005m932n34N402l008l640L28K880K058J139L644Q827l889k788m87
7558E881k304J55q46l896J89M450M626k560p102n328J348R97J8K92k837k312P182
7541b047P706k096j91j495m430k706M950j715Q31K486J0404o25k369l789M33J275
$$ y = [1531, 5005, 2019, 4102, 5033, 3921, 1536, 769, 4075, 3173, 4845, 992, -158, 3237, 8574, 3512, -3101, -5122, -5669, -2648, -5355, -10686, -13674, -13288, -10386, -12285, -14004, -9063, -4230, -1893, -69, 2858, -2491, -4771, -1535, -4629, -3501, -1506, 3617, 6124, 8502, 13312, 8451, 5971, 5066, 1396, 543, -4272, -4091, -4995, 1975, 8359, 10159, 5040, -2264, -6537, -3262, -1065, -2410, 468, 10098, 9419, -293, -5793, -5323, -3732, -5882, -12218, -19226, -17330, -16887, -13928, -8834, -5890, -4729, -3114, -3105, -2795, -609, -2023, -2124, 881, -4051, -4585, 817, -2191, -5831, -5503, -2623, -565, 574, 4218, 13045, 9156, 6368, 5881, 3577, 3732, 2886, -1010, -821, 3629, 8255, 5695, -1407, -6735, -5387, -4390, -4372, -4080, -6917, -9229, -2047, 5659, 3563, 3372, 1877, -2553, -5259, -309, -2024, -1193, 1293, 11697, 11072, 8703, 4914, 5347, 6622]
7525F622k60p102j0870N76L300Q839K863J255K266J308P528l590p150l345m9M55
7509B646j454j545L268j071n044O374p8m851r66j394M18N03o6j340L135K766r
7492A292O90N41j162L778P411L502j916k340m563q58k948q601o527n67O998Q115
7476B845L249L832m709l733J299j697j0998j574M020N026K701M25N74K024r57
7461B327n455p05M468l508O028J679j503J261j249L1N090M904l114o35m302k594
7445B723o77l766o46L561N515m409l142M362k284m720l451K862m154j144j973
7430a1343N383N124l668J460Q962j963n671o539j389p36J325L892L115l029j079
7415f156N713l42J36R38n085o633r1m021r28O047l794K623O047m75n815K17P212
$$ y = [6622, 6362, -740, -11610, -11034, -7734, 1105, 3968, 5223, 7489, 8797, 16325, 12735, 5585, 2240, 2191, 2646, 1192, -353, 2915, 1844, -3200, 3174, 3096, -1755, -2721, -4115, -3697, -3194, -3260, -4600, -1465, 1301, 1292, 1982, 2523, 1361, 5139, 12550, 16052, 14136, 11796, 7233, 6375, 3427, -5174, -11701, -12268, -5270, 2845, 6094, 9926, 5217, 1484, 2783, 1086, -9912, -11486, -7466, -2440, 261, 686, 1260, 3284, 2327, -3128, -3833, 635, -2873, 3155, 4834, 3331, 4592, 3343, 3374, 8464, 13368, 10254, 9619, 5317, 2723, 2046, -1720, -2366, 1195, 6710, 2301, -841, 3521, 1237, -3483, -6934, -4072, -8226, -9370, -11343, -5960, -836, -4504, -3044, 5918, 3955, -1716, -8255, -9644, -10380, -9055, -5163, -2048, -5077, -6156, -443, -785, -649, 289, -4796, -11429, -11520, -15541, -16469, -10422, -14216, -11593, -5546, -6021, -11836, -11619, -4407]
7398d407j261R87o76N360k731Q97j311Q65K592M169j704n446R86K240j0221m608
7382a4269O87J744O075L832m772o10m4J634J574J859L158k597j914J312J723K568
7366A960o31n871j060q14K958J058n272J829K484k4J300P50k22L73m420r5k45
7349e942j620L271j29L084j023K122M789R44l634n701K934P738K984j145l731
7334D941m003o116j893k487P468O110J569P48l469j825k580n509J903L808l058
7319d393J157L429k678J639l069K036O116o188m258J786K396J315J731k095L587
7304B511L367j095P27l465n639m13J0581l033K624j042p61j252m948k412j62j659
7288f071L687K153J2495Q73k348r226n445J320m96P81p41j0M377l061l266J599
$$ y = [-4407, -5668, -4681, -5357, 3, -2728, -1831, -3142, -2277, 315, 4484, 2780, -2666, -1680, 560, -9661, -14269, -13582, -11838, -5763, -1931, -6703, -7313, -7357, -5723, -4149, -2290, 868, -1729, -3643, -2331, -608, 1960, 1329, -4542, -5602, -6416, -3458, -2400, -7672, -5843, -3359, -3383, -2083, -1333, -1555, -1182, -5602, -5697, -5942, -7562, -4291, -4420, -1336, -2359, -237, 4552, 5496, 1862, -3839, -905, 6833, 9817, 8672, 4941, 938, -5178, -7071, -9558, -2090, 4020, 5589, 6337, 2868, 1043, -1537, -7046, -5143, -1335, -4393, -3236, 193, -2485, -846, -3915, -1879, 4237, -1951, -6209, -4423, -2027, -712, 1019, -1076, 2511, 5878, 4783, 5510, 2045, -3594, -4007, 6574, 3541, 6165, 5123, 4362, 3110, -1838, -4250, -4412, -6071, -2384, -231, 12264, 13137, 10789, 1563, -3882, -2562, -3058, -2277, -3018, -3028, 1349, -1712, -4978, -3379]
7272c379J86j816J951L319L320o870p37M249m801m434N755L896K935k801l516
7257b743m625O19N272L571N689l613j409j5K233o233K849J09J147M34o84m018
7241a417p78k743j344n295j189J098Q211Q519L054O726K455r252n066o91K294
7226D582m278J328M38O245K308m048n386l12j865J613k993N09J596K191p649J476
7210d245J27J734R54K19m26J430m67k363o128j908J354J979L286r794Q814J1434
7194F000L478o038R80j969n325J288N354o42k640K322l19P46p950Q61j604o142
7178a1600L071K099l051K05Q952M906n297L860K564p818J638N451l971Q44p706
7163e853J499M149J852M752l881j661n604k766Q643N488k328O08n410j757L650
$$ y = [-3379, -3193, -5009, -3058, 261, 3581, -3289, -4026, 223, -4578, -9012, -3257, 639, 3574, 773, -2743, -7368, -6749, -1477, 2094, 7783, 4170, 2761, 2746, 4979, -1254, 1595, 1704, 2851, 3285, 2601, -1417, -2195, -4938, -6282, -11577, -12766, -11668, -3457, 5062, 8116, 14842, 17297, 8045, 2979, 2288, 4582, 304, 1632, 2070, 8315, 10623, 6575, 1189, 877, -988, 625, -2368, -1859, -263, 1928, -5721, -4245, -4118, -2384, -1430, -1211, -1637, -207, -674, -3037, -9165, -11073, -9719, -7740, -4454, -14248, -5434, 6000, 9478, 3440, 4420, 2451, -2874, -1586, 3768, 3126, 486, 2808, 2489, 3235, -4715, -3854, -5458, -11600, -8529, -6430, -9481, -9276, -324, 4582, -715, 3145, 5709, -2109, -471, 4980, 1009, 1853, -5853, -4354, -205, 1647, 6399, 2518, 857, -4747, -7513, 1130, 6618, 4290, 4898, -512, -2269, 1381]
7148A381l095O377j324m434o408n244O59L935J559M379L080L343J497l674j678
7133C53k486p588O9p278L077K547J018M16K523M872K007l995J615L715m515p995
7117a1645K070j728L549J655l964j303K902J557n723l341J830J0828P192j812
7103B067j0853k324K702k864K878L736K935K382K521l279P338K564n991l500l640
7088c328l05j010j589J167P666m03o36k60J45P828k569j909k454n031J518j043
7072b213L839q2M05q980k527O333P273n60n257r372q099P588J2018K246Q88K386
7056E886J195m05Q96j453J973n428m05P801m749l984k898j211N363K126l22l534
7040H51q377L420P72j629N98j49k94L157Q220m817k076l45J894O187n803m412
$$ y = [1381, -1714, 4663, 3339, -1095, -7503, -12747, -12088, -8153, -6594, -2215, 865, 4208, 5705, 2031, 353, -2133, -9721, -9652, -16930, -13853, -11306, -10288, -9872, -7349, -2477, -470, -4465, -2850, 865, -3650, -11645, -9575, -11303, -7754, -6099, -10063, -11366, -8464, -6907, -12630, -15971, -14141, -3313, 3879, 2067, -8786, -11110, -8408, -11272, -8394, -4658, -1723, 659, 3180, -99, 7239, 9803, 3812, 312, -3328, -3633, -4643, -6232, -5065, 2601, 2198, 1562, 1302, 1447, 9275, 6706, 4797, 2343, -2688, -1170, -2213, 1626, 1544, 1949, -7031, -9558, -3225, 4048, 3488, -1769, -11141, -19240, -11652, 366, 2612, 3500, 5886, 7081, 6676, 7572, 6119, 8092, 2664, 2259, 10060, 5311, 1327, -1571, -2782, 2581, 4707, 4385, 851, -7526, -4106, -3334, -4963, -4365, -4514, -4808, -1651, 6569, 1752, -324, -669, 1225, 7412, 1609, -2803]
7024b803p82j931M17n22J308J852m274L62K987J919q15M68j275M099M387m169
7008A228m173L397K449J677K409n247l949r562j1237L552M383l915L14P450P828
6993c396M661Q32m498k245K53O902j205l635M459O092J601l365k394J09j398O37
6977C410L317k571K483p405o073P11N466K618l007m842J147O28J925N634m632
6962a191n356M264M799n468m289K079N46K972l562O01N963K790j209r664o357
6947a3082P162N260K645n979k729Q61M857k101J218P02L506j134p98P77N633j049
6931E749k954n988j623L338P39l506N8M345K700o29o373k591N390M05J935n78
6915D17Q22m292p496r98L870J281j151J984J515p660k116L001L883M062n59k553
$$ y = [-2803, -3585, -5516, -5099, -5621, -4313, -2461, -6735, -6373, -3386, -1467, -2282, -1814, -3089, 1010, 5397, 1228, -2945, 452, 2901, 4578, 6987, 1740, -2209, -11771, -23008, -19456, -15073, -18988, -18674, -11224, -3396, 1265, 2097, -2401, -4646, -4393, 2509, 1304, -2331, 2128, 8220, 9821, 6456, 4062, 4171, 2773, 3410, 6727, 4156, 6639, -766, -6839, -6128, -662, 1956, -1051, -5893, -4746, -4118, -2193, 3441, -1191, -6547, -2283, 2516, -2952, -7241, -5162, -4616, -1644, -5206, -4605, 1358, 4148, 2939, -6725, -13082, -5920, -660, 1985, -3994, -6723, -5862, -1005, -3106, -1888, -1186, 2320, 1186, 388, 1165, 6798, 5749, 2795, -3193, -4816, -1478, -739, -4245, -4187, 158, 2858, 2229, -4144, -6735, -1345, -940, 995, 417, 1239, -3053, -10549, -11547, -7677, -6396, -7547, -5563, -4048, -11708, -13824, -10823, -6940, -2878, -3437, -5990]
6899e990m085j563M705L700k049j131l683q110j916K458R07O607N39P60N638j478
6883d691m397k501K724M101j786m853K366R384M51n2n410l499L406P44J598N569
6867C154J0394r45j0716l952n147O627P429p052n085L28m677o736K069j833j828
6852a7970L597J690K963m95Q43j658J704Q216n58o707k945K770j552L302N207
6837a593N483M226l858k865n896J987M264o217j227j202R307J702o598J176L172
6822A861K446J178L515O05k406m505p613m581N943K353j463Mj903p369L848J0807
6806B720P637j579m894k555k676j027l249N40J305K745N018rR78k96K437j379
6790E716l24q6j844L260o249j021m05O537O93J405j79q61l066j127L80L814m239
$$ y = [-5990, -10075, -11638, -6933, -3233, -5282, -6413, -10096, -18206, -20122, -17664, -16757, -10150, -9611, -8851, -3213, -4691, -9088, -11589, -8865, -4764, -6550, -11403, -9037, 347, 798, 746, -4664, -8163, -4757, -4013, -2415, 3154, 13548, 12603, 1887, -2065, -7212, -585, 6844, -208, -5293, -4965, -9642, -16378, -14309, -16142, -17970, -14373, -12683, -9720, -10215, -9372, -11030, -9326, -1110, -1668, -8375, -11320, -8550, -10102, -6800, -1593, 3890, 8116, 4258, 1393, -4503, -2516, 1748, -4469, -5696, -6898, 2409, 4111, -2487, -1311, 1861, 4307, 5485, 9000, 9605, 7199, 2694, -4919, -9500, -3557, -1204, -2667, -2663, -4566, -11935, -8087, 2720, 10357, 8778, 3884, 1329, -1347, -2374, -5623, -5083, -3778, -1033, 3985, 3976, 4954, 4658, 7095, 5716, 5392, 5306, 3462, 6722, 473, -548, -953, 5584, 6277, 7682, 7503, 6642, 3576, 2449, 2829, 6643, 2404]
6773B404n142N732L632o66O353j326l803j794K225J523K578p02n511q639J963
6758a173K566J343K395O316m788r578j487m786j61P859M424k726l269L489P39
6743A163M571R042j668q521n438K890o54M490l746j728K086r65k1J402j995l216
6727b308J014m852k104N817K266k981n668K758J399k783m96m827K402J873l33
6712h823O417O571j864k046j982m77l05q70K709K445L215n180n17K805K696m76
6696D318j438j544K450L871j701l056Q26l77m329j273L835K56j361M949M415k837
6680G004m42j647Q207R88n300j990k467M53M8l09p47l953j044K558o118N210O123
6663F574l350Qk675J89N030J274l151o34j16j344o534r033O409O460R089M817
$$ y = [2404, -2738, 2994, 6626, 5960, 12313, 10987, 7184, 5390, 7615, 9138, 11716, 11014, 5503, -3136, -1173, 1393, 2736, 5131, 11447, 6659, -2919, -4406, -9192, -9353, -1494, 2930, 204, -3065, 424, 1163, 5734, 14776, 13108, 4587, -851, 2039, 1385, 5875, 2129, 401, 2487, 1522, 1501, 2903, 908, -2308, -1294, -6146, -8250, -2433, -167, -3148, -8816, -6058, -4659, -7442, -7938, -12765, -10363, -8490, -8823, -2406, 4165, 2301, 255, -1727, -2204, -2509, -3379, -670, 1775, 4990, -190, -707, 2098, 4794, 4318, 2880, 1336, 3786, 7657, 5956, 2900, 3726, 3349, -980, -2253, 1582, 1838, 477, 5426, 9841, 7004, 6562, 4915, 13122, 14110, 8810, 6820, 4353, 4806, 4854, 4545, 3798, -155, -1199, 1359, -4759, 451, 6574, 3224, 3232, 557, 746, 5776, 7050, 3899, 3265, 3149, 1805, -4729, -13762, -7353, -893, 8196, 13013]
6647A3013j543p681n405k657O190Q393m754m617M081j905l067m010M035O443K818
6632I334n857q049J103J222L643M154K437m058l874j440j031k294K983k321k603
6617f651J027l193k279P42N118N441J173p667p33O993l419o92q219l503o82K584
6601a3960Q224J978m082m389K818O890N333L965j439l913l216J130l11J707k993
6586b258j075J979M301j497l44K218q07o359m142M040M26j077N051l86K307m28
6570A949N794j450p035n337M241K117k518N98m244l496M711L565J322K083j285
6555A015L682K157n546n582K741K261J531m625k764L653m178k711N317O540k44
6540C247l055l47k04q055M176n4o91P193o172o306l116j789J116M138L004L151
$$ y = [13013, 11470, 3789, -1616, -4273, 1917, 10310, 5556, 939, 5020, 3115, 48, -3962, 73, 6516, 9334, 3477, -4572, -3469, -2247, 1396, 5550, 7987, 3929, 55, -1385, -2416, -4710, -1727, -4048, -6651, -5624, -8817, -11096, -10354, -5236, 205, 1378, -6289, -7022, -29, -3448, -4140, -12359, -15862, -16544, -13960, -5736, -3758, -7840, -12229, -9411, -2521, 2812, 6777, 5338, 1425, -1791, -661, -972, 735, -2258, -3333, -1354, 2947, 1450, 1106, 3324, 2517, -3842, -7984, -3944, -3518, -4595, 456, 70, 2377, 1949, 7743, 6293, -742, -6079, -1838, 279, -2239, -1641, -5885, -9381, -4670, -1105, 217, 2300, 1015, 4697, 6854, 1308, -4274, -1533, 728, 2259, -2366, -5130, -1477, -5655, -8366, -3049, 3491, 3247, 192, -155, -359, -8414, -4238, -4292, -4983, 2210, -3962, -10268, -13384, -15173, -14057, -9919, -6915, -3764]
6524c764L776r95p92l832n354L981L226K13K485N548L43j898M480J434j0264k588
6508d001M070M010n867l082l689J509M175J1412k099r004k348K942O114n220n710
6493f788L180k267M324r89m997k821M998R981P76r59k577o307J509k842l705K977
6477f507m319K119J115L913J372M727Q87j872k599n948o579J855l11l070L132
6462a2085N851L507P4l083O25P74L414O566N369N33n311k642m6m917j345L289
6446E73L642p636k695N907j527J506k436j693L706J517j455N365Q11l300j295
6431I90k757n516o247O046K011J317m98N06M568K625j811M08k453n098M95M542
6415h72j384l46L3K028L647o547q005K430R532P474l029j657k373l584m551k045
$$ y = [-3764, 12, -983, -1775, -5607, -10961, -6980, -3754, -3541, -1056, 4492, 4835, 2937, 7417, 8851, -1413, -4001, 69, 4079, -1788, -4870, -8559, -7050, -2875, 8537, 6438, -2566, -4914, -1972, 4142, -1078, -6788, -3608, -5875, -1551, -2540, -7537, -10358, -5360, 4621, 5397, 4438, 1861, -4446, -2937, -5779, -9484, -6507, -10826, -8707, -7592, -3679, -2307, 2420, 3307, 1435, -1164, -7112, -13691, -11836, -12147, -15217, -12085, -6234, -2727, -2653, -5736, -5111, -4337, -923, 5643, 11012, 11545, 6234, 3592, 3546, -1371, -2716, 573, 4215, -3421, -6116, -209, -1736, -230, -2666, -4359, -653, 864, -591, 4774, 5585, 2285, 990, -1767, -7283, -13530, -7484, -5473, -4156, -4654, -4148, 420, 3045, 1234, 1642, -811, -5909, -5414, -872, -2256, -2602, -2569, -541, 3106, -3441, -11446, -9016, 516, 7990, 4961, 3304, 931, -2653, -7204, -9249]
6399i249O171l006l682l216N30J112l483j688K109M962O512J692J395P061L476
6384A0696k759q36p443k007j969o830J970O22K024L715M038n87p533m209n52L11
6368a1349J638J083O009k485l407Q07K348K712m796K435N022L315l714k602Q84
6353b100J091J635M379N417j030k736n017r258k326k47M680k206l026Q121O476
6338C853k888j494q21m282J459p61k711R99M714J39j0095l991Q280O522j930k608
6322e615L295J390p92n51L421M952N434k201m934q71k46l75l121r73K358l414
6306b243j641L120m435k167J201M72N265K441L409L096k372n349o473j348L105
6291c919N696j884q118m151j516K403J983J0282K247k231r41j285l016N769J421
$$ y = [-9249, -3078, -6084, -9766, -12982, -12452, -11340, -14823, -16511, -14402, -9440, -2928, -1236, 159, 7220, 10696, 7937, 7101, -342, -2349, -4318, -11148, -9178, -8556, -6532, -2817, 1221, 634, -6899, -11108, -11660, -11349, -9711, -8628, -2619, -5104, -8511, -7704, -5356, -2644, -7440, -5005, 17, 3332, -382, -2984, -2100, -1009, 626, 5005, 10422, 9392, 6656, 1639, -7619, -9945, -10192, -5512, -7718, -10744, -2623, 3853, 965, -529, -1350, -5632, -4173, -4934, -7645, -6646, -1932, -1793, -11888, -15879, -7599, -1077, -3007, -5615, -2320, -930, -1722, -2273, 1148, 6100, 11534, 9333, 4399, 3528, 3282, 2907, -214, -1187, 1171, -2243, -3884, -764, -5199, -7366, -6165, -5693, -428, 2013, 5422, 8518, 6146, 797, -5676, -7024, -3919, 1777, -107, -8225, -12376, -13892, -11489, -9506, 776, 3023, 792, -149, -1434, -4450, 1319, 2740]
6276B740n452n157l45J957N82j820k519J0571L201P206K694o372l301n71k719
6261F95Q23J009M843J709r59M296k690m990O712J85l922n238M883k99l270k289
6245A498L969N053J110n078l302n247p64j275o362R58N090K468N117K393j653
6230C975l118M815l361q702j260L372K613N645K626o80K031n301q307J439k580
6215f793K301Q494N341R35j607l09n047L087K202m721j109M51l932M547Q768j967
6199A0641J608l7k225q740n664j189m36J694J140M930l49J220m905J134J0081
6184H903L172J761j832m091n822l923J343K783j846J545L53o222L876K81O189
6169F470K963J757n258K829K849j961m414n03o41k766o088q95N46Q875o66m120
$$ y = [2740, -2712, -7869, -8214, -6257, -5675, -7495, -10014, 557, 3758, 10964, 13658, 7286, 3985, 3414, 695, 1518, 2527, 7370, 9079, 8120, 12416, 9726, 4736, 11448, 11633, 7711, 2473, 7356, 7057, 3787, 1498, 5467, 10520, 11630, 6552, 3250, -1997, -2761, -4036, -10398, -9440, -4350, -1882, 3235, 5628, 3975, 857, 5672, 2311, -6391, -7651, -4279, -1666, 3979, 6605, 5925, 7956, 2655, -5652, -4213, -6793, -4492, 4002, 9343, 10278, 8671, 8362, 3315, 6402, 8604, 3883, 2774, 3225, -707, 3840, 12608, 10641, 12249, 12212, 9987, 1247, -4417, -5606, -6042, -4348, -3208, 1722, 1373, 2593, -2312, -1178, 8903, 12075, 13836, 12004, 7913, 2091, -1832, -489, 2294, 448, 1993, 2346, -3876, 0, 281, 6470, 9433, 11190, 5932, 8761, 11610, 9649, 5235, 4732, 4091, 1325, -4763, -5658, -5112, 3763, 3097, -1023]
6153a023m83p174j305k182L207M846l065L815l140K021m52j328k03m271k747R81
6137a2503M245P54p10M390L68J057N354k240L48Q645n54m318r336p657o060K031
6121a6186O219M654m082l328j12K693J853K574m483m80L67L808n79q438j110N067
6105a1563N72R04j397L328m909q35Q540L705l96j023K508j194o351P90J0745q69
6089B555k304j629m400l095N544O30N704o06J391P071k495p467J054J713m840
6074a174l823j38L446L729O13N281M197p101p841n962k012n00J796O665J929o454
6058g349O246L082k603k519P24M31L862k308m148L668Q882K119m577l307m54K075
6042C824l003k456M157J221j652K369K29k574n247l014O271j831k44l676j910
$$ y = [-1023, -1506, -8680, -9985, -12167, -8960, -4114, -7179, -3364, -6504, -4483, -4935, -6263, -6466, -10737, -13484, -12503, -8258, -7504, -8214, -3824, -3456, -2399, 2955, 715, 1063, 9708, 9154, 4836, -4500, -12157, -18217, -16186, -9967, -5313, -9395, -12723, -12835, -10142, -8289, -5715, -10198, -10678, -10311, -6503, -7082, -15520, -16630, -11563, -10991, -10087, -11484, -8156, -13065, -13900, -5360, -1655, -2051, -3074, -566, -1760, -8111, -7321, 3424, 2555, 251, -1378, -5778, -8873, -3329, -2699, 3005, 2399, 3790, 10861, 8366, 899, 1953, 3666, -1174, -4997, -5135, -1689, 2040, 2653, 7934, 12131, 5030, -2811, -8773, -10785, -11285, -9489, -2824, -895, -7349, -1103, 1979, -624, -3143, -2419, -1988, 1874, -434, -4582, -914, 7968, 10087, 5510, 2203, 1749, 3824, 821, -1635, 2522, 3743, 2091, 4460, 4689, 2115, -3132, -6146, 125, -1706, -1950, -5626, -7536]
6027g536L546L153l149N807O311L328Q70p56M495M987R16l067q987j1481o862
6012h425O42J983M557P821N878o505J10K21k881j2530k603M339q45K64j495N427
5996d042K763o098o717K366O520P457k945q76j72l77l641P48n656k040J8M283
5980h409k246R94p11K036R733j294k292l97j05J883J1427M042j0390n816m40r69
5964b954k248k862M1O10N25P179O443l014l622j23Q16r75J768K523m001k453o909
5947i256M128R679L540Q84j333k631j449K998n510l908K672J84m208L453M741
5932C984m536R80n817l171K907K650p04m890J832o38l077k344j558K671M952L924
5916b835j326k728L83J506N009K565p346J365J48J443L580m783m453j598M154
$$ y = [-7536, -3990, -837, -3986, 1821, 8132, 11460, 12330, 11574, 16069, 21056, 21972, 18905, 9918, -1563, -8425, -7783, -5800, -1243, 6578, 12456, 5951, 6061, 6282, 3401, -9129, -11732, -7393, -8238, -7974, -9469, -4042, -1279, -7377, -14094, -11728, -5208, 2249, -696, -1572, -1744, -2121, -5762, -5014, -10670, -12710, -12692, -8409, -10655, -9661, -10372, -8336, 1397, 103, -2189, -2586, -2691, -808, 10619, 14661, 4271, -1545, -1985, -2954, -5202, -8064, -8023, -7413, -6888, 291, 6734, 3720, 98, -25, 791, -184, 1584, 4107, 106, -2347, -9256, -5128, 4551, 8091, 8975, 7642, 5011, 3562, 6560, 1050, -2858, -186, -2, -4210, -757, 3984, -552, 428, -5389, -8560, -5653, -3003, -3707, -8597, -6765, -7403, -10480, -12824, -14382, -11711, -6759, -2835, -4161, -6889, -6506, -5000, 9, 2574, -4772, -3407, -3259, -1816, 1764, -3019, -7472, -9070, -4916]
5901d916Q744J615N43j871l979j1j237k436n754q096j397O947O909l892j712o0
5885a0603j96n050O88O455K755L619k256l714j886M338J478j487j887r24m939
5870a3609j403J870K650K032j497L799L518j749R45m71l344n294j175M130N445
5855d153J867m136m564N899N95Q519K746n651j1510m021P8J549M766P313j569
5840b272r174J725l88J321L852K732p939q54M392O489N20J548K1P40m926j428
5824c641K05M025m978J828J057k190j014L572j878Q23K119j32k545k552L789Q354
5808F842k659q712M213M159M854m309M21n57q351j029J250M238N257m559j612
5793e54N173K156k256n564P01J877m692J455Q732l983p059R9L300q587m601L748
$$ y = [-4916, 3828, 5443, 5986, 4115, 136, 125, -1112, -3548, -9302, -17398, -18795, -11848, -4939, -8831, -10543, -10603, -10799, -15849, -15161, -8706, -5951, -2332, -4588, -8302, -10188, -5850, -4372, -5859, -7746, -8670, -13609, -15012, -13142, -10492, -8460, -9957, -6158, -2640, -4389, -3444, -3915, -7259, -12553, -13728, -9598, -4153, -2286, -6422, -10986, -5087, -4492, 4027, 6773, 1122, -10388, -14409, -14331, -12782, -8016, -703, -2272, -11446, -9721, -10109, -8788, -4936, -2204, -10143, -10997, -6605, -116, 404, 1952, 1973, 2713, -2213, -3641, -3436, 589, -4389, -2561, -1504, -3694, -4708, -1136, -3014, -2191, -72, -204, -2749, -5301, -1512, 6842, 4183, -4529, -316, 3843, 8697, 4388, 4809, 4252, -4099, -5128, -3878, 360, 5617, 1058, -554, 4619, 6775, 4519, -1045, -344, 1533, -3159, -1704, 7028, 3045, -4014, -3915, -615, -9202, -13803, -10055]
5777a0055J961L340K474p19m832L343K673j89r272l604O47N79J898O575P475m731
5761b437j14j470m550p008O946P223R349O89m486j921M82K117j756p14o086m162
5745g898O108j789m293Q909O79k269m427m80K506L319K503j229N45J281L88q258
5729d405r738q86K885M000M649R5p5R836J607J86p05q437j2197L911R763P084
5713G573j865N11K102n095j600J293k526n589P66n36k649n155Q26K086P113j566
5697d311J030L064l77M855L447l162j894n86j032L81p81l957J183j096j555N564
5681G73l07k412N157n69r52k564J440K777n422M67M658L565l639p655l528J557
5665f654l757j681O644J0545k492n791l920N435k385j136K276Q343l298j376j286
$$ y = [-10055, -8094, -4754, -2280, -2999, -7831, -4488, -1815, -2004, -11276, -14880, -14233, -13654, -11756, -5181, 2294, -2437, -2551, -4021, -8571, -15579, -8633, -1410, 7939, 8628, 4142, 2221, 2703, 4820, 3064, 2350, -3736, -7898, -1790, -3579, -7872, 1037, 1716, -553, -4980, -5460, -2954, 365, 2868, 1639, 2184, 3465, 3853, -4405, -14143, -15029, -12144, -8144, -3495, -3400, -3475, 6361, 7968, 8154, 7449, -988, -13185, -9274, 489, 7573, 5708, 6219, 8321, 3226, 1626, 2919, 393, -5196, -4430, -4966, -7615, -12770, -11944, -9858, -2745, -4311, -3281, -217, -594, 4261, 7708, 4546, 2652, 2066, 1034, 1415, 634, -3323, -2140, -3236, -4791, 773, 466, -1946, 3211, 2642, 1690, -874, 566, 3343, -2079, -1612, 3046, 6611, 2972, -4683, -8211, -6654, -10411, -12092, -5448, 5097, 2605, -3186, -7106, -1671, -4056, -5192, -2916, 5427, 2129, 753, -533]
5650e33K303N812o648j953K82l516L764k562q122J785O556k070o496j470O400
5635f468j484k181M7j56J048O422K500n20j928K324o50m617m268j851k891K552
5619a2121L975L93K194j22J083m748J37N862l199r356j028J31P890M560n580r
5603i938K789j144M434J922M145M19k621j484k817j103p564k086M451O902M618
5588I23j448k342k786q92M268m152k01K96n30p74o98j017N700K885M197J127l201
5571A355o641J195J604J873j55k711l101M60M744N898J559o150l819L626k006
5556b269j671M228J542k790J419j797j126l06J783O260j977n325K246J682p103
5541e204p455P6j45j00J649K193l94K864M611J860n878J119M48L429P713m424
$$ y = [-533, 1770, 7582, 934, -1019, -737, -4253, -489, -3051, -11173, -9388, -2832, -4902, -11398, -12868, -6468, -7952, -10133, -10086, -10242, -9194, -2772, -272, -792, -2720, -396, -1046, -5663, -9931, -11782, -14673, -12121, -8146, -7753, -5559, -5681, -4598, -9346, -9209, -3347, -6546, -15902, -16930, -16799, -8909, -4349, -9929, -9938, -7149, -8293, -3859, -1937, 2208, 2627, 6, -1478, -4295, -5398, -12962, -15048, -10597, -3695, 923, -525, -2867, -5653, -6545, -2277, -6429, -6630, -6334, -6864, -7638, -8336, -9353, -3653, -768, 3429, 4556, 1355, -5286, -4091, -2487, -614, -769, -3480, -6581, -6121, -1377, 4521, 6080, -70, -3889, -263, -2269, -3940, 288, 1830, -960, 459, -1338, -2464, -2770, -987, 5273, 3296, -2029, 217, 1899, -5204, -12659, -12583, -12728, -12828, -11179, -8986, -9380, -6516, -1905, -45, -5923, -4804, -4356, -927, 6786, 2362]
5525B362m154L327L557K037k784P31l418m222n277l787M713N23Q101j240j133
5510f64K30o119k227k975J560J980L963O842M606j251p213n608k958J711l310
5495a1433k692J650J0759r77l63M069M8l095m127o409K50M876N751J510l489j151
5479d823l6J761j03j986j004K782N94O18K20P22j928j630K690N297k322l549k223
5462d920k072M676J188m443m690K776M966k78j030K464J815j953k83J030j667
5447b421J205j176J615j031L696O08l471l589p60k190m667q97J521K942K299L454
5431b862n339q684l883N054K784o21O107J579J281m179m671K921P233L141m663
5416d802l305M756P487K243o750O28l036k94M02k636M491J979n326m266k442K806
$$ y = [2362, -1792, 1535, 5092, 7129, 4345, 5076, 1658, -2564, -7841, -11628, -6915, -6392, 1709, 469, -664, -434, -6553, -8780, -11755, -10195, -8215, -4252, 2590, 7196, 5945, -1268, -6876, -9834, -8123, -11433, -14125, -12475, -1716, -2693, -3056, 1013, 1061, -2034, -6161, -12570, -12320, -7444, -1693, -183, -3672, -4823, -4859, -3098, -3201, -5187, -6191, -3409, -2815, -2197, -1977, -1255, -3183, -4813, -2123, 3174, 852, -2697, -4920, -6992, -2316, -1128, -5571, -10261, -7485, -2519, -2797, -3827, -1363, 452, -1501, -1784, -754, -2421, -1216, -2392, -777, -1808, 1888, 2496, -975, -4564, -5324, -7514, -12181, -13078, -11557, -8615, -6316, -2862, -8201, -16885, -20768, -15714, -12930, -13551, -7444, -5865, -4584, -8763, -13434, -10513, -3280, -139, -4802, -8107, -3351, 4136, 6379, -371, 257, -2779, -3073, -2671, -5307, -816, 1163, -4163, -8429, -10871, -8065]
5400h065K532l425N110Q90k744l835k208m357J597O59j01L391O609O609K812k283
5384C191R38m116k125N66o989j270J060j161m157J584K181J614k105R316P06L231
5368B464l511O60M318P89k530m823r17K936M513m975l888j814N027K066N255l510
5352B060o451M941J769j066J022K954o589r638r867j830Q962M185j27N062k833
5337g446l8M461O77L669L76J223l849k697n259m746L653j942J762O161P591m429
5321h33l317j514J656O154n685P93K428l672m157K190J612K647p095m043Q041
5306d795k63L361M67l669N572P41P14k275j951N626L063k712K375k497n370r79
5290b592J243R311J985j882p688j150M588L915j7m802k511K258R92k099o301l381
$$ y = [-8065, -5533, -8958, -3848, -2958, -5702, -9537, -11745, -16102, -14505, -13846, -13947, -10556, -3947, 2662, 5474, 3191, 4129, 13, -2112, -1546, -8535, -9805, -8745, -9906, -14063, -12479, -10298, -8684, -10789, -1473, -767, 2464, -1047, -387, 3931, 4720, 2190, -2633, -3550, -614, 3899, -1076, -4964, -6778, -1751, 315, 5570, 2060, -4391, 550, 2319, 1253, 2275, 5229, -1360, -10998, -20865, -22695, -13733, -9548, -9675, -4613, -7446, -7484, -3023, -2346, 1323, 1699, 2922, -927, -3624, -8883, -13629, -9976, -11918, -10156, -3995, 3596, -833, -4150, -5664, -4008, 2146, -3539, -2746, -318, -3990, -8147, -5957, -4345, -1698, -8793, -12836, -4795, -5058, -1697, -1230, -4899, 673, 1414, 2128, -147, -2098, 3528, 6591, 3879, 6254, 3757, -1613, -2592, -1349, 7962, 9947, 8065, 377, -773, 3815, 7730, 7713, 2911, 400, 2658, 3650, 1551, -4750, -8131]
5274h131M490P546l410l118K177K124q04R62J458k359J254J01l886l546M714j06
5258e34P60K034L408M12K573n849r53k178J049M935L094r858r011J701L896j368
5242e889j251m707L120K065N815N047j301J862l969q642k259j81L359L898k121
5227e154j568k765M138J152o36M018R09r319J644P053Q50K214J87J933J950n983
5211F23j547R76R27j253J936m292n84l874K439K982N891l46L525K239P07l157
5195G192m902p95o023J060p47K000Q72m180Q06Q7m082L994J787K178L560k269
5179E38n839o139M322Q488L996m753JK195K061p77l179k156l0n441l206J0565
5163F46Q765k046m390n928l777j223M020O345l280K345M985N629j369m209m127
$$ y = [-8131, -3641, 3905, 495, -2623, -446, 1678, 874, 1836, 3294, 935, 2189, 2290, -1596, -5142, -428, -534, 226, 2260, 5668, 6080, 8653, 2804, 1851, -327, 722, 5657, 8751, -1107, -10118, -8417, -4521, -5889, -7140, -11847, -8727, -6662, -847, 4200, 2899, 4761, 792, -7850, -10109, -10290, -6931, -3033, -5154, -6722, -9487, -5349, -4197, -4833, -815, 94, -9225, -7581, -528, 322, 2536, 2723, 4656, 6606, 623, -924, 52, 979, -274, 1662, -2630, -3214, -7088, -4649, -1667, 4224, 3878, 7403, 9642, 10349, 7192, 2290, 1495, -4528, -3468, -4215, -2215, -1343, -5523, -4717, -4630, -8712, -4718, -2931, -753, 2807, 538, -5301, -11440, -7118, 1370, 5366, 613, 614, 2809, 4870, 4093, 914, -1242, -1272, -6713, -9919, 646, 9411, 7365, 2975, -2953, -6730, -7953, -3933, 2412, -868, 1477, 6462, 12091, 10722, 6513, 2386]
5148B386K195o294j925Q83o19k443n8j382O348k294k884l64j003L543K560j940
5132c291n141k099l052Q557P545j418m220L340l871J922N275R81j86j698j157
5117A487Q60j623j734p80m0L874K388l739k32L926j424l538K624j294J004k673
5101i14j850L064O037n194j121M98k674J205M506l210j403k738l098n84M824L853
5085A201j93k601K110J489m433J287J160j667m300K166l935K504J202N509j711
5070b12K339J00K23J680j472o454J885J571m358k497j12O985J448K854J54M197
5054H331j40J639n025l82l167m836k245r32K42P864J103k102o932O269O462l297
5038B852l976L306L56R8j252m67j103m611q33M747J042O98J795J516n475o94k051
$$ y = [2386, 4581, -1713, -3638, -2755, -3374, -5817, -5875, -7257, -909, -3203, -6087, -6451, -7454, -3911, -1351, -3291, -8432, -10531, -13583, -5026, 2519, 1101, -3119, 221, -3650, -1728, 3547, 4528, 4342, 2644, 1487, 2347, 724, -1010, -1790, -1830, 2044, 4432, 693, 461, 4387, 2963, -575, 2049, 755, 1759, -914, -2764, 300, 6337, 1143, 22, 520, -2154, -949, 3557, 347, -1056, -3794, -6892, -7476, -2652, 1201, 1008, -1593, 517, 2006, -2427, -1140, 20, -1647, -5947, -3781, -7716, -5212, -4010, 1499, -212, 2127, 2227, 2450, 4130, 2658, -3796, -1911, -340, -4698, -7195, -7307, -322, 1126, 3980, 4134, 8331, 8191, 9830, 4805, 4423, 1256, -3580, -5825, -6757, -6515, 1349, 2452, 350, -6582, -313, 6149, 2852, -1124, 2182, 2538, 2636, 1384, 917, -186, -4797, -5630, -883, 159, 857, 2652, 4168, -1307, -2001, -4052]
5021d052K453j720n203m577K15N533K586M39l447J079L380J748n451j175m356
5006a2548K095K333Q120M977K14K78K3l899j0j691m436j478M130j226k517n56
4990f191L566K398k003m48Q14j237o77j49M849k07k963M358J074K622J129o662
4974B73m788M304J409j216n498O59p46L657j87o385k348N179L354p592n449P121
4958h253J0579M46k461O324j67P520j574n670P421p35q987o394n90J964O861K179
4942H463q1L309O02o992n100m381R42J255M689j196k912l208L073M077L620J86
4926F346K909m522j200N431Q33K24L88k155l86k48m256q661l262L091P039J521
4910C092p62k619l435Q208J364n596n031K524M639k281J738J095j308O68m32k071
$$ y = [-4052, -1599, -3319, -8522, -13099, -12884, -7351, -4765, -4326, -7773, -6694, -3314, -1566, -7017, -8192, -12548, -10453, -8120, 0, 4977, 5191, 5469, 5492, 1593, 1583, -108, -4544, -6022, -1892, -3118, -5635, -6191, -2625, -227, -2230, -2678, -1864, -3101, -3778, -3927, 922, 715, -2248, 2110, 3184, 5806, 6935, 273, -4515, -211, 1198, -18, -5516, -4857, -5603, -1946, -2133, -8518, -10866, -5687, -2333, -9925, -15374, -8253, 2326, 2772, 311, 6635, 6468, 13988, 12414, 6744, 14165, 13430, 4443, -1951, -2541, -577, 6284, 8463, 8382, 11691, 12293, 5301, 201, -4180, -3238, -1983, 2706, 1510, -1402, -4610, -1537, 2540, 6160, 6346, 9255, 4733, 3533, 8964, 9797, 10021, 10409, 8254, 7868, 7620, 3364, -5297, -8559, -5468, 1571, 3092, 2330, -289, -3724, 4484, 5848, 252, -4779, -2255, 2384, 103, 1841, 2936, 1628, 2296, 1864, -207]
4894b07k540J778L429P18k918J520L010n72M788k879l677P47j883l397j065K798
4878c50K633J033j239l451N485k195j579n830n523J738N677N199K174m351l601
4863d180J449L134K56O66N956K454N09O021o516n291j08l949l446p90M354L215
4847C734l952k324n765k576m604o97M575Q974J1936K890K398l477l871m336p446
4832d541r276m636P53K674N038N466K010M128J353l771Q66l144m916P380j999
4817b615o080M270L509L638k42L484j422m250J624m566K94P932L240k357k944
4802C515j165m819L720K365j292m561q769M292P037N294n172J054l267k89l329
4787e386k783Q42K566m235k594p331R782N674k016J238J230J995K552N43k545
$$ y = [-207, -2747, -969, 2460, 3178, 260, 1780, 4790, 4218, 9006, 6127, 2450, 3197, 1314, -2083, -3148, -350, 2283, 3316, 2077, -1374, 4111, 1916, 337, -5493, -11016, -9278, -3601, 1598, 3772, -579, -4180, -2731, 403, 659, 1325, 7281, 9735, 10244, 16265, 9749, 4458, 4350, 401, -3045, -3835, 519, 3734, -218, -2542, -8307, -10883, -15487, -16184, -11609, -2635, 9301, 12191, 14589, 11112, 7241, 2905, -4541, -13817, -18453, -17700, -15026, -9988, -4522, -2512, 1616, 2969, -802, 64, -3080, -7996, -616, -2615, -8695, -4425, -916, 2722, 2480, 5964, 4542, 292, 1916, -2650, -2356, 5576, 8816, 6459, 3515, 2350, -2469, 1251, 3616, 2324, -2237, -11006, -6714, 323, 5617, 445, 1499, -1768, -2057, -5386, -8169, -7327, -4761, -8996, -11590, -18921, -9139, -3465, -5481, -4243, -3013, -1018, 1534, 2077, -468]
4772d68l367l139N176k675n066J203O352L535J066k076m7m068K248L983l371k797
4756c511L982q3m056k141n31J750R759q50n310n01R28J230q135P60l969j642N302
4739g018K357M034M22L01l654k565M637l619j5M13p2J752j918J642l024o953l566
4722a6846N228M226L339L83k211J743p01O836L439m303K986Q960q170l42l936
4707F31k350k240l315N797M27l324O502K20j843J124M757l470J300M491J288j677
4691H318j31m081r43p966n189j617O653M180o397o351j82Q715P264N412Q866n725
4675A0826l790m847l078j027L586M318m315o115m85K053k22L813j592m189q95
4660e959P843M046m380l571j236j972N764P563J481n380p325R30Q89m02j866K026
$$ y = [-468, -3835, -6974, -1798, -4473, -9539, -8336, -1984, 1551, 2617, 541, 494, -3574, -1326, 2657, -714, -3511, 471, 388, -3668, -5809, -6340, -4590, 5169, 4319, -991, -1492, -564, 666, -7469, -6709, -10678, -12320, -7018, -4661, -627, -205, 96, -3558, -6123, -1486, -5105, -5120, -4707, -4779, -3027, -4945, -3303, -6327, -13280, -16846, -11618, -7392, -4053, -3670, -5881, -4138, -4839, 1997, 5436, 1133, 4119, 13079, 4909, 4567, 631, -1719, -3959, -7274, -1477, -1050, -4374, 2128, 2348, 505, 1629, 6386, 2916, 4216, 8707, 9995, 8318, 8187, 4106, 3163, -4803, -9992, -11609, -4956, -776, -7173, -13524, -13706, -4991, 2273, 7685, 16551, 10826, 7036, 2189, -889, -1916, 1670, 5988, 1673, -4442, -4927, -2874, -3096, 717, -875, -5064, -5959, 1884, 5930, 1550, -2021, -3257, -5229, 535, 8098, 9579, 4199, -3126, -2196, -1307, -1709, -3575, -1549]
4644a549k106l314q48N319L43k639L291K672O77K665Q87o606l092P18L76M140
4628I34l225J859o276p247l696J835P754R448O2m617l256M222P308J918n898k735
4612a610j410Q62L372O39K350n73q57J828K634r548m943J151l90R774M082p070
4596B91k592K230K757m89O198L74k97j283J489k663l879n231p94L321P082J229
4580G743r79K821J976O340m983m079n265L898l32j1540p275k591O463k85M977
4565c111K931O82P845O573l969p15o124N64l045j41k016P484j856o165n075M424
4549a714P000k482J894P77q999k57K763j363N87M131K056J061k663J106r47k624
4533C26Q29L387r57j979k002J77K100n452n986J039K237J864O43o662Q197L52
$$ y = [-1549, -3655, -6969, -7817, -2498, -2155, -4794, -1503, 1169, 1846, 4511, 5398, -1208, -4300, -3582, -3206, 934, -2291, -432, -6708, -13955, -17651, -15816, -8062, 1386, 1448, -3169, -6425, -2203, 5105, 7023, 1125, -1610, -3020, -2158, 1214, 1853, 4203, 3630, 2773, 4601, 7235, -2313, -7256, -6105, -6495, 3279, 7361, 291, -2301, -71, 2686, 2197, 8395, 8769, 8472, 7189, 8678, 6015, 2136, -3095, -3889, -568, 6514, 7743, 6764, 9585, 11561, 17901, 12918, 8839, 3574, 7472, 7140, -4400, -11675, -14266, -7803, -8088, -3111, -180, 502, 8347, 14920, 10951, 10236, 4112, 4676, 1631, 1490, -526, 6958, 5102, -1063, -6138, -1714, 5286, 2804, 4698, 5475, -3524, -3781, -1018, -2381, -1794, 2337, 4393, 5454, 2791, 3897, 2950, 326, 1155, 4542, 3585, 1606, -396, -219, 1881, -3571, -9557, -8518, -6281, -4417, -3774, -10436, -2239, -1887]
4517a887o258O0n783j365L448K933M000L176l81m328J754q39K394j09K352K38
4501e95K829k210P43l273J344p25j267K657K850o819k606O581O05j0024K790O93
4485f427K525O867J795j512k244N279q64p711P75L52J427rk670L48P294L742K720
4468A1687J924o06k897n142p798l512k8L794j63L083j963k429l262J800q06P54
4452e564k3k422O005L489R6l95k709m961K368R61l362k856j407j480J0359p43
4436b644k344K686K078j473k814K3n156L092N280o957j172L602J740o256K050
4421h265L940o28M226Q12L2M408n431O61K81L18l94j401n214l958j382N335J0221
4404C561Q09n572K694K435m162J230L299l712m904O679M987j469Jj219m311j815
$$ y = [-1887, -8145, -8085, -13868, -15233, -11785, -8852, -4852, -1676, -2057, -6385, -4631, -5470, -3076, -3185, -833, -595, 2234, 24, 767, -2506, -1162, -1887, -3154, -497, 2353, -4466, -7072, -491, 114, -9910, -7120, -6427, -3902, 2965, 4760, 3248, 1004, 6283, 5419, -2292, -1517, -1165, 262, 253, -2417, -2069, 5225, 8967, 11687, 13611, 13005, 10108, 4966, -2832, -6344, -6372, -2578, -2741, 342, -1621, -4050, -7312, -5512, -6318, -5564, -5587, -8009, -2004, 1485, 1581, 1186, -1523, -6484, -4116, -3155, -6517, -9373, -10780, -12260, -1901, -2644, -4988, -2302, -224, -1697, -4511, -4488, -9644, -6552, -1272, -8229, -9401, -5799, -4059, -10315, -8265, -4325, -4953, -727, 85, 117, 4525, -906, -245, 36, 354, -40, -1441, -6655, -10613, -11995, -6660, 3561, 4370, -1202, 1492, 3927, -235, 995, 4294, 582, -4322, 2357, 7344, 5875, 5876, 4657, 346, -1469]
4388a469J405n692k335L782j052j350l333l973M884P054j185r620j469N129K223
4373g001K814N688k776j622K110l036m260K577M646o17k725M271K86N608Q167
4358A4130l464r870o423n23Q563J02n641n655O84m787L088J968R1j547K475k159
4342h968k123P93M142J405r09O88L758O223L42m541O726m16l054J19J571l506
4326B250Q23O796o224l396o759n673R39q70q36J0033K366M82Q82k222J999o8J094
4309A616j670J199L890n043k703j007l98o294J983L066k574r15J767L74o346J297
4293a1758O865P333R45j0455p869J85J0222J71j613j015L576r39N291O92r74k904
4277b247n964n894O140R009M861L151p721l421o64l774J309N26j976L20m202J499
$$ y = [-1469, -64, -5756, -8091, -4309, -5361, -6711, -10044, -14017, -9133, -2079, -3264, -12884, -14353, -9224, -7001, -4187, 1501, -1275, -2897, -787, -3823, -8083, -5506, -860, -1477, -4202, 69, 355, 5963, 14130, 10666, 796, -5627, -6150, 2413, 2515, -3126, -8781, -8097, -12884, -9796, -7828, -7737, -9284, -6809, -8968, -11091, -10298, -6156, -4751, -5660, -4972, -1214, 5009, 5351, 810, 7536, 7120, 4066, 4185, 5756, 2250, 3073, 9869, 3645, 249, -6510, -12183, -11244, -12114, -12950, -2917, -551, -69, 813, -1409, 590, 522, 1616, -54, 1145, 5035, -8, -2711, -3718, -4116, -10410, -8427, -5361, -7935, -8850, -7083, -6709, -13055, -11758, -4893, 2440, 3385, -7070, -14939, -14754, -4532, -4361, -5974, -6989, -3413, -4352, 939, 1631, 657, -2247, -8211, -14105, -7965, 1044, 5905, 9056, 1335, -2086, -2750, -6524, -5215, -4689, -6665, -6345, -10547, -9048]
4261i048K187O020M305N52K1k058n532k653K348L49O595N052k334l898K69o293
4245d118J040L683J2k518o8j231N582Q984m454k266l405L636P386J454o486o487
4229G44L54N300m541r331l641J521K281j216n701L894R199J4904R309L363l018
4214B3421n542j3495k0771p285k953M945Q134J2046J2487P618q54l817r996r573
4200e635j3676o34O714J0636J2432R122l870j2208o436n337k7J82K025L844N029
4185B161R524O597L134n241q287q701p923L189O030j193K422k674n833L175L121
4170d99M270K451j083j660M116L33j210j876l828o035q97l433K384L738o41l896
4154g766K308M958l9J894J057l47k928K771K821j540J36p165J078P647k181J149
$$ y = [-9048, -6861, -841, 3464, 4016, 4037, 1979, -3553, -6206, -3858, -3509, 3086, 8138, 5804, 1906, 2175, -4118, -3078, 605, 617, -1901, -1969, -3200, 2382, 11366, 6912, 4646, 1241, 4877, 12263, 13717, 7231, 744, 1098, 6398, 1857, -7474, -11115, -9594, -7313, -8529, -14230, -10336, -1137, 13767, 23076, 26439, 23421, 17879, 4384, -16387, -23672, -26625, -21680, -13546, -1500, 10987, 18605, 17751, 13934, 3938, -5635, -19311, -19945, -13231, -2595, 9837, 18959, 15089, 2881, -3555, -8892, -8919, -8737, -6712, -2868, 2161, 11685, 18282, 21416, 16175, 7888, -813, -8736, -5547, 483, -710, 1712, -962, -6795, -3620, -499, 3771, 6222, 5139, 3479, 7595, 7928, 6718, 4842, 1014, -5021, -5918, -9351, -6967, -3229, -3870, -7766, -5458, -500, -539, 1355, 2412, 2065, -863, 1908, 4729, 3189, 3325, -3840, -2762, 4885, 2704, 3853]
4138C853l948J366P096j226J487m891k59m836l179J357k693m448k53K132P91M211
4122c440M76p33J379L293R32l097n77k518P74L845K581m29n299j735j776r44m792
4105a2060p27K290O820j994o551M530R872M741K021j288m931N20Q569K187p170
4090F829k668j950o004P43R471K237j556n225l56L433M705l190j772j141l657
4075a01p975m904N16J936k209k316M286N653L940n83l176J913n52P71L739k841
4059a903J553M514k733j306L20O856L5j0966j893M276N967m143M343O636m814
4044F742j3700n784N963p71o595K774O526N471M173l010K37J975M984J955L709
4029A4649j777m099K265L279p238m968J691k917J847K892j305N30M35j674o866
$$ y = [3853, -95, 1271, 8367, 7141, 8628, 3737, 3478, -1358, -4537, -3180, -5873, -10321, -10574, -8442, -7651, -3440, -2964, -3697, -2318, 975, 1907, -1190, -1767, -4285, -3511, 334, 2915, 2486, -2813, -4548, -6324, -7268, -12060, -12787, -10497, -3677, -5671, -12222, -7692, 2180, 6921, 8942, 7654, 2723, 3243, 11812, 13999, 6829, 4161, 2211, -3793, -3050, 6421, 8658, 7102, 1877, 1521, 4954, 9659, 6469, 4697, 3556, -101, -8076, -12980, -12464, -10528, -12737, -15053, -10767, -5114, -1174, -1757, -4933, -3020, -3572, -2801, 938, -1903, -350, 4164, 1431, 125, 445, 7301, 7336, -3630, -5523, -1247, 4720, 577, 4920, 11556, 6742, -6958, -12742, -6779, -7550, -14145, -11371, -4845, 626, 4799, 1789, 2026, 4001, 8985, 10940, 14649, 12872, 8773, 11038, 14317, 7079, 2111, 3802, 885, 2732, 5624, 4319, 4849, 5284, 3610, -3256]
4014c256N757M783j499n76L039J195p963k485o802J556L195k54L292J633n777
3999d162L960K433j933l087J029j872J87O228q263r671K184m88J355M089P530
3984d81J599j414k204K655L536j501m847L253k4o251N235n80n935L339J524o435
3968h531n081n04J673O177L87n755m302j69N001m785l052Q656L496J207J126J29
3952d327n400M736O933N373k81q708k526J877J943l122m639k297m865K698J929
3937a0676N017N707M079M76L64j004n070n58O07k915M945K482k2J009Q60j606
3921C695K743n43q15J380j923l300M32K48j121n566m111o37O294l743m82J93o047
3904a3303K102K078J1028J7949J416n382o041j787K246K112j439o85l216j0611
$$ y = [-3256, 2501, 7284, 5785, 5209, 8248, 9443, 1480, -1005, -7807, -6251, -3056, -3310, -18, 1615, -4162, -202, 2231, 298, -2789, -1760, -3632, -3445, 2783, -5480, -15151, -12967, -13455, -12100, -8011, -481, 1118, -296, -2500, 155, 3691, 2190, -2657, 596, 572, -5679, -444, -1024, -6959, -3620, -2096, -8531, -13612, -14116, -12443, -6266, -5879, -11634, -15936, -16105, -11104, -15889, -18941, -10285, -6789, -5582, -4456, -4327, -9727, -4991, 1942, 7315, 7034, -1674, -4200, -2323, -380, -3502, -8141, -10438, -15303, -12605, -10676, -5659, 48, 4127, 4603, 4967, 3963, -1107, -1665, -1058, -3973, 972, 3454, 3432, 4441, 5301, 3695, 6438, 5895, 5080, 6460, 4537, 1237, 1669, 1917, 796, -4770, -8881, -9518, -3224, -6967, -7449, -7256, -13303, -11201, -9123, 1905, 19854, 21270, 15888, 9847, 8060, 10306, 12418, 10979, 10294, 7078, -3533]
3890c533j1366K500K860N597M300l7n280k716N465Q399P696K575m658k789R51
3875I964j256n096M806j57K999l192r348j0746j056Q726Q307m378m107J978J255
3860a301J960j143K966k009m401O32J363j494o232Q438L880k869j748j44l745
3845e847K0Q781L396M818q04m893r96j61J780L738j195J38J345k011n476K557
3829E190L434o945p060M30O973R20o912K68O348L844j0126n210N54l526M071J306
3813f441l139m743N191m809J925L526K574N160P199j028m000n778j500j42M5N88
3797e372L834j272l242J59O30M960N671p49o884o046R23M826M696M09l701k301
3781c459P50P02O112J199j171l663k594j247Q689k343q167O71J184J796m396j029
$$ y = [-3533, -14899, -12399, -9539, -3942, 358, 321, -4959, -7675, -2210, 6189, 13885, 16460, 11802, 9013, 9964, 8708, 3612, 8418, 8261, 11260, 8068, -1280, -12026, -13082, -4356, 3951, -427, -4534, -2556, -1301, 659, -484, 2482, 473, -3928, -3296, -1933, -3427, -9659, -1221, 2659, -210, -1958, -2102, -5847, -5827, 2954, 6350, 11168, 10364, 5471, 4475, 4314, 6094, 9832, 8637, 8775, 10120, 8109, 2633, 5190, 8624, 1679, -5381, -4951, 2022, 2942, -3970, -3702, 2646, 6490, -3636, -8846, -8292, -11818, -7747, -6441, -9580, -14323, -9132, -13941, -12016, -8490, -5916, -756, 6443, 5415, 1415, -4363, -5863, -6005, -5960, -5372, -1538, -2810, -6052, -5893, -5263, -303, 5368, 4619, -2265, -8311, -7388, -2562, 2134, 2543, -1158, -3459, -2709, -2007, 4105, 5304, 4133, 470, -2124, -3371, 5318, 2975, -5192, -4521, -3337, -1541, -5937, -6966]
3765f966K873j251n597M742O53K456j081J651J554k993k083J872M399K765q1j077
3749A836j0432l617N071Q680j268K46J184K827k935o847n103l492M962J1799Q394
3734A1305l821j264M3l55N822n043n169M98J641K580m80k914J757O04l524k175
$$ y = [-6966, -4093, -5344, -10941, -6199, -5546, -3090, -4171, -2520, -966, -3959, -6042, -4170, 229, 2994, 2913, 1836, -8596, -12213, -7142, 1538, 270, 516, 1700, 4527, 1592, -5255, -10358, -13850, -8888, 2911, 11305, 7484, 6220, 6263, 5908, 11730, 6687, 1518, 2016, 3657, 6237, 5757, 2843, 4600, 5204, 1680, -495]
$$ [...]
##END NTUPLES=NMR SPECTRUM
##END=
