##TITLE=Analysis number 318741
Compound Code cc 46201
Book Reference 440/174
Project Code adrs
Chemist Name craigr
##JCAMPDX= 6.0         $$ Bruker NMR JCAMP-DX V2.0
##DATA TYPE= NMR SPECTRUM
##DATA CLASS= NTUPLES
##ORIGIN= Bruker BioSpin GmbH
##OWNER= nmr
$$ XWIN-NMR		Version 3.5
$$ Wed Apr 12 11:20:04 2006 GMT Daylight Time (UT+1h)  MAYBRIDGE\nmr@NMR_250MHZ
##.OBSERVE FREQUENCY= 250.131544655141
##.OBSERVE NUCLEUS= ^1H
##.ACQUISITION MODE= SIMULTANEOUS (DQD)
##.ACQUISITION SCHEME= undefined
##.AVERAGES= 16
##.DIGITISER RES= 18
##SPECTROMETER/DATA SYSTEM= dpx250
##.PULSE SEQUENCE= zg30
##.SOLVENT NAME= DMSO
##.SHIFT REFERENCE= (INTERNAL, DMSO, 0, 16.522)
##AUDIT TRAIL= $$ (NUMBER, WHEN, WHO, WHERE, WHAT)
$$ ##TITLE= Audit trail, XWIN-NMR		Version 3.5
$$ ##JCAMPDX= 5.01
$$ ##ORIGIN= Bruker BioSpin GmbH
$$ ##OWNER= nmr
$$ C:\u/data/dgb/nmr/ADRS/2570/pdata/1/auditp.txt
$$ ##AUDIT TRAIL=  $$ (NUMBER, WHEN, WHO, WHERE, WHAT)
(   1,<2006-04-12 11:19:43.01 +100>,<MAYBRIDGE\nmr>,<NMR_250MHZ>,
      <created by zg, POWCHK disabled, PULCHK disabled
       configuration hash MD5:
       84 BC 41 DB A1 6E 1D 46 DA 25 12 A5 C1 ED C5 3A
       data hash MD5: 64K
       88 C4 57 2D 64 71 48 06 8C 91 53 F6 25 B6 7E 93>)
(   2,<2006-04-12 11:19:55.51 +100>,<MAYBRIDGE\nmr>,<NMR_250MHZ>,
      <Start of raw data processing
       ef LB = 0.3 FT_mod = 6 PKNL = 1 SI = 32K 
       data hash MD5: 32K
       C7 8B 64 1E E0 0A D8 7A F0 5C 63 A9 4B 52 35 B1>)
(   3,<2006-04-12 11:19:57.10 +100>,<MAYBRIDGE\nmr>,<NMR_250MHZ>,
      <apk 
       data hash MD5: 32K
       AB 1C B8 92 03 93 3E 84 97 50 23 50 95 E3 5C EF>)
(   4,<2006-04-12 11:19:57.90 +100>,<MAYBRIDGE\nmr>,<NMR_250MHZ>,
      <abs ABSG = 5 
       data hash MD5: 32K
       07 7A 99 43 15 4A 45 F8 F3 E1 A5 36 84 C6 50 A0>)
$$ ##END=
$$ 
$$ hash MD5
$$ 49 67 95 B7 68 8E 5E 66 DF 04 BB 2E 41 91 BF 3C
##$RELAX= 
##$RELAX= 
##$RELAX= 
##$RELAX= 
##$RELAX= 
##$RELAX= 
##$RELAX= 
$$ Bruker specific parameters
$$ --------------------------
##$DU= <C:\u>
##$EXPNO= 2570
##$NAME= <ADRS>
##$PROCNO= 1
##$TYPE= <nmr>
##$USER= <dgb>
##$AMP= (0..31)
100 100 100 100 100 100 100 100 100 100 100 100 100 100 100 100 100 100 
100 100 100 100 100 100 100 100 100 100 100 100 100 100 
##$AQSEQ= 0
##$AQ_mod= 3
##$AUNM= <au_zg>
##$AUTOPOS= <16 >
##$BF1= 250.13
##$BF2= 250.13
##$BF3= 250.13
##$BF4= 250.13
##$BF5= 500.13
##$BF6= 500.13
##$BF7= 500.13
##$BF8= 500.13
##$BYTORDA= 1
##$CFDGTYP= 0
##$CFRGTYP= 5
##$CHEMSTR= <none>
##$CNST= (0..31)
1 1 145 1 1 1 1 1 1 1 1 1 1 1 1 1 1 1 1 1 1 1 1 1 1 1 1 1 1 1 1 1 
##$CPDPRG= <>
##$CPDPRG1= <>
##$CPDPRG2= <>
##$CPDPRG3= <>
##$CPDPRG4= <mlev>
##$CPDPRG5= <mlev>
##$CPDPRG6= <mlev>
##$CPDPRG7= <mlev>
##$CPDPRG8= <mlev>
##$CPDPRGB= <>
##$CPDPRGT= <>
##$D= (0..31)
0 1 0 0 0 0 0 0 0 0.06 0 0 0 0 0 0 0.0002 0 0 0 0 0 0 0 0 0 0 0 0 0 0 
0 
##$DATE= 1144837181
##$DBL= (0..7)
120 120 120 120 120 120 120 120 
##$DBP= (0..7)
150 150 150 150 150 150 150 150 
##$DBP07= 0
##$DBPNAM0= <>
##$DBPNAM1= <>
$$ [...]
##$SUBNAM7= <"">
##$SUBNAM8= <"">
##$SUBNAM9= <"">
##$SW= 20.6930455092707
##$SWIBOX= (0..15)
0 0 3 0 0 0 0 0 0 0 0 0 0 0 0 0 
##$SW_h= 5175.983436853
##$TD= 65536
##$TD0= 1
##$TE= 294.16
##$TE2= 300
##$TE3= 300
##$TEG= 300
##$TL= (0..7)
0 120 120 120 120 120 120 120 
##$TP= (0..7)
150 150 150 150 150 150 150 150 
##$TP07= 0
##$TPNAME0= <>
##$TPNAME1= <>
##$TPNAME2= <>
##$TPNAME3= <>
##$TPNAME4= <>
##$TPNAME5= <>
##$TPNAME6= <>
##$TPNAME7= <>
##$TPOAL= (0..7)
0.5 0.5 0.5 0.5 0.5 0.5 0.5 0.5 
##$TPOFFS= (0..7)
0 0 0 0 0 0 0 0 
##$TUNHIN= 0
##$TUNHOUT= 0
##$TUNXOUT= 0
##$USERA1= <user>
##$USERA2= <user>
##$USERA3= <user>
##$USERA4= <user>
##$USERA5= <user>
##$V9= 5
##$VALIST= <valist>
##$VCLIST= <CCCCCCCCCCCCCCC>
##$VD= 0
##$VDLIST= <DDDDDDDDDDDDDDD>
##$VPLIST= <PPPPPPPPPPPPPPP>
##$VTLIST= <TTTTTTTTTTTTTTT>
##$WBST= 1024
##$WBSW= 4
##$XGAIN= (0..3)
0 0 0 0 
##$XL= 0
##$YL= 0
##$YMAX_a= 383031
##$YMIN_a= -497625
##$ZGOPTNS= <>
##$ZL1= 120
##$ZL2= 120
##$ZL3= 120
##$ZL4= 120
##$ABSF1= 16.522
##$ABSF2= -4.171173
##$ABSG= 5
##$ABSL= 3
##$ALPHA= 0
##$AQORDER= 0
##$ASSFAC= 0
##$ASSFACI= 0
##$ASSFACX= 0
##$ASSWID= 0
##$AUNMP= <proc_1d>
##$AZFE= 0.1
##$AZFW= 0.1
##$BCFW= 0
##$BC_mod= 0
##$BYTORDP= 0
##$COROFFS= 0
##$CY= 12.5
##$DATMOD= 1
##$DC= 0
##$DFILT= <>
##$DTYPP= 0
##$F1P= 14.0000005364418
##$F2P= -0.99999901652339
##$FCOR= 0.5
##$FTSIZE= 32768
##$FT_mod= 6
##$GAMMA= 0
##$GB= 0
##$INTBC= 1
##$INTSCL= 1
##$ISEN= 128
##$LB= 0.3
##$LEV0= 0
##$LPBIN= 0
##$MAXI= 10000
##$MC2= 0
##$MEAN= 0
##$ME_mod= 0
##$MI= 0
##$NCOEF= 0
##$NC_proc= -6
##$NLEV= 6
##$NOISF1= 0
##$NOISF2= 0
##$NSP= 0
##$NTH_PI= 0
##$NZP= 0
##$OFFSET= 16.522
##$PC= 1
##$PHC0= 156.2247
##$PHC1= 6.93472
##$PH_mod= 1
##$PKNL= yes
##$PPARMOD= 0
##$PSCAL= 4
##$PSIGN= 0
##$REVERSE= no
##$SF= 250.13
##$SI= 32768
##$SIGF1= 0
##$SIGF2= 0
##$SINO= 400
##$SIOLD= 32768
##$SREGLST= <1H.DMSO>
##$SSB= 0
##$STSI= 32768
##$STSR= 0
##$SW_p= 5175.98343685301
##$SYMM= 0
##$S_DEV= 0
##$TDeff= 65536
##$TDoff= 0
##$TI= <Analysis number 999999
Compound Code 99
Book Reference 9
Project Code 9>
##$TILT= no
##$TM1= 0
##$TM2= 0
##$TOPLEV= 0
##$USERP1= <user>
##$USERP2= <user>
##$USERP3= <user>
##$USERP4= <user>
##$USERP5= <user>
##$WDW= 1
##$XDIM= 32768
##$YMAX_p= 480892075
##$YMIN_p= -1165639
$$ End of Bruker specific parameters
$$ ---------------------------------
##NTUPLES= NMR SPECTRUM
##VAR_NAME=  FREQUENCY,     SPECTRUM/REAL,   SPECTRUM/IMAG
##SYMBOL=    X,             R,               I
##VAR_TYPE=  INDEPENDENT,   DEPENDENT,       DEPENDENT
##VAR_FORM=  AFFN,          ASDF,            ASDF
##VAR_DIM=   32768,         32768,           32768
##UNITS=     HZ,            ARBITRARY UNITS, ARBITRARY UNITS
##FACTOR=    0.157963299565203, 1,           1
##FIRST=     4132.6476996994, 0,             0
##LAST=      -1043.33573715361, 0,           0
##MIN=       -1043.33573715361, -1165639,    0
##MAX=       4132.6476996994, 480892075,     0
$$ Real data points
##PAGE= N=1
##DATA TABLE= (X++(R..R)), XYDATA
$$ [...]
22106H9946n3186j56705r7319k8069M5695K02406J50858J79953Q7494l2802n1110
$$ 89946 36760 -119945 -217264 -245333 -199638 2768 153626 333579 421073 388271 337161
22095C37161j34907L5401j66054k96385r3930L747O3358J30488l00R95J66470
$$ 337161 202254 237655 71601 -224784 -318714 -314967 -251609 -121121 -121421 -120426 46044
22084D6044J13309J17624o56k80327k5095N4412j85520M2772k30531J24824J86848
$$ 46044 159353 276977 276321 -4006 -29101 25311 -160209 -117437 -347968 -223144 -36296
22073c6296j06022K23581O5503J38789Q8477p6627j46213l05340J63476M12991
$$ -36296 -142318 81263 146766 285555 374032 297405 151192 -154148 9328 422319
22063D22319R8595m40122J17118o2696k74827p8354o4534o3024J62852L3891l858
$$ 422319 520914 80792 197910 135214 -139613 -217967 -282501 -345525 -182673 -148782 -152640
22052a52640n5204L7336J38912j88540l5817k37783J42611J63145j36895j97242
$$ -152640 -207844 -170508 -31596 -220136 -255953 -493736 -351125 -187980 -324875 -522117
22042e22117J69758N4441Q123k6539J13070J98933J48142l07749Q904r0671n1572
$$ -522117 -352359 -297918 -289795 -316334 -203264 -4331 143811 -163938 -155034 -245705 -297277
22031b97277j22509J84547J6542r8803j63752p212K36253K8953j06230j22417
$$ -297277 -419786 -235239 -218697 -317500 -481252 -488464 -252211 -223258 -329488 -451905
22021d51905p4601J20827J62000K17605J47776j62965J44207J97566j73023k78333
$$ -451905 -526506 -405679 -243679 -26074 121702 -41263 102944 300510 127487 -150846
22011a50846J1249k56130Q1813L41153J2515j13798J52970M6966k51295m9453
$$ -150846 -139597 -395727 -313914 27239 39754 -74044 78926 125892 -125403 -174856
22001a74856K04594K2571j2563J14614J20021J97991N4794p4222o1787k71496
$$ -174856 29738 52309 39746 154360 274381 472372 527166 452944 391157 119661
21991A19661r4985k09503k45199j27462J72826J25664L4123O0659J45790j78021
$$ 119661 24676 -184827 -430026 -557488 -384662 -258998 -224875 -164216 -18426 -196447
21981a96447m1545o881R45j73633N5570L30680J55372j41349p7313j90908R7702
$$ -196447 -237992 -244873 -243928 -417561 -361991 -31311 124061 -17288 -94601 -285509 -187807
21970a87807J83829P0037K2460N9188J13556p2997k88997J27150K84829j75291
$$ -187807 -3978 66059 88519 147707 261263 188266 -100731 26419 311248 135957
21960A35957J4055K17933q5101J2612j45054J7102K8479k5351L49713J48251j07000
$$ 135957 150012 367945 282844 295456 150402 167504 195983 170632 520345 668596 561596
21949E61596j65876l46017j01566J00596J56911J5433n5899R5994j34704j09723
$$ 561596 395720 49703 -51863 48733 205644 221077 165178 261172 126468 16745
21939A6745o5901Q0641P2447J7928j55078j55166l9613O4395J90258J88657n0170
$$ 16745 -49156 31485 103932 121860 -33218 -188384 -227997 -163602 26656 215313 165143
21928A65143p1078J10438Q3268J4842L1010J9325k4928J5820j64312L8548K29056
$$ 165143 94065 204503 287771 302613 333623 352948 328020 343840 179528 218076 447132
21917D47132J0054j74307k32916k35213J5808L0572J14153J56027K0325q4792
$$ 447132 457186 282879 49963 -185250 -169442 -138870 -24717 131310 151635 66843
21907F6843J81397o1518l83050k50651J18975J63999l5892K85057j4547q9208
$$ 66843 248240 186722 -196328 -446979 -328004 -164005 -199897 85160 70613 -18595
21897a8595j45689o409j40488P2154J99576J48129q8241J02078N5769q10r0615
$$ -18595 -164284 -170693 -311181 -239027 -39451 108678 20437 122515 178284 177474 86859
21886H6859m32357r1287j17218J05563R8173J65996M5674O0302o5963j63899N2333
$$ 86859 -345498 -436785 -554003 -448440 -350267 -184271 -138597 -78295 -144258 -308157 -255824
21875b55824K71006n8054j98771k34434J09923J7177J59791L28878j38438M6322
$$ -255824 15182 -42872 -241643 -476077 -366154 -348977 -189186 139692 1254 47576
21865D7576L86724j02020j80190j6718j15292Q70P3975L3616M24602R8719l91148
$$ 47576 434300 332280 152090 135372 20080 20950 94925 128541 553143 651862 260714
21854B60714j88764J87956m6760j98505l74087j73368P7114L75126q0981k2343
$$ 260714 71950 259906 213146 14641 -359446 -532814 -455700 -80574 -161555 -183898
21844a83898J31342J511p780j47732p1718O1598N3066j04584O3132j20653l9751
$$ -183898 -52556 -51045 -58825 -206557 -278275 -216677 -163611 -268195 -205063 -325716 -365467
21833c65467J89959K6779j28685O9133j9484k98302J83338J61822j22547j24581
$$ -365467 -175508 -148729 -277414 -208281 -227765 -526067 -342729 -180907 -303454 -428035
21823d28035o0148k5182k384L727P1962o09j82350j19203K10506K21485L64861
$$ -428035 -488183 -513365 -515749 -512022 -440060 -440669 -623019 -742222 -531716 -310231 54630
21812E4630l8799P474J37001R3862j46764l64721J02351K27213Q3898J03729m40847
$$ 54630 15831 23305 160306 254168 107404 -257317 -154966 72247 156145 259874 -180973
21801a80973l62198P8752J44602J16590K0979R5667Q0488j35861o9705l1345j2273
$$ -180973 -543171 -464419 -319817 -203227 -182248 -86581 -6093 -141954 -211659 -243004 -255277
21790b55277K8547j02164l78927j03724n773J05500L34772M49040K9367k34842
$$ -255277 -226730 -328894 -707821 -811545 -817318 -711818 -377046 71994 101361 -133481
21780a33481j17326P47l19927j03365M6130K9894R1141r1188M6094K37775K80419
$$ -133481 -250807 -250060 -569987 -673352 -627222 -597328 -506187 -597375 -551281 -313506 -33087
21769c3087j20297j2270K55073J34213j07404j35400j96031N8066n8031M4132
$$ -33087 -153384 -165654 89419 223632 116228 -19172 -215203 -157137 -215168 -171036
21759a71036j19410j8814J97398o2321J5659K63014j0417k06809p8560J80474
$$ -171036 -290446 -309260 -111862 -174183 -158524 104490 94073 -112736 -191296 -10822
21749a0822M9342j27489L2447J40053N1298m1330R1993p8884j60235J25246J1194
$$ -10822 38520 -88969 -56522 83531 134829 93499 185492 106608 -53627 71619 82813
21738H2813n5638K54204P0332j35729L5907l1272O3590J50304j46910N8740k46766
$$ 82813 27175 281379 351711 215982 251889 220617 284207 434511 287601 346341 99575
21727I9575J1321J55249j09311k42794j23822l74534j59356L15506L06877k29717
$$ 99575 110896 266145 156834 -85960 -209782 -584316 -743672 -428166 -121289 -351006
21717c51006N6785r5555l21643K5116K74654L47678j38564k88628R8196J3716
$$ -351006 -294221 -389776 -711419 -686303 -411649 -63971 -202535 -491163 -392967 -379251
21707c79251K0103Q5535n4361j1896Q2351P952J3084J19734j82810K15012n7740
$$ -379251 -359148 -273613 -327974 -339870 -257519 -249567 -236483 -116749 -299559 -84547 -142287
21696a42287l61647L1906J64350J49837J84082k45391R1307R5900l154j40205
$$ -142287 -503934 -472028 -307678 -157841 26241 -219150 -127843 -31943 -35097 -175302
21686a75302J66067J50294N8732J74837J42794l38337l53413j57139Q7883N071
$$ -175302 -9235 141059 199791 374628 517422 179085 -174328 -331467 -243584 -238513
21676b38513P5623l5173j50303r4035m2132k88548o8387K77539j34608J08723
$$ -238513 -162890 -198063 -348366 -442401 -484533 -773081 -841468 -563929 -698537 -589814
21666e89814L07838o6135Q7371J79253L7233J12174J28906K08562k4000k17555
$$ -589814 -281976 -348111 -260740 -81487 -44254 67920 196826 405388 381388 163833
21656A63833q4838J7785O8886m1834J710l9883k43690n9237j26176N5964K06655
$$ 163833 78995 96780 165666 123832 125542 85659 -158031 -217268 -343444 -287480 -80825
21645h0825j5124J13257o9768P9725K91000M090j1124p906j50780k41471m2491
$$ -80825 -95949 17308 -52460 27265 318265 322355 311231 303325 152545 -88926 -131417
21634a31417J52101j49144j75515O9919J67052R0460J45792J29170n9938O3897
$$ -131417 20684 -128460 -303975 -234056 -67004 23456 169248 298418 238480 302377
21624C02377j6763j23550K9527Q6583j06054n1781m14504j05350J46691L81308
$$ 302377 285614 162064 191591 278174 172120 120339 -294165 -399515 -252824 128484
21614A28484P4089k99611N5198j452R0215M9896R0565j45140R2576J81094j19606
$$ 128484 202573 -97038 -41840 -43292 46923 96819 187384 42244 134820 315914 196308
21603A96308k39578k76294J39564j08442r6481J83931j28074l7170j3810j01006
$$ 196308 -43270 -319564 -180000 -288442 -384923 -200992 -329066 -366236 -380046 -481052
21593d81052k8240k19176J18876J56580m8899J49853K54553N3831J89896k6201
$$ -481052 -509292 -728468 -609592 -453012 -501911 -352058 -97505 -43674 146222 120021
21583A20021j14527J61295M7081K2946J32472J11445j06795j30949j27311k57386
$$ 120021 5494 166789 213870 236816 369288 480733 373938 242989 115678 -141708
21573a41708L02144N341r4372N443k05259k9685j22598j51380j23725J79883P7171
$$ -141708 160436 165777 71405 76848 -128411 -158096 -280694 -432074 -555799 -375916 -298745
21562b98745j19953k16990j4634K86149o3885q134P1043n5591J99789M93728m9858
$$ -298745 -418698 -635688 -650322 -364173 -428058 -436192 -365149 -420740 -220951 272777 222919
21551B22919q1772j19553J693P6104N5395Q9741J2640J8016J79565k56474n23458
$$ 222919 141147 21594 23287 99391 154786 244527 257167 275183 454748 198274 -325184
21540c25184o7526J43529Q7962J73810O6450J7330j06056j26592k1664N1185J09466
$$ -325184 -392710 -249181 -161219 12591 79041 96371 -9685 -136277 -157941 -106756 2710
21529B710J58712J38409k69705j70658J61166L7204j9310K2287j14867j87077
$$ 2710 161422 299831 30126 -140532 20634 57838 38528 60815 -54052 -241129
21519b41129k96047J39674K42649J64998Q1491j7940j47340m07137n8727P9172
$$ -241129 -537176 -397502 -154853 10145 91636 73696 -73644 -480781 -539508 -460336
21509d60336k57716k2492K31069J76502L08347J8923j77633m7421p8479j76055
$$ -460336 -718052 -740544 -509475 -332973 -24626 -5703 -183336 -230757 -309236 -485291
21499d85291L184M41238L88675J13101J36805j44399k77614l12243j90895j27814
$$ -485291 -482107 -40869 347806 460907 597712 453313 175699 -136544 -327439 -455253
21489d55253P4373O4764J40545k4864J02239m0368j35536K5558L8167m0221j46294
$$ -455253 -380880 -316116 -175571 -200435 -98196 -138564 -274100 -248542 -210375 -250596 -396890
21478c96890q691O6569J32818O4447J47343J25675K258j34781k65769n2886p366
$$ -396890 -405581 -339012 -206194 -141747 5596 131271 133529 -1252 -267021 -319907 -327273
21467c27273L03989K27808o3788m2676j59021n1967P4530j55811o0533K39620
$$ -327273 -23284 204524 140736 98060 -60961 -112928 -38398 -194209 -254742 -15122
21457a5122K61619l01592Q767L48662M4127r7041k5454p7057j0400j87505j15933
$$ -15122 246497 -55095 -46328 302334 346461 249420 223966 146909 136509 -50996 -166929
21446a66929j31266K19260n5169K26169k02597j45095l1830j1079J97590J40409
$$ -166929 -298195 -78935 -134104 92065 -110532 -255627 -287457 -298536 -100946 39463
21436C9463o6183o450n861k08961N622L8832J54271J07145O4126l51191j61496
$$ 39463 -26720 -33170 -39031 -247992 -242370 -203538 -49267 57878 122004 -229187 -390683
21425c90683K12922R9927j89174j08907J27842k4713J24933J66374k89936l10894
$$ -390683 -177761 -77834 -267008 -375915 -248073 -272786 -147853 18521 -271415 -582309
21415e82309k59507J49825M70080k0127q3053L4090j89670k43763K53332j4471
$$ -582309 -841816 -691991 -221911 -242038 -325091 -291001 -480671 -724434 -471102 -485573
21405d85573j39412R6132K46599L9733K90576L43899N3073k90478k41780J01372
$$ -485573 -624985 -528853 -282254 -242521 48055 391954 445027 154549 -87231 14141
21395A4141K58756R5389l8348j40440K0309j49597m6493K8985k64724K24142N4101
$$ 14141 272897 368286 329938 189498 209807 60210 13717 42702 -222022 2120 56221
21384E6221k48285j09560J67031o5432M4502K12719j36622l7348j01876k65558
$$ 56221 -192064 -301624 -134593 -200025 -155523 57196 -79426 -116774 -218650 -484208
21374d84208L5874K55858N8334J15596l6407k4962J00527j13778l0769K7995J59868
$$ -484208 -448334 -192476 -134142 -18546 -54953 -79915 20612 -93166 -123935 -95940 63928
21363F3928o4766k7896K45109K76096q6548m19614j3337O3356J40991J1300j67095
$$ 63928 -838 -28734 216375 492471 405923 -13691 -27028 36328 177319 188619 21524
21352B1524r4805j51800J99197J53759q0041j13023k57943L4120M0316j32497
$$ 21524 -73281 -225081 -25884 127875 47834 -65189 -323132 -289012 -248696 -381193
21342c81193q8202J84067L46744J80274j01608l35210m8447K31451o2201l8382
$$ -381193 -469395 -285328 61416 241690 140082 -195128 -243575 -12124 -74325 -112707
21332a12707k88467j13280L18540Q2354j24883N0423J00579j00955J46339J26713
$$ -112707 -401174 -514454 -195914 -113560 -238443 -188020 -87441 -188396 -42057 84656
21322H4656R703Q8934O5674j59953N5219o5528J90597L2124p2324K8953j65757
$$ 84656 94359 183293 248967 89014 144233 78705 269302 301426 229102 258055 92298
21311I2298j21429N4844j50878j68610Q1157K45947K06435J16757j41487l55985
$$ 92298 -29131 25713 -125165 -293775 -212618 33329 239764 356521 215034 -140951
21301a40951R6245p1409J17903K3521j48317k40444k2418K64837J29692O5923
$$ -140951 -44706 -116115 1788 25309 -123008 -363452 -385870 -121033 8659 74582
21291G4582O4342r4341j73259J2445j86022k31108K19561L36799J29397j85972
$$ 74582 138924 44583 -128676 -116231 -302253 -533361 -313800 22999 152396 -33576
21281c3576p8571j73002r7107j55593J16449L84727K4899n4042J44647J21230
$$ -33576 -112147 -285149 -382256 -537849 -421400 -36673 -11774 -65816 78831 200061
21271B00061k72737J0254j66232k08745k14452K16521J26484K20439m5835j37546
$$ 200061 -72676 -62422 -228654 -437399 -651851 -435330 -308846 -88407 -134242 -271788
21261b71788K85944M1822Q0075k25094N9920J26621j8903K8497m880j16373J04974
$$ -271788 14156 55978 136053 -89041 -29121 97500 78597 107094 102214 -14159 90815
21250I0815k99120k31854J25399O4904j94404k5169K35566P1002j17417J36574
$$ 90815 -208305 -440159 -314760 -249856 -444260 -469429 -233863 -162861 -280278 -143704
21240a43704k2960L1748J19687l4811n7767l9591N8255j0101L6399r9838O0106
$$ -143704 -166664 -134916 -15229 -50040 -107807 -147398 -89143 -99244 -62845 -162683 -102577
21229a02577o0769J32256K67819j31472p7307J61112N8363k16030L6324k61768
$$ -102577 -163346 -31090 236729 105257 27950 189062 247425 31395 67719 -194049
21219a94049j82797J80383K75971k34240m659m2414k10556j4218L31240K91509
$$ -194049 -376846 -196463 79508 -154732 -159391 -201805 -412361 -426579 -95339 196170
21209A96170J81861m64493l29549P5692L06227L3717j55232N7937J94971J04206
$$ 196170 378031 -86462 -416011 -340319 -34092 -375 -155607 -97670 97301 201507
21199B01507k44212J21288K00653J68587p8745m2181k09797j45020j7709K78556
$$ 201507 -42705 78583 279236 447823 369078 326897 117100 -27920 -45629 232927
21189B32927J54059q21o4100k10188J23600k18011l50823L8638J45979q5086O1761
$$ 232927 386986 386165 322065 111877 235477 17466 -333357 -294719 -148740 -233826 -172065
21178a72065O1940K08397N3149n9279j61334k27719r4250K50257L20325K5614
$$ -172065 -110125 98272 151421 92142 -69192 -296911 -391161 -140904 179421 205035
21168B05035j28696j10809k00027J05569j77372k0697j14001n6360J5371o255
$$ 205035 76339 -34470 -234497 -128928 -306300 -326997 -440998 -497358 -481987 -488242
21158d88242J97320J08286r5797R7218J68572L6356j48924l1274j21563j09770
$$ -488242 -290922 -182636 -278433 -181215 -12643 23713 -125211 -156485 -278048 -387818
21148c87818j97266Q536K0730K71875M43775J1203j27074p50j50322o6877j17142
$$ -387818 -585084 -576548 -555818 -283943 159832 171035 43961 43211 -107111 -173988 -291130
21137b91130K2510k66048J73036K63286K19130Q0500N381k09305k70050O8033
$$ -291130 -268620 -534668 -361632 -98346 120784 201284 206665 -2640 -272690 -204657
21127b04657j05356k18935J8919P5417J21050J73541m4071j52537j87677R3464
$$ -204657 -310013 -528948 -510029 -434612 -313562 -140021 -184092 -336629 -524306 -430842
21117d30842L00274M7212N1642R6947J26139J40144r2121k48753o4638M5597K57055
$$ -430842 -130568 -83356 -31714 65233 191372 331516 239395 -9358 -73996 -28399 228656
21106B28656J35922R5182m3699o5340k6442k31615k72535j33976p170J68160J54638
$$ 228656 364578 459760 416061 350721 324279 92664 -179871 -313847 -321017 -152857 1781
21095A781j22703j13899q5112r524L61910p2970J22668L1361k13467l6472p5788
$$ 1781 -120922 -234821 -319933 -329457 32453 -40517 82151 113512 -99955 -136427 -212215
21084b12215k58368l2227O9534K02468M4636M125k8990l0371m6441O9487J5323
$$ -212215 -470583 -502810 -433276 -230808 -186172 -182047 -211037 -241408 -287849 -218362 -203039
21073b03039k3260K9982J50258R8770k72165j48165J50318J06544J10760J09465
$$ -203039 -226299 -196317 -46059 52711 -219454 -367619 -217301 -110757 3 109468
21063A09468l6806l42461q6578K81816N5308m27423k01071j11363L29431Q6205
$$ 109468 72662 -269799 -356377 -74561 -19253 -446676 -647747 -759110 -429679 -343474
21053c43474j4011K08963R8684j4951k27097K51484J02283r3909l71117R2238
$$ -343474 -357485 -148522 -49838 -64789 -291886 -40402 61881 -32028 -403145 -310907
21043c10907L21614K09019J54693K1399k61428J7620N3030q978J3656j62345k12329
$$ -310907 10707 219726 374419 395818 134390 152010 205040 196062 209718 47373 -164956
21032a64956J82300L0375j47308q3416K35366J41248m3908k46758j07546l06259
$$ -164956 17344 47719 -99589 -183005 52361 193609 149701 -97057 -204603 -510862
21022e10862j44841J57172P4803J23734N8177l168J93168k43916o9730R2521J46266
$$ -510862 -655703 -498531 -423728 -299994 -241817 -244985 -51817 -295733 -365463 -272942 -126676
21011a26676J31113n5221L6277m72434k6128J95229l8918K35552J11784r9768
$$ -126676 4437 -50784 -14507 -486941 -513069 -317840 -356758 -121206 -9422 -109190
21001a09190N702j42554j6879J43161K25335k42031k5633L52853K33818o1513
$$ -109190 -103488 -246042 -262921 -119760 105575 -136456 -162089 190764 424582 363069
20991C63069J01786k52407j31888J44804n6456K9164m0823l19333l42260K49372
$$ 363069 464855 212448 80560 225364 168908 198072 157249 -162084 -504344 -254972
20981b54972J61156j2044J93689K73028k06557l37937k10891K06463L52507p340
$$ -254972 -93816 -105860 87829 360857 154300 -183637 -394528 -188065 164442 157102
20971A57102O3939K65690n7911j75268J59528k31966r8056j06633k45861k33432
$$ 157102 221041 486731 428820 253552 413080 181114 83058 -23575 -269436 -502868
20961e02868n3176m8141L729R1872K03026K23779K01782r2539j26555M9591K52572
$$ -502868 -556044 -604185 -600456 -508584 -305558 -81779 120003 27464 -99091 -49500 203072
20950B03072J8039j88979J108J9940J06129o8345k15431J30364J7976Q5779p7348
$$ 203072 221111 32132 33240 53180 159309 90964 -124467 5897 23873 109652 32304
20939C2304j25506j87032J29673R7902j53131j19474L3997K01500j06174r4032
$$ 32304 -93202 -280234 -150561 -52659 -205790 -325264 -291267 -89767 -195941 -289973
20929b89973L7784J67098m8470k37440k15117K22551J92365l2522j9704Q8291
$$ -289973 -252189 -85091 -133561 -371001 -586118 -363567 -171202 -203724 -223428 -135137
20919a35137P5846r1443j45820l122K21481J02123j8465j11928j53225j63576
$$ -135137 -59291 -150734 -296554 -299676 -78195 23928 5463 -106465 -259690 -423266
20909d23266J17087J54439L34238k6264j20041l1233k46151l0619o5606K3387
$$ -423266 -306179 -151740 182498 156234 36193 4960 -241191 -271810 -337416 -314029
20899c14029j87703N2559m4479K34682K25893J53958O4082J76835L1966l38883
$$ -314029 -501732 -449173 -493652 -258970 -33077 120881 184963 361798 393764 54881
20889E4881k21389k00053J5738j02565l8936N0561N1490J79032O4938M4177N9734
$$ 54881 -166508 -366561 -350823 -453388 -492324 -441763 -390273 -211241 -146303 -102126 -42392
20878d2392j02962j58863p9255J76851K24383K0066J29058k21348q6221o9669
$$ -42392 -145354 -304217 -383472 -206621 17762 37828 166886 -54462 -140683 -210352
20868b10352J47906J32163j9253m2824P6791J0289j65121j53672j56382L8390
$$ -210352 -62446 69717 50464 7640 84431 94720 -70401 -224073 -380455 -342065
20858c42065l7484K03072o387L0578J46321K7065j03429P8475Q9013m7799m3594
$$ -342065 -379549 -176477 -182864 -152286 -5965 21100 -82329 -3854 85159 37360 -6234
20847f234J41683J2966n9626R5258k8953k31782j43071J17495J50200J45506m9028
$$ -6234 135449 148415 88789 184047 155094 -76688 -219759 -102264 47936 193442 144414
20836A44414k62395J43788K35186j72513K16953M5264j03523o0513j66723o9568
$$ 144414 -117981 25807 260993 88480 305433 350697 247174 186661 19938 -49630
20826d9630q8122K776j9037j25325N8764K7840k74931K9653J43266J45554q1470
$$ -49630 -137752 -134976 -154013 -279338 -220574 -192734 -467665 -438012 -294746 -149192 -230662
20815b30662M8338J57035k3880K51756J42727k01834n4916L18354O1410k07091
$$ -230662 -182324 -25289 -49169 202587 345314 143480 88564 406918 468328 261237
20805B61237P6889j32234j51162Q4802m5306Q4652M2800j04382k21688l42398
$$ 261237 338126 205892 54730 139532 94226 178878 221678 117296 -104392 -446790
20795d46790m9614J77050L09897J78007L7107l52637j28745l67218j54133J76910
$$ -446790 -496404 -319354 -9457 168550 205657 -146980 -275725 -642943 -797076 -620166
20785f20166J61659M65100J10204j23209J33334l50518l02148j98638M7794O6936
$$ -620166 -458507 6593 116797 -6412 126922 -223596 -525744 -724382 -676588 -609652
20775f09652K53847J64735L2019K10482k389j42715m4874R8933O5752R8854o6396
$$ -609652 -355805 -191070 -159051 51431 49042 -93673 -138547 -39614 26138 124992 58596
20764E8596k0721j86096m1034o6540m3548K40251J97072L3651l3999o1784j7279
$$ 58596 37875 -148221 -189255 -255795 -299343 -59092 137980 171631 137632 75848 58569
20753E8569L96719k14258k27777N8014Q3029j72625k29456j0387J30782N0986
$$ 58569 455288 241030 13253 71267 154296 -18329 -247785 -258172 -127390 -76404
20743g6404j37389q5319k5588o3462R2516j34102K94089J96691l2798O1375k88928
$$ -76404 -213793 -299112 -324700 -388162 -295646 -429748 -135659 61032 28234 89609 -199319
20732a99319K2806j59242n0454N6998J01311N6048O6296L3689P8328J40979k25938
$$ -199319 -176513 -335755 -386209 -329211 -227900 -171852 -105556 -71867 6461 147440 -78498
20721g8498L6522K28767K9000L1103o5479P4005K1498J232k43794k144j24970
$$ -78498 -41976 186791 215791 246894 181415 255420 276918 278150 34356 32212 -92758
20710i2758p1190k8093j63209k4820M8663J72882K21919R3241p3410j31446k14294
$$ -92758 -163948 -192041 -355250 -380070 -331407 -158525 63394 156635 83225 -48221 -262515
20699b62515j84699J81195L97895j27319K03174N563j12319n7542J57995j87181
$$ -262515 -447214 -266019 131876 4557 207731 213294 100975 43433 201428 14247
20689A4247J46630Q7133n1906j3786o3345m60358j47049O07K40727K27730j9126
$$ 14247 160877 248010 196104 182318 118973 -341385 -488434 -487827 -247100 -19370 -38496
20678c8496k06894J06033o0841o9515J41210J34930K02623j80628k35672L1767
$$ -38496 -245390 -139357 -200198 -269713 -128503 6427 209050 28422 -207250 -175483
20668a75483J82332K1992K6398J91436j09906l5049k827j72821m05766J731L00192
$$ -175483 6849 28841 55239 246675 136769 101720 98893 -73928 -479694 -477963 -177771
20657a77771J09102L35538J9901o4516o2242K9904L87789k6520j60375j1035l69376
$$ -177771 -68669 266869 286770 222254 160012 189916 577705 551185 390810 379775 10399
20646A0399k62350m4641K03403J60608J99999M6410j76401o2396J24560o4229
$$ 10399 -251951 -296592 -93189 67419 267418 313828 137427 75031 199591 135362
20636A35362l40331l6457R9287J161r0026J09378R0494J31682J506k55169p2199
$$ 135362 -204969 -241426 -142139 -140978 -231004 -121626 -31132 100550 102056 -153113 -225312
20625b25312K55352K0592j40999j81236j35230P4737K19219J83962n8882J03038
$$ -225312 30040 50632 -90367 -271603 -406833 -332096 -112877 71085 12203 115241
20615A15241k10953k05114K5178K90512K19650j38740J07503J06947o5911j90029
$$ 115241 -95712 -300826 -275648 14864 234514 95774 203277 310224 244313 54284
20605E4284j92151J96525J07628J36791j40088j98152k04869P6376N3808r9248
$$ 54284 -137867 58658 166286 303077 162989 -35163 -240032 -163656 -109848 -209096
20595b09096j47936k30512L5974R7372j63990J72347j6147j03948J20364N8267
$$ -209096 -357032 -587544 -551570 -454198 -618188 -445841 -461988 -565936 -445572 -387305
20585c87305m5218K74972K35353l2647j3189R2683J24230j74255l4138K20009
$$ -387305 -432523 -157551 77802 45155 31966 124649 248879 74624 40486 260495
20575B60495J35148j63897k22365j59668L24471j53647J22240K8506j89985K59273
$$ 260495 395643 231746 9381 -150287 174184 20537 142777 171283 -18702 240571
20565B40571k5343j91066k4059j1797o3496j59542K11111j2664j27594j09126
$$ 240571 215228 24162 103 -11694 -75190 -234732 -23621 -36285 -163879 -273005
20555b73005j03367Q4995J78747J30432M2545k97220J4998J92325j43237l30527
$$ -273005 -376372 -291377 -112630 17802 60347 -236873 -221875 -29550 -172787 -503314
20545e03314l3067K98776J36835k2314M8082R7025j85796m6272j07711k688J48289
$$ -503314 -536381 -237605 -100770 -123084 -75002 22023 -163773 -210045 -317756 -320444 -172155
20534a72155J89974J16194k42079j77306K01917L10926k04652k55238k12887k367
$$ -172155 17819 134013 -108066 -285372 -83455 227471 22819 -232419 -445306 -447673
20524d47673J75287J44562P2004J9017k84697p3597R0869l87153p9489l9548M75646
$$ -447673 -272386 -127824 -55820 -36803 -321500 -395097 -304228 -691381 -770870 -810418 -334772
20513c34772K30897j89873j31588L12282M02652q8304j60777k56483j16912M2901
$$ -334772 -103875 -293748 -425336 -113054 289598 201294 40517 -215966 -332878 -289977
20503b89977J09997K46341K08815j01190k85197k69727J08492L74113M4315k5437
$$ -289977 -179980 66361 275176 173986 -111211 -380938 -272446 101667 145982 120545
20493A20545J76372J7610K1190j53779k6602j51468K28217j52218k66064j78596
$$ 120545 296917 314527 335717 181938 155336 3868 232085 79867 -186197 -364793
20483c64793q9549L34797K87790K8343L5479P304k975o5001N9900N1373p6042
$$ -364793 -454342 -119545 168245 196588 232067 239371 236396 171395 231295 282668 206626
20472B06626j79844k21499q3015O9032K90900L0513N423j05378q2793k09738J01971
$$ 206626 26782 -194717 -277732 -208700 82200 112713 118136 12758 -70035 -279773 -177802
20461a77802m0713L47266N0792l51427j64559j5117O9518k14737m956k9705K70434
$$ -177802 -218515 128751 179543 -171884 -336443 -351560 -282042 -496779 -501735 -531440 -261006
20450b61006O9547J05016J09762O5187r1649k38322o1617l8373J33360L19181
$$ -261006 -191459 -86443 23319 88506 -3143 -241465 -303082 -341455 -208095 111086
20440A11086J9065k632K0055K6740j46018M1314j21469k16087J05226j09341J67514
$$ 111086 130151 127519 147574 174314 28296 69610 -51859 -267946 -162720 -272061 -104547
20429a04547R1824n165n4202k22098j0504k3924p4225K518L44890K33008K036
$$ -104547 -12723 -17888 -72090 -294188 -304692 -328616 -402841 -400323 -55433 177575 179611
20418A79611k88420k35614k50601L03732K17312K34671J26877J46453k71775r3197
$$ 179611 -108809 -344423 -595024 -291292 -73980 160691 287568 434021 162246 69049
20408F9049N6011K6273q3862j74921J06768K07542k3628k9878n5682l27430k74158
$$ 69049 125060 151333 67471 -107450 -682 206860 183232 153354 97672 -229758 -503916
20397e03916K80451K08220j42045j21971M8068N2562J87307o78n6800j77580j54822
$$ -503916 -223465 -15245 -157290 -279261 -231193 -178631 8676 7998 -48802 -226382 -381204
20386c81204k05317q0648O9017J77890K10888M36904j65669l04320P8246O7705
$$ -381204 -586521 -667169 -598152 -420262 -209374 227530 61861 -242459 -164213 -96508
20376i6508k5341j80214l71778j61315J561M11569J31634j29255j55931L2764
$$ -96508 -121849 -302063 -673841 -835156 -833595 -422026 -290392 -419647 -575578 -542814
20366e42814K55724j08727q1087L52575Q962j3393N884m0932l5136K8381j83837
$$ -542814 -287090 -395817 -476904 -124329 -115367 -128760 -122876 -163808 -198944 -170563 -354400
20355c54400k17042J57908j42804N8864K86962K41634q9895j33279l576j02382
$$ -354400 -571442 -413534 -556338 -497474 -210512 31122 -58773 -192052 -195628 -298010
20345b98010j35155K52265j22161j54959J03618J43857j71086M7266K48855K20752
$$ -298010 -433165 -180900 -303061 -458020 -354402 -210545 -381631 -334365 -85510 135242
20335A35242J69331j20723J1928n9127Q11j5331K38204Q054j63310p7977m3968
$$ 135242 304573 183850 195778 136651 137462 122131 360335 368389 205079 127102 83134
20324H3134K04438J10235j07185n4921j76757N9725J25747j33517J21161K97068
$$ 83134 287572 397807 290622 235701 58944 118669 244416 110899 232060 529128
20314E29128m3511j91120k77673j24049O3592K21292m9530m3570o9666R6966L64267
$$ 529128 485617 294497 16824 -107225 -43633 177659 128129 84559 14893 111859 476126
20303D76126K8393l2205L0511J05084N7329J57650l79100k21221o606k77183J00049
$$ 476126 504519 472314 502825 607909 665238 822888 443788 222567 215961 -61222 38827
20292C8827k0427j67522p2227J41803L1150P9890K20450K05821o8438j47270J36345
$$ 38827 18400 -149122 -221349 -79546 -48396 31494 251944 457765 389327 242057 378402
20281C78402k5402p0013j35532k92034L5184J70589K46891K21411j30992r6261
$$ 378402 353000 282987 147455 -144579 -109395 61194 308085 529496 398504 302243
20271C02243J77573l3209l24237j81927q7281j4485J95144J63155q7351q074l16674
$$ 302243 479816 446607 122370 -59557 -146838 -161323 33821 196976 109625 101551 -215123
20260b15123m49864o1985L10310N05026k34000m40810K19372L39055J71415q5816
$$ -215123 -664987 -726972 -416662 88364 -145636 -586446 -367074 -28019 143396 57580
20250E7580k0884k8648q0521N5639j6268P9031k45439K9359L0712k34712j78696
$$ 57580 36696 8048 -72473 -16834 -33102 45929 -199510 -170151 -139439 -374151 -552847
20239e52847J40923r9331M7333J85776J08642L5819J55222K25885p253j64495
$$ -552847 -411924 -511255 -463922 -278146 -169504 -133685 21537 247422 240169 75674
20229G5674l22279J0117q0793q6595K96617K67413J8583j02344j7875j02033l2983
$$ 75674 -246605 -236488 -317281 -403876 -107259 160154 178737 76393 58518 -43515 -76498
20218g6498P9714K9737j17494k36876J53819J4303n4707Q8448N8796L3285J865
$$ -76498 3216 32953 -84541 -321417 -167598 -153295 -208002 -119554 -60758 -27473 -25608
20207b5608L10530k3737j80396j04430o7556L13129O795j40561r9413r2120L0357
$$ -25608 284922 261185 80789 -23641 -91197 221932 228727 88166 -11247 -103367 -73010
20196g3010N0480j01445L64122K59846J1187m050n6465q275K75735l2181l53072
$$ -73010 -22530 -123975 240147 499993 511180 507130 450665 442390 718125 685944 332872
20185C32872o7361j00902n0751r714j69990j24904j11563J40607J21856K0687
$$ 332872 265511 164609 113858 104144 -65846 -190750 -302313 -161706 -39850 -19163
20175a9163o4260J73473J1288j46681j75168J33794J24635k06955k03428J60267
$$ -19163 -83423 90050 101338 -45343 -220511 -86717 37918 -169037 -372465 -212198
20165b12198n1174j0396L93576p3258m7413j9945J6321J95547Q4967K41099o0369
$$ -212198 -263372 -273768 119808 46550 -863 -20808 -4487 191060 276027 517126 456757
20154D56757k33222J1689r3527j23026P6973m4835P3458n1241k63366j48776K15678
$$ 456757 223535 235224 141697 18671 95644 50809 124267 73026 -190340 -339116 -123438
20143a23438J93092J38689k40826k00023J98577Q0491J7605r1936J30322j99752
$$ -123438 69654 208343 -32483 -232506 -33929 46562 64167 -27769 102553 -97199
20133i7199k65221K0127n912J47838K56173j32271j59550k90912j13669O0921
$$ -97199 -362420 -342293 -348205 -200367 55806 -76465 -236015 -526927 -640596 -579675
20123e79675O565M2108R0798q3903P6287J49751L22294r7884J8948l7496N1886
$$ -579675 -573110 -531002 -440204 -524107 -447820 -298069 24225 -73659 -54711 -92207 -40321
20112d0321K79432j99870l8713k51019Q6099Q4382K8166k4418k2493j58717P1464
$$ -40321 239111 39241 528 -250491 -164392 -80010 -51844 -76262 -98755 -257472 -186008
20101a86008P0923l19277J4426M34538M3589J73720P2010l79670j90182L2452
$$ -186008 -115085 -434362 -419936 14602 58191 231911 303921 -75749 -265931 -233479
20091b33479J94028K00999k24267k83700l07L9673l7920O3196p6091L86497K28853
$$ -233479 -39451 161548 -62719 -346419 -346726 -307053 -344973 -281777 -357868 28629 257482
20080B57482j30016j81254q5311K3726j6957J32034L22330J9913R986J4872j43233
$$ 257482 127466 -53788 -139099 -115373 -132330 -296 322034 341947 351933 366805 223572
20069B23572l8696p7348o3603j31301p7144O2347k47982l01244K37303J47739
$$ 223572 184876 107528 43925 -87376 -164520 -102173 -350155 -651399 -414096 -266357
20059b66357J73916J88688K92588n5807k09207k19078k01305p0104M1227j19986
$$ -266357 -92441 96247 388835 333028 123821 -95257 -296562 -366666 -325439 -445425
20049d45425J44464P4211L43405l72318k20569K02930P2808L1445K94067r697
$$ -445425 -300961 -226750 116655 -255663 -476232 -273302 -200494 -169049 125018 115321
20039A15321k44478K9951j08781N9785K89374p2050k42669j27783N4088M0461
$$ 115321 -129157 -99206 -207987 -148202 141172 69122 -173547 -301330 -247242 -206781
20029b06781O7649K33796L00524K83793j39398M9989j79659j69523j69332j6987
$$ -206781 -139132 94664 395188 678981 539583 589572 409913 240390 71058 54071
20019E4071k2502p8607J85446N3118Q4965K01197j00028J3130j84518J31136J01396
$$ 54071 31569 -47038 138408 191526 276491 477688 377660 390790 206272 337408 438804
20008D38804k09887l68780j47540K04753L08095K291j9057j86313l16214n9986
$$ 438804 228917 -139863 -287403 -82650 225445 227736 208679 22366 -293848 -353834
19998c53834M00408J88354M476J7342J5255k65358J08248j44L9065j75128j26575
$$ -353834 46574 234928 239404 256746 272001 6643 114891 114747 153812 -21316 -147891
19987a47891j78259o9420K10525p5541L04523K18082L00466m1570M9697J35807
$$ -147891 -326150 -395570 -185045 -260586 43937 262019 562485 520915 570612 706419
19977G06419l29714j29234M0056J2993p0803K68435j22912j90133j04660J92104
$$ 706419 376705 247471 287527 300520 229717 498152 375240 185107 80447 272551
19967B72551R1955n390j982R6407Q6136k52837k76846R5011N4709j4123p044K04614
$$ 272551 364506 359116 357134 453541 539677 286840 9994 105005 159714 145591 138547 343161
19955C43161l9130m03929j18548K59363J63364J92866J93012n2327j83794l51709
$$ 343161 304031 -99898 -218446 40917 204281 397147 590159 537832 354038 2329
19945B329j71427K10089L33520Q9525k35434k17899J62339O7503J67486j07663
$$ 2329 -169098 40991 374511 464036 228602 10703 173042 240545 408031 300368
19935C00368J68668q5711k75023K847O4484J58688j26105j03090K7074r1018o2819
$$ 300368 469036 383325 108302 111149 175633 334321 208216 105126 132200 41182 -21637
19924b1637p8561j7241Q306K15201J41319J5135l02164j34021K40585M88065J2074
$$ -21637 -100198 -117439 -109133 106068 247387 262522 -39642 -173663 66922 554987 567061
19913E67061k04268p3787K52173J77008o9495L23l97767j22273Q6291l5972k21358
$$ 567061 362793 289006 541179 718187 648692 649015 251248 128975 215266 179294 -42064
19902d2064l3316L87916O4922j82884k11257O9263j75757l48645m6284L59863
$$ -42064 -75380 312536 377458 194574 -16683 52580 -123177 -471822 -518106 -158243
19892a58243m4135J97098J70693j44096K69420J33097j86786N4199j73196l3117
$$ -158243 -202378 -5280 165413 21317 290737 423834 237048 291247 118051 84934
19882H4934Q3554k76270n6636O5104J05988J08066L956P8878J86209k01957j76176
$$ 84934 168488 -107782 -164418 -99314 6674 114740 118696 197574 383783 181826 5650
19871E650n4593O7924J47195K13706K4337l04560k54454n9957R6059L2554R6706
$$ 5650 -48943 18981 166176 379882 404219 99659 -154795 -214752 -118693 -86139 10567
19860A0567N1079J40865M8156L7859j13266J41721p220j29941j0093M70M8170
$$ 10567 61646 202511 250667 288526 175260 316981 309761 179820 169727 170197 218367
19849B18367m5428l01047j40972L6998j08091R1576M06043K26396j75498K51972
$$ 218367 172939 -128108 -269080 -232082 -340173 -248597 157446 383842 208344 460316
19839D60316K03219k57238j3753k53369l46989Q0290L8431j03153J6032N70106
$$ 460316 663535 406297 392544 139175 -207814 -127524 -89093 -192246 -176214 393892
19829C93892j6660J3543J37552j43817j31141p2943O9753R5590j97567p2620j71106
$$ 393892 377232 390775 528327 384510 253369 180426 250179 345769 148202 75582 -95524
19818i5524k22497M6979J25987J9637K47687Q143k96534K81961Q3187P0215J54767
$$ -95524 -318021 -271042 -145055 -125418 122269 130412 -166122 115839 199026 269241 424008
19807D24008k30841l39343q280n3428o1640M7424Q629m9163O2956P2191j20685
$$ 424008 193167 -146176 -154456 -207884 -269524 -222100 -213471 -262634 -199678 -127487 -248172
19796b48172K8105L20782J33647o898r7396l2232Q5060Q7445J30258N6892k34643
$$ -248172 -220067 100715 234362 227464 130068 97836 182896 270341 400599 457491 222848
19785B22848j27551R2527M2294j59567K44795m2776J71493k74074j02375o9487
$$ 222848 95297 187824 230118 70551 315346 272570 444063 169989 67614 -1873
19775a873j10815r3915K32626K94434j77149j48929r0682m8943m4838k26372K21962
$$ -1873 -112688 -206603 26023 320457 143308 -5621 -96303 -145246 -190084 -416456 -194494
19764a94494K99210J25448Q3894j14089k75366K50393Q2408Q8223J72246L3226
$$ -194494 104716 230164 314058 199969 -75397 174996 257404 345627 517873 551099
19754E51099q6457l85509r0817j110J82343O2009j89034J16124K5879k09690j02375
$$ 551099 464642 79133 -11684 -12794 169549 231558 42524 158648 184527 -25163 -127538
19743a27538k24950P6956j5856j9210J08426K41268J78126k06684P3539J59058
$$ -127538 -352488 -275532 -291388 -310598 -202172 39096 217222 10538 84077 243135
19733B43135k73904R8661Q0604j04824N639R3387j10537j41313K0497K57626K37655
$$ 243135 -30769 67892 148496 43672 49311 142698 32161 -109152 -88655 168971 406626
19722D06626J95753J51407l9925j80951j36864R485J88662j59496j73960R8902
$$ 406626 602379 753786 713861 532910 396046 405531 594193 434697 260737 359639
19712C59639P2725J7216J60271L52769k68914l25553O9318J08925j5025k62311
$$ 359639 432364 449580 609851 962620 693706 368153 437471 546396 531371 269060
19702B69060k7092l5027k28340j5846q4486K38515K393k00205J19151N9166k24263
$$ 269060 241968 206941 -21399 -37245 -121731 116784 119177 -81028 38123 97289 -126974
19691a26974J62220K01211J9840j75886P8429L02302k12494j09429n1312L3187
$$ -126974 35246 236457 256297 80411 158840 461142 248648 139219 87907 121094
19681A21094j5174j972p7061K4497J06697J49343k05639K62402K42511l01144
$$ 121094 105920 103948 26887 51384 158081 307424 101785 364187 606698 305554
19671C05554k98147K59686J3351P1301n6771k83746k4834K20320J63451j6927
$$ 305554 7407 267093 280444 351745 294974 11228 -13606 206714 370165 353238
19661C53238l8074p959l10283J35645K8409K44458J411l26385q0454K65529j94758
$$ 353238 315164 307205 -3078 132567 160976 405434 406845 80460 6 265535 70777
19650G0777j54228J2570K28904N515m3753J44133J16066j61819n5706l8141J68698
$$ 70777 -83451 -70881 158023 163538 119785 263918 379984 218165 162459 124318 293016
19639B93016J11852j91257l5155j80381l222J70431k69274j20215J97823l4381
$$ 293016 404868 213611 178456 -1925 -5147 165284 -103990 -224205 -26382 -60763
19629f0763J85131J86256o6980Q8215j47495j24582J82765L642P6276M375P2287
$$ -60763 124368 310624 243644 331859 184364 59782 242547 246189 322465 326840 399127
19618C99127R0463j70065P2880j87966J45473R7314j63984n1344J63070P0330
$$ 399127 489590 319525 392405 204439 349912 447226 283242 231898 394968 465298
19608D65298q7775n4041Q3701K8253k88522q2212R6659J11694J1180L00341K2475
$$ 465298 377523 323482 407183 435436 146914 64702 161361 273055 284235 584576 607051
19597F07051m5284J99732R8270k4697j24265r0178p088J75750J36936k9108M02129
$$ 607051 561767 761499 859769 835072 710807 620629 613541 789291 926227 897119 1299248
19586A299248J08255m72234m33078n6962k782K43114M6503J15394j75907J28754
$$ 1299248 1407503 935269 502191 445229 442447 685561 732064 847458 671551 800305
19576H00305M3737R8877j90045n0938K01612K88947N45138M91238j52448m2924
$$ 800305 844042 942919 752874 701936 903548 1192495 1737633 2228871 2076423 2033499
19566B033499K26001N17076P2085r537j31495p4226r9873J40584j55333k00042
$$ 2033499 2259500 2776576 2848661 2839124 2707629 2633403 2533530 2674114 2518781 2318739
19556B318739P2926M2898L28992K61027N3751J9762m353j88706l16532k99350
$$ 2318739 2391665 2434563 2763555 3024582 3078333 3098095 3093742 2905036 2588504 2289154
19546B289154k38548j22170k47591j63631j31306J62626j26562k91614n4620N1433
$$ 2289154 2050606 1928436 1680845 1517214 1385908 1548534 1421972 1130358 1075738 1127171
19536A127171J50184M8827J86551p4808m52011Q361O0615j26040N4218k08347
$$ 1127171 1277355 1326182 1512733 1437925 985914 994275 1054890 928850 983068 774721
19526G74721K345J6954q3044J12603J64139l8502J73262J71150k34911k63906
$$ 774721 777066 794020 710976 823579 987718 949216 1122478 1293628 1058717 794811
19516G94811Q6280k08553j7674r2661l1867k1803J39487R6164O0227J81434K71071
$$ 794811 881091 672538 654864 562203 530336 508533 648020 744184 804411 985845 1256916
19505A256916L23077q4757l51325m14026L2718k4516R5546K08211j75844K1631
$$ 1256916 1579993 1495236 1143911 729885 762603 738087 833633 1041844 866000 887631
19495H87631J48267J80675R7908J07001n3854K12458j88400k93998j76781o5847
$$ 887631 1035898 1216573 1314481 1421482 1367628 1580086 1391686 1097688 920907 855060
19485H55060j69877R0288j25261n6673q4290p3700Q6698O5945J45676k5357j7753
$$ 855060 685183 775471 650210 593537 509247 435547 522245 588190 733866 708509 690756
19474F90756p0499k1336K14191P2337J60393k48954p3189r4186K71544K08270
$$ 690756 620257 598921 813112 885449 1045842 796888 723699 629513 901057 1109327
19464A109327p1495j04523j48573o6113q7666K7083O8172L7270L1381J50010K08461
$$ 1109327 1037832 933309 784736 718623 630957 658040 726212 763482 794863 944873 1153334
19453A153334O2173k29866p2309J63475O6232m5878j04985P6482J02626r3633
$$ 1153334 1215507 985641 913332 1076807 1143039 1097161 992176 1068658 1171284 1077651
19443A077651j25818L8172m9674J14330l5401j69495R1431j09016j10609k11049
$$ 1077651 951833 990005 940331 1054661 1019260 849765 941196 832180 721571 510522
19433E10522J66681K81673k24663j16158J30800P5495J86463J12412j77011n974
$$ 510522 677203 958876 734213 618055 748855 824350 1010813 1123225 946214 940240
19423I40240M5670P109q9051J3115K78019L58585N7224L9775k81810l51632j09571
$$ 940240 985910 993019 903968 917083 1195102 1553687 1610911 1650686 1368876 1017244 907673
19412I07673L20653P5393M5622j89635p5007N8244j59755q7441m8505j1703K22606
$$ 907673 1228326 1303719 1349341 1159706 1084699 1142943 983188 895747 847242 835539 1058145
19401A058145K67298l53094k91183J88170j57584k4547J4975j13740M28949K89681
$$ 1058145 1325443 972349 681166 869336 711752 687205 702180 588440 1017389 1307070
19391A307070j92326k56946k0345N6285j65759J55125K72469Q3175N6529q1239
$$ 1307070 1114744 857798 837453 893738 727979 883104 1155573 1238748 1295277 1214038
19381A214038j84220M7421K5851k87386j29891l9698K49355J78065k60220K9543
$$ 1214038 1029818 1077239 1103090 815704 685813 646115 895470 1073535 813315 842858
19371H42858j22445l0723L27860Q8407k60407K09289L0678k66339j72402j550
$$ 842858 720413 689690 1017550 1105957 845550 1054839 1085517 819178 646776 645226
19361F45226n3004O7269L92331J37831k9104q0272J26805J03870l6740K86281
$$ 645226 592222 659491 1051822 1189653 1160549 1080277 1207082 1310952 1274212 1560493
19351A560493O4329j04633k76720r2341K949M2969j32392J29680k2920r1667l43449
$$ 1560493 1624822 1520189 1243469 1151128 1154077 1197046 1064654 1194334 1171414 1079747 736298
19340G36298K25730K85387L3085r0214R3474O0253j04455L7591J43580m5973L91280
$$ 736298 962028 1247415 1280500 1190286 1283760 1344013 1239558 1277149 1420729 1374756 1766036
19329A766036L37372q7665j74992m3842m1794j88975j03324J27202J5144k24189
$$ 1766036 2103408 2015743 1840751 1796909 1755115 1566140 1462816 1590018 1605162 1380973
19319A380973j26346K05699j04882Q0697j69556O3269J12298O7448K91584K7042
$$ 1380973 1254627 1460326 1355444 1436141 1266585 1329854 1442152 1509600 1801184 1828226
19309A828226P4346l4262j02904K2905O1291o5140j78625j08096K5572L81379
$$ 1828226 1902572 1868310 1765406 1788311 1849602 1784462 1605837 1497741 1523313 1904692
19299A904692J32747L95272J83387j69361l99417J72104J55084r9866L6463L4007
$$ 1904692 2037439 2432711 2616098 2446737 2047320 2219424 2374508 2274642 2311105 2345112
19289B345112K46491J38715K35620o5991l08750l05351K50599K91522k26610k47063
$$ 2345112 2591603 2730318 2965938 2899947 2591197 2285846 2536445 2827967 2601357 2354294
19279B354294j15344j18954j12548k24908j6445R0796J78298o4013n517r6255
$$ 2354294 2238950 2119996 2007448 1782540 1766095 1856891 2035189 1971176 1965659 1869404
19269A869404l46532J9265K81m82699j1860p202R0887J71829J952N3450M3445
$$ 1869404 1522872 1542137 1542418 1059719 1047859 1040657 1131544 1303373 1305325 1358775 1402220
19258A402220J08964J28828J18083K07921J9035O6014k22710k31621L74857L91896
$$ 1402220 1511184 1640012 1758095 1966016 1985051 2051065 1828355 1596734 1971591 2363487
19248B363487m2212m9210J97825M07989L20088J18957m1920j50562Q756J83081
$$ 2363487 2321275 2272065 2469890 2877879 3197967 3316924 3275004 3124442 3133198 3316279
19238C316279K85881j38824m20975j16936K38277P7289q4991L3498n3933k97425
$$ 3316279 3602160 3463336 3042361 2925425 3163702 3240991 3156000 3189498 3135565 2838140
19228B838140j31255j84820r7171m5451m3950L6779k4350j29479m3114R725J69696
$$ 2838140 2706885 2522065 2424894 2379443 2335493 2372272 2347922 2218443 2175329 2185054 2354750
19217B354750K5885m5221m29817p6770J84905o1488J395k78857J28323P9606K46411
$$ 2354750 2380635 2335414 1905597 1828827 2013732 1952244 1953639 1674782 1803105 1882711 2129122
19206B129122J50695k6784k32433J29911J19047J28906l162o0996K78564K78163
$$ 2129122 2279817 2253033 2020600 2150511 2269558 2398464 2395302 2334306 2612870 2891033
19196B891033J28741l24269l07708k00724K85281K56326q9148q1292j28502J6539
$$ 2891033 3019774 2695505 2387797 2187073 2472354 2728680 2639532 2558240 2429738 2446277
19186B446277r7504K72900r0854k17933k22930j93809J38972r4172J46487L53452
$$ 2446277 2348773 2621673 2530819 2312886 2089956 1896147 2035119 1940947 2087434 2440886
19176B440886J17008P344O7028J10010j48635K47198J71177K04056J6466j41560
$$ 2440886 2557894 2565238 2632266 2742276 2593641 2840839 3012016 3216072 3232538 3090978
19166C090978L2602J94231P4995K9206O8245j86285k1182K08042N0380J37763
$$ 3090978 3123580 3317811 3392806 3422012 3490257 3303972 3282790 3490832 3541212 3678975
19156C678975l109k35767k09113j3109j15789K51172R3855j57925k81871k01793
$$ 3678975 3675866 3440099 3230986 3217877 3102088 3353260 3447115 3289190 3007319 2805526
19146B805526j17544n7108r7890K54268J02956L3468j10738J6863p0928j65732
$$ 2805526 2687982 2630874 2532984 2787252 2890208 2923676 2812938 2829801 2758873 2593141
19136B593141J33197J83464J39401L1909j02367j11346m3054o5929l0476J31275
$$ 2593141 2726338 2909802 3049203 3081112 2978745 2867399 2824345 2758416 2727940 2859215
19126B859215K96038R3182J03381o5829P0700K42460L01766k28298k34435J07165
$$ 2859215 3155253 3248435 3351816 3285987 3356687 3599147 3900913 3672615 3438180 3545345
19116C545345o5567R1482k5628p1919j2985P9675N719L90170J54659p2796m1781
$$ 3545345 3479778 3571260 3545632 3473713 3460728 3540403 3546122 3936292 4090951 4018155 3976374
19105C976374k03420j04137j9668p1000k03303n19695j43322R1181J03917L809
$$ 3976374 3772954 3668817 3649149 3578149 3374846 2855151 2711829 2803010 2906927 2910736
19095B910736L31656J54959j61733l44916o8785J04919J60973L99832K34226K2238
$$ 2910736 3242392 3397351 3235618 2890702 2821917 2926836 3087809 3487641 3721867 3744105
19085C744105J88746J0498j3589K07630J78717n680K00818J08444K4820q7973
$$ 3744105 3932851 3943349 3929760 4137390 4316107 4310427 4511245 4619689 4644509 4556536
19075D556536K5124P1224r97J09443k02794m11369p1366J7730p4333k34531J41313
$$ 4556536 4581660 4652884 4651887 4761330 4558536 4147167 4075801 4093531 4019198 3784667 3925980
19064C925980J10288j92550o4776K843j99015K8225Q2831k6014N37460L90428
$$ 3925980 4036268 3843718 3778942 3781785 3582770 3610995 3693826 3667812 4205272 4595700
19054D595700K36492J21137J45765k0661J78235J64210O6866J43780J42897K16658
$$ 4595700 4832192 4953329 5099094 5078433 5256668 5420878 5487744 5631524 5774421 5991079
19044E991079K03077q0538r8580k9251L47499J97769J78699K30290O7852k89247
$$ 5991079 6194156 6113618 6015038 5985787 6333286 6531055 6709754 6940044 7007896 6718649
19034F718649k11621j12200q8330p6359J88758N316j98987m02453j52913q6582
$$ 6718649 6507028 6394828 6306498 6230139 6418897 6424213 6225226 5822773 5669860 5583278
19024E583278M8417m7568j48808k57096N2842J06311m5502j15514q2226k0205
$$ 5583278 5631695 5584127 5435319 5178223 5231065 5337376 5291874 5176360 5094134 5073929
19014E073929n2234K8212P1255j49598n9400K75p5141K84309J10298J12067j35102
$$ 5073929 5021695 5049907 5121162 4971564 4912164 4912439 4837298 5121607 5231905 5343972 5208870
19003E208870l94524k16739l15191o1266J20884m1756j84867J03719L06930L43918
$$ 5208870 4814346 4597607 4282416 4221150 4342034 4300278 4115411 4219130 4526060 4869978
18993D869978J4726m98455r9241L14617J22141r3495p9941M189N9050J38054R2350
$$ 4869978 4884704 4386249 4287008 4601625 4723766 4630271 4550330 4554519 4613569 4751623 4843973
18982D843973K76343J60682K20655j71377l24307P425J66598q9500J83868J28878
$$ 4843973 5120316 5280998 5501653 5330276 5005969 5013394 5179992 5090492 5274360 5403238
18972E403238J7159J74366L76949N68148L47654K15008Q4534L34845M17314O4267
$$ 5403238 5420397 5594763 5971712 6539860 6887514 7102522 7187056 7521901 7939215 8003482
18962H003482j74954M9086J47295M8884R4737K52862L54462M81662K35338M36954
$$ 8003482 7828528 7877614 8024909 8073793 8168530 8421392 8775854 9257516 9492854 9929808
18952I929808M93765N69077N70644P59740O30908O42820P42020O88118N09239
$$ 9929808 10423573 10992650 11563294 12323034 12953942 13596762 14338782 15026900 15536139
18943A5536139L00596R12576J286140J250371J111551J333532J651525K438428
$$ 15536139 15836735 16749311 18035451 19285822 20397373 21730905 23382430 25820858
18935B5820858L586156M471946N978458Q690102J3487225K2683424L6663402M7599195
$$ 25820858 29407014 33878960 39857418 48547520 62034745 84718169 121381571 168980766
18927A68980766M2394429L0993185L9036483O1354436O5267986K3331197k9819785
$$ 168980766 211375195 242368380 281404863 342759299 408027285 431358482 401538697
18920D01538697k8530721O367485K6686700J2985904j7315302k7654083j0909027
$$ 401538697 373007976 379375461 406062161 419048065 401732763 374078680 363169653
18913C63169653K3656849N0412294L6755861k0439460n2902250l1543139p230974
$$ 363169653 386826502 437238796 473994657 453555197 400652947 369109808 361878834
18906C61878834j5187174n1739488p0343830n4367782l3499557k0273219j3209953
$$ 361878834 346691660 294952172 224608342 170240560 136741003 116467784 103257831
18899A03257831r459534p537687n818396m256672l219814k933436k545337k795625
$$ 103257831 93798297 86260610 80442214 76185542 72965728 70032292 67486955 64691330
18891F4691330k394189j881377j746849j592316j922154j877413j212482j186237
$$ 64691330 62297141 60415764 58668915 57076599 55154445 53277032 52064550 50878313
18883E0878313j228697j230189j337596r26969p36098j002362r97164r43197j010515
$$ 50878313 49649616 48419427 47081831 46154862 45418764 44416402 43419238 42476041 41465526
18874D1465526j349073j219376q57692j095763p73753q39307n18084m98765n51592
$$ 41465526 40116453 38897077 38039385 36943622 36169869 35330562 34812478 34313713 33762121
18865C3762121o21250p20119q43830p71073o43587q78056q87236p58812o14847
$$ 33762121 33140871 32420752 31576922 30805849 30162262 29284206 28396970 27638158 27023311
18856B7023311n74272k40493m20273n65730n85152m05479o19029o52420o07818
$$ 27023311 26449039 26208546 25788273 25222543 24637391 24231912 23612883 22960463 22352645
18847B2352645o26043l88646m58434l60131n35482j01748l75865k9060j11743
$$ 22352645 21726602 21337956 20879522 20519391 19983909 19882161 19506296 19477236 19365493
18838A9365493j32437j06016j67089q9099j14107j96516j45436o9626j35904k99550
$$ 19365493 19233056 19127040 18959951 18870852 18756745 18560229 18414793 18345167 18209263 17909713
18828A7909713k21607k16466l58897q4516K36143j60610j87254j0635l59015j77605
$$ 17909713 17688106 17471640 17112743 17028227 17264370 17103760 16916506 16905871 16546856 16369251
18818A6369251J40879m5281J12083J70191K54562K60822K90156K09928K67515
$$ 16369251 16510130 16464849 16576932 16747123 17001685 17262507 17552663 17762591 18030106
18809A8030106L28221K08975J57069M4393N33741P65111R06145J044022J274568
$$ 18030106 18358327 18567302 18724371 18768764 19302505 20067616 20973761 22017783 23292351
18800B3292351R18739J205258K280394K372479L011288M676888O964050J0291822
$$ 23292351 24211090 25416348 27696742 30069221 33080509 37757397 44721447 55013269
18792E5013269J4903817J7408030J7654346J9044332K2321446K2088949J4942675
$$ 55013269 69917086 87325116 104979462 124023794 146345240 168434189 183376864
18785A83376864O228909M842083Q214830M748099n014184o167452L162442Q540779
$$ 183376864 189605773 194447856 202662686 207410785 202396601 196229149 199391591 207932370
18777B07932370Q27758j2241946j6300720j2316798j3019968k0286853k4598897
$$ 207932370 208760128 196518182 180217462 167900664 154880696 134593843 109994946
18770A09994946k0937874j4391975r345441o339505m170599k967730k180731j698744
$$ 109994946 89057072 74665097 65319656 58980151 54809552 51841822 49661091 47962347
18762D7962347j360836q32636q02827n87726l8353K10098O3175j63566j67848
$$ 47962347 46601511 45768875 44966048 44378322 44339969 44550067 44613242 44449676 44281828
18753D4281828O40095P23416P59063J581713K108108K621104M133479O637370
$$ 44281828 44921923 45645339 46404402 47986115 50094223 52715327 56848806 63486176
18745F3486176J0520377J6475605K3628849K9146854K9281620L0676170L8687704
$$ 63486176 74006553 90482158 114111007 143257861 172539481 203215651 241903355
18738B41903355M3567735L2977228J4307921Q212466J4051582R972601p425829
$$ 241903355 285471090 318448318 332756239 340968705 355020287 364992888 357567059
18731C57567059j3617605k044471K396647j1937636k5091512k3494989j8243766
$$ 357567059 343949454 341904983 344301630 332363994 307272482 283777493 265533727
18724B65533727k4222446l6408964l8642085l0665739k1085103j4140556j0253062
$$ 265533727 241311281 204902317 166260232 135594493 114509390 100368834 90115772
18717I0115772p702386n687574m341716l389725l178047k727184k261666k201990
$$ 90115772 82413386 76725812 72384096 68994371 65816324 63089140 60827474 58625484
18709E8625484k214479j754837j292421j390869j561094j165346j045502j489973
$$ 58625484 56411005 54656168 53363747 51972878 50411784 49246438 48200936 46710963
18701D6710963j313127j042538p43729r19343r67844q06149r38946j036868o85344
$$ 46710963 45397836 44355298 43611569 42692226 41724382 40918233 39979287 38942419 38257075
18692C8257075l05400o71231j146138j274401p22448p91675n77173n39257n83677
$$ 38257075 37951675 37280444 36134306 34859905 34137457 33345782 32768609 32229352 31645675
18683C1645675n79585m35319k50313l19928k17463q2613R6658J68685R6954J52987
$$ 31645675 31066090 30630771 30380458 30060530 29843067 29760454 29857112 30025797 30122751 30275738
18673C0275738N73910M17070M94090Q59444O74261R92284J330624J385009J868725
$$ 30275738 30849648 31266718 31760808 32620252 33294513 34286797 35617421 37002430 38871155
18664C8871155L022023N293515P765297J1727150J6705699J9346963J9021784
$$ 38871155 41893178 47186693 54951990 66679140 83384839 102731802 121753586
18657A21753586K1113444K4918973K1785504R360240P00029M132231Q730440N708380
$$ 121753586 142867030 167786003 189571507 198931747 199631776 203764007 212494447 218202827
18649B18202827q94222k7872J0437613J7893575Q679596j2576542k2375890j8372802
$$ 218202827 217308605 217280733 227718346 245611921 254291517 241714975 219339085 200966283
18641B00966283j8699259k7244133k9388940k1939888j4099617q944666n996850
$$ 200966283 182267024 155022891 125633951 103694063 89594446 80649780 74652930
18634G4652930l857416k617424j766085m15909N779Q43413K051020L668704O462811
$$ 74652930 70795514 68178090 66412005 65996096 66001875 66845288 68896308 72565012 79027823
18625G9027823J0429709J6349709K1754164K1453731J5799085J3151408J4137322
$$ 79027823 89457532 105807241 127561405 149015136 164814221 177965629 192102951
18618A92102951R604904l293486j3660751o799610J0648633K5871646K8904099
$$ 192102951 201707855 198414369 184753618 177954008 188602641 214474287 243378386
18611B43378386K5377234K9082759L6641990K9049459j89536k0004719r537829
$$ 243378386 268755620 297838379 334480369 363529828 363340292 343335573 333797744
18604C33797744R970013J5301078K809607m311154P300240K1001170J5254030
$$ 333797744 343767757 359068835 361878442 357567288 364867528 385868698 401122728
18597D01122728j3516041l4622458l1119557k4604815l1249046m2014023l9417097
$$ 401122728 387606687 352984229 321864672 297259857 266010811 223996788 184579691
18590A84579691k8448040j8675596j2664314q454940n767317m162364k574475
$$ 184579691 156131651 137456055 124791741 116336801 110569484 106407120 103832645
18583A03832645j286111K43119K141060N121164R190744J5636008K5438524L7616803
$$ 103832645 102546534 102789653 104930713 110051877 119242621 134878629 160317153 197933956
18575A97933956M4053419L7864101K9265092K7444033K2402946J199431k9966290
$$ 197933956 241987375 279851476 309116568 336560601 358963547 360162978 330196688
18568C30196688m2385387l3215739j5766490j915351L698712N860345N158123
$$ 330196688 287811301 254595562 238829072 236913721 240612433 246472778 251630901
18561B51630901P84220r724383k2766107l0873602l2755177k6060780j7498721
$$ 251630901 252415121 242690738 219924631 189051029 156295852 130235072 112736351
18554A12736351j1927049q326062o012210m708429l902999l143346k363043k237769
$$ 112736351 100809302 92483240 86471030 81762601 77859602 74716256 72353213 70115444
18546G0115444k177041k115684j926957j633209j322003r88354r40913r24854
$$ 70115444 67938403 65822719 63895762 62262553 60940550 59952196 59011283 58086429
18538E8086429l50767l17211J39620L32766P36155J152687J819594L534999O531813
$$ 58086429 57735662 57418451 57558071 57890837 58626992 59779679 61599273 65134272 71666085
18529G1666085J0565186J7106388K2964182K2071881J4349305J1582233J3004416
$$ 71666085 82231271 99337659 122301841 144373722 158723027 170305260 183309676
18522A83309676P378829j0242005k4859537k0682592p495793K523392M498389
$$ 183309676 190688505 180446500 155586963 134904371 127408578 129931970 134430359
18515A34430359K268272K861653L246677k168597j4155375k2324554j8916362
$$ 134430359 136698631 139560284 142806961 140638364 126482989 104158435 85242073
18508H5242073j2630565q370248o239795m881313l572062k406656j814933j479710
$$ 85242073 72611508 64241260 58001465 53120152 49548090 47141434 45326501 43846791
18500D3846791j559571j139455r58966j074751j101347q28104r96308p81076o34683
$$ 43846791 42287220 41147765 40188799 39114048 38012701 37184597 36188289 35407213 34772530
18491C4772530m96064m91111q5741o18182o20826n66799p20659p15396n54157
$$ 34772530 34276466 33785355 33699614 33081432 32460606 31893807 31173148 30457752 29903595
18482B9903595n24551m43097k51125l89785n97835n67853p47045l93552l64330
$$ 29903595 29379044 28935947 28684822 28295037 27697202 27129349 26382304 25988752 25624422
18473B5624422n92966o05679m80883n75458n63781m22578k74429m91378o31886
$$ 25624422 25031456 24425777 23944894 23369436 22805655 22383077 22108648 21617270 20985384
18464B0985384n07257k16512l11106n81684j92533n0836k39058k11492j27723
$$ 20985384 20478127 20261615 19950509 19368825 19176292 19125456 18886398 18674906 18547183
18455A8547183k22788l57581l12192j9515j52925p5763J0811r0785m5773k6509
$$ 18547183 18324395 17966814 17654622 17635107 17482182 17406419 17417230 17326445 17280672 17254163
18445A7254163r76J64977J08079J52262P1820l7922m9542J71868J75925M92342
$$ 17254163 17253187 17418164 17526243 17678505 17750325 17712403 17662861 17834729 18010654 18502996
18435A8502996J78473K79450K81153L77226J55393l81441k45499J71159R9860
$$ 18502996 18681469 18960919 19242072 19619298 19774691 19393250 19147751 19318910 19418770
18426A9418770L15608M79587P92016J337223R88845Q90179J442767K004095K929636
$$ 19418770 19734378 20213965 21005981 22343204 23332049 24222228 25664995 27669090 30598726
18417C0598726M421397O384381R409300J4565868K1260035K7166825K7422267
$$ 30598726 35020123 41404504 50813804 65379672 86639707 113806532 141228799
18410A41228799K0520638J6905488J7935838J3528195o10303j4680603j2186272
$$ 141228799 161749437 178654925 196590763 210118958 209508655 194828052 182641780
18403A82641780R51014P077987N138090N407065Q070668J879195j7377818l5070016
$$ 182641780 183592794 190670781 195808871 201215936 209286604 211165799 193787981 158717965
18395A58717965l5849523k6192470j7013941j1167641p827035n334507l770660
$$ 158717965 122868442 96675972 79662031 68494390 60667355 55332848 51562188
18388E1562188k587772j792867j630954j383119r49041q10779j046890r77176
$$ 51562188 48974416 47181549 45550595 44167476 43218435 42407656 41360766 40383590
18380D0383590n17781j51166J02097P032J85613P19600R10613J239900J816135
$$ 40383590 39865809 39714643 39816740 39823772 40009385 40728985 41639598 42879498 44695633
18371D4695633L058105M587690O494728J0040832J5651521K4425712L3806124
$$ 44695633 47753738 52341428 58836156 68876988 84528509 108954221 142760345
18364A42760345L6271955K8544317K1668234K2804409K0880889M791998j6300920
$$ 142760345 179032300 207576617 229244851 252049260 272930149 277722147 261421227
18357B61421227j9757759n082262O347197O625731N712072P488589K346248j7249027
$$ 261421227 241663468 236581206 242928403 249554134 255266206 262754795 265101043 247852016
18349B47852016l9690435m5600536l5779836k3965401j5435605j0610858p748899
$$ 247852016 208161581 162561045 126781209 102815808 87380203 76769345 69020446
18342F9020446n785566l856199l028456k434197j856195j756276j650923j674128
$$ 69020446 63234880 59378681 56350225 53916028 52059833 50303557 48652634 46978506
18334D6978506j683250j573607j027590p48175q21423m25833k50229k15962l42720
$$ 46978506 45295256 43721649 42694059 41945884 41124461 40698628 40448399 40232437 39889717
18325C9889717o33570K75672Q99820J469663K041669M006582O845561J0675458
$$ 39889717 39256147 39531819 40431639 41901302 43942971 47949553 54795114 65470572
18317F5470572J2883789J1006949P730566P777039Q331123M432800m607271r169251
$$ 65470572 78354361 89361310 97091876 104868915 113200038 117632838 113025567 103856316
18309A03856316l926417P97759J224052J050390K185344J757194n255796j4322984
$$ 103856316 99929899 100727658 101951710 103002100 105187444 106944638 101688842 87365858
18301H7365858j7092757j3554867q881421n952634m279165k904910k250180k083123
$$ 87365858 70273101 56718234 47836813 41884179 37605014 34700104 32449924 30366801
18293C0366801j380595j159103j164210o71687n22760q46316p67144o03447k09360
$$ 30366801 28986206 27827103 26662893 25991206 25468446 24622130 23854986 23251539 23042179
18284B3042179j16610j87460l01706l11174m78128j65493l69539o09057l59061
$$ 23042179 22925569 22738109 22436403 22125229 21647101 21481608 21112069 20503012 20143951
18275B0143951l7946j68039k06105Q7776j5698j3064n28524o36767m31587m50624
$$ 20143951 20106005 19937966 19731861 19819637 19803939 19790875 19262351 18625584 18193997 17743373
18265A7743373k48709m4404j31553k73532k58909j04703j04626l62482o64774
$$ 17743373 17494664 17450260 17318707 17045175 16786266 16681563 16576937 16214455 15549681
18256A5549681m28282k93999m66343o11629o72448q43239m32317m08643m14465
$$ 15549681 15121399 14827400 14361057 13749428 13076980 12233741 11801424 11392781 10978316
18247A0978316l84329j39006k19372j79117o2978k68163p6356N8182j55460j16433
$$ 10978316 10593987 10454981 10235609 10056492 9993514 9725351 9648995 9707177 9551717 9435284
18237I435284J83453K05448K01581N1117k62752j38171J72031k9288j65364m33211
$$ 9435284 9618737 9824185 10025766 10076883 9814131 9675960 9847991 9818703 9653339 9220128
18227I220128k96795M2083j10035K20317O2926k35559k15941j86563o31694j66115
$$ 9220128 8923333 8965416 8855381 9075698 9138624 8903065 8687124 8500561 7868867 7702752
18217G702752J02847J09188j85970j55044p2367k48495k36113m23799j39445K643
$$ 7702752 7805599 7914787 7728817 7573773 7501406 7252911 7016798 6592999 6453554 6456197
18207F456197j27579j1663l14083l71837k74514p8973j13197m1471K0921O1585
$$ 6456197 6328618 6316955 6002872 5631035 5356521 5277548 5164351 5122880 5143801 5205386
18197E205386J16530K51999j43145l5723L3575K49986K55112J82567K19392R9777
$$ 5205386 5321916 5573915 5430770 5395047 5428622 5678608 5933720 6116287 6335679 6435456
18187F435456N4366L61424K24280j85205l72049o0829m08535l55085k18444o12229
$$ 6435456 6489822 6851246 7075526 6890321 6518272 6457443 6048908 5693823 5475379 4863150
18177D863150l83658j02556Q5215k5938k18517l23528k02953N16J90122k92608
$$ 4863150 4479492 4376936 4462151 4436213 4217696 3894168 3691215 3691731 3881853 3589245
18167C589245o4169L16997J50329j53152k86443l78114j64008k2284P0609L209
$$ 3589245 3525076 3842073 3992402 3839250 3552807 3174693 3010685 2988401 3059010 3062219
18157C062219N517J9034J6014j66800p4824R5572k68803j23150R0538K14867j05129
$$ 3062219 3067736 3086770 3102784 2935984 2861160 2956732 2687929 2564779 2655317 2870184 2765055
18146B765055j02670N98594O29859k3893J51906L02213K46803K59315J94453J38569
$$ 2765055 2662385 3260979 3890838 3866945 4018851 4321064 4567867 4827182 5021635 5160204
18136E160204P8884q1500J56839N5313k4631k12962k85370k94028j28882j41362
$$ 5160204 5239088 5157588 5314427 5369740 5345109 5132147 4846777 4552749 4423867 4282505
18126D282505l7336j21561n07978k02734k03126j70259k47805j43386j18181M9985
$$ 4282505 4245169 4123608 3615630 3412896 3209770 3039511 2791706 2648320 2530139 2580124
18116B580124p0826q7013r1670k0506K52370j8142j20377o6028J82493k07136
$$ 2580124 2509298 2422285 2330615 2310109 2562479 2544337 2423960 2357932 2540425 2333289
18106B333289r8578K41381R9459k05397R5651K13027k14926J08004p0533j44243
$$ 2333289 2234711 2476092 2575551 2370154 2465805 2678832 2463906 2571910 2501377 2357134
18096B357134j33134L0810J01176J20346Q7170j7644O0919J18728J37459K75104
$$ 2357134 2224000 2254810 2355986 2476332 2563502 2545858 2606777 2725505 2862964 3138068
18086C138068J26680l41104j04359L387K655M8761k12687k1920j23713q6245j09499
$$ 3138068 3264748 2923644 2819285 2822672 2825327 2874088 2661401 2639481 2515768 2429523 2320024
18075B320024K888j96910J74j12698o4952j91826L02207n7442l07005j66536l09251
$$ 2320024 2322912 2126002 2126176 2013478 1948526 1756700 2058907 2001465 1694460 1527924 1218673
18064A218673K25530K15918k6157j77983j19073J60292r4928J20538M03501J78553
$$ 1218673 1444203 1660121 1633964 1455981 1336908 1497200 1402272 1522810 1926311 2104864
18054B104864J43249L02183J39672k40339k60115j92809r0473Q6892n8085j63869
$$ 2104864 2248113 2550296 2689968 2449629 2189514 1996705 1906232 1993124 1935039 1771170
18044A771170n248p9662j64405l3789J66385K49441J24048j27070J04956p8900
$$ 1771170 1765922 1686260 1521855 1488066 1654451 1903892 2027940 1900870 2005826 1926926
18034A926926j37903q0604j94042k05716k20038J2178J03508p490o7004m1464
$$ 1926926 1789023 1708419 1514377 1308661 1088623 1100801 1204309 1196819 1129815 1088351
18024A088351p295j00263Q155j20113J12914J36390j87809m53739j9733J51180
$$ 1088351 1081056 980793 988948 868835 981749 1118139 930330 476591 456858 608038
18014F08038K60070j67502j66254J21203K25534J90039n6889p5810J53906K39053
$$ 608038 868108 700606 534352 655555 881089 1071128 1014239 938429 1092335 1331388
18004A331388K31408j08024J03460j75903q2981j80822r3599m4044j0527r2634
$$ 1331388 1562796 1454772 1558232 1382329 1299348 1118526 1024927 980883 970356 877722
17994H77722k52083L5599m231N2584n5872j35292l9611j66147j76656j17794K8561
$$ 877722 625639 661238 657007 709591 653719 518427 478816 312669 136013 18219 46780
17983D6780M3378J21035J29568N1323j97668J14880K06040l31530J46818J88372
$$ 46780 90158 211193 340761 392084 194416 309296 515336 183806 330624 518996
17973E18996l10917P3698M4249J25357j43001q7488L30163O3445j55932j26198
$$ 518996 208079 281777 326026 451383 308382 220894 551057 614502 458570 332372
17963C32372n2584O7667J09996q1518j4089j6902J25858J5028N7832J1197M1908
$$ 332372 279788 347455 457451 375933 361844 344942 470800 485828 543660 554857 596765
17952E96765j30184k41877j56474N4468J8444L2766R01j90382p6589K43350J10087
$$ 596765 466581 224704 68230 122698 141142 173908 174809 -15573 -92162 151188 261275
17941B61275j99335J75454R4056j32556k6882J08953K27210J1106P4381m22025
$$ 261275 61940 237394 331450 198894 172012 280965 508175 519281 593662 171637
17931A71637m87705J76762J42063p8450M41241J82850M5587J11797P8651k90254
$$ 171637 -316068 -139306 2757 -75693 365548 548398 593985 705782 784433 494179
17921D94179l02726K91170K17047J90878j04169l10337P5832K14348K5428j52710
$$ 494179 191453 482623 699670 890548 786379 476042 551874 766222 791650 638940
17911F38940L5199L23370p8767j94433j2570l66409l11852J20430K25674j03042
$$ 638940 674139 997509 918742 724309 711739 345330 33478 153908 379582 276540
17901B76540r3557m9883L3166M38763J68714J9850K14544Q1378j6340K6842J66845
$$ 276540 182983 133100 166266 605029 773743 793593 1008137 1089515 1073175 1100017 1266862
17890A266862J48043K37151K38372J48367J05622K75982J94328L26828o383Q9542
$$ 1266862 1414905 1652056 1890428 2038795 2144417 2420399 2614727 2941555 2935172 3024714
17880C024714l7481l73276j31233k36796n52317k71362k99719J8280k56942J49899
$$ 3024714 2987233 2613957 2482724 2245928 1693611 1422249 1122530 1140810 883868 1033767
17870A033767k6823o6131J5197P3904J72774M33791M15006M25600K83905m2712
$$ 1033767 1006944 940813 956010 1029914 1202688 1636479 2051485 2477085 2760990 2718278
17860B718278k02178j23383j92077k11983k99442l00298n7675j05281q7994L16358
$$ 2718278 2516100 2392717 2200640 1988657 1689215 1388917 1331242 1225961 1137967 1454325
17850A454325J28672l39157j75460K16912M45925J25526J12459O5541j74497L4334
$$ 1454325 1582997 1243840 1068380 1285292 1731217 1856743 1969202 2034743 1860246 1894580
17840A894580p1180K23659J02994j29218k22371l31002p3803j9057q6901J1473
$$ 1894580 1823400 2047059 2150053 2020835 1798464 1467462 1393659 1374602 1287701 1299174
17830A299174j37619k83577k54564J9634J81271K15555k8568o0275n2460N6373
$$ 1299174 1161555 877978 623414 643048 824319 1039874 1011306 951031 898571 954944
17820I54944n0166k94647k22441P3952K22872K38404R297j61202j14439j40023
$$ 954944 904778 610131 387690 461642 684514 922918 932215 771013 656574 516551
17810E16551j301k05236r140N6069J42975J92986k60972L2155j9617j2440J0419
$$ 516551 515250 310014 300874 356943 499918 692904 431932 464087 444470 432030 442449
17799D42449l6759M49095K16178R8831j82441m8260P8198K20689m0099M729k6493
$$ 442449 405690 854785 1070963 1169794 987353 939093 1017291 1237980 1197881 1202610 1176117
17788A176117L687j27517j97614p6663j05226k14021j19313Q2605J35126k02965
$$ 1176117 1179804 1052287 854673 778010 672784 458763 339450 422055 557181 354216
17778C54216j9906p7854l59902K20074L73967K34700J6619k39999q9616k27656
$$ 354216 334310 256456 -103446 116628 490595 725295 741914 501915 412299 184643
17768A84643m9141q1234m9419k8793K07036J49346P6476N2501k0869p3592k3400
$$ 184643 135502 54268 4849 -23944 183092 332438 408914 461415 440546 366954 343554
17757C43554P3873J14926j80456p9056J16524J58364R8698j93055J89219J44173
$$ 343554 417427 532353 351897 272841 389365 547729 646427 453372 642591 786764
17747G86764O4799K0861k90697n52042k03918r9462Q5805K34953J94699N0547
$$ 786764 851563 872424 581727 29685 -174233 -273695 -187890 47063 241762 292309
17737B92309j04121J58046K60416n5195m96692K7127J94438J43713P1221N7922
$$ 292309 188188 346234 606650 551455 54763 81890 276328 420041 491262 549184
17727E49184K72122K3039k76438J58250l8320j52360P1891r0521J69549O1300
$$ 549184 821306 844345 567907 726157 687837 535477 607368 516847 686396 747696
17717G47696k39859Q4456k61592j43020L67990K61650j27860j65129J59301n38655
$$ 747696 507837 592293 330701 187681 555671 817321 689461 524332 683633 144978
17707A44978j24238J84848j29449j70370j69845J01883m9153K75030R1928j01918
$$ 144978 20740 205588 76139 -94231 -264076 -162193 -211346 63684 155612 53694
17697E3694N193J86039J35262N7641k44148j06864L9591r69R4799J9115j00443
$$ 53694 58887 244926 380188 437829 193681 86817 126408 125439 220238 239353 138910
17686A38910j73511m3721Q1783J62113O3891Q0084j8389l55074m40232J38313
$$ 138910 -34601 -78322 3461 165574 229465 309549 291160 -63914 -504146 -365833
17676c65833J12820K02644o6663N6469J98624L50239k93663j30351J23911j72655
$$ -365833 -253013 -50369 -117032 -60563 138061 488300 194637 64286 188197 15542
17666A5542j20204J27019N0388K06807Q1232K0401k66539P9588l1689J46608P0251
$$ 15542 -104662 22357 72745 279552 360784 381185 114646 194234 162545 309153 379404
17655C79404K85257J53751m8485n6389K9479k10855k78319k50413J33814j6173
$$ 379404 664661 818412 769927 713538 743017 532162 253843 3430 137244 121071
17645A21071J04675j0621R4320q879p4979k26706R544m0166M8756p406o6995N9082
$$ 121071 225746 215125 309445 300566 225587 -1119 8425 -31741 17015 9609 -57386 1696
17633A696L71939L65064L46444J70313R5902J30328Q350K23545m2150k11207j17794
$$ 1696 373635 738699 1085143 1255456 1351358 1481686 1490036 1713581 1671431 1460224 1342430
17622A342430j65195N5122J95292Q1549m6817k6166J67771L02375O0880K33132
$$ 1342430 1177235 1232357 1427649 1509198 1462381 1436215 1603986 1906361 1967241 2200373
17612B200373p8114l28252j16192J25912J8928l27122K41420K21417K30575j95539
$$ 2200373 2122259 1794007 1677815 1803727 1822655 1495533 1736953 1958370 2188945 1993406
17602A993406n17979k90902K3556L1K91325L00352K42706l8825J4378j2055J46437
$$ 1993406 1475427 1184525 1208081 1208112 1499437 1799789 2042495 2003670 2018048 2005993 2152430
17591B152430n45682m42880j85910k18787R5859J25216j05835L2J07036J20563
$$ 2152430 1606748 1163868 977958 759171 855030 980246 874411 874443 981479 1102042
17581A102042N5194j9823N2824m7424p9456j23099l44442j06073j49881l5470
$$ 1102042 1157236 1137413 1190237 1142813 1063357 940258 595816 489743 339862 304392
17571C04392J14643r5440J10352J72761K42929n7724L2359Q9176j30112j85112
$$ 304392 419035 323595 433947 606708 849637 791913 824272 913448 783336 598224
17561E98224l6892K04849j83346j42082K36651n893l20273j6955J34789O0958
$$ 598224 561332 766181 582835 440753 677404 671511 351238 334283 469072 530030
17551E30030J14939l06520n1269Q8611K3383j71229P0255J96236m7636J60645
$$ 530030 644969 338449 287180 375791 399174 227945 298200 494436 446800 607445
17541F07445k6335k41612j23534J19754j17365k76941K150L9416L32408O9639
$$ 607445 581110 339498 215964 335718 218353 -58588 -56438 -17022 315386 385025
17531C85025k08536K53475J11269k37706k23021K90476L32129L60351j06803l15711
$$ 385025 176489 429964 541233 303527 80506 370982 703111 1063462 956659 640948
17521F40948p8830J74837J78389r5519o6022J149L3676j42348l06711j31692J99215
$$ 640948 562118 736955 915344 819825 753803 754952 788628 646280 339569 207877 407092
17510D07092L72781o6887K1804n9538L4439J2295j19722l65068J51767L1754J81550
$$ 407092 779873 712986 734790 675252 709691 721986 602264 237196 388963 420717 602267
17499F02267M04655O8391k89988j02461j68180j23125J80294K3495K41545L5850
$$ 602267 1006922 1075313 785325 682864 514684 391559 571853 595348 836893 872743
17489H72743J49343K74643O8197R8138k0529j24510L3600J39105J0238j54088
$$ 872743 1022086 1296729 1364926 1463064 1442535 1318025 1351625 1490730 1500968 1346880
17479A346880k60340K75343L11672j0417m24561j92018j11049J07632J18660M3550
$$ 1346880 1086540 1361883 1673555 1663138 1238577 1046559 935510 1043142 1161802 1205352
17469A205352k5759K1926L4363n2351L47431K21450N30148N19633L35530J49819
$$ 1205352 1179593 1201519 1235882 1183531 1530962 1752412 2282560 2802193 3137723 3287542
17459C287542Q4515O9966k36183o40123k08177M43477L28155j04948n51500k89630
$$ 3287542 3372057 3442023 3205840 2565717 2357540 2801017 3129172 3024224 2472724 2183094
17449B183094k75518k48687K71818J06108n2909j008L21181O27040M94980n3353
$$ 2183094 1907576 1658889 1930707 2036815 1983906 1982898 2304079 2931119 3426099 3372746
17439C372746K68296M00481L91802M27409l02320l38934j45777J70790l14445
$$ 3372746 3641042 4041523 4433325 4860734 4558414 4219480 4073703 4244493 3930048
17430C930048m95549k85859l23045k8208P704j21646K4940k66254j21306L9402
$$ 3930048 3434499 3148640 2825595 2797387 2805091 2683445 2708385 2442131 2320825 2360227
17420B360227P4611L8828J48510k30943N1235J37774O1894j77594O2692J29196
$$ 2360227 2434838 2473666 2622176 2391233 2442468 2580242 2642136 2464542 2527234 2656430
17410B656430k8238R2154j1450k53441j41363k12901q2796p8124J4841N8840P0698
$$ 2656430 2628192 2720346 2708896 2455455 2314092 2101191 2018395 1940271 1955112 2013952 2084650
17399B084650Q5483K43594n3034r1248K68591J46114K63414j96602j41428J60979
$$ 2084650 2170133 2413727 2360693 2269445 2538036 2684150 2947564 2750962 2609534 2770513
17389B770513J66329k3442n2686j46346j30606J038K73694K84662m5742m2823
$$ 2770513 2936842 2913400 2860714 2714368 2583762 2584800 2858494 3143156 3097414 3054591
17379C054591P6287J47098m459l31060m016L92082K02237K71375J08456k62389
$$ 3054591 3130878 3277976 3273517 2942457 2938441 3330523 3532760 3804135 3912591 3650202
17369C650202J10720L79208K82946M59880M70109K05786M58494J006718O83559
$$ 3650202 3760922 4140130 4423076 4882956 5353065 5558851 6017345 7024063 7707622
17360G707622L43948J92407L81484N06189O42066N58979M74438M19806L78548
$$ 7707622 8051570 8243977 8625461 9131650 9773716 10332695 10807133 11226939 11605487
17351A1605487L48975L61493O70777J029325J423482J909344K401256L114348
$$ 11605487 11954462 12315955 12986732 14016057 15439539 17348883 19750139 22864487
17343B2864487M296921N640117Q275225J3027228K1042582L2740678M1595469
$$ 22864487 27161408 32801525 41076750 54103978 75146560 107887238 149482707
17336A49482707L6887863K5285116K8937510M9171527O2365974L7892182j6829063
$$ 149482707 186370570 211655686 240593196 289764723 352130697 390022879 373193816
17329C73193816m3696392k4721667j377450p332045l9735507n9385515m7551412
$$ 373193816 329497424 304775757 303398307 296066262 256330755 196945240 149393828
17322A49393828k7718927j3630720m100870L752404J3494593K7573944M2382837
$$ 149393828 121674901 108044181 103943311 107695715 121190308 148764252 191147089
17315A91147089M5646570L2233665K6041360M3938429O8667769O1645037O071476
$$ 191147089 236793659 269027324 295068684 339007113 407674882 469319919 475391395
17308D75391395m8403998m5893590j4380091l767300l0790484o6441532o7957504
$$ 475391395 426987397 381093807 366713716 362946416 332155932 265714400 197756896
17301A97756896m6445005k7998542j7708397j1883901q522889o899579n354353
$$ 197756896 151311891 123313349 105604952 93721051 85198162 78298583 72944230
17294G2944230m419173l656090l174946l230097k761427k510186k128748j509134
$$ 72944230 68525057 64868967 61694021 58463924 55702497 53192311 51063563 49554429
17286D9554429j226728j142898j386486j334689j167942j235689j202669j015809
$$ 49554429 48327701 47184803 45798317 44463628 43295686 42059997 40857328 39841519
17278C9841519j004115r61046j058191j495300j372278j051088j195929j122591
$$ 39841519 38837404 37876358 36818167 35322867 33950589 32899501 31703572 30580981
17270C0580981j248710r95116q17749q46336p63988p71840n30877n96894p24891
$$ 30580981 29332271 28337155 27519406 26673070 25909082 25137242 24606365 24009471 23284580
17261B3284580o62053n35240l58393p17058m29636n93296o07871n49579m38999
$$ 23284580 22622527 22087287 21728894 21011836 20582200 19988904 19381033 18831454 18392455
17252A8392455k84000k86507k24478j19011o25375o12283l15428n98914k75476
$$ 18392455 18108455 17821948 17597470 17478459 16853084 16240801 15925373 15326459 15050983
17243A5050983j97256j37969l59805k11644j81176l78701m34726k5476K8140j81797
$$ 15050983 14853727 14715758 14355953 14144309 13963133 13584432 13149706 13124230 13152370 12970573
17233A2970573j88888q6216k73638m50068l19828k82501l22783k24165k16148
$$ 12970573 12781685 12695469 12421831 11971763 11651935 11369434 11046651 10822486 10606338
17224A0606338J22830J17421l4108k62472j41738k26011k87938j03685l24250
$$ 10606338 10729168 10846589 10812481 10550009 10408271 10182260 9894322 9790637 9466387
17215I466387K4041j71359p4838K41196J19721J74764K86513J65084L65378M16505
$$ 9466387 9490428 9319069 9244231 9485427 9605148 9779912 10066425 10231509 10596887 11013392
17205A1013392q556R4551K26069j38668j80163q0519L5838o03366p53111k30197
$$ 11013392 11004836 11099387 11325456 11186788 11006625 10926106 10961944 10358578 9605467 9375270
17195I375270q0961o2455k49455J11562J12181L93189M77044J70702k55327j71114
$$ 9375270 9294309 9231854 8982399 9093961 9206142 9599331 10076375 10247077 9991750 9820636
17185I820636J23156N0558L31163K31312k32512m96685j34233j17967m95536m70269
$$ 9820636 9943792 9994350 10325513 10556825 10324313 9827628 9693395 9575428 9079892 8609623
17175H609623k96039j69758L17074P8912q6030j43642O0802K63923l90788m70351
$$ 8609623 8313584 8143826 8460900 8539812 8453782 8310140 8370942 8634865 8244077 7773726
17165G773726l91153l83717k51103l01074m10075r6424R5973r4295j24709j18650
$$ 7773726 7382573 6998856 6747753 6446679 6036604 5940180 6036153 5941858 5817149 5698499
17155E698499j76018J2159L26273K11726k08795m25358J26725J01370l21152j25756
$$ 5698499 5522481 5534640 5860913 6072639 5863844 5438486 5565211 5666581 5345429 5219673
17145E219673J17742L06077p9120q3217j16922j78895j75350Q393j9081k00067
$$ 5219673 5337415 5643492 5564372 5481155 5364233 5185338 5009988 5018381 4999300 4799233
17135D799233L3377Q1352K37593j64880o405J19212J7877p7043k0804j01348j8073
$$ 4799233 4832610 4913962 5151555 4986675 4980270 5099482 5117359 5040316 5019512 4918164 4900091
17124D900091J33096J03747j99353k62121L2595N6759j11695q9797J14521j2240
$$ 4900091 5033187 5136934 4937581 4675460 4708055 4764814 4653119 4563322 4677843 4665603
17114D665603j20422P3401L05272K63770M00229M12645P0724K04315L13287L71292
$$ 4665603 4545181 4618582 4923854 5187624 5587853 6000498 6071222 6275537 6588824 6960116
17104F960116L36613K15948o8944L26730M98092P07799M72615M96816M89815P34670
$$ 6960116 7296729 7512677 7443733 7770463 8268555 8976354 9448969 9945785 10435600 11170270
17094A1170270N45672O3899K98449O10258J273290J064162J435314J799942K253578
$$ 11170270 11715942 11779841 12078290 12688548 13961838 15026000 16461314 18261256 20514834
17085B0514834K579711L343871M369146O369126J0115605J7690231L1605196M8707707
$$ 20514834 23094545 26438416 30807562 37176688 47292293 64982524 96587720 145295427
17077A45295427N0548316K7782007J5659820K8450826L5721751Q739989m7523498
$$ 145295427 195843743 223625750 239285570 267736396 303458147 312198136 264674638
17070B64674638o5332036l7842034n884254K1974143L9960253L3175195J3872246
$$ 264674638 199342602 161500568 155616314 177590457 217550710 250725905 264598151
17063B64598151J6084313L0083691K4570895j6120052n7129793m3636027n791554
$$ 264598151 280682464 310766155 335337050 319216998 262087205 218451178 212659624
17056B12659624K0415562J8261972M727878J0379633K3519201J6391053k2288624
$$ 212659624 233075186 251337158 256065036 266444669 289963870 306354923 284066299
17049B84066299n7424605m6287479j8722667O322588K7029316L2467912J4778753
$$ 284066299 226641694 180354215 161631548 167954136 194983452 227451364 242230117
17042B42230117O102467J7966594K4184309O23826m8344219o4759645m4973916
$$ 242230117 248332584 266299178 290483487 291107313 242763094 178003449 133029533
17035A33029533k6222829j5684138j0302887p234350n235319m024778l242967
$$ 133029533 106806704 91122566 80819679 73585329 68350010 64325232 61082265
17028F1082265k826320k484446k311212k150910k057868j791540j910228j729463
$$ 61082265 58255945 55771499 53460287 51309377 49251509 47459969 45549741 43820278
17020D3820278j544903j122604r45006j011822j337876q34029j088724j422304
$$ 43820278 42275375 41152771 40207765 39195943 37858067 37024038 35935314 34513010
17012C4513010j178334j220934r90238q92882r33465r30156r18887p09554l91515
$$ 34513010 33334676 32113742 31123504 30230622 29297157 28367001 27448114 26738560 26347045
17003B6347045n14980m47350n77604p72619q84750n46676n70830o87302q14541
$$ 26347045 25832065 25384715 24807111 24034492 23149742 22603066 22032236 21344934 20530393
16994B0530393m00264p40402o23490l09186l76665m23425l57392n07981l19085
$$ 20530393 20130129 19389727 18766237 18457051 18080386 17656961 17299569 16791588 16472503
16985A6472503l79900m43083m71007p4477j68904k88514j6383n15828p08731l10331
$$ 16472503 16092603 15649520 15178513 15104036 14935132 14646618 14630235 14114407 13405676 13095345
16975A3095345L3836k89650l44043l59210J07183j23362n47240k31404J26900
$$ 13095345 13129181 12839531 12495488 12136278 12243461 12120099 11572859 11341455 11468355
16966A1468355k64859l74210l36175j54167k89439l39720j98067m6897L4156J81221
$$ 11468355 11203496 10829286 10493111 10338944 10049505 9709785 9511718 9464821 9498977 9680198
16956I680198M1061l00681j40682r2122o7847K10132J83040l03282J04862j09168
$$ 9680198 9721259 9420578 9279896 9187774 9119927 9330059 9513099 9209817 9314679 9205511
16946I205511n583k50414l20845k72849j35846j09687n8475J28926K62181j02347
$$ 9205511 9199928 8949514 8628669 8355820 8219974 8110287 8051812 8180738 8442919 8340572
16936H340572j67458j24532K26980J92464K52113l58055j54115k33973l52637
$$ 8340572 8173114 8048582 8275562 8468026 8720139 8362084 8207969 7973996 7621359
16927G621359l51286J8520j01286m48063J1381K5300k07516j94853j07510j63066
$$ 7621359 7270073 7288593 7187307 6739244 6750625 6775925 6568409 6373556 6266046 6102980
16917F102980k574r7034J6280J25715k9054J20427M1108j46373k87315k91168
$$ 6102980 6100406 6003372 6019652 6145367 6116313 6236740 6277848 6131475 5844160 5552992
16907E552992l45818k48178k30367j18022k65291n15378n6135K60404L5998o0635
$$ 5552992 5207174 4958996 4728629 4610607 4345316 3829938 3773803 4034207 4070205 4009570
16897D009570j31645m8109o8395k75787l99392O1099L81311M2523j98018l40715
$$ 4009570 3877925 3829816 3761421 3485634 3086242 3147341 3528652 3571175 3373157 3032442
16887C032442J53268P3535l85174m11728K98985K42815M5297k01672j37863j4915
$$ 3032442 3185710 3259245 2874071 2462343 2761328 3004143 3049440 2847768 2709905 2694990
16877B694990j6249l07687L586K32889m2940O8376l6831q1336j2945q8276n0006
$$ 2694990 2678741 2371054 2374640 2607529 2564589 2632965 2596134 2514798 2501853 2413577 2363571
16866B363571n6106p920l0236N1024r235J08980l1709j11519M0049r8492k06976
$$ 2363571 2307465 2299545 2269309 2320333 2311098 2420078 2388369 2276850 2316899 2218407 2011431
16855B011431o8190j85400J3288J71099n5540j62641R1621l8846q0986q7203P7367
$$ 2011431 1943241 1757841 1771129 1942228 1886688 1724047 1815668 1776822 1695836 1608633 1686000
16844A686000l41887q0801L5504M32382q7148j47705j87857K7400Q7107L4983
$$ 1686000 1344113 1263312 1298816 1731198 1644050 1496345 1308488 1335888 1422995 1457978
16834A457978L64565m1808l26876l7640K09533n6384k92151j97209K53369O147
$$ 1457978 1822543 1780735 1453859 1416219 1625752 1569368 1277217 1080008 1333377 1339524
16824A339524M1136L5379J08723P423n5394j22537M212j55004j36076l3009k07390
$$ 1339524 1380660 1416039 1524762 1532185 1476791 1354254 1358466 1203462 1067386 1034377 826987
16813H26987K25974Q216j46645k38007K4055j2549j31046K54997J18890k03147
$$ 826987 1052961 1061177 914532 676525 700580 688031 556985 811982 930872 727725
16803G27725O7876K84554J47696k19562j44329l3909M1943o9195k73070r5194
$$ 727725 795601 1080155 1227851 1008289 863960 830051 871994 802799 529729 434535
16793D34535R9746J53401m8712J32271K21759R7915j2631k68049j23673o8371
$$ 434535 534281 687682 638970 771241 993000 1090915 1078284 810235 686562 618191
16783F18191J43756J60958J63085J26875L55327R8489O0971M11372J71823J05282
$$ 618191 761947 922905 1085990 1212865 1568192 1666681 1727652 2139024 2310847 2416129
16773B416129n8274L59708J89363l31479j63448N9147l61726l05300P700Q6282
$$ 2416129 2357855 2717563 2906926 2575447 2411999 2471146 2109420 1804120 1811820 1898102
16763A898102k70386k11153l45796m73977M375N08426M95075Q7265K83145M16006
$$ 1898102 1627716 1416563 1070767 596790 601165 1109591 1604666 1691931 1975076 2391082
16753B391082J3796K14221J55755P2391l02848j89878q8435p9118k75493m35249
$$ 2391082 2404878 2619099 2774854 2847245 2544397 2354519 2266084 2186966 1911473 1476224
16743A476224j83491K63778N5194k63358o42533k48545Q3256o3463r5346r8949
$$ 1476224 1292733 1556511 1611705 1348347 705814 457269 540525 477062 381716 282767
16733B82767j20614L20244N87214j57609l23934J30176Q7590j10000j97957j3906
$$ 282767 162153 482397 1069611 912002 588068 718244 805834 695834 497877 483971
16723D83971j05735k57582K13877J62622J5792k73883l0005J85520R1063k00146
$$ 483971 378236 120654 334531 497153 512945 239062 209057 394577 485640 285494
16713B85494j66737r9088R0050k2396p3305L925L54842K31675J60773k3151k69436
$$ 285494 118757 19669 109719 87323 14018 17943 372785 604460 765233 742082 472646
16702D72646m3808O7814r6363j9987l41868o3941K25967O2682O001j32822J2816
$$ 472646 428838 496652 400289 380302 38434 -25507 200460 263142 269143 136321 149137
16691A49137P623J61029k16222l10574K31410j42938O6556K94765J24797j26890
$$ 149137 156760 317789 101567 -209007 22403 -120535 -53979 240786 365583 238693
16681B38693o1181j0270p4209j7990k16396k64353P5364J42716K03398J61483
$$ 238693 177512 167242 93033 75043 -141353 -405706 -330342 -187626 15772 177255
16671A77255r3978j76737M5763L03617K61255J10101j46891k45876o4148j87815
$$ 177255 83277 -93460 -47697 255920 517175 627276 480385 234509 170361 -17454
16661a7454q5485J64277n0830J2499j06668J53434J71848K1696j97742j03018
$$ -17454 -102939 61338 10508 23007 -83661 69773 241621 263317 65575 -37443
16651c7443N1268K29560r3778l01674J09609P5358O4956K63232J15202r9824q2875
$$ -37443 13825 243385 149607 -152067 -42458 32900 97856 361088 476290 376466 293591
16640B93591M4604j37758j1040j60697k23353Q1114M06340l05131j36185J79916
$$ 293591 338195 200437 189397 28700 -194653 -113539 292801 -12330 -148515 31401
16630C1401m031p6899J61211K18062L8364p1710m5555K9418K4012O1339P7129
$$ 31401 27370 -49529 111682 329744 368108 296398 250843 280261 304273 365612 442741
16619D42741q7575o94230l44701j4585M69789M04403J57909r6622o4900P2220
$$ 442741 355166 -339064 -683765 -698350 -228561 175842 333751 237129 172229 244449
16609B44449j48902j84024k72829k2098M62495M4624K30618l25797n39015O7393
$$ 244449 95547 -88477 -361306 -383404 79091 123715 354333 28536 -510479 -443086
16599d43086L00974J7Q670J82221J77093j93106q1216q6987J31787J05959j05771
$$ -443086 -142112 -142095 -133425 48796 225889 32783 -48433 -135420 -3633 102326 -3445
16588c445K04305k120j49597j69177K5117j2986L19626M1232o8579m2444k46341
$$ -3445 200860 198740 49143 -120034 -94917 -107903 211723 252955 184376 141932 -104409
16577a04409J17498J03515Q5963k86111J05388L53763j5442J5840o3068o8958
$$ -104409 13089 116604 202567 -83544 21844 375607 360165 376005 312937 243979
16567B43979j9493K33703j09930j32472j38503o4629K04308N466k25230j47083
$$ 243979 224486 458189 348259 215787 77284 12655 216963 222429 -2801 -149884
16557a49884j10972k33034L48889K06208o4433P9024l5043j49424N6619J11216
$$ -149884 -260856 -493890 -145001 61207 -3226 75798 40755 -108669 -52050 59166
16547E9166K17871K62318j19204r0635K1081O8975J72805j57979j64325m25283
$$ 59166 277037 539355 420151 329516 350597 419572 592377 434398 270073 -155210
16537a55210P3887M5487j31878R0381K0598L9159K09891j56599J35523Q5210L0528
$$ -155210 -81323 -35836 -167714 -77333 -56735 -17576 192315 35716 171239 256449 286977
16526B86977k38918j74543K8691L17698M67439J19275j36617K52129J77580J19921
$$ 286977 48059 -126484 -97793 219905 687344 806619 670002 922131 1099711 1219632
16516A219632j70538m8992N11514K20184k99207R2374m9751k63985l18497M0570
$$ 1219632 1049094 1000102 1511616 1731800 1432593 1524967 1475216 1211231 892734 933304
16506I33304K39716R6825K88587j09352k5155n4109L52089j0684j76340m37822
$$ 933304 1173020 1269845 1558432 1449080 1423925 1369816 1721905 1711221 1534881 1097059
16496A097059p6637j35912k4656K56515K95442J26987k09960k24009j46234P6952
$$ 1097059 1020422 884510 859854 1116369 1411811 1538798 1328838 1104829 958595 1035547
16486A035547J4244j07802J17575K68156J81521r8646K44522o0493m41772m56859
$$ 1035547 1049791 941989 1059564 1327720 1509241 1410595 1655117 1594624 1152852 695993
16476F95993j40055O3436J26531k09553j91209R5764K51703p4076k48161l83241
$$ 695993 555938 619374 745905 536352 345143 440907 692610 618534 370373 -12868
16466a2868K10074M11502R8757k08608j73609j19802j73972K26985R2507q3912
$$ -12868 197206 608708 707465 498857 325248 205446 31474 258459 350966 267054
16456B67054N867l4375r8703j70691J11871q5290j75594k38015J65510K58666
$$ 267054 272921 238546 139843 -30848 81023 -4267 -179861 -417876 -252366 6300
16446F300N6441J45423J69544m0744M071j27532l44198n0141J32782L23808l2198
$$ 6300 62741 208164 377708 336964 341035 213503 -130695 -180836 -48054 275754 243556
16435B43556N6598N831r4755R4912j64432j42466k35344l69607k94919j89594
$$ 243556 300154 305985 211230 306142 141710 -756 -236100 -605707 -900626 -1090220
16425a090220J82375M40073J50060m2157J27694K22407J3397j55937n2294P540
$$ -1090220 -907845 -467772 -317712 -359869 -232175 -9768 3629 -152308 -204602 -197062
16415a97062j10957L5624K20541K99974j08046r5226k27312k92897J8758R8672
$$ -197062 -308019 -272395 -51854 248120 140074 44848 -182464 -475361 -456603 -357931
16405c57931L46271J97120j19813k13286o0862m0861J00568K11704N9696k71555
$$ -357931 -11660 185460 65647 -147639 -208501 -249362 -148794 62910 122606 -148949
16395a48949j68552O5359N6482J30742J05803J27817J04525L9024N8020N6039
$$ -148949 -317501 -252142 -195660 -64918 40885 168702 273227 312251 370271 426310
16385D26310k06798p0492J6805K13228j9209m48386m20327j36259J19887K56193
$$ 426310 219512 149020 165825 379053 359844 -88542 -508869 -645128 -525241 -269048
16375b69048J56491O1526K3963j31608k25881j20076J97883J66296R8176J902
$$ -269048 -112557 -51031 -27068 -158676 -384557 -504633 -306750 -140454 -42278 -40376
16365d0376j3584K4856k02225j33567m1096O4878J81506m3298N1725J92350R7500
$$ -40376 -53960 -29104 -231329 -364896 -405992 -341114 -159608 -202906 -151181 41169 138669
16354A38669J0572j4238J35747q646j59105j72843k6063n3071j01964k8933R6469
$$ 138669 149241 135003 270750 262104 102999 -69844 -95907 -148978 -250942 -279875 -183406
16343a83406J1095n120J85662J31804M5343R1222k08452l20392M7087J88641o4870
$$ -183406 -172311 -177431 8231 140035 185378 276600 68148 -252244 -205157 -16516 -81386
16332h1386K5395J14335O1093j40137q1833l02201Q114j42822k698q0877K66851
$$ -81386 -55991 58344 119437 -20700 -102533 -404734 -396620 -539442 -542140 -623017 -356166
16321c56166o4912k1302K49563j82739Q7501J2092o2223N5631K7310L9302q7796
$$ -356166 -421078 -442380 -192817 -375556 -288055 -275963 -338186 -282555 -255245 -215943 -303739
16310c03739j17204J76281J89551l4991K24264n415k58285r6650L88211j93987
$$ -303739 -420943 -244662 -55111 -90102 134162 128747 -129538 -226188 162023 -31964
16300c1964k71316Q874J02085p6048j67556L11358J51055j99288k05880o3697
$$ -31964 -303280 -294406 -192321 -268369 -435925 -124567 26488 -172800 -378680 -442377
16290d42377J93267J44450O2374O5746J49153P2911j79315j99710j60007j16783
$$ -442377 -249110 -104660 -42286 23460 172613 245524 66209 -133501 -293508 -410291
16280d10291q9327n6197j11974J0342K73875L90630k45980n0557J16778j8459
$$ -410291 -499618 -555815 -667789 -657447 -383572 7058 -238922 -289479 -172701 -191160
16270a91160Q5439j00705n7508n6634K50155p5716j10649J88808o2077J00684
$$ -191160 -105721 -206426 -263934 -320568 -70413 -146129 -256778 -67970 -130047 -29363
16260b9363O1854o2844L5094K38793O0593j96966j99984p2734J5134J80647K20350
$$ -29363 32491 -30353 4741 243534 304127 107161 -92823 -165557 -150423 30224 250574
16249B50574R1269k03519r4933o1626Q7732k57098J2757J98404Q3825J69547n7298
$$ 250574 341843 138324 43391 -18235 69497 -187601 -174844 23560 107385 276932 219634
16238B19634l28100j16242n8341J45544q5971J58704k18292k7830K65710M4934
$$ 219634 -108466 -224708 -283049 -137505 -223476 -64772 -283064 -310894 -45184 -250
16228b50M2661K12047k33645J32666J89014j38258R4117j59111j79588M0946J38913
$$ -250 42411 254458 20813 153479 342493 204235 298352 139241 -40347 599 139512
16217A39512L6446m5397J01042j73193M9651Q7548k34291j2918P3747K02890j77795
$$ 139512 175958 130561 231603 58410 108061 195609 -38682 -51600 22147 225037 47242
16206D7242q5352M1484l0320j84875p5916J89352K11844p4885p041P6027Q3797
$$ 47242 -38110 3374 -26946 -211821 -287737 -98385 113459 38574 31533 107560 191357
16195A91357n5331k2059K93027K0640l22389M1402j78817R4130J53048N5191j49435
$$ 191357 136026 113967 406994 427634 105245 146647 -32170 61960 215008 270199 120764
16184A20764k23897n5370L4101k17541k75268J10143L13808K80866j92371j30525
$$ 120764 -103133 -158503 -124402 -341943 -617211 -507068 -193260 87606 -104765 -235290
16174b35290j63158J65400K14126Q0554J26575j24963O2013j54522m91467m3883
$$ -235290 -398448 -233048 -18922 61632 188207 63244 125257 -29265 -520732 -564615
16164e64615P7923J71030L18464K48201j34559J43598j4718J35391P5390k11990
$$ -564615 -486692 -315662 2802 251003 116444 260042 245324 380715 456105 244115
16154B44115l02075M5957j37787r2396J01055Q4383N9419J3917k0290J13911j2115
$$ 244115 -57960 -12003 -149790 -242186 -141131 -56748 2671 16588 -3702 110209 98094
16143I8094k9209n4169Q322j55455k75900J43041L24150j57359l09206j41929
$$ 98094 68885 14716 23038 -132417 -408317 -265276 58874 -98485 -407691 -549620
16133e49620n6386P3151J02297J28201j35909l19363j28755K49801L06283Q8225
$$ -549620 -606006 -532855 -430558 -302357 -438266 -757629 -886384 -636583 -330300 -242075
16123b42075j91121M0485p5268l25259K11977K75378j11202p11n0776L16547L57372
$$ -242075 -433196 -392711 -467979 -793238 -581261 -305883 -417085 -417796 -468572 -152025 205347
16112B05347J80942k59529n8312J12541J13166J93494j89786j31911P2282J37169
$$ 205347 386289 126760 68448 180989 294155 487649 297863 165952 238234 375403
16102C75403p0780q1794k03982k30434l4304J26814J66559Q9926j9934k50695
$$ 375403 304623 222829 18847 -211587 -245891 -119077 47482 137408 117474 -133221
16092a33221k11476J07063J97009M6584l9886k51409l3959q996k11930M23720
$$ -133221 -344697 -237634 -40625 5959 -33927 -285336 -319295 -328291 -540221 -116501
16082a16501L61578k03774L9761k6375k47505J93505q8986K9715n496P2574N3547
$$ -116501 245077 41303 81064 54689 -192816 689 -88297 -58582 -64078 8496 62043
16071F2043k33319m02524l6121K75629L69229J03636J3503Q9165k8023j38419
$$ 62043 -171276 -573800 -609921 -334292 34937 138573 152076 241241 213218 74799
16061G4799M7608J21548l3010m82693l06848L44801L68252k13466n6339k58102
$$ 74799 122407 243955 210945 -271748 -578596 -233795 134457 -79009 -135348 -393450
16051c93450L4406J75830q9501l8969j04986j580J25064L7612J79088J30138k33499
$$ -393450 -359044 -183214 -272715 -311684 -416670 -418250 -293186 -255574 -76486 53652 -179847
16040a79847K50520K57906l99799o4049K02851j60180k34275J42916L22119m3906
$$ -179847 70673 328579 -71220 -135269 67582 -92598 -326873 -183957 138162 94256
16030I4256j84822O5969P0867J68955J28947J87432L1120k04180n2449J20982
$$ 94256 -90566 -24597 46270 215225 344172 531604 562724 358544 306095 427077
16020D27077k6120k83109l8069j47679n3850J55849K12328k9130k77857L6996
$$ 427077 400957 117848 79779 -67900 -121750 34099 246427 217297 -60560 -23564
16010b3564r2406l66562j09315Q0691j47173r6078L22595K4888l3755p7215Q6334
$$ -23564 -115970 -482532 -591847 -511156 -658329 -754407 -431812 -406924 -440679 -517894 -431560
15999d31560J37335K18023J81030j0330k59308n3963j71761K09277P7722k1507
$$ -431560 -294225 -76202 104828 94498 -164810 -218773 -390534 -181257 -103535 -125042
15989a25042J10083k9901R342j47342k14011j11130n2569K82658J1027q0981P8628
$$ -125042 -14959 -44860 -35518 -182860 -396871 -508001 -560570 -277912 -266885 -347866 -269238
15978b69238J50326l13055O6327K51514J93186M1403J08371K74878J84434k24352
$$ -269238 -118912 -431967 -365640 -114126 79060 120463 228834 503712 688146 463794
15968D63794p9580j66447j6554j39757Q9743j63146N2638R0938n4834o8996P2688
$$ 463794 384214 217767 201213 61456 151199 -11947 40691 131629 76795 7799 80487
15957H0487r1861J8438j09944L7090m3327m27272J15784M29667j92485j73588
$$ 80487 -11374 7064 -102880 -65790 -109117 -536389 -420605 9062 -183423 -357011
15947c57011j71173J12735j7728q4586J2848K48522K71365j2787M4963l4092r8815
$$ -357011 -528184 -415449 -433177 -517763 -504915 -256393 14972 2185 47148 13056 -85759
15936h5759j06301P944k18355p9660J91976J73693j6806J30485j25117j88050
$$ -85759 -192060 -184116 -402471 -482131 -290155 -116462 -133268 -2783 -127900 -315950
15926c15950K79516J43833j06425r1910K4144j40377J58245J87084k71478J53122
$$ -315950 -36434 107399 974 -90936 -66792 -207169 -48924 138160 -133318 19804
15916A9804K36976j23234k18836j17380J9903j29540k39456K90107K46145O6020
$$ 19804 256780 133546 -85290 -202670 -182767 -312307 -551763 -261656 -15511 50509
15906E0509J82985k23109j88883K96734J50330j91574j86434J68734j55464j84972
$$ 50509 233494 10385 -178498 118236 268566 76992 -109442 59292 -96172 -281144
15896b81144o3001J93715Q0772j59400K8490J5817k85815J66055P5707j32990
$$ -281144 -344145 -150430 -69658 -229058 -200568 -184751 -470566 -304511 -228804 -361794
15886c61794J68082N2862J171J7990j21876q4203J01648J55689J18936j23495
$$ -361794 -193712 -140850 -139679 -121689 -243565 -327768 -226120 -70431 48505 -74990
15876g4990j12976m8092m1765J12962L15798L3723J7156k35842k4260O5232J51522
$$ -74990 -187966 -236058 -277823 -164861 150937 184660 201816 -34026 -58286 6946 158468
15865A58468O4240r5841M1929m2491J38276J5078q71j56331l86013n8257K62791
$$ 158468 222708 126867 168796 126305 264581 279659 278788 122457 -263556 -321813 -59022
15854e9022J44555M17121Q1480Q3249p489j15408j95255m04154j87111Q9030p7759
$$ -59022 85533 502654 584134 667383 659894 544486 349231 -54923 -242034 -153004 -230763
15843b30763q7345m2427p2084N4490K81965j021j24253r2736o2591j61934o9350
$$ -230763 -318108 -360535 -432619 -378129 -96164 -97185 -221438 -314174 -376765 -538699 -608049
15832f08049J73539J30017J07195J9054m1578K0995J3465J96046n2569J62179
$$ -608049 -434510 -304493 -197298 -178244 -219822 -198827 -185362 10684 -41885 120294
15822A20294o0016j18098R8536L04981K22335l19380k58053o6975k08121J115
$$ 120294 60278 -57820 40716 345697 568032 248652 -9401 -76376 -284497 -283382
15812b83382N6031K4971j65724J40390N065Q2761R1129O2909J64914j87528k49838
$$ -283382 -227351 -202380 -368104 -227714 -222649 -139888 -48759 14150 179064 -8464 -258302
15801b58302q5071j5737j01912J69953K55869J5468L790J44462J50572N1754p6772
$$ -258302 -343373 -359110 -461022 -291069 -35200 -19732 -15942 128520 279092 330846 254074
15790B54074K06078j80493o3399j12831p0351n6581J02891K12551p3584l07175
$$ 254074 460152 279659 216260 103429 33078 -23503 79388 291939 218355 -88820
15780h8820R6366j19757k12256r4245J50309M14065l38261L8837R8863j04756
$$ -88820 7546 -112211 -324467 -418712 -268403 145662 -192599 -153762 -54899 -159655
15770a59655k50482m8484K79063J18883l8192j11971R7802m2713K9034k19255
$$ -159655 -410137 -458621 -179558 -60675 -98867 -210838 -113036 -155749 -126715 -345970
15760c45970P8751L66643N70120M52970L77023K11316K98920Q0423K08193J04210
$$ -345970 -267219 99424 669544 1122514 1499537 1710853 2009773 2090196 2298389 2402599
15750B402599k74839o16252o23440l61568n64301l34120J19078P8805j63779J49720
$$ 2402599 2127760 1511508 888068 526500 -37801 -371921 -252843 -174038 -337817 -188097
15740a88097J85078J13971M9194p2238j60406m9563J54570J36202l92763q6543
$$ -188097 -3019 110952 160146 87908 -72498 -122061 32509 168711 -224052 -310595
15730c10595J7672J34467r7420O7084K63489n1047j11749k48585J74275M94420
$$ -310595 -292923 -158456 -255876 -188792 74697 23650 -88099 -336684 -162409 332011
15720C32011K81881L07645o9827k53684k96855k49128l61565P5627M9106K4638
$$ 332011 613892 921537 851710 598026 301171 52043 -309522 -233895 -184789 -160151
15710a60151Q0029o7539n061J56638K49636K32503j55628l10886k12862k81828
$$ -160151 -80122 -147661 -152722 3916 253552 486055 330427 19541 -193321 -475149
15700d75149n4208L71058K86512m0864l0307n5235p7536j11211J04725n6534K28350
$$ -475149 -529357 -158299 128213 87349 57042 1807 -75729 -186940 -82215 -138749 89601
15689H9601J77247R48j17601r458k38475r0551K22086n2859k68001j79272K42629
$$ 89601 266848 267796 150195 140737 -97738 -188289 33797 -19062 -287063 -466335 -223706
15678b23706j11544j02023J79878j77549k0465k08445L4663L50454j9255j02484
$$ -223706 -335250 -437273 -257395 -434944 -455409 -663854 -629191 -278737 -297992 -400476
15668d00476o3010J00125R2276q6892k34654j18357J14706K80447J39735J57646
$$ -400476 -463486 -363361 -271085 -357977 -592631 -710988 -596282 -315835 -176100 -18454
15658a8454L1605k1778J76269k5374k08928R8185L15435M928N428K6919J1620
$$ -18454 13151 -8627 167642 142268 -66660 31525 346960 351888 357316 384235 395855
15647C95855l69094m07004K08126J407j32239K5192J76345N6671K26744k3030
$$ 395855 26761 -380243 -172117 -170710 -302949 -277757 -101412 -44741 182003 158973
15637A58973j47229j87157k78458K65510J89641j43525j8754k76581R707J75053
$$ 158973 11744 -175413 -453871 -188361 1280 -142245 -160999 -437580 -427873 -252820
15627b52820K4530m5201m5923k33318J3253J90995J79492n504k05496m60595o1923
$$ -252820 -228290 -273491 -319414 -552732 -539479 -348484 -168992 -174496 -379992 -840587 -902510
15616i02510K87369J16345m0830J06545J8939r1647K73919L18656k4538j88057
$$ -902510 -615141 -498796 -539626 -433081 -414142 -505789 -231870 86786 62248 -125809
15606a25809p2447K15848k32649k0128j32360M4899J97301k92075q7976J6516
$$ -125809 -198256 17592 -215057 -235185 -367545 -322646 -125345 -417420 -505396 -488880
15596d88880O436K80084M70260n6623k32070l72032j93408j9435J23426k5919
$$ -488880 -482444 -202360 267900 211277 -20793 -392825 -586233 -605668 -482242 -508161
15586e08161J00230K56964L97034K60928K3733l73492k65924L6935O8438J03837
$$ -508161 -407931 -150967 246067 506995 530728 157236 -108688 -71753 -3315 100522
15576A00522j4894N3448N6122M0143J33575k24629r3178k68939k12835j220k8828
$$ 100522 85628 139076 195198 235341 368916 144287 51109 -217830 -430665 -431885 -460713
15565d60713L39174P761k63542n26184J67821J89199R1110J81985K50734J1047
$$ -460713 -121539 -113778 -377320 -903504 -735683 -546484 -455374 -273389 -22655 -11608
15555a1608M0403P068j65264k70004J20036J8951J09280k73411O0000L16120k4282
$$ -11608 28795 35863 -129401 -399405 -279369 -260418 -151138 -424549 -364549 -48429 -72711
15544g2711J38667K28444j85830m37832N3034k7419J57784L03478k36910k15542
$$ -72711 65956 294400 108570 -329262 -276228 -303647 -145863 157615 -79295 -294837
15534b94837j06385L52733J44162o755j66196J56476m735j5879K58083o4210o6651
$$ -294837 -401222 -48489 95673 88918 -77278 79198 74463 58584 316667 252457 185806
15523A85806l43855J65051J34643j13209k65117O4043L90231P9606k17599P3887
$$ 185806 -158049 7002 141645 28436 -236681 -172638 217593 297199 79600 153487
15513A53487k4189n4016j11925Q2396Q9773j36822r1819j83938j22910j33841
$$ 153487 129298 75282 -36643 45753 135526 -1296 -93115 -277053 -399963 -533804
15503e33804j00852J80567J47999j3995J64721L9373K39725M26512J11312k03254
$$ -533804 -634656 -454089 -306090 -320085 -155364 -115991 123734 550246 661558 458304
15493D58304j72742m75679m32739r124K02665Q0003r3241N5324K23951k6876M2400
$$ 458304 285562 -190117 -622856 -631980 -429315 -349312 -442553 -387229 -163278 -190154 -147754
15482a47754P0741J20521K9861p7336j23920K0547L3726o0009R915J02375M1242
$$ -147754 -77013 43508 73369 -3967 -127887 -107340 -73614 -133623 -123708 -21333 19909
15471A9909O8619J4486R524J03340J12401k48872l2496R7535J51451j12517m0016
$$ 19909 88528 103014 112538 215878 328279 79407 46911 144446 295897 183380 143364
15460A43364N2820k54226l09627J76809O7047J55082J61600N8947j7040k77526
$$ 143364 196184 -58042 -367669 -190860 -123813 31269 192869 251816 234776 -42750
15450d2750j12073l20831p0870K79467J11367N4892J31901m3062j58581Q6022
$$ -42750 -154823 -475654 -546524 -267057 -155690 -100798 31103 -11959 -170540 -84518
15440h4518l1913o7285K72678k2290m3753j546l3708k64750R5074J50802j09569
$$ -84518 -116431 -183716 88962 66672 22919 21373 -12335 -277085 -182011 -31209 -140778
15429a40778L8379K34619k61421l32428J119J43071J00411O4933J69793l3081
$$ -140778 -102399 132220 -129201 -461629 -460510 -317439 -217028 -152095 17698 -15383
15419a5383k49637J83971P0444j02060k736j15896k32139k36589J60463K77114
$$ -15383 -265020 -81049 -10605 -112665 -115401 -231297 -463436 -700025 -539562 -262448
15409b62448j32793p1184J00281L74986Q8597J434j89284l6876M3266O6682j31317
$$ -262448 -395241 -466425 -366144 8842 97439 98873 -90411 -127287 -84021 -17339 -148656
15398a48656l19484k07852o206L35027j21641r7029l5171p0423N2430L6869K78680
$$ -148656 -468140 -675992 -682198 -347171 -468812 -565841 -601012 -671435 -619005 -582136 -303456
15387c03456j33703n799K13895J97819j69749m21225j816L07507K12350J82042
$$ -303456 -437159 -442958 -229063 -31244 -200993 -622218 -624034 -316527 -104177 77865
15377G7865J01581q2907k88166L6174j29647r1494k16361j64200k5835J78991
$$ 77865 179446 96539 -191627 -155453 -285100 -376594 -592955 -757155 -782990 -603999
15367f03999j90727j2651m4552k81627P6058n3148M2762K45267K56686K12009
$$ -603999 -794726 -807377 -851929 -1133556 -1057498 -1110646 -1067884 -822617 -565931 -353922
15357c53922J49320J81697J18275j62893k06850L7072k6439K879N4935L0724p1969
$$ -353922 -204602 -22905 95370 -67523 -274373 -237301 -263740 -260861 -205926 -175202 -247171
15346b47171r6660p1204M28953N66124j81474l62102j15144J9030L1071k6404
$$ -247171 -343831 -415035 13918 580042 398568 36466 -78678 -59648 -28577 -54981
15336e4981j70551n432K54108k9468L5495L7746k15090k1900P1111Q5421P3869
$$ -54981 -225532 -230964 23144 -6324 29171 66917 -148173 -170073 -98962 -13541 60328
15325F0328N3397J64859j6535k22203k86637J38571O3562q9706J34310R7754q1507
$$ 60328 113725 278584 262049 39846 -246791 -108220 -44658 -134364 -54 97700 16193
15314A6193j30486J75337o0340J57296J71889j09443l42802k73925O5689N3806
$$ 16193 -114293 61044 704 158000 329889 220446 -122356 -396281 -330592 -276786
15304b76786Q8909J6201K1933K28777L63045p5315l36665m4003J18608p0533J70914
$$ -276786 -187877 -171676 -149743 79034 442079 366764 30099 -13904 104704 34171 205085
15293B05085M9310o4968p3709j53275J61094K47564M031n7408n2633j29996q5912
$$ 205085 254395 189427 115718 -37557 123537 371101 375132 317724 265091 135095 49183
15282D9183k27698K01427J79049L27571J2155J0312j28954j50452j50337k05532
$$ 49183 -178515 22912 201961 529532 541687 551999 423045 272593 122256 -83276
15272h3276k95914Q8089k7200J1672j74739m1621J10462L84204r0460j20232K46853
$$ -83276 -379190 -291101 -318301 -306629 -481368 -522989 -412527 -28323 -118783 -239015 7838
15261G838O0961o5932k93243j65490J16047K70370L08440p3806k26327j70587
$$ 7838 68799 2867 -290376 -455866 -339819 -69449 238991 165185 -61142 -231729
15251b31729L39791M02261J4611L58m4667j92333k62988k55520O45J82698k5725
$$ -231729 108062 510323 524934 525292 480625 288292 25304 -230216 -229571 -46873 -72598
15240g2598l0080j65430j61483J67753M1220J84593L29593R8794O2868k3094k32178
$$ -72598 -102678 -268108 -429591 -261838 -220618 -36025 293568 392362 455230 432136 199958
15229A99958l17330K42434M00175j73247l55212j40466P9370o0309j49064J0973
$$ 199958 -117372 125062 525237 351990 -3222 -143688 -64318 -124627 -273691 -262718
15219b62718K34109j9878L5310J67493M0745m4034r6441l03q1760p4082J32247
$$ -262718 -28609 -48487 -13177 154316 195061 151027 54586 54283 -27477 -101559 30688
15208C0688J30114p2727j99158J32507j27935j98235N1240p2052p2639j15456
$$ 30688 160802 88075 -111083 21424 -106511 -304746 -253506 -325558 -398197 -513653
15198e13653p3865K58496K31928k4231o040K44979K45559m57572k81198M2587
$$ -513653 -587518 -329022 -97094 -121325 -127365 117614 363173 -94399 -375597 -333010
15188c33010K8735k69966M2775K40096L3494k4434J293O1788q6874K78199O7572
$$ -333010 -304275 -574241 -531466 -291370 -257876 -282310 -281017 -219229 -306103 -27904 39668
15177C9668j38126O7683M8860l30604j78271K75907k3285J58546R7316k09573
$$ 39668 -98458 -30775 18085 -312519 -490790 -214883 -238168 -79622 17694 -191879
15167a91879J56802J52822J0883n8942k02734J8989J94194j82627j73291J50347
$$ -191879 -35077 117745 128628 69686 -133048 -114059 80135 -102492 -275783 -125436
15157a25436j59103M2763N2819L25005J70018J03571p0306m03347j77517k67504
$$ -125436 -284539 -241776 -188957 136048 306066 409637 339331 -64016 -241533 -509037
15147e09037K01672q3246J30822J88556j25920J63484K21801J00855j62254m1615
$$ -509037 -307365 -390611 -259789 -71233 -197153 -33669 188132 288987 126733 85118
15137H5118p4822j05549k71875l5051R3274J08661L76851L77843n3184k59751
$$ 85118 10296 -95253 -367128 -402179 -308905 -200244 176607 554450 501266 241515
15127B41515j2145Q8084L9613L5727n6206l05065N1020m3725m8785L84785J24939
$$ 241515 229370 317454 357067 392794 336588 31523 82543 38818 -9967 374818 499757
15116D99757k93112R905p5650r4345J00483K40232p9260k93926j78899P4689j2745
$$ 499757 206645 216550 140900 46555 147038 387270 308010 14084 -164815 -90126 -102871
15105a02871K93892j9720K6332J14950j52719j11101J10133k0870J80035m05446
$$ -102871 191021 171301 197633 312583 159864 48763 158896 138026 318061 -87385
15095h7385k83364J4126J31343J49567M2458j3810r7438k59301Q9152M4591j63778
$$ -87385 -370749 -356623 -225280 -75713 -33255 -47065 -144503 -403804 -314652 -270061 -433839
15084d33839k76396K80113L29480q4810m31614l0666J28439J16339J34861K54844
$$ -433839 -710235 -430122 -100642 -185452 -617066 -647732 -519293 -402954 -268093 -13249
15074a3249K13538J57071J17289J2897k89197l9437m6051j60111O2069o9521K4861
$$ -13249 200289 357360 474649 487546 198349 158912 112861 -47250 14819 -54702 -29841
15063b9841Q1818N3904J4909l8389J28393k9860L079k16215k25855P0591L43766
$$ -29841 51977 105881 120790 82401 210794 180934 184013 -32202 -258057 -187466 156300
15052A56300n323l62981Q8887L16856J99276j61790n4412k20671r3195J5027j01365
$$ 156300 150977 -212004 -123117 193739 393015 231225 176813 -43858 -137053 -122026 -223391
15041b23391K4011K35364R5741k15064j37481K9792J05917l8522K2592J99109
$$ -223391 -199380 35984 131725 -83339 -220820 -191028 -85111 -123633 -101041 98068
15031I8068Q2941m4466N32J93497r4806L3239j67736k64830q2933m9701j78593
$$ 98068 181009 136543 137075 330572 235766 269005 101269 -163561 -246494 -296195 -474788
15020d74788l76468K77247L73537Q8996J0380j7797m328q4320K8906J22717J84591
$$ -474788 -851256 -574009 -200472 -111476 -101096 -118893 -123221 -207541 -178635 -55918 128673
15009A28673L9788L632l8290j35534k13353j59174J88813K34993k7991l09032
$$ 128673 168461 172093 133803 -1731 -215084 -374258 -185445 49548 21557 -287475
14999b87475J73767K31622j68504L7498J74534k962L6759J70654l12699R7161
$$ -287475 -113708 117914 -50590 -13092 161442 158480 195239 365893 53194 150355
14989A50355r0266l78638J27672L25660K00150J00032n8548L8250K2245k43819
$$ 150355 60089 -318549 -190877 134783 334933 434965 376417 414667 436912 193093
14979A93093l80101j61883Q0281J55485N7865N6690N1977o0218J11633J97959
$$ 193093 -187008 -348891 -268610 -113125 -55260 1430 53407 -6811 104822 302781
14969C02781k1238k72295l23277k13955j26681j43837K61243j0265m061L17077
$$ 302781 281543 9248 -314029 -527984 -654665 -798502 -537259 -547524 -551585 -234508
14959b34508q960J34541R2484j58762q8438M17683J65264j93320M3139K8696k4882
$$ -234508 -243468 -108927 -16443 -175205 -263643 154040 319304 125984 169123 197819 172937
14948A72937j47414J2584K34212J93557L8463l91819j46112K30156j23400P4331
$$ 172937 25523 38107 272319 465876 504339 112520 -33592 196564 73164 147495
14938A47495k15239j31753r9819j76929R8673K32302M7280j886l57033j04330
$$ 147495 -67744 -199497 -299316 -476245 -377572 -145270 -97990 -99876 -456909 -561239
14928e61239P4029J38806J66089R3428j71387j27213l893J20698k13294M0840
$$ -561239 -487210 -348404 -182315 -88887 -260274 -387487 -391380 -270682 -483976 -443136
14918d43136L99965K32177k15789k07777M4789P9950k01556j69614J0757k9609
$$ -443136 -43171 189006 -26783 -234560 -189771 -109821 -311377 -480991 -470234 -499843
14908d99843o4466j47912J01305j0566L65576J36706j5599J06537l12826j79324
$$ -499843 -564309 -712221 -610916 -621482 -255906 -119200 -134799 -28262 -341088 -520412
14898e20412j59822L04915K19382p052k99516l6993L18232J13556q6569O4032
$$ -520412 -680234 -375319 -155937 -162989 -462505 -499498 -181266 -67710 -154279 -90247
14888i0247P2567o5848k33038L40991R9635m182o1720r2595j57937j71931J22054
$$ -90247 -17680 -83528 -316566 24425 124060 119878 58158 -34437 -192374 -364305 -242251
14877b42251M2354J7351L9425J81539J1774j31376j2171j84310j65746J37049
$$ -242251 -199897 -182546 -143121 38418 50192 -81184 -93355 -277665 -443411 -306362
14867c06362J14018j80157n2266j9170j6110j10784K54450L56454R2166k05340
$$ -306362 -192344 -372501 -424767 -443937 -460047 -570831 -316381 40073 132239 -73101
14857g3101r2882L3196j05083K36699M8823j25488l66402l659J43545J89419j55699
$$ -73101 -165983 -132787 -237870 -1171 47652 -77836 -444238 -447897 -304352 -114933 -270632
14846b70632n0746K86232j33424j42076J5118L67969L06671j32855j28438m85093
$$ -270632 -321378 -35146 -168570 -310646 -295528 72441 379112 246257 117819 -367274
14836c67274j19576K15379o0420j75790J86962L81523k2471j54081k60204J31595
$$ -367274 -486850 -271471 -331891 -507681 -320719 60804 38333 -115748 -375952 -244357
14826b44357l0040J98923k16315k04632l4183L79072K13832J92619j78693j89872
$$ -244357 -274397 -75474 -291789 -496421 -530604 -151532 62300 254919 76226 -113646
14816a13646q0113j04789P3347K0331j75673J12229R3866J35217J08704o1992
$$ -113646 -193759 -298548 -225201 -204870 -380543 -268314 -174448 -39231 69473 7481
14806G481j6971J02505N6494N1235j77938J18419o9743k8954M0268j34758j92023
$$ 7481 -9490 93015 149509 200744 22806 141225 71482 42528 82796 -51962 -243985
14795b43985o0705R5952j8876j35977r1550J04935P5847k32009j37135J01978
$$ -243985 -304690 -208738 -227614 -363591 -455141 -350206 -274359 -506368 -643503 -541525
14785e41525P2044J35469N3123J53340K39034k6300O5152j96671m40722m90223
$$ -541525 -469481 -334012 -280889 -127549 111485 85185 150337 -46334 -487056 -977279
14775i77279j0093M92656j9159P8738L7536n4784n3330J96520N8803r704R9281
$$ -977279 -987372 -494716 -513875 -435137 -397601 -452385 -505715 -309195 -250392 -260096 -160815
14764a60815J00509M0791J33885j70976o746k00188r5220m970J11681r7398j79541
$$ -160815 -60306 -19515 114370 -56606 -63352 -263540 -358760 -363730 -252049 -349447 -528988
14753e28988l487J78931J43245K35576J57675J42377k70789l46180L2635r2200
$$ -528988 -532475 -353544 -210299 25277 182952 325329 54540 -291640 -259005 -351205
14743c51205j94218n2203L43467k46274l5313M9496N1542L4090k9730m6378K86907
$$ -351205 -545423 -597626 -254159 -500433 -535746 -486250 -434708 -400618 -430348 -476726 -189819
14732a89819K63534K82038K15549r5416k78468O1287R5992P9378j71463l73397
$$ -189819 73715 355753 571302 475886 197418 258705 354697 434075 262612 -110785
14722a10785J59866j50333J96146N1990k90694r970K15678Q2502j92149l2597
$$ -110785 49081 -101252 94894 146884 -143810 -153780 61898 144400 -47749 -80346
14712h0346p4151n9633M1674Q5010j27440J21589K04442N9162j91203j87221J13383
$$ -80346 -154497 -214130 -172456 -87446 -214886 -93297 111145 170307 -20896 -208117 -94734
14701i4734Q1489o3614m1739o7952R9691P307P3928J45268j89631q4858J06970
$$ -94734 -13245 -76859 -118598 -186550 -86859 -79552 -5624 139644 -49987 -134845 -27875
14690b7875j36789l03078j4572J22325J76117j9107j6470K63369k5051J5706P7730
$$ -27875 -164664 -467742 -482314 -359989 -183872 -202979 -219449 43920 18869 34575 112305
14679A12305j46264j48081J47981k28086n8380J8758p0938M6798J73380J53841
$$ 112305 -33959 -182040 -34059 -262145 -320525 -301767 -372705 -325907 -152527 1314
14669A314m456q6915k00384O6469J84508m4062J1710R9132J6776k88793N2381
$$ 1314 -3142 -90057 -290441 -223972 -39464 -83526 -71816 27316 44092 -244701 -192320
14658a92320n8791J14003K42621L128j35867J47372J44540k57896p7606q3580
$$ -192320 -251111 -137108 105513 108641 -27226 120146 264686 6790 -70816 -154396
14648a54396j20339m2790J14777j6893j17976O1809L4504k69881l22143J21177
$$ -154396 -274735 -317525 -202748 -219641 -337617 -275808 -241304 -511185 -833328 -712151
14638g12151L51614J68014J9002K25709J08163r1967j52005m58375j38966J93713
$$ -712151 -360537 -192523 -173521 52188 160351 68384 -83621 -541996 -680962 -487249
14628d87249K65342K30019l102k19939k36138R0411L21593J46468j49512j07618
$$ -487249 -221907 8112 5010 -214929 -451067 -360656 -39063 107405 -42107 -149725
14618a49725k26184j28704J48916J54909P1878J11444J97427M9370J25012j50711
$$ -149725 -375909 -504613 -355697 -200788 -128910 -17466 179961 229331 354343 203632
14608B03632o1925o8090m6285K3277o342j62476j73257O0847p7460l17787O246
$$ 203632 141707 73617 27332 50609 44267 -118209 -291466 -230619 -308079 -625866 -619620
14597f19620K64267o0153j95526j53543O8713J09568K63943j42115k07749J40664
$$ -619620 -355353 -415506 -611032 -764575 -695862 -586294 -322351 -464466 -672215 -531551
14587e31551J47946J7556R7179n637J68289L64240K8030m24614j20350P7762Q7413
$$ -531551 -383605 -366049 -268870 -274507 -106218 258022 286052 -138562 -258912 -181150 -93737
14576i3737N3779M0063j21356l66180m8696l15241j1947L34091K33385r5592k17299
$$ -93737 -39958 105 -121251 -487431 -536127 -851368 -863315 -529224 -295839 -391431 -608730
14565f08730P5901r280j5125j1016O7340k75865K82284Q6293J60282L89214K57196
$$ -608730 -532829 -542109 -557234 -568250 -500910 -776775 -494491 -408198 -247916 141298 398494
14554C98494j72326K0580j12069p7108J62242k35276K9052j65452j46007j82698
$$ 398494 226168 246748 134679 57571 219813 -15463 13589 -151863 -297870 -480568
14544d80568J11372J0404J11029K99209J51056k19075l65341j28757J79168O4161
$$ -480568 -369196 -358792 -247763 51446 202502 -16573 -381914 -510671 -331503 -267342
14534b67342k36504j05414J23307J38203L41175K91838k26065l17477n2409Q8033
$$ -267342 -503846 -609260 -485953 -347750 -6575 285263 59198 -258279 -310688 -222655
14524b22655L49768Q0490J12627k27463j04583J33751J17650J15165J18579j00311
$$ -222655 127113 207603 320230 92767 -11816 121935 239585 354750 473329 373018
14514C73018l17148j12168q9443L8768J5944P1069J64736j16204m16384j82497
$$ 373018 55870 -56298 -145741 -106973 -91029 -19960 144776 28572 -387812 -570309
14504e70309k44798M4851J39840J88482J29278K47843J03734q946k0795k38803
$$ -570309 -815107 -770256 -630416 -441934 -312656 -64813 38921 29975 9180 -229623
14494b29623J16225o8053j29415L80977K80533k99478N0644J33560j14621k29594
$$ -229623 -113398 -181451 -310866 70111 350644 51166 101810 235370 120749 -108845
14484a08845n7175r599K63544J56728k54270J0883j75760k59443K04269n1904
$$ -108845 -166020 -175619 87925 244653 -9617 1266 -174494 -433937 -229668 -281572
14474b81572J32550m5126l752j28431o117n6410O5930j35483o2214J72460J79904
$$ -281572 -149022 -194148 -197900 -326331 -332448 -388858 -322928 -458411 -520625 -348165 -168261
14463a68261J93357j52302k36265J73770p6470k36123R4991K34039k95493k06300
$$ -168261 25096 -127206 -363471 -189701 -266171 -502294 -407303 -173264 -468757 -675057
14453f75057L26053Q4237J27012j69308K46250j13028k3661j2783r638j21332
$$ -675057 -349004 -264767 -137755 -307063 -60813 -173841 -197502 -210285 -219923 -341255
14443c41255K10001L9995l56716k26684J10664K01943m5142q6363K0452J38090
$$ -341255 -131254 -91259 -447975 -674659 -563995 -362052 -407194 -493557 -473105 -335015
14433c35015O7541j2942J02307m2308k31245k68192Q9584N3581J67869J11388
$$ -335015 -267474 -280416 -178109 -220417 -451662 -719854 -630270 -576689 -408820 -297432
14423b97432O200k5472j30368K36842N5746J93506J51393P8430k57121k19817
$$ -297432 -291232 -316704 -447072 -210230 -154484 39022 190415 268845 11724 -208093
14413b08093o3176P0870Q1902l4976J97098J32892k02887J10343p8164l10033
$$ -208093 -271269 -200399 -118497 -153473 43625 176517 -26370 83973 5809 -304224
14403c04224j33540j3731k11816j03160J68179K82102r408J27154K17702K839
$$ -304224 -437764 -451495 -663311 -766471 -598292 -316190 -325598 -198444 19258 22097
14393B2097j94987J06627K8738L3599o7417R7247K34395K8097j54240m9258m82644
$$ 22097 -172890 -66263 -37525 -3926 -71343 25904 260299 288396 134156 84898 -397746
14382c97746j64509K5600J30720M6847R5366J4289j2287Q6047k4582J8329L4601
$$ -397746 -562255 -536655 -405935 -359088 -263722 -249433 -261720 -175673 -200255 -181926 -147325
14371a47325J30904j15926J11622M8935j11563k03737L4950K17799j08311K44319
$$ -147325 -16421 -132347 -20725 28210 -83353 -287090 -252140 -34341 -142652 101667
14361A01667j34140K5286R7709n9189j08200j25333j55952K65108M5270J05571
$$ 101667 -32473 -7187 90522 31333 -76867 -202200 -358152 -93044 -47774 57797
14351E7797J22791O2232O1084o2190O933J09662J87575k29218k56412J42795L48273
$$ 57797 180588 242820 303904 241714 248647 358309 545884 316666 60254 203049 551322
14340E51322k78148m10861k07961l28211J11421L5582J55203K56743q7907L18536
$$ 551322 273174 -137687 -345648 -673859 -562438 -526856 -371653 -114910 -202817 115719
14330A15719M93306j89186r3602n8681j70161k75799N5459J32646J2356k52776
$$ 115719 609025 419839 326237 267556 97395 -178404 -122945 9701 22057 -230719
14320b30719n1646K40029j5462q3651K66114L03886L8534l87692l12930j97367
$$ -230719 -282365 -42336 -57798 -141449 124665 428551 467085 79393 -233537 -430904
14310d30904K8932N5693J94913n2509O5302j79172l4965k58629o6611J24776N644
$$ -430904 -401972 -346279 -151366 -203875 -138573 -317745 -352710 -611339 -677950 -553174 -547530
14299e47530r7337L222J86984L04164K36473K1644k6655m3304r6817j33927k62186
$$ -547530 -644867 -641645 -454661 -150497 85976 107620 80965 37661 -59156 -193083 -455269
14288d55269j74823J22727J63556l9497q0961m9461j62687J130K36728L54827
$$ -455269 -630092 -507365 -343809 -383306 -464267 -513728 -676415 -675285 -438557 -83730
14278h3730n3335K245j51004l1441R5816J40076n4537l76021P156O0057J43402
$$ -83730 -137065 -134820 -285824 -317265 -221449 -81373 -135910 -511931 -504775 -444718 -301316
14267c01316J86903J05798o8226j87993J63161j11588O1229n935J59621J53340
$$ -301316 -114413 -8615 -76841 -264834 -101673 -213261 -152032 -157967 1654 154994
14257A54994p7907l97419q0187J11888N6921Q8946K60921m9222j39489K1893J48697
$$ 154994 77087 -320332 -400519 -288631 -231710 -142764 118157 68935 -70554 -48661 100036
14246A00036j01262l15132K7341L26701q2635J45445J11913J49709k9023m11043
$$ 100036 -1226 -316358 -289017 37684 -44951 100494 212407 362116 333093 -77950
14236g7950k36074K29413J36865N7227r386k32877j81189J59996Q8309p7419L8438
$$ -77950 -314024 -84611 52254 109481 100095 -132782 -313971 -153975 -65666 -143085 -104647
14225a04647j44296L20685j43226n9849M6607J86308k6382l4623L49695J90658
$$ -104647 -248943 71742 -71484 -131333 -84726 101582 75200 40577 390272 580930
14215E80930l46808l99815K6749O7946O5752j10392o1882J17134l7961j30992
$$ 580930 234122 -165693 -138944 -70998 -5246 -115638 -177520 -60386 -98347 -229339
14205b29339J3712L4949J82019K26224k27107q3477o6745m1904j61943L23609
$$ -229339 -215627 -180678 1341 227565 458 -83019 -149764 -191668 -353611 -30002
14195c0002k6238r1448N4760P1454l3056l7286j62063k06663K37457J12996L7902
$$ -30002 -56240 -147688 -92928 -21474 -54530 -91816 -253879 -460542 -223085 -110089 -72187
14184g2187L33926k5950m47656j00574J50545k647k35679Q3689K13301j95670
$$ -72187 261739 235789 -211867 -312441 -161896 -164543 -400222 -316533 -103232 -298902
14174b98902L0964J17184K36644K11443j19269r5350o4860J18981l0515n1781
$$ -298902 -267938 -150754 85890 297333 178064 82714 17854 136835 106320 54539
14164E4539J46020j11347m0430q912k09287K74972J05290r5915k75812o0615J7485
$$ 54539 200559 89212 48782 39870 -169417 105555 210845 114930 -160882 -221497 -204012
14153b04012M8088K5883l4037J33239J09589p6561j38624p5933k6687L67997M356
$$ -204012 -155924 -130041 -164078 -30839 78750 2189 -136435 -212368 -239055 128942 133298
14142A33298l1395j63635N4589j22671m1865J65129R0043j59369q2625J37651
$$ 133298 101903 -61732 -7143 -129814 -171679 -6550 83493 -75876 -158501 -20850
14132b0850l59439j77154Q7509J12701J33290j99736p3628r0177n4165r3273J59797
$$ -20850 -380289 -557443 -469934 -357233 -223943 -423679 -497307 -587484 -641649 -734922 -575125
14121e75125K18457j5703L3111N1756j5370n2765k00081J72633M0338J16572J14040
$$ -575125 -356668 -372371 -339260 -287504 -302874 -355639 -555720 -383087 -342749 -226177 -112137
14110a12137K03607o5253r6631o0074l1535L709p1097j06363K9520K92856J70924
$$ -112137 91470 26217 -70414 -130488 -162023 -158314 -229411 -335774 -306254 -13398 157526
14099A57526m11521l6410K90186K14772j16716J76218j04j3083k10099J25573
$$ 157526 -253995 -290405 -219 214553 97837 274055 273951 260868 50769 176342
14089A76342q245P8127N1082j31307L7210L4454j54958q4935J20261l66J61992
$$ 176342 168097 246224 297306 165999 203209 237663 82705 -2230 118031 117665 279657
14078B79657K3459j14442j38594j24723k8236Q0464J87470k0694j45364J74026
$$ 279657 303116 188674 50080 -74643 -102879 -22415 165055 144361 -1003 173023
14068A73023l2035J70358j4859k76912k46602N2539K08976O9547j01196L29185
$$ 173023 140988 311346 296487 19575 -227027 -174488 34488 104035 2839 332024
14058C32024Q9646j15724K7944j21559l94965J9093n1033O691O0783k17800q9884
$$ 332024 421670 305946 333890 212331 -182634 -163541 -214574 -207883 -147100 -364900 -454784
14047d54784K42429K70094k37371j370J83538j72526J3408j66819l29250P4257
$$ -454784 -212355 57739 -179632 -181002 2536 -169990 -156582 -323401 -652651 -578394
14037e78394K62791Q0293J26672M237K7765l32699k50169Q1480J39226Q5756j58522
$$ -578394 -315603 -235310 -108638 -104401 -76636 -409335 -659504 -578024 -438798 -353042 -511564
14026e11564n8126l5858L0391L41278K20295K60230n3648o7887j22124j74104
$$ -511564 -569690 -605548 -575157 -233879 -13584 246646 192998 125111 2987 -171117
14016a71117k9837m218J44878k1553O1877k90636L4180R4607J84300j62758J876
$$ -171117 -200954 -205172 -60294 -81847 -19970 -310606 -276426 -181819 2481 -160277 -158401
14005a58401r9895p3026l58142J12848K74475m601L546N725k9798O409Q2234K42531
$$ -158401 -258296 -331322 -689464 -576616 -302141 -306742 -303196 -297471 -327269 -320860 -238626 3905
13993C905M9640P3086j24418k13603J16088j6882O1721p4938j1031m0697M7028
$$ 3905 53545 126631 2213 -211390 -95302 -112184 -50463 -125401 -136432 -177129 -130101
13982a30101j06218o9618J6955l9401J19568J91944j01174n8040j29716J29199
$$ -130101 -236319 -305937 -288982 -328383 -208815 -16871 -118045 -176085 -305801 -176602
13972a76602J74850j05512k3568j85646j70605j71870n023J23055J37488J94054
$$ -176602 -1752 -107264 -130832 -316478 -487083 -658953 -663976 -540921 -403433 -209379
13962b09379K19822o5774j78655K5197K03591J72707J01042r4882j50278k52712
$$ -209379 10443 -55331 -233986 -208789 -5198 167509 268551 173669 23391 -229321
13952b29321p9941L85782j22546k92345j30064K28604K31656p0448J01607K37499
$$ -229321 -309262 76520 -46026 -338371 -468435 -239831 -8175 -78623 22984 260483
13942B60483k78109P8703K20809l23858R6404q7708j74795o3390L40348K6145
$$ 260483 -17626 61077 281886 -41972 54432 -33276 -208071 -271461 68887 95032
13932I5032l13816K48217k80559p1700K55804k16628M4066J82664j46906j87909
$$ 95032 -218784 29433 -251126 -322826 -67022 -283650 -239584 -56920 -203826 -391735
13922c91735k8429K1900M8524L3856J95963K9197J8310Q9256j87766m0193J05460
$$ -391735 -420164 -398264 -349740 -315884 -119921 -90724 -72414 16842 -170924 -211117 -105657
13911a05657K6135l04839j50432J48589n1036j66068O1913Q2991J60852K57028
$$ -105657 -79522 -384361 -534793 -386204 -437240 -603308 -541395 -458404 -297552 -40524
13901d0524O0649J1834j90724J72200R123l08802j29357k4292J67402n5881j28076
$$ -40524 20125 31959 -158765 13435 22558 -286244 -415601 -439893 -272491 -328372 -456448
13890d56448l9163J12584K20028Q8220k90751J87682Q8883J39477J24067K6202
$$ -456448 -495611 -383027 -162999 -74779 -365530 -177848 -88965 50512 174579 200781
13880B00781j13082l2793j68298o9483K07186k5455J74604l56113p9161J40441
$$ 200781 87699 54906 -113392 -182875 24311 -1144 173460 -182653 -261814 -121373
13870a21373J05969j69515r2480R0085j98105k39722O7725k287K74190L76259
$$ -121373 -15404 -184919 -277399 -187314 -385419 -625141 -557416 -559703 -285513 90746
13860I0746j64886m6658l7836j75207L2851M3137q3815N463r464j63609k68321
$$ 90746 -74140 -120798 -158634 -333841 -300990 -257853 -341668 -336205 -345669 -509278 -777599
13849g77599Q4818L67807j2928k74336K3974K62810K57561K13816j07047k89630
$$ -777599 -692781 -324974 -337902 -612238 -588264 -325454 -67893 145923 38876 -250754
13839b50754k28265J64773K19891j79725O7078K35930J24578K06962O049m13802
$$ -250754 -479019 -314246 -94355 -274080 -207002 28928 153506 360468 366517 -47285
13829d7285K8915J94929j18019k04272K21400m967k05538j43227j21664K77594
$$ -47285 -18370 176559 58540 -145732 75668 70701 -134837 -278064 -399728 -122134
13819a22134J49721m4829M469J23434J15495o4318k11347k7199P7288k61731q1777
$$ -122134 27587 -17242 -12773 110661 226156 161838 -49509 -76708 580 -261151 -342928
13808c42928R6668P656L95759M07449m360n2193o11188o0701J00773O2289l46297
$$ -342928 -246260 -238604 157155 564604 560244 508051 -103137 -163838 -63065 -776 -347073
13797c47073J25644Q075j2021q6302p2549J43071K06541j50966J26776r1161l45796
$$ -347073 -221429 -213354 -225375 -311677 -384226 -241155 -34614 -185580 -58804 -149965 -495761
13786d95761J42510K89047K8917O9814L3978l04896K2345J03535J92951j09446
$$ -495761 -353251 -64204 -35287 34527 68505 -236391 -214046 -110511 82440 -27006
13776b7006k15006J29366O9696k30089N0638K28702l4600Q222R4267j38829n3494
$$ -27006 -242012 -112646 -42950 -273039 -222401 6301 -28299 -20077 74190 -64639 -118133
13765a18133K98609Q7833M7851j4374J89935K20201O577j99492j87939j70486
$$ -118133 180476 268309 316160 301786 491721 711922 718499 519007 331068 160582
13755A60582K1300j29772j85942J1579J78587M8920l3511L01431K63550p1388
$$ 160582 181882 52110 -133832 -122253 56334 105254 71743 373174 636724 565336
13745E65336j87043j55106r6822k70055Q7996L67384R6892j3977q4706k36427
$$ 565336 378293 223187 126365 -143690 -55694 311690 408582 394605 309899 73472
13735G3472j16632o5788l7124J98413m9447Q1459O7067J24769o3716j74886j10871
$$ 73472 -43160 -108948 -146072 52341 2894 84353 151420 276189 212473 37587 -73284
13724g3284L9894K64953K03260P5834l5753j8272J24872L2328k69472k39492j12247
$$ -73284 -33390 231563 434823 510657 474904 456632 581504 613832 344360 104868 -7379
13713g379m5563j35361Q4227m07390j15842K95520K44316J02310j56072J85115
$$ -7379 -52942 -188303 -104076 -511466 -627308 -331788 -87472 14838 -141234 43881
13703D3881J8634J50692K7665j2113l6493R4357J06096l34563l38266K98371o5583
$$ 43881 62515 213207 240872 228759 192266 286623 392719 58156 -280110 18261 -47322
13692d7322j25150M4168j36255j7479Q9206M1285k02869M6691J05089k62718P7973
$$ -47322 -172472 -128304 -264559 -282038 -192832 -151547 -354416 -307725 -202636 -465354 -387381
13681c87381K91742L51827O3270j07186k96377l67815J4809J55301R4819j49955
$$ -387381 -95639 256188 319458 212272 -84105 -451920 -437111 -281810 -186991 -336946
13671c36946j78582K07686L07089J67244j46445j02662N165J60309k86570l1039
$$ -336946 -515528 -307842 -753 166491 20046 -82616 -77451 82858 -203712 -234751
13661b34751R2788j49987K89835j25436k89810j01808K21609J35207q3025L40846
$$ -234751 -141963 -291950 -2115 -127551 -417361 -519169 -297560 -162353 -245378 95468
13651I5468J3944l49779O7493J50766k3615m37634M1018M0861M21580J49799j38545
$$ 95468 109412 -240367 -172874 -22108 -45723 -483357 -442339 -401478 20102 169901 31356
13640C1356k3652m150j15233p0963J86278r4875j06057J55134J2294j72880K0674
$$ 31356 7704 3554 -111679 -182642 3636 -91239 -197296 -42162 -29868 -202748 -182074
13629a82074r70r1383R9280l6843J01268J11928j6593j32350m0987l8503q9970
$$ -182074 -183044 -274427 -175147 -211990 -110722 1206 -15387 -147737 -188724 -227227 -317197
13618c17197R4432K53273q9044j78909n6585J3674m3974J20796J6973L3334j14470
$$ -317197 -222765 30508 -58536 -237445 -294030 -280356 -324330 -203534 -186561 -153227 -267697
13607b67697m8860K61965L10495Q3149j46087j31772L07079P1230m25868j66771
$$ -267697 -316557 -54592 255903 339052 192965 61193 368272 439502 13634 -153137
13597a53137J87562J83524J05652k56435k35994k4404l5387K3058O7708Q9628
$$ -153137 34425 217949 323601 67166 -168828 -193232 -228619 -205561 -137853 -48225
13587d8225K79305O8911K9558j91781p0976j54086o6899L38307J18661J33016
$$ -48225 231080 299991 329549 137768 66792 -87294 -154193 184114 302775 435791
13577D35791n4857m8844m198n0401q7990J86827k47222k29797J40713J45070r4972
$$ 435791 380934 332090 327892 277491 189501 376328 129106 -100691 40022 185092 90120
13566I0120p2384j36506n6519O3606r2615p4834K52864K25557J5474j41258j22671
$$ 90120 17736 -118770 -175289 -111683 -204298 -279132 -26268 199289 214763 73505 -49166
13555d9166m27471j81643J6082n8680K07340J35059J39874R3120L8169J56845
$$ -49166 -476637 -658280 -642198 -700878 -493538 -358479 -218605 -125485 -87316 69529
13545F9529j55132n2584p924L4156P1708L28232j78985r5139n738k00509N17599
$$ 69529 -85603 -138187 -146111 -111955 -40247 287985 109000 13861 8123 -192386 325213
13534C25213J46670l01712J66233J54309m5003k26416k3623p5230k8887J2613
$$ 325213 471883 170171 336404 490713 445710 219294 195671 120441 91554 104167
13524A04167l6306p1803J71193J30158j05090Q3303Q3410n5956J132k73715O6489
$$ 104167 67861 -3942 167251 297409 192319 275622 359032 303076 304208 30493 96982
13513I6982k4231q9973m7659J2266J3661j01924k53948N1831L24065L8778l9757
$$ 96982 72751 -17222 -64881 -52615 -38954 -140878 -394826 -342995 -18930 19848 -19909
13502a9909p0821L6781k08421p5630K9041K22643K75841P1318p21o6734Q59K07642
$$ -19909 -90730 -53949 -262370 -338000 -308959 -86316 189525 260843 260122 193388 194247 401889
13490D01889J80569l05845r6500M1573m8809J18153j10688l26881j68683o8310
$$ 401889 582458 276613 180113 221686 172877 291030 180342 -146539 -315222 -383532
13480c83532q5932p8673N0316k23519L23585K43702n2194K72660J55393j10461
$$ -383532 -469464 -548137 -497821 -721340 -397755 -154053 -206247 66413 221806 111345
13470A11345Q0456m5252j87863J4477p6059J69659K63268J5291L1092M1284k3048
$$ 111345 191801 146549 -41314 -26837 -102896 66763 330031 345322 376414 417698 394650
13459C94650j45666O1124k04174r5804L35882K8837l0391k5444r2260j64815p3170
$$ 394650 248984 310108 105934 10130 346012 374849 344458 319014 226754 61939 -11231
13448a1231q8173l03315L13274J76667j95013l1947K65657l1087M3433k2706q7639
$$ -11231 -99404 -402719 -89445 87222 -107791 -139738 125919 94832 138265 115559 27920
13437B7920j19385J49768K26967k92390l37135n1705K06050n662P6983J66042
$$ 27920 -91465 58303 285270 -7120 -344255 -395960 -189910 -195572 -118589 47453
13427D7453K33842J52541k0985l60350q3738p0550j85534q8960J61042K76340
$$ 47453 281295 433836 412851 52501 -31237 -101787 -287321 -376281 -215239 61101
13417F1101o8227j18928L67829K06725j09216j84284m80375p0618n0361o4337
$$ 61101 -7126 -126054 241775 448500 339284 155000 -325375 -395993 -446354 -510691
13407e10691j50954K6015K54160K05120k30366j7775M08850j07509m5025P4114
$$ -510691 -661645 -635630 -381470 -176350 -406716 -424491 -15641 -123150 -168175 -94061
13397i4061j07963K6690p73J26005J54973Q3145j3800l3769j0997J59912k06033
$$ -94061 -202024 -175334 -176107 -50102 104871 188016 174216 140447 129450 289362 83329
13386H3329J41661L43627O2950M4241j10177k47318k87967P6881J6987l52671
$$ 83329 224990 568617 631567 675808 565631 318313 30346 107227 124214 -228457
13376b28457J74507J14573k78453J01157J06070L78992k2115q6517O7691j26596
$$ -228457 -53950 60623 -217830 -116673 -10603 368389 346274 259757 327448 200852
13366B00852r7789o3239K24025j84860l1390O2237k11331Q3409j16176J08835
$$ 200852 103063 39824 263849 78989 47599 109836 -101495 -18086 -134262 -25427
13356b5427j23801k8141j25112J15397J71276J9039J44654J17140R4032n8029
$$ -25427 -149228 -177369 -302481 -187084 -15808 3231 147885 265025 359057 301028
13346C01028l9351j18902K357m1445L8912J99273R0846J00521k44399K7490j79354
$$ 301028 261677 142775 145132 103687 142599 341872 432718 533239 288840 316330 136976
13335A36976q3306j76967j725J66872k05197N4438K02828j51244k37306l0915
$$ 136976 53670 -123297 -125022 41850 -163347 -108909 93919 -57325 -294631 -325546
13325c25546M1536K99066j32574j55016j20637K60681m5245M860J98469K382j02626
$$ -325546 -284010 15056 -117518 -272534 -393171 -132490 -177735 -172875 25594 27976 -74650
13314g4650J38967J14279k902J37320R6208j28360k58480j63311J91141n7820
$$ -74650 64317 178596 175694 313014 409222 280862 22382 -140929 50212 -7608
13304g608j49405j36856o5820J90601K10426o2530L8031k8114k43718J34525R9635
$$ -7608 -157013 -293869 -359689 -169088 41338 -21192 16839 -11275 -254993 -120468 -20833
13293b0833J51647j12095L2605J64274j69700j60557J2571O8178j36160j48514
$$ -20833 130814 18719 51324 215598 45898 -114659 -102088 -33910 -170070 -318584
13283c18584J05971K21736N7304k17694O4760L49706R2398j51910m05736q9578
$$ -318584 -212613 9123 66427 -151267 -86507 263199 355597 203687 -202049 -291627
13273b91627L32281p0563N1783L2053K50698M07284o4051n52423l83106J58755
$$ -291627 40654 -29909 21874 53927 304625 711909 647858 95435 -287671 -128916
13263a28916J98172J78951j90435j47869R2143j23144j63373J14451J08030K7513
$$ -128916 69256 248207 57772 -90097 2046 -121098 -284471 -170020 -61990 -34477
13253c4477o3961j91025j88051K42525K53600P6506J0362L6228K185j68805o0526
$$ -34477 -98438 -289463 -477514 -234989 18611 95117 105479 141707 143892 -24913 -85439
13242h5439k15637L49092p935j59114n5535K5519J29016j5887l74111l4663l10235
$$ -85439 -301076 48016 40081 -119033 -174568 -149049 -20033 -35920 -410031 -444694 -754929
13231g54929M5820K45744K00022J89096j446N0690J64597k23971J97767O2497
$$ -754929 -709109 -463365 -263343 -74247 -75693 -25003 139594 -84377 113390 175887
13221A75887k5318j04179O4397k5164k69984l01277J69069J05969j8836l67931
$$ 175887 150569 46390 110787 85623 -184361 -485638 -316569 -210600 -229436 -597367
13211e97367J11302K78691r8090J05046L30661k3660j25469J10388K65348L40919
$$ -597367 -486065 -207374 -305464 -200418 130243 106583 -18886 91502 356850 697769
13201F97769j53933m01276j23623q8399j57689K7018k1610j6374J86198K11309
$$ 697769 543836 142560 18937 -69462 -227151 -200133 -221743 -238117 -51919 159390
13191A59390j67976o10068m82616K43577M10605M64022Q3342J2437o2386n3882
$$ 159390 -8586 -618654 -1101270 -857693 -447088 16934 100276 112713 50327 -3555
13181c555L0513k45947N8908o0731j74593J15101M57825J60553K972l68072j08454
$$ -3555 26958 -218989 -160081 -220812 -395405 -280304 177521 338074 341046 -27026 -135480
13170a35480J6056K00840m1781m1243o0534j2645N4374j5348l2259o672j49856
$$ -135480 -119424 81416 39635 -1608 -62142 -74787 -20413 -35761 -68020 -74692 -224548
13159b24548j46793p7405R648Q2786L3717J18922J30755J25670J54859M7182m0767
$$ -224548 -371341 -448746 -439098 -356312 -322595 -203673 -72918 52752 207611 254793 214026
13148B14026o756J1626j53371L42894J17567l18726k30940j12995K35896p9969
$$ 214026 207270 218896 65525 408419 525986 207260 -23680 -136675 99221 19252
13138A9252m02006J3061J70018P1266j42336L3994J47178J0582l2405J83424K46136
$$ 19252 -382754 -369693 -199675 -128409 -270745 -236751 -89573 -78991 -111396 72028 318164
13127C18164p4075j11049n4825j36949J31766L8131j32566k07599J97447Q0921
$$ 318164 244089 133040 78215 -58734 73032 111163 -21403 -229002 -31555 49366
13117D9366k09404K29185K34396j51719j26566l15429J04017J72527j8532j89785
$$ 49366 -160038 69147 303543 151824 25258 -290171 -186154 -13627 -32159 -221944
13107b21944m8707N3355L0781j23187q4076J68864K37479k20177j04330Q8990
$$ -221944 -270651 -217296 -186515 -309702 -393778 -224914 12565 -207612 -311942 -222952
13097b22952q9704N4812q8657k8084L8548J38325M60271R7127q0480J81403M5669
$$ -222952 -312656 -257844 -346501 -374585 -336037 -197712 262559 359686 279206 460609 506278
13086E06278k2730P7819k8744K95022j71936k6857K08449n0894j15492l01287
$$ 506278 483548 561367 532623 827645 655709 628852 837301 786407 670915 369628
13076C69628k90685j83808q2590o3006K77967J32631r7997R0088P282J57052N0881
$$ 369628 78943 -104865 -187455 -250461 27506 160137 62140 152228 159510 316562 367443
13065C67443r8028J16877k15713o422J2860k32463R3280K70364j57331P7542j34469
$$ 367443 269415 386292 170579 164157 177017 -55446 37834 308198 150867 228409 93940
13054I3940l8776N9899l62724r2176J49746J39030p5535J6355j91020P0386L21508
$$ 93940 55164 115063 -247661 -339837 -190091 -51061 -126596 -110241 -301261 -230875 90633
13043I0633M6527j44459j10142K9742J62156m795K610m7330J26587p5407k75600
$$ 90633 137160 -7299 -117441 -87699 74457 69662 72272 24942 151529 76122 -199478
13032a99478J13644K06644K36311K10480J61851N6442J60218k04494k51568L212
$$ -199478 -85834 120810 357121 567601 729452 785894 946112 741618 490050 493262
13022D93262j23216K4995k189j25440k97449N563Q4769k41997n1806K42958K89326
$$ 493262 370046 395041 392852 267412 -30037 -24474 60295 -181702 -233508 9450 298776
13011B98776l69686k80235J77537r6114K11816K0792R9811J27268j43462J45991
$$ 298776 -70910 -351145 -173608 -269722 -57906 -37114 62697 189965 46503 192494
13001A92494L00174j04556K705J008L0514N3649j17197j31405k5318m7057o1795
$$ 192494 492668 388112 390817 391825 422339 475988 358791 227386 202068 155011 93216
12990I3216L465J11990L11034J07438k53497j44232P0978j65707k2173r16K52030
$$ 93216 96681 208671 519705 627143 373646 229414 300392 134685 112512 111596 363626
12979C63626K3174n2695K1551M1509j24442r246O8011l183j40453n6391K27660
$$ 363626 386800 334105 355656 397165 272723 263477 331488 328305 187852 131461 359121
12968C59121K14579k15367q0684J2652K25288O9617o3584m8644k15299q2428Q4544
$$ 359121 573700 358333 277649 290301 515589 585206 521622 472978 257679 175251 259795
12957B59795J16940j7280m0660J26766r0400j77301o704M2081J3703l91381j20648
$$ 259795 376735 359455 318795 445561 355161 177860 171156 213237 226940 -164441 -285089
12946b85089J85420J08704j25634m5229K92764J50602k904J45557p7510Q5284
$$ -285089 -99669 9035 -116599 -161828 130936 281538 278634 424191 346681 431965
12936D31965j47992k11827L9901j09465K7710j85174K7984O1372P1486N0873q6338
$$ 431965 283973 72146 112047 2582 30292 -154882 -126898 -65526 5960 56833 -29505
12925b9505K9929o8080J66610J4447k89760j93m6020l0332J72957L3395L11582
$$ -29505 424 -67656 98954 113401 -176359 -176552 -222572 -252904 -79947 -46552 265030
12914B65030j11182j95439J30173J21023l75o7221K24755N5531K54250j89974
$$ 265030 153848 -41591 88582 209605 209230 142009 366764 422295 676545 486571
12904D86571l80354P8012j31715q6048P4492M04957j32893r7007j21850r1204
$$ 486571 106217 184229 52514 -33534 40958 445915 313022 216015 94165 2961
12894B961k06942j00402J94572K04576l80278N264K45418L78743L03953l4610
$$ 2961 -203981 -304383 -109811 94765 -285513 -280249 -34831 343912 647865 613255
12884F13255j84483l90822k83492q2023n4489j6976J19792N8286j01953L22480
$$ 613255 428772 37950 -245542 -327565 -382054 -399030 -279238 -220952 -322905 -425
12874d25K38519Q5329O7097l06464k01342M03876j6454k40868J8772J39605L9362
$$ -425 238094 323423 390520 84056 -117286 286590 270136 29268 48040 187645 227007
12863B27007P0652k45779j49012J13756n1057j49038N0325k01656J99091L48870
$$ 227007 297659 51880 -97132 16624 -34433 -183471 -133146 -334802 -135711 213159
12853B13159J06816k01283k19887k15222Q6037Q0609J12943l1848p8927J99937
$$ 213159 319975 118692 -101195 -316417 -230380 -149771 -36828 -68676 -147603 52334
12843E2334R4367N8466K68977n9040k24132k0617j25055J74255K66585o1050j51534
$$ 52334 146701 205167 474144 415104 190972 170355 45300 219555 486140 425090 273556
12832B73556N5634J8788l75334k15838K04726L34211K84688M803J08150J77902
$$ 273556 329190 347978 -27356 -243194 -38468 295743 580431 585234 693384 871286
12822H71286n9347j92876j53457k3417P0860k97333k86530O8188q6660K86669
$$ 871286 811939 619063 465606 442189 513049 215716 -70814 -2626 -89286 197383
12812A97383k5717M8192N3857L87895J89598L611k83180j88426o9567m1923N3406
$$ 197383 171666 219858 273715 661610 851208 854819 571639 383213 313646 271723 325129
12801C25129J7775J21094J94401j63614J31106J42245k36209N851n2962l23505
$$ 325129 342904 463998 658399 494785 625891 768136 531927 537778 484816 161311
12791A61311R6227k7149j28228L7994M9415j28707P4036J28957j18611l38406
$$ 161311 257538 230389 102161 140155 189570 60863 134899 263856 145245 -193161
12781a93161r5088M86484R9872k01946K44801l752J69620n700j69742j44950j1273
$$ -193161 -288249 198235 298107 96161 340962 337210 506830 501130 331388 186438 175165
12770A75165J88394J16528m8332j48811j04939N8204K68667J69896n5703j4861
$$ 175165 363559 480087 431755 282944 178005 236209 504876 674772 619069 604208
12760F04208j90955l1699N6697N3517J83831P4946l51459j68750j25927J24630
$$ 604208 413253 381554 438251 491768 675599 750545 399086 230336 104409 229039
12750B29039l0233j83495m8338o99l8740R2489K35296J66067O5997j74544J75423
$$ 229039 198806 15311 -33027 -33726 -72466 20023 255319 421386 487383 312839 488262
12739D88262j06853k5806J24166J66076P898k40612J41669Q7704r53j6993R8370
$$ 488262 381409 355603 479769 645845 653743 413131 554800 642504 641551 624558 722928
12728G22928K899M3990J21831k37078L1030k0317k69248P3989J88342J10119n2533
$$ 722928 725827 769817 891648 654570 685600 665283 396035 470024 658366 768485 715952
12717G15952q5174J20489k13659n1767n008M771p3535K97392N7667k02983K17341
$$ 715952 630778 751267 537608 485841 480833 485604 412069 709461 767128 564145 781486
12706G81486K7486P4220O1418r8438l81819m32141K40071N5234r5125O733J67377
$$ 781486 808972 883192 944610 846172 464353 32212 272283 327517 232392 239125 406502
12695D06502J1716K6667J77511j58183j35473j59947k37090m5905K98139m1002
$$ 406502 418218 444885 622396 464213 328740 168793 -68297 -114202 183937 142935
12685A42935J3808L20937Q2160l18134k09267n4543L4250K61484N3306o9005P5630
$$ 142935 156743 477680 559840 241706 32439 -22104 12146 273630 326936 257931 333561
12674C33561J49288K09831J3918q3687j69143j3546N8284k80175p8090K421k2239
$$ 333561 482849 692680 706598 622911 453768 440222 498506 218331 140241 142662 120423
12663A20423j35903P7857P11j0743K52965K68163K5400q7500j07351j90701J17422
$$ 120423 -15480 62377 63088 52345 305310 573473 598873 511373 404022 213321 330743
12652C30743k41713n6819J10596K04097J92289n0528K67849J61656k08883j92726
$$ 330743 89030 32211 142807 346904 539193 488665 756514 918170 709287 516561
12642E16561J40264N4080k99810n4967L2966J23536K54849J25943n4822K51114
$$ 516561 656825 710905 411095 356128 389094 512630 767479 893422 838600 1089714
12632A089714j27911k26263J64311k59190j68457o9265N4854j68905N39587J10818
$$ 1089714 961803 735540 899851 640661 472204 402939 457793 288888 828475 939293
12622I39293j57881k04561j83666o8852K0596j59801o4001J14297M8385R8458
$$ 939293 781412 576851 393185 324333 344929 185128 121127 235424 283809 382267
12612C82267P1903R2577J7365M6484m3054L2854j03439j83341J82278J09658m6736
$$ 382267 454170 546747 564112 610596 567542 600396 496957 313616 495894 605552 558816
12601E58816j13158m8369j96650k38055j34238L21992K24821J78178J70817p1155
$$ 558816 445658 397289 200639 -37416 -171654 150338 375159 553337 724154 652999
12591F52999p8276p8029K6065Q2432k59143K26362K19761n6267o9322j02328p6180
$$ 652999 574723 496694 522759 605191 346048 572410 792171 735904 666582 564254 488074
12580D88074l44926p0836J8508L45793K54972J13225m15298j02016n9505K8113
$$ 488074 143148 72312 90820 436613 691585 804810 389512 287496 227991 256104
12570B56104K68176J30486q0888K45983o115j65655j85449J43762m3295j28042
$$ 256104 524280 654766 573878 819861 813746 648091 462642 606404 563109 435067
12560D35067j11592m0069J91061K29397j99237j27566j1490P7522J312k20022
$$ 435067 323475 283406 474467 703864 504627 377061 365571 443093 444405 224383
12550B24383L1099K4456k0380J6074j12662P3729J30583p2569j50068R4811N9648
$$ 224383 255482 279938 259558 275632 162970 236699 367282 294713 144645 239456 299104
12539B99104j37440J21541J38269K0103K34813j68913J09103k6651q7898j5664
$$ 299104 161664 283205 421474 441577 676390 507477 616580 589929 502031 486367
12529D86367L98421K63737k59239o5507J1629j71851k5111k1514n7207q2613q1000
$$ 486367 884788 1148525 889286 823779 835408 663557 638446 616932 559725 477112 396112
12518C96112Q5180j4982k7299j36958Q0560L88086J01747j01386K71333J39459
$$ 396112 481292 466310 439011 302053 382613 770699 872446 771060 1042393 1181852
12508A181852k82044j06072j41116r4444J54032M89091L54365l996j88104n04828
$$ 1181852 899808 793736 652620 558176 712208 1201299 1555664 1551668 1363564 858736
12498H58736K3471j7091k6912o1511L03752J97013j36596j21141K04322j25749
$$ 858736 882207 865116 838204 776693 1080445 1277458 1140862 1019721 1224043 1098294
12488A098294j94555N5776k2071n9529Q0900M668J28809j14006j82535J15013
$$ 1098294 903739 959515 937444 877915 958815 963483 1092292 978286 795751 910764
12478I10764K85641J09681K95072p148k55974j78223J33781j33447K4987l3921
$$ 910764 1196405 1306086 1601158 1594010 1338036 1159813 1293594 1160147 1185134 1151213
12468A151213k15596M0773K66981K2007K1289P616j36661L5423k01059r6392J42984
$$ 1151213 935617 976390 1243371 1265378 1286667 1294283 1157622 1193045 991986 895594 1038578
12457A038578L777J77809j8208j69654j21588K27313K51489L4472k58310k32393
$$ 1038578 1042355 1220164 1201956 1032302 910714 1138027 1389516 1423988 1165678 933285
12447I33285j00301O7711j24126O8441L09528l5165l40799J18745m0919J70154
$$ 933285 832984 900695 776569 845010 1154538 1119373 778574 897319 856400 1026554
12437A026554K08012M7813j15036j25596M9113j26273k07948O3228l4485J55122
$$ 1026554 1234566 1282379 1167343 1041747 1090860 964587 756639 819867 785382 940504
12427I40504n1467K33403K81026l5688p6602N1589J3327K2786M9398j57807k44903
$$ 940504 889037 1122440 1403466 1367778 1291176 1342765 1356092 1378878 1428276 1270469 1025566
12416A025566l82832j49764R5425n5965K71378K40563K97248J81198j09590P964
$$ 1025566 642734 492970 588395 532430 803808 1044371 1341619 1522817 1413227 1421191
12406A421191l8242P6653P2861j03364k81898O2012J36836j26049o5241K88431
$$ 1421191 1382949 1459602 1532463 1429099 1147201 1209213 1346049 1220000 1154759 1443190
12396A443190P4024Q7218K7321l56822K0113j1556j6326j53124j77273j98861
$$ 1443190 1517214 1604432 1631753 1274931 1295044 1283488 1267162 1114038 936765 737904
12386G37904K60733R8296K51744j53765q6534M58918M4291k88113m82372k38838
$$ 737904 998637 1096933 1348677 1194912 1108378 1567296 1611587 1323474 841102 602264
12376F02264P7838L06535K91517R4311R5244l7257j88546K5363M2606Q0408J08720
$$ 602264 680102 986637 1278154 1372465 1467709 1430452 1241906 1267269 1309875 1390283 1499003
12365A499003j20381j9745K16381o674R9613P9817L5875k87694j65993j05704
$$ 1499003 1378622 1358877 1575258 1568584 1668197 1748014 1783889 1496195 1330202 1224498
12355A224498N5413J44380j94483L5125K08586J77013K8663n9814J6380n2734
$$ 1224498 1279911 1424291 1229808 1264933 1473519 1650532 1679195 1619381 1635761 1583027
12345A583027j91950J58189j82207j48805J72242J07188j10908J59466j25224
$$ 1583027 1391077 1549266 1367059 1218254 1390496 1497684 1386776 1546242 1421018
$$ [...]
##END NTUPLES=NMR SPECTRUM
##END=
