##TITLE=Analysis number 318857
Compound Code cc 46204
Book Reference 440/176
Project Code adrs
Chemist Name craigr
##JCAMPDX= 6.0         $$ Bruker NMR JCAMP-DX V2.0
##DATA TYPE= NMR SPECTRUM
##DATA CLASS= NTUPLES
##ORIGIN= Bruker BioSpin GmbH
##OWNER= nmr
$$ XWIN-NMR		Version 3.5
$$ Thu Apr 20 12:25:20 2006 GMT Daylight Time (UT+1h)  MAYBRIDGE\nmr@NMR_250MHZ
##.OBSERVE FREQUENCY= 250.131544655141
##.OBSERVE NUCLEUS= ^1H
##.ACQUISITION MODE= SIMULTANEOUS (DQD)
##.ACQUISITION SCHEME= undefined
##.AVERAGES= 16
##.DIGITISER RES= 18
##SPECTROMETER/DATA SYSTEM= dpx250
##.PULSE SEQUENCE= zg30
##.SOLVENT NAME= CDCl3
##.SHIFT REFERENCE= (INTERNAL, CDCl3, 0, 16.522)
##AUDIT TRAIL= $$ (NUMBER, WHEN, WHO, WHERE, WHAT)
$$ ##TITLE= Audit trail, XWIN-NMR		Version 3.5
$$ ##JCAMPDX= 5.01
$$ ##ORIGIN= Bruker BioSpin GmbH
$$ ##OWNER= nmr
$$ C:\u/data/dgb/nmr/ADRS/2810/pdata/1/auditp.txt
$$ ##AUDIT TRAIL=  $$ (NUMBER, WHEN, WHO, WHERE, WHAT)
(   1,<2006-04-20 12:24:57.08 +100>,<MAYBRIDGE\nmr>,<NMR_250MHZ>,
      <created by zg, POWCHK disabled, PULCHK disabled
       configuration hash MD5:
       84 BC 41 DB A1 6E 1D 46 DA 25 12 A5 C1 ED C5 3A
       data hash MD5: 64K
       C8 40 E9 D7 DC 52 36 7E A2 30 40 1D CF E3 7D FE>)
(   2,<2006-04-20 12:25:10.71 +100>,<MAYBRIDGE\nmr>,<NMR_250MHZ>,
      <Start of raw data processing
       ef LB = 0.3 FT_mod = 6 PKNL = 1 SI = 32K 
       data hash MD5: 32K
       ED 00 F5 D8 D9 0B D3 1C 35 8D 27 8A B6 68 58 31>)
(   3,<2006-04-20 12:25:12.48 +100>,<MAYBRIDGE\nmr>,<NMR_250MHZ>,
      <apk 
       data hash MD5: 32K
       15 F1 E1 C8 71 2A 12 6D 0E 82 18 99 B0 0A FB 7B>)
(   4,<2006-04-20 12:25:13.26 +100>,<MAYBRIDGE\nmr>,<NMR_250MHZ>,
      <abs ABSG = 5 
       data hash MD5: 32K
       1A 74 F5 55 11 B5 04 75 2D AE 76 EA D5 96 14 95>)
$$ ##END=
$$ 
$$ hash MD5
$$ CF F3 FA 29 64 0E 5B 81 F9 8C 0E 21 E1 4B 80 51
##$RELAX= 
##$RELAX= 
##$RELAX= 
##$RELAX= 
##$RELAX= 
##$RELAX= 
##$RELAX= 
$$ Bruker specific parameters
$$ --------------------------
##$DU= <C:\u>
##$EXPNO= 2810
##$NAME= <ADRS>
##$PROCNO= 1
##$TYPE= <nmr>
##$USER= <dgb>
##$AMP= (0..31)
100 100 100 100 100 100 100 100 100 100 100 100 100 100 100 100 100 100 
100 100 100 100 100 100 100 100 100 100 100 100 100 100 
##$AQSEQ= 0
##$AQ_mod= 3
##$AUNM= <au_zg>
##$AUTOPOS= <24 >
##$BF1= 250.13
##$BF2= 250.13
##$BF3= 250.13
##$BF4= 250.13
##$BF5= 500.13
##$BF6= 500.13
##$BF7= 500.13
##$BF8= 500.13
##$BYTORDA= 1
##$CFDGTYP= 0
##$CFRGTYP= 5
##$CHEMSTR= <none>
##$CNST= (0..31)
1 1 145 1 1 1 1 1 1 1 1 1 1 1 1 1 1 1 1 1 1 1 1 1 1 1 1 1 1 1 1 1 
##$CPDPRG= <>
##$CPDPRG1= <>
##$CPDPRG2= <>
##$CPDPRG3= <>
##$CPDPRG4= <mlev>
##$CPDPRG5= <mlev>
##$CPDPRG6= <mlev>
##$CPDPRG7= <mlev>
##$CPDPRG8= <mlev>
##$CPDPRGB= <>
##$CPDPRGT= <>
##$D= (0..31)
0 1 0 0 0 0 0 0 0 0.06 0 0 0 0 0 0 0.0002 0 0 0 0 0 0 0 0 0 0 0 0 0 0 
0 
##$DATE= 1145532295
##$DBL= (0..7)
120 120 120 120 120 120 120 120 
##$DBP= (0..7)
150 150 150 150 150 150 150 150 
##$DBP07= 0
##$DBPNAM0= <>
##$DBPNAM1= <>
$$ [...]
##$SUBNAM7= <"">
##$SUBNAM8= <"">
##$SUBNAM9= <"">
##$SW= 20.6930455092707
##$SWIBOX= (0..15)
0 0 3 0 0 0 0 0 0 0 0 0 0 0 0 0 
##$SW_h= 5175.983436853
##$TD= 65536
##$TD0= 1
##$TE= 295.16
##$TE2= 300
##$TE3= 300
##$TEG= 300
##$TL= (0..7)
0 120 120 120 120 120 120 120 
##$TP= (0..7)
150 150 150 150 150 150 150 150 
##$TP07= 0
##$TPNAME0= <>
##$TPNAME1= <>
##$TPNAME2= <>
##$TPNAME3= <>
##$TPNAME4= <>
##$TPNAME5= <>
##$TPNAME6= <>
##$TPNAME7= <>
##$TPOAL= (0..7)
0.5 0.5 0.5 0.5 0.5 0.5 0.5 0.5 
##$TPOFFS= (0..7)
0 0 0 0 0 0 0 0 
##$TUNHIN= 0
##$TUNHOUT= 0
##$TUNXOUT= 0
##$USERA1= <user>
##$USERA2= <user>
##$USERA3= <user>
##$USERA4= <user>
##$USERA5= <user>
##$V9= 5
##$VALIST= <valist>
##$VCLIST= <CCCCCCCCCCCCCCC>
##$VD= 0
##$VDLIST= <DDDDDDDDDDDDDDD>
##$VPLIST= <PPPPPPPPPPPPPPP>
##$VTLIST= <TTTTTTTTTTTTTTT>
##$WBST= 1024
##$WBSW= 4
##$XGAIN= (0..3)
0 0 0 0 
##$XL= 0
##$YL= 0
##$YMAX_a= 481913
##$YMIN_a= -645214
##$ZGOPTNS= <>
##$ZL1= 120
##$ZL2= 120
##$ZL3= 120
##$ZL4= 120
##$ABSF1= 16.522
##$ABSF2= -4.171173
##$ABSG= 5
##$ABSL= 3
##$ALPHA= 0
##$AQORDER= 0
##$ASSFAC= 0
##$ASSFACI= 0
##$ASSFACX= 0
##$ASSWID= 0
##$AUNMP= <proc_1d>
##$AZFE= 0.1
##$AZFW= 0.1
##$BCFW= 0
##$BC_mod= 0
##$BYTORDP= 0
##$COROFFS= 0
##$CY= 12.5
##$DATMOD= 1
##$DC= 0
##$DFILT= <>
##$DTYPP= 0
##$F1P= 14.0000005364418
##$F2P= -0.99999901652339
##$FCOR= 0.5
##$FTSIZE= 32768
##$FT_mod= 6
##$GAMMA= 0
##$GB= 0
##$INTBC= 1
##$INTSCL= 1
##$ISEN= 128
##$LB= 0.3
##$LEV0= 0
##$LPBIN= 0
##$MAXI= 10000
##$MC2= 0
##$MEAN= 0
##$ME_mod= 0
##$MI= 0
##$NCOEF= 0
##$NC_proc= -4
##$NLEV= 6
##$NOISF1= 0
##$NOISF2= 0
##$NSP= 0
##$NTH_PI= 0
##$NZP= 0
##$OFFSET= 16.522
##$PC= 1
##$PHC0= 166.6201
##$PHC1= 2.731918
##$PH_mod= 1
##$PKNL= yes
##$PPARMOD= 0
##$PSCAL= 4
##$PSIGN= 0
##$REVERSE= no
##$SF= 250.13
##$SI= 32768
##$SIGF1= 0
##$SIGF2= 0
##$SINO= 400
##$SIOLD= 32768
##$SREGLST= <1H.CDCl3>
##$SSB= 0
##$STSI= 32768
##$STSR= 0
##$SW_p= 5175.98343685301
##$SYMM= 0
##$S_DEV= 0
##$TDeff= 65536
##$TDoff= 0
##$TI= <Analysis number 999999
Compound Code 99
Book Reference 9
Project Code 9>
##$TILT= no
##$TM1= 0
##$TM2= 0
##$TOPLEV= 0
##$USERP1= <user>
##$USERP2= <user>
##$USERP3= <user>
##$USERP4= <user>
##$USERP5= <user>
##$WDW= 1
##$XDIM= 32768
##$YMAX_p= 345067368
##$YMIN_p= -127267
$$ End of Bruker specific parameters
$$ ---------------------------------
##NTUPLES= NMR SPECTRUM
##VAR_NAME=  FREQUENCY,     SPECTRUM/REAL,   SPECTRUM/IMAG
##SYMBOL=    X,             R,               I
##VAR_TYPE=  INDEPENDENT,   DEPENDENT,       DEPENDENT
##VAR_FORM=  AFFN,          ASDF,            ASDF
##VAR_DIM=   32768,         32768,           32768
##UNITS=     HZ,            ARBITRARY UNITS, ARBITRARY UNITS
##FACTOR=    0.157963299565203, 1,           1
##FIRST=     4132.6476996994, 0,             0
##LAST=      -1043.33573715361, 0,           0
##MIN=       -1043.33573715361, -127267,     0
##MAX=       4132.6476996994, 345067368,     0
$$ Real data points
##PAGE= N=1
##DATA TABLE= (X++(R..R)), XYDATA
$$ [...]
24318b3679K6771R940K051K082l4204k7714k6058Q39L1933J9799L61k601o011
24305b6491l8160k4893K8331L1128L4800k0725k6395j5353R382J4105K6252k81
24293h300j2961K3117l937j9828n579P577J3898K2213j0013n757L536N917j6003
24280f120m325p329k795j2664k5384k71L3932J0631j2554o715J0112O481J2446
24267d555J6984L531J5521j8010j7694q901j6872k796J1253l932J1985j9536o888
24254c9910K2382J1558p224j8196L3763L3794j5466j7290K679j6173l760Q038
24242e805J6785j8245l177j135k6186o208L0867J8053m029j6799r040o863j3980
24229d5762L974J0760K3851J313J0958j5230K041L485k2829J4307j3559j8284
$$ plain form
24318 -23679 3092 13032 15083 17165 -17039 -44753 -70811 -69972 -38039 -18240 -17879 -20480 -26491
24305 -26491 -64651 -89544 -61213 -30085 4715 -16010 -42405 -57758 -48376 -34271 -8019 -8300
24293 -8300 -21261 1856 -2081 -21909 -27488 -19911 -6013 16200 6187 430 3966 9883 -6120
24280 -6120 -10445 -17774 -20569 -33233 -58617 -58888 -24956 -14325 -26879 -33594 -23482 -17001 -4555
24267 -4555 12429 15960 31481 13471 -4223 -13124 -29996 -32792 -21539 -25471 -13486 -33022 -39910
24254 -39910 -17528 -5970 -13194 -31390 2373 36167 20701 3411 6090 -10083 -13843 -5805
24242 -5805 10980 -7265 -10442 -11577 -37763 -43971 -13104 4949 920 -15879 -24919 -31782 -45762
24229 -45762 -41788 -31028 -7177 -5864 5094 -10136 -8095 -4610 -27439 -13132 -26691 -44975
24217d4975J1577R840J0308k0854Q573L4190J7058P861k3926k1644L10q113j7924
24204c7719k8308q924j119P808L6285J1118j6977J1205K4425K9347R688k4064
24192A2765k1012j5112k0039p990J542M541k7360j5081L1445K1249m909K317K6073
24179a1571L1616K703j4589q598j0763Q138j7125l2459J0972J7504J7492k2130
24167b8810J143K3610K4874L0485l096k4086l4800r539l597k4236L224P516K9869
24154g443j2275Q266P543k1621j9583j0148q721K1560J0736o116K0870J7273k9978
24141b9637M381K6727J9380k5886O848J5167K2196k1278k3039l4981R729j0225
24129d0618M130n512l2126j3852K3470J7816J0527J6817j5277j9114O209o338
$$ plain form
24217 -44975 -33398 -23558 -13250 -34104 -25531 8659 25717 33578 9652 -11992 -11682 -19795 -37719
24204 -37719 -66027 -74951 -76070 -68262 -31977 -20859 -37836 -26631 -2206 27141 36829 12765
24192 12765 -8247 -23359 -43398 -51388 -49846 -45305 -72665 -87746 -56301 -35052 -39961 -37644 -11571
24179 -11571 20045 22748 8159 -439 -11202 -3064 -20189 -52648 -41676 -24172 -6680 -28810
24167 -28810 -27667 -4057 20817 51302 48206 24120 -10680 -20219 -23816 -48052 -44828 -37312 -7443
24154 -7443 -19718 -11452 -3909 -25530 -45113 -55261 -63982 -42422 -31686 -37802 -16932 341 -29637
24141 -29637 -25256 1471 20851 -5035 1813 16980 39176 17898 -5141 -40122 -30393 -40618
24129 -40618 -36488 -42000 -74126 -87978 -64508 -46692 -36165 -19348 -34625 -53739 -47530 -53868
24117e3868J7831K2698J8090l2572q553K5871J8795Q558k3931R142r415k6002
24105c3356J0211M899j9157k9121j3595J0500K6954N154J4816L2278R998j2480
24093G101k3612k499J8933j7286K209J8161j1783J16l101j4890k6437J1282K0695
24080b1111L0871m054j3277N182K773k005m864j598J714j5425K893P380j6312
24067b7833j0837M5J6340J0378J7868r478k9477K4025M3595l6627l6942J4830
24055b4113J7394J6413j9534j3360n293j1164l720j8158L70j935J9103P100K3464
24042a3433K0957J3632j5368j8492m602p965L399j9310p91M439J5121r8j1906
24029c4417l636L553j0421k5349J383J6892J0092K7211J9424m1096j5556K8688
$$ plain form
24117 -53868 -36037 -13339 4751 -27821 -36374 -10503 8292 16850 -7081 2061 -7354 -33356
24105 -33356 -23145 -18246 -37403 -66524 -80119 -69619 -42665 -37511 -22695 9583 19581 7101
24093 7101 -16511 -19010 -77 -17363 -15154 3007 -8776 -8660 -11761 -26651 -53088 -41806 -21111
24080 -21111 9760 5706 -7571 -2389 384 -1621 -6485 -8083 -6369 -21794 -18901 -11521 -27833
24067 -27833 -38670 -38625 -22285 -11907 5961 -3517 -32994 -8969 34626 -2001 -38943 -24113
24055 -24113 -6719 9694 -9840 -23200 -28493 -39657 -43377 -61535 -61165 -63100 -43997 -36897 -13433
24042 -13433 7524 21156 5788 -12704 -17306 -25271 -21872 -41182 -41973 -37534 -22413 -22511 -34417
24029 -34417 -38053 -34500 -44921 -70270 -68887 -51995 -41903 -14692 4732 -36364 -51920 -23232
24017b3232n211j3754m042L9875J1956q539O020J0019J684j7353j6476k8391J7116
24004c0328J6786j2787j4633j0903K2361K1710j1721j7148j4027N824L0442J9918
23992E494j2113m389k0299j4802M183j544J590j720k2726J0505L0100Q933J0302
23979f486l3979k9566J7153J3707O209K1727Q399o27k3128n942j3127n560K0719
23966c0501j6018J3849K469K419J7376J6590J9281P613k2048l9329r835J1629
23954b6505R121L407j52q014k1267n556K0567n472j0754J5351j1765K2248R890
23941h901k884k5336n45o441o830q458m507J9057K0178O86n29j2417r681J5344
23927c1264J9287l3913j6193L551K2325Q678j9436j944K2103K4849J4076J6063
$$ plain form
24017 -23232 -28443 -42197 -46239 -6364 5592 -2947 3073 13092 14776 -2577 -19053 -47444 -30328
24004 -30328 -13542 -26329 -40962 -51865 -29504 -7794 -19515 -36663 -50690 -44866 -14424 5494
23992 5494 -6619 -11008 -31307 -46109 -41926 -43470 -41880 -43600 -66326 -55821 -25721 -16788 -6486
23979 -6486 -40465 -70031 -52878 -39171 -32962 -11235 -2836 -3463 -26591 -32533 -45660 -51220 -30501
23966 -30501 -46519 -32670 -30201 -27782 -10406 6184 25465 33078 11030 -28299 -38134 -26505
23954 -26505 -17384 -13977 -14129 -22143 -43410 -48966 -28399 -33871 -44625 -29274 -41039 -18791 -8901
23941 -8901 -11785 -37121 -37666 -44107 -50937 -59395 -63902 -44845 -24667 -23981 -24510 -36927 -46608 -31264
23927 -31264 -11977 -45890 -62083 -58532 -36207 -27529 -46965 -48909 -26806 -1957 12119 28182
23915B8182k6300k3144j7431n14J0771J2433K5796J1301k1452m002J4976R666
23903B0282k810Q42j6558m753J2657L248l0003N077M2072M0214n491k8720k6179
23890I878k4572J945K225K625J2849k0348j5744q438n203J1198L4512N086J1524
23877A7537L344j3428K0506j7634j7219j8249l322j387n237J5455m394Q324k1090
23864c6794j5758J322L993J3260K8895j1073p736o477L626K1352J4286j4874j9704
23851b5682q807K3710j151K0134K0726l0421l3263K0304K7720J5624L57R8J959
23838C1308l795j4750r55j7448k1660K3177O115j1056O398k454j5185K89J7252
23825b764n21M627k3569o134J6478R103O297o253j2071L103k4129L364r231J2308
$$ plain form
23915 28182 1882 -21262 -38693 -39207 -28436 -16003 9793 21094 -358 -4360 10616 20282
23903 20282 17472 18314 1756 -2997 9660 12908 -17095 -12018 30054 70268 64777 36057 9878
23890 9878 -14694 -12749 -10524 -7899 4950 -15398 -31142 -39580 -44783 -33585 927 6013 17537
23877 17537 20881 7453 27959 10325 -6894 -25143 -28465 -29852 -35089 -19634 -24028 -15704 -36794
23864 -36794 -52552 -51230 -47237 -33977 -5082 -16155 -23891 -30368 -26742 -5390 8896 -5978 -25682
23851 -25682 -34489 -10779 -11930 8204 28930 -1491 -34754 -14450 13270 28894 29251 29349 31308
23838 31308 27513 12763 11808 -5640 -27300 -4123 1992 -9064 -2666 -5120 -20305 -20016 -2764
23825 -2764 -3285 1342 -22227 -28361 -11883 -2780 3517 -2736 -14807 -11704 -35833 -32469 -41700 -29392
23811b9392K3332Q703K4997l437k9047j9115K203L0766m268j0402j0032n728j5136
23798c6556J3830k517j8759K08L20k5Q071R375R672R268J6620l5240r348R167
23784b5914L821m029J7891J0789K831J791j900J3690J0847p705k3270j9255k851
23771b3264J7063J2247J2527n119j4228O940J0440n772n472k854j0704r920p039
23758b5155K408J0076j2928L257n89l2973m697Q313M0550K8087R561r475k2341
23745e906n155J359o901n768P486k3379J9309L2891M686j9924J0044r407j1679
23732a2344n383j233K2384J8367n176n130K3245K6738k9240l0037K2163j373l2776
23719i795J7831J0455K7820L1136j7776l3575l5378k0192j1573p179q216K8857
$$ plain form
23811 -29392 -6060 2643 27640 24203 -4844 -23959 -21756 9010 4742 -5660 -15692 -21420 -36556
23798 -36556 -22726 -25243 -44002 -43794 -43474 -43499 -35428 -26053 -16381 -7113 9507 -25733 -35081 -25914
23784 -25914 -22093 -26122 -8231 2558 5389 7180 5280 18970 29817 22112 -1158 -20413 -23264
23771 -23264 -6201 6046 18573 13454 -774 6166 16606 10834 5362 2508 -8196 -18116 -25155
23758 -25155 -22747 -12671 -25599 -22342 -22931 -55904 -60601 -52288 -11738 16349 25910 16435 -5906
23745 -5906 -11061 -9702 -16603 -22371 -14885 -38264 -18955 13936 18622 -1302 8742 -665 -12344
23732 -12344 -17727 -18960 3424 21791 16615 11485 34730 61468 32228 2191 24354 22981 -9795
23719 -9795 8036 18491 46311 77447 59671 26096 -9282 -29474 -41047 -48226 -56442 -27585
23707b7585K9365o638o789N044r284l021K172J2723R087Q147q889j544j3926j3762
23693b4900J0714j9747J8547N3074K4186j4739K236l4107l2814l5889K1935K7132
23681d372k977N586j7463K1411J7390k205o505o868R617j8797J0633J7160k2961
23668c51j4587J962k7785O01L8072j093j71K2572j3325n436j1765k722o025J0508
23654i545J0114R988J0889R76J6241P52N636J9408L919j546k3084j4431K3223
23641E2540p06l6761k7760J8634J5179n341N949N573P338j5511j5549J8158l078
23628A8665j4889R870K693j3629n224O434l569N331L5424p884L065K8506K2875
23615H7668M330O277L5152N4152J01108J87225K87675L61443L33103K79459R3464
$$ plain form
23707 -27585 1780 -4858 -11647 -6603 -15887 -18908 -16736 -4013 5074 13221 4332 2788 -11138 -24900
23693 -24900 -14186 -33933 -15386 37688 61874 47135 49371 15264 -17550 -53439 -31504 -4372
23681 -4372 -7349 -1763 -19226 2185 19575 17370 10865 3997 13614 -5183 5450 22610 -351
23668 -351 -14938 -12976 -40761 -40160 -2088 -3181 -3352 19220 5895 459 -11306 -14028 -20053 -9545
23654 -9545 569 10557 21446 22422 38663 39415 45051 64459 68378 66832 43748 29317 52540
23641 52540 51834 15073 -12687 5947 21126 15785 21734 27307 34645 19134 3585 21743 18665
23628 18665 3776 13646 16339 2710 -2514 3920 351 5682 41106 33222 36287 64793 87668
23615 87668 91998 98275 133427 187579 288687 475912 763587 1125030 1458133 1737592 1831056
23604A831056m2486m5391M1863O7401o2290l10817m27036l25566j67708p2496
23594D86530n4130p8807m5707j6151l8684J715k3255k6149o446J3937n09j8913
23582A93431K2159J948k3458m012J8536k4410l5945j0023j9226k3194q185O587
23570I4208O777P569Q662j2118l447L648j0922O440J6378M861k6752K045L617
23557A00966k1997k6083J2570m963M58O732L1876Q896r060l1286l2626j6211N043
23544B4315R707J397k4761M244J9573L945j456P865n42j9681P035J7968K1836
23531G1445j0809k3437k0938J441K1858M16J3348K1641L473j0101k9793k2549
23519A5995K8023J4035l047k9841k2618K0368O836J6296K8752K6164M2277J3044
$$ plain form
23604 1831056 1788570 1743179 1785042 1852443 1790153 1479336 1052300 726734 559026 486530
23594 486530 432400 353593 307886 291735 253051 254766 231511 205362 198916 212853 212344 193431
23582 193431 215590 217538 194080 190068 208604 184194 148249 138226 119000 95806 87621 94208
23570 94208 100985 108554 117216 105098 101651 105299 94377 100817 117195 122056 95304 97349 100966
23557 100966 78969 52886 65456 60493 60951 67683 99559 108455 99395 68109 35483 19272 24315
23544 24315 34022 35419 10658 14902 34475 38420 36964 44829 44287 24606 31641 49609 71445
23531 71445 60636 37199 16261 17702 39560 39976 53324 74965 78438 68337 38544 15995
23519 15995 44018 58053 55006 25165 2547 22915 29751 46047 74799 100963 143240 156284
23507A56284j9767k4978j5788j0515J0888q42j3600l8121m4383k3989L579q957
23495c0189q061O83m051P537L5485O575Q541J3851r596j9348k1372P006P876K0712
23481A5649J239k628J471o271q142j9816J7992K3884J1668j0365q06n608K6423
23468D4690M989j8665j0701J9243K595j5612k7016j4610N843K9965N414k5919
23456B16k0189P15M0033K4475l3824j4141N877O130o950k7331O172K4932M144
23443A0259j523p55j493j5915R10K9182J979j8937k0816j7440r905m016L9056
23430i414J1264j5035j692N078J0838K256j4887R380J7069K746p437L108K403
23417A5677k6184j1555J1233j2969p414M5374J7084m393K2392K983j7502j2840
$$ plain form
23507 156284 136517 111539 95751 85236 96124 95282 81682 43561 -822 -24811 -21232 -30189
23495 -30189 -38250 -37567 -41618 -34081 1404 7979 16520 30371 20775 1427 -19945 -12939 -5063 15649
23481 15649 16888 14260 15731 9460 1318 -18498 -506 23378 35046 24681 23875 18267 44690
23468 44690 49679 31014 20313 39556 42151 26539 -477 -15087 -9244 20721 26135 216
23456 216 -19973 -19258 20775 45250 11426 -2715 3162 9292 2342 -24989 -18817 6115 10259
23443 10259 8736 7981 6488 -9427 -8517 20665 22644 3707 -17109 -34549 -44454 -48470 -9414
23430 -9414 1850 -13185 -14877 -9799 1039 3295 -11592 -2212 14857 17603 10166 13274 15677
23417 15677 -10507 -22062 -10829 -23798 -31212 14162 31246 26853 49245 52228 34726 21886
23405B1886R180j4673l0100k5540K223O741K6131J0220l9537P978L0762m375k2286
23392b1390p914J9709J577j9906j4057j799K2398K2834j3357K1446K2140N889
23380C7570r497j2580l2177j1952q019J0227K8264L8333o52Q530k1685l3284p964
23367a4886N2153j2941o500J0342N939L242j2835l2937O815R190P78l918L45k9729
23353b4942j7258N057p942K458J1337J0325J876j2251J3258M375J6157k722P447
23340G175K3846Q868j7325k2868M2J972q492L235Q148j9039m28J4351O569l736
23326B318j9789j4433j492J4988L5886L280o553j0847N381k716J7413K7551j788
23313D9199J0114M628l4075J7821J8400J4348j3954j6260Q297l3563l1742j4831
$$ plain form
23405 21886 31066 16393 -13707 -39247 -37024 -30283 -4152 6068 -33469 -25491 5271 896 -21390
23392 -21390 -29304 -9595 -8018 -27924 -41981 -43780 -21382 1452 -11905 9541 31681 37570
23380 37570 28073 15493 -16684 -28636 -36655 -26428 1836 40169 39517 48047 26362 -6922 -14886
23367 -14886 37267 24326 17826 28168 34107 37349 24514 -8423 -1608 7582 8360 4442 4787 -24942
23353 -24942 -42200 -37143 -45085 -42627 -31290 -20965 -19089 -31340 -18082 -13707 2450 -272 7175
23340 7175 31021 39889 22564 -304 -262 1710 -6782 -3547 4601 -14438 -14866 -515 6054 2318
23326 2318 -17471 -31904 -33396 -18408 17478 20758 14205 3358 8739 6023 23436 50987 49199
23313 49199 59313 63941 29866 47687 66087 80435 66481 50221 58518 24955 -6787 -21618
23301b1618K3345L3962O433n751K225K4480L1691K9693K9830L1375k379K2198
23289B05484L6370J573j6138l5136j5437O253o2066m5089j2628K3309K8030j8801
23277I5724j3675j6898j5695j0283N732k5556k0478r286k8430l375R781L3485
23265A046J3529j7928J1201K9162p863j0419l99P479N94K417p673n369k2412r173
23251a5808K4259j1285j5507j5753J9361K5569J9321L9915k0029k9477J7874K2584
23239F1024n70j2534k7218m552J2909L6855Q10K9617K723K3020m84J5571l415
23226A33756j3269L271J1076K2557k7492l6814l6704k288p481j9035K2196L3869
23214H3642J937j4415l4789m6243k494R387R186j1915j8244l408k068n867j722
$$ plain form
23301 -21618 1727 35689 42122 36371 38596 63076 94767 124460 154290 185665 183286 205484
23289 205484 241854 243427 227289 192153 176716 182969 120903 75814 63186 86495 114525 95724
23277 95724 82049 65151 49456 39173 44905 19349 -1129 -10415 -38845 -42220 -32439 1046
23265 1046 14575 -3353 7848 37010 29147 18728 18329 25808 26402 28819 21146 15777 -6635 -15808
23251 -15808 8451 -2834 -18341 -34094 -14733 10836 30157 70072 50043 20566 38440 61024
23239 61024 60454 47920 20702 16150 29059 65914 66724 96341 99064 122084 121600 137171 133756
23226 133756 120487 123758 134834 157391 129899 93085 56381 54093 46612 27577 49773 83642
23214 83642 85579 71164 36375 -9868 -12362 -2975 6211 -5704 -23948 -27356 -29424 -35291 -37013
23201c7013k6198J0070N0039J8440J1868R306j6070L0181L216m0231l4530j8617
23189c9539K1282J0486j1566M289k1145j765L708J114P08K1616J7658j281j1544
23176e979N803P992L083J9899N1154Q9715J52284K07491K61413K96788K67402
23165A357045K11835J46834P5503J4099J9552J0631k9127j34179k30637k08623
23155A232933j14287l7215o1573p7928m0537l4933j7114N532m269l2540k0523
23144G97546k4780j2674j9014J840m247j7261J0149K1355j4344m3233j8152L227
23132F80412L7828J0747K252K2053M088K3515J855q454j408l9373n3740o312L6001
23119G09464M0579J24840J75888L03985L56498L34162K75439Q1475o3930n1392
$$ plain form
23201 -37013 -63211 -53141 -3102 15338 27206 36512 20442 50623 53839 13608 -20922 -39539
23189 -39539 -18257 -7771 -19337 -15048 -36193 -37958 -34250 -33136 -32428 -10812 6846 5565 -5979
23176 -5979 -176 7816 10899 30798 81952 171667 323951 531442 792855 1089643 1357045
23165 1357045 1568880 1715714 1791217 1805316 1824868 1835499 1806372 1672193 1441556 1232933
23155 1232933 1118646 1081431 1019858 941930 901393 866460 849346 854878 850609 818069 797546
23144 797546 772766 760092 741078 742918 738671 721410 731559 752914 738570 695337 677185 680412
23132 680412 718240 728987 731239 753292 757380 780895 782750 774296 772888 733515 679775 673463 709464
23119 709464 750043 874883 1050771 1354756 1711254 2045416 2320855 2402330 2338400 2287008
23109B287008O4943J00513p9095l49324m26630k59291j49671p4353l9141k0373
23099A054586j8959M603p378l7473k3287k3514k0729k4114k5466m7460l8699J4276
23087H06386K4414p542K6641l71J7150N1458N0256N1924M5358P7293Q3429P8220
23075A304616O4246M0171L4122P7531Q4870L7525L5106M8527J21217J47325J28604
23064B123860J66810K32044K94676L26142L03329L47933L57726L80052M91407
23055E023979N96811O89227Q07414J003974J295978J687512K231259L106261M109085
23046B0551500N720601R298861J7322606L4331703N7298722O5930035O0465636
23039B70919664N0534552J3927145j8139436j1625953J1944955J8458395r730709
$$ plain form
23109 2287008 2351951 2452464 2373369 2024045 1597415 1338124 1188453 1114100 1074959 1054586
23099 1054586 1035627 1040230 1032852 995379 972092 948578 927849 903735 878269 830809 792110 806386
23087 806386 830800 823258 849899 849528 866678 918136 968392 1020316 1065674 1142967 1226396 1304616
23075 1304616 1368862 1409033 1443155 1520686 1605556 1643081 1678187 1726714 1847931 1995256 2123860
23064 2123860 2290670 2522714 2817390 3143532 3446861 3794794 4152520 4532572 5023979
23055 5023979 5620790 6310017 7117431 8121405 9417383 11104895 13336154 16442415 20551500
23046 20551500 26272101 35570962 52893568 87225271 144523993 210454028 270919664
23039 270919664 321454216 335381361 317241925 305615972 317560927 336019322 326288613
23032C26288613o3710378q4628539n4863084k8564081j5963739r934651o890507
23025F1733634n244474m419662m022807l559725l017633k505540k152519j986356
23017C4824918j899639j755976j584828j376832j083803p61085m54529r3341O9975
23008B5884860J95386K94159k08622o64967q16437p92028j129382j665927j485106
22999A9611936j049526p65707o21951n59360m44039l77668l56365l41285l00857
22990A4795178k08894k09756k25495k33561k75500k94901l21932l31670l00256
22981A2393213l05380l24843l45601l02706k92858k68216k55768k24461k07197
22972I866183k12559k05800k06588j69596p5449P768J16954J76023J79254J44476
$$ plain form
23032 326288613 262578235 177949696 123086612 94522531 78558792 68624141 61733634
23025 61733634 56489160 52069498 48046691 44486966 41469333 38963793 36811274 34824918
23017 34824918 32925279 31169303 29584475 28207643 27123840 26362755 25908226 25814885 25884860
23008 25884860 26080246 26374405 26165783 25500816 24684379 23892351 22762969 21097042 19611936
22999 19611936 18562410 17796703 17174752 16615392 16171353 15793685 15437320 15096035 14795178
22990 14795178 14586284 14376528 14151033 13917472 13641972 13347071 13025139 12693469 12393213
22981 12393213 12087833 11762990 11417389 11114683 10821825 10553609 10297841 10073380 9866183
22972 9866183 9653624 9447824 9241236 9071640 8996191 9003959 9120913 9296936 9476190 9620666
22962I620666k9129k59393k35592j30912m6897j36444m14812o01881m72671k66494
22952G026441k12707j76317j79516j66688j21668j41037j57377j11917r3872j23709
22942E541633j30724j46043j03047p6316n5139o0327j38077r4364q3458q3921
22932D570217o3022o9322q0758r5721r9959j02499q8680r7066q6492p2780m5807
22921C668111m8751k9892l2209L4539J40093K42111K12272J37980J01295J19112
22911D544661Q7464P3513K4212m1891o1762j40460k18372j93753j48390q9545
22901C835677n6994j5274m2162l8882o0141p7576q4173q5885r0419r0117j08263
22890C085791j11273o1922m1418o5485p0215o8987l2714m3838j20656q9064k9671
$$ plain form
22962 9620666 9591537 9332144 9096552 8965640 8918743 8782299 8367487 7765606 7292935 7026441
22952 7026441 6813734 6637417 6457901 6291213 6169545 6028508 5871131 5759214 5665342 5541633
22942 5541633 5410909 5264866 5161819 5085503 5030364 4970037 4831960 4737596 4654138 4570217
22932 4570217 4507195 4437873 4357115 4261394 4161435 4058936 3970256 3873190 3786698 3713918 3668111
22921 3668111 3619360 3589468 3557259 3591798 3731891 3974002 4186274 4324254 4425549 4544661
22911 4544661 4632125 4705638 4729850 4687959 4626197 4485737 4267365 4073612 3925222 3835677
22901 3835677 3778683 3763409 3721247 3682365 3622224 3544648 3460475 3374590 3284171 3194054 3085791
22890 3085791 2974518 2912596 2871178 2805693 2735478 2666491 2633777 2589939 2469283 2380219 2350548
22879B350548m1819m0274m6593k7170j5462k1464l3316k8988n4017n0811m5052
22868A945582k0723j5230m6317l3539k5538l1273m3089p646l1523k3476k6151
22857A641077m9697m9480l3334j15k0828q5368o2889m690k3486o4527m6778k4933
22845A174952N661Q964k0254j0903J1221J2757j988k9073j8751j2984n390J2165
22833A126377j2316k1915l3944l6800J511m1456j2511j3095q183j9247o985P708
22821I29144j7688l7774k5304J94m173j5350l430o312j5127k298j5725J889J9458
22808H07504j3336k7608k4545k1332K2788j5565j8808Q606J9j9239j1049k6091
22796F61344j4023K466P847n591P02K2725M2251K0168L4201J1557P43J7755o55
$$ plain form
22879 2350548 2308729 2268455 2221862 2194692 2179230 2157766 2124450 2095462 2041445 1990634 1945582
22868 1945582 1924859 1909629 1863312 1829773 1804235 1772962 1729873 1722227 1690704 1667228 1641077
22857 1641077 1591380 1541900 1508566 1508451 1487623 1402255 1339366 1334676 1311190 1246663 1199885 1174952
22845 1174952 1180613 1189577 1169323 1158420 1169641 1182398 1180410 1151337 1132586 1119602 1114212 1126377
22833 1126377 1114061 1092146 1058202 1021402 1022913 981457 968946 955851 947668 928421 921436 929144
22821 929144 911456 873682 848378 848572 844399 829049 825619 819307 804180 801882 786157 788046 807504
22808 807504 794168 766560 742015 720683 743471 727906 709098 717704 717723 698484 687435 661344
22796 661344 647321 649787 657634 652043 652745 675470 717721 737889 772090 783647 784390 802145 801490
22783H01490j6621j7043k3285m8316p6889m3438k0739l7393N22R441m7229l7985
22771D42515P50j4875J1535k5141Q030j0384Q075l472l2750j9220J5545k7093
22759C53515K2608J7649j5721K3685L4273K857q956j6011J4893P080l5218j8105
22747C82549l0954o321K215r933o988q895j2807l0388J298k0318r631J6514R629
22734B75970p648P537J0253k6093p849J1124J3949K633K0631J0937j0694m501
22722B96249J1236j4026k2635r119p259J1483N295k6162k0895p028p571k5744
22710A83824j3934n845M294J0753J1378q586m668j742p168l4505K7726K326K056
22697A65909J6050J9761j8388l7632L866N510J6090k4727k2540J2587J815p605
$$ plain form
22783 801490 784869 767826 744541 696225 619336 575898 555159 517766 518288 527729 480500 442515
22771 442515 443265 428390 439925 414784 422814 412430 420505 417033 384283 365063 380608 353515
22759 353515 376123 393772 378051 401736 436009 438866 429910 413899 428792 435872 400654 382549
22747 382549 351595 345274 347489 337556 330568 321673 308866 278478 279776 259458 249827 266341 275970
22734 275970 268322 275859 286112 260019 252170 263294 277243 279876 300507 311444 300750 296249
22722 296249 307485 293459 270824 261705 254446 265929 271224 245062 224167 217139 209568 183824
22710 183824 169890 164045 168339 179092 190470 181884 177216 175474 168306 133801 161527 163853 165909
22697 165909 181959 201720 183332 145700 149566 155076 171166 146439 123899 136486 138301 130696
22685A30696j2254R166J6196L65k8816o848L3784M169m0521K0850R146j5518k3067
22672I7348N307n408J263j4962j5641J470J8366l088j6570N852O473j4311J1517
22659G7616l040l0278M200J9644L9704J5343l3506o010j889P737k8604J8348K2912
22646A02177k6561j6746l755L829J6536J5740p169j2789J0433p29Q822m531L241
22633H8498j7783l2880P018J6149K2228k43k4434L943K2500K214m19P706j2057
22620H2440p44O560P53m977r480j3664m2806L0458M907p804p719K3528J7766j8229
22606F0989n350L222k3766Q08M887k2821O37q248L7158K236j2840O928J7399J6629
22592G7868j733K323l269j2283k7098k8401L3684K5814M722K4429J7113k1914
$$ plain form
22685 130696 118442 127608 143804 144169 115353 108505 142289 146458 105937 126787 135933 120415 97348
22672 97348 102655 97247 98510 83548 67907 69377 87743 84655 68085 73937 80410 66099 77616
22659 77616 74576 44298 48498 68142 107846 123189 89683 83673 81784 89521 60917 79265 102177
22646 102177 75616 58870 55115 58944 75480 91220 84051 71262 81695 80966 89788 85257 88498
22633 88498 70715 37835 44853 61002 83230 82987 58553 62496 84996 87210 86791 94497 82440
22620 82440 81696 88256 89009 84032 74552 60888 18082 48540 53447 45643 37924 61452 79218 60989
22606 60989 55639 58861 35095 35903 40790 17969 18606 10358 47516 49752 36912 43840 61239 77868
22592 77868 76135 78458 75189 62906 35808 7407 41091 66905 71627 96056 113169 91255
22580I1255k0826L3977L4069K444j3805q130l0104k8661m5166k0660j5943P016
22568a4534o739l0819L37Q55l4144J1282J9659K7828n340P460P485M238M74j4883
22554b6841j6587J9715J7651n904q202l1898l1332P922M8325L3893L0309K3672
22542F0723j8250J1506K1754m1307k9987K954J7976m64L944J2297J1654J6344
22530F9144j5503m7484p435L550j9187O645J9437L2364j4365l0828j6412J3159
22518f915Q519k4059k1850L932L2295J9601l392m10J9479O094o213m433J9218
22505D1866Q530K003J0564J0037k2017k7820M5999K6422j7269r415k4218N740
22493E0422P580j455N057k4650P647j3902j1092p135J6744K9807L2425L4488L739
$$ plain form
22580 91255 70429 104406 138475 140919 127114 118984 88880 60219 15053 -5607 -21550 -14534
22568 -14534 -21273 -52092 -51755 -50900 -85044 -73762 -54103 -26275 -31615 -24155 -16670 -12432 -11958 -26841
22554 -26841 -43428 -23713 -6062 -11966 -20168 -52066 -83398 -75476 -27151 6742 37051 60723
22542 60723 42473 53979 75733 34426 4439 7393 25369 24905 28849 41146 52800 69144
22530 69144 53641 6157 -1278 2272 -16915 -10270 9167 41531 27166 -3662 -20074 -6915
22518 -6915 1604 -22455 -44305 -40373 -8078 11523 8131 7721 27200 33294 27081 22648 41866
22505 41866 50396 52399 62963 73000 50983 23163 69162 95584 78315 68900 44682 50422
22493 50422 58002 56547 61604 36954 44601 30699 19607 12472 29216 59023 91448 125936 129675
22480A29675j5065J8030P107J7940L4155L9032O1582O1094R5084J92510L29489
22469I70633M81824O43731P35586O59024N57923L61963m4462l08616m88240n44017
22459C025349l45083j26228p7609k80154m76284m27690k56212j70525j09867n9471
22449F96226m0815l3296p1288o0785l43j802l9061n5214j4650Q818j3905j630
22437C72255l69j5359M171M036j60l4885n1336j4017k0860J1172J3854k3019j5935
22424B29548J0819r22l9235l7317O585J0143K1231J1906j8541l143J9881q311
22412B02644k7281Q963l169N033K290n684L658q670n734K6199K1433j6284l2610
22399A70788j6005k1389j8686O495J6236O732l483m945o297J0343K0263P898J6173
$$ plain form
22480 129675 114610 132640 139747 157687 191842 230874 292456 353550 448634 641144 970633
22469 970633 1452457 2096188 2831774 3490798 4048721 4410684 4366222 4057606 3569366 3025349
22459 3025349 2680266 2554038 2476429 2196275 1719991 1292301 1036089 865564 755697 696226
22449 696226 655411 622115 550827 490042 489699 487897 448836 393622 378972 387790 373885 372255
22437 372255 371886 356527 360698 364734 364574 329689 278353 264336 243476 254648 268502 245483 229548
22424 229548 240367 239445 200210 162893 169478 179621 200852 212758 194217 191074 210955 202644
22412 202644 175363 184326 181157 186190 188480 182796 186454 177784 172050 198249 219682 203398 170788
22399 170788 154783 133394 114708 121203 137439 144171 140688 135743 129446 139789 160052 167950 184123
22386A84123j0433r448M239K0315Q474M956J7148J4554N673K0458k3810j0303
22374B25946k5588j6360l9878l3087j6048K003k6576J523K9282N375R982m038
22362A12536J0691j209k4673l0575q473J5615k829j4253o430J2998m628q555N491
22349E5706n963J1176j4995q926L815j918J2574K9552K893r135k0141l0335J1534
22336C5837o957j7295L3830J6667O554R267k5229l5648K673J6779K7438K3891
22324H7807P439N740j4364l1460l681n444K1739l613j3273k6106P688K5973j4280
22311D4165O708K0q262r266M04K4865J8714k4629k7547j8314L804J7993N062o445
22297B7272J8835K4309j5408j4926J3257L728m2918p451l25O412Q894j4615r732
$$ plain form
22386 184123 173690 164242 168481 188796 197270 202226 219374 233928 239601 260059 236249 225946
22374 225946 200358 183998 144120 111033 94985 96988 70412 71935 101217 106592 116574 112536
22362 112536 123227 122018 97345 66770 58297 73912 71083 56830 50400 63398 58770 50215 55706
22349 55706 49743 60919 45924 36998 40813 38895 51469 81021 83914 74779 54638 24303 35837
22336 35837 28880 11585 45415 62082 68636 77903 52674 17026 19699 36478 63916 87807
22324 87807 95246 100986 86622 55162 51481 46037 67776 64163 50890 24784 32472 58445 44165
22311 44165 50873 50893 42631 33365 33769 58634 77348 52719 25172 6858 10662 28655 33717 27272
22297 27272 46107 70416 55008 40082 53339 57067 14149 6698 6373 12785 21679 7064 -2668
22284b668N303L4834N250k1963k6616P522J6409K7713k7972q071Q058J095O565
22271B5459J7586j0553r899k5933p070J3781o736j0887N458l447J8403J4983r070
22258A2075J7182K7550J552k9634l7238J2933J1560k0965m3964j5790K1851J7477
22246b5411M905o338K745J6950K4093q177J7562j3476j5743L3463j4298q789J089
22233H575M880N979l046O104j3451n4948Q898K3452j1823r646M567J8024O380
22220f055O935m11J1212j1324J2693K665Q451r053k2136j0278J8331J319M149
22207F498J0470N325j1966j8261K0566m1463m7452M0855M7350M393J958J0426
22195B8699J1738j2800j1451K3028k378J094k0029l3764j2297k963k7538n416
$$ plain form
22284 -2668 2635 37469 42719 20756 -5860 1662 18071 45784 17812 9741 17799 18894 25459
22271 25459 43045 32492 22593 -3340 -10410 3371 -3365 -14252 -8794 -12241 6162 21145 12075
22258 12075 29257 56807 58359 28725 -8513 4420 15980 -4985 -48949 -64739 -42888 -25411
22246 -25411 -20506 -26844 -24099 -7149 16944 8767 26329 12853 -2890 30573 16275 7486 8575
22233 8575 13455 19434 16388 22492 9041 -45907 -37009 -13557 -25380 -35026 -30459 -12435 -6055
22220 -6055 880 469 11681 357 13050 15715 24166 15113 -7023 -17301 1030 2349 6498
22207 6498 16968 22293 10327 -7934 12632 -28831 -76283 -35428 11922 16315 18273 28699
22195 28699 40437 27637 16186 39214 36836 37930 17901 -15863 -28160 -31123 -58661 -64077
22183f4077L5258M0333O817j1947k3738q509Q726J463J6302k3510k3901J5172
22171c1611J8482j6564k9873m643J4748J4210J4949M151k5647p137j6286O228
22159e8993P040Q548j5225r93N0718K0874j0195l667K4710r430k9635J953K558
22146a1737n061o14M157L773l6461k5495K5120L2873K9375L880k361K1953l1853
22133G549m4687M816p515j8614J7824L4054K4567J5860k960k3280k8860J656J7816
22120a774K9048j3022j0392Q756m881n38p207k7442j9889j8855q073J1955J7707
22107d4607K9886J330l2038J5018l118k3928J3563O346K1117M299m559M46J0572
22094e673j3642k0342J7121P591K3764N781j1557p764j9114j3394m668J2225M287
$$ plain form
22183 -64077 -28819 11514 18331 6384 -17354 -25863 -17137 -15674 628 -22882 -46783 -31611
22171 -31611 -13129 -29693 -59566 -64209 -49461 -35251 -20302 -16151 -41798 -48935 -65221 -58993
22159 -58993 -51953 -43405 -58630 -59623 -8905 11969 1774 -1893 22817 13387 -16248 -14295 -11737
22146 -11737 -16798 -17412 -13255 -9482 -45943 -71438 -46318 -13445 15930 19810 17449 39402 7549
22133 7549 -37138 -32322 -39837 -58451 -40627 -6573 17994 33854 30894 7614 -21246 -19590 -1774
22120 -1774 27274 14252 3860 12616 7735 7197 -10 -27452 -47341 -66196 -74269 -62314 -44607
22107 -44607 -14721 -13391 -45429 -30411 -33529 -57457 -43894 -37548 -16431 -12132 -16691 -16245 -5673
22094 -5673 -19315 -39657 -22536 -14945 8819 14600 3043 -4721 -23835 -37229 -41897 -29672 -25385
22081b5385J2237k038J084j0716K3277J8848j0387m7949m426J1234J228J8202
22069a4791K6849j1391M547Q502Q829j8525m3315k2972J5783L0784J8659K92R446
22056A2697J0219K3776O643k6961m5336j9580K4640K8031J1899k49J6506K8962
22044G1247K1564L3389j6498k1090J4175j6755n4777o302l332P440j1108J5560
22032C3513J5424k3139j991J509j5812R352K8985r128r375O482J1273J1022K4556
22019H2671j8565o603l076k3313m632p30k7j5736K1066K1526j2263j4732O686
22006C2272N932k2775j7138k8704K0473N881J5887o608j8539M269K0724L6216
21994D7890o186m736j9016l3172J9540q518j2944j2426j198L1090o21l817J678
$$ plain form
22081 -25385 -13148 -15186 -14102 -24818 -1541 17307 6920 -41029 -45455 -34221 -32993 -14791
22069 -14791 12058 667 5214 13716 22545 4020 -39295 -62267 -46484 -15700 2959 3251 12697
22056 12697 22916 46692 53335 26374 -18962 -38542 -13902 14129 26028 25779 42285 71247
22044 71247 92811 126200 109702 88612 102787 86032 31255 24953 21621 29061 17953 33513
22032 33513 48937 25798 23807 25316 9504 18856 47841 38713 29338 35820 47093 58115 82671
22019 82671 64106 57503 54427 31114 26482 25752 25725 9989 31055 52581 40318 25586 32272
22006 32272 38204 15429 -1709 -30413 -9940 -4059 11828 5220 -13319 -9050 11674 47890
21994 47890 41704 36968 17952 -15220 4320 -4198 -17142 -29568 -30766 324 -297 -4114 -2436
21981b436J0419j8540n883N206M769O205P456j5650l641P860l481l42p331k3381
21967c8770j0718L7916M8831Q507p715J617J5437J6390k2737l6568J870r965j1270
21954g175R086J6231Q128m647j6965o28J4923L1448q004k7611K5434L921M158
21941D8299P789P164j402J8748l999l9699l5737k6613j9690L1570j4092J5558
21929a2104M4622j1799j9337K474o467O955l95N4J173j2008j1988K1275J5822
21916A8277r250m7943l2787R590K2800J8317K0991J2352p56M832k50p966k9442
21903b1235p064j2752p308J385K1535N8417J1416L239p444j0980j7269k8091J4326
21890a825J9868j9101j5329M795K613K6736J7660j3992k5758j6419k0695L102
$$ plain form
21981 -2436 7983 -10557 -16440 -11234 -6465 -260 7196 -8454 -12095 -4235 -7716 -8058 -15389 -38770
21967 -38770 -49488 -11572 37259 45766 38051 39668 55105 71495 48758 12190 14060 4095 -7175
21954 -7175 1911 18142 26270 21623 4658 4030 18953 50401 42397 14786 40220 44141 48299
21941 48299 56088 63252 61850 80598 76599 36900 1163 -25450 -45140 -13570 -27662 -12104
21929 -12104 32518 20719 1382 3856 -2611 4344 3949 4003 5176 -6832 -18820 2455 18277
21916 18277 9027 -38916 -71703 -62113 -39313 -20996 -5 12347 11591 16423 16173 8207 -21235
21903 -21235 -28299 -41051 -48359 -46974 -25439 32978 44394 47633 40189 29209 11940 -16151 -1825
21890 -1825 18043 -1058 -16387 -11592 -8979 17757 35417 21425 -4333 -20752 -41447 -38345
21878c8345j4772k291K0785L6099R397Q012L280k2068j6595O263J5837j9621k977
21865a6996j0398j192L4595J9916q188j3563n0272q619K3704r614r385L2216O022
21852a1774k5986P47K3308J2306J6502J2804q887l035L808k1973j1306Q781r270
21839a3975J8886q376k099k553J9674p245J7718J130k8484M601n792J5880J0810
21826B0175j5808J305j4470j494N397o988j8834Q755J9581l753J6452l711L192
21813I799K3246k6516p216j9225j5075K239R334R551j9410R4J9764J4922k9815
21800b8308J0322m75j768J3209K8953M276n360k1760K84l299N529L684l391j5168
21786a3272p272L0658J588J3633J2108j1029k7477M15J2512m476k9627R064K1199
$$ plain form
21878 -38345 -53117 -55408 -34623 1476 10873 18885 22165 97 -16498 -10235 5602 -14019 -16996
21865 -16996 -27394 -28586 6009 25925 17737 4174 -46098 -54717 -31013 -40627 -50012 -17796 -11774
21852 -11774 -37760 -37013 -13705 -1399 15103 27907 19020 15985 19793 -2180 -13486 -4705 -13975
21839 -13975 4911 -3465 -5564 -8117 11557 4312 22030 23160 -5324 -723 -6515 9365 20175
21826 20175 4367 5672 -8798 -10292 -4895 -11883 -30717 -21962 -2381 -6134 10318 6607 9799
21813 9799 33045 6529 -687 -19912 -34987 -32748 -23414 -13863 -33273 -33179 -13415 1507 -28308
21800 -28308 -17986 -18461 -20229 -7020 21933 26209 20849 -911 -627 -3926 1603 5287 1896 -13272
21786 -13272 -20544 10114 11702 25335 37443 26414 -1063 -648 11864 7388 -22239 -13175 8024
21773H024k7612k926O321p892J477O961J9797j3294Q362L6727L8824O180j7647
21760F3302k1447k2230p24K1835L1542k1529l3753J119j2522K2863J159m4795
21748a5180l2916M622J6062K0279j6332J50K5332P9k922k8367Q096P723j7845
21735c1219q372J6879K8079j5856M231J3167l374k6389L940J3499m62J623Q800
21722D546J1056o251j723K8922k3716p714j256M742p001k0928j6888k2993n090
21709f4294P942J9938J2213p04j4841K1384K298O660J5042k4401n933o487K0101
21696a1082j4586k4282L2570K7856j3251k6089K2374q289o987j7447k0779L2534
21684b7458K6003M300J5301Q153l3610j2535J7168o750P486K462l2132j0204R427
$$ plain form
21773 8024 -19588 -22514 -16193 -24085 -22608 -15647 4150 -9144 -782 35945 74769 80949 63302
21760 63302 41855 19625 18901 40736 72278 50749 16996 18115 5593 28456 29615 -15180
21748 -15180 -48096 -43474 -27412 -7133 -23465 -23315 2017 2096 -826 -29193 -21097 -13374 -31219
21735 -31219 -39591 -22712 5367 -10489 -6258 6909 3535 -22854 -18914 -5415 -5877 -4254 4546
21722 4546 15602 9351 7628 36550 12834 5120 3864 8606 1605 -19323 -36211 -59204 -64294
21709 -64294 -56352 -36414 -24201 -24905 -39746 -18362 -16064 -9404 5638 -18763 -24696 -31183 -11082
21696 -11082 -25668 -49950 -17380 10476 -2775 -28864 -6490 -14779 -21766 -39213 -59992 -27458
21684 -27458 -1455 2845 18146 26299 -7311 -19846 -2678 -9428 -1942 520 -31612 -41816 -32389
21671c2389k672Q269J4548l479m385r492j409k434K423k45p532k5895J426J9456
21657d3810L38J75j53J1367J163K6197O921k8960Q207L1220k1290k7689P662J6013
21643a2639K0006j74Q936J2406k4067k356L760j2424j2902K3036P716m725J575
21630H148R906j6773r373j4085j9673m87n302J580p043N414j4076N168L5486K8847
21616G737J988n280K013k3373j036q111l412L3667n493j7958j216J5284J9628
21603A4438n796k9173j7947J892K7613J3669q113n4833p04M627J0154j709J1780
21590c4102O781k1405L973J2425j3382o84o569r814n994K8826R333r355L016K0266
21576a6685J7118j4401N203R151J8153l38k331k8811o292J2149M642p012o181
$$ plain form
21671 -32389 -35061 -26792 -12244 -15723 -20108 -29600 -31009 -33443 -31020 -31265 -38797 -64692 -63266 -43810
21657 -43810 -43472 -43297 -43450 -32083 -30920 -4723 2198 -26762 -18555 12665 -8625 -36314 -28652 -12639
21643 -12639 7367 7193 16129 28535 4468 2112 5872 -6552 -19454 3582 11298 6573 8148
21630 8148 18054 1281 -8092 -22177 -41850 -42337 -47639 -46059 -53102 -47688 -61764 -56596 -21110 7737
21616 7737 9725 4445 6458 -16915 -17951 -26062 -29474 4193 -1300 -19258 -20474 -5190 14438
21603 14438 8642 -20531 -38478 -36586 -8973 4696 -3417 -58250 -58954 -54327 -44173 -45882 -34102
21590 -34102 -27321 -48726 -44753 -32328 -45710 -46394 -52963 -62777 -68771 -39945 -30612 -39967 -36951 -16685
21576 -16685 433 -13968 -8765 386 18539 18201 15870 -12941 -19233 -7084 -2442 -9454 -15635
21563a5635j4864L868N855r296r796j389o007K0992J2325q71J7074j1164k3956
21550c2864j6752J0022K2061L987l1388j4641J6690N515L4579k147k9081K8778
21538e241j9228j1985K2382m122R064N004P328k773l306m687K6137k5769k8000
21525c5196J2882k0059m6621p542K5828P344K4045P173q595j4107J0622L4694
21513i532K5096j7686m948K2359k0333j0892L0725K8874k881l8026l0549j441
21501b9234J545J9788K4676j6560l3924j4137J0169J4985L0256R935k101j0474
21489D924j0994K41J2732R046J2047j4647k2025r684j795K3700J6437L260k172
21476B1070n499J9116l83j3008l325j716n501m0724k1472J991O480q703J0861
$$ plain form
21563 -15635 -30499 -26631 -20776 -30072 -39868 -41257 -47264 -26272 -13947 -14818 2256 -8908 -32864
21550 -32864 -49616 -39594 -17533 -13546 -44934 -59575 -42885 -37370 -2791 -4938 -34019 -5241
21538 -5241 -24469 -36454 -14072 -18194 -9130 -4126 3202 429 -2877 -7564 18573 -7196 -35196
21525 -35196 -22314 -42373 -88994 -96536 -70708 -63364 -39319 -32146 -40741 -54848 -44226 -9532
21513 -9532 15564 -2122 -7070 15289 -5044 -15936 14789 43663 40782 2756 -27793 -29234
21501 -29234 -27689 -7901 16775 215 -33709 -47846 -37677 -22692 7564 17499 15398 4924
21489 4924 -6070 -5829 6903 15949 27996 13349 -8676 -18360 -20155 3545 19982 23242 21070
21476 21070 15571 34687 34304 21296 17971 16255 10754 -29970 -51442 -49451 -42971 -51674 -40813
21463d0813R1J1837p910J6251J1088R229J5705l989q951J7876q076j7207j2306
21450a7175j7110j3266m641J9346K2549p69j9942M272J6010k1691O49N739Q928
21437a7101j4451l4353J9693J7681k5591l755J5587p35j154j469j661l505n395
21424e6209R406M5104K026l4080j5035k2633J0263N0543K0229j8365J0824K0982
21412B3055p029N909Q373m4963j7077j8421L102L3880P329j2452J5456k2616R396
21399a6058J3721k2838j1869J3459J8458j4620J5483K8609p569o941k9908N154
21387a4919J5237R008k2407k5246k565J4431K9912R79m4164l0476L1006j348n501
21374d6053K2362J9774J2994L0429J6388k4701l1159M879J1958l2879N186j05
$$ plain form
21463 -40813 -40722 -28885 -36795 -20544 -9456 -227 15478 11489 2538 20414 12338 -4869 -17175
21450 -17175 -34285 -47551 -52192 -32846 -10297 -11066 -31008 -26736 -10726 -32417 -31768 -26029 -17101
21437 -17101 -31552 -65905 -46212 -28531 -54122 -57877 -42290 -43025 -44179 -45648 -47309 -50814 -56209
21424 -56209 -46803 -1699 327 -33753 -48788 -71421 -61158 -10615 9614 -8751 2073 23055
21412 23055 16026 21935 30308 -14655 -31732 -50153 -47051 -13171 -5842 -18294 -2838 -25454 -16058
21399 -16058 -2337 -25175 -37044 -23585 -5127 -19747 -4264 24345 16776 9835 -20073 -14919
21387 -14919 318 9326 -13081 -38327 -40892 -26461 3451 4430 -39734 -70210 -39204 -40552 -46053
21374 -46053 -23691 -3917 9077 39506 55894 31193 34 4913 16871 -16008 -10822 -10927
21362a0927l1866j5010q91j0340J3262K8371K6958J6331K3576K7563k0446j5105
21350C1476m1354l4727K1296J6087k9434k2120j1002N211J3527R669j3465k478
21338e7314J4943K1761K6855j3975k0747L3061L23l1544O338K0439J1368L4377
21326D5885M0490k8322K651n0550k5317N674L360j9526j0503J3849j2202r602
21314d4113r187J070J5568J0893J9198j5456n212j6807J3752J6648j4475N545
21302b2576o915k6333Q499J8830n468K779m226m835m601J721k422j9444k9663
21289i4654l2613O667J8244K4447L7799J4398R274n294l8511M884J250J6246M8
21276c7815J6460J7652J6086K5406J2185j4134j8406k6418k7733K7004L571K332
$$ plain form
21362 -10927 -42793 -57803 -58694 -69034 -55772 -27401 -443 15888 39464 67027 46581 31476
21350 31476 -9878 -44605 -23309 -7222 -36656 -58776 -69778 -64567 -51040 -41371 -54836 -57314
21338 -57314 -42371 -20610 6245 -7730 -28477 4584 4907 -26637 -20299 140 11508 45885
21326 45885 86375 58053 60704 10154 -15163 -9489 -6129 -25655 -36158 -22309 -34511 -44113
21314 -44113 -53300 -52230 -36662 -25769 -6571 -22027 -27239 -44046 -30294 -13646 -28121 -22576
21302 -22576 -29491 -55824 -47325 -28495 -33963 -31184 -35410 -40245 -44846 -43125 -45547 -64991 -94654
21289 -94654 -127267 -120600 -102356 -77909 -40110 -25712 -16438 -21732 -60243 -55359 -54109 -37863 -37815
21276 -37815 -21355 -3703 12383 37789 49974 35840 17434 -8984 -36717 -9713 -6142 -3810
21264c810J2434j5031j6719O255N996j512o511m886K950K0867j4835j1427J3074
21251a3155K0905J8465k2838m7058K1338K0261J8529j4175j2806j6837J6674K8356
21239A7659K724j8246k360m877l878n327k0245o627Q381m342J986K3169J3929
21226A946P414j9112j7933l1108N551M4979J2922m4394j0447Q861j198j391P357
21213c6553J1621K305o730J184L0661K2919j3305q346Q248q937L571J1503k4996
21200f855m1868l1856K1791J372k1303R316K3389O486o81J3170K2697q995K1642
21187H305J3973m5495l617K7391r892n125J5222J7590J8925m90j6933l513n664
21174A0677j7931P475q790j0756q123l979J5412M114P995j1633J1157j4710j1332
$$ plain form
21264 -3810 8624 -6407 -23126 -16871 -10875 -12387 -18898 -23784 -20834 33 -14802 -26229 -13155
21251 -13155 7750 26215 3377 -43681 -22343 -2082 16447 2272 -10534 -27371 -10697 17659
21239 17659 20383 2137 -223 -5100 -8978 -14305 -34550 -41177 -32796 -37138 -35152 -11983 1946
21226 1946 9360 -9752 -27685 -58793 -53242 -8263 4659 -39735 -50182 -41321 -42519 -43910 -36553
21213 -36553 -24932 -22627 -29357 -28173 2488 25407 12102 3756 12004 3067 6638 18141 -6855
21200 -6855 -48723 -80579 -58788 -57416 -78719 -69403 -46014 -39528 -40209 -27039 -4342 -13337 8305
21187 8305 22278 -23217 -26834 557 -9335 -14460 762 18352 37277 36787 19854 16341 10677
21174 10677 -7254 221 -8569 -19325 -27448 -31427 -16015 -11901 -3906 -15539 -4382 -19092 -30424
21161c0424J7300O451L0577J4907M418J6354j7514m4175j9976j9095J7265o423
21149c0335j1146p220J2100L2424r943m718j3128j0618O073J6874m457n855K5219
21136d730O744k1925j9943K153J5703l118O086L4817m643k0761k4184K1208L9701
21123B7108m597L31n911k2510k4852j550J1963K399J4157L515j7465Q58R34k0791
21109c6411M382J0954O976l0395k3998p280R260J9635L8328N703j4561K3153J877
21096G623l0864k0931J416K1228J5034p720M755J6926j2490O272O527j5399p624
21083a5247L862K9091j3077K155k0433O234L0748L7578k1296l1370n147k2651
21071a9553l3123J8176J6364J588k347p43l408J8645l719k587J885l2114M157
$$ plain form
21161 -30424 -13124 -6673 23904 38811 43229 59583 42069 -2106 -22082 -41177 -23912 -30335
21149 -30335 -41481 -48701 -36601 -4177 -14120 -18838 -31966 -42584 -36511 -19637 -24094 -29949 -4730
21136 -4730 2014 -19911 -39854 -37701 -21998 -25116 -19030 15787 11144 -9617 -33801 -12593 27108
21123 27108 22511 22842 16931 -5579 -30431 -31981 -20018 -17619 -3462 53 -17412 -16554 -15620 -36411
21109 -36411 -32029 -21075 -14099 -44494 -68492 -75772 -66512 -46877 -8549 -2846 -17407 5746 7623
21096 7623 -23241 -44172 -42756 -21528 -6494 -14214 -9459 7467 -5023 1249 7776 -7623 -15247
21083 -15247 -11385 17706 4629 6784 -13649 -7415 23333 60911 39615 8245 3098 -19553
21071 -19553 -52676 -34500 -18136 -16548 -18895 -19638 -23046 -4401 -8120 -10707 -8822 -40936 -36779
21058c6779L4210N438m293l2760l7725N582K3990O627j7950O748K528J5195k2311
21045e1500K6124N030k0638j765Q181l00L970K6176J1153J9609k6961l6126m5897
21032h2944q039K3652L4351k124J6883p673k0479J670J6179R022J4938j1184n969
21019b1717k0825J2169Q538J5693P640L60K637j4254J6994j164J1609J7538k0954
21006A4264j8875k740j3119k0275J1409J8593K5585j0846n558p746J184j8081
20994b6205k010j4283J0714O828K243J701L2659P672j5633j0530J0937K9062P149
20981D0304k2262m1651r250j817Q524K11K2454K1009p905j0265K4741J0214j0801
20968B3506l6156k1986K507N917L487J9265Q289r074k3296K346K633P851J0188
$$ plain form
21058 -36779 -2569 2869 -1424 -34184 -71909 -66327 -42337 -35710 -53660 -46912 -44384 -29189 -51500
21045 -51500 -25376 -20346 -40984 -42749 -34568 -34868 -30898 -4722 6431 26040 -921 -37047 -82944
21032 -82944 -90983 -67331 -32980 -35104 -18221 -25894 -46373 -44703 -28524 -19502 -4564 -15748 -21717
21019 -21717 -42542 -30373 -21835 -6142 1498 1858 4495 -9759 7235 6071 17680 35218 14264
21006 14264 -4611 -7351 -20470 -40745 -29336 -10743 14842 3996 -1562 -9308 -8124 -26205
20994 -26205 -28215 -42498 -31784 -24956 -22713 -21012 11647 19319 3686 -6844 4093 33155 40304
20981 40304 18042 -23609 -32859 -34676 -26152 -25941 -3487 17522 9617 -648 24093 34307 23506
20968 23506 -12650 -34636 -32129 -26212 -22725 -3460 4829 -4245 -27541 -25195 -22562 -14711 -4523
20955d523J2051l0209r334J4412J8908L5108J9354l7800o0678j074R454J3962
20943b0369N333r061K6753K8128j7631j4834r533j2718l307K6448L971l1573O093
20930b2300J5094J2899L628J0812l267p16l3379n457K0223O284o869K253K6563
20917B5768L294j0849k3613J0290J1387j2863k5523j0720n655j2358J3563K3203
20905a4076O945K0726j3388j6219L989L0168M3696j5114k6415J1690m971o053
20893B0978j6761n086J6648r17k3858k8082n258N177L3148Q914k2082j3407o460
20880c7046K9364K3429k5744P804J000J1363l785N3j0272k1776L7705Q275j2522
20867G848o503j2550j2952J754k2900j2600P763J4276L5060K3822m591k2645Q678
$$ plain form
20955 -4523 7528 -22681 -32015 -17603 1305 36413 55767 17967 -42711 -43785 -34331 -20369
20943 -20369 -15036 -24097 2656 30784 13153 -1681 -11214 -23932 -27239 -791 3180 -28393 -22300
20930 -22300 -7206 5693 9321 20133 16866 16150 -17229 -22686 -2463 3821 -3048 -795 25768
20917 25768 29062 18213 -5400 4890 16277 3414 -22109 -32829 -38484 -50842 -37279 -14076
20905 -14076 -7131 13595 207 -16012 -12023 18145 61841 46727 20312 32002 27031 20978
20893 20978 4217 -869 15779 14862 -8996 -37078 -42336 -37159 -4011 4903 -17179 -30586 -37046
20880 -37046 -7682 15747 -9997 -2193 -1193 10170 6385 6438 -3834 -25610 12095 20370 7848
20867 7848 1345 -11205 -24157 -22403 -45303 -57903 -50140 -35864 -804 23018 18427 -4218 4460
20854D460n032j1846j4927K0617j3069L561L1324n902m2226k0359k518J7258J5492
20841b3167J2276m362J5970K5767J3421q602j6557l2787k0560O348K6026K7828
20829B1601n731j6221J3226j0260k4181r339Q220j5394J598q728j7074L4822J8255
20816i206O451r042J553r734o74K748k819J705O071J1774J010J8580P788l5080
20802h875l2457j9964Q002J7157K5304J1359r714j0398j1706k3759L2621J805
20790b0625q765Q724o210o558K802j8982J7966K4531j4315j5649n960o699n926
20777e5666j8899J5523K4305J934k279J4335M4398l538J2797k8309m62J1543j1106
20764D576j7518K9275j2807j8953r191O84K3928m057n6745r154K4964q526J4875
$$ plain form
20854 4460 -572 -12418 -27345 -6728 -19797 -16236 15088 9186 -33040 -53399 -55917 -38659 -23167
20841 -23167 -10891 -15253 717 26484 39905 31303 14746 -18041 -38601 -32253 -6227 21601
20829 21601 15870 -351 12875 2615 -21566 -30905 -22685 -38079 -36481 -45209 -62283 -27461 -9206
20816 -9206 -2755 -11797 -10244 -19978 -20652 -17904 -20723 -19018 -12947 -1173 -163 18417 26205 -8875
20802 -8875 -41332 -61296 -53294 -36137 -10833 526 -9188 -19586 -31292 -55051 -22430 -20625
20790 -20625 -29390 -20666 -26876 -33434 -30632 -49614 -31648 -7117 -21432 -37081 -43041 -49740 -55666
20777 -55666 -74565 -59042 -34737 -32803 -35082 -20747 23651 20113 32910 4601 4139 15682 4576
20764 4576 -12942 16333 3526 -15427 -24618 -23934 -6 -4063 -60808 -69962 -44998 -53524 -38649
20751c8649P877J2939J4861J4088j0942m24r830J8840l768j0667J2868O749k147
20738A1795J4398k6003k5431R413M679J8521K5444Q12j3046k2632l4008m518K9877
20725a0699K8307l955k9753R185L273k5037q573O145k966J4333J2494O792K3170
20712B2716N403J124l3366l644q12N57K3361j8293j0984k411R493Q563R400j4873
20698c766N642q062k4435j5527J0182K4668m905l599J5J2694n326j6127j8566
20685d7112J0995j3477J2036R973r766j6238J0150K5363K2671J4981j0572j2847
20673c843j7350J7215n858J3698M612p957j8855o715K049P17J6244K995J818J9597
20659A8367P092k9552j3581J2367N088J2487j7489l4186p483j885J7001K6410
$$ plain form
20751 -38649 -30772 -17833 -2972 11116 174 -250 -10080 8760 4992 -5675 7193 13942 11795
20738 11795 26193 190 -25241 -15828 -11149 7372 32816 33628 20582 -2050 -36058 -40576 -10699
20725 -10699 17608 13653 -16100 -6915 -3642 -28679 -37252 -31107 -34073 -19740 -7246 -454 22716
20712 22716 28119 29243 -4123 -7767 -8579 -8022 15339 -2954 -13938 -16349 -6856 1707 11107 -3766
20698 -3766 1876 -6186 -30621 -46148 -35966 -11298 -16203 -19802 -19787 -7093 -12419 -28546 -47112
20685 -47112 -36117 -49594 -37558 -27585 -37351 -53589 -43439 -18076 4595 19576 9004 -3843
20673 -3843 -21193 -3978 -9836 3862 8474 517 -18338 -25053 -23004 -22287 -6043 -3048 -1230 18367
20659 18367 25459 -4093 -17674 -5307 -219 12268 -5221 -39407 -46890 -48775 -31774 -5364
20647e364M354j9305P204J7781K2949q973K045K127n26j1300j1973J4929R035
20634B2983r70l348M061j1862l7248j161J5297J2621n579P938j652j3027j849
20621a3796j5281L1132J7409K636j6379k7383n695q285K8656J9164l6803j8038
20609d2663R158J1658L2289j27K354J928O088k4244k9136J3655J3329k2449J0287
20596a7873K8008p989l028L425q924L329K7834l7071k9746M3833L7582O00l8332
20583A648j4713k4536J7096R69n210J3896J0454K019K11l9980Q452K9617R172
20570I095m92L3793J5665n8942j4792j4612k403J1692K7373l120p860q958k795
20557a6356r388j1608J4615K6214q331j3375J0870J9419K3183m634k4586j8988
$$ plain form
20647 -5364 -1010 -20315 -13111 4670 27619 18646 20691 22818 22292 10992 -981 13948 22983
20634 22983 22013 18665 22726 10864 -26384 -27545 -12248 373 -5206 2732 1080 -11947 -13796
20621 -13796 -29077 2055 19464 22100 5721 -21662 -27357 -35642 -6986 12178 -24625 -42663
20609 -42663 -33505 -21847 10442 10315 12669 14597 20685 -3559 -32695 -19040 -5711 -28160 -17873
20596 -17873 10135 2146 -882 2543 -6381 -3052 24782 -12289 -42035 1798 39380 39980 1648
20583 1648 -13065 -37601 -20505 -19536 -24746 -10850 -396 1623 1834 -38146 -29694 -77 9095
20570 9095 8603 42396 58061 -881 -15673 -30285 -32688 -20996 6377 3257 -4603 -13561 -16356
20557 -16356 -25744 -37352 -22737 3477 -4854 -18229 -7359 12060 35243 30609 6023 -12965
20545a2965k2488K419L8589K2259k5514P609j1642Q434k5231l4267J156N945K7622
20532a8074L7761J970j1331J4366j2427J1102J0115j272m663K088k5342J5254
20520A9547K249J3619j2388j6826j3568j9012k0760R884K3937L373K4111R866
20508B4032l0948k6756j718K6274J4430j1045j467m3959n016K2122J3263K2723
20496A935R555r440j8264j5473K8835L6101k3436l9958m9L0831Q21Q73K7490K0296
20482E0117j6732l7506l466k041J8819o598k3639k060m387j7803J187L018L1713
20469i378j29j2715k9455N24M5381j651k8255J3629L6764j2819J231R275K0669
20456C3071K847r850j4730l4064j0836J6042l375O450m935P375L1323o282l7393
$$ plain form
20545 -12965 -35453 -33034 5555 27814 2300 9909 -1733 6701 -18530 -52797 -51641 -45696 -18074
20532 -18074 19687 21657 10326 24692 12265 23367 33482 32210 27547 29635 4293 19547
20520 19547 21796 35415 23027 6201 -7367 -26379 -47139 -37255 -13318 -9945 14166 24032
20508 24032 -6916 -33672 -35390 -9116 5314 -5731 -7198 -51157 -56173 -34051 -20788 1935
20496 1935 11490 2050 -16214 -31687 -2852 33249 9813 -30145 -30194 637 1458 2331 29821 50117
20482 50117 33385 -4121 -7587 -9628 9191 2593 -21046 -23106 -27493 -45296 -44109 -41091 -9378
20469 -9378 -9507 -22222 -51677 -51153 -5772 -7423 -35678 -22049 14715 1896 3127 12402 33071
20456 33071 35918 26068 11338 -22726 -33562 -17520 -20895 -14445 -19380 -12005 19318 13036 -24357
20443b4357J641J6976L9337j1457l7639J9057L5454O841n708J296j3766j213J8831
20430D5293K381p508o033n71O906r163l3344k151K355L019k2261q559L4630R44
20416E938k7558K6489K4818k7108J3790Q459k1482L236r019k5614j2567J0545
20404c0073M2196J083l806K9533j0636j6830r539J3821n758j4489n700N19N138
20391d541P178J3241k3008p529r814o259Q122L1307J8592L559j6785p047m20J872
20377H468k1559k8412P723j4830L0273N188J5761j0548j6924J5572K0403p135
20365C980j1085N180K5327r464l7644k3277K6j3122k202J0460N1557L2515l0866
20352A385n5602m255K1041J0167k0834K1340M0061l304J1060n830r783j3611J6232
$$ plain form
20443 -24357 -22716 -5740 33597 22140 -15499 3558 39012 45853 40145 41441 27675 26462 45293
20430 45293 47674 40166 34133 33562 40468 31305 -2039 -4190 -1835 1184 -21077 -29636 4994 5938
20416 5938 -21620 4869 29687 2579 16369 24828 3346 6582 -2437 -28051 -40618 -30073
20404 -30073 12123 13206 9400 38933 28297 11467 1928 15749 9991 -4498 -10198 -9679 -4541
20391 -4541 2637 15878 -7130 -14659 -24473 -30732 -22610 8697 27289 30848 14063 7016 6596 8468
20377 8468 -13091 -41503 -33780 -48610 -18337 -13149 2612 -7936 -24860 -9288 11115 3980
20365 3980 -7105 -1925 23402 13938 -23706 -46983 -46957 -60079 -62281 -51821 -264 32251 1385
20352 1385 -54217 -58472 -37431 -27264 -48098 -26758 13303 9999 21059 15229 5446 -8165 8067
20339H067k796l4971l940m544K1456J0744j2900L837j6877j660J8674J1853K7994
20326B4937J6638j9362J6899M745p579j7942N059j610M593j4768k5692M466J8079
20313H463J1156j2927O58K9887j752M757q673L6367K9321l3979k1488J3278n66
20300E4502R990k433k2615j9000p701K0602O430k2247j3584k4946n625l773R829
20287b0571N5472K0298P958k5590k7706J023m619j5053l2399j5150J7117K4932
20275a4288J0081L6674q371q55P252j7487K5542J3729l0226l5868J4425L4586
20263C5194n846J6749j296k5707n411J2147k609q695k3340P64L729p15R534k2937
20249a8439N320L7684J7413k2983j7478l5033j4702M182L4910J5609k0994r172
$$ plain form
20339 8067 5271 -29700 -33640 -38184 -16728 -5984 -18884 -15047 -31924 -33584 -14910 -3057 24937
20326 24937 41575 22213 39112 43857 36278 18336 23395 21785 26378 11610 -14082 -9616 8463
20313 8463 19619 6692 7350 37237 35485 40242 31569 67936 97257 63278 41790 55068 54502
20300 54502 64492 62059 39444 20444 12743 33345 39775 17528 3944 -21002 -26627 -30400 -20571
20287 -20571 34901 55199 63157 37567 9861 10884 6265 -8788 -41187 -56337 -39220 -14288
20275 -14288 -4207 32467 24096 23241 30493 13006 38548 52277 22051 -13817 608 35194
20263 35194 29348 46097 44801 19094 13683 25830 23221 14526 -8814 -8050 -4321 -5036 4498 -18439
20249 -18439 -13119 24565 41978 18995 1517 -33516 -48218 -44036 -9126 6483 -14511 -23683
20237b3683K0291r287m738J3286q808q559J2669K8316J1938r458M066k94n181
20224B0558k0508m95Q506k660k2893q260L1480Q760M797L985r312j3131j6977
20211a6150J1427R460K1370j3138l0566k645J3807K5963q061J1158n450J6592
20199C3767j010Q874R701k0069L270k5644j5439O536Q246L062J0012j0808k792
20186G706J6486j8608L983N138K8774L496l3351M640j5097j5185k3762m439J4660
20173b5559K0924J7892J5632j665j0804j8188r850L44j0587K941J1441j098J3649
20160E072N944k5558Q37L223j5709J7820J4978k2058P136J1774J8529R151L8618
20147F9757j0209j5746o495J4304J0802j0966k6025p153J4691k3631l6996l385
$$ plain form
20237 -23683 -3392 -12679 -17417 -4131 -12939 -21498 -8829 19487 31425 21967 26033 25739 20558
20224 20558 50 -445 8061 5401 -17492 -25752 5728 14488 19285 23270 13958 827 -16150
20211 -16150 -4723 4737 26107 12969 -17597 -20242 -6435 19528 11467 22625 17175 33767
20199 33767 32757 41631 51332 31263 34533 8889 -6550 -14 8232 11294 21306 10498 7706
20186 7706 24192 5584 9567 14705 43479 46975 13624 18264 3167 -12018 -35780 -40219 -25559
20173 -25559 -4635 13257 28889 27224 16420 -1768 -11618 -11274 -21861 -18920 -7479 -8577 5072
20160 5072 11016 -14542 -13705 -10482 -26191 -8371 6607 -15451 -8315 3459 21988 31139 69757
20147 69757 59548 43802 37307 51611 62413 51447 25422 18269 32960 9329 -27667 -31052
20135c1052M1745J8399L658J7772j3337m3171j451M748L4193k684k420r572M868
20122B1696J3207j5553l0623p809k322l0407J3341K3363J7242j6665J9804j6503
20110a1229k266K3683J2112K796O455J77l449j6931N740o77l5410l369J0999j775
20096a3144j64J49J6267K0234J0453k4943P677j6710K328J1020J37k4457K0123
20083H970p873o779l3796j0661K1875L6600K086R255K8873k2177j9466k2777M53
20070a5417P87n816O393P581k012p469K66o078j849K4394J0836Q425m721k1332
20056f012L457N359K815j6796l8589r952J9727R715l038K2390p180o193n837K9233
20042i01K4658J0508j1764k0750o856J1049lj5646p726k1150j0898K3815j440
$$ plain form
20135 -31052 10693 29092 32750 50522 37185 -5986 -7437 -2689 31504 28820 26400 16828 21696
20122 21696 34903 19350 -11273 -19082 -21404 -51811 -38470 -15107 2135 -14530 5274 -11229
20110 -11229 -13495 10188 22300 25096 31551 31728 28279 11348 17088 16411 -18999 -22368 -11369 -13144
20096 -13144 -13308 -13159 3108 23342 33795 8852 16529 -181 2147 13167 13304 -11153 8970
20083 8970 1097 -5682 -39478 -50139 -28264 8336 10422 19677 48550 26373 6907 -15870 -15417
20070 -15417 -14630 -20446 -14053 -6472 -8484 -15953 -15687 -21765 -23614 780 11616 20041 15320 -6012
20056 -6012 -2555 2804 5619 -11177 -49766 -59718 -39991 -30276 -33314 -10924 -18104 -24297 -30134 -901
20042 -901 23757 34265 22501 1751 -5105 5944 5941 -9705 -17431 -38581 -49479 -25664 -27104
20029b7104K496J7001p878l199r174j2883M0592J8468J0841l0670p049J3714L1941
20016C7096m771k5807R348R87J5372m723k7146r475p876n79M160J560J3391N885
20002G422K027j9948J036K2028o462j5186j115k49K5346L5957K7430j4235K368
19989F6419k2540j6627R641o751j2221j7784J0862L5283J7115j6193m1812j5816
19977a0424O834J5443K1305J6823R24l2078k7514O108K7401L8937o24j2639K0127
19964G0623k1783j5571o426K311j6505k5588j2201L5768J2090m280n879J697J251
19951A5507K0234k3473k4036L1463K649n27P65l080K4835L281j4494r70J028L4189
19937F7371J204m1716l2660J3723J5631o069j1178K1019R166j2269R972p931r751
$$ plain form
20029 -27104 -24608 -7607 -15485 -18684 -27858 -40741 -149 18319 29160 -1510 -8559 5155 37096
20016 37096 32325 6518 15866 16853 32225 27502 356 -9119 -16995 -17574 -13414 -11854 1537 7422
20002 7422 9449 -10499 -9463 12565 6103 -9083 -10198 -10447 14899 50856 78286 64051 66419
19989 66419 43879 27252 36893 30142 17921 137 10999 46282 63397 47204 5392 -10424
19977 -10424 -3590 11853 33158 49981 50905 18827 -8687 -2579 24822 63759 63135 50496 70623
19964 70623 48840 33269 26843 29154 12649 -12939 -25140 10628 22718 18438 12559 14256 15507
19951 15507 35741 12268 -11768 19695 22344 21817 22582 19502 44337 47618 33124 32154 33182 67371
19937 67371 68575 26859 -5801 7922 23553 17484 6306 27325 36491 24222 34194 26263 16512
19924A6512k9412j7320M661K8734J2961J5940l328j3185m856j153R999j3398k1931
19911a5776L7172L0084l839q254k6947j7890J233J9745J6686j5154j588K6653
19899D2125J1376J6917k2816l214j2141m1157k0112Q53L2641K7307n251l250N57
19886B3835M898k9857l6344K6714M2467O779J9905n336l0858j4390K9384L1121
19874F8318j1136q997k5287j3341N221J5043R213L531J2426J0537L048j803r948
19861E6825l0418n954j3681k3345j5941N3152K3584k0826k5233j623L5379K1192
19849E3111k3056J0245L1056j226k4124j3216o439j76K4195J6329q043n896q345
19836D4415j1215o090J8992m635j0006k0317j3320N643J6588J5485L993j6463
$$ plain form
19924 16512 -12900 -30220 -25559 3175 16136 32076 28748 15563 10707 9554 19553 6155 -15776
19911 -15776 21396 51480 47641 39387 12440 -5450 -4217 15528 32214 17060 15472 42125
19899 42125 53501 70418 47602 44388 32247 -8910 -29022 -28169 4472 31779 26528 23278 23835
19886 23835 28733 -1124 -37468 -10754 31713 38492 58397 53061 22203 7813 37197 68318
19874 68318 57182 48185 22898 9557 14778 29821 39034 42565 54991 65528 68576 66773 56825
19861 56825 26407 20453 6772 -16573 -32514 20638 44222 23396 -1837 -3460 31919 53111
19849 53111 30055 40300 71356 70130 46006 32790 26351 26175 50370 66699 58656 52760 44415
19836 44415 33200 27110 46102 41467 31461 11144 -2176 3467 20055 35540 39533 23070
19824B3070r007j8714J5412J6981J3826N29j1044J8076J1049J7480l915n261j1105
19811E7377j4514J1781L5244k1773R920J3524j1706k0270k5341j013J6595J9314
19799F9138j9678k8558r414K1340K9497lj6278j696K3894l3591l562J5915O205
19786E3209j0338J1905p336l941o367J3700J6587J4956J2778K5834N7105O6536
19774B44628P3461N4718Q5165N0061L1629L5162L8371O060M545Q141o242J1306
19762F37005K8727k2602l8264l4609k7960n0400q6081q8956r6419m2941j1949
19751A65551J133q802K11P434j8220j0770K1308J2410j4403k5180j7394K1023
19739A34301J7657R835J1762r946k161j0552j3555n396O143j0577J4985L6003
$$ plain form
19824 23070 14063 -4651 10761 27742 41568 42097 31053 49129 60178 77658 73743 68482 57377
19811 57377 42863 54644 89888 68115 78035 91559 79853 59583 34242 33229 49824 69138
19799 69138 49460 20902 11488 32828 62325 62322 46044 44348 68242 34651 31089 47004 53209
19786 53209 42871 54776 47440 43499 37132 50832 67419 82375 95153 120987 178092 244628
19774 244628 318089 372807 457972 508033 539662 574824 613195 619255 623800 631941 625699 637005
19762 637005 665732 643130 604866 570257 542297 491897 405816 316860 220441 177500 165551
19751 165551 166684 157882 158093 165527 147307 136537 157845 170255 155852 130672 113278 134301
19739 134301 151958 161793 173555 163609 161448 150896 137341 131945 138088 127511 142496 178499
19727A78499L6630M7103P8954Q4245M9449P1381O3190N9013Mk898j1548j6240
19715F37782m005K8753O3555O1037j889p5353o8909r0214q5866p5271n6833l0074
19703C02713l1102l9536k6047N295m190j159l098k735k3411j4758k3198o929K5950
19690A57795J0753j9517J562j5770o708J340N007n800j2886Q653j9378k2048K6146
19677A09149K5270L744J4761M214J886o424l1734M960j3430n006k6674o881J2780
19664H6615M0620R217m2601l2138J4988K7277K6830K0473j3609k4581r619q640
19652I4832L1520j8215l3823J2651J4934Q260p681k870r651k4871j74K9885N41
19639I5338P330Q948n134m3692M293L132J1256Q07N315L507O184j455j3859k491
$$ plain form
19727 178499 215129 262232 341186 425431 474880 546261 609451 668464 668468 665570 654022 637782
19715 637782 633777 662530 726085 787122 785233 709880 640971 550757 464891 389620 332787 302713
19703 302713 271611 232075 206028 211323 207133 205974 202876 200141 176730 161972 138774 131845 157795
19690 157795 168548 149031 150593 134823 128115 129455 134462 128662 115776 124429 105051 83003 109149
19677 109149 134419 138163 152924 157138 159024 152600 120866 125826 112396 107390 80716 73835 86615
19664 86615 127235 136452 93851 61713 76701 103978 130808 151281 137672 113091 103472 94832
19652 94832 126352 108137 74314 86965 101899 110159 102478 99608 89957 65086 64912 94797 95338
19639 95338 102668 111616 106482 62790 67083 70215 81471 82278 87593 91100 97284 95829 81970 79479
19625G9479O158J4921J9500M209L1306j0144l6321k0190j7365j5403o959J8902
19613F8093J2178R488j7705n296J6582J1552r062j3762K7845J6484j68R614k9385
19600I6458k2340j5733J5010L9175J4586m008J730l1268l4234k3553J3180l5531
19588A3472m264K7097M7288j1307n6903K061J7325M9311N9336j5939j8831J0519
19576A19165q781j8692q058m186M029j2574K3140J5370j31k0315L800J5460j5209
19563I3018J667J1938L5100j4395k5666k7495o06M183K295K7341J6510j3598R811
19550A20103J686k0335j2064j2369l842J5399O970m334N630o077k9796l9884n411
19537A5676J6084K1987Q882J5324j853J7288J0240J478J9408L788k1963K08l51
$$ plain form
19625 79479 85637 100558 120058 124267 155573 145429 109108 88918 71553 56150 49191 68093
19613 68093 80271 89759 72054 66758 83340 94892 85830 72068 99913 116397 116229 125843 96458
19600 96458 74118 58385 73395 112570 127156 123148 124878 93610 59376 35823 49003 13472
19588 13472 9208 36305 83593 72286 15383 17444 34769 84080 143416 127477 108646 119165
19576 119165 110384 91692 83634 79448 83477 70903 94043 109413 109282 88967 92767 108227 93018
19563 93018 94685 106623 141723 127328 101662 74167 73561 77744 80039 107380 123890 110292 120103
19550 120103 121789 101454 89390 77021 73179 88578 95548 91214 96844 90767 60971 21087 15676
19537 15676 31760 53747 62629 77953 76100 93388 103628 105106 124514 128302 106339 106547 106196
19524A06196l859J9808k7843l2524M430L8391L748o413K05J2194k780K6131J1134
19511A48818P619L986o475l9209K1873k459J328M2827q701k5804P177J0115J301
19498A62396J5588n310r268j748j1969p855L1M427k195j3285j5753m658k3081
19485H7320J6764R61r661J8465L910J7877J1415J4606k6712l4757j3101l725R551
19472I2913J0656K422J1080K1511J3580k3484Q829J8726J2449J5920J2942l666
19460A93878K985N839J3938q865k074J0516j050k6104j26K9689N7998M704k5843
19447B55485k0094q600j8726j0683J2404K426q809L0450m580r725j2394l7724
19435A69430m8607L7217J6992j2702j4121l4318n11j0249Q17M379j6435l118R864
$$ plain form
19524 106196 102337 122145 94302 61778 66208 104599 108347 101934 102139 114333 111553 137684 148818
19511 148818 156437 160423 153948 114739 136612 134153 135481 178308 169607 143803 150980 161095 162396
19498 162396 177984 172674 163406 161658 149689 141834 141865 146292 144097 130812 115059 110401 87320
19485 87320 104084 105045 95384 113849 117759 135636 147051 161657 134945 100188 87087 83362 92913
19472 92913 103569 105991 117071 138582 152162 128678 137507 156233 168682 184602 197544 193878
19460 193878 196863 202702 216640 207775 205701 216217 215167 189063 188937 218626 276624 281328 255485
19447 255485 235391 226791 208065 197382 209786 212212 203403 233853 229273 219548 207154 169430
19435 169430 120823 158040 175032 162330 148209 113891 113380 103131 103948 108327 91892 88774 98638
19422I8638j872M3801L4263j3466J0m073j0866j078K0118O633K8298K7252k8155
19409A99503k5448P454Q655J4127k2823K1809J3816j5007J3688K0160L132l0886
19397B08180K791J2002J1725K263L657J1718J9099J8623L5265M9957N4833O9883
19385D99996K3943O2811P1772L1219m18K2849M6005L3407N974j0866J3072K1786
19373H21550K3727k6538j3143k2363j6768n4086p5987m9193o890J9530j0779j6595
19361E72465m051J808L571l3385J4540J6137j3578q482O442K6420J7713k2726
19349E76874l167q920j2733l5828J2591K2378K2872L8491K4038M6522J5689L7146
19337G35953M8282R4004O1197Q2078P6251M5290J8283q265N005K1065M1243P2825
$$ plain form
19422 98638 96766 140567 174830 161364 161374 157301 146435 145357 165475 172108 200406 227658 199503
19409 199503 174055 181509 190164 204291 181468 203277 217093 202086 215774 235934 239066 208180
19397 208180 210971 222973 234698 236961 240618 252336 271435 290058 325323 375280 430113 499996
19385 499996 523939 586750 658522 689741 689323 712172 758177 791584 797558 786692 799764 821550
19373 821550 845277 818739 805596 783233 766465 712379 636392 587199 580309 599839 589060 572465
19361 572465 568414 570222 573793 540408 554948 571085 557507 549025 555467 581887 599600 576874
19349 576874 573707 564787 552054 516226 528817 551195 574067 612558 636596 683118 698807 735953
19337 735953 784235 878239 939436 1021514 1097765 1143055 1161338 1153073 1158078 1179143 1220386 1293211
19325A293211M4022N7933K6771j8365m7844m0092o5754n3536l8266j4341l662
19314A140077l5569j1816J3599p382L2839K8416J20K218o100K683L0915K7697
19302A217697J82M2084N5087J07432J47750J38291J52141J91316J98765J97432
19292B448177J83321J79013Q3339P0947J48728J72403J71042Q3484m3984j3053
19282C483417J10802K22389K58928K71615J17491P1063K15637L34106K57119J06019
19272E448586N7949K40398L39397L56421M42965P23203J029900J540029K502912
19263A2681760M288181P733890J2459259J5437769J5937796J6076191J1847185
19256I6462031K933492j146414J448764r76527m972675k296692M788305R338822
$$ plain form
19325 1293211 1337233 1395166 1421937 1403572 1355728 1315636 1249882 1196346 1158080 1143739 1140077
19314 1140077 1104508 1092692 1106291 1098909 1131748 1160164 1160284 1162502 1156402 1159085 1190000 1217697
19302 1217697 1217879 1259963 1315050 1422482 1570232 1708523 1860664 2051980 2250745 2448177
19292 2448177 2631498 2810511 2893850 2964797 3113525 3285928 3456970 3540454 3496470 3483417
19282 3483417 3594219 3816608 4075536 4347151 4464642 4535705 4751342 5085448 5342567 5448586
19272 5448586 5506535 5746933 6086330 6442751 6885716 7608919 8638819 10178848 12681760
19263 12681760 16969941 24703831 37163090 52600859 68538655 84614846 96462031
19256 96462031 99395523 98249109 99697873 98721346 93748671 91451979 96240284 105579106
19248A05579106P161212r65606n728945m480028r226070j8019979j9477311j2661235
19240D2181144p119393m305555k818882k034487j490821j186158j047602r21715
19232B1256531p78329o63176o41218o14154m72785l58150l40242k46763j65687
19223A6976027n4707K1785P4742N5583R4260L44969O49015J077213J884997L443562
19213B4567446O351694J1278040J6134476J7967415J8748671J7488596Q392351
19206A20928689j213348j263969j928289p246580n790397L130265R909299J2155113
19198A28680783N437139m745823p319978q467108j7135788k2744029j7675539
19191E6029657j0352471o225178m168769k956627k224734j757065j475807j282329
$$ plain form
19248 105579106 112740318 111774712 106045767 101565739 92339669 74319690 54842379 42181144
19240 42181144 35061751 30756196 27937314 25902827 24412006 23225848 22178246 21256531
19232 21256531 20478202 19815026 19173808 18559654 18086869 17728719 17388477 17141714 16976027
19223 16976027 16921320 16943105 17017847 17073430 17167690 17512659 18161674 19238887 21123884 24567446
19213 24567446 30919140 42197180 58331656 76299071 95047742 112536338 120928689
19206 120928689 119715341 118451372 116523083 109276503 103486106 106616371 116525670 128680783
19198 128680783 134117922 129372099 122052121 113585013 96449225 73705196 56029657
19191 56029657 45677186 39452008 35283239 32326612 30101878 28344813 26869006 25586677
19183B5586677j092663j057156j047366j005722q46908p62199p42698p10545o35982
19174A7685438m83367m85191n31999n42251n23118n01646m64554m32263l86220
19165A3334829l17693l04517k71242j95747j83426j46129j43146j85021q2555
19156A1505353K9293n8280J493M5078k13650k35028l38299n05327m33430l19071
19146I478132l25715l12236k96182k24015j76145j56301p4633l4341n233k7573
19136G845758n2185j91453l06085k10291j39203r3929q5203p7682n9736r932O1195
19125F681254R2521J51903J53533R4410K3725o3622k71266k83732k63708k20398
19115F094620j15291O9587K30740K88014K68632J87079j20477m33539m17995k35396
$$ plain form
19183 25586677 24494014 23436858 22389492 21383770 20536862 19774663 19031965 18321420 17685438
19174 17685438 17202071 16716880 16184881 15642630 15119512 14617866 14153312 13721049 13334829
19165 13334829 13017136 12712619 12441377 12245630 12062204 11916075 11772929 11587908 11505353
19156 11505353 11534646 11476366 11477859 11522937 11309287 11074259 10735960 10230633 9797203 9478132
19146 9478132 9152417 8840181 8543999 8319984 8143839 7987538 7912905 7878564 7873331 7845758
19136 7845758 7793573 7602120 7296035 7085744 6946541 6852612 6767409 6689727 6629991 6620059 6681254
19125 6681254 6773775 6925678 7079211 7173621 7197346 7133724 6862458 6578726 6315018 6094620
19115 6094620 5979329 6048916 6279656 6567670 6836302 7023381 6902904 6469365 6051370 5815974
19105E815974m2813O6423J43310J39434J2445j07457k86007l35586k00738k474
19095E202511J30010K16855K86073P0511j90440k48601n07076n45782l31143j58254
19085C924664p7628m3124J533O517O001k0259o1383o2304k3965L1811L3930N6615
19073C772408R6486Q4250M0649r5827j75109j75493j04309q8906k1206N4550P7162
19062C464655J48029K63684K83574K44013J44715n066k88107m69127l49331k02971
19052C234068l1648R0602J71758K28318K01272k0638k54331l32377l49299l00663
19042B637062j67766j03778n7927o4155o6827n2727k7892n0511k5430l7826m2271
19031A939952k4777m9035j8095o456l047l9424k6302j8126l8697k2323n3252o0195
$$ plain form
19105 5815974 5773161 5839584 5982894 6122328 6134773 6027316 5741309 5405723 5204985 5202511
19095 5202511 5332521 5549376 5835449 5905960 5715520 5466919 4959843 4414061 4082918 3924664
19085 3924664 3847036 3803912 3805445 3811962 3817963 3797704 3736321 3674017 3650052 3681863 3715793 3772408
19073 3772408 3868894 3953144 3993793 3897966 3722857 3547364 3443055 3354149 3332943 3387493 3464655
19062 3464655 3612684 3876368 4159942 4403955 4548670 4543604 4255497 3786370 3437039 3234068
19052 3234068 3202420 3293022 3464780 3693098 3894370 3873732 3619401 3287024 2937725 2637062
19042 2637062 2469296 2365518 2307591 2243436 2176609 2123882 2095990 2045479 2020049 1982223 1939952
19031 1939952 1915175 1866140 1848045 1841589 1838542 1799118 1772816 1754690 1715993 1693670 1640418 1580223
19019A580223l3339m2902l4572J4349J9326j044n991j0029k6425m4458l2337k7967
19007A354834k6015m5037j5981r302j7050q092J9413K3641k9056k7972j9596J6307
18995A216094M644l0436M742l002k097k10J1227j3420j0291k5956j4178M554L763
18982A145434q47m336k5852q96K6323M325n816j2795l9213k858k914l1320J78
18969A049413j6779k2527J256P755j6561j1032j7968l5027l9368O912k3606l9878
18957H42590l9505k4606J1715l221L993P109m499j4950L561Q257k461J149N577
18944G94709j2234j2479M928j9466j0456J6687M5065J7622M3579M9480N0011L4373
18932A001819J079j3319l9091l3162Q017N0714k222M0283M4424P667J7575O702
$$ plain form
19019 1580223 1546884 1503982 1469410 1483759 1503085 1502041 1496050 1486021 1459596 1415138 1382801 1354834
19007 1354834 1328819 1283782 1267801 1258499 1241449 1233357 1252770 1276411 1247355 1219383 1199787 1216094
18995 1216094 1220738 1190302 1195044 1192042 1189945 1189735 1200962 1187542 1177251 1151295 1137117 1141671 1145434
18982 1145434 1144587 1140251 1114399 1113503 1139826 1144151 1138335 1125540 1086327 1083469 1080555 1049235 1049413
18969 1049413 1032634 1010107 1011363 1019118 1002557 991525 973557 938530 899162 906074 882468 842590
18957 842590 803085 778479 790194 786973 790966 798075 793576 778626 782187 790444 787983 789132 794709
18944 794709 782475 769996 774924 755458 745002 761689 806754 824376 867955 917435 967446 1001819
18932 1001819 1002898 989579 950488 917326 925343 976057 973835 1014118 1058542 1066209 1083784 1090486
18920A090486k1202J4880M8422j0428k0305k9082k3702l2494j7269J2740N2320
18909A064366L4013M4452K4439J9836J0519K2459k2157m0203m8988l6891o638
18898A065207j034Q586J5477j5855K1637M8278O7698O4693M3267K8547K7815J6238
18886A390554P1364N1316p642l092k5765o5102l6881J3128m600n943J1596L3110
18874A422043M5346r382m6278O646O6745O2574K9261P283K248K6740L0272O5071
18862A708569N2545j2857K3583O0919Q8833O1111o806q1893l4079k7734l7616
18851A794575n7332o6092m5819k6360P435K2825l947J4711L2130N1453P0643M9740
18839A843962K0269J7044k4103j9989P755M4375K9026O1257P3009R8261N7205
$$ plain form
18920 1090486 1069284 1084164 1132586 1122158 1101853 1072771 1049069 1016575 999306 1012046 1064366
18909 1064366 1098379 1142831 1167270 1187106 1197625 1220084 1197927 1157724 1108736 1071845 1065207
18898 1065207 1064173 1072759 1088236 1072381 1094018 1142296 1209994 1274687 1317954 1346501 1374316 1390554
18886 1390554 1461918 1513234 1505592 1502500 1476735 1411633 1374752 1387880 1383280 1377337 1388933 1422043
18874 1422043 1467389 1458007 1411729 1418375 1485120 1547694 1576955 1584238 1586486 1613226 1643498 1708569
18862 1708569 1761114 1748257 1771840 1832759 1921592 1982703 1975897 1894004 1859925 1832191 1794575
18851 1794575 1737243 1671151 1625332 1598972 1606407 1629232 1625285 1639996 1672126 1723579 1794222 1843962
18839 1843962 1864231 1881275 1857172 1837183 1844938 1889313 1918339 1979596 2052605 2150866 2208071
18828B208071j711k6573k7369J1763M2260l6568q490N4206Q2585Q1607O0765P2396
18816B512942P9664O2198O6735J30455J67655J72997J59608J33569J17335J46178
18806C749336K25798K29580J87575J72648K89450M34654M67059O21122R63303
18797G340525J555959K711633M929068P904851R089752Q710820R435995N844523
18789E7523126p79186r02562J478796k128418m183267K049544O270724Q334192
18781F7662949Q962352J274158n158539l298294n115318j3075328j3143312p905627
18773C0203041m345495k736041j963879j414920r62455o61500m71012k99994j99852
18764A7147893j41140k13562k94514k83358j98406k08125j84606p73J92503K91608
$$ plain form
18828 2208071 2206360 2179787 2152418 2164181 2206441 2169873 2161383 2215589 2298174 2379781 2440546 2512942
18816 2512942 2592606 2654804 2721539 2851994 3019649 3192646 3352254 3485823 3603158 3749336
18806 3749336 3975134 4204714 4392289 4564937 4854387 5289041 5756100 6377222 7340525
18797 7340525 8896484 11608117 16537185 24442036 33531788 42242608 51678603 57523126
18789 57523126 56743940 55841378 57320174 55191756 51008489 53058033 59328757 67662949
18781 67662949 76625301 77899459 72740920 69442626 64327308 51251980 38108668 30203041
18773 30203041 25857546 23121505 21157626 19742706 18780251 18118751 17647739 17347745 17147893
18764 17147893 17006753 16793191 16498677 16215319 16016913 15808788 15624182 15623409 15815912 16107520
18754A6107520K69556L75177O44004R80005J284982J807627K952444N086141R068555
18745C8576011J6273888K3767826K4447875K3830876K3451868P849503n803258
18738A52394589j504816J781645j0969743j1500303M094298J2497218J7782379
18731A64575267J3932383n164566j2198862p438608j6156270l0505644k6231240
18724H0812460j5608474r190446o316675m515665l160676k303125j872038j564044
18716C6281317j446083j379528j214772j115439j154894r93224o50726m67218
18708B7859433n26680n74123n50104m45095k12623J38289M91598R01789J689383
18699B8771867L115552O054835J1792002J8998495J9230694J4274795J0543732
$$ plain form
18754 16107520 16377076 16752253 17396257 18376262 19661244 21468871 24421315 29507456 38576011
18745 38576011 54849899 78617725 103065600 126896476 150348344 158197847 152394589
18738 152394589 150889773 152671418 141701675 130201372 134295670 146792888 164575267
18731 164575267 178507650 173343084 161144222 153705614 137549344 107043700 80812460
18724 80812460 65203986 56013540 49696865 45181200 42020524 39717399 37845361 36281317
18716 36281317 34835234 33455706 32240934 31125495 29970601 28977377 28326651 27859433
18708 27859433 27332753 26758630 26208526 25763431 25550808 25689097 26180695 27082484 28771867
18699 28771867 31887419 37942254 49734256 68732751 87963445 102238240 112781972
18692A12781972q460466k4197287j5816008m392358N650521J5107909J6572114
18685I7246397J1566820Q265131r820188k7013140j9978418j0816735o169240
18678D3280627m094373k800561j917866j400668j015939o63503l89994k46865
18670C0750858r1294l8317k4138k38205k83900O4703K62360L75877P14625J324334
18660C2816903J899415K721618M172687O903958J2269363K2827694L6756554M2000191
18652A62368383M4542477N0075413K6159357P984090J3926049l074456j2942091
18645B89039222k8146181l3593502R82060K8878821L2383778L1234215K4288955
18638C45067368j8503504l5473034j7371429l516850q239249m7178623n7078601
$$ plain form
18692 112781972 104321506 80124219 64308211 59915853 65566374 80674283 97246397
18685 97246397 108813217 117078348 107258160 80245020 60266602 49449867 43280627
18678 43280627 39186254 36385693 34467827 33067159 32051220 31387717 30997723 30750858
18670 30750858 30659564 30621247 30597109 30358904 30075004 30139707 30402067 30777944 31492569 32816903
18660 32816903 34716318 37437936 41610623 48514581 60783944 83611638 120368192 162368383
18652 162368383 206910860 256986273 283145630 291129720 305055769 301981313 289039222
18645 289039222 260893041 227299539 228281599 257160420 289544198 320778413 345067368
18638 345067368 326563864 291090830 273719401 270202551 261963302 214784679 157706078
18631A57706078l5437721j9765038j1864609p926383n956781m744932l896776
18624F8113838l222940l002728l072060k652332k221883j904682j636432j426479
18616D8974302j329657j366181j347384j335069j168241j017899r88861o90175
18608C9730835l52920j37004J15495P88682K058510M595421Q855672J1815692
18600F7470383R474550P646130K148258j2799120j4315740p087327j109515M604183
18592E6031802R307839Q421889N792354K618838j0598360j6457626j0568039n885404
18584C8663293l554261k389691j870222j591328j312254j032720q34161p01037
18576B5377619n93182o19913o77443p14080o93927n52748l37769k19712j70704
$$ plain form
18631 157706078 122268357 102503319 90638710 82712327 76755546 72010614 68113838
18624 68113838 64890898 61888170 58816110 56163778 53941895 52037213 50400781 48974302
18616 48974302 47644645 46278464 44931080 43596011 42427770 41409871 40421010 39730835
18608 39730835 39377915 39240911 39356406 40145088 42203598 46799019 55654691 67470383
18600 67470383 76944933 84591063 86739321 73940201 59624461 52537134 51427619 56031802
18592 56031802 65339641 73761530 79553884 82172722 71574362 55116736 44548697 38663293
18584 38663293 35109032 32719341 30849119 29257791 27945537 26912817 26078656 25377619
18576 25377619 24784437 24164524 23487081 22773001 22079074 21526326 21188557 20968845 20798141
18567B0798141j92868k38246l13583l77987m65631m87338m66588n08996n12320
18558A7234584m16418l88444l56735k88510k95334k86089k81773l76161m03063
18549A4142057l08059k89634k81575k34531j37039j24375j38021j82782k03987
18540A2242054k23612k27519k40515k25531k09381j56094j38082j76684j89561
18531A0455075j39515q2625J8856J39402J30989J08741P6325j980j5218j30921
18521A0559129j66255p2180Q137Q4143K24040K08943L3802o3796j05772k59648
18511A0450543l02035k54606k08340j88673j59150j78957j76076j62332j49316
18502H671058j04473q2622j41045k11189k54878k31647j47326j00258q7514j08010
$$ plain form
18567 20798141 20605273 20367027 20053444 19675457 19209826 18722488 18255900 17746904 17234584
18558 17234584 16818166 16429722 16072987 15784477 15489143 15203054 14921281 14545120 14142057
18549 14142057 13833998 13544364 13262789 13028258 12891219 12766844 12628823 12446041 12242054
18540 12242054 12018442 11790923 11550408 11324877 11115496 10959402 10821320 10644636 10455075
18531 10455075 10315560 10232935 10251791 10391193 10522182 10630923 10707248 10705268 10690050 10559129
18521 10559129 10392874 10320694 10328831 10412974 10637014 10845957 10879759 10815963 10710191 10450543
18511 10450543 10148508 9893902 9685562 9496889 9337739 9158782 8982706 8820374 8671058
18502 8671058 8566585 8483963 8342918 8131729 7876851 7645204 7497878 7397620 7310106 7202096
18492G202096j15082j04345j20774j11501q5603r9038r6819n9136n1460o6674
18482F291664p0839q8737r4888q2962o7886p8030l8491N1718J9597O6228L9277
18471E946651j22049j56916j33834j37546n9712K3162O3624L6839J360n0827q8333
18460E322419j40288j53051r5131q8462m7418n7062q9681j11150j03176r4544
18450D342456k8924j8134k0087J7230P1020P7675J34785J64933J59473J38555
18440E038982O3619l6118o84R1210J30445J69269J18492J30207J40379K00385
18430F046186K45815L73452M76429O05399P29523R26762J408621K339470M119587
18421A7271244P245547R983310R687503Q479072N945331q11326j784631K294081
$$ plain form
18492 7202096 7087014 6982669 6861895 6750394 6664791 6565753 6468934 6409798 6358338 6291664
18482 6291664 6220825 6132088 6037200 5954238 5886352 5808322 5769831 5821549 5841146 5907374 5946651
18471 5946651 5824602 5667686 5533852 5396306 5336594 5359756 5423380 5460219 5461579 5410752 5322419
18460 5322419 5182131 5029080 4933949 4845487 4798069 4741007 4651326 4540176 4437000 4342456
18450 4342456 4313532 4295398 4275311 4292541 4363561 4441236 4576021 4740954 4900427 5038982
18440 5038982 5102601 5066483 5065799 5157009 5287454 5456723 5575215 5705422 5845801 6046186
18430 6046186 6292001 6665453 7141882 7747281 8476804 9403566 10812187 13151657 17271244
18421 17271244 24516791 34500101 44187604 52666676 58612007 57800681 56016050 58310131
18413E8310131M726707N936709J765426k745242j432048J509797n71309n382478
18405F2117693k798812M57121J363795j459445r981881j2268424p888713m137373
18397B5403961k174759j314148r72248r97107j208408r63437n56096l03846j56952
18388A6756960j33691o9818q6048j73106r2432P1542K41035N31274R72873J404722
18378A9423311K200562L505873N570044P493091P722215Q346710Q400345O743625
18370F9405776Q330186R885113J0449248O392488j724095j591974L066629O853460
18362A11066831L631132m402108m081083l0001L91022p088062j2099119q750954
18354G8637658m362686k970096q506106j2598785r390232n556923l323590k174094
$$ plain form
18413 58310131 63036838 68973547 70738973 67993731 66561683 68071480 67500171 62117693
18405 62117693 59318881 59776002 61139797 59680352 49698471 37430047 29541334 25403961
18397 25403961 23229202 21915054 20942806 19945699 18737291 17773854 17217758 16913912 16756960
18388 16756960 16623269 16553451 16467403 16294297 16201865 16273407 16514442 17045716 18018589 19423311
18378 19423311 21623873 25129746 30699790 38192881 45915096 54261806 62662151 69405776
18370 69405776 77735962 87621075 98070323 104462811 102738716 101146742 104213371 111066831
18362 111066831 114697963 110295855 106214772 106184771 106575793 99487731 87388612 78637658
18354 78637658 74274972 71304876 62798770 50199985 40809753 35252830 31929240 29755146
18346B9755146j629659j358185j217978j114936r10889p35037n91518o04410o71363
18337B0921171m63041k84826k16870r7985n7265j02883o7154J96902O44296J492333
18327B1964678L249851N456683O059962N196107M622418J326538j744886L31145
18319D6462496K441376L921498L087628j075991k093133j32166j08374l413105
18311D9090229k827228l35629N09691l80337n434956q491574o223780l612410
18303B2294006k151212j448568j074334r29106p83743o33659n56007n05706m32496
18294A3779175l96043l44766l65955l72171l42532l73223m03095l05619k28629
18285A0647142k12347k44772k73102k52819k19224j86810j71929j67027j60185
$$ plain form
18346 29755146 28125487 26767302 25549324 24434388 23523499 22788462 22196944 21592534 20921171
18337 20921171 20458130 20173304 19956434 19858449 19801184 19698301 19631147 19828049 20472345 21964678
18327 21964678 25214529 30671212 36731174 41927281 46549699 47876237 46131351 46462496
18319 46462496 48903872 52825370 55912998 54837007 52743874 52611708 52503334 49090229
18311 49090229 46263001 45927372 46437063 46056726 40621770 32130196 25906416 22294006
18303 22294006 20142794 18694226 17619892 16690786 15907043 15273384 14717377 14211671 13779175
18294 13779175 13383132 13038366 12672411 12300240 11957708 11584485 11181390 10875771 10647142
18285 10647142 10434795 10190023 9916921 9664102 9444878 9258068 9086139 8919112 8758927
18276H758927j94060k17000j54642j39739j24494r8164q3267k1625l2401q7942
18266G605593o5937j03776j65801j33575j21901j72324j80783j07369p8381o9287
18256F406459j23584j65293j58605k08695k27430j76383j25882j11960j11662
18247D996965p0631k3445k8237j2880n2722q0527n0507j2723n2083o0729q271
18236D544210M92j0227r979o033q648k0581l2420q9219r2151r2067r0271q4110
18224D008996o1713n0584j3827p824l985O625j136p278q721n0148r6137n8531
18212C655737n3116n9439o3839k4154k1372n0873q3928j07748j06706j28057j26943
18201B829562r6134k6576j7729j8551j7174j5605l5769m3648m8188l0568j1925
$$ plain form
18276 8758927 8564867 8347867 8193225 8053486 7928992 7830828 7747561 7725936 7693535 7605593
18266 7605593 7539656 7435880 7270079 7136504 7014603 6842279 6661496 6554127 6475746 6406459
18256 6406459 6282875 6117582 5958977 5750282 5522852 5346469 5220587 5108627 4996965
18247 4996965 4926334 4902889 4874652 4861772 4809050 4728523 4678016 4665293 4613210 4552481 4544210
18236 4544210 4544702 4534475 4524496 4518463 4509815 4489234 4456814 4367595 4275444 4183377 4093106 4008996
18224 4008996 3947283 3896699 3882872 3875048 3871063 3877688 3876552 3869274 3860553 3810405 3714268 3655737
18212 3655737 3602621 3543182 3479343 3455189 3433817 3382944 3299016 3191268 3084562 2956505 2829562
18201 2829562 2733428 2706852 2689123 2670572 2653398 2637793 2602024 2558376 2510188 2479620 2467695
18190B467695p316l4378j4907J5421J6059L7073N3183N4798K7415l689j08988
18179B502366j35221r9846p4570k3086K7792N3165L2041k940o3774j47341j50066
18168A918520j15012o6607j9862j3514q671O909k2730n0350n8484n4029O60O746
18156A523576l3977k5145l8622j9624K734m2054k5473l503K6423J6500l3589k3838
18144A323408P694l91L849K4798N0947K9485M8101O5096Q1162L5564N7513k233
18132A724993l0540k1693k8744m8735L5176Q0486J00956J16934M7399m7779p0484
18121A857969n0148r7493k6378k7423L2125O0027R0338J16467J69304K60452M27703
18110B812943O85023J250784K558881N387135Q031097O106028N034359K968163
$$ plain form
18190 2467695 2460379 2426001 2411094 2426515 2442574 2479647 2532830 2587628 2615043 2611354 2502366
18179 2502366 2367145 2267299 2192729 2169643 2197435 2250600 2282641 2279701 2215927 2068586 1918520
18168 1918520 1803508 1736901 1717039 1703525 1694854 1701763 1679033 1628683 1570199 1516170 1516830 1523576
18156 1523576 1489599 1464454 1425832 1406208 1408942 1366888 1341415 1337912 1364335 1380835 1347246 1323408
18144 1323408 1331102 1330711 1334560 1359358 1410305 1439790 1487891 1552987 1634149 1669713 1727226 1724993
18132 1724993 1694453 1672760 1644016 1595281 1630457 1710943 1811899 1928833 1976232 1928453 1857969
18121 1857969 1807821 1710328 1683950 1656527 1688652 1748679 1839017 1955484 2124788 2385240 2812943
18110 2812943 3497966 4748750 7307631 12694766 20725863 26831891 31866250 34834413
18102C4834413r185413j0493509n233164k477625j319113p85313n52334m14791
18094D373151l06546k52850k52657k02673j26909j01788q2360j14721j09187p5667
18084B747793j17952j44931j43952q7713n7807K5459M6967Q126j344o0934j13023
18073B100689q5256n4354j8313m9587m0903k2656K5313J7900L8315j2771q7457
18062A810920q8924k9620k054L2752M5757J1958L009k177p1895r3326p8392o3005
18050A475003l6278o1514l5782q278p2767n1834j5852j8064n5120l9402j9292
18039A060820j0196l3316l3184j1015K1114J6219j7444j5358K0678j8727n498
18028I74093m755j9272p549m0989r317N039K9390N9971O0840L3965M2081j4177
$$ plain form
18102 34834413 25649000 15155491 9922327 7444702 6125589 5340276 4787942 4373151
18094 4373151 4066605 3813755 3561098 3358425 3231516 3129728 3047368 2932647 2823460 2747793
18084 2747793 2629841 2484910 2340958 2253245 2195438 2220897 2267864 2275990 2274646 2213712 2100689
18073 2100689 2015433 1961079 1942766 1893179 1852276 1829620 1854933 1872833 1911148 1898377 1810920
18062 1810920 1721996 1692376 1690322 1723074 1768831 1780789 1783798 1781621 1709726 1616400 1538008 1475003
18050 1475003 1438725 1377211 1341429 1333151 1260384 1208550 1192698 1174634 1119514 1080112 1060820
18039 1060820 1050624 1017308 984124 973109 994223 1010442 992998 977640 998318 979591 974093
18028 974093 969338 950066 942517 901528 892211 897250 926640 986611 1047451 1081416 1123497 1109320
18016A109320j3612L6339O1034N3545m209j3826j7783k0771J8071M3896J33202
18005A385206J96392J98762J95158M5322j30689r0109j4134N731j5278k01645
17995A574716j93070K6280J22935J12458J10008o979r1748j6559P102J7671j27609
17984A535205k39529k17950j39328l3181k0433l9889L779J794m1579l2837r956
17973G66096l685n17L0196O3812O5635P7929O4290M281p5722q3840o3215m7323
17961G97937M977L3809K8623M2147N8926j0631n9489n3493m2476n1031m3629l6402
17949F69268j2561m2326m7443m4175l6540k8275m793o827o369q395J403l9849
17937C93118o972k228n198o463p278k5583K910J8581K3488P01K9812J1176l3890
$$ plain form
18016 1109320 1095708 1132047 1193081 1246626 1242417 1228591 1210808 1190037 1208108 1252004 1385206
18005 1385206 1581598 1780360 1975518 2020840 1890151 1800042 1785908 1791639 1776361 1574716
17995 1574716 1381646 1407926 1530861 1643319 1753327 1746348 1654600 1638041 1645143 1662814 1535205
17984 1535205 1295676 1077726 938398 905217 884784 844895 848674 850468 808889 776052 766096
17973 766096 762411 761894 792090 855902 921537 999466 1063756 1068037 992315 908475 845260 797937
17961 797937 802914 836723 865346 907493 966419 955788 896299 842806 800330 749299 705670 669268
17949 669268 656707 614381 566938 522763 486223 457948 453155 446328 439959 431564 432967 393118
17937 393118 386146 383918 378720 372257 364979 339396 342306 360887 384375 385076 414888 426064 392174
17924C92174K89L2220N459k9897o439k3834J8588L0463J3412M0875m798m8422
17912D20090l2645j3881P934K8480J8442J6079L6357J4740K5638J8192K4075K2665
17900E86166J4469j0148p130j4041j2576J807O035j973n416J374m943J4273l814
17887E64083j0261j5864j120K9201k0406m9739j994j5954l9259j7699o844p760
17875D06384m682k1974o194k2709j0823k1146p437o983j3896j2538J1480K120
17863B91602L4991M8689P067J6965N4871J4098j073K9388J8453J610O2773P7420
17851F56854L8019L5581l3717j4099L2879M0930M2651L3158j0971j8962L476j4144
17839G91655m0365m6100J52K450K5887k3283p9087p6640m4701m5647k2432k6165
$$ plain form
17924 392174 392463 424683 430142 400245 393806 369972 388560 419023 432435 473310 468512 420090
17912 420090 387445 373564 381498 409978 428420 444499 480856 495596 521234 539426 563501 586166
17900 586166 600635 590487 583357 569316 556740 558547 564582 562609 557193 558567 553624 567897 564083
17887 564083 553822 537958 536838 566039 545633 495894 493900 477946 438687 420988 414144 406384
17875 406384 401702 379728 373534 350825 340002 318856 311419 304436 290540 278002 289482 291602
17863 291602 326593 375282 382349 399314 454185 468283 467210 496598 515051 516661 579434 656854
17851 656854 694873 730454 696737 682638 715517 756447 799098 832256 821285 802323 805799 791655
17839 791655 751290 705190 705342 707792 733679 710396 631309 554669 509968 464321 441889 415724
17827D15724l1404m388O103j1897k1574L959q232k0594j7308j4663j146J7609
17815C12189j8478k803M7895K80L247O373L4328M0449M4211L8364j1097j3862
17803D81096J0397L6491L6032R345j5821n508J0362j8166O05j3674k781J5540
17791E43918j4035o9571p9693k2132K4687J2924k8174k8232P608o502l7L1722
17779C72483J2470l6984l7517k2180O324k2209j2568j6434j3535O554L187P244
17767B46835K931k1518q914K6916J0105l0348q288p071j3275J0571K8514L3211
17755B69669K1074K0890L3870N7918Q5873R3613J09627J01708m2002q6409j16248
17744E49583q3748K435K3665Q6810P8501P6698P1145k0548j00985j45325j17924
$$ plain form
17827 415724 384320 379932 386035 374138 352564 356523 348291 327697 310389 295726 294580 312189
17815 312189 293711 290908 338803 339083 342330 348703 383031 423480 467691 506055 494958 481096
17803 481096 491493 527984 564016 573361 557540 552032 562394 544228 544833 531159 528378 543918
17791 543918 529883 460312 380619 358487 383174 396098 367924 339692 347300 340798 340761 372483
17779 372483 384953 347969 310452 288272 294596 272387 259819 243385 229850 236404 239591 246835
17767 246835 249766 228248 219334 246250 256355 226007 217719 210648 197373 207944 236458 269669
17755 269669 290743 311633 345503 403421 489294 582907 692534 794242 752240 665831 549583
17744 549583 465835 468270 491935 578745 657246 733944 805089 784541 683556 538231 420307
17733D20307o5486n6872k1427j4451j0368k3330O123J4034O238j6055k3172K1516
17721B37057j2824j0113m496N105j8740R708J3168R047j1573j7634j0255L560
17709A92010m067J0202J4749K6762J1194j7188l6762N015L1471Q6230Q0647P7343
17697D77606Q7492M2503m1961q3222r2070m4238l877J6639L0785M7347P5672M8797
17685E61473k4557n6206r4135p2243k2242j3808l5497k1206j1094k4874J0824
17674A96435J8818K4003o966K3708J7803j7058Q124M8098Q1005J14870J43562
17663F52402J80156J70371J19407J540o5682m274P0172j8089j61463k27522j31017
17652E86001o0138l6419k2287j5867o685q209R242K7399R7292J50240J79156J63195
$$ plain form
17733 420307 354821 297949 276522 262071 251703 228373 234496 248530 254768 238713 215541 237057
17721 237057 224233 214120 209624 214729 195989 205697 218865 227912 216339 198705 188450 192010
17709 192010 187943 198145 212894 239656 250850 233662 196900 201915 233386 319616 400263 477606
17697 477606 565098 607601 565640 482418 390348 346110 342233 358872 389657 437004 512676 561473
17685 561473 536916 480710 386575 314332 292090 278282 242785 221579 210485 185611 196435
17674 196435 215253 239256 232290 255998 273801 256743 264867 312965 393970 508840 652402
17663 652402 832558 1002929 1122336 1123876 1058194 1053920 1124092 1106003 944540 717018 586001
17652 586001 525863 489444 467157 451290 444605 436396 445638 473037 570329 720569 899725 1062920
17640A062920J54562M5761n1265l5764l5076N825n2423k19856k29128j15797o6916
17629D62843j7228j7265m7531l1875k6502j3048k4840r671l9680l5863J0670J8940
17617B28950L043k365R54l6565r308L2609J9550n19J9156q333l3494j9713L2298
17604B26263R337J6869l842o384O937J0573k7863L738Q529j3871K5436P254j7350
17591B45626m7342L265K8038J9264J08k443J988p796J9756k6124j5805k3570m0177
17578A54788Q381K2630j6709j5439o959R690K3724J7298L628K6409K712Q174R462
17565B47789K1861l358R551P608O5M3296O1314J10451J62162J38815J00450O6585
17553I66589j24389k29286j38196n6391l7860K9506R4762J16691J39288J14792
$$ plain form
17640 1062920 1217482 1263243 1211978 1176214 1141138 1146963 1094540 874684 645556 529759 462843
17629 462843 445615 428350 380819 348944 322442 309394 284554 274883 235203 199340 210010 228950
17617 228950 231993 229628 230582 194017 184709 217318 236868 236349 255505 247172 213678 193965 226263
17604 226263 235600 252469 248627 242243 249180 259753 231890 235628 244157 230286 255722 262976 245626
17591 245626 198284 201549 229587 248851 248959 246516 248504 240708 260464 234340 218535 194965 154788
17578 154788 163169 185799 169090 153651 146692 156382 180106 197404 201032 227441 230153 238327 247789
17565 247789 269650 266292 275843 283451 283516 326812 388126 498577 660739 799554 900004 966589
17553 966589 842200 612914 474718 418327 380467 409973 504735 621426 760714 875506
17543H75506Q6873J0942j46971j76392j14983j0137N7985J30999J60706J32040
17533A006568J04865n6886k47628k10942j11721l5149R783M5425P4161J54816
17523G33292J50346Q1980L5586j14490k54903j67397r4221m3974Q339j4499M850
17512C24909k5383l564J2161Q5P402k0552l8296K0388J5072r355K567q701m1053
17499B35680j6845j4099m964j9963l385J6655K541K2847K2k6598O006O793J3507
17486B18197j332k1539K197J9877K636M903j4223J4734q037k4286l3965r630k150
17473A47382L1074K965J9440M305O586J6174K0903q984k1742j6991j5301m1584
17461A44227j9645K033J3994L8357J5550J2682o199M117J7143l0208k8084j3523
$$ plain form
17543 875506 962379 973321 826350 649958 534975 524838 582823 713822 874528 1006568
17533 1006568 1111433 1054547 806919 595977 484256 449107 458890 504315 578476 733292
17523 733292 883638 965618 1001204 886714 631811 464414 370193 326219 334558 320059 324909
17512 324909 299526 295962 308123 308208 315610 295058 256762 277150 292222 282867 285434 276733 235680
17499 235680 218835 204736 199772 179809 176424 193079 195620 218467 218489 191891 197897 204690 218197
17486 218197 216865 195326 197523 217400 220036 224939 210716 225450 217413 193127 159162 149532 147382
17473 147382 178456 181421 200861 205166 211752 227926 248829 239845 218103 201112 185811 144227
17461 144227 124582 126615 140609 178966 194516 207198 200999 205116 222259 192051 163967 150444
17449A50444J7645M194p271k511J9627N1073J507j0395j7439J7761N6423M8284
17437C29342L6888M347p2174o9831l9250O841M928n1503o278j2373l1265j2731
17425H6941n073M1690J4898K564J6455K1287k93K4820r204p437k869J5090L791
17412B02660L1805N9787N4087Q6096P0532j8451j00981q0112m0267P005K3304
17401B95465M3263L0442L4646L4225l3716o6522m2616m5852k7071k122l79p730
17389B12033p78k0205j3892M392K8420j8579l9053k9150k953J8990m458J4931
17377A49698L1561J4178O517l437o901O748L2259K1683J2273N017K2991L4603
17365C27190M8100J13150O3650N8298L8773l1014k4730M216M6323m7260n6043
$$ plain form
17449 150444 168089 172283 165012 162501 182128 233201 234708 224313 206874 224635 281058 329342
17437 329342 366230 370577 298403 228572 189322 196163 201091 149588 143310 130937 99672 86941
17425 86941 81868 123558 138456 141020 157475 178762 178469 203289 194085 186648 183779 198869 202660
17412 202660 234465 294252 348339 434435 504967 486516 385535 305423 265156 272161 295465
17401 295465 338728 369170 403816 438041 404325 337803 295187 249335 222264 220142 219763 212033
17389 212033 211255 191050 177158 181550 209970 191391 152338 123188 120235 139225 134767 149698
17377 149698 181259 195437 201954 198517 191616 198364 230623 252306 264579 269596 292587 327190
17365 327190 375290 488440 552090 610388 649161 618147 593417 597633 643956 596696 540653
17354E40653R742J2755J6695m655l4634o423q158o41j3346m9394p521k594k6105
17341D26374r091o819k3312l5787k6190k2191j4197j7368K3891K827j2163l3779
17329B52195l814J5169K2161k1820%o333j1723j996L023J4036o259J5021N393
17316B75053l6102J9019Q5554N8064J4802K3904m3253o9651p768J6803j4997p271
17304C14157J5348K3778L0599O3727O216l9921j6507J0582j5808M932j7684j7216
17292C62203j3891l739N893K5869P872k8344j4345o597P584M9404K5524r729j4335
17279C93369k4664m3385r617J2648J4095k8012n5621J5228M8091J5117j0143l7739
17267B89367L2488K3161j6891n021p346j0821J1864m223N617j8455N767L2355
$$ plain form
17354 540653 550395 563150 579845 575190 540556 534133 525975 525334 511988 462594 455073 452479 426374
17341 426374 417283 410464 387152 351365 325175 302984 288787 271419 295310 298137 285974 252195
17329 252195 248381 263550 285711 263891 263891 257558 245835 243839 246862 260898 254639 269660 275053
17316 275053 238951 257970 343524 401588 416390 440294 397041 327390 319622 336425 321428 314157
17304 314157 329505 353283 383882 447609 453825 413904 397397 407979 392171 397103 379419 362203
17292 362203 348312 344573 350466 376335 384207 355863 341518 334921 342505 391909 417433 407704 393369
17279 393369 368705 325320 315703 328351 342446 314434 258813 274041 322132 337249 327106 289367
17267 289367 321855 345016 328125 323104 315758 304937 316801 312578 318195 299740 305507 337862
17255C37862N3432P448l6957k4624j381K0280L640Q490K6162N4630O5031K5969
17243E39982N5660R1520J26010J61646J01211L7067N7253J5559J6183R760j9026
17232A192825n0487j12187j13912n4072l3154k9631k5983j6724J5002L3020M9049
17221H53746P9212J36176K12328J92682J76339J41416K6539l3543j8522K9441
17211A795814k5558r4082j46072j19099r1206n0157j8359m5366n2956l1467n518
17200A115974L60k4339l5637l1795m693K1946k1683j4120L0184P185n540N9618
17188A097460n895m4381m9986k685K3834M0755L0555J2280P263J9247K360m481
17176A126326l5212j8414k6878L985M1508p015P403J3111J3433l433j385j9656
$$ plain form
17255 337862 391294 398742 361785 337161 335780 356060 359700 368190 394352 448982 514013 539982
17243 539982 595642 687162 813172 974818 1076029 1113096 1170349 1185908 1202091 1211851 1192825
17232 1192825 1142338 1030151 916239 862167 829013 799382 773399 756675 771677 804697 853746
17221 853746 932958 1069134 1281462 1474144 1650483 1791899 1818438 1784895 1766373 1795814
17211 1795814 1770256 1676174 1530102 1411003 1319797 1269640 1251281 1205915 1152959 1121492 1115974
17200 1115974 1116334 1091995 1056358 1024563 1019870 1041816 1020133 1006013 1036197 1043382 1037842 1097460
17188 1097460 1091565 1047184 997198 994513 1018347 1059102 1089657 1101937 1109200 1128447 1130807 1126326
17176 1126326 1091114 1072700 1045822 1049807 1091315 1084300 1091703 1104814 1118247 1114814 1113429 1093773
17164A093773k1130J7537k20j588j9289J1277M5741M2071M8981P2962L2022P98
17152A322935K1395K0543P3143P7740O2426O6563Q4658J06068J83699K15015J64744
17141B398929J18835J07640J14565J84646K68469K40478R7493N7846R9153J96599
17131C884653K65689K62602J78573K51135M26374N22586O31567P64038R12948
17122H100165J188821J526217J917023K606940M077835P358859J3870004K3389800
17114F4035664K7933646K4094240K1919007J0210384p215227l632189L141264
17107A40486789N462139r103421l3515373l1361666j7493661q801851m415748
17100D1257208j937205l10031J163158L089230O629691J3920126K6712823L8426371
$$ plain form
17164 1093773 1072643 1090180 1089960 1088372 1069083 1080360 1126101 1168172 1217153 1290115 1322137 1322935
17152 1322935 1344330 1364873 1438016 1515756 1578182 1644745 1729403 1835471 2019170 2234185 2398929
17141 2398929 2517764 2625404 2739969 2924615 3193084 3433562 3531055 3588901 3688054 3884653
17131 3884653 4150342 4412944 4591517 4842652 5269026 5791612 6423179 7187217 8100165
17122 8100165 9288986 10815203 12732226 15339166 19417001 26775860 40645864 64035664
17114 64035664 91969310 116063550 137982557 148192941 140977714 137345525 140486789
17107 140486789 145948928 136845507 103330134 71968468 54474807 45672956 41257208
17100 41257208 39320003 39009972 40173130 43262360 49892051 63812177 90525000 128951371
17092A28951371L6818719L1992858K3871326m144750j2431330p44608N840747
17085B10154333j451911l6283023n1149453l4172912j8517342j0354522o439189
17078E1785981m513651l436430k827643k454446k182422j949592j750562j673532
17070C0997703j564256j364496j211990j027999r18243q70358q12671o86795n51534
17061B1989361m67023m86489m42781m09994m11962m87680o03344n52742m70031
17052A7657315m66950n40437o85906o80161m66430l44778l33680k99742k23416
17043A3615815k16978k43049k34117j52672j43672j35969j51871j60547j50108
17034A2026832j16749k7160P361o5040p3359j68324l50891k92952o8095R1960
$$ plain form
17092 128951371 165770090 197762948 221634274 217489524 205058194 204313586 210154333
17085 210154333 208702422 172419399 121269946 87097034 68579692 58225170 51785981
17078 51785981 47272330 43835900 41008257 38553811 36371389 34421797 32671235 30997703
17070 30997703 29433447 28068951 26856961 25828962 24910719 24040361 23227690 22540895 21989361
17061 21989361 21522338 21035849 20593068 20183074 19771112 19283432 18680088 18127346 17657315
17052 17657315 17190365 16649928 15964022 15283861 14817431 14472653 14138973 13839231 13615815
17043 13615815 13398837 13155788 12921671 12768999 12625327 12489358 12337487 12176940 12026832
17034 12026832 11910083 11882923 11890284 11825244 11751885 11583561 11232670 10939718 10871623 10963583
17024A0963583K00780J91857K13346J79726j06929j30691p448n2053o0569K36624
17014A1628226N15658O38522P28337O93563P01003Q82312J198879J871498L036263
17005B1894261N314743J0076970K0300048L6175960L9637770K7983122K4466367
16998A85849241j0107611n4370388l9172087j8216728o752009P14423Q944420
16991F6889261K2433270L6675218L2407573K3575921J6088631l1467508n2651580
16984A13950786k9655544j1328303J090824J4365850K4106405J9252191J5537171
16977A47319380N998354l0886262l5516888j8897984q606078k831728K251989
16970E8830783R859233K1351860K5308103J7470153J5319222o098168l9247926
$$ plain form
17024 10963583 11164363 11356220 11569566 11749292 11642363 11511672 11504224 11452171 11391602 11628226
17014 11628226 12143884 12782406 13510743 14204306 14905309 15787621 16986500 18857998 21894261
17005 21894261 27209004 37285974 57586022 93761982 133399752 161382874 185849241
16998 185849241 175741630 121371242 82199155 63982427 57230418 57944841 66889261
16991 66889261 89322531 125997749 158405322 181981243 198069874 166602366 113950786
16984 113950786 84295242 72966939 74057763 88423613 112530018 131782209 147319380
16977 147319380 153317734 122431472 86914584 68016600 59410522 56578794 58830783
16970 58830783 68690016 90041876 115349979 132820132 148139354 142041186 102793260
16963A02793260l0690437j6150076q741527n196115l490182k594357j927324j461736
16955C2541506j155112j063375j129884j168060j257871j296763j137042r70127
16947B3363272p67255n61075m81696m39777m27705n40192p86497q20015o30395
16938A7908665m85327m48519l78875l07196k90607k59721k83683l00506l52447
16929A4801784m91284n11510l83004l21466l02115k71323k75504k89954l23139
16920A1632485l06506k28370k03312k17081k10535j60069j64470k28159k07890
16911I706093k42058k04196k08301k00601j87015j75086j71216j52514k03277
16902G961829j68279j46063j89230j69589j14154j20381j51651j25102j20473
$$ plain form
16963 102793260 72102823 55952747 47211220 42015105 38524923 35930566 34003242 32541506
16955 32541506 31386394 30323019 29193135 28025075 26767204 25470441 24333399 23363272
16947 23363272 22596017 22034942 21553246 21113469 20685764 20145572 19359075 18539060 17908665
16938 17908665 17423338 16974819 16595944 16288748 15998141 15738420 15454737 15154231 14801784
16929 14801784 14310500 13798990 13415986 13094520 12792405 12521082 12245578 11955624 11632485
16920 11632485 11325979 11097609 10894297 10677216 10466681 10306612 10142142 9913983 9706093
16911 9706093 9464035 9259839 9051538 8850937 8663922 8488836 8317620 8165106 7961829
16902 7961829 7793550 7647487 7458257 7288668 7174514 7054133 6902482 6777380 6656907
16893F656907j16137r6745j07587j35199j38439j41553j10646q9521q8368p8717
16883E553995j08982q8684q9462q3286p0663n8902L4427J08175M1916k8837m5521
16872E164176r1717j25873j46194j62795j55537j14434l703O3559J06754M5538
16862D579774j4661j9874p8706j41940j22712j15132m1503K3656M3119l0851l7970
16851D043200l2414p1293j30279j14916j09458j02562m3834o25M0969M4875J6174
16840C539837j720r067j10730j41899j24517j00780q1064n1037l5517n0270k4625
16829B808611o7030q8743l8104l7858n9480m7651k3826n9769o4461n1316l7532
16818B232841k0906n0988l2474k6255k8129m5997o2249k3409l0898q0203o6410
$$ plain form
16893 6656907 6540770 6444025 6336438 6201239 6062800 5921247 5810601 5721080 5632712 5553995
16883 5553995 5445013 5356329 5266867 5183581 5112918 5054016 5088443 5196618 5238534 5209697 5164176
16872 5164176 5072459 4946586 4800392 4637597 4482060 4367626 4363923 4427482 4534236 4579774
16862 4579774 4565113 4545239 4466533 4324593 4201881 4086749 4045246 4068902 4112021 4081170 4043200
16851 4043200 4010786 3939493 3809214 3694298 3584840 3482278 3438444 3437819 3478788 3523663 3539837
16840 3539837 3538117 3529050 3418320 3276421 3151904 3051124 2970060 2919023 2883506 2833236 2808611
16829 2808611 2741581 2652838 2614734 2576876 2517396 2469745 2445919 2386150 2321689 2270373 2232841
16818 2232841 2211935 2160947 2128473 2102218 2074089 2028092 1965843 1942434 1911536 1831333 1764923
16807A764923j9183j0353J1743k3326o282o252l2771m0046l6952k8989l8186m4041
16795A490285k4062l626M85n52l3380j3581m5250n7600m6537j2493L856M245n763
16782A256027p975J7051R125j8630l1646n4946l2424l275j6658m0307j6035P788
16770A068095l5091k9499r863k3396k4806K169j2333j4414m094K073o905j0022
16758I01914j0400o946k3268m9685k8816J689j5844j0811J1995j0430j1914r835
16746G37649j9283l2817k9950j236K12j0747j4163L797r367j4507N048k3469k6204
16733E64963j4990m49L843K2229m496j7343j0894j6931k4213o424K6646k3684
16721D98257j2708n3331l7553Q612P259L1178J6317j4700M220k552m34j0969L1415
$$ plain form
16807 1764923 1745740 1735387 1747130 1723804 1717522 1711270 1678499 1638453 1601501 1572512 1534326 1490285
16795 1490285 1466223 1462597 1463082 1462530 1429150 1415569 1370319 1312719 1266182 1253689 1257545 1261790 1256027
16782 1256027 1248052 1265103 1274228 1255598 1223952 1169006 1136582 1133307 1116649 1076342 1060307 1068095
16770 1068095 1033004 1003505 993642 970246 945440 947609 935276 920862 916768 918841 911936 901914
16758 901914 891514 884568 861300 811615 782799 784488 768644 757833 769828 759398 747484 737649
16746 737649 718366 685549 655599 654363 654575 643828 629665 633462 624095 609588 614636 591167 564963
16733 564963 549973 549524 553367 575596 571100 553757 542863 525932 501719 495295 521941 498257
16721 498257 485549 432218 394665 403277 410536 441714 458031 443331 447551 444999 444565 433596 465011
16708D65011o3J3876k0897l2968l3825Q908N020k797j8479l4051p312J8618J4704
16695C75745j4480j5034J9101K2710j1655l7225m591n323r476l4917J0815R304
16683C04974J927K637n217k947j6281j4247L2027K1558O091N041k0130j7065j6757
16670B81611k9704L598r508k3358J6091M080l835j2135l000M0865K6989j0693
16658B81001j1540j3794P054Q439j964k3504l9276k4998M031K400R306j557K8599
16645B24197j7297q391O054j4246m8352k350J0866L883N698J2684J2781M912q196
16632A82243l6308j8943J5527J7767j7325q230J0620M896k5707k3345j3443O559
16620I4311j3743k0555o467L131M691K9359L6243L9059M00l1269l7369r388J9280
$$ plain form
16708 465011 464948 478824 457927 424959 391134 400042 405062 402265 383786 349735 342423 361041 375745
16695 375745 361265 346231 365332 388042 376387 339162 334571 329248 319772 284855 295670 304974
16683 304974 306901 309538 304321 301374 285093 270846 302873 324431 330522 335563 315433 298368 281611
16670 281611 251907 255505 245997 222639 238730 242810 238975 226840 223840 264705 291694 281001
16658 281001 269461 255667 262721 271160 269196 245692 206416 181418 185449 187849 197155 195598 224197
16645 224197 206900 198509 204563 190317 141965 139615 150481 154364 160062 172746 185527 190439 182243
16632 182243 145935 126992 142519 160286 142961 134731 145351 150247 124540 101195 87752 94311
16620 94311 80568 60013 53546 56677 61368 90727 126970 166029 166429 135160 97791 88403 107683
16607A07683K2672J3332J7177O863n676j8422J8254J5391K7198o121j6382J4011
16595A95980K0233J287J0529O6041J0804l0739m5248m2793j455J7576Q126Q377
16583B18718L6800L9676M4567O5940K1772l463j7133n0558p8206J0536M3764K8383
16571C60796N8274J8621m5342o5193p4675l6690N575O6272K5951K2575L2547R7321
16559D66032Q0022O7131J32301J67016J14617R7090O2706k4776J627l415m609
16548A155742r6170k36507k32738j37476k7673j9917J0819J0237l4630k0598K3896
16537C94985N7665R4340J25723J60575J56579R0184J0467k2029l8832r152k213
16526A018292j50265k35714j77236p4878p2187q3478k0963J3293J3271j834J6778
$$ plain form
16607 107683 130355 143687 160864 167727 162051 143629 161883 177274 204472 198351 181969 195980
16595 195980 216213 217500 228029 294070 304874 274135 228887 186094 184639 202215 210341 218718
16583 218718 255518 295194 339761 405701 427473 424010 406877 356319 278113 288649 332413 360796
16571 360796 419070 437691 392349 327156 252481 215791 221366 287638 313589 336164 368711 466032
16559 466032 546054 613185 745486 912502 1027119 1124209 1186915 1162139 1163766 1160351 1155742
16548 1155742 1059572 823065 590327 452851 425178 405261 416080 426317 391687 371089 394985
16537 394985 452650 546990 672713 833288 989867 1080051 1090518 1068489 1029657 1020505 1018292
16526 1018292 868027 632313 455077 380199 308012 224534 203571 216864 230135 228301 245079
16515B45079m0615m09j0201k7061k6524l584J5397L027n125o648K2779j6702j2984
16502A36429r038o5j0297l6168r901K8126L461J6931J6649J5551k6818k9188J7405
16489A13077l33j3633L513m707j8488J0190J2890k6820n557j3944q990K2352r904
16476E9646j6894l666J1368L3010j8625J1211K7057p70j7749L977K4936q299M816
16463A10018j8814M531L746j8082n12Q233j0055J9090n789j0728j5341J3823R418
16450H9538r828O035L6679M3669L9J0753P3833R0919J19288J75767J55535R5211
16438H87438o5451j98882j70176q2827k9627J9158K1041J28672J65440J13355
16428G88141Q9615P2191p1583k18333j52329m8520J3421J09454J79362J17660
$$ plain form
16515 245079 204464 204055 193854 166793 140269 136685 152082 155109 149984 143336 166115 149413 136429
16502 136429 127391 127326 117029 80861 70960 99086 102547 119478 136127 151678 124860 95672 113077
16489 113077 112744 99111 102624 97917 79429 89619 102509 75689 70132 56188 47198 69550 59646
16476 59646 42752 39086 50454 83464 64839 76050 103107 102337 84588 88565 113501 105202 110018
16463 110018 91204 95735 99481 81399 80887 89120 79065 98155 92366 81638 66297 80120 89538
16450 89538 79710 85745 122424 166093 166132 176885 250718 341637 460925 636692 792227 887438
16438 887438 821987 623105 452929 370102 340475 359633 380674 509346 674786 788141
16428 788141 877756 949947 878364 660031 507702 459182 472603 582057 761419 879079
16418H79079N9194L6162j48439k05126j04920o9228l493L9620J08082J51327J55930
16407H98188J42760J21305Q548j85196j97991r1746l9013m5632k7279j7243l3364
16396E33337n7070l7872k332j9862k1373k5447k111k7110n6224n2768l2975J5840
16384B14033q464N539L0308r743m717j8583l3179l4854K0925o569j3871j695j426
16371A37704N240k3822k0749K4950K6843n345j1496o032J0191O158j0937n1784
16359H0921K830L6909J3353k5240l0782K884M6433J0972l2171m2179n550o176
16347E2204M297m501l959R699R910m911k3852k5022Q828J9047J7913J4176J790
16334G5619R806J1475J2478O167K1695j2766j3003k3925j6021p603j5587j5527
$$ plain form
16418 879079 938273 974435 825996 620870 515950 446722 443229 482849 590931 742258 898188
16407 898188 1040948 1162253 1170801 985605 787614 695868 656855 611223 583944 566701 533337
16396 533337 476267 438395 436063 416201 394828 369381 367270 340160 283936 231168 198193 214033
16384 214033 205569 211108 241416 231673 226956 208373 175194 140340 161265 154696 140825 139130 137704
16371 137704 142944 119122 98373 123323 150166 144821 133325 127293 137484 143642 132705 80921
16359 80921 83751 120660 134013 108773 77991 80875 127308 138280 106109 63930 58380 52204
16347 52204 56501 52000 48041 57740 67650 62739 38887 13865 22693 41740 59653 73829 75619
16334 75619 85425 96900 109378 115545 137240 124474 111471 87546 71525 63922 48335 32808
16322C2808R908K3491J5439Q757k4571j4438l3997k2693j847l734J0301j2497
16310a3073J4159K7334J345j0331K7511r481q512R186R755L370k3563J122J7457
16297D6279P012J3350K299j4266j7747j9688M387k4217P479J3336p274M690K9798
16284D5438J1240j6335j8221J8279P638j9351J1289J9443j6145k6728j1131J7091
16272B2507K7827m59J1018J3281m0406j3363j755Q111M348O168J6297j3491j6371
16259B3712K9484L6214j3639j5987J1417q893j0475k1019k2970O736j83j1660
16247B737j43j2190k2964K0567J5212j6528l1728K2998N4488n185j5913J652k111
16234A0892Q304J9336N8336M3698J7763L9433K5618J5842K7530J8929L8901p68
$$ plain form
16322 32808 42716 66207 81646 90403 65832 51394 17397 -5296 -7143 -10877 -576 -13073
16310 -13073 1086 28420 29765 19434 46945 37464 28952 38138 47893 51263 27700 28822 46279
16297 46279 53291 66641 68940 54674 36927 17239 21626 -2591 4888 18224 10950 15640 45438
16284 45438 56678 40343 22122 40401 48039 28688 39977 59420 43275 16547 5416 22507
16272 22507 50334 49875 60893 74174 33768 20405 18650 26761 31109 37277 53574 40083 23712
16259 23712 53196 89410 75771 59784 71201 62308 51833 30814 7844 14580 14397 2737
16247 2737 2594 -9596 -32560 -11993 3219 -13309 -45037 -22039 32449 27264 11351 13003 10892
16234 10892 19196 38532 96868 140566 158329 197762 223380 239222 266752 285681 324582 323814
16222C23814m5051n1395j9006K0239l0379p7829m1524j8964K834J7115K1357J141
16210A02352L3686K4697K6066J802L1839K0038J5392J3528k0970k9313j4383R743
16198B14477k2064j878j8097m2482k5689j1922J4713J3809n260m556r990l3387
16186F7674k5418J508L6071K387k101l0576J3043J1973n490q327K151J5765P840
16173H6500J5034l987M927o482k4521M31r912K2730J2750q71J209j5741O220r054
16159G9233m3350k2340L2850L0853p448l281o153n272J557j4002l636l797m277
16146C0937O228j8622j2434M378Q492o419j4998M754P636O130J2473J4179k8877
16133A3857j0579p655O294K9764j0868j0188J825J8377M303l55n255j1158R018
$$ plain form
16222 323814 278763 227368 208362 228601 198222 120393 78869 59905 62739 79854 101211 102352
16210 102352 136038 160735 186801 188603 220442 240480 255872 269400 248430 219117 204734 214477
16198 214477 192413 190535 172438 129956 104267 92345 107058 120867 115607 111051 101061 67674
16186 67674 42256 43764 79835 82222 80121 49545 62588 74561 69071 60744 62895 78660 86500
16173 86500 101534 97547 102474 95992 71471 71902 61990 84720 97470 96599 97808 82067 88287 79233
16159 79233 35883 13543 46393 77246 69798 66517 60364 55092 56649 42647 39011 35214 30937
16146 30937 37165 18543 6109 10487 18979 12560 -2438 2316 9952 16082 28555 42734 13857
16133 13857 3278 -4377 1917 31681 20813 10625 12450 30827 35130 34775 29520 18362 27380
16120B7380o711J5577J8052J6518j487k8284M45J0187j2654k9993j6914J4106
16108F222J9716J7453J3096j4380l4136P001j4932P951K3341o5j945J5699k088
16095D2933K989K1478o317k2125l1402P22N795J8148J6889o150l7507k2700J4277
16082b970K4436l129k806J9811J475J2481l5491k7143L412j0849j8577J6757J1671
16069a0922P791M355K1091o455L184k0368j1024J3829J7700j8603j9376m569J1357
16056a2010P373j6772p361K5749J8837K4097K3424P604Q50j3153j4308J0168j5831
16043C8667j9313L137K258n503K0389j7739n870J3238K2853j5273j9749q500J2790
16030B1385k671p34j0115k9737J270J8927j4371K7985K9325J3298p737k2220l4531
$$ plain form
16120 27380 20669 36246 54298 70816 69329 41045 41490 51677 39023 9030 -7884 6222
16108 6222 25938 43391 56487 42107 7971 14972 40 7991 31332 31267 29322 45021 42933
16095 42933 45922 67400 61083 38958 7556 8278 14073 32221 49110 42960 5453 -17247 -2970
16082 -2970 21466 18337 15531 35342 36817 49298 13807 -13336 -9924 -20773 -39350 -22593 -10922
16069 -10922 -3131 1224 22315 15860 19044 -1324 -12348 1481 19181 578 -18798 -23367 -12010
16056 -12010 -4637 -21409 -28770 -3021 15816 39913 63337 70941 71791 58638 44330 54498 38667
16043 38667 19354 22491 24749 19246 39635 21896 16026 29264 52117 36844 17095 8595 21385
16030 21385 18714 17980 7865 -21872 -20602 -1675 -16046 11939 41264 54562 46825 24605 -9926
16017i926l090N6317M3069k9794m2320j2584N747K5068j6437n629J9730K158l866
16004B8443J338Q608J4367J5336l182J650j8248o516n440J4033l041l8105p688
15991A555M851K3488J7275J1559J0991J827m201l6783j9861J2271K2328k2530
15979B2770J5712L3189p888k0208p571j3947n790j4L338K6713K0768k2480j3170
15966C1422j2285p745K4458J7403j549k722j8147r710k0844m164J8480K4000j8163
15953B0434L110K9022L304J5563L061O598n02j7858k8527r463K5136P770L618
15940F1266K3210k6446j6941k2660L299K404l035L649L1509J3264J8192k7534
15928F0177k0051p510l406l002j1636K044p480n537P13M3528Q857j3213j0091
$$ plain form
16017 -9926 -13016 43301 86370 56576 14256 1672 7419 32487 16050 10421 30151 32309 28443
16004 28443 29781 38389 52756 68092 64910 66560 48312 41796 36356 50389 47348 9243 1555
15991 1555 6406 29894 47169 58728 69719 71546 67345 30562 10701 22972 45300 22770
15979 22770 38482 71671 63783 43575 36004 22057 16267 16253 19591 46304 67072 44592 31422
15966 31422 19137 11392 35850 53253 51704 48982 30835 21125 281 -3883 14597 38597 20434
15953 20434 23544 52566 55870 71433 74494 81092 80590 62732 34205 24742 49878 57648 61266
15940 61266 84476 58030 41089 18429 21728 24132 21097 24746 56255 69519 87711 60177
15928 60177 40126 32616 29210 26208 14572 16616 9136 3599 4312 47840 56697 43484 33393
15915C3393j1726j744K1032J7317j4199k7698J493K7603Q847J9224j5269k3409
15903C4864m170j2322K230J9136K3478J0112O421R750R672l1923k2498q03K2721
15890F6668r809k1891j4544Q319l008Q687K7439k612j0590P062J5058K7625Q94
15877I9298l0197k3416K1606L6807J2836k2281j0750n97k1915j9159J6369O702
15865F5303j0437k4255K0308r75k6675M171J3891j3478k5301J9789K7307j8249
15853C1399k9914M804R595J6155k225m8612J3591M5538j493j0232K4212P16l421
15840E0113L994N852k7907j0109J6597L048o049J9589o710k4110j2489L501J3464
15827B8784n6783k1724J7320J6842L0694J5913J842k187q235p494L241l808M2305
$$ plain form
15915 33393 21667 19923 40955 58272 44073 16375 17868 45471 54318 73542 58273 34864
15903 34864 30694 18372 20602 39738 63216 73328 79749 89499 99171 67248 44750 43947 66668
15890 66668 56859 34968 20424 28743 25735 34422 61861 59249 48659 55721 70779 98404 99298
15877 99298 69101 45685 67291 104098 116934 94653 83903 83306 61391 42232 58601 65303
15865 65303 54866 30611 50919 49944 23269 27440 41331 27853 2552 22341 49648 31399
15853 31399 1485 6289 15884 32039 29814 -18798 -5207 40331 38838 28606 52818 53534 50113
15840 50113 54107 59959 32052 21943 38540 41588 35539 55128 48418 24308 11819 15320 28784
15827 28784 -27999 -49723 -32403 -15561 15133 31046 32888 30701 22466 14972 18213 14405 56710
15814E6710L8569P37l1636k1866j402J5041j8450o592j495J0069K4072J0645Q70
15801G5272k9550r449k1885Q03J4586J9376m099N117j3854j3836r03O32J0227
15788C2437n714R953J1551p048p216j0208J2203j6404l1646k05J967k8959J1909
15775b7380L1801L7093j8861m546J4643Q119L777k2925j2755j1864k6596J8848
15763a0646M053J6766K0966n071j0846l6331J2529M0108J8506k4342q014j3455
15751D223J0773K4791M077k471k1386N165J9410j6167l9724K6862K6730N46P665
15738E0494o528Q87o695j9679k1415J8616j5533Q521j364o191J0772K6066J0199
15725D8150j1853j3557j4792j503m298q432J9650P932J1203r282j1325L391l940
$$ plain form
15814 56710 95279 96016 64380 42514 41112 56153 37703 31111 29616 39685 63757 74402 75272
15801 75272 45722 36273 14388 15191 29777 49153 45054 50171 36317 22481 21578 22210 32437
15788 32437 26723 36676 48227 41179 33963 23755 35958 19554 -12092 -12297 -10330 -39289 -27380
15775 -27380 4421 41514 22653 18107 32750 40869 44646 21721 8966 -2898 -29494 -10646
15763 -10646 -6593 10173 31139 26068 15222 -21109 -8580 31528 50034 25692 17678 4223
15751 4223 14996 39787 43864 41393 20007 25172 44582 28415 -11309 15553 42283 42829 50494
15738 50494 43966 44853 38158 18479 -2936 15680 147 8668 7304 1113 11885 37951 48150
15725 48150 36297 22740 7948 6445 2147 -6285 13365 21297 32500 23218 11893 15284 11344
15712A1344J3475m48K0344J4034j2665l7825o598K5427M1993p789m2967r926P371
15699A5770Q555r609J1379K1847n525q537l713j5482j8706m539l2271K4564J6549
15686B82j8441k8232J9480K6562j8641k027J2498R228l196r421J6603J8215j110
15673B1800r565k7803J5734r312k0129L366J6960L47M255o003j985o272J6577
15660b030k1883q998K5297Q787k2982Q660J3212L803J5205P634k1004o297Q273
15647G677r154L2J6841J0441k1386q054k214R793r706l8704n390o851p882R589
15633e4968J3926N283J8160o275k4261k0234o984J2146j525j0195K6041K4636
15621b4250o051n99J288J1020L805q517K2194J9987k8731p352p360Q63J6827l0214
$$ plain form
15712 11344 24819 24371 44715 58749 46084 8259 1661 27088 69081 61292 18325 8399 15770
15699 15770 24325 14716 26095 47942 42417 33880 30167 14685 -4021 -8560 -40831 -16267 282
15686 282 -18159 -46391 -26911 -349 -18990 -21017 -8519 709 -2487 -11908 4695 22910 21800
15673 21800 12235 -15568 166 -9146 -29275 -25909 -8949 -8602 -4347 -10350 -12335 -18607 -2030
15660 -2030 -23913 -32911 -7614 1173 -21809 -13149 63 3866 19071 26705 5701 -596 7677
15647 7677 -1477 -1445 15396 25837 4451 -3603 -5817 3976 -5730 -44434 -49824 -56675 -64557 -54968
15633 -54968 -41042 -35759 -17599 -23874 -48135 -68369 -75353 -63207 -64732 -74927 -48886 -24250
15621 -24250 -30301 -30900 -29612 -18592 -14787 -23304 -1110 18877 -9854 -17206 -24566 -23703 -6876 -37090
15607c7090j2606J7628J5289N857j0370p350J7354r285P69j1201n578P643P013
15594b1927j6516q902M499Q4N425Q723o400j475J0013o78J3956Q087K588k122
15580d645j1357j9469l3906P865K7069K738L726J049n364K921P820K2639j1173
15567a0087j5830J1117K5791j4516j1055p297J7201M367j3230o235j8311m604
15555d2689M114Q858L768J0929K2562j1213k3776j97L5526J4311k7778r131k0494
15542c5210j5655J6208M1741K168L904L617l192J95j3654j3831K8035N20j1999
15529B847m320j6884k989J0525L1270L4305o183j9641k9080M36j0313j9149R15
15516b8261L0004O301k7438j7490j2112K1414L456j0120j3076j5739K246K2448
$$ plain form
15607 -37090 -49696 -32068 -16779 -10922 -21292 -28642 -11288 -20573 -19804 -31005 -36583 -28940 -21927
15594 -21927 -38443 -47345 -42846 -42762 -37337 -28614 -35014 -36489 -26476 -27154 -13198 -5111 -2523 -4645
15580 -4645 -16002 -35471 -69377 -61512 -34443 -31705 -27979 -26930 -32294 -29373 -21553 1086 -10087
15567 -10087 -25917 -14800 10991 -3525 -14580 -21877 -4676 -309 -13539 -19774 -38085 -42689
15555 -42689 -38575 -29717 -25949 -15020 7542 -3671 -27447 -27644 7882 22193 -5585 -14716 -35210
15542 -35210 -50865 -34657 7084 9252 13156 16773 13581 13776 122 -13709 14326 14846 2847
15529 2847 -1473 -18357 -21346 -10821 20449 54754 48571 28930 -150 286 -10027 -29176 -28261
15516 -28261 1743 8044 -19394 -36884 -48996 -27582 -24126 -34246 -47322 -63061 -60815 -38367
15504c8367Q123J6369K161M892L117J3011j6488l3289j1543l121K5346P052J6037
15491f700K9842M1544k5799j0140J570j0053J6886K58o474j5690r113R50l0784
15478b3703r444k8314n682J3411L3421M5865o105j9775k0868J3576j5903j5375
15466c8896K3265J9591R143j9861l757j6940k29j1989Q048L0290L6899r252j0268
15453A6044j9299j7431J4617k0143k0899j4512o974L8999J7062J5652j4740j6034
15441b7658J6381M5331J8394k1382l6132l470j0254Q272n839L4025j220k8738
15429a2290N55K8901q27J4148N648r913j0580l0786l0850K2641K1017M1927J1178
15416E0769k8279k49j3731j6415J6514p393q276K1551L0784j8836N744j119j2725
$$ plain form
15504 -38367 -30244 -13875 -11714 -6822 -3705 9306 -7182 -40471 -52014 -55135 -29789 -22737 -6700
15491 -6700 23142 64686 38887 28747 30317 20264 37150 37408 30934 15244 6131 7081 -23703
15478 -23703 -33147 -61461 -67143 -53732 -20311 25554 19449 -326 -21194 -7618 -23521 -38896
15466 -38896 -15631 3960 13103 -6758 -10515 -27455 -27684 -39673 -31625 -1335 35564 26312 16044
15453 16044 -3255 -20686 -6069 -26212 -47111 -61623 -68597 -29598 -12536 3116 -11624 -27658
15441 -27658 -11277 34054 52448 31066 -5066 -8536 -18790 -10518 -16357 17668 16448 -12290
15429 -12290 -11735 17166 16339 30487 36135 26222 15642 -15144 -45994 -23353 -2336 39591 50769
15416 50769 22490 22241 8510 -7905 8609 1216 -7060 14491 45275 26439 32183 31064 18339
15403A8339o461k6855k0299L084L1240J7814l6391J2137p53l296J9128k747l367
15390A573k308m921n132j3473m908R393j3293q01J3885q905J671L0991o02j4069
15376a0899m946R787j1307o438k353J083R445M858J7515o510k0165R841J8541
15363H452j7141j4491J3200J903j7693l0366N959J9926R960J3600Q324r906j6674
15350b4947j1953j8049J5578K729R88N980j4497k4891p755K9222K0829L5996R241
15337A8471r846o675l8281k0465k319L3834M6049J0508k3380j0539K7485J8974
15325D3816j0407k2033j1494j2767j0176J4794K5485L7894K8347p074j5475k9634
15313C1276j6622k0694k278M2333K1474r987k4734k813J1383J4722j1956J832
$$ plain form
15403 18339 11878 -14977 -35276 -32192 -952 16862 -19529 -7392 -8145 -11441 7687 4940 1573
15390 1573 -735 -5656 -10788 -24261 -29169 -19776 -33069 -33870 -19985 -28890 -27219 3772 3170 -10899
15376 -10899 -15845 -6058 -17365 -23803 -26156 -25073 -15628 -10770 6745 235 -19930 -10089 8452
15363 8452 -8689 -23180 -9980 -8077 -25770 -56136 -50177 -30251 -20291 -6691 1633 -8273 -24947
15350 -24947 -36900 -54949 -39371 -36642 -35654 -29674 -44171 -69062 -76817 -47595 -26766 9230 18471
15337 18471 8625 1950 -36331 -56796 -59115 -25281 20768 31276 7896 -2643 24842 43816
15325 43816 33409 11376 -118 -12885 -23061 -8267 17218 55112 83459 76385 60910 31276
15313 31276 14654 -6040 -8318 34015 55489 45502 20768 17955 29338 44060 32104 33936
15301C3936J1237j4354r640K564k5206M230L8943J0160j4192j7058j0557J2836
15289B2899N989j0616l1898k4599J6649j7542k1202J3830N421J23l185j2496N70
15276e6057N937K6993K6718r139k7030k7460J352r553K0186J4979J3960j3727
15264c2841l339K4769J5751J6523j413k907M715q574k2376l462q542O529l822
15251a8989k082L1961J6626m284j7035j9808j1700Q261L575Q379j111O792M5581
15238D6166K0186L1794N8515K1567j0836q296j6925j2231j3852L699p060K4041
15226A36768j2065l2200k9195r657k8345j1980k6873l302J6326K7835O529j0004
15214B3837j1701J68p14K297n18J2099P693J412J0389k3537m448N415j8222j2282
$$ plain form
15301 33936 45173 30819 21179 23743 -1463 2767 41710 51870 37678 20620 10063 22899
15289 22899 28888 18272 -13626 -38225 -21576 -39118 -60320 -46490 -41069 -40946 -44131 -56627 -56057
15276 -56057 -50120 -23127 3591 -5548 -32578 -60038 -58686 -68239 -48053 -33074 -19114 -32841
15264 -32841 -36180 -11411 4340 20863 19450 16543 21258 12684 -9692 -13154 -21696 -15167 -18989
15251 -18989 -21071 10890 27516 23232 6197 -13611 -25311 -17050 -13475 -5096 -6207 585 46166
15238 46166 66352 98146 156661 178228 167392 159096 142171 129940 116088 119787 112727 136768
15226 136768 124703 92503 63308 53651 25306 13326 -13547 -16849 -523 27312 33841 23837
15214 23837 12136 12304 11590 13887 13369 25468 33161 34573 44962 21425 16977 22392 4170 -8112
15200h112K1125l960J7044J395L267J1340l924l6251j5622L0765J4935m6537l0221
15187d4756j8697Q499j86p910j6186L2948L6880K6925k7977j5716J2555J7561
15175C940j2659l931J4963j8961j2143j264L750j117R510k2414j039K1234L4797
15162A4666J6942j292l419j7564p193l551j4443m452j5751j1340l3q224P217j0288
15148e8725k128K7736J5646m788k0201R66J5996O765L5168K5360N637J6965N110
15135F9507j933J1410J3121j1270J9401N573j2960o8j9891L752J05M647j5287
15122F6107k6331k2410n305J8659j7231R111q509o765J9255m1519k0930P869K4952
15109c047p00m663j5464Q656K199K5496K9176J7462k1664k4783l283K1736N508
$$ plain form
15200 -8112 13013 9053 26097 27492 30759 42099 38175 1924 -13698 17067 32002 -14535 -44756
15187 -44756 -63453 -54954 -55140 -63050 -79236 -46288 -9408 17517 -10460 -26176 -13621 3940
15175 3940 -8719 -12650 2313 -16648 -28791 -30055 -26305 -27422 -17912 -40326 -41365 -20131 14666
15162 14666 31608 30316 26897 9333 2140 -1411 -15854 -20306 -36057 -47397 -47430 -55654 -48437 -58725
15148 -58725 -60853 -33117 -17471 -22259 -42460 -41494 -25498 -18733 16435 41795 47432 64397 69507
15135 69507 67574 78984 92105 80835 100236 105809 92849 92781 72890 76642 76747 81394 66107
15122 66107 39776 17366 12061 30720 13489 22600 14091 7326 26581 -14938 -35868 -27999 -3047
15109 -3047 -3747 -8410 -23874 -15218 -13019 12477 41653 59115 37451 12668 9385 31121 36629
15096C6629k7730k223J4062o845j4845Q97p260r623K235j1859q990k671J2977
15083b5246K796Q789K4791R081q148j1944o331j778M390P557j0227j1906K1217
15070C041J3274l0235l6034Q268M8504J6815k1609l3403J2480J843K8239Q936
15058B0119j7765J2508r881j4335o641o201L589R562q011J850o668N948r503N0260
15044B4831l592l586m071k6902J841j7815J4432J3653j5576r665L6599l691j1071
15031d613J5164J7040k7688o356o756L5935K1680j6382m8029j8733n749K3421
15019b1066L1459l163M416n48j1714L413J0615j8236l323j6854j0796K3224K2084
15006I511N026k7954M152q930j1890J7490K5464R48R13k1673J1J3882O455Q798
$$ plain form
15096 36629 8899 6676 20738 13893 -952 -55 -7315 -16938 -14703 -26562 -35552 -38223 -25246
15083 -25246 -22450 -13661 11130 20211 12063 119 -6212 -7990 -3600 3957 -6270 -18176 3041
15070 3041 16315 -13920 -49954 -41686 6818 23633 2024 -31379 -18899 -17056 11183 20119
15058 20119 2354 14862 4981 -9354 -15995 -22196 -18607 -9045 -17056 -15206 -21874 -15926 -25429 24831
15044 24831 21239 17653 13582 -13320 -11479 -29294 -14862 -1209 -16785 -26450 10149 6458 -4613
15031 -4613 10551 27591 -97 -6453 -13209 22726 44406 28024 -20005 -38738 -44487 -21066
15019 -21066 10393 7230 11646 11098 -616 2797 13412 -4824 -8147 -25001 -35797 -12573 9511
15006 9511 14537 -13417 -9265 -18195 -30085 -12595 12869 13817 14730 -6943 -6932 6950 13405 22203
14992B2203J0886j3619K601L1676J6941J2427m027k2824j2709M4305K5573K4912
14980A38345P8095J21551K52886M49854L84266K61318K40488l61236o59877l81729
14970E23961j48627q3632o6442m6690k5746J0449K179p946p231k0002k5662j4734
14958H9877K153j142o770n257M402j2363k2815R579j651q323P977K255M708r181
14944E3449J0331j5520J5239J5167j4655l263N482R28J1615R494j0020q287j205
14931F8755n922m920k4461J2423P519k3716j874j4681p837J1310k0955l8190k9148
14918g1697J6832K7804N2078L5010j4166m4612l0092j0744O99J1986j6453K0457
14906b2898j083J117J3718K5509L861j090j4j5150j0161k1833p07M0603J9882
$$ plain form
14992 22203 33089 19470 22071 53747 70688 83115 79088 56264 43555 87860 113433 138345
14980 138345 216440 337991 590877 1040731 1424997 1686315 1926803 1565567 905690 523961
14970 523961 375334 291702 225260 178570 152824 163273 165452 157506 150275 130273 104611 89877
14958 89877 92030 90888 84118 78861 83263 70900 48085 57664 56013 47690 55667 57922 62630 53449
14944 53449 63780 48260 63499 78666 64011 60748 66230 67158 78773 88267 78247 69960 68755
14931 68755 62833 57913 33452 45875 53394 29678 27804 13123 5286 16596 -4359 -42549 -71697
14918 -71697 -54865 -27061 25017 60027 45861 1249 -28843 -39587 -38888 -26902 -43355 -22898
14906 -22898 -23981 -22864 -9146 16363 20224 19134 19120 3970 -6191 -28024 -28731 11872 31754
14893C1754J8582j6372k1759k6792P740N723J002k669m406M383k9609J2091L5063
14880A4731L656j5827j2585J2299o124k0275Q196N392K3035J6883m579j7168j0924
14867c290L909k344j0164R284L44j8417N016J9401P620O532j338j9188K0312j3316
14853D361l1762R089J4419J1710j3987K779J6290j2991k385m856P513L401O143
14840I724O481k0143j4523R518k7756J0183J9633J559N331j1466l024J9826L2145
14827C7488l711k5322p884q735J5037K0737l846N921k3415J556J7552P118P969
14814D0465j2854k3173R235M619K6341N281l432j9574o961M025J1333P844n172
14801C7977m4872r028J6195k986p510K9695J1867j8185l706Q120n699O841k2466
$$ plain form
14893 31754 50336 33964 12205 -14587 -6847 -1124 -122 -2791 -7197 -2814 -32423 -20332 14731
14880 14731 18387 2560 -10025 2274 -3850 -24125 -15929 -10537 12498 29381 24802 7634 -3290
14867 -3290 619 -1725 -11889 -2605 -2261 -20678 -15662 3739 11359 17891 16553 -2635 17677 4361
14853 4361 -27401 -18312 -3893 7817 -6170 -3391 12899 -92 -2477 -7333 180 3581 9724
14840 9724 16205 -3938 -18461 -8943 -36699 -26516 -6883 -5324 7 -11459 -14483 5343 37488
14827 37488 33777 8455 571 -8164 6873 27610 23764 29685 6270 7826 25378 32496 40465
14814 40465 27611 4438 13673 18292 44633 49914 46482 26908 19947 23972 35305 43149 37977
14801 37977 -6895 -15923 272 -2714 -10224 19471 31338 13153 9447 17567 11868 18709 -3757
14788c757m1549q235J1441r549k482J6491K3188J0394j0892M6R869r462k1495
14775c5992j0528j0269L041L4234J7184M6572J4135j4597j5565J1260m607j2897
14763B1971K014k1881j4000r486J2637O049J2100O086J6833q353j478Q58r463
14750A3887o25Q166L2836o387l3787l67K278R106M132j4555J478P688M022J113
14736B8985l689K79L474j7627K5J7435k4172J9219L687j4175j2846k1139j6226
14723c6770M258n851J9985P678j1822J8168q059j9901O306n413L817r22P382j8842
14709c9986K2121l558l571K051j5760L260M7051J4809q863n633p329K7j3757o012
14695a5150J9175K626r011j3026p105R582J7756Q816J8812n285k4164M1125N029
$$ plain form
14788 -3757 -45306 -53541 -42100 -51649 -54131 -37640 -14452 -4058 -14950 -14904 -5035 -14497 -35992
14775 -35992 -46520 -56789 -53748 -19514 -2330 44242 58377 43780 28215 39475 34868 21971
14763 21971 23985 2104 -11896 -21382 -8745 -2696 9404 15490 32323 23970 22492 23350 13887
14750 13887 13262 21428 54264 47877 14090 13723 16001 25107 29239 14684 16162 23850 27872 28985
14736 28985 25296 25575 29049 11422 11447 28882 4710 23929 27616 13441 595 -20544 -36770
14723 -36770 -32512 -38363 -18378 -10700 -22522 -4354 -12413 -32314 -26008 -31421 -27604 -28526 -21144 -39986
14709 -39986 -17865 -21423 -24994 -22943 -38703 -35443 11608 26417 17554 11921 4592 4619 -9138 -15150
14695 -15150 4025 6651 -2360 -15386 -22491 -12909 4847 13663 32475 27190 3026 44151 49180
14682D9180m1774k4535m6374j5457M9631K9376k0836k6673R313L9741K3546O897
14670C2035l1909j2794Q788N393R431J7895j5116Q64l5595l157L0862K2378m988
14657B4087p720M340j0928J4344r375k8692q378K6614l0577k0051L1169M127K6630
14644A5590K3256j5451J567O043J3398J6215k7141l5323n65j4357P649K5976j431
14631A5426o390J0798k1172O437j0722p613J4959J2666J6834j4984k0839m2263
14619d6863j1853k436Q726l574M654K4756K0069k4190k2693J1193J5327J2468
14607a4416K1647J4366J3197j7218k5337J1122j1966j7532J7690k2253k2343M813
14595d8230J0319N107L3245J5644j6743j4893j0763K4198l4099p778M3294J1820
$$ plain form
14682 49180 7406 -17129 -63503 -78960 -29329 47 -20789 -47462 -38149 1592 25138 32035
14670 32035 126 -12668 -3880 1513 10944 28839 13723 14587 -21008 -24165 6697 29075 24087
14657 24087 16367 20707 9779 24123 14748 -13944 -22322 4292 -26285 -46336 -15167 -11040 15590
14644 15590 38846 23395 24962 31005 44403 60618 33477 -1846 -2411 -16768 -9119 16857 15426
14631 15426 9036 19834 -1338 5099 -5623 -13236 1723 14389 31223 16239 -4600 -46863
14619 -46863 -58716 -61152 -52426 -56000 -51346 -26590 -6521 -30711 -53404 -42211 -26884 -14416
14607 -14416 7231 21597 34794 17576 -7761 3361 -8605 -26137 -8447 -30700 -53043 -48230
14595 -48230 -37911 -32804 441 16085 -658 -15551 -26314 -2116 -36215 -43993 -699 11121
14583A1121j1060j6762l689j4986J0691J1863K102j642j7148r552K771R069K8932
14570A710K22j3793J134L1388J6304k6003j7583O433q068l2435j146m460j0850
14557e7147J1102K0504L502L211J4765k3004k8812N773J3688P236j2437J5633
14545b5986J4616K8533J6326j3941k6121r571o459M36P747K2387L376J2828l175
14532B0996k6940J277P567R165Q275R342K3437q661l2437k3285j3931J165N350
14519a8680N108k769n597n676J1034m663n575M354P406r318j2375K2033m622j3505
14505c2845R797K7280J3510k6589q760k1605K630n336j6440J6709K9084O182r30
14492g313K3030n697j0504K0300j831l1619M07k882k5047K780R237J9109q694
$$ plain form
14583 11121 61 -16701 -20390 -35376 -24685 -12822 -10720 -12362 -29510 -39062 -36291 -27222 1710
14570 1710 1932 -11861 -10727 20661 36965 10962 -6621 -188 -8256 -40691 -41837 -46297 -57147
14557 -57147 -46045 -25541 -22039 -18828 -4063 -27067 -55879 -50106 -36418 -29182 -41619 -25986
14545 -25986 -11370 17163 33489 19548 -6573 -16144 -22603 -22167 -14420 7967 11343 24171 20996
14532 20996 -5944 -4667 2900 12065 20340 29682 53119 44458 12021 -11264 -25195 -24030 -18680
14519 -18680 -13572 -16341 -21938 -27614 -16580 -21243 -26818 -22464 -15058 -24376 -36751 -14718 -19340 -32845
14505 -32845 -23048 4232 17742 -8847 -17607 -39212 -36582 -41918 -58358 -41649 -12565 -6383 -7313
14492 -7313 15717 10020 -484 19816 17985 -13634 -13227 -16109 -41156 -38376 -29139 -10030 -18724
14479a8724j5118j5937j243q124m89J7028j47J5647M6914j3223l4964J7078P239
14466d063k0812J3307J8042k0890n2312L642K1612K2028q689J4674j0692k5672
14454d9825J462j2953k7013J4762L7599O56j8831O286J9918J1058K1919L659k8174
14441a9477k8644P466J5597K4580k0916k2906q609o583L8032M7297O030l8290
14429f423j5345q444R332j2305j3165J4359J924q623m8629M164K3709L8911Q643
14416a1892K1876j3913J4392j96P922J0067J8186j131o686j8673j5069j8356j317
14403a4790j901j407M2736K3349J4117Q345j4492k5058l3508l0608l359K5670
14391a0906J5978J5725j7302k6946J547l126P731K4298J7371j6628K347J5430
$$ plain form
14479 -18724 -33842 -49779 -51022 -59146 -59635 -42607 -42754 -27107 19807 6584 -28380 -11302 -4063
14466 -4063 -24875 -11568 6474 -14416 -66728 -63086 -41474 -19446 -28135 -13461 -24153 -49825
14454 -49825 -48363 -61316 -88329 -73567 -35968 -35312 -54143 -47857 -27939 -16881 5038 8697 -19477
14441 -19477 -48121 -40655 -25058 -478 -21394 -44300 -52909 -59492 -21460 25837 31867 -6423
14429 -6423 -21768 -30212 -20880 -33185 -46350 -31991 -30067 -38690 -87319 -83155 -59446 -20535 -11892
14416 -11892 9984 -3929 10463 10267 18189 28256 46442 45311 38625 19952 4883 -13473 -14790
14403 -14790 -16691 -18098 24638 47987 62104 70449 55957 30899 -2609 -33217 -36576 -10906
14391 -10906 5072 20797 3495 -23451 -21904 -25030 -17299 6999 24370 7742 10089 25519
14379B5519r081k3438j1917j1660L0224R883N5q979p559o057J0291K3975M92k2150
14365d02k8431j8996j4303L3323J3751j3610j9697J5110k263J4428r402J4776
14353a5716R891J5J5861j0167l5562M72q680n136K5119K1138J3210k8240m809
14340b2604m408q582O578K0732J4147m124k2435k5903J2879J2169K3144K6975
14328B8568n18k0422j5511j6430m7402K518L5074j8570M14K9895M846K0589P272
14315A0323N667l0474r612L191o437J3465k0964l798p103N626K7549q555k5170
14302d6292k108L7838m138j2244Q356j0445k902j5516j7147o289N244J0819q085
14289f2909J7074K172j8811M377L5753J0313O758k949l38j691o51J3298k5496
$$ plain form
14379 25519 16438 -7000 -18917 -30577 -353 9530 9585 606 -6953 -13010 -2719 21256 21748 -402
14365 -402 -28833 -47829 -62132 -28809 -15058 -28668 -48365 -33255 -35518 -21090 -30492 -15716
14353 -15716 -5825 -5810 10051 -116 -35678 -35206 -43886 -49022 -23903 -2765 10445 -17795 -22604
14340 -22604 -27012 -35594 -29016 -8284 5863 1739 -20696 -46599 -33720 -21551 1593 28568
14328 28568 28050 7628 -7883 -24313 -71715 -69197 -34123 -52693 -52279 -22384 -17538 3051 10323
14315 10323 15990 -14484 -24096 -20905 -27342 -13877 -34841 -38639 -45742 -40116 -12567 -21122 -46292
14302 -46292 -48400 -10562 -14700 -26944 -18588 -29033 -31935 -47451 -64598 -70887 -65643 -54824 -62909
14289 -62909 -45835 -43663 -62474 -58097 -22344 -12031 -5273 -8222 -8560 -10251 -10902 2396 -23100
14276b3100k5412j68J3131L92l18K2532J1850N382P770L79l67j3826k6075k6557
14262e4387J4414R297j6154k9390K1487J5636L698j0885K1454K6238O397J9749
14250B7554Q9l0096O411q642J233k240L931J5376l07k202J8039j5213j3936J7591
14236A7588J3304m779j1708J3686p954k7373l913n966J4142R102k8223J3486O534
14223b074J0247j313k7590J0527L739J014K5503K164j900k46k048q284j2896m347
14209g504j318P741P951J1266k1983r642k7419j4480O442j1193Q545K317L880
14196d5397J6086j2975J6683K7736L1595L510j8600p384J4307J2722j3049M171
14184B9405j4153k6972K9464M59q059N509r237k9568r21J06j0932O135J2253r67
$$ plain form
14276 -23100 -48512 -48680 -35549 -35157 -35475 -12943 -1093 4289 12059 12438 12071 -1755 -27830 -54387
14262 -54387 -39973 -30676 -46830 -76220 -54733 -39097 -35399 -46284 -24830 1408 7805 27554
14250 27554 27643 -2453 3958 -4684 -3451 -5691 -1760 13616 13309 11107 29146 13933 -3 17588
14236 17588 30892 26113 14405 28091 20137 -7236 -11149 -17115 -2973 6129 -22094 -8608 -2074
14223 -2074 8173 6860 -20730 -10203 -6464 -5450 20053 22217 20317 20071 18023 9739 -3157 -7504
14209 -7504 -8822 -1081 6870 18136 -3847 -13489 -40908 -55388 -48946 -60139 -51594 -49277 -45397
14196 -45397 -29311 -42286 -25603 2133 33728 37238 18638 11254 25561 38283 25234 29405
14184 29405 15252 -11720 17744 18203 10144 15653 6416 -23152 -24073 -23967 -34899 -28764 -16511 -17478
14170a7478k1151M847j258m817j5906K5502k0259l7472k331M712q84K7711J1780
14157d7004J5412Q322j672j1650j3460R750j0797R08J0499k57J857L0220K6283
14144A8411j0227j2927k1217r067l229J3724l2545j0780J1238L4613K5807J0364
14132A4165l879J8771k3583j2829P185k6832k4916m548J9802N994j6447p630Q608
14119d6139J6062J4004J115K284j0538J7149K5295M927R931p322j707k429m96
14106B2136j2731k4403j3504L959N707O710M0771M825k680J1907j1638k107j1044
14093A7908l612j4060m753l1087j2227J8812k715J1450q404l3642j0217Q3J2672
14080e9792j6628J1962J4782k460j529L423J6693j0724M608l82J5515j0714j6952
$$ plain form
14170 -17478 -38629 -33782 -35040 -39857 -55763 -30261 -50520 -87992 -90323 -85611 -86495 -58784 -47004
14157 -47004 -31592 -23270 -24942 -36592 -50052 -40302 -51099 -50191 -39692 -39949 -38092 -7872 18411
14144 18411 8184 -4743 -25960 -35027 -38256 -24532 -57077 -67857 -56619 -22006 3801 14165
14132 14165 10286 29057 5474 -7355 -170 -27002 -51918 -56466 -36664 -30670 -47117 -54747 -46139
14119 -46139 -30077 -16073 -14958 -12674 -23212 -6063 19232 24159 34090 26768 25061 22632 22136
14106 22136 9405 -14998 -28502 -24543 -18836 -12126 28645 33470 30790 42697 31059 28952 17908
14093 17908 14296 236 -4517 -35604 -47831 -29019 -31734 -20284 -28688 -62330 -72547 -72464 -59792
14080 -59792 -76420 -64458 -49676 -52136 -53665 -50242 -33549 -44273 -39665 -40047 -24532 -35246 -52198
14067e2198J405K1456L213j1431P775n901j6800O678j386J2577K2558q701O800
14054a3955K1438o227j1663M26j3387k6819j4732L0184J3698O729J2292k2139
14042b4155p960J4889R822O540J876P072j2176l3700L428l015J8709N693Q367
14029d610j2683j1363j9158j2433l957O632J9440J0815j664J3721M4598O024j4279
14016B1083J921q761J746j3973l3738j2389J9151L1624R206q03N350j7563j5402
14003a2548L832O686n234k0782J1088J3877K2974Q931j7268K564j0192j7507j8140
13990c1719p918n554j141K9001L949j5979J3166J8795l179k2796j4392J8374J8129
13977a264M615j028k4613k6983M630J8967R263K1410j6003O13j3371P1P261J6416
$$ plain form
14067 -52198 -50793 -29337 -26124 -37555 -29780 -35681 -52481 -45803 -47189 -34612 -12054 -20755 -13955
14054 -13955 7483 1256 -10407 -9981 -23368 -50187 -64919 -34735 -21037 -14308 -2016 -24155
14042 -24155 -32115 -17226 -7404 -864 1012 8084 -4092 -37792 -34364 -37379 -18670 -12977 -4610
14029 -4610 -17293 -28656 -47814 -60247 -64204 -57572 -38132 -27317 -28981 -15260 29338 35362 21083
14016 21083 23004 14243 15989 2016 -31722 -44111 -24960 6664 15870 15067 20417 2854 -12548
14003 -12548 -8716 -2030 -7264 -28046 -16958 -3081 19893 28824 11556 14120 3928 -13579 -31719
13990 -31719 -39637 -45191 -46332 -17331 -13382 -29361 -16195 2600 -579 -23375 -37767 -19393 -1264
13977 -1264 3351 2323 -22290 -49273 -44643 -25676 -16413 4997 -11006 -10393 -23764 -23693 -16432 -16
13963a6K9640J1244m0484m0979j3704M359J4610J3736P155p863P99J626K4973
13950E096J25l6173j3791J7901K3632J6729l3464J976m299K208J1470J664j2772
13937a9698k0055j4517M7546M9240j5911m2332k3794K157R993j3661P827J6172
13925a7033P285J525o217Q93j2721K673k3921n323L459K3390J0088M652n257O561
13911i946M584N1357K1281k7459m7237j758l375l953j3732j8732K4352J2935l858
13898a5541N480q767K300O449m966k5907k6636L2938K4247j3332N394N308J2719
13885c14N379N257j3295k865j15J5885N686q845O726j6889n494j532m722k3487
13871c8625J504k36P625N705L0443j373j8334j5217j4621n153j8022J1939K2471
$$ plain form
13963 -16 29624 40868 384 -40595 -54299 -49940 -35330 -21594 -14439 -22302 -21503 -19877 5096
13950 5096 5221 -30952 -44743 -26842 -3210 13519 -19945 -17969 -22268 -20060 -8590 -6926 -19698
13937 -19698 -39753 -54270 -6724 42516 26605 -15727 -39521 -37364 -27371 -41032 -33205 -17033
13925 -17033 -9748 -8223 -14440 -13547 -26268 -23595 -47516 -52839 -49380 -25990 -15902 -11250 -16507 -9946
13911 -9946 -5362 45995 67276 39817 -7420 -9178 -12553 -16506 -30238 -48970 -24618 -11683 -15541
13898 -15541 -10061 -18828 -16528 -10079 -15045 -40952 -67588 -34650 -10403 -23735 -18341 -13033 -314
13885 -314 5065 10322 -2973 -5838 -5953 9932 15618 6773 13499 -3390 -8884 -10416 -15138 -38625
13871 -38625 -37121 -37357 -29732 -24027 6416 5043 -13291 -28508 -43129 -48282 -66304 -54365 -31894
13858c1894J7596r852j2657L6500J2895l0425k0111j4117l231j5895J0694m893
13846f5390J5110L9015m036p17J8071L74p960l574J2123r521j0349l170J4187
13833e837j8777K1979J4185M385L516l469k238J7631k7254j2455j5928k2809J863
13820d5208Q368K1658L2087r109j2089k9304k1176J9065m492K070J03j321K5291
13807a4057j2193k3383O600o580K1713O998k4183j9102k515J4637r222j9420J9017
13794f1690R576Q386r836q214J2307J9861K4135o301k4840K854N163K853L273
13781b2473J8188J034o534J0333R052J8555n363j6351p952R987m006K0569P879
13768C2918j1883l0711o549K276l536j3289r272J1633J3547n230K0680l108m1623
$$ plain form
13858 -31894 -14298 -24150 -36807 -307 12588 -17837 -37948 -52065 -55296 -71191 -60497 -65390
13846 -65390 -50280 -11265 -15301 -16018 2053 2427 -5533 -9107 3016 -6505 -16854 -20024 -5837
13833 -5837 -24614 -2635 11550 15935 19451 15982 13744 31375 4121 -8334 -24262 -47071 -45208
13820 -45208 -36840 -15182 16905 7796 -4293 -33597 -54773 -35708 -40200 -38130 -38027 -39348 -14057
13807 -14057 -26250 -49633 -43033 -49613 -27900 -20902 -45085 -64187 -66702 -52065 -61287 -80707 -61690
13794 -61690 -52114 -43728 -53564 -61778 -49471 -29610 -5475 -11776 -36616 -33762 -28599 -25746 -22473
13781 -22473 -4285 -3251 -9785 548 9600 28155 22792 6441 -1511 8476 4470 25039 32918
13768 32918 21035 -9676 -16225 -13949 -17485 -30774 -40046 -28413 -14866 -20096 584 -2524 -44147
13755d4147K4722K9434J3658M612j5118r456j7771L0439k4570J0580m72j5649
13743a3738n638J6291l587N678M417l3307j5156L8145K1241q130J0487n344L946
13730A5305j9670n44k246k3457j2084J9026j2341j7173k2539N08K4626N202j2405
13717e7792K8898J8225j4320k520j2360R583K5878m294j7019k042K234J7252J3562
13704E285k1136M313K2516k6601k2901k3427J0178K4247K7454P445k4620k8957
13692d6204k4629J0577J6683Q340J9146L0080K9075j1901m9137k3682j828O177
13680c7303j7192J457K8885o086J1681L0982N421n730j2705j4224P626L2305l076
13667B2041r012j3012p407k3508m869m491Q37J4709J3000m077J6468K056k3482
$$ plain form
13755 -44147 -19425 10009 23667 28279 13161 3705 -14066 16373 -8197 2383 1911 -13738
13743 -13738 -19376 -3085 -6672 -994 3423 -29884 -45040 -6895 14346 6216 16703 11359 15305
13730 15305 -4365 -4909 -7155 -30612 -42696 -23670 -36011 -53184 -75723 -75215 -50589 -45387 -57792
13717 -57792 -28894 -10669 -24989 -27509 -39869 -30286 -4408 -8702 -25721 -27763 -25529 -8277 5285
13704 5285 -15851 -11538 10978 -15623 -38524 -61951 -51773 -27526 -72 7373 -17247 -46204
13692 -46204 -70833 -60256 -43573 -35233 -16087 13993 43068 31167 -17970 -41652 -43480 -37303
13680 -37303 -54495 -53038 -24153 -30239 -18558 12424 17845 12115 -590 -14814 -7188 25117 22041
13667 22041 13029 17 -7390 -30898 -35767 -40258 -39421 -24712 -11712 -15789 679 2735 -20747
13654b0747Q818L075L837j4938j0492N753Q633J4937J2557j9575o540q477k7987
13641e1146J1003K2482K17p076k046J138r956j246M4377k638k8059M967j6059
13628c4042L076J1682r300q34j0345m3651J0793L1137j9345O55Q271O035m427
13615e0295J3744O880k000j367K5037j9775j5094J3436N783r813l235J6984K8383
13602H668J739j7513j8637O8r168Q615J0293K052L1039K3443p036j3855j400O585
13588B4893j4782l7544j2733J7307L143j5070k1870l2655K299J2821K4111k1990
13576g2070J0635J5032N879n604J1432K007L941R565P496k175M603L162j0491
13563a6588J6881l320J8526J4112k8398J796n541k5795J0254n09j0677m924j5929
$$ plain form
13654 -20747 -11929 -8854 -5017 -19955 -30447 -24694 -16061 -1124 11433 -8142 -14682 -23159 -51146
13641 -51146 -40143 -17661 -17444 -24520 -26566 -25428 -35384 -36630 7747 5109 -22950 -17983 -34042
13628 -34042 -30966 -19284 -28584 -29418 -39763 -83414 -72621 -41484 -60829 -60174 -51903 -45868 -50295
13615 -50295 -36551 -29671 -31671 -33038 -8001 -27776 -42870 -29434 -23651 -33464 -36699 -19715 8668
13602 8668 10407 -7106 -25743 -25675 -34843 -26228 -15935 -13883 17156 40599 33563 19708 18308 24893
13588 24893 10111 -27433 -40166 -22859 -19716 -34786 -56656 -89311 -87012 -74191 -50080 -72070
13576 -72070 -61435 -46403 -40524 -46128 -34696 -32689 -28748 -19183 -11687 -13862 -9259 -6097 -16588
13563 -16588 293 -3027 15499 29611 1213 3009 -2532 -28327 -18073 -18582 -29259 -34183 -50112
13550e0112K4925j707K783J0422q305p476J9186J7076q750l788k8058j9286M109
13537d8981L725K9817o867j1985j1406M894L0015J2160O951K034m780l203J2645
13524A5019j9071m3655q508p12j2160J8659J0425n872M309q675j521L4934j8307
13511c5135L847J0807N759L269K2859K867N711j3907J6328K2305J0501o242j7153
13498C1816J2982q576j8114j3584j5980o748O974r475q3j6985O385J4574j2747
13485b9561j2763k8437J1914L0417J9242Q474r406k6008j7264j0487o79M0916
13473b3642L9934p60j2090k702K1326L0042R297J1127l1459k9459r676r429j8170
13460b5661m3115k9975J7092M6284Q390K5066P393n973k9855j0199J58N334L723
$$ plain form
13550 -50112 -25187 -26894 -24111 -13689 -21994 -29470 -10284 6792 -1958 -5746 -33804 -53090 -48981
13537 -48981 -45256 -15439 -22306 -34291 -45697 -40803 -10788 1372 8323 10357 5577 2374 15019
13524 15019 -4052 -47707 -56215 -56927 -69087 -50428 -40003 -45875 -41566 -50241 -51762 -16828 -35135
13511 -35135 -31288 -20481 -14722 -11453 11406 14273 19984 6077 22405 44710 55211 48969 31816
13498 31816 44798 36222 18108 4524 -11456 -18204 -11230 -20705 -20788 -37773 -31388 -16814 -29561
13485 -29561 -42324 -70761 -58847 -28430 -9188 -714 -10120 -36128 -53392 -63879 -64558 -23642
13473 -23642 16292 15532 3442 740 22066 52108 61405 72532 41073 11614 1938 -7491 -25661
13460 -25661 -68776 -98751 -81659 -35375 -26985 -1919 5474 -499 -30354 -40553 -40395 -35061 -31338
13447c1338k8883K85R272J6614p053L293K6775J8237k6488l5744j1537K7137L880
13434c5550KP985J8554M331p28l286o434l2606Q126J3293R385k4126k6215J8235
13420d9034N663O23j3618k570K1388P895L62j2433J256n895L385J6599p363J9919
13406a3823j2219K338j947J6843L581k1873j1718k2238j6875J2970l544L2285
13394c6220J5046j436P741K8992K1018k7012l7742q319K4683J9644K6244j4621
13382A8018k4983R231R826R22m4994k6303j7261j1219L995L9910l210l551N856
13369d3763j0309r950K152K318j647K3607L0419J8143j6294k844K4094k1915k2989
13356b8978J6296n887r248r049J3834k843r775j7769K1775L2347J128k3668J592
$$ plain form
13447 -31338 -60221 -59936 -50664 -34050 -41103 -37810 -11035 7202 -19286 -55030 -66567 -39430 -35550
13434 -35550 -35548 -27563 -9009 -4678 -5406 -8692 -15126 -47732 -39606 -26313 -16928 -41054 -67269 -49034
13420 -49034 -43371 -42748 -56366 -58936 -37548 -29653 -29291 -41724 -40468 -46363 -42978 -26379 -33742 -13823
13406 -13823 -26042 -23704 -25651 -8808 -5227 -27100 -38818 -61056 -77931 -64961 -68505 -36220
13394 -36220 -21174 -22610 -14869 14123 35141 8129 -29613 -37932 -13249 6395 32639 18018
13382 18018 -6965 2266 12092 13014 -31980 -58283 -75544 -86763 -82768 -42858 -46068 -49619 -43763
13369 -43763 -54072 -64022 -61870 -59552 -61199 -37592 -7173 10970 -5324 -8168 15926 -5989 -28978
13356 -28978 -12682 -18569 -27817 -36866 -23032 -25875 -35650 -53419 -31644 703 1831 -21837 -20245
13343b0245Q09o211k931Q898p403J812O48j3921J9290J685J3302k6522L8076j3540
13329f253j9753O328R932P693j6266j1854J4231L4165J9266l8038k1411K2574
13317F14j2474j5758R237P846J8755l759J4053j4190K7830N144j0703J6953J0203
13304E3751K4978J680J0627l0973l5281j1942o365j3900N42j2947m469P803q674
13291b5170k8941P753R23J6309m009l3791J0131Q535L6933L5328j2427j9884j819
13278a0129J6724K0439l276P595R551j040k2496n783K983M422k3426P656K5072
13265B8292j627j3562o354R724k1734j3129J0736J6323o369j3442j2822L3116
13253I152Q885l383k3123k2695n778j4580n0562j6156Q049K6356L5581M979p393
$$ plain form
13343 -20245 -19436 -25647 -28578 -19680 -27083 -25271 -24623 -38544 -19254 -17569 -4267 -30789 7287 -6253
13329 -6253 -26006 -19678 -9746 -2053 -18319 -30173 -15942 18223 37489 -549 -21960 614
13317 614 -11860 -27618 -18381 -10535 8220 4461 18514 4324 32154 37298 26595 43548 53751
13304 53751 78729 80409 91036 60063 24782 12840 6475 -7425 -6883 -19830 -24299 -16496 -25170
13291 -25170 -54111 -46358 -45435 -29126 -33135 -66926 -56795 -48260 -11327 24001 11574 -8310 -10129
13278 -10129 6595 27034 23758 31353 40904 39864 17368 11585 14568 18990 -4436 3220 28292
13265 28292 26665 13103 6749 16473 -5261 -18390 -7654 8669 2300 -11142 -23964 9152
13253 9152 18037 14654 -8469 -31164 -36942 -51522 -102084 -118240 -110191 -83835 -48254 -43275 -50668
13240e0668j1083N912K7741K545q880o530k747K5124L2072l121j5077p772l962
13227a6446J0403J9207r86R016p066L492q476K929l920l489j4317r957Q104o521
13213a8027K331K648L040J3061P319l18k5318j871q855M5898L9459m9017k1236
13200a0886K1040K1103l878k0210m3728L544m503J4154M6117m890k483j5742n292
13187e654k098M472k2706J127o050K6067o195J9187K1721M898J4264k8968l4672
13174a4607k0852P922j133L783R096n434j429K2474Q446J4177M536k9217K871
13161F33J4335M40m174j9212j2395J1409R798q564k939k715N98o652j3899O469
13147b6868P943k649J6958j1920j1899J802k2913J1303O309l059K3591k672l0193
$$ plain form
13240 -50668 -61751 -55839 -28098 -25553 -34433 -40963 -43710 -18586 13486 10365 -4712 -12484 -16446
13227 -16446 -6043 13164 12178 21194 14128 17620 9144 12073 8153 4664 -9653 -19610 -11506 -18027
13213 -18027 -15696 -13048 -10008 3053 10372 10054 -15264 -17135 -25990 19908 59367 10350 -10886
13200 -10886 10154 31257 27379 7169 -36559 -33015 -37518 -23364 22753 17863 15380 -362 -5654
13187 -5654 -7752 -3280 -25986 -24859 -30909 -4842 -11037 8150 29871 34769 49033 20065 -14607
13174 -14607 -35459 -27537 -28670 -24887 -15791 -21225 -22654 -180 8266 22443 26979 -2238 633
13161 633 14968 15408 11234 -7978 -20373 -8964 834 -7730 -10669 -13384 -12786 -19438 -33337 -26868
13147 -26868 -18925 -21574 -4616 -16536 -28435 -26633 -49546 -38243 -31934 -34993 -11402 -14074 -44267
13134d4267J430J4226j6651o661o403M6594P758j2048K044o519j6834J4906J1110
13121a1315J7944l489l21q375k960O063K471R770J1954k3561j1531j8157J2840
13108a8667N608J4953j677k1598O076o785N471K4472j0228j7027j9931q187J6297
13095c1223j4630K8954K5860K970k4782n916J4145O816k7066k4360P275L3445
13083h512L2210R589J3052J894j8948j8396j738o538m537O418m535J4102K0098
13070C4159O291k2569k7836r304J515O644J2631j2674J5353k31l7563q051R899
13057c1736j0680J2938j1751j5756N1088j411l5601q667K7459J4614k8656P243
13045c0916K7006M400k2071k6979N880L3628K3666j936k5913J18J3708k173J4015
$$ plain form
13134 -44267 -42837 -28611 -45262 -51923 -58326 -11732 -3974 -16022 -13978 -20497 -37331 -22425 -11315
13121 -11315 6629 3140 2819 -5556 -8516 -2453 18 9788 21742 -1819 -13350 -31507 -18667
13108 -18667 -13059 1894 217 -21381 -15305 -22090 -16619 7853 -2375 -19402 -39333 -47520 -31223
13095 -31223 -45853 -16899 8961 11931 -12851 -18767 -4622 2194 -24872 -49232 -41957 -8512
13083 -8512 23698 33287 46339 48233 29285 10889 9151 2613 -1924 4494 -41 14061 34159
13070 34159 40450 17881 -9955 -19259 -17744 -11100 1531 -11143 4210 3979 -33584 -41635 -31736
13057 -31736 -42416 -29478 -41229 -56985 -5897 -7308 -42909 -51576 -24117 -9503 -38159 -30916
13045 -30916 -3910 490 -21581 -48560 -42680 -9052 14614 12678 -13235 -13117 591 -1582 12433
$$ [...]
##END NTUPLES=NMR SPECTRUM
##END=
