##TITLE=Analysis number 318991
Compound Code cc 46209
Book Reference 440/182
Project Code adrs
Chemist Name craigr
##JCAMPDX= 6.0         $$ Bruker NMR JCAMP-DX V2.0
##DATA TYPE= NMR SPECTRUM
##DATA CLASS= NTUPLES
##ORIGIN= Bruker BioSpin GmbH
##OWNER= nmr
$$ XWIN-NMR		Version 3.5
$$ Wed Apr 26 12:26:43 2006 GMT Daylight Time (UT+1h)  MAYBRIDGE\nmr@NMR_250MHZ
##.OBSERVE FREQUENCY= 250.131544655141
##.OBSERVE NUCLEUS= ^1H
##.ACQUISITION MODE= SIMULTANEOUS (DQD)
##.ACQUISITION SCHEME= undefined
##.AVERAGES= 16
##.DIGITISER RES= 18
##SPECTROMETER/DATA SYSTEM= dpx250
##.PULSE SEQUENCE= zg30
##.SOLVENT NAME= CDCl3
##.SHIFT REFERENCE= (INTERNAL, CDCl3, 0, 16.522)
##AUDIT TRAIL= $$ (NUMBER, WHEN, WHO, WHERE, WHAT)
$$ ##TITLE= Audit trail, XWIN-NMR		Version 3.5
$$ ##JCAMPDX= 5.01
$$ ##ORIGIN= Bruker BioSpin GmbH
$$ ##OWNER= nmr
$$ C:\u/data/dgb/nmr/ADRS/3230/pdata/1/auditp.txt
$$ ##AUDIT TRAIL=  $$ (NUMBER, WHEN, WHO, WHERE, WHAT)
(   1,<2006-04-26 12:26:21.19 +100>,<MAYBRIDGE\nmr>,<NMR_250MHZ>,
      <created by zg, POWCHK disabled, PULCHK disabled
       configuration hash MD5:
       84 BC 41 DB A1 6E 1D 46 DA 25 12 A5 C1 ED C5 3A
       data hash MD5: 64K
       D2 0B FE FD E6 88 2E 3F 82 E4 1B DD 1F 96 1B 05>)
(   2,<2006-04-26 12:26:34.24 +100>,<MAYBRIDGE\nmr>,<NMR_250MHZ>,
      <Start of raw data processing
       ef LB = 0.3 FT_mod = 6 PKNL = 1 SI = 32K 
       data hash MD5: 32K
       DA C3 C6 C7 9E 80 FF C5 B8 A8 D1 5F 04 14 FE 4F>)
(   3,<2006-04-26 12:26:35.80 +100>,<MAYBRIDGE\nmr>,<NMR_250MHZ>,
      <apk 
       data hash MD5: 32K
       09 2C 72 2E AD 58 B7 26 A4 92 8F 56 F8 EA 87 F3>)
(   4,<2006-04-26 12:26:36.83 +100>,<MAYBRIDGE\nmr>,<NMR_250MHZ>,
      <abs ABSG = 5 
       data hash MD5: 32K
       4E D2 72 B7 52 E0 87 6B F5 79 31 6F 67 68 50 D5>)
$$ ##END=
$$ 
$$ hash MD5
$$ 6E 56 4F 36 96 31 AA 14 0A 01 40 9D 92 DE 60 67
##$RELAX= 
##$RELAX= 
##$RELAX= 
##$RELAX= 
##$RELAX= 
##$RELAX= 
##$RELAX= 
$$ Bruker specific parameters
$$ --------------------------
##$DU= <C:\u>
##$EXPNO= 3230
##$NAME= <ADRS>
##$PROCNO= 1
##$TYPE= <nmr>
##$USER= <dgb>
##$AMP= (0..31)
100 100 100 100 100 100 100 100 100 100 100 100 100 100 100 100 100 100 
100 100 100 100 100 100 100 100 100 100 100 100 100 100 
##$AQSEQ= 0
##$AQ_mod= 3
##$AUNM= <au_zg>
##$AUTOPOS= <25 >
##$BF1= 250.13
##$BF2= 250.13
##$BF3= 250.13
##$BF4= 250.13
##$BF5= 500.13
##$BF6= 500.13
##$BF7= 500.13
##$BF8= 500.13
##$BYTORDA= 1
##$CFDGTYP= 0
##$CFRGTYP= 5
##$CHEMSTR= <none>
##$CNST= (0..31)
1 1 145 1 1 1 1 1 1 1 1 1 1 1 1 1 1 1 1 1 1 1 1 1 1 1 1 1 1 1 1 1 
##$CPDPRG= <>
##$CPDPRG1= <>
##$CPDPRG2= <>
##$CPDPRG3= <>
##$CPDPRG4= <mlev>
##$CPDPRG5= <mlev>
##$CPDPRG6= <mlev>
##$CPDPRG7= <mlev>
##$CPDPRG8= <mlev>
##$CPDPRGB= <>
##$CPDPRGT= <>
##$D= (0..31)
0 1 0 0 0 0 0 0 0 0.06 0 0 0 0 0 0 0.0002 0 0 0 0 0 0 0 0 0 0 0 0 0 0 
0 
##$DATE= 1146050780
##$DBL= (0..7)
120 120 120 120 120 120 120 120 
##$DBP= (0..7)
150 150 150 150 150 150 150 150 
##$DBP07= 0
##$DBPNAM0= <>
##$DBPNAM1= <>
$$ [...]
##$SUBNAM7= <"">
##$SUBNAM8= <"">
##$SUBNAM9= <"">
##$SW= 20.6930455092707
##$SWIBOX= (0..15)
0 0 3 0 0 0 0 0 0 0 0 0 0 0 0 0 
##$SW_h= 5175.983436853
##$TD= 65536
##$TD0= 1
##$TE= 295.16
##$TE2= 300
##$TE3= 300
##$TEG= 300
##$TL= (0..7)
0 120 120 120 120 120 120 120 
##$TP= (0..7)
150 150 150 150 150 150 150 150 
##$TP07= 0
##$TPNAME0= <>
##$TPNAME1= <>
##$TPNAME2= <>
##$TPNAME3= <>
##$TPNAME4= <>
##$TPNAME5= <>
##$TPNAME6= <>
##$TPNAME7= <>
##$TPOAL= (0..7)
0.5 0.5 0.5 0.5 0.5 0.5 0.5 0.5 
##$TPOFFS= (0..7)
0 0 0 0 0 0 0 0 
##$TUNHIN= 0
##$TUNHOUT= 0
##$TUNXOUT= 0
##$USERA1= <user>
##$USERA2= <user>
##$USERA3= <user>
##$USERA4= <user>
##$USERA5= <user>
##$V9= 5
##$VALIST= <valist>
##$VCLIST= <CCCCCCCCCCCCCCC>
##$VD= 0
##$VDLIST= <DDDDDDDDDDDDDDD>
##$VPLIST= <PPPPPPPPPPPPPPP>
##$VTLIST= <TTTTTTTTTTTTTTT>
##$WBST= 1024
##$WBSW= 4
##$XGAIN= (0..3)
0 0 0 0 
##$XL= 0
##$YL= 0
##$YMAX_a= 384590
##$YMIN_a= -497920
##$ZGOPTNS= <>
##$ZL1= 120
##$ZL2= 120
##$ZL3= 120
##$ZL4= 120
##$ABSF1= 16.522
##$ABSF2= -4.171173
##$ABSG= 5
##$ABSL= 3
##$ALPHA= 0
##$AQORDER= 0
##$ASSFAC= 0
##$ASSFACI= 0
##$ASSFACX= 0
##$ASSWID= 0
##$AUNMP= <proc_1d>
##$AZFE= 0.1
##$AZFW= 0.1
##$BCFW= 0
##$BC_mod= 0
##$BYTORDP= 0
##$COROFFS= 0
##$CY= 12.5
##$DATMOD= 1
##$DC= 0
##$DFILT= <>
##$DTYPP= 0
##$F1P= 14.0000005364418
##$F2P= -0.99999901652339
##$FCOR= 0.5
##$FTSIZE= 32768
##$FT_mod= 6
##$GAMMA= 0
##$GB= 0
##$INTBC= 1
##$INTSCL= 1
##$ISEN= 128
##$LB= 0.3
##$LEV0= 0
##$LPBIN= 0
##$MAXI= 10000
##$MC2= 0
##$MEAN= 0
##$ME_mod= 0
##$MI= 0
##$NCOEF= 0
##$NC_proc= -5
##$NLEV= 6
##$NOISF1= 0
##$NOISF2= 0
##$NSP= 0
##$NTH_PI= 0
##$NZP= 0
##$OFFSET= 16.522
##$PC= 1
##$PHC0= 170.0888
##$PHC1= 7.274992
##$PH_mod= 1
##$PKNL= yes
##$PPARMOD= 0
##$PSCAL= 4
##$PSIGN= 0
##$REVERSE= no
##$SF= 250.13
##$SI= 32768
##$SIGF1= 0
##$SIGF2= 0
##$SINO= 400
##$SIOLD= 32768
##$SREGLST= <1H.CDCl3>
##$SSB= 0
##$STSI= 32768
##$STSR= 0
##$SW_p= 5175.98343685301
##$SYMM= 0
##$S_DEV= 0
##$TDeff= 65536
##$TDoff= 0
##$TI= <Analysis number 999999
Compound Code 99
Book Reference 9
Project Code 9>
##$TILT= no
##$TM1= 0
##$TM2= 0
##$TOPLEV= 0
##$USERP1= <user>
##$USERP2= <user>
##$USERP3= <user>
##$USERP4= <user>
##$USERP5= <user>
##$WDW= 1
##$XDIM= 32768
##$YMAX_p= 423543242
##$YMIN_p= -1031788
$$ End of Bruker specific parameters
$$ ---------------------------------
##NTUPLES= NMR SPECTRUM
##VAR_NAME=  FREQUENCY,     SPECTRUM/REAL,   SPECTRUM/IMAG
##SYMBOL=    X,             R,               I
##VAR_TYPE=  INDEPENDENT,   DEPENDENT,       DEPENDENT
##VAR_FORM=  AFFN,          ASDF,            ASDF
##VAR_DIM=   32768,         32768,           32768
##UNITS=     HZ,            ARBITRARY UNITS, ARBITRARY UNITS
##FACTOR=    0.157963299565203, 1,           1
##FIRST=     4132.6476996994, 0,             0
##LAST=      -1043.33573715361, 0,           0
##MIN=       -1043.33573715361, -1031788,    0
##MAX=       4132.6476996994, 423543242,     0
$$ Real data points
##PAGE= N=1
##DATA TABLE= (X++(R..R)), XYDATA
$$ [...]
23207 -78158 -134579 -85082 -37949 -25506 -65625 -66904 -213573 -284419 -180627 -127012 -113773
23196 -113773 -282836 -98605 -3719 -87741 -168929 -188491 -166911 -142495 -184760 -233332 -308603
23185 -308603 -208192 2135 68661 -91352 -220723 -263612 -88021 69194 23899 158445
23175 158445 234767 78847 -26367 -34215 28902 -110322 -183862 -218841 -260741 -18530 32329
23164 32329 117581 32356 49842 233780 277412 53042 -101952 -354601 -304283 -55815 -96083
23153 -96083 -160290 5236 17130 113038 190332 44993 31616 -86990 -142282 -128137 15801
23142 15801 -20484 -191535 -141626 -38297 -56193 103133 71062 7130 -191379 -137161 -55897
23131 -55897 -33027 24180 71409 -47703 -117733 -119387 -261215 -169171 -162253 -116862 91591
23120 91591 166601 -121744 -294500 -252839 -73925 62786 39516 36179 72801 42191 -74205
23109 -74205 -117947 -117230 -7515 11008 -77809 -32615 46959 75587 81725 79141 127693 -13414
23097 -13414 -54361 -29528 -67893 -80960 36083 182814 62246 -65570 -197874 -260595 -307363
23086 -307363 -437635 -305608 -187074 25781 186042 176164 199134 73699 -105769 -184123
23076 -184123 -38012 -179044 -248714 -145713 -54293 -113922 -147729 -183386 -149885 -28980 187211
23065 187211 159748 234011 94894 -66565 -194232 -244244 -287421 -249843 -161971 130496 264609
23054 264609 84112 77865 -49205 -252194 -237035 -128236 -56250 -10724 -45050 11587 98037
23043 98037 90622 -183667 -164084 -99547 -38447 -113457 -44067 -92082 -85475 -132554 -98844 -13849
23031 -13849 -191 -37751 64001 -13099 -129286 -49629 174002 427544 489655 402609 294187
23020 294187 278100 233985 74543 -50050 -116054 -138189 56718 95271 -61250 -189753
23010 -189753 -96734 -20265 201412 81666 28179 127404 75517 -17580 -46936 -217504 -247293
22999 -247293 -24885 60392 106273 128548 -19632 -70262 -88856 88240 231936 413807
22989 413807 369978 283846 159252 -58133 -314326 -307237 18245 -39930 -36372 -64740 -21275
22978 -21275 -68302 22190 208593 215600 150558 -109361 -29297 38397 3723 -72525 -93671
22967 -93671 -84229 -86962 145765 195007 109717 156946 275331 75769 -82349 12635 42780
22956 42780 -58456 -70608 -61775 -43960 2074 130528 113611 107903 160607 153166 53106 -84870
22944 -84870 -16577 -16145 131687 210375 128855 137128 182140 157844 191091 203448 15618 19919
22932 19919 36888 91942 80779 82651 139581 70384 -103639 -235824 -256540 -220045 -316384
22921 -316384 -311815 -237883 -171806 53485 36863 -102883 -77405 11967 205517 317914 199407
22910 199407 -13630 -148053 -157925 119688 33410 -129911 -170913 988 233346 28744
22900 28744 -38485 -4157 31859 105422 71833 -34463 -203359 -40417 113635 51863 198163
22889 198163 226583 -125249 31889 -47482 -26298 -10951 -128693 -211359 -210932 -264515 -263799 -335168
22877 -335168 -402189 -289733 -226002 -357688 -483545 -240177 59899 21155 -131665 -296429
22867 -296429 -395928 -207224 -32165 -99484 -212979 -182030 -262936 -464039 -368604 -342546 -311362
22856 -311362 -168321 -155039 -191991 -296413 -434221 -464258 -318443 -261686 -177749 -133457 -38891
22845 -38891 -65318 41248 102909 112793 -37704 -85144 -203906 -276202 -276691 -182214 -73958
22834 -73958 -54419 -35996 -344 63470 56937 94916 139187 41215 -36574 -30067 80422 115181
22822 115181 84606 91834 -13606 -146722 -195899 -130668 30917 15435 5696 94579 9486
22811 9486 -136257 -160950 -85880 -75755 35672 187456 150117 -16927 -3153 84353 168469
22800 168469 124296 -80264 73012 298338 280287 153263 112821 -47015 -209619 -275104
22790 -275104 -433963 -393471 -208653 -124650 69077 170896 75494 -13053 -147200 -14825
22780 -14825 -65413 -24221 -55645 -145006 -127269 15704 133763 171129 157116 107377 -59725
22769 -59725 -80697 -99562 -117109 54181 55657 128995 108498 -41596 24314 20270 -62518 -183900
22757 -183900 -197980 -53084 74921 -36824 -94817 -207502 -223011 -220925 -130677 -90957 763
22746 763 -13930 -108646 -250177 -310949 -334634 -286705 -193132 -178174 -107710 -181270 -116932 -209956
22734 -209956 6767 13342 -87343 -37967 38481 161278 267692 218666 212776 285360 227159
22723 227159 222517 168403 217919 157279 145029 76447 24172 -145825 -296608 -49223 231574
22712 231574 147972 168027 87586 -166488 -245417 -110054 45130 23561 -123576 -176662 -76338
22701 -76338 -51293 -72235 -63831 -268677 -307042 -297012 -127981 -119655 -62156 -45899 -174215
22690 -174215 -281792 -273296 -123181 -152306 -20171 109940 200166 293885 165142 -138653
22680 -138653 -41138 37368 130489 -109671 -275291 -305514 -282686 -127243 44676 41686 117795
22669 117795 101685 115754 247118 211461 157492 43079 -94989 -271708 -220205 -138623 2952
22658 2952 56301 16331 32103 -2380 -78776 -169965 -176301 -96329 -156925 -230361 -255504 -172769
22646 -172769 -17838 140334 201976 263375 381368 372675 169109 105248 -160771 -153369 -90864
22635 -90864 -22688 24653 -84451 -11557 47477 77340 126706 173114 276319 240723 158857
22624 158857 181828 109236 23679 -86478 -41828 90971 171242 202242 227349 280031 234628
22613 234628 109342 -31357 -113821 -72592 -136848 -175959 -198048 -125918 34629 146125 95489
22602 95489 -75678 -141961 -59235 7241 -33115 -95525 -38745 23106 -49476 58849 88754
22591 88754 -16277 -76477 -103901 -181893 -216198 -211765 23351 310619 352128 246521 70461
22580 70461 33741 99877 80016 -119379 -88729 132017 153407 61493 -9805 5832 -43949
22569 -43949 -134281 -87443 42908 161924 208659 176001 74091 36133 -42182 -209850 50402
22558 50402 232096 24889 -91788 -56570 103173 93295 106173 70141 99586 29759 16263
22547 16263 41879 -5563 152068 203636 158182 273101 63881 -132496 -297142 -39764
22537 -39764 94537 50842 316536 175625 141240 118105 84153 18989 -12720 -79515 -167528
22526 -167528 -270937 -250008 -193704 -197362 -74992 25094 17916 -88617 6299 139317 262961
22515 262961 188174 9397 -11838 -125218 -113967 -161005 -161430 -80658 -23729 -9639 -106513
22504 -106513 -114543 -54147 -80717 -169634 -90217 -220077 -310864 -350772 -383785 -310855 -267721
22493 -267721 -82283 6756 31939 191848 232354 84308 859 -160396 -182681 -228945 -340951
22482 -340951 -324273 -169725 -130844 -242926 -350473 -396823 -467408 -342309 -171024 -143235
22472 -143235 -382842 -438915 -299349 -211025 -145045 -143325 -147181 -165515 -112779 -135500 -135296 -125891
22460 -125891 -153356 -28531 -17509 -88013 -13466 -52928 -54207 65861 51837 37965 16405
22449 16405 -101552 -44005 48061 -49678 63669 94707 89859 -72307 -120370 -123644 -60210
22438 -60210 33549 92803 145353 -46354 2874 41940 -50589 -55705 -88607 -144385 -335413
22427 -335413 -417205 -340501 -184073 -77754 15297 151130 249291 246105 90118 85011 36053
22416 36053 -102605 -75611 -107616 -226448 -144533 115975 257417 210681 165435 72418 -20465
22405 -20465 -122034 -267926 -21031 95093 138598 -31501 -41886 90667 191114 226414
22395 226414 99557 210121 233901 240145 204685 -40589 38843 96898 69656 -102943 -68961
22384 -68961 54949 275216 415518 235528 54542 -568 99423 70225 1291 117776
22374 117776 160025 11220 49048 -28426 -99145 -93001 41113 100923 2889 82662 -31887
22363 -31887 17148 81972 -21404 103370 179104 56472 38353 -59341 -186245 -287562 -214643
22352 -214643 11271 11401 -94039 -53916 80767 165969 79345 -29824 -98986 -57106 -19656
22341 -19656 169644 347591 266573 271380 117991 28964 -37584 -16016 -104369 -62038 -51407
22330 -51407 19247 -24651 -122966 -225004 -89267 -58866 -19003 -75359 -67710 -76778 -127934 -222312
22318 -222312 3918 226130 177889 108348 108778 137733 156617 152429 127644 -4011 -37577
22307 -37577 -119327 -234601 -131484 -99743 -120430 -146673 -29331 -20316 -167055 -421618 -292681
22296 -292681 -143684 -157879 -16252 72110 30352 -82347 -189152 -319647 -224928 -198320
22286 -198320 -191898 -43938 60129 -19169 31034 -2907 -98422 -131891 40485 -28809 -98191
22275 -98191 -122865 -168648 -19194 237681 292204 193345 169685 102026 75138 -114678 -161974
22264 -161974 -209459 -226927 -97237 70116 764 -86739 -81731 -37483 12402 63542 198282
22253 198282 370239 453233 362535 203618 116275 149403 195214 229089 281968 182917 38813
22242 38813 16287 -190678 -285849 -415756 -205470 35049 185683 273622 162800 71756
22232 71756 19157 129997 206521 294113 156427 173539 338506 211463 84632 181204 217971
22221 217971 222536 148047 172186 80291 92524 -61159 -88717 -232093 -117631 12861 131663
22210 131663 271454 328096 169810 58133 -48516 -356436 -542600 -299620 -173711 -212694
22200 -212694 -206856 -181851 -128485 -120941 -193972 -208847 -107954 -18880 -183411 -98200 49582
22189 49582 112826 75077 42492 110152 267186 181860 -106483 -325885 -342203 -119813 16163
22178 16163 -117369 -55449 -70522 -240378 -128869 -55528 -24703 63733 68428 142210 82743
22167 82743 13826 -80315 10696 1087 37831 138542 41682 -126925 -175802 -194740 -143755
22156 -143755 -13290 92169 84080 87548 79153 -43389 -54043 -16827 11794 72607 19825
22145 19825 118781 199246 277155 342496 98733 108821 195537 130719 115322 14734 14804 73495
22133 73495 111964 87693 109003 204350 195124 2541 -238466 -241982 -172970 -48376 49856
22122 49856 11595 -81345 -173069 -182958 -151721 -87042 47734 25808 -38082 16356 190972
22111 190972 172098 47963 97243 100310 74234 10138 -276118 -280152 8625 169017 177295
22100 177295 186728 275505 288572 293892 237379 81894 -87667 -209394 -239084 -39920 105637
22089 105637 14565 -204633 -238388 -105167 16218 129321 94843 279327 387988 258549
22079 258549 64925 91237 112805 112994 94791 19343 -112181 -106773 123569 138229 138721 190293
22067 190293 214741 249015 185418 175376 193370 217932 102165 88180 119862 45754 -41951
22056 -41951 -159828 -122159 -172775 -265569 -194438 -147813 -247143 -308301 -79041 32143 6667
22045 6667 -18157 -130462 -9834 104443 194479 233083 311005 306945 197373 108250 -20816
22034 -20816 -135780 -170906 -95082 -316387 -343134 -233824 -119792 -323537 -272781 -169337
22024 -169337 -102264 16109 151041 214757 122018 62410 10089 -61765 18956 -112417 -230002
22013 -230002 -192496 -101844 -143185 -109476 -207358 -281641 -183196 -175141 -30620 -8799 -220985
22002 -220985 -418433 -286726 -12605 198081 89780 144299 56810 -161675 -232318 -214231
21992 -214231 -227582 -157964 -84447 21715 172407 115665 104339 193307 232021 103340 -44135
21981 -44135 -67129 -128366 -160176 -192428 -290223 -141041 -20183 10485 -129438 -58477 54257
21970 54257 58468 -12700 -83391 -40536 -534 169946 111632 -155245 -155259 108080 -16443 -107141
21958 -107141 -246988 -224180 -96640 -50421 37198 3938 -149086 -157640 -189528 -159704 -36814
21947 -36814 15168 99602 -4627 -46342 -58642 -184038 -427681 -333770 -353705 -273763 -140543
21936 -140543 -191693 -12416 39211 -74067 -123438 -252862 -383287 -260656 -257440 -281163 -286978
21925 -286978 -69360 172692 99648 24455 -42077 -10159 -27850 -75159 -174373 -99406 -114491
21914 -114491 -230502 -171751 -145674 -74484 40129 127217 106960 -578 -1297 -141475 -145263
21903 -145263 45046 -13484 -107411 -86393 -96991 -105185 173968 201558 65335 -30187 -94488
21892 -94488 -122597 15568 228949 128098 101947 84511 35754 7337 -54279 -131188 -274241
21881 -274241 41606 214194 79181 135961 -2077 66524 163331 12018 -142811 -150596
21871 -150596 10264 123307 -9579 -179347 -238095 -242897 -44740 18131 -83787 -123634
21861 -123634 -23419 2553 -47728 -182520 -134772 -138001 -313906 -269132 -212804 -186097 -334954
21850 -334954 -333878 -315024 -228566 11548 -36045 -46894 -96626 -40454 93863 315493 148661
21839 148661 118440 123280 176960 149982 148844 91184 -36639 -27897 -1158 -42545 110782 255519
21827 255519 297321 81782 -32776 83572 112703 45671 104179 420766 416704 369844 -60560
21816 -60560 -132514 -1969 87937 160167 197584 238331 89551 65715 49230 -89659 -4221
21805 -4221 102086 32406 -81472 -66443 -29307 103787 225935 258352 220002 148767 105160
21794 105160 285606 320428 227416 100528 124987 119696 57919 57901 61753 49394 -77235 -237027
21782 -237027 -129287 -13956 -36537 -157400 -264039 -299947 -135236 170263 181154 192945
21772 192945 144745 54073 81957 202373 171618 137843 155423 134437 -7771 -177467 -99458
21761 -99458 -129448 -169838 -180981 -170505 -9663 64447 -53597 -112592 -26524 -110714 -295828
21750 -295828 -213758 -101926 -87026 32502 29027 51806 29704 -209530 -349026 -326990 81875
21739 81875 285359 123899 -35374 -32755 29272 92366 -23509 -128577 -107948 -127431 -179732
21728 -179732 -40900 166360 331146 329195 217191 250166 156572 140973 108329 -43934 80021
21717 80021 -175860 -301363 -259547 -205956 -229801 -335490 -368705 -205353 -127304 -187696 -297457
21706 -297457 -287933 -128872 -61305 -31565 -82515 -142204 -286991 -286595 -192308 -144398 -232011 -228989
21694 -228989 -158075 -45483 -134788 -47754 -15482 196759 163565 -166457 -240889 -123822 -63335
21683 -63335 -179964 -346340 -275965 -198319 -238675 -129935 -71654 -78865 -105583 -133823 -100302
21672 -100302 -173335 -418065 -485439 -326217 -127942 -169975 -199858 -366798 -259253 -321851
21662 -321851 -303288 -230302 -336820 -488025 -360571 -54602 192166 253855 185360 98101
21652 98101 -12486 -78817 -110281 -157293 -172120 -85136 39311 45747 -40403 -128847 -101746
21641 -101746 -89348 -32189 126741 162513 105493 100128 142283 210672 258022 162795 158792 154554
21629 154554 186025 220931 172850 24509 136173 84717 -8774 42530 -33597 100688 102879
21618 102879 22029 -192295 -56458 66903 262200 204193 77556 55722 33979 135911
21608 135911 153597 -49483 -315165 -464332 -200783 -85939 -222612 -197456 -148040 -156530
21598 -156530 -118512 -39582 116502 212652 274398 268725 246443 270496 197365 228500 -37561
21587 -37561 -69941 66758 111265 13324 135846 108872 24236 92638 120028 85238 239698
21576 239698 272383 278914 275584 165824 36330 8142 20023 -67527 -94406 -137517 -145897 9885
21564 9885 55547 16051 -2389 135537 96439 -110642 -210204 -207257 -114049 -79138 -168465 -133917
21552 -133917 103134 190842 163103 104015 -14720 -145302 -264607 -375340 -325828 -295381
21542 -295381 -148714 -39143 51277 129803 320582 200051 126148 20077 -65524 -39585
21532 -39585 -78824 -52211 6781 23809 213867 220574 192687 279711 182542 10247 -112950
21521 -112950 -35858 -108499 -220624 -146068 -16402 21347 -18290 -136618 -122777 -37984 250507
21510 250507 378039 345432 273890 225585 175619 44604 -37485 -11656 -69885 -130372 54520
21499 54520 -7843 -90607 -178105 -47915 42359 -107628 -113146 22692 80052 56728 -84142
21488 -84142 34936 5392 -164327 -151576 -124586 -93179 3805 108866 151018 87259 50521
21477 50521 17595 14913 -29920 -24707 -237654 -272786 -270204 -221172 -290679 -183269 -165254 20070
21465 20070 172310 95228 235240 196703 -33813 -189061 -276904 -217457 -65212 52730
21455 52730 -25245 -87581 -32222 10251 -118345 -140163 -68283 -99424 -188922 -247479 -159687
21444 -159687 -92058 -102066 -191157 -168937 -336934 -223784 -170886 -170445 -169898 -110541 26314 -80223
21432 -80223 12136 107505 163306 195701 80588 -29815 -120632 -183250 -117503 75615 -20882
21421 -20882 -57583 -46344 36253 120466 32842 -196092 -221812 -138929 -80704 -37263 -81522
21410 -81522 -130234 -59788 51955 63278 98919 146063 71120 -8400 -14621 1138 -102675
21399 -102675 -63993 87734 -144819 -302810 -199293 -84741 83691 103912 38064 -27807
21389 -27807 -97505 -172009 -48605 -84908 -58555 -81488 195114 290060 151806 129542 125162
21378 125162 72087 -25634 -78076 -127889 -7715 8316 -41565 -6312 50255 91045 95824
21367 95824 56292 -7918 -79765 39261 -13722 -181790 -272193 -288641 -297732 -182265 -162176
21356 -162176 -146888 -80333 -70670 -115264 -220322 -306276 -256997 -126938 -121766 -94560 -29370
21345 -29370 83378 -5979 -89144 -137197 -20047 134330 43153 35631 -63590 -95684 46921
21334 46921 43894 42177 80503 60695 -5581 -82031 -130126 -128441 16041 144536 165939 62198
21322 62198 -12256 -50561 -163754 -48315 81648 7782 31906 -39214 -5817 101530 -26386
21311 -26386 -150484 -157417 -250950 -61522 52900 6084 -258160 -344426 -137787 -67880 -86545
21300 -86545 19911 -33305 8393 97505 31431 -85741 -203738 -197076 -164553 -147575 -160609
21289 -160609 -168028 -108524 5033 -21998 -91002 -2435 -9851 -54315 -246614 -182187 -235541
21278 -235541 -173204 -8749 44900 1147 -3484 -88137 -158036 -52714 107271 117846 52444
21267 52444 55423 -22515 -105874 -147398 -185071 -289562 -210121 -206389 -255555 -239546 -204260 -182480
21255 -182480 -137521 -223721 -94436 -83705 -246372 -174222 -154393 -146288 -117850 -19252 164309
21244 164309 406856 155867 -29496 52853 186437 -49093 -312521 -252732 -127441 628
21234 628 -15198 -60887 90658 242090 318562 76761 -131316 -183229 -259098 -132453 253784
21223 253784 243047 -26208 64044 143700 7155 -37016 15072 22811 -11834 -50121 60421
21212 60421 94690 -29986 -190642 -95381 239965 379014 319028 336307 232557 158660 39965
21201 39965 -11628 -62564 -217912 -167208 -96567 -28288 133288 103699 -60590 -98919 -78622
21190 -78622 -216027 -262271 -111110 70586 -14109 -16462 -84211 -119974 -158423 -357608 -317950
21179 -317950 -82992 -12729 -107239 -135879 67066 149512 150586 -16305 -250068 -235576 -109994
21168 -109994 5225 -136040 -127410 -164190 -222495 -237248 -199665 -82976 -58701 -79779 -16339
21157 -16339 78767 111381 123792 -15441 5649 65013 170319 98744 35105 -35313 -116885
21146 -116885 -123357 -51756 -106501 -43089 53538 180165 230615 169296 57922 17437 30213
21135 30213 -33313 -172804 -133705 56172 -24262 84729 126458 -56038 -110307 57703 135205
21124 135205 71658 14528 -4416 -114073 -144953 -125652 26418 24637 -21249 -175057 -133435
21113 -133435 -127355 -72638 -51273 -15523 234826 167838 -86800 -72433 32476 136748 165627
21102 165627 182575 247582 338431 356384 451657 392177 205948 215094 234509 209761 275100
21091 275100 175892 104391 113849 229896 180990 151432 193986 -43549 -312888 -178158 -72444
21080 -72444 -71777 -11390 54272 111056 9982 -112678 -153626 -95640 -142410 -163814 -58012
21069 -58012 21594 75594 66179 97094 -24596 161550 156259 170617 101809 37079 149149
21058 149149 -43066 -141332 -14106 28049 24825 2727 -93261 -163047 -183854 -255920 -168359
21047 -168359 48588 187556 137264 84309 70361 6952 -126157 -190286 -339708 -314649 -208473
21036 -208473 -102729 -116929 -44541 91834 37490 15834 -64773 -8502 -73139 -339889 -313299
21025 -313299 -240070 -196288 -70558 157593 -42875 -110403 -32151 26830 45713 73443 72424
21014 72424 54681 -128776 -186742 -123260 -4861 106164 160252 99323 -87824 -51533 -26636
21003 -26636 -107119 -427891 -490143 -266763 -139531 -31604 -134504 -255372 -51537 29296
20993 29296 -36471 -121946 25402 156335 190777 196495 253779 239888 155993 37345 8970
20982 8970 21330 97266 -116615 -100226 29954 215773 205127 54693 196552 224310 99427
20971 99427 5301 -67323 -202263 -261491 -146252 -25394 44991 -24992 -238432 -254425 -75578
20960 -75578 109196 133670 175438 229573 268516 74175 -38049 -99707 -227789 -309599 -288527
20949 -288527 -30099 -30991 -80494 -62469 -125840 -228401 -182738 -186719 -201089 -138669 -230371 -183246
20937 -183246 -85577 -3930 -62298 -138087 23275 -82499 -326889 -401621 -179015 -28379
20927 -28379 -66128 5536 10502 26180 -61056 -128535 -238097 -185485 -160921 -138800 -180783 -162243
20915 -162243 -116356 -202464 -186630 -36984 53381 42534 -52922 -58886 56981 2677 -39029
20904 -39029 -76180 -87622 -225228 -87889 134397 56593 -86687 -151885 -104594 -44865 -205913
20893 -205913 -277453 -324541 -243046 -93422 -166896 -310399 -207424 -140045 -103355 -81435 -137738
20882 -137738 -120287 -81116 -96533 -73720 -22359 13970 -3223 66573 -35323 -213841 -278943
20871 -278943 -208301 -151075 -14471 140187 -7328 -114320 -204871 -254399 -209208 -145753 26086
20860 26086 92602 186663 94097 153176 67166 66461 143443 43816 48373 142685 134506 20834
20848 20834 -80732 31451 328142 397594 246009 51779 104702 -101803 -324370 -237945
20838 -237945 -5118 -68057 18472 -54815 -92364 -89303 -136128 -144805 -127623 -178491 -200979 -247556
20826 -247556 -200710 -286815 -232062 -137053 2060 -34500 -32120 -13875 -2798 62320 5079
20815 5079 -260313 -252008 -167821 -4497 -141314 -160568 -130860 -120694 -5411 12141 -80288
20804 -80288 -1091 12013 145194 215345 156838 -22867 -66157 -162992 -317626 -435720 -415844
20793 -415844 -291748 -185195 -365867 -405349 -419050 -407505 -342821 -167352 -95306 -198024
20783 -198024 -162315 -129509 -167931 -184197 -171004 -201911 -148390 25084 19445 54192 261471
20772 261471 76623 -79835 10101 -153176 -226150 -165505 -126825 -47953 -66063 -80165 -32945
20761 -32945 113392 271444 133304 -95148 -360309 -357230 -193044 -20111 -89828 -168921
20751 -168921 -100233 -222774 -196881 89674 101160 102237 2460 91417 259728 113526 115275
20740 115275 119321 -24459 -76229 -253511 -187001 -21902 -195683 -54433 84903 94747 36420
20729 36420 81562 45089 67036 80136 12824 -98622 19917 105432 -89341 -102414 -6088
20718 -6088 113679 72596 -104790 -187528 -135026 42321 38705 4652 -71212 -131656 19666
20707 19666 181287 245964 195346 227048 205488 121658 -120839 -96710 61766 385100 444404
20696 444404 424559 146756 -13397 -98045 -51222 -128899 -283303 -303377 -165928 -68137 2688
20685 2688 172155 101938 179835 315906 225677 42492 -26981 104488 133548 -39784 -55657
20674 -55657 48802 57281 -2564 -34303 -98292 -30575 16879 110015 65850 -149909 -243275
20663 -243275 -78178 -1455 76842 10702 -129075 -334871 -408077 -219521 -43506 -39038 5549
20652 5549 -153381 -223638 -123214 -91182 -78366 136239 136951 65180 104266 259592 215742
20641 215742 161584 156858 37232 74733 11275 -147634 -182204 -124198 46766 62468 -180469
20630 -180469 -124341 24984 -58330 68417 62086 -2236 82201 33770 78709 134525 87514
20619 87514 10440 -19309 26433 -23177 113530 181686 64832 11010 -58574 -45332 184886
20608 184886 341304 396189 359234 284893 86514 29789 160156 152714 37909 -82120 -242054
20597 -242054 -402395 -325481 -99609 -96873 -37494 -30355 38633 296927 184630 -2341 -121563
20586 -121563 -84620 -261019 -78470 -19805 -194742 -196082 -81470 -23787 -33739 88829 153843
20575 153843 65214 41096 -24987 -83370 -83488 -257878 -292484 -221773 68743 60391 -57017
20564 -57017 -14097 -230221 -386025 -283217 -253515 -251749 -246595 -178522 -44516 -12312 -61382
20553 -61382 1510 21041 -95397 -137613 37269 131292 67554 25412 89248 -8252 -35824
20542 -35824 -172021 -311636 -180900 -61567 -15543 -4185 64441 62921 -31727 -73292 -78785
20531 -78785 -48636 -90928 42486 217399 258605 130453 15970 -220763 -241240 -242784 -252348
20520 -252348 -44099 -52539 -122594 -189050 -19011 62229 90440 15614 137675 249420 295456
20509 295456 212938 240885 212287 115461 63312 23683 -27612 -71399 10077 -97043 -222986
20498 -222986 -251559 -184761 7097 65065 -97882 -53383 60961 30836 -147013 -227606 -154683
20487 -154683 -106880 -141091 -148308 -45166 35167 -82164 -63895 -7955 154807 146197 141732
20476 141732 -59934 -67487 13114 -132190 -110411 105552 49892 -93858 -225822 -203771 -232592
20465 -232592 -219860 -149509 -124929 -1631 -97201 -108600 14805 -48522 -113606 -82637 -74597
20454 -74597 -203877 -314483 -178809 -202585 -71604 84681 139445 185592 282592 380087 481826
20443 481826 195763 -92636 -156503 11788 -45461 -321472 -287197 -126285 9337 9865 -22175
20432 -22175 79037 -47670 30127 329560 324776 35985 -100036 -187372 -9283 -85009 -58979
20421 -58979 -68926 -198643 -214417 -90736 114054 272829 354908 300924 157824 119146 40183
20410 40183 105857 184034 176228 -78272 -69665 134957 164610 164377 104311 117840 194643 180682
20398 180682 205114 19680 -101897 -77667 -193047 -64997 117343 90711 81147 20485 59756
20387 59756 -51873 -151073 -286477 -181326 -151816 15077 88145 -221 143034 257319
20377 257319 141806 -28296 -174549 -136015 -137006 -141388 -21679 -69020 -111669 -261056 -353408
20366 -353408 -360115 -333790 -379809 -384925 -257317 -107471 -118496 101133 163488 160669 258655
20355 258655 312815 273489 208483 153361 23195 -27086 118585 796 -46791 -51344 123034
20344 123034 75056 -18434 -140206 -212816 -138907 -20041 -45866 -737 172554 156972 -119535
20333 -119535 -121162 38312 -20385 -94373 -138946 -100437 -97453 -174825 -173736 -12300 167897
20322 167897 107735 188133 206713 169961 21902 -49687 15221 -37018 -123282 -83327 107950
20311 107950 48479 -47671 -127476 -72146 -5464 63742 -55056 -72948 16287 26902 44790
20300 44790 198685 85087 7019 -110621 -160740 -107716 -111779 -188427 -177803 -73843 -45357
20289 -45357 145766 85315 61036 -203407 -258862 -129013 30108 3308 -16677 137483 89370
20278 89370 54341 -35116 -18398 82127 117845 4515 -155047 -313022 -396494 -198143 123875
20267 123875 74773 -31270 105169 112459 86572 -89129 -71921 88415 149 -11804 -12695
20256 -12695 -43879 -74912 -32372 99334 111157 -13499 -55910 -91921 -61631 70043 214982
20245 214982 183622 214392 122254 77965 -86641 -342141 -206579 -27577 -125363 -120887 49752
20234 49752 191398 33487 -136310 -173932 -86266 -58447 -65151 -28560 10745 95567 87345
20223 87345 159994 137872 216929 135953 -48606 51999 137924 43559 -28402 139159 220510
20212 220510 173710 217945 297566 343144 135230 155538 275519 185240 86353 -17975 -48998
20201 -48998 32577 191097 194452 161676 228549 78307 -80279 52613 53310 -1648 1405 -68412
20189 -68412 10937 294473 377055 246418 200422 119124 188577 138830 31323 -40999 -137340
20178 -137340 -169216 49803 -30684 -39921 124305 309183 268993 220044 177083 -78212 -178485
20167 -178485 -187841 -137572 -31037 -45663 -63596 69648 186198 7227 -156306 -176976 -47530
20156 -47530 -152165 -253758 -142821 -148215 -260842 -173627 4207 133136 97083 169642 206457
20145 206457 251833 160093 91199 96077 63166 -130588 -146475 -111371 -168852 -282723 -163532
20134 -163532 -239001 -231848 -283070 -275058 -91768 56159 91536 134775 -7625 -105651 -60445
20123 -60445 -49674 -62345 36771 79367 244732 284683 302044 54514 78660 56451 -32095
20112 -32095 -12401 20111 38800 87771 182698 81302 72665 220154 366229 310250 66932
20101 66932 -36958 -214812 -203870 -68736 7225 -73370 5371 -112858 -200654 -158088 -150254
20090 -150254 -203505 -167290 -22984 -151757 -132172 63548 159313 138082 97505 141119 56988
20079 56988 47206 284025 139257 -176054 -118728 -232770 -115357 159767 110911 37498 43548
20068 43548 -24144 20150 40127 -42995 110782 189400 113027 96830 134602 44759 -23826
20057 -23826 -85260 -101483 -132931 29112 107955 -103558 -117927 -141065 -65863 -83943 60115
20046 60115 133324 110665 116770 104830 79492 -36212 -193869 -290637 -107030 5332 50824
20035 50824 196070 170059 119217 89304 57429 -113628 -135922 -18258 47664 32707 113396
20024 113396 73439 68543 -30636 -7493 26295 208153 136527 -154528 -413710 -497417 -397991
20013 -397991 -155820 -8398 61792 134431 200311 291254 244365 290621 219645 201424 279147
20002 279147 38128 -89469 34825 114710 11853 94019 74449 72166 59582 -69235 62497
19991 62497 190894 256454 211890 245646 167830 193949 259374 91570 8940 -27254 -164661
19980 -164661 -283320 -242351 -160672 -238823 -116595 -135464 -185378 -300774 -330330 -69467 136402
19969 136402 245727 103643 -14746 2076 -82195 -74355 -207759 -98039 -38068 25258 -63941
19958 -63941 -125342 -3843 -57599 -32112 223638 373900 166071 98450 -29789 -86633 92409
19947 92409 133164 167234 204409 162777 195093 130989 -63420 28975 154563 110889 106158
19936 106158 138933 79757 201648 367090 321058 77003 -33878 117225 339955 244369
19926 244369 198350 117966 156405 150338 77354 -127945 -311010 -215444 -228867 -97746 26954
19915 26954 126606 109920 -127662 -87857 -35070 -87257 -149670 -91928 -147796 -4220 240980
19904 240980 202554 22955 103102 -1462 -117440 -109846 -172088 -175065 -80429 12010 -87927
19893 -87927 -100479 -117856 -50339 -49533 -56197 -44863 -81098 -102725 -67899 55929 -57697 -93522
19881 -93522 1892 110972 -106245 -15405 45467 -87728 -200226 -282030 -111358 -10528
19871 -10528 28151 23418 45802 92836 41014 30864 -87003 16654 13573 66847 71057 -1087
19859 -1087 93490 299495 355454 124014 122114 81356 109201 73437 -27081 -43578 77758
19848 77758 16742 -130960 -132222 -134204 -332056 -352570 -155660 29897 -1392 -56000 -52059
19837 -52059 -182067 -298207 -177686 -23196 -91474 -71630 -69985 -93606 -87235 -8905 134824
19826 134824 111611 108526 218000 30895 -22914 -29094 -8181 102932 134278 113501 -21986
19815 -21986 -35286 44150 35203 -58938 200940 152237 92209 3628 -90213 -187867 -80360
19804 -80360 46229 30018 -81959 -26933 95764 341451 333985 157245 173206 240266 256225
19793 256225 74350 73440 -7265 -47276 -16000 -84616 -13564 17211 82544 180811 216869 93341
19781 93341 46853 12449 -73302 175184 108327 -138794 -239277 -282382 -323545 -50584 13245
19770 13245 -111667 -256532 -158209 -85648 -189360 -297667 -205960 -143461 -151873 -139470 -111496
19759 -111496 -65983 -76886 126810 91860 106232 -29504 -121951 -180316 -152759 -202672 -151989
19748 -151989 7571 -36232 52925 90878 -46782 -118511 29535 106736 57733 -15400 22867
19737 22867 29983 -33778 -4302 -116544 23226 234101 248021 319593 211695 184364 233042
19726 233042 104957 21485 -85368 -107037 70439 218848 197815 151477 19488 -13347
19716 -13347 72966 12987 -219750 -176975 -130193 -244865 -104632 -265107 -364528 -400176 -340323
19705 -340323 -279401 -194973 -259138 -283826 -84501 -79716 -122522 -196369 -161019 72551 184409
19694 184409 136188 58943 -11647 35687 -42120 37890 -2661 -100196 -209238 -114939 -9391
19683 -9391 23610 29311 130761 145424 147962 65537 -196725 -242498 -250373 -156995 -24464 -89644
19671 -89644 -177143 -205060 -119871 4904 86469 203306 253214 176243 308587 317112 256846
19660 256846 42756 -28560 105636 149307 226497 194564 116142 114886 -53603 -188319 -27641
19649 -27641 6906 -95796 -29886 58533 -29281 -116192 -129237 -149683 -109767 8199 -59384
19638 -59384 -83210 -139766 -146706 -72465 81072 37322 -39163 46208 82491 72805 35182 50189
19626 50189 77989 131138 249637 351787 253036 124837 123255 11578 79963 47959 52420
19615 52420 35809 -132497 -163453 -113111 1320 7488 16454 198983 299257 213989 183375
19604 183375 168886 143750 95202 89925 56898 -43861 -161096 -146563 -168975 -102 -175018
19593 -175018 -78448 52645 -59874 33168 206926 59378 58894 135493 39289 -115402 -213047
19582 -213047 -205434 -102793 29157 -47529 27945 168818 158059 191202 130026 84524 -1933
19571 -1933 -46892 -83452 -207248 -293541 -245320 -20312 95557 170390 87832 -131721 -94855
19560 -94855 -46652 18826 -71183 -124464 -82389 -21929 -37785 7663 85719 115450 -13525
19549 -13525 -21284 -37261 -64288 48716 42075 88689 80935 -73866 -147265 -138683 -217463 -293684
19537 -293684 -306891 -75176 181352 204597 194328 86581 5995 -41697 -305848 -204481
19527 -204481 -156223 -188752 126462 444039 321990 350193 385565 288738 81158 -16977 -15968
19516 -15968 -178144 -41796 184007 264675 268737 138767 120820 -46234 -89184 -136426 81127
19505 81127 148350 66765 103257 192569 235441 159684 -40992 27020 11839 17281 128552
19494 128552 182285 105308 82488 12826 -161972 -213854 29801 111975 207290 356628 260689
19483 260689 96895 -15118 35259 46222 154113 184755 38942 -146345 20727 262551
19473 262551 203886 2155 17754 -43771 -82937 7346 162224 213713 249574 158197 -1188
19462 -1188 -65143 -120238 -140224 -67243 -127814 -216510 -221170 -338856 -289532 -187051 -120174 -72909
19450 -72909 -152842 -85060 -26769 58210 334359 405078 334175 236805 111484 -25566 -163618
19439 -163618 -200448 -125474 136609 180110 75853 134261 191174 181598 244681 277449 150335
19428 150335 -18976 14116 116175 -57234 -122688 13296 57869 20934 -1867 163741
19418 163741 80204 53654 121552 174185 138607 -16108 11975 20184 61781 -59621 -34702
19407 -34702 84638 211974 268104 284409 283146 207983 43728 35574 189837 234216 227193
19396 227193 94218 103273 396480 645703 540745 334119 139351 170557 188500 161410
19386 161410 69674 163191 94150 166833 259701 331904 371374 296483 107202 -19756 -2055
19375 -2055 232564 457921 273027 210301 343471 459308 356533 179351 134194 186309
19365 186309 193151 31422 70259 156838 226928 101840 168882 128007 15275 -3015 -170686
19354 -170686 -103573 -116277 -253855 -12373 114216 353933 307483 76045 -71071 -5888
19344 -5888 105072 153728 152092 168763 56261 24561 173765 159939 70337 72853 169961 189766
19332 189766 169441 34446 94658 115748 207871 145107 44988 10175 39385 147288 240077
19321 240077 187149 134928 59237 152850 242262 162745 143810 236225 214254 116926 -80837
19310 -80837 1427 166349 231924 96162 -80680 -120592 -19411 67014 225747 141925 -55927
19299 -55927 78594 205127 281003 222308 137339 154208 396666 477447 368676 192852 118188
19288 118188 248262 300750 298029 298699 144910 181598 86541 144351 98847 95651 131249 -14177
19276 -14177 81965 159935 374183 403704 592982 706236 621929 643301 602558 502772 308104
19265 308104 468353 485394 550448 512218 468524 452851 264037 163392 -66494 2610 270439
19254 270439 369693 323289 204293 257723 370491 332913 326968 423537 430400 503554 729181
19243 729181 694978 650872 627224 640563 530654 534421 478366 246231 83446 231333 287040
19232 287040 351824 475363 603263 430040 436893 578207 614786 560447 356700 295723 423261
19221 423261 653438 782814 826261 704054 649301 805807 707170 544932 463732 550304
19211 550304 569951 762458 853082 897165 642192 533495 676948 647545 688845 846864
19201 846864 911669 909188 1062279 914439 914231 1042150 1160301 1248010 1358072 1340330 1179849
19190 1179849 1047417 1069724 1161286 1232137 1296136 1118593 1047377 1011771 1079168 1204627 964159
19179 964159 972159 1044276 910514 796817 746596 782419 806121 680151 415568 313084 290576
19168 290576 277372 457978 518059 448229 422409 390145 188843 190733 447724 402935 236919
19157 236919 315529 291027 396891 368350 392198 483735 536284 621593 593229 566704 547379
19146 547379 639320 626700 402891 268836 179658 167763 171341 61175 13541 133269 158165
19135 158165 265953 300993 246558 306033 99627 32993 197940 430689 580640 625681
19125 625681 507776 339885 373361 288677 307843 301253 410890 638007 755235 613860
19115 613860 512503 362349 459746 509357 329327 164390 274681 351310 388595 261638
19105 261638 89116 244610 318146 390276 385272 530206 533466 506025 333449 356826 491224
19094 491224 467106 283943 266710 445162 461048 471206 403716 205975 171884 123451 128197
19083 128197 104517 225606 362275 315318 229812 -45349 -112470 -37929 142161 188132 36647
19072 36647 74676 211338 255734 164299 337147 359407 353314 415799 284122 246097 228083
19061 228083 42588 -60692 -82782 95477 313463 164564 -13624 -5013 28897 109461
19051 109461 -84631 -93574 -64611 37236 220668 250990 422858 561058 580961 535321 423916
19040 423916 303057 294653 240926 281720 453969 326868 139780 335713 456665 591749
19030 591749 677989 837661 902328 685081 642232 572351 470121 508556 670410 497969
19020 497969 400427 505347 662295 752905 808991 801476 774361 777889 686933 534952 447467
19009 447467 423679 528539 667393 554137 437174 542551 504765 395946 418396 465542
18999 465542 467467 560380 559606 573035 551703 655007 587333 483521 475755 413366 528265 651584
18987 651584 658486 757760 818677 822894 827910 597022 413661 531779 583720 558826 689935
18976 689935 800083 778748 675364 616813 657019 815474 732825 495949 460862 522901 523308
18965 523308 416533 551438 649074 531741 561771 463638 358351 435610 429599 424189 384566
18954 384566 452546 514271 481064 561680 465451 350140 524139 525962 491227 565928 722502
18943 722502 704583 646299 620104 636436 641334 623296 657483 657913 622113 473014 622140 751669
18931 751669 646838 549323 534109 533742 445958 618832 724702 944513 949284 921517 672820
18920 672820 362644 210359 35297 98084 185699 243134 412254 601992 574074 413130
18910 413130 319847 416519 465429 533287 569312 691604 811293 866925 696322 572041 437359
18899 437359 445028 547276 658542 749464 1009790 983898 979812 994281 1028456 1158360 995250
18888 995250 880348 816366 727230 670742 627496 506970 524576 808818 1024435 1077738 1062319
18877 1062319 1106430 1402400 1516763 1449869 1362660 1286427 1184124 1037749 1074385 1003057
18867 1003057 925191 854015 853657 573667 527438 747510 801203 874075 1049677 1142420 1316504
18856 1316504 1276548 1055266 869704 1013606 985214 940348 1222855 1310110 1370775 1329988
18846 1329988 1362792 1394775 1379051 1441894 1542537 1565859 1642964 1663719 1712376 1766187 1721915
18835 1721915 1813767 1989446 2047874 1922277 1792879 1661023 1662402 1572529 1538620 1651144
18825 1651144 1641202 1552131 1462490 1449874 1448995 1520266 1632932 1698554 1830744 1937157 2093292
18814 2093292 2254367 2345007 2461943 2703479 2849075 2858285 2821634 2761968 2713861 2814189
18804 2814189 2799138 2714626 2700635 2854099 2905771 3312536 3953934 4578121 5628818 6949023
18794 6949023 7904885 8489076 8805427 8545903 7679384 6870480 6304085 6168637 6377265
18785 6377265 6552022 6673114 6766936 6743245 7023590 7268222 7494628 7851786 8546032 9453408
18775 9453408 10917786 13187074 16946254 22724201 31175655 42340726 55332433 68814921
18767 68814921 81244551 90593575 94725851 92883050 85904515 75750496 64149956 52850937
18759 52850937 43782114 38059663 36055057 37512412 42302448 50499860 60683568 70227493
18751 70227493 78042321 83973885 88061543 89833677 87672739 83327413 78919737 72582952
18743 72582952 62391321 51124448 43181961 38531352 36131176 35380194 36579608 39387195
18735 39387195 43132336 47923429 53665219 58856957 62120323 63634180 63283464 60590030
18727 60590030 56233792 51844848 48965045 48657479 51433901 57199748 65170934 72795078
18719 72795078 78238218 80483713 79230792 75277175 70432721 68113404 70138813 77500068
18711 77500068 89313245 103411636 117104737 127405910 131249550 127816788 118020972
18704 118020972 103947017 87533593 70973571 56820075 46257091 39168847 34604577
18697 34604577 31437982 29300173 27703467 26700924 25772548 25118663 24700285 24339913 24275522
18688 24275522 24487903 24915793 25506361 26025985 25967582 25567469 24760733 23725657 22395312
18679 22395312 20766869 19267755 18016476 17074658 16235448 15688527 15257552 14762372 14140329
18670 14140329 13741605 13411218 13069569 12829541 12489105 12162215 11922270 11910734 11912738 11872718
18660 11872718 11772933 11622242 11480911 11179160 10743752 10405806 10179082 9837620 9493779
18651 9493779 9078022 8626368 8322602 8211011 8135252 8176803 7988248 7860827 7785418 7714692
18641 7714692 7552064 7441146 7281656 7209428 7201108 7097317 6963379 6640941 6601179 6720262
18631 6720262 6744495 6621352 6420272 6427470 6639886 6588185 6503318 6507770 6586298 6481716 6448729
18620 6448729 6492923 6524411 6490466 6409252 6349260 6284321 6025743 5788353 5692027 5680460 5536791
18609 5536791 5524868 5518268 5854639 6134594 6254520 6427048 6715400 7098453 7198672 7442705
18599 7442705 7537411 7480927 7483515 7608211 7665324 7771490 7852826 7872410 8221651 8545709 8856157
18588 8856157 9211120 9501499 9723028 9966694 10180250 10406937 10692379 10902795 11002802
18579 11002802 11290578 11700358 12306841 12801719 13157480 13591487 14366542 15379635 16782838
18570 16782838 18653535 21553367 25852029 31973657 41820714 58696515 85633161 117037275
18562 117037275 142006702 162421138 182379510 198805151 203818393 197556518 193158463
18555 193158463 191286694 184365183 173379298 171982008 181850382 192261505 204120831
18548 204120831 217091299 224544954 218747929 206161363 196248867 184213005 161770062
18541 161770062 130928975 106730347 95167616 92006740 94438745 99466906 103830420
18534 103830420 108371852 113077383 114121435 110433990 105373120 99957166 92859185 85634787
18526 85634787 80934211 77990626 76596683 77486687 79361290 79607550 79194018 78970334 77257222
18517 77257222 73739520 70599823 68827202 67450568 66174642 65949139 67218036 68187056
18509 68187056 68086036 68013020 67854688 66324676 63103784 59883419 58139065 58005034 58895320
18500 58895320 61603520 66870805 74956772 84291372 93286001 100385012 104605667 106581100
18492 106581100 105244856 101224325 96496542 90729017 83172250 74860491 67704572 62427201
18484 62427201 59622292 60736808 65282641 72254637 82562450 95907383 108343155 118138684
18476 118138684 127300095 133486050 131982947 124772497 116169000 105002174 90355661 76344016
18468 76344016 65078121 55595638 47481691 41653403 37869250 35260068 33014278 31128838
18460 31128838 29848053 28782056 27939203 27295365 26752591 26420626 26204184 26429224 27040729
18451 27040729 28162455 29190861 29951128 30259258 29604828 27997074 25835430 23704396
18443 23704396 21859335 20301371 19304637 18608700 18078780 17520098 17170991 17024534 16866580
18434 16866580 16700092 16701440 16895263 17334708 17788370 18025978 17960280 17547406 16997222 16029383
18424 16029383 15133417 14289168 13569258 13086609 12709936 12544553 12271108 11962177 11630902
18415 11630902 11375849 11419690 11433756 11040164 10578807 10440391 10350483 10225246 10054937 9829076
18405 9829076 9846400 9717707 9520804 9282719 9336914 9394474 9103250 9069527 9099278 8964157
18395 8964157 9037372 8963118 9026457 8815273 8641477 8240376 7820781 7459069 7146990 6963267
18385 6963267 6792709 6686197 6591866 6572032 6590598 6574471 6590231 6619492 6640994 6652126 6649804
18374 6649804 6744875 6830774 6885273 6991458 6917582 6854968 6695415 6675604 6363296 5867053
18364 5867053 5730916 5887077 5824187 5739776 5706280 5657586 5473544 5475094 5455936 5522918 5922427
18353 5922427 6301134 6460077 6648690 6687738 6638781 6595844 6623676 6442234 6326261 6227056
18343 6227056 6103525 6127744 6253715 6384748 6452897 6471576 6850031 7457201 8065971 9198821
18333 9198821 11082924 13521583 16315388 18536990 19928362 20269028 19362759 17309117
18325 17309117 14916134 13206793 12441723 12706539 14049045 16737174 20984253 26412377
18317 26412377 32367307 37081997 39882018 40079015 37400055 32679326 26902539 21986751
18309 21986751 18138118 15689876 14452543 13742797 13304838 13037795 12585073 12396716 12180782
18300 12180782 11961978 11896043 12078535 12518515 13186759 14132820 15415110 16987850 18779628
18291 18779628 20713048 23298550 27029366 33171434 43359669 59484157 80922571 103456635
18283 103456635 121267872 131501043 132995025 124164906 106833844 87369133 72505873
18276 72505873 64802298 63684165 68289706 79396220 97479592 122260699 153151030
18269 153151030 185821006 212809285 226324998 224803033 209237308 181398335 146793282
18262 146793282 114790113 91682321 76777998 67266677 61223186 57279150 54952597
18255 54952597 54255750 55020074 57634612 62803117 71744310 87843898 117741113 166865223
18247 166865223 222874691 259503175 278333268 282085741 259284424 205919200 148265466
18240 148265466 111407890 90525378 78130540 70451297 65513498 62516160 61012746
18233 61012746 60442622 60876730 62729768 66244219 72304042 83035633 100892852 125886829
18225 125886829 154622777 180127653 197400933 203709152 196338970 175991062 148551236
18218 148551236 123161365 103791079 91255902 85345500 86638410 94958953 107373954
18211 107373954 118126986 124184103 124601473 117706495 102944710 84553617 68731307
18204 68731307 57767196 50778923 46229244 43042737 40642836 38699368 36857487 35045450
18196 35045450 33439815 31945897 30668417 29559264 28560832 27713260 26895631 26394093 25998676
18187 25998676 25660846 25020367 24611167 24311981 24364057 24995173 26310540 28373797 31646186
18178 31646186 35370316 38516838 40515855 40900914 39147217 35636569 31398374 27671361
18170 27671361 24788678 23106839 22278867 22337677 23384017 24900799 26143075 26698954 26324819
18161 26324819 24978567 22947035 20471089 18315194 16783715 15835702 15309136 14817184
18153 14817184 14563503 14295117 13825397 13299033 12989999 12670069 12427126 12488008 12206955
18144 12206955 11897476 11912771 11972357 11881281 11682113 11407227 11102238 10770697 10694856 10569429
18134 10569429 10220234 9973497 9804585 9709934 9639151 9629172 9534910 9357330 9394404 9566027
18124 9566027 9841658 10103998 10328309 10654428 11336681 12008930 12649722 13429231 14350304
18115 14350304 15471362 17078118 19436046 22738182 27823966 36556464 52727670 83498007
18107 83498007 128994458 163982077 180470141 189338877 182309706 148837522 99891053
18100 99891053 67315956 50172795 40493694 34384925 30245279 27187077 24935487 23342899
18092 23342899 22153830 20936909 19796007 18734582 17774612 16984633 16392468 16085997 15427027
18083 15427027 14761989 14306793 13742009 13191168 12756817 12332407 11881749 11682359 11506287
18074 11506287 11350680 11228596 10959559 10790278 10545518 10295980 9931717 9518438 9274947
18065 9274947 9107299 8967707 8664261 8261795 8067173 8075609 7961301 7766389 7553751 7363964
18055 7363964 7220232 7165715 7106607 7168844 7231992 6992527 6942075 6868364 6802932 6665115 6509574
18044 6509574 6355251 6182657 5916657 5541736 5453642 5329971 5080005 4774159 4631990 4550002
18034 4550002 4681481 4831254 4806534 4651297 4597878 4727998 4770923 4707973 4743019 4717307
18024 4717307 4793816 4875416 4859494 4733661 4503135 4387598 4280607 4231996 4192109 4258907
18014 4258907 4216718 4008313 3847402 3821083 3881910 3964774 3955601 3769715 3526733 3288739
18004 3288739 3103227 3220795 3290933 3225651 3208198 3250675 3302247 3322797 3418415 3323154 3086129
17993 3086129 2975992 2884098 2828472 2811473 2813667 2824736 2798412 2643910 2626028 2684910 2817128
17982 2817128 2826352 2984331 3256812 3305216 3270600 3267038 3352163 3155436 2971626 2789308 2621296
17971 2621296 2596111 2603812 2562313 2634325 2787430 2835184 2901190 2945807 2752056 2528186 2285378
17960 2285378 2154514 2031687 1953706 1878208 1937878 1741905 1815664 1941018 2043096 2006784
17950 2006784 2080009 2119695 2050200 1821612 1669676 1597898 1615747 1525310 1427343 1286486 1235422
17939 1235422 1480743 1556062 1384078 1261253 1287473 1371778 1408939 1534503 1521186 1265420
17929 1265420 988842 966490 855005 832543 962744 909561 861260 913977 951051 892986 869747
17918 869747 1081096 1237755 1483286 1741882 2145951 2200544 2112880 1895571 1937535 1884344
17908 1884344 1833159 1867317 1813825 1991286 2066872 2066944 2098888 2176439 2074255 1921886 1724113
17897 1724113 1622837 1539411 1304010 1132961 1097987 970599 992515 1021806 910728 842535
17887 842535 804885 832613 752845 717713 606740 683936 708898 617365 446214 414475 462895
17876 462895 597252 731904 717607 573357 517145 425063 507042 459829 427283 472387 471038
17865 471038 620622 821545 954745 890452 748014 701128 622654 440047 502638 682881
17855 682881 776008 881410 815644 870118 617730 425824 480176 474716 461716 295168 315239
17844 315239 347534 420546 331851 328397 289304 233579 254381 237829 284217 316396 223815 274389
17832 274389 234655 281451 207404 185419 127126 317929 451465 491388 416811 459143 595459
17821 595459 482282 405958 400695 578179 545471 415414 383219 369557 371780 437413 618385
17810 618385 619358 580870 638426 598267 581190 732933 682081 604687 511553 453135 567936
17799 567936 614522 802350 777160 614886 630994 635029 555793 494195 438135 275995 141832
17788 141832 201335 43594 -137439 -104378 81641 106526 210096 298788 248216 143229
17778 143229 269984 395598 537002 452342 375962 520334 471831 377243 467060 501262 243861
17767 243861 127918 316488 443008 543844 487918 610236 700674 811579 943112 1078074
17757 1078074 1228490 1290177 1327455 1270399 1262908 1328050 1501565 1691151 1883220 1936320 1888391
17746 1888391 1648223 1446128 1351707 1202266 1133199 1062251 882975 556444 570236 510100
17736 510100 583445 593951 472034 419008 426918 424976 561552 793389 1056177 1101122 1122438
17725 1122438 1272597 1404496 1595315 1624487 1459709 1275124 1126376 959569 865733 978970
17715 978970 981958 925050 958877 1185251 1279657 1293392 1354592 1269138 1024499 884837 809234
17704 809234 718395 545017 545216 509579 536003 464009 336323 464263 423460 139175 -113309
17693 -113309 -13695 305158 468624 189470 -52243 123503 221043 444362 443249 466618
17683 466618 341136 259751 379280 385266 211199 337502 284509 297030 234734 274519 515866
17672 515866 557241 661157 736244 612560 605096 732437 609897 554100 401032 295326
17662 295326 425422 556958 650352 762298 805990 709177 624071 537114 470632 291578 271886
17651 271886 288854 83258 -24579 202706 420308 319242 95602 -69071 -137363 -99785
17641 -99785 -115349 -114449 -66721 -27125 201125 261589 243264 348750 434681 309152 129116
17630 129116 42486 90122 206459 453777 611298 529980 281499 100085 -28687 -12488
17620 -12488 -41951 -114429 -111583 -18970 36798 -22334 53364 67628 43970 -35813 -17072 -105051
17608 -105051 -51831 156030 232595 236605 256109 404808 336049 280724 190082 150779 120207
17597 120207 349843 410656 264952 49176 213594 267758 231523 94803 -36714 -57968
17587 -57968 68363 214799 166455 162646 261532 88599 51630 83272 26457 105553 10293
17576 10293 12586 -89657 -137629 -23810 97580 137197 60289 -16352 -11102 14008 36878
17565 36878 57394 24650 -148702 -144637 -6704 39832 28704 43941 106479 67231 19004
17554 19004 -8548 125101 118074 136655 197862 363539 462833 376847 153567 186462 165528
17543 165528 124695 242220 322427 334342 404955 374479 179017 62271 118617 209284 253228
17532 253228 217506 178447 308204 207921 112795 174381 244307 396295 514536 439003 377829
17521 377829 50072 -74780 138250 266353 278085 144616 250116 306105 326695 480818
17511 480818 536298 654065 687131 661762 733509 683010 308603 96403 115567 93979 289394
17500 289394 426690 514053 654619 634012 569871 469738 443936 472996 470635 327529 341050
17489 341050 577706 884229 928040 997335 1016088 755296 726312 607259 539487 672992
17479 672992 576249 496262 717616 764902 904622 963145 964589 784278 416825 297651 323410
17468 323410 430002 439232 328364 291567 330031 343497 309184 420905 502180 453135 465520
17457 465520 338529 287416 156226 276456 363921 376516 395573 356781 255573 114316
17447 114316 45290 144367 192592 333163 409406 565030 902007 1244409 1323568 1298663 1131389
17436 1131389 925232 578465 586470 593270 602621 601332 635143 550319 350199 316561 321555 412616
17424 412616 319829 259111 230626 389867 277004 293382 244747 16939 194576 380009
17414 380009 397753 19746 33698 321951 354515 203209 28050 30265 28342 14571 145741
17403 145741 37746 -108542 -7892 24214 84768 57958 77633 134620 359904 214902
17393 214902 -10844 -88155 -78820 -150248 68497 99619 124747 311765 282521 160088 261271
17382 261271 386167 358716 286501 66896 353343 471080 402362 47531 -130462 -115083
17372 -115083 235828 269877 78947 30948 49437 202578 283807 271352 224544 131693 217417
17361 217417 331373 358046 446382 452064 449998 494619 576877 480947 337377 240060 229140
17350 229140 91947 -102362 -62997 105874 195490 244464 154407 54577 142798 288958 234825
17339 234825 224909 371323 483755 296925 332549 582930 647916 569239 708637 765661 929064
17328 929064 1339536 1365918 1198601 1220750 1333431 1453385 1515938 1489107 1417768 1366776 1252086
17317 1252086 1214877 1022057 806450 686082 698289 827692 787392 713225 733809 999270
17307 999270 1204991 1213257 1210003 1385017 1563739 1631596 1654812 1587700 1810390 1859972 1778894
17296 1778894 1564149 1402576 1237333 896360 855943 806001 725743 681657 513928 438527
17286 438527 549735 842710 890894 942403 974705 995281 884940 896405 940718 770535 791146
17275 791146 798774 793534 958259 782543 725210 842533 1037628 1083092 914812 732149 709671
17264 709671 742643 815621 994078 1132744 1094403 1295180 1415124 1472015 1382095 1460229 1194141
17253 1194141 922397 1019625 984354 1015944 1137631 1186729 1311412 1381540 1300300 1264156 1204573
17242 1204573 1260562 1426694 1640935 1877256 1890415 1901491 1927933 1943798 2009328 2148189
17232 2148189 2227859 2415360 2739082 2883615 2977740 3303886 3494017 3606602 3789792 4205187
17222 4205187 4581406 4607224 4666896 4828686 5000750 5083450 5284740 5636558 6025415 6641957
17212 6641957 7307984 8470666 9710043 11419950 13395475 16074383 19714202 25149521
17204 25149521 33958957 48840699 72225696 100267496 123445331 141522848 158452497
17197 158452497 171668345 174603636 166729875 158038588 149402833 133536625 107595705
17190 107595705 80357656 62285975 52674645 47799371 45785851 46268890 49209306 55790552
17182 55790552 68414990 90697299 121839593 151389244 173376189 192672309 209672595
17175 209672595 217620796 211036761 198505863 187856560 172172317 144463606 109620443
17168 109620443 81691631 64843528 54733022 48125186 43549481 40004324 37438265
17161 37438265 35083865 32992032 31222003 29809548 28541098 27326460 26196243 25046432
17153 25046432 24006165 23240854 22624385 21872741 21161882 20533782 20024332 19479787 18858311
17144 18858311 18247905 18005418 17544474 16864022 16196745 15784343 15523747 15140202 14538354
17135 14538354 13825494 13161886 12703050 12437094 12223891 11841126 11574269 11393384 11106206
17126 11106206 10738093 10435801 10344084 10130561 9763070 9533478 9426133 9131178 8756073
17117 8756073 8486708 8087309 7888947 7735352 7363156 7130205 7073119 7021625 6897699 6909702
17107 6909702 6802759 6582353 6453479 6364612 6229682 5878318 5575292 5359993 5298586 5260311
17097 5260311 5286209 5136167 5085279 5231230 5104250 4915078 4865780 4809591 4773061 4596400
17087 4596400 4664349 4854674 4799206 4901159 5055327 4902468 4616782 4523538 4563338 4641342
17077 4641342 4714533 4688052 4921191 5278685 5329663 5325591 5414370 5599289 5791475 5748727 5675508
17066 5675508 5452863 5174245 4811068 4433717 4307224 4410706 4424730 4226386 3989947 4081034
17056 4081034 4085525 4207233 4404604 4555973 4693874 4554273 4692183 5084150 5300804 5225758
17046 5225758 5139343 5155475 4982890 4635471 4147967 3925347 3693119 3385293 3215220 3205431
17036 3205431 3191398 3024205 3039028 3050771 2898192 2717680 2721166 2813105 2788644 2619478 2559336
17025 2559336 2608831 2414939 2408712 2344968 2235922 2243061 2176412 2245018 2136957 2161018 2263163
17014 2263163 2206986 2143340 2111843 1951836 1859076 1864684 1943053 1920957 2084456 2133912 2105906
17003 2105906 2082283 1914879 2018615 2192490 2265023 2402669 2582521 2646609 2498304 2373444
16993 2373444 2459514 2488079 2513750 2787393 3068433 3087959 3354720 3503003 3501650 3390716
16983 3390716 3285055 3385367 3613364 3943933 4252493 4694299 4893060 5037050 5243208
16974 5243208 5531475 5667807 5978921 6596811 7334709 8103194 9349640 10746071 12104230
16965 12104230 13610654 15881563 18874783 23802209 32517034 47966000 75067212 108578051
16957 108578051 131337037 143814929 149567506 141156202 114721150 84166980 67202186
16950 67202186 61712179 65125027 79230588 106071116 134778903 150926963 159676961
16943 159676961 160527514 146068267 116572221 91783716 84190782 92471949 113541059
16936 113541059 133007589 142786388 147956861 144741327 126848985 98232338 77135682
16929 77135682 67746033 66232846 72822347 90069877 114596316 131939649 139831690 142235872
16921 142235872 133812841 109953711 80140534 60131870 48854317 41995426 37596798
16914 37596798 34326269 31920878 30400220 29253314 28247506 27076408 25793152 24530967
16906 24530967 23332508 22065224 21085048 20471436 20141889 19615784 19177854 18644828 17869853
16897 17869853 17095485 16324345 15722617 15173538 14562308 14183122 13844238 13763159 13504111
16888 13504111 13115526 12787446 12482088 12170628 11756185 11229862 10830167 10557749 10286052
16879 10286052 10163499 9963774 9743271 9720406 9619821 9196300 8974238 8879156 8773897 8425827
16869 8425827 8024907 7574473 7365557 7264443 7127890 6999169 6916482 6768350 6535603 6255603
16859 6255603 6087387 5988031 5934074 5857121 5773503 5713028 5529301 5459001 5268699 4874113
16849 4874113 4875940 4955867 4816782 4681708 4649426 4595896 4566534 4486481 4318338 4235221 4162486
16838 4162486 4207399 4188809 4234469 4224819 4185979 4118845 4065938 4273676 4486106 4540660 4477743
16827 4477743 4271337 4005218 3979424 4034729 3848173 3650859 3621112 3788714 3949990 3993313
16817 3993313 3935348 3696346 3511612 3562751 3637940 3422148 3265639 3276039 3464858 3561815
16807 3561815 3517419 3304574 3098800 3071277 3111609 3059445 2947732 2834649 2777547 2796147
16797 2796147 2900706 2956328 2876928 2805584 2769736 2714852 2630970 2407179 2245969 2093072
16787 2093072 2054836 2124493 2143788 1972249 1861880 1651176 1514013 1464435 1482612 1502884
16777 1502884 1262864 1151931 1181782 1237049 1298855 1202065 1304624 1386845 1378693 1367822 1223908
16766 1223908 1188034 1097116 1051462 1025456 934288 862591 982399 975903 915004 845390 871358
16755 871358 878567 717301 684191 839369 874821 706563 558508 502192 542101 586765 618528
16744 618528 674861 758876 818959 919494 933798 763944 765667 661424 592801 642292 762915
16733 762915 888896 852770 791483 717938 535378 503152 599728 466392 518694 772724 655024
16722 655024 507493 433335 372481 493225 610004 443612 255965 332122 490322 721048
16712 721048 789065 710848 668513 563043 590410 712814 726848 723273 753456 760020 618748
16701 618748 561843 559960 556572 514296 302976 261019 205253 246327 356589 467215 598128
16690 598128 577611 572614 675764 629011 565122 582516 596678 540868 674504 515426 459127
16679 459127 469904 362904 355114 392449 530241 489628 458626 400159 379363 173459 278588
16668 278588 292680 319731 264355 109848 240229 290208 217597 133492 -111867 -188255 -188413
16657 -188413 -150909 147258 352134 264251 181640 146529 246832 411214 371549 404610 382138
16646 382138 286823 446862 793253 1043645 1042183 1078907 1254972 1449944 1492882 1458505 1530675
16635 1530675 1379124 951455 642288 549639 523371 621276 680233 653280 583070 494990 446486
16624 446486 513313 582871 647001 870591 918340 796604 880282 1101534 1324385 1215086
16614 1215086 1189081 1105435 919531 771935 706103 609968 440502 572451 508087 234678
16604 234678 69608 157055 172611 175678 258386 234234 226662 119370 101895 68474 278087
16593 278087 461134 341311 281314 237045 124294 -36225 -1879 101746 47214 122871
16583 122871 137190 301399 249310 215467 89967 -161009 -397962 -116936 312736 423555
16573 423555 299416 102967 64821 301772 273225 133605 -45144 -77774 -44602 -147116
16563 -147116 -274725 30026 150922 14608 -132077 70528 328852 113320 -129603 -246145
16553 -246145 -201290 -158804 -50648 -27383 64864 131372 139032 154609 253007 278131 26185
16542 26185 -79302 -146751 -4271 24255 49349 -18972 58176 120665 194917 80786 -113933
16531 -113933 -107444 -27614 54087 -87138 -255154 -269278 -311916 -287120 -227373 -299275 -350657
16520 -350657 -247799 -84352 28866 72337 130612 199519 235761 252087 145489 13456
16510 13456 105158 248645 170342 7914 38725 120293 154451 -767 -232443 -234648 -194374
16499 -194374 -171050 -43043 83899 99237 -57894 -168751 -46143 152655 312918 177234
16489 177234 59105 71780 98407 76091 132421 292663 180052 316211 397234 290934
16479 290934 444997 344637 129585 -130879 -254925 -203214 -292877 -212034 -127086 -45894
16469 -45894 81314 257314 331869 252941 258850 315411 80112 -131222 -41043 -55191 -14195
16458 -14195 105394 157717 149658 7190 -12435 48386 22514 -119975 -293653 -89875 48158
16447 48158 -78467 -36411 60001 149815 74561 -11455 -38060 -33652 -126019 -142226 -275293
16436 -275293 -125456 15992 -69674 -141757 -73615 42389 59743 30372 150 -101368 -137371
16425 -137371 -50185 79821 112158 27283 -10019 -63891 -30347 229178 265333 128575 256297
16414 256297 308969 291452 155341 1547 -161158 -172356 -108874 90028 279241 235853
16404 235853 288579 412201 486576 577479 739154 686280 685110 864336 866738 687034 631518
16393 631518 577705 465456 417731 593535 688250 663643 588357 640098 574674 746875 658186
16382 658186 361455 343926 469896 676656 780432 835268 831892 812873 654707 558854 481180
16371 481180 440465 245118 153770 376295 601421 766596 895132 835138 582294 405134
16361 405134 177853 40260 164590 198190 157545 -37485 -167073 -141352 -203632 -189163
16351 -189163 -175904 -280453 -329006 -294913 -157069 -33815 -6959 7023 -300024 -231285 -27203
16340 -27203 93563 108346 -102758 -253358 -264546 -346789 -252292 -82642 -67489 54164 100880
16329 100880 153030 189220 98302 3987 -78011 -32779 14205 -5320 116763 131866 241547
16318 241547 193769 -11226 79697 291593 229699 55914 133676 173477 -53284 -215777
16308 -215777 -208254 -13212 83282 -6708 35577 124843 123709 151305 247886 183602 -42322
16297 -42322 -19207 4232 -176340 -203668 -302278 -161640 -107939 -99742 -31458 -162244 -176504
16286 -176504 -195995 -116759 -125244 -87928 -2563 69133 6168 2863 -31610 -46862 -12900 40433
16274 40433 23777 953 -42551 33219 183011 165739 121041 322408 430177 299900 70364
16263 70364 67340 95557 181007 328822 213897 87421 149558 75355 32597 26553 34923 -136107
16251 -136107 -248260 -279633 -336475 -356955 -252048 -97971 13274 28652 90214 -46588
16241 -46588 -150349 -219472 -117070 116390 345556 288595 283239 120072 -91500 -156983 88390
16230 88390 160128 243992 309760 188197 207779 267631 258610 154872 121124 39815 56464
16219 56464 -21668 30493 84977 34598 57307 165497 154928 49332 -24855 -177330 -150235
16208 -150235 -98163 96658 101278 42953 -580 -8606 -163226 -231926 -224541 -72970 -42078
16197 -42078 -128648 -137957 -143143 1073 32120 86983 172737 172992 51658 -59086 48846 221359
16185 221359 217383 113857 -14067 -8361 29498 181604 102184 -24931 -119439 -292355 -260926
16174 -260926 -343618 -255708 -73504 -13913 -30785 -89014 -180696 -84241 159457 285596 254827
16163 254827 201741 81526 -90351 -95383 25409 -36533 -290988 -291522 -198715 -86374 -132162
16152 -132162 -44929 -83636 -150276 -145311 -8383 125493 133718 -41627 7357 46272 125478
16141 125478 162777 30956 -30806 -149831 -143848 -85383 -130794 -105493 -164572 -87418 113977
16130 113977 66476 -125519 -180559 20375 7057 -104987 -106233 -16783 152608 189907 213096
16119 213096 127743 -37433 -99143 -55425 91325 320773 153668 -12845 -117877 -107264
16109 -107264 -37193 20171 -129031 -69958 33413 83824 -36047 -130556 -165402 -18419 62490
16098 62490 -101698 -21481 9108 95917 210250 247421 175098 53403 103266 47293 -184774
16087 -184774 -358899 -207976 -10064 203206 244533 277933 373967 348937 102664 -83663
16077 -83663 -91141 -101074 -2324 44954 38006 3743 -138212 -104794 91612 191400 264952 78099
16065 78099 -148508 -287809 -246271 -171045 -35631 -79806 -133989 -291781 -332743 -284471 -160504
16054 -160504 -105478 68682 169757 176484 56855 60708 19415 103599 228588 241350 116492
16043 116492 105043 81059 -24450 -35308 -166487 -276255 -136295 80903 110437 9545
16033 9545 -133826 -18794 -128397 -248861 -275813 -274336 -338264 -222890 -103608 -103753 -106363
16022 -106363 36508 54302 42511 240349 246990 195116 81637 123067 144299 90680 -53249
16011 -53249 -27311 -95878 -265560 -156721 24163 145298 58027 106557 156623 92157 116002
16000 116002 85374 -20421 -149816 -32478 152432 221037 121474 -111355 -257172 -149068
15990 -149068 -35895 -122401 -126304 -115764 -94551 -4705 50871 188897 79632 -24937 -151887
15979 -151887 -176098 -151006 -5745 -94843 -146723 102653 107980 13987 -13428 -67416 44362
15968 44362 59176 107263 195796 80658 82603 182618 81171 5270 -48280 -170761 -148313
15957 -148313 -130203 -298338 -229709 -166159 -114003 -160528 -268812 -164297 18447 16861 -207378
15946 -207378 -287302 -49431 13227 108749 89335 75591 195493 143720 -28438 -170144 -169235
15935 -169235 -171239 -142118 -119832 -90613 31937 -8795 -131 -135675 -441885 -446355 -307178
15924 -307178 -146014 -91327 -164530 -165892 -118017 -84835 -122570 -59874 54387 74024 131539
15913 131539 162335 126525 164153 133129 4816 -98242 -302418 -331833 -176011 46164
15903 46164 -46241 -47524 -106030 22056 -7360 -183046 -180526 -174075 -132287 -191879 -155813 -89666
15891 -89666 -25967 7606 -73050 -13636 185548 192945 88854 54850 6615 -43689 -177867
15880 -177867 -231461 -202296 -142976 -74534 -105029 48448 115630 214894 247866 154201 122206
15869 122206 202718 151217 92650 51467 103228 38651 -99998 -58426 -149064 -185602 -124442
15858 -124442 -24547 -6319 39861 -26651 -74185 -134870 -237037 -386317 -431532 -402117 -284925
15847 -284925 -254721 -197182 -122429 -18922 -9775 -32937 -136425 -89248 154998 219585 88986
15836 88986 5714 106799 52295 -119162 -288861 -236560 -235692 -260519 -322120 -220415 -95674
15825 -95674 -151819 -139738 -26325 -109828 -267688 -55578 185835 340098 258135 1334
15815 1334 -49300 48269 163657 269975 281407 223777 -26540 -86726 -72099 187260 196030
15804 196030 213517 186940 144768 105188 146080 113336 218655 303743 73004 -46114 32425
15793 32425 -72368 -47876 96134 47606 -106299 -167253 -55576 -173346 -299749 -151837
15783 -151837 -216894 -347181 -240509 -32162 136767 59332 19616 94226 267222 178738
15773 178738 -43398 -235299 -375717 -341370 -120289 -147241 -51644 -148478 -42401 -24902
15763 -24902 50683 58176 223453 78674 -103081 -110717 -252060 -373267 -318700 -131707 -17576
15752 -17576 38695 -58591 -168484 -150181 -66865 -71824 -76344 -130734 -108880 -84025 -14935 51550
15740 51550 78924 281631 303794 134989 -157431 -242621 -197165 -251582 -102261 74096 99674
15729 99674 135140 29735 -43011 -116909 33146 209348 213408 55615 -6576 -43519 -218456
15718 -218456 -279952 -53058 -59743 -83258 -184791 -80226 70525 -82782 -287521 -287201 -181402
15707 -181402 -174566 -73542 -111369 -194238 -225371 -282398 -178756 -30940 -62952 -15410 -158824
15696 -158824 -299710 -204288 23392 21424 98865 148448 33649 -155503 -232907 -227526 -277908
15685 -277908 -238339 -270257 -149194 -25578 15138 -121139 -217358 -121356 -68074 -156580 -219164
15674 -219164 -217656 -205671 -94201 66635 106642 147372 85630 44846 106284 -73275 -62373
15663 -62373 -14910 -97795 -188268 -150318 -103510 -50263 -240380 -350049 -305777 -149313 -97973
15652 -97973 160 102151 70984 71324 -18494 10263 25544 131166 70817 65972 228361 259638
15640 259638 141441 55549 -142112 23468 203489 280038 320475 363984 226190 115313
15630 115313 -29820 -113547 -193856 -265923 -166218 -101923 -3664 159545 149927 130354 111195
15619 111195 69926 -47920 -107405 -41106 3378 -98974 15426 102129 51916 84503 -32621
15608 -32621 6942 119932 230889 132716 -87898 -278350 -179882 -39527 -65678 -122907 -221557
15597 -221557 -229964 -172817 -142332 -117524 -156343 -157684 -43823 27905 98199 16687 -48321 41404
15585 41404 236977 116084 -84280 -123245 -66386 -69612 2156 242873 293467 254253 243342
15574 243342 301497 203472 119451 -14464 -101324 -60207 -127686 -328058 -318016 -348633 -345017
15563 -345017 -139081 91756 81941 -60900 -186106 -218750 -248805 -191223 -53554 128448
15553 128448 102228 35088 64362 87300 107353 -40480 -84762 -110748 -232741 -319987 -225391
15542 -225391 -77512 73207 -2793 104477 214499 100016 54560 44303 -11716 -104370
15532 -104370 -43587 -89603 -106650 -210989 -209672 -143107 -128991 -37611 -45665 28227 -5550 78697
15520 78697 108114 56839 66988 158480 149943 132553 197688 62317 -19628 -65717 -146008 -101760
15508 -101760 -3800 142708 92451 26020 110930 -2293 -85453 -126559 -191077 36983 152752
15497 152752 139447 93975 135258 -26735 -47569 73079 27272 -1024 81275 149380 64945
15486 64945 -8240 -85330 -91200 -21796 -47223 -164555 -149580 -113253 -115785 -151805 -120767 -39085
15474 -39085 -51990 -50535 -106963 -149373 18535 134384 78339 -51595 -30684 15703 10346
15463 10346 123099 109402 -98001 -190064 -227197 -182917 -63075 -45057 81653 44621 -178542
15452 -178542 -158598 -84583 73535 191979 101064 60693 114406 -30146 62162 214937 238008
15441 238008 217145 226055 165246 159386 129793 181243 70167 31797 -64045 -129081 -100498 -66230
15429 -66230 -159563 -195887 -355276 -509302 -397440 -228865 -147845 -63566 110661 -23638
15419 -23638 -196189 -145898 -29415 151258 29838 -216862 -130024 86048 245369 250615
15409 250615 135667 36802 -75631 -173685 -96327 -34964 -20882 11666 103820 82173 -99988
15398 -99988 -140667 -166090 -129674 -202435 -346680 -243874 -143312 -132149 -15274 150266 90856
15387 90856 115337 220788 70014 -69711 -117577 16469 -48957 -49884 -46583 -20518 -80412
15376 -80412 102617 285162 242959 190304 109664 -140544 -262169 -191875 -168036 -84144 105743
15365 105743 155866 167111 153196 118493 161652 68668 -86532 -17726 95554 -15868 -166832
15354 -166832 -165192 -92566 -18111 64765 -87921 -89166 38210 58460 -22739 -121124 -82327
15343 -82327 -78027 -126320 -80526 55124 168501 135068 95742 82634 26583 -33719 -19438
15332 -19438 102188 -9467 -142007 -184 64666 -168533 -259246 -135689 -54239 3818
15322 3818 123628 173656 -62353 -108955 32497 -41340 -94175 -241914 -165144 37836 -34087
15311 -34087 -37269 11506 91782 -63953 -12714 -13909 -93951 -219667 -192347 -129915 95206
15300 95206 115494 -2835 16484 -201589 -83738 -31384 -659 73251 61915 115900 72216
15289 72216 -57141 -23378 -74792 20653 155287 145996 89193 70173 99216 105855 121478 169730
15277 169730 -42919 -191978 -189837 20925 9202 112623 124401 85415 -88717 -198040
15267 -198040 -160709 -101370 35165 -43236 -214964 -131115 -147281 -34881 -86021 -179764 -244390
15256 -244390 -276060 -314697 -278591 -146476 -59170 40378 180061 181828 118383 -19185 -123160
15245 -123160 -116005 -142717 -255658 -219209 -102569 -87950 1398 -27473 -75619 -144706 -124653
15234 -124653 -56312 37345 93465 18146 6638 -11272 18338 39276 85736 100851 61179
15223 61179 140772 97154 91634 7946 -14292 204268 282757 244711 324173 198900 -72233
15212 -72233 -245229 -305442 -181980 47318 48682 -157550 -295595 -471473 -332165 -161000
15202 -161000 -164325 27707 205784 183299 85634 -2406 84691 11355 6193 41070 116694
15191 116694 60562 -53980 -145391 -145963 -35798 96385 -3299 -24112 -84472 112008 163188
15180 163188 42977 35844 65224 -84695 -153443 -55923 -109246 -134967 -39194 80704 140794
15169 140794 103358 39354 61415 179299 192497 218187 230069 295822 230140 209577 38346
15158 38346 -115904 -154807 12769 -34037 -161534 -197077 -211942 -224522 -98457 36491 -27376
15147 -27376 -85070 33986 236235 112143 17691 34009 74135 142934 186477 -23212 -50628
15136 -50628 -144130 -97998 78240 48432 -1033 -163923 -283846 -106368 -112519 -239180 -170180
15125 -170180 77732 222933 173856 261031 260175 115107 60459 -30876 7985 36110 14098
15114 14098 -118256 -221969 -172375 -112144 -79717 -125278 -208656 -189019 -2720 -27998 -39942
15103 -39942 -52176 70676 142486 52694 53948 205595 177291 32878 -44952 -156744 -160498
15092 -160498 -148112 -74981 -89137 -206232 -341333 -337737 -244613 -358124 -238718 -69132 71108
15081 71108 51735 36546 -30357 -108554 -227513 -321262 -194706 -52231 63793 72574 -49717
15070 -49717 -69206 5154 121005 84489 94251 71582 -42653 28918 91482 85491 -35587
15059 -35587 -129467 -158551 -112861 -65104 15650 -83466 -206206 -110506 137112 107476 43546
15048 43546 171932 43712 -61679 -135176 -176417 -159324 -26530 171491 276899 226422
15038 226422 18810 -1431 176551 228616 248473 156378 56298 108993 -10550 30623 51703
15027 51703 -87468 -81016 -66664 -130325 -301591 -299095 -154637 -40032 -32926 -70430 -137582
15016 -137582 -24634 -31134 -77229 -10418 92096 -92463 -204101 -149056 -56220 -46273 -2385
15005 -2385 37750 11256 155264 268150 424361 352656 247247 189603 67599 -26724 48387
14994 48387 19872 113835 51835 -69053 221455 391240 305212 82079 125909 178042 194172
14983 194172 165866 182144 126877 74890 32757 102685 168257 75390 81663 23350 86195 183375
14971 183375 191442 153009 170640 313915 262049 156968 223814 176802 194375 119162 12863
14960 12863 49954 95287 198123 205035 106954 7307 -27259 21886 61902 -34794 -31960 -15015
14948 -15015 -82515 56919 114387 -37310 84967 167215 227999 370582 394511 308154 74390
14937 74390 4849 96483 -254 53426 68476 233996 243373 179253 47210 126069 189389
14926 189389 111021 93605 194960 214177 58466 -112800 -104277 -86196 31378 -23418 -225964
14915 -225964 -184426 -128239 -98891 34432 -67220 58656 191854 326094 337750 45417
14905 45417 -99748 -89796 -112309 50486 39772 72963 15509 -201207 -386215 -283370 -12954
14894 -12954 143817 326036 296026 -46751 -138090 -2855 165862 66109 -164604 -263629
14884 -263629 -319165 -81434 -88244 -106664 -158609 -155543 -71549 77955 294217 273826 396987
14873 396987 206150 -14471 -46835 -144549 -367252 -315980 -40940 150730 174785 44885
14863 44885 77155 151970 184496 243247 216460 96826 -34885 -6667 49904 67355 -63974
14852 -63974 -111603 -192398 -159655 -30579 158494 230889 213558 31068 -16490 79887 137566
14841 137566 115922 48726 -103209 -79487 3712 102308 186737 127364 151783 257357 215837
14830 215837 -67535 -97834 116199 80124 -150530 -250006 -207147 -193827 -251553 -335374 -265279
14819 -265279 -57527 194386 131132 77192 319000 239394 120522 -14720 -20298 50298 -155248
14808 -155248 -212891 -194293 -171010 -134606 -4764 25201 48583 185150 252706 124733 64231
14797 64231 156911 159540 193487 181657 74069 -3929 79074 -22988 -136984 -3842 74134
14786 74134 158806 113892 102581 103191 101771 120731 139453 152383 157164 240219 85323 114408
14774 114408 176871 230167 -2676 -91094 -172475 -94676 -28171 -189953 -291639 -207763 -129082
14763 -129082 -148937 -75914 127911 112404 10151 2598 88220 -28623 -122824 1382 206255
14752 206255 68171 23707 102026 -1901 -177840 -174699 22176 245811 210594 163944 164430
14741 164430 156706 78678 -3021 -22907 100083 215339 160374 231527 205165 189077 144844
14730 144844 33983 164012 282172 54340 -24753 -145543 -186734 24656 134639 195809
14720 195809 184221 196008 148090 5906 -34991 -129336 -253091 -188275 -139791 -173602 53452
14709 53452 46715 83021 99698 115172 61962 95523 190431 357874 601993 624464 398034
14698 398034 212482 177181 232889 445083 759879 1042449 1420672 1791438 2080468 2334824
14688 2334824 2281130 2028631 1784478 1613395 1361512 1292042 1092554 813924 699018 772225
14678 772225 730075 742068 521681 520629 639803 526342 399459 353178 452080 448547 132665
14667 132665 -85303 35651 43557 64793 268739 387610 346308 353137 441752 611591 559323
14656 559323 698334 718068 803890 970378 1456924 1727264 1777805 1924053 2005720 1957973
14646 1957973 1942842 1820894 1560754 1242940 1041094 888553 801630 684412 716164 651986
14636 651986 633720 477002 536880 638928 444563 455517 422416 394996 410864 429566 423888
14625 423888 468223 375922 253471 46271 49975 131938 139296 115185 127982 53350 19974
14614 19974 115982 159367 226964 354407 485099 591530 371581 348486 281449 262316 185683
14603 185683 144664 242670 233506 48410 -86362 -116657 -116126 60815 105646 125796 100562
14592 100562 184191 73170 88148 190355 239241 162109 188950 209696 345672 301988 260692
14581 260692 233656 315715 320376 127570 137604 107325 204705 166309 88715 168445 244649
14570 244649 320853 217066 -6588 -83113 94320 118978 175597 224163 322799 537594 661276
14559 661276 591151 354441 -42821 -137923 23614 60472 138656 89060 133437 253075 318344
14548 318344 282000 243791 101257 110743 186290 174156 160693 238475 354490 456208 504615
14537 504615 282907 6740 -82737 -256568 -178243 -80986 -169828 -160976 -75579 -6390 97679
14526 97679 144277 143678 19755 -103259 -98397 -22968 26499 -48889 31179 5919 -15133 -25058
14514 -25058 162552 414678 367449 141964 45504 154570 165480 158208 378370 270436 164263
14503 164263 264194 304057 215977 154424 2815 -11463 -35651 54571 259683 208116 279925
14492 279925 333078 442150 220320 183502 164475 226458 140753 15184 108932 232677 298369
14481 298369 224367 272412 266769 195647 44061 93457 216478 443707 451451 352917 387413
14470 387413 510241 424856 155467 114201 139727 74727 218041 308028 251393 102862 -82660
14459 -82660 72642 207201 365924 569422 641680 507251 245113 393721 419693 532483
14449 532483 492039 356384 271144 190674 191048 411898 349788 183005 10767 129056 63434
14438 63434 30257 60130 53173 -7107 -158162 -112833 -118564 -131777 -91328 -39123 103745 275013
14426 275013 116383 164619 402858 422638 339382 308704 301291 299819 119510 98147 72585
14415 72585 20672 12094 190773 29303 -250292 -164826 36768 30806 268536 394298 368409
14404 368409 416003 361048 164912 111169 205297 315009 198121 116498 78943 -20048 -3262
14393 -3262 30376 247319 521737 697317 601001 517001 537738 647174 670487 519679 437496
14382 437496 580857 699083 704090 577927 690053 829247 943442 945288 1003834 1026773 1065344
14371 1065344 1260188 1350420 1586312 1930302 2346964 2697700 2848506 2933392 2883402 3075248
14361 3075248 3026029 2560343 2056367 1759967 1351742 963623 846293 958072 1263380 1320008
14351 1320008 1397037 1253544 1111523 1047949 981273 1075752 1092909 1160019 1215290 1225067 1206032
14340 1206032 1277158 1336862 1172903 1155731 985131 861111 867904 1210425 1636164 1831309
14330 1831309 2000008 2218234 2597472 2766279 3109472 3444168 3654899 3691785 3711721 3711863
14320 3711863 3515900 3204663 2919591 2702110 2323437 1904443 1656662 1614438 1563586 1568546
14310 1568546 1766520 1772255 1734610 1763155 1687810 1696547 1526878 1443440 1518166 1564149 1461751
14299 1461751 1634601 1785561 1895675 1857141 1701566 1719378 1699639 1756036 1945573 2108940
14289 2108940 1929361 2043113 2319706 2511743 2721734 2808082 2783247 2733682 2888066 2935859
14279 2935859 3103028 3215936 3268226 3374203 3489535 3486291 3449343 3508585 3772849 4085571
14269 4085571 4406485 4694276 4906337 5081693 5364525 5544296 6020843 6736274 7235450
14260 7235450 7888594 8607833 9773893 11166246 12438141 13785176 15687064 17862636
14252 17862636 20555057 23433032 26927488 31790662 38227480 47288132 60613618 80874015
14244 80874015 110262621 150242579 200366717 256511343 311661989 359174182 392739456
14237 392739456 402927901 385471761 347470038 297824829 241871176 186314458 142045859
14230 142045859 113132458 94976642 83196681 75126310 69399396 65091714 61227348
14223 61227348 57769305 54801244 52020971 49655546 47609023 46131744 44988704 44335561
14215 44335561 44207755 44497292 45125479 46275476 47941002 50338120 53238183 57357914
14207 57357914 63292077 72017405 85830446 106897363 137038066 177917439 228954558
14200 228954558 285213116 339942004 385892421 416908993 423543242 402168232 360988475
14193 360988475 308624639 250210808 193558549 149564141 121134674 103173914 91237664
14186 91237664 82866919 76438187 71323933 66887448 62714111 58839010 55247781 52008366
14178 52008366 49116278 46615275 44366124 42272899 40302317 38651483 37254506 35850416
14170 35850416 34635630 33310328 32188701 31262188 30504813 29672130 29046341 28548722 28101417
14161 28101417 27519742 26927038 26461880 26004724 25566899 25096435 24420527 23765945 23064708
14152 23064708 22449924 21877961 21062681 20413887 19893210 19358225 18921960 18365745 17916620
14143 17916620 17381338 16736595 16045501 15430454 15065603 14816894 14623312 14190003 13770853
14134 13770853 13337724 13094240 12813003 12590036 12447478 12295032 11912231 11509435 11439687
14125 11439687 11414109 11412638 11457940 11618827 11767391 11898030 12302375 12761687 13079969 13423321
14115 13423321 13712756 13791963 13673235 13571739 13328457 12919722 12447432 11844739 11392680
14106 11392680 10769155 10256216 9926623 9452146 8871425 8395384 8103164 7847960 7625887
14097 7625887 7511385 7278451 7038530 6862396 6838377 6780114 6763434 6563580 6377749 6316449
14087 6316449 6430025 6427205 6203902 6058084 6207664 6389164 6335650 6355909 6512864 6560777
14077 6560777 6612393 6664597 6795528 7095192 7357660 7479185 7603022 7706436 7582824 7456314
14067 7456314 7187494 6769144 6448972 6192461 5776181 5429218 5383275 5073887 4749112 4538116
14057 4538116 4261529 4163536 3899573 3715140 3686627 3612556 3629440 3712274 3590297 3458310
14047 3458310 3374978 3140059 3003342 3133287 3350626 3380868 3412919 3408890 3369689 3335458 3280748
14036 3280748 3178539 3002586 3000327 2943936 2796278 2710550 2627147 2545288 2739525 2657648 2431414
14025 2431414 2069025 1898083 2072703 2070465 2040622 2053300 2003038 2059277 2100808 2169647 1964848
14014 1964848 1777968 1904620 1925750 1877800 1826218 1828912 1760178 1958499 1843175 1660606
14004 1660606 1499033 1525294 1375334 1370644 1546745 1644307 1596592 1514893 1393123 1208611
13994 1208611 1147494 1102892 1001675 1033643 1042407 1190702 1176326 1103006 1223407 1234351 1302096
13983 1302096 1141234 983650 867769 810899 820071 738974 732019 843126 874593 1052860 1068510
13972 1068510 1072384 1015519 1003647 1221326 1167269 919010 709857 569879 719378 971654
13962 971654 1122726 1045357 955258 898567 780792 909016 883699 846033 676612 616470 766275
13951 766275 797952 732750 634539 655273 792346 872455 860667 776078 596596 640643 649175
13940 649175 579621 568598 625049 558140 389824 438924 516948 525948 486368 540456 594957
13929 594957 526016 587140 454383 389448 260618 243555 204721 214829 337990 365253 302585
13918 302585 371101 537284 565417 580168 504122 426511 425362 512393 600676 618031 474851
13907 474851 358995 266138 275880 298042 348374 442906 411337 422832 533931 574525 484843
13896 484843 425982 429910 361606 409532 564552 499955 491912 501694 421497 449381 427826 314424
13884 314424 166596 86590 191489 342267 459454 369276 268207 254535 211232 196560
13874 196560 60924 133210 295462 306828 292463 307960 294761 204617 183592 443494 646954
13863 646954 574041 529025 494458 300396 210466 271769 208944 313894 228483 152413 292194
13852 292194 205125 34027 -55361 18942 166799 201478 250276 382288 371574 394286 332218
13841 332218 317206 309851 226937 287930 345228 405337 377785 375330 440298 410814 350910 252838
13829 252838 109879 249675 334978 313515 196987 191337 125215 10678 39988 331025 410976
13818 410976 199138 213489 337375 298263 212127 266531 214481 90690 11014 -128864 -174111
13807 -174111 -387767 -154984 96120 176261 93509 -31556 -60616 56939 37215 91237
13797 91237 50457 -28296 24022 245621 307484 262427 354445 573800 504863 387694 516260
13786 516260 562371 783847 1109131 1510233 1691903 1846280 2075682 2131838 2228829 2315224
13776 2315224 2060594 1569537 1143744 800209 652203 670990 550462 504346 445619 511795
13766 511795 542638 401674 175155 -35313 95442 362139 362690 206112 161613 207839 263441
13755 263441 315380 293018 106895 -99778 14571 120298 150139 137731 278041 336110
13745 336110 371295 686588 971387 1269875 1806164 2112447 2360073 2522097 2319812 2032924
13735 2032924 1727168 1484543 1242363 953939 695253 621847 610464 583125 415701 392063
13725 392063 493160 357646 183299 175760 158361 133066 250122 291415 241249 206479 87883
13714 87883 124762 212223 295188 266581 407831 387640 181208 62996 56045 112427 161264
13703 161264 108528 155254 229458 167496 70323 117382 251836 275055 224612 -2377 -203375
13692 -203375 -148544 -16246 66782 10549 -27329 -4066 -11611 30259 82967 44916 -111728
13681 -111728 -152002 69029 254767 365537 302337 167999 76548 115660 197131 275655 194510
13670 194510 231912 133312 124520 67782 40204 7949 -251058 -205362 -191300 -59627 84173
13659 84173 86086 -74105 -73563 -59981 -153523 -115639 -48231 -61320 23476 280467 385985 326067
13647 326067 184624 24522 28094 12678 -94813 -141086 -127768 -31163 -22485 -71694 -81814
13636 -81814 -90965 161918 147242 -9989 -88217 140732 236241 160254 -53287 -101479 -34538
13625 -34538 140409 206354 149128 4714 11168 98236 25303 -140282 -293936 -191634 -59344
13614 -59344 72615 131168 125439 19735 -150740 -352396 -298274 -307724 -182846 -30466 33863
13603 33863 -34247 -147151 -46927 -371 -99820 -104316 76370 183190 64450 106975 79695
13592 79695 238884 220227 104128 -59000 -7087 23947 -78354 -183886 -251704 -134189
13582 -134189 -34948 -137318 -166652 -101423 -130348 108105 218316 -65184 -235153 -240159 -217401
13571 -217401 -295603 -250267 -104882 -89290 87305 131953 -14735 2637 126329 253252
13561 253252 163941 170722 158612 70775 -29466 -132240 -150146 -49786 -74832 -126643 14531
13550 14531 203083 120246 93665 -46679 -122778 112951 138206 -47480 -21478 -42357 41881
13539 41881 210654 337698 253606 61823 10856 34141 -145662 -227279 -168724 44160 51795
13528 51795 -76115 -64523 -31525 225722 55210 37076 -81221 -118497 -72851 -132824 -8681
13517 -8681 8210 6775 37412 -92072 58456 -5544 -59902 -264153 -227941 -239863 -187587
13506 -187587 22244 95700 55964 6786 83705 46358 -146582 -259905 -362417 -232092
13496 -232092 -66265 4109 -107618 -94005 -123514 -21545 -39368 1627 86665 9271 -72688
13485 -72688 -82966 -81071 -12636 111298 210470 192779 105150 -3966 -66760 57003 161314
13474 161314 145452 96748 86017 108754 149473 245356 185177 -4788 -50997 -489 144318
13463 144318 218002 100062 27765 -119602 -278221 -292012 -358820 -101847 32906 65823
13453 65823 34314 -64196 -52394 -64538 -110746 -150742 -205122 -138480 -176690 -177690 -78110 96529
13441 96529 22781 -76413 -372350 -338182 -479318 -441401 -385239 -295850 -274023 -196454 -36714
13430 -36714 124267 113482 1763 -64645 -100205 98030 177541 188475 219632 245785 251399
13419 251399 128739 46138 -6021 -31968 11107 91722 117717 178095 89583 -80332 -241242
13408 -241242 -238101 -160272 -34680 4044 -126327 -112957 -219447 -305188 -165133 31588 62450
13397 62450 -51303 -57115 -31278 52592 18390 -92845 -89762 -174617 -274964 -237769 -212389
13386 -212389 -233827 -269126 -191913 -137898 -32959 -39090 -133917 -143917 -185583 -127887 -272063
13375 -272063 -186509 63434 304222 179446 -19834 -181826 -298532 -291340 -159595 103
13365 103 13244 110105 305967 432117 293392 155340 19055 -219531 -410604 -450287 -273400
13354 -273400 -149864 -95970 -120169 -127931 23261 86528 -119034 -284860 -376958 -427014 -296643
13343 -296643 -188934 -255878 -193355 79031 288919 184824 84284 168525 249974 221737
13333 221737 29501 64546 122300 175832 143651 20041 12892 50989 87241 22046 -181150
13322 -181150 -243840 -43081 88338 149153 136932 -28680 -162080 -204362 -185236 -229833 -129390
13311 -129390 28949 -49710 -108771 -41490 -72575 -152720 -95037 -12439 -38861 -205583 -207875
13300 -207875 -235327 -148910 -80339 -11494 139252 23472 -57382 -75393 98417 216974 160570
13289 160570 206520 85515 -152976 -126867 50105 130748 20737 -94836 -214180 -219277
13279 -219277 -14416 93779 66786 -17554 -160668 50257 154016 191025 47615 17055
13269 17055 23595 -180357 -92697 219635 180890 -149655 -200364 -111282 -64086 -118498 -45061
13258 -45061 131006 166723 142316 206197 15744 -122468 37455 170137 120787 22131 -63754
13247 -63754 53094 140887 24994 -80716 -241969 -257968 -242847 -218656 -134370 -287980 -205003
13236 -205003 -119302 -121141 -192809 -184080 -1513 -11116 -282065 -262513 -323649 -151662 83419
13225 83419 151601 -28491 -23523 16819 -19632 -8366 94319 133969 166803 90494 68576
13214 68576 -45967 -257212 -146305 -58952 9268 162724 150476 119644 123267 17989 -80744
13203 -80744 -221742 -319184 -289744 -249942 -319449 -61274 9235 -28834 -14830 69149 175284
13192 175284 -22984 -288864 -327572 -259280 -176409 -182148 -250895 -235154 -230323 -169716 -50260
13181 -50260 -125661 -101990 -193801 -180747 -67297 96752 77238 136411 115382 -155599 -224501
13170 -224501 -123167 17927 117937 120725 96861 9943 -37427 -279054 -413886 -351037 -138294
13159 -138294 -113836 -182245 73136 124633 211662 119779 114678 -4614 121228 79493 -69193
13148 -69193 -123221 75641 180085 89936 14146 -85351 -95688 -203876 -292504 -263835 -227178
13137 -227178 -160282 8253 -23715 46790 24396 39791 55268 135219 90853 6824 13305
13126 13305 91893 -29367 -129292 -16391 51139 -136742 -354067 -329912 -178643 -138217 -190997
13115 -190997 -88566 58189 68957 77935 28104 -271011 -174648 -50954 -83244 -57886 -155020
13104 -155020 -107938 -157543 -121238 -35899 33806 -43032 -97645 -106431 -130396 -122731 -181373 -155946
13092 -155946 -143305 -182036 -420557 -351586 -161800 -3450 -29652 -92434 -64459 14059 -64352
13081 -64352 -150772 8924 156149 14947 -91791 -159928 -163145 -72235 103009 92993 -112981
13070 -112981 -250579 -345489 -288554 -317894 -338924 -264773 -246892 -128791 92102 264020 203408
13059 203408 73350 51300 176695 161135 -30484 -146808 -211056 -213129 -352313 -276111 -257898
13048 -257898 -83616 -41128 -30990 81944 51859 -82705 126805 170353 -78556 -209413
13038 -209413 -80714 -42459 -59244 -16652 63291 94389 26849 -119498 -62402 -94466 -104891
13027 -104891 -139649 -156627 -51533 53394 76912 170045 168357 101795 34753 -35897 36095
13016 36095 98910 109647 121898 -57939 79288 109220 -5009 -129652 -137073 -225847 -269584
13005 -269584 -166005 -353428 -285568 -213441 -158896 -159392 -303810 -311624 -260659 -212896 -49998
12994 -49998 41637 -61638 -239853 -156778 54811 105608 90325 31751 82539 20686 -12127
12983 -12127 55420 93788 23123 -121 -156966 -172039 16499 -28693 -270847 -245758 -251935
12972 -251935 -175539 -255248 -231684 -122724 -65522 1299 -154287 -297063 -110490 126699
12962 126699 220100 213495 185528 81608 168952 138788 -75786 6342 -15096 -7005 -70096
12951 -70096 38393 121474 -6503 -261033 -253095 -58733 56786 -66280 -93747 -148471 -190963
12940 -190963 -46998 -167181 -289898 -211044 -263614 -238288 -4944 -17816 -53502 96424
12930 96424 114282 34206 45159 66763 27144 -94508 -181354 -146109 20675 21689 109991
12919 109991 46433 -149618 -96516 -13270 6464 188500 162587 142385 -20306 3789 17806
12908 17806 101114 96438 24991 -48626 -44228 13614 133917 3073 -39912 -152166 -219574
12897 -219574 -159198 31240 -41400 -182034 -185734 -261091 -175604 -49462 -179525 -177047 85344
12886 85344 180225 -16039 -53200 82879 187732 37572 -30617 41885 -26480 -241505 -163991
12875 -163991 -128710 -86611 -120013 -164285 -32271 44348 290265 317184 112755 -114418 -266121
12864 -266121 -229692 -62226 143882 186997 56408 118775 133926 48715 -16098 162180 229178
12853 229178 161865 42493 46735 160778 224006 175374 53201 -205446 -13690 57363 -101827
12842 -101827 -172343 -12065 198505 255791 172066 -45267 -117783 -92003 -22866 -43222 -115972
12831 -115972 6911 26946 -64980 -155587 -127762 -84645 -189233 -137201 -166065 -225887 -23505
12820 -23505 14528 118758 212549 186366 206620 81844 11076 -26250 -144054 -197044 -164456
12809 -164456 -188601 -156433 -163007 -11272 40592 -16528 12158 -45633 -60509 -55812 -17836 -111279
12797 -111279 -120455 -30650 14192 100298 82071 116056 43405 -144268 -218771 -250703 -140473
12786 -140473 144389 194016 89976 -398 -124594 -54514 127842 44947 -63981 -11683
12776 -11683 -23779 57871 24703 46709 -72798 -22664 78556 122657 25027 -113074 -141606
12765 -141606 -280108 -325242 -302316 -233598 -246342 16646 158222 303411 207827 33966
12755 33966 33937 73279 -51258 31958 87798 62845 -126548 -93428 23203 135391 70191
12744 70191 -148825 -209191 -67202 25167 188951 180326 10184 -48506 26828 117885 -94141
12733 -94141 -385571 -520714 -437561 -123913 -24443 86156 -47839 -88946 -45704 -9607 59959
12722 59959 139590 131026 238534 168732 95630 206480 355048 173645 -1127 -115555 -14221
12711 -14221 70395 82976 81875 20909 -153891 -127428 -88044 -48427 110165 221316 210360
12700 210360 48007 79686 215318 293191 292458 132476 158804 -10856 -127963 63321 -40873
12689 -40873 -258447 -228553 -72436 -34096 -119601 -147776 -172282 -122750 -100427 -70519 -26651
12678 -26651 -27209 67754 -9051 -95732 -14862 27470 34654 -20679 -156463 -162329 -93281 -268909
12666 -268909 -301991 -342717 -347518 -275372 -221768 -229186 -293797 -484444 -560002 -421395 -338390
12655 -338390 -338745 -353994 -265039 -129911 -57241 5534 63202 -97108 -200214 -7920 -8870
12644 -8870 29433 13162 22385 -56688 -23629 135790 178460 14350 -180310 -249096 -19448
12633 -19448 213417 288788 307744 164792 -93181 -38311 -62580 113063 215381 283130 320226
12622 320226 210465 243132 233231 104672 163596 145798 157462 91703 40483 11893 276275
12611 276275 496486 414189 377234 181817 157626 113474 95401 249342 169947 86955 18276
12600 18276 69815 -2924 42641 158331 95912 170249 107566 38321 -16989 -130488 -99928
12589 -99928 -63870 -234022 -280084 -182540 -102048 -46274 -9403 32018 35731 31524 165105 52303
12577 52303 -179501 -148841 -112900 61565 185725 242869 162725 62537 103619 -3700 52175
12566 52175 156166 276483 305244 258889 371587 170560 30131 84900 109662 1732
12556 1732 -203442 -228470 -130689 -3183 -45831 -106196 -133788 -384865 -368679 -172559 -156147
12545 -156147 -162745 -392592 -520870 -333176 -73495 149049 205896 195909 242036 162869 79894
12534 79894 -24516 -99417 -28728 -155296 -187155 -94454 10257 23554 -1680 -75320 -42645
12523 -42645 65072 103420 -84804 -162146 -20909 151035 107806 56830 -22468 -136830 -134861
12512 -134861 -235050 -153669 -21717 -83024 -160375 -300873 -153171 -73368 -151076 -126893 -99871
12501 -99871 -164159 -221761 -100029 -216942 -389426 -409601 -350837 -180611 -115099 -67879 -210210
12490 -210210 -126957 -150836 -117855 8910 55377 -53646 -158208 -116645 -605 148601
12480 148601 138511 103230 -17843 3969 182483 165272 203186 299 -107556 -157613 37605
12469 37605 70756 126272 276621 339065 223513 166311 167677 95803 -18232 -209252 -217481
12458 -217481 -177550 -45876 -81939 -215056 -165109 -58883 -1579 36001 -19393 -8289 54408
12447 54408 -27417 -6278 162725 130035 86782 35576 4015 84263 -165558 -201323 -139218
12436 -139218 -106602 16726 -14381 -73160 -141841 69183 209416 189774 23282 36102 141600
12425 141600 200869 265993 222481 226266 144795 19060 -131331 -237711 -163216 87741 65883
12414 65883 -96180 -155948 -39063 4285 52401 -26847 -49384 -119892 -139620 -31586 142293
12403 142293 216222 307427 316097 252039 276200 22368 -52694 -63903 21576 96403 5303
12392 5303 -66567 -23085 107354 181077 239804 157862 164323 128568 -184015 -120122 -14458
12381 -14458 47904 -121409 -159936 -242963 -123744 44648 36691 -97519 55133 47288 -82729
12370 -82729 -202665 -305301 -467490 -524976 -354748 -71855 -90986 -213301 -375233 -280339
12360 -280339 -97442 -11729 -146783 -12241 -14945 102742 229343 227056 17574 -151222
12350 -151222 -169794 -101304 -128276 -243243 -134198 98455 -47207 -158160 -48264 4869
12340 4869 31717 38751 1106 -54730 -46987 -40780 65578 103517 118701 -10785 -190703 -264180
12328 -264180 -210110 -69299 -88294 -114480 -67405 -100985 -46862 69412 179609 183138 38322
12317 38322 57717 114851 15062 61388 -43602 -113923 -80452 -78303 57755 109023 126748
12306 126748 98501 576 -146522 -157411 -125170 81425 84475 81386 39973 -76227 -174860
12295 -174860 -163775 -197010 -203363 -282479 -218104 -112024 -16932 32967 -59655 -128077 -78556
12284 -78556 -120528 -92404 -14733 195792 165066 71753 59252 9744 -72273 -75943 44887
12273 44887 20128 69249 107632 30296 -170027 -89410 -24728 -65771 -98210 -69083 -306312
12262 -306312 -504569 -284858 42625 120025 -4837 139054 69071 149236 149958 83040 101798
12251 101798 68943 167893 271383 211093 -58868 -260461 -202964 -265447 -223817 -118930 -416309
12240 -416309 -427149 -229967 -44057 -66549 -70112 -128896 -159980 -162406 -165705 -79864 -158238 -236605
12228 -236605 -1376 18417 -31524 -94852 -61930 -44156 -218037 -342940 -399687 -188280 -246742
12217 -246742 -239969 -165898 -244492 -209242 -97763 -184615 -141491 -15961 65746 88100 106684
12206 106684 63884 -65777 38063 34778 -182622 -297007 -241604 -214583 -227220 -212221 -140607
12195 -140607 64792 100224 -9439 -52265 24242 -88861 -29615 14460 49530 -123504 -241987
12184 -241987 -309006 -145960 78952 17379 -128153 -114267 -60957 -70028 -196944 -268394 -85442
12173 -85442 165224 132396 48091 7007 -219879 -303447 -259436 -232172 -45350 5520 -120648
12162 -120648 -267723 -191966 22910 7190 -159185 -146478 -154496 -85778 83436 174993 135274
12151 135274 134137 324734 496906 756381 1154104 1467856 1648791 1775591 1768853 1700277
12141 1700277 1396971 991736 629366 451908 417631 383670 331356 266110 302395 221595
12131 221595 280973 397419 355777 205974 208265 79929 95639 34967 -5291 4601 -67678
12120 -67678 -26088 82082 103462 152097 259016 364531 310736 276988 758819 1274038 1601581
12109 1601581 1745752 1792542 1539685 1009521 470014 188025 164482 241635 142118 -44836
12099 -44836 6214 181 10045 -22547 -91634 -50520 36728 -24331 -21339 -30967 80112 -50799
12087 -50799 11863 -101019 -23124 -12456 5386 196250 422786 335971 309891 152226 42582
12076 42582 59811 99423 31214 157834 243142 331216 324769 220611 -94378 -179963 -168473
12065 -168473 -122575 43070 241448 278403 204309 -21181 51421 221726 200379 102941 118143
12054 118143 83170 -7289 31989 -67212 -230438 -229867 -240472 -303881 -234233 -12457 -44912
12043 -44912 -99877 -4468 108811 237668 101621 -9420 33770 -41660 -87709 -16986 -32470
12032 -32470 97261 202366 293607 301478 147927 43986 14570 40223 119739 237422 311856
12021 311856 296494 326954 219267 77333 -12458 10274 27704 61958 92090 214484 184244
12010 184244 102532 61873 207864 120837 -27168 -139444 -204305 -199437 -187292 -196043 -111429
11999 -111429 41512 191065 111902 -23486 -187882 -135378 -17020 -25961 31571 180257
11989 180257 189143 241257 276357 189150 213136 246280 253082 200603 -29639 -98761 -161598 -167198
11977 -167198 -161783 -84795 -73135 24799 192095 210039 130972 -10248 -10514 -122236 -217426
11966 -217426 -188625 -172263 -160780 -129678 -105065 -93392 -108317 -180125 -223645 -187973 -196357 -207648
11954 -207648 -210979 -152108 -163897 -146637 -131211 -98516 61004 36973 76 -35057 -204154
11943 -204154 -106911 -8125 21023 -27346 -61372 16283 62243 -23178 -178320 -215595 -66662
11932 -66662 66031 16313 62980 -40759 -145038 -105086 9721 -68567 76647 285748
11922 285748 162085 145616 81449 82288 169983 168059 93562 92193 179118 105765 -25661 -139343
11910 -139343 -134819 -172004 22314 118675 134110 295697 254807 249418 243615 74682 250122
11899 250122 332028 305928 122368 -31923 -25417 175974 235419 97388 28827 -53188 -102542
11888 -102542 -88192 -46118 2045 80788 179744 192083 -41684 -306268 -296798 -199916 -132158
11877 -132158 -15198 188459 174604 -5635 148199 149543 134828 66414 61314 23774 -4143
11866 -4143 -43837 -35031 -100189 -287183 -199286 -156614 -82631 72922 49282 -148340 -252180
11855 -252180 -310835 -197916 -52062 -11029 -61385 -156333 -195055 -275117 -267399 -186323 -185339 -199132
11843 -199132 13266 153732 111192 -75050 -213731 -271349 -197806 -146972 -106169 -139826 -101448
11832 -101448 -23479 -58584 -57606 -18609 -122704 -155126 -57551 -140 38659 102591 -43813
11821 -43813 -79283 -33816 -81247 -232679 -180965 -48084 17660 237886 221512 55754 49986
11810 49986 -32045 -191574 -146821 146586 186603 34581 -60573 6347 173723 116951 61258
11799 61258 -82352 -5317 86854 186406 203129 236494 259536 263267 -42632 -124249 -162232
11788 -162232 -21858 -28181 -19939 15889 94647 223657 96470 75463 -5011 -68043 -154688
11777 -154688 -103250 -102820 11684 119258 113625 12553 8143 113837 218009 176712 96773
11766 96773 76457 149941 296229 168061 103871 28074 -16008 -33769 11784 -31757 55802
11755 55802 283021 457224 243577 40432 -13803 -205557 -117763 -132549 -256468 -193878
11745 -193878 -57001 -50227 -115178 -81239 -10681 -6487 69607 8890 -60792 105734 137020
11734 137020 -32915 -123429 -380141 -170262 -179112 -347569 -363276 -234564 -126598 -71218
11724 -71218 -100159 -172064 -102796 -82526 -17762 52379 94470 74131 -76649 -128635 -65302
11713 -65302 -34058 4193 28196 47289 244183 382911 294821 98414 -72781 -119726 -23892
11702 -23892 64325 188114 428430 306701 165055 87723 -38231 -95096 -158282 -177007 -73805
11691 -73805 53387 223699 221954 96536 53620 -69921 -88631 -75660 -94742 -62776 -155812
11680 -155812 -67870 -526 89566 63984 55411 -81229 -49108 110851 68208 44588 173526
11669 173526 256358 194560 -100875 -180781 10127 104724 27640 51011 -61590 -116600 -84462
11658 -84462 5351 -27548 16182 112020 121492 5401 -60980 -28582 58784 -70907 -244120
11647 -244120 -167399 -124712 -76295 -92834 -79966 -33736 -19879 64350 -162962 -234256 -70492
11636 -70492 141116 119931 59812 -69135 -199639 -228519 75543 114748 13118 -94551
11626 -94551 -200889 -156744 -35834 162247 113695 -124679 -229995 -311561 -369803 -291601 -326838
11615 -326838 -230567 -77920 -137091 -82566 51936 -65910 -167530 11084 4707 -262738
11605 -262738 -305210 -241613 -379775 -335293 -64383 22181 -25405 39522 36234 -20984 -129031
11594 -129031 -78299 109360 175030 338733 394142 289642 19875 -10000 -52865 -72785 -202390
11583 -202390 -171500 -141890 -143679 -167459 -114551 -35937 117630 229254 267663 270065 116019
11572 116019 6168 36119 -130198 -112994 -114032 -295543 -202336 -213906 -178714 -67957 -64852
11561 -64852 7970 187245 206598 134647 -36195 -155751 -31661 -77569 -172011 -86862 -183161
11550 -183161 -241650 -314815 -283243 -63685 42296 120377 131494 97588 162929 275784 261256
11539 261256 93613 129667 158816 87513 11658 -109068 -98373 -78457 -99846 -98414 -293482
11528 -293482 -339321 -226029 -160365 -226301 -308901 -292626 -219579 -185112 -178980 -269967 -27509
11517 -27509 197969 60960 -111889 -287392 -230478 -115570 39006 -92592 -279258 -267583
11507 -267583 -99615 -25547 -202461 -187944 -62063 -72527 -74339 -161574 -95420 -105968 -187488
11496 -187488 -113354 -147530 -113273 -35330 509 67069 -31220 -124723 -113653 -31805 -57029
11485 -57029 -57751 -147949 -175879 -210212 -229376 -183784 -200608 -178739 -282845 -364822 -364179 -421934
11473 -421934 -450685 -404115 -451699 -242489 -141688 -132376 -47636 34839 -119033 -104974 -41819
11462 -41819 -105438 -106890 19284 96115 -32076 -115894 -240295 -403679 -238406 -211405 -130336
11451 -130336 119187 122209 80871 2221 -66293 -61417 -182520 -2791 100643 114372 -9761
11440 -9761 -104994 106348 234077 214972 575 -47312 -206205 -301052 -362629 -271651 -293459
11429 -293459 -300098 -292296 -345902 -291326 -159772 -49589 7019 -64300 -31088 26178 -14850
11418 -14850 -66725 -113845 -233503 -305201 -295389 -157390 -40330 -9955 74104 74150 -49224 -192451
11406 -192451 -225330 -100702 -7742 -37479 -93903 -96242 -44512 -184143 -299530 -149563 -122704
11395 -122704 -129955 -108176 -279872 -356743 -230229 -204057 -115487 102203 228178 -43257 -119386
11384 -119386 -130522 -138339 -212606 -159076 -73869 -59762 -61011 -150060 -174572 -193889 -171133 -81472
11372 -81472 -154412 -240784 -155691 -53048 -105698 -190121 -139416 36040 339278 268800 127596
11361 127596 22490 -153193 -283241 -452836 -372269 -287620 -422116 -437674 -213957 -16978
11351 -16978 -181999 -207734 -173680 -187339 -187866 7507 47919 -46621 173603 182346 104566 137474
11339 137474 40317 -196738 -206086 -214608 -211563 -155193 -33968 -133084 -179327 -86404 -36227 -178000
11327 -178000 -326404 -459252 -280608 -181099 -128421 -22221 130015 123532 100331 -39032
11317 -39032 -116036 -161896 -82358 -99129 -208202 -155176 -124676 -159592 -115339 -274605 -332022
11306 -332022 -160407 -245604 -240386 -46627 49170 84516 76717 -114414 -263094 -277000 -230498
11295 -230498 -207684 -204072 -250881 -223201 -155284 -225132 -175364 -11354 169767 198962 -124968
11284 -124968 -222986 -171408 -152066 -105213 -158802 -207161 -274511 -159277 -127332 -160203 -199354
11273 -199354 -146073 -102879 -18008 56367 139991 51134 -148290 -360128 -412408 -229676 -95701
11262 -95701 40354 -61546 -73382 -20043 8018 -7998 -1130 6167 -12737 -33350 -170857
11251 -170857 -208169 -45423 -93265 -135871 -118888 -171424 -168265 -131111 24383 -61305 118382
11240 118382 116465 49437 43653 -130637 -158244 -18890 22441 -71316 -144416 -323508 -209040
11229 -209040 -18235 77344 -41991 -215050 -273880 -194446 -309409 -301242 -155920 -207277 -269390
11218 -269390 -229921 -127678 18322 -109528 -55457 38824 -37444 23687 61797 143113 168175
11207 168175 67121 -49959 -169108 -241414 -254741 -220699 -274021 -388633 -378949 -141893 -95333
11196 -95333 -125388 -227164 -278558 -341672 -233764 -166973 54055 263156 183517 -6533 -42683
11185 -42683 -47594 -71844 -260141 -252619 -223161 -239822 -181151 -84911 -23908 -101273 -167434 -147299
11173 -147299 -182962 -150557 -89819 -47483 37779 76525 117203 136226 43087 -35355 -232960
11162 -232960 -257622 -405524 -425918 -332989 -217440 -152440 -169566 -167686 -24317 -105916 -87832
11151 -87832 -58568 -16111 141818 73229 -162042 -196700 -139303 -57645 85862 25988 -79990
11140 -79990 -138417 59668 43430 -72117 -114797 -153273 -95774 -109409 -82877 35450 -28357
11129 -28357 62865 65926 -9249 -89078 -120657 -222359 -224416 -187726 -221741 -152260 -157230 -199799
11117 -199799 -258286 -145593 -78471 -76692 -138184 -157124 -174559 -211986 -230905 -112384 -146575
11106 -146575 -42410 46043 108270 70278 -121677 -151382 -30717 64368 69192 -105200 -119046
11095 -119046 -232001 -437018 -182663 -36894 16302 102975 -69451 -21640 138481 15287
11085 15287 -6627 -5257 -212206 -196208 -109101 -18924 118785 38012 -121025 -32408 128187
11074 128187 68624 -40211 -71987 -125767 -143229 -149148 -55506 102065 39497 63026 67853
11063 67853 -46550 -79356 -76201 -31541 -126214 -330958 -291379 -63791 -215811 -352702 -236072
11052 -236072 -203706 -194323 -128042 15501 31648 -26205 -247832 -224902 -210549 -275327 -248485
11041 -248485 -275356 -215487 -182448 -70166 -127675 -226083 -215388 -260107 -202832 -109645 -147361
11030 -147361 44479 110987 -23983 -118591 -135798 -16076 -119496 -172971 -555 -88944
11020 -88944 -187379 -238481 -103935 89812 86584 135078 244803 121316 14675 24053 32414
11009 32414 25018 -147234 -265780 -191731 -100268 -180228 -278300 -289352 -246515 -278832 -71385
10998 -71385 -14896 -37580 -40686 -100785 -97776 -264640 -337940 -155238 -47091 -143910 -167297
10987 -167297 25805 40095 21111 26899 -71821 -84886 143091 311633 189948 183633 280717
10976 280717 332050 446394 330828 137788 85592 46090 102866 115102 12717 -6784 -48437
10965 -48437 -95737 -181968 -260853 -201012 -83294 14503 35110 -59009 -12739 -68421 -197727
10954 -197727 -60348 -123836 -133689 -138974 -61739 -81124 -5376 184686 189986 70049 -153982
10943 -153982 -61635 69236 21841 -196283 -315468 -339807 -368344 -236881 -197944 -183252 -209072
10932 -209072 -258937 -156820 -92437 -114046 -169100 -36834 -72361 -94973 104529 61343 -61343
10921 -61343 -72625 -60361 -63975 -131464 -140333 -143917 -188721 -43090 -157598 -151499 68167 23074
10909 23074 60327 168413 134598 -73794 -171729 66683 326119 236377 137244 129929 343193
10898 343193 495996 476327 422223 455638 394391 88319 70133 178254 241703 229684 134986
10887 134986 6829 23360 19468 100995 161452 74027 -66995 -852 -151381 -251644 -243183
10876 -243183 -243935 -139086 16544 26713 -66892 -1503 71878 186777 147268 152902 279195
10865 279195 172904 149529 361534 391707 345995 338016 125841 123356 157165 16248 -59894
10854 -59894 -24233 176559 364605 480933 613201 521237 404895 389515 304245 335704 282164
10843 282164 307610 415463 234109 118338 194687 315168 442528 302151 62961 -70736
10833 -70736 -32056 153696 331570 541871 465756 332763 227463 175741 62976 111342
10823 111342 199965 108385 -6020 70352 165005 282052 263672 132985 22512 83009 172051
10812 172051 209796 61925 -185491 -152060 81556 224707 225149 133990 297986 389197 416972
10801 416972 464476 501288 291883 320235 247318 256438 335132 255331 187986 198495 201775 150318
10789 150318 300801 247452 314994 400104 208912 294259 332084 219953 316065 492260 481110
10778 481110 319644 171786 186315 207505 122788 106018 118762 41207 56221 53945 9604
10767 9604 -204218 -180806 -5513 113473 104268 45362 -74768 -137201 58065 233043 257479
10756 257479 352261 381039 199121 43971 9903 61397 13125 -27413 -99262 -36312 13026
10745 13026 49300 38625 -48220 -200573 -70786 59871 258097 296137 93564 -116027
10735 -116027 -166290 -174038 -189040 -135501 -38736 -54975 53967 147794 219972 128880 -79105
10724 -79105 -207569 -414537 -479071 -411767 -389366 -208281 -21832 202378 223300 184077 174188
10713 174188 192000 273574 220541 176183 44304 -37623 84139 169727 106945 23451 -14874
10702 -14874 31742 108907 30445 183143 233527 115023 122742 -62231 -203612 -42251 70240
10691 70240 77904 174842 332556 274467 220867 192806 130891 -48350 -235628 -263479 -344216
10680 -344216 -314038 -129249 164554 246565 120035 -56918 -225691 -155829 -58684 -20058
10670 -20058 -208391 -264247 -214411 -94042 -19386 -127852 -224672 -236712 -68165 23081 179892
10659 179892 259506 222847 49231 46014 -147478 -297841 -150159 -64608 -148406 7477 -27637
10648 -27637 -41513 141888 125270 -72057 -121372 -60396 -24134 107741 216442 76742 -58130
10637 -58130 123758 260772 198652 254992 218061 315610 260461 201301 220789 250021 309143
10626 309143 169018 155252 -15901 -247531 -332601 -268191 -100087 -24875 -5199 115867
10616 115867 51496 -136537 -8181 37634 28870 -136944 -233115 -177610 -77332 70134 63629
10605 63629 -18705 136757 238185 152581 -27357 -100435 -27703 -53148 -239622 -289694 -364342
10594 -364342 -408254 -241322 -164506 -217333 -352113 -269867 -88840 93646 141358 237780 131490
10583 131490 -21735 -22090 11938 57126 55033 101002 186100 218419 377247 401223 517565
10572 517565 482517 421891 299420 169385 186042 -3512 -31491 -177810 -291034 -305281
10562 -305281 -318206 -216069 -208821 -292640 -187788 -45763 -59187 -49755 112023 327465 164721
10551 164721 45855 -51132 -131802 -197052 -139095 -182742 -173888 -687 89239 114470 134139
10540 134139 258880 295188 341251 234534 156174 -120284 -172177 137065 264235 276387
10530 276387 159104 52289 -74631 -245482 -209411 -255180 -148019 -58062 -122728 -117284 -152387
10519 -152387 26746 10392 -40838 -129415 -232368 -255965 -227124 -152483 14345 145788 -57356
10508 -57356 -75943 72191 82377 115655 45774 -84651 -42091 -70078 -140952 -148469 -203285
10497 -203285 -71778 -64090 -219609 -140729 -80565 15044 83799 24229 13306 70488 73350
10486 73350 78039 122221 167324 242023 361779 153693 -72710 -147905 -14440 91542 168257
10475 168257 148596 66031 109269 113786 273984 231825 261343 150133 89558 6212 -162769
10464 -162769 -341536 -392008 -323718 -393664 -281023 -135455 -68133 -145571 2056 136503
10454 136503 51638 9192 -84878 57545 153893 106630 106508 216235 172282 -4919 -64504
10443 -64504 -72919 -32670 29763 62777 7299 -122121 -170458 -119669 -34697 90468 156883
10432 156883 215501 288296 127534 -217493 -273429 -241999 -183039 38969 272468 304097 306774
10421 306774 186772 118409 63664 -3054 -133248 -8731 106948 115123 24088 -140582 -297037
10410 -297037 -91395 171292 365206 264057 383623 459487 614840 687749 901668 1066221
10400 1066221 1278199 1266794 1134712 1167275 1120845 1109828 1333693 1333982 1069493 810020 602850
10389 602850 625180 657076 587512 334403 197337 246085 345269 288555 273976 362422 254473
10378 254473 255692 198262 170169 180446 137005 15823 92399 149442 240808 173778 239794
10367 239794 358054 365686 279332 243579 68952 166454 216406 76974 -111109 -183637 -171579
10356 -171579 -177665 -185202 -241080 -134278 81276 46508 -3141 114748 159742 204579 190749
10345 190749 239959 -35815 -182138 -212442 -51720 17840 152996 171797 68231 149316
10335 149316 62640 13035 -27691 41905 156903 47387 -31851 49200 109903 25710 76755
10324 76755 186144 211167 182665 126492 130459 212959 166957 68593 225214 305747 361637
10313 361637 204922 4806 -186229 -36621 65335 90303 35304 -49340 -35463 -6218
10303 -6218 -83441 -293292 -321857 -327668 -291855 -124047 -135640 38864 66545 378539 522540
10292 522540 260050 -4152 -37434 -27021 -82820 56799 261065 136539 92904 269716
10282 269716 441201 412058 406700 397548 261222 156009 98205 3728 -7843 40459 102334
10271 102334 253452 239535 256087 308571 315385 151913 -101606 -182401 -64094 197393 107365
10260 107365 65153 206805 279259 162959 65929 12823 147041 96121 -60360 -22782 18540
10249 18540 101306 25094 4323 -89832 -170890 -215289 -55882 83843 98627 11743 28411
10238 28411 192020 246001 184680 175121 126531 329532 405254 165482 120592 88122 268712
10227 268712 351126 231403 241777 269933 90760 -161781 -104998 88951 99318 -107071
10217 -107071 -65051 153196 359888 323953 195726 141885 275477 266458 298838 225088 238991
10206 238991 292965 150217 173865 354818 388632 337568 225903 278796 264717 130888 64056
10195 64056 234749 324873 302468 282544 167926 78892 38615 156727 279715 336814 273588
10184 273588 284998 344271 268427 179879 239014 240062 210123 257578 289321 360209 277373 218261
10172 218261 451236 720959 670493 413790 298643 240930 229591 425164 514271 705477
10162 705477 796175 963363 915299 1065748 1214094 1130641 837435 796901 830573 731976 785145
10151 785145 739084 550887 579965 510023 431133 469747 469916 592854 533310 616746 667964
10140 667964 531166 369806 426308 477803 441623 244895 229947 193193 379249 501268
10130 501268 471720 572505 505879 443871 521722 676909 650332 745460 971047 1288905 1647379
10119 1647379 1743325 1659059 1663845 1818366 1708273 1435508 1367779 1180837 1090102 1034452 869193
10108 869193 918196 801228 685887 516402 639429 885478 925516 934722 1019135 894299
10098 894299 793158 635475 667088 795583 803741 542284 532724 628441 581510 578817 872269
10087 872269 1019197 1109561 1068670 1029194 932095 908671 1084010 1279437 1464922 1474895 1580734
10076 1580734 1641369 1709607 1748058 1648576 1567577 1297262 1228204 1393318 1642056 1759072
10066 1759072 1928846 2018513 2125028 2287882 2407547 2616060 2800035 3072694 3251372 3629814
10056 3629814 4365651 5101187 5960730 7399988 10046471 14987928 23948128 35532508
10048 35532508 42368936 46005695 48006485 45313814 35984270 25506574 20396423 18749472
10040 18749472 18913709 20351632 23461941 29170681 39035829 55786408 79761191 102756219
10032 102756219 117146334 124869658 125649667 113296771 87586466 62795265 46917180
10025 46917180 37309058 31240424 27209778 24425760 22461981 20708552 19321895 18163598
10017 18163598 17173938 16335485 15608117 15093852 14704119 14324131 14243980 14229177 14149628 14063859
10007 14063859 14155581 14418784 14902148 15782765 16991516 18531838 20616963 23657637 27524868
9998 27524868 32806091 40661919 52999595 74072304 110255523 161401558 207467492
9991 207467492 234095007 248929464 248976891 218981328 161996376 112975244 83624899
9984 83624899 66567385 55479833 48065400 42831996 38782404 35606367 33334955 31260368
9976 31260368 29224056 27387910 25888216 24376841 23342299 22653985 21982051 21421441 20829208
9967 20829208 20323554 19854211 19437823 19254960 19238363 19623215 20028271 20997963 22419667
9958 22419667 24388125 27001989 30856666 36904999 47203997 64518179 87685501 108303562
9950 108303562 120480383 126384907 124797161 109741758 83661440 61016122 46981363
9943 46981363 38379007 32867806 29333052 26674344 24388465 22496276 21204002 19959532
9935 19959532 18879249 17783350 16853036 16035031 15220055 14616954 14031552 13278861 12799129
9926 12799129 12471790 12071262 11714995 11490062 11267060 10957495 10781509 10503811 10274439
9917 10274439 10037293 9662046 9259269 8999729 8849603 8720593 8678371 8318983 8127085 8035845
9907 8035845 7902028 7751035 7619728 7495808 7565648 7516288 7606707 7447738 7219618 7163664
9897 7163664 6906588 6687135 6476062 6160630 5844574 5673621 5704657 5496598 5041289 4852176
9887 4852176 4726984 4566332 4315077 4280711 4358140 4347544 4359010 4512424 4654247 4743155
9877 4743155 4744254 4605595 4541573 4251192 3939814 3792976 3682890 3607111 3693394 3729216 3983369
9866 3983369 4208205 4520489 4613995 4589980 4439517 4411889 4383127 4294138 3893079 3680768
9856 3680768 3561822 3305228 3126418 3004007 2950592 2987031 3022411 2837246 2812976 2694470
9846 2694470 2630944 2617948 2720697 2850093 2865127 2853230 2724677 2928289 3366405 3546220
9836 3546220 3625377 3447980 3216958 2865827 2641679 2436928 2352996 2307855 2392896 2576031
9826 2576031 2522005 2515959 2757376 2841394 2707388 2717275 2803417 2529988 2183279 2115039 2013408
9815 2013408 1805591 1766228 1736014 1508652 1445329 1499705 1377493 1216640 1274758 1408076
9805 1408076 1567139 1437258 1397586 1327980 1398014 1627220 1750487 1875986 1900243 1803042
9795 1803042 1755082 1676305 1578502 1442759 1449982 1494241 1466972 1423847 1494315 1349303 1188601
9784 1188601 1257142 1073227 1061855 1231468 1159438 1041602 1018103 812443 777774 800240 831995
9773 831995 800172 977704 898622 775491 659026 726369 538421 516819 489899 553001 564675
9762 564675 416084 361557 469659 493319 409919 326666 553054 606266 504405 513830 720736
9751 720736 791233 644822 529155 488459 402621 351594 288744 402881 541586 312418 238338
9740 238338 326169 463256 598570 520189 436851 244661 101780 161060 333603 413449 499347
9729 499347 580830 513884 419351 509234 495192 392220 385023 249846 14477 2171 120867
9718 120867 173093 166562 190226 106695 157121 98229 191941 272221 -29949 -119563 59392
9707 59392 169134 103758 121 56678 8040 102143 74494 -61500 160279 313657 379751
9696 379751 365880 371653 379996 401093 434635 459668 453691 435240 224485 153802 203859 314365
9684 314365 204687 146965 291887 273161 200238 408314 334907 103397 -42121 -4609 -48329
9673 -48329 -33006 36326 241422 238997 -8910 17410 167961 183444 174888 287096 230317
9662 230317 198178 343566 429091 430637 347089 247504 276603 276558 253297 218759 364355 203056
9650 203056 -56072 112301 302061 409781 321747 247248 278612 244282 354313 359966 271748
9639 271748 139026 112058 82147 229279 474580 443718 428212 423437 141452 30490 -92007
9628 -92007 -269955 -320638 -258286 -83794 15341 48265 110238 277357 311234 234081 152855
9617 152855 215986 174815 264891 336073 346558 84741 -107878 -9027 94128 186554 236643
9606 236643 138593 -105852 -133882 -103435 -35802 32574 -157357 -158631 -7081 -12914 78605
9595 78605 232953 111096 107997 69814 35906 -120532 -112716 -198731 -168448 -59873 -91141
9584 -91141 -127440 -108307 -70309 -76996 -77284 18548 -28135 69929 75218 -163535 -231796 -169114
9572 -169114 5817 208055 296765 349354 236723 145768 -26133 -131592 -25514 18414
9562 18414 -31851 52219 230308 231376 237862 103069 -136297 -137425 -132468 -16931 90401 178996
9550 178996 111949 217743 24360 -155774 -505 105199 119214 212549 129379 158318 155739
9539 155739 91968 58305 46308 -12229 33592 -20402 -107463 24841 46560 121173 111752 27937
9527 27937 116556 93160 80825 163510 185337 131702 98358 72305 -12999 -111003 -4879 169956
9515 169956 174888 -32657 -163128 -26328 19099 97912 242602 151054 50037 31447 -212527
9504 -212527 -249706 -24276 31916 -125663 -306544 -120457 -20849 30210 50225 14957 -23512
9493 -23512 11254 42442 91000 78118 102418 200245 210743 189467 153447 -51179 -89973 58396
9481 58396 84714 260575 414377 382924 302503 305842 192435 -42305 -118856 21944 8333
9470 8333 84705 -34411 -37110 50206 62157 16899 -77250 -182048 -213045 -339558 -258466 -99624
9458 -99624 -83355 -82744 -116683 -133666 -2557 58566 104704 -36071 -113573 -136205 -175689 -157886
9446 -157886 -72307 40585 -88459 54594 51805 -75775 -167010 -171038 -138994 -94404 -178683
9435 -178683 -215470 -196303 -140898 -29508 84528 100841 -28707 -65344 -62546 -167210 -224189
9424 -224189 -184941 -160527 -128868 -73186 -61022 -30386 6376 -40349 -52159 34246 16141 178196
9412 178196 304129 295061 245110 173436 204167 252860 100142 124898 295536 312443 271641
9401 271641 266219 175088 81573 178144 100516 -96293 -378237 -325861 -135613 20096 -92338
9390 -92338 -132315 -113663 -271794 -210688 31362 53788 8727 55584 60737 199959 185819
9379 185819 -13399 39014 52809 -175249 -49988 87475 131991 38982 17646 200448 295461
9368 295461 233111 207697 82038 -67927 -62256 10383 125399 250695 199708 2805 -106199
9357 -106199 -74425 -192209 -156069 -34602 -37768 22927 -43848 -120398 -84201 60836 137806
9346 137806 137300 72212 -37549 33219 34403 -56788 -176687 -231045 -89264 -19524 38533 -67962
9334 -67962 6358 33127 67566 26413 118001 -18539 -228685 -258668 -164143 -80104 -30053
9323 -30053 -21887 -119166 -68127 2857 77157 150597 101509 153364 77601 -55671 -112189 -119765
9311 -119765 -115197 -25949 125517 190600 211615 197829 61132 -93042 -100935 17618 71278
9300 71278 164389 208368 91671 -61805 -43943 -5811 140212 133668 220336 304150 62824
9289 62824 -18488 -1423 -106589 -132986 -69549 -109934 -32505 44507 2145 -98501 29869
9278 29869 -27267 -6252 144797 288456 260802 281715 77808 27361 107027 191130 90163
9267 90163 -30301 70188 18771 34963 164845 118919 72411 -81972 -23010 -61523 -292619
9256 -292619 -170105 -44063 -153189 -266576 -50705 223664 334009 359705 392072 627131
9246 627131 661108 566459 561608 490799 365080 260171 327816 307367 267042 152225 58891
9235 58891 221578 209792 110550 12101 197169 379978 290374 286010 190074 -48177 -44005
9224 -44005 -12915 -19354 -41762 51083 129111 215771 238992 180417 120602 181317 225606 255905
9212 255905 219791 35679 -27176 -50705 -29046 57414 234129 424998 468210 432753 390777
9201 390777 259578 116132 257360 230676 169797 93540 79101 155800 200833 259262 353340
9190 353340 360950 291932 -27533 -194963 -157287 -52113 100038 135890 291966 449528 473326
9179 473326 530350 446270 310694 334690 387871 394507 437670 388028 313793 391071 478587 664998
9167 664998 840678 661217 648312 726212 627254 714282 838195 772561 721032 725709 809510
9156 809510 724507 699910 696200 664112 715526 896904 1095239 1083769 1102912 1064133 1093838
9145 1093838 1171539 1089459 1065029 1024358 1155947 1246718 1286801 1405990 1697658 2199187 2508282
9134 2508282 2858948 3235265 3848974 4630924 5480817 6681975 8476415 10903303 14591428
9125 14591428 20493929 30583735 47692633 68704676 84064527 92086744 95608537 90830618
9117 90830618 73812766 51552611 36180230 27070454 21555664 17889305 15282518 13315092
9109 13315092 11875400 10813717 10059195 9538289 8880885 8385206 7859005 7377572 6971536
9100 6971536 6795815 6701971 6463496 6115418 5954684 5641286 5250584 4999362 4799221 4708580
9090 4708580 4682807 4631474 4461233 4248183 4085676 3920874 3763835 3679214 3503442 3373562
9080 3373562 3632086 3598465 3658265 3619583 3383593 3188960 3225668 3460578 3507500 3389225
9070 3389225 3116968 3040489 2780307 2511390 2436797 2485282 2589101 2579458 2518160 2455678 2312492
9059 2312492 2125831 2002606 2089272 2174222 2201261 2061103 1983711 1874922 2012509 1995580
9049 1995580 1806903 1705876 1617034 1568575 1627703 1651971 1565809 1292915 1240422 1480169 1599492
9038 1599492 1488606 1612640 1746705 1748385 1694520 1620947 1450721 1419699 1384081 1371516 1340798
9027 1340798 1166350 1131605 1157471 1252079 1112222 949478 980344 1109617 1213891 1197454
9017 1197454 1180065 1224509 1120457 1058315 1062977 1098178 1029106 840011 714664 819752 768828
9006 768828 614831 595349 561999 657552 1039278 1301604 1305264 1413919 1411752 1241788 1175228
8995 1175228 1174232 1190994 1344276 1292563 1335590 1417118 1301328 1120668 1008624 883445 814648
8984 814648 751532 802323 806726 809447 794836 814152 827718 693009 638209 724384 740795 612988
8972 612988 376092 437691 534441 572756 550886 544870 567481 439912 407604 649729 645431
8961 645431 469795 393209 488154 488592 551111 569850 577649 582728 553611 297826 78696 86576
8949 86576 107725 5113 -856 75707 248118 226411 151828 124970 166891 285573 342593
8938 342593 292954 434244 556352 497400 407658 291831 252929 207297 361222 489132 535642
8927 535642 546915 422993 320610 443368 409487 33901 -86192 33391 10209 -156707
8917 -156707 -179560 68990 348060 350147 396811 442899 417452 350373 359659 370438 214516
8906 214516 110689 231782 327679 303096 211700 278615 468653 472056 464548 497898 509830
8895 509830 586123 471130 438665 522774 550680 432391 518496 502840 333162 277251 208298
8884 208298 381880 458435 336959 199688 186290 284004 317675 416287 479375 430844 500291
8873 500291 537649 530637 325910 141606 44026 136366 198741 205199 261739 354731 415395 504010
8861 504010 456533 421105 646820 596094 405552 410010 531184 602351 794726 677058 620116
8850 620116 513009 456673 506286 466555 298724 323660 398766 356241 378260 327461 240326
8839 240326 199026 91177 -19027 9966 -38823 -66382 -100542 -140403 -212052 -150810 93979
8828 93979 323810 385846 389832 486847 308622 249082 191239 62699 117820 275175 339050
8817 339050 292940 188447 202313 400813 488599 409808 297851 372828 480114 357693 398498
8806 398498 402118 463152 449362 558022 629347 438545 433181 257025 216071 317510 199572
8795 199572 134040 41761 -16524 -43910 8445 -92757 -31848 173628 162473 222925 333977
8784 333977 324145 396036 362733 444355 267778 122642 184081 70853 113906 142571 116362
8773 116362 227070 245016 224542 174267 213792 285468 422463 236678 271036 361892 458756
8762 458756 458034 442167 542224 588502 517300 467458 565031 531287 589454 677553 559957 284293
8750 284293 125633 153290 209293 206554 214367 274355 230702 75785 -57080 -84873 140569
8739 140569 186143 110116 4971 98381 194811 163682 56604 98543 181428 196401 195047
8728 195047 279369 266024 138440 94161 -43001 -46125 81178 141633 293157 423137 262356
8717 262356 290670 221212 143644 111383 110558 253335 245352 152926 135159 222391 362067 313897
8705 313897 66350 122984 120103 154407 -37139 72417 56262 -70267 -46208 -17805 40803
8694 40803 -71690 -218510 -185922 -115944 -56763 -152892 -2337 125998 92879 126838 201794
8683 201794 288178 211540 288642 280367 184084 41514 -73294 -71169 -109561 -221874 -262779
8672 -262779 -52027 84908 12465 -101909 -204747 -227992 5572 274740 116004 36826
8662 36826 174686 98187 10563 -60181 -90920 -45181 89712 339969 398083 231503 200663
8651 200663 192586 189674 189644 137159 -1938 43729 266721 357981 241707 374291 464694 404862
8639 404862 291096 191585 184443 282099 239034 250182 314210 196099 39007 -98248 -112341
8628 -112341 -81468 -75945 40313 188784 76979 -16912 83627 266993 289121 140733 49330
8617 49330 171324 371541 340206 168386 1231 34320 -25982 -42698 14884 -20198 12396
8606 12396 -75799 -66524 40964 127265 234054 254021 323925 266588 184244 199490 161865 111755
8594 111755 166502 325042 378275 230601 226906 148401 79173 164285 6864 27953 253256
8583 253256 129527 160240 106052 114246 73912 -29994 -8026 117348 190686 237474 136494
8572 136494 185910 115327 44412 -31897 -97344 -179550 -61908 121911 257436 152588 24287
8561 24287 -111978 -68508 54350 77345 -53590 37169 160747 -92952 -159015 111001 392365
8550 392365 423334 244865 38967 -527 -39348 -35892 4975 25807 109125 201447 87688
8539 87688 -25141 83477 102905 103820 940 -109247 -271063 -134764 20819 17753 79405
8528 79405 -16978 -179930 -150153 -99910 -104113 45667 59697 36817 144031 99354 31020
8517 31020 -32120 -76384 140053 335125 400368 387904 185794 106090 195627 140347 77268
8506 77268 174094 373802 357611 328623 352304 205572 84941 49193 -10512 -113023 -169066
8495 -169066 -254149 -194843 -287022 -180207 186716 259700 243304 85801 31783 256401 373772
8484 373772 434303 382943 286702 102591 43740 97138 295670 355777 261183 103907 35996
8473 35996 -61294 -49778 47174 18722 27792 119373 82071 16425 -30623 -69254 -42979 22009
8461 22009 -97796 -99597 52163 117570 60461 -126586 -194154 -186113 -163614 -176843 -93823 97385
8449 97385 252361 170154 83931 108795 164189 86269 33627 9827 -84693 -100287 8863
8438 8863 -166759 -246998 -241615 -139944 46787 65979 6006 96644 -42027 -9977 -79568
8427 -79568 -143110 -223660 -156158 -120407 -43690 54013 5657 -133127 -180559 -74393 95463
8416 95463 188079 128855 24595 139374 375155 344133 201738 86583 240951 310967 203551
8405 203551 86038 57655 122481 29389 67019 -121381 -361352 -327202 -138979 -78291 16533
8394 16533 140282 194069 61871 94763 114896 -9421 45599 59578 -1823 25579 -16273
8383 -16273 -72925 -116877 -103124 -111812 -100765 -60014 -128707 -49820 80075 33456 -99916 25729
8371 25729 176516 188237 160532 218442 379615 363007 465622 514589 502227 547990 579810
8360 579810 523441 303431 226602 300549 144800 -696 -79564 -107891 -165537 12068 21889
8349 21889 -1661 79967 145984 109614 112453 -18218 -114175 17666 130192 139727 152094 260781
8337 260781 465886 352812 93093 45320 142563 103454 144954 273311 352911 231910 172315
8326 172315 123268 179280 171426 142060 110742 44702 -29819 -131009 -20218 211485 291042
8315 291042 100107 -73408 11948 140473 196005 309471 305399 92363 38333 71974 -99005
8304 -99005 -40942 22347 -68252 -115270 -35079 -53592 -65412 -176008 -292346 -355645 -248729
8293 -248729 -141525 -90768 -78180 -105282 19315 132729 160074 98925 188144 160221 39011
8282 39011 -163337 -199663 -274677 -226730 -110863 -44436 -70919 -178981 -355722 -244435 -26060
8271 -26060 112062 130853 27323 95238 203545 144103 76934 -55178 -30473 -50562 -109738
8260 -109738 -95322 69023 183372 137433 161476 219928 203908 366255 322549 222228 106616
8249 106616 118539 100686 263414 136040 -29428 -134599 -89535 31800 -1974 -194545
8239 -194545 -275088 -108778 148730 167485 118172 343917 314041 185530 -23268 -123288
8229 -123288 -134656 -75878 81270 145077 53459 143135 111900 141769 121087 113477 71455 -44532
8217 -44532 -77934 -126611 -177972 -346159 -325323 -261650 -249409 -138392 -142080 -93392 -20936 -120122
8205 -120122 121109 274983 154083 -35809 58663 18496 158816 119335 35247 194525
8195 194525 273506 309808 172730 42254 -95626 -158522 -110418 -184890 -106639 -101312 73454
8184 73454 317281 412091 267218 220287 147924 40695 -55778 -109039 75362 -21065 -86316
8173 -86316 -94635 -51808 90689 195805 142437 -134548 -67664 101218 304938 427640 518736
8162 518736 713925 473057 194099 276559 574422 759584 641759 747929 958579 1095618
8152 1095618 920449 1043502 902482 862364 907835 804366 666409 523444 569637 558087
8142 558087 396669 235828 269611 234566 146475 287723 372488 282789 364755 397805 358537
8131 358537 326972 405028 582587 801893 880453 1053676 999492 862361 625114 474868
8121 474868 290190 169706 132734 170951 329663 385450 320765 177101 254796 437433 643473
8110 643473 819518 971336 1231735 1545963 1787382 1780364 1584816 1373403 1013255 845822
8100 845822 641500 337669 233323 -6546 -70393 148991 405965 459305 372440 353842
8090 353842 297018 135211 160697 268268 271997 175844 174181 205480 261436 286917 201956 403026
8078 403026 427910 393413 546020 533806 545080 675948 776128 891336 865252 764528 677902
8067 677902 707215 696293 692004 667835 763516 837913 720630 606697 572951 635005 754197
8056 754197 742278 566994 545818 568270 719017 505828 296172 314273 320864 285373 439322
8045 439322 441508 270837 138525 111094 207023 302888 423145 422540 389265 330032 203834
8034 203834 233514 421470 374817 361005 502673 606483 693087 884994 1021890 812538
8024 812538 801910 813636 787989 610116 464375 377030 371671 142178 10653 51596 332699
8013 332699 318058 253520 228342 251636 223056 199961 289560 207523 158193 70401 18109 81246
8001 81246 379735 516589 246801 179227 162710 215931 186904 180983 134412 58251 -40911
7990 -40911 14911 -33839 -10749 154027 162685 163068 303334 464301 451453 405429 418738 247295
7978 247295 42359 127580 242120 134524 195165 404989 593339 584665 336428 68005
7968 68005 -32424 -32883 11389 48501 -71584 -30920 -25517 -130920 -78750 3214 38537 36942
7956 36942 -12739 -35328 13013 64247 19501 -43399 -150478 -216962 -207126 -63434 172939
7945 172939 124331 146168 128072 70807 -36465 14471 133843 199347 261965 152033 71693
7934 71693 141247 165115 111895 29025 -127149 -10570 72217 41437 49274 21550 30414 35385
7922 35385 -19700 -38894 41400 63744 139179 203930 357867 415930 270550 123516 102460
7911 102460 78617 -48951 -25148 56395 236504 178237 320478 253980 213762 89416 -31059
7900 -31059 -94599 -19013 -76469 -30296 51511 166614 -8305 -191076 -132450 59496 43638
7889 43638 -120639 -247014 -371461 -404455 -247430 -232387 -144755 -86969 44969 246720 261202
7878 261202 151207 165561 99724 84582 134321 132498 65275 97854 190021 81146 358
7867 358 -56600 -142412 -96239 9578 80349 291159 233234 279255 207056 115790 -5666 -62375
7855 -62375 -187575 -209533 -170760 -249117 -247949 -18426 27928 -164486 -241646 -245541 -393242
7844 -393242 -321117 -134843 115590 57312 9183 35847 35103 204560 162206 105397 342562
7833 342562 376202 282340 127700 173094 91352 58008 26076 57817 203584 120923 62410
7822 62410 190362 247312 50109 -37886 -97933 -157580 -56005 -120868 -231512 -155338 10044
7811 10044 -155509 -108405 -113073 -115716 -120436 -17891 -101785 -159612 -158279 -155977 -89120 -78586
7799 -78586 -199356 -93689 -6535 -119546 -76724 33434 50891 175358 166153 197745 85648
7788 85648 -78355 -176164 -203429 -180324 -170947 -247384 -246619 -202038 -147784 -38610 -44113 151286
7776 151286 13818 22076 193824 92386 156997 142335 49941 56448 166402 345856 494190
7765 494190 528280 408501 206659 -14187 -27988 -122210 -138713 -117016 -187182 -289772 -240704
7754 -240704 -1201 194117 130005 -41938 -65629 -99757 -48540 10572 -20995 -68107 -232408
7743 -232408 -258259 -237134 -300318 -202458 -224005 -88382 -74163 16585 60124 -12744 23878
7732 23878 89560 35719 -4401 -41793 -194681 -268952 -440041 -351501 -145789 -96173 -169266
7721 -169266 -225181 -295991 -25328 177533 6038 8480 153934 42838 -27878 -67527 62048
7710 62048 91030 33045 -27216 -41168 -229346 -27046 171376 19744 -28819 73374 6843
7699 6843 -109942 -128955 -177449 -349760 -362227 -182687 175368 225648 178087 150068 80428
7688 80428 112920 82069 5047 -137397 -68475 -7114 63986 150631 47807 -152621 -104183
7677 -104183 3407 -65162 -172790 -183364 -198856 -20563 61691 56517 78861 220715 197338
7666 197338 201010 207199 221630 233543 148818 -32631 -230121 -33223 194733 66035 -42798
7655 -42798 -25570 40570 111700 122533 47677 -40441 -74725 -68795 6831 37379 19293 81052
7643 81052 134985 37560 139393 138314 189119 171079 -9327 -76999 -32180 72301 59206
7632 59206 48401 -114218 -153893 96462 170336 227135 92958 -3320 -115959 -279225 -253251
7621 -253251 -108567 30571 23855 66461 303288 318160 153600 157771 124424 81179 -116590
7610 -116590 -52825 67430 170317 126056 -41424 -49865 -109570 -149916 -72433 -93895 -208621
7599 -208621 -130115 144030 222197 302975 333436 308269 243505 178099 166886 159411 68673 -44204
7587 -44204 -59642 17769 118838 67887 69932 142967 129551 -27148 -61295 -93355 -63319 -20917
7575 -20917 40176 -114705 -168967 -76341 -119352 -245706 -143427 -46735 -17344 7828 26065
7564 26065 109867 206539 147191 118905 124136 133082 217008 347405 389196 283020 195635 24040
7552 24040 -65500 -188600 -189933 -31381 63283 61278 110246 48501 -105422 -293677 -195918
7541 -195918 -89380 -39283 -51161 180550 316641 336665 342248 398463 367269 334660 95672
7530 95672 -164814 -277261 -218315 -176374 -105411 37812 68031 66077 -54249 -78210 -63431
7519 -63431 61901 86249 171713 164605 136699 94391 191170 163933 169193 62715 116913 -22839
7507 -22839 -315622 -350053 -140427 22902 -95552 -256514 -405187 -309909 -135297 -5131
7497 -5131 -210369 -344517 -46269 72831 209380 239466 -145245 -216487 -96976 -35272 -22878
7486 -22878 74061 21258 -162992 -284752 -201145 -102819 -5017 44865 -59946 -107481 -160838
7475 -160838 -227796 -198209 -163562 -85319 -27113 -122338 -163224 -36750 123196 13883 -184623
7464 -184623 -207376 -41594 50212 13059 -36156 47889 50617 79651 103641 121976 87092 -106246
7452 -106246 12153 -47879 -114288 28636 204873 224837 180029 132253 67487 -65148 -28648
7441 -28648 -192818 -237319 -233728 -403875 -325866 -143248 47466 126164 185025 102298 -68759
7430 -68759 -149940 -114833 -20178 136361 165237 30948 22879 95221 65793 47961 -21006 116288
7418 116288 -5905 -628 165368 -93506 -320042 -161367 -124595 -271618 -184886 -99051 -9876
7407 -9876 -98504 -47515 -28857 -69814 -81569 55415 -7486 -199029 -133752 -45308 3894 -70555
7395 -70555 -140454 -212975 -177558 -251865 -172830 -89086 -238506 -157026 -316223 -369695 -438046
7384 -438046 -356928 -260947 -217934 -152452 -182874 -218592 -5833 -19385 -180209 -174377 -47795
7373 -47795 42125 -38711 -158310 -143409 -28528 -135783 -221568 -177874 -258805 -270786 -120605
7362 -120605 8326 47557 -116543 -262630 -238883 -190416 -104226 -131240 -273273 -170581 16501
7351 16501 31316 -161030 -109173 -96242 -228952 -239452 -159540 -173782 -82364 -50088 -20226
7340 -20226 -147858 -71753 18859 -142343 -43286 182611 247529 261061 226538 240115 263978
7329 263978 303439 352667 271923 73602 -31055 115317 145071 43592 779 40446 247534
7318 247534 238301 239408 342403 252556 117216 111189 -103216 -250538 -339946 -150850 -62478
7307 -62478 43179 90029 58505 -8094 -90779 -205607 -330779 -246350 -11242 -9712 -186454
7296 -186454 -199410 -116338 -245891 -240557 -48664 -3089 27952 84465 -58225 28057 -68550
7285 -68550 -41715 -200865 -248778 -192192 -129473 -39746 -74002 -241488 -204313 6415 -63282
7274 -63282 -46152 -61332 -2310 86253 108617 -66255 -215389 -193242 -134726 -364806 -571532
7263 -571532 -378821 -389134 -308320 -310251 -208354 -178513 -349924 -357640 -291230 -241755 -313546
7252 -313546 -294396 -251599 -278583 -223781 -364166 -317767 -149119 -186533 -296206 -269752 -66059
7241 -66059 -2907 -105476 -201257 -118281 116816 197272 130665 135067 -54098 -274236 -236105
7230 -236105 43559 193579 64808 207677 350955 210197 -75211 -197274 -204612 -125802
7220 -125802 -57397 -73629 -41189 11772 48652 219492 100081 -84719 -52277 -221403 -249723
7209 -249723 -275041 -172855 -92379 64439 105499 65248 -112942 -172222 -132584 -80626 -90396
7198 -90396 -138865 -152412 -20156 30410 24540 10532 2981 80295 -93190 -215687 -289881 -278267
7186 -278267 -207070 -223436 -233531 -263879 -349727 -310396 -247105 -32731 166008 120577 -61886
7175 -61886 -164537 -198518 -182520 -85119 -17494 29870 218069 253202 90720 -264659 -329214
7164 -329214 -503080 -526302 -362662 -59012 168677 160767 74856 22853 -81180 -115925 25902
7153 25902 36117 27015 75589 -40305 -80509 -84971 -40053 194793 19946 32407 86622 59245
7141 59245 41359 52246 66014 228763 314825 265850 239004 227087 33210 -130865 -90526
7130 -90526 105365 33799 49752 -90376 -112112 -29208 -215428 -387025 -390211 -339484 -139488
7119 -139488 137412 60314 -303576 -306839 -122840 -78420 -96975 -293374 -198325 70983 137722
7108 137722 73163 99140 87979 -34820 12930 -2540 -183618 -272025 -230715 -131979 -78744
7097 -78744 197981 157223 -114311 -150492 -117966 -164800 -72198 -46050 -180261 -201636 -122370
7086 -122370 -79275 -66363 -66070 -133552 -254948 -235452 -162090 -183240 -265077 -193025 -244505 -205384
7074 -205384 -190461 -317974 -339523 -363232 -379764 -326659 -314187 -357715 -282031 -324864 -400923
7063 -400923 -266935 -9007 19728 -1147 -86306 9679 -14800 -6212 -128209 -37629 -150678
7052 -150678 -196956 -21034 193986 234018 226909 298118 377916 268531 155483 162360 90660
7041 90660 91978 82128 -44756 -8495 144497 178647 66301 -38310 67331 202330 27559
7030 27559 96640 118521 106102 125289 44289 -133163 -181180 -189261 -105168 -14436 -8215 115350
7018 115350 176888 214574 51713 -163989 -157942 -21106 -88823 -117335 -165833 -100576 -53942
7007 -53942 -76917 -118485 -183265 -28905 19367 -2983 94061 188883 112349 109714 109229 -90544
6995 -90544 -118543 9557 70845 56770 -29936 -82166 12023 -671 -37855 -89319 -113471 -132600
6983 -132600 -223960 -162504 72687 415 -157977 -181333 -229247 -118287 -92002 -245524 -169379
6972 -169379 -180718 -270802 -378609 -412601 -274405 -358855 -324519 -381773 -393671 -204067 -118518
6961 -118518 -11379 129763 152630 -47678 -54264 -2171 -180384 -355726 -287627 -146630 -21780
6950 -21780 -149417 -190492 20799 92907 -19624 99500 163663 122703 25060 -46034 -34468
6939 -34468 85013 39961 -74362 -186887 -146424 -130689 86794 177219 246276 117960 -32350
6928 -32350 -87186 -128244 40935 12649 -58459 -62776 -179481 -151329 -44315 -41868 -121497 -82975
6916 -82975 -17932 -6071 -106390 -152270 -105070 -252950 -218189 -127230 11705 206349 213640
6905 213640 132655 159794 163786 81459 172000 214691 151210 -25765 -64899 9509 -135641
6894 -135641 -39968 113166 237943 281840 141370 80650 -5146 58194 -86800 1887 91155
6883 91155 25911 45888 -86418 -198931 -235078 -191517 -108089 37695 204028 186738 184650
6872 184650 164651 157891 91512 -91127 -141069 -226111 -203923 -103148 5854 206270 -1735
6861 -1735 -73511 26748 -28507 35168 106340 95004 108653 208782 217910 64702 -22963 132198
6849 132198 10809 -138557 -107269 -128725 -67168 -129109 -174983 -231174 -175762 -107794 -18441
6838 -18441 -88085 -161469 -186682 -157966 -108246 -140626 -154665 -63882 -148112 27574 119537 126144
6826 126144 -54697 -55242 164929 299892 145854 8231 75115 182517 164446 110793 -61390
6815 -61390 -175977 -78398 61385 64061 138387 255583 269422 130508 69430 48453 -70599
6804 -70599 -112939 -137545 -68713 -181078 -210541 9728 65410 -57594 -132364 -246132 -158809
6793 -158809 -182399 -189592 -215060 -226573 -166788 -125363 -278949 -165703 48231 156539 68085
6782 68085 111268 118840 -58874 -79874 -16347 233347 125026 2419 -45975 -97979 -242151
6771 -242151 -157686 -2392 -4572 -124123 -123281 -143920 -45155 71097 32965 -127935 -202582
6760 -202582 -266918 -259621 -158235 -137848 -69359 -125849 -181535 -89552 171945 238561 264925
6749 264925 268585 258435 104249 -39839 -169755 -212558 -127720 156100 267913 185826 65831
6738 65831 154291 78608 35543 -37279 17625 66295 156209 122506 -38434 -89042 -98703 32598
6726 32598 85335 95279 -40205 -37744 47074 -49046 -160042 -190156 -6398 35879 -36859 4729
6714 4729 -186946 -246142 -182606 -140013 -286884 -216773 -209319 -276813 -318146 -79454 54237
6703 54237 8648 10105 -44557 7338 98515 234297 194161 105724 -6472 -227905 -92240
6692 -92240 -12403 -16642 81862 -114672 -270563 -283296 -170485 -67213 -35639 -14371 64310
6681 64310 -45808 -182719 -11049 -106762 -301350 -326131 -253526 -195427 -17491 21136 -166440
6670 -166440 -214035 -309806 -298419 -150935 103256 48493 -159595 -156251 -66445 15651 -103627
6659 -103627 -203878 38375 256213 320555 300764 189888 -32470 -24956 66036 166948 200492
6648 200492 14798 -19301 21743 -80812 -205129 2337 75275 -30311 17494 -28013 27222
6637 27222 -50931 23991 -31208 -91220 -97481 -326683 -335118 -148907 -79175 -167086 -177342 -223029
6625 -223029 -129966 -146510 -143577 4927 156552 162420 65747 1599 4927 71910 56775 58706
6613 58706 -157067 -9242 193928 497903 615475 485304 382356 269917 248101 156245
6603 156245 59397 -54797 -270937 -354988 -249297 -46157 14502 -143213 -326289 -428906
6593 -428906 -299324 -88845 -83275 99627 57030 -117023 -222661 -312924 -284831 -179610 -154316
6582 -154316 -155693 -39048 109640 -13669 -26667 -63533 172089 195614 42806 11027 66500
6571 66500 29242 -36194 -35811 46987 140725 -23030 -76348 -7537 -8270 100210 101377 -33109
6559 -33109 42211 -14034 -12507 -86675 -226955 -263495 -440432 -340534 -300581 -135351 -1400
6548 -1400 43501 94567 121985 23473 -12064 71381 -17637 117851 36586 10328 -141545 -345725
6536 -345725 -220868 -233201 -249391 -205678 50511 84643 169122 253230 162684 107498 89736
6525 89736 32246 -135215 -253191 -273040 9217 174229 63471 -52066 -149992 -235696 -173209
6514 -173209 131353 245237 121702 -53168 -143267 -2983 20144 -83747 -218358 -136522
6504 -136522 -156548 -92635 -162810 4137 255727 319014 284446 339782 289802 149017 5157
6493 5157 70124 175405 -16373 -154033 -428948 -484842 -330858 -191034 -140134 -117989 -159221
6482 -159221 -48833 62620 158725 111472 117147 94960 130598 36871 -76905 -205092 -158474
6471 -158474 -94035 52499 182306 212261 217344 251569 122923 35803 -40912 -113143 -156900
6460 -156900 4582 81830 108786 187447 165284 118107 2235 -126218 -163567 -239862 -246622
6449 -246622 -268664 -106791 90791 165293 209519 -8597 -191804 -282929 -401154 -342338 -48826
6438 -48826 101982 29314 -189579 -169103 -128082 -57785 16815 106288 96438 93993 76276 173467
6426 173467 196752 155260 98605 151301 204953 146435 168597 108532 56873 -38893 20019 31807
6414 31807 142765 34478 -64605 -276954 -147547 -19385 107759 28322 -41896 -99877 -185975
6403 -185975 -117013 -261450 -280935 -119368 47748 87828 155491 89828 -17029 -135807 -54169
6392 -54169 -2151 98743 105886 1617 -6892 -9329 63378 137011 65392 -138823 -180678 -280613
6380 -280613 -210747 31907 98145 115497 37692 76395 -23493 74601 138314 41677 42892 334105
6368 334105 398643 54828 40833 -144796 -109420 22170 -45908 45729 77784 -24481 -89466
6357 -89466 23861 319917 262127 157031 67576 15060 84383 196520 64456 -35857 -101248
6346 -101248 -216274 -86469 -7470 -90011 -180922 -185050 27295 62398 -16439 -76171 -39686
6335 -39686 -38190 -42788 -164487 -277382 -265064 -15869 81755 31994 22263 153127 207468 250456
6323 250456 384635 286832 45602 131468 155827 130534 228098 118191 -5087 -218775 -326555
6312 -326555 -425961 -362268 -246636 -264136 -281155 -124296 -32666 223227 130447 -17435 60070
6301 60070 -23133 -96206 26641 -123438 -120889 4739 124900 -70112 -27473 125508 109339
6290 109339 157735 184157 244190 185631 70790 264696 204957 258169 390308 275021 -19390
6279 -19390 -225551 -309888 -285410 -209968 -178773 -173541 -129710 -118578 36819 25354 -68392 -110497
6267 -110497 -148734 -267021 -276027 -338369 -363674 -280212 -75625 105676 66051 -20637 -275855
6256 -275855 -498239 -478199 -146341 -40390 -28045 -37966 -36527 -241568 -344416 -430582 -447482
6245 -447482 -286794 -216074 -86026 115330 70001 81604 108776 105340 61749 -54048 -190769
6234 -190769 -170355 -187062 -171289 -159854 -169953 -198239 -105051 1865 46965 42177 213635
6223 213635 343948 233064 140055 88061 57307 144184 36215 30443 99759 124611 38
6212 38 71049 299406 99074 -6822 103590 -47594 -4522 -36445 29981 28157 -85768
6201 -85768 -37346 18594 70972 92516 53729 -15808 -103401 -17884 -39925 -19282 130427 79813
6189 79813 37156 140248 104686 48332 -35178 51024 303487 223328 108373 138098 54849
6178 54849 153792 69086 -68578 -97494 69061 169264 -17761 -201845 -177148 -110025 -180217
6167 -180217 -53338 91867 14980 -8832 -62770 -12716 9058 15378 -54926 9797 183834
6156 183834 343117 324653 164280 98487 -88585 -283100 -71253 178329 250851 128231
6146 128231 119187 1670 -106712 -166561 -168442 18918 32687 30367 71758 -120008 -238761
6135 -238761 -288071 -180099 -194307 -107539 53277 25853 125298 230343 181812 183670 183937 240605
6123 240605 185477 118903 -46046 -100135 -108754 -229271 -192875 -198315 -158911 -19068 67898
6112 67898 58521 17798 122882 182875 176001 65250 -23199 82012 296135 297828 140863
6101 140863 113222 122337 -54438 -253062 -262901 -253255 -212287 -53682 -24911 -69535 -87519 -134638
6089 -134638 -155781 -204007 -254111 -403906 -271129 -63895 85959 172037 296475 245047 292887
6078 292887 272184 -11067 -36826 16456 36211 11660 526 -31406 76865 171002 193904
6067 193904 79888 -97727 -150218 -337274 -192812 -89075 48508 41545 21703 -22550 -135304
6056 -135304 -213636 -220892 -252815 -126165 -51622 -175326 19762 206046 96294 81573 94053
6045 94053 56148 -9282 28479 103814 28871 -43417 7058 -2325 73204 143944 126974 -4817
6033 -4817 37757 98427 101328 90806 87389 81532 53730 102185 141001 113060 30976 83088 70560
6020 70560 -121388 -35523 178473 182696 217776 198259 160667 55046 -20589 21803 -69356
6009 -69356 -232084 -176333 -181536 -169979 -354827 -475545 -325489 8464 30375 -171804 -387259
5998 -387259 -440910 -213756 -104691 -240001 -318363 -278111 -351134 -293921 -170450 16688 88585
5987 88585 155355 15767 -90616 -198991 -41424 144811 -39885 -149055 37745 98649
5977 98649 85982 218676 161780 65438 -43190 -29474 28853 177539 166088 126617 -79940
5966 -79940 -41218 84301 31737 -60351 -6373 51933 38861 56584 264778 348157 285059
5955 285059 135853 123147 127091 113456 4726 -99464 -47710 -95891 53168 209045 187909
5944 187909 157731 52625 -104009 -192131 -231430 -326994 -309669 -258147 -292871 -292370 -202478 -236314
5932 -236314 -131753 -226026 -246520 -228461 -188572 -35425 187961 252116 271945 285280 269891
5921 269891 333791 174890 104457 65198 113688 177277 34564 -165581 -230205 -213780 -225096
5910 -225096 -201254 -154421 -229917 -142236 -118908 -230590 -155827 -84598 -248634 -141456 -9747
5899 -9747 216061 159846 156929 196906 95297 -159564 -43974 18026 20512 -26925 -123724 -180770
5887 -180770 -206329 -221418 -212858 -220955 -117663 -163787 -225065 -108349 -135144 -257076 -227208
5876 -227208 -155539 -115494 -40847 81014 -10247 -67709 -63021 -42027 -38644 45663 -18194 -22197
5864 -22197 44965 -15288 -5820 3730 -98060 -138988 -236082 -171139 -131932 -293452 -265856 -218754
5852 -218754 -119636 -111900 48878 89850 -119240 -388156 -351264 -210944 -177214 -22288 147144
5841 147144 68088 94409 237204 281806 321443 132261 25655 31806 -537 32359 55304
5830 55304 -108578 -61320 82074 37900 88541 122399 73537 27525 50843 -40285 -17318
5819 -17318 -61056 -133126 -195609 -132212 21354 -74915 -273883 -299791 -244330 -33722 -18943
5808 -18943 -144009 -257309 -284374 -134918 184817 288382 252503 74990 -35415 89642
5798 89642 -7690 -78500 -36002 6269 -30345 -44024 -242615 -380327 -345269 -168475 -49167
5787 -49167 50398 40504 7829 -105298 -132792 -129065 -129211 -49035 111404 187194 112668 116922
5775 116922 16274 -161503 -179660 -172434 -87413 -11236 -268332 -385185 -236323 -154402 -278244
5764 -278244 -148282 3521 -64129 -50476 85539 263867 283669 278588 294755 467504 345134
5753 345134 187226 103522 113125 155194 175909 193857 83240 -80699 -4414 -182 84453
5742 84453 236830 232588 280424 300232 228470 137385 164334 67315 20225 -25565 -210509 -413511
5730 -413511 -365846 -106453 -70550 20948 -90321 -74454 134292 91726 -74995 -283660 -207400
5719 -207400 -136607 -70518 -37198 80183 174671 61940 27746 79001 93235 44110 -45157
5708 -45157 -177578 -310275 -218286 -165804 -212391 -204679 40509 -62319 -291291 -446395 -303213
5697 -303213 -213810 -193073 -259504 -341574 -222874 -325055 -258853 -99192 -117026 -78281 -159995
5686 -159995 -150179 -101044 -15442 54342 134105 12527 -75244 59916 253947 37600 -89990
5675 -89990 -353887 -439357 -471625 -374509 -4856 43608 94997 8458 -92101 24234 36786
5664 36786 -73289 -82063 187239 152900 -75125 -77506 -141053 -199593 -166304 -8424 152292
5653 152292 237131 105904 68242 36717 -25345 -168544 -125709 -32326 -87282 -45710 19111
5642 19111 30387 97180 -61188 -253832 -145619 60723 132016 132338 12865 -71503 -75549
5631 -75549 41259 138565 89645 -74397 -25867 -8598 295416 303837 -1769 -52353 28952
5620 28952 -78306 -161491 -218552 -180269 -78853 -201669 -175736 21778 166632 129095 88135
5609 88135 48469 88037 111048 66431 -29654 -36669 -1064 99238 56861 246070 273354 72125
5597 72125 31725 59631 195600 186363 131313 73133 132576 148728 122297 -123262 -295094
5586 -295094 -262087 -235616 -336298 -319719 -237549 -230416 -255658 -241433 -243090 -289804 -394870 -256924
5574 -256924 -104940 -253478 -291702 -90110 16254 40198 -25572 -85230 -53233 -70448 46328
5563 46328 47754 -159956 -167201 107684 -16842 -102202 -3465 -85355 -94968 -141555 -144316 -126462
5551 -126462 -139734 -354708 -319450 -232060 -101854 -42828 83684 198004 67801 -115734
5541 -115734 -168493 -243214 -180350 -255577 -287825 -373960 -306387 -118745 -108261 -74166 -55344
5530 -55344 -92854 -51975 -86834 -52762 -62423 -77002 -211908 -71293 60513 57841 -195107
5519 -195107 -280619 -157129 44687 235510 165299 -48507 -209504 -291562 -166542 -79457
5509 -79457 -96381 -49767 95504 16978 -69915 -66069 -113667 -179660 -133458 -87087 -158441 -212587
5497 -212587 -259810 -198878 32207 227113 83724 -16787 71857 211431 249761 130230
5487 130230 93747 229291 284098 164300 31175 -170711 -152855 -64408 177318 131895 132725
5476 132725 120627 226040 26719 -3550 74321 -21519 27120 896 -49367 -43181 -74689
5465 -74689 -47554 -154124 -97302 43688 53304 -26593 -39396 173434 -84965 -265483 -229837
5454 -229837 -18296 138399 271532 256111 298239 329196 198936 272591 299061 124242 -15660
5443 -15660 -101202 -172161 -236436 -339218 -214602 -211832 -109643 -57516 -46114 -159913 -146775
5432 -146775 -215340 -163029 -13622 51913 81724 25482 43006 35040 -59698 -46926 93027
5421 93027 108728 151293 -65728 -138201 -96503 39764 141208 183693 234453 154905 80903
5410 80903 -152973 -254685 -285968 -201227 -106775 -41717 78702 201214 250875 150325 42712
5399 42712 57247 61433 62176 -64924 25891 159697 113082 42645 -43348 3738 -32530 -44391
5387 -44391 95372 302077 287988 315205 214739 180897 123731 -103513 -338567 -346893 -239942
5376 -239942 -215567 -215866 -148237 -101583 -55066 174753 278905 232001 23597 61418 146349
5365 146349 -29958 41968 75748 -7425 20992 13141 -96663 -36773 -61733 -53768 -162459
5354 -162459 -357652 -349653 -319612 -241730 -123598 -128488 -156113 -107568 -169106 -152394 8365
5343 8365 5383 -28656 14867 171210 76651 29091 -66754 -149845 -227328 -167521 -196768 -71137
5331 -71137 -95307 -144997 90962 50587 -201994 -136346 92337 76726 108102 -55803 -193243
5320 -193243 -389988 -435150 -279297 -236885 22369 108820 -15134 -358306 -428923 -291148
5310 -291148 -32053 124008 66801 -34443 26015 16622 -16772 22640 29222 -45988 -57447
5299 -57447 -87596 -135103 -189664 24611 -17612 -17602 55730 60202 201487 147028 43888 14660
5287 14660 2253 50641 -102037 -301016 -149099 -15985 102454 85834 63726 -21930 -123165
5276 -123165 -57291 -23843 7818 -18894 -129837 -214310 -215559 24514 122156 124379 -34774
5265 -34774 -123153 -2786 127137 127658 89340 176292 176209 257812 117735 55519 -25566 -299130
5253 -299130 -206705 -54705 -44619 -76702 20131 44906 52305 58868 27052 -130596 -113667 -85420
5241 -85420 -106665 -89096 -65499 -12297 -50854 -176827 -163852 -249029 -411564 -382478 -181421
5230 -181421 -154194 -79175 -79298 -211899 -136031 -80377 -1698 70013 -48527 -55295 12114 -61157
5218 -61157 61983 186028 207703 179448 -15987 -37020 71517 43079 305560 287887 172415
5207 172415 85208 271 -92850 2709 87587 -2521 32283 32138 74515 1287 -128386 -276312
5195 -276312 -337066 -383425 -201762 -96659 -213989 -262149 -111777 -135189 69799 108273 30577
5184 30577 -52209 -47496 -53264 41932 -23156 -104367 -156011 34356 90630 235468 263734 64101
5172 64101 -38732 14816 -134488 -147333 -87818 -224083 -278060 -156012 -135141 -157565 90589
5161 90589 257579 384363 219097 -47240 -134748 -153744 -115658 13471 8405 -36430 -58958
5150 -58958 38608 22689 -143961 -82401 -40171 -30574 -136156 -47786 -3021 -185099 -326552
5139 -326552 -159035 40429 117328 177948 160068 62249 -134883 -205989 -151390 -213622 -349951
5128 -349951 -485672 -305363 -73440 14929 -95429 -33031 -105268 -310728 -339834 -181881
5118 -181881 -161759 31742 60561 72100 117290 -35030 -119292 -81418 -147453 -59543 -117994
5107 -117994 -23094 -136071 -252629 -130922 -48636 137339 55021 -128775 -235171 -104182
5097 -104182 -79664 -159237 -53439 35578 -37462 -46519 39284 54561 22227 73027 107450 -38141
5085 -38141 -373263 -482268 -465805 -255325 -165638 -165437 -139824 -230294 -211069 -145299 -8893
5074 -8893 68269 73491 183025 243972 141740 104904 -38664 -147417 -240556 -32428 46689
5063 46689 -7415 82369 1121 -33287 -117291 -315022 -377923 -106033 -47368 -123899 -98795
5052 -98795 -87069 -72421 10514 8736 -163076 -58623 103988 99617 72850 34209 95170 239236
5040 239236 291656 217498 48023 129527 151398 -23074 -83825 77285 124941 -36932 27501
5029 27501 31614 85855 118381 129227 94633 -26046 77216 267218 206462 207412 191288 121147
5017 121147 77972 -15928 -189685 -156847 -6569 45603 -53798 63662 198285 86266 56249
5006 56249 59398 155015 21286 -157976 -240389 -127065 -200094 -57574 128339 170835 67548
4995 67548 113129 158562 109498 -47223 -186472 -99335 97838 21539 133543 362893 267713
4984 267713 278210 348994 258627 79532 105833 173233 29741 -93704 -119371 -9720 -72628
4973 -72628 -311817 -335157 -264671 -298210 -274598 -218736 -219192 -175504 -53701 111336 110769 33350
4961 33350 -2845 165864 81793 82561 -23651 11302 -16346 -44817 4520 23729 -26616 25522
$$ [...]
##END NTUPLES=NMR SPECTRUM
##END=
