##TITLE=Analysis number 318080
Compound Code cc 46210
Book Reference 440/160
Project Code adrs
Chemist Name craigr
##JCAMPDX= 6.0         $$ Bruker NMR JCAMP-DX V2.0
##DATA TYPE= NMR SPECTRUM
##DATA CLASS= NTUPLES
##ORIGIN= Bruker BioSpin GmbH
##OWNER= nmr
$$ XWIN-NMR		Version 3.5
$$ Wed Mar 15 09:37:34 2006 GMT Standard Time (UT+0h)  MAYBRIDGE\nmr@NMR_250MHZ
##.OBSERVE FREQUENCY= 250.131544655141
##.OBSERVE NUCLEUS= ^1H
##.ACQUISITION MODE= SIMULTANEOUS (DQD)
##.ACQUISITION SCHEME= undefined
##.AVERAGES= 16
##.DIGITISER RES= 18
##SPECTROMETER/DATA SYSTEM= dpx250
##.PULSE SEQUENCE= zg30
##.SOLVENT NAME= CDCl3
##.SHIFT REFERENCE= (INTERNAL, CDCl3, 0, 16.522)
##AUDIT TRAIL= $$ (NUMBER, WHEN, WHO, WHERE, WHAT)
$$ ##TITLE= Audit trail, XWIN-NMR		Version 3.5
$$ ##JCAMPDX= 5.01
$$ ##ORIGIN= Bruker BioSpin GmbH
$$ ##OWNER= nmr
$$ C:\u/data/dgb/nmr/ADRS/680/pdata/1/auditp.txt
$$ ##AUDIT TRAIL=  $$ (NUMBER, WHEN, WHO, WHERE, WHAT)
(   1,<2006-03-15 09:37:11.92 +000>,<MAYBRIDGE\nmr>,<NMR_250MHZ>,
      <created by zg, POWCHK disabled, PULCHK disabled
       configuration hash MD5:
       84 BC 41 DB A1 6E 1D 46 DA 25 12 A5 C1 ED C5 3A
       data hash MD5: 64K
       25 3F 40 EB 43 18 31 74 D5 99 ED 7F B9 9D E7 7E>)
(   2,<2006-03-15 09:37:24.38 +000>,<MAYBRIDGE\nmr>,<NMR_250MHZ>,
      <Start of raw data processing
       ef LB = 0.3 FT_mod = 6 PKNL = 1 SI = 32K 
       data hash MD5: 32K
       45 D3 2F A3 6F 97 65 51 22 6F 80 83 88 E2 D2 30>)
(   3,<2006-03-15 09:37:26.11 +000>,<MAYBRIDGE\nmr>,<NMR_250MHZ>,
      <apk 
       data hash MD5: 32K
       6E 86 04 F6 15 18 BD FB AB 6E CE 7D ED 36 40 B0>)
(   4,<2006-03-15 09:37:27.11 +000>,<MAYBRIDGE\nmr>,<NMR_250MHZ>,
      <abs ABSG = 5 
       data hash MD5: 32K
       AC E3 A8 E6 0F A1 9D 23 F3 C9 B6 F2 A7 5A 30 6A>)
$$ ##END=
$$ 
$$ hash MD5
$$ 82 93 FD 2D 98 A4 9F 8C 8A 1E 0C C0 FD 5D 65 BD
##$RELAX= 
##$RELAX= 
##$RELAX= 
##$RELAX= 
##$RELAX= 
##$RELAX= 
##$RELAX= 
$$ Bruker specific parameters
$$ --------------------------
##$DU= <C:\u>
##$EXPNO= 680
##$NAME= <ADRS>
##$PROCNO= 1
##$TYPE= <nmr>
##$USER= <dgb>
##$AMP= (0..31)
100 100 100 100 100 100 100 100 100 100 100 100 100 100 100 100 100 100 
100 100 100 100 100 100 100 100 100 100 100 100 100 100 
##$AQSEQ= 0
##$AQ_mod= 3
##$AUNM= <au_zg>
##$AUTOPOS= <4 >
##$BF1= 250.13
##$BF2= 250.13
##$BF3= 250.13
##$BF4= 250.13
##$BF5= 500.13
##$BF6= 500.13
##$BF7= 500.13
##$BF8= 500.13
##$BYTORDA= 1
##$CFDGTYP= 0
##$CFRGTYP= 5
##$CHEMSTR= <none>
##$CNST= (0..31)
1 1 145 1 1 1 1 1 1 1 1 1 1 1 1 1 1 1 1 1 1 1 1 1 1 1 1 1 1 1 1 1 
##$CPDPRG= <>
##$CPDPRG1= <>
##$CPDPRG2= <>
##$CPDPRG3= <>
##$CPDPRG4= <mlev>
##$CPDPRG5= <mlev>
##$CPDPRG6= <mlev>
##$CPDPRG7= <mlev>
##$CPDPRG8= <mlev>
##$CPDPRGB= <>
##$CPDPRGT= <>
##$D= (0..31)
0 1 0 0 0 0 0 0 0 0.06 0 0 0 0 0 0 0.0002 0 0 0 0 0 0 0 0 0 0 0 0 0 0 
0 
##$DATE= 1142415431
##$DBL= (0..7)
120 120 120 120 120 120 120 120 
##$DBP= (0..7)
150 150 150 150 150 150 150 150 
##$DBP07= 0
##$DBPNAM0= <>
##$DBPNAM1= <>
$$ [...]
##$SUBNAM7= <"">
##$SUBNAM8= <"">
##$SUBNAM9= <"">
##$SW= 20.6930455092707
##$SWIBOX= (0..15)
0 0 3 0 0 0 0 0 0 0 0 0 0 0 0 0 
##$SW_h= 5175.983436853
##$TD= 65536
##$TD0= 1
##$TE= 293.16
##$TE2= 300
##$TE3= 300
##$TEG= 300
##$TL= (0..7)
0 120 120 120 120 120 120 120 
##$TP= (0..7)
150 150 150 150 150 150 150 150 
##$TP07= 0
##$TPNAME0= <>
##$TPNAME1= <>
##$TPNAME2= <>
##$TPNAME3= <>
##$TPNAME4= <>
##$TPNAME5= <>
##$TPNAME6= <>
##$TPNAME7= <>
##$TPOAL= (0..7)
0.5 0.5 0.5 0.5 0.5 0.5 0.5 0.5 
##$TPOFFS= (0..7)
0 0 0 0 0 0 0 0 
##$TUNHIN= 0
##$TUNHOUT= 0
##$TUNXOUT= 0
##$USERA1= <user>
##$USERA2= <user>
##$USERA3= <user>
##$USERA4= <user>
##$USERA5= <user>
##$V9= 5
##$VALIST= <valist>
##$VCLIST= <CCCCCCCCCCCCCCC>
##$VD= 0
##$VDLIST= <DDDDDDDDDDDDDDD>
##$VPLIST= <PPPPPPPPPPPPPPP>
##$VTLIST= <TTTTTTTTTTTTTTT>
##$WBST= 1024
##$WBSW= 4
##$XGAIN= (0..3)
0 0 0 0 
##$XL= 0
##$YL= 0
##$YMAX_a= 391704
##$YMIN_a= -530838
##$ZGOPTNS= <>
##$ZL1= 120
##$ZL2= 120
##$ZL3= 120
##$ZL4= 120
##$ABSF1= 16.522
##$ABSF2= -4.171173
##$ABSG= 5
##$ABSL= 3
##$ALPHA= 0
##$AQORDER= 0
##$ASSFAC= 0
##$ASSFACI= 0
##$ASSFACX= 0
##$ASSWID= 0
##$AUNMP= <proc_1d>
##$AZFE= 0.1
##$AZFW= 0.1
##$BCFW= 0
##$BC_mod= 0
##$BYTORDP= 0
##$COROFFS= 0
##$CY= 12.5
##$DATMOD= 1
##$DC= 0
##$DFILT= <>
##$DTYPP= 0
##$F1P= 14.0000005364418
##$F2P= -0.99999901652339
##$FCOR= 0.5
##$FTSIZE= 32768
##$FT_mod= 6
##$GAMMA= 0
##$GB= 0
##$INTBC= 1
##$INTSCL= 1
##$ISEN= 128
##$LB= 0.3
##$LEV0= 0
##$LPBIN= 0
##$MAXI= 10000
##$MC2= 0
##$MEAN= 0
##$ME_mod= 0
##$MI= 0
##$NCOEF= 0
##$NC_proc= -5
##$NLEV= 6
##$NOISF1= 0
##$NOISF2= 0
##$NSP= 0
##$NTH_PI= 0
##$NZP= 0
##$OFFSET= 16.522
##$PC= 1
##$PHC0= 168.4878
##$PHC1= 13.89365
##$PH_mod= 1
##$PKNL= yes
##$PPARMOD= 0
##$PSCAL= 4
##$PSIGN= 0
##$REVERSE= no
##$SF= 250.13
##$SI= 32768
##$SIGF1= 0
##$SIGF2= 0
##$SINO= 400
##$SIOLD= 32768
##$SREGLST= <1H.CDCl3>
##$SSB= 0
##$STSI= 32768
##$STSR= 0
##$SW_p= 5175.98343685301
##$SYMM= 0
##$S_DEV= 0
##$TDeff= 65536
##$TDoff= 0
##$TI= <Analysis number 999999
Compound Code 99
Book Reference 9
Project Code 9>
##$TILT= no
##$TM1= 0
##$TM2= 0
##$TOPLEV= 0
##$USERP1= <user>
##$USERP2= <user>
##$USERP3= <user>
##$USERP4= <user>
##$USERP5= <user>
##$WDW= 1
##$XDIM= 32768
##$YMAX_p= 432870022
##$YMIN_p= -724832
$$ End of Bruker specific parameters
$$ ---------------------------------
##NTUPLES= NMR SPECTRUM
##VAR_NAME=  FREQUENCY,     SPECTRUM/REAL,   SPECTRUM/IMAG
##SYMBOL=    X,             R,               I
##VAR_TYPE=  INDEPENDENT,   DEPENDENT,       DEPENDENT
##VAR_FORM=  AFFN,          ASDF,            ASDF
##VAR_DIM=   32768,         32768,           32768
##UNITS=     HZ,            ARBITRARY UNITS, ARBITRARY UNITS
##FACTOR=    0.157963299565203, 1,           1
##FIRST=     4132.6476996994, 0,             0
##LAST=      -1043.33573715361, 0,           0
##MIN=       -1043.33573715361, -724832,     0
##MAX=       4132.6476996994, 432870022,     0
$$ Real data points
##PAGE= N=1
##DATA TABLE= (X++(R..R)), XYDATA
$$ [...]
24056f4781q915l3765l6216L4706N5989K8459k9257m4415m5533K8265P6991J1598
24044b6874N7116J6684k1250O467m954L508l205m8576p3916K295j3915J7973K0782
24031f7865N1310Q7813K1715k8386m8400l5035k740P518L6225L44q1501q6213
24019a45215M2103O4428M0245k8486Q618R2749M3080m1065q3369l0298M1107J1030
24007A4927j08313n148M4164O0699r614m6781J3928N9345J2278n2520n860J360
23995b1535n11n7456J2830L4034n947j918J2795l1605P855m6072O5516M9705K2012
23982C9703P656L7798j2144k4945n6937j1089j28592m8909Q1059O6019n3174o7907
23970a71462K7447Q4505Q545L8140N2488n0959m8005L9139j653m4348k799q969
$$ plain form
24056 -64781 -73696 -107461 -143677 -108971 -52982 -24523 -53780 -98195 -143728 -115463 -38472 -26874
24044 -26874 30242 46926 25676 32143 27189 30697 27492 -21084 -95000 -92705 -106620 -88647 -67865
24031 -67865 -16555 71258 92973 64587 16187 -18848 -21588 -14070 22155 22499 -59002 -145215
24019 -145215 -103112 -38684 1561 -26925 -18307 74442 117522 76457 -6912 -37210 3897 14927
24007 14927 -93386 -98534 -54370 6329 -3285 -50066 -36138 23207 35485 -17035 -22895 -21535
23995 -21535 -22046 -79502 -66672 -32638 -38585 -40503 -27708 -59313 -51458 -97530 -32014 17691 39703
23982 39703 47359 85157 73013 48068 -8869 -19958 -148550 -197459 -116400 -50381 -103555 -171462
23970 -171462 -144015 -59510 -50965 -12825 39663 -11296 -59301 -20162 -21815 -66163 -68962 -77931
23958g7931k5693J4654r751M9374J03312K982o5413j5617M4991p901J1857n4885
23946c0021q681Q954n633k6196p717L1967k4799j0187k1162k2982L575P6085j4627
23933e1424m049L4307N2924k9836m4957O18o847L9335j2457k5912K7130J090l9082
23920e9160n0079M661L3190L0438J13207l8305r6984O8034K7024L0637k5451J6640
23908E3852O7299k5434n0384l1045Q468j5174M6072K7145L3443p9410r6671p002
23896f8841L4208l9211L3803O371m7981l7575k0839m2531K1036J14264O2576o3423
23884d8143k6268J4177o8209m4174O457N1405O4232K1299n7476N1830Q3570k6735
23872B1965j2379K1477q673n3606j04653L114N3409M2781K2315L6482Q0952K4063
$$ plain form
23958 -77931 -103624 -88970 -98721 -49347 53965 56947 -8466 -24083 20908 13007 24864 -30021
23946 -30021 -38702 -29748 -35381 -61577 -69294 -37327 -62126 -72313 -93475 -116457 -112882 -36797 -51424
23933 -51424 -55473 -21166 31758 1922 -43035 -42417 -49264 -9929 -22386 -48298 -21168 -20078 -59160
23920 -59160 -109239 -104578 -71388 -40950 72257 33952 -63032 5002 32026 62663 37212 53852
23908 53852 121151 95717 45333 14288 22756 7582 53654 80799 114242 34832 -61839 -68841
23896 -68841 -34633 -73844 -40041 -33670 -81651 -119226 -140065 -182596 -161560 -47296 15280 -48143
23884 -48143 -74411 -60234 -128443 -172617 -166160 -114755 -50523 -29224 -86700 -34870 48700 21965
23872 21965 9586 31063 22390 -31216 -135869 -132755 -79346 -36565 -14250 22232 103184 127247
23860A27247m1791p5796m7851k898N0268Q8387L3370J3276j28686n9305p0576
23849a14355p1272L529M917L9843J4529K0035L5680Q5827N425R752k2763O2800
23837G3947o281k6032l4264m4001l8351q34R338M5546J1319K1155L3313o6205
23825b1350l3012j02882J4861Q9925M1092j3253N5582k3422k8770m7234k7587
23814i6050R8283P1715L9645k0032K198p8186j26533P4330O1263n8999J1386p9894
23802a00874m0770N0030M1584M0766K2688m1258j00266M2735M5013J3464l4255
23791f1143J09964q47j0637r3467n267R0409L523o5033k5579m3053Q5859Q2464
23779F7193l6765o3236j9648l9956N4802J9648r3193l6185J4368O2259J54387
$$ plain form
23860 127247 85456 9660 -38191 -41089 9179 97566 130936 144212 15526 -43779 -114355
23849 -114355 -185627 -182098 -177181 -137338 -122809 -102774 -67094 18733 24158 33910 11147 73947
23837 73947 67666 41634 7370 -36631 -74982 -75816 -66478 -20932 -9613 11542 44855 -21350
23825 -21350 -54362 -157244 -142383 -52458 -11366 -24619 30963 7541 -21229 -68463 -96050
23814 -96050 2233 73948 113593 93561 95759 17573 -108960 -34630 26633 -32366 -20980 -100874
23802 -100874 -141644 -91614 -50030 -9264 13424 -27834 -128100 -85365 -40352 -26888 -61143
23791 -61143 48821 47974 37337 -56130 -61397 29012 32535 -32498 -58077 -101130 -15271 67193
23779 67193 30428 -32808 -52456 -92412 -37610 -17962 -111155 -147340 -132972 -70713 83674
23768H3674k4190q3879L4430l8621p9339l5933J0944J07209M5349k1097r360l6336
23756d7149j9578O2413Q0785K2563j8866q2849n8701n3606j0688p344q610M0008
23744a01622P0566P6635J0544O686j4495k165o1707j2702l4150o7017K9900l2124
23732a31651M995M2919q272j4219k7720J5218L0594Q3505J4898M7001M601n0467
23720A1402o6977M693O1020K9031m1986q090M266p766p5373J6000N1100m1497
23708f4177q933N4524O7080K9937m8693n3207o3565p9335l2305J12072J11554
23697B4952o5944n8592M6634J04472k5364n6227R767K9640j4659j6380Q5438P672
23685G1409j20228j095P6585J0126o7403l510n3823l3603P4119j1534j6038P088
$$ plain form
23768 83674 59484 -24395 10035 -28586 -107925 -143858 -132914 -25705 19644 -1453 -10813 -47149
23756 -47149 -66727 -4314 76471 99034 80168 -2681 -61382 -114988 -125676 -133020 -141630 -101622
23744 -101622 -31056 45579 56123 62809 48314 46149 -15558 -28260 -62410 -129427 -99527 -131651
23732 -131651 -126656 -83737 -92009 -106228 -133948 -118730 -88136 -4631 10267 57268 61869 11402
23720 11402 -55575 -50882 10138 39169 -2817 -10907 -6641 -14407 -89780 -73780 -22680 -64177
23708 -64177 -73110 -18586 48494 78431 29738 -23469 -87034 -166369 -198674 -86602 24952
23697 24952 -40992 -99584 -52950 51522 26158 -30069 -20302 9338 -5321 -21701 63737 71409
23685 71409 -48819 -49914 26671 36797 -30606 -34116 -87939 -121542 -47423 -58957 -74995 -67907
23673f7907r726M9581P412J0244Q1345Q583J8351o8643r82J0784K928L0852K652
23660G5474m5678j23904l12J4919P9909k9543m2044l5663j3451M9045m2898J7185
23648i6961J2398O4091R224L5848l8147j17306m1114N4373L359M5170K4778n9194
23636a03481L4726K6203J6805K8549M014k8405K8394R16k2177l3947o5041L1764
23624h1680P1532j3979Q505K1989m5142j24236o8828M5864N2469J0771P1854J11439
23612F0558P4308j46996n3751K8387r19J0762k300k8513o3739l2820m9680N7369
23600a47334P8523J4125Q0802J9910K1584j5703l1627n2981m9120q3953O5706
23589a00068M389K2930N9816R62j4330m7661L7878j6676n7578N6268J7190K7952
$$ plain form
23673 -67907 -77633 -28052 -20640 -10396 70949 79532 97883 29240 28258 39042 41970 72822 75474
23660 75474 29796 -94108 -94420 -79501 408 -29135 -71179 -106842 -120293 -71248 -114146 -96961
23648 -96961 -84563 -20472 -11248 24600 -13547 -130853 -171967 -117594 -114235 -69065 -44287 -103481
23636 -103481 -68755 -42552 -25747 2802 6816 -21589 6805 7721 -14456 -48403 -113444 -81680
23624 -81680 -10148 -24127 -15622 6367 -38775 -163011 -231839 -185975 -133506 -122735 -50881 60558
23612 60558 134866 -12130 -65881 -37494 -38413 -27651 -29951 -58464 -122203 -155023 -204703 -147334
23600 -147334 -68811 -54686 26116 46026 67610 51907 20280 -32701 -81821 -165774 -100068
23589 -100068 -95679 -72749 -12933 -11971 -26301 -73962 -36084 -52760 -110338 -54070 -36880 -8928
23577h928O2867l1934o885L30l1414n3912M8860L9045k7721m437L2275j7823j7373
23564a7050l017J198K9837m7454L4393k0538p401L1044L0482O3088N5876k4004
23552A26454j09796q1106l4641l7736M7502N1246L2365L1090j3488m9711m0546
23541g8367J8972J7466Q1634o1423j09882l0925M0905J08052J1599l7388l9441
23530g8798j4984k683M2119l3626L0567J8597r2938Q1583N7295j5205l3710j3426
23518e5209k8701N8180Q2843j8048k76m0021k9046K8865O473m847r863k2873L1350
23505a173m6771N4807j6936J6781J0422K0373N5225k5720o2040o9610l415O4192
23493c865J7109N1985p8391p3925k2262R167J3310o0088P8344O3299N8151K4690
$$ plain form
23577 -8928 53939 22005 15120 15450 -15964 -69876 -21016 18029 -9692 -14129 18146 323 -17050
23564 -17050 -20067 -18869 10968 -36486 -2093 -22631 -30032 1012 31494 94582 150458 126454
23552 126454 16658 -64448 -99089 -136825 -89323 -38077 -5712 25378 11890 -37821 -78367
23541 -78367 -59395 -41929 39705 -21718 -131600 -162525 -121620 -13568 -1969 -39357 -78798
23530 -78798 -93782 -96465 -54346 -87972 -57405 -38808 -131746 -50163 7132 -8073 -41783 -55209
23518 -55209 -83910 -25730 57113 39065 38789 -1232 -30278 -1413 5060 213 -9650 -32523 -1173
23505 -1173 -47944 6863 -10073 6708 17130 37503 92728 67008 4968 -64642 -68057 -3865
23493 -3865 13244 65229 -13162 -87087 -109349 -100182 -86872 -146960 -68616 -5317 52834 77524
23481G7524o8660n0371L6391M5321L7939l6385m7920p5007m2184Q9904K9292M1351
23469C7195k9836l2983j2885P1821N3980L5731o9557j29776o4470n712K7711M7456
23457g1325K666l6496j4119n5176M8977N2305j7504L4086K4809n6575Q0217J03808
23445I5673j17465q3333J349J1292m4789J3971Q3958O5284j5950K6595l7180o0301
23433f0896P655k560q6591k4406J0647N1840j798N190J32947N9947j4600j60683
23421h3308j21529O3192L404q321J5412L1675L2257K5861j8107K594O539N467
23409d4864N2822N0323k5917j8506J6883M9241M6763p9367l8401m3355o5536N1629
23397d8285J2497m5220l9347O3159J1138R56N2958K1691m0828L1813j8814n7559
$$ plain form
23481 77524 8864 -41507 -5116 40205 78144 41759 -6161 -81168 -123352 -33448 -4156 37195
23469 37195 7359 -25624 -38509 33312 87292 123023 53466 -76310 -140780 -146492 -118781 -71325
23457 -71325 -68659 -105155 -119274 -174450 -125473 -73168 -90672 -56586 -31777 -88352 -8135 95673
23445 95673 -21792 -105125 -103776 -92484 -137273 -123302 -39344 25940 9990 36585 -595 -60896
23433 -60896 -53241 -55801 -142392 -166798 -156151 -104311 -106109 -100919 32028 91975 77375 -83308
23421 -83308 -204837 -141645 -138241 -146562 -131150 -99475 -67218 -41357 -59464 -56870 -50331 -44864
23409 -44864 7958 58281 32364 13858 30741 79982 126745 47378 8977 -34378 -99914 -48285
23397 -48285 -35788 -81008 -120355 -57196 -46058 -45102 7856 29547 -11281 20532 1718 -55841
23385e5841M468K389m239L1825Q2924K8643l8901Q772j5579n6731m0002p58L426
23372d9604J4196l8577m8526j9438J4638M2997K6128L5718L7918m0207M2029M4166
23360F1438R2j3279J4640M8817K1629o8134M2536l9874l9115o896j3105l441q7789
23347h2481p7602l3776M2770N3281O4660K9285N1272J2821Q645l0392O0232N7840
23335A56555r8231J6452N0935M729m6264k2318J684J2912n4164J9446k1305O241
23323B6672n6625l2282J1556L0601q275L2435J1702k8548K8607K8889o639Q97
23311C8990M0535q4232q0488P0767L2975K7059l4976R186M2161l2550j961j4832
23299A2634J3104n588r0319k0074Q4958K1047n4718K8177Q2110m2703L108k2335
$$ plain form
23385 -55841 -51373 -48984 -53223 -21398 61526 90169 51268 60040 44461 -12270 -52272 -53030 -49604
23372 -49604 -35408 -73985 -122511 -141949 -127311 -84314 -58186 -22468 15450 -24757 17272 61438
23360 61438 61530 48251 62891 111708 133337 65203 107739 67865 28750 21854 8749 5308 -82481
23347 -82481 -160083 -193859 -151089 -97808 -33148 -3863 47409 60230 68875 38483 98715 156555
23335 156555 58324 74776 125711 130440 84176 61858 63542 76454 22290 41736 20431 26672
23323 26672 -29953 -62235 -50679 -20078 -28353 4082 15784 -12764 15843 44732 38093 38990
23311 38990 79525 -4707 -85195 -14428 18547 45606 10630 19816 61977 29427 27466 12634
23299 12634 25738 20150 -70169 -90243 -5285 15762 -38956 -10779 71331 28628 31736 9401
23287I401k9523k9071p8525l2900K7758K0453R274N7918K8865o9513k4769R0604
23275b0028L0042K8454q4265m105Q4835p0327r0051Q6735K8560l0563Q6280N8800
23263A04367j08314J4319J4679k561j8170L1069M2389j13245l0675R5175K4301
23252E3334p2028j17132p1713N2538K8726J9108N1326K80L3848k6957N4L2029
23240a6587K5636m5266q5727J5066N7402L6653o9652J41J240n834m6566n8173
23228a91667n2010R2430J72804p521m7974r894k7641l3573R8185R1992l361o1101
23216B0669r381J0775j0284m3556N8903n5864l7910M4670k2813K751M2245j2103
23204a1898K2332k9992m006m671k9593O7403Q3494l448j2061K4767M339k9467
$$ plain form
23287 9401 -20122 -49193 -127718 -160618 -132860 -112407 -103133 -45215 -16350 -85863 -110632 -20028
23275 -20028 10014 38468 -45797 -49902 34933 -35394 -125445 -38710 -10150 -40713 45567 104367
23263 104367 -3947 10372 25051 22490 4320 35389 77778 -35467 -66142 29033 53334
23252 53334 -18694 -135826 -207539 -155001 -126275 -107167 -55841 -55561 -21713 -48670 -48616 -16587
23240 -16587 9049 -36217 -121944 -106878 -49476 -12823 -82475 -82334 -81094 -86928 -133494 -191667
23228 -191667 -243677 -151247 21557 14036 -33938 -43832 -71473 -105046 -6861 85131 81770 20669
23216 20669 11288 22063 11779 -31777 27126 -28738 -66648 -21978 -44791 -42040 205 -11898
23204 -11898 10434 -19558 -23564 -28235 -57828 9575 93069 89621 77560 102327 106666 77199
23192G7199O512k3465N1354K0260r1807o344l3988K1555J7518m4844M824m5721
23180d6947k2645L9095J19141P8795o3839r4206M7817R481m0115L4231O5233m7748
23168G8293j9039K5025J5760k2180k9936q3016k4011J7037M0154j6260L2505Q443
23156B2775o3153k9723k2950m3541N2526k5947o1052R0992L1083K5359J5642L002
23144d987J2333o9425K4494K5798m4927m117k0399K9798Q8496N8980j05288j9512
23132b8756m547L0222P7440M619r4763m8326o959J0182M0681R1578L97J2061l1049
23119E2780n5330N3381J7240j05171J7763J7486p883r959L3140Q1058K0974r0702
23107B4777r8892P760M2675M0386O5776j2582j12908m6360p296Q6069J543O2408
$$ plain form
23192 77199 83711 60246 111600 131860 40053 33709 -279 21276 38794 -6050 -1226 -46947
23180 -46947 -69592 -30497 88644 167439 103600 9394 57211 66692 26577 60808 126041 78293
23168 78293 59254 84279 100039 77859 47923 -35093 -59104 -42067 -1913 -18173 14332 22775
23156 22775 -40378 -70101 -93051 -136592 -84066 -110013 -171065 -80073 -48990 -23631 -7989 -4987
23144 -4987 7346 -62079 -37585 -11787 -56714 -60831 -81230 -51432 37064 96044 -9244 -28756
23132 -28756 -33303 -3081 74359 78978 -15785 -64111 -71070 -60888 -20207 71371 71768 83829 52780
23119 52780 -2550 50831 68071 -37100 -19337 -1851 -9734 -19693 13447 94505 115479 24777
23107 24777 -74115 -66355 -23680 16706 82482 69900 -43008 -89368 -96664 -10595 -9052 53356
23095E3356M8379n8301m7023J1575n1479O5057Q1138q9406j01519n7032Q1983
23084f3272N2309j6498J9394K2526k3673k5504K1426N930K0142L5801j291P791
23072E5081k3291K8717j388j16028j46762K2645P0056p372P747k2417k8579j6792
23060a78383N1548M3293l0865J518K9765K6396J9152P1097l0263j0245J7185m9605
23048c9407n2321L7183J26117n599k4351M5179o2406l6508j0056J2944l5964k4808
23036f9997L7456K8725K3088K0839l4357n517M8926l4044o7590k4299r4170O6410
23024a04530J14537m9912r879K5347k3471N2070L49k9620Q5109J5369J6423K4909
23012A16701p2344M622p172l2640o281P6123O3744n9020k4995m0076J9878k886
$$ plain form
23095 53356 101735 43434 -3589 7986 -43493 21564 102702 13296 -88223 -145255 -63272
23084 -63272 -10963 -27461 -8067 14459 -9214 -34718 -13292 -7362 12780 48581 47290 55081
23072 55081 31790 60507 59119 -56909 -203671 -181026 -110970 -118342 -110595 -133012 -161591 -178383
23060 -178383 -126835 -83542 -114407 -112889 -83124 -56728 -37576 33521 3258 -6987 10198 -39407
23048 -39407 -91728 -54545 71572 65973 41622 86801 24395 -12113 -22169 -9225 -45189 -69997
23036 -69997 -32541 -3816 19272 40111 5754 237 49163 15119 -52471 -76770 -170940 -104530
23024 -104530 10007 -39905 -49784 -24437 -47908 4162 4511 -25109 60000 75369 91792 116701
23012 116701 44357 48979 41807 9167 2886 79009 142753 83733 58738 18662 38540 35654
23000C5654J6944L55J14519N1958l8207m2224r5241l7823k9291m3454N1133k567
22988a8244K3788O2935n2495l2300l993M2202K3761l9332Q993k8334l257m856
22976b1132m3213p2289M1686L8323n7844K0147P2094j7826O5785P816K4925k8138
22964C0334J2052p262K848K1725k2981o0986K480N9662J7134J9241P6046j128
22952A49165J7681k4349l3546P190J1904k8680m6072N6381j4854J5352r758n9542
22940D0872P2540o998j04212n3161J9970j4429j7350N3141J1066M453l2739k0023
22928d6870L0935j5620O6018P118N178P0718K6309n3228n9912m2377j0172m5497
22916f7400J8755J1673p861J9067J9328L6037q675M876J3791l4454l866L3226
$$ plain form
23000 35654 52598 52953 167472 219430 181223 138999 43758 5935 -23356 -66810 -15677 -18244
22988 -18244 5544 68479 15984 -16316 -20309 21893 45654 6322 15315 -13019 -16276 -21132
22976 -21132 -64345 -136634 -94948 -56625 -114469 -94322 -22228 -40054 25731 33547 58472 30334
22964 30334 42386 35124 37972 59697 36716 -24270 -21790 37872 55006 74247 150293 149165
22952 149165 166846 142497 108951 116141 128045 99365 53293 109674 94820 110172 100414 40872
22940 40872 113412 106414 2202 -50959 -30989 -45418 -62768 -9627 1439 5892 -26847 -46870
22928 -46870 -15935 -31555 34463 41581 46759 117477 143786 90558 30646 -11731 -21903 -67400
22916 -67400 -48645 -36972 -44833 -25766 -6438 29599 20924 25800 39591 5137 1271 34497
22904C4497P9899o2871j0773J5165k4536M9333o941r438k9040k7779J2179k4514
22892d819Q4631K168q5274o4957J6022m1176l199O3369k0469j6716L1397R516
22880b9507P4627o423q6486j3392K2949j4681l5762l125L6720L9521R487p360
22868a3432M5185K9497m0527K7268N144r6895P298L3037k8696L5635J0340J9117
22856C2971m7547K7787K7050p807o3257k6461L6651j47o3519l995J13609J4911
22844D0246k5169j4609o7297L2097J5532l4008p174O306K708m7092N6881N8345
22832A6766n1322m0440K4035J2934K0822M8912L569l2336n6585m3128J0115Q3395
22820c263P7918m0542o4318l8543o5128L8502N3484J0054m211m2354o0986N222
$$ plain form
22904 34497 114396 51525 40752 55917 31381 80714 73773 64335 35295 7516 19695 -4819
22892 -4819 79812 81980 -3294 -68251 -52229 -93405 -96604 -33235 -53704 -70420 -39023 -29507
22880 -29507 45120 38697 -47789 -61181 -38232 -52913 -88675 -91800 -55080 -15559 -6072 -13432
22868 -13432 31753 61250 20723 47991 53135 -43760 -36462 -3425 -32121 3514 13854 32971
22856 32971 -14576 13211 40261 32454 -30803 -57264 -20613 -20760 -84279 -88274 25335 40246
22844 40246 15077 468 -66829 -34732 -19200 -53208 -60382 -54076 -51368 -98460 -41579 16766
22832 16766 -34556 -74996 -50961 -38027 -17205 31707 35276 2940 -53645 -96773 -86658 -3263
22820 -3263 74655 34113 -30205 -68748 -133876 -95374 -41890 -31836 -36047 -78401 -139387 -134165
22808a34165J23776J4997m2578R282n096k4018K1265N8934o014m2436o6786n8849
22796a51688M0760R2766l6545m2902J7693l2456m7809K9809O7000k1034K0214
22785f4192L7579k576K6552Q6683o2495l8889K2197j39772k1287O1006L4330l2765
22773i3629n2738p4188P4165J08266Q086l2006q23K9084O5924j9552j0479p7272
22761g5162L4643N3806J5914m9325K8777j7576O658k8459r1846o1948N7505J28153
22749A140K1384j6295Q908o060J6793K2174k7746m9105j4408J5078j3063K2709
22737a8491k0232J2737K6827o7780J455K0245m0899P1265R2869j7820j00145k4220
22725f4189K8583M0223j2869J2310j3758K107P4699N9749l9298j29666K5240l4241
$$ plain form
22808 -134165 -10389 4608 -37970 -28688 -33784 -57802 -36537 22397 16383 -26053 -92839 -151688
22796 -151688 -110928 -18162 -54707 -97609 -79916 -112372 -160181 -130372 -63372 -84406 -64192
22785 -64192 -26613 -29189 -2637 84046 21551 -17338 4859 -134913 -156200 -95194 -60864 -93629
22773 -93629 -146367 -220555 -146390 -38124 -30038 -62044 -62867 -33783 32141 12589 2110 -75162
22761 -75162 -40519 13287 29201 -20124 8653 -8923 -2265 -30724 -122570 -184518 -127013 1140
22749 1140 22524 6229 15137 9077 25870 48044 20298 -28807 -43215 -28137 -41200 -18491
22737 -18491 -38723 -25986 841 -66939 -65484 -45239 -86138 -14873 77996 60176 -39969 -64189
22725 -64189 -35606 4617 -8252 4058 -9700 -7593 67106 126855 87557 -42109 -16869 -51110
22713e1110r008L9858R057l8862k4424j8213J9975O6237K9468K5394J4038m3877
22701A8533q45J1379Q83k6184Q195L2313j0564n5828m5672l5283m9775k6362P092
22688a72118J2580j7602K4115K3871J3550M1707j8483j5935l7014j5656L2719
22677a28266K3948l1988P2063P5977P4424L4752n9476J4348P9524l2168m5223
22666G7915n8899n2849o1989O4531M3322p0788o3305j3698P5237N7679l5756k7766
22654f6366N4387m5221J0185M7557n2383n8364L833L8484l539K0181M8178J4707
22642A1639q6543N5285P9996M1174n3986Q0634n7753l6694j8806m5652m0534n225
22630g6465M9411o184k692k4805n260R7610K8974m2223o6088o9542p110j8228
$$ plain form
22713 -51110 -60118 -20260 -11203 -50065 -74489 -92702 -72727 -6490 22978 48372 62410 18533
22701 18533 17688 29067 29950 3766 11961 44274 33710 -22118 -67790 -103073 -152848 -179210 -172118
22688 -172118 -159538 -177140 -153025 -129154 -115604 -73897 -92380 -108315 -145329 -160985 -128266
22677 -128266 -104318 -136306 -64243 11734 86158 120910 61434 75782 155306 123138 77915
22666 77915 19016 -33833 -95822 -31291 12031 -58757 -122062 -135760 -60523 -2844 -38600 -66366
22654 -66366 -11979 -57200 -47015 542 -51841 -110205 -106372 -67888 -71427 -51246 -3068 11639
22642 11639 -74904 -19619 60377 101551 47565 128199 70446 33752 14946 -30706 -71240 -76465
22630 -76465 -27054 -33238 -35930 -60735 -65995 31615 60589 18366 -47722 -117264 -124374 -142602
22618a42602O6616O8829Q1589j8881l9388p936N0378M2305k998m1205m650J9996
22606G2053K0485n883n6527L9160k5816j0895p7444k0900J5650N0561K9934j240
22594B9138m1653J0439m4530J1471J6071j2079o5932j3744O0472L7487M4029l2398
22582a229J581j2739n8125o1195N9898Q7900M2346k4494m2880l507M9787P939
22570D5282p3077j6520K6247j9736m7338n458m096J1334m5774N3585K5276J630
22558d8645K6396Q1704Q9770o022n3152q1066q7009K9559R46j9667l3734Q967
22546i1953K8429o177N1688j212o7695K8500O7574M1646l3596L1107k9618q5257
22534f6564J5490J2188L4478J0559n7658j3392k2064K3493N043q6428m2114Q9051
$$ plain form
22618 -142602 -75986 -7157 74432 55551 16163 8227 58605 100910 97912 56707 52057 72053
22606 72053 92538 86655 30128 69288 43472 32577 -44867 -65767 -50117 444 30378 29138
22594 29138 -12515 -2076 -46606 -35135 -19064 -31143 -97075 -110819 -50347 -12860 31169 -1229
22582 -1229 352 -12387 -70512 -131707 -71809 16091 58437 33943 -8937 -12444 37343 45282
22570 45282 -27795 -44315 -18068 -37804 -85142 -90600 -94696 -83362 -129136 -75551 -50275 -48645
22558 -48645 -22249 59455 149225 143203 90051 8985 -78024 -48465 -47519 -67186 -100920 -91953
22546 -91953 -63524 -69701 -18013 -19225 -86920 -58420 9154 50800 17204 48311 18693 -66564
22534 -66564 -51074 -38886 -4408 6151 -51507 -64899 -86963 -63470 -58427 -144855 -186969 -97918
22522i7918K5718L4794M0085Q1848j7437k7077l1611j1805p7172n0595k1025K4397
22510a27798N4304J9188q1926p4778j5301R3591Q7638K8965P1770O4365j8192
22499A01826o2472q1470q059J12592O828n5511q8465k487K3379R3423M4820l7898
22487D6506r640k6338K309m1112J6540M8223J9699m1781Q789L700m8086O3206
22475D2015l485K4116N778K8603m8368L3000r390o7236p6676K7293l5640n5224
22463a35214R1413N4661m044m5150k4622p39k723Q42J8273J8039J041N258n19
22450b3484K1738M8051k3529M576J1966J2836m906l9407N0893k9641j9284k3480
22438a3671O3239l097l2944P0024l5600j18510k4379M8860J1712p3584m5619j4758
$$ plain form
22522 -97918 -72200 -37406 2679 84527 67090 40013 8402 -3403 -80575 -131170 -152195 -127798
22510 -127798 -73494 -54306 -136232 -211010 -226311 -132720 -45082 -16117 55653 120018 101826
22499 101826 39354 -42116 -50175 62417 69245 13734 -74731 -77218 -53839 39584 84404 46506
22487 46506 36866 10528 12837 -28275 -11735 36488 56187 14406 23195 26895 -21191 42015
22475 42015 38530 62646 68424 97027 48659 81659 72269 5033 -71643 -44350 -79990 -135214
22463 -135214 -43801 10860 6816 -38334 -62956 -63695 -66418 -65576 -47303 -29264 -28223 -22965 -23484
22450 -23484 -1746 46305 22776 27352 39318 52154 47248 7841 58734 29093 9809 -13671
22438 -13671 49568 46471 13527 83551 47951 -70559 -94938 -46078 -34366 -107950 -153569 -168327
22426a68327J16771J03179P8226J2179n9933L5001k9903j07820p5255J6678K5922
22415e3282M4915R6528l5558j02522P687L1099k2689k7480K7990M4129N486j0328
22403E975K9987k7949K4728J090J4988K6116k984N0377M4739l3842k9103L2956
22391A37078m8138J1927O2299j7121j32684j00773l1561n688K801r370P6906K9327
22379b4997N8818P586m5352j5505K4987O1097n7438k1526J7167P0414P9089p112
22367A47228m5234q0557m2375N905m7342l55P5859l9908j8891j9296J1531L467
22355d9968K8434M0486k2935J1753n1419M357m1118k4629N8560J02240k5453K4576
22343E4884K3679j7741K6797l7196l7301k4360k9295O7026L5590k3766j2875m2309
$$ plain form
22426 -168327 -51556 51623 129849 142028 82095 117096 87193 -20627 -95882 -79204 -53282
22415 -53282 -8367 88161 52603 -49919 -42232 -11133 -33822 -61302 -33312 10817 16303 5975
22403 5975 35962 8013 32741 33831 48819 74935 71951 122328 167067 133225 104122 137078
22391 137078 88940 100867 163166 146045 13361 -87412 -118973 -124661 -121860 -131230 -54324 -24997
22379 -24997 33821 41407 -3945 -19450 5537 66634 9196 -12330 4837 75251 154340 147228
22367 147228 101994 21437 -20938 -15033 -62375 -62730 13129 -26779 -45670 -64966 -53435 -49968
22355 -49968 -21534 18952 -3983 7770 -43649 -39292 -80410 -105039 -46479 55761 30308 54884
22343 54884 78563 60822 87619 50423 13122 -11238 -40533 26493 62083 38317 25442 -16867
22331a6867l1518l1874L0175Q1374o90N1429n240k2089L074M2374k1176p9148
22319a76p8942J9460P142K7925L152M9140k549o5689N5738L8690r5323l4641J9537
22306e6536P5089M6991J8078K8167q0787r1830N756J7059N9750J5088k6510L496
22294A3811L7841L0210O99m8259M4N2695k3016l8307o6977l0562j4339n474l1319
22281a22953m8241O5515J38469O3696l7456r0407n3596P916J16887P6345m9477
22270F6698J10212O4543Q5259k5114l7571m1312j67186k9971j9561k5468J6233
22259c238J8497J04349K7631m2614m1478o3819j8013j4479l5355K3637J4297M1528
22247A0943N0051o7569r7783k8543P132P9795L1335m1190l5453P2971J895p5332
$$ plain form
22331 -16867 -48385 -80259 -50084 31290 30600 82029 76789 54700 57774 100148 78972 -176
22319 -176 -79118 -59658 -52516 -24591 -21439 27701 25152 -40537 15201 53891 -41432 -76073 -56536
22306 -56536 18553 65544 83622 111789 31002 -60828 -55072 -38013 21737 36825 10315 13811
22294 13811 51652 81862 82561 34302 34346 87041 64025 25718 -41259 -71821 -86160 -91634 -122953
22281 -122953 -171194 -105679 32790 96486 59030 -31377 -84973 -77057 39830 116175 66698
22270 66698 176910 241453 326712 301598 264027 222715 55529 25558 5997 -19471 -3238
22259 -3238 15259 119608 147239 104625 63147 -672 -18685 -33164 -68519 -44882 -30585 10943
22247 10943 60994 -6575 -104358 -132901 -125769 -45974 -14639 -55829 -91282 -18311 -16416 -91748
22235i1748j909L9920M8948K445M3527J4693n165Q805q3741o5220L423M7715J61608
22222A23301J29204Q1888Q147n6612r9552p7282k2079q3026p9586N536O7431j0364
22210a2994l8573l4084N254k4793L3083M1513L1609J06643M4698o1493K3073P0209
22198A84145o7437j07254m5388Q3935J5376k9118o2727j9473o0585m4873N6333
22187i7066K7510J765J20142J12199j12903m1857N1211M6833L0445j35905o6721
22176f4347N205k8689K5934K3965R8709n4299j76275m3329J9527j9211n1549L0450
22164b33909J06401N8117K1776M3138L1323k6866n8970J1094K561j6554n580O419
22152f1050O4018M270m2872j0114j2450n8699J8069L8280q492Q0767N1673o6671
$$ plain form
22235 -91748 -93657 -53737 -4789 -2344 41183 55876 50711 59516 -24225 -89445 -86022 -38307 123301
22222 123301 252505 334393 342540 285928 186376 109094 87015 3989 -75597 -70061 -2630 -12994
22210 -12994 -51567 -85651 -80397 -105190 -72107 -30594 1015 107658 152356 90863 113936 184145
22198 184145 116708 9454 -35934 48001 63377 34259 -28468 -47941 -108526 -153399 -97066
22187 -97066 -69556 -67791 52351 164550 51647 9790 61001 107834 138279 2374 -64347
22176 -64347 -59142 -87831 -61897 -37932 60777 6478 -169797 -213126 -193599 -212810 -264359 -233909
22164 -233909 -127508 -69391 -47615 -4477 26846 -20 -58990 -47896 -45335 -61889 -67469 -61050
22152 -61050 2968 7238 -35634 -45748 -58198 -116897 -98828 -60548 -69040 11727 63400 -3271
22140c271r4997J169n2852K5811L7825M7333K8442Q618K9220k4561n2434K9319
22128b0378N1389K6633n7575q7826j2168k3916J1560N9722L9568n9882J7864j1959
22116f6968M3721K2903J9908o0335J7204K8232q50l0096j9003j4230L6446m484
22104b7552K3161J131j7166M5256L0117L861q033N681q3190M7412L5706q1965
22092b5581l2785L0110N111p0325l1629M7542j3954K8769l9452N4734P6562k5403
22080C699p2320j3223L5347M5160K1104n0525p6308J4031J18496K4576m29J6087
22068F5695L6479L2539j2966j5612l0782J1566m9373r6926k4645O5864j6723j0815
22056d5699R983Q7511K571o6798j7792r5870m9831O4492K0709M2739J791l4190
$$ plain form
22140 -3271 -98268 -97099 -149951 -124140 -86315 -38982 -10540 -1922 27298 2737 -49697 -20378
22128 -20378 31011 57644 69 -87757 -99925 -123841 -112281 -52559 -12991 -72873 -55009 -66968
22116 -66968 -23247 -344 19564 -40771 -23567 4665 3815 -26281 -45284 -59514 -23068 -27552
22104 -27552 -4391 -3260 -20426 24830 54947 58808 50775 56456 -26734 20678 56384 -25581
22092 -25581 -58366 -28256 -23145 -93470 -125099 -77557 -91511 -62742 -102194 -47460 29102 3699
22080 3699 -68621 -81844 -46497 -1337 19767 -30758 -107066 -93035 25461 50037 49608 65695
22068 65695 102174 134713 121747 106135 75353 86919 37546 -59380 -84025 -18161 -34884 -45699
22056 -45699 -35716 51795 54366 -12432 -30224 -126094 -175925 -111433 -90724 -47985 -46194 -80384
22044h0384N4512M6098l7977n0441k3353K060N745Q6898L4150Q340N7766P568
22032A10982o1717m2487L5356J4840j24732J6833L8100O574o1861P7472J6462
22021B5822j14452q5811j4980P0927j9631l0550J3867N0664M4971M6566P0775
22010E8168q925k1541j9278j3670k4998R716O4802K4620k5359m364m8657M70m676
21997a3692j7127m1603J9813O1942o8307N3346J6343m9857Q489n7520j7954M6560
21985e9567j261K1828Q362n2126J7518Q7341K9215K3835n629o8251q0917p4352
21973a54004k6063P1821J12095m3953o0163q3126R870J13201J21026k831n5693
21962B180l7969m8604l7531R0505k6215l5135k4546l3010J3004M1704J1544P9226
$$ plain form
22044 -80384 -25872 20226 -17751 -68192 -91545 -89485 -83740 3158 37308 45648 103414 110982
22032 110982 49265 6778 42134 56974 -67758 -50925 -12825 -6251 -68112 9360 25822
22021 25822 -88630 -174441 -189421 -118494 -138125 -168675 -154808 -104144 -59173 -12607 58168
22010 58168 49243 27702 8424 -5246 -30244 -20528 44274 68894 43535 39171 -9486 -9016 -13692
21997 -13692 -30819 -72422 -52609 9333 -58974 -5628 10715 -39142 -30653 -88173 -106127 -59567
21985 -59567 -60828 -39000 -30638 -82764 -65246 22095 51310 75145 69516 1265 -79652 -154004
21973 -154004 -180067 -108246 3849 -40104 -100267 -183393 -173523 -60322 60704 57873 2180
21962 2180 -35789 -84393 -121924 -31419 -57634 -92769 -117315 -150325 -137321 -95617 -84073 -4847
21950d847J9205n6434Q86J4347r29k0989m4476K546M2394J36427n4924q1389J5236
21937c2947J1483K4502N4009K0281K8830J4621o2092K6220N2257m399m473l6509
21925I1783l1504Q202J00777k5084o9517n7205M824L8740k4624o664j4244o150
21913I334O6398M9370j1876K675p4525q0058K3708P5523R846o8823q887l1438
21901c8753K4643K3983m8518n5126m609P2314K4376n0095k3297N9246J04121J38470
21889B26755o2793n2035O194n8985o7409P758k1774M938N2135n1169K0520o938
21877b803L4572K0429n8882j7951K5716n2633j0975j2036O1070K3425p3513m5942
21865a09523J9112L7869j1153j1548o5479Q406J7099J3016m294M2463J3277J0480
$$ plain form
21950 -4847 14358 -42076 -41190 -26843 -27772 -48761 -93237 -90691 -48297 88130 33206 -48183 -32947
21937 -32947 -21464 3038 57047 77328 106158 120779 58687 84907 137164 132765 128292 91783
21925 91783 60279 68481 169258 144174 74657 17452 22276 61016 36392 29728 15484 9334
21913 9334 75732 125102 113226 115901 41376 -38682 -14974 60549 70395 1572 -7315 -38753
21901 -38753 -14110 9873 -38645 -93771 -98380 -26066 -1690 -51785 -75082 -15836 88285 226755
21889 226755 163962 111927 118121 59136 -8273 -515 -22289 -17351 34784 -16385 4135 -2803
21877 -2803 31769 52198 -6684 -24635 1081 -51552 -62527 -74563 -13493 9932 -63581 -109523
21865 -109523 -90411 -52542 -63695 -75243 -140722 -132316 -115217 -102201 -106495 -64032 -50755 -40275
21853d0275J8340K6325K7068J8735p8419m4203J8768k4174j6760N3466K7797n8970
21841g2302K2825K7198J6874L2843k0769j7115j1296L2387l8904l884O4235m192
21829B7900q172M952l3387K1732K8677o1324N4154O7558J9745p0009j12017o7270
21817a27461J4073J22615k4985N952k3137j09119M0875m922N6315M6987K2534
21806A9727k8151K1943o0272m8509j7935K5033R056p352M5573m452n3087L5563
21794f2863K7110n0294R31j277P3102P0912J3408k2299L767N688r9570M8481M3885
21781E0981p9822l4039q32L3020P176n6210O1568k4197o5920m4572R866O6951
21769g6030K4898M1257P04P0692o5671m0435k9629O3216P7508q131o730n368k102
$$ plain form
21853 -40275 -21935 4390 31458 50193 -28226 -72429 -53661 -77835 -94595 -41129 -13332 -72302
21841 -72302 -49477 -22279 -5405 27438 6669 -10446 -21742 10645 -28259 -32143 32092 27900
21829 27900 19728 24680 -8707 13025 41702 -19622 34532 102090 121835 51826 -60191 -127461
21817 -127461 -113388 9227 -15758 -9806 -32943 -142062 -101187 -106109 -49794 -2807 19727
21806 19727 -8424 13519 -46753 -95262 -113197 -88164 -79108 -86460 -40887 -45339 -98426 -62863
21794 -62863 -35753 -86047 -85116 -86393 -13291 57621 71029 48730 52497 58185 -41385 7096 50981
21781 50981 -28841 -62880 -63712 -30692 -23516 -79726 -18158 -42355 -108275 -152847 -142981 -76030
21769 -76030 -51132 -9875 -9171 61521 -4150 -44585 -74214 -10998 66510 58379 51649 46281 44179
21756D4179m03K2311m023p6399j33541L9163L0115J1865J4320j4597L5768L2182
21744I40l1779P756o9964K9617J04620J4406M8742K3784j24413L8361K8448q9550
21732a9032N3432N250M91j4874j21693o0199J02330Q9179L3535m2494k7645J3218
21720A1498r745K648Q021K0030j518j01544l463M2128N3597K9601J143K2289R473
21707H4158q7138J8582n4889k7343j4535k5934O833l042N4596P115k274J2605
21695c1266N2524l1161r1903l0856k7279R55Q3522R8634R958L4143o035n6417
21683D819q5298K0730L5822k0158m6658j7737O7619Q9181N5870K1275p1879j05415
21671e1829J1389J8592K243j8202k0130q175k6110Q759M0312J1983L051j6359
$$ plain form
21756 44179 43776 66087 62064 -14335 -147876 -108713 -78598 -66733 -52413 -67010 -31242 940
21744 940 -30839 -23083 -93047 -63430 41190 55596 104338 128122 3709 42070 70518 -19032
21732 -19032 34400 39650 40141 25267 -96426 -156625 -54295 34884 68419 25925 -1720 11498
21720 11498 1753 4401 12422 32452 30934 -70610 -74073 -31945 21652 51253 52396 74685 84158
21707 84158 -2980 15602 -39287 -66630 -81165 -107099 -100266 -103308 -48712 -41597 -43871 -31266
21695 -31266 21258 -9903 -101806 -132662 -159941 -158986 -75464 23170 33128 67271 61236 4819
21683 4819 -80479 -59749 -23927 -44085 -90743 -108480 -40861 48320 104190 125465 53586 -51829
21671 -51829 -40440 -21848 -19605 -37807 -57937 -66112 -92222 -83463 -43151 -31168 -28117 -44476
21659d4476j2924K8909q102p971O8794L027N1404k1299r6646j118K7846p704m0552
21646f0812k4053J3750K7230m7988O1864P5382L9401J7250r3K1859J9473L2581
21634A75844r2713j22907J5170l890J6654J3490k035o586K0776M7724l1426p7648
21622d7547o0793p2885j5712O3203o37N5605L5314L4998k818K3625m693N9934
21610F7594l1012j53629N00O1432O0834o387l2361j8227J7212K405l8838L0010
21598d0467J5752o9616m9276q507K4005M5914J4538j4332k4451Q3029Q2295J213
21586F0097J0723l710n4482L3373q549k6297N722m9959k6024o1393q715r636j5166
21573a54016k4896P9783J2679J4860J02198o385q5016l2101n3207j6974m406K9053
$$ plain form
21659 -44476 -57400 -28491 -36593 -44564 24230 27257 78661 57362 -39284 -40402 -12556 -20260 -60812
21646 -60812 -84865 -71115 -43885 -91873 -30009 45373 84774 102024 101931 123790 143263 175844
21634 175844 83131 -39776 -24606 -28496 -11842 1648 -387 -6973 13803 61527 30101 -47547
21622 -47547 -108340 -181225 -196937 -133734 -134371 -78766 -43452 -8454 -11272 12353 7660 67594
21610 67594 36582 -117047 -116547 -55115 5719 -668 -33029 -51256 -34044 -31639 -70477 -40467
21598 -40467 -24715 -94331 -143607 -152114 -128109 -82195 -67657 -81989 -106440 -23411 58884 60097
21586 60097 70820 67110 12628 46001 37452 11155 16877 -33082 -59106 -120499 -129214 -138850 -154016
21573 -154016 -178912 -99129 -86450 -71590 30608 24223 -60793 -92894 -146101 -163075 -167481 -138428
21561a38428O5354R9451P3318l7936n2467p891p9680l6511j2534J7799M8457L9407
21549b1661J8169p732q6459k4240j9021q834O1872K8236j0513o3382n3353J5966
21537a70952L3688J34639J3539p9264L1094K054J0139J4897k216j14409n0964
21526a77755O732M3907R5163N7101N656p7627k1739Q0917O2016P0589L903j3551
21514A35312l8238j22922p1419M5958P3065l6574j02048M2965P0839R745K9352
21503C6035J3205J2503J07300L2113q524p1618o2208j8464J9691k0275K245m595
21491C7408q557m2522l6869m1057l0731R5007O4450o8575l5226R769J2413M9462
21479D972M4286j935q0180K5985P8054n4845k4514P9683m9599l0350k4654K9101
$$ plain form
21561 -138428 -73074 26377 99695 61759 9292 1401 -78279 -114790 -127324 -109525 -61068 -21661
21549 -21661 -3492 -11224 -97683 -121923 -140944 -149778 -87906 -59670 -70183 -133565 -186918 -170952
21537 -170952 -137264 -2625 10914 -68350 -37256 -35202 -25063 -10166 -12382 -126791 -177755
21526 -177755 -171023 -127116 -31953 25148 30804 -46823 -68562 12355 74371 144960 148863 135312
21514 135312 97074 -25848 -97267 -51309 21756 -14818 -116866 -73901 -3062 6683 36035
21503 36035 49240 61743 169043 201156 192632 121014 58806 40342 60033 39758 42003 37408
21491 37408 28851 -13671 -50540 -91597 -122328 -27321 37129 -31446 -66672 -56903 -44490 4972
21479 4972 49258 47323 -32857 -6872 71182 16337 -8177 71506 21907 -8443 -33097 -3996
21467c996k8386M1813j6240K7281k2770K6421k1499l3051j8378k657Q94m8604
21455i9172L5038M5674J32l5323R1717j8103m2504N8J2276l0350l1947k3553J987
21442i4070M1338o956l1427M2566M6058N4557m2904o7618l1020l1833l6233P2358
21430h5184L1056j2490O9149J9491K834k9337l3295J9007l542M5935r806k6607
21418a2789O174K6666k4728r623P382O4593L1477j0986q0431k9487k1043j0160
21406f2955M4770M0193K7030l013M2442j5107o9992r9012j1008P9537L4606K1434
21394B8925o5300P3551p7110p9082M6920K845O7187K1454j5114p274j05501l3338
21382a41837L8183p2627r552P7394P8589O0616l0729O5948L996j09147r599J0974
$$ plain form
21467 -3996 -32382 9431 -6809 20472 -2298 24123 2624 -30427 -48805 -51462 -50568 -99172
21455 -99172 -64134 -18460 -18328 -53651 38066 19963 -22541 -22483 -10207 -40557 -72504 -96057 -94070
21442 -94070 -52732 -59688 -91115 -48549 -2491 52066 9162 -58456 -89476 -121309 -157542 -85184
21430 -85184 -54128 -66618 2531 22022 24856 -4481 -37776 -18769 -22311 23624 13818 -12789
21418 -12789 -6615 20051 -4677 -14300 -6918 57675 89152 78166 -2265 -31752 -52795 -62955
21406 -62955 -18185 22008 49038 46025 88467 73360 3368 -95644 -106652 -27115 7491 28925
21394 28925 -36375 37176 -39934 -119016 -72096 -69251 -2064 19390 4276 -2998 -108499 -141837
21382 -141837 -103654 -176281 -185833 -108439 -29850 30766 37 65985 69981 -39166 -48765 -37791
21370c7791P7683j121J486k1330l0485K7716r0224k2386M8644n0646p2221j8676
21358a89351P8161J344n941O36n1690k8245Q6194O3468L5862N348Q059l0543O3556
21345C6858J1565k7389M0158J9478k0043k2126n3401Q996Q423q816n3063q5169
21333a44529N7700P1807K5994J0099L7468l6548r3851K0240P2361k6111j3853
21322a9223L066J7657M9963n1800K0805P823Q2559L3861p2325m2646l439j7398
21310H903j041N9776l037O603m5885q0877J2945j9687k1951M3297L7097l8020
21298d1877J109O0468N3342J17149K1757o4844n5989k3185p4011K0860K6221p5693
21286c4693j2395N0849K6949J1253n2978n9240J8904P2940j819q6061K9356J9339
$$ plain form
21370 -37791 39892 38771 40257 18927 -11558 16158 -74066 -96452 -47808 -98454 -170675 -189351
21358 -189351 -111190 -109846 -115787 -115151 -166841 -195086 -108892 -45424 -9562 -4214 3845 -26698 36858
21345 36858 48423 21034 61192 80670 60627 38501 -14900 -5904 2519 -6297 -59360 -144529
21333 -144529 -86829 -15022 10972 21071 58539 21991 -71860 -51620 20741 -5370 -19223
21322 -19223 -16157 1500 51463 -337 20468 28291 110850 144711 72386 29740 26301 8903
21310 8903 7862 67638 64601 71204 25319 -55558 -42613 -62300 -84251 -40954 -3857 -41877
21298 -41877 -40768 19700 73042 190191 211948 147104 91115 67930 -6081 14779 41000 -34693
21286 -34693 -47088 3761 30710 41963 -11015 -70255 -51351 21589 19770 -66291 -36935 -17596
21274a7596k4547l8717m2781k3381L2964N4053P4340P5509P546l4936n827k2509
21262C4118N0777q695K767j3321O2886n426k7016m3736k2935Q0863j6081j5320
21250G8881K175M6706J1860o1085q7339j7773k7030o893K2216n1657N5494M5991
21238A1546P2182M4101r7018k1805K4369j6979l0839Q476K377K803k8480p7195
21226a06462O5037M7324l2592n2450j23M2245K806j267O8357n9835p5650L0696
21214g1914J9651j7545J3478n031o15Q0175M5254l9762J0881K8878j2164o0011
21202h725N4809N984m7276m8954r041L9263m20j10229j07771K6481R2561O1895
21190e1423M0928L526n8828k8333K3733J5090j792K3276k3802j2523N4033L8946
$$ plain form
21274 -17596 -42143 -80860 -123641 -147022 -114058 -60005 14335 89844 97390 62454 56627 34118
21262 34118 84895 76200 78967 65646 128532 123106 96090 52354 29419 110282 94201 78881
21250 78881 81056 127762 139622 78537 -8802 -26575 -53605 -60498 -38282 -89939 -34445 11546
21238 11546 83728 127829 30811 9006 33375 16396 -14443 -5967 -3590 -787 -29267 -106462
21226 -106462 -41425 5899 -26693 -79143 -79266 -37021 -34215 -35482 32875 -26960 -102610 -71914
21214 -71914 -52263 -69808 -56330 -61361 -61976 18199 63453 23691 34572 63450 51286 -8725
21202 -8725 46084 52068 4792 -44162 -53203 -13940 -14360 -124589 -232360 -205879 -113318 -51423
21190 -51423 -10495 -6969 -65797 -94130 -70397 -55307 -57099 -33823 -57625 -70148 -16115 22831
21178B2831K8140K0798m0515p6543o5680M6553M4299R7414K5074j9045k582n2795
21166B7949J903Q709j8771L887k553L0643j5274j7268R646k2101n7894j1267N7278
21153e113j2629R787Q194N5853j04574p8604l390P1470L6108K9389K2145k5405
21141C231j7570L1237m117j096o1246l9057L9071m190M7192k5292K3814P0977
21129F2954l4636n9148L7625n7178L8950M6108j9982l6293K6189k227k875l4325
21117c4838l9502O1822O3638j03971o0027K6435J0303L9297j4208r2697R298K8634
21105a05816N7707Q4079Q607L722P5656N5809o394m34j0424m5942j05253o4551
21093e3234j906M6698L7841j6198m5478P3047L1716q2013l7801j9571o3980M59
$$ plain form
21178 22831 50971 71769 31254 -45289 -110969 -64416 -20117 77297 102371 83326 80744 27949
21166 27949 29852 38561 19790 23677 21124 51767 36493 19225 28871 6770 -51124 -62391 -5113
21153 -5113 -17742 -7955 239 56092 -48482 -127086 -130476 -59006 -22898 6491 28636 3231
21141 3231 -14339 16898 12781 11685 -49561 -88618 -49547 -53737 -6545 -31837 -8023 62954
21129 62954 28318 -30830 6795 -50383 -11433 34675 14693 -21600 4589 2362 -513 -34838
21117 -34838 -74340 -12518 51120 -52851 -112878 -86443 -76140 -36843 -51051 -143748 -134450 -105816
21105 -105816 -48109 35970 44577 48299 123955 179764 173370 172936 162512 116570 11317 -53234
21093 -53234 -55140 -8442 29399 13201 -32277 40770 72486 -9527 -47328 -66899 -130879 -130420
21081a30420K2998J2608K3871O0437J3050M074r7203l4131Q4151n5630l8929o751
21069a41875Q2473M9079N0544n5823l7302O4513N0061K4036m191N6918n406o3459
21057F9568p0874M9975P1161K3328o1151J5180R1806l8032p9366p148L6006n8693
21045D1760o2572j5802O8034J4491O2047J5122k9874J44k1029k2286k3487j2918
21033A3630j9391N2048M7613o154j23953j43348l3547L5894J53205M4676j3584
21022G089L5173p2688o7596K8472J8291L0350P5745J7920o6929p0682m6021K0182
21010i0694N9249J389q0405j7509J05651O745Q2147M7492j2152j03788o7816l9475
20998a09166Q7916M8730l226m720j4254J8990O0184m1771j0721J7978N3005l7549
$$ plain form
21081 -130420 -107422 -94814 -70943 -10506 2544 6618 -90585 -124716 -40565 -96195 -135124 -141875
21069 -141875 -59402 -10323 40221 -15602 -52904 11609 61670 85706 81515 138433 133027 69568
21057 69568 -1306 48669 119830 143158 82007 97187 188993 150961 71595 64447 100453 41760
21045 41760 -20812 -36614 31420 45911 107958 123080 93206 93350 72321 50035 26548 13630
21033 13630 -5761 46287 93900 87746 -36207 -179555 -213102 -177208 -24003 20673 7089
21022 7089 42262 -30426 -98022 -69550 -51259 -20909 54836 72756 5827 -64855 -110876 -90694
21010 -90694 -31445 -30056 -110461 -127970 -22319 -15574 66573 114065 101913 -1875 -69691 -109166
20998 -109166 -21250 27480 24254 19534 5280 24270 84454 42683 31962 49940 102945 65396
20986F5396o7174M413J0403l1598n4396m8830k1658L5257N7052P5252N6382L1233
20974A11732J11522L1865j34311r0956N7194j4257J5053M0046j9165j9509l0336
20963E8878m1575J8063L0035K6188L3000j3207j8097J1917N0667K5785n0029p2934
20951E8691O0456l9162o5574m7558N3452O0608p9308J0571L7512j1818l5426j2942
20939a0498J2019p693p1129q987J00628m1938p6871K759J16322L1340k6911J4237
20927C3278L0378n9526l5157J7671J0927J3622J3093Q7442N6185J8179m7240j08292
20915C0560q0287M0983J6159O87n1537O450Q6913L96n5374o3359J9506K6137r689
20902c2455R6537M1568O3038M1813l8707q9822m3903J8183K9133L4270m3198k6000
$$ plain form
20986 65396 -1778 2635 13038 -18560 -72956 -121786 -143444 -108187 -51135 24117 80499 111732
20974 111732 223254 255119 120808 29852 87046 72789 87842 127888 108723 89214 58878
20963 58878 17303 35366 65401 91589 124589 111382 93285 105202 155869 181654 131625 58691
20951 58691 119147 79985 14411 -33147 20305 80913 1605 12176 49688 37870 2444 -10498
20939 -10498 1521 -6172 -77301 -86288 14340 -27598 -104469 -101710 14612 45952 19041 33278
20927 33278 63656 4130 -31027 -13356 -2429 11193 24286 111728 167913 186092 138852 30560
20915 30560 -49727 -8744 7415 8102 -43435 -36985 49928 50324 -5050 -68409 -48903 -22766 -32455
20902 -32455 64082 105650 168688 210501 171794 81972 38069 56252 85385 119655 76457 50457
20890E0457O7908J0692N769j1789l5174j35853R068P9162K1827j4164o7399m8658
20878f8154m63P3517n8641j4519L0468k3856K4644Q2335L3533n9497j7585k8552
20866b6770m5996r6488o2548P1181P0670L8887J6154l7395k4236o356K7475n686
20854h1108J5883K6351O8292M0230o002j5513J3188J3648m6220m9070m9023L3968
20842c5376M5066M3190o4859L6589M7287J4587k0549P420K6079q161J1140n4175
20830D8238j41998l1979M7750l4683M0977L1665N1034o7802n0129O0944M9990
20819D007n0670j5084M7288K7254O3903O8976l0644n7431L6624J8733q7407j23226
20807i7677M5559Q5189l4679K2043n0701J00647L7362J2138o65l3382r2819N771
$$ plain form
20890 50457 118365 129057 134826 123037 87863 -47990 -38922 40240 62067 47903 -19496 -68154
20878 -68154 -68617 4900 -53741 -68260 -37792 -61648 -37004 45331 78864 19367 1782 -26770
20866 -26770 -72766 -169254 -231802 -160621 -89951 -51064 -34910 -72305 -96541 -102897 -75422 -81108
20854 -81108 -65225 -38874 29418 69648 63646 48133 61321 74969 28749 -20321 -69344 -35376
20842 -35376 9690 52880 -11979 24610 71897 86484 65935 73355 99434 91273 102413 48238
20830 48238 -93760 -125739 -77989 -112672 -71695 -40030 11004 -56798 -106927 -45983 4007
20819 4007 -46663 -61747 -14459 12795 76698 145674 115030 57599 94223 112956 25549 -97677
20807 -97677 -52118 33071 -1608 20435 -30266 70381 107743 119881 119216 85834 -6985 -1214
20795a214L94m3654Q4894N9787n5891m3980k9452K5681Q2997R871k6284n5444
20783G705k1289M576j787J6049K220j0390K208N9398J5709k093j19497L9264J03649
20770I5722j0941l4377m0781K4291l5599L294l1443K5381P2764n625o2668m3041
20758d3023J2636r474j6361L6520J9008l2771l7269K1228K5510n0347n000j1449
20746i0792L6740O130j1265L268m3461l887N0407N5962l6246P4113Q9976j1016
20734A19929m6388n485J0747k8937n3387j4430P5911J6992p053L7189m2822j35727
20722g3461L1534J8082o5713m1649J07433P5832O0346q8854K2637K0760p4953
20711h006n4501l7498K7269P3473K2384l7301k493L0892m9915k2748N3759K823
$$ plain form
20795 -1214 -820 -44474 40420 100207 44316 336 -29116 -3435 79562 89433 63149 7705
20783 7705 -13584 -9008 -10795 5254 7474 -2916 -708 58690 74399 72306 -47191 -7927 95722
20770 95722 84781 50404 9623 33914 -1685 1609 -29834 -4453 68311 62686 18 -43023
20758 -43023 -30387 -39861 -56222 -19702 -694 -33465 -70734 -49506 -23996 -74343 -79343 -90792
20746 -90792 -54052 -47922 -59187 -55919 -99380 -103267 -52860 3102 -33144 40969 130945 119929
20734 119929 73541 68056 78803 49866 -3521 -17951 57960 74952 67899 105088 62266 -73461
20722 -73461 -41927 -23845 -89558 -131207 -23774 52058 112404 23550 46187 66947 -8006
20711 -8006 -62507 -100005 -72736 737 23121 -14180 -16673 14219 -35696 -58444 -4685 -1862
20699a862q028j7867K2677R100n582p2110m5755O0925L5346j3737k1438K407N8837
20686B913J18931L212k2467m6626n3522k9622j5945j624O5141K218p4116Q2784
20674C1277L8237J702O856M341L3902k066J2650l9957m597M9175k0300k4567l8073
20661D8580n627j7312j0084j6103k8423q046K2275j5194l3361J4758M9681n2753
20649e1609k9618J131R6262P5323R964m4413q0978m9747j9421j2714p624M9145
20637f4299K7885k6591k2308k5722N7042L0513m2853j6826O699R4711K3981J0294
20625E2526m5990k6601O6511N203n5771m1774K9216J9564m083r971j4253K3105
20613b318L5890n248l9591K3297l9210n2417q3501P4181M1040j1531m3745K9560
$$ plain form
20699 -1862 -9890 -27757 -5080 4020 -1562 -73672 -119427 -58502 -23156 -36893 -58331 -55924 2913
20686 2913 121844 125056 102589 55963 2441 -27181 -43126 -44750 20391 22609 -51507 31277
20674 31277 69514 71216 78072 82413 116315 114249 126899 86942 82345 131520 111220 86653 48580
20661 48580 42953 25641 15557 -546 -28969 -37015 -14740 -29934 -63295 -48537 1144 -51609
20649 -51609 -81227 -80096 16166 91489 101453 57040 -23938 -73685 -93106 -105820 -113444 -64299
20637 -64299 -36414 -63005 -85313 -111035 -53993 -23480 -66333 -83159 -76460 18251 42232 52526
20625 52526 6536 -20065 46446 51649 -4122 -45896 -16680 2884 -1199 -11170 -25423 -2318
20613 -2318 33572 28324 -11267 12030 -27180 -79597 -163098 -88917 -47877 -59408 -103153 -73593
20601g3593M3534j8308l949P485P9874R1993p2797J886L9286J0849l3207j11996
20589c8943k4327K3492j7820j6572N5935l382j0247j8297R384Q920J7466J676
20577a2715m2474L3682K5516m6487J5856L6516J1800l56M7723l4479q7759l0427
20565h3604K6148J638R6712l7468q9711r466K0711m4136L158L3121K1841N4859
20553f197j4574J888R081n3458N3918M3286l7717N6583n881k6960l02J8124L0121
20540F7912j9051o6577q664l0728J4835J1463K9918o1018q9393N627L9283J20564
20528A4171k5878n3353k6956J6028k5360m86K0610M0979O0716m8357m7789k2699
20516i8374j024K6629L9355J9926P6135P4941N0942q2448j0222l7038P0163n5908
$$ plain form
20601 -73593 -30059 -48367 -52316 -44831 35043 127036 54239 56125 95411 106260 73053 -38943
20589 -38943 -63270 -39778 -57598 -74170 -18235 -21617 -31864 -50161 -40777 -31857 -14391 -12715
20577 -12715 -55189 -21507 4009 -42478 -26622 9894 21694 21338 69061 34582 -53177 -83604
20565 -83604 -57456 -55818 40894 3426 -86285 -95751 -75040 -119176 -116018 -82897 -61056 -6197
20553 -6197 -20771 -18883 -9802 -63260 -9342 33944 -3773 52810 46929 19969 19667 37791 67912
20540 67912 48861 -17716 -26380 -57108 -42273 -30810 -892 -61910 -151303 -145676 -106393 14171
20528 14171 -11707 -65060 -92016 -75988 -101348 -101834 -81224 -40245 20471 -27886 -75675 -98374
20516 -98374 -99398 -72769 -33414 -13488 62647 137588 188530 106082 95860 58822 128985 73077
20504G3077p6173P243N9746k2005M071j8180J3401J09766q6403l4417l0711P3797
20492G3212p680R518j5888r5780K3528O7112J5342p702K5304j0537K9536q5094
20480B0871P4090J14839k6999K9084q8516l6780j7245p8603J8742r8881o294Q3786
20468a1906J3028J844l7833J6971N8998j973n373j4007p5248m0584J04028N2925
20456F0870n8741l880J8230O6942k9066K2183l6585j8227n5758m2178m7465P9679
20444d3996L9917L6204Q7426J842k3460l9256k1761k8582N1230k4033m8667O1874
20432D8738J05025k1387n9626k303J917j9789L5059M5j3284j1546p474o898j2429
20419C6048k2279k4994k9775K6247o082J01334j0743o8757n9490K5302k1699Q850
$$ plain form
20504 73077 -3096 4147 63893 41888 45959 27779 41180 150946 64543 30126 -585 73212
20492 73212 65532 75050 59162 -36618 -13090 54022 69364 61662 86966 76429 105965 20871
20480 20871 94961 209800 182801 211885 123369 86589 69344 -9259 9483 -89398 -95692 -11906
20468 -11906 1122 2966 -34867 -17896 41102 39129 33756 19749 -55499 -96083 7945 60870
20456 60870 2129 -1751 16479 83421 54355 76538 39953 21726 -34032 -76210 -123675 -43996
20444 -43996 -4079 32125 119551 121393 97933 58677 36916 8334 59564 35531 -13136 48738
20432 48738 153763 132376 72750 70447 72364 52575 87634 87679 74395 62849 55375 48477 36048
20419 36048 13769 -11225 -41000 -14753 -20835 80499 69756 999 -58491 -33189 -54888 -46038
20407d6038n5489M0637L9330K762O1763L6475J05755k1616j46921n7137K2544
20396a7935q2542o1561J15763M0175M1627O740m9556m5885J7658N6627R742J5597
20384D6450J2857K1849K2206j3892J8796n7586l5344j4861k9712n3468m4208j1738
20372a38651k8673N4771R3313M7152o1514K0549K9510K5812N2315m6575j8584
20361B9425r0286K1780O7574L6798P0116k592m657P9473K2522q1794J1230j10707
20349D8882r2771M233J9919J2631P7357m467J9525l5988j01710J8676N2026j3996
20337D317L4135M4030j0776k6123j9068o084m8290K4013L9333O837L6908K4175
20325A03407l9879o9114M2158P3371M2807j01590m4075k5902J9330N0460n1712
$$ plain form
20407 -46038 -101527 -60890 -21560 -18798 42965 79440 185195 163579 16658 -40479 -17935
20396 -17935 -100477 -162038 -46275 -6100 35527 42267 -7289 -53174 -35516 21111 30853 46450
20384 46450 59307 81156 103362 89470 108266 50680 15336 475 -29237 -82705 -126913 -138651
20372 -138651 -167324 -112553 -19240 27912 -33602 -13053 16457 42269 94584 48009 29425
20361 29425 -60861 -39081 28493 65291 135407 132815 128158 207631 230153 148359 159589 48882
20349 48882 -43889 -39656 -19737 -7106 70251 65784 85309 49321 -52389 -33713 18313 4317
20337 4317 38452 82482 71706 45583 26515 20431 -27859 -3846 35487 42324 79232 103407
20325 103407 63528 -5586 36572 109943 152750 51160 7085 -18817 513 50973 -739
20314g39o9794j1789M6244P1416J4699m6293j3281j6720q8381Q4072J76008L8580
20302A84022q1009j37402M2360Q0932k1m5717j791J4153M8409r2830N387K1275
20290C7768m0653K7143Q7881m437n3101J7162P155l4975l7692n4944m1471R029
20278h1135M5344N3346k6065K9470M8787L5845o1498K5065L6545j4014n7202l7716
20266c228K5517p537N3828K3932l796O428q3286n5793L8463l3147o3508p335J0240
20253i9222O2462M8802k7060M7737J6341K6767M5190n5871q1068n181k2454n9933
20241a03490j928K8745L6552M1159J5616m7620N7187o2114j9734p0129q028L2777
20229a01007J9851J06655m2135J1698O624k8124N2932m2097N8935K7950J9842
$$ plain form
20314 -739 -70533 -82322 -36078 35338 50037 3744 -9537 -26257 -114638 -30566 145442 184022
20302 184022 103013 -34389 7971 88903 88882 43165 41374 55527 103936 11106 16493 37768
20290 37768 -2885 24258 112139 107702 54601 71763 78918 43943 6251 -48693 -90164 -81135
20278 -81135 -35791 17555 -8510 20960 69747 105592 44094 69159 105704 91690 34488 -3228
20266 -3228 22289 14752 68580 92512 88716 95144 11858 -43935 -5472 -38619 -102127 -109462 -99222
20253 -99222 -36760 12042 -15018 32719 49060 75827 121017 65146 -15922 -21103 -43557 -103490
20241 -103490 -105418 -76673 -40121 1038 16654 -30966 26221 -35893 -55627 -125756 -133784 -101007
20229 -101007 -81156 25499 -16636 -4938 1686 -26438 26494 -15603 43332 71282 91124
20218I1124l2442l9294O6470L8354M8268J1961k0212r4468j3942N1050J1308j7064
20206A01113j31778j9883M9371R8613R8135l2134p910q0997k1277k2447n1557
20195b0751m2936r246N0396Q3034R2354J5373Q553R1286o9960n3828O1388J3307
20183B18970m1438j05045n8853j807Q756q7639j41112L3822J43823N4681j4175
20172I983Q8151o0361j16755J7372Q0436N6963m483L6892J4743n0351L4928J8879
20160A26397j2195K3870l0106j26898j5335N3349N1888N2725j0692l5209j3331
20149F4463J6169M7827m1725K2408l0412m362o464j5074l5394J6461l3449L286
20137C734O4949Q450j6889K8306J0542l9313k9655K6284K7455m9654k6037M3342
$$ plain form
20218 91124 58682 19388 85858 124212 172480 184441 164229 69761 55819 106869 118177 101113
20206 101113 -30665 -50548 -1177 97436 195571 163437 155527 74530 53253 30806 -20751
20195 -20751 -63687 -72933 -22537 60497 152851 168224 176777 268063 198103 144275 205663 218970
20183 218970 177532 72487 13634 11827 20583 -67056 -208168 -174346 -30523 24158 9983
20172 9983 98134 37773 -78982 -61610 18826 75789 71306 108198 122941 72590 107518 126397
20160 126397 114202 138072 107966 -18932 -34267 19082 70970 123695 113003 77794 64463
20149 64463 80632 128459 86734 109142 78730 74368 67904 52830 17436 33897 448 3734
20137 3734 68683 77133 60244 88550 99092 59779 30124 56408 83863 34209 8172 51514
20125E1514p282M174O5627N3927k0796m1554q0696j5697O5035P6120j0184n7773
20113H2415l6175O6083m5507n3960M6420N9956N266j11428j9608J7962O7720j4466
20101F4678j5662J3443K711K6367j496j964n2363N222P2864L5398J8995j06984
20089F1209m3008m248k8488m8787L1287L2479j588j324m350N9797P1590J16465
20077B41034K6082l0791j1845m9003m0111O493k02l0260l2249L835M6268o8648
20065F0603L6873n6872M4555J2668J2978j8219j7833l1588K2258r297M980M286
20053F5392Q700j4964Q134J4804l943Q0794O9697j11834n8642l8085m3031R7O0826
20040C7945J7033j4699j8491k7666O2780K4662m3229p9752o3249K1488M1886J6480
$$ plain form
20125 51514 44232 48406 114033 167960 147164 105610 24914 9217 74252 150372 140188 82415
20113 82415 46240 112323 66816 12856 59276 119232 124498 13070 -6538 11424 79144 64678
20101 64678 49016 62459 65170 91537 90041 88077 35714 40936 113800 149198 168193 61209
20089 61209 18201 13953 -14535 -63322 -32035 444 -1144 -2468 -6818 52979 124569 241034
20077 241034 267116 236325 224480 175477 135366 141859 141657 111397 79148 82983 129251 60603
20065 60603 97476 40604 85159 97827 110805 92586 74753 43165 65423 56126 61106 65392
20053 65392 74092 59128 67262 82066 78123 158917 228614 116780 58138 20053 -22978 -22881 37945
20040 37945 54978 40279 21788 -5878 56902 81564 38335 -41417 -104666 -83178 -41292 -24812
20028b4812n2044K854R2335Q0321K0494p8688P725K9061K7233o6023o6329j0240
20016c8113J3861J6406M5020P485M7507J0965m4803N0277o5958k7531m6071P1393
20004D0438J07090q018j1941N036j6763m8389l1707j9119M3033L2518l0650k9990
19992C1538j1895M5754k0348N3330o426K764P6604M8203q655q504n8227o016k6085
19979A12037J5692n0622M4611Q44l7714j08151r467K3418O8198P731j7206j3047
19967C6324K5271j1717r575j6454o1330k0258J11719j7250N443K7723L4516l7515
19955F6897j6458P0733L255J9201P4025m3086r9142K9985K3804q2540l4189L2847
19943D5332R927J9496N1053P051K5086K6726o1067q1820K0674N2074m3569j1249
$$ plain form
20028 -24812 -76856 -74002 18333 98654 119148 40460 48185 77246 104479 38456 -27873 -38113
20016 -38113 -24252 -7846 37174 44659 92166 103131 58328 108605 42647 15116 -30955 40438
20004 40438 147528 139510 127569 132605 115842 67453 35746 16627 59660 92178 61528 31538
19992 31538 19643 65397 45049 98379 91953 94717 171321 219524 210869 202365 144138 138122 112037
19979 112037 127729 77107 121718 122562 84848 -23303 -32770 -9352 58846 66577 49371 36324
19967 36324 61595 49878 40303 23849 -37481 -57739 53980 36730 42173 69896 104412 66897
19955 66897 50439 121172 124427 143628 217653 174567 75425 105410 129214 46674 12485 45332
19943 45332 55259 74755 125808 132859 157945 184671 123604 41784 62458 114532 70963 59714
19931E9714o4975n7572M9834Q5273Q692p4864Q946j452m8262N8668N2709R4344
19919A71055N9984J3321k6459J1021j27289j27294n0083K5026J29021M1557r8244
19908B1616n2640O947j7627R0136O1668m4768p7931K0465R3245l1400J9376l3404
19896E5683K121q406j2646m260K7821M9054L3006n8136L6967K9072n3213l1616
19884F5447n0244K0587J1878j3914j0792J5681l2464q9641j818L6255P7532K5085
19872E3592M952R9159k3970J5734K2107n9485m2332M126O1296k9074q42J993M2859
19859A50115m0746M8181L2286O6277p1387q0608n4583k9390m8463q681K4368l2194
19847d4825l1678j0773R4033J02932K5139K3025Q030Q755M708K3374n8307q8122
$$ plain form
19931 59714 -5261 -62833 -12999 72274 80966 6102 15048 13596 -34666 24002 76711 171055
19919 171055 231039 244360 217901 228922 101633 -25661 -75744 -50718 78303 119860 21616
19908 21616 -31024 -24077 -41704 48432 110100 65332 -12599 7866 101111 69711 89087 55683
19896 55683 57804 49398 36752 32492 60313 109367 142373 84237 121204 150276 97063 65447
19884 65447 15203 35790 47668 33754 22962 38643 6179 -83462 -85280 -49025 28507 53592
19872 53592 58544 157703 133733 149467 171574 112089 69757 73883 135179 106105 105263 107256 150115
19859 150115 109369 157550 189836 256113 184726 104118 49535 20145 -28318 -36999 -12631 -44825
19847 -44825 -76503 -87276 6757 109689 134828 157853 165883 174638 179346 202720 144413 56291
19835E6291L7859R1131k7217k8522j8482j3132k0931r6263L3479L1896M0656M2782
19823A29547l4101L9347K8469n5184K2711Q04o9412m4423m6350Q0366O1152p222
19811A05704j5397o3037J3489M745j1909k6602J8429j04375l4597P1047J5193
19800b7310l0529O6826J2489R0984O1463m316j1449l8102l5735j0453r459k8399
19788C6010M7194N5608m2861k2114o9187j9570P0754K4303N2868K1674k7011k3926
19776A03742J3855M6923R8477l1081j07275k5608j0659K5472n564l3090k9882
19765D5310K6574J11400K570o171L8329j2230p5748J977L8534N0599n1179j13120
19753E6845L7283p3026l9393J9190j0966K2306k1103J03469L886n441N8303k7526
$$ plain form
19835 56291 94150 185281 158064 129542 111060 97928 76997 -19266 14213 46109 86765 129547
19823 129547 95446 134793 163262 108078 130789 131593 62181 17758 -28592 51774 112926 105704
19811 105704 90307 27270 40759 45504 33595 6993 25422 -78953 -113550 -42503 -27310
19800 -27310 -57839 8987 21476 112460 173923 169607 158158 120056 84321 73868 64409 36010
19788 36010 83204 138812 95951 73837 4650 -14920 55834 80137 133005 154679 127668 103742
19776 103742 117597 164520 262997 231916 124641 99033 88374 113846 108282 75192 45310
19765 45310 71884 183284 185854 179683 218012 205782 130034 132011 170545 221144 169965 56845
19753 56845 94128 21102 -18291 899 -10067 12239 -8864 94605 98491 93050 151353 123827
19741A23827m4388k0208j6916K0455K4933K0187M8533j8847k288k7116j546K6537
19729A33163J7511P0872R0856J3800l6469n8668n6444m3137q1789p7885J685K3637
19717b868j5081j3993L6515J2188L6056K2555j2648O2198k2419J6410k7600O9593
19705A60906m793m5088J5243r659p5629l337M0295m4595j6761j7869j5533L7227
19693B0407L6524L9586L4975j1532M5018n512n9372J00546M5412l9505K2586q058
19681B21075m3415o6637L1501K0015P518N9977p7546o8755q951J3622K3775J7947
19669A30126J05113J1482n2856j73171m7212J00255J27974p6507n6143J1658K5175
19658A05894K2909k106K5152L3755l585L8818N075n4463q7810q1038j6833P8150
$$ plain form
19741 123827 79439 59231 42315 62770 87703 107890 156423 137576 135288 108172 106626 133163
19729 133163 150674 221546 312402 326202 289733 231065 174621 131484 49695 -28190 -26505 -2868
19717 -2868 -17949 -31942 4573 16761 52817 75372 62724 124922 102503 118913 91313 160906
19705 160906 156113 111025 126268 116609 40980 37643 77938 33343 16582 -1287 -16820 20407
19693 20407 56931 96517 131492 119960 164978 159466 100094 200640 246052 206547 229133 221075
19681 221075 177660 111023 142524 162539 170057 230034 152488 83733 74782 88404 112179 130126
19669 130126 235239 246721 193865 20694 -26518 73737 201711 125204 69061 80719 105894
19658 105894 128803 126697 151849 185604 182019 220837 225912 171449 83639 2601 -14232 63918
19646F3918m06L5511O926m590l5011k4047M0924N8564m3972m5585L0603q713k9211
19633D4911l8410M4671R3858l0267n2833J0196L631k6250O5507K040j32678p929
19621b3553k2423O1029J1368M4844R0424j646m8926m7895o1830R090k9757m5154
19609f4429J9628R0426J04684M3416q821j8950O7004O4172n3028o811o191R969
19597B41069m8270p7074j1792J4944P207k1400K9891m2276N599M9834K4737P372
19585A79841j0968N1122K4837r8328n6294N1834O4649n8165n7156j7552O7525
19574A41345M4030o7460J0732L6442M8393l7260l9534K0339j6530Q654M2841o1135
19562A30857M5818p193m5896j1107J457N4498K05K5918P2913J7679n7239j4499
$$ plain form
19646 63918 63512 99023 105949 101359 66348 42301 83225 141789 97817 52232 82835 74122 44911
19633 44911 6501 51172 145030 114763 61930 72126 75757 49507 115014 117054 -15624 -23553
19621 -23553 -45976 15053 26421 71265 161689 160043 111117 63222 1392 10482 -19275 -64429
19609 -64429 -44801 45625 150309 193725 184904 165954 232958 297130 244102 237291 231100 241069
19597 241069 192799 115725 103933 118877 126084 104684 134575 92299 97898 147732 172469 179841
19585 179841 168873 219995 244832 146504 90210 142044 206693 148528 91372 73820 141345
19574 141345 185375 117915 128647 165089 213482 176222 136688 157027 140497 149151 191992 130857
19562 130857 176675 169482 123586 112479 113936 168434 168639 194557 267470 285149 227910 213411
19550B13411m6077P2462O9378j2981m9756O1154J0855j4056K3364j8116l5396
19539B74242o0265n926o6090J2010N1293Q8936m9692K7917K2221Q5090O4945J7579
19527D62260M0442k7475K2603j3978N8233L14047L25689K20174P9992J1250p1214
19516A422023k42298k63798j36530k4899K11046L22181J78872O1266j4556r9001
19506A414306q7247j17426k81311l05825j61921j08310J2320L2336L1060O529
19496D34511j10541K0738L4861J1527l8524j3297k1325J6044r2847m8092N926
19485A98981q306P5438M9298m4558j0825O0835J27428O8967k2956p7342P555R2423
19473E16938J19806K60036K90372K13272J66335J7338j61845k24905j82625j70787
$$ plain form
19550 213411 167334 239796 309174 296193 246437 307591 318446 304390 327754 309638 274242
19539 274242 213977 208051 141961 153971 205264 294200 244508 272425 294646 379736 444681 462260
19527 462260 502702 475227 497830 483852 542085 856132 1181821 1401995 1481987 1493237 1422023
19516 1422023 1179725 915927 779397 754498 965544 1287725 1466597 1527863 1513307 1414306
19506 1414306 1327059 1209633 928322 622497 460576 352266 364586 396922 427982 434511
19496 434511 323970 344708 379569 391096 352572 339275 317950 333994 241147 193055 198981
19485 198981 190675 266113 315411 270853 260028 320863 448291 517258 494302 416960 424515 516938
19473 516938 636744 896780 1187152 1400424 1566759 1584097 1422252 1197347 1014722 843935
19463H43935L4238R6984J54841K67479J74127r140o9363j23710j89916j93619
19453I85856k13262k00904j42960o9990l8773j4993K3990n4993m5027P4179L8385
19442C41508k4589N8189l1615j33021k2304N3395O445L6413k0960m6037J6387
19431B33811M8440O5992N3576n6571j24295j04791J9998O0299M0697K9300J34109
19420D00565p1743l8321r812p9836j02568m3601J4760N8035k2266J6266m1046
19409H0433N354R0101k5203N35J5565K9306k0240q305O5708l9449k2865j5167
19397A55773M9746Q8359J8455m1458m3899L7600J30728O8451M901o2446j18856
19386B87354p4702M7977p8108m2806J4718J09907K8878R222r5833q1109K2572
$$ plain form
19463 843935 878173 975157 1129998 1397477 1571604 1562464 1493101 1369391 1179475 985856
19453 985856 772594 571690 428730 358740 319967 304974 328964 273971 228944 303123 341508
19442 341508 316919 375108 343493 210472 188168 241563 248008 284421 263461 217424 233811
19431 233811 282251 348243 401819 345248 220953 116162 136160 196459 237156 266456 400565
19420 400565 328822 290501 280689 200853 98285 54684 69444 127479 105213 121479 80433
19409 80433 85787 175888 150685 151220 166785 196091 175851 167546 233254 193805 170940 155773
19397 155773 205519 293878 312333 270875 226976 264576 395304 463755 468656 406210 287354
19386 287354 212652 260629 182521 139715 154433 264340 293218 302440 206607 125498 148070
19375A48070M4380N0049L8380P6232r118J3618l7286k1341L531J2746m4042M9958
19363C25177k7897o4077M6067J8551l34M2073l925P3100L2399o5360o5695M7101
19351C57180O647M8885j15108j10964j2131M4901L7844j5713j11371N9388J05331
19340B94889J303J328q0651j17936N3251J29036R4328K9075L3947l5993n5082
19329C47495J08569O2003n7826j18242m2655L8009r681n4070l8551O2560K7555
19318C25166j23374l1525M2002J6616N1432M4556K8415J3083j2386L0929k9959
19307C54955k4524M2745L23j2261m782k8463M2056O7492m4938L352J9868P1848
19295D87671J14375K06909J64624K00953K32588J93357N0968p4692j37411p6693
$$ plain form
19375 148070 192450 242499 280879 357111 347993 361611 324325 302984 306515 319261 275219 325177
19363 325177 297280 233203 279270 297821 297487 339560 335635 408735 441134 375774 310079 357180
19351 357180 363827 412712 297604 186640 174509 219410 257254 241541 130170 189558 294889
19340 294889 296192 297520 216869 98933 152184 281220 375548 404623 438570 402577 347495
19329 347495 456064 518067 460241 341999 299344 337353 327672 273602 235051 297611 325166
19318 325166 201792 170267 212269 228885 280317 324873 353288 366371 353985 384914 354955
19307 354955 330431 373176 373499 361238 356456 327993 370049 437541 392603 395955 415823 487671
19295 487671 602046 808955 973579 1174532 1407120 1600477 1651445 1576753 1439342 1362649
19285A362649M1835J96798J53038J41372O6812j10971j20059j38583l02994k84396
19275A005501j12432j39789q0265l4582j03155o1671J4578p6707Q101M1110J8580
19264D79269O8706r796n7076K1834j905Q455L4348J11519M921o5360M960k9736
19252E70139O7479Q6559q78k8269o9958J798P588J09268J11657J43151K16806
19241A215340L04139K20198J93661J12662j68356j24076q1265L5081M3246K05344
19231A955974J44798P2736j70663k12519k44050k87268k69133k57919r4000o0647
19221E77309q520o581L3691L4957r251N0012J844j3538K1341J2194M3693J8093
19209G55244O6408m0357n2717J756m6080L0276m8039L2324M2577j5546m1952j7464
$$ plain form
19285 1362649 1404484 1601282 1754320 1895692 1962504 1851533 1731474 1592891 1289897 1005501
19275 1005501 893069 753280 673015 638433 535278 473607 488185 411478 419579 460689 479269
19264 479269 547975 538179 481103 502937 501032 509487 543835 655354 660275 594915 599875 570139
19252 570139 637618 724177 723299 695030 625072 626870 634458 743726 855383 998534 1215340
19241 1215340 1519479 1739677 1933338 2046000 1877644 1753568 1672303 1707384 1750630 1955974
19231 1955974 2100772 2173508 2002845 1790326 1546276 1259008 989875 731956 637956 577309
19221 577309 568789 562208 595899 630856 621605 671617 673461 659923 681264 693458 737151 755244
19209 755244 821652 781295 728578 730334 684254 714530 666491 698815 741392 725846 683894 666430
19197F66430M3127n912p6905L4064J16058J3601j5904M3599O9916J95081K77057
19186A360212M03365N18886M28694L11363L19464N41998O24114L91357J28562
19177E028015j87124l92121l46637j63141l9236k0731Q0731M40414N75303L21722
19167E297195J13049k84386o98407q20737p55219o33720m88333k89835k21585
19158A218022j17017j58604l9248m1270k0888L2359M5666k1571j01190n2457K1394
19147G65196L7157j3990l4985J5669O8585J6729n0538L8495m9511j8124j8982
19136G55701M1414O1588M1518K32918K58104M53720M92582M50975M09505J86434
19126C384459k47874l45728l88168l07059k05247J19069M53521N54315M99986
$$ plain form
19197 666430 709557 703645 626740 660804 776862 790463 774559 818158 888074 1083155 1360212
19186 1360212 1763577 2282463 2711157 3022520 3341984 3883982 4508096 4899453 5028015
19177 5028015 4840891 4448770 4102133 3938992 3899756 3879025 3959756 4400170 4975473 5297195
19167 5297195 5410244 5125858 4427451 3606714 2851495 2217775 1729442 1439607 1218022
19158 1218022 1101005 942401 903153 861883 840995 873354 919020 897449 796259 743802 765196
19147 765196 802353 788363 753378 769047 837632 854361 803823 842318 792807 774683 755701
19136 755701 797115 858703 900221 1133139 1391243 1844963 2337545 2788520 3198025 3384459
19126 3384459 3136585 2790857 2402689 2095630 1890383 2009452 2462973 3017288 3517274
19117C517274L63040M6912k24410k51692l23933l56951l61005k61667j92679k19002
19107A735887k37301j37491q5092k1527R8640K1853J35615J24858p0097n3912
19097A511433j06096j73550j12927q5036p6312k2136M7152K7204K5785m6302j30575
19086H58640n4894k9830n7343n1268k9465J4912j2899j8231N5398N5934J01932
19075H32886n2447m8030p4010R722J33991J66275M1836Q1726J59782J11838J12095
19064A475664K81326K23092J05942J28433J19894j6163o3502j56626j57757l4706
19054A905597L2214J19877Q6677J88059K91128J12306r1558q1761n9521k279m0456
19043B460283L4127J09318K39192L18960L60791M20992M69816L19567J97803Q0212
$$ plain form
19117 3517274 3880314 3927226 3702816 3451124 3127191 2770240 2409235 2147568 1954889 1735887
19107 1735887 1498586 1361095 1276003 1254476 1353116 1374969 1510584 1635442 1565345 1511433
19097 1511433 1405337 1231787 1118860 1033824 957512 935376 982528 1009732 1035517 989215 858640
19086 858640 803746 773916 716573 665305 635840 650752 637853 619622 675020 730954 832886
19075 832886 780439 732409 658399 668121 802112 968387 1010223 1091949 1251731 1363569 1475664
19064 1475664 1756990 1980082 2086024 2214457 2334351 2318188 2254686 2098060 1940303 1905597
19054 1905597 1937811 2057688 2144365 2332424 2623552 2735858 2644300 2562539 2503018 2500739 2460283
19043 2460283 2494410 2603728 2842920 3161880 3522671 3943663 4413479 4733046 4930849 5011061
19033E011061j5043m2853l9435J77078K72811L88238M62970N06878M68446M71650
19023G661801O61576P87778P42604Q25015P99721P57837J003463J617876K450888
19014A7308559L569948N496992Q657278J4168650K4465518L8548400M6713899
19007A58929244M3976109L3194445J1246799j5614021l1684267l5904660l1561112
19000A32582537j7459998L619728K5956326L9102185L8450383K7870589N652738
18993B55774488k1797953l8613171m3800484m1526281l2301789k1091408j2811564
18986D3831838q071003n428666l797436k688134k085390j585809j048085o16296
18978A8511019k86966j06908j23261r1822j42740j08174m8673Q6610L70629N20862
$$ plain form
19033 5011061 4996018 4953165 4913730 5090808 5363619 5751857 6214827 6721705 7190151 7661801
19023 7661801 8323377 9111155 9853759 10678774 11478495 12236332 13239795 14857671 17308559
19014 17308559 20878507 26375499 35032777 49201427 73666945 112215345 158929244
19007 158929244 202905353 236099798 247346597 231732576 200048309 164143649 132582537
19000 132582537 115122539 118742267 144698593 183800778 222251161 250121750 255774488
18993 255774488 233976535 195363364 151562880 110036599 77734810 56643402 43831838
18986 43831838 35760835 30332169 26534733 23846599 21761209 20175400 19127315 18511019
18978 18511019 18224053 18117145 17993884 17902062 17759322 17651148 17602475 17689085 18059714 18580576
18968A8580576P53000J210256J682291K458156L563015N499670Q903741J4937259
18960E7587964K6419821M2920843N3536670N1352176M0367961J6501994j5436024
18953B73251405l6066884m2072967l8465653k3222710R66148K7212635M3844896
18946B05446870M4587556L3890308J0040060k1833452m3096473n0567022m9162415
18939A29305432l9467001k6558108j6513721j0290511o671373m486988l210057
18932B2107673k269957j647812j290133j091551q37635q62302q77899r38182r35944
18923A1356258r96250r55324p95504o04974m24407j37483n8466l5166r0279k33584
18913G024821l79844m46123n35246m81298n44552n24739l67217l85005l15188
$$ plain form
18968 18580576 19333576 20543832 22226123 24684279 28247294 33746964 42650705 57587964
18960 57587964 84007785 126928628 180465298 231817474 272185435 288687429 273251405
18953 273251405 237184521 195111554 156645901 133423191 134389339 161601974 205446870
18946 205446870 250034426 283924734 293964794 272131342 229034869 178467847 129305432
18939 129305432 89838431 63280323 46766602 36476091 29804718 25317730 22107673
18932 22107673 19837716 18189904 16899771 15808220 14970585 14108283 13230384 12292202 11356258
18923 11356258 10360008 9404684 8609180 8004206 7579799 7442316 7383850 7348684 7258405 7024821
18913 7024821 6644977 6198854 5663608 5182310 4637758 4113019 3745802 3360797 3045609
18904C045609k45622j25432j22115j75551j79465j19864q0689k6774l3412j74577
18894A762108j63477j09695n2161m7797o3507M9221q8805l5348J812M3373R4354
18883A390078L271k1673J21838N0055L9162l3141n8758l6683K420L8646M2308
18872A537523Q9861m3232j31798j3179N478P6253M2648N1244p0591j21413j11596
18861A311198k1856P4445Q9573M3458Q67j2038j5912r5786n3383m209l4317l5327
18849A246713L7093Q6489M4388L9278j17524J196P1148q6153j15211j886K6738
18838A232269L0160J31069K47622K78644J44734M6507n4239j16683l3735K30733
18828B137081L80924K79090N4408l8962j23241k43441j89500m9846O6443R4125
$$ plain form
18904 3045609 2799987 2674555 2552440 2376889 2197424 2077560 1996871 1970097 1936685 1762108
18894 1762108 1598631 1488936 1436775 1388978 1325471 1374692 1285887 1250539 1252351 1295724 1390078
18883 1390078 1393349 1371676 1493514 1543569 1582731 1549590 1490832 1454149 1456569 1495215 1537523
18872 1537523 1627384 1584152 1452354 1439175 1444653 1520906 1563554 1614798 1544207 1422794 1311198
18861 1311198 1289342 1363787 1453360 1496818 1497685 1485647 1469735 1373949 1320566 1316357 1282040 1246713
18849 1246713 1283806 1370295 1414683 1453961 1336437 1337633 1408781 1322628 1207417 1205531 1232269
18838 1232269 1262429 1393498 1641120 1919764 2064498 2111005 2056766 1940083 1906348 2137081
18828 2137081 2518005 2797095 2851503 2812541 2689300 2445859 2256359 2206513 2272956 2367081
18818B367081Q5039J33054N9533J33510K45059M91815O63795N48764N16091K08281
18808E452022j73930k31327k69292O1255L34525M15459M38667L06470j22904l34222
18798E876723k42654j87897l8699J81091K56841J97847K33699L90172M81878O07372
18788G756373P39608Q86336Q51288N98135N16924P07361O91054P35294Q94299
18779A4376672J315236J755235K278326L200559M570608O830675J1033836J9296388
18771F4657535L5067387N2226171M8290251M0948730K7288324j0470509k5639515
18764B32368374k4999543j3103026J5023242K8847118K4835763K1802256j3707351
18757B71066833m0121492m5617963m8198036m1493229k7482146j6337647r492439
$$ plain form
18818 2367081 2452120 2585174 2644707 2778217 3023276 3515091 4178886 4727650 5243741 5452022
18808 5452022 5278092 5046765 4777473 4838728 5173253 5588712 6027379 6333849 6210945 5876723
18798 5876723 5634069 5446172 5407473 5588564 5845405 6043252 6276951 6667123 7149001 7756373
18788 7756373 8495981 9382317 10233605 10831740 11348664 12056025 12747079 13482373 14376672
18779 14376672 15691908 17447143 19725469 22926028 27496636 34327311 45361147 64657535
18771 64657535 99724922 151951093 200241344 241190074 268478398 258007889 232368374
18764 232368374 207368831 194265805 209289047 238136165 262971928 284774184 271066833
18757 271066833 230945341 185327378 137129342 95636113 68153967 51816320 42323881
18750D2323881o041659m203223l309965k933046k485331j900683j319188q79864
18742A9250922o33038m00811m46568m01061q9329L17229N23011L20751n4681k69108
18732A8117317m05384k57172K71549P53680J475314K149736K789472L967390N651154
18723C4513056Q484221J3821752K4460280M3660436O0084460N1992575M5567536
18716B82584316K3049292j7521053k9061889k7234083j0294268K1235958L0592048
18709B73350321K7201816J7675567k3865163m6281807n1923770n3228528m3654927
18702I9273509k8620576j7364225j0867505p196430m940628l686655l030765k600444
18694B0966281k275536j695590j124197j039469j012913r60689j044733r90555
$$ plain form
18750 42323881 36282222 32078999 28769034 25835988 23350657 21449974 20130786 19250922
18742 19250922 18617884 18217073 17770505 17369444 17280115 17597344 18120355 18441106 18386425 18117317
18732 18117317 17711933 17454761 17726310 18479990 19955304 22105040 24894512 28861902 34513056
18723 34513056 42997277 56819029 81279309 124939745 185024205 237016780 282584316
18716 282584316 305633608 288112555 259050666 231816583 221522315 242758273 273350321
18709 273350321 300552137 318227704 294362541 248080734 196156964 142928436 99273509
18702 99273509 70652933 53288708 42421203 35224773 30284145 26597490 23566725 20966281
18694 20966281 18690745 16995155 15870958 14831489 13818576 12857887 11813154 10822599
18686A0822599q02827n42699n77528n35829m71694o70335o70116n08710m95843
18677E547018m70681l69761l44574j88583q8246j22222q7929k0089O9587J95305
18667D119825N25997Q06384P49425M38574j66782n05097o80417p76259n69929
18658C941721j37095L29707O49732O06571N48838M9352n27643p46200p92737p54309
18648C167937n00258k83886k30803j54157q5109k0768L4258J6182m5269L8129
18638A936256Q3012O026o2648m1214m3717o9495j53126M4564L1049J00564j3749
18627A817522r3228j02438r3837k0485K7852n8778j6000M0973J4716M3720l56
18616A559661M404R0770M2964P2943j7136k8213k1796m1936M041M8104L050M0099
$$ plain form
18686 10822599 10019772 9477073 8899545 8363716 7892022 7221687 6551571 6042861 5547018
18677 5547018 5076337 4706576 4362002 4173419 4085173 3962951 3875022 3854933 3924520 4119825
18667 4119825 4645822 5452206 6201631 6640205 6473423 5968326 5287909 4511650 3941721
18658 3941721 3804626 4134333 4784065 5390636 5939474 5988826 5461183 4714983 3922246 3167937
18648 3167937 2667679 2383793 2152990 1998833 1913724 1892956 1927214 1943396 1898127 1936256
18638 1936256 2019268 2025294 1962646 1921432 1877715 1808220 1655094 1699658 1730707 1831271 1817522
18627 1817522 1724294 1621856 1528019 1507534 1535386 1476608 1460608 1501581 1516297 1560017 1559661
18616 1559661 1564065 1654835 1697799 1770742 1753606 1725393 1703597 1661661 1665702 1713806 1716856 1756955
18604A756955J25662N2746O5303J67153J47819J42378R5588J00195P2309Q448
18594B734556O6044Q1339Q3520J76317M52055O65649O51009L68526K28837J93112
18584E700964K50660J91667r4949j99658j65154q2324J98625M07041K57825K38472
18574F703169M17898M93723O78238N70214O06343L81792J62152M14539O88703
18565A1116771P16364O96455Q90442J246137J244254J367560J880583K330120
18557B1488686K843632L678600M802017O244415Q669735J3650296K3868938M4181109
18549A29427428P6036266Q6664778M9486798K2267670K1249749K4919061J3908811
18542D23960561j8430813l0348123l7278715l9779666o109937M4645860M7782091
$$ plain form
18604 1756955 1882617 1935363 2000666 2167819 2315638 2458016 2553604 2653799 2726108 2734556
18594 2734556 2800600 2881939 2965459 3141776 3593831 4259480 4910489 5279015 5507852 5700964
18584 5700964 5951624 6143291 6048342 5848684 5683530 5601206 5799831 6206872 6464697 6703169
18574 6703169 7121067 7614790 8293028 8863242 9469585 9851377 10013529 10428068 11116771
18565 11116771 11833135 12529590 13420032 14666169 15910423 17277983 19158566 21488686
18557 21488686 24332318 28010918 32812935 39057350 47727085 61377381 85246319 129427428
18549 129427428 205463694 292128472 341615270 363882940 385132689 410051750 423960561
18542 423960561 405529748 375181625 337902910 298123244 292013307 336659167 384441258
18535C84441258J5384759Q077678J1976918J2989409j1832492l9424408m9089198
18528C32523924o7567158p5056333n8259234l6370303k2122525j4045738r355364
18521D9747269o667453n050756l919758l091980k689324k372403j920794j552404
18513B2482397j576364j684232j450067j309439j251286j125596r63888n09785
18505A2611740l34503m64734m26493k05654j07147l04980n20340n20740o44804
18496I082345o89136m95430n7857K24568K62245M13658N95669O18848N28295J54341
18486A0637546l03926p41123r18591q27689o50720o25712m16529j35968J21411
18477F138699M20449M12007q8551k90913k83668m40566l59252m04245m16724m31027
$$ plain form
18535 384441258 399826017 407903695 419880613 432870022 421037530 381613122 332523924
18528 332523924 264956766 189900433 131641199 95270896 73148371 59102633 49747269
18521 49747269 43079816 38029060 34109302 31017322 28327998 25955595 24034801 22482397
18513 22482397 20906033 19221801 17771734 16462295 15211009 14085413 13121525 12611740
18505 12611740 12277237 11812503 11386010 11180356 11073209 10768229 10247889 9727149 9082345
18496 9082345 8393209 7897779 7839922 8064490 8326735 8740393 9336062 9954910 10483205 10637546
18486 10637546 10333620 9592497 8673906 7846217 7195497 6569785 6153256 6017288 6138699
18477 6138699 6559148 6971155 6882604 6591691 6308023 5867457 5508205 5103960 4687236 4256209
18467D256209l64234k85206j32640j41451q3094o4835N5801J97916M63622O21278
18457D523366N05542L71676M3504m41657n27302n53777n39085k29022N1193L67344
18447C571782N87991N17537L15555k03848l94177l24947k43298r3705K6381J3935
18437C773206m8600r0987k19148j46816p3211n6510m4325J35550K55941L67092
18427C852192L78506L53299J75784j4648k04265m20429m01284m08141m45464k80182
18417B585368j02960j3147L3438K22337K15561J30741R0022K16347L18642O34926
18407D331275P31318N56648L47855k72716n26612o07493o55596n07857j41399
18398C255423K46055P15140P06809N88015P7348m96011p07620q62841o62178l16906
$$ plain form
18467 4256209 3891975 3606769 3474129 3332678 3249584 3184749 3240550 3438466 3902088 4523366
18457 4523366 5028908 5400584 5444088 5002431 4475129 3921352 3382267 3153245 3204438 3571782
18447 3571782 4159773 4677310 4992865 4789017 4394840 4069893 3826595 3732890 3759271 3773206
18437 3773206 3724606 3633619 3414471 3267655 3194444 3137934 3093609 3229159 3485100 3852192
18427 3852192 4230698 4583997 4759781 4745133 4540868 4120439 3719155 3311014 2865550 2585368
18417 2585368 2482408 2469261 2502699 2725036 2940597 3071338 3161360 3377707 3696349 4331275
18407 4331275 5062593 5619241 5967096 5694380 5167768 4560275 3904679 3396822 3255423
18398 3255423 3501478 4216618 4923427 5511442 5588790 5092779 4385159 3522318 2860140 2543234
18388B543234k44392n7485J56792J25442J12845J71410J43470j1353j2908J90171
18378C117226L69817N48630M18334K30773m352k89056l79777j70619Q6349R5205
18368D022530l1556j04999p8376j53778o5638l8397j11588r9518o2398q7077m252
18357C184953P5055K09486L15724K39877M8476k9146M303p5859J53496L96452
18347D522817M80890L36754L59633K28014J29395K32993L29966N77396R57350
18338H155208J494250K101013K763293L538993N077825Q462028J5180053K7827900
18330G4600563M0039708K8144645N178847n116900j7683914k2897815j2231902
18323I0033232P261961K7237860K6150866K801857r237646k0774109l0972722
$$ plain form
18388 2543234 2298842 2241357 2398149 2523591 2636436 2807846 2951316 2939963 2927055 3117226
18378 3117226 3487043 4035673 4454007 4684780 4680428 4391372 4011595 3840976 3927325 4022530
18368 4022530 3990974 3885975 3807599 3653821 3588183 3549786 3438198 3338680 3276282 3189205 3184953
18357 3184953 3260008 3469494 3785218 4025095 4073571 4044425 4048728 3972869 4126365 4522817
18347 4522817 5003707 5340461 5700094 5928108 6057503 6290496 6620462 7197858 8155208
18338 8155208 9649458 11750471 14513764 18052757 23130582 31592610 46772663 74600563
18330 74600563 114640271 142784916 147963763 142846863 125162949 102265134 90033232
18323 90033232 97295193 124533053 150683919 153485776 144248130 123474021 92501299
18316I2501299k8161754j8695073j1349057o963283m512945k774229j786088j120560
18308A7138310q52771p62626m42388l09528k69716k86501j04125O1591l3831m9890
18298A4088525L13466N32675N07525M78279O26969Q01994J234075K122637L190936
18289B3897081M473565O214526R780302J6622570K9729761M9587615N3747292
18282A94052712K9140511J9827184J7294377l345965j9106801q075788P491162
18275B37277392J6114563L611911k748433L486638q678406l2246648l4766706
18268A82050311l3321391l6365119l1481889k1157284j3083639q355722n662623
18261C2622644l967334k822219j974741j580073j380179j261627j144539r85860
$$ plain form
18316 92501299 64339545 45644472 34295415 27332132 22819187 20044958 18258870 17138310
18308 17138310 16285539 15522913 15080525 14770997 14501281 14214780 14110655 14172246 14138415 14088525
18298 14088525 14401991 14934666 15442191 15920470 16547439 17349433 18583508 20706145 23897081
18289 23897081 28370646 34585172 44365474 60988044 90717805 140305420 194052712
18282 194052712 223193223 243020407 260314784 256968819 237862018 229786230 237277392
18275 237277392 253391955 257003866 254255433 257742071 249063665 216817017 182050311
18268 182050311 148728920 112363801 80881912 59724628 46640989 38285267 32622644
18261 32622644 28655310 25833091 23858350 22278277 20898098 19636471 18491932 17506072
18253A7506072q29884m50055j03590k298j33313k23983k06392j38372l1800K85660
18243A5672045M65984Q57607J390344K093739K808979L913161O502814J1717992
18235D5422665K2078164L8730926M3419581J8242597j165103j2899318k5826239
18228A28003273k3778500o578477J6332322L2322983J7645719m570141j4612034
18221A44765145k8270526l3768264k6121542j6151468r609105n984626l941674
18214B0917940k872196k158464j671602j277361j088255q55544n22695l23960
18206A0147863n15541n08176l96573m15141k33787q7839j2686L3593J50114M94427
18196H656254J320010K717809L305340J651951J83j160974k400201k686653k018888
$$ plain form
18253 17506072 16676188 16226133 16122543 16120245 15986932 15762949 15556557 15418185 15386385 15672045
18243 15672045 16138029 16995636 18385980 20479719 23288698 27201859 33704673 45422665
18235 45422665 67500829 106231755 149651336 167893933 166728830 153829512 128003273
18228 128003273 104224773 97646296 113978618 146301601 163947320 159377179 144765145
18221 144765145 116494619 82726355 56604813 40453345 30844240 24859614 20917940
18214 20917940 18045744 15887280 14215678 12938317 11850062 10994518 10471823 10147863
18206 10147863 9632322 9124146 8727573 8312432 8078645 7990806 7978120 8011713 8161827 8656254
18196 8656254 9976264 12694073 15999413 17651364 17651547 16490573 14090372 11403719 9384831
18187I384831j320419q22471o60991n77417l23229k75705k30875j09838k54947
18178D808939l47005k80055l72708m39986k25059j35765r7054o5077q5054r779
18168B751397J32473J46339K12965O4203j91946k46131l29803k11783o8110P0384
18158B329988J30033M6469O8478J55292J91718L72031P05358O74067N06873N515
18148E185822k18797k86210l64754j92318M3645K48850N83574P27969M99110O1577
18138F288468l87701o22867p17269n37645l50874M7000M25533Q15897Q18123N56483
18128F335148M69367K45707J3933M4361j05037k72652l31409k05806K52K34339
18118F428203O96946J255819J527102K026270L152284N650199J0924799K2704811
$$ plain form
18187 9384831 8064412 7241941 6580950 6003533 5680304 5404599 5173724 5063886 4808939
18178 4808939 4461934 4181879 3809171 3369185 3144126 3008361 2911307 2846230 2761176 2751397
18168 2751397 2883870 3030209 3243174 3307377 3115431 2869300 2539497 2327714 2259604 2329988
18158 2329988 2460021 2506490 2574968 2730260 2921978 3294009 3999367 4673434 5180307 5185822
18148 5185822 4967025 4680815 4316061 4123743 4167388 4416238 4999812 5727781 6226891 6288468
18138 6288468 5900767 5277900 4560631 4022986 3672112 3719112 4144645 4960542 5778665 6335148
18128 6335148 6804515 7050222 7064155 7108516 7003479 6730827 6399418 6193612 6193864 6428203
18118 6428203 7125149 8380968 9908070 11934340 15086624 20736823 31661622 54366433
18110E4366433L7278090K2481564k037625p475425k0722234k7457263k0163907
18103C6269633j1070617o148032l464166k095572j707890j244312p28827p12327
18095I097890n94679k25996N6105k41799k27255m054j27904n54032n82689o43133
18085E952454o76390m53005j58894O9095L69976L00738J18343J11671M1972j39809
18075E536151m27470n52276m62760l62377l67615k48933j33983M5846J05342j760
18065C130165p4826j35311j21347r1893l7947n597Q2560R8563J13304J42182K62717
18054C362570M85226O08220L72357j2312k71383m12182m46664k86269k34499n3852
18044C111212L57192N98058M52715J42853J58307j22981m26589l85324k60773
$$ plain form
18110 54366433 91644523 114126087 112088462 104613037 83890803 56433540 36269633
18103 36269633 25199016 19050984 15586818 13491246 11783356 10539044 9810217 9097890
18095 9097890 8503211 8277215 8333320 8091521 7864266 7860212 7732308 7178276 6595587 5952454
18085 5952454 5276064 4823059 4664165 4733260 5103236 5403974 5522317 5633988 5675960 5536151
18075 5536151 5108681 4556405 4093645 3731268 3363653 3114720 2980737 3026583 3131925 3130165
18065 3130165 3055339 2920028 2798681 2706788 2668841 2663244 2745804 2844367 2957671 3099853 3362570
18054 3362570 3847796 4456016 4828373 4816061 4544678 4132496 3685832 3399563 3165064 3111212
18044 3111212 3468404 4066462 4519177 4662030 4820337 4697356 4270767 3885443 3624670
18035C624670n1959R9061J41217J39610K64502L57142N61200N20624M76293N32402
18025F664762P38124Q87740O03297L15136J26832J17137o0870N6510K15489K49472
18015I913629K72617M49865Q95971J240471J504327J886846K463410L277397M129851
18006B6034384N232845P070292J0654730J8264010L2978058N7649974P8295715
17999B36180008O7876371L7570566K0384447J8693324J3145351p885749l1388092
17992C54576226m6523461o0187926o5398624n3113837l3759248j8915073r585582
17985F7092475l851025J32893L665807Q741726J7740029L4615961O1542450Q0466368
17977B70146684O5218215L3533123J8236266J6858674R367088j3272738l6236397
$$ plain form
18035 3624670 3572711 3671772 3812989 3952599 4217101 4574243 5135443 5656067 6132360 6664762
18025 6664762 7402886 8290626 8893923 9209059 9335891 9453028 9392158 9448668 9664157 9913629
18015 9913629 10186246 10636111 11532082 12772553 14276880 16163726 18627136 21904533 26034384
18006 26034384 31267229 38337521 48992251 67256261 100234319 157884293 236180008
17999 236180008 304056379 341626945 362011392 380704716 393850067 385964318 354576226
17992 354576226 308052765 247864839 182466215 129352378 95593130 76678057 67092475
17985 67092475 63241450 63374343 67040150 75781876 93521905 128137866 189680316 270146684
17977 270146684 335364899 368898022 387134288 403992962 413360050 400087312 363850915
17970C63850915n1238693o5284274o8558516n3991518l4152605j9743786j1284593
17963E9596930o205231k844269r6345K678330O749223J4273813K7758084M2752583
17955A44663118L6300044R574691p693487k1951668l2677627k8913187j6395239
17948H2906645m257120P997547K4158768M0665500L4803196P366629j0724116
17941A82917049k5633637l7274566l4620977k3528307j4151921q647601n444517
17934C3615523l318467k009229j679600j778915j567501j532857j529765j381925
17926A8817264j073088q38189m75635j50904J35726M70358O60379P43055Q82754
17917A9171720J223311J768026K734633M338257P043342J1909951K0849379L4618084
$$ plain form
17970 363850915 312612222 247327948 178769432 124777914 90625309 70881523 59596930
17963 59596930 53391699 50547430 50451085 53129415 59878638 74152451 101910535 144663118
17955 144663118 180963162 190537853 182844366 160892698 128215071 99301884 82906645
17948 82906645 78649525 86647072 110805840 151471340 186274536 193641165 182917049
17941 182917049 157283412 120008846 85387869 61859562 47707641 39060040 33615523
17934 33615523 30297056 28287827 26608227 24829312 23261811 21728954 20199189 18817264
17926 18817264 17744176 16905987 16430352 16279448 16415174 16885532 17545911 18288966 19171720
17917 19171720 20395031 22163057 24897690 29235947 36279289 48189240 69038619 103656703
17909A03656703M1059894K7100226J5636520J7142874J6960349L822301j1532315
17902B13846552j5175281j9047061j6041811L063071J9582540J3548773O528138
17895B06304921J0382309J1388633k289450j9248976k4995285l2821277l8067659
17888A10653216l1448378k0272184j2044442p474344m920804l476604k944798
17881B8071662l016648k761957k366087k039235j595394j118407p23147m18738
17873A4032049j58918o5241l7273R938M1656K15037M55021Q28703J425591K280414
17863A9026977L501959N685506R890873J7940217K9307934K9983743J1833729
17856A27170938l030714j2827873k2226128k2401874j4163660n019583L444454
$$ plain form
17909 103656703 144716597 171816823 187453343 204596217 221556566 225378867 213846552
17902 213846552 198671271 179624210 163582399 166645470 186228010 199776783 206304921
17895 206304921 216687230 228075863 225786413 206537437 181542152 148720875 110653216
17888 110653216 79204838 58932654 46888212 39413868 34493064 31016460 28071662
17881 28071662 25055014 22293057 19926970 17887735 16292341 15173934 14450787 14032049
17873 14032049 13873131 13807890 13770617 13780555 13822211 14037248 14492269 15320972 16746563 19026977
17863 19026977 22528936 28214442 38105315 56045532 85353466 115337209 127170938
17856 127170938 124140224 111312351 89086223 66684349 52520689 47501106 50945560
17849E0945560J3738471K5821110K6709429R248082n299135j5207970k4499072
17842H1456475k5063287j8010732j0858934o430995m018002k587196j710607j205539
17834A1571183j092957r00927q13274q59868q52627o34965n28591l48695l28545
17825E210734l25387j78768k3075M2080M706j67170l28460k65516l29377l77840
17815C261927p4671R160J05686J53200J38309O1492N954j77761j91196k29050
17805C063050l54491l58315k58096q9660J23139K20369M6496j48157j38315j31816
17795A974204k31018k29838j87569j32952m7417K5732n4881q7760K2789o3993
17785I87297L911J4370m7976m7352j0431p6917q6080j5773Q7636J09981P7872
$$ plain form
17849 50945560 64684031 90505141 117214570 126462652 121163517 105955547 81456475
17842 81456475 56393188 38382456 27523522 21092527 17074525 14487329 12776722 11571183
17834 11571183 10478226 9577299 8764025 7904157 7051530 6416565 5887974 5539279 5210734
17825 5210734 4885347 4706579 4683504 4725584 4730290 4563120 4234660 3969144 3639767 3261927
17815 3261927 3187256 3196416 3302102 3455302 3593611 3655103 3661057 3483296 3292100 3063050
17805 3063050 2708559 2350244 2092148 2002488 2125627 2345996 2392492 2244335 2106020 1974204
17795 1974204 1743186 1513348 1325779 1192827 1145410 1171142 1116261 1028501 1051290 987297
17785 987297 991208 1005578 957602 910250 899819 822902 736822 721049 808685 918666 996538
17774I96538n6947r4780P305J14424M2855P9099L9087K0442o1243k4093R2514
17763A155201J77106K39665K21061K01987M9726j30827k16350j95342n1228l4606
17753A416393j8888J83763J98702K1698j54080j93605k81072k26935j16779j17458
17743G11739J7460o9553o3836r3418L2694n8112m0846j1749j6798L8400Q0779
17732E26760j2227P5698O5022M6363k9502r7369n758L2572M8793n793N9051M4608
17720G48218j9081R290K103o800k0048P8088J00860Q9607n9452q0082l3108q4014
17708G25581j23663r2720K9045J73099M7164o8161k9672k9317p7592m3494o8779
17697D41491k8205j04562j1616R1526L0495K8819m0920j1634k0904L3787q8143
$$ plain form
17774 996538 939591 844811 852116 966540 1009395 1088494 1127581 1148023 1086780 1062687 1155201
17763 1155201 1332307 1571972 1793033 1995020 2044746 1913919 1697569 1502227 1450999 1416393
17753 1416393 1397505 1581268 1779970 1801668 1647588 1453983 1172911 945976 829197 711739
17743 711739 729199 659646 595810 502392 535086 476974 436128 424379 407581 445981 526760
17732 526760 514533 590231 655253 701616 672114 574745 568987 601559 650352 644559 703610 748218
17720 748218 729137 738427 740530 733730 713682 791770 892630 982237 922785 842703 809595 725581
17708 725581 601918 509198 538243 711342 758506 690345 660673 631356 553764 510270 441491
17697 441491 413286 308724 297108 388634 419129 447948 407028 395394 374490 408277 320134
17686C20134j38690p9524J05392N9410L8074N425M6634j8021J8833p6753r1054
17675A89860n2520L3755J08223K8512n9887n5875m8973n6269j4749Q3537m9140
17664A06474p6485J2065j9616r213K1809K3827O2628N8488K9938N665j1612r2072
17652A11896o5964j9691J0301M6973J02872N9442m7549L2443n958j4759K2559
17641B32565k6559p6041K3506O6830M4930l6563n1059q3240n1061k8016j3382
17630A910M0355O5080l0306r924j8662r9952L7164P9152J1796j3468k4120M1415
17618H0440K6643k2418O1525O1397J5568p7039r985J2302q0053q0598J8165O8247
17606G4194J00322o624p7850J044N6750M6285p2765o1490l6294k7476j564J7221
$$ plain form
17686 320134 181444 101920 207312 266722 304796 310221 356855 338834 357667 280914 189860
17675 189860 137340 171095 279318 307830 247943 192068 143095 86826 72077 155614 106474
17664 106474 29989 42054 22438 13225 35034 58861 121489 179977 209915 215580 203968 111896
17652 111896 45932 26241 36542 83515 186387 245829 198280 230723 224765 210006 232565
17641 232565 206006 129965 153471 220301 265231 228668 177609 94369 43308 15292 1910
17630 1910 42265 107345 77039 67115 48453 -51499 -14335 64817 76613 63145 39025 80440
17618 80440 107083 84665 146190 207587 223155 146116 136131 148433 68380 -12218 5947 74194
17606 74194 174516 167892 90042 91086 147836 194121 121356 59866 23572 -3904 -5468 11753
17594A1753N341m1476j799M245j2623L2502M3481L8800J5631n6921n6608L2897
17582A5223O9789J7109J2867n3407m5680J129Q1667L081j7703k784j4037r1565
17570b4311o4137M7723O6953J5437J6763j8493l4038N0735M1484j09203l7450
17559d8537K9924K2012L854L6158P5236J8967N187j896m3068o6071P682N5850
17547I5298L4839P824J4680m1339M333P9550K0337P6156l1892J0612J5328J88072
17535D73798K46136L42169M90639K48601p4932j23099k40507l32333k38197q1484
17525G10791n5388O1358J74824L83480M21345J81921k6221j72976l35915k89923
17515A053296k39557j24248Q9126K57392M10587K00167l3035n1254k52059l29382
$$ plain form
17594 11753 17094 -24382 -26181 -21936 -34559 -2057 41424 80224 95855 38934 -17674 15223
17582 15223 85012 102121 114988 61581 15901 17030 98697 101778 84075 81291 67254 -24311
17570 -24311 -88448 -40725 26228 41665 58428 39935 5897 56632 98116 -11087 -48537
17559 -48537 -18613 3399 7253 43411 118647 137614 142801 140905 97837 31766 39448 95298
17547 95298 130137 137961 152641 111302 115635 195185 215522 291678 259786 270398 285726 473798
17535 473798 719934 1062103 1552742 1801343 1726411 1603312 1362805 1030472 792275 710791
17525 710791 655403 716761 891585 1275065 1696410 1878331 1852110 1679134 1343219 1053296
17515 1053296 813739 689491 778617 1036009 1446596 1646763 1613728 1562474 1310415 981033
17505I81033k47810n1733n0064J0849J54915L59185L51071N9124n8165k13453
17495A294952l68085l18669k90199j61522j9481l6735k081N4634K427p4590m9695
17484C0956O5074J4141J1750J8202l1009L6840P4841M8397K4437p9920n4233l5322
17472A24154l3761l7873J3927P391p2069M0361J42551N419p7485n951J1535l1006
17460H7193j00046m4915Q8076K6758j2336m6882m9358M0426R1448P0971j9782
17449A31553M2994J5727K1355J12208J57713J80666J90230R9995Q4875J69152
17439A206468K04692L53387M02647L27972J40011k442Q214M0005R391j08809j63751
17428B417785k27550k16210j98947r3414k14483l37206j58590q5256j02207n8604
$$ plain form
17505 981033 733223 681490 631426 642275 797190 1156375 1507446 1566570 1508405 1294952
17495 1294952 926867 608198 317999 156477 136996 100261 98180 152814 155241 80651 30956
17484 30956 96030 110171 121921 140123 109114 145954 220795 269192 293629 213709 159476 124154
17472 124154 90393 52520 66447 73838 1769 42130 184681 190100 112615 106664 118199 87193
17460 87193 -12853 -57768 30308 57066 44730 -2152 -51510 -11084 80364 151335 131553
17449 131553 174547 190274 211629 323837 481550 662216 852446 952441 1037316 1206468
17439 1206468 1411160 1764547 2167194 2495166 2635177 2632735 2640949 2680954 2690345 2581536 2417785
17428 2417785 2190235 1974025 1775078 1681664 1467181 1129975 971385 886129 783922 725318
17418G25318J9171N4106K60624M33121M06471K70017P5868J86798J27743j1230
17408B548007j25177k43045m19267m72182l61964k33090o7037j01780p7005l5255
17398D12205k6301O0276K7773L0676J66374J70782K13511J33958O9559J21281
17388A380094J9451l8398r1659l9332r3347o9458l5382R9693J42241K3273k987
17377A294189J684j8324o1780j40008o8216q9970j16282o6702j7561p1221p8875
17366E66934Q439j58044k792j04134j39087j7338K9781n3354r5514l20Q6326L0505
17354A51402m0249L990O74N8971K4032R4552R2184O4954k9321J83J3348L2006
17342D66726N7106J72451P9424Q0735M8270j17800j15620j7846r4858o3971K9841
$$ plain form
17418 725318 744489 798595 1059219 1492340 1898811 2168828 2244696 2431494 2559237 2548007
17408 2548007 2422830 2179785 1760518 1288336 926372 693282 626245 524465 447460 412205
17398 412205 385904 446180 473953 504629 671003 841785 1055296 1189254 1258813 1380094
17388 1380094 1399545 1361147 1269488 1230156 1136809 1067351 1031969 1131662 1273903 1297176 1294189
17377 1294189 1295873 1277549 1215769 1075761 1007545 917575 801293 734591 717030 645809 566934
17366 566934 575373 417329 414537 310403 171316 153978 183759 130405 34891 34571 120897 151402
17354 151402 111153 115143 115817 174788 198820 293372 385556 450510 421189 421372 434720 466726
17342 466726 523832 696283 775707 856442 904712 786912 671292 653446 558588 494617 524458
17331E24458J14310J14569N1391M1721k4927j05326j45507j45872l2483j2111
17321C80223m4544j65375j1656R553J1074L629j1054o0659P1440J4427l5307j08727
17309E3024n0672m3608O915Q2005J08903Q0085j01176n6747L4798Q6713K3917
17298B24157m7347j3799N3624j4568n0549j3066l7386p973m7846m8291j9798L0458
17286G616l2592k4K6604p4925o0429L3359n88L9413N2861J05185J69318l1007
17274B34791j26807m1653n5675m841L1854O2453J18615N5452k0633M7189R2623
17263C93368m6239p8943N6838J1355m2773J46183K6485r1984j2798j2071m1465
17252C07956q4553J8623L4775q2177l5400O4984R9841R3878Q4260j6356k0345
$$ plain form
17331 524458 638768 753337 804728 846449 821522 716196 570689 424817 392334 380223
17321 380223 335679 170304 158648 168201 179275 182904 171850 111191 182631 197058 161751 53024
17309 53024 2352 -41256 -34341 47664 156567 236652 135476 78729 113527 200240 224157
17298 224157 176810 163011 216635 202067 151518 138452 101066 93093 45247 -3044 -22842 7616
17286 7616 -24976 -25000 1604 -73321 -133750 -100391 -100979 -61566 -8705 96480 265798 234791
17274 234791 107984 66331 10656 5815 37669 100122 218737 274189 253556 300745 393368
17263 393368 347129 268186 325024 336379 293606 439789 466274 374290 361492 349421 307956
17252 307956 223403 242026 276801 194624 159224 224208 324049 417927 502187 485831 465486
17241D65486l9020m4739o5541p4055q2218k6428K5298P6349R7929J4182j23232
17230B24011l5651J6683m5101j5229N9211J8085m6962O258O3709J07519Q6082
17219D38615R459J8436p77j34464o0438j1846L5949K3585K1103P140k2630N2965
17207C77097P526q6284k3783j9821k1003Q1822O8441J7735O5500K0576J6030L9830
17195E43666q431j11750j08616p7656p9823M3684Q0302J2396l0455m5268r986
17184B08063K9848L687R579n470J04243Q8552J29632M3200K0803m6867J188m94
17172E85964k5051j43182j57946p2906m8497K7103P9076K0506n6552m4611j0933
17161A52971O4685l1818l0049K3275j6546J55687j1564q4250N354J6842J2726
$$ plain form
17241 465486 426466 381727 316186 242131 159913 133485 158783 235132 333061 347243 224011
17230 224011 188360 205043 159942 144713 203924 222009 175047 181305 245014 352533 438615
17219 438615 448074 466510 465733 331269 270831 258985 294934 318519 339622 346762 324132 377097
17207 377097 384623 298339 274556 254735 233732 315554 383995 401730 467230 487806 503836 543666
17195 543666 535235 423485 314869 237213 157390 201074 281376 293772 263317 218049 208063
17184 208063 237911 241598 251177 245707 349950 438502 568134 611334 632137 585270 586458 585964
17172 585964 560913 417731 259785 186879 138382 165485 244561 265067 208515 163904 152971
17161 152971 217656 185838 155789 179064 162518 318205 306641 222391 227745 244587 257313
17150B57313J6889p9432k1645j1635n3895L6902Q2871l014j8206p0831o9504r446
17138E6367L415N2807j2162J3158p1994k0811r8197p8846J607K5179N3364L7058
17126c9055L4525Q4139P5493q7351q3494N0107O3992m0026j8107q9717k9617N2106
17114b7005N0566M3285k9985j9575N174j26925r9882k3924K6340P2443M0098n508
17102i4898K8463J0213L116K7090N249M8854n8729p0407K9948J35055l1305q0635
17090d7986j0818l1651l5439Q5372M4665l6470J3255M3719P6499J5928q5587n1895
17078b0408P570L7652Q3215J02640k1691j7647K2462L5525k4960l2813J03507
17067B75052M6692p1125Q5917K1703o1213L0315K7880L8366j0512k0163n3070
$$ plain form
17150 257313 274202 194770 173125 161490 107595 144497 227368 224354 206148 135317 65813 56367
17138 56367 59782 112589 100427 113585 41591 20780 -77417 -156263 -154656 -129477 -76113 -39055
17126 -39055 -4530 79609 155102 67751 -15743 34364 98356 58330 40223 -49494 -79111 -27005
17114 -27005 23561 66846 36861 17286 22460 -104465 -204347 -228271 -201931 -129488 -89390 -94898
17102 -94898 -66435 -56222 -53106 -26016 -20767 28087 -30642 -101049 -71101 63954 32649 -47986
17090 -47986 -58804 -90455 -125894 -40522 4143 -32327 -19072 24647 101146 117074 31487 -20408
17078 -20408 -12838 24814 108029 210669 188978 171331 193793 229318 204358 171545 275052
17067 275052 321744 250619 336536 358239 297026 327341 355221 393587 383075 362912 309842
17056C09842l9785J5616J4889k8509n3557L1219O8869L4350P564M4974O6683M2155
17044E14310M6635N685m4612j2702O620L7890L7506r110p5545q2084J06330J05844
17032F36767P3991J4315O6482M2587k871K2884N7455N9433L36O1829P6334O0688
17020A170230J92466J87640J19294J25684Q1660N9021J91186L06210N15258N08569
17010C457218L06444K43228j8484j48779P1625M35112O05778L85218M55979N83577
17000F376916N81008L32032L41911M41600M33183P58938J287025J470979J610304
16991A3633896J703741K073702K677636L430468M797180O968534J1751338K1640819
16983F8677314M1940265P7947322R2384112L4076573o551591k8189942n9972624
$$ plain form
17056 309842 270057 285673 300562 272053 218496 249715 318584 352934 360498 405472 472155 514310
17044 514310 560945 566630 522018 509316 515936 553826 591332 582222 506677 424593 530923 636767
17032 636767 710758 725073 791555 834142 831271 854155 911610 971043 971379 1033208 1109542 1170230
17020 1170230 1362696 1550336 1669630 1795314 1876974 1935995 2127181 2433391 2948649 3457218
17010 3457218 3763662 4006890 3988406 3839627 3911252 4346364 4952142 5337360 5793339 6376916
17000 6376916 6957924 7289956 7631867 8073467 8506650 9265588 10552613 12023592 13633896
16991 13633896 15337637 17411339 20088975 23519443 28316623 35285157 47036495 68677314
16983 68677314 110617579 188564901 280949013 315025586 308473995 280284053 220311429
16976B20311429o3470253m0563821j7900272L38448J9732190M9479514Q5604540
16969B53531775O6072927M537735j6435446m4878418o5559402n2272109k4508470
16962A20488592J102831L0714899P0342380P8381928K0302557j1820680l4234786
16955B75277721o1853025o0481838l7518730j6442535N43756J9679814N0367024
16948A69572187Q3160475N4453648k370393k1287965n1613483o9323540n5563253
16941A07027676l3806465j9606240j1746649p315833m680121l092115k329923
16934B4450330j768570j608132j787541j998845j825765j621212j345108q69295
16926A1625862l72002K7834Q2864l60452o82162r62381j119129r70584q38841
$$ plain form
16976 220311429 156841176 116277355 98377083 98715531 118447721 167927235 253531775
16969 253531775 319604702 324142437 307706991 262828573 197269171 144997062 120488592
16962 120488592 121591423 152306322 222648702 301030630 321333187 309512507 275277721
16955 275277721 213424696 152942858 115424128 98981593 99525349 119205163 169572187
16948 169572187 252732662 307186310 304815917 283527952 231914469 162590929 107027676
16941 107027676 73221211 53614971 41868322 34552489 29872368 26780253 24450330
16934 24450330 22681760 21073628 19286087 17287242 15461477 13840265 12495157 11625862
16926 11625862 11253860 11281694 11364558 11004106 10321944 9359563 8240434 7269850 6431009
16917F431009n83319l73093j39806J5905J67938J23955j40261k29315l51539n15222
16907D406252n79951l87774l04606k57032j20794K8288M1771l1613r2830j90667
16897B511044r6380j32285j98228j52112j76301l6778m3307j7771l8540M9376
16887A668718p8177o2051k8736n0021K1117n2084m233P0790k1828n0770p8065
16876A334660j06799n897j1844j00183j10292J608J14437R5431r209n8364o8227
16865A075321m6030r7091n6579m2684j3953L5399L0128r812P899l287r151n0163
16853H19997m6878n2060r766k652J1992M0927j8999J006n7671r408M7700J1511
16841G35699k8395m3274q9390r755O7429N1423m2562j3427m5730N4759K4983m157
$$ plain form
16917 6431009 5847690 5474597 5334791 5350696 5518634 5642589 5502328 5273013 4921474 4406252
16907 4406252 3826301 3438527 3133921 2876889 2756095 2784383 2826154 2794541 2701711 2511044
16897 2511044 2414664 2282379 2084151 1932039 1755738 1718960 1675653 1657882 1619342 1668718
16887 1668718 1590541 1528490 1499754 1449733 1470850 1418766 1414533 1485323 1463495 1412725 1334660
16876 1334660 1227861 1221964 1210120 1109937 999645 1001253 1115690 1211121 1201912 1143548 1075321
16865 1075321 1029291 932200 875621 832937 818984 854383 884511 874699 882598 879311 870160 819997
16853 819997 773119 721059 711293 708641 720633 761560 742561 743567 685896 676488 724188 735699
16841 735699 707304 664030 574640 564885 632314 683737 641175 627748 582018 636777 661760 657603
16829F57603K4375j0022j7386j31467o8074J1564J2464J0655m535M7545k3424
16818E09298K7147m3401q2076M619n4546k1151O8188R8216J0406J8669o1199N886
16806D80056k7575q7161j883L5756O4448K1149j579P9631l774M9789M868j07786
16794E05939q3086o1113p8885n1302J854J2601K0273n7242r762l1927M829k0776
16782A51403K5175M2702N3073K1595Q5223P049j32786o8510j5367q2896k4926
16771F1735K6978O6199J47347n0630J6927o1067k5069j2377J7634M0830K1563
16760B50070J5502K1635R064o7989o4065m3728O2490M5441o3282p5878J8983K3324
16748A31567J3922N3085P7058L1511k2912n1344n7782m7086l9327l4910P6873
$$ plain form
16829 657603 681978 671956 654570 523103 455029 466593 479057 489712 485177 532722 509298
16818 509298 536445 493044 410968 415587 361041 339890 408078 506294 516700 535369 474170 480056
16806 480056 452481 365320 363437 399193 463641 484790 483211 562842 559068 608857 613725 505939
16794 505939 422853 361740 282855 231553 233407 246008 266281 209039 199277 167350 172179 151403
16782 151403 176578 219280 272353 293948 379171 386220 253434 184924 169557 86661 61735
16771 61735 88713 154912 302259 251629 268556 207489 182420 170043 187677 228507 250070
16760 250070 265572 287207 296271 228282 164217 120489 182979 228420 165138 89260 108243 131567
16748 131567 145489 198574 275632 307143 284231 232887 175105 128019 88692 53782 130655
16737A30655K5005n1567m127J3935O5617j8370r0345j8401M9126j4038J3760K5812
16725A27062N7978k159N3384l55K2265o2047r4747j9457n2439k3828k8770m9287
16713g2400K3274J8122P1565P275K9488N6791o251l1315K5229L8599J7400L2618
16701B10395P9022q599q3014o7917K0757K394j665k4475J5291l7343N496r185
16689A01157n9093n593k049k2172J4810M7619m162N2480P0355Q1982n3176k0716
16677B01442J1085J7577j21034q2530K3489j5139n1730k0065K8294N1478L5062
16666G7929L528j0506j191q8431j7174k2368K4500N4885L844k9251p4506l147
16654h1888N6428L1377K2371N402J1532K2287O8378k8634n8288j8527J8460Q7249
$$ plain form
16737 130655 155660 104093 99966 113901 179518 161148 70803 52402 101528 87490 101250 127062
16725 127062 185040 182881 236265 235910 258175 196128 101381 81924 29485 5657 -23113 -72400
16713 -72400 -49126 -31004 40561 47836 77324 134115 127864 96549 121778 160377 177777 210395
16701 210395 289417 280818 197804 129887 150644 153038 151373 126898 142189 104846 110342 101157
16689 101157 42064 36471 34422 12250 27060 74679 70517 122997 193352 275334 222158 201442
16677 201442 212527 230104 109070 26540 50029 34890 -16840 -36905 -8611 42867 77929
16666 77929 81457 70951 69760 -18671 -35845 -58213 -33713 21172 25016 -4235 -78741 -81888
16654 -81888 -25460 5917 28288 33690 45222 67509 135887 107253 48965 30438 48898 136147
16642A36147N9581k4979k3620L174L9555q5265n5380m2179j2656K3542l8308P7315
16630E6927J9081J2259l5151n6781q919N6543J011j5609o7903j736J9331k8313
16618d9260m9847J22168R3272n3246m8774L2112p722O2189k5084m2977L5705L0761
16606I9297m3071M4197l7021m615J22489P2496q5459j29876n6597L673n823N6053
16594C5743O0941J3835k2k4826l681K3051J7597n0378L8405Q235K889l3178k52
16581H8359p004k0349l848n9862m6280K3708L7875J7663N3840n8473J616O9576
16569I6821o5778m2632l4170j5755M2581l6018M3140n612J02920J638j5424L2691
16557A04402P4261k5281j22241m1496Q557o2546O546O6706L9601P8007J665m6412
$$ plain form
16642 136147 195728 170749 147129 150303 189858 104593 49213 7034 -5622 17920 -20388 56927
16630 56927 76008 88267 53116 -3665 -12584 43959 44970 29361 -38542 -40278 -20947 -49260
16618 -49260 -99107 23061 116333 63087 14313 46425 38703 100892 75808 32831 68536 99297
16606 99297 56226 100423 63402 58787 181276 253772 168313 38437 -18160 -14487 -20310 35743
16594 35743 96684 110519 110497 85671 81990 105041 122638 72260 110665 118900 121789 88611 88359
16581 88359 81355 61006 57158 -2704 -48984 -25276 12599 30262 84102 25629 27245 96821
16569 96821 31043 -11589 -45759 -61514 -18933 -54951 -11811 -17423 85497 87135 71711 104402
16557 104402 178663 153382 31141 -10355 -1798 -64344 -57798 8908 48509 126516 128181 81769
16545H1769k7155M7950k564N1684o614l4293m6541p5078q0111L7777K9627M3103
16533A9554J4697J1458R355k6703J8726q2715n9077j8239K7589N1308m156Q5963
16521D7760J3491m8284j7598q823R143q022p5120p5848M9741P1501P8889M666
16509D1496j5020p33M6354n4881o5681k5642l3666K3425R11J1425M9311J7116
16497e585N7279J6918l1660k0521N6439J8949M715n4282K013j9817m0514n6193
16485g2259Q1765J03232K3832L034p2305n8857L4336J418o1073K110o242q629
16473b9638l2683P047Q7959L6994L034j05831r3181K5685J1331M8568j86M225
16461c6676J8692J6721j4362m1843p0601L160J06404P9077l7259q0188J4975M7339
$$ plain form
16545 81769 54614 102564 100000 151684 145070 110777 64236 -10842 -90953 -53176 -23549 19554
16533 19554 34251 45709 55064 28361 47087 -35628 -94705 -112944 -85355 -34047 -38203 47760
16521 47760 61251 12967 -4631 -13454 -4311 -12333 -87453 -163301 -113560 -42059 36830 41496
16509 41496 26476 25743 72097 17216 -48465 -74107 -107773 -84348 -83437 -72012 -22701 -5585
16497 -5585 51694 68612 36952 16431 72870 91819 96534 42252 44265 24448 -16066 -72259
16485 -72259 9506 112738 136570 139604 67299 8442 42778 44196 -16877 -14767 -21009 -29638
16473 -29638 -62321 -55274 32685 69679 72713 -33118 -126299 -100614 -89283 -40715 -40901 -36676
16461 -36676 -17984 -1263 -15625 -57468 -128069 -124909 -18505 60572 23313 -56875 -41900 5439
16449E439o793L9072L2825L2497q8144n6388n27J9054Q4794N2306N5558j7575
16437A52118J4205l3997J4958P0506k3485q2245j8570J3614L8274O0795R2547
16426B98720J10887K02596L14999M11335K84495O7903m7949k38827l60327l63290
16416F80542j37756M9754M2351J71461K89795M53658K66030n0536j41068k45949
16406A378282m11641k42735j083J12346J78265L58950L33565P9419r226k84127
16396A492015m02529k54459q9248j48855J803J98055M04353M06399J43921l9978
16386A711477j88684l72090l63249j82959p5358j39855j79161o4335m6829k368
16376I6589k6756K7676J0291j5394k5822o6811K8373k9211o0790Q0196K461l8168
$$ plain form
16449 5439 -1354 37718 70543 103040 14896 -41492 -42019 -22965 61829 114135 169693 152118
16437 152118 166323 132326 147284 217790 194305 112060 93490 107104 145378 206173 298720
16426 298720 409607 612203 927202 1338537 1623032 1690935 1642986 1404159 1043832 680542
16416 680542 542786 592540 634891 806352 1096147 1549805 1815835 1765299 1624231 1378282
16406 1378282 966641 723906 722823 835169 1013434 1372384 1705949 1785368 1776142 1492015
16396 1492015 1089486 835027 745779 596924 598727 796782 1201135 1607534 1751455 1711477
16386 1711477 1522793 1150703 787454 604495 529137 389282 210121 145786 98957 96589
16376 96589 69833 97509 107800 92406 66584 -227 28146 -1065 -61855 18341 20802 -17366
16364a7366k7636m354o37P0669K4062m9777j3351n9826R455N3334L9975J18163
16352A42711j0181n8621n0762l2185m3681o265K7850K3410k6332l6518K2228M5808
16340b538J3559Q8667K5635p2084o7518m074k1350N6897K8775n020P8093K6472
16328A45514j00262k5492N7956L1236M6182J8136q0874m3023L271k9532n8505
16317c5393L2416R4889l787N793N2280k5507q0573n0852l1713K7099M8357O1249
16305I4258m5363q6L3902J322p8530p5639M7480J05543N1684o9216j0522p4441
16293a9608j1448L6288j2623l3035k3211J0985R4100J391m8808k7269n843o4356
16281a03437J1082L7434n6732r08m4315m9954N8546L8584N7659L7960o9051m3662
$$ plain form
16364 -17366 -45002 -49356 -49993 20676 44738 -5039 -18390 -78216 -68761 -15427 24548 142711
16352 142711 132530 73909 23147 -9038 -52719 -58984 -31134 -7724 -34056 -70574 -48346 -2538
16340 -2538 11021 99688 125323 53239 -14279 -18353 -39703 17194 45969 40949 119042 145514
16328 145514 45252 19760 77716 108952 155134 173270 92396 49373 52644 23112 -35393
16317 -35393 -2977 91912 88125 93918 146198 120691 40118 -10734 -42447 -15348 33009 94258
16305 94258 48895 48809 82711 84033 5503 -70136 -22656 82887 134571 65355 54833 -19608
16293 -19608 -31056 5232 -7391 -40426 -63637 -52652 41448 42839 -5969 -33238 -39081 -103437
16281 -103437 -92355 -54921 -111653 -112561 -156876 -206830 -148284 -109700 -52041 -14081 -83132 -126794
16269a26794k5823l642k1298N7573J1590p299k88P2266J0836M1158O884q5151
16257f9988j02331L9583O6140R312N2535k697l5175L970o82j137J5333M6157l6305
16244a5285l0848K6015L5469m6103l8128k5145M8150P0238N3198j24340j9159
16233f5938J4265L7595L1876l5354m6793J2643j5531L0793k0569l2748n4788J16519
16221b8030O8394J0530K7205r1534J7073N804j1556R6574K4812k3201K7379k9581
16209I3869m9508m6602L0465L3642N0793l6741m8900L01n9608J03308j3228n6653
16197A138l4620L4193l7641K2393N3613l0635n1287j6195O0714R80p0257N6023
16185a1581M8174L3683K2084l6499j026K701o6747M966O9034L1503j18075o8294
$$ plain form
16269 -126794 -152617 -156259 -177557 -119984 -108394 -115693 -115981 -43715 -32879 8279 15163 -69988
16257 -69988 -172319 -132736 -66596 -57284 -4749 -7446 -42621 -38651 -39333 -40470 -25137 21020 -15285
16244 -15285 -46133 -20118 15351 -30752 -68880 -94025 -45875 24363 77561 -46779 -65938
16233 -65938 -51673 -14078 17798 -17556 -64349 -51706 -67237 -36444 -57013 -89761 -144549 -28030
16221 -28030 40364 50894 78099 -13435 3638 9442 -2114 94460 119272 96071 123450 93869
16209 93869 44361 -2241 28224 61866 112659 75918 27018 27319 -32289 71019 57791 1138
16197 1138 -33482 711 -36930 -14537 39076 8441 -42846 -59041 1673 2653 -67604 -11581
16185 -11581 36593 70276 92360 55861 54835 57536 -9211 -4245 64789 96292 -21783 -90077
16173i0077N7651L8996l815L348L0796M7834m7937j15877n3386p4529p4854Q8309
16161a93541J18484j1710O5814N1608o304o8742j01278l1129J5643N6622N2901
16150e1632P8925P1845l1446m7903J6042M434k6668q516L465j393j7177k3479
16138c3503P642k0936k1377Q219L8263Q3484R2827k4212p7115p3973q7562J0579
16126i7664M0936K9115j1894J0210j2914P72k9720l1320L4820O8846j9546m095
16114b2454J8043M9031k8947q146m4359k0516j1658k5319J0564N8643N6706j8295
16102A3293R5639p0888p4500j7800k1898J19155L7926K6436J4095p8290j7197
16091B5971r1444p0295q076j6021P927Q4934O3559l7078q2459O2427L9816M6919
$$ plain form
16173 -90077 -32426 6570 2755 6103 36899 84733 36796 -79081 -132467 -206996 -281850 -193541
16161 -193541 -75057 -86767 -20953 30655 24351 -44391 -145669 -176798 -161155 -104533 -51632
16150 -51632 27293 99138 67692 19789 35831 40265 13597 5081 8546 7153 -10024 -33503
16138 -33503 -25861 -46797 -68174 -59955 -21692 61792 154619 130407 53292 -20681 -108243 -97664
16126 -97664 -56728 -27613 -39507 -29297 -42211 -41439 -71159 -102479 -67659 1187 -18359 -22454
16114 -22454 -4411 44620 15673 7527 -36832 -57348 -69006 -94325 -83761 -25118 31588 13293
16102 13293 108932 38044 -36456 -54256 -76154 43001 80927 107363 121458 43168 25971
16091 25971 -65473 -135768 -143844 -159865 -151938 -67004 -3445 -40523 -122982 -60555 -20739 26180
16079B6180n5288j1940M6425K4927k869m1111l1835o7000m7613J0584J3340L3268
16067a02932J2997O274L9302p8531j19J8818O215q350O4007J0313j2745j3272
16055e8023Q094R8400k7674k9303k4063L7025P506M7674j3236L1433k4564j5729
16043C7540l8422k9827N3167K3564J3574q904M2473j3915l2324o4212p1648P7700
16031a1234j5721j01607N3632M3355p4508m8213j2490P7738J7768l4477L9667
16020f6090L924o653K0801P8032L1361q8569p5006M9932J04646L5690N560R175
16008A02803l272k1315m3201l2261M5235Q324k5593k7795q2727L1117P4016J33474
15996A58805k1321l6043n2514P535r019M9491q0714j6750Q3912J2541k0975L3418
$$ plain form
16079 26180 -29108 -41048 5377 30304 27435 -13676 -45511 -112511 -160124 -149540 -136200 -102932
16067 -102932 -89935 -83661 -44359 -122890 -123009 -104191 -97976 -106326 -42319 -32006 -44751 -58023
16055 -58023 -49929 48471 20797 -8506 -32569 4456 11962 59636 46400 77833 53269 37540
16043 37540 -882 -30709 22458 46022 59596 50692 93165 79250 46926 -17286 -88934 -11234
16031 -11234 -26955 -128562 -74930 -31575 -106083 -154296 -166786 -89048 -71280 -105757 -66090
16020 -66090 -62166 -68819 -48018 30014 61375 -27194 -102200 -52268 52378 88068 93628 102803
16008 102803 99531 78216 35015 2754 47989 56313 30720 2925 -79802 -48685 25331 158805
15996 158805 137484 101441 48927 56462 47443 96934 16220 -530 83382 95923 74948 108366
15984A08366L0986N608p1012j03220j0233N0952O012j569M2807k3519q5168L8267
15972a1723j522K4098K4312q5913j8345M0998o4172o4254J13833M0947m0480N7622
15960A5401k3157R336R433k5384k8229K1089O2607k1127j6307O4055J740m9481
15948A9976j315N106m631N0217k8804n5887p9593M7037J8722n9447M5144M7292
15936C817M028m8172J3667O4502J9607R0546L7069Q031l1876o7931r8750m2374
15924d7836o5333l7450L4766J5377k7821J7652M0343J10032L7903K3573m4634
15913E6572n2979m383k03p000M6912l1474n9809l2465m83Q6348R8997j7791J7332
15900I9574o1416r1974k0144M0266P9265P7419n8740k9228L2726r0226j05886
$$ plain form
15984 108366 139352 144960 73948 -29272 -39505 11447 17459 15890 58697 35178 -49990 -11723
15972 -11723 -13245 10853 35165 -50748 -69093 -28095 -92267 -156521 -42688 -1741 -42221 15401
15960 15401 -7756 1580 11013 -14371 -42600 -21511 41096 19969 3662 67717 69457 19976
15948 19976 18661 23767 19136 69353 40549 -15338 -94931 -47894 -29172 -88619 -43475 3817
15936 3817 7845 -40327 -26660 37842 57449 147995 185064 193095 161219 93288 -5462 -47836
15924 -47836 -113169 -150619 -115853 -100476 -128297 -110645 -70302 39730 77633 101206 56572
15913 56572 3593 -790 -993 -7993 38919 7445 -52364 -84829 -85312 1036 100033 82242 99574
15900 99574 38158 -53816 -73960 -33694 45571 122990 64250 35022 67748 -22478 -128364
15889a28364j5758L5189M9716K3438m704N8313j907o7595j2168k5076N3807J7799
15877a7310O7515n220j9297n1390j05109n3919L7043M3515K6919m616j8812q3848
15865a84529J9843L6555R3610j5464k0422K9747R863M606K3047l4568n1725k1194
15853a10631J12260J47551K7715m3292K4079P780q9809N851n6179M1490P1702
15842A38517q858n3750q814N6959k6785j20805m1209K2601J2373j8786N5431k1266
15830a4392n0798K3914K6572M7897k2733N7662Q0488O128l9264p8686o3386R640
15818a6958N23k4115m932o297J6327L4388k1503R6995j940j8684J075K639m2838
15805A4680q7215Q434J253N8546P9741k1037L8978O0370l0352j02325r7630N5112
$$ plain form
15889 -128364 -144122 -108933 -59217 -35779 -40483 17830 15923 -51672 -63840 -88916 -35109 -17310
15877 -17310 50205 44985 25688 -25702 -130811 -184730 -147687 -104172 -77253 -81869 -100681 -184529
15865 -184529 -164686 -128131 -34521 -49985 -70407 -40660 -30797 -26191 -3144 -37712 -89437 -110631
15853 -110631 1629 149180 176895 133603 157682 165462 75653 81504 25325 66815 138517
15842 138517 129659 75909 67095 124054 97269 -23536 -64745 -42144 -29771 -48557 6874 -14392
15830 -14392 -65190 -41276 -14704 33193 10460 68122 148610 154738 115474 36788 -26598 -16958
15818 -16958 -16435 -40550 -45482 -51779 -35452 -1064 -22567 74428 72488 53804 54879 57518 14680
15805 14680 -72535 -64101 -62848 -4302 75439 54402 93380 153750 123398 21073 -76557 -21445
15793b1445l455M9519P9979O0909n4933m3831j797m0281O990Q414j5320N5753
15781H0502L7545j08070n2853K226l6486q3573K2781M4680M6811O9811r027j1088
15769C259m476O8499O3088q0411p5326n7668p9984K5393P0949L8745o960Q460
15757b6432l2414n8103J2824J04513L8661j0170k4914k290o1045k8724n1980j4997
15745a55071J9695L0461N0725M8858m6823N9025N0626r75o4302m4099L4302K9303
15733A1725o215q3222p232Q5309N1703K9048O2982K3412j05016q0273J2307K6634
15721B1162Q704M2439K8545k5491l5011L4683q204p0483M4590Q9728j9764j10733
15709A65n6111M4352n343L2518J2956L9793q5441k5476O7500l9087K1542O8053
$$ plain form
15793 -21445 -24900 24619 104598 165507 110574 66743 64946 24665 31655 40069 24749 80502
15781 80502 118047 9977 -42876 -40650 -77136 -160709 -137928 -93248 -46437 23374 14347 3259
15769 3259 -1217 67282 130370 49959 -25367 -83035 -163019 -137626 -66677 -27932 -34892 -26432
15757 -26432 -58846 -116949 -104125 388 39049 28879 3965 1675 -59370 -88094 -140074 -155071
15745 -155071 -135376 -104915 -54190 -5332 -52155 6870 57496 56521 -7781 -51880 -17578 11725
15733 11725 5510 -77712 -84944 365 52068 81116 144098 167510 62494 -17779 -5472 21162
15721 21162 29866 72305 100850 75359 40348 75031 66827 -3656 40934 130662 110898 165
15709 165 -55946 -11594 -16937 15581 28537 68330 -17111 -42587 24913 -14174 7368 75421
15697G5421M9392k5637l6317j3418j5826O4130L3529j2601p4862p1008K0357J914
15685d926p9282K8533K7633J5711k2141k85o7420j7732R9793K738N0530M614l4694
15672C072m3004K7484m3227q0951o061k453J00415O6423m6514Q576Q5656r3702
15660b4286n9647J5033k674L6638M7673o2481j8453Q5202K1686n3563l3240P5544
15648B7432l0318l5640Q301K2274L8941P442m2716m8876p0689L2325M1985k6406
15636g5945m1073N6596R4702Q3343J9925q6217j1785L2349l7792l6017p806P940
15624a780N9796J9270l8199l0107K1901j4881M0128J5614K5915o1536j00982N3446
15612a1415O6407n923K91l9657j5211j5137L3299J9991o5737m3229m4228J18011
$$ plain form
15697 75421 124813 99176 62859 49441 33615 97745 131274 118673 43811 -27197 -6840 -4926
15685 -4926 -84208 -55675 -28042 -12331 -34472 -34757 -102177 -119909 -20116 -17378 33152 37766 3072
15672 3072 -39932 -12448 -55675 -136626 -142687 -145140 -44725 21698 -24816 -16240 69416 -24286
15660 -24286 -83933 -68900 -71574 -34936 12737 -49744 -68197 17005 38691 -14872 -48112 27432
15648 27432 -2886 -38526 -30225 -7951 30990 38432 -4284 -53160 -123849 -91524 -49539 -75945
15636 -75945 -117018 -60422 34280 117623 137548 51331 39546 71895 34103 -1914 -9720 -1780
15624 -1780 58016 77286 39087 8980 30881 16000 56128 71742 97657 36121 -64861 -11415
15612 -11415 54992 49069 49360 9703 -5508 -20645 12654 32645 -33092 -76321 -120549 -2538
15600b538O0836K943m0987j0546K1808n6239k60J3382J2141K095K4091m7095p3937
15587i4306M3832O9602l5973k7883j3595K8818j2075L5735N7496L7210J4739M632
15575A08232J6690n5088o1930k4902l8417M6665P3338n2755k803j3618l8688K4473
15563a8803Q035l7380j2475k4430o199J00754O3543O1845j2621j9102o7014p7105
15551d0952n3298N9647K7144o4952J5641M005m1113J2557l6944l9082O7110P5184
15539a5053l6648L0343P0694o1578j05056k4482R2123L8383K4640M8441J0116
15528G1923n6380p8806K2064K6369N5502m0201n5135r1281O3363M1183p5067p4546
15516a91012l5279P4029N430J5571O0933M5553l3323O0619J6886L5922o3034n4861
$$ plain form
15600 -2538 58298 61241 20254 9708 31516 -24723 -24983 -11601 540 2635 26726 -20369 -94306
15587 -94306 -50474 19128 -16845 -44728 -58323 -29505 -41580 -5845 51651 88861 103600 108232
15575 108232 124922 69834 7904 -16998 -55415 -8750 64588 11833 9030 -4588 -43276 -18803
15563 -18803 -10768 -48148 -60623 -85053 -91252 9502 73045 134890 122269 103167 36153 -40952
15551 -40952 -94250 -34603 -7459 -72411 -56770 -52765 -93878 -81321 -118265 -157347 -90237 -15053
15539 -15053 -51701 -21358 49336 -12242 -117298 -141780 -49657 -11274 13366 61807 71923
15528 71923 15543 -63263 -41199 -14830 40672 471 -54664 -145945 -82582 -41399 -116466 -191012
15516 -191012 -226291 -152262 -146832 -131261 -70328 -24775 -58098 2521 19407 55329 -7705 -62566
15504f2566M1903K2533J4281N0342N3025N8011m7982q9221l9670k4322O216j5027
15492c2477O7015k4790l6054M187L6491j07472j6462Q2046P483q6666K7043J8977
15480f0679m0750J679k8648Q1252R7384k0480o4086J9060P029J8079j8657K1184
15468A2367m1890m4298N8403R5302l094j07243k8766J9308l4439l725J5799L4550
15456b7726j2806K7042O5067j2579k0728j4317N78M2583o0311o8036J1699L3755
15444c5779O8548j2258k2134j14344k6299R4429l674q643J10973Q1998J969r8706
15432C6080q8241M4130M9665J1098j17506q0198O4712P2829m1675r4970J6277
15421a27799P3654J0714K0259L0611M1314M2138J9455n0372m0295j2745j1308
$$ plain form
15504 -62566 -20663 1870 16151 66493 119518 177529 129547 40326 656 -23666 -17450 -32477
15492 -32477 34538 9748 -26306 -22119 14372 -93100 -109562 -27516 -20033 -106699 -79656 -60679
15480 -60679 -101429 -99750 -128398 -47146 50238 29758 -34328 -15268 -8239 9840 -8817 12367
15468 12367 -29523 -73821 -15418 79884 76790 -30453 -59219 -39911 -74350 -78075 -62276 -27726
15456 -27726 -40532 -13490 51577 38998 18270 3953 4531 47114 -13197 -81233 -69534 -35779
15444 -35779 32769 20511 -1623 -115967 -142266 -47837 -51511 -60154 50819 132817 134786 36080
15432 36080 -52161 -8031 41634 52732 -64774 -144972 -80260 -7431 -49106 -144076 -127799
15421 -127799 -54145 -43431 -23172 7439 48753 90891 110346 59974 19679 6934 -4374
15410d374r5988J134K5335R35K4791Q4958J6006m6199p2367L745m4564J5226J6163
15397g5199N4176j5381n9857J3867L3243k4792p5216K083P7144R7721k9621j14307
15385a16139R012J3596L88O1697K9630L2847n308r575m433L2193l9221M710Q8416
15372I7813q5658p214P3804m8181J4216J3372J7283m4782k9441O434K5751l2289
15360A108r484n6098L416j8941k9692K2447j4995K901J30263O9020P709l3271
15348G4383o0173K0402r581K3526P8177k7085o5783k6292j395j6299m0771j5195
15336f6086J6473p994K0872j7603M6673K7877p9326M0060N0214l0373l7593K7077
15324i729k572o8253j6027L6367k7963o0118P7472O1896P4904n697j5584R597
$$ plain form
15410 -4374 -100362 -99228 -73893 -72958 -48167 36791 52797 6598 -65769 -62024 -106588 -91362 -75199
15397 -75199 -21023 -36404 -96261 -82394 -49151 -73943 -149159 -147076 -69932 27789 -1832 -116139
15385 -116139 -107127 -93531 -93143 -31446 -1816 31031 25723 16148 11715 43908 4687 9397 97813
15372 97813 12155 4941 78745 30564 44780 58152 75435 30653 1212 7646 33397 1108
15360 1108 -8376 -64474 -61058 -79999 -109691 -87244 -102239 -99338 30925 99945 107654 74383
15348 74383 14210 34612 25031 48557 126734 99649 33866 7574 6179 -10120 -50891 -66086
15336 -66086 -49613 -57607 -36735 -54338 -7665 20212 -59114 -19054 31160 787 -36806 -9729
15324 -9729 -12301 -80554 -96581 -60214 -88177 -148295 -70823 -8927 65977 60280 44696 54293
15312E4293n3125J9056m0675k1795K9676J869k9509R911K9526l6668j0200N6610
15300H969O4997l50n6780r5160p5854J82N7188J1071K5883L6056k5358K9256J2907
15287f993K8725N7317O2992p7356n1515J7902L9269m0015p3764oQ4342n20K222
15274D2600K5107M2472k5398J9866J7325K9819P6438p7978p3628m3856m6134m1371
15262e4738N6069L12o9517P111J2684n5483J2145J4720Q8860P5244p2457p5894
15250f0944l4391J074J3978j5983J8554P2147K7754l400k0891k9590m1192M8939
15238b3945p848p2277j3595L4930O1254K7307M2573l2104j4616n625L6998m2756
15226i704M0533O0626n4957m841m034J3807j4428k7832K6491J11734L3466m0368
$$ plain form
15312 54293 1168 20224 -20451 -42246 -12570 -10701 -40210 -30299 -773 -37441 -47641 8969
15300 8969 73966 73616 16836 -78324 -154178 -153996 -96808 -85737 -59854 -23798 -49156 -19900 -6993
15287 -6993 21732 79049 142041 64685 13170 31072 70341 30326 -43438 -43444 40898 40378 42600
15274 42600 67707 110179 84781 104647 121972 151791 228229 150251 76623 32767 -13367 -54738
15262 -54738 1331 1643 -67874 -60763 -48079 -103562 -91417 -76697 12163 87407 14950 -60944
15250 -60944 -95335 -94261 -80283 -96266 -77712 -5565 22189 18789 -2102 -31692 -72884 -23945
15238 -23945 -31793 -104070 -117665 -82735 -21481 5826 48399 16295 1679 -3946 33052 -9704
15226 -9704 30829 91455 36498 31657 27623 41430 27002 -830 25661 137395 170861 130493
15214A30493j0432k1540j8364M744j5785R7562l8842p2548n1046K1977j1011n0609
15202c5401K7332J2024J15545k5363q2205p3408n2911L2142M8727m5464k8717
15191a07699N125P6887O2454J1940j3022r7597m9124M8848M4753J3847Q288J88
15179D888N8059K3794r3747m0663J0071j2787M9081j6870O6044J08200Q3567m1917
15167A97720n6070l0415Q628m580m3844j2948o571M6858N5619J5643l3165k4528
15155A12347m8098j00450O4013n9514p8197k5665m8580O0808J64486J42328J3655
15144A97133q5875p413N9267j6442R488P589n9333j12741k1872K3761J4649k5295
15132a7084L24K9847M3731j0302K1767p0930J1447O6394K3569j7076R668J224
$$ plain form
15214 130493 120061 98521 80157 84901 69116 166678 127836 55288 4242 26219 15208 -35401
15202 -35401 -8069 3955 119500 94137 11932 -61476 -114387 -82245 -33518 -78982 -107699
15191 -107699 -102574 -25687 36767 48707 35685 -61912 -111036 -62188 -17435 -3588 4700 4888
15179 4888 62947 86741 -7006 -47669 -37598 -50385 -1304 -18174 47870 156070 239637 197720
15167 197720 141650 111235 119863 115283 71439 58491 51920 98778 154397 170040 136875 112347
15155 112347 64249 -36201 27812 -31702 -109899 -135564 -184144 -123336 41150 183478 197133
15144 197133 111258 103845 163112 146670 156158 163747 104414 -8327 -30199 -6438 8211 -17084
15132 -17084 -16760 13087 56818 46516 68283 -2647 8800 75194 98763 81687 91355 92579
15120I2579o4166q7347J8391P2061n3465Q32M9351M7835k68j6088L2442k1898
15108G0259l5098r789l8495m852L4074N7608Q571p2874j0968Q2507l0602n493
15096D4848m4882J8871J32618P200p3184n699N3971N627l5287k2739n8515l4321
15084a1492N807o7998J2573k2207R6760L0034m0931r4325j596R9663M3743j8564
15072C1467m7212m3718j5838R698Q778r5274M5592R3930P286O6682N1807p3402
15060C9796M7967m3947K7758K0809L1703l6604k5186j6763l8047j3838l749L0563
15048B0462k9920k2106L2028L6561o8007p6527j3642m427k104O5967N6668J05660
15036A00613M1975p2041k9324R829L5845j5243k5956j3732O4505m0536q5232J0243
$$ plain form
15120 92579 28413 -58934 -40543 31518 -21947 -21115 28236 76071 75803 59715 92157 70259
15108 70259 35161 25372 -13123 -17975 16099 73707 82278 9404 -1564 80943 50341 44848
15096 44848 -34 18837 151455 158655 85471 79772 133743 139370 104083 81344 22829 -11492
15084 -11492 -5685 -73683 -61110 -83317 13443 43477 2546 -91779 -93375 6288 50031 31467
15072 31467 -15745 -59463 -75301 -65603 -56825 -152099 -106507 -12577 -5291 61391 113198 39796
15060 39796 87763 43816 71574 92383 124086 87482 62296 45533 7486 -6352 -10101 20462
15048 20462 -9458 -31564 464 37025 -30982 -107509 -121151 -125578 -127682 -61715 -5047 100613
15036 100613 142588 70547 41223 51052 86897 71654 45698 31966 96471 55935 -29297 -19054
15024a9054K7183J59421j0643l0434j29088m2232L9049J0333J0288n2318r04R137
15012b9262O2699r693j8307l4816j8907j090J08547M1111n1337n0887m5886R392
15000c8436J9630k2107P3462P862n7982L2339Q7917r183l8367n2304r306q239
14988a4714K1480L3936m1456l1998K0269m5791L3936J2662L8450O255m0016L914
14976c073l4896l244M6358M0883J814j3207J835l5218n5348O664O8309m6644k8377
14963e4144J2383Q8812k1637j02980j9243L2979M1175k410J394K1751J427o1504
14951f1997O2421O1743N3553k2476n8574K1947m4969l7818r143n241o1655L7019
14939f5190Q4522O213q2206n1396L5977Q3725N3646R549o6301o1118j3626K2448
$$ plain form
15024 -19054 8129 167550 156907 126473 -2615 -44847 -5798 4535 14823 -37495 -38399 -29262
15012 -29262 33437 23744 5437 -29379 -48286 -49376 59171 100282 48945 -1942 -47828 -38436
15000 -38436 -18806 -40913 32549 40411 -17571 14768 102685 93502 55135 2831 -6475 -14714
14988 -14714 6766 40702 -754 -32752 -12483 -58274 -24338 -11676 26774 33029 -6987 -3073
14976 -3073 -37969 -41213 5145 46028 47842 34635 36470 1252 -54096 -47432 20877 -25767 -54144
14963 -54144 -41761 47051 25414 -77566 -96809 -63830 -22655 -25065 -23671 -1920 -493 -61997
14951 -61997 424 62167 115720 93244 34670 56617 11648 -26170 -35313 -40554 -102209 -65190
14939 -65190 19332 25545 -56661 -108057 -72080 11645 65291 74840 8539 -52579 -66205 -43757
14927d3757O218N405J17088N0547Q280q8170k7073l4613j38002m5438M3822L6320
14915a09373M4828O0647L0484o7497n3531K4689P1194O4014L4042l8112r9132
14904c7747m8595Q5065M6779l235l3045j0815L2622k6471K6132l7092n2651k1869
14892h0922J2363P6040j357l1612J8071k774p5454n7609K8504O0750R7185P5641
14880A18826M0625n5138q8415j8110K1765Q5544L4058L2935p8417p9933J6961
14869C0701J4136O6170j2268o2129j6607j3803k0810K8819K1682K4601m8378r457
14857B657J8526k3413m8099M0428m0644O3170L4096n1608m7272l9388J9099M2075
14845c0373J923Q1121j0890L3758Q0325n0043r5202K2638k1079M1619L6536l4601
$$ plain form
14927 -43757 -37539 -32134 84954 135501 143781 55611 28538 -6075 -144077 -189515 -145693 -109373
14915 -109373 -64545 -3898 26586 -40911 -94442 -69753 1441 65455 99497 61385 -37747
14904 -37747 -86342 -1277 45502 42267 9222 -1593 31029 4558 30690 -6402 -59053 -80922
14892 -80922 -68559 7481 6124 -25488 -7417 -10191 -85645 -143254 -114750 -54000 43185 118826
14880 118826 159451 104313 15898 -2212 19553 105097 139155 172090 93673 13740 30701
14869 30701 44837 111007 98739 36610 20003 6200 -14610 14209 35891 60492 12114 2657
14857 2657 21183 -2230 -50329 -9901 -50545 12625 46721 -4887 -52159 -91547 -72448 -30373
14845 -30373 -28450 52671 41781 75539 155864 105821 10619 33257 12178 53797 90333 55732
14833E5732q5141J0252M5254P1905P1852l2553j1851m3015j19743o5663N2238
14822e0733P1644Q752m6307n8522n6638M8132o480o210K2644m1713l7442q925
14810a61798M5313j1306m7515K8838k1768P0187J07737O8513L9699M8477j02772
14799F3605k0070N1435k3303n6462O8049O6471q3128m5970m2048N0152o7355Q916
14787b9708l76k7755J16692P0741n9920r3599J3786R8013j8636j06221m1959R4727
14775A5785J69961J7936j0859q5249q5795N81N1882n6360l0659R470K0564K7173
14763D4430K7684l7845m2652o8163M9225M7320o3822m7834L9206K5354n2268M6476
14751c2889J0559j5127q001l0424o5363J09746J42235K8442P733L1816j18253
$$ plain form
14833 55732 -29409 -19157 26097 98002 169854 137301 125450 82435 -37308 -102971 -50733
14822 -50733 20911 29663 -16644 -75166 -131804 -83672 -90152 -96362 -73718 -115431 -152873 -161798
14810 -161798 -116485 -127791 -175306 -146468 -168236 -98049 9688 78201 117900 166377 63605
14799 63605 43535 94970 71667 15205 83254 149725 66597 20627 -21421 28731 -38624 -29708
14787 -29708 -30084 -57839 58853 129594 69674 -23925 -10139 87874 69238 -36983 -78942 15785
14775 15785 185746 203682 192823 107574 21779 22360 74242 17882 -12777 -3307 17257 44430
14763 44430 72114 34269 -8383 -76546 -27321 19999 -43823 -91657 -52451 -27097 -79365 -32889
14751 -32889 -22330 -37457 -45458 -75882 -141245 -31499 110736 139178 146911 178727 60474
14740F0474l5926k7572k5048m5216J2223q3175J04880J07171l8137r8458q239
14729g7023N7740K5804L73q1397k5037K9647K4793N1911j0686J2432K9019m4264
14717f688n7008l679O1941P3752M683j2540J6103m5564o1929K1276J6103K5251
14705C1701l3673L6757k922K4252j1472J7408j36465j3420R7499R7966j17321
14694i690k7706J0080M3323l7176q9260N2018J00412q7513l708n461k9146J0387
14682g3440M8081L2023j03520r593O1636l812r3810l9999J0424O1862J0350O8268
14670c1530J18868j7679n0788o678L8465M9356j5298N5753o7401j22888l3623
14659h3443Q6065P4331n000N1234J1008l8328l8660p0687r893N1394N7070J1489
$$ plain form
14740 60474 24548 -3024 -28072 -73288 -61065 -144240 -39360 67811 29674 -68784 -77023
14729 -77023 -19283 6521 6894 -74503 -99540 -69893 -45100 6811 -3875 8557 37576 -6688
14717 -6688 -63696 -67375 -5434 68318 73001 60461 76564 31000 -30929 -9653 6450 31701
14705 31701 -1972 34785 31863 56115 44643 62051 -74414 -87834 9665 107631 -9690
14694 -9690 -37396 -27316 16007 -21169 -110429 -58411 42001 -45512 -49220 -54681 -83827 -73440
14682 -73440 -25359 6664 -96856 -106449 -44813 -48625 -142435 -182434 -172010 -110148 -99798 -31530
14670 -31530 87338 69659 18871 12193 50658 100014 84716 140469 73068 -49820 -83443
14659 -83443 2622 76953 71953 123187 134195 95867 57207 -13480 -23373 28021 85091 96580
14647I6580n7140p2434J7240J358j3576l5217l427L3098K3141k5132k5836P979
14635e3366R8593r545j779k1113l8217n3114m4134O977m0329L0113P1205m7693
14623a02402l171j3293L6379l750J13496j18130j44420L5097J23406Q9797L0440
14612D3449j741L9008K5973l0309L890k6189j05007L504L1484L5104K4145J07356
14600A50667M9905J3836n5476j61043k2744k6891m3229k2710J8485K8858n5256
14589a25598J5932P9416M9333l4935K1447J16921O1228j82o9836j20840k950J6010
14577E946r59k3696M1258J02245m451o2986r0151k6990L4822R4307L5028J2763
14565A17136l3214m8984k4108J6381N5797N823l4242o5691R683Q4793o9628o3884
$$ plain form
14647 96580 39440 -32994 -15754 -14396 -27972 -63189 -66616 -33518 -10377 -35509 -61345 -53366
14635 -53366 45227 35682 33903 12790 -25427 -78541 -122675 -115698 -156027 -125914 -54709 -102402
14623 -102402 -105573 -118866 -82487 -86237 27259 -90871 -235291 -200194 -76788 13009 43449
14612 43449 41708 80716 106689 76380 80270 54081 -50926 -47422 -15938 19166 43311 150667
14600 150667 200572 214408 158932 -2111 -24855 -51746 -94975 -117685 -99200 -70342 -125598
14589 -125598 -109666 -30250 19083 -15852 5595 122516 183744 183562 113726 -7114 -10064 5946
14577 5946 4987 -18709 22549 124794 120343 57357 -32794 -59784 -24962 69345 104373 117136
14565 117136 83922 34938 10830 27211 83008 88831 54589 -11102 -1419 83374 13746 -50138
14553e0138M826O9792L1832L4535O1326k4917r8293l5993m6035m1229J5505Q8566
14541I777M5788L9824q8114m0035J7850O4880L0647j4149J6373k4068j8732j7023
14529B3018k4281l4782L4714R7397N7400p8173n2216o4676J808K2827k3841P097
14517c3708j1917O3301Q1447R8635q9696r0996l1699J2978P7516P4039l6136l0054
14505H3710o6811K1283K8370p2182j3197P0907r5586j1359L0591l1548K0549J2021
14493b3252M771r105j6715r739m2752M8765R7879K770q181n7292n5951r7047J9679
14480a46170L538q6533Q1432J05008O4702o3192q5224M696k4935m7184O9081J6481
14468a08300J3340L8239K815P1631k9438j810l516J4686l6971l8486L6307j267
$$ plain form
14553 -50138 -45312 24480 56312 90847 152173 127256 28963 -7030 -53065 -94294 -78789 9777
14541 9777 55565 95389 7275 -32760 -14910 49970 80617 66468 82841 58773 40041 23018
14529 23018 -1263 -36045 -1331 96066 153466 75293 23077 -41599 -39791 -16964 -40805 -33708
14517 -33708 -45625 17676 99123 197758 108062 17066 -14633 -1655 75861 149900 113764 83710
14505 83710 16899 38182 66552 -5630 -18827 52080 -43506 -54865 -24274 -55822 -35273 -23252
14493 -23252 -18481 -27586 -44301 -54040 -96792 -48027 49852 52622 44441 -12851 -68802 -165849 -146170
14480 -146170 -142632 -229165 -147733 -42725 21977 -41215 -126439 -121743 -146678 -193862 -124781 -108300
14468 -108300 -94960 -56721 -53906 17725 -11713 -13523 -17039 -2353 -39324 -77810 -41503 -42770
14456d2770J5439n4997l540O0249J18972l626l6197j4014j8215M685j0295L2013
14444D7704k4731o1150m1432Q7525j3716l5310j2838M852O4614J0033p4726l5303
14432h4478N755M8222Q1177j7886l6628k8098M0063p3740M9297k2194n3609M0635
14420e1484M1803j040N3720o2374K3950K4461o2197J6607M6742Q9655Q884p4089
14408E4638m7743L1914K4831r6692l6786N6373k9407j9229J0890l5060j7660K3608
14396h0323K4974Q9848N1380k6701K2962K8093q9848m2257k8468P4662Q3251k1711
14384H5862j388M4887J7736o0923j48438k6617J08446k6969j6486R458L6720j2925
14372I363K1535P800k8194m0440j847p355o7184L683J22359k5557m0370K9379
$$ plain form
14456 -42770 -27331 -82328 -85868 -25619 93353 89727 53530 39516 21301 25986 15691 47704
14444 47704 22973 -38177 -79609 7916 -5800 -41110 -53948 -49096 15518 25551 -49175 -84478
14432 -84478 -78723 -30501 50676 32790 -3838 -31936 8127 -65613 -16316 -38510 -92119 -51484
14420 -51484 -9681 -10721 42999 -19375 4575 29036 -33161 -16554 30188 119843 128727 54638
14408 54638 6895 38809 63640 -33052 -69838 -13465 -42872 -62101 -51211 -86271 -103931 -80323
14396 -80323 -55349 34499 85879 59178 82140 110233 20385 -21872 -50340 24322 107573 85862
14384 85862 84474 129361 147097 86174 -62264 -88881 19565 -7404 -23890 -14432 22288 9363
14372 9363 30898 38698 10504 -29936 -31783 -39138 -106322 -102639 19720 -5837 -46207 -16828
14360a6828K4721M6639k4990J9303M4956K9062J295l370p0727q7728L0924r943
14348a6686o1393M5627J4406o2820n8071L65N9295O3954J06569N125l9641L0600
14336H7330K7809j2550n4243m9788L1855k696K5451k5220m998p3365l1595J1239
14324g0771P7029L4950N15p4532N359L1145R907K5221n011Q306Q894M1755k2344
14311G0423j2679r463n6840Q2634J58144k5769o5653q8824j80663n7888O5276
14300a21302M5433J28583R700j3392m6295n6974k0923m786N6692M3185J5738j7460
14288A8199P3824l4313p2500K4048m2928J7431L0695K3240k8239m1621N6354L8639
14276F2829N6645k3416o9636q8052l7338O3058l3016l6754j7658M1801M4851K3619
$$ plain form
14360 -16828 7893 54532 29542 48845 93801 122863 124158 120788 50061 -37667 -6743 -16686
14348 -16686 -78079 -32452 -18046 -80866 -138937 -138572 -79277 -15323 91246 96371 56730 87330
14336 87330 115139 102589 48346 -1442 30413 27717 53168 27948 22950 -50415 -82010 -70771
14324 -70771 6258 41208 41723 -32809 -27450 3695 13602 38823 33812 42118 51012 92767 70423
14311 70423 57744 48281 -8559 74075 232219 206450 140797 51973 -128690 -186578 -121302
14300 -121302 -75869 52714 62414 49022 2727 -54247 -75170 -79956 -23264 19921 35659 18199
14288 18199 92023 57710 -14790 9258 -33670 -16239 14456 37696 9457 -32164 24190 62829
14276 62829 119474 96058 26422 -61630 -98968 -35910 -68926 -105680 -123338 -81537 -36686 -13067
14264a3067N2017J2479K078j5436J7099K6566Q769j2266l5468n8888J5000j0164
14252a1281M6414n2365O136K1490L1095Q973k8585j03476k6255K8784N0955j3831
14240d1946k2760M7746K4983k0880j7103l8717P239m8954p499K3297Q5415Q408
14228g71j725M6305P6261N0106k5607o6589j1965k124l101m4274j104M8476m0710
14215B3178q0122O015o60m642o0111O756K3995P3960R1063N7504J3330l9313j17739
14202f786p3414L6140n8840M3528K7237o3805n3759k8105j3774M1111P4260M398
14190g1809M0473p6796J2244O6609P9070O4768N0894n9117p0299m4900K3917J16325
14178A31379l9864q3710k4020R5368j108j2277M993n747L9712r510n9250j380
$$ plain form
14264 -13067 38950 51429 53507 38071 55170 81736 90505 78239 42771 -16117 -1117 -11281
14252 -11281 35133 -17232 -11096 10394 41489 50462 21877 -81599 -107854 -79070 -28115 -41946
14240 -41946 -64706 -16960 8023 -12857 -29960 -68677 -61438 -110392 -117891 -94594 -9179 -771
14228 -771 -2496 43809 120070 170176 144569 77980 66015 63891 60790 16516 15412 63888 23178
14215 23178 -56944 -50929 -51589 -56231 -116342 -109586 -85591 -11631 79432 136936 150266 110953 -6786
14202 -6786 -80200 -44060 -102900 -59372 -32135 -95940 -149699 -177804 -191578 -150467 -76207 -71809
14190 -71809 -31336 -108132 -95888 -29279 49791 114559 165453 106336 36037 -8863 15054 131379
14178 131379 91515 7805 -16215 79153 78045 65768 70761 65014 104726 95216 35966 34586
14166C4586P6994N2463k1252K9096m4467N094L6195k6015J0639l9097j08949m1338
14154c6051J4244N5245L6527k3846r744j04137k7580L5068R1367R2814l8992n9324
14142B5591O6926K6305r0290p4362J2726O9305m2920m0579J02600L2378p8891
14131H789M583k2554K619M1779k7945P8697K5406l0059J0624l2669j1682m1398
14119F190o1199j3736N2955J279R971J0962q4l0611K1463k5133k2359M4115k7824
14106c4011L6825j7055o4856l7266K314O6139R3071L4026M2145p3195m953n9026
14094a5842M3944M5584J06771L9383o6762j31295k8897j3725J5858K520M164m1619
14082c9916j542q9943j6681l9741k459M766M393J2188P0105R8591M1036j4465
$$ plain form
14166 34586 111580 164043 142791 171887 127420 132514 168709 142694 153333 114236 5287 -36051
14154 -36051 -21807 33438 69965 46119 36375 -67762 -95342 -60274 31093 123907 84915 25591
14142 25591 92517 118822 28532 -45830 -33104 36201 -6719 -47298 55302 87680 8789
14131 8789 13372 -9182 -6563 35216 7271 85968 111374 81315 91939 59270 47588 6190
14119 6190 -55009 -68745 -15790 -14511 -4540 6422 6338 -24273 -2810 -27943 -50302 -6187 -34011
14106 -34011 2814 -14241 -79097 -116363 -114049 -47910 45161 79187 121332 48137 43184 -15842
14094 -15842 28102 73686 180457 219840 153078 21783 -7114 -20839 -4981 -2461 1703 -39916
14082 -39916 -41458 -131401 -148082 -187823 -190282 -185516 -181123 -168935 -98830 -239 40797 26332
14070B6332n1078J4157N1812k7553k3926o2206L3959K2512k4380L8676J4207k3020
14058a0508K4163M9780l057p14N8488J665K3594l6653j16005l7619K1076k7490
14046e3280l0740K9945Q1029J2830k8383m6895R5982K2644M1096r4939n7720J6714
14034a1717K1616N792J6868L3733J11834J1200l4536P5602K2225n3457p9723p8869
14022D0568l0179J00560L9369n3757l6432l962M8754K5934m0680k966m5815J7195
14010E8589n2942L8240K3554M986K4178o671m9392m1727j4217o525L3344K5080
13998C6497J8475n0647m7110J1191K4832R458L3753m1797J4316j7715l6880k9696
13986g5323j3951Q2507M7704j0236m9609O047l9935j4359P2826L849n5897n8385
$$ plain form
14070 26332 -24746 -10589 41223 13670 -10256 -72462 -38503 -15991 -40371 -1695 12512 -10508
14058 -10508 13655 63435 60378 59664 118152 119817 143411 106758 -9247 -46866 -25790 -53280
14046 -53280 -84020 -54075 26954 39784 11401 -35494 60488 83132 124228 29289 -28431 -11717
14034 -11717 9899 15691 32559 66292 178126 189326 154790 230392 252617 199160 119437 40568
14022 40568 10389 110949 150318 96561 60129 56167 104921 130855 90175 87209 41394 58589
14010 58589 5647 43887 67441 72427 96605 89934 40542 -1185 -15402 -21927 11417 36497
13998 36497 54972 4325 -42785 -31594 -6762 2696 36449 -5348 8968 -8747 -45627 -75323
13986 -75323 -89274 -6767 40937 30701 -18908 -12861 -52796 -67155 5671 9520 -46377 -104762
13974a04762j4122J28012P1369k1600p8019j03644O4828M5029K213j145J5466
13963C625n4966p508J18865J34062J0489j40531r9036K3422k1628l226P5480O1186
13951A00234o3002L5041j0345k8686M6220M4757r7400n4167n0389N8850R0598
13940G1711o819J3390Q787K701K4650j8407j7596l0048m1474j4738M2706k3227
13928A1636o4940N9831K2121n3573l7351p153P8709L3566M2361K9657k0598o7062
13916B7204L0708k2772n8258k7140K5596m31j1526m3514l5822P6268J3796p7790
13904a03681l0073M85Q741k6829j5792J7448N1018R2834K4231j8836k7217J0442
13892a7229M1980Q9821J2464j7614O105m2699p911j4377K0821J9608o6758k0495
$$ plain form
13974 -104762 -118884 9128 80497 58897 -19122 -122766 -57938 -12909 -10696 -11841 3625
13963 3625 -51341 -58849 60016 194078 204567 64036 -35000 -11578 -33206 -36432 39048 100234
13951 100234 37232 72273 61928 33242 79462 124219 26819 -27348 -77737 -18887 71711
13940 71711 64892 78282 87069 89770 114420 96013 78417 48369 6895 -7843 34863 11636
13928 11636 -53304 6527 28648 -24925 -62276 -69429 9280 42846 85207 114864 94266 27204
13916 27204 57912 35140 -23118 -50258 -24662 -25093 -36619 -80133 -115955 -39687 -25891 -103681
13904 -103681 -133754 -133269 -124528 -151357 -167149 -149701 -98683 -5849 18382 -454 -27671 -17229
13892 -17229 24751 114572 127036 109422 115527 72828 64917 50540 71361 90969 24211 3716
13880C716k61J2344M8603N898k6365k9336m7325L8506Q3892P9898L5963n6830
13868A48703m2881m9521p8123l0003J061m5745N0838L3352M9618N6251k2230O75
13856G1995K4821J04038k8797j3168J6934n2915j10600k7311L1164J9009l4888
13845B82k7469M7703K994K0926J9011p298j07593M5818M9643k7297J0424k3704
13833C440Q2313n57q8248j3000n2261k5667O0609k781l9999K9463j6535k3579
13821h6802j6372Q1796Q8507p0646o9949N4259N014n6568K8087O0274o040K9761
13809D1321l7928m8775L8146N149p183M6267k1623l3913L2123M2588J9589j3662
13797F2099P153J473K201q5578j2555N3089P984n5114l0339m42M189Q3109j5467
$$ plain form
13880 3716 3455 15799 64402 70300 43935 14599 -32726 5780 89672 169570 205533 148703
13868 148703 105822 56301 -21822 -51825 -50764 -96509 -45671 -12319 37299 93550 71320 71995
13856 71995 96816 200854 172057 158889 175823 122908 12308 -15003 16161 35170 282
13845 282 -27187 20516 23510 44436 63447 56149 -51444 -5626 44017 16720 27144 3440
13833 3440 85753 85196 -3052 -16052 -68313 -93980 -33371 -36152 -76151 -46688 -63223 -86802
13821 -86802 -103174 -21378 67129 -3517 -73466 -19207 -14193 -70761 -42674 17600 11560 41321
13809 41321 3393 -45382 -7236 -2087 -9270 36997 15374 -18539 13584 56172 75761 62099
13797 62099 69252 70725 72926 -12652 -25207 27882 35866 -19248 -49587 -50029 -45840 37269 21802
13784B1802l6891n5484j1848j8238j665N8047k1274p572j6540N1996J19686o0135
13772B1884p0222L0967L8959o0586O2673k6188q9501l023J9296N8722n4424J0157
13760f1286L0308j1967p3024m7783Q1409O6277k6921o3287M4376j3681n138L5280
13748d5437N78j2268L1135Q5007j83p2587p5133L6495N7075k6761q8267q8404
13736a98750N3634P5341p50K2389N2303o4020j4189J5228k9451J9251K3768J5978
13724b9268L0703M2751k7817n9928k0857J5102n6129k3768L1785k1311j5958K9289
13712a05406Q411J5282K8653N6173Q1142K597k977n0952k4241J7829o412Q5459
13700A05558J1410p6889K4155R0675k784n7452p1882o8284K5246K6020o2882p2320
$$ plain form
13784 21802 -15089 -70573 -82421 -100659 -102324 -44277 -65551 -73123 -89663 -37667 82019 21884
13772 21884 -48338 -17371 21588 -38998 23675 -2513 -92014 -95037 -75741 -17019 -71443 -61286
13760 -61286 -30978 -42945 -115969 -163752 -82343 -16066 -42987 -106274 -61898 -75579 -80717 -45437
13748 -45437 -44859 -57127 -25992 59015 58832 -13755 -88888 -52393 4682 -22079 -110346 -198750
13736 -198750 -145116 -69775 -70525 -48136 4167 -59853 -74042 -58814 -88265 -69014 -45246 -29268
13724 -29268 1435 44186 16369 -43559 -64416 -49314 -105443 -129211 -97426 -118737 -134695 -105406
13712 -105406 -96995 -81713 -53060 3113 84255 86852 83875 32923 8682 26511 20099 105558
13700 105558 116968 40079 64234 154909 152125 94673 22791 -45493 -20247 5773 -57109 -129429
13688a29429M1479N6866K9156l8689l031k8232J321K1390K9523M8068l6766K931
13676e413R368N8132l4713p2731M5811l0227J236M9811L7986O369o6702K0116
13664A9043P5189J763j889n9982J6269o4926k2888l0432l1002L9504L0601M4002
13652A5252J8701k8755m136k6662J765k2656j5551m9668k3162K778j1561M8955
13640i4700j02171l2433N3153Q0932P0191K4573q783j0751J02839j02309o3622
13629h3081L4264M5890Q2891j4987o3525j8435M012J2166j7530L4433K946o070
13617A2974J7543m2356j7560L0245K8497l9669j0050m379j8362r1637O516N769
13605a22469L42J41820L057l5171m9690m1076J9497j0882j2636K9982Q5754J899
$$ plain form
13688 -129429 -87950 -31084 -1928 -40617 -43648 -71880 -70559 -49169 -19646 28422 -8344 -5413
13676 -5413 3955 62087 27374 -45357 454 -29773 -28537 21274 59260 65629 -1073 19043
13664 19043 94232 95995 94106 34124 50393 -14533 -37421 -67853 -98855 -59351 -28750 15252
13652 15252 33953 5198 1062 -25600 -23835 -46491 -62042 -111710 -134872 -132094 -143655 -94700
13640 -94700 -196871 -229304 -176151 -95219 -25028 -455 -9238 -19989 82850 -19459 -83081
13629 -83081 -48817 -2927 79964 64977 1452 -16983 -12971 -805 -18335 16098 19044 12974
13617 12974 30517 -11839 -29399 846 29343 -10326 -20376 -24755 -43117 -134754 -128238 -122469
13605 -122469 -122127 19693 22750 -12421 -62111 -103187 -83690 -94572 -107208 -77226 8528 10427
13593A0427k6843N3786m4746p0071L1176k303j0136O856k2321l5024m9263L6511
13581a21951M3177r4723J5071L827O2358J03031l7608K2155Q1215N0478M0764
13570A67794k6320k6052l2229o7720k1462j7877P1015R8655L0312m4527k4400
13559A07189l8051n6823l4100K5397J9162l9693o8265o2866L0238O9242R6458
13548D7888J16189N0235j44712n1277R24o3495k7365j6796K5273N4198j0156l8042
13536e7136J2787N9765l1556N323j324j13836k7131N9236K7276J7649L4665K3878
13524I596M0766O0473n7021q1833p65L4421J4435J2627m467o5831n4686K6712
13512f5573J90482l6049p6441l5062N418Q5914L6525M794r5216P332l507N9073
$$ plain form
13593 10427 -16416 37370 -7376 -77447 -46271 -48574 -58710 -51854 -74175 -109199 -158462 -121951
13581 -121951 -78774 -173497 -158426 -154599 -92241 10790 -26818 -4663 76552 127030 167794
13570 167794 141474 115422 83193 15473 -5989 -23866 47149 145804 176116 131589 107189
13559 107189 69138 12315 -21785 3612 22774 -16919 -85184 -148050 -117812 -48570 47888
13548 47888 164077 214312 69600 18323 19247 -44248 -71613 -88409 -63136 -8938 -19094 -57136
13536 -57136 -44349 15416 -16140 -10817 -12141 -125977 -153108 -93872 -66596 -48947 -14282 9596
13524 9596 50362 110835 53814 -28019 -28784 5637 20072 32699 28232 -37599 -92285 -65573
13512 -65573 124909 88860 12419 -22643 -17225 68689 105214 110008 14792 22124 18617 77690
13500G7690N8396K9686m3406k5140L3527j07071n8205L7523M3392l2527m1095
13489b7230Q30m180o6271k8456J02111K7450m1776k7892K4194O7901j5102R859
13477B1438l2738j08956K1123K8433k7057j9706j8451l0444L3718P9216J9294
13466c4130j5584J1332O981M4638L5893J0044j3954k8297k4503o6613n5041K5956
13454a03278p025J2694m0642o0432Q0230P1907l1517n7815k3186L1080J5852M3950
13442f8182m0407J2708N8247L4498N5835J3516K5681M2005k0194r6900m6254l7875
13430f7322l1117O9474L8877J2591J7218K7885m0429K6989m3084j04845M931J20055
13418C1223R0842m2234o4892m7946K3766L2910K5320L866r750l3423m6934M7412
$$ plain form
13500 77690 136086 165772 122366 97226 130753 23682 -34523 3000 46392 13865 -27230
13489 -27230 -26400 -30580 -96851 -125307 -23196 4254 -37522 -65414 -41220 26681 11579 21438
13477 21438 -11300 -120256 -99133 -70700 -97757 -117463 -135914 -166358 -132640 -53424 -34130
13466 -34130 -49714 -38382 -31401 13237 49130 59174 45220 16923 -7580 -74193 -129234 -103278
13454 -103278 -110303 -97609 -138251 -198683 -118453 -46546 -78063 -135878 -159064 -127984 -112132 -68182
13442 -68182 -108589 -95881 -37634 -3136 52699 66215 91896 133901 113707 16807 -29447 -67322
13430 -67322 -98439 -28965 9912 22503 39721 67606 27177 54166 11082 -93763 -88832 31223
13418 31223 122065 79831 14939 -33007 -9241 23669 48989 52855 43105 9682 -37252 10160
13406A0160K9414L3200L2821j8513M5239l1125j49140r3503M3978O9113P332l7527
13394e8551j22881J0560K5776j1164P0434R1972M6193J6644q0496L2462n7411
13383c6462m7110j13536M0069P6503N2007l6549q0159j6496L924N7580J11924
13372A1695J3107q2025k1906P8923N5908o8859m48J0068R432m9739o6793O3798
13360d6839L1768j7655j9021P8898N0795m2990K9382J7695O3834J7251l7539o5074
13348F0505m5028o1165m2282m956N5274L3856k9590O573M086M4595l416r3103
13336g4651O102O5739l9456M1846N022o3594n938k1774l3737M5447O1502K8034
13324A4542M5261Q165r5026K7957l4676o4423o3279J7086Q1171j6072j2805R05
$$ plain form
13406 10160 39574 72774 105595 87082 132321 101196 -47944 -141447 -97469 -28356 -21024 -58551
13394 -58551 -181432 -170872 -145096 -156260 -85826 6146 52339 68983 -11513 20949 -36462
13383 -36462 -83572 -197108 -157039 -80536 -28529 -65078 -145237 -161733 -157809 -100229 11695
13372 11695 24802 -57223 -79129 -206 55702 -13157 -13605 -3537 5895 -43844 -110637 -46839
13360 -46839 -15071 -32726 -51747 27151 77946 34956 64338 82033 145867 163118 125579 60505
13348 60505 15477 -45688 -87970 -92926 -37652 -3796 -33386 -26813 -22727 21868 18452 -74651
13336 -74651 -68549 -2810 -42266 -420 4602 -58992 -64930 -86704 -120441 -74994 -13492 14542
13324 14542 59803 67968 -27058 899 -33777 -98200 -161479 -144393 -63222 -79294 -92099 -91194
13312i1194K3518k6813P2885J07012J3988k8133n2945r3578r452o9198M892M4126
13300a04892N4078K334j4010r907N0436m9612l3136L4636L0110n1205p446M4296
13288e4318L8995O4655n1681l765p214j4097j5983K2135q34j2049n6030O5334
13276b4852M9684R445R928k910k0428m9719L5082n7159k3943N680k821L3041K1617
13263a7355M3048l6118N9515j3776j8831m0523o4488K5468l4116p1730L4791K7337
13251a06778M2048Q6548N8934m2912l1319k4974k1286M5462P12r9754n5025j3095
13239a61439j1862P8813Q9527N4251k24O1144j1966q300l878l8597p2002L5893
13227A1360R920j76J08614j2997j1775j3171M2247p3491r6669l8832K7019k106
$$ plain form
13312 -91194 -67676 -94489 -21604 85408 99396 71263 18318 -75260 -84712 -153910 -149018 -104892
13300 -104892 -50814 -48480 -62490 -72397 -21961 -71573 -104709 -70073 -39963 -91168 -98614 -54318
13288 -54318 -15323 49332 -2349 -6114 -13328 -27425 -43408 -21273 -22107 -34156 -90186 -24852
13276 -24852 24832 34277 44205 41295 20867 -28852 6230 -50929 -74872 -69192 -72013 -38972 -17355
13263 -17355 25693 -10425 49090 35314 16483 -24040 -88528 -63060 -97176 -168906 -134115 -106778
13251 -106778 -64730 21818 80752 37840 6521 -18453 -39739 5723 6435 -93319 -148344 -161439
13239 -161439 -173301 -94488 -4961 49290 49066 110210 98244 89944 86066 47469 -24533 11360
13227 11360 21280 21104 129718 116721 104946 91775 134022 60531 -36138 -74970 -47951 -50057
$$ [...]
##END NTUPLES=NMR SPECTRUM
##END=
