##TITLE=Analysis number 319493
Compound Code cc 46219
Book Reference 440/188
Project Code adrs
Chemist Name craigr
##JCAMPDX= 6.0         $$ Bruker NMR JCAMP-DX V2.0
##DATA TYPE= NMR SPECTRUM
##DATA CLASS= NTUPLES
##ORIGIN= Bruker BioSpin GmbH
##OWNER= nmr
$$ XWIN-NMR		Version 3.5
$$ Wed May 17 10:19:28 2006 GMT Daylight Time (UT+1h)  MAYBRIDGE\nmr@NMR_250MHZ
##.OBSERVE FREQUENCY= 250.131544655141
##.OBSERVE NUCLEUS= ^1H
##.ACQUISITION MODE= SIMULTANEOUS (DQD)
##.ACQUISITION SCHEME= undefined
##.AVERAGES= 16
##.DIGITISER RES= 18
##SPECTROMETER/DATA SYSTEM= dpx250
##.PULSE SEQUENCE= zg30
##.SOLVENT NAME= CDCl3
##.SHIFT REFERENCE= (INTERNAL, CDCl3, 0, 16.522)
##AUDIT TRAIL= $$ (NUMBER, WHEN, WHO, WHERE, WHAT)
$$ ##TITLE= Audit trail, XWIN-NMR		Version 3.5
$$ ##JCAMPDX= 5.01
$$ ##ORIGIN= Bruker BioSpin GmbH
$$ ##OWNER= nmr
$$ C:\u/data/dgb/nmr/ADRS/4540/pdata/1/auditp.txt
$$ ##AUDIT TRAIL=  $$ (NUMBER, WHEN, WHO, WHERE, WHAT)
(   1,<2006-05-17 10:19:05.63 +100>,<MAYBRIDGE\nmr>,<NMR_250MHZ>,
      <created by zg, POWCHK disabled, PULCHK disabled
       configuration hash MD5:
       84 BC 41 DB A1 6E 1D 46 DA 25 12 A5 C1 ED C5 3A
       data hash MD5: 64K
       CB F0 0B 39 13 86 A3 C2 77 0C E6 78 EC 16 B9 81>)
(   2,<2006-05-17 10:19:18.29 +100>,<MAYBRIDGE\nmr>,<NMR_250MHZ>,
      <Start of raw data processing
       ef LB = 0.3 FT_mod = 6 PKNL = 1 SI = 32K 
       data hash MD5: 32K
       9A F7 71 BC EE 3F 22 CA 1B 67 4D 43 37 2D 1D 35>)
(   3,<2006-05-17 10:19:20.24 +100>,<MAYBRIDGE\nmr>,<NMR_250MHZ>,
      <apk 
       data hash MD5: 32K
       81 C8 57 ED 13 32 57 F3 3A 5B F7 F3 5E 06 45 91>)
(   4,<2006-05-17 10:19:21.06 +100>,<MAYBRIDGE\nmr>,<NMR_250MHZ>,
      <abs ABSG = 5 
       data hash MD5: 32K
       FF C3 33 8D 9E 31 61 8E 5C 1E F1 A4 EA 4E 52 BE>)
$$ ##END=
$$ 
$$ hash MD5
$$ 3B DE 64 D0 4F A5 1E 87 EF A3 74 90 E5 90 B4 7A
##$RELAX= 
##$RELAX= 
##$RELAX= 
##$RELAX= 
##$RELAX= 
##$RELAX= 
##$RELAX= 
$$ Bruker specific parameters
$$ --------------------------
##$DU= <C:\u>
##$EXPNO= 4540
##$NAME= <ADRS>
##$PROCNO= 1
##$TYPE= <nmr>
##$USER= <dgb>
##$AMP= (0..31)
100 100 100 100 100 100 100 100 100 100 100 100 100 100 100 100 100 100 
100 100 100 100 100 100 100 100 100 100 100 100 100 100 
##$AQSEQ= 0
##$AQ_mod= 3
##$AUNM= <au_zg>
##$AUTOPOS= <9 >
##$BF1= 250.13
##$BF2= 250.13
##$BF3= 250.13
##$BF4= 250.13
##$BF5= 500.13
##$BF6= 500.13
##$BF7= 500.13
##$BF8= 500.13
##$BYTORDA= 1
##$CFDGTYP= 0
##$CFRGTYP= 5
##$CHEMSTR= <none>
##$CNST= (0..31)
1 1 145 1 1 1 1 1 1 1 1 1 1 1 1 1 1 1 1 1 1 1 1 1 1 1 1 1 1 1 1 1 
##$CPDPRG= <>
##$CPDPRG1= <>
##$CPDPRG2= <>
##$CPDPRG3= <>
##$CPDPRG4= <mlev>
##$CPDPRG5= <mlev>
##$CPDPRG6= <mlev>
##$CPDPRG7= <mlev>
##$CPDPRG8= <mlev>
##$CPDPRGB= <>
##$CPDPRGT= <>
##$D= (0..31)
0 1 0 0 0 0 0 0 0 0.06 0 0 0 0 0 0 0.0002 0 0 0 0 0 0 0 0 0 0 0 0 0 0 
0 
##$DATE= 1147857544
##$DBL= (0..7)
120 120 120 120 120 120 120 120 
##$DBP= (0..7)
150 150 150 150 150 150 150 150 
##$DBP07= 0
##$DBPNAM0= <>
##$DBPNAM1= <>
$$ [...]
##$SUBNAM7= <"">
##$SUBNAM8= <"">
##$SUBNAM9= <"">
##$SW= 20.6930455092707
##$SWIBOX= (0..15)
0 0 3 0 0 0 0 0 0 0 0 0 0 0 0 0 
##$SW_h= 5175.983436853
##$TD= 65536
##$TD0= 1
##$TE= 295.16
##$TE2= 300
##$TE3= 300
##$TEG= 300
##$TL= (0..7)
0 120 120 120 120 120 120 120 
##$TP= (0..7)
150 150 150 150 150 150 150 150 
##$TP07= 0
##$TPNAME0= <>
##$TPNAME1= <>
##$TPNAME2= <>
##$TPNAME3= <>
##$TPNAME4= <>
##$TPNAME5= <>
##$TPNAME6= <>
##$TPNAME7= <>
##$TPOAL= (0..7)
0.5 0.5 0.5 0.5 0.5 0.5 0.5 0.5 
##$TPOFFS= (0..7)
0 0 0 0 0 0 0 0 
##$TUNHIN= 0
##$TUNHOUT= 0
##$TUNXOUT= 0
##$USERA1= <user>
##$USERA2= <user>
##$USERA3= <user>
##$USERA4= <user>
##$USERA5= <user>
##$V9= 5
##$VALIST= <valist>
##$VCLIST= <CCCCCCCCCCCCCCC>
##$VD= 0
##$VDLIST= <DDDDDDDDDDDDDDD>
##$VPLIST= <PPPPPPPPPPPPPPP>
##$VTLIST= <TTTTTTTTTTTTTTT>
##$WBST= 1024
##$WBSW= 4
##$XGAIN= (0..3)
0 0 0 0 
##$XL= 0
##$YL= 0
##$YMAX_a= 407867
##$YMIN_a= -532008
##$ZGOPTNS= <>
##$ZL1= 120
##$ZL2= 120
##$ZL3= 120
##$ZL4= 120
##$ABSF1= 16.522
##$ABSF2= -4.171173
##$ABSG= 5
##$ABSL= 3
##$ALPHA= 0
##$AQORDER= 0
##$ASSFAC= 0
##$ASSFACI= 0
##$ASSFACX= 0
##$ASSWID= 0
##$AUNMP= <proc_1d>
##$AZFE= 0.1
##$AZFW= 0.1
##$BCFW= 0
##$BC_mod= 0
##$BYTORDP= 0
##$COROFFS= 0
##$CY= 12.5
##$DATMOD= 1
##$DC= 0
##$DFILT= <>
##$DTYPP= 0
##$F1P= 14.0000005364418
##$F2P= -0.99999901652339
##$FCOR= 0.5
##$FTSIZE= 32768
##$FT_mod= 6
##$GAMMA= 0
##$GB= 0
##$INTBC= 1
##$INTSCL= 1
##$ISEN= 128
##$LB= 0.3
##$LEV0= 0
##$LPBIN= 0
##$MAXI= 10000
##$MC2= 0
##$MEAN= 0
##$ME_mod= 0
##$MI= 0
##$NCOEF= 0
##$NC_proc= -5
##$NLEV= 6
##$NOISF1= 0
##$NOISF2= 0
##$NSP= 0
##$NTH_PI= 0
##$NZP= 0
##$OFFSET= 16.522
##$PC= 1
##$PHC0= 169.5765
##$PHC1= -5.020176
##$PH_mod= 1
##$PKNL= yes
##$PPARMOD= 0
##$PSCAL= 4
##$PSIGN= 0
##$REVERSE= no
##$SF= 250.13
##$SI= 32768
##$SIGF1= 0
##$SIGF2= 0
##$SINO= 400
##$SIOLD= 32768
##$SREGLST= <1H.CDCl3>
##$SSB= 0
##$STSI= 32768
##$STSR= 0
##$SW_p= 5175.98343685301
##$SYMM= 0
##$S_DEV= 0
##$TDeff= 65536
##$TDoff= 0
##$TI= <Analysis number 999999
Compound Code 99
Book Reference 9
Project Code 9>
##$TILT= no
##$TM1= 0
##$TM2= 0
##$TOPLEV= 0
##$USERP1= <user>
##$USERP2= <user>
##$USERP3= <user>
##$USERP4= <user>
##$USERP5= <user>
##$WDW= 1
##$XDIM= 32768
##$YMAX_p= 453889237
##$YMIN_p= -299666
$$ End of Bruker specific parameters
$$ ---------------------------------
##NTUPLES= NMR SPECTRUM
##VAR_NAME=  FREQUENCY,     SPECTRUM/REAL,   SPECTRUM/IMAG
##SYMBOL=    X,             R,               I
##VAR_TYPE=  INDEPENDENT,   DEPENDENT,       DEPENDENT
##VAR_FORM=  AFFN,          ASDF,            ASDF
##VAR_DIM=   32768,         32768,           32768
##UNITS=     HZ,            ARBITRARY UNITS, ARBITRARY UNITS
##FACTOR=    0.157963299565203, 1,           1
##FIRST=     4132.6476996994, 0,             0
##LAST=      -1043.33573715361, 0,           0
##MIN=       -1043.33573715361, -299666,     0
##MAX=       4132.6476996994, 453889237,     0
$$ Real data points
##PAGE= N=1
##DATA TABLE= (X++(R..R)), XYDATA
$$ [...]
27866 -62044 1835 46302 97257 88939 59609 147292 111964 59747 -25165 -31215 -6892 26330
27854 26330 45511 22127 -25296 31250 54710 64238 22849 88061 88502 -22710 -39636 -73287
27842 -73287 -133438 -28623 -39409 -96369 -107932 -125229 -33064 -55584 -37867 -24713 -86913
27831 -86913 -123619 -184028 -131525 -54039 -13803 97263 230619 283210 271463 190584 128199
27820 128199 53471 -8253 -22625 -55964 -102879 -112074 -68077 -22222 -21079 -47820 -48458 -228
27808 -228 -8756 1448 21799 105963 173655 143633 85528 101215 111242 36673 190 78985
27796 78985 72330 26303 -24468 -7267 20271 35907 -14533 31752 102777 19011 -13425 43191
27784 43191 48580 104244 40700 -9795 -65428 -108917 -81121 -84864 3052 46718 -11006 18118
27772 18118 106654 83768 -9628 -31492 16145 94409 40206 -25282 -52226 -5591 -37115 -32634
27760 -32634 -555 20506 23516 -40346 -72278 -90947 -84103 -64732 -53360 7712 11333 -63420
27748 -63420 7727 44975 -38109 -75648 -48306 21658 16997 -19854 -34021 -62023 -46181 -9002
27736 -9002 14366 -3500 -56438 -20539 -60528 -13446 -8103 260 11100 23441 72322 73810
27724 73810 47169 65730 134300 148408 129984 134175 182913 135068 82918 102334 26417 -43894
27712 -43894 -1788 67011 73427 85777 91801 72260 49751 -6699 -14109 54201 88457 133746
27700 133746 135095 84815 62935 53278 75274 93052 132547 56803 -20442 -43541 -59847 -35068
27688 -35068 -11749 -36594 -95458 -57402 -16563 -44983 -38396 -16173 8998 5334 -14757 -13458
27676 -13458 -24056 -37309 -47014 -35058 -12691 1376 76556 76631 30670 15754 26216 75329
27664 75329 123472 129219 124559 25304 -10270 2951 38385 -633 -23748 -55778 11300 112641
27652 112641 108501 97699 106239 32705 15253 -23570 -89608 -63375 260 56989 107139 132556
27640 132556 135815 102223 115998 40878 48128 7254 13742 60532 84240 98284 20539 -23223
27628 -23223 53548 88053 44678 116730 98124 12885 -27057 44060 59545 91723 137724 168387
27616 168387 180701 82832 81785 40461 23698 72527 113166 101653 10885 9799 67224 154991
27604 154991 121395 117734 80706 12070 14394 16476 -21008 -55277 18159 111038 190102 168168
27592 168168 76346 38285 15246 -31123 13265 -21992 -56579 -88674 -18846 84554 99824
27581 99824 137504 84630 33673 60371 132224 76903 39601 65 -41097 -255 -8974 16583
27569 16583 92575 136136 103520 23291 -25764 1872 11480 22271 32735 -3321 -28520 -38448
27557 -38448 -7454 69177 28342 79838 157537 152371 100558 56089 69632 34501 -50083 12256
27545 12256 71256 107475 93006 66545 76110 42273 4572 -30524 -84300 -100295 -136838 -86065
27533 -86065 -3613 9152 -34697 -60807 -119335 -39545 41888 80979 98495 62120 90139 152782
27521 152782 160374 69191 47241 -6554 -3061 60066 87666 50486 77083 87376 76798 25674
27509 25674 -10627 -3403 16171 -29354 29490 69146 75560 72401 19587 -10050 -38597 -40130
27497 -40130 -84080 -43390 -39052 -4054 3348 -20536 14419 164496 138445 92215 20263 -2498
27485 -2498 20852 2647 -1538 -50132 -31836 -17782 -47107 -94600 21673 67352 -35017 -77366
27473 -77366 -107401 -78089 59079 107543 146348 149548 140092 120510 124996 79415 -4754 -3442
27461 -3442 -43047 -19179 38197 79830 33118 -45524 -32120 6960 11014 -22489 246 19752
27449 19752 4311 18716 69754 87274 71381 58906 83745 132141 86754 39126 41107 100442
27437 100442 24135 32433 87599 106220 63509 42630 2912 14634 53033 41979 23273 -16463
27425 -16463 -17361 -36792 -900 14074 19868 46949 94551 129710 117686 56949 24497 -3570
27413 -3570 -47065 -70890 15200 105901 134651 139789 136891 18966 36653 113789 79012 37514
27401 37514 92486 74103 20527 4568 -33335 3248 -18243 8826 -15240 -71457 -80984 -68664
27389 -68664 34214 75561 79010 23119 -8000 68139 109731 90663 73161 10441 54521 36138
27377 36138 8431 58701 30420 -29379 23445 36981 492 31618 -6446 -45618 -63598 -8551
27365 -8551 70782 58622 12953 17404 19482 -8869 25187 122248 180722 146596 99684 123901
27353 123901 108548 13551 -31921 9312 -5198 20833 37332 -44196 -47342 -67618 -25867 88385
27341 88385 39462 -13552 7874 19575 5833 55175 99915 27615 5493 42721 56314 57885
27329 57885 -14815 -4788 94922 73586 -2022 12210 38491 4772 -45638 -45359 -121895 -130981
27317 -130981 -65283 -47628 -42621 -6203 38639 105647 60194 -746 -24377 -12282 69961 118248
27305 118248 135869 102845 43777 -53729 -45449 -12899 26703 80282 56591 26290 13697 -15641
27293 -15641 -5544 -2205 -48561 -62428 -8259 4783 -48451 -31662 38811 54618 32127 27840
27281 27840 34114 27488 -49744 -117171 -121414 -108616 -61568 -71552 -12380 25670 6237 27958
27269 27958 28495 -38324 -81409 -16178 -1445 77522 137183 111682 28000 55741 133837 171765
27257 171765 92805 -29154 -96983 -56116 -36873 -50222 -93538 -79798 -28188 -14181 26483
27246 26483 90481 127775 151625 172754 123135 -12506 -113724 -141282 -177699 -161304 -150543
27235 -150543 -98724 -47233 -13873 -30977 -37548 44688 96044 133162 161753 149872 110985 57270
27223 57270 104124 50363 -74798 -87580 -44872 -101 -12005 -23350 136050 123290 48561
27212 48561 66864 205740 211862 112851 47938 55932 12056 -31404 -52694 -36497 45348 64865
27200 64865 3244 -34731 -81381 -74317 12944 11181 -28106 -46889 -90413 -26986 22542 22305
27188 22305 -676 23738 -9663 -31795 40662 74546 50835 -10489 -105648 -63346 -10236 45766
27176 45766 131000 208902 245121 179486 76490 36690 72381 15725 26948 -5766 -37038
27165 -37038 -16391 42316 78941 136671 134872 62011 73707 77537 46456 24534 65289 54012
27153 54012 25236 39475 -1160 52691 169234 126632 35276 -2226 31915 154874 182843
27142 182843 181388 159504 91710 91826 121757 88766 47470 67879 24476 -30938 -77633 -2126
27130 -2126 36023 45201 33944 34694 17662 61202 76628 141397 217732 130174 42250 8103
27118 8103 -38667 38694 77021 76649 46892 16660 16338 -5215 -14295 9425 35350 54980 2812
27105 2812 -123684 -129696 -25777 -39864 -8139 24340 29617 -20701 -109807 -84911 -87793 -40685
27093 -40685 -78802 -96281 -45229 -18335 -79065 -12838 56788 47727 -21987 -44835 -11621 -29673
27081 -29673 -62868 -89078 -84601 10410 11267 10617 -29920 -8077 23284 -3156 38870 44908 52639
27068 52639 -4620 34421 62024 -20959 -88712 -106144 -98370 -14289 74205 106782 33477 44837
27056 44837 14275 85087 62852 75538 116731 132539 90184 40594 34255 21182 -33868 -122072
27044 -122072 -149265 -83441 -64188 -35666 -20289 -42090 -44657 -62230 -9912 76631 85860 64828
27032 64828 88242 95230 59899 26291 18924 17605 48735 -12574 -17778 -7089 4133 -23829
27020 -23829 -51804 -30810 4307 91361 112330 99472 114344 97144 68822 29532 17007 -29379
27008 -29379 -74699 -63750 -36289 29468 111751 129036 135329 106287 51751 52924 70563 15526
26996 15526 -15102 -37942 -10255 32371 44626 43125 12716 -39845 2795 -13346 -63307 -74747
26984 -74747 -62493 -112029 -117595 -87265 -98469 -83600 -26395 13092 60398 126369 123965 32573
26972 32573 30061 7495 -14355 21470 46288 100383 54578 42956 -6198 -62134 -105499 -71259
26960 -71259 4577 89134 81892 76654 36707 15399 -25004 -44657 -72408 -55548 -67404 -39989
26948 -39989 -12178 33481 -20030 -1357 13874 -81835 -27360 27971 -47033 -84681 -31964 -70395
26936 -70395 -40750 21671 12805 77864 65015 25021 117 2336 -53389 -33859 59424 69596
26924 69596 46608 51711 6611 -52658 -78013 -91365 -93329 -73489 -22161 46564 73309 161942
26912 161942 201047 100349 30753 15336 -40671 -82625 -20068 -18902 -16822 -68415 -87985 -87906
26900 -87906 -87092 -109967 -86543 -11540 22283 57859 86406 86700 81405 109237 3739 -39439
26888 -39439 66462 88219 33250 5925 -33363 -21532 1957 2860 -17988 60002 123091 37607
26876 37607 -26368 37557 4690 -63153 -45201 55008 80436 38139 32403 49172 11404 -22394
26864 -22394 -92308 -93194 -29331 -38344 -24248 -4480 -51190 -70821 -27319 51050 45144 -7152
26852 -7152 -18984 -92506 -106279 -64376 -55524 -78667 -27453 -1496 -48771 -64534 -28906 -5642
26840 -5642 22843 24262 -20323 -55682 -42542 62648 77622 53733 -23025 -951 61877 95071
26828 95071 36199 21222 35454 4113 -4773 -19595 -7878 11748 27302 -18498 -69162 -81180
26816 -81180 -131475 -109109 79564 95261 79793 62459 -7179 8755 50932 29097 18669
26805 18669 19625 -54204 -84164 -1155 25724 36506 138989 126971 6330 -21472 17599 8263
26793 8263 12966 59210 28909 52900 106736 13736 30664 105933 86855 40946 -16616 -35660
26781 -35660 -38076 37064 37323 -34504 -5038 25611 48357 2701 -32768 -66749 -15416 -17931
26769 -17931 -28545 19045 70624 23387 33824 27399 14002 -6737 -38574 -178 53596 127331
26757 127331 156500 72438 -4191 24793 43489 22828 13353 18374 58514 43380 65555 86190
26745 86190 56933 -3146 -158975 -163599 -184478 -129866 -72173 -4919 11529 49287 -5125 -22835
26733 -22835 -44421 -97751 -131360 -80594 -74787 -42941 -59667 -48387 -56836 -73654 -60386 38407
26721 38407 107140 109118 61449 -83273 -121798 -62785 -47731 -50696 -34765 29153 -26090 -76118
26709 -76118 -73568 -57015 -15640 -31622 13346 15452 -2203 -87442 -81455 -82986 -74262 -75657 -15388
26696 -15388 -454 9032 117698 180140 149493 102113 157371 158017 94661 45926 117526 96835
26684 96835 69134 6397 50554 118909 129844 85055 -3778 -23996 13321 27274 75127 49791
26672 49791 12241 9383 -5043 -65178 -22560 -49922 -123054 -174799 -116946 -78327 10317 85161
26660 85161 96185 64922 85829 107575 75860 68007 144433 110750 129266 153448 117275 53751
26648 53751 71122 152937 163970 22570 -11559 4222 53394 67475 76278 87831 25612 -28864
26636 -28864 21417 23511 79160 74433 25477 44214 95259 92928 57578 45480 61135 32096
26624 32096 52735 104240 57675 52322 106478 95720 2754 -13070 35225 42366 -36681 -53695
26612 -53695 -51453 -24464 28497 25861 -47179 -66894 5539 8570 -31925 -57671 -118004 -205292
26600 -205292 -113136 -34397 1885 1545 -32000 -31394 5161 59026 49712 84059 103688 -5142
26588 -5142 -56547 -127649 -148820 -70707 15651 -13304 -58513 -24927 61356 80635 50345 5445
26576 5445 42634 74264 50508 25282 -27164 -31201 24974 24830 -35706 -37636 -48598 -23235 -13932
26563 -13932 39940 10888 45941 11092 -6109 -27662 36976 -18077 5578 109772 159682
26552 159682 127118 98550 69494 73960 -3586 -70188 -89407 -42234 -21204 31759 54692 -5976
26540 -5976 -20881 -13446 -34571 -90878 -143189 -46924 39297 11189 54201 75396 74536 88202
26528 88202 48591 53893 24114 -49354 23640 32332 -51462 -71697 -44684 107916 181970 156940
26516 156940 11800 5927 51738 32457 -31201 -33275 -78862 -46251 -7117 -71479 -41467 5784
26504 5784 33598 55756 19433 -7106 -36000 -29372 22005 91848 112355 66519 7875 -16678
26492 -16678 -15725 -26628 -36146 -110578 -52790 37674 68857 40811 -4811 -28384 -1626 79417
26480 79417 175128 220406 201159 98551 41936 33091 -9099 -39485 -47771 -60597 -82504 -107088
26468 -107088 -73963 -44799 -62376 -13317 17136 97786 66476 -17890 37864 59520 -50158
26457 -50158 -62757 -18014 1537 23670 115449 58034 -21729 -5579 31166 38471 -15827 -26891
26445 -26891 35495 73502 10865 43787 87419 92614 98716 19467 47773 80259 70381 109447
26433 109447 88064 95199 39707 12764 43533 15148 20784 -51701 -136257 -91643 -28529 15964
26421 15964 80523 71442 70404 94936 43089 89005 80179 73053 37929 35679 38199 10985 2619
26408 2619 1332 22484 30908 29308 16088 55597 37505 -55308 -34584 4140 -26983 -47699
26396 -47699 -76614 -84112 -73760 -36843 -6620 -49191 -62521 -31948 -55168 -50808 44220 65119
26384 65119 -6508 -64230 -109469 -53239 -22513 -54638 -58609 -74643 -30764 -21703 -38696 -56434
26372 -56434 -14048 -34315 -137486 -124533 -78574 -13795 34267 71535 74181 63764 12452 28728
26360 28728 37831 29904 38755 30625 27147 -10860 24023 47925 38401 75175 34169 -2688 102501
26347 102501 197411 114240 24714 27363 39711 40069 42057 17815 10779 3885 76392 68475 41385
26334 41385 30768 80497 93676 117356 73409 80352 99091 74347 -8186 -24506 -38278 14808
26322 14808 27544 17142 10333 -33321 -49204 -58153 -35189 -22066 61878 111534 95733 65507
26310 65507 -33309 -3726 -18445 -81662 -73444 14664 58639 68199 50521 114350 89149 84343
26298 84343 97906 127343 97076 -3566 -16710 -21139 -40129 -12366 -49855 -1873 17888 24941
26286 24941 5942 44445 43642 62976 65955 -1446 6461 91265 148016 119522 42512 81432
26274 81432 68319 -48373 -110190 -115392 -100410 -8554 42252 70819 43225 762 6082 37742
26262 37742 37724 33938 42674 110753 42771 26276 19497 937 130041 204908 221668 185876 113569
26249 113569 35796 11786 -69051 -105377 -34571 3410 -29268 -127742 -148706 -119137 -95339
26238 -95339 -31252 20009 13869 53251 80111 45603 -21989 35878 110677 105281 61255 25685
26226 25685 87625 129777 55547 -20190 -78842 -92671 -138410 -139120 -82632 -7294 -18585 -83845
26214 -83845 -33293 -45997 -39745 7873 -40260 -107880 -78269 -31111 -37242 17341 55441 50395
26202 50395 6289 -23303 24304 100412 163282 128519 39992 -36556 -30456 15032 -1632 12333
26190 12333 -29018 -39773 -15239 -32851 -16610 9693 79840 40833 44497 21179 -1081 21351
26178 21351 2362 1951 -16790 -38017 -92378 -30032 -29703 -71455 -75467 -33981 -16354 26671 35672
26165 35672 14950 -38940 -67809 -121340 -183677 -163545 -62377 14106 -12230 17350 100229
26154 100229 198332 198296 118455 54159 -10129 74104 81634 52799 12631 39680 586 -88706
26142 -88706 -74585 -43378 -7701 -39167 -69728 -70038 -29988 -20647 47451 132102 130959 79980
26130 79980 102848 155138 62146 9788 5383 -40311 42464 74930 101062 96104 25451 -6216
26118 -6216 -12384 -64869 -93383 -48789 -8341 -42280 -41781 -51509 -73135 -77457 27188 50620 74163
26105 74163 97969 92817 98748 179847 145332 128601 125596 63025 102279 98327 65083 96966
26093 96966 111228 81847 82579 84953 87253 156931 104787 52705 -5296 -12824 43772 133627 147832
26080 147832 134638 133513 119633 93296 46678 59045 52521 26203 79222 30619 -5172 -24598
26068 -24598 43743 33468 56835 172516 179721 185567 189154 143278 76153 22612 16475 14491
26056 14491 88744 66559 38066 36551 44038 28866 52860 -4514 -29777 26179 12104 -1501
26044 -1501 4612 63436 55990 13394 -25058 -105303 -141717 -133410 -62646 -27212 -57888 -84318
26032 -84318 -90856 -42746 -10859 -2926 -98964 -145521 -123290 -142964 -138455 -75890 -98596 -137352
26020 -137352 -157791 -174930 -126900 -10020 11047 30829 13251 69881 88293 80060 120091
26009 120091 156837 131826 105937 -75422 -86787 -35366 -18497 -7773 -77622 -14865 60781
25998 60781 88965 26021 44153 -1133 -40104 -69537 -72339 -28192 -6811 28764 19426 56104
25986 56104 127122 103424 83995 27194 55927 -25185 -79716 2474 96775 80300 66759 114349
25974 114349 74832 69690 26503 42214 67924 111640 141331 43175 35554 5466 -33064 60589
25962 60589 127172 103674 131515 60841 16622 -92912 -115376 -28813 58057 63946 89937 18884
25950 18884 5683 63995 -9700 -56391 -51572 28250 11774 -17164 -29277 -48516 10856 10681
25938 10681 41038 -90231 -35392 31543 74191 82147 23434 -42567 -74028 -65701 -89124 -63888
25926 -63888 -22844 14446 -25969 -37969 -43843 -18983 -9478 -106678 -77070 -59368 -70884 -66515
25914 -66515 -47557 11121 26921 -84 -14356 12650 -29783 -32231 -6373 50273 44084 7567
25902 7567 52724 79599 47227 -56702 -52595 27620 1103 74116 71522 47083 86843 109027
25890 109027 70758 1809 45896 68618 -17754 -17964 -15262 -30780 -65190 -58577 -49480 -42289 -79902
25877 -79902 -84920 -83116 -71772 -15620 17254 60281 52534 56244 45544 49558 67828 30039 -48028
25864 -48028 -98468 -90222 -94565 -79363 -78575 18094 47644 18983 -43102 -46055 -40707 -66067 -30500
25851 -30500 -11016 18592 12131 -22745 -48263 35967 87918 108703 168271 226140 223957 92290
25839 92290 24957 -57859 -5983 -17978 5855 19476 26566 -36551 -29349 5128 -15892 32307
25827 32307 7670 -4433 3348 32532 56861 39382 39730 23779 57596 68524 57581 69781
25815 69781 15820 -4706 10067 -33368 -66437 -69431 20927 4611 -36803 -114702 -63797 15751
25803 15751 8931 -32330 11237 5453 -33981 -105819 -146489 -94229 9588 90364 158445 85011
25791 85011 705 -25895 -2688 79609 80678 31541 30679 828 -25343 57942 94818 74691
25779 74691 -968 48972 143535 91135 -9486 -94396 -54269 25733 44941 94085 80711
25768 80711 1244 4580 14665 -13045 20824 16341 7274 -62629 -24704 24592 28870 49130
25756 49130 24119 66509 160176 211985 178718 92194 109993 113668 214694 123776 36539 28521
25744 28521 14401 25598 -8601 -5650 -4282 -16770 38432 35900 18415 37942 33685 43883
25732 43883 26521 74035 173762 114126 -6199 -9594 21863 -19976 -38394 -16031 79614 88729
25720 88729 93127 173788 168990 166997 120385 44189 10041 6810 11365 -33800 -18291 11326 -11901
25707 -11901 -8476 17337 34671 48838 73561 47448 24832 -5117 1353 54927 45291 -15685
25695 -15685 -108881 -104981 -18957 -18325 -31662 -71758 -112059 -106607 -74987 -33271 -48599 -56250 -60950
25682 -60950 1275 41181 29326 -10542 6755 58214 71799 16224 4758 -35648 43480 85018
25670 85018 95515 69121 -18392 -45672 -57866 10921 -1912 -20727 34581 51855 28949 -18143
25658 -18143 -25845 -15402 -23566 -23971 63718 115763 70753 31157 34628 25031 -41536 -57711 -54104
25645 -54104 -32721 -9994 -52670 -90127 -72004 -86323 -97519 -1482 3939 -90692 -61886 -56436
25633 -56436 -43383 -42065 -15885 -63228 -66605 -34647 -53309 -123235 -113109 -88674 -101351 -10040
25621 -10040 27833 5765 75361 68995 44257 134985 112510 36222 -6612 25716 86816 25209
25609 25209 -21558 -27782 -27784 36458 25411 -22333 35795 60244 23231 -20071 -10625 7650 -68746
25596 -68746 -22965 19202 32732 79493 109157 109756 84297 15227 69653 71951 2259 25741
25584 25741 -77781 -81915 -17764 -21482 -56598 -64049 -9129 40671 32480 5906 -13947 -44907
25572 -44907 -97491 -88499 -87087 -128990 -72056 -2345 -11768 -15720 -5214 17364 55792 10398
25560 10398 -76953 -49843 7198 -6694 9175 13044 6921 -29131 -31972 -93514 -63466 12183
25548 12183 21609 59586 43752 1564 -27145 -55300 -97012 -143138 -110557 -13547 49049 50391
25536 50391 33843 -3797 9285 13866 -3414 -27583 3660 109404 85732 -20380 -14320 -9005
25524 -9005 20483 87660 34698 -70264 -27837 -1520 54302 141985 147000 78050 37288 -7461
25512 -7461 18278 160521 168307 165654 167851 119581 42107 28874 -7434 -31378 84739 152383
25500 152383 94309 32522 92544 130132 72064 51838 21515 36864 42340 47029 35361 -17832
25488 -17832 -84051 -29468 24315 24666 74365 52741 -35045 5071 33823 51475 49189 11815
25476 11815 49010 67557 17076 -47230 12806 -822 -52420 -79639 -801 103867 68904
25465 68904 44311 66383 22608 22810 46679 -15678 -37438 -49960 -18141 -47558 -97718 -114267
25453 -114267 -88054 -94894 -103677 -116227 -39799 552 -36689 -53545 -44499 -107419 -64508 24865
25441 24865 33884 -56061 -127282 -86670 -56815 -32301 94 14222 -54234 -51089 -41648 -70182
25429 -70182 -27950 -74537 -68549 -57419 36798 97517 84253 92471 -9292 -16534 -55717 -96924
25417 -96924 -78085 -4926 -64001 -30251 56672 35356 13574 18730 52667 48485 54854 42544
25405 42544 68576 59853 -51143 -51619 -44534 -44457 -105080 -76662 14965 11145 -39913 -84063 -77232
25392 -77232 -92559 -12857 80174 80204 -9253 49378 8797 27756 117400 130939 113360 102982
25380 102982 33872 35887 47136 25921 16344 -36395 38500 67136 33244 -35029 -3280 -17708
25368 -17708 -41118 35 44034 -1743 21185 35430 53976 67790 69218 -1831 -34730 -52347
25356 -52347 -31190 12250 18543 -21438 -6904 63999 28433 9370 32192 46638 33247 22187
25344 22187 22324 -35213 -100299 -19682 34313 -60048 -37661 -42476 -118907 -121150 -70240 -75671 -32755
25331 -32755 -66254 -48149 -83236 -92250 -44356 525 94209 96218 -13016 -74007 -69301 -88392
25319 -88392 -70339 -47769 27191 61123 61277 -15358 -32654 -61727 -54532 1088 22829 43200
25307 43200 61963 5211 -50057 -82639 -142738 -76010 -79899 -62645 -2688 -40142 -53736 -6332
25295 -6332 25727 144277 186588 117228 72145 14625 79781 89976 -9270 28589 68248 74360
25283 74360 72840 28349 77582 40608 -54042 -33708 61345 53405 26818 16425 26126 13146
25271 13146 57643 118478 84831 111106 5957 -63513 -56784 -82764 -125746 -149052 -143202 -89789
25259 -89789 -79472 -27507 -34795 -56179 -94921 -71110 -101226 -109883 -93454 -100478 -26262 -38177
25247 -38177 -11390 -2535 -15098 -59157 374 34262 7145 39492 -798 11814 -6796 -93593
25235 -93593 -98512 -106184 -138592 -45555 3990 -29643 -59219 -14711 46124 9265 -28305 -61023
25223 -61023 -104696 -67269 -35599 9807 10979 23218 33483 -30660 -31494 -69808 -60493 -61824 -95093
25210 -95093 -41535 -55499 -53633 4774 84926 174887 106030 68552 117115 151914 89749 70794
25198 70794 37671 35813 -1328 -13689 12849 54390 41041 24712 20111 -8412 32023 10631
25186 10631 -71429 -32695 17898 140524 112081 92672 28936 22526 -10791 -36829 -60125 -11930
25174 -11930 60825 26118 -63987 -97053 -74671 -21625 6387 -23204 -7634 -74823 -90615 -28022
25162 -28022 -28984 -71125 -18870 100599 123151 93117 15085 87524 145301 34599 -55717 -98934
25150 -98934 -82548 -47845 -29270 -33887 -78246 -74415 -76869 37280 28814 96097 154002 137867
25138 137867 122714 80995 32511 26049 -50904 -162630 -149302 -204461 -203584 -121154 -79207 60681
25126 60681 27996 -44886 -49741 -22620 -5788 -11023 5141 3585 -83087 -128369 -65802 -32549
25114 -32549 -2196 64692 65702 12146 -20882 -66811 -47841 -38430 -23719 26561 75625 82490
25102 82490 50741 -36279 -96860 -137518 -229114 -260123 -271446 -192941 -111115 -34925 -63239 -78120
25090 -78120 -87067 -65159 -29656 -7476 -37629 2233 -251 27784 20866 35039 52734 -57964
25078 -57964 -145090 -90734 364 57588 125809 100359 82312 70548 -10125 -100021 -56001 -39141
25066 -39141 -69952 -124494 -91362 15986 93420 138035 115931 110338 104898 92007 82923 105267
25054 105267 69605 66899 143348 202383 141583 136795 101523 52283 -8109 -1429 19817 -74048
25042 -74048 -122381 -45221 -31291 5285 -32353 24195 6054 -17456 -16172 36063 82619 20764
25030 20764 35716 37861 -88944 -97805 -29427 -28813 23944 41098 -61759 -80271 -23188 -12697
25018 -12697 6535 6312 -23139 -38668 -101040 -128308 -147099 -74659 6852 29765 -11781 -42822
25006 -42822 -18597 131840 155130 109973 76032 94490 111826 84014 20308 41791 45898 27546
24994 27546 -23047 45904 65459 24419 -7186 -5274 8056 27696 3165 8122 77148 105547
24982 105547 89791 -16207 -84077 -50701 -74005 -133671 -25573 14877 -43490 -77100 -17670
24971 -17670 -36086 -61460 -19753 23267 -55412 -232789 -203940 -174250 -220925 -194113 -63557
24960 -63557 17672 23951 -35966 -96764 -60525 -21614 36795 25865 49871 37977 24244 5055
24948 5055 25851 94799 -26950 -66944 46595 113673 96821 145741 162281 174393 175016 157206
24936 157206 112167 60624 -12231 -32346 741 26928 32866 36620 44555 11609 27069 46042
24924 46042 19404 -47251 -12655 46543 2158 -44103 -41717 -57418 -41510 -86018 -7264 42848
24912 42848 52202 -33372 -28283 -15428 -120463 -86988 -103750 -92624 -30764 -5640 -320 12857
24900 12857 1007 -18298 -62775 -128044 -172964 -98895 -119559 -67345 12737 38136 23670 21209
24888 21209 31671 -14231 62781 180140 231287 141960 136516 126725 94851 83876 123830 43455
24876 43455 20897 -25615 -44353 -24361 52104 15519 -8241 25456 25460 -15283 20592 -17706
24864 -17706 -23594 -76839 -114153 -127369 -117715 -84550 -86463 -46555 -17754 66831 86923 3268
24852 3268 -70441 -108489 -80166 -115395 -89144 -64761 5081 45969 33937 23669 -58662 -54552
24840 -54552 -60765 -48737 10354 6274 18250 68768 95174 43692 50858 -8901 -79848 2846
24828 2846 -48240 -89098 4686 73640 26897 -13971 -24797 71617 149998 191409 103271 14259
24816 14259 -11831 77897 99943 65950 84237 83393 41445 -23108 -69644 -59476 5027 51373
24804 51373 49536 41097 53138 93714 109893 55374 58739 61573 66950 42346 32974 95876 72573
24791 72573 29831 -40161 -109061 -130806 -182945 -117689 -40553 -587 -27365 -39554 -44172 -48766
24779 -48766 -18600 85796 124975 112479 76750 77095 29237 -34420 -51247 21965 76227 78768
24767 78768 -36210 -16178 12464 -38248 -532 17584 36415 64749 50375 69111 74682 109791
24755 109791 97746 72261 39424 5055 22380 -16035 -40688 -23938 -5694 35913 60943
24744 60943 -6922 14569 -33877 -13614 55656 47812 -41705 -32193 -14445 -18903 -23075 -76416
24732 -76416 -83874 -72478 24507 83998 29321 -45555 -41416 26855 17689 45176 100186 157226
24720 157226 17866 -60624 5193 23996 33567 61847 83441 55667 43894 -8809 -21073
24709 -21073 -14934 -56914 -48951 -82016 -92503 -21612 -19509 -52790 -76002 -71400 -26206 47146
24697 47146 67997 45682 -3722 -44311 52390 24132 -1771 115929 68017 12806 -2638
24686 -2638 -34753 -79790 -135901 -74909 -504 -16996 -49680 -27450 11374 -2360 -126084 -235863
24674 -235863 -177267 -26537 43768 70832 7301 -60960 15552 48985 13489 13753 49617 38231
24662 38231 46352 -48895 -61310 -63405 -64711 -2563 -14990 43448 94600 69367 17656 16308
24650 16308 130986 108881 65146 92294 10811 -30716 -53454 -29591 43778 24818 -32612
24639 -32612 -121955 -63961 -24232 36521 77911 55087 14389 -41135 -22323 -22164 -25688 -30432
24627 -30432 12981 51760 36333 60753 -48792 -86670 -42034 -24823 -114512 -188200 -115297
24616 -115297 -4744 -55316 -100015 -92407 -24083 40075 17748 55735 93069 11385 -34147
24605 -34147 -16734 -55695 -65294 -33072 69726 18816 992 -32750 -72538 -82579 -48493 20229
24593 20229 25425 35260 27960 17643 86353 27849 -6310 4228 37920 65900 -12877 -44071
24581 -44071 -100621 -67150 -18349 37718 15099 72803 95883 66814 46885 -6009 -7386 2187
24569 2187 14473 2034 -42031 -116047 -93460 -30145 50372 103983 92145 57401 32407 86894
24557 86894 21659 48096 157239 139891 81796 32271 27118 -75595 -160219 -90206 -42030
24546 -42030 37672 70528 69280 52917 -12729 15540 5810 9925 2801 4044 -45513 -29412 -13260
24533 -13260 -70037 -105653 -75944 -88650 -76112 -80810 -49769 25112 -26780 -47691 5625 43333
24521 43333 13970 -48878 -102389 -80365 -30926 -46727 -9756 26604 5942 -31453 -86685 -90383
24509 -90383 -59398 -85594 -77704 -95192 -15044 94504 47547 119005 131527 93510 80775 30583
24497 30583 -3986 -14164 -89967 -76296 -53153 -37986 -22504 -29175 -26370 -51087 -38945 39401
24485 39401 24840 -50207 -66263 -69813 -25480 13141 -8391 -6805 -8880 -17440 46005 53247 31729
24472 31729 9999 55417 40774 -12706 27760 49419 78001 101744 7954 -71540 -88172 -44131
24460 -44131 -17849 -67989 -154284 -189173 -161817 -79597 -25250 -50568 -48382 -21373 3713 -45818
24448 -45818 -80570 -76737 -19267 47000 70089 114085 120538 92006 12068 -77528 -58872 -51758
24436 -51758 -37871 -51300 -52089 -73007 -126609 -185058 -154047 -59936 -43726 -71298 -86183 -29124
24424 -29124 -4167 23467 11779 -139710 -264674 -223631 -138629 -69191 -62748 25220 45176
24413 45176 79788 91230 17442 -8452 7950 31400 59864 55165 89030 139019 107382 85789
24401 85789 31427 85408 197233 253093 168945 104568 83164 79197 27448 38971 56397 29504
24389 29504 -74329 -119877 -109349 -53779 -65544 -79901 -121991 -152283 -83960 -33452 -10969
24378 -10969 -4029 3409 5574 46837 40472 30636 -21947 -88310 -17544 8635 28518 49123 877
24365 877 -50767 -47867 -33951 -16292 36629 10672 21203 -61958 -137472 -93800 -62188 85625
24353 85625 178815 115731 36674 12687 -84055 -123186 -50818 -44266 -20603 43354 12871 -583
24341 -583 -6098 -28217 -74282 -47724 -106890 -106498 -101107 -78012 -104507 -15651 58224 80014 59661
24328 59661 30596 84762 59375 38413 22383 -19574 14346 -9727 2145 -35128 -64582 -38512
24316 -38512 -1134 89326 99409 95517 112443 52274 -44046 -94004 -85245 -71847 -64038 14613
24304 14613 41965 53910 12368 39166 92545 41448 1037 23615 75582 53796 30441 -2572
24292 -2572 7387 76041 62728 -12416 -61329 27142 10269 31197 74306 20554 -19888 -9146
24280 -9146 -37381 -32283 -10705 36005 130984 111400 28116 75523 103762 119539 125502 145465
24268 145465 65634 56749 43583 104230 102642 83077 120516 49479 18591 30839 -32761 -60761
24256 -60761 2139 34016 53649 149324 109177 82451 70660 81341 91639 9548 120999
24245 120999 124174 131907 135189 80030 133027 144079 5142 -55959 -67374 -9427 -18600 7950
24233 7950 288 5516 -17113 -10729 -26942 5889 66456 96908 4940 -25951 22632 71959
24221 71959 27194 47368 40162 -28088 36948 30746 -18 -33204 -6230 37307 8562 -45024
24209 -45024 -115559 -110239 -45080 7628 -81483 -169038 -181863 -127937 -73729 -97211 -23431 -26920
24197 -26920 -62435 -94904 -149261 -186412 -184327 -147000 -109074 -85339 -46609 -40128 -47240 -98663
24185 -98663 -148094 -85359 -84454 -122453 -90135 -82749 -67783 -56517 -66132 -115794 -103246 -47823
24173 -47823 -37711 973 72917 -47474 -118037 -47175 29581 2822 -6465 16704 56325 7724
24161 7724 -14177 18516 -6063 40474 111779 126857 64564 99432 109949 3391 -78340 28886
24149 28886 113702 97938 80641 74663 64752 -24453 -42015 10351 57638 76449 78411 31094
24137 31094 21231 33911 21661 69249 26226 18058 98829 66764 -4315 -26790 1209 34063
24125 34063 23619 7862 32785 44433 67703 81947 74161 37970 33633 70821 81714 118561
24113 118561 70702 35781 -21991 39015 37970 -48179 -121377 -53565 10304 -33950 10737 -14478
24101 -14478 -113065 -108119 -59622 25248 111804 42672 -25219 -33409 -41880 -33947 -84012 -56685
24089 -56685 16604 -6954 -99125 -93280 -126760 -97804 -15070 34962 23317 342 -32521 -93114
24077 -93114 -134059 -119736 -31700 50674 -35638 -105793 -56920 -230 -64554 -180520 -203964
24066 -203964 -192438 -83108 -73669 -69286 -98883 -47055 -46934 -30894 -83592 -123503 -109505 -60299
24054 -60299 -142574 -119607 -47589 5402 15295 -18050 13182 -35377 -45816 -69911 -155823 -159574
24042 -159574 -46563 1201 1040 -30246 -82059 -193388 -235702 -167487 -151266 -103820 -74390
24031 -74390 -46522 -73406 -35075 -58737 -30053 56601 70517 100790 112165 72194 30978 25199
24019 25199 -8232 -42119 9995 62975 70496 18854 -85306 -15734 57547 7990 -4346 17072
24007 17072 17266 93854 107504 18949 -37793 -60041 -76733 -41384 -45850 -66994 -36178 -13391
23995 -13391 -41991 -57596 19886 -39456 -55769 2740 34009 43528 122117 119784 60236 -11432
23983 -11432 -95302 -82490 -85949 -95832 -81001 2386 -6784 52433 80252 64062 36568 -23025
23971 -23025 -51823 -51740 -20364 -44680 -65356 -30025 2450 -24947 -17145 26624 -54062 -147217
23959 -147217 -154428 -60781 12968 42032 24593 -55467 -58445 -12661 -3917 -61964 -40810 -3213
23947 -3213 -8970 1496 20434 -81385 -72900 -60292 3015 26736 61398 2099 11180 34031
23935 34031 52997 37275 -44264 -67734 -75805 -55164 27116 53585 -3509 2313 28854 29035
23923 29035 47425 -2631 3259 7845 -105734 -80114 -64630 -46615 -119959 -99430 -69976 -30292
23911 -30292 16277 -20445 66910 160444 161082 95175 106785 136255 153887 35897 39101 106984
23899 106984 63742 15385 -11950 -15048 -30011 -58837 6648 97049 36171 19087 56482 16257
23887 16257 -16137 -4378 -38538 -70842 -53173 -6420 -24429 -59666 -61030 13837 24434 -53258
23875 -53258 17111 89867 73458 12760 14784 -32683 -641 7327 77330 64887 -57784 -116863
23863 -116863 -130508 -157464 -119742 -104639 -12340 19026 -40626 -102693 -77970 -16983 -52352
23852 -52352 -83533 -38150 -39238 -8926 16607 477 -24299 -78424 -16850 11666 15279 42298
23840 42298 24928 18119 11163 508 -796 -18876 12183 106912 139565 96307 150433 98647
23828 98647 -3683 -49834 -17571 -42443 -84930 -93997 -65803 -37614 -51839 -82748 -100382 -115845
23816 -115845 -142403 -99260 -103510 -84151 -99732 -18894 -33192 -75371 -64051 -151134 -130352 -10015
23804 -10015 87519 126218 84877 4393 -52163 -84690 -151857 -70773 8360 -10222 10470 -9574
23792 -9574 -27309 -70822 -116495 -80643 -8150 5168 78697 75404 93066 108184 90433 43422
23780 43422 57776 7792 -48483 -2545 75819 146735 144651 57794 73504 64127 -6097 6909
23768 6909 74106 109924 83609 68691 58478 5702 -96651 -112946 -48448 32067 41545 -63176
23756 -63176 -102891 -94773 -55097 -77169 -82418 -35280 -33059 13477 31982 22351 -151 4410 16082
23743 16082 18109 54973 48347 -10154 -7289 -55229 -34961 24134 29629 31250 113779 165097 127684
23730 127684 103321 90070 279 -42137 -36007 24422 25773 99917 85194 22450 -44830 -77125
23718 -77125 -20471 15083 -3252 -34364 -9705 25795 -42970 -60614 -52732 -46584 9944 8036
23706 8036 30968 91399 129061 101239 76906 11419 760 18577 31039 9711 23858 28476
23694 28476 84288 91149 67659 3970 34372 45602 -71540 -64630 -43281 16878 54630 -81375
23682 -81375 -111345 12170 77132 31200 40524 42926 28406 40039 52549 70213 -5391 -24907
23670 -24907 20446 13493 30764 55089 62327 93416 124424 66578 14750 23451 -7370 13562
23658 13562 8177 -12513 -42696 26441 -58974 -90233 -6608 79037 78916 50989 83496 62991
23646 62991 77605 2058 -42392 -92672 -133889 -160751 -122211 -118835 -47755 26016 32377 14813
23634 14813 26884 25149 -30301 -43990 -44802 -17373 -75773 -49717 -33448 -36779 -38744 -20030 1025
23621 1025 -6248 -79668 -38103 -3094 41298 73691 48758 -11487 -87234 -36688 -16756 -84005
23609 -84005 -107918 -107647 -149775 -75464 19581 102735 92582 82653 28097 16939 -8417 780
23597 780 -39704 -76798 -58966 -64553 -66534 -68854 -104020 -113454 -42369 -80306 -67628 -41140 -32289
23584 -32289 -8456 35999 56455 -551 -2823 -87069 -15778 85854 46112 35067 -18503 28618
23572 28618 62888 -27842 -71393 -5217 -63327 -92030 -42415 -55273 8263 69800 54683 99844
23560 99844 96427 46753 -13361 -14843 -29475 -89093 -137980 -116058 -68940 -89380 -58681 -11493
23548 -11493 60865 108104 -5769 -41053 43674 -15138 -53047 -125620 -189120 -218052 -158433
23537 -158433 -121996 -106556 -80657 -28033 -12878 20289 15300 24909 71147 56393 -9882 19329
23525 19329 8995 89936 46506 3911 -33296 -42470 -67341 -26002 -10189 26862 77311 23237
23513 23237 -24822 21513 -19828 -32505 1129 32287 22276 109205 81434 2712 -8874 25292
23501 25292 -32999 -54550 -99602 -105174 -31956 150 -36943 -36867 -52261 -38302 2399 8640 62765
23488 62765 118629 75266 29252 55055 15785 -43830 -27116 29570 33782 -19430 -41233 -22081
23476 -22081 -76827 -121226 -102857 -13932 -10792 -2096 -28628 -15661 22904 5394 -34032 -19293
23464 -19293 -35253 -54993 -28293 -75931 -143788 -115068 -129377 -103861 -119559 -91111 -43726 26171
23452 26171 -7107 -69045 50943 73774 49700 -22314 -8280 -11625 -10269 17149 -32327 -16706
23440 -16706 4955 4220 47172 90871 78320 101719 50607 7723 -74001 -24678 74781 101032
23428 101032 121221 73351 26275 68933 112719 63935 33986 55719 51354 35000 -8646 22121
23416 22121 59609 83395 82602 20188 17593 -2597 28382 44699 43699 34150 103316 106577 50526
23403 50526 84378 121563 131041 -480 -22873 67731 65037 14388 33421 57601 103228 29423
23391 29423 -96277 -60855 -5098 -6866 -21455 -77959 -96847 -54880 -31690 -40989 -24903 -46009
23379 -46009 -32491 -39581 -48640 -11873 -726 10711 31929 7291 31235 53925 -5770 -44013
23367 -44013 -57202 -36075 -23374 21730 -24842 -38607 8421 64197 80365 14984 -78693 -111825
23355 -111825 -129452 -78497 -44504 -132140 -165085 -167169 -92165 20707 -21902 -4587 39270
23344 39270 65110 110611 15472 -58676 -41754 -80563 -36296 -47116 -76299 -53423 -77755 -112447
23332 -112447 -105645 -81175 -109962 -128519 -104854 -55600 -24037 14771 -8484 -34217 -71424 -61282
23320 -61282 -44067 6098 -15772 -85530 -95444 -68630 -88442 -86074 -133705 -181717 -147865 -12882
23308 -12882 81095 23934 63770 97478 127451 80800 68426 72475 79333 57725 72176 50679
23296 50679 26001 20362 71398 131184 99659 22155 45685 7270 -25911 -56966 -78984 -61326
23284 -61326 -61770 -38782 -4207 32391 3253 -52627 -96403 -93248 -52987 -105819 -131799 -45906
23272 -45906 40233 35702 4187 -27743 -51974 -41102 -31151 -74019 -56617 -32408 9563 37451
23260 37451 95714 25642 -106140 -124596 -54964 4622 -29095 -35902 5379 44849 4312 -57725
23248 -57725 -50352 -50033 -38757 -13773 -33026 -23603 11456 40174 -11651 -66720 -95779 -82466
23236 -82466 9662 -11438 -22806 -29179 -55416 -28761 -28869 -75940 -70952 -48813 -19994 14239
23224 14239 16118 -28220 -105494 -71266 63497 115784 95271 71950 73040 40699 11906 25606
23212 25606 11482 -6652 -55671 -63651 -99465 -76306 -48035 -27083 -33655 -86319 -75316 -75800
23200 -75800 -36810 -62931 -8832 19051 -20152 -10577 19121 -2936 -70394 -45761 -58137 -115486
23188 -115486 -111765 -34996 -11399 -28403 29640 114712 206613 162754 85927 82735 65690 20124
23176 20124 82205 145189 105404 40104 -107490 -150975 -112030 -77650 8260 -7678 27843
23165 27843 16329 -22123 -74774 -47984 -11784 -55169 -92962 -102572 -83648 -28015 45089 -14790
23153 -14790 -66105 -58747 -65704 -84122 -24531 -15874 -13792 52427 61636 11570 -93137 -50358
23141 -50358 -13716 -80480 -27097 80418 136560 80942 26728 -81689 -86159 -25631 -36096
23130 -36096 -81181 -51594 -89663 -76493 -54867 32394 33972 42895 11171 -61651 -4194 70786
23118 70786 67049 6255 -5595 31691 -900 5786 -10350 13202 47725 68298 30177 -20232
23106 -20232 11467 75744 40579 -21857 -24326 21153 -4946 -16369 -30857 -39930 -8688 -28822
23094 -28822 -13702 30621 10382 10345 32405 28766 35203 -21920 22150 15322 -53835 -70474 22770
23081 22770 1420 -90253 -152438 -128196 -94322 8067 70574 12692 50452 41164 -31547 -74952
23069 -74952 -172919 -114726 13706 10307 -6911 -61314 -37323 -31894 17598 36201 17023 -15867
23057 -15867 -24657 31590 29853 51757 40048 2255 21570 4825 48397 85526 83553 99947
23045 99947 44850 -32190 -81509 -19304 -51625 -26232 34881 157114 216801 174874 129235
23034 129235 68174 72958 37811 4732 -3792 -23096 -31607 -32402 -41957 1475 49770 137774 146937
23021 146937 83726 -7136 5611 10448 -36318 -36044 -83098 -104482 -111848 -101084 -72448 -114103
23009 -114103 -117213 -114300 -65178 -26890 38578 57689 20296 72259 76293 81310 33091 -13711
22997 -13711 21680 79528 48740 -38213 -23977 4765 33823 114715 86533 -8278 -40579 -7546
22985 -7546 -52434 -71065 -56311 -45145 -33921 -49187 -62858 -76598 -23717 -48159 -105408 -109471
22973 -109471 -131551 -99786 -34096 -12170 -22396 -5137 -4975 -54734 -74805 -52830 -79025 -77400
22961 -77400 -88641 -111415 -123094 -164337 -144695 -133679 -40002 4986 35571 66615 -26582 -21487
22949 -21487 55447 73455 54533 -52266 -104125 -80479 17699 49283 50730 53495 -3114 -39724
22937 -39724 -79932 -87113 -85370 -77452 -41044 -73273 -95463 -99242 -91814 -155408 -167588 -145582 -139551
22924 -139551 -50983 -86572 -58994 -40776 -39964 -69487 -62590 -68468 -112345 -148707 -129381 -161963
22912 -161963 -182851 -145358 -96576 10241 5852 -26031 63711 33312 -111160 -120799 -77797
22901 -77797 -38674 -39488 -41690 -71637 -50785 -23030 4418 -60644 -112237 -30560 -408 3692
22889 3692 -25926 -116954 -105089 -18125 -39960 -66277 -59260 -105284 -127928 -94190 -32829 46324
22877 46324 61527 -10185 -28540 -24615 2335 43817 77284 30763 -26683 -68172 -38938 46814
22865 46814 119108 146983 61133 -42184 -72203 -22028 3943 38362 -12549 -50338 -67516
22854 -67516 -19765 60706 57082 31354 -18805 -102862 -67088 2359 19600 -18095 -61710 -38785
22842 -38785 -63215 -3766 -34751 -113988 -53514 45351 73108 26361 28949 -11946 -608 -7798
22830 -7798 55528 20222 26143 14499 77610 12789 -20420 -5153 -44469 -90647 -31272 -42173
22818 -42173 -67384 -47589 -22426 -82864 -107870 -81116 -66532 -139382 -105105 -39522 46622 75768
22806 75768 -1960 -57881 -41586 1029 22993 48219 27368 -25848 -43295 8022 20156 -45296
22794 -45296 -32494 34009 32339 40703 35917 44697 116062 81515 48550 14536 29444 44480
22782 44480 29329 -33269 -88833 -65004 -83571 -93465 4567 35115 -48626 -80255 -54461 -24151
22770 -24151 41008 35047 253 -84799 -87732 -32841 -37802 14029 21597 5964 -7791 -18459
22758 -18459 1868 1290 -20530 53243 -17857 2301 58289 46411 29301 -1114 -55136 -66391
22746 -66391 4121 8365 -58492 -133396 -42020 55443 28492 46022 85704 114189 148978 88156
22734 88156 -44077 -75061 -60726 -74460 -31633 -22522 -39931 -31093 -76810 -40310 -61805 -54227
22722 -54227 -17422 1753 61067 56359 19256 26768 26504 45687 18299 14645 1359 -9182 -36372
22709 -36372 -60185 -44588 -81473 -141842 -92941 -64517 -36705 -86908 -186158 -199261 -148785 -65262
22697 -65262 -52183 -70186 -5232 59392 31712 -9075 -70863 -56988 -13691 -32341 -34165 -61815
22685 -61815 -73251 -40121 -97399 -73335 34838 77716 94660 102744 53407 48719 51161 112363
22673 112363 19745 -54753 -25245 61105 110265 44248 11699 13061 48129 21856 -54120 -73752
22661 -73752 -46270 -26720 -17573 -24679 8455 23845 -15626 8849 -51021 -21796 21215 -14502
22649 -14502 -3963 71622 104558 63055 21284 64011 59136 18953 52594 38112 -23439 -53397
22637 -53397 -86327 -70400 -22207 -41839 3118 53012 19681 49435 152406 197913 134863
22626 134863 71876 49813 9116 -46728 -80096 -72603 -80138 -63129 -65742 -97490 -69169 -20167
22614 -20167 31042 30706 20540 -49287 -16330 6276 54965 22257 -21930 -14220 37035 87039
22602 87039 127007 91133 78251 16095 22140 42425 37077 -25631 -27158 -35979 -66061 -65519 -76404
22589 -76404 -56263 -29430 -55445 -116494 -87733 -50335 -33776 -22902 -36860 -36329 -65853 -142347
22577 -142347 -190810 -129471 -62140 -82017 -25240 22306 -29915 -109430 -139085 -102232 -81495
22566 -81495 -74745 -103573 -108466 -71261 -156 37837 32927 16937 -33060 -64798 -49948 -43617
22554 -43617 -114350 -140095 -71934 -72966 -78294 -27780 -24969 -36441 -16333 105467 77599 60722
22542 60722 -17870 -36682 -63706 -65611 -52262 -108220 -97939 -98089 -90689 -42694 46684 56064 25571
22529 25571 41013 -12926 -41762 -91599 -48485 -40632 -73718 -26767 -32660 -50379 -35742 61641
22517 61641 61663 11296 5925 -4030 -36317 -51907 -80530 -109732 -104362 -11333 5930 -3598 -41750
22504 -41750 -36881 -5236 -68808 -90404 -47755 64918 58647 -55099 -105938 -130679 -168151 -207350
22492 -207350 -136733 -118824 -36511 -58626 -80845 -114493 -44456 38635 87249 -20255 -93740
22481 -93740 -190928 -193870 -114938 -33269 -9128 -14006 5392 38518 28048 18264 11794 717
22469 717 -35663 -28162 -73076 -128642 -110920 -122916 -45900 17357 20618 29177 -25281 18230 38073
22456 38073 30396 -67630 -37956 -42913 -33402 16794 -95312 -202331 -245199 -148918 -57392 -67534
22444 -67534 519 -56401 -142081 -65145 -10219 -65094 9561 -15860 -107293 -127841 -57245 -16721
22432 -16721 -26331 -94462 -89112 4486 -8687 -26940 8279 72169 149023 133665 155573 85956
22420 85956 53039 -23357 -39457 -24739 -18389 55722 111701 104657 111010 100669 69179 74372
22408 74372 64718 115228 116786 53968 -11519 -21832 71959 76424 -21662 27730 101275 109163
22396 109163 88910 -1162 -17131 33139 99119 96799 60319 -26290 -90360 -94165 -105133 -98111
22384 -98111 -60919 -8122 67917 107287 24019 -39975 -53811 -74447 -45404 10891 10479 -21478
22372 -21478 -16750 -18227 31965 55804 19498 -17800 -61050 -77190 -118531 -152966 -142813 -119353
22360 -119353 -21925 33918 32832 37760 28370 -10940 -15253 -20163 7469 -44356 -120890 -141820
22348 -141820 -131675 -85681 -92569 -124975 -38940 83316 113483 79961 38843 -4729 -50754
22337 -50754 15621 58525 70164 -8190 -21046 12733 83477 65826 -38334 -99230 -63946
22326 -63946 -31771 -43548 -64546 -59915 986 123464 129625 15560 -21792 40225 65139 8302
22314 8302 11450 27342 28723 109313 74107 5633 8268 13426 50672 -27080 -109409 -85351 -43204
22301 -43204 -109538 -133686 -130794 -47251 -44403 2207 21179 18418 -21863 -8786 -25821 13196
22289 13196 -2514 93861 116963 35175 -23328 -17046 -29064 -27703 -24022 17338 86986 13616
22277 13616 -57578 19432 34888 -4010 -27936 -64350 -64314 -76938 -40964 -19853 63666 138723
22265 138723 156839 83583 -7628 -75728 -79721 -51051 -67983 -67263 -63155 -21532 89738 102216
22253 102216 14377 -14263 -13218 -65528 -11303 16366 -29141 -33391 -34480 -78504 -26439 58323
22241 58323 60399 20400 -28520 -56220 -79825 -133240 -89777 -47280 -110773 -94756 -32097 -30420
22229 -30420 4058 20272 8217 -33552 -97631 -116376 -137369 -132231 -90339 -116063 -94966 -86447
22217 -86447 -117991 -152124 -155336 -131958 -120347 -117412 -93311 -128855 -84276 -33154 7788 -102046
22205 -102046 -176205 -96479 -15794 -52343 -103078 -167531 -160111 -124826 -114078 -107066 -152200 -185622
22193 -185622 -153258 -151145 -67906 -95339 -147096 -58747 -60926 -84037 -80548 -49461 -19917 5375
22181 5375 -8822 -33011 -14758 -30688 949 2017 -13111 -73136 -141274 -111658 -123628 -72163
22169 -72163 -21102 33205 41391 -27499 -134130 -83646 8828 -3894 -125778 -119209 -117295 -82034
22157 -82034 -67404 -9308 -11688 -37315 -17731 12511 15838 12571 17617 10370 42 35061 41825
22144 41825 36330 -41156 -10008 51346 -15687 -62189 -90417 -88697 -29935 3808 -25717 -130246
22132 -130246 -75846 46746 41054 2290 32044 -34712 -112395 -237226 -197222 -58201 -61337
22121 -61337 -16635 -66143 -79222 -36839 50935 14954 -63587 -35678 -98666 -144753 -88647 -20513
22109 -20513 40735 57322 84680 99785 105588 66940 -13869 -11937 -3885 26266 2568 -18494
22097 -18494 -33112 -116342 -95539 -38979 -50090 -32635 -58319 -57597 -47521 -36317 42248 47242
22085 47242 -12692 44163 150083 119179 102669 84652 23546 -12813 -25931 9105 41192
22074 41192 96288 91136 49499 -27605 -18338 -76995 -95763 -87851 -5978 -4233 -86089 -64256
22062 -64256 -60654 -60596 -25807 -26550 -42917 -64661 -140754 -124027 -33438 -4587 -26495 2115 -26449
22049 -26449 -75565 -92690 -94117 -79867 -119481 -99958 -19394 -29699 -9576 46113 18567 -42916
22037 -42916 -61739 -25345 -41836 -100773 -147841 -167709 -185162 -165833 -133628 -129463 -45767 -11296
22025 -11296 2331 -47880 -111215 -92564 -78673 -13712 22176 -8270 -53108 -161731 -184336
22014 -184336 -119886 -100200 -116650 -69781 -58853 -100334 -78429 -43402 -62924 -37263 -47107 -28629
22002 -28629 -60039 -99374 -63656 -78913 -80734 -40507 -10572 -46952 4493 24296 -33086 -54926
21990 -54926 -10585 18336 -33917 -59370 -2806 11920 7449 21973 -16195 -111210 -102964 -92938
21978 -92938 -178499 -153191 -42787 25273 42634 18308 64627 22299 46339 66726 -27387
21967 -27387 -58402 -70049 -117345 -85516 -81578 -48569 -66766 -59062 -64926 -93484 -88583 -73944
21955 -73944 -104570 -110731 -46520 -40110 -7147 59024 -710 -73394 -110299 -129859 -78595 -51760
21943 -51760 -6389 -38925 -91156 -46772 17263 -2688 -47745 -114477 -138332 -64579 -37224 44440
21931 44440 45080 17701 -12051 -69677 -180540 -184765 -79729 -54059 -46616 -33116 -13684 12277
21919 12277 6974 -50509 -70399 -55015 -91651 -117351 -70311 -42710 -37244 -96961 -83708 -33597
21907 -33597 -44452 -118007 -99468 -107448 -42970 13742 8768 -34313 -2409 16837 -13757 2750
21895 2750 -9922 -48797 -63720 -98073 -31380 27884 29541 17362 29620 28494 -6077 -56818
21883 -56818 -53988 -29484 56648 43249 26604 10729 -61217 -63995 -79073 -49643 44974 118713
21871 118713 -1102 -73740 -1265 15471 -50885 -34034 14340 -43517 -129901 -108301 -66695
21860 -66695 -15103 -41206 -31031 -30262 1162 -8942 -73077 -64261 -113096 -100548 -72715 -66767
21848 -66767 -142042 -158937 -70486 -42463 -60116 -112934 -123405 -74454 -86306 -129289 -113347 -40348
21836 -40348 -21400 -16987 13068 -26199 -36567 -53731 -92696 -89366 -73145 -80749 -92818 -87909
21824 -87909 -26452 -4670 -6790 -66787 -72303 11737 36634 53897 99710 102119 50763 34294
21812 34294 29114 -9168 -26099 -43288 -78470 -14400 69846 46792 -9346 -66718 -43187 -85243
21800 -85243 -93778 -75865 -64382 -83714 -69575 -44985 -1089 33005 -21658 -29625 -28016 -65701
21788 -65701 -86004 -56817 -61928 -17556 59819 19298 -102124 -175602 -140174 -124737 -126094 -125685
21776 -125685 -153650 -189049 -133164 -64173 -116134 -106723 -30458 33071 41603 -18321 -26502 1559
21764 1559 14 -44533 -111068 -127672 -52259 -75177 -61968 -79293 -24453 -64921 -161674 -204445
21752 -204445 -149257 -137275 -141897 -150765 -128440 -138758 -116070 -140792 -160659 -155918 -119167 -122554
21740 -122554 -73428 -26389 31010 9753 28912 66489 20972 8624 20602 -6404 9121
21729 9121 94555 127693 117567 111869 57677 33946 41434 16168 6998 35093 45112 -117351
21717 -117351 -179340 -103924 -57758 -43350 -108983 -92022 -161998 -169014 -170069 -117693 -108073 -90461
21705 -90461 -132058 -112495 -5669 46067 -41525 -68046 -45299 1856 42717 82066 36693
21694 36693 26624 36881 -16400 -79392 -95675 -120755 -120092 -28592 67559 53737 -29839 -18219
21682 -18219 63554 63524 20851 19357 -90763 -131613 -138470 -143554 -104568 -78439 -14810 31168 55083
21669 55083 4277 -40471 -78131 -79302 -40576 -31880 -55662 -68249 -36972 -66943 -94820 -190613
21657 -190613 -162270 -68821 -72088 -52057 10181 43182 -6936 -20732 -23090 -65297 -25842 66779
21645 66779 90692 60341 5766 38616 55765 29979 71077 80462 45870 49023 49185 9062
21633 9062 16541 83061 132656 90446 23217 40216 65368 23512 16377 63032 78244 44346
21621 44346 16278 13462 30738 9510 1560 7137 11850 16794 53332 35616 -1409 37084 47271
21608 47271 46284 8663 -41683 9606 59833 25836 -13315 26753 142817 145127 10631 -20340
21596 -20340 -87241 -102477 -84431 -42051 -15775 177 17014 -41 22609 86339 61112 -49102
21584 -49102 -37792 -4031 14446 52822 -25605 -6412 -1353 15834 -15968 -93396 -65566 -36270
21572 -36270 -60568 -74317 -72806 -94102 -34178 -3666 -42840 -18755 -37160 -30698 21733 14119
21560 14119 -38328 -59455 -36207 -40890 -50402 -59663 -62707 -125894 -123971 -165100 -185495 -112122 -9311
21547 -9311 52936 100846 84979 10604 -25669 -34655 -27621 -94125 -93418 -68964 -55977 -30615 -61283
21534 -61283 -68107 -62291 -135354 -166580 -140145 -96877 -125106 -158174 -99152 -11979 28341 34147
21522 34147 -4599 -60016 -141376 -190347 -167107 -118463 -147522 -107627 -115114 -55562 -63451 -41042
21510 -41042 22355 43571 -17624 30322 46275 28716 -38407 -85165 -56665 57312 -3738
21499 -3738 -10272 -17953 12190 11479 -25477 -72854 -103619 -61525 -18996 -112929 -137795 -141379 -67595
21486 -67595 -7670 24720 15108 6687 -1534 7222 -51674 -86444 -137061 -126100 -81896 -44530
21474 -44530 5430 113853 55923 -8515 -488 7894 4925 -58972 -119957 -120266 -115687 -48423 -32679
21461 -32679 -93926 -29659 -13298 -18184 -2118 43007 47956 -9227 -56617 -65907 -14490 -14250 -55639
21448 -55639 -5952 4632 20036 35688 31868 1712 -62077 -169225 -163882 -219866 -159674 -109484
21436 -109484 -41522 -39813 -49390 -68191 -85719 -85770 -77405 -69038 -105065 -83170 -101573 -86555 -51528
21423 -51528 -44751 44841 90809 50682 83353 78863 73874 20279 -27464 14021 57989 101167
21411 101167 70989 -27740 -61648 -34812 -27408 -7312 -912 -26472 10911 11324 38040 15799
21399 15799 15264 -2444 -76926 -125672 -123312 -66104 -61751 -51266 24868 14052 2902 -5656 23939
21386 23939 54880 68108 23082 89309 120100 92350 28288 -7018 40369 -16618 -40833 -28165
21374 -28165 -5989 -19036 -49362 -79138 -149178 -143220 -77677 -61990 -78828 -84745 -101609 -108931
21362 -108931 -84714 -141193 -162085 -96236 -95083 -98835 -34447 13309 33101 112063 152761 66416
21350 66416 -16875 14675 38406 6269 -27611 -71344 -72941 -9984 -43599 -50755 -53957 -158115
21338 -158115 -183329 -104015 -21325 75653 70617 27142 -71026 -82780 -128595 -119428 -5281 29782
21326 29782 -98139 -149031 -121896 -106154 -134300 -188014 -169606 -95095 -143730 -57346 45355
21315 45355 23860 -33651 -85724 -44495 30370 40721 118262 25653 -74459 -117889 -129917
21304 -129917 -95517 -93915 -80181 -114863 -128287 -94306 12571 -66066 -90586 -71542 69097
21293 69097 65079 -36763 1135 33280 34073 32057 -54272 -10281 -38296 -92540 -33213 6155
21281 6155 2060 -40154 12367 89335 33605 -27243 -13062 668 -94411 -74149 -62940 -156560
21269 -156560 -130543 -77885 -94271 -51423 -96502 -70068 -62857 -106351 -99183 -43101 60798 46862
21257 46862 32542 40389 55260 43276 -34886 -48447 -49188 -63185 -87399 -117107 -141306 -103735
21245 -103735 -128143 -197341 -167402 -93739 -70519 -111482 -59704 -139262 -149919 -25803 8251
21234 8251 -38915 -21893 -13077 -54908 -50339 -27236 -56340 -125015 -146403 -99049 -62118 -13387
21222 -13387 50781 83913 35134 22908 54628 -15846 -7689 -8594 -67396 -55569 -43638 2369
21210 2369 74280 69971 -39260 -66962 -26290 -13914 -43420 -89628 -52100 -124115 -139572 -49979
21198 -49979 76395 102867 95152 34283 -38511 -87699 -109550 -28336 -11585 -30022 5771 18060
21186 18060 18964 26699 14672 14862 14583 -17598 -24254 -35337 -41386 -6570 -35202 -43094 32120 66658
21172 66658 65386 19183 49463 -3529 -49846 -99511 -108459 -86486 -29989 17584 -47393 -108952
21160 -108952 -130152 -41264 -31676 -22349 -47040 -60924 -24514 -2606 14594 -6735 -50460 -90184
21148 -90184 -50064 -33914 -61794 -72545 -65867 -28911 10554 32877 -40529 -137400 -123774 -159828
21136 -159828 -107199 -139369 -77936 -19842 -5269 15485 -20613 -89796 -135508 -95871 21157
21125 21157 56086 72606 11038 -19779 -5858 -28736 -21933 37472 -5485 -11424 -110330 -79811
21113 -79811 -18996 -2125 -7556 -26875 24358 3594 61023 35702 17958 31749 -8756 -42904
21101 -42904 -36030 -17126 -14703 -2228 26921 71480 35440 34382 35410 42729 -19842 -70289 -105440
21088 -105440 -72034 -80373 -87025 -71995 -82342 -42375 -85412 -85057 -56673 -79097 -91203 -67187
21076 -67187 -59433 -119663 -80087 -79946 -108758 -144406 -72504 -2992 67250 114436 64085 -54509
21064 -54509 -51824 3342 39505 24014 -17159 -77 30209 55921 36884 7084 -3785 -80196
21052 -80196 -92610 -24280 40579 51401 83549 77950 48814 95434 58635 37655 66865 75293
21040 75293 92968 155903 90799 35994 72304 120996 99694 11074 -31963 23569 21630 15251
21028 15251 -22548 -7271 -24481 -129190 -152570 -74194 -37207 561 9981 -83173 -92180 16715
21016 16715 127501 95988 29242 32829 4378 -54290 -100168 -51582 -43556 -26881 19251 44061
21004 44061 61852 39616 3131 24379 -36258 -85194 -128792 -123285 -161883 -91750 47848 70011
20992 70011 57808 76742 42903 17493 -59372 -92839 -64199 -107949 -115937 -70687 -41368 -56771
20980 -56771 -58292 -74349 -62875 -100478 -110311 4877 -4918 -35479 -100912 -131069 -84186 -54168
20968 -54168 -77834 -42020 -115443 -161028 -73343 -46948 -14431 -28117 -83814 -50579 -106098 -220659
20956 -220659 -225795 -176775 -181866 -202893 -174803 -90605 -90721 -117933 -130679 -117275 -84729 -93308
20944 -93308 -108127 -27144 -6748 50327 86043 98496 38789 129 -12349 -29546 -56836 -67228
20932 -67228 -36021 -95592 -120125 -63495 -75108 -347 31228 53817 29583 -2653 -31393 -3129
20920 -3129 -9295 -45434 -10110 57834 110427 65281 66255 118785 90207 2758 -54790 -88695
20908 -88695 -58361 -43225 1410 21975 -50892 26518 17362 38053 -728 -69829 -133715 -101089
20896 -101089 -12794 -27265 -67255 -69331 -106614 -125763 -96958 -72146 -55516 -102924 -108160 -89656
20884 -89656 -10697 -86080 -144343 -54459 -81870 -158586 -90931 -74548 -134378 -144564 1382
20873 1382 13510 16845 -16160 -50054 -99260 -75855 2621 -35922 -31277 6371 -87289 -90511
20861 -90511 -105615 -128427 -101650 -96214 -101639 -161809 -226259 -242786 -169973 -89603 -99481 -66893
20849 -66893 -89942 -143215 -108306 -59182 7479 -65720 -114579 -91416 -103515 -74711 -33295 -24673
20837 -24673 -61477 -81121 -50055 -32397 -10232 -54344 -81393 -14513 24639 -92131 -158452
20826 -158452 -69893 66742 76692 10263 -50358 -86186 -54426 -85972 -141215 -93956 -20341
20815 -20341 -41814 -74402 -188014 -150430 -131754 -157676 -126282 -98022 -84683 -33458 -69401
20804 -69401 -81595 -65709 -34713 -26830 -26605 -40278 -2258 -33598 -63416 3408 -14714 -37678
20792 -37678 -74646 -94726 22812 104443 167418 195448 163056 187654 116875 24043 -26739
20781 -26739 -122234 -148944 -83501 8484 51745 28014 28893 -4178 -62739 -70399 -20423 44175
20769 44175 44899 10627 -78132 -19607 7158 55958 128784 112218 13178 -5441 -23465 20500
20757 20500 33773 53079 79475 30508 18764 32940 8186 61071 25366 56396 71270 66779
20745 66779 34319 36536 -2515 20927 52556 45963 74824 -3106 -92629 -105323 -92648 23051
20733 23051 -15670 7322 20999 -40135 -16084 -24053 63206 54342 27178 -55396 -73077 -40419
20721 -40419 -87106 -38647 -38613 -31799 -47504 -11084 867 -82582 -101808 -80637 -91053 -109981
20709 -109981 -81780 -94115 -78929 -26006 -45868 -44984 -65705 -116050 -128591 -110018 -31910 -29342
20697 -29342 -27652 54372 69008 60865 45473 11425 31365 -11714 -31470 -48630 -36530 17612
20685 17612 72501 112357 107146 62796 26966 13790 4369 -74180 -44711 19952 32413 -20718
20673 -20718 -61934 -8618 -5362 11627 25191 33631 33569 70719 33361 -25383 -39863 -85191 -104304
20660 -104304 -44001 22848 58787 -2121 -58028 -90471 -177759 -129377 -65532 -22678 15848
20649 15848 -2990 -89799 -73327 62634 33658 10967 6236 6654 -12651 -42611 -28730 -18421
20637 -18421 -9128 7450 -47904 -131028 -144196 -54623 -3150 9615 4912 -47434 -73343 -40684
20625 -40684 32673 37472 -6653 5285 -9759 -79572 -63565 -46808 -74159 -67939 -48878 -79102
20613 -79102 -87105 -92627 -92716 -39857 -9406 -46212 -104151 -40688 21144 10181 -26543 -53756 -58568
20600 -58568 -50377 -78571 -31656 -73462 6268 49824 56583 106886 106114 64989 -6884 -90607
20588 -90607 -95609 -11379 -4079 -33301 -61842 -93297 -62541 50386 56957 14329 -24361 21429
20576 21429 26358 64038 71830 64907 48237 -11650 5176 19277 20429 -38148 -79910 -53954
20564 -53954 -25432 -47984 -61633 -82766 -126401 -161561 -142519 -130574 -155487 -144758 -59234 -29403
20552 -29403 -48841 -13470 -24724 -25379 24617 15000 -21645 55618 66027 31283 -13807 6746
20540 6746 99775 160337 171972 94665 129930 97072 50212 12062 -28714 11074 41990 -2880
20528 -2880 -35703 -85882 -70177 -109325 -141551 -50656 5545 19409 -1972 -62384 25029 92521
20516 92521 62955 15010 -13030 -58163 -51232 -103320 -110284 -37652 13569 -19965 -59490 -93043
20504 -93043 -53504 -71793 -83477 -94097 -111358 -105244 -196152 -49658 -37974 -99106 -153357 -140770
20492 -140770 -153043 -161610 -136167 -146973 -132896 -121488 -96541 -70141 -93757 -50341 75733
20481 75733 132478 77644 116414 146192 196324 147425 36076 23015 11643 13863 27285 8796
20469 8796 15994 59536 79350 89192 53722 67329 109761 91656 7556 -66483 -44377 -72064
20457 -72064 -162930 -179750 -110193 -39261 -40383 -78660 -76425 -40344 -34442 33605 55578 9025
20445 9025 23423 -53786 -140478 -102107 -98260 -33677 -1699 -20481 -91184 -79731 -75946 -26378
20433 -26378 -14240 -4139 20892 -41199 -48975 -6230 6207 -42446 -87154 -98315 -130914 -164542
20421 -164542 -156282 -151639 -57865 -21644 -119894 -129270 -162689 -105300 -33462 -46870 -39327 19569
20409 19569 41049 -42557 -18138 20660 -39744 -76816 -4192 69224 -17210 -8052 3846 21577
20397 21577 23671 -42200 -53990 46079 104301 34751 -59295 -119411 -139874 -113785 -124618 -52657
20385 -52657 -11219 24601 -30786 -92373 -68187 -106941 -22736 72214 67719 -11105 11500 -9816
20373 -9816 -15342 -53128 -89287 -72314 -53141 -94197 -59259 -56273 -98009 -81424 7867 31612
20361 31612 13431 -17180 -62220 -81830 -80938 -126185 -96697 -453 35638 -61206 -86681 -187986
20349 -187986 -170073 -165042 -158373 -108460 -137306 -114051 -44592 -30418 -9734 -29960 -60899 -69086
20337 -69086 -51939 -42980 -29528 25466 53683 32137 48010 89332 37261 -15385 -12690 -17530
20325 -17530 -39757 -3822 2994 12532 -50862 -20585 1506 -43847 15766 -2110 -64145 -79450
20313 -79450 -9584 75012 67383 17493 31904 70541 11838 -95453 -8380 103792 98969 36436
20301 36436 12942 64851 32030 -54984 -39112 -25513 8890 32910 76518 114610 82829 -76193
20289 -76193 -128126 -86674 -47693 -31603 -104999 -95217 -62630 -45121 -55593 -1812 62242 58594
20277 58594 26761 -6209 7198 82094 18490 26007 2488 -19238 -39407 -81791 -34182 54364
20265 54364 28098 16927 113164 80169 -22733 -12345 -67065 -58023 -9102 -98691 -103967 -79292
20253 -79292 -31781 -12918 -12923 17643 23125 -40325 -32899 -91488 -89170 -85209 -14309 -45378 -67221
20240 -67221 -37904 -23936 29874 5715 43212 -652 -58386 4440 54267 12580 -14303 -17403
20228 -17403 -20601 1505 -15309 2044 -27907 -53493 -45771 -66295 -47023 -48927 -25693 -25122 2176
20215 2176 99220 111322 36412 -79510 -74075 -6739 77011 99797 67380 10165 827 -46721
20203 -46721 -37511 46878 125545 167708 88711 -34650 34672 1629 -77152 -88738 -47548 50941
20191 50941 49724 961 -79737 -66786 -22215 -10970 -29450 -7146 44203 71527 74298 58338
20179 58338 47105 330 -112771 -123665 -42533 40357 78739 30923 -75089 -127697 -75675
20168 -75675 -29029 -95573 -119831 -51712 -2987 13187 48496 8590 -29025 20504 55273 14573
20156 14573 -17528 -63122 -119805 -152575 -103658 -20371 5241 -26625 -42083 39612 760 68596
20144 68596 66626 33319 11479 48161 40369 18141 -29663 -7591 -32067 -62963 -29825 13791
20132 13791 -35905 -125893 -84268 -92614 -44245 -27520 -15299 -1420 10788 13088 37454 62190
20120 62190 -20409 -70174 -84360 -18823 -5106 37757 40538 87788 109479 69972 61198 39126
20108 39126 39069 30670 28393 38629 108592 175705 213667 172948 49351 16631 -47044 -45948 -5784
20095 -5784 48077 8501 -66275 -131391 -166258 -114923 -28161 45165 -42520 -69751 -32486 -9964
20083 -9964 8903 -26613 -122465 -117682 -141820 -163885 -103684 -96673 -9309 98908 130120 123876
20071 123876 162662 143878 95048 54512 5597 -53532 -25173 80513 153398 132516 70513
20060 70513 -27970 20294 44006 25298 29515 49454 96876 72408 7547 -19654 -25436 5076
20048 5076 -21578 -28180 -23800 -55922 -32507 4936 26256 12564 -68629 -151029 -132613 12723
20036 12723 103715 87869 7640 -16127 -20082 6865 -55485 -33555 -34953 46258 42488 4935
20024 4935 65430 34218 71421 209422 143963 52058 26700 -18343 -26802 -9439 65787 58061
20012 58061 43591 42601 -13825 -15983 49928 3711 -43054 -55811 -14712 -1800 48638 68074
20000 68074 73010 20206 32354 34638 30459 55685 87744 22769 20541 9155 52899 59252 41775
19987 41775 102458 47306 3118 -75641 -43028 34224 19772 58902 62932 13858 54244 120303
19975 120303 181319 118946 31518 80115 106650 114800 120560 75362 17422 -16842 -31235 14181
19963 14181 64169 4757 -21467 -42212 -57645 -39703 -20943 -20950 -35891 -76487 -42046 -55945
19951 -55945 -58435 -49528 16171 17887 18834 79930 75432 32670 25955 16062 8411 133039 150282
19938 150282 324 -51263 -20600 -9892 -71915 -111896 -113800 -59851 -52785 -22662 4135 30745
19926 30745 87034 99408 38313 25171 -20749 -6899 -14511 -26815 -9680 -16647 13970 36120
19914 36120 15400 50111 97228 28731 59311 56003 26043 16718 -44901 -132652 -126800 -57529
19902 -57529 -74907 -79786 -9587 86521 171221 170051 81254 15954 -59141 -153918 -168285 -80306
19890 -80306 -113624 -71594 -29558 4681 12795 31416 48687 52963 36087 -50062 -50566 20014
19878 20014 85322 108627 26092 50526 -22930 -148385 -94986 -60705 -78314 -110353 -85280
19867 -85280 -6969 11344 6303 -51837 -125647 -114843 -68919 -39256 -53005 -49522 -50749 -72303
19855 -72303 13360 66216 -11553 -51812 -105459 -113645 -68653 9457 -7996 -81566 -44343 -30224
19843 -30224 11436 96368 128864 116001 69279 50645 42507 56976 53842 35261 44479 39469
19831 39469 54208 84838 112759 135352 135175 87070 65487 25330 -60754 -73301 8896 64104
19819 64104 17841 -52996 -6268 51369 10354 13243 -59943 -141351 -113166 -141588 -170375 -117320
19807 -117320 -24104 44535 48043 12425 49219 75061 106789 90302 65986 73704 52074 -4614
19795 -4614 -30009 -52358 -87374 -50672 63135 107644 91818 40595 -5966 -32601 23331 57852
19783 57852 23830 9310 41134 93944 78160 21449 9677 5578 7507 102431 144467 117909
19771 117909 181585 124209 67977 115410 134415 114344 60118 27841 27494 28878 32220 61510
19759 61510 112134 53666 21285 -6687 -38535 -60575 -115751 -66207 36010 96835 124616
19748 124616 98013 67608 31473 68331 79933 61651 98205 79341 8908 26217 48962
19737 48962 -3408 22784 -15941 -21951 3178 764 12100 41034 12847 56643 51366 53849
19725 53849 136262 131058 96755 29412 -40589 -42131 -80224 -113351 -166122 -147444 -136034 -122241
19713 -122241 -113359 -103788 -25641 13322 -8427 62496 73581 62705 100340 186653 169710 42096
19701 42096 -64794 -31648 50592 39114 51091 44893 97036 206135 141478 108155 76979
19690 76979 74907 38846 3526 -40628 -7357 103736 133509 52762 49602 50350 12093 34725
19678 34725 119788 168125 79039 34521 38146 59670 186588 181202 100389 63456 118308 89159
19666 89159 35190 78562 77884 133372 184537 142998 72490 42863 44372 73575 9691 -46384
19654 -46384 -15691 52110 190128 238964 282924 278957 417110 578226 677751 831654 1021671
19643 1021671 1047397 1165725 1194542 1166873 1108438 1112765 1143593 1151190 1143736 1087530 945425
19632 945425 841777 672983 501806 374316 343922 367800 406877 407883 390622 399254 364407
19621 364407 307838 291803 294054 257314 282946 324097 264960 216012 243743 271266 281759 243179
19609 243179 219221 172144 100740 103789 89367 -835 22197 90027 144444 259206 330355
19598 330355 388940 540488 725149 938304 1051935 1153250 1297845 1399077 1425406 1356413
19588 1356413 1311725 1360310 1370309 1358145 1322800 1316746 1212334 1041121 877489 749838 578462
19577 578462 480521 379164 348262 413921 351010 328182 288367 304406 253017 215890 290896
19566 290896 313676 270071 257023 269783 263690 227946 150557 169168 199775 270027 236384 203091
19554 203091 245019 276255 251164 215821 181565 126283 124729 114798 90386 175922 272122 259343
19542 259343 257851 258195 172437 107614 62549 129501 124225 123514 214597 206821 205427 223695 145077
19529 145077 120024 188681 155889 140713 195887 237206 197493 255392 184305 73201 92057
19518 92057 123078 105283 42235 88473 57901 59212 77297 137318 124221 30747 63201 137630
19506 137630 155905 90468 83412 130825 109598 109289 57660 42712 118860 146683 62691 49863
19494 49863 39007 8166 30349 85611 127438 44192 97245 160678 193090 171143 119094 207995
19482 207995 250969 251827 216597 186514 192917 176540 142607 162582 108944 134938 58240 29176
19470 29176 64295 128179 155243 104829 41798 65644 98236 104872 49561 77967 99816 115923
19458 115923 89861 58029 46409 67380 143667 202903 196151 125315 154070 172251 163506 156204
19446 156204 180725 214582 235338 303716 199803 86219 136179 202843 237224 203799 164458
19435 164458 189432 206046 108594 67233 63397 59234 85790 133129 135080 107265 126781 129835
19423 129835 69950 123636 103494 41427 57107 130994 111627 56864 56928 145668 184589 152148
19411 152148 114560 104741 101992 112456 101698 132301 138813 92201 141416 157406 174677 101468
19399 101468 73982 41423 58757 84476 82081 95561 52057 11122 79661 155445 133738 131499
19387 131499 128919 156912 195620 224848 245310 243246 239912 234607 222337 193047 225129 257554
19375 257554 186183 148879 83892 187207 251536 251732 262039 276612 296510 296542 329509 401991
19363 401991 415810 373043 378689 397410 337208 223288 152194 182420 156729 196665 241988
19352 241988 259186 294963 266027 257273 215512 234171 335963 370210 264954 224362 303547
19341 303547 408470 579782 756564 868073 1069289 1294903 1265656 1214616 1291232 1266532
19331 1266532 1187689 1172541 1289624 1480442 1577028 1558372 1493244 1462044 1299408 1016269
19321 1016269 828523 710569 723707 741908 639702 587075 553500 485374 497248 553470 552534
19310 552534 604559 705318 774122 698736 604233 537956 576334 553090 592720 642587 645822
19299 645822 632434 644839 684610 690015 671677 691407 797410 859526 959600 1053418 1222339
19288 1222339 1400087 1519917 1619062 1655927 1655820 1575950 1445386 1451186 1455846 1492218 1595548
19277 1595548 1665567 1600044 1474804 1244026 1044150 913317 742944 741828 776758 679571
19267 679571 635139 674570 805051 869554 837294 823104 738552 704591 666110 590816 541467
19256 541467 563202 548802 547190 521916 454580 495533 434574 400456 380785 450311 501415 466966
19244 466966 468961 474103 444345 398310 407850 455168 496169 479386 456826 507576 564893 649003
19232 649003 775652 911381 996624 1040561 1171795 1406761 1696032 2051533 2405828 2588486
19222 2588486 2637907 2709723 2704071 2500845 2097700 1847834 1836402 2021226 2253998 2495556
19212 2495556 2605223 2600823 2557852 2568606 2545532 2246949 1772342 1416408 1225380 1105560
19202 1105560 1049655 975389 971668 982580 864335 845941 917474 956966 988577 983486 914377
19191 914377 946258 973327 972540 1077132 1213214 1239568 1294272 1331356 1333567 1463964 1613039
19180 1613039 1819695 2045875 2270261 2394504 2333168 2093349 1915389 1844636 1874761 2100937
19170 2100937 2302753 2389650 2250202 1980804 1818904 1718468 1666079 1662293 1738355 1799328
19160 1799328 1947753 2135178 2300274 2464378 2742266 3154566 3584076 3852923 4071524
19151 4071524 4246296 4444989 4726155 4897836 5072142 5334989 5747992 6275272 6844764
19142 6844764 7450067 7978589 8504903 9241906 10435755 12164868 14607542 18061518 23063390
19133 23063390 30662634 43496041 64372568 92200388 122301334 149074973 166528348
19126 166528348 174211462 179019837 183322102 183564386 182237996 186155094 193114623 194134940
19118 194134940 187445258 177677428 161932463 134653253 102742036 78088545 63055440
19111 63055440 53949286 48068635 44127722 41284504 39239702 37781106 36542059 35190238
19103 35190238 33672908 32261764 30960439 29795766 28920460 28270472 27754627 27410155 27286215
19094 27286215 27182181 27043156 26971045 26926057 26881858 26773098 26913852 27506012 28692970 30589973
19084 30589973 33476152 38140694 45759965 58781288 80929783 113167563 150870808
19077 150870808 187190289 214377196 227913947 234067049 240400843 243102358 239854326
19070 239854326 239596812 246085058 250055135 244663569 233953447 218262723 189339075 149542212
19062 149542212 113856072 90412786 76121280 66808829 60246580 55321318 51504206
19055 51504206 48579780 46247619 44320910 42605747 40941144 39288485 37643830 36181644
19047 36181644 34911716 33724010 32561708 31615716 30802463 29940198 29022950 28033906 27000831
19038 27000831 25963177 25069448 24351972 23753414 23189161 22680303 22194559 21677611 21143803
19029 21143803 20645584 20239095 19708380 19226106 18674928 18091179 17619816 17102535 16568475
19020 16568475 16038939 15625384 15202203 14726593 14279047 13969244 13654489 13312159 12961606
19011 12961606 12642118 12325187 12020710 11800003 11548665 11256690 11069232 10932842 10705103
19002 10705103 10452491 10280745 10156831 10014356 9790835 9617964 9453388 9230382 9013975
18993 9013975 8840661 8712799 8462103 8244076 8159502 8033466 7827911 7645464 7477642 7257942
18983 7257942 7043611 6848811 6711815 6578921 6510272 6363870 6213931 6165979 6072830 5962337
18973 5962337 5862865 5789730 5694353 5606578 5571000 5538505 5419970 5315254 5245731 5122296 4994950
18962 4994950 4957292 4941829 4836056 4699935 4599102 4520758 4459390 4449308 4460288 4476975 4402396
18951 4402396 4389258 4338436 4304752 4287801 4221599 4142460 3990036 3802487 3615367 3529490 3485742
18940 3485742 3375509 3325238 3277628 3167942 3001624 2949344 2972366 2921259 2838682 2722260
18930 2722260 2646267 2640667 2602056 2559842 2523427 2529490 2605214 2576730 2566616 2558669 2454065 2415655
18918 2415655 2487846 2502342 2474581 2455393 2444546 2421629 2369873 2257143 2204937 2303864 2350870
18907 2350870 2306379 2239350 2138559 2165531 2219278 2220755 2224069 2152859 2039760 1995489 2031202
18896 2031202 2072510 2030668 1991544 1933608 1836515 1814997 1735802 1709071 1710446 1716923 1773040 1827728
18884 1827728 1797754 1733539 1654147 1681404 1725287 1808080 1834389 1845316 1747058 1745719 1836458
18873 1836458 1875531 1864262 1906818 1899099 1848999 1825523 1874322 1886770 1858686 1815021 1738019
18862 1738019 1767166 1806821 1833870 1921457 1971396 2068162 2153648 2250823 2266639 2299433 2289583
18851 2289583 2327502 2446800 2621166 2811389 3011939 3243698 3537392 3842914 4101639 4364087
18841 4364087 4711279 5138751 5608702 6159000 6561679 6955605 7355810 7637146 7854854
18832 7854854 8183927 8765446 9421491 10128520 10940244 12272531 14115076 16482252 19883114
18823 19883114 25353289 34808916 52150719 79712023 110543343 139468727 162097364
18816 162097364 166667611 165932237 169505274 163662698 147515922 150868416 169732638 191156823
18808 191156823 206367793 200090410 188164255 180482610 158966984 117715714 85773696
18801 85773696 67908511 57213819 50267243 45614593 42354452 39989167 38004191 36333919
18793 36333919 35202389 34318732 33459841 32874115 32514734 32186917 31754487 31189646 30520606
18784 30520606 29755325 29157038 29001064 29200237 29793644 30761610 32186423 34087737 36334725
18775 36334725 39470359 44864415 54680216 73156381 103550175 138602680 171659734
18768 171659734 198796940 206234251 206187168 210983697 206997850 188508887 190027776 211508318
18760 211508318 236267805 254919752 249427559 234467684 224846818 203392787 156627064
18753 156627064 115738225 92311464 78375717 69056743 62427042 57625563 53967808
18746 53967808 50655176 47721731 45471999 43671671 42049018 40609173 39228691 38146275
18738 38146275 37308545 36396387 35547800 34698388 33770362 32983974 32649227 32670886 32780247
18729 32780247 32644099 31984511 31175752 30423934 29866656 29442686 29142353 29139184 29656376 30563397
18719 30563397 31992828 34322053 37985202 44212024 55920234 77661526 108811153 137357938
18711 137357938 155271601 149193603 116661139 89167196 77419632 78457582 92303760
18704 92303760 116288934 138541874 151047838 141188648 106992263 77268417 60307173
18697 60307173 50652326 44614206 40479677 37666827 35580604 34029746 32962549 32347036
18689 32347036 32054358 31776050 31319204 30837948 30085344 29130514 28233065 27600978 27253006
18680 27253006 27190495 27169398 27149423 27312184 27629785 28107738 28854708 30143396 32291951
18671 32291951 35541836 40269722 47540732 59913802 82306137 119451616 163477703
18664 163477703 201194758 225454727 220035698 201666985 194468011 191932694 180318658
18657 180318658 176204191 189643915 206969800 218267446 209061792 189659965 177235145
18650 177235145 164659900 135586067 102724023 81714172 69661659 61992412 56673453
18643 56673453 52737450 49595497 47211114 45432057 43852658 42387930 40856575 39297391
18635 39297391 37775805 36499708 35484062 34800751 34457250 34190280 33788128 33316022 32938020
18626 32938020 32724776 32715022 32818352 33072116 33639122 34670084 36264668 38842082 43109587
18617 43109587 50421485 63639396 87164387 119109040 146892090 163040058 153096305
18610 153096305 119408524 93981455 83810597 85152859 98205238 120379565 140608582
18603 140608582 151645418 141203421 109091235 82237310 67499577 59875677 55515786
18596 55515786 53107929 52021326 52129669 53580195 56712517 62267694 71519263 88317485
18588 88317485 120772966 175054476 241183010 301373404 340095475 345920623 341622913
18581 341622913 350967745 360381329 336985562 279147813 236254096 240205332 280814571
18574 280814571 331972474 373395864 385920158 373229714 367160552 371486884 356860409
18567 356860409 297473132 219645852 164105902 132727040 114269807 102535908 94178887
18560 94178887 87332992 81468837 76760388 72950790 69611895 66476599 63489750 60980219
18552 60980219 59026767 57461160 55995001 54404815 52614696 51031287 49648185 48363380
18544 48363380 47156858 45973494 44861686 43749160 42706400 41631513 40744251 39913859
18536 39913859 38894763 37740523 36652793 35885644 35325099 34682024 34099944 33443684 32516848
18527 32516848 31481824 30594605 29694141 28613433 27459589 26386998 25420905 24555128 23824090
18518 23824090 23215544 22659640 22125065 21582803 21094813 20700036 20325647 19817029 19350888
18509 19350888 18946548 18583362 18160521 17656282 17293417 16925578 16558742 16276647 16011094
18500 16011094 15725736 15365841 14973743 14632726 14261685 13943506 13696300 13480342 13256929
18491 13256929 13079837 12933285 12769144 12558373 12250912 11932628 11641782 11339125 11152087
18482 11152087 10960932 10749003 10529021 10331714 10093127 9889019 9712414 9542457 9330818
18473 9330818 9086919 8876962 8741260 8609171 8428767 8211390 8118890 8019670 7893891 7738385
18463 7738385 7689917 7587631 7510413 7460735 7491433 7451898 7278958 7267707 7216856 7107451 7019992
18452 7019992 6848482 6647661 6544701 6491044 6436624 6288589 6068196 5950023 5939792 5853629
18442 5853629 5684923 5556747 5464566 5382671 5203292 5067468 4963008 4902358 4836106 4738915
18432 4738915 4684126 4702250 4634303 4447563 4321525 4237682 4198942 4147658 4025975 3923244
18422 3923244 3828513 3814238 3811279 3678319 3589382 3593809 3582093 3557390 3465485 3440747 3331563
18411 3331563 3248487 3228900 3221884 3218763 3207919 3184461 3153091 3025761 2938022 2922124 2952268
18400 2952268 2930269 2952966 2897957 2878638 2850259 2818525 2767542 2785057 2794171 2755423 2654692
18389 2654692 2595719 2549775 2507296 2479540 2414868 2320446 2315240 2368378 2329267 2298023 2217637
18378 2217637 2264364 2248718 2186706 2043120 1998731 1918590 1906540 1847034 1821348 1900846 2024040
18367 2024040 2024076 1943367 1917866 1919834 1931899 1962800 1928758 1996520 1988560 1941649 1943809 1926632
18355 1926632 1930157 1933821 1896647 1884346 1851525 1814275 1775260 1771095 1712230 1613660 1597905 1555718
18343 1555718 1563530 1545789 1554143 1579391 1542726 1479587 1414443 1435957 1456114 1430404 1406577 1399205
18331 1399205 1430678 1400522 1420844 1445630 1526638 1532451 1559540 1594352 1562880 1463704 1426163
18320 1426163 1414322 1378953 1381015 1408508 1527375 1600044 1607925 1652579 1611370 1544878 1511081
18309 1511081 1523349 1606510 1685640 1727434 1765266 1732436 1751896 1736659 1711362 1665007 1649001
18298 1649001 1627008 1607389 1735084 1867349 1929577 1936757 1963431 2084344 2247222 2337787 2530149
18287 2530149 2834408 3164906 3581403 3808626 3912905 3906275 3891120 3995832 4275022 4507781
18277 4507781 4696626 4861695 4988340 5119210 5379428 5600267 5784627 5969265 6275994
18268 6275994 6820002 7581540 8536878 9757950 11402982 13810799 17529310 23150180 31997227
18259 31997227 47040671 72339350 106411159 138688213 158559490 153629249 125518228
18252 125518228 100943297 96028096 110889889 137094056 160815063 169983151 151351111
18245 151351111 112151144 78840620 59267295 48211974 41639752 37589329 35108093
18238 35108093 33352372 31974143 30691048 29501309 28474666 27624523 27227945 27128980 27036751
18229 27036751 26930550 26700116 26510911 26358134 26160445 26089287 26445165 26984212 27494983
18220 27494983 28039415 28794646 29809316 31452592 34033575 37940349 43542141 51676627
18212 51676627 64747746 87288479 124125319 173468992 225305064 262289671 267521803
18205 267521803 243919700 211991611 199236926 218568219 263600720 324585849 386934630
18198 386934630 432968019 453889237 448891123 425018009 395858829 379153593 372823234
18191 372823234 349900672 293021216 222846250 170171446 140011630 123023844 112676884
18184 112676884 106176795 101990204 99733040 99808006 103046764 111371954 128916077 163326187
18176 163326187 218138541 283057591 340590258 372908310 375102260 367458680 367795346
18169 367795346 362228445 324076782 256498485 193197097 154418955 135179932 128237906
18162 128237906 131750828 145623814 164582910 180145734 184661218 169970541 145469422
18155 145469422 129866186 128918752 140319806 155948044 166917385 164508724 142423205
18148 142423205 113775484 93425817 81321258 73562548 68105281 63953074 60767690
18141 60767690 58348180 56597958 55195322 53849113 52421868 50772240 49116137 47520756
18133 47520756 45891882 44357428 43112635 42152703 41305084 40554925 39743601 38845988 37844561
18124 37844561 36761217 35690354 34761063 33987979 33290698 32732230 32336218 32149168 32109348
18115 32109348 32565804 33652156 36011181 40997740 51984115 72129908 93406694 107983810
18107 107983810 109215521 83129250 57460682 44269858 37437903 33465353 30915132
18100 30915132 29062713 27569139 26254558 25156729 24206316 23444306 22725753 22107423 21566459
18091 21566459 21041559 20557120 20062435 19542631 19039671 18573546 18139397 17677626 17339203
18082 17339203 17059493 16720905 16503641 16243104 15955398 15778191 15485270 15190727 14897159
18073 14897159 14622774 14471170 14374854 14150902 13882796 13587728 13269450 12972183 12548849
18064 12548849 12147624 11813973 11477112 11189682 10846016 10581424 10306296 10069910 9786990
18055 9786990 9582612 9408684 9290599 9193174 8998649 8778790 8706751 8602297 8470679 8405479
18045 8405479 8332100 8274189 8087825 7877921 7745083 7547194 7212227 6985726 6838802 6692296
18035 6692296 6551461 6295417 6157160 6058794 5988483 5819671 5652527 5600254 5536959 5399970
18025 5399970 5371064 5322515 5184646 5122144 5010013 4838764 4618277 4495109 4436390 4315121
18015 4315121 4253196 4242685 4165788 4066749 4013114 3954586 3847414 3790469 3665159 3651258 3688280
18004 3688280 3691801 3634458 3549504 3447308 3414147 3318923 3268518 3243294 3222037 3172837 3080130
17993 3080130 3028709 2955133 2904061 2824355 2687594 2614797 2533284 2542371 2572642 2501141 2503844
17982 2503844 2481126 2371817 2298936 2244912 2128586 2114266 2079869 2042880 1934765 1970750 2049056
17971 2049056 2089745 2028456 2031886 2038703 2018197 2010059 2034216 1919263 1787636 1749391 1705351
17960 1705351 1647198 1643836 1722458 1716550 1663785 1624479 1631326 1619438 1603255 1500363 1480054 1532190
17948 1532190 1619002 1617269 1560851 1579398 1562693 1585695 1595893 1589236 1727533 2026521 2424919
17937 2424919 2790341 3080424 3102817 2999146 2912341 2983177 2917418 2744744 2444175 2265665
17927 2265665 2426317 2683825 2926492 3070617 3019705 2906271 2939466 2900246 2658772 2258735
17917 2258735 1950877 1655157 1452087 1380999 1375081 1313932 1193509 1154368 992719 963358
17907 963358 975318 971288 921204 951338 969567 957150 936042 943671 906424 881132 910987 879307
17895 879307 799630 710464 765002 863659 875957 880360 877133 954853 863084 830345 837186 738475
17883 738475 751287 744630 761254 733549 684887 701853 649773 647449 678570 663566 597437 670758
17871 670758 633522 568587 531328 580055 544977 466315 465096 437527 422131 493241 609546
17860 609546 689269 670682 588665 591931 624239 753932 705636 523236 444909 390693 364024
17849 364024 395666 408251 339828 417036 470313 493202 527804 507263 515996 428162 380458 458924
17837 458924 429574 396413 396258 382020 404871 387140 432095 493454 530651 549606 473137 432201
17825 432201 421211 471196 511877 509931 522164 570810 597266 633607 559186 505433 473721 498072
17813 498072 572745 582938 675018 732255 664608 586054 526603 435675 415512 474296 502667
17802 502667 599148 614890 559627 556989 558045 594705 606869 547774 460890 401458 434110 381966
17790 381966 373470 396056 373550 372036 411691 453139 394739 352210 352265 399166 446994 456955 435351
17777 435351 373966 351488 340170 294253 314781 331424 263697 254344 232115 266643 270879 311590
17765 311590 393521 413721 421935 454337 396419 271336 204741 225153 297854 306055 345458 397522
17753 397522 408317 394066 373719 290817 217681 175704 130359 136999 159544 203766 199143 195623
17741 195623 184620 222754 325763 302567 257196 361360 454135 553356 686278 822475 850689
17730 850689 761652 593358 552541 581127 642223 768594 891282 915731 769133 573348
17720 573348 461134 417921 375456 340942 319655 300994 306680 397415 434381 456536 342182
17709 342182 334804 340284 315951 258245 227686 232968 217604 159262 175183 227342 207496 171652
17697 171652 215841 296190 274175 236885 175605 242085 360221 434721 463197 570636 660560
17686 660560 868836 1106508 1371053 1559331 1534965 1398271 1247770 1237742 1327514 1371334
17676 1371334 1455251 1447972 1346315 1176253 968228 806582 689190 633683 560133 503336
17666 503336 501443 472130 399899 386385 345128 309586 336973 299040 286528 379535 437858 456417
17654 456417 400248 335974 300833 332898 349740 328658 328920 348087 361188 360667 380152 419860
17642 419860 416820 440194 465236 604701 926308 1309873 1749968 2171589 2408237 2502810
17632 2502810 2377973 2326753 2376561 2413155 2291891 1992531 1667836 1298569 1005621 853985
17622 853985 818223 834984 865924 820425 792097 843130 1019423 1189823 1443359 1763374 2074421
17611 2074421 2247285 2187245 2139030 2185178 2068190 1780697 1406817 1121049 892176 737594
17601 737594 741811 713375 604140 496417 441685 408674 412198 458291 483572 541009 582262
17590 582262 504602 452244 435067 444503 501247 537745 553683 619093 614087 545080 511214 544672
17578 544672 518298 559916 589506 593429 704874 844538 1056785 1363012 1709362 1903500
17568 1903500 1738777 1351321 1113080 920253 785355 772936 851944 1094806 1408465 1699733
17558 1699733 1881911 1843059 1478298 1069408 838417 841344 846085 885641 1020204 1361088
17548 1361088 1662937 1843783 1820362 1477933 1130931 1030524 954977 909534 911473 1011673
17538 1011673 1302705 1622279 1764088 1779184 1596238 1192077 964632 800983 651571 591973
17528 591973 600834 540669 503403 475178 499525 518635 430204 388182 458364 425490 381406 442778
17516 442778 390594 350670 329834 292974 290109 230688 205688 252860 348368 393368 381463 355836
17504 355836 348420 322134 259777 208559 194362 217462 270303 286957 252542 243851 320713 332723
17492 332723 284108 225278 243788 285712 334210 383457 358725 334280 229595 183082 249170
17481 249170 263885 294760 218490 138672 106404 151038 186884 220973 265541 283566 288147 311889
17469 311889 324834 374805 364847 339344 263818 266815 363507 314499 250970 296406 344066 259310
17457 259310 284597 285495 209271 171069 116002 39388 41573 147777 255019 306373 317020 325940
17445 325940 391004 430377 467330 490679 517529 475158 419054 311932 200300 204466 292111
17434 292111 377700 360667 309660 237674 250894 221592 180458 161188 181596 247532 273123
17423 273123 319868 284151 259720 217664 157624 103800 186550 302935 312325 279666 280876 227727
17411 227727 241765 226502 174901 168567 160072 195139 203084 173364 198297 202417 178428 176487
17399 176487 204984 152402 217523 256415 223278 255536 265838 251102 317763 349273 287111
17388 287111 240440 231496 212215 215531 257066 231065 199769 212427 211851 280873 330928 373260
17376 373260 270247 201528 153673 159567 184555 202219 216075 271965 245319 214244 185810
17365 185810 119226 87220 106660 102234 106729 103883 147166 88066 62606 108974 141636 155134
17353 155134 188178 265559 249811 234796 279089 307799 265532 221838 186645 275678 264593
17342 264593 274661 291209 245487 259593 188958 66906 -13091 54993 184231 212719 276142
17331 276142 288687 269722 202947 218727 201196 230621 184374 166014 232066 229166 197802 176501
17319 176501 146825 122606 125943 218835 249751 329014 278075 176201 102806 121587 102634
17308 102634 92089 170143 300070 358611 325382 286851 250966 288250 375724 423128 409670
17297 409670 307149 295773 297384 254020 230386 370763 474690 498316 454802 424243 506197
17286 506197 535489 468993 365638 311258 303953 295168 298453 317337 355395 332453 348851 388596
17274 388596 394698 383273 387219 355475 364031 382687 508214 594236 562012 515607 486593 451574
17262 451574 415220 501107 556191 594898 562826 561122 564259 520597 523420 515819 497256 498704
17250 498704 513579 592124 607350 561410 493507 561415 622700 584345 502445 483097 489109 494374
17238 494374 530897 488763 453535 513870 552631 598289 560491 527092 512422 500316 510855
17227 510855 532191 559550 562642 562876 564682 663669 738664 747483 776264 735760 642250 584510
17215 584510 661877 656055 595076 674218 695359 631131 689265 635153 502561 499500 534925 562107
17203 562107 524549 534187 569595 575701 585151 577568 602700 594958 523519 457702 485777 571069
17191 571069 635334 662855 629482 537411 439569 435968 460105 499337 524842 492736 471284 490614
17179 490614 471224 409718 403409 466398 535644 520765 512492 584008 581174 529201 451334 408470
17167 408470 407608 466153 489289 517337 485214 500078 408838 332546 352886 436948 449752 387570
17155 387570 427444 450572 455377 409911 400117 446190 469939 470284 418123 307263 278597 280530
17143 280530 335756 335225 312513 325825 383229 414680 340639 385402 341685 238974 309799 420299
17131 420299 416081 340445 271972 360805 427656 443553 438318 421385 346373 361153 512224 579931
17119 579931 440035 409514 443285 554828 545667 493756 483944 414988 332940 402690 457248
17108 457248 402229 388450 425392 531183 555870 648554 703736 677877 745680 814638 780599
17097 780599 721199 563130 445982 412997 483045 632706 802169 821482 769281 749239 731790
17086 731790 772957 798056 710130 712974 781462 878805 1004650 1162248 1195831 1172830 1126732
17075 1126732 1121900 1123487 1171913 1144469 1133207 1205296 1269562 1367449 1394381 1443633 1479249 1520025
17063 1520025 1506236 1484699 1441049 1408815 1355184 1468888 1636540 1783746 1960974 2121678
17053 2121678 2254336 2323081 2302684 2394977 2568801 2874790 3371251 3844323 4219013 4318530
17043 4318530 4145349 3967259 3975304 4193435 4550973 5124861 5769070 6405618 6690032 6945765
17033 6945765 7149899 7273931 7446714 7855182 8545153 9596238 11117446 12834613 14491464
17024 14491464 16068373 18031873 21124994 25988004 33623977 46925525 72364698 121321772
17016 121321772 190505856 249279265 284672860 260317832 178628358 120415328 93044705
17009 93044705 82264096 82687802 95282266 127500879 185578919 247877042 290859473
17002 290859473 297133320 230825653 156170760 116939444 100118372 96663408 106454929
16995 106454929 136328551 192164356 252604932 294706467 301245391 236498413 162927645
16988 162927645 123279332 105103577 98898306 103300993 122581676 165929721 227172608
16981 227172608 276582950 302751633 268961652 185968412 128444027 98202851 80999646
16974 80999646 70629658 63951698 59242593 55760388 52962428 50732702 48918341 46872076
16966 46872076 44730938 42434354 40046204 38039517 36606426 35486450 34682398 34198796
16958 34198796 33814495 33317605 32278221 30767155 29272209 27969314 26939749 26189514
16950 26189514 25371070 24691439 24276183 23989178 23680797 23330089 22845055 22074313 21201579
16941 21201579 20412664 19805032 19349590 18830475 18199613 17675765 17125750 16632261 16172844
16932 16172844 15735546 15300408 14828935 14365039 13947836 13590936 13347514 13008547 12716481
16923 12716481 12398297 12095731 11838654 11544927 11319862 11036170 10829918 10624285 10307931
16914 10307931 10081682 9823125 9680793 9509928 9319872 9164183 8990697 8840815 8700177
16905 8700177 8481395 8257988 8044018 7870712 7789868 7651563 7474755 7315656 7163195 6992031
16895 6992031 6912966 6809422 6690803 6555829 6407196 6286132 6207330 6113827 5996254 5861751
16885 5861751 5650253 5518793 5390850 5323733 5239932 5166147 5055829 4996298 4870667 4809253
16875 4809253 4744981 4602326 4511620 4445857 4272278 4152640 4033470 4059048 4090897 4060848
16865 4060848 4011112 3898429 3814738 3673277 3608164 3578198 3534738 3417598 3231026 3212859
16855 3212859 3205979 3209484 3231591 3123756 2956933 2791936 2709400 2628544 2625426 2553764 2449748
16844 2449748 2349193 2366712 2437434 2408735 2338093 2316479 2270754 2185882 2113978 2021007 1951911
16833 1951911 1958425 1967873 2034606 2058370 1992986 1908116 1822177 1664625 1585555 1559993 1544676
16822 1544676 1497122 1505479 1472506 1470416 1530759 1485208 1422457 1361887 1347829 1243130 1198318
16811 1198318 1177009 1214807 1199336 1247167 1166624 1080028 1136390 1135556 1097339 1104728 1068011 1111681
16799 1111681 1183828 1140444 1039701 907250 802388 802296 868908 878483 865383 737012 749579
16788 749579 853558 921022 925627 858085 764703 696434 652301 656507 653446 688832 709510 690108
16776 690108 683623 669414 654301 618062 580465 578879 620777 641908 606017 570887 581580 539492
16764 539492 495061 445869 420430 406155 455162 535286 525930 463931 490480 472185 489731 550632
16752 550632 491682 477592 456422 437010 356361 345634 419329 496726 469072 415153 405545 318661
16740 318661 301872 270276 241345 265744 336017 361691 289592 248675 131110 93147 114833
16729 114833 141833 142622 166403 147101 178341 209173 217841 260316 262843 223001 218211 191292
16717 191292 208309 212112 186872 159221 179239 150561 166951 253920 266618 259844 225487 165260
16705 165260 87005 28209 61477 109770 79492 36233 78857 57340 75500 102511 123898
16694 123898 138376 138749 107014 -12424 27145 72752 101946 52526 7111 57183 75326 144517
16682 144517 156965 107665 41175 55624 55712 61950 109622 184666 206962 172978 126301 29607
16670 29607 56376 164424 140395 98928 92999 44469 27116 30277 -24959 -51962 4804 141734
16658 141734 155193 112279 83817 2002 -16359 -27774 16688 89274 109792 144293 121207
16647 121207 90299 68758 47738 26153 47809 76128 56080 64879 63193 33904 101153 84288
16635 84288 49892 69815 76305 2334 4140 19192 -9703 22088 84294 102854 102829 55964 89672
16622 89672 168413 184825 196437 131875 107814 138231 96349 34405 -2010 57229 -8929 -9653
16610 -9653 36331 90518 112246 118112 134781 148422 105616 60571 117981 194257 208804 166930
16598 166930 116059 90667 50155 35728 55396 31381 103953 196566 165409 159181 132273 194014
16586 194014 142677 18734 22606 111161 115281 107177 112530 165664 209955 151287 89616 41607
16574 41607 37379 34563 -6497 -64463 11763 18384 31357 -6636 -90556 -55170 -5462 45274
16562 45274 61145 64377 44991 48298 54540 20068 -10641 13820 40367 34427 -8643 -57207
16550 -57207 -89952 -130252 -169513 -122371 -78326 -63544 -72712 -67520 -41655 -18354 -45790 -74484
16538 -74484 -87254 -89760 -71202 -45778 -51873 -45476 13464 -59552 -74772 -108359 -150837 -222567
16526 -222567 -182637 -77721 -67666 -121675 -79602 15088 135700 105477 -23021 -133061 -145274
16515 -145274 -210038 -210867 -143705 -135240 -74473 -60557 15878 50893 50632 54238 85791 59200 19627
16502 19627 91755 125446 83266 83588 82061 -48258 -104153 -87210 23089 40479 -37121 -46405
16490 -46405 -89815 -35972 -7018 35096 -15136 614 102791 48485 21604 27318 26315 57446
16478 57446 33763 31470 92171 134949 124467 62853 -35455 20745 80156 29145 -32581 -59683
16466 -59683 -15407 -17941 -36023 23370 49303 63927 132998 198103 229922 374164 489204
16455 489204 685557 953339 1264895 1448138 1421070 1014423 704547 469044 396964 422609
16445 422609 528921 807284 1065959 1341174 1555999 1576577 1299772 957241 709001 646407
16435 646407 646621 702584 821660 1106615 1423198 1582672 1581555 1288155 955798 769882 591963
16424 591963 520930 544126 597173 758664 1139872 1385235 1460774 1280920 845592 578892
16414 578892 511780 459597 445581 425841 412936 377278 380187 372116 322194 273853 247429 295774
16402 295774 257193 181091 179033 204426 211231 222471 210124 252844 291676 252242 160602 161497
16390 161497 132731 111278 131489 112209 63619 83213 142769 154862 143301 118355 168191
16379 168191 159626 177067 153630 74040 48859 55672 62297 82772 30077 -67256 -35213 62883
16367 62883 89021 165754 164761 121297 90153 92768 89529 103437 124520 126961 136749 66960 93233
16354 93233 69148 109144 85657 69924 92665 125887 131463 82565 20924 23458 75841 98760
16342 98760 160872 161066 84393 78390 114153 21142 35343 75573 122299 159173 191131 152508
16330 152508 15142 -111222 -87887 -32682 2204 -50586 -5874 65094 126681 157670 82348
16319 82348 55906 60182 52043 68386 -16154 -69068 -26511 -25674 6099 42077 66943 68528 76772
16306 76772 17971 -12778 -114488 -177149 -163687 -107444 -72350 -27100 55780 55380 25689 58140
16294 58140 120474 89639 -3317 -93784 -145940 -116075 -16157 -21314 -69129 -80224 -49840 5774
16282 5774 1784 -6386 -4316 -90059 -160582 -114708 -77372 -12761 -63778 -68067 -62728 -145246 -155686
16269 -155686 -149046 -68680 -31710 51248 -23092 -70040 -65590 3439 -26739 -44855 -39583 -26493
16257 -26493 -45348 -60136 -40383 3819 -21108 -83290 11304 76996 22340 -9459 -28582 -33468
16245 -33468 -28517 -65632 -48020 -29200 -780 32382 -26336 14237 45415 -30951 10441 -13771
16233 -13771 -54443 -40266 -5092 75387 32696 38853 74460 31435 19038 107217 110909 39454
16221 39454 -39977 -5344 -22899 -12398 1858 31235 31311 -6817 18008 69396 73947 78148 -17582
16208 -17582 -39970 -62676 -122061 -113181 -105720 -77394 -114923 -98703 -128402 -103539 -35738 -1767
16196 -1767 -93514 -171239 -159742 -130870 -83433 -98918 -64367 -39324 36211 48755 5492 48227
16184 48227 65114 80705 20623 -56754 -44266 -68354 -113029 -117082 -148353 -116082 -107231 -66109
16172 -66109 -50126 -16438 -14164 -33105 -49755 -83496 -13568 -38327 -77051 -51011 -9106 32987
16160 32987 9964 62904 135239 111540 22871 -20556 31119 59801 49554 57275 49912 -9886
16148 -9886 -34220 -92530 -33902 -51283 -58656 -87533 -51044 113638 180012 132593 103128 74937
16136 74937 56188 36108 48627 9651 -35736 -71221 -58782 2241 -73361 -139036 -162902 -96742
16124 -96742 -48462 -115919 -127096 -61817 11184 105842 110634 90221 74054 37863 27556 41374
16112 41374 53254 65678 45984 -38841 65 17659 10825 18106 48583 63980 49561 88501
16100 88501 110527 76505 64789 112471 116841 43590 -8804 -57839 -11328 -22074 -45133 -46534
16088 -46534 -62412 -53333 -48042 -72034 -75402 1885 60598 127715 37028 -45365 -10677 4335
16076 4335 19077 30325 -21908 -18627 40907 93538 10973 56339 84372 -33125 -41475 35180
16064 35180 71901 101624 97385 35265 -21676 -49818 -3104 -25534 -116250 -98473 -35925 -2829
16052 -2829 54185 65235 54688 -40158 -47733 -45664 -2642 4868 24363 -40343 -85552 -71013
16040 -71013 731 -9502 -21707 -19398 -72895 -116785 -71582 -30177 31507 28680 33544 2687
16028 2687 -110654 -148787 -103727 -83896 -59278 -108899 -137736 -93780 -46424 -129687 -209931 -190964
16016 -190964 -71233 13206 11799 -27709 -53660 -83114 -80264 -93160 -88256 -78328 -42081 -33002
16004 -33002 -52006 -81504 -48486 29908 -18653 -29097 19605 48543 95385 71975 -16497 -14071
15992 -14071 -35015 -21521 6774 2535 -26933 -64957 -130651 -134412 -150371 -131376 -89933 27395
15980 27395 13868 10161 -69605 -136909 -130013 -119431 -83497 -6135 -36112 -131022 -123343 -71663
15968 -71663 -47298 -52370 -12456 25937 63290 -8994 -68408 -83145 -87224 -111211 -90694 40746
15956 40746 75514 38826 38091 -659 -68148 -87764 -58949 -122982 -82996 -52918 -105296 -121723
15944 -121723 -19056 8758 -33356 -42886 -35582 -35126 -89107 -83067 -20216 22276 4679 -14160
15932 -14160 -5296 9865 -56683 -66696 -43436 34515 74173 109653 73330 26485 -41261 -47046
15920 -47046 -66581 -4707 27779 21607 53341 -14018 -67949 21128 65647 89388 81390 79981
15908 79981 36493 79674 75869 -33814 -80526 -39315 -59603 -63882 -60462 -48640 -57306 -63533
15896 -63533 -33082 -10445 -1893 54427 21287 -3071 -25635 15063 92736 166142 168106 98406
15884 98406 62965 582 -36739 -97373 -148120 -92484 8161 -41366 -15413 61920 81887
15873 81887 51010 9687 -4072 80893 160615 111891 120825 66785 -20358 22785 -1928 -6185
15861 -6185 -19206 -94991 -54803 -48272 -64019 -16510 -12556 -8407 -26983 -123642 -141681 -57321
15849 -57321 -382 17199 -29741 -51381 -44904 -112029 -87229 -76438 20299 3724 -76680 -80914
15837 -80914 59729 101790 46029 -68943 -116248 -113238 -97123 -114933 -77926 -127492 -74226
15826 -74226 -38379 -37858 -41812 -11315 39498 104567 87244 15592 -14117 55411 115348 63709
15814 63709 54980 66909 17332 -40575 -9696 66228 107001 34348 -5820 -20328 44838 64541
15802 64541 10138 -54106 -77970 -63728 -11403 53055 25612 59525 69802 82667 13132 -9434
15790 -9434 37663 55078 110571 139234 112024 110581 86699 75906 60226 77911 61270 802
15778 802 -59518 2950 65163 27402 -36702 -46436 -111838 -223346 -241293 -136487 -104539 -24477
15766 -24477 -17362 17268 14607 27763 58427 69576 100885 89820 32104 123830 122811 82227
15754 82227 98281 63249 -1540 -59574 -67344 -102032 -91094 -111918 -121307 -147236 -143224 -22641
15742 -22641 86698 106609 12064 -26249 31022 -13956 -77280 -135332 -113042 -43272 -18812
15731 -18812 3603 -117808 -134202 -119979 -74363 23467 93099 150931 44731 -85940 -91365
15720 -91365 -34598 -76157 -59941 -34634 -15537 22794 58184 -365 -77273 -84465 -59233 -87314
15708 -87314 -108854 -129647 -148485 -142474 -57931 28121 56527 53286 88557 95191 145291 181559
15696 181559 160995 162474 174727 98322 12886 -46862 8242 51356 108936 71191 -8259 -52749
15684 -52749 6002 -18658 -83661 -181491 -217672 -192110 -28530 -16106 -4304 -4679 -31763 -95439
15672 -95439 -167231 -193045 -126484 -168071 -167847 -85266 -82420 -64655 18599 76942 -15148 -80595
15660 -80595 -88786 -36394 -40821 -28003 5281 -71768 -149935 -128036 -28325 -71090 -107263 -82627
15648 -82627 -63303 -53161 -5978 73582 55599 29810 46879 56666 48341 41950 58095 70810
15636 70810 127966 57520 -41191 -15573 -11580 -52113 -40224 37242 59207 76225 47535 17154
15624 17154 14514 70312 54212 4534 -26305 -1678 31191 82913 55355 19496 3789 -33683
15612 -33683 -87005 -97139 -77476 -145383 -131907 -88762 -49023 -36909 -60270 -70157 -78868 -41097
15600 -41097 -55282 -95843 14112 78677 70063 61492 49361 76846 63538 44449 -5156 -35722
15588 -35722 10488 79512 23864 44247 173177 126647 48213 66380 98463 99058 57777 -36814
15576 -36814 -146449 -177061 -130004 -101784 -55705 15989 40761 24038 41292 -58677 -98147
15565 -98147 -33513 48865 107782 79563 52154 33130 72672 98326 97003 56114 52512 31264
15553 31264 -42961 -49539 21887 118010 103171 36668 2008 40019 72523 44931 -60004 -41409
15541 -41409 13465 35260 -9180 8009 83703 107377 60413 59936 83233 90132 71088 -26765
15529 -26765 -29072 -27491 -42843 -40912 -82455 -31070 28063 66270 18942 13544 -10193 -47163
15517 -47163 -21173 -1483 25575 -33580 -35655 19896 33986 1074 -76563 -102964 -116700 -59612
15505 -59612 -34254 -49005 5007 88666 93881 71325 71675 145960 138018 82770 78934 92412 85675
15492 85675 39795 -12330 -66680 -139919 -185348 -129953 -49690 -63993 -102364 -66058 -30032 -67016
15480 -67016 -16416 3828 74612 22115 15292 -11429 -56630 -140984 -221566 -114816 6971
15469 6971 -844 -8750 -3148 94832 180588 166765 123775 51558 -59474 -88317 -97512 -83529
15457 -83529 -19356 29692 117 -34671 -57720 -65501 -38743 -71144 -65559 -48728 -153899 -122164
15445 -122164 -95789 -140521 -196091 -214404 -238314 -200989 -178135 -111753 -102904 -2842 95917
15434 95917 76856 -31661 -72896 -125195 -123259 -51938 -5630 -11308 31539 25645 27413 13700
15422 13700 13266 -26721 -12931 -5936 -898 62488 59297 28984 86900 79133 -14652 -46304 -5883
15409 -5883 -31620 28544 13228 -17057 -54218 -36055 -31909 -46873 -48779 -41035 -36982 -34024 -44078
15396 -44078 -20249 -13459 -38237 -88921 -34054 60880 37187 17860 13711 62476 152418 156514
15384 156514 141697 64886 32109 21227 47817 52017 68065 75902 47533 -28643 -86401 -62105
15372 -62105 52230 71379 36133 54926 70011 57737 60670 108091 53920 -3893 -49865 -91743
15360 -91743 -147820 -88069 -36938 -38348 -8239 -61507 -53698 20580 35696 40862 5894 -63313
15348 -63313 -48134 -51124 -29207 -30985 9314 53201 96423 83554 88757 68990 23834 21462
15336 21462 28513 -29299 11673 -46952 -84703 -73807 -6602 -67171 -96426 -133257 -141726 -55475
15324 -55475 -27667 -32179 -64293 -44935 -6299 -22928 -92937 -149797 -144018 -125588 -87330 -74105
15312 -74105 -22912 -15913 -64482 -55715 -42376 51126 75231 -17563 -44470 26553 75569 45010
15300 45010 -45002 -94704 -119571 -126386 -127192 -98121 -120715 -107583 -55453 -23233 22673 -3125
15288 -3125 -22759 -39375 -13514 9783 9593 7834 3476 20176 58165 77596 115614 93431 74313
15275 74313 29556 61892 67410 44298 -3942 14312 22816 -24716 -14434 -37440 -116340 -155327
15263 -155327 -101866 -29170 -61350 -101492 -71636 -52791 -25375 -13067 -48945 -22753 -59556
15252 -59556 -69229 -51940 19088 -23708 -66849 -61753 -48982 -12007 -15344 -36479 -5754 -29124
15240 -29124 -19980 -50001 -151371 -252451 -298423 -299666 -278156 -257445 -217356 -63772 65474
15229 65474 5902 24960 17457 -24303 -65773 -47354 -44949 -23476 -22239 -5450 28492 1027
15217 1027 -43890 -83040 -24541 7538 -17795 -10139 -24927 -71045 -6852 -16670 9899 60833
15205 60833 76171 1677 -111797 -149990 -69199 -13222 -40768 -29543 -36121 -31973 -23499 59616
15193 59616 118090 123215 100275 55748 76331 43336 15204 -42298 6171 -38246 -45839 -26371
15181 -26371 -24082 -13295 19255 36819 -37935 5646 29113 -813 -84475 -74700 -30811 -6828
15169 -6828 841 -59536 -26765 -37540 15154 -85674 -171723 -102458 7113 32149 -24790 -36768
15157 -36768 -63675 -44819 -101035 -75519 -47294 -22994 51560 88622 109120 72030 17840 38053
15145 38053 11529 13019 15839 -6689 18181 -6121 56516 190736 136122 51223 55015 30390
15133 30390 29319 12932 -8888 -23657 -63551 18049 75705 68208 52603 42491 -21811 -7075
15121 -7075 32626 -18181 -123773 -175351 -166849 -136463 -138235 -92725 -72607 -41959 12947 3973
15109 3973 -13233 16805 25408 45498 -30920 -80986 -3135 75325 66340 16284 -47600 -34421
15097 -34421 -26038 18324 1955 -51643 -31256 -22581 -10414 14411 100283 150206 146452 59370
15085 59370 6555 58419 63873 103229 149159 158738 89928 25971 22384 72575 94231 95290
15073 95290 86287 136007 50920 -51017 -40728 -5491 9382 33133 34686 31681 7319 36882
15061 36882 65237 -25400 -33660 -23312 -35046 -94460 -16626 25458 -11227 -1125 -19466 44607
15049 44607 71432 11123 -33541 -44757 -13227 51838 70842 73999 27128 -69760 -159025 -98312
15037 -98312 -90905 -122809 -135945 -121260 -95866 -94381 -65939 -78405 -57524 -46795 -124680 -108552
15025 -108552 50565 83617 49151 -42996 -50614 -127851 -73823 -92902 -105173 -7505 82784
15014 82784 77336 64145 34984 7443 18338 49773 29676 6077 5537 17775 37138 46882
15002 46882 -36910 -60311 -13692 29419 -7348 -24213 -20546 -21746 -92206 -96541 -78097 -120302
14990 -120302 -203543 -209028 -103925 -65671 -43268 -51359 -48634 18253 10871 -36535 -29055 -60821
14978 -60821 -83399 -76108 -107019 -83523 -38555 -105925 -93436 -52139 -27193 -41015 19089 95849
14966 95849 170906 124082 73788 39454 -32741 6089 20193 632 -32097 -25049 40182 32794
14954 32794 12805 28554 -4740 -5961 -2068 5437 -88943 -63941 -39381 74706 93898 31270
14942 31270 -24568 15711 91569 64743 40101 46281 88877 101904 37035 66596 46518 36834
14930 36834 47604 16177 -54718 -63306 -40639 -27282 -87266 -52879 -17047 28035 14250 8447
14918 8447 -103489 -115851 -83588 -54873 -28032 -26865 -58189 -94636 -44556 -21907 -40619 -12805
14906 -12805 -29524 -4722 -59018 -34059 -52129 -7357 -1353 -47279 -63028 56790 104800 110792
14894 110792 64917 -5478 -30401 26255 101059 88238 87771 33570 -30076 -55756 -27896 78976
14882 78976 76403 -11772 -27406 40047 40590 19884 41687 35340 -2088 39326 69014 28301
14870 28301 -54616 -30803 -14823 22298 48876 78751 75574 63391 57376 46978 -57695 -136859
14858 -136859 -109836 -21460 34042 46565 -32226 -122038 -114744 -69197 -33210 -53570 -9597 37301
14846 37301 32094 8247 108 55989 118915 70819 36620 -5063 12047 39886 54120 2008
14834 2008 36758 -8170 -82583 -72457 -68942 -96890 26930 26293 17077 39990 -18180 27626
14822 27626 21085 8507 -8336 23432 34729 -3761 -17683 28984 33826 -29969 -44796 8949
14810 8949 46410 47688 32402 -2026 46569 70120 78589 61556 46932 -2223 -25193 -93939
14798 -93939 -108693 -47890 -12813 13766 -426 -48962 -82974 -115059 -150000 -66416 -12046 112896
14786 112896 164953 138682 58259 28607 48448 62148 35175 57905 81198 10589 -15251
14775 -15251 -14604 17389 198 -6466 -12880 -72341 -91286 -38436 -28229 -130414 -199599 -117723
14763 -117723 -7391 9485 -64831 -68660 -2297 20204 -17046 29602 17084 -2410 -4084 -2016
14751 -2016 29912 -959 -58533 -49010 -48456 -93591 -65797 -11392 55803 11005 11981 70752 62046
14738 62046 38767 49733 65035 79965 72066 116072 151728 129445 58842 10881 -11987 50215
14726 50215 101184 35139 13077 62911 -2624 -59818 -41688 48165 162862 262425 271670 185242
14714 185242 77793 31459 -375 -65204 -100226 -58967 49872 104333 12483 -13493 32103
14703 32103 29239 -14698 12358 70479 81852 65783 19675 -22679 -57614 -67803 20241 20959
14691 20959 -68121 -111808 -85168 -58534 -20843 59816 60904 59694 -14488 -72963 -31452 -69614
14679 -69614 -133080 -186352 -140718 -63921 -100044 -157157 -87600 -13899 -14548 -104896 -82173 -58585
14667 -58585 -36888 -1836 9207 -12142 -65997 -42035 55638 56841 21674 88761 76601 -23184
14655 -23184 -68430 15839 71348 187413 252512 173651 70019 81526 93428 114754 60278
14644 60278 113168 91520 109751 110180 128981 168635 109353 77380 67370 85262 130527 185521
14632 185521 150241 102034 20001 -22377 -25859 -34021 -8251 -22638 -79020 -127999 -103833 -99660
14620 -99660 -88481 -81136 -24021 14373 29583 41652 51172 -43930 -127669 -135971 -75273 -11703
14608 -11703 16565 28108 -30927 -45860 -20588 -53025 -21729 -25138 37633 59413 75561 33000
14596 33000 57212 -5248 -96983 -70411 -13169 5401 -21837 -7409 42935 66520 98504 196597
14584 196597 229707 116766 74534 89176 87625 99910 130365 168935 76754 -13658 -67859
14573 -67859 -111821 -72377 16269 29398 90433 48877 -25078 -38037 -4656 7115 -3699 106119
14561 106119 134607 105869 102659 86342 134708 96943 21480 -26850 -45062 -82148 -135009 -177382
14549 -177382 -111370 -1719 -19530 -6425 -39981 -45218 76916 150102 125141 99574 126365
14538 126365 95701 64686 69401 52722 -60001 -94559 -19149 -27265 -78233 -107078 -150748 -76073
14526 -76073 -38419 -27662 -7435 -32002 -28966 88725 123742 107846 122167 47741 -33849 -17351
14514 -17351 799 27650 32338 52888 12092 -45289 8029 63405 54445 32348 56252 -13617
14502 -13617 12075 43312 100742 217705 233983 91975 13951 -30723 25088 117271 79517
14491 79517 97016 74639 21859 48996 51556 67691 39339 58154 58408 63938 40799 34439 9491
14478 9491 -4049 -922 -2384 16760 -48733 -63589 -11875 41369 32572 58618 34449 -414
14466 -414 53381 20952 52 -24165 -34945 -11563 19203 34 -55206 -30681 66234 6341
14454 6341 13245 60260 113650 62780 29377 59570 30119 -102 -36463 -3492 -58462 -48266
14442 -48266 -32219 -10776 44550 67586 66338 98658 75575 48549 -37602 -17139 25924 72823
14430 72823 74089 31156 6575 95554 142627 11625 -10548 -41082 -34638 35960 54740 52608
14418 52608 130068 135625 27553 -13650 -39138 -100529 -85347 -22201 -41077 -38564 -38164 -13986
14406 -13986 -31014 -54763 -5368 33959 38151 8444 -32876 -123115 -110028 -20600 40155 68444
14394 68444 47609 -16577 -49707 -12660 -18177 -66388 -29885 41952 14225 -31910 -51120 -62335
14382 -62335 -54479 -43842 6362 -2914 -42979 10043 15330 -34468 -34780 -28837 -38652 -37897 91462
14369 91462 35495 -48613 -92146 -79610 -25485 -41781 -68392 -26445 -13178 -43159 -50575 -3348
14357 -3348 22037 -870 26973 -870 -61130 -46594 -38416 -17072 -20866 -67451 -35265 -46551
14345 -46551 -98404 -28654 66243 6270 -57664 -42763 -49031 -20419 -30119 36381 80725 111617
14333 111617 -22162 -88041 -64831 24596 16204 11592 -31054 -73000 -105936 -49650 25581 -22798
14321 -22798 -54201 -126106 -70356 32348 5192 8143 44415 -4893 -32963 -4379 -4305 14747
14309 14747 -39064 -43761 -25011 30174 46964 -32230 -63958 -61000 -89872 -58061 -43428 10649
14297 10649 -42200 -126891 -150688 -153660 -125592 -7063 69478 104153 74024 37510 -2304 34005
14285 34005 28147 31751 -94997 -136961 -76388 -16769 5140 85771 56281 4145 -3455 -97642
14273 -97642 -83422 10422 25881 -51538 -45612 -41944 -51016 -24816 -78443 -70887 -59643 -82755
14261 -82755 -153168 -146226 -71372 -79607 -51582 -29796 -26464 -42843 -72877 -40779 -81473 -80450
14249 -80450 1805 62141 3470 -18595 1813 -13754 -37031 -99895 -107436 -78433 -16965 -3101
14237 -3101 -903 -23145 -23816 -58643 -53730 -35938 -18635 2725 26833 22981 -9871 -6065 38925
14224 38925 15742 63993 115798 89162 -2563 3623 47614 128634 108425 113393 46527 16062
14212 16062 -28674 -1040 28503 38270 -44251 -107907 -122016 -101462 -125541 -63433 42953 161479
14200 161479 183049 103756 59925 47333 22393 -19158 -48635 32333 80771 69865 126786
14189 126786 149419 159003 109406 40794 27190 70170 59894 -49464 -18274 19488 34051
14178 34051 10202 4791 -48369 -34657 1587 9923 22980 -38819 -61449 -78903 -145590 -118989
14166 -118989 -118623 -127831 -70760 -28307 -6944 38474 17281 38901 66241 7395 14850 -81144
14154 -81144 -129593 -77550 -34225 67352 97724 12638 -11408 24676 83328 109434 105435 72691
14142 72691 27884 35880 30070 -53861 -78702 -73104 -45397 15848 29660 45021 63987 80517
14130 80517 56289 40850 -25232 -111158 -194665 -220605 -187448 -84503 6163 -56519 -53104 -47095
14118 -47095 -27569 39105 134759 87558 9883 -54118 -87639 -47238 -10411 -96367 -135358 -42830
14106 -42830 -1526 18438 20787 32140 60012 -27692 -56486 -70857 -112591 -73892 -28864 -37632
14094 -37632 7215 8808 35912 52738 37541 -15732 -45933 -82571 -97085 -41407 -25173 -81062
14082 -81062 -69191 -50962 -55098 -67809 -26342 76552 153036 162703 204285 208010 150799 86244
14070 86244 15816 -5869 20419 1822 -65686 -18917 47502 93435 90347 60062 69995 8759
14058 8759 -34801 14685 39216 62592 48139 -6266 -29370 60627 122453 62834 -17740 -17566
14046 -17566 -25571 -36972 16566 76693 56697 60113 67827 63659 34025 -22803 -67759 -71121 -105210
14033 -105210 -49288 -31218 -48756 8783 402 15565 12013 54312 106164 96115 93270 62167
14021 62167 90553 62266 49550 16002 11459 43708 98696 23871 -88880 -134774 -152324 -142034
14009 -142034 -104467 -54700 -98112 -164272 -186009 -136340 -140654 -100667 -87059 -85835 -49675 21935
13997 21935 -54571 -42391 14665 21856 -42668 -98711 -121385 -26550 -22233 -105907 -106822 -69613
13985 -69613 -51287 4948 16068 28408 -16312 -53460 -127158 -118524 -106234 -105410 -41988 -9893
13973 -9893 19739 16877 -56321 -34657 33308 29125 -25761 -33651 5156 -58923 -40012 -30044 -20303
13960 -20303 -20877 -48938 -88734 -57342 -35702 -21894 -26592 -42173 -39443 -29160 26851 -9447
13948 -9447 -37784 -84949 -92693 -92855 -88420 -43726 12612 20000 41571 43925 61832 39017 -23976
13935 -23976 -16290 -60934 -95432 -82664 -123238 -121150 -159466 -105968 -30777 43621 84733 47575
13923 47575 -9151 -27210 870 -17439 13821 44116 74247 55451 6075 -30572 -12663 -42341
13911 -42341 1796 58514 108809 88201 67303 -21545 24605 42927 33363 24916 34898 86909
13899 86909 94688 53806 15227 71710 65393 106588 90408 64857 93531 137196 64780 -10899
13887 -10899 -23073 -18393 1611 11520 -31496 -42343 -64826 -118724 -60630 17631 62091 41521
13875 41521 -1774 -46823 -65615 -63687 -443 -7040 -632 17296 -50408 -36744 6596 35371
13863 35371 85522 3636 -81743 -11600 -6567 -51162 -37819 34979 22899 -33600 -11003 21882
13851 21882 -10747 -32356 -68781 -25778 20256 37837 44009 33104 -24013 8976 15590 -11237
13839 -11237 34429 76677 33465 6318 33790 -25704 -26756 15733 46272 65336 98240 37313
13827 37313 49836 48006 21219 80327 44443 -28351 -54192 -26867 24479 -7718 -16172 -9512
13815 -9512 25081 87306 57808 -26298 -96809 -98149 -16487 15221 23297 25308 -753 -72199
13803 -72199 -71491 -117905 -137989 -90635 -70920 -26375 -60057 -109353 -74721 12944 -5961 -17977
13791 -17977 -13229 10186 106107 132662 64655 11419 -1121 -56517 -63831 -67549 -42389 25373
13779 25373 93315 109955 90098 91051 11058 -65947 -76505 -105405 -139397 -63906 -42495 -88207
13767 -88207 -134222 -19367 81080 91564 88053 -33272 -72560 -117246 -92261 74227 172099
13756 172099 146977 122593 146868 157108 87714 10257 -44072 -74916 -28786 34474 111460
13745 111460 128838 92121 57411 -13458 17168 68286 14088 70530 104943 69920 26380
13734 26380 -5066 22744 51852 86746 68558 58825 117089 75897 56316 4647 40071 76315
13722 76315 122379 74885 51503 72121 128611 128313 148915 201682 244106 112250 32518 -39100
13710 -39100 -15023 -66887 -118260 -127601 -77524 -53725 -22924 -97643 -136457 -54335 7327 8108
13698 8108 55872 34852 32019 -42510 -109619 -66495 -19543 -38105 -14808 -5407 22274 44799
13686 44799 103460 86608 22916 54832 59805 115707 118568 286 13008 69725 24662 -24938
13674 -24938 -46386 -57611 -15514 1852 -48856 -86894 -114442 -83198 -49631 5508 72239 74514
13662 74514 60505 20696 27150 36436 25320 71453 5984 -7177 38001 48172 -5979 -65791
13650 -65791 -73699 -25401 -54972 21578 55940 -6800 -9906 -51621 -61078 -29085 49623 138527
13638 138527 187855 95510 42404 38644 6918 37661 21329 67183 98653 97239 69806 -274
13626 -274 -45210 -48668 19300 54283 -2173 -28258 -3553 -13234 -79284 -45234 12565 9521 -34329
13613 -34329 -58182 -58360 7232 12920 -10360 -31814 -119172 -115467 -96127 -56160 -46653 -44251 -58471
13600 -58471 -75198 -115041 -114130 -53009 13623 93176 63411 24956 33323 38642 100557 38484
13588 38484 19003 -17795 -34153 -16488 -58136 -22039 54429 86168 81393 57685 -13039 -7493
13576 -7493 -103958 -141849 -121069 -31489 -44748 25529 15348 -3038 11655 24092 34261 32993
13564 32993 4698 -32300 6713 56963 35135 23266 14820 23619 38454 -5611 -33294 -2565
13552 -2565 -65704 -112401 -79872 -68257 -106034 -58886 -55323 -80834 -137090 -117593 -185072 -140918
13540 -140918 -74016 -123302 -178592 -119552 -109295 -166139 -165922 -96281 -49455 -33295 -36007 -65694
13528 -65694 -100737 -94786 -124643 -94403 -61813 -41379 -105952 -121863 -92678 -9237 -2160 -30899
13516 -30899 -2667 5412 -71011 19520 82360 36179 93728 137750 93068 104884 39158 -18037
13504 -18037 -89391 -191859 -158639 -124399 -74715 -18724 3167 -19945 -67474 -39509 -73398
13493 -73398 -44732 -39995 -13831 22319 49468 -4728 -42279 -31277 -45956 -48986 26736 -22803
13481 -22803 -97606 -70189 -13113 28594 -22578 11714 55739 103510 128082 92770 14998 13308
13469 13308 17978 -37534 -120107 -123570 -58895 35002 99529 96780 38091 -2038 -44950 6738
13457 6738 -40535 -110634 -66915 -6254 7516 63885 50450 11729 -10423 44018 86734 72743
13445 72743 88149 141996 72714 -54690 -193944 -156226 -33612 -21987 15960 57921 23736
13434 23736 -43123 -30309 22101 87468 121804 89876 67604 111713 150601 168169 112014 -8327
13422 -8327 -49431 -80728 -62334 -2169 84722 44687 -14985 -47808 -110390 -167979 -121651 -35528
13410 -35528 23742 43534 99526 59587 18922 -12499 -37444 -32546 -89571 -92726 49542 159694
13398 159694 138220 53076 38693 73466 124879 131447 116984 110372 -6070 -20850 2369 -11742
13386 -11742 -51671 -17926 -17483 -974 -815 -28242 -36840 -77566 -39106 -37047 -21982 10167 -2665
13373 -2665 -33100 -30780 -67944 -79368 -20064 -37320 -13128 21032 54642 7233 -2687 24270
13361 24270 -62768 -111984 -127018 -127171 -141409 -107844 844 27193 49682 -50461 -77966 -28849
13349 -28849 -38565 -35849 76850 128413 142484 114835 26542 19398 -13670 34100 31531 -82939
13337 -82939 -150461 -89061 2202 56641 -14615 -10598 11646 51730 79906 -5835 11664 9286
13325 9286 -39459 -69123 -45656 -84345 -78457 -10814 81012 92720 89339 26470 15788 99
13313 99 7940 32602 32410 130261 31920 -69597 -52887 8031 15006 25745 10283 -16786 4542
13300 4542 -29067 -31879 -42187 -134749 -146504 -129558 -129932 -98169 -107745 -27733 22455 30424 83907
13287 83907 52353 -17144 3439 87922 79107 61394 39373 -37961 -71784 -3293 54597 46001
13275 46001 61616 82633 70605 -80 -72875 -54869 20551 117425 -18686 -75454 -117224
13264 -117224 -111819 -53029 -22282 9394 -9255 -31900 -58379 -72988 -108782 -83868 -5093 -41422
13252 -41422 -71490 -12436 65574 3983 -11045 32778 110189 116725 101394 33516 38210 85542
13240 85542 43854 -19655 -22538 32367 68306 59487 129922 38309 -15612 -16283 -80018 -24439
13228 -24439 -7963 -52251 -23953 -89022 -203936 -242166 -134265 -36503 -50045 -51976 15632
13217 15632 84380 41899 -47418 -113965 -137190 -73622 -61323 -103113 -76872 -13901 77893 41453
13205 41453 6926 -21509 -109383 -159436 -130620 -52818 -7167 -68972 -160618 -163223 -103326 -67237
13193 -67237 -76765 -86854 33391 79254 74752 72585 49124 95883 95418 -66994 -196998 -208160
13181 -208160 -156415 -3988 70546 17531 -28175 -24865 -24540 7037 5889 97249 142497 140676
13169 140676 109675 55069 -1304 12130 11771 -14662 -1558 38383 96334 80951 72571 137050
13157 137050 102591 31975 -92245 -101833 -71028 -10703 9182 -1053 -11613 40500 9065
13146 9065 77455 91349 46756 48553 71012 28116 -40483 -80141 -57966 1596 48769 27393
13134 27393 31962 76723 48231 115023 120397 73732 13033 -36364 6604 -53118 -21277 31736
13122 31736 31901 47190 57105 38994 -35265 -51506 -65968 -119506 -137639 -53856 6688 33412
13110 33412 49755 42455 -13927 23858 27644 -58289 -130351 -155102 -114870 -136886 -167845 -95262
13098 -95262 1697 -42763 -23033 42450 51289 -79014 -104118 -42579 16645 -14942 -1283 -13806
13086 -13806 822 62015 59043 -35107 -114705 -37185 -34018 -55805 -73414 -54148 -72293 -100491
13074 -100491 -77519 -135070 -96906 -14932 17714 95642 91822 71822 -17491 -59684 -28746 -61467
13062 -61467 13267 52394 44006 44708 -35460 -21741 -8481 -39733 -83997 -42893 25126 -19437
13050 -19437 -81617 -86647 -49734 -43771 -21484 46243 128239 136322 471 -52261 -54055 -6022
13038 -6022 -53229 -107406 -98570 13927 5539 22853 100150 74392 53321 105876 69626 15224
13026 15224 -9172 45868 54679 93262 115773 63652 51828 -2148 -26501 17464 9074 -1513
13014 -1513 45085 111852 84252 65140 103509 54849 71473 142397 67951 14305 132162 194353
13002 194353 131487 111238 62830 -60990 -101937 -26344 -59667 27121 35894 5034 -49122
12991 -49122 -8369 -19418 40622 52041 13924 -35124 -62449 -60998 -61190 -19302 51022 104310
12979 104310 105891 119289 31985 60024 55928 36429 2687 42771 40828 47191 28944 29298 47595
12966 47595 -10820 -78624 -90253 -92222 -84171 -75762 -2603 -31685 -94885 -117963 -183466 -205070
12954 -205070 -101001 -88818 -42659 -22059 8104 -2746 -15200 549 32285 19096 -49068
12943 -49068 -115751 -92344 -26410 263 43131 89802 79376 47517 106157 -4283 -33267
12932 -33267 3104 -27679 -74040 -52296 -47679 21088 18826 43559 58986 49667 90493 130787
12920 130787 98714 7318 -55210 -20298 -32629 -56331 -58412 -52065 -63723 -70679 -26797 -27751
12908 -27751 -56307 -49052 -109299 -52793 -53415 -54433 26278 71413 87306 44728 17060 28520
12896 28520 38209 41024 73351 56416 76562 63377 23778 85791 38216 8381 45045 61495
12884 61495 64502 65969 33024 51666 38947 12405 7863 1112 -671 27797 27549 16803 71569
12871 71569 67759 93102 133157 76605 4891 30020 -25332 -37223 4677 -43541 20704 10628
12859 10628 -33958 -32348 -6099 64875 63842 47631 27041 -65542 -65612 -20949 -11106 23914 -50317
12846 -50317 -72068 -27004 66413 160947 89335 -56377 -61149 -71701 -100529 -134936 -130471 -118824
12834 -118824 -23706 -56212 -71850 -67838 -81472 -107109 -113175 -109513 -111607 -169662 -121536 -97291
12822 -97291 -138143 -126406 -139148 -75923 -54843 -79814 -68053 -23893 18459 -33508 -96343 -79565
12810 -79565 -36311 9761 -38525 -72073 -6953 90668 97340 158264 190239 166364 150978 168020
12798 168020 98042 19807 -6749 -105328 -144819 -74825 -9884 -12820 27057 -6617 -81535 -45424
12786 -45424 -11510 -139 -8505 -28339 -9058 -10492 10219 51912 24812 -54693 -86506 -76836
12774 -76836 -30330 9902 25171 16071 -33016 -2582 59034 49908 -27398 -70008 -137917 -143800
12762 -143800 -100180 12947 115641 183331 152950 84814 73718 -47449 -60804 -29809 -32455
12751 -32455 -60308 -75818 -3131 -57278 -94983 6839 98810 105837 63223 30323 -3095 3078
12739 3078 -47583 -104462 7645 35503 40037 36936 -22794 3247 -6008 -17120 -45721 -81306
12727 -81306 -50916 6737 35825 20891 53069 74232 2249 -43811 -65893 -67036 -90387 -83561
12715 -83561 -129229 -120744 -149861 -138594 -82807 -18095 17631 4884 33918 24567 28015 2538
12703 2538 -67668 -87410 -72784 -93852 -15477 -10 -20611 32883 74762 33515 47772 -26810
12691 -26810 -175901 -182585 -83494 -67662 -12451 19624 -12302 -7623 -22843 37106 83805 105913
12679 105913 117329 22638 67777 72933 118213 186106 171534 78920 17950 -67596 -62955 7723
12667 7723 6668 -38581 -15761 20760 56426 77123 -1257 -23869 41713 125336 223604 306448
12655 306448 302248 277056 163029 165799 155058 151041 127816 87188 78913 26482 75589 76893
12643 76893 15510 -68036 -133500 -185566 -148844 -77289 -100552 -214573 -149886 32430 41910
12632 41910 65152 2123 5218 30334 8557 8124 -16213 -10575 12182 42476 43853 59924 101257
12619 101257 72501 -96514 -122005 18660 42414 10017 29732 32263 -8957 87834 84234
12608 84234 10911 -34678 -67369 -97688 -72181 -91781 -158985 -188535 -191731 -219281 -217447 -190545
12596 -190545 -147593 -6065 92013 25176 -42819 -71653 -45350 -39478 -15885 19561 102765
12585 102765 65304 807 -123431 -183770 -144410 -103342 -110116 -117066 -91704 -47057 -39723 -117591
12573 -117591 -70389 6300 107524 81053 28975 51568 733 -8191 24151 35410 -30909
12562 -30909 -60865 -139348 -167223 -101823 -90334 -137923 -185118 -156952 -27258 62357 103322
12551 103322 44702 14574 48266 128396 119988 103092 107450 140166 76968 -72785 -95002 -38828
12539 -38828 -991 -36216 -89793 -99439 -138824 -109766 -147032 -135596 -87668 -60305 -14698 -20365
12527 -20365 -27789 797 9928 24708 58551 81508 70408 14181 -17045 92473 134070 78095
12515 78095 -68127 -94293 -99625 -25716 -812 -11986 -7744 45181 -8068 -85180 -87053 -25528
12503 -25528 -19752 10563 -57995 -105077 -54605 -87862 -182171 -107346 -76042 -142965 -98972 -64931
12491 -64931 -11746 41285 56687 22759 121 52512 67545 75752 33481 -8776 -18031 26182
12479 26182 20649 -78532 -107162 -149721 -169168 -106126 3150 46372 -20494 -34665 15119 18832
12467 18832 -30260 -3790 60598 27613 -20438 -10289 14070 24419 59461 80210 94813 94457
12455 94457 72953 126211 69425 -61750 -120448 -171291 -126252 -74918 -43743 -13895 90222
12444 90222 124467 46970 -39400 -31049 19317 12034 -492 -114848 -158775 -156459 -71452 -2427
12432 -2427 -56902 -110631 -66226 -29276 22065 95347 65971 24300 8351 18995 13228 37172
12420 37172 -2160 -597 -6513 -23591 -67710 -44552 -48468 -26294 39769 22962 38578 43093
12408 43093 51386 31430 -6602 5921 26523 52728 26106 -11508 -7133 9547 25461 34515
12396 34515 29201 55881 83645 124793 98160 60074 18093 -12754 38544 47783 34973 -30559
12384 -30559 -17501 -17954 -25235 12359 66922 89815 57766 14609 -20411 11243 20398 16644 24762
12371 24762 4494 29984 -33669 -67850 -120193 -167903 -141312 -10213 50570 -32750 -53355
12360 -53355 -11308 60474 72119 29946 36908 89120 88933 59843 -45169 -89885 -139683 -68217
12348 -68217 13439 22223 48654 10515 -33244 -25675 -3733 25452 70447 30198 -80052 -126024
12336 -126024 -79944 -96676 -52227 25124 7142 -22442 -74091 -45337 -22221 -14896 19876 49262
12324 49262 87645 157030 99547 -17227 -86597 -114770 -69231 -107900 -114000 -77262 -50341 1720
12312 1720 46157 34644 13463 15368 1959 2156 -14926 -81027 -103988 -145893 -76100 -55975
12300 -55975 -1351 23588 -44410 -52138 -14329 -2934 -68192 -143944 -152387 -200794 -216980 -74870
12288 -74870 -1710 -38939 -63294 33292 3608 -91264 -149245 -174701 -150988 -123549 -92361 -86620
12276 -86620 -53842 -18821 55703 68381 37472 52928 -26304 -87349 -48734 -115898 -148342 -165866
12264 -165866 -154399 -186948 -196722 -174996 -141745 -121326 -149424 -151163 -152718 -132073 -89808 -41453
12252 -41453 -13757 -32069 -113325 -129965 -108785 -22541 -9960 -17591 -101741 -76451 27593 21485
12240 21485 -14774 -24614 -32081 30638 -30651 -54913 -59544 -39038 -113693 -47009 2646 -16936
12228 -16936 -53289 -105636 -62445 -12527 4942 -20137 21284 -14191 -67241 -77419 1545 38955
12216 38955 37072 22667 30175 11689 -27726 20636 35029 4767 52781 89151 16290 9781
12204 9781 28614 -27467 -20637 -42704 -133731 -103342 -77487 49720 28476 -12849 -35407 -65907
12192 -65907 -104764 -132392 -134099 -37911 -5099 49473 115008 141153 146455 93930 72591 61154
12180 61154 13203 -59362 -80484 -31347 -23944 -101398 -68169 66275 8952 -72064 -100555 -89403
12168 -89403 -30444 -70327 -88124 -37584 -41061 -2037 60153 79799 98041 107185 132410 103080
12156 103080 99051 90627 69239 25532 8225 52452 157528 129955 70689 45861 10247 -30165
12144 -30165 -63404 25920 10128 -53836 -58357 -59746 9820 53441 66788 90486 119714 73715
12132 73715 53552 132040 97547 -25221 -81125 -83755 -48778 -9728 -18907 -76709 -89932 -35188
12120 -35188 13378 -14195 -80904 550 17297 -44641 -101385 -160912 -147311 -96385 8994
12109 8994 14731 15641 44415 65327 178113 218009 179490 109247 88457 95169 85154 66245
12097 66245 100194 123617 28691 -58310 -36706 -57358 -47031 -3200 31477 29779 31239 13113
12085 13113 23651 -19403 -80262 -76642 -46449 -28933 -14322 37157 57795 14980 69922 88284
12073 88284 47793 -6388 -72990 -40236 -29870 12410 31329 124961 112715 93402 103767 91871
12061 91871 101486 120860 106338 72706 35693 -20488 -22646 -41234 -28508 48498 57911 22400
12049 22400 15663 20749 -208 -52124 -43403 1374 52445 120274 88166 65017 -20001 -72202
12037 -72202 -78505 -4149 -29726 -56870 -7834 -9685 -45835 -42329 -40393 -22189 -19944 -72653 -55746
12024 -55746 -20650 -128635 -98112 -33887 -19165 11826 20576 50190 78520 77114 43577 44791
12012 44791 -7511 -84270 -55846 -36323 2177 -7620 1488 -26708 -10769 -50804 -121473 -48367
12000 -48367 12815 -5864 -47007 -61069 -16528 23660 -39561 -41255 -40805 -36711 -15597 26933
11988 26933 40476 92724 82121 19623 -33681 -55256 -41952 -38983 46104 44135 -17198 -78947
11976 -78947 -106901 -77608 -117368 -150835 -89637 -24118 40504 13285 16821 47109 86682 6094
11964 6094 -16828 5033 4002 23122 2997 -6020 -26834 -60708 -97955 -70294 -39156 -71482
11952 -71482 -130815 -190708 -102466 -16299 -19782 -52958 -109771 -68462 3624 41908 7056 -60401
11940 -60401 -34913 11142 -54084 -111127 -47252 19441 18212 12016 8312 62189 79538 95370
11928 95370 65595 -28880 24625 69074 -21859 -128819 -155657 -122645 -53107 76889 85477
11917 85477 36623 3523 -15692 61705 65967 90035 127665 101018 72176 -22892 -49527 4371
11905 4371 10851 67823 90476 32869 33567 6260 -7374 7164 -26505 47241 28082 59685
11893 59685 76906 48236 58137 63483 46232 44463 36448 -6541 20293 45062 90556 118098
11881 118098 169531 113913 11916 5611 10571 -18303 -12260 -4555 -31555 -14550 34726 87092
11869 87092 42394 -7600 -7475 -41062 -115855 -77234 31300 37586 -67010 -99469 -80856 -44955
11857 -44955 -29733 41554 98648 105027 55107 43708 -16516 15940 48731 -24023 -33819 25508
11845 25508 78378 74493 -1315 -40889 -39897 6523 -15692 -55362 -33668 -92955 -63447 -54717
11833 -54717 494 -43752 -89822 -118352 -115342 -49693 -73596 -127277 -131705 -10141 70085 69973
11821 69973 16580 -8563 -131804 -65423 -39267 -71054 -162499 -138323 -109728 -35656 39908
11810 39908 121167 50067 27460 12736 -49255 1293 61595 71296 91316 123032 13999 -84090
11798 -84090 -104770 -102087 -53999 21422 51678 6884 -85121 -71129 -30600 -139425 -113719 -72643
11786 -72643 -96569 -92097 -44857 -11819 -8257 -23498 -26250 -29019 -21026 -37087 -108954 -78144 -99043
11773 -99043 -17489 20050 66294 -5494 -75906 -77710 -66868 -109852 -149443 -145438 -72106 42946
11761 42946 42021 -46714 -87447 -137125 -135731 -103384 -94791 27836 59921 34525 74698 56268
11749 56268 51105 64429 53169 73712 134778 127925 79465 -12403 -83585 -73647 -26412 26704
11737 26704 4013 23156 19370 -11629 9039 -26193 51103 55356 68089 -11059 -90356 -110156
11725 -110156 -86835 -14480 -27371 -20949 -31271 -40459 -43041 10945 22002 88756 8880 -72387
11713 -72387 -44223 -22005 -54836 -41166 24814 41277 12200 -16654 -46256 -22950 12068 46523
11701 46523 107288 103966 -40 5562 -60869 -92662 9134 29729 -24030 59769 75273 47243
11689 47243 33530 43 1021 -55090 -45800 -58767 -29024 26545 17022 -51773 -42541 -21808 -79583
11676 -79583 -135198 -148678 -87364 -3649 147729 248761 212728 192636 98349 65011 39135
11665 39135 -37978 -101874 -64561 40247 148092 163044 112689 83689 24288 -42556 3162
11654 3162 -16116 -55957 -100802 -42284 -7910 37686 81510 123583 96213 29840 17611 34417
11642 34417 -40829 -164214 -126287 -111773 -112977 -99809 -39142 -34857 -15001 81634 105675 50229
11630 50229 -33376 -58830 -28995 32661 109737 109115 36480 -29376 -35182 -77739 -48807 -56751
11618 -56751 -63599 -49216 -93272 -142686 -109756 -52165 -30798 -33418 -50019 -51597 -34329 26219
11606 26219 53223 -3570 -47048 -51765 -40656 21373 72370 7327 -28594 4385 41453 31492
11594 31492 11796 74029 46055 -47641 -142811 -149599 -121977 -41865 -4454 -22024 -45770 8537
11582 8537 -28109 1149 76708 130239 125088 139762 142257 45652 15424 -42591 -49758 -44697 26522
11569 26522 48316 60800 133469 129430 -15251 -41819 -44293 -58618 -17408 -114937 -169625 -104195
11557 -104195 -104985 -156860 -103166 -6329 -16052 37229 56763 139 -90365 -99607 -4437 2822
11545 2822 -18224 2368 25027 1734 -28375 -66626 -55180 -85542 -42460 -33321 -44637 -37617
11533 -37617 2615 -1336 -32588 4486 52939 -57591 -39871 9799 -20608 -56816 -23104 -90008
11521 -90008 -98547 -53436 34584 18325 -1737 -82830 -24650 28867 10055 7292 -20812 -91744
11509 -91744 -116737 -70429 -94417 -141379 -111210 -86092 -76092 -51914 1032 -52534 -141595 -171242
11497 -171242 -155594 -117781 -141645 -182739 -127988 -58430 -92371 -115175 -50590 -49828 -121322 -113343
11485 -113343 -122805 -76096 -41598 -15735 57372 97739 144789 149996 113777 97583 85257 -8582
11473 -8582 -34194 70488 121214 12381 -68893 -51717 -43688 -91075 -92087 -74644 -62752 -5471
11461 -5471 63399 34090 -12347 -48371 1163 -86643 -109306 -113139 -148938 -139458 -91851 -92942
11449 -92942 -117898 -123123 -117927 -91094 17832 112522 108029 99709 78134 92101 100760 34168
11437 34168 30584 -3693 -44302 -25240 35241 71250 67245 45070 -46441 -8871 43193 23943
11425 23943 -64803 -106452 -174567 -133213 -58577 7195 -60307 -50585 -47523 -87193 -118468 -66480
11413 -66480 -5115 -57436 -40789 -27508 14367 -7156 -22709 91455 70303 3947 -3282 -6674
11401 -6674 12205 37047 56056 20184 -19829 -70432 -65377 731 -22368 -73749 6380 98569
11389 98569 47999 15812 -20740 -22873 -987 -28287 -4967 62052 125468 122835 73157 88340
11377 88340 62739 -2100 46640 19256 55519 77963 -1246 -31425 24623 -78325 -89132
11366 -89132 -89598 -148250 -85420 9877 28378 29925 4918 17264 98455 -37918 -151833 -121185
11354 -121185 -111951 -65429 -2636 -23386 -69628 -25043 -23292 5297 17791 20420 54080 55994
11342 55994 -13567 -100892 -145698 -170238 -109791 -93936 9355 79530 53809 -7601 -20854
11331 -20854 7817 83758 121182 28503 12353 -34450 -118419 -143549 -153343 -77957 -31549 -62453
11319 -62453 -12600 27473 818 -72055 -109764 -138246 -56182 -9531 -80201 -15060 15651 65489
11307 65489 119380 45662 -64404 -90245 21826 35749 -39225 -71107 6196 63839 71932
11296 71932 2645 -18921 -6162 13770 5931 4654 74328 122108 135935 72789 26291 47845
11284 47845 30287 -45501 -51325 -12671 12297 13583 -54947 -113722 -61330 -876 48702 41966
11272 41966 71695 50361 48077 44225 31573 75072 -14811 -55734 -73561 -54732 -30780 -9825
11260 -9825 1412 48334 48380 6430 -4364 -103508 -93486 5045 29927 18232 69344 84577
11248 84577 98159 180254 231721 185341 155583 208018 181348 144297 144758 75270 -4931 14667
11236 14667 72616 71158 31716 16314 18700 63618 74833 14804 741 52565 108627 161187
11224 161187 141799 128343 107668 67671 81388 73012 -3525 -49388 -140571 -153588 -105781 -44821
11212 -44821 -36456 -57479 -74188 -37050 39642 43492 34856 13906 13117 67694 -2776 -98580 -17440
11199 -17440 20418 -18773 7916 35140 54539 -2176 -49653 -67506 -83759 -102364 -65983 -75586
11187 -75586 28585 115113 105280 74989 107949 93134 114808 95935 75085 133159 143961 129573
11175 129573 109350 70719 43097 51065 144712 123434 80258 137228 116801 13973 -66392
11164 -66392 -100276 -109551 -102291 -15918 67205 67236 -10646 -24201 1815 85994 51322 13353 19770
11151 19770 -22501 7041 3758 19695 -10066 -41707 -70940 -155132 -185193 -147610 -127926 -103315
11139 -103315 -145230 -152981 -153639 -103115 -129324 -177246 -221106 -161618 -24262 37486 -6872 -56988
11127 -56988 -12296 42145 27195 38169 81301 118572 140128 81778 -55199 -112146 -128213
11116 -128213 -119763 -105295 -29193 -5237 -23190 -5987 9827 10552 34127 -14784 9273 48497
11104 48497 39562 -24930 -57296 -55960 -20495 -22239 -59060 -27713 28119 47894 64120 108233
11092 108233 104498 62781 38286 76354 65681 52973 -3631 -75595 -39614 -85522 -98717 -35493
11080 -35493 23399 53152 8892 -26068 -38143 -10102 10408 -36043 -51765 -18493 -82770 -44879
11068 -44879 48841 43917 35731 59703 42175 -16616 -19693 -43650 1283 85 -81282 -95899
11056 -95899 -27123 11447 -12006 -10571 49885 47881 52628 60634 57624 93482 63577 -33547 -87118
11043 -87118 -81035 -107008 -94602 -61019 -47062 -76023 -92672 -50435 -13606 9543 -25663 8239
11031 8239 22336 47564 77199 26858 13018 35206 62958 78337 54274 29561 72779 64412
11019 64412 59986 19399 -11431 -36747 4638 -15220 -100152 -147183 -140185 -55217 99431 128277
11007 128277 114860 23918 -128064 -126016 -82751 -58237 -58052 -141901 -206292 -107427 25191 52127
10995 52127 65564 30128 -31504 -49646 -72295 -31661 -24544 -59805 22349 44693 32417 -18119
10983 -18119 -54367 -138433 -101028 -111449 -114144 -181909 -164776 -88436 -116816 -124648 -83016 -87549
10971 -87549 -95293 -9924 69066 55065 84346 53703 21731 24381 13876 -11208 -15870 -23687
10959 -23687 -34628 -8922 -23194 -65677 -47210 4639 -7515 -68819 -58545 -110608 -50401 34347
10947 34347 27689 -8648 -41085 -55863 2028 50291 106271 100259 51512 26878 25619 103608
10935 103608 58868 -102376 -221406 -249507 -249371 -186454 -20777 48929 13593 7517 -32196
10924 -32196 -49677 -88531 -51550 19030 26302 21070 -13835 -24407 19182 -9269 -33659 -41406
10912 -41406 14915 75289 64741 11466 -4976 768 -18816 -30656 -75747 51564 82958 89378
10900 89378 112855 146522 122651 63401 100518 81565 -34438 -30893 5650 -26826 11542 59330
10888 59330 13538 26542 -18327 -14831 1607 54247 128737 37565 -49896 -66399 -110319 -62066
10876 -62066 21234 55479 29417 76836 149016 140141 133838 94892 14967 99091 77758 71037
10864 71037 1775 -91315 -122381 -141677 -137131 -141993 -76888 -1507 18432 16310 -13930 -52667
10852 -52667 -36390 -85520 -37694 -41360 -47915 -33192 20746 9185 34874 63258 11695 -43386
10840 -43386 -1875 -1755 -13572 -50286 -30131 -82862 -44447 -2444 6485 12207 2455 72733 22101
10827 22101 -51525 -50744 -21279 -14256 45113 80184 129875 66691 12539 -10998 57589 80614
10815 80614 69105 8919 31535 53369 89345 104016 133299 62786 20855 26144 -31268 -37312
10803 -37312 12187 75245 51986 66461 124376 49510 -4094 16962 15249 -13802 -17518 -23533
10791 -23533 -65057 -99457 -109487 -64471 23669 70422 48832 42514 51119 -583 -41613 -49916
10779 -49916 -36647 50101 49212 57541 56210 67627 87654 1256 -114016 -93818 -53907 -36251
10767 -36251 -40594 -4136 7946 -67479 -61993 -27144 -36404 5754 2369 -32170 -32324 -56496 16684
10754 16684 8115 2502 56334 66021 35977 63032 69976 40715 -49693 -133281 -43177 -44481 21122
10741 21122 38849 83739 54538 107668 83346 60541 36610 203 28031 63908 51801 -25965
10729 -25965 -20747 -33091 -16498 15011 115497 104977 70911 17313 12287 18138 29495 32684
10717 32684 42530 56681 30110 1476 47464 92395 115336 133921 127344 116596 87740 88286
10705 88286 96197 122093 57800 -57989 -53141 -62813 -69872 -112369 -184128 -87480 -55696 -112741
10693 -112741 -173402 -183017 -146003 -113953 -150600 -94343 -42251 -66882 -60769 -54995 -29392 -52416
10681 -52416 -27737 -26955 -37571 -93409 -119489 -118296 -116358 -117709 -50108 -21043 -48492 -111175 -132547
10668 -132547 -75255 -58712 -63450 -9302 -26936 -74586 -128082 -43636 -31591 -59435 -2390 28589
10656 28589 -79890 -107151 -150758 -143627 -114418 -94102 -62263 -16576 19069 21040 23220 25591
10644 25591 -29954 -75128 -97028 -130285 -69726 52755 48199 41889 -1648 3035 -17401 -59832
10632 -59832 -19205 -60126 -110784 -131684 -108149 -1970 123807 140180 93420 12043 -15390
10621 -15390 53977 36255 80659 49136 18179 -17936 -91149 -13771 -13644 20521 50957 9509
10609 9509 -733 39108 70748 64864 134729 158792 148964 70830 48753 24859 6347 -6105
10597 -6105 6413 9787 -55428 -151397 -103828 -8122 -36074 -32532 -53507 -47377 -5108 -12318 -52135
10584 -52135 -84376 -120641 -109970 -125469 -108947 -126745 -136745 -76262 44137 109837 73359
10573 73359 96286 35062 43871 62169 97745 88132 100605 96732 36555 93138 88572 23246
10561 23246 32564 70243 58156 13304 41005 -1190 -63863 -73598 -50281 -15747 1791 10754
10549 10754 12346 30781 77638 109690 44938 68352 40667 30057 9569 -70727 -102019 -37026
10537 -37026 18347 327 8947 28439 53548 27818 -29995 -97880 -71034 -3617 -39057 -95742
10525 -95742 -119698 -179063 -118845 -59596 8958 62989 10197 -26825 -39732 -13883 42003 90470
10513 90470 71700 95463 58783 19904 14479 26923 43976 57327 41709 79487 103310 85551
10501 85551 80222 61537 14441 -40348 -49277 -13364 -3774 50683 116813 100207 4717 -13575
10489 -13575 -19770 -95254 -98321 -21888 23514 16511 14872 -16631 3270 8362 5316 31929 -48628
10476 -48628 -91537 -81048 -96948 -72622 -30452 -34161 -29832 -25839 23981 90719 93830 62346
10464 62346 105432 249883 219008 149158 122887 118604 124204 118816 68009 -7412 -31568 29264
10452 29264 -6172 22194 45417 63352 25317 -30801 -1976 69783 52085 59616 90047 48506
10440 48506 -25750 -76802 -20403 44817 61317 71491 20188 17752 131192 193706 156181 211005
10428 211005 194228 148758 80926 63785 84790 47134 60348 149185 247597 236150 231628 254636
10416 254636 248655 234609 279543 338251 333224 294564 337484 436187 650293 846162 1113802
10405 1113802 1502386 1901020 2119601 2276763 2312606 2319682 2302062 2281765 2227081 2205516 2269736
10394 2269736 2300330 2287973 2224685 2075045 1860432 1658709 1439534 1204846 996332 848205
10384 848205 772086 631081 596230 641008 543249 408282 431790 487812 487011 396095 317908
10373 317908 244550 217782 238204 330905 334810 361566 363874 340321 249691 115875 78910 79205
10361 79205 54358 20083 56814 119146 176169 275540 273614 218510 256528 236686 184035 196493
10349 196493 264078 278479 301090 257842 202246 180314 152207 191150 229271 204447 222004
10338 222004 217447 193056 99966 25390 89480 132407 75698 92859 109896 94899 111931 150291
10326 150291 116211 62815 93686 26590 35367 151619 168103 167341 126499 148225 109100 90629
10314 90629 78335 77153 144084 174246 99154 113560 130553 -16006 -60440 14568 21353 46816
10302 46816 122589 65771 71909 34748 19051 -46139 -130159 -57451 -45152 -11272 45844 49687
10290 49687 13185 15983 -1174 9923 43658 40908 79091 98718 52888 42271 93867 131160
10278 131160 102735 49245 -26757 -12638 29554 -1065 19782 10313 -3510 11515 73495 52233
10266 52233 28623 -19795 510 -22354 10956 107756 41642 22208 57722 114932 71692 103188
10254 103188 106329 54628 41564 26490 -9344 -1404 18718 12836 44785 12748 -35052 1583
10242 1583 -8448 -49079 -37570 29979 38435 23690 52217 -23152 -56760 -88404 -20220 277
10230 277 6381 57702 -7334 -74444 -98243 -58429 -75956 -60857 -23343 65136 76659 41212
10218 41212 32294 100000 137077 150946 154481 109437 -24188 -50497 20838 46121 81509 82706
10206 82706 78760 128328 175166 147330 39804 63835 65043 67912 30323 -68960 -50433 -16643
10194 -16643 -27290 -2037 66352 73807 106122 104740 42753 32094 32752 99866 7631 -18797
10182 -18797 -19467 -55923 -77729 -140816 -88227 -81937 -85085 -14634 -37869 -31769 -113498 -111534 -83914
10169 -83914 -59496 -71428 604 24128 -4967 11239 17347 24853 63545 82971 28714 -122719
10157 -122719 -173168 -99593 41972 80138 74632 66899 36424 -7595 -42434 -100151 -103649 -108814
10145 -108814 -42587 -24771 -22896 12614 70431 120546 82197 78097 11214 -99821 -70753 -69826
10133 -69826 -89084 -41910 30955 95893 86412 47786 32406 42476 26632 89914 135420 81052
10121 81052 119358 229253 146819 10556 -102826 -58619 15722 -885 -69560 -120553 -88150
10110 -88150 -129895 -144105 -60735 11150 -13998 15411 38788 -5810 29764 -4496 33842 96999
10098 96999 130707 103193 93342 83226 -4757 -36695 -62199 -35258 40487 107948 144747 107919
10086 107919 87290 100819 108644 122307 159562 117671 132248 154088 161283 101093 58256 32258
10074 32258 8021 -3432 44551 114420 82211 -12048 -1116 -11831 15338 -9769 61048 152144
10062 152144 159731 137317 88545 24227 12779 134 -35987 -53302 -38447 -36612 -34716 11290
10050 11290 58167 98257 92677 84483 67698 3543 -62004 -47112 -4223 15484 11620 -9578
10038 -9578 -91771 -71163 -59832 -89237 -97706 -82323 -15926 27155 24989 23297 21199 99383 161948
10025 161948 90630 15071 -1013 4269 69672 142039 130608 66723 -119360 -185679 -62802
10014 -62802 -4907 -6134 -78187 -79941 -103002 -35749 -9334 -55415 -48838 -42194 4964 134213
10002 134213 133484 131583 153884 177910 182510 135384 67735 66048 44692 75532 39909 19418
9990 19418 55617 123977 73248 108870 16281 -45124 -35594 33365 87702 61745 73590 51113
9978 51113 39981 21237 79942 65394 7091 -64668 -103651 -106050 55560 83137 -4001 -94918
9966 -94918 -89473 -99183 -141812 -160882 -72276 21534 82037 70519 19596 4490 4529 -47595 35997
9953 35997 144773 117269 102781 100653 102140 81350 71483 50993 28087 56601 37480 32660
9941 32660 89027 98718 74441 88473 61734 21062 32917 -46557 -61078 -31873 -105215 -91981
9929 -91981 8237 -9596 11607 94033 108299 38959 63476 36746 -20867 53723 56374 110517
9917 110517 110022 108851 68062 20439 -61244 -33234 69601 131512 156576 174382 105674 123724
9905 123724 185334 139785 185442 202054 145918 23992 12795 73185 57259 102869 147182
9894 147182 195367 174828 177674 190936 166576 84542 40478 16992 -45711 -30391 -80088 -12947
9882 -12947 49452 72124 -8137 -72273 6134 9296 -7390 35618 -29677 -43344 29584 44421
9870 44421 26575 -65715 -82492 -40633 -42387 -15094 -64460 -149428 -119156 -68016 -42349 -46108
9858 -46108 -3683 90940 106934 130411 68191 70450 85749 87103 96702 63313 67236 117763 169791
9845 169791 251925 224527 134029 124627 159194 201978 149609 108004 125868 124974 22741 -13516
9833 -13516 -33003 15884 99990 150023 74463 43473 14297 8428 33259 11685 -41911 941
9821 941 -35934 31719 131091 108816 46594 59618 46351 45562 97691 67961 38767 9232 -11036
9808 -11036 -46059 -105291 -76617 -26669 5216 -15920 14698 -2219 -54439 -42534 -40626 -1209
9796 -1209 35886 101315 97272 26260 -17149 41087 27185 48728 -37421 -24793 35773 92947
9784 92947 148320 144730 120162 38216 -21361 -25840 -25452 79721 34810 -36713 17239 105967
9772 105967 165281 200761 149139 81421 66929 76416 28959 74065 97050 47425 -10217 2292
9760 2292 48982 13711 -41524 -13932 36728 87820 136539 123962 156870 172133 123791 88949
9748 88949 5468 -60800 -145158 -169417 -130537 -35898 45979 62558 83177 98036 65697 37014
9736 37014 42224 41485 49966 55472 -21872 -73436 -43746 -45540 -61349 -21406 11887 4157 76167
9723 76167 45102 43118 41037 58453 124778 126074 103077 135516 96974 45317 65166 47073
9711 47073 56729 77486 60506 44392 22624 -41985 33565 -10768 23977 74959 98272 74783
9699 74783 35512 -1093 9974 23748 -14163 -21044 -6338 46631 53967 36222 50087 59386
9687 59386 31274 11516 -2482 -13452 243 34114 109576 109982 129586 145211 156778 74684
9675 74684 74964 88578 93047 170559 225600 132945 43600 -35561 -39646 -45024 -195 81622 63521
9662 63521 35420 78852 82484 32250 37082 19689 79258 75719 5712 57689 52081 107845 148149
9649 148149 139102 115492 114092 152401 121308 107099 144299 106288 58793 -20242 -55494 -30292
9637 -30292 102212 197263 247137 217789 186163 140398 71596 79686 59043 9319 -263 49937
9625 49937 102013 94429 27273 -25240 -16133 63882 84167 11628 11658 65475 74825 97029 125717
9612 125717 99165 104065 118707 183158 229691 220918 200212 113434 118757 110882 110475 167182 95981
9599 95981 11138 -45094 19342 131970 109952 187987 160357 72252 -38103 11986 56985
9588 56985 43175 139199 150070 145173 115614 123608 101599 73593 115836 126322 132519 10136
9576 10136 -28764 -36359 -76917 -14308 38188 96500 115064 118653 9954 -65791 -58010 -40855
9564 -40855 9488 15768 -15127 -18402 -43497 -41557 -34209 16109 117202 138216 156078 209572
9552 209572 217332 135595 51454 56248 83381 90747 59506 42019 69611 161528 205693 220536
9540 220536 136167 126117 105371 98603 53050 29451 -61818 -99832 -2809 22805 -14928 16851
9528 16851 8895 -36585 -79449 -26384 37847 49016 72447 67669 113944 168771 280219 283458
9516 283458 156246 38015 10355 23099 38009 -37608 -48316 56005 37592 63071 35687
9505 35687 23394 63900 185227 234679 259610 227540 220207 109757 49522 116193 175141 184602
9493 184602 179502 156342 40757 48374 98031 39892 -12331 37174 7700 36916 160980 131895
9481 131895 88325 74379 86401 125878 111270 127998 174611 116150 154232 154145 179934 157420
9469 157420 123186 123479 155176 187460 125118 48528 140032 141758 166810 178834 232605 244035
9457 244035 263091 218079 190381 217508 281048 321037 280138 193945 173505 155057 180467 203765
9445 203765 166193 214884 156565 80662 95564 165420 257722 273488 236454 203091 173196 114322
9433 114322 116799 121237 175428 184492 178437 135544 112689 136696 158164 134858 259211 356219
9421 356219 382039 374297 400973 465177 484114 479029 531077 486617 351539 370707 390726 388617
9409 388617 420460 381062 345763 347097 383158 404605 373935 369705 335226 334038 330040 289652
9397 289652 267746 273224 278666 250762 313983 399038 314369 281161 249374 232504 246610 211456
9385 211456 246829 282766 256068 228288 214054 255639 334266 338615 312365 347493 369750 368450
9373 368450 373875 432616 441857 479822 472905 360813 344975 421750 469700 389071 302111 324522
9361 324522 334663 414868 363377 325410 308267 233123 238604 260791 332507 282264 200792 197585
9349 197585 213762 232992 226643 156497 115066 203935 286334 330563 279315 175732 159110 239552
9337 239552 269694 275582 238924 256887 283334 302385 319727 323440 297866 239502 247604 331058
9325 331058 351966 373260 344756 326497 328301 390732 380543 444632 455779 466718 500099 521889
9313 521889 521287 572424 651389 664947 672910 610120 601377 550842 533179 464642 492516 488682 491854
9300 491854 518717 562840 631666 585686 475474 378887 365149 415721 465699 425993 395957
9289 395957 410888 440034 427475 400835 454120 465544 457396 533933 535054 523787 498749 453699
9277 453699 468079 551249 637906 621886 655751 728205 810387 915056 985331 1071015 1257377
9266 1257377 1341645 1375965 1368415 1397846 1427753 1320024 1232699 1278945 1293864 1272288 1275816 1325923
9254 1325923 1265700 1187115 1195775 1280781 1379801 1351916 1264684 1202926 1162309 1143628 1148677 1125653
9242 1125653 1103029 1129901 1167859 1156385 1124073 1086270 1090179 1072615 1070686 1073342 1069023 1193254
9230 1193254 1266962 1239971 1298648 1378511 1498329 1556328 1621824 1761462 1903829 1956011 2005300
9219 2005300 2150105 2222324 2308002 2344956 2416495 2499796 2554147 2646678 2693317 2719222 2693155
9208 2693155 2628860 2589019 2573344 2448044 2305013 2182599 2175417 2078781 1922989 1883140 1897914
9197 1897914 1844816 1842003 1827790 1828808 1882436 1885993 1826793 1842043 1880318 1872975 1849345 1785687
9185 1785687 1865103 2025325 2037869 2025418 2094246 2121294 2188784 2310054 2581981 2744599 2966660
9174 2966660 3361462 3715824 4188295 4674657 5248830 6113804 7281275 8902810 11419448
9165 11419448 15842125 24146690 37220639 49427918 54762254 47886042 31573464 20329142
9157 20329142 14531094 11324359 9426698 8223491 7279235 6581187 6124434 5813914 5579864
9148 5579864 5279608 5015396 4757170 4570380 4364552 4147729 3878216 3633367 3485963 3350867
9138 3350867 3155663 3019123 2917386 2795457 2734935 2652981 2511056 2309670 2185181 2159138
9128 2159138 2129454 2051784 2107109 2157614 2177237 2245891 2267619 2366075 2481396 2499852 2526611
9117 2526611 2440689 2364553 2358092 2303885 2207892 2215417 2246388 2277775 2178376 2097116 2035318 1953239
9105 1953239 1836136 1650007 1508844 1471817 1378286 1271850 1171178 1037316 996301 1054850
9095 1054850 1126860 1064088 1021396 1059366 1042830 908551 819755 912026 925238 918938 904933
9084 904933 904939 882259 871069 930356 961190 925781 867023 773452 745073 742854 693185 619373 642941
9071 642941 698817 670502 749703 803955 751307 631610 604306 647462 544552 518204 574378
9060 574378 526713 513058 475329 455809 450922 403088 383218 359113 319148 366107 416315 440239
9048 440239 364771 364826 407459 439751 511065 528652 538571 487467 479936 473672 410622 423105 443631
9035 443631 509878 570958 494644 493527 498225 484095 385355 345363 345294 308834 320869 345210 326015
9022 326015 303211 402750 395003 355853 333633 358592 376003 387222 322804 317024 335551 322092
9010 322092 292598 263369 299122 379662 400718 346557 340758 266927 296565 323214 458381 442448
8998 442448 350198 277874 238221 248517 281545 282577 383375 443598 458257 460926 502548 516193
8986 516193 468904 386825 438283 462667 377270 346495 361367 375346 297619 267561 323138 381911
8974 381911 359378 312660 361827 372868 352844 328564 307071 308254 322020 292676 293989 299498
8962 299498 288820 345746 342285 344604 362234 357250 351194 292484 299181 334008 307717 342198 416015
8949 416015 507618 538791 528194 527134 548696 572241 539883 487357 436542 450111 491640 519200
8937 519200 560991 599078 540293 604540 593681 512268 473566 468676 504504 487037 558858 619083
8925 619083 630339 554755 580567 557224 426956 395410 450871 517204 511724 461559 438840 460686
8913 460686 474038 459479 394582 359330 362621 427153 400026 340301 388681 409232 386197 380990
8901 380990 335084 345794 365223 470025 507224 501397 594002 602052 615189 666467 640593 577870
8889 577870 579194 663985 621760 556213 550570 564597 596682 660988 755041 853507 998906 1137518
8877 1137518 1103261 954413 791167 737037 708337 607000 505367 500984 496335 507774 565241
8866 565241 563762 538711 516975 485510 548617 593452 535322 507633 522903 506137 522907 637591
8854 637591 702170 741771 785707 807923 821912 886895 978833 1066984 1127427 1152124 1158004 1157237
8842 1157237 1125357 1073059 1125572 1252330 1330669 1463488 1624276 1870236 2117874 2253264
8832 2253264 2360266 2425962 2466293 2312781 2040294 1835280 1704414 1602084 1536145 1506607
8822 1506607 1441431 1361498 1202881 1087779 1055442 1080811 1038782 968539 1042836 1057624 1070704
8811 1070704 1150946 1233521 1253600 1288384 1405261 1561212 1686898 1882594 2056467 2213946
8801 2213946 2316228 2439102 2560797 2701282 2827728 2984604 3198659 3430596 3611423 3767229
8791 3767229 3894302 4034798 4220424 4362998 4506268 4613945 4619629 4577363 4554999 4509362
8781 4509362 4331113 4125118 3959544 3740074 3401551 3092907 2839621 2620956 2533225 2451652
8771 2451652 2382287 2301369 2181597 2140842 2142282 2070913 2017788 2044800 2110150 2181517 2254084
8760 2254084 2277316 2354111 2405925 2440095 2559656 2685193 2784795 2962078 3129359 3162799 3240186
8749 3240186 3372303 3458689 3703588 4056364 4322223 4481219 4675684 4876849 5042665 5252316
8739 5252316 5416251 5490897 5597240 5703511 5620907 5423870 5084418 4722015 4340269 3947494
8729 3947494 3691424 3497257 3337384 3213128 3130518 3055726 2998818 2902145 2854968 2848818 2730463
8718 2730463 2664131 2638554 2608462 2596753 2539400 2482968 2321939 2302304 2367962 2443286 2461539
8707 2461539 2544722 2618456 2658394 2589420 2551817 2648354 2768623 2855793 2975798 3106839 3232431
8696 3232431 3411905 3592659 3710880 3858706 3978414 3987043 3898836 3812634 3610530 3443639
8686 3443639 3270123 3040112 2861132 2646729 2570071 2526995 2412963 2341918 2364775 2378423
8676 2378423 2254943 2178651 2144011 2170623 2161196 2133904 2033582 2066264 2042309 1955183 1965559
8665 1965559 1935288 1887609 1943271 1925396 1903645 1931573 1955187 1930157 1926575 1928213 1913406 1902869
8653 1902869 1963947 1935548 1935101 2036731 2141592 2137284 2137981 2144561 2029442 1814683 1683308 1515598
8641 1515598 1474529 1466506 1353162 1326379 1396082 1385235 1305384 1199742 1138868 1078209 1027411
8630 1027411 1102607 1064035 1033479 1112179 1123836 1092057 1076991 1137327 1174574 1221846 1183962
8619 1183962 1166494 1126106 1069305 1089421 1141754 1040620 971553 934456 915128 992791 1020818
8608 1020818 1061363 1138015 1162674 1165633 1106405 1093783 1012803 902894 833953 842251 807578 830466
8596 830466 888046 852598 842519 884168 876125 852053 801884 836261 782032 729940 718834 718561
8584 718561 703727 584195 535616 477404 515010 565466 581352 572661 564667 526661 484006 502110
8572 502110 474560 410124 399829 396577 382326 346325 348997 380251 427743 443511 403933 403756
8560 403756 357059 376832 415767 459490 455587 517278 524117 489323 455742 478198 406511 356874
8548 356874 396649 435896 414153 372481 396177 312907 203137 227664 265238 300654 276737
8537 276737 250478 180500 144936 174699 186445 177777 262205 294321 308188 388701 406296 399514
8525 399514 400861 365887 354726 339275 361752 360518 390586 380294 369673 324707 331252 311397
8513 311397 306921 280014 277499 270941 281724 344837 384791 396236 403464 357619 258006 172771
8501 172771 132602 210522 278707 298554 240260 137115 107233 102976 131049 124502 122059 151410
8489 151410 205990 299169 264724 170051 78796 40354 46145 94709 82377 103165 164303 175974
8477 175974 128428 50841 6646 74782 105224 131668 160455 188567 244145 290134 326979 305217
8465 305217 243414 183292 167197 219126 228306 262349 285635 182603 155174 114815 98970 90891
8453 90891 79520 90519 1741 -75880 -41867 6976 -7555 5649 65602 78676 151756 166211
$$ [...]
##END NTUPLES=NMR SPECTRUM
##END=
