##TITLE=Analysis number 318163
Compound Code cc 46239
Book Reference 453/113
Project Code adrs
Chemist Name lesleyd
##JCAMPDX= 6.0         $$ Bruker NMR JCAMP-DX V2.0
##DATA TYPE= NMR SPECTRUM
##DATA CLASS= NTUPLES
##ORIGIN= Bruker BioSpin GmbH
##OWNER= nmr
$$ XWIN-NMR		Version 3.5
$$ Fri Mar 17 08:08:33 2006 GMT Standard Time (UT+0h)  MAYBRIDGE\nmr@NMR_250MHZ
##.OBSERVE FREQUENCY= 250.131544655141
##.OBSERVE NUCLEUS= ^1H
##.ACQUISITION MODE= SIMULTANEOUS (DQD)
##.ACQUISITION SCHEME= undefined
##.AVERAGES= 16
##.DIGITISER RES= 18
##SPECTROMETER/DATA SYSTEM= dpx250
##.PULSE SEQUENCE= zg30
##.SOLVENT NAME= CDCl3
##.SHIFT REFERENCE= (INTERNAL, CDCl3, 0, 16.522)
##AUDIT TRAIL= $$ (NUMBER, WHEN, WHO, WHERE, WHAT)
$$ ##TITLE= Audit trail, XWIN-NMR		Version 3.5
$$ ##JCAMPDX= 5.01
$$ ##ORIGIN= Bruker BioSpin GmbH
$$ ##OWNER= nmr
$$ C:\u/data/dgb/nmr/ADRS/930/pdata/1/auditp.txt
$$ ##AUDIT TRAIL=  $$ (NUMBER, WHEN, WHO, WHERE, WHAT)
(   1,<2006-03-17 08:07:45.41 +000>,<MAYBRIDGE\nmr>,<NMR_250MHZ>,
      <created by zg, POWCHK disabled, PULCHK disabled
       configuration hash MD5:
       84 BC 41 DB A1 6E 1D 46 DA 25 12 A5 C1 ED C5 3A
       data hash MD5: 64K
       B2 08 EE 6A BB E4 1C EF 6F 77 22 A9 85 B2 04 97>)
(   2,<2006-03-17 08:08:08.38 +000>,<MAYBRIDGE\nmr>,<NMR_250MHZ>,
      <Start of raw data processing
       ef LB = 0.3 FT_mod = 6 PKNL = 1 SI = 32K 
       data hash MD5: 32K
       A7 93 D8 38 39 23 49 69 D8 CA 61 A0 E6 01 4D 27>)
(   3,<2006-03-17 08:08:10.66 +000>,<MAYBRIDGE\nmr>,<NMR_250MHZ>,
      <apk 
       data hash MD5: 32K
       6A 23 17 B0 F9 07 E0 68 EA 82 78 24 54 FB 5C 8D>)
(   4,<2006-03-17 08:08:11.83 +000>,<MAYBRIDGE\nmr>,<NMR_250MHZ>,
      <abs ABSG = 5 
       data hash MD5: 32K
       F8 A7 EE CB 36 26 E8 52 63 A0 A2 F3 20 58 3D 74>)
$$ ##END=
$$ 
$$ hash MD5
$$ 6F ED AB CB 6B 62 12 6A C9 C9 E8 F3 3B ED 98 9C
##$RELAX= 
##$RELAX= 
##$RELAX= 
##$RELAX= 
##$RELAX= 
##$RELAX= 
##$RELAX= 
$$ Bruker specific parameters
$$ --------------------------
##$DU= <C:\u>
##$EXPNO= 930
##$NAME= <ADRS>
##$PROCNO= 1
##$TYPE= <nmr>
##$USER= <dgb>
##$AMP= (0..31)
100 100 100 100 100 100 100 100 100 100 100 100 100 100 100 100 100 100 
100 100 100 100 100 100 100 100 100 100 100 100 100 100 
##$AQSEQ= 0
##$AQ_mod= 3
##$AUNM= <au_zg>
##$AUTOPOS= <1 >
##$BF1= 250.13
##$BF2= 250.13
##$BF3= 250.13
##$BF4= 250.13
##$BF5= 500.13
##$BF6= 500.13
##$BF7= 500.13
##$BF8= 500.13
##$BYTORDA= 1
##$CFDGTYP= 0
##$CFRGTYP= 5
##$CHEMSTR= <none>
##$CNST= (0..31)
1 1 145 1 1 1 1 1 1 1 1 1 1 1 1 1 1 1 1 1 1 1 1 1 1 1 1 1 1 1 1 1 
##$CPDPRG= <>
##$CPDPRG1= <>
##$CPDPRG2= <>
##$CPDPRG3= <>
##$CPDPRG4= <mlev>
##$CPDPRG5= <mlev>
##$CPDPRG6= <mlev>
##$CPDPRG7= <mlev>
##$CPDPRG8= <mlev>
##$CPDPRGB= <>
##$CPDPRGT= <>
##$D= (0..31)
0 1 0 0 0 0 0 0 0 0.06 0 0 0 0 0 0 0.0002 0 0 0 0 0 0 0 0 0 0 0 0 0 0 
0 
##$DATE= 1142582861
##$DBL= (0..7)
120 120 120 120 120 120 120 120 
##$DBP= (0..7)
150 150 150 150 150 150 150 150 
##$DBP07= 0
##$DBPNAM0= <>
##$DBPNAM1= <>
$$ [...]
##$SUBNAM7= <"">
##$SUBNAM8= <"">
##$SUBNAM9= <"">
##$SW= 20.6930455092707
##$SWIBOX= (0..15)
0 0 3 0 0 0 0 0 0 0 0 0 0 0 0 0 
##$SW_h= 5175.983436853
##$TD= 65536
##$TD0= 1
##$TE= 294.16
##$TE2= 300
##$TE3= 300
##$TEG= 300
##$TL= (0..7)
0 120 120 120 120 120 120 120 
##$TP= (0..7)
150 150 150 150 150 150 150 150 
##$TP07= 0
##$TPNAME0= <>
##$TPNAME1= <>
##$TPNAME2= <>
##$TPNAME3= <>
##$TPNAME4= <>
##$TPNAME5= <>
##$TPNAME6= <>
##$TPNAME7= <>
##$TPOAL= (0..7)
0.5 0.5 0.5 0.5 0.5 0.5 0.5 0.5 
##$TPOFFS= (0..7)
0 0 0 0 0 0 0 0 
##$TUNHIN= 0
##$TUNHOUT= 0
##$TUNXOUT= 0
##$USERA1= <user>
##$USERA2= <user>
##$USERA3= <user>
##$USERA4= <user>
##$USERA5= <user>
##$V9= 5
##$VALIST= <valist>
##$VCLIST= <CCCCCCCCCCCCCCC>
##$VD= 0
##$VDLIST= <DDDDDDDDDDDDDDD>
##$VPLIST= <PPPPPPPPPPPPPPP>
##$VTLIST= <TTTTTTTTTTTTTTT>
##$WBST= 1024
##$WBSW= 4
##$XGAIN= (0..3)
0 0 0 0 
##$XL= 0
##$YL= 0
##$YMAX_a= 491178
##$YMIN_a= -524728
##$ZGOPTNS= <>
##$ZL1= 120
##$ZL2= 120
##$ZL3= 120
##$ZL4= 120
##$ABSF1= 16.522
##$ABSF2= -4.171173
##$ABSG= 5
##$ABSL= 3
##$ALPHA= 0
##$AQORDER= 0
##$ASSFAC= 0
##$ASSFACI= 0
##$ASSFACX= 0
##$ASSWID= 0
##$AUNMP= <proc_1d>
##$AZFE= 0.1
##$AZFW= 0.1
##$BCFW= 0
##$BC_mod= 0
##$BYTORDP= 0
##$COROFFS= 0
##$CY= 12.5
##$DATMOD= 1
##$DC= 0
##$DFILT= <>
##$DTYPP= 0
##$F1P= 14.0000005364418
##$F2P= -0.99999901652339
##$FCOR= 0.5
##$FTSIZE= 32768
##$FT_mod= 6
##$GAMMA= 0
##$GB= 0
##$INTBC= 1
##$INTSCL= 1
##$ISEN= 128
##$LB= 0.3
##$LEV0= 0
##$LPBIN= 0
##$MAXI= 10000
##$MC2= 0
##$MEAN= 0
##$ME_mod= 0
##$MI= 0
##$NCOEF= 0
##$NC_proc= -1
##$NLEV= 6
##$NOISF1= 0
##$NOISF2= 0
##$NSP= 0
##$NTH_PI= 0
##$NZP= 0
##$OFFSET= 16.522
##$PC= 1
##$PHC0= 174.4567
##$PHC1= 8.099418
##$PH_mod= 1
##$PKNL= yes
##$PPARMOD= 0
##$PSCAL= 4
##$PSIGN= 0
##$REVERSE= no
##$SF= 250.13
##$SI= 32768
##$SIGF1= 0
##$SIGF2= 0
##$SINO= 400
##$SIOLD= 32768
##$SREGLST= <1H.CDCl3>
##$SSB= 0
##$STSI= 32768
##$STSR= 0
##$SW_p= 5175.98343685301
##$SYMM= 0
##$S_DEV= 0
##$TDeff= 65536
##$TDoff= 0
##$TI= <Analysis number 999999
Compound Code 99
Book Reference 9
Project Code 9>
##$TILT= no
##$TM1= 0
##$TM2= 0
##$TOPLEV= 0
##$USERP1= <user>
##$USERP2= <user>
##$USERP3= <user>
##$USERP4= <user>
##$USERP5= <user>
##$WDW= 1
##$XDIM= 32768
##$YMAX_p= 314083351
##$YMIN_p= -19122
$$ End of Bruker specific parameters
$$ ---------------------------------
##NTUPLES= NMR SPECTRUM
##VAR_NAME=  FREQUENCY,     SPECTRUM/REAL,   SPECTRUM/IMAG
##SYMBOL=    X,             R,               I
##VAR_TYPE=  INDEPENDENT,   DEPENDENT,       DEPENDENT
##VAR_FORM=  AFFN,          ASDF,            ASDF
##VAR_DIM=   32768,         32768,           32768
##UNITS=     HZ,            ARBITRARY UNITS, ARBITRARY UNITS
##FACTOR=    0.157963299565203, 1,           1
##FIRST=     4132.6476996994, 0,             0
##LAST=      -1043.33573715361, 0,           0
##MIN=       -1043.33573715361, -19122,      0
##MAX=       4132.6476996994, 314083351,     0
$$ Real data points
##PAGE= N=1
##DATA TABLE= (X++(R..R)), XYDATA
$$ [...]
20447 4293 9486 8813 3772 1452 3331 3585 3840 2678 704 -674 -1233 143 219 -388 -6194 -2371
20431 -2371 925 -426 -953 -2720 -304 -4564 -2911 4880 6486 3701 -2742 -794 1646 592 -1349
20416 -1349 -2112 -2962 924 -721 -1695 -2072 182 -1569 -6255 -3418 -1362 -2005 -1005 -5834 -7338 -5558
20400 -5558 -4440 -4255 -8085 -3739 -851 -1408 -1993 -1058 1884 -773 5357 10982 8994 4678 -3410 -7081
20384 -7081 -4074 -2344 -1796 712 -652 -3792 -5354 -6592 -7911 -8174 -8092 -5577 -1690 -2648 -1332 -3267
20368 -3267 -3023 -2606 -1622 -99 1020 -1165 992 1835 1480 5617 9956 7655 4177 1930 1454 -529
20352 -529 2582 3759 3621 1608 -4285 -4324 -2455 -3660 -2226 5898 8944 8137 4628 4335 2332 -331
20336 -331 -7115 -1936 990 2491 2911 -1045 -2047 -4171 -3759 -72 -183 197 1015 3235 3655 2722 2638
20319 2638 5726 2978 3675 9068 6210 -2834 -3017 507 -125 -1100 -534 -3008 -3596 -4135 -6564 -1637
20303 -1637 3930 8928 6165 5348 1585 310 -469 -71 1137 1387 4134 1899 -1036 1783 821 -3913
20287 -3913 -7357 -4685 -2179 -1308 -3722 -3398 -2197 329 4627 8172 3630 7599 7214 4445 2281
20272 2281 3818 -102 1717 4055 6100 9586 6112 297 -2969 -3461 -3987 -5228 -2075 -540 -5059
20257 -5059 -593 -17 -4946 -9683 -7543 -5306 -1700 -2744 -473 2417 -2756 -10655 -17352 -13758 -6553
20242 -6553 834 4356 5547 4042 -3182 -5846 -6129 -4580 -3202 -3182 -3815 -5169 -6818 -3632 -1873 -4386
20226 -4386 724 -2408 -2176 -523 -15 -617 2188 5847 5842 -1913 -6494 -6304 -3913 -4407 -2366 -409 -6229
20209 -6229 -15788 -16439 -9183 -824 1018 250 -1709 -3913 -6213 -7576 -7628 -8442 -9107 -4579 -511 765
20193 765 -2589 -7571 -7921 -1757 235 296 -370 66 868 -1893 -4447 -3384 -1904 616 2169 3869
20177 3869 -71 -312 4027 8858 6204 589 -632 951 -3278 -7535 -6528 -4105 -4627 -3936 -2358
20162 -2358 2062 4043 274 -1692 -2464 -3370 -1092 2169 1452 349 3325 4557 3783 2489 3785 6508
20146 6508 6234 -670 -4684 -3059 -178 -1406 -4738 -261 3313 6582 5610 3448 2482 -6001 -10673
20131 -10673 -3372 -2496 -1513 3296 2123 -1450 -441 1042 3663 6048 8172 4886 -1440 -3483 -1049
20116 -1049 2158 1726 1525 868 2247 -532 -5215 -7054 -5674 -3701 2075 1924 -1906 450 3747 4914
20100 4914 1308 558 1225 6585 6945 -2414 -5709 -3533 2678 38 -5738 -5991 -755 2277 4423 8709
20084 8709 6224 3172 1021 1035 765 -4799 -8490 -4248 -3116 -588 -4373 681 -35 -1652 4242 757
20068 757 -2069 1003 2290 1620 151 -1428 -3664 -4761 -4456 -6632 -7109 -4922 -4154 -2894 1232 2552
20052 2552 1879 974 -545 -746 730 3043 3216 -2752 -7331 -7655 -4028 -4597 -2659 -1407 -4577 -4578 -8706
20035 -8706 -8170 -6967 -5674 -2247 1116 3841 4799 977 -5465 -9179 -9473 -10103 -5210 3028 6839 2521
20019 2521 3631 2869 5090 3131 680 603 2191 2977 966 2756 6063 9689 6672 -212 -3404 703
20003 703 1121 -289 824 -2274 1291 -1283 1712 4788 805 4133 8014 4316 -958 -3137 3914
19988 3914 6150 4568 4181 3230 4070 4703 5466 4173 9222 10820 4927 2867 4209 8439 9350 2800
19972 2800 -179 -1076 -3402 -3035 1825 1292 -880 -5512 -10168 -6464 -5870 -4042 -3993 -2452 -243 -4304
19956 -4304 -8299 -6765 -6783 -2096 -3157 -2630 -4973 -6524 -2794 -1626 2360 4962 6690 8436 10471
19941 10471 11896 4321 -3168 -4439 -4663 -2196 348 3923 2184 1948 488 -2400 1843 7086 6629
19926 6629 707 -2802 -4648 -3953 -5767 -4318 -4662 -2930 -367 2652 4898 4540 2101 1775 408 2225
19910 2225 2826 2860 711 -2984 -3588 -6531 -7056 -4941 -4465 -2322 -71 1916 107 -5274 -7972 -8513
19894 -8513 -4513 -741 2621 -3116 -10776 -10934 -10784 -6056 -2345 -2303 -1797 3930 4072 1801 2461 1617 5331
19877 5331 3087 -46 1129 -2758 -3276 -2344 -2787 -2202 -409 -1226 195 -1424 -2523 -2839 -6474 -4299
19861 -4299 -1553 -2881 2929 1778 -1798 -3556 -3631 -1898 455 782 -4246 -6812 -6571 -1633 2131 550
19845 550 -298 -623 -3541 -1928 -3522 -5390 -2050 319 -5354 -4264 -1534 -2932 -609 -1181 57 923
19829 923 4015 3620 1531 1756 -710 334 -1767 -2933 -2456 1083 -1936 -8700 -7624 -4327 -1075 1961
19813 1961 3149 3010 4791 6658 5415 -771 -3335 -2336 2029 1835 1420 -2096 -4865 -420 -841 -7046
19797 -7046 -5764 -2167 -4373 -6845 -3335 -1068 -2833 -3494 -1969 1420 7183 6273 7553 6679 3188
19782 3188 -1228 -4504 -617 929 -978 305 -4614 -9871 -8556 -7257 -2034 1422 -4035 -5365 -2615
19767 -2615 -1357 -1198 -3518 -1943 967 2532 68 -381 -3197 -4828 -3669 -3490 -1795 -338 -408 -2781
19751 -2781 -4990 -1827 -2489 -3994 3038 8466 4524 -1316 -1916 -2565 -2976 -978 1909 4173 4967 -10
19735 -10 -2584 -1641 -1905 -2049 2155 5397 2780 4992 4946 6599 5311 6633 5212 415 -5304 -4902 -4425
19718 -4425 -6057 -4909 -1777 -2425 -7021 -3737 -1163 -1036 -1439 -4698 -744 4673 5526 1788 365 3536
19702 3536 6552 5488 4201 -75 393 4519 5654 2319 4691 2577 2137 4642 3671 3022 5185 2209
19686 2209 -1032 326 3030 6262 5910 4026 3614 3843 -15 -3428 -3708 -2722 2953 501 -2750 119
19670 119 3801 1479 4462 5640 4081 -736 -3379 -7739 -1685 3926 4214 2844 -966 -4385 -8814
19655 -8814 -3549 -4964 -8418 -4682 -3603 -3111 -881 433 1858 4393 2162 1187 2685 1112 2780
19640 2780 2244 7051 9204 6218 1465 -1893 -1331 4468 9020 5256 73 -1583 832 -124 1717
19625 1717 1116 1366 1327 192 -2412 -2568 3697 3521 4579 6242 7843 566 -433 2042 3006 -3964 -6984
19608 -6984 -4717 -5923 -10374 -10062 -5962 -2967 -1314 -3471 -4572 -2560 -2359 -3398 113 2672 5634
19593 5634 3545 -1141 -345 1225 3507 2892 5152 6235 4461 3595 2614 1339 1029 -792 809 1913
19577 1913 4015 3390 4195 3901 -850 -9090 -8661 -6508 -2305 612 -1098 -1863 -3696 -6569 -2903 489
19561 489 4877 7555 5134 2056 2415 2508 910 -2893 1419 6509 11336 8927 5063 2516 1763 1039
19545 1039 -652 2414 3486 3533 3794 3644 6280 3092 -2384 -1095 163 990 -2666 -6532 -9124 -8093
19529 -8093 -5755 -11523 -8605 -4983 -8578 -8542 -4783 2338 -169 -476 -3111 -2298 -297 2338 1217 -4169
19513 -4169 -7620 -1986 4788 11772 12057 8499 12979 13794 8839 4448 3909 3487 240 1408 1283 4239
19497 4239 3008 6751 9478 13212 15604 12677 11656 11780 10639 9238 3645 -1027 3177 5700 5950
19482 5950 5181 6547 3410 974 3719 8108 9002 4394 2292 -986 -2284 -2619 -5800 -168 2158
19467 2158 2747 5273 10451 9591 2322 1889 4258 3101 7375 12062 10378 4170 6074 8354 5302
19452 5302 3281 857 1063 2109 1516 6841 6787 8709 8845 7696 1204 1786 3579 2395 790 1963
19436 1963 2906 7623 8971 9374 9916 10747 9298 3785 3809 180 -5315 58 -2202 -3684 -2735 188
19420 188 2395 5702 10040 10491 10572 8206 1147 -204 912 3093 5194 5221 5675 5517 9828 8917 8311
19403 8311 5973 1867 577 2724 -1863 -2665 -3701 -280 1071 146 -977 -945 2801 2377 -2367 131
19387 131 4817 2794 6238 4826 3510 -906 -2315 1302 7845 11715 4438 4864 7333 9227 11098
19372 11098 9786 10177 11292 10798 12861 7948 7567 7320 9359 7617 9264 9077 6675 3299 5420 2458
19356 2458 4755 9314 6566 3579 3301 3175 5039 6052 4567 2704 3390 4124 4846 3789 640 -4548
19340 -4548 -3789 3545 4630 4508 3049 2045 3021 3945 4806 7789 6277 5578 6588 8170 8356 9818
19324 9818 6184 3698 5959 6837 7660 9206 10347 10593 10110 8326 8957 11851 12758 12599 12419 15858 14059
19307 14059 12097 8122 7871 8288 5531 2869 4505 3512 1804 3013 5586 3415 23 -1027 -2573
19292 -2573 -3740 -2142 -6 4056 8921 7154 7167 10814 11818 7190 2202 3749 6169 2744 2401
19277 2401 11381 19778 17862 14673 10659 11192 15001 14788 14270 12841 10749 9620 11193 13332 8835
19262 8835 3044 1907 -1200 385 5438 6616 4531 976 177 4133 6809 7558 10955 6662 4135
19247 4135 6872 5424 5984 1763 -263 3039 1540 2549 2892 4427 8305 6590 60 -3784 -2261
19232 -2261 2712 8625 11773 10686 9984 11048 9304 9068 9257 10276 10156 12895 12047 13598 12807 13207
19216 13207 14216 10941 6880 4332 4256 3934 1865 4081 4482 8976 12552 11979 17337 15308 8916 5100
19200 5100 5057 5072 4766 6136 4496 6305 9349 8318 5102 6341 5427 7477 11353 10044 6624 2877
19184 2877 2576 5582 9389 9276 4110 7593 15342 21597 21624 27798 30441 33027 30883 30786 35589 36170
19168 36170 39644 41360 39508 35395 28152 24028 27143 31290 34560 32814 34088 38616 36452 30070
19154 30070 24783 22274 19206 16883 13142 14401 17843 16933 14218 16798 14549 12303 12084 7494 6391
19139 6391 7289 5188 5071 7530 7839 7204 10858 16744 19793 18238 18472 19601 21305 21958 29476 36437
19123 36437 41531 47712 50990 56046 59200 62652 66057 64535 63259 61727 66112 67045 67184 64401 56908
19108 56908 49746 40648 34868 27864 16936 13111 16508 14758 14202 16516 20728 20286 24230 22938 16195
19093 16195 12037 10874 9499 7514 7487 10374 10860 10748 7496 5657 5611 9381 11854 10707 15819 17769
19077 17769 16751 15313 15295 15113 19583 23485 27476 30838 33378 39149 45176 46241 47344 45683 46081
19062 46081 45233 47181 46536 42131 37537 35599 36138 40051 36798 43920 50598 57911 60854 57162 50775
19047 50775 52920 60942 61518 57510 54922 51631 57446 62516 63136 58820 59505 64085 66604 62604 54493
19032 54493 43427 34364 30006 27327 21961 19586 21378 22074 23171 23370 20516 13491 11350 9489 18927
19017 18927 26394 25630 24606 25221 22606 16613 13936 18371 22682 21631 20920 24306 26413 27806 29614
19002 29614 37804 46310 61206 80812 109307 157906 224810 289359 329462 333003 295194 234264
18990 234264 177675 145984 137248 150456 187877 250235 310160 342269 340354 296768 228898 167851
18978 167851 125165 94582 76849 61942 54897 48682 42605 39272 39200 38659 38401 39833 38797 32991
18964 32991 31762 35399 35474 32559 30028 26795 25453 26762 28112 30838 31071 30328 31673 41500 56133
18949 56133 78211 118340 176149 253407 331638 380882 392277 360082 290826 219362 176343 157931
18937 157931 167919 211388 285635 358393 396038 395872 351491 276767 204513 151450 116480 92245
18925 92245 73943 61785 50729 42401 36485 34644 35516 33793 29610 27754 31768 31829 29592 26061
18911 26061 25266 19646 17763 18658 18182 19271 21969 29813 33563 28681 28583 25325 20170 19375 20739 17504
18895 17504 19643 27372 32486 31855 28168 25517 22221 20453 19556 27413 28000 27446 30708 40283 40843 32976
18879 32976 32041 27398 30315 33611 32984 28730 27597 27351 26138 27291 29871 30505 29403 31701 33323
18864 33323 36181 35457 30654 28144 25292 25441 20057 25490 32594 36842 33937 32768 37306 35426 31453
18849 31453 32599 37277 37489 41071 48273 48045 51747 53790 49093 44830 49954 51681 49562 53972 56092
18834 56092 57591 59737 59754 56942 50171 45222 47373 45367 41431 37168 32560 27542 27580 34602 42008
18819 42008 42671 36332 33511 30411 37174 43759 38304 32250 31476 30095 35544 36117 35997 39647 40373 38290
18803 38290 36883 35112 36496 44570 51284 57793 65214 66418 67268 65938 58144 51590 46143 44161 50939
18788 50939 58690 64435 72224 71721 70793 74011 69772 60733 59400 55374 50898 47509 47176 51011 51980
18773 51980 48106 48731 57636 61081 64132 80766 103843 112610 104618 106960 122071 158038 218532
18760 218532 297228 361165 383698 378422 326043 271702 253673 279320 337094 392284 409159 401117
18748 401117 340374 261579 198777 154830 127948 114568 102904 93665 88213 84684 82725 80696
18736 80696 80186 84232 85356 86147 88101 84018 79926 82931 83257 84862 85774 92846 91599 93048 90290
18721 90290 93088 100870 103578 104161 106690 112402 122521 135162 153222 183967 230743 310660 407888
18708 407888 466576 493982 477104 414692 359293 350735 399295 483730 545155 569768 560178 493879
18696 493879 412882 356240 322345 311105 308008 311284 318364 330190 350229 369419 392917 423948
18684 423948 450992 484569 535698 601177 681597 788498 945482 1172568 1493119 1942917
18674 1942917 2533424 3170493 3659808 3949042 4182540 4409014 4467861 4301094 4078802 4036259
18664 4036259 4228946 4484820 4579520 4535977 4511879 4486495 4225590 3668957 3002067 2414370
18654 2414370 1966858 1644174 1405566 1220389 1082936 985122 914940 863865 826866 801032
18644 801032 789572 787345 789037 800169 820113 850015 883244 923912 977215 1048770 1142365 1269553
18632 1269553 1449750 1687791 2022005 2502038 3154229 3967103 4800896 5585896 6509615
18623 6509615 7746659 8962750 9455930 9219944 9071757 9473574 9973483 10089123 10165819
18614 10165819 10632394 11041107 10554750 9344652 8091606 6898616 5575231 4304268
18606 4304268 3306943 2602890 2118106 1773065 1521630 1341602 1205899 1103564 1021546 943707
18596 943707 886003 842721 799544 759801 729149 706586 686808 671743 661703 659471 660171 656228
18584 656228 654373 671439 699757 732725 786324 878886 1018432 1231679 1589238 2200575 3238968
18573 3238968 4678952 5844092 6117793 6062322 6443768 7068835 7168466 6966226 7202683
18564 7202683 7659696 7505717 6894552 6545667 6386397 5707848 4485832 3286451 2398638
18555 2398638 1817254 1434061 1169664 984552 855042 760083 686277 629392 583086 546750
18545 546750 514186 480540 456634 453580 467671 511708 608523 724372 749817 690662 653675
18534 653675 685647 730354 678988 562468 470804 447244 498007 603933 679569 649677 590016
18523 590016 591781 650955 655904 544537 410108 312531 246389 206987 184931 166971 158189 150504
18511 150504 147221 142204 134457 125890 120461 110548 108883 113506 112437 103152 106072 110895 109014 103866
18497 103866 98463 95275 95736 90946 87825 89231 87799 86538 88963 88991 88984 90158 92808 89942 87720 87042
18481 87042 86328 81411 80146 80160 79405 76856 73983 72283 73106 76847 78025 73884 73753 78411 89588 93788
18465 93788 94919 98235 93915 92526 95582 104457 115749 130197 148524 161669 169997 167296 167423 174347
18451 174347 177560 178292 171367 163308 170186 191821 212585 219099 220142 230185 250990 267738 277732
18438 277732 293116 311307 319602 333567 348737 367015 394558 417071 439181 462539 497303 547632
18426 547632 616621 710225 825551 990439 1240988 1637870 2317187 3532166 5619010 8226615
18416 8226615 9504917 8827060 7988640 8388536 9924507 10567170 9193592 7359851 6413970
18407 6413970 6831994 8606652 10437695 10354402 9045299 8413227 9212936 10363006 9679624
18398 9679624 7402048 5168957 3626108 2706268 2177198 1867084 1702174 1665409 1778399
18389 1778399 2091095 2735519 3764546 4510533 4177023 3317056 2566173 2100736 1905986
18380 1905986 1961426 2315705 3077867 4095694 4398196 3642632 2657177 1893246 1398953
18371 1398953 1097572 905640 775996 676767 601712 554748 526146 526604 535012 525242 498935
18360 498935 473545 456670 450534 451349 453440 462400 470348 474894 474820 483902 502547 536742 592347 672333
18346 672333 799973 993817 1288797 1768720 2574871 3938048 5842372 7153555 7026375
18337 7026375 6303291 5280945 4234593 3551211 3369829 3748670 4794544 6203013 6810044
18328 6810044 6414861 5705851 4597796 3399919 2501784 1935613 1554321 1251565 1023580
18319 1023580 862278 757777 706450 702869 723490 722202 659651 571050 497509 455093 422988
18308 422988 403718 395728 394869 393941 395868 397186 387292 384803 392226 420687 467794 535804 641644
18295 641644 804778 1078029 1549734 2378083 3616246 4580083 4293259 3314754 2436380
18286 2436380 1893612 1660703 1682403 1964916 2602951 3609920 4299493 3880643 2955183
18277 2955183 2186328 1675659 1316993 1072651 926139 815220 709889 636509 621201 632943
18267 632943 609499 556273 520540 490066 424893 349053 290894 251341 229961 220896 216984 206241
18255 206241 184592 163036 145041 134341 122093 115151 109698 108637 108096 103004 100777 93785 89084
18242 89084 87290 86832 84845 79661 79137 82267 87170 92218 96651 104834 110635 113988 124705 149854
18228 149854 191740 256719 316341 307011 253843 206623 178513 171413 195378 251164 306868 311678
18216 311678 259588 195518 149995 130273 117520 112678 110028 112418 115535 115967 119291 128915 140251
18203 140251 158013 173281 183464 186887 179596 181334 192372 205091 222065 242554 261224 283954
18191 283954 308774 334690 377060 444904 544396 684473 896903 1219171 1740745 2617240
18181 2617240 3941775 5224928 5435141 4592293 3591966 2937026 2744386 3057730 3935919
18172 3935919 5108480 5546460 4749882 3490963 2441681 1740675 1301640 1023717 846256
18163 846256 724523 636414 576241 536717 507325 485583 473284 468893 464197 459342 455651 453393
18151 453393 452618 467726 494114 514515 532774 550133 562946 590777 634382 707050 819793 974719
18139 974719 1197596 1540221 2079900 2994943 4527944 6544597 7847646 7398115 5971753
18130 5971753 4721162 4099083 4198405 5096948 6692383 7896182 7420548 5771308 4120510
18121 4120510 2939743 2198101 1745437 1474638 1320581 1254011 1271078 1387749 1654481 2183159
18111 2183159 3259525 5428559 8631957 9619080 7404901 4887785 3175573 2196736
18103 2196736 1640740 1295731 1065407 902231 777793 689645 627841 588354 568742 572815
18093 572815 597911 664188 792813 1012146 1402703 2057724 2834054 3149537 2779470 2197151
18083 2197151 1773666 1615756 1743420 2182610 2785132 2992101 2538353 1856434 1297282
18074 1297282 927312 692680 540778 434338 358630 304373 266155 239431 219627 204446
18064 204446 191929 180166 168082 156747 149358 147822 151799 151810 142094 127614 119391 110178 99653
18051 99653 90337 82876 81293 79560 72579 63677 61858 61958 57891 57762 57415 56724 53835 47824 42936
18036 42936 40580 43133 43759 42112 43408 40946 41058 39968 39126 40508 36322 32665 34022 37344 34611
18021 34611 24601 17274 12374 13822 21332 20628 24273 30764 29083 24093 24058 26645 25102 24155 25929
18006 25929 27728 31742 37375 38617 34993 24069 24695 28818 34700 39734 40749 41339 43317 44262 47132
17991 47132 51752 54810 60811 73354 96681 129161 194832 308374 431190 495794 481198 453965
17979 453965 474991 514844 487143 386556 275362 193713 143333 110273 99297 92536 89365
17968 89365 88390 86917 92740 117029 164453 242045 362680 483101 528174 497834 472063 508212
17956 508212 546730 510744 412176 320231 275159 280141 318632 325266 275699 214392 164646 136520
17944 136520 117317 112271 118921 141606 190238 247769 272861 234273 168747 123234 92130 71644
17932 71644 58974 53698 47758 39297 36496 30157 31343 35484 35803 31923 28215 25068 22463 18539
17918 18539 13246 10188 11797 15173 20458 26012 33696 36411 37714 37905 46076 58338 76941 117599
17904 117599 186073 243571 259375 249930 262200 299257 305090 259515 210299 185841 190732 226480
17892 226480 268890 272720 256367 259361 282547 275835 224922 158114 110247 82277 69944 63522
17880 63522 57952 49985 40074 40038 43122 45176 45966 40956 36622 33084 33665 33685 33240 33689 37029 39617
17864 39617 46780 43111 31319 27597 31290 33219 35071 41368 57105 82514 116858 161498 191955
17851 191955 176846 131975 96050 76645 62681 62360 65886 77728 106597 147256 174883 158616
17839 158616 119990 85425 60143 38836 33367 28724 25608 23511 25824 28661 28678 30221 37738 37477
17825 37477 35868 37805 33556 28272 27502 31114 32079 30438 38692 39859 37507 32274 26660 23484 23519
17810 23519 20774 18074 10245 8037 11437 10527 7145 7604 4533 2337 1345 3609 5186 -71 -2510
17795 -2510 675 3308 2085 3581 7215 9634 3586 397 5194 11936 11750 13217 16894 13858 12960
17780 12960 10222 12795 18561 25886 30947 41426 55672 61499 60648 57137 59617 69382 73863 68098
17766 68098 59054 51857 49034 47310 58084 60463 51856 48917 46522 57775 62130 56281 44539 37033
17752 37033 33663 32984 34716 35392 32550 31064 33494 30898 22528 19192 15766 9794 5770 6875 13892
17737 13892 12851 7811 6021 6796 5118 5096 3692 3109 -516 -2180 -1175 2542 2251 500 223 17
17721 17 1650 2568 1879 4035 4307 3996 7222 6250 4257 9312 7434 6072 9935 13535 13549 8106 3600
17704 3600 1657 4851 8477 3748 -1512 5477 11998 5991 5319 1230 6426 20587 32973 43888
17690 43888 50280 48681 46227 42455 48937 52903 50441 41776 32341 27862 21907 16165 16491 15059 15828
17675 15828 18512 21564 25474 40020 53834 60628 69457 71297 68757 67919 73111 81837 83048 68127
17661 68127 49203 36141 22914 18836 17612 13805 13146 12391 15418 17749 17736 14429 13928 12313 11616
17646 11616 11009 13075 17084 13691 8135 8409 9978 10635 12259 12530 13120 14132 10027 9488 14774 14513
17630 14513 12887 17599 17954 22187 29668 38852 48340 43506 39621 36799 34882 35663 43895 54801 61201
17615 61201 57792 44246 33377 28615 24682 19639 9708 8542 7053 13420 18200 16288 16710 14589
17601 14589 10314 3854 7128 16706 20005 18103 22245 22085 17931 18583 16110 15947 10681 11757 13699
17586 13699 12315 6700 3822 -755 196 9548 12119 9957 17635 19939 22714 22214 18361 10516 12756
17571 12756 18166 20795 22070 19802 15065 10584 7315 7618 7176 11035 12612 10660 7388 3466 3401
17556 3401 11614 14658 9789 8042 7142 4006 -512 -2218 1038 -170 -2975 -4966 -7301 -8131 -10387
17541 -10387 -8701 -3435 -5087 -7582 -5444 2859 7678 4784 6040 7304 6021 7219 6088 2102
17527 2102 1695 1006 6363 10728 11387 9856 8516 4495 5667 3849 4309 405 1581 2324 3476 2186
17511 2186 3031 2472 -1149 -247 1022 805 2053 2341 3349 5463 4989 3682 2491 3631 9114 6678
17495 6678 719 2333 4914 6240 7468 3379 3126 -416 -2060 -710 2420 -553 -815 4509 5254
17480 5254 6821 7211 11084 11964 5635 2974 -81 -2585 -1930 -150 -1099 -2867 2263 3682 4308 1376
17464 1376 1311 3264 2547 7314 8055 4387 -111 -367 -480 -2859 -1963 -378 3122 631 204 6682 12491
17447 12491 18012 21337 24500 29713 43460 56802 54364 37056 28477 22016 17304 16711 15234 12892
17433 12892 12773 17789 15443 11803 11233 25122 39280 46430 48063 37659 26585 22556 19301 17861
17419 17861 16366 19433 23329 32470 43267 46208 42378 31516 18920 13545 12559 13184 18315 33895
17405 33895 48307 56421 48972 37278 27100 22941 18341 22923 25533 32784 39817 49458 55394 49437
17391 49437 42159 30481 21469 13095 9283 4306 5855 8388 3149 955 6174 5472 5581 4996 6569
17376 6569 9313 7578 10488 9945 11857 16510 19387 20290 20024 21231 15410 9871 8282 7677 10088 10955
17360 10955 6746 7680 8557 7405 -649 -2857 -1617 -1219 -6084 -1860 -524 4040 10636 12714 9159
17345 9159 8385 7302 4713 -48 898 488 928 1368 2475 3888 8700 9332 10173 9672 7095 6726 5789
17328 5789 1044 -543 -709 2356 7318 16136 18494 16365 14998 13238 9080 9663 7989 5231 3619
17313 3619 3080 5379 6383 7319 13038 16646 15500 12133 7416 6896 10539 17021 16129 13737 15488 16161
17297 16161 18042 16292 15388 13120 9879 10487 13554 11467 11117 16276 21500 18320 14193 9380 5798
17282 5798 3976 3719 4791 11019 12688 13024 11943 13164 6003 2566 -289 2310 -2431 -4796 -3708
17267 -3708 2259 8112 9467 12706 16401 18169 16155 13114 12976 16113 19635 21886 18794 14480 12908
17252 12908 13786 11791 9663 10609 15049 17596 17791 18477 18248 17420 11408 11303 18011 14183 10308 17091
17236 17091 22764 25262 22660 25674 23759 21971 28116 25091 20573 17109 22433 19268 18445 18627 23815
17221 23815 23125 21523 24963 28670 34000 33626 30720 29263 23223 23541 26354 27807 27446 30755 26960
17206 26960 24347 25422 33103 35012 31061 28389 26671 29467 32807 33675 34664 33853 32462 31550 30354
17191 30354 30309 35301 43374 48784 48730 53204 54339 52493 50485 49671 55129 59029 53895 53531 54719 67359
17175 67359 79784 91914 102201 116828 131739 141867 148829 166235 191687 210166 213274 210358
17163 210358 207900 211819 216946 222945 227237 229704 237263 254553 291453 340119 395646 459468 534330
17150 534330 647101 791855 992420 1298799 1824119 2755659 4390970 6741705 8518889
17141 8518889 8377673 7406399 7209366 8218456 9129689 8195729 6097223 4217863 2981886
17132 2981886 2259965 1852206 1625238 1525436 1522706 1618631 1849485 2313841 3219024 4893918
17122 4893918 7507061 9888754 10118152 8940814 8372179 9236531 10448616 9791583 7449803
17113 7449803 5104181 3461022 2448845 1839882 1457180 1196237 1005802 861791 754503
17104 754503 666540 587906 522450 469168 421451 380212 347806 326932 306385 285033 263386
17093 263386 251932 247557 238249 218008 200554 195783 185290 166524 152866 150887 149595 135840
17081 135840 117562 99242 83746 73237 62636 56071 54341 49903 50761 51355 45327 41956 40513
17068 40513 41744 37273 40141 39686 33888 31142 26797 23556 24882 30214 32347 29187 26973 26797 26589
17053 26589 22423 20483 22475 26042 32893 35340 35911 33057 32233 33601 33277 32923 28735 25359 23712
17038 23712 23961 21077 23088 23597 20641 20319 20886 19409 19941 18669 21142 23491 21315 17517 17620 16660
17022 16660 15564 19728 24883 22116 16112 10978 9020 11910 14356 22019 21862 19817 22402 23624 25747
17007 25747 26599 23837 18890 13410 16446 22533 25528 28902 30760 28116 27856 26145 25968 27719 25752
16992 25752 27506 34143 36819 38585 40608 41426 43347 43520 40185 42889 49879 53680 59557 64389 67366
16977 67366 66629 66625 79686 102380 151922 248172 402666 509360 451080 336285 243104 184831
16965 184831 155555 139270 141907 168161 235586 355095 503509 527144 415920 305328 230209
16954 230209 187064 175149 185232 222972 308977 446959 521880 441094 324394 233630 180943
16943 180943 157252 147728 146747 170034 232869 353311 485648 482280 374569 268902 195012
16932 195012 148316 116404 102644 94926 82314 75559 67426 64082 59694 58546 60166 59976 59522 62347
16918 62347 63623 64541 68487 66939 66221 61909 62451 71262 76864 92217 110931 126300 132141 125415
16904 125415 120847 119014 119468 124245 143203 162723 187884 206124 219838 228337 225424 218186 224045
16891 224045 246001 276490 323189 382543 445788 501571 550605 619427 722670 887441 1175751
16880 1175751 1676879 2597344 4318653 7148739 9559483 8840578 6500966 4470701 3216136
16871 3216136 2567292 2325962 2406702 2865779 3935848 5988031 8803706 9805868 7998952
16862 7998952 5681263 4044367 3190477 2939488 3231502 4243503 6273088 8491477 8350094
16853 8350094 6374884 4455910 3199336 2506215 2183721 2139256 2408310 3131694 4642609
16844 4642609 7022200 8418772 7129197 4976945 3277703 2214728 1589483 1205598
16836 1205598 953835 787697 676313 601833 545088 499897 466230 429482 383306 336168 290186
16825 290186 255504 230725 212795 214053 219028 216457 202374 183358 159495 135253 118608 107668
16813 107668 102766 96332 94212 92920 94246 98542 94695 86508 77538 63504 54342 46197 37364 29509
16799 29509 26726 30703 34315 33967 37331 34207 27808 25900 22670 20570 17834 15410 22348 20705 19446
16784 19446 24322 21366 16405 11969 10290 12272 12885 14619 13734 8702 12476 15458 14290 14044 14270
16769 14270 10158 4538 8075 13363 10397 7892 8062 13997 12361 5663 6858 6417 2339 994 -1238
16754 -1238 -3913 368 3187 2109 -1665 -793 4697 8948 8898 5746 6520 4674 6823 8416 9398 7047
16738 7047 9572 11020 11321 14313 14785 12951 10484 4352 2060 1329 5435 13564 12119 11073 8623
16723 8623 9621 9702 6620 5913 6749 5456 2647 5005 12935 12429 12756 11398 5733 1006 5572 11252
16707 11252 10742 10879 8416 9909 15275 17231 17059 15508 15557 13604 9966 4048 8797 8959 9385 11312
16691 11312 11893 10661 3631 3034 3941 6894 4692 2455 5080 9728 10696 10840 11593 12998 14561 14317
16675 14317 16431 13450 4141 3872 6063 1524 -1320 83 3212 8710 11210 11440 7864 3106 990
16660 990 3998 5749 6288 1866 -786 -5162 -6090 -2987 -2996 -4633 -6426 -9049 -2763 5234 6349 6085
16644 6085 4511 1989 1411 665 -2922 -1078 2764 9555 12236 12195 10675 8064 7588 4691 1829 3332
16628 3332 3324 -144 987 4668 3984 2286 2826 666 -125 634 4149 5332 2851 3682 1383 -851 1410
16611 1410 3025 5318 2060 3382 3377 -1318 3345 3477 5307 2422 3891 5039 5971 4795 2844 6668
16595 6668 9907 9617 11239 14582 18546 21779 23872 31839 46601 53654 50833 52101 55718 57073 57805
16580 57805 50923 42481 30216 21952 16133 13857 14099 13166 14455 15372 17206 17026 23079 35422 46489
16565 46489 50885 52348 52503 48457 45946 46961 38528 29191 20975 18303 13806 6424 2263 4018 9379
16550 9379 11432 4358 -2876 -971 4470 3516 2411 4798 5943 4745 2670 -2838 -406 -3272 -2466
16535 -2466 1367 4253 512 -9379 -6964 5725 10591 6750 -332 -4502 -3717 -3591 548 5022 5591
16520 5591 1498 238 1175 -677 -2698 -3068 -3148 805 5454 3974 2306 983 2376 3218 -1868 -6795
16504 -6795 -7634 -2153 -1850 -7322 -10367 -8917 -2192 1924 2825 256 2938 2825 222 -1679 6185 8748
16488 8748 8673 6835 8353 9126 9599 8124 5472 2299 2845 2051 6026 4170 816 4195 4872 7550
16472 7550 6377 5913 3789 -1244 -5588 -4660 -6509 -4446 -5160 -3219 -347 4041 6104 3993 1886
16457 1886 -4789 -6146 -4637 -1078 -714 -5577 -5627 -2155 5604 11034 11425 5610 -850 -605 -12 -2795
16441 -2795 -4971 -6394 -2170 80 -2139 -4489 -3454 792 1011 -3518 -4280 753 -1905 -2464 -1636 -1513
16425 -1513 896 -630 -2903 914 1593 -672 -2118 517 1540 -127 -3137 -716 4882 1415 4503
16410 4503 4176 5815 5629 7308 4242 829 -23 -336 1486 2581 1798 2330 5852 3873 790 -1584
16394 -1584 -3415 -397 3036 -2768 -5162 -2140 -1643 -2526 -1331 908 2032 4210 4061 -643 -3081
16379 -3081 -370 -2669 3662 4715 2117 1578 2465 2276 2756 1638 159 -2776 -4179 -667 2923 391
16363 391 -2689 -802 -815 -2380 -4176 -2225 -3332 -393 2677 1201 2169 5589 3506 4132 3898 4128
16347 4128 2154 4201 4515 4041 5586 3634 2855 3315 3278 2076 1976 3368 904 3816 9156 9511 9142
16330 9142 9703 15028 19726 19443 20459 15129 9730 12041 26914 44184 53279 46994 35088 30496
16316 30496 24067 19007 15429 15845 19393 23950 31234 38158 39239 32840 23062 17531 16067 15852 18700
16301 18700 31633 44471 51470 42436 28156 20438 16759 14804 16616 19527 21090 22782 27447 34696
16287 34696 35022 29674 24901 19260 16196 11510 10996 10043 10278 9469 4375 1183 -2378 -5082 -5783 -7891
16271 -7891 -10414 -12110 -11524 -10569 -4787 4128 3797 2103 -1072 -1572 3191 5950 1402 4562 6734 6328
16255 6328 3185 7426 10668 6221 2151 3024 3104 -1093 -354 879 3139 -2438 -6121 -7021 -5611 -8022
16239 -8022 -8961 -7394 -5332 261 -1317 -4097 -5928 -4163 170 4994 5587 6446 7497 2171 1111
16224 1111 1715 -3131 -5257 -3110 -1382 -1232 -1939 -4435 -2861 -1104 1606 726 -518 2915 3661 6091
16208 6091 9799 13074 12999 8524 3871 1338 4068 3732 6102 4341 2690 -4570 -6810 -4524 -4642 -4105
16192 -4105 -2792 -1022 789 3168 3072 7130 11343 7892 4252 3348 2656 1970 4496 7350 6882 6575
16176 6575 2938 2092 -737 1277 4362 4779 3868 5912 1791 -6046 -2712 5107 11695 8500 4597
16161 4597 -377 -2004 -1926 -4527 -4305 -3468 -1813 743 3503 6074 3475 174 -2747 -6074 -6642 -3618
16145 -3618 -668 2302 3131 -1080 -2110 -8086 -8209 -481 2238 1410 -887 -1259 1413 2651 2705 -2304
16129 -2304 -6387 -5060 -993 437 -410 -3180 -2154 -2910 -6652 -7616 -6947 -6450 -7770 -6594 -7926 -4932
16113 -4932 -516 1309 2060 1121 -1701 -3025 -1858 1354 999 1664 2093 560 -5942 -5442 -5403 -5870 -2593
16096 -2593 -1982 929 5858 8611 7679 6113 3295 3773 -2863 -1961 3612 6295 10798 8998 3790 340
16080 340 -1855 546 3211 1334 1438 -362 -1414 -2042 -3199 -659 -259 -5515 -9207 -7414 -808 -2070
16064 -2070 -5525 -7416 -10188 -6664 241 3485 642 -1048 -38 1359 -1517 -3614 -3161 -454 1995
16049 1995 -665 -5180 -1161 -1524 247 -802 1821 4048 4284 3718 -137 -5778 -7767 -9095 -9103 -8253
16033 -8253 -3194 -2442 -1122 -1176 -2331 -1153 -970 -4550 -7451 -3338 -4063 -4561 -2213 -1609 49 -1450
16017 -1450 -818 1967 4462 2510 772 1631 2743 640 -701 -7138 -10989 -8900 -3310 -4575 -3236
16002 -3236 -2684 -3583 1327 2756 1529 5849 5817 -44 -1380 522 1156 3749 2841 7378 7159 3692
15986 3692 960 -202 3894 6625 3535 2067 2729 5393 7733 14088 12537 7136 1393 -277 1183
15971 1183 2435 5030 2980 -985 -1797 623 2609 1423 -1501 1656 4452 1265 -3950 -4682 -2112
15956 -2112 -6055 -4182 -1329 -730 -902 -2456 -216 3343 1850 -2615 -7823 -8177 -6651 -4283 -2399
15941 -2399 -2109 -76 6680 4182 408 7752 4395 -1386 -420 6291 10520 12813 10093 8253 1869
15926 1869 1312 2897 3579 5526 2800 -2107 -514 2910 5298 2009 -166 2768 6267 4042 6876
15911 6876 12686 11618 2050 1553 4435 1416 -5206 -2995 -324 -4037 -623 -1746 -1016 3366 3375 143
15895 143 679 5036 4414 -997 -3973 -31 -3476 -4540 -5249 -6345 -3336 -3059 -3726 -2289 -2657 -467
15879 -467 2625 -3026 -4928 -7392 -4778 -3532 -4362 -4410 -122 3520 1375 2393 2633 4027 4130 -290
15863 -290 -4114 -5622 -4243 -1451 2836 1865 3016 3334 -347 -612 1137 437 675 133 -5746 -7607
15847 -7607 -4810 -2291 608 147 3402 5376 1381 -81 1849 5306 7486 9948 10626 2227 -7190
15832 -7190 -4070 -1917 540 3385 763 2996 1141 -3021 -7937 -8965 -4711 -3655 -5231 -4644 544
15817 544 947 -1169 -1387 153 4619 1125 -1297 3862 2678 -250 -2182 1159 2006 -360 -4861 -7464
15801 -7464 -8878 -10837 -7917 -5697 -7743 -5464 -40 2942 1042 603 185 -2543 -1883 -176 745 1062
15785 1062 -4240 -6975 -7506 -7269 -4683 -2548 942 1877 -981 -1445 -3276 -4178 -6501 -4356 -1999 -1031
15769 -1031 582 -5978 -13159 -15011 -10684 -2673 -2591 -1959 -2390 -3718 2325 6734 5293 2843 490 4202
15753 4202 3795 4596 5962 5987 3088 696 1032 -2651 -1942 2022 -1387 -1756 1088 6353 3638 -2691
15737 -2691 -4352 -3559 -2955 -4265 -755 65 2985 6760 8314 5873 3445 1836 1486 2954 1744 -1833
15721 -1833 -3277 -1357 -4029 -8758 -7521 -6734 -10644 -11415 -8263 -7218 -6658 -2976 -4644 -5702 -10023
15706 -10023 -11444 -11281 -4640 1200 515 1031 3366 -776 -2233 -121 -2453 -5196 -3006 -4359 1371
15691 1371 4461 1524 -4475 -5711 -6918 -3885 2658 1630 1092 -3469 -9387 -11657 -9097 -3706 4415
15676 4415 5152 1728 -1241 -1270 870 5843 6400 1923 -348 1796 650 3354 3592 3933 7072 -153
15660 -153 -4662 -2449 -2725 -711 1466 2522 4495 2209 2557 1657 2658 2296 1117 5244 7825 3765
15644 3765 1321 27 -1299 2630 5132 5815 1773 388 4724 4487 -1788 -2712 -879 1244 5964
15629 5964 7689 5202 3039 -955 1162 -65 3675 4785 -1195 -3453 -213 -1359 -3230 -1796 -5203
15614 -5203 -3600 -3353 -5739 -3133 -262 -2455 -5678 -6197 -7140 -5704 -2779 -2227 -1732 -841 -2254 1556
15598 1556 3734 3662 2737 7561 6932 8808 12905 9421 5882 3846 -1067 -1320 -182 -566 -4044 -92
15582 -92 1908 6349 5092 1965 2138 4253 12479 17214 17320 12916 8506 1994 -2296 -2562 -2940 -1548
15566 -1548 -357 -594 1440 459 -2824 -900 -1363 1037 5170 4978 5305 2595 1659 -464 2819 1726
15550 1726 5720 6954 5114 7458 7453 3259 3371 3663 4362 1892 4505 5817 7444 4811 418 4927
15534 4927 9014 6549 9122 10237 4604 5165 2816 -500 -474 2285 -1460 -4542 -6773 -3648 -2822 -2091
15518 -2091 1435 4294 2945 3962 3965 4617 5921 503 -4813 -11128 -9442 -7723 -1522 3947 -1260 -24
15502 -24 -1103 -6964 -4527 -1105 -557 -2472 -3782 -4843 -5712 -7171 -5463 807 6367 9167 9643 6471
15486 6471 4783 2289 3239 1929 1362 3767 2401 -1343 376 894 3539 6696 7258 4279 6337 7839
15470 7839 2196 -5390 -8939 -10269 -9036 -7415 -8088 -4642 2765 4536 6433 6888 4964 4482 1891
15455 1891 7468 8003 7961 5317 1445 -2322 -2752 23 5038 4699 1325 -1583 -73 4530 3422 9279
15439 9279 9180 8434 11381 9155 8731 5456 2473 6282 10377 8715 11824 10261 4613 576 -4419 -2303
15423 -2303 -806 730 6 2413 2604 3185 3797 3721 764 3736 4465 1846 -1370 -678 4204 9359 6810
15406 6810 -579 -6153 -2803 -3424 -3255 -3033 -4053 -1689 363 1300 432 5596 6177 9955 12963 5954
15390 5954 1481 1630 1551 897 -522 1426 1243 -1295 -1425 -39 1644 3506 -800 -3130 -2529 -1265
15374 -1265 1385 2913 480 1168 -849 -6060 -8401 -2281 -3239 -5302 -4698 -1815 1244 5963 5603 7696
15358 7696 2241 1399 188 -4801 -4297 -599 -2393 -1282 1251 4094 6186 3556 1775 203 3819
15343 3819 6963 8254 2272 -4972 -5893 -1495 -1149 -1963 2765 6148 10634 10064 2111 -233 3494 -3633
15327 -3633 -5566 -4457 -6099 -6478 -7910 -7923 -7514 -4255 -2842 877 -456 -1245 1280 1746 1707 344 -898
15310 -898 -2053 2009 2282 1027 -1321 -4204 -141 2493 3286 -993 -1257 -6916 -11895 -12321 -6241 -6876
15294 -6876 -7365 -8785 -6112 -4368 2247 6724 6356 7641 9197 7393 587 -4890 -6519 -554 1317
15279 1317 -1307 -1994 2417 -1997 -7875 -10447 -6187 -3546 -5595 -3995 -2830 -1169 -3114 -5877 -9847
15264 -9847 -7479 -2419 -3226 -3855 -2660 -1881 -1216 741 126 1552 3397 4429 4076 3036 5624 7044
15248 7044 3448 4872 4876 -805 -438 -1525 1629 6915 7801 3582 2546 3949 3791 3764 3794 2423 7948
15231 7948 1498 -825 -227 -915 -1415 2894 7624 13823 13313 8611 2517 1504 -286 -3746 -3255 -5987
15215 -5987 -7575 -5065 -2916 -3759 -3473 -2032 702 -1898 -3684 -6060 -4728 -3501 -8100 -6470 -4650
15200 -4650 -3328 -2694 -3749 -7842 -9631 -6071 -3747 -406 -1167 423 -2104 1423 6321 3284 591
15185 591 726 786 2117 -2324 -6105 -7129 -8005 -5607 -4393 -10121 -7413 -6503 -2707 1176 1687 -1592
15169 -1592 15 5936 1619 -1733 1013 922 -1876 322 -4339 -6680 -4642 -2641 -3493 1214 -189
15154 -189 -3292 -791 2908 2586 4053 8574 7576 5211 3283 880 -1491 -1947 -4363 -1792 -3074 -3830
15138 -3830 -1440 241 -2300 -5222 -5363 -2593 -234 -701 656 91 2064 3298 1769 5030 6307
15123 6307 9615 12370 8873 6550 7318 9171 10422 6629 7650 2039 -4037 -3872 -3946 -3640 1772 4203
15107 4203 4254 3581 -713 -220 2236 3931 3214 3573 5766 3659 3005 5550 4225 8897 3844 -1083
15091 -1083 2028 4983 935 -1005 -4143 -6760 -4743 -1421 4760 1812 -599 1630 6522 1251 -4230
15076 -4230 3741 8756 4924 -1048 -170 4161 5031 1879 1432 784 3625 7513 6007 5378 8181 10330
15060 10330 7571 2704 -222 2126 6907 4083 1183 -1070 -1782 506 -3771 -5088 -36 3672 2252
15045 2252 1394 2486 3315 3810 1787 2877 2082 864 -2055 -5998 -4643 -4649 -1254 2565 3186 5047 4319
15028 4319 4705 -482 -6788 -5139 -1809 -7465 -7967 -7128 -7237 -4017 -2489 3313 5185 5717 3890 3918
15012 3918 6091 4871 3983 4408 4312 6215 2427 2557 4582 5021 316 -605 796 -845 3473 7071
14996 7071 4755 1594 3242 6274 2141 -4403 -8215 -9418 -9921 -6278 -3701 -1466 -2619 3979 6319
14981 6319 1773 87 1950 -944 -2086 -735 619 -2025 -746 -1442 -2579 3235 1913 -2135 -1768
14966 -1768 -1768 -4790 -4986 -4230 -2343 4260 4292 1363 -2262 -6586 -7044 1571 1492 -1174 3189 1862 3832
14949 3832 5080 5176 4390 2293 6401 2872 -178 -2771 3224 5058 4781 6371 5151 6519 5491 1822
14933 1822 1829 654 758 599 -1612 2901 7310 911 1556 -676 -7179 -6822 -1831 1924 424 -1684
14917 -1684 2425 4333 5561 760 -1309 -1894 632 -459 -1252 -3150 -3699 3776 5005 -926 -3645
14902 -3645 -4760 -6496 -11182 -15872 -9983 -3419 4793 160 -1184 -2517 -3707 -1268 906 1470 -1823
14887 -1823 -556 562 1940 4498 2998 1360 4677 3136 -3240 -2524 18 2674 2274 -4240 -2805
14872 -2805 -1416 -537 1766 958 -2194 -4004 -11164 -10442 -4970 -1301 -1314 1356 1265 -5384 -7622 -6097
14856 -6097 -5690 -6727 -7502 -4916 -6785 -9244 -12488 -8042 -6410 -7992 -6007 -6252 -5681 -5695 -2135 2310
14840 2310 -539 -3079 -4959 -11107 -13033 -11329 -9960 -3518 -4574 -7888 -3665 -4360 -3643 -1472 3692
14825 3692 2227 1579 3705 4472 1066 -732 49 -2998 -6681 -8361 -3842 -4373 -518 394 453 -322 -5984
14808 -5984 -5376 -3143 -924 -2916 -2812 -1517 1476 3942 8135 2916 -2113 -4558 -2575 -6368 -6515
14793 -6515 -4099 -9355 -13473 -13219 -10732 -10656 -7794 -3494 881 -182 -5915 -3682 -2125 -3669 -3138 -3019
14777 -3019 -2627 -2455 -6276 -5435 -6954 -1721 8050 9948 4111 644 1378 1598 1302 -2160 1745 2660
14761 2660 2365 4217 3589 4252 61 -4049 599 8311 11686 9531 2831 2893 3779 3482 975 3595
14745 3595 3229 -5014 -11047 -6266 164 6636 7244 9656 6608 3662 3408 3025 2801 3246 716 530
14729 530 228 1005 1808 1503 4779 4426 -982 -3182 -2206 2687 4122 2313 3190 2145 -1803 -3213 -814
14712 -814 -1388 -2764 -1309 -2515 -6189 -5699 -6367 -4350 -1929 170 3197 -1348 -6722 -6641 -5809 -4582
14696 -4582 1836 5142 3719 625 3970 958 134 -5752 -3925 -480 -2272 -3387 192 1347 7602
14681 7602 7008 3802 -3211 -8274 -9555 -8562 -5244 -4820 -4642 -3043 4003 7832 3715 -1225 -3611 -251
14665 -251 4355 1783 -3723 -4459 2819 5528 2073 -275 -383 -4221 -2071 -3791 -3045 990 3413 3892
14649 3892 3479 2989 513 -802 -1353 -3510 -3682 2912 5012 -3781 -5555 -1644 768 6561 8789 9202
14633 9202 4257 1366 -2812 -2310 2386 291 -675 -2481 -7035 -3335 -1068 -325 1675 1734 1938 490
14617 490 1050 -1111 -1460 -976 186 -2693 -5939 -7204 -10469 -8873 -4217 -2275 -1923 -1585 -2019 -6562
14601 -6562 -5274 -281 509 -3790 -1175 2852 6182 4620 3476 2280 3802 2361 -494 -1536 -1167
14586 -1167 5088 4140 199 -3773 -6936 -7018 -3759 -1411 3885 5956 6188 3410 2766 3226 2550 6073
14570 6073 6628 5210 2032 2275 7656 5767 1063 -3228 -4229 -2157 -4136 -4767 -8182 -10952 -8088
14555 -8088 -1204 3540 -1894 -4629 360 485 371 1687 1413 1168 -3486 -10596 -7421 -5387 -4202 551
14539 551 2598 902 4390 5413 2241 -4133 -1206 2939 5408 6949 8931 9952 8925 6900 6167
14524 6167 3516 3389 3597 -1386 -1869 1019 3189 -909 -1379 3208 1371 2050 5351 4902 3047 -1790
14508 -1790 -3786 -4675 -9817 -4849 -3363 -6906 -9494 -5096 432 1748 -1660 -3275 -1040 1479 -1981
14493 -1981 -7063 -1201 612 -502 -839 359 -452 -6444 -11317 -4097 -846 6034 10650 9560 9563 12687
14477 12687 9636 9462 7749 7559 3810 -3474 -5472 -6143 -6953 -4980 343 1436 -1220 747 788 -1197
14461 -1197 39 707 2356 -828 -4162 -7971 -7315 -4784 -5823 -6799 -1406 -2148 -3370 -1758 -1144 -3680
14445 -3680 -2961 -4213 -3472 -525 5332 8997 6869 -2234 113 2786 2038 -3609 -5615 -793 879
14430 879 3507 611 996 3741 875 1598 462 632 3712 2626 5828 6515 2564 -2330 -2701 2242
14414 2242 4556 824 -7190 -5502 420 4706 4580 4628 3796 1543 -1034 502 -386 223 3165 5121
14398 5121 337 -3568 -6371 -6461 -6922 -6400 -5758 -4114 -2048 3945 4544 3456 2995 1305 1082 -1908 -4128
14381 -4128 -5201 -4323 310 214 746 4041 -1418 -4015 -3182 -1011 2593 3141 5784 6598 5818 3037 2986
14364 2986 2396 1573 775 -4586 -5083 -3002 -1771 2891 3216 -1101 -3067 -1623 401 3376 4170 1905
14348 1905 -1995 1063 -1698 -4836 -8965 -9570 -8072 -5330 -1578 -598 -91 -2693 -7421 -12073 -10696
14333 -10696 -3198 689 1705 1852 857 -783 -1036 -113 548 -1733 -6517 -8574 -6187 -5351 -6505 -6628
14317 -6628 -3102 -44 -494 -2701 -3080 -4725 -2886 -5373 -10327 -13821 -6991 -3654 -1667 -1567 880
14302 880 1127 -2904 -2823 -13 2759 2457 -875 -4213 -5739 -6178 -3305 -3625 77 3092 1032 -3259
14286 -3259 -5069 -4242 -3263 680 -1142 1473 5145 4579 632 -1319 -1611 -2194 -3108 -7870 -7712 -6998 -3707
14269 -3707 -2746 239 -1877 -1532 2771 304 -1846 597 4089 981 -4214 -5528 -376 2415 681
14254 681 615 2883 3333 -76 674 1476 -3616 -3580 -5637 -4386 -4656 -2729 2244 4208 2626 795 2939
14237 2939 2407 -198 -7475 -9767 -8458 -4233 -4217 -5989 -5961 -5292 -3253 5370 8600 3463 1708 388
14221 388 1096 3689 5822 2556 1575 3534 757 -2647 -6080 -11957 -10700 -4293 -551 -548 -3082 -5014
14205 -5014 -7446 -5927 -4586 -3544 -1404 3267 6199 2613 2382 1184 2212 3853 6153 7106 9673
14190 9673 7557 9882 9438 6710 5000 4949 5565 5972 5665 8954 11426 11308 11456 11056 7218 2107 -1115
14173 -1115 -424 -1204 1548 3507 353 -1285 -327 -1226 2718 5671 6088 4063 4811 5263 4188 1641
14157 1641 801 592 -385 1537 4711 4363 2872 -2701 -3835 -1190 -576 -1841 -6652 -8439 -9068 -8640
14141 -8640 -7115 -11826 -9613 -7709 -2137 -1704 -2176 -2962 -2877 1058 5637 4535 3825 3510 -103 -4106
14125 -4106 -7921 -5904 -5995 -8110 -2734 -6064 -4786 919 -2036 -7104 -9488 -10498 -5855 -943 -1425
14110 -1425 2436 4877 4462 459 -254 -4194 -3476 -2128 -3502 -6249 -6448 -7676 -8115 -10679 -10114 -8083
14094 -8083 -6954 -5486 -4578 -3170 -4852 750 5464 -953 -4491 -4933 -5007 -3114 2269 8109 11595 7219
14078 7219 1139 2530 4600 284 -8083 -9804 -8057 -3660 4908 6729 4666 2827 3562 1938 3015
14063 3015 1889 2622 -688 -6217 -5237 -403 3361 1002 -3431 -5846 -4723 -4099 -106 3548 4746
14048 4746 2538 -1227 -1577 -5330 -4479 -837 2364 5851 8589 3086 -73 -3427 -4093 -2971 -4113
14033 -4113 -3068 1472 3544 -1764 -5572 -1851 592 -2676 -2981 -2763 -6249 -7213 -6178 -7831 -5604
14018 -5604 287 932 -3880 -4054 890 3252 2872 2875 1193 -2843 -1735 -3168 -2974 139 5734 10546
14002 10546 4513 -1078 933 5906 -756 -6094 -1922 -70 2851 4967 5315 5846 2105 660 1948
13987 1948 1284 -910 -2298 -6030 -6748 -5476 -2567 -5004 -1026 2117 3236 5741 5322 3493 1724
13972 1724 -259 3341 -520 -2035 1130 2431 1741 -2392 -374 628 1407 -3704 -3857 -6860 -7156 -4039
13956 -4039 -3343 -4975 -3917 -1845 -472 1879 -537 743 5738 9691 7562 1217 -4081 134 8148
13941 8148 8687 5081 1873 -1695 -4094 -6623 -9957 -5220 3587 6299 2416 -1601 -2700 -2250 -3694
13926 -3694 -6828 -6761 -3842 -2581 -998 -1760 1854 185 -3101 -4088 -6355 -9856 -10303 -6596 -605 5309
13910 5309 4232 1811 4555 4952 -102 1630 5344 4124 5842 4340 5114 6210 7721 3979 -3567
13895 -3567 -4684 -6487 -10319 -7409 -6753 -10060 -7039 -8675 -9638 -6010 -5227 -5094 -4808 -1885 932 -3613
13879 -3613 -2512 -2894 -3563 438 -3773 -5496 -3173 -533 -2209 -3041 -1866 -1620 -2436 -4387 -7964 -4172
13863 -4172 -4531 -5336 -1457 4110 5261 3416 -1496 -643 340 -2087 -832 5781 8632 773 -3182 2930
13847 2930 -187 -852 283 -663 -3080 -1993 -4516 -7059 -6305 -2305 -2114 -3505 -2953 -2560 -5430 -6747
13831 -6747 -2667 2402 3039 -1132 -4283 -5083 -5339 -637 -1312 -2203 3201 7782 -1252 -9134 -10685 -5515
13815 -5515 708 4497 2167 -3979 -3907 -1436 -534 -4771 -5681 -4592 -58 2425 -854 -4919 -7961 -12092
13799 -12092 -12462 -9444 -12411 -2879 3390 2569 1375 1753 -1848 -2573 2964 6999 4160 4021 -1712 -4177
13783 -4177 63 -752 -3708 -6240 -3968 -1692 -296 -6865 -11966 -8056 -7363 -7740 -6699 -2998 -1513
13768 -1513 -3871 -1484 -1010 307 4586 -865 -2478 557 517 -697 -7199 -10140 -8047 -8566 -6490 -1300
13752 -1300 2788 -127 -782 -1385 -1813 -3780 -978 2460 -2218 -2380 -3652 -1662 -3248 -1629 -1676 -5823
13736 -5823 -5559 -2512 -3332 -7683 -8767 -2183 -2274 -2914 -2165 -2987 -5150 -8012 -8506 -10815 -11692 -11377 -9861
13719 -9861 -5022 -960 1125 1853 3720 40 1663 1849 -793 1240 1544 -1250 3895 3339 1308 3182
13703 3182 6346 7630 12654 8145 71 988 -2350 -209 -5724 -7418 1726 5394 2915 1106 -4071
13688 -4071 -2297 -1933 -2960 -6122 -7225 -5925 -5080 -7037 -6401 -4751 -4990 -5167 -7021 -3583 1875 1324
13672 1324 759 2974 4127 2939 3015 2387 3180 -426 -2037 -1628 -3753 -7969 -3058 1232 3961 1267
13656 1267 -1274 -3739 -6233 -5885 -4321 -1519 232 -1290 199 1358 -2400 -1933 -1469 -5811 -3397
13641 -3397 2964 -1618 -7254 -6865 -4141 -2134 1326 808 3101 7410 4721 4478 3428 -1997 -4902
13626 -4902 -4724 -3917 -4243 -2176 -2338 -3391 -3533 -876 -1044 313 2465 4849 1934 555 -1384 -4325
13610 -4325 -5089 -4960 -2450 -1152 664 -2583 -4694 -5488 -1899 1137 2882 -3877 -5535 -5404 -5940 -2813
13594 -2813 -2565 -1063 211 -4406 -4860 1236 1169 1849 1538 54 -3586 -4590 -2648 -1780 2774 4463
13578 4463 6942 5934 5544 -438 -2677 -2306 -1791 15 -2368 1295 5857 9207 7834 4082 -687
13563 -687 -1130 3046 5405 4157 1407 671 -5041 -6108 -4266 -1154 -1446 -1914 1 2566 3123 2246
13547 2246 -669 570 2835 3789 2970 -1942 178 -1677 -2780 -1648 1190 2188 3431 -88 1087
13532 1087 1851 2220 4339 1416 -636 697 2326 412 1922 7412 8704 10331 14561 12237 7257
13517 7257 3908 1299 270 -1741 -4779 -10392 -8390 1586 -401 -2584 -3907 -5686 -7086 -3928 -2495
13502 -2495 -2199 -2412 -2386 -3717 -2206 -1335 373 185 1945 3121 792 1371 938 -2839 -6371 -2667 2132
13485 2132 2260 3204 5476 6999 8464 8286 2578 -155 -846 2888 1935 -1166 3478 1288 -1647 570
13469 570 -2091 -4688 -3327 -2716 730 870 1911 843 1789 5278 10738 7560 6801 10410 9671 4483
13453 4483 -2871 -5741 -1940 -1225 1279 4508 4799 1248 -150 -3363 -5809 893 -1172 -4861 -215
13438 -215 -1321 -4575 -5995 -7794 -9447 -6055 -3985 -4710 -4588 -1480 -1549 357 -2965 -7212 -4733 -1133
13422 -1133 -216 5021 6770 4404 1903 -968 -3815 -1222 -1706 -3627 -4707 -3474 35 -821 -1125 439
13406 439 -762 -1712 4752 3662 2714 1702 -815 155 4681 3532 -4664 -9521 -1956 -530 -986 891
13390 891 -1117 -2679 2048 5547 5137 3106 3350 2 -1209 2357 4595 3191 -257 -1054 -3309 -3068
13374 -3068 3285 7377 3580 -323 -3394 -3107 1226 5290 2623 -2416 -4331 -3113 -1940 -4170 -6993
13359 -6993 -7310 -6157 -9179 -4437 1849 -2865 -3871 -3293 -6961 -9777 -11506 -11555 -9429 -7305 -5537 -938
13343 -938 624 -1630 -1205 441 -3908 -5556 -1928 -2503 -7335 -9107 -4741 -1301 43 -1961 -1675 -457
13327 -457 5072 3326 -1863 -1466 -3980 -3977 -2368 -3863 -474 -771 5788 3043 963 -1158 -1142 -3141 -4693
13310 -4693 -5589 -4661 -5462 -6912 -4941 -2680 -8111 -5075 -2315 1300 2084 -2739 -8126 -9243 -13347 -10816
13294 -10816 -6372 -2475 692 2412 1292 88 591 5102 4199 3035 1312 3464 6647 7097 6661
13279 6661 3573 -1330 -4371 -2794 -5500 -6918 -4367 -3820 -7299 -5301 -6172 -10771 -8474 -5135 -6973
13264 -6973 -8312 -23 -2429 -4216 -7702 -6416 -1558 -2311 -2714 -6056 -8346 -5265 -6149 -1272 -4920
13249 -4920 -6420 -4442 -199 1626 2089 6737 7045 2596 -736 -2649 -5898 -5629 -5905 -2684 2702 -1739
13233 -1739 -2459 -3155 -3363 -608 -2373 -1486 2407 3432 865 2559 3594 2678 -294 -116 -1702 -1079
13217 -1079 5977 8949 8709 4767 -380 -4840 -5327 -7032 -6331 -1602 8393 14819 19117 13285 4363
13202 4363 3374 2876 -1376 1272 5857 7851 2564 -3085 -3295 -3800 -2127 2300 3098 -474 -7963 -6329
13186 -6329 -3108 -310 2353 1913 1054 3716 6844 8231 4732 3357 3441 7406 9639 6938 5037 4930
13170 4930 3175 3071 219 -662 -647 4852 6221 3736 4305 6563 11663 15888 15919 10278 7802 6622
13154 6622 5450 487 402 1357 1579 -3630 -4956 -599 -4696 -3579 -4764 -3129 -2764 164 -1396 -2803
13138 -2803 -1417 -5753 -4695 -2889 -866 456 -773 -4599 -3487 -2651 19 2987 2909 -2171 -5886
13123 -5886 -1151 -1755 -943 2183 6582 5167 2378 -1731 -3767 -6699 -5870 -5692 -3281 -2052 -2087 -2956
13107 -2956 -1065 -1457 -1297 589 279 -5417 -2924 929 2143 2556 1605 -1718 -6773 -5067 -143 1807
13091 1807 -177 -599 -4336 -6806 -5748 -1955 1002 10 -4061 -7534 -90 3069 3739 3351 -863 -5665
13075 -5665 -8840 -7185 -6123 -9313 -9648 -7484 -10992 -7432 -784 -3610 -1799 -4115 448 405 1067 3108
13059 3108 4147 2651 -1219 -6098 -7675 -9306 -12136 -10723 -6453 -3381 -6184 -6772 -3315 -3379 -3056 250
13043 250 -4492 -2549 -1678 4655 12075 12232 7760 3565 4731 1618 2642 5521 3811 1301 -1408
13028 -1408 -2545 -4786 -2232 -7252 -10957 -5207 -5050 -6985 -3394 -779 732 5591 8464 6569 3091
13013 3091 31 -3404 894 4733 1317 217 1133 -184 -757 618 655 -785 745 1106 2908 -1644
12997 -1644 -7724 -11212 -5356 -2052 -2934 -1267 -220 4993 4132 1852 -2154 -2801 572 3367 -1436
12982 -1436 -2340 -2399 -2346 -2154 -5643 -4620 -3568 2337 3290 3585 2918 1855 1140 2180 4504 4474 -1176 409
12964 409 3647 3852 2744 3483 9658 13602 16261 13816 12130 7806 7657 5459 7244 6011 1890 1781
12948 1781 71 -7651 -11234 -8832 -1329 5208 6425 2147 -1139 1521 2234 1033 -5755 -8237 -5918
12933 -5918 -5962 -6458 -6170 4321 4588 1542 -1646 -7734 -9621 -3196 -3422 -3478 -1020 -1606 -1970 -4547 -4933
12916 -4933 1399 4409 2174 3096 2196 2156 827 4580 5231 7434 9223 7676 1898 -1561 -1024 891
12900 891 -774 295 3123 1159 3032 1928 -1229 161 -671 -2030 799 -4914 -5116 -5460 -2065 -5488
12884 -5488 -9379 -5955 -2047 -2134 803 -6045 -7403 -310 5629 3274 4508 1274 978 2009 -329
12869 -329 -4217 -6869 -2565 4444 4726 181 -4082 -3132 -4304 -3907 -1524 2705 354 323 784 -2870
12853 -2870 -4823 -1693 799 1101 2443 8728 9135 3261 142 -1183 -2415 -1350 2586 1281 -3735
12838 -3735 -6425 -6965 -4947 -2805 -2100 -2059 -52 1469 9165 9200 7076 4301 18 -1730 -1941 812
12822 812 2600 4745 9243 9932 5228 4292 3885 5232 9895 10955 11809 11168 8068 9169 12677 9135
12806 9135 10062 12789 14403 16210 14612 10507 7774 7254 5596 2131 -1540 -401 753 5049 2822
12791 2822 1011 3627 3927 5167 6899 1553 -3685 -4125 -104 5301 10917 13727 14060 13956 16170 13303
12775 13303 12759 16383 13632 16104 17170 18083 16003 12230 5883 3231 9157 10931 7542 5588 5799
12760 5799 4891 4808 2043 -3917 -2704 516 1912 -668 -2172 -6149 -4393 -819 1548 6006 4777
12745 4777 5810 4508 1268 -41 3901 1479 2296 4580 7909 13952 13714 10375 5729 3985 3841
12730 3841 5720 1762 976 1970 1593 -1935 -3732 -351 381 2561 4251 5347 1509 2579 785 -1955
12714 -1955 -1436 1445 32 747 5114 5747 4544 2366 -3294 -4246 -945 3239 475 -4352 -3668 1806
12698 1806 1089 -4219 -7926 -7193 -4791 3993 5369 1358 1623 2386 2866 2593 1374 -5779 -12178 -11966
12682 -11966 -11756 -7903 -6335 -5202 -2782 1056 3278 4391 1427 2600 5569 5653 5449 4371 -2786
12667 -2786 3123 4323 21 -3627 -6637 -12535 -11374 -4258 -2039 -4256 -4301 -2362 -943 2604 2382
12652 2382 -2646 -3645 -3513 -3395 -715 401 -175 -88 -1157 -5477 -10317 -12573 -13742 -9624 -1755 -428
12636 -428 -919 -4427 -3614 -1439 -2669 -4150 -7251 -3292 1885 359 -906 5279 4543 -1912 -4326 -6984
12620 -6984 -2481 1406 -4155 -13121 -16285 -11801 -6745 -4455 1492 9758 9933 1919 -1043 2474 4400
12605 4400 10983 13256 10328 6689 6378 5454 3990 1210 -3365 -4544 1256 512 2003 4117 2640
12590 2640 -784 -3929 -1136 2768 2184 -3194 -7734 -7525 -2079 -1506 -112 2355 5018 3473 4930
12575 4930 8294 3877 1732 888 -2935 -3752 -5625 372 -2102 -2723 -5123 -12655 -11809 -9438 -3006 -2289
12559 -2289 -2591 -2725 -2392 -276 -3 877 1095 -2249 -3293 -4247 -2063 -2743 -863 -501 -2116 -7293 -10595
12542 -10595 -8169 -6809 -3708 -2966 -4229 -3830 2043 1168 -5837 -4016 2466 1473 -1312 433 1162 -830
12526 -830 -7295 -1261 1973 3582 3333 108 782 2233 265 1512 5031 4141 -419 -4787 -3603 -486
12510 -486 -1859 -6921 -11018 -13122 -3996 4115 5097 -1181 -4454 558 1014 1909 1095 -3397 -5142 -842
12494 -842 -1941 -6056 -3693 -48 5292 4960 4087 5829 5551 1427 2085 2728 1768 5752 9154 4549
12478 4549 7406 5483 -345 -2667 -3064 -7243 -7880 -7865 -7671 -8397 -6311 -6212 -2324 1322 -666 -3788 -1633
12461 -1633 -953 -1396 -1111 37 1688 1910 4105 3053 -1934 -2792 4661 4863 8102 16080 7419 824
12445 824 1169 56 -3426 -3293 -1689 1573 5305 5093 6928 6952 2968 1324 3017 4071 2982 1360
12429 1360 -4365 -4431 -3459 514 5105 8945 7958 5110 4589 5006 2557 7765 10445 12255 9480 5241
12413 5241 7961 10397 8863 7167 8865 9559 9996 9229 6642 347 -2133 -701 -815 514 -3690 -3062
12397 -3062 -4633 -4059 3243 5385 -1176 -3628 -4342 -453 2330 899 3024 4863 3934 2846 5891
12382 5891 13152 17399 17097 11197 4167 7036 6813 5621 5017 6294 10582 8313 5608 4053 5904
12367 5904 5650 4721 6870 10152 13026 11248 10462 14504 12861 18715 19981 22492 31695 42557 50597
12352 50597 44881 47824 55907 64782 70532 72570 72835 77379 80203 83967 78858 76668 75400 66975 57012
12337 57012 54730 48613 36246 28925 24847 25331 22770 17420 16430 16372 13808 14547 15113 16828 14479 16941
12321 16941 24660 19171 8902 8896 11033 14046 12288 11718 14048 13326 9361 4994 6826 7551 2403 79
12305 79 860 -1769 -6456 -5061 3441 8267 7114 858 -3485 -718 1633 4700 2283 -688 4621
12290 4621 2123 -3435 -1351 5350 8922 1735 -5080 -6573 -9880 -6409 -1558 -3559 -3116 -1715 -4767
12275 -4767 -3835 -557 4830 4843 3633 2596 3830 3744 3195 1268 -3843 -8602 -7189 -5188 -3951 -6066
12259 -6066 -6382 -95 1980 -888 -4517 512 -866 -4442 -4248 -1807 -1888 -5035 -5778 -3515 -2597 1944
12243 1944 7767 12563 19377 21981 16370 8495 -1277 -1782 -712 -891 3407 12223 8086 4498 -1335
12228 -1335 -1528 -2092 -751 -359 -2659 -518 1512 8481 6975 355 -430 2215 771 461 3169 6451
12212 6451 13539 15627 10247 4324 9443 16522 21452 25369 17092 8600 6812 7964 7727 2993 472
12197 472 1294 4163 3938 2734 5287 6258 6781 7357 4361 2509 4597 3739 1227 375 3269 1261 1265
12180 1265 -629 -153 -2023 3092 7910 11611 13015 11524 10638 10788 6142 350 -3111 -7221 -8124 -5182
12164 -5182 -4409 -4889 -10363 -7662 -2471 -3421 -4961 -1866 -235 2136 2878 3084 2875 -3592 -6267 -4547
12148 -4547 -1291 -1769 -4824 -5063 886 1003 -2178 -11377 -15160 -15133 -16233 -9483 -4358 -1518 209 -1067
12132 -1067 -5073 -4971 -552 -1884 -3713 -3759 1265 3909 3697 2905 187 813 -1631 -1631 4824 2745 966
12115 966 40 -2517 -505 2990 4404 61 1572 1362 5252 10156 9897 9157 9381 5159 259 -2965
12099 -2965 -1644 1498 -399 1342 2818 4670 2756 3847 4443 -391 -1154 -2126 -4354 1457 8648
12084 8648 5922 -1268 -195 3232 3187 1854 104 -1713 -3209 -3674 -6237 -3497 -441 -1039 -1331 -164
12068 -164 278 725 1942 -3801 -4575 -2455 -1624 -2466 756 5070 1278 -2423 354 -1332 2329 782
12052 782 5276 4625 2978 7200 11169 11175 9977 6880 2997 -3651 -3477 545 -1254 -4311 -2065 221
12036 221 452 1419 1433 416 -2867 -4735 -2562 51 827 -2911 -8334 -9117 -4460 -2394 -1395 2362 456
12019 456 -1211 -1215 -6059 -5232 -6273 -8022 -7566 -3341 -3574 -5913 -3771 -1590 -3318 1899 3395 1562
12003 1562 4864 9786 10435 10005 8556 5754 2615 540 -1367 -3275 -4474 -4163 2079 5072 10014
11988 10014 7928 5759 75 -635 3006 3827 1695 399 -1872 -3154 -2910 -1027 1574 -2749 -3724
11973 -3724 -2930 -5075 -4097 1927 6932 2741 -1343 -6297 -5943 -1262 -958 -1363 101 790 -2007 -2299
11957 -2299 -5706 -6512 -7607 -8143 -7663 -5638 -7711 -7139 -6600 875 2932 4587 2147 2967 4500 5410
11941 5410 -404 -7205 -10765 -7903 -3311 -1445 -3730 -4491 -4012 -669 -4641 -5031 -2784 -5374 -4084
11926 -4084 -8453 -11012 -2162 -826 975 -2689 -1650 1108 906 62 1747 1289 -634 902 1576 -867
11910 -867 -1166 -4904 -8421 -4184 480 4070 6055 216 -4597 -5003 -4098 -3127 -2401 -3626 -6485 -8007
11894 -8007 -1825 2650 6705 7826 8072 7245 5348 7572 3829 4460 5025 -1725 -10051 -17288 -16199 -13865
11878 -13865 -9962 -8261 -8193 -3685 -2785 -5202 -2994 -4080 -8713 -9136 -12266 -11262 -4894 -2186 1273
11863 1273 1964 1749 -1354 -4649 -2857 650 2960 1786 -556 1680 1075 3019 4254 -2510 -1966 2686
11847 2686 -2331 -3946 -2749 332 98 1939 2987 249 -5196 -9882 -3825 1408 1171 -3632 -5909
11832 -5909 -4103 -8090 -5452 1335 94 -3221 -2314 149 393 507 2903 2114 -3354 -6937 -5780 341
11816 341 -2626 -6991 -9015 -9570 -4509 -888 -2435 -3327 -1817 2677 2599 -3123 -9482 -9501 -6400 -8505
11800 -8505 -9687 -7107 -5274 -1322 -1659 -2119 -3724 -7508 -5375 -1288 1208 1691 -868 -3714 -55
11785 -55 -1158 -2334 -2609 -1880 130 4896 4350 -887 -6249 -7253 -6921 -5035 -625 2291 -815 -3593
11769 -3593 -3494 -1398 -873 -2893 -1881 -3989 -5456 -4995 -3206 -2229 -3618 -4588 -7258 -6008 -3400 -3247
11753 -3247 -8194 -3709 -3341 -4126 -3719 -2679 4170 -530 -5097 -2503 -3828 -5930 -6610 -4960 -8380 -10302
11737 -10302 -9043 -6287 -7746 -6874 -3043 1509 -85 -1907 -2037 -2583 -6521 -6917 -7102 -4580 -6488 -6153
11721 -6153 -6470 -2933 4385 5920 2850 237 -1350 -3519 -161 2529 -842 -1025 2194 4705 3117
11706 3117 648 -1537 -3757 -4664 -3482 -4112 -4082 -6250 -7373 -6072 34 6776 3746 -2609 -5289 -3605
11690 -3605 -2567 412 -1270 -2571 -3604 -4458 -3025 -4598 -3381 2667 5651 292 -488 1980 3291
11675 3291 3276 -3096 -4204 -1457 2071 2554 237 1979 2560 4472 2457 -403 3266 4443 635 -2400
11659 -2400 440 448 -2149 -2551 -1346 -339 -714 -2578 -921 4224 9908 8737 7032 6803 227 -2523
11643 -2523 1319 -930 -1963 -2243 -3540 -1746 1288 7497 7793 4313 1875 4250 4967 3077 -272
11628 -272 -1194 -3403 -5554 -4960 -1761 330 2454 -2893 -713 682 4865 6581 6929 2589 -418 2871
11612 2871 3063 3683 4225 1457 -829 2828 8134 11248 9225 10642 10903 5246 2982 4939 7647 8400
11596 8400 7431 6185 2431 2933 -2041 -2962 962 2397 6499 7150 7533 7600 7734 11351 17309 19658 26846
11579 26846 28789 28307 29917 30989 33320 35068 33285 25982 22606 22610 18315 18697 18452 16424 15893 16231
11563 16231 11577 9693 10731 11260 14677 15963 17790 20480 24377 23302 16897 15960 22719 25207 30170
11548 30170 33987 37781 48576 52594 49038 53964 46634 42475 36244 31907 34857 34641 43423 53305
11534 53305 63029 73241 88646 106089 117472 122852 119957 105745 95320 87046 74081 59499
11522 59499 55654 52651 43817 37415 35298 35595 33248 36145 38594 40769 41971 39723 42792 46089 43875
11507 43875 49510 55010 60231 63729 74886 94775 107745 118663 126691 124309 114162 106469 94933
11494 94933 82434 73653 68370 60249 61600 65910 77651 85391 97332 111753 123605 125936 120681
11481 120681 112047 102752 93197 78827 68222 61209 55125 49697 43662 39869 32817 28675 29812 30179
11467 30179 27583 27569 33566 38459 40669 40723 43961 48831 53278 59482 74346 90323 103241 117434
11453 117434 122354 124235 119292 104465 93184 78310 63606 55670 48499 48920 44618 38854 38176 35296
11439 35296 42353 44912 44402 41470 45380 46092 36119 34185 28001 22511 17383 14539 16504 17523 14499
11424 14499 11759 10972 13175 9746 10367 12340 13522 9659 1552 3315 12315 17177 15603 15706 14731
11409 14731 19128 26397 32310 33376 34892 34165 31421 27583 24753 19720 19005 21454 17093 15583 11699
11394 11699 8241 6657 4679 1141 4529 4400 9732 5056 4887 5626 6261 2486 3477 3647 -1628 -8589
11378 -8589 -8188 -4005 -1967 -2144 256 -1208 -6860 -9085 -9963 -6824 -3886 -4910 -5520 -4189 -1537 -794
11362 -794 -1074 49 1338 84 1496 2978 7474 12304 15618 15767 16242 17344 13400 8307 7144 8723
11346 8723 8198 8251 9680 7401 5733 2961 5177 7154 9490 5940 4221 8108 5590 2737 -146
11331 -146 1787 5486 9111 1097 -1422 3002 3740 935 2807 5137 2078 966 -376 1293 2086
11316 2086 491 1308 7246 13163 13269 19746 24680 31952 38983 49610 56719 53798 44757 34254 28375
11301 28375 22032 20345 15172 11315 10413 10960 7080 7265 8133 7978 5980 7229 6934 2202 1004 5006
11285 5006 10832 12063 10737 9461 12556 14653 14214 16319 23159 30764 42363 47727 56695 63921 69049
11270 69049 67986 68069 59878 48177 41846 35806 32325 27703 32110 41610 47231 53993 50727 44647 34190
11255 34190 28217 27067 23471 20828 21143 18472 13132 9904 10115 13053 16018 13966 12279 10703 12229
11240 12229 14761 13314 15506 19888 25755 29024 32202 37588 51253 63833 76606 98051 134155
11227 134155 176096 213321 233075 226473 195232 155292 121833 95630 75984 63670 56973 52554
11215 52554 46693 45149 46056 43051 36944 31005 24945 17919 19271 18309 16829 13267 18371 21028 18651
11200 18651 18792 22099 20055 20585 15874 10951 4278 7767 13766 15161 24281 29550 35209 39414 49122
11185 49122 62718 77045 92541 119438 161912 202142 232520 233983 205157 159768 120020 94304
11173 94304 75724 57742 44668 31874 27061 27913 27980 23678 20243 21341 14936 13094 12452 12569 6203
11158 6203 6037 10253 9906 6754 4615 3911 7973 8897 4198 54 175 6326 10558 8478 4905 1863
11142 1863 1240 7834 16210 17638 19723 30810 40225 55023 68592 79903 85042 82925 71691 51121
11128 51121 33994 26200 21506 18508 12922 8919 9677 12809 10840 7451 4537 5152 8195 6301 2635
11113 2635 310 -2917 -2972 -32 667 -2184 3040 5554 6928 7825 -190 -5216 -5266 -3312 -4513 -4932
11097 -4932 -6942 -6751 -6162 -6210 -4552 6 1365 2057 319 -3916 -4718 -172 5704 5573 2435 -1658
11081 -1658 -8427 -7591 -1279 -4744 -5099 -2457 -2169 -5079 -6594 -7307 -5826 -2546 -960 -7818 -9056 -7731
11065 -7731 -3857 -775 -2034 -836 107 -5536 -8610 -9978 -8371 -4111 -449 209 1990 -2383 -5958
11050 -5958 -5350 -6961 -7144 -7256 -5747 -5560 -4672 -8460 -10207 -8931 -3015 -1364 -2911 -731 -1023 -1435
11034 -1435 1429 2318 1848 -1678 -5562 -8418 -8159 -8378 -6963 -6269 -5988 -9283 -5618 -5599 -6570 -1671 514
11017 514 1793 -2831 -4366 -3561 -4071 -4807 -1620 -3828 -2538 -2913 -1557 -1656 -5005 -7323 -4641 -4009 -6785
11000 -6785 -8599 -9436 -10629 -8406 -6008 -3704 530 -3010 -7849 -8383 -8777 -8385 -7281 -8779 -7545 -5982
10984 -5982 -5046 -2871 -1194 -78 -2701 -4444 -1582 -5738 -6070 -2076 -2425 -5620 -5505 -2895 -2476 -1040
10968 -1040 1128 5482 6763 7357 9062 1872 -2762 -1969 -3342 -2124 -5513 -4160 -760 3603 4381
10953 4381 1909 379 385 -3210 -832 740 -1873 308 4997 5059 6532 2201 332 -3521 -7682 -6224
10937 -6224 -7704 -3020 -3346 -2615 -1003 -1342 -5389 -4066 -4897 -4885 -5807 -7752 -10389 -13477 -13438 -13741 -7511
10920 -7511 1409 1685 864 -3658 -5775 -4099 -5310 -3946 -8738 -11060 -2982 -1586 -4309 -5706 -7170
10905 -7170 -2075 323 -3732 -3647 -6082 -7337 -6301 -3750 -5313 -5944 1577 3935 2437 -4647 -4636 -1109
10889 -1109 -5000 -9335 -13002 -12297 -8920 -5865 -3130 -3590 -5390 -57 3557 5821 2368 -4006 -4484
10874 -4484 -9550 -7625 -413 -2106 -1916 -2000 -1224 -217 -2751 -1404 -4688 -8027 -5167 -1734 -4986 -4180
10858 -4180 -4902 -5668 -5164 -1035 7137 7158 1398 -1824 -1819 1082 562 489 2491 -114 -2728 -3453 -2445 -321
10840 -321 2557 -1985 -5927 -4585 -5604 -8337 -4628 -5228 -6596 -6349 -3359 244 3316 3484 849 -3898
10824 -3898 -4255 532 -346 -5652 -7652 -4554 -7030 -11130 -9377 -7935 -6743 -3874 2154 5099 3325
10809 3325 3798 3642 -4833 -9091 -4458 1644 -1344 -7436 -8018 -4602 -3220 -3322 -4652 -7421 -3815 -3063
10793 -3063 201 3199 3920 2710 -3098 -5543 1111 3479 5243 5430 1612 -4797 -2748 -204 5657
10778 5657 4801 5816 3249 -1969 -6670 -5511 -3438 -3427 -3673 -6641 -5975 -5678 -4500 -7309 -9235 -14707
10762 -14707 -13137 -9467 -10928 -11795 -9928 -5659 -3408 -4880 -298 801 5104 6548 2934 -835 -2699
10747 -2699 -5754 -9695 -10322 -8039 -3606 -5178 -10713 -9368 -4399 1633 5128 4207 -2826 -3676 -3725 -4737
10731 -4737 -3501 -2915 -1923 3098 2610 -1735 -3915 4543 7129 3691 -3111 -4180 -3922 -2367 -487 -3202
10715 -3202 -3897 1893 -3290 -8671 -149 1494 -325 -1160 -3583 -2103 1472 510 1097 3535 -1938 -6366
10699 -6366 -7442 -6201 -3634 -5878 -9078 -6838 -3980 414 -97 2150 6036 3238 1415 -1618 -6869
10684 -6869 -6194 -2256 -3251 -1627 -4197 -2672 -4472 -6368 -4317 -8936 -11071 -5867 -3811 -1627 -730
10669 -730 2615 1257 5287 1446 -5828 -6609 -4579 -3815 -5788 -5078 -5406 -6811 -2714 1893 3566 827
10653 827 -6483 -9280 -11887 -7690 -8965 -10424 -9685 -8919 -1817 -2906 -3845 -1782 -3824 -6397 -5478 -2418
10637 -2418 -1142 1984 87 -3855 -4859 -6399 -5316 -3719 -3516 -1274 4352 6453 4062 1732 2808
10622 2808 1343 -3426 -3982 -7879 -9082 -4114 231 1811 -932 -4590 940 5237 5094 1345 4359
10607 4359 2076 1299 1660 -1799 -1186 875 713 1174 -280 -7790 -9601 -6532 -5796 -8340 -8682 -7703 -8415
10590 -8415 -4110 -4846 -9452 -6845 -4726 -6337 -6554 -8580 -6275 -4720 457 427 -9944 -12934 -8301
10575 -8301 2791 14038 17318 17369 29972 60433 102340 130480 128113 101991 66788 46434 29733
10562 29733 14502 6825 1641 -4728 -4530 -4191 1026 1456 -80 -665 -2951 -2283 -3099 -7006 -9227 -10070
10546 -10070 -6657 -1983 291 2627 -1212 -2939 528 -2951 -7467 -11748 -8778 -6778 -3269 4297
10532 4297 6172 -2819 -10177 -8365 -3675 -2063 -127 325 -8021 -1821 4352 1206 -3154 -683 -470
10517 -470 -9569 -8244 -4893 -8650 -8581 -3210 -5424 -6756 -5260 -2683 2306 -763 -4298 -4262 -2866 -2694
10501 -2694 -4833 -5783 -5074 -2927 3219 -294 -414 2011 6298 12089 8517 1144 1502 3012 -1469 -1043
10485 -1043 -26 -220 812 5372 4109 1460 -1446 -2684 -2616 -3169 758 3182 3118 -2890 -2558 1614
10469 1614 4789 3631 -2110 -2536 -3762 -2807 -4687 -5004 -3458 -2715 -2554 -3911 -4017 292 -2619 -2343
10453 -2343 1907 6768 3018 -2075 -911 -2207 -1920 -2253 -1470 -1137 -4975 -6389 -7005 -7403 -5464 -5181
10437 -5181 -2007 -2043 -4532 -2317 -1520 -3510 -4959 -4145 -2232 -210 788 2198 1931 -169 -2842 -1046
10421 -1046 1022 777 -3671 -6322 -8951 -7171 -4566 -5272 -3921 -3655 3798 6468 6839 7706 1681 -4501
10405 -4501 -6030 -6066 -5864 -3673 -2969 -4211 -9020 -8706 -3652 2128 5734 3667 251 1447 6354 1375
10389 1375 -5115 -6403 -8175 -10575 -7837 -6455 -5272 -1907 3537 1591 -732 -219 -4006 -1306 2997
10374 2997 3689 2020 310 1032 4040 2229 2324 1060 -3047 -3725 -694 -5358 -7181 -4307 -5822 -2550
10358 -2550 -1434 274 2328 1769 1381 -2449 -8390 -7745 -8218 -6305 -4401 -3756 -232 -36 1024 -1284
10342 -1284 -2463 -4564 -3943 -866 -156 -624 553 -146 -2878 -3006 -5067 -5693 -4943 -4424 -5156 -331 1661
10325 1661 1115 3375 2048 -71 -152 1353 135 1198 -1641 -6037 -7858 -9242 -5775 -947 2292
10310 2292 2493 3255 1067 -2156 -2354 696 1827 809 -135 3982 4942 4671 2013 -3040 -5138 -7369
10294 -7369 -8648 -8439 -2784 823 -5464 -11762 -13578 -9601 -6957 -6214 -6378 -4983 -2009 -3003 -754 841
10278 841 -3162 -5680 -2382 -3032 -1865 226 -1810 -6436 -7948 -7141 -5754 -4646 -4438 -4480 -3930 -3328 -5115
10261 -5115 -7760 -8380 -4110 630 5003 2935 1489 777 -772 954 4355 1830 -2695 50 7996
10246 7996 10273 6914 4989 1696 2149 1977 1928 -930 -1748 3820 2098 1314 4135 5700 871 -3808
10230 -3808 -3859 -1274 1622 3336 6642 11206 15438 20160 24189 22922 23855 26241 29515 30472 23690 18689
10214 18689 13661 11547 11143 9353 7390 3775 1671 3881 4846 2458 1696 926 3879 7016 2278
10199 2278 382 -963 264 -3418 -3112 1461 1143 565 717 4296 5591 2934 -1415 -4711 -7319 -9712
10183 -9712 -10646 -4966 1337 1931 1871 -323 -4212 -3423 1845 6052 2485 3348 6290 6248 4211 5703 3993
10166 3993 -4903 -9327 -1661 3332 1214 580 -3934 -8102 -4123 842 2369 3788 2379 4297 -1339
10151 -1339 -4717 -3627 428 -1753 -3094 -384 -6439 -12452 -4500 -1492 -8169 -4029 -3091 -5627 -6102
10136 -6102 -9785 -7190 -6517 -3302 -4609 -5097 -5401 -2395 -1767 -4692 -4764 -5504 -9599 -13314 -5481 -5966 -4205
10119 -4205 -2390 -5777 -5019 -2128 -2131 -1512 -226 1979 2423 2348 -2233 -3384 -2939 -596 1275 1367 -1566
10102 -1566 -6212 -10408 -8353 -7473 -5299 -4974 -6212 -1991 2074 6743 12919 18708 20473 12985 6648
10087 6648 5081 4953 2816 3318 -105 -6543 -8872 -9618 -12167 -6194 -5298 -8717 -6572 -5484 -2194 75
10071 75 2105 -1263 -3148 -1762 -1215 -3251 -6072 -6878 -666 -457 -2189 -2455 -4294 -6992 -1903 2372
10055 2372 3557 -1441 -2568 -2077 -2552 -2978 -9532 -7162 -2014 -1671 -3209 -1379 -955 1782 1307 -2511
10039 -2511 -3024 -5333 -11027 -16285 -10708 -7116 -2859 2772 -3455 -7096 -2767 2153 3393 3446 4453
10024 4453 5193 4464 1574 3189 1814 1865 5386 8270 4554 2427 -139 2004 5542 10514 5528 -4138
10008 -4138 -10311 -9289 -10855 -10556 -5135 -2393 -3232 -1813 -2354 -170 -1822 -2476 -6316 -5634 -3532 -1329
9992 -1329 -3098 -5468 -4547 -8255 -11284 -11763 -7648 -4816 -1182 -219 -620 -360 1735 2857 3167 1685
9976 1685 616 1251 -4356 -6704 -3826 -5284 -3166 514 -2643 -1772 -912 -3806 -12243 -11891 -4619 -1582
9960 -1582 -1160 -4208 -7496 -7053 -6494 -7358 -6210 -7706 -4216 -3432 -4559 -3946 -4514 -2367 -3123 -3156 -5121
9943 -5121 -4320 972 3798 5003 8475 7132 3200 5609 1679 -1663 2275 1401 438 855 -149 -2866
9927 -2866 -1536 1575 5326 2715 16 -1829 273 192 2246 -1453 -4628 -2617 -5461 -6304 -4444 -4525
9911 -4525 -1692 4378 5865 5430 8602 5168 428 1074 -3728 -6066 -4160 -811 3159 1936 2498 3721
9895 3721 5948 3467 -1377 -2979 -4839 -5312 -6503 -4341 -3574 -2224 3368 4294 4757 6844 5971 3178
9879 3178 -1286 -2248 -2145 -5694 -3638 1374 1613 2795 4439 7308 5063 -2822 -9046 -9167 -5437 -976
9863 -976 -3633 2332 9014 9582 9327 11853 12709 10191 1732 -1110 3834 4993 2489 7131 11357 8087
9847 8087 2122 1738 -2 7836 8734 6806 8326 8242 3499 7251 11011 8294 1200 5835 7308 6243
9831 6243 4210 3431 7346 6666 3676 6171 5534 4782 7733 8557 10211 6326 2771 405 1852 3341
9815 3341 2676 3320 2109 222 -2543 -2362 3651 6081 2032 -2122 -3622 -4790 -5044 1913 5021 969
9799 969 1834 1035 1286 1022 -2271 -3516 -4874 -7796 -3565 -1251 -2327 -2405 -3800 -4339 -5211 -6888 -6827 -4980
9781 -4980 2311 6266 7354 5925 5399 4151 -1425 -4388 -4332 -911 1263 662 3220 6057 4911 884
9765 884 2942 1453 1941 -2314 -5265 -5123 -1108 -1622 -2954 -4948 -2508 -319 -4250 -3947 -5706 -5890
9749 -5890 -2074 2033 815 -865 -2655 -5831 -9212 -12754 -14344 -9735 -6795 -3813 -5445 -5826 -5173
9734 -5173 -4705 -4194 -2099 -5845 -7371 -4533 -3256 153 -1626 -7832 -6577 -3507 -1302 -608 -1472 -2828
9718 -2828 -586 -1426 -6213 -2845 -5707 -5752 -3919 -7268 -6663 -7117 -3675 -1014 2704 2843 1918 142 -4628
9701 -4628 -6946 -6762 -2914 -1307 -2519 -5502 -3911 -2054 -2336 -3267 -1806 -373 -1285 -9879 -16082 -18880
9685 -18880 -12593 -3993 -353 -1621 -5817 -7918 -6068 -6393 -6567 -7058 -4914 -5783 -7247 -7253 -7791 -4236 -800
9668 -800 5247 9632 7350 3566 56 -2583 1146 2651 2757 1555 -1921 -5627 -5676 -4355 -1718 3392
9652 3392 5541 4628 5269 6560 5069 4099 2036 -1585 -2695 -2440 -222 4286 6728 8232 5729 1205
9636 1205 -102 -649 -3199 -863 6 -475 -527 -3468 -4694 -135 3245 1876 4815 6427 4379 49
9620 49 -11 2982 3494 4563 7310 7117 933 -3660 -6343 -6580 -887 2418 2500 -312 -2269 -3692 -3761 -4134
9602 -4134 -3972 -8209 -10146 -8113 -3817 -1653 2535 5308 5307 6270 4642 -1582 -6857 -8157 -6365 -4159
9586 -4159 -4569 -1924 -3092 -2904 -2972 -3502 -4544 -6337 -8580 -8857 -2174 3830 2273 4769 -939 -2904
9570 -2904 -2506 3258 2914 6226 7388 8590 8157 8346 6214 5804 9035 9937 12880 15935 11819 4409
9554 4409 314 723 770 -1299 3952 10609 12164 7872 334 -692 4667 6219 3863 3929 7376 11820
9538 11820 10394 7403 209 -3052 1558 1282 3547 3978 1871 1197 -8164 -11907 -3892 -2063 -1708 -5039
9522 -5039 -2309 1541 2052 81 -3981 -2605 -613 -1071 -2537 89 1598 208 -4736 -5143 140 -1371
9506 -1371 77 2218 5863 12213 11115 7029 3198 1752 3434 4140 3107 1291 -2319 -5791 -1711
9491 -1711 -41 -1494 -1763 2657 -1445 -1746 -3625 -2679 -1771 2105 4109 -2426 -2524 2841 7817 9732
9475 9732 11770 8758 4791 649 -2842 1684 8067 6666 2393 -1364 -785 2733 -5157 -8859 -9239
9460 -9239 -3701 -1710 -1956 -2735 -6695 -6520 -2769 -330 5839 9818 5764 29 1247 -1417 -7750 -11472
9444 -11472 -7714 -5099 -2272 3539 6088 7856 9781 9380 3592 2370 -1142 1956 4332 6685 5494
9429 5494 3299 5233 7961 4785 -3344 -5973 -13477 -14067 -7523 -6515 -4779 -5591 -5616 -4263 1167 2265
9413 2265 2292 -2816 -6895 -7126 -5350 -4932 -3964 -1546 -4036 -4754 -7767 -8762 -5765 -1247 1553 -3795 -6492
9396 -6492 -3901 -7805 -8657 -9775 -9795 -4986 -1331 -4042 -9550 -9259 -8744 -9313 -2167 3619 3320 906 -3045
9379 -3045 1340 3950 4570 5586 7573 7626 6374 3610 9156 14123 9771 3593 3359 1018 -818 -1465
9363 -1465 -2857 -4365 -5389 -4010 -2175 -6093 -7076 -4344 -3257 -434 1408 6397 7409 3090 -2819
9348 -2819 -5220 -4393 -8999 -9994 -4824 -1287 775 1283 -1283 -1776 -1029 -1401 -2002 -2102 -5291 -7526 -10780
9331 -10780 -9211 -2231 -1858 -1533 -3006 -2278 -1735 -303 200 -2578 -4266 -5572 -5628 -2689 1194 3280
9315 3280 4255 3998 862 690 304 3919 8609 11353 7327 248 -845 3922 9154 12159 14087 15798
9299 15798 17265 17682 16922 15063 21518 24167 16709 12738 10590 9235 9081 8416 1448 1528 2713 211
9283 211 3028 6800 3904 3531 7542 8881 9322 8150 9358 8671 2989 -75 -520 -1396 -2519 -7071
9267 -7071 -9681 -9238 -6037 -1263 3107 915 -1995 -231 691 -1285 -1195 -4710 -7902 -12111 -16598 -9327
9251 -9327 -5411 1965 7383 5529 6172 2576 -1790 6036 11738 10931 16032 16147 15017 14116 9835 9380
9235 9380 11407 11340 11113 19641 23104 22106 20428 17991 11417 9711 7680 12550 13649 12343 15422 18994
9219 18994 20533 23968 26028 22396 17980 19073 21002 25458 30344 27812 24779 27849 33458 38167 39868
9204 39868 40802 43184 51716 61647 69583 77648 88086 106815 126561 147556 175161 216658 274672
9191 274672 352112 456481 573256 699789 833496 943842 1015233 1044378 1027280 951273 838116
9180 838116 714745 589737 480686 385526 308471 250897 213862 180352 158192 141774 127776
9169 127776 114811 99806 90347 78855 70209 65011 63184 60528 54018 46256 43983 43670 44354 41724
9155 41724 41335 44045 45205 45758 40956 37037 31689 28926 30911 34569 30171 20587 19551 25564 28139
9140 28139 33272 37597 40782 40717 44689 45441 41358 42254 41462 38632 43800 44329 46922 44501 40006 41357
9124 41357 47527 52814 52988 49092 45667 44037 44813 51445 58049 54823 55058 61191 69090 81944 87564
9109 87564 90245 98565 108364 115999 127472 146580 173202 208559 260841 339334 445393 583127
9097 583127 756132 944665 1078697 1093159 986651 821270 654817 513906 402850 315975
9087 315975 253378 207267 175458 149924 125879 111545 98957 87901 85400 81520 74155 64118
9075 64118 60281 55835 45688 45921 49140 51171 47285 45268 42429 41351 40780 42031 42587 46764 49528
9060 49528 53579 51802 47855 45938 45502 46828 42706 43909 48096 50703 51145 54778 56206 57319 65981
9045 65981 89161 112517 131554 147581 158862 171412 186144 186053 156534 122441 97504 80983
9033 80983 62453 49159 37512 40227 44351 41351 38297 36317 38831 40858 41580 40504 40894 39539
9019 39539 31304 27652 29606 33453 38896 43264 33611 19337 8612 4237 6256 9084 11328 9460
9005 9460 5123 6008 9771 15106 25111 28449 29588 33263 37872 38329 36932 34727 40585 49303 53813
8990 53813 52790 48076 48300 55363 54389 46015 39399 42411 54548 58371 63079 64243 60356 49191 40049
8975 40049 39651 39507 39410 40235 37627 42196 48155 53400 48566 43107 40723 43922 55880 68077 64034
8960 64034 56417 52952 57360 61725 61912 65021 64887 67379 70605 72931 71962 76424 77221 76575 73131 64397
8944 64397 56589 39993 28574 18449 13863 25020 34941 43604 54563 59411 65649 69030 69490 63259
8930 63259 58314 53949 51925 50006 51205 46195 37570 33252 34220 37428 34988 34304 27174 5927 -16146
8915 -16146 -14887 29649 109327 182333 225516 233755 220273 210438 201077 195183 192108 185956 183407
8902 183407 181354 189058 195543 199554 196194 193133 198961 204609 212344 224985 241445 260616 281443
8889 281443 317240 363355 426611 493241 538222 538239 497365 440549 385634 342504 319829 316938
8877 316938 317576 315420 322859 329987 336373 339496 339244 330427 319547 318216 329502 338806 345305 344626 343104
8862 343104 344787 346171 345538 342783 344371 351570 361138 379665 410909 447871 477130 500225 525729
8849 525729 558095 593984 638850 683439 736265 808013 913071 1037590 1160738 1294154 1411754
8838 1411754 1454026 1387497 1270120 1164103 1090697 1048684 1033740 1048374 1070917 1090764 1113578
8827 1113578 1137672 1177830 1224938 1279543 1355728 1460631 1572237 1694017 1840451 2003471
8817 2003471 2163776 2324407 2498767 2680147 2868432 3088336 3347836 3652447 4001346 4411140
8807 4411140 4902675 5476848 6126368 6888715 7855064 9075246 10622513 12562663 14800051
8798 14800051 17117375 19503597 22245726 25965365 31479245 39901635 52953083 73637398
8790 73637398 107197259 160872633 236310014 305338172 314083351 262895234 195259777
8783 195259777 138758631 99556977 73841347 56796195 45228927 37273331 31740462
8776 31740462 27721033 24485087 21779496 19549518 17532417 15491689 13521528 11771392
8768 11771392 10295246 9083236 8095123 7283164 6614147 6056388 5581827 5164520 4786225
8759 4786225 4438607 4122960 3828259 3566445 3346766 3164343 2993333 2806681 2617537 2437348
8749 2437348 2273079 2112139 1973025 1843214 1715335 1598218 1500243 1421947 1359505 1300367
8739 1300367 1248475 1200025 1140191 1080060 1034539 995952 963605 938186 921123 900951 869505
8728 869505 837101 805465 779844 747826 717507 687614 663273 649339 638391 637994 639440 633285
8716 633285 619526 605810 589695 571102 549020 529878 518938 510107 494446 478441 464343 452449
8704 452449 438443 422997 407106 392348 384275 388914 401259 407353 408939 406699 401420 388073 375121
8691 375121 361389 354170 346213 338023 331419 328638 327763 324887 317782 314803 317791 314025 315274 319458
8677 319458 332402 362255 409680 452857 453160 419918 379349 338248 304597 283812 266930 247608
8665 247608 231383 209934 183349 161591 174060 235046 302469 348149 362959 351892 340371 329364
8653 329364 316139 309364 304740 306398 315250 320641 321131 319725 310142 300489 300789 309597 317223 336998
8639 336998 357208 369398 367663 366836 380796 402231 419086 435821 445279 447910 470685 533931 654710
8626 654710 875351 1263819 1947560 2983401 3764849 3448691 2596185 1855192 1362015 1049575
8616 1049575 833344 685197 584148 513777 468679 442974 429778 420030 404756 377154 347821
8605 347821 323344 303990 293168 282022 271425 260106 253601 249457 240120 228428 220188 215088 217656
8592 217656 221090 226207 235115 241317 245353 242706 238793 238433 231963 229852 226739 227715 230489 227398 220596
8577 220596 217594 212690 215427 223283 222876 228367 240046 250885 260293 264817 269342 270828 270776 266770 258380
8562 258380 244719 228743 217978 208087 201424 198023 192482 190855 192730 190613 184393 172220 165116
8549 165116 161143 159328 165155 170071 174707 179778 185548 205851 234629 271548 321570 382603 438924
8536 438924 465961 440816 383237 321505 265707 224300 195727 185589 176387 166933 153438 134484
8524 134484 123909 125845 124188 120186 114158 118143 120939 125081 123630 117150 108959 105443 97743 97680 105180
8509 105180 105626 102657 101630 103882 111568 111672 110461 118462 128122 135388 144610 157290 169330 193864
8495 193864 247582 331143 435849 555528 684486 779413 760417 634464 484512 356532
8485 356532 272167 214008 176489 149614 130987 122198 121041 124430 122271 115967 110462 98877 92210
8472 92210 87052 84339 85284 87687 83199 74101 67571 67227 66821 64322 68086 69203 68579 69165 71635 78834
8456 78834 82284 79542 79383 78407 82413 94873 108835 132033 164875 210578 264627 327447 379246
8443 379246 384637 346483 278926 212981 161499 132647 111208 94468 83292 78591 76444 75797 71458
8430 71458 69228 70427 70750 67159 67847 63136 55776 55207 53645 54881 58978 61334 60480 62423 63012 63169
8414 63169 64695 64402 69364 75474 77747 78687 80800 76720 78154 83796 84059 83354 83293 87452 96977 102134
8398 102134 112219 125516 137483 152918 173093 194806 237516 296420 371871 467400 577091
8387 577091 699263 833510 958315 1043411 1081233 1079345 1024868 917481 791182 667910 557472
8376 557472 453509 363837 293438 244975 210161 189896 174793 157841 142878 128156 117475
8365 117475 109005 101290 91083 81091 77119 75542 73665 69452 67119 65282 62390 60121 62554 61588
8351 61588 57007 55396 57248 58486 60376 56880 58494 57514 54793 52876 54577 55923 53624 49680 46561
8336 46561 43695 44298 41399 41066 43278 40179 36816 35500 37343 41432 49142 50698 48945 47440 50378
8321 50378 58305 61353 60126 53099 47927 48064 50535 43924 42574 43389 37828 41968 42889 40453 42533
8306 42533 43908 43728 40441 39468 43100 44293 41789 37067 35959 38408 39210 33232 34420 35573 39768
8291 39768 38187 35796 38091 37299 37769 42426 42713 37743 35879 32873 28503 28198 30548 28710 27803 25953
8275 25953 31779 36107 32437 31039 33664 36833 36347 36419 42476 45097 42943 39531 37514 33536 32799 37820
8259 37820 38872 37888 39335 48136 60684 68676 69503 64641 57992 51588 45582 40948 41516 45681 39248
8244 39248 35818 40924 41372 35220 34851 37995 34884 36776 38727 36929 32658 36144 38952 37791 36871
8229 36871 37846 37179 37403 35738 35350 32519 33372 35653 42722 46291 44140 45446 46239 45503 42294 47092
8213 47092 54562 56384 60577 63772 60829 54085 47138 39778 40957 41585 35508 33740 37946 37638 32552
8198 32552 37848 43118 44017 43304 39845 32428 24947 23856 27526 27573 31525 34512 31351 28306 32689 36755
8182 36755 32698 31196 33512 37584 38061 35459 37275 39208 34202 33586 38825 38857 37408 38463 39692 37381
8166 37381 38764 39540 39873 42406 38460 36267 31594 27766 30513 25459 25789 25037 25992 24386 27955 33120
8150 33120 38243 39293 42055 44802 47477 45443 45608 44966 43295 41644 41251 44387 49210 49882 46901 42592
8134 42592 40241 42053 44831 48071 47631 45735 44902 42551 38600 36861 40775 39526 41963 42829 43118 42853
8118 42853 40101 35869 33353 36347 33909 31258 29561 29016 27585 29560 33538 37624 39208 39988 38869
8103 38869 35779 32516 34411 45068 51343 46343 42454 45372 41983 41573 44654 45624 45405 43495 45716
8088 45716 43131 41830 45987 47780 47023 47747 42637 38919 36290 34540 34904 34761 27835 29720 27903 29164
8072 29164 25665 23498 26998 34204 39258 38302 32021 34461 36959 35339 34789 33111 29067 29815 34759
8057 34759 33211 37279 42414 40971 40716 37171 37816 39857 35290 29816 28397 27856 29534 26529 28712
8042 28712 32948 34255 36634 37590 30615 26371 28306 30440 27862 30185 33596 34769 34695 34590 40052 45748
8026 45748 38216 38598 36151 32436 31937 36342 40568 39656 41751 45731 43572 41025 41786 46027 46152 41960
8010 41960 36870 39591 43533 41712 38560 37818 35399 34768 35904 37197 34760 34803 36858 35193 33637 32950
7994 32950 33276 34214 33074 34177 41436 45073 44631 43552 41007 37571 38619 36082 33946 33329 30574 28408
7978 28408 29046 33158 37686 39982 37349 39335 37115 34492 36412 38223 40506 43362 42251 42911 40996
7963 40996 39655 37733 34666 34545 35183 33217 36104 32822 33480 31230 33144 30028 29250 32263 29774 28000
7947 28000 22449 22423 23073 26012 29332 31985 31383 27451 25214 27992 32209 28930 27802 27317 26364 26528
7931 26528 28217 29084 25019 25585 25281 26744 25934 28260 35504 40512 42836 40902 37406 34579 31060 33572
7915 33572 33770 32613 32377 28648 27498 28154 24474 27141 26859 25986 24347 23328 22589 26169 31786 34255
7899 34255 33308 35507 38214 35237 39909 39382 37440 34334 33140 32239 36866 36646 36719 38890 34664 31811
7883 31811 34106 33556 32759 33920 30164 28751 33199 26640 24363 23062 24667 22519 20163 19637 28345
7868 28345 28752 24394 23915 22116 22113 20686 22046 20027 19359 21214 20381 18207 16858 16659 15196 12442 13031
7851 13031 17185 19220 19920 18989 17168 17987 18878 17870 17886 12781 8336 6228 3887 5276 6257 4105
7835 4105 9101 11389 7436 7165 5633 7204 16397 20294 18369 10267 8251 10695 15450 22034 25308
7820 25308 20955 17435 16174 16579 14328 12471 14439 14365 15144 17322 19988 15072 13844 17148 13745 13769
7804 13769 13888 12730 17851 18831 16728 15327 10259 9794 11636 15038 17431 16563 15577 13998 11431 12370
7788 12370 15870 19942 19147 19423 20393 17377 9999 6785 10121 12558 12841 14777 12043 7238 11786 14714
7772 14714 9755 10231 12239 13938 13699 9144 8454 10898 11735 14424 9162 3571 6332 10938 8148 5227
7756 5227 5314 9394 9679 9405 14139 13391 8327 6029 8020 8015 9575 7850 9451 9332 6371 8635 9710
7739 9710 8335 6965 7647 5439 6028 8550 10184 12761 6268 4149 7967 7123 7178 8433 12807 12528
7723 12528 9031 11792 12687 12070 5764 1572 8472 11685 14595 9656 6581 7356 9149 12710 7660
7708 7660 4638 9740 9615 11570 11712 14765 12519 8528 6289 6106 6929 7726 9397 7831 6086 8869
7692 8869 11740 12286 11160 9267 10481 4498 1765 3491 2340 1257 2206 3680 6439 7614 4739
7677 4739 5155 5897 4917 7590 12198 14440 15501 11126 10677 11240 11835 16316 17966 13950 9664 13967
7661 13967 16786 14557 15052 14234 11679 9158 8667 12018 7894 6258 9993 10676 9075 13686 18863 17117
7645 17117 15047 13818 11719 8545 2890 2281 5885 7114 5330 7047 8860 9967 6400 5649 4371
7630 4371 3147 2438 1382 8349 9827 9799 6864 4905 4767 5556 9334 11019 10433 6372 6336 5655 8927
7613 8927 9846 4875 3853 4846 4705 2185 2666 2949 8239 7751 8774 7266 5838 2547 4381 7512
7597 7512 6034 1462 3020 4110 8475 13292 10782 8492 5667 4917 5533 4285 9333 8417 7657 11393
7581 11393 10520 12683 13032 6707 73 -154 3881 6037 5348 3379 6547 12249 9797 8781 9996 3106
7565 3106 -1357 1684 2498 6564 7930 3976 1492 2941 6958 5343 5764 4698 2378 -2864 -2226 3212
7549 3212 9440 8395 3043 4380 3016 3603 852 23 2627 3033 5073 6863 6062 5202 4739 809
7533 809 378 5305 9314 10058 4594 1366 -3238 -4895 -948 -1381 -4997 -1668 4786 8232 14253 14125
7517 14125 11705 8377 7698 6693 8104 8478 10655 9364 8724 8160 6996 7058 7095 8356 7679 10584 14025
7500 14025 12779 10869 9042 9206 6514 6286 12339 16554 20579 17235 10977 4813 8366 11107 11318
7485 11318 6714 4253 -275 -257 4015 4352 5971 4169 -998 -1864 1215 5777 10846 10815 11189 10895 5965
7468 5965 6570 4216 6416 4875 5290 2004 -1857 -3344 -487 6526 9151 4114 3997 7485 9058 9546
7452 9546 6819 7440 6083 9655 12874 8285 1718 -3480 -949 2924 5494 7432 8329 9903 9138 8191
7436 8191 8742 4807 1500 4660 6482 4039 1678 1625 3200 7404 4214 5720 9811 9408 10354 10189
7420 10189 8907 6487 5200 3120 3519 2552 2389 5293 3820 2756 2686 2093 2287 6868 9186 2251
7404 2251 126 7529 12308 14822 12358 10500 5597 5646 7927 2599 3483 3452 5926 8881 11363 10566
7388 10566 13437 14151 14461 11886 6792 8577 10009 9456 6227 8115 11168 10275 7044 6892 8141 9189
7372 9189 5703 2668 3514 7321 6250 6768 6361 7480 2356 -2076 -2913 351 4114 7406 7422 6449 7559
7355 7559 10600 9272 10560 12485 12291 8923 4550 5901 7229 8691 9524 5441 932 134 2183 3796
7339 3796 9115 13817 11204 6343 5010 3672 3900 7821 12209 10295 5762 5413 6348 5665 1551 -2608
7323 -2608 -304 6086 9186 11622 10121 4173 1290 -1185 -437 -1209 964 -246 -1455 -1157 -745 -2889
7307 -2889 -1780 4950 3652 3549 6580 11806 9286 -1607 -1714 157 3520 5656 7965 8870 5964
7292 5964 7240 5061 -1041 -1154 -1815 -2287 -846 7774 7658 2092 -737 -2670 2394 7620 10326 12453
7276 12453 15688 15315 13485 10353 9675 10322 5334 3265 3518 6051 6092 8187 9421 12182 11183 6046
7260 6046 8034 10237 6834 11245 10848 10697 5362 1239 752 3719 8500 5958 4728 7216 7742 3249
7244 3249 -4235 -3478 -4427 -6086 -3346 -445 -2814 -3853 -1311 -1630 -2108 -539 1267 -736 -1434 -1640
7228 -1640 -4148 -2793 -1483 763 -2555 -5419 -3383 4550 5699 5201 7439 7519 6211 3183 -765 680
7212 680 1273 -3039 3226 5477 2511 3833 4152 4449 6469 10216 7894 8486 10224 11759 9344 3769
7196 3769 2207 4336 4073 3742 3481 3361 9553 10483 11708 12162 8499 5425 6806 8225 5921 -734
7180 -734 312 8321 9530 5387 3272 4521 5970 2665 -2708 -2539 -1672 1514 5990 10530 5040 248
7164 248 -1682 -1503 622 2603 2745 7709 10742 7775 6429 9048 6619 5494 1345 -307 1082 -971
7148 -971 1222 7143 9145 6783 6320 7050 7331 2334 -1175 748 5874 5386 4364 4711 11605 8699
7132 8699 4975 2990 4389 7079 8441 7603 4944 1146 3984 2842 276 -3654 -4488 -3214 -1381
7117 -1381 297 859 -3553 -1540 1550 1615 6226 9187 8468 6605 2911 3632 7998 11758 5919 4121
7101 4121 3389 4460 2995 3966 7228 9234 7473 5791 8377 9438 12518 14687 9170 9299 10179 15564
7085 15564 12196 9729 1471 -3929 -4292 -5809 -3655 -2090 -548 -1663 -2298 2032 5394 11048 10375
7070 10375 2356 -600 -3647 -6805 -6709 -4581 1482 896 -2573 -3721 -4545 -2421 -622 2338 5121 1895
7054 1895 905 5940 9549 14083 12525 7244 3822 4411 7452 10830 13949 9785 9038 8584 10522 5023
7038 5023 2054 1164 6674 8454 7310 4129 2226 1831 3964 4437 2895 206 2926 3755 -254 426
7022 426 166 836 2070 3225 3342 4048 474 -1264 -4585 -8154 -3982 -3898 -2768 -144 -4257 -5142 -3954
7005 -3954 -7419 -6742 -3742 -3143 -2191 -51 -2366 -5364 -230 3426 1631 3081 2099 646 2688 4603
6989 4603 4550 2100 1810 1868 3427 2914 1319 319 3048 1885 285 -975 -2467 -206 4290 4087 1103
6972 1103 -2027 -2684 -987 5011 1366 -4465 -1991 -1951 -4003 -2199 2222 -989 -2091 -2388 3609 7138
6956 7138 10251 15322 12236 3395 739 3914 10161 13111 11319 4704 2572 4513 5366 2963 -3195
6941 -3195 -5508 -6825 -617 -1681 -6204 -8054 -8548 -8963 -5500 -4458 -4270 -5316 -5938 -5061 -1600 320
6925 320 2471 10207 10902 4845 4348 5572 5480 6634 1989 2234 4383 4090 5198 894 1585 2841 98
6908 98 -629 -3828 -4190 -2155 -1355 -1888 -1179 -1678 -971 -1969 1599 3508 6610 1578 -2242 -374 3562
6891 3562 6507 3055 1093 1699 1195 -1121 3405 3465 4588 1627 -2799 -4937 -3111 -2380 -1033 218
6875 218 5141 10738 7429 3205 607 2180 2159 -3117 -8697 -2726 2487 3566 3905 3571 6852 10643
6859 10643 9400 10002 6368 1318 -7077 -6153 1929 2758 343 -5793 -3521 -3619 262 -1959 -4555 -2839
6843 -2839 -1522 -137 613 5636 7178 2827 1214 -319 -2499 -6785 -11164 -8512 -8376 -4278 -3519 -4113
6827 -4113 -4031 -1773 1626 -560 847 5438 5458 3811 4171 3464 5346 4147 3282 3283 4176 4473 4400 3170
6809 3170 2713 -1872 -7488 -12115 -6678 -658 4748 10591 11564 4753 2098 547 2236 8416 8305 6814
6793 6814 3178 3552 10060 10678 4932 2709 343 -1094 -1266 -1809 -6409 -679 7947 10361 9123 9316
6777 9316 3205 2474 4567 4160 4193 3308 3833 2582 6664 12066 15637 17563 14557 3623 1650 3578
6761 3578 2438 3724 4200 2667 5975 7644 7528 3755 5412 8868 5831 5760 9988 8395 8236 5356
6745 5356 7540 10249 5684 8043 5357 4215 6862 9166 10395 14409 13224 11110 16485 12413 7018
6730 7018 4884 3116 6171 6941 2061 4125 9809 12322 13887 14218 14921 8034 3338 5651 8747 7032
6714 7032 1719 875 4073 1434 1583 2764 6171 8861 10121 6660 2483 -765 -2561 1607 3278
6699 3278 4383 1769 3019 4723 5758 2416 1778 2119 3233 5607 4604 4160 3473 19 20 -173 -2271
6682 -2271 -2454 -1466 2543 4786 4033 7393 5495 2864 3751 5737 5766 2634 1422 -740 -6250 -1667
6666 -1667 1489 5495 6675 9133 7731 5424 8625 15335 15677 12432 1981 -4000 -7586 -10254 -7517
6651 -7517 -1861 489 680 -1898 -4420 -2795 -3376 -5540 -3195 -1572 -2505 -1802 1537 6024 8861 7837
6635 7837 8512 4455 2769 2991 5068 5915 5069 3197 5358 8472 6076 848 883 3269 4574 5504 4892
6618 4892 3646 -594 192 -854 -3472 -3799 -1232 6743 7256 5224 2272 -1589 -363 799 920 -1973
6602 -1973 1976 5761 3944 1312 3888 1997 2504 5963 10638 10879 8911 4399 4410 4980 -2157 -1607
6586 -1607 3225 1514 -2629 215 1830 2031 4106 2994 5775 5338 1548 -907 -6824 -7120 -1964 -4136
6570 -4136 -969 6874 7698 13121 11135 6033 5326 6204 7386 6576 1527 -1858 -1188 2193 2386 2932 4317
6553 4317 5935 -898 -8520 -5449 -4837 -3986 -3741 -380 4478 6979 5660 4629 391 -442 -2830 -6411
6537 -6411 -3156 3975 5144 5792 1418 -1039 -2222 -2328 -4821 -3162 -1268 2759 6049 7558 5754
6522 5754 221 -1144 -2929 -3291 -137 7780 8402 4702 2872 8018 5822 1919 18 1152 1490 6722
6506 6722 8944 5448 1589 192 -3675 312 6239 10848 10181 8735 4293 1187 1016 4265 3736 3035
6490 3035 3655 3941 738 162 -140 3728 6392 6011 8401 10269 6202 951 5924 9467 8208 5040
6474 5040 4759 10296 11761 10329 5456 3506 5027 8212 5060 5918 3376 1945 3590 4108 4224 5843
6458 5843 4887 1188 657 1279 621 408 -829 -1846 -736 5863 7693 3658 2960 3239 -138 -9392 -9259
6441 -9259 -6241 -2772 -2430 -3972 702 -977 -2767 1621 615 4750 6222 6338 6397 -516 -3686 -4970
6425 -4970 -5847 -842 1860 387 1968 836 4418 6649 8639 3137 -302 112 3596 4376 137 -716
6409 -716 1050 2374 6623 7663 7873 9155 9068 2161 -2830 -5746 -3416 -2207 -2856 -5474 -7166 -2383
6393 -2383 -2702 -1865 3645 6036 3879 1345 -2584 -2916 313 2245 1967 -257 -2870 -3524 -5979 -3965
6377 -3965 -3233 900 3387 10579 6765 8521 6104 3727 2891 4339 1491 1195 2060 -708 4206 12988
6361 12988 11475 6394 441 -383 915 4080 5235 10767 10502 7518 8023 5396 -115 -2987 1613
6346 1613 997 -2786 308 3133 8968 3647 -2499 -7137 -3374 -1716 3676 2939 2597 4104 4180 6167
6330 6167 5907 -1461 -2777 -2449 -542 -948 -3484 -5073 -4595 -8213 -4774 -1192 654 -3990 -5384 -741
6314 -741 2891 3283 5583 6968 9066 7338 3588 1716 -701 -4276 -3533 -3321 -4587 -3222 -2551 -6464
6298 -6464 -5414 2932 5755 5688 10255 11353 4868 484 -176 -1776 -8646 -9568 -2451 796 2181 -1195
6282 -1195 -2400 -5888 -2335 -872 -1157 1667 5282 5628 -632 -619 -129 2210 7246 7552 5272 5359 7305
6265 7305 6006 3912 2535 7954 4633 1304 -427 77 -644 -2178 -5339 -7310 -2033 6333 4231
6250 4231 3898 5233 2890 3115 7291 5727 2784 2234 2681 62 -2876 -226 2029 -926 -3097 -291
6234 -291 1797 2023 2150 3323 4507 2911 5661 7592 4024 -4567 -6361 -5003 -4115 -3123 -6244 -9846
6218 -9846 -2626 2233 -1705 -4939 -9811 -9319 -4847 -4585 -4884 -4342 -2317 -2663 -364 -270 -224 -2527 -2624 -338
6200 -338 -106 82 -114 517 -347 -1642 -6375 -6703 -5619 -2583 314 3428 4967 1809 3030 3758 1562
6183 1562 3247 2288 4562 -1191 -5273 279 5620 4661 287 2452 4648 4834 8523 7643 173 -376
6167 -376 -534 -558 -1074 -4035 -6307 -3901 -197 382 935 -1152 2472 7620 4108 1571 2236 -1694 -1515
6150 -1515 -1815 -1765 599 582 -2282 -4612 -4156 -1077 825 -1627 -953 3513 2798 2700 2878 1399 2426 -312
6132 -312 -758 831 1433 -3283 -1868 3685 5336 2398 4269 4394 3402 -2431 -5204 -7897 -8299 -7666 -5211
6115 -5211 -5410 -1711 6489 9290 11633 9096 7405 2488 86 4558 8797 7559 2446 1500 -4075
6100 -4075 -4881 -3625 -1849 -3347 -3724 -819 4502 8058 10198 7317 2580 604 283 589 3844 7131
6084 7131 6702 2189 -356 2457 2287 988 -3406 -1827 74 -23 3479 9636 8732 4641 3128 3529
6068 3529 699 -2828 88 5340 7931 10209 10829 11767 11868 6667 1952 4488 5005 257 -4045 105
6052 105 5102 4953 -490 -854 -899 -2753 -141 -197 -1469 -1830 648 1993 2153 114 971 285 642 -1757
6034 -1757 -3484 1515 4131 -837 -2559 -5659 -5855 -2006 300 -3702 -6901 940 10425 11986 4599
6019 4599 -3711 -3295 -836 3648 2989 191 1229 -397 -3031 -638 -2339 -31 -410 2411 3676 2978
6003 2978 1475 3689 6054 5869 7627 7597 3170 3220 -533 949 -824 -5197 -3525 -2285 -1711 -2781
5987 -2781 -3161 -972 -664 1489 708 2435 1630 759 1352 3555 3019 105 -252 -1273 2079 2256 2775
5970 2775 3046 2366 1964 561 -1224 -298 -1633 -1688 730 219 1626 5625 6588 3095 2948 -946 -3253
5953 -3253 -2993 -1085 -1702 -387 593 -2700 -3062 -1422 -4564 -7419 -9071 -9060 -5533 -6508 -1774 598 2410
5936 2410 4402 4935 -306 -2758 -1542 1163 2656 -148 -2361 -1892 -4392 -5677 -5886 -7162 -6791 -3822
5920 -3822 -5191 -4225 -5551 -5935 -4037 -2263 274 -1444 -3369 -4782 -7622 -2876 -3498 -1664 -293 -3753
5904 -3753 -5308 -4923 -2511 -2555 -2639 -633 -783 622 2888 4948 5858 10591 12050 6036 5936 -51 354
5887 354 3657 4973 9804 13517 16080 10422 9670 8491 3645 311 -107 -2167 -11863 -10460 -7404 -1748
5871 -1748 3319 3218 -1407 -5200 -1676 878 -1348 1108 3355 4087 6313 4134 3367 2623 3341 8770
5855 8770 10578 9008 5665 570 -2689 -3708 -4728 -7220 -10184 -8976 -10926 -4025 -2113 -1446 -274
5840 -274 316 -1832 -5693 -3049 1408 1564 3250 -1222 1505 2763 -2610 -7216 -5889 -8825 -9035 -1060
5824 -1060 1790 -2340 -5244 -3531 817 850 -2267 -5120 -9150 -8863 -3923 -2979 5 3331 31 -262
5808 -262 -2725 -3206 -437 -2700 -886 1843 3492 -2599 -1101 888 5060 47 -5534 -5337 -2404 -683
5792 -683 209 -1074 2073 6567 2331 1135 1999 2205 1406 508 -20 3435 4463 2715 -6987 -12364 -9923
5775 -9923 -5152 -6723 -8321 -8213 -8392 -7616 -8076 -4944 -2412 -5676 -4295 -3713 45 1318 6016 7546
5759 7546 6924 3454 -2783 -2064 -621 -577 154 63 -4761 -10714 -11766 -6085 4002 8904 7823 3403
5743 3403 4059 3282 4677 3429 7527 4455 1943 4183 1207 -1760 -4477 -8923 -4692 -2380 -207
5728 -207 3030 3628 5624 2567 -95 -3083 -10215 -7736 428 -1399 -4667 -1809 2848 357 4009
5713 4009 8996 6042 1471 74 251 2439 3806 5418 -545 -3665 -3661 -610 2165 4844 276 957
5697 957 2279 3777 6838 4630 263 -4181 619 1324 -4527 -3802 -1055 7879 10096 10493 10161 8230
5681 8230 6215 3742 3794 460 1273 1029 4752 5683 894 -1134 3694 2279 6256 5195 5037 2616
5665 2616 2079 1415 -599 -2233 -1203 -499 7192 6923 4582 218 2116 6211 4038 1405 7462 6076
5649 6076 739 -3815 -2430 3022 1968 638 2528 2275 -650 832 2867 793 5413 6983 3707
5634 3707 5827 5224 1266 1861 4957 4083 1195 -514 -1700 13 3285 3564 3395 4538 4469 -1808 1451
5617 1451 -295 -1233 -827 4452 4088 507 677 -1002 1712 4455 3737 883 -4841 -9458 -8377 1793
5601 1793 4704 1816 -2621 -3288 -7890 -6347 -7021 -7797 -4727 -4286 -6999 -4508 -1492 -1181 196 -543
5585 -543 -288 -1706 -1004 -1254 -4749 -4539 1040 2522 -1940 -641 3486 6681 7875 5819 3182 -2094
5569 -2094 -5961 -4888 -9530 -3367 820 1107 758 1969 566 -3381 -5521 463 1651 -4145 -6459
5554 -6459 -4936 3166 7574 5689 -1641 -2411 -2032 -2526 471 3972 2836 3513 4002 2955 2856 2089 -1320
5537 -1320 -1077 1804 3850 6594 7226 4490 5131 4912 7603 4177 94 1261 2952 1302 -686 -5455
5521 -5455 -1765 -398 -4582 -7815 -7212 -8321 -7737 -3487 2871 -2804 -4363 -3064 -457 924 3858
5506 3858 8487 7932 9811 5785 1219 4410 7577 8843 3112 1104 2416 -1863 -4762 -3177 -1951
5491 -1951 2901 1298 50 -1684 -3819 -3025 -781 5126 8496 6764 -181 -1090 -1760 -182 -1217 -3266
5475 -3266 -2153 -387 952 -7494 -7222 -7753 -7869 -4259 2181 3815 2433 4401 8977 10890 8097 1045
5459 1045 -1124 -166 1601 4283 2223 -5602 -4454 -1359 714 -913 606 842 482 -5065 -6244 -2480
5443 -2480 -3891 -5016 -7551 -2508 1627 -1378 -327 918 -2371 -725 3562 10480 14241 9162 1914
5428 1914 4014 -2130 -6192 -1384 -776 -890 -2446 -1253 -1602 24 2681 1064 658 1076 3436 1719
5412 1719 -2155 -6790 -9408 -4372 -2393 -3879 1171 1986 -1038 -2780 252 2886 7419 5105 3941
5397 3941 -2213 -4346 -1504 2489 4596 3522 2437 2151 601 -1377 -2361 -3791 -1872 -574 4699
5382 4699 6001 449 -1536 1900 3360 -1423 -921 2613 4718 -1537 -2453 -2122 2410 2159 -1471 -3324
5366 -3324 -2240 1604 5044 4297 2653 2180 -693 -3307 1297 -35 -2415 -415 6951 10494 6649
5351 6649 -547 -5300 -5257 -2309 -4860 -2290 -1914 -4580 -4132 744 4423 2609 2628 5533 1947 -2509
5335 -2509 -3732 -1107 -1799 -2649 -3827 -5516 -2196 2325 2626 6570 6293 2377 1935 20 2857 7624
5319 7624 4946 -1229 200 1841 1025 -1608 -4692 -3004 -5573 -8281 -6630 -8700 -5417 -4695 -1295
5304 -1295 2115 -2590 -6105 -4257 -1877 -2575 -694 262 -1816 2482 3596 -97 -6257 -6245 -6496 -5283
5288 -5283 -4587 -1160 -2130 -1349 1187 1556 -3977 -9939 -9777 -9156 -9336 -4822 969 6742 4624 -2937 -5597
5271 -5597 -9607 -9920 -9283 -8918 -6478 -3550 -3360 -3030 -2484 -4085 -8347 -10080 -12168 -9578 -5913 -7304
5255 -7304 -4722 -3162 -6611 -10934 -9093 -6825 -4435 -2408 152 5375 4573 -4098 -7861 -8717 -6672
5240 -6672 -3887 261 179 -6854 -3901 -3206 -2964 1425 -1674 1803 4521 674 1314 -916 -2292 -1246
5224 -1246 1382 -2147 -3759 -3565 3562 6768 5669 4250 4226 5005 1127 1798 -776 -577 -123 4200 6216
5207 6216 5003 1093 743 194 -238 4176 9587 8143 1793 -1284 -622 1871 3492 2054 -764 -4969
5191 -4969 -2512 -1524 -3848 132 -2780 -5175 -3695 -1823 -2161 -2142 395 -950 -2272 -2319 -2589 -7333 -9505
5174 -9505 -4338 -4311 -5146 -1153 -1332 -548 635 -1210 -1935 825 89 3283 5183 3884 8326 8695 5087
5157 5087 8366 5201 -474 -3210 1003 3953 1069 4688 10126 7081 10239 10428 10113 7940 2428
5142 2428 -2784 -1363 116 -262 3215 4818 934 1937 648 458 676 -2843 -7521 -7928 -2254 3280
5126 3280 3284 2998 10 -2938 -5868 -4637 -2987 -3918 -2982 -1086 -3497 -3722 1012 4585 2342 1771 3404
5109 3404 -3539 -10696 -9429 -5480 -6338 -1309 1651 -1045 -2204 401 1312 679 154 -2538 -7740 -9773
5093 -9773 -7579 -3123 -582 5 -596 1474 3932 998 -4112 -5132 -4204 -4377 -4693 -5983 -3431 2125
5077 2125 -146 -6556 -5250 324 1963 3242 3648 1971 1187 -4502 -9977 -12512 -12145 -10142 -7428 -8730
5061 -8730 -3349 602 2459 1072 3140 4150 5248 3216 -3786 -6267 -2039 1734 2144 -1321 -9910
5046 -9910 -10957 -7069 -2557 -1564 -1 724 -687 672 -5004 -9830 -7430 -5530 -7028 -4350 -4105 -2870
5030 -2870 923 -2932 -3913 -7000 -13619 -12783 -9092 -6866 -5329 -4638 -3461 -2942 -8565 -11969 -9026 -7374
5014 -7374 -5920 -5430 -2076 -1382 -1512 -1215 -4557 -7183 -4623 -624 3466 1300 -844 -1210 1040 3960
4998 3960 1344 1411 2177 -95 4268 4411 885 -634 -2059 3871 388 -3912 -3345 5406 8454 6453
4982 6453 2860 2908 4472 740 -1383 -2393 -2791 -127 -2071 -3015 -4244 -4645 -1526 1847 -2815 -8051
4966 -8051 -7238 -5660 -9844 -5486 1363 4265 5 -1596 -784 -1896 -5139 -2607 669 -1075 -805 -100
4950 -100 965 450 1065 1516 1733 515 1447 2159 1506 6199 8320 6753 1130 -3442 1174 4129 3193
4933 3193 -327 -4993 -10148 -11707 -7504 -2881 360 -3230 -3935 418 112 -524 -2389 -5286 -8135 -6284
4917 -6284 1321 7053 6071 6978 6428 4431 1373 -138 190 -2967 -3345 -1887 -242 3371 2887 -2364
4901 -2364 -5216 -225 3268 1629 417 73 5222 5189 1686 685 3244 6515 5675 1981 424 -169
4885 -169 2242 -43 1942 2567 -5478 -6659 -5090 -4002 -3780 -6051 -2616 -1562 5357 3914 3034 1016
4869 1016 2333 4301 2669 329 -5830 -6259 -637 4322 5175 1478 -567 -2654 -3387 -5890 -6981 -4121
4853 -4121 3818 3045 713 -3585 -6387 -6270 -7205 -4549 -4504 -6421 -3304 -3486 -3332 518 2116 -1723 -2854
4836 -2854 -1612 543 7921 9640 6993 2102 2303 4574 6672 5831 788 -511 -2383 -585 -324 817
4820 817 2928 -1519 -2466 -5118 -4897 -5964 -4510 664 -233 -5983 -7706 -1419 306 2632 5616 1816
4804 1816 5226 3359 2509 927 168 -2907 -1910 -4337 -3163 -3728 -4392 -1723 1682 5289 3012 1397
4788 1397 104 -3457 -6348 -3688 -972 4201 2368 3264 1745 -5487 -7222 -8657 -10821 -10080 -9044
4773 -9044 -9583 -7953 -6152 -5197 -889 2283 3150 3288 -2819 -10091 -15678 -13183 -5567 -1693 3991 1754
4757 1754 -1116 -3224 -4144 -3666 -815 -1581 -5820 -8727 -4077 -3631 -4842 -1828 -939 -843 1958 1416 2503
4740 2503 2543 -187 471 -1716 -1055 175 356 -1849 -6266 -6499 -3077 -1410 -3903 -3728 -6835 -2511 2439
4723 2439 5064 7512 12344 11979 7907 7130 3116 -150 -1058 1444 -2030 -3314 -463 912 2084 -3011
4707 -3011 -3574 -8170 -15727 -14816 -14140 -11111 -5429 -5882 -6897 -8915 -5975 -4921 -5424 -7769 -10594 -9672
4691 -9672 -5705 -2395 -1090 -2220 -1268 857 -510 -1264 -3721 -6960 -7502 -6393 -3995 -7720 -8357 -8273
4675 -8273 -5506 -1864 -4352 -5672 -5848 -897 1676 -837 -966 1177 -830 -1038 -1281 1258 1189 114
4659 114 -6113 -6173 -2625 2440 872 1643 2172 3900 3157 2701 1567 -328 -3477 -1525 -868 -4520 -3216
4642 -3216 1443 4506 1809 -4208 -1714 -3525 -4367 -547 1109 -3646 -2273 229 -1508 2669 4688
4627 4688 3247 5164 1399 1525 3903 3857 4624 1965 838 -1023 -2952 -6924 -10567 -12763 -12838 -10764
4611 -10764 -6428 -5204 -1296 1193 -3181 -3331 467 -1644 -4086 -4716 -4285 -1459 438 1743 1737 1964
4595 1964 3127 4232 2955 1609 -1191 -3465 -2905 -3438 -40 -225 -1358 4395 1512 -998 1799 2602
4579 2602 -2261 -1873 -3967 -9005 -5282 -7681 -10333 -8234 -6941 -3739 -1523 -3405 -4288 -4420 -3366 -9568
4563 -9568 -9194 -8495 -7385 -6763 -1948 3405 4570 4208 4647 4636 -1190 2 -3448 -131 1828 -3621 -3015
4546 -3015 -2224 -4267 -4475 -7424 -8712 -3270 2106 1572 1222 -1295 941 306 972 1114 -310 4705 6113
4529 6113 111 -3645 -7098 -4480 -5880 -2358 -1889 -1788 1592 2219 4510 13038 13589 5119 -265 -444
4513 -444 2679 6159 4763 2855 -2018 -5942 -7395 -6655 -3820 -2651 -54 1048 1150 -4293 -6246 -5328
4497 -5328 -10783 -4389 2688 1993 510 659 -2085 -3394 876 -634 -3007 -1997 -3793 -2882 -93 3930
4481 3930 6437 8064 2768 2733 2352 -4050 -7755 -11466 -10827 -6126 -4131 -4220 -4857 -3382 -3312 68 6091
4464 6091 4443 1830 1431 2359 4115 4696 4876 2617 -299 629 1133 -1535 -5641 -178 3040 752
4448 752 7065 9105 3176 697 4117 2470 -3105 -4177 -6150 -5719 -2899 -4696 -4993 2006 4616 2425
4432 2425 -1019 -329 1697 3325 51 -2180 -2309 -1044 -3630 -3783 -5375 -5844 -1685 -4178 -4871 -1588
4416 -1588 5103 6161 5719 1901 -3275 -3705 -8143 -4684 -4322 -2946 1956 -665 404 5015 4367 4383
4400 4383 6364 3873 2036 813 2625 2762 505 1514 3840 3706 8683 11222 5491 3308 1581
4385 1581 2014 1797 -741 -2225 3899 5150 2802 2936 697 -4028 -3765 -451 -2255 -6915 -8101 -2830
4369 -2830 41 -855 -3442 -1171 857 1256 2515 3278 3552 7051 7189 3808 4676 7334 5838 1041
4353 1041 -4215 -7439 -8950 -8033 -3816 -5111 -6222 -1042 -1244 -1891 -3188 -4850 -4297 -3370 -26 1387
4337 1387 2540 2721 -757 -2619 -1776 -3141 -4567 -2211 -2544 -2889 -5196 -1424 2452 1877 -2174 -6937
4321 -6937 -4889 1237 2961 -681 -6218 -6508 -5095 -5827 -7722 -1729 1407 -1201 -4355 -3573 -2759 -3661
4305 -3661 764 1184 2873 3186 -646 -2212 -2768 -6336 -5170 2781 6964 7887 4394 2826 1842 1606
4289 1606 4316 1738 -1317 -4632 -9376 -6493 -1927 -3920 -6934 -8176 -6341 -2586 -1290 -843 -2080
4274 -2080 -5728 -3970 -3087 -4588 -3592 -2761 -4402 -4581 -633 -1666 -3350 -807 -4400 -1947 3468 2779
4258 2779 1556 1053 -186 -6800 -9189 -5371 -1324 257 2674 6694 9983 10179 9153 5951 -711
4243 -711 -199 -738 -3769 -14061 -14006 -7858 -2922 -6889 -10244 -12244 -7237 -10373 -10830 -10248 -8365 -8301 -8615
4226 -8615 -6185 -2554 4656 4741 2166 -19 -2363 -2070 -3223 -2259 3074 3315 2693 861 -4450 377
4210 377 6118 4049 5425 5234 7452 7514 5744 5090 3552 2022 2392 -406 -3922 -6963 -9233 -8618 -6254
4193 -6254 202 2128 -1571 160 -4145 -7008 -1775 -485 -1460 3057 4759 5195 5573 3477 573 -859
4177 -859 -5839 -4724 -2011 2319 4013 2188 2791 3422 5315 6637 6844 7344 5528 3635 7358 6441
4161 6441 662 -201 -1066 -2627 -4008 -3664 -3019 -4877 -3157 1345 2005 5807 7279 7252 9248 9798 7957
4144 7957 6691 7717 10905 7794 -4406 -12308 -11540 -9040 -4161 -2971 -945 -875 -484 -2646 -714 -1070
4128 -1070 -692 -930 -2916 -4864 -4941 -675 3453 851 -722 506 -2387 -1771 3564 4496 1281 259
4112 259 -2783 -3248 2547 631 -413 408 747 759 -467 -3587 146 1640 1929 -2312 -3789 -2223 3223
4095 3223 8705 5724 6847 6256 5353 2005 1067 521 -1235 -1274 -1960 -5557 -10583 -12860 -13960 -10175 -6433
4078 -6433 -2264 3163 780 -2782 -2441 -5154 -4037 387 1770 -1317 -2286 394 1629 1935 2483 -1265
4062 -1265 145 767 3057 3364 -293 -1565 -4316 -7318 -3947 -2464 -1396 -760 -2886 -196 -94 -1075
4046 -1075 -3362 -2196 -4890 -8046 -6984 -5349 -1055 -603 981 -186 -2444 -2253 -3021 -4927 -2485 147
4030 147 -1270 -1218 222 3483 2725 2647 1831 6080 4120 2581 4845 7424 7864 5213 -1557 -1495 1796
4013 1796 -568 3443 8329 5501 1887 -975 137 -4020 -6420 -7376 -11550 -14041 -11800 -10224 -10138 -3792
3997 -3792 -455 490 -449 -970 13 -2236 -201 3016 6705 5809 3951 -1346 -6809 -7882 -2567 -1951
3981 -1951 -5168 -2088 274 -2287 -3673 -1372 6404 5492 5941 6097 6591 4045 7935 6439 4675 5480
3965 5480 10938 7527 8027 12988 8595 4858 -1742 2798 3196 1624 -2333 426 1030 -5036 -6331 -2227
3949 -2227 -2160 1028 6953 6575 4326 -111 -3288 -4508 -10542 -7538 -2136 -1104 -80 -938 -3576 -5379
3933 -5379 -3195 -3250 -3327 -3685 -2940 -1425 1349 -172 -1194 1254 5580 5057 1305 -554 3251 -359 -991
3916 -991 -3714 -2165 3033 -693 -2575 -1469 -646 3018 2233 5056 2267 3784 6377 4685 3464 1291
3900 1291 -4526 -1498 381 -810 -277 -818 107 -904 614 421 -1517 1296 4864 5849 3719 -1983
3884 -1983 -1209 -3407 -5892 -2443 -1741 -1594 893 -1157 -1461 -110 4430 134 -1493 415 4106 888
3868 888 403 -176 -889 -2505 -1094 1209 844 -279 -5880 -7721 -6585 -4133 -3693 -4378 -2873 -7172 -8738
3851 -8738 -5151 -1979 -4277 -3739 -5051 -9954 -7152 -43 -1362 -3204 1503 95 5065 8753 8060
3836 8060 -333 923 -401 550 1988 -93 -1733 -1619 -259 -2133 -2124 -4706 -2738 -1676 -3784 -614
3820 -614 2477 2411 6584 6665 4442 -1775 -5066 -3488 -1689 -2146 -4267 13 2475 1605 1022 3511 1667
3803 1667 3137 4010 -582 -2050 565 -154 -5412 -7567 -6957 -4671 -2270 -35 773 192 -2548 -2829
3787 -2829 -1653 -71 184 -6168 -4864 -6647 -10072 -11030 -2086 1145 3200 -1695 -7966 -9930 -7093
3772 -7093 2066 3479 2114 812 1714 -875 -2362 -828 -3066 -6055 -6278 -4488 -732 2648 3281 3286
3756 3286 -448 -3538 4091 10221 9882 12402 11068 5934 2763 545 1559 401 -525 78 1119 6699
3740 6699 8265 7677 4722 3267 2427 6099 2671 630 692 -5861 -10194 -5982 -2831 1917 3416 3181
3724 3181 5434 8658 6772 4673 3243 1061 -5226 -2676 906 4229 678 2006 3490 712 4532
3709 4532 7722 3505 2152 -3034 -6683 -4975 -5678 -4173 -2137 -5567 -7466 -5819 -1357 5007 4058
3694 4058 1707 286 -2949 -1989 3129 5831 4171 4645 5883 6938 2819 -1492 -432 768 -3186
3679 -3186 -2746 883 1680 768 -3869 -2671 -5146 -5676 -4054 -4139 -1260 3972 7307 5066 -1131 -5872
3663 -5872 -5840 -1209 -10 -313 679 853 -364 -1901 -8089 -6831 -2436 -4609 -4020 -557 -2238 -2596 -1139
3646 -1139 2039 5599 3464 5154 6964 3977 2502 -1723 -2244 -3494 -6876 -2092 1442 3674 5203
3631 5203 5275 2763 848 2266 3109 -798 -798 5935 5648 6304 5688 3654 478 3890 4083 328 -1573
3614 -1573 2231 3470 1956 476 3295 4032 917 6 -2519 -1450 2765 4155 -907 -520 -1849 -1976
3598 -1976 -2183 -7783 -7380 -2654 -2048 1117 726 3862 6257 5242 6971 9022 2853 -1295 -3286 -2767
3582 -2767 -3237 -1913 1449 2446 3472 6374 6716 2469 3922 -52 -5709 -4753 -3451 -4000 -1986 3684
3566 3684 3549 1979 -2319 -5088 -3557 1557 8235 3696 3007 2607 4063 69 -3719 -1102 2072 -3387
3550 -3387 -4443 -5985 -3212 -1695 -2032 -4400 -8297 -6597 -5099 -2364 -4898 -7558 -7760 -8018 -3666 -2790
3534 -2790 -890 1207 552 -4596 -5535 -1764 -4739 -7585 -3647 -2926 -2972 -3905 -3514 -2729 -3332 -3658 4822
3517 4822 8718 7753 6184 2366 1944 2772 970 -3437 -6808 -7732 -7037 -5453 -8223 -3206 -1478 1023
3501 1023 1741 -1453 -4460 -5000 -1889 2899 3641 2186 981 -2092 -1445 312 1051 3119 3273 -4153
3485 -4153 -4119 1011 -306 725 3206 423 -4108 -5657 -167 2550 825 -1696 -5901 -4402 -2305
3470 -2305 -4503 -3542 -930 1052 5923 3556 676 357 330 -230 -2157 -338 5482 5876 6778 9390 6657
3453 6657 8018 4990 -3425 -4500 -2775 -2839 641 327 -2133 -706 31 23 -5357 -7290 -5439 -3641 -3967
3436 -3967 -2426 -1737 -279 4342 3633 30 -5674 -4368 -3018 -1823 -4932 -2883 1662 5935 4936 339
3420 339 -357 -2527 -5702 -4301 -2700 -5072 -5635 -9258 -5635 -1022 1464 -1077 -4884 -6721 -6572 -5958
3404 -5958 -4782 -5537 -4874 -9549 -10134 -6817 -6583 -7431 -6465 -4005 -4372 665 1337 -6288 -8990 -7730 -4520
3387 -4520 481 3578 19 -2812 597 -2716 -6817 -5763 -3492 3310 2454 -4204 -3207 -3083 -5610 -6309
3371 -6309 -8371 -5696 -6307 -7533 -8519 -6301 -3918 773 -1254 -2696 -3788 -3714 -4067 -9607 -9957 -9425 -9804
3354 -9804 -8506 -3570 -4606 -5960 -477 3150 4690 1045 -1165 1791 -1153 -1393 -4234 -8084 -4425
3339 -4425 -3581 -8183 -9776 -9176 -7560 -8469 -9121 -10473 -7080 -4917 -1431 -3086 -2772 -4965 -2969 190
3323 190 2137 5589 3437 2534 1971 7197 7278 3411 2438 4647 9220 4324 2284 1025 454 -284 -892
3306 -892 -5001 -4888 -4387 -4951 922 2904 5192 1946 -2909 -2175 -1286 663 3294 2689 3860 5070 7315
3289 7315 7549 9595 9181 7747 4981 3355 2472 371 1501 3136 2050 1812 3013 1145 -1991 -2507
3273 -2507 -5551 -3386 -206 -427 -1402 2601 -269 1027 -66 -5591 -4068 -2673 1041 1368 2612 2218
3257 2218 5350 4331 -2669 -6560 -6892 -6290 -9566 -12855 -11736 -9289 -398 1833 434 -3693 -7141
3242 -7141 -7006 -6340 -4067 -3695 -760 -3166 -2016 -1765 1397 4498 1011 -4155 -4561 -3438 -146 -874
3226 -874 761 4854 8821 7277 -1508 -5728 -9508 -4196 -1764 2411 5842 10145 8970 6981 4842
3211 4842 -422 559 2841 153 2898 8180 2598 -4545 -6307 -1126 2270 3743 2927 2487 -1613 -3704
3195 -3704 -843 -2258 -3453 -1997 -1684 1787 -947 512 5195 4754 -1594 -5838 -8879 -8623 -6505 -5980
3179 -5980 -11431 -10328 -12626 -8152 -77 5298 1936 1178 -1886 -4554 -1596 3242 3414 996 -2476
3164 -2476 -2633 -4310 -896 3207 2278 -360 339 1161 -1056 3216 4998 930 837 -1660 -1902 -907 -3736
3147 -3736 -4181 -4627 -7327 -6093 -4193 -2037 -2441 -742 2417 -710 -2840 236 5185 6386 3990 3317
3131 3317 4097 6119 2195 6708 6062 3445 4371 8909 6434 3739 4302 2075 2275 5252 2567 6319
3115 6319 11162 10664 6696 -153 -738 -1831 -4221 -4842 3279 11605 9534 7939 8541 8593 7912 4212 4257
3098 4257 -954 2846 4412 9003 10509 8524 4191 -3563 -4058 -1048 -2360 -4846 -4973 2838 3161 2102
3082 2102 626 381 -3864 -2191 1687 6900 5001 441 1370 3362 1504 1560 -451 2958 3317 -290
3066 -290 -3921 757 3285 -218 -2573 -2427 -946 2952 3236 -2043 -6138 -7674 -5641 -8006 -7348 -8858
3050 -8858 -3726 -4166 -4900 2648 7183 7883 5147 5082 1982 488 1675 2105 -891 -12 2319 4314 3591
3033 3591 -225 -2804 -1733 356 -2726 -3583 130 0 -1840 -3917 -4621 997 5883 5952 4032 2227
3017 2227 21 -3274 -3181 -6765 -6760 -5612 -3586 -7352 -7266 -5731 -6068 -6764 -8163 -9872 -9568 -9155 -5862 -3788
2999 -3788 -2283 -751 -1848 1288 3740 469 -2364 -1269 5245 5841 7131 5723 179 2030 3292
2984 3292 291 962 2121 2663 4062 2060 1364 2212 2945 1744 -2578 -1699 5081 2554 -1373 -3167
2968 -3167 -4 -1266 -3257 -2630 -1787 85 334 -1689 -776 1476 731 2160 6512 3209 4426 854
2952 854 -3715 -4200 -6217 -5649 775 2219 4005 6212 7679 7323 5882 5484 8190 7454 5015 6333
2936 6333 8042 7703 6719 6537 4162 2707 2051 -425 -3348 -413 -3726 -2366 3684 4096 7559 9374
2920 9374 2847 -1149 -293 1675 935 -311 -398 95 -421 2423 2529 -138 1518 1665 651 -4188 -6662
2903 -6662 -6497 -3662 -1656 1120 -2770 -3189 -5401 -5225 -4879 -6246 -1545 734 168 1026 -4005 -4378 -3982
2886 -3982 -6074 -6888 -4524 2090 5166 4651 5324 4423 3671 5575 9045 14463 12294 10171 6866 8909
2870 8909 8681 4754 -560 -3701 -1685 881 -1407 -8211 -5510 -1443 -3335 -2727 -1345 -2136 126 5553
2854 5553 6782 2430 -763 -2080 -3402 -2098 888 3771 1541 -1710 -5429 -6939 -3833 -275 -3121
2839 -3121 -5946 -6573 -4394 -3843 651 1998 506 -580 4093 7755 8575 3411 885 -1763 1252 3891
2823 3891 3399 -1582 3690 7752 6308 4771 419 78 1112 -128 -2827 -1844 -2185 323 4083 4149
2807 4149 4680 6234 379 3196 3127 -482 -6749 -2366 596 2898 5978 2271 -5737 -7941 -5426 -945
2791 -945 -523 -2659 889 4627 3040 -1531 -1476 4152 1429 -2922 -607 325 2395 -1378 -3186 -1913
2775 -1913 772 3432 8211 8750 2352 -2376 -2077 -3294 -1785 2385 2880 2739 5246 2868 8777 7748
2759 7748 5117 4992 5606 4321 7687 4981 2081 2162 994 -1907 -9369 -5463 -3835 -7394 -10634 -11583
2743 -11583 -7867 -4457 -1027 230 -3216 -8082 -10373 -14601 -8961 -1618 722 2475 2059 3322 -5626
2728 -5626 -4604 -1762 -4489 -1319 3092 5683 2094 1422 2220 3936 1838 -3210 -1760 2299 6899
2713 6899 10756 12293 6943 981 2411 6800 6784 2879 3598 6286 4114 4539 3232 -3594 -4004 -1526
2697 -1526 3090 4962 8537 8729 4663 5709 1064 -1137 -1091 -2391 -5071 -1156 -4861 -4386 216 -203
2681 -203 -1897 -126 1137 -3119 -2507 940 -530 -6854 -7196 -2984 -1413 -3641 -5742 -4071 -5267 -6438
2665 -6438 -3686 1279 -701 -4028 -10784 -7541 -3846 -5387 -5548 -12592 -11028 -6155 -6184 -6029 -4711 -1115
2649 -1115 1084 -3699 -6040 -3961 -1306 -17 -194 676 798 -2093 -2043 3943 5894 -2228 822 3201
2633 3201 2647 1431 -2195 -3134 -3703 447 397 42 -293 2874 1290 403 2005 1392 758 -397 1655
2616 1655 2271 1839 2178 -1158 -5897 -5278 -3961 -2326 -1652 -2486 -1258 3478 1509 -930 4527 3791 980
2599 980 491 -2411 -1725 -1819 -6794 -6042 -4500 -3851 -1333 -4508 -6231 -4949 -3354 -3928 -5625 -3588 -4302
2582 -4302 -5213 -1870 763 3263 6139 2171 2340 -2660 -8072 -2819 -1391 -2983 -1803 3823 3823 -1040
2566 -1040 916 -1593 -3927 -8426 -11077 -5860 -1586 -2166 -324 1537 3550 -1225 -6115 -91 -1433
2551 -1433 -4582 -3392 -5356 -434 4034 3993 4775 5664 7260 5513 -818 -3276 -2269 4350 5367 1298
2535 1298 -2874 -3607 -2674 1328 3400 -2814 -7777 -4601 -1834 -103 -3617 -8248 -6356 -2274 3469
2520 3469 3752 556 -1886 198 359 4281 5128 1971 504 433 -329 -1506 -1660 -5812 -841 -627 -3429
2503 -3429 691 -4750 -7134 -7902 -5481 -3024 -4367 -1180 -2020 286 -1348 -144 811 -956 -3801 -7311
2487 -7311 -8347 -7204 -7595 -5869 -919 -2629 -1732 907 2670 4071 1093 -5957 -7859 -4389 -5209 -6253
2471 -6253 -7553 -5603 -4074 380 10276 9827 5839 399 -4481 -3615 -516 -1322 2628 1826 2985 7040
2455 7040 9065 8448 5645 -1238 -2067 545 3408 1700 247 -6433 -7564 -1289 615 -4466 -2044
2440 -2044 3689 2509 259 969 -2609 -4011 434 995 3418 6171 5178 3362 12 -1485 -2348 -4317
2424 -4317 -2440 -166 -2516 -6870 -8490 -2157 3087 3782 5358 2219 152 -1134 -4061 281 4035
2409 4035 1284 2098 -66 -1718 -809 543 -3844 -4881 -4920 -2192 -1461 -2351 -2498 1414 2468 6316 6685
2392 6685 7990 9553 7568 3747 5406 6701 9902 9797 6799 3953 2672 6925 8490 2599 -4997
2377 -4997 -4854 -4327 -5353 -5529 -3849 -5778 -6892 -1739 -3441 -7272 -4528 -4236 -1739 2100 1664 -1676
2361 -1676 -3103 -6515 -1422 437 -7222 -12926 -8092 -3500 36 252 3622 2136 5599 4809 2681
2346 2681 -3975 -5417 -5798 -2040 -631 -1013 -957 -2066 -1753 2398 5819 7813 6081 346 -249 3951
2330 3951 2812 3398 1016 -311 -1843 -2320 -972 -4209 -8657 -8152 -2812 6362 4428 -1171 64 2313
2314 2313 1433 -1699 -1945 775 6904 7645 2550 3643 6113 7417 6194 5236 5966 3892 2335 123
2298 123 -2080 -2914 -4564 -2908 -1996 -3736 -5397 -8153 -9945 -9316 -10324 -10110 -9066 -7041 -4021 1998
2282 1998 -1531 -3615 -7525 -7481 -9554 -10807 -10142 -11185 -7001 -5968 -3366 275 -174 1107 4176 6649
2266 6649 5311 1776 1831 2876 6328 5946 8537 6330 5641 6365 3696 -2201 -2046 -2310 -921 -860 -1298
2249 -1298 2722 2040 3759 7247 8291 9841 8545 7530 5968 1599 3623 6255 6108 2059 1606 -2714
2233 -2714 -5402 -2392 -4249 -2160 -201 1518 2162 1042 1011 -84 -1766 -1464 790 3688 7610 6141
2217 6141 2401 1268 5836 8254 7571 6321 5163 4739 1829 3547 1131 -1111 -1957 -1251 -2676 -6120
2201 -6120 -2107 2419 4977 7618 3554 3182 5082 7591 8432 2792 3633 1402 -1471 -184 4917 3906
2185 3906 63 -159 -639 -1527 -2952 -8886 -6233 -4669 -4113 -4865 -5667 -1697 1349 2955 2374 1783 3160
2168 3160 2788 3123 2203 -1354 -933 -1771 -3059 -3220 -3443 -3026 -393 -1871 1525 1535 -1726 -2916 -2713 -693
2150 -693 303 375 1575 7340 6425 1881 1702 -3122 -6261 -2093 1657 3201 2946 -222 -1203 -6372 -6696
2133 -6696 -3846 -3835 -1562 -3638 -7813 -10001 -4735 -1164 -1045 -2662 -5808 -6164 -8836 -5273 3762 1404
2117 1404 -4812 -7286 -3047 -2603 -741 2834 2579 -2180 -7790 -5083 -3045 1324 -199 -917 -4832 -6278
2101 -6278 -3302 1133 5644 5187 762 1406 -1117 -5935 -5854 -5732 -5145 -5075 -6539 -7590 -9424 -7683 -5039
2084 -5039 -6851 -4641 -2837 -1467 -3624 -1812 -450 -3752 -3805 -4725 319 4952 6038 934 -1626 -40
2068 -40 3287 5322 1767 -2275 310 2538 5810 2259 -315 5379 10030 9254 8773 2700 -8607 -10465
2052 -10465 -6397 -5370 -4473 -4881 -5153 -5565 1457 4656 6999 8117 8820 8697 6750 5532 9639 11529
2036 11529 7623 2473 4124 8957 4576 5763 333 -984 1205 2408 1199 2797 7802 6110 -987
2021 -987 -7420 -7443 -11733 -10684 -1850 1225 75 -2295 3747 6480 4574 3773 -955 -2656 -6482 -6235
2005 -6235 747 3058 -1901 -6455 -10158 -5715 -2364 397 4792 3315 -2055 -1605 479 -1954 -4391
1990 -4391 -2976 -303 499 1601 4180 6371 2841 7428 10036 9991 8232 12447 13310 11315 8886 11454
1974 11454 9657 9546 7233 5328 6210 168 -2070 -4978 -3832 300 -1361 -6841 -4060 -1343 801
1959 801 527 419 -3423 -4602 -2910 -1803 -4173 -8753 -6284 -946 -5618 -3683 -393 4811 3973 1695
1943 1695 3998 7065 5527 1477 -2577 -2406 -3015 -652 3761 1929 4857 5479 8343 10760 6746 6110
1927 6110 8951 11723 10328 3432 -985 4544 3623 3764 4958 2520 1734 4610 2550 4445 8915 7856
1911 7856 5378 5183 9359 4029 -424 1542 3780 5101 6284 7146 5351 6718 4349 2887 -940
1896 -940 -1974 -3957 -2831 -6812 -14192 -15535 -12267 -11155 -7336 -870 1228 -400 -1880 -2523 -2126 -1053
1880 -1053 -2412 -3055 -6492 -7169 -6866 -4820 -5515 -4127 -2356 -7120 -10375 -9821 -9249 -10048 -1297 2607 -733
1863 -733 -7774 -2516 1028 3798 2421 4152 2362 -1334 -1669 3313 1422 2839 1754 -1273 2262
1848 2262 3463 -137 3003 3472 2355 4712 11521 11222 10589 15217 16363 14523 11693 7447 6979 5893
1832 5893 5611 4652 7324 5986 6973 3132 -351 6482 6586 5920 4388 3156 4309 3680 5178 5962 5711
1815 5711 1980 553 -873 -4713 -4203 -2014 -3769 -3564 -1545 -321 -3454 -1244 -4053 -11304 -11532 -4165
1799 -4165 -1272 1884 1929 3586 5614 6540 4700 6293 10728 6948 1831 231 -1006 -3512 -4738 -3990
1783 -3990 -6161 -8044 -4900 -3343 -1127 36 682 222 3016 3003 5105 3050 -2392 -3398 -1921 360
1767 360 2972 5589 4275 7416 8296 6778 5390 5392 5698 3365 -5540 -7234 -6955 -14294 -14871 -10470 -5995
1750 -5995 -9278 -7679 -3265 -8069 -7419 -3166 -4840 -4996 1680 1175 2309 124 -828 -662 -15 1352
1734 1352 -460 -328 -4779 -687 550 179 3550 588 -4194 -6626 -8034 -11972 -10213 -6231 -5296 -4284
1718 -4284 -5528 -9017 -8766 -9514 -7127 -5401 -6836 -5121 -2571 2130 4715 4612 -492 -3921 -1127 -2296
1702 -2296 -2665 -2503 -855 70 856 1979 -1657 -3729 -2014 -6946 -10459 -8291 -3341 -3192 -3102 -508 -1729
1685 -1729 1051 3524 3345 1318 -2171 -3494 -5798 -5337 -2139 -196 3733 4307 5632 11195 4097 -2194
1669 -2194 728 4927 379 -5282 -3206 -5087 -1507 870 1656 4787 3341 1930 -892 844 -78
1654 -78 -823 -2272 -4106 420 682 1440 -2561 -957 4287 4843 2808 -3951 -9722 -8286 -5120 -3749
1638 -3749 -3869 -1277 -753 -3852 -2861 1656 3133 6152 5473 3612 -1315 -4880 -6456 -926 4124 8027
1622 8027 10286 4205 -1263 -2026 -1985 2435 7022 3625 1496 854 2077 -350 -1800 -5233 -5399 -9149
1606 -9149 -3779 1072 4812 6491 4006 3259 944 -1956 -2364 -3027 -3064 -2072 -6074 -4698 3308 5952
1590 5952 1002 -2518 309 632 -2227 -2461 -3842 -4256 1783 7323 7350 10403 7603 1405 -1269 -2302
1574 -2302 -5213 -49 2026 4442 2047 1191 -3730 -8255 -5068 -784 -841 313 1047 1584 3700 3489
1558 3489 -1726 -8745 -6901 -2091 -3471 -4234 -2364 359 1531 6254 3678 -1925 -4482 -3742 -8537
1543 -8537 -10111 -6479 -5840 -4565 -1847 -1127 -5507 -2285 -2460 -1636 -1764 -6462 -10243 -11425 -6287 -3638
1527 -3638 -5096 -6253 -5195 -5661 -3755 -1641 770 3605 5357 5402 -291 -5303 -7812 -3172 1250 475
1511 475 751 -895 4237 9654 9629 6275 3058 2876 10269 16637 17098 8957 3419 -2414 -2985 -5325 -194
1494 -194 6279 6595 7049 4818 2637 5323 3863 5454 6831 3148 1387 1738 484 2035 3720 4024
1478 4024 4195 1500 1083 2888 1224 630 3291 2840 3364 3530 2392 1744 7004 7792 2995 821 1480
1461 1480 -2192 -3729 -5244 -5985 -2177 1022 2767 4127 1198 -1795 -477 4466 -654 -3451 -3830
1446 -3830 -2785 417 1397 3401 3949 1899 3854 2846 -644 -2611 -1851 -1862 -898 4320 3755 1362 -2615
1429 -2615 -3026 -1193 -5208 -4486 2073 6279 -476 -3779 -4530 -3884 -3205 -6628 -5585 644 7396 11259
1413 11259 11860 11883 10401 7423 3357 3720 4216 1772 -1329 396 3937 3302 2981 2652 947 2079 -2691
1396 -2691 -6864 -7740 -5752 -6565 -5771 -4894 -2925 -919 -2589 536 -317 -3316 -1620 1841 1434 1579 -1033
1379 -1033 -1114 -1551 2121 1171 -1267 -1342 362 2923 2209 2597 -940 -3108 1360 905 -1004 2144 -508
1362 -508 -853 2152 5774 5513 5263 1001 397 409 1153 3905 3135 6018 5313 1485 1957 2937 1832 3244
1344 3244 5182 373 -2266 -5145 -4916 -2662 -8185 -6136 2300 -349 1598 3510 1870 -2938 -1924
1329 -1924 2557 9481 7437 7805 9059 6402 4459 2820 -3270 -2299 -1373 -2085 -1978 777 5401 9141
1313 9141 7748 6661 5151 3930 760 1478 4816 1790 -950 -2721 -1753 -634 5199 4639 2578 1125
1297 1125 -1118 -6824 -9026 -6429 -5446 -4858 -4364 -2841 -2654 -4644 -4435 -2752 553 3983 4891 1419
1281 1419 -4273 -4070 197 991 1308 1391 -4901 -8886 -5358 -580 3171 4299 5214 7413 5761 1750
1265 1750 400 -281 1591 453 -623 -2506 -5231 -2898 -541 830 3002 5164 2921 241 757
1250 757 -1300 -2503 -1125 526 -157 -5963 -5337 -2591 -210 -228 985 4807 8894 4918 3127 1298
1234 1298 -1652 -191 1666 3516 6314 8373 5140 7995 8092 3199 2634 -2538 -706 4495 3773 3496
1218 3496 4129 1878 -785 -354 263 -3879 -3505 -4413 -3717 -2736 -3495 717 2541 -336 -1776 -2017 -690
1201 -690 -1182 2890 -521 -1615 -5794 -3521 -4593 -5998 -956 2036 -107 -2455 -4322 -4802 -1060 -2257
1185 -2257 -3203 -1325 -1679 1409 4462 5136 1203 -516 -1111 -2132 -2480 872 -1664 -3862 -3939 -4125 -6848
1168 -6848 -6881 -743 890 -336 -969 5117 7816 3470 -2634 -1696 -491 1738 1612 4263 1232 1209 2112
1151 2112 5654 12911 16437 13759 9960 4231 5340 1366 4766 6988 8107 12118 12019 9120 497
1136 497 -5468 -6754 -2471 -7434 -8440 -9600 -6373 1164 3342 5524 5948 2888 5717 7832 6627
1121 6627 -1708 -2226 3530 7648 4480 2768 2684 2734 -2333 -4519 -2148 -2702 -816 -4515 -2695 -2243 -2558
1104 -2558 -1734 -4769 -3331 -1661 -5220 -9714 -6034 -2307 -2677 -470 6129 6612 -1262 82 363 4009
1088 4009 7483 5111 1649 245 -1468 -222 -2826 -1478 2220 6471 3984 1493 4943 2520 -1666
1073 -1666 518 -516 -3822 89 5650 4606 2234 -330 -479 1071 -3893 -9475 -9537 -2700 -3286 -5329
1057 -5329 -8529 -8374 -5828 -3998 -2469 -304 3610 4520 1627 2324 4720 5387 6752 2967 -3323 -1567
1041 -1567 -3378 -6512 421 2204 -3704 -2609 -677 882 1481 -1179 -612 -950 -2860 -2126 -624 2666
1025 2666 5798 8784 8482 7559 6294 6519 2044 -1645 -3582 -7505 -9965 -11008 -4591 1256 -88 -2692
1009 -2692 -2280 -1201 -648 353 964 1807 2935 4036 613 4461 1595 10 -4691 -5610 -5514 1655 -1501
992 -1501 -1385 118 -275 1593 1579 1617 -386 2748 5764 4655 2825 2217 3372 2147 1545 78 480
975 480 -1036 -573 -2269 -2974 -5128 -6822 -3872 -3256 -4954 -2523 -3701 -4193 -2518 -1086 359 -1154
959 -1154 -2805 5879 7327 490 2527 4100 4304 291 19 -3437 -5913 -7253 -6346 -107 160 -2167
943 -2167 152 1145 374 1607 4347 4100 6099 8445 5512 6670 2137 -1909 624 2689 4595 2618
927 2618 372 666 4033 2451 -1918 -2500 -591 185 -40 4129 5926 8733 10590 10835 7893 10937
911 10937 8924 -546 -4919 -8297 -4592 -4310 -1889 1085 -1413 3210 6350 2553 -113 -980 -4924
896 -4924 -9612 -8714 -4793 -3372 -4086 -1920 -653 2131 408 -2664 -5981 -7666 -11160 -5741 -2952 -246
880 -246 3698 5579 1116 -2579 -2970 -931 -1880 -5050 -2435 -372 -2478 -4664 -317 -371 -130 -1351 -1294
863 -1294 -72 1317 3001 7241 4941 1719 1452 440 -2394 383 5968 12483 12498 10868 6697 6704 3671
846 3671 1958 3811 6512 4115 1856 1453 2934 2795 2587 1283 -423 -1227 -2428 -2368 -1581 -296 1119
829 1119 -3165 -5349 -5118 -252 -860 -2304 -3005 -172 1900 2713 2470 32 5320 5683 5822 6404 2648
812 2648 -4372 -6163 -3492 -1521 -777 1337 165 1952 5182 2501 -134 -1065 166 -5488 14 1134
796 1134 1867 -241 -2745 -142 877 -715 -2000 -2493 769 2241 1751 23 -2363 -837 -1585 -315
780 -315 -1996 -6634 -3783 1620 -1982 -6480 -4340 -213 3141 733 391 1429 74 -3145 -5578 -8817
764 -8817 -7810 -2640 -1874 4507 9101 3548 2888 4035 3056 -4636 -8401 -3307 -701 -1166 -4217 -5358
748 -5358 -6138 -3931 -1217 4246 6609 9283 9161 4711 118 -2891 -707 3165 -904 -6156 -3357 -8192
732 -8192 -6649 -176 2497 8368 8124 6234 3026 753 -54 -553 -4951 -8293 -8048 943 608 1311 657
715 657 1985 -480 -4043 -3298 3637 989 -4507 -4497 -1532 -3147 -3065 890 954 1356 -1151 868 7772
698 7772 6313 7366 4129 -2991 -3120 -2050 3237 1297 1660 -1068 -549 4342 3141 -2624 -7693 -3292
682 -3292 -515 3302 11236 14325 11638 9216 7973 3254 -3172 1210 1622 2688 3565 1694 3332 6457
666 6457 5790 7564 6062 446 -2344 65 2533 4314 1782 -2385 -6576 -300 3257 5993 3953
651 3953 -961 -1947 -2477 1473 1101 6786 11500 7717 5569 2874 1555 -1782 -504 -1114 -3005 -5316
635 -5316 -2144 3168 2273 1363 -2456 -2571 -3631 -7207 -4921 -4329 187 4044 4430 5187 937 1762 1479
618 1479 -4496 -3540 1058 -1368 -4376 -2969 -2737 -6355 -5188 -3372 -3721 -5116 -1842 3553 6274 4415
602 4415 -2808 -6490 -9370 -8022 -9636 -5161 -3744 -1502 -1396 -142 -1229 -7258 -9854 -7823 -5485
587 -5485 -4911 -1947 -1783 -3493 -4105 -2843 -297 -3731 -4665 4223 5950 4279 6601 4158 3733 5282
571 5282 1423 -2214 -3231 -3204 3062 5672 4570 3740 -1714 -4292 -3408 2059 2232 1873 5565 7482 5203
554 5203 -194 76 3046 4372 4451 886 -43 -3837 -3776 -234 599 2075 6645 5749 6955 5752 6548
537 6548 6640 2392 760 -2652 175 3719 640 -3774 -372 2328 3569 2607 958 855 1248 2850
521 2850 2678 -1136 -3282 -538 541 -495 -1652 769 1581 2317 2510 -762 993 603 668 -1816 -4417
504 -4417 -4089 -2981 -3453 -4255 -2878 -2082 -2093 -6850 -10713 -6768 -6684 -7249 -4840 -2138 826 332 -2866 -7669
486 -7669 -8686 -6747 -2890 2972 1187 -1180 -4407 -1363 -522 -2652 -6599 -4536 -3733 -2621 -2645 -4770
470 -4770 -67 656 -1322 2319 5026 4942 3777 -491 -1076 649 810 -42 3596 3520 1177 -4273 1037
453 1037 1211 -362 4500 8680 3061 -807 6404 4982 2022 1061 6219 3486 642 -2830 -5514 -7181
437 -7181 -7041 -5060 -4246 -6973 -3996 -3061 -1353 1081 4052 3144 453 -889 -1218 -2822 -2283 -4846 -4223
420 -4223 1290 651 -3282 4094 6975 6795 2696 -2194 -2223 729 320 2390 6703 11562 12360 7948 6128
403 6128 7300 3155 2402 1789 -439 1806 81 -4006 -3368 -4695 -4975 -3078 -1343 1128 1887 -5782
387 -5782 -8334 -9193 -12333 -8570 -1031 -1537 -3071 1192 1999 338 -612 -643 729 4119 3690 3894 1392
370 1392 2307 2484 -367 1018 1496 1901 2762 4879 3763 1849 2039 5215 6838 7126 3793 -2203 -9000
353 -9000 -4487 -828 -2370 -4835 -162 6795 8302 3551 1890 4440 4905 4473 741 -1150 -467 1299
337 1299 3264 4849 3796 5555 3961 3445 2644 2111 4353 6384 6816 3389 1949 1870 2151 -110 1258
320 1258 2785 -4273 -3544 -5000 -3301 -1517 -3264 -2090 -2628 -1226 -1377 -2008 -3635 -3945 -4684 -2473 2675
303 2675 5080 121 763 -653 -1109 -1593 -1602 -1670 -5281 -4279 -4483 -4217 -1924 -4093 -2075 -3890 -3530 -2097
285 -2097 3373 5976 6220 6700 5316 2838 1877 -2285 -5409 -6692 -8116 -1042 -1217 -5630 -3453 1524
269 1524 1310 -1215 678 3964 1823 1264 2230 1254 657 4718 3560 840 -5492 -6226 -3590 1670 0
252 0 -5208 -6001 -2614 -4464 -366 1829 -2145 -1408 -2815 -2562 -2778 -3380 1896 5578 2283 1949 1027 2678
234 2678 3282 3070 801 -1688 -3662 -2475 -1300 -4147 -7661 -5741 -5200 -2935 -1105 -51 -254 168
218 168 1988 1803 1290 1935 1450 782 460 2028 -1272 -2024 -697 889 -1262 602 1306 2332 4601
201 4601 3650 -2001 -2995 -1040 2177 1355 -1135 2598 3428 5058 3188 5508 4951 5017 1880 -969 -3233
184 -3233 -2750 -2314 927 2781 -157 -3058 -621 -1760 -1292 1226 -1444 -4395 -1193 1998 5454 9487
168 9487 7113 10947 10225 5383 4383 4448 2809 3352 3286 1432 1061 -2464 -3015 -1262 326 -1509 -1323
151 -1323 543 3303 140 -2819 -3341 -4780 53 5860 3823 1472 4674 2540 -1418 -2031 -2648 -3414
135 -3414 -656 2645 1060 1889 2306 -457 -3092 -86 1732 16 833 1159 1204 31 -1586 -2361 -289
118 -289 -995 797 393 -2588 -5258 -4837 -4046 -4423 -2402 1201 2111 3147 4176 2099 -4094 -6271 -4981
101 -4981 -2328 1598 4143 767 -5314 -6789 -6553 -5166 -5295 -5555 -2876 -708 3355 4473 2233 423
85 423 -4550 -6362 -5169 -433 2365 -4309 -7485 -3980 -4121 -6654 -3243 -1651 -1281 2118 4815 6511
69 6511 4306 4040 3680 -475 -1924 -2190 -1681 -3222 -3970 -2099 -272 153 -1605 -1682 -3517 -4374 -2950 -1538
51 -1538 482 1969 1769 2388 3085 1693 589 -142 5341 8166 8050 8041 8256 6873 3249 168 1921 1541
33 1541 3147 2938 4530 2872 187 -447 447 2619 2042 1360 1490 -3091 -7623 -4833 -1512 2283 1396
16 1396 582 205 -1497 -592 -3900 -2326 -646 -1452 -539 574 2482 2576 2263 86 -3997 -4421
0 -4421
$$ Imaginary data points
##PAGE= N=2
##DATA TABLE= (X++(I..I)), XYDATA
32767 17515 17501 13488 11259 13677 17014 16768 15338 13272 15678 20139 19032 17528 18347 18106 19070 21813
32751 21813 23882 21431 21150 20972 19922 20102 23526 25882 25218 27417 27987 25662 25164 23204 22223 24369
32735 24369 26979 25750 22818 20244 20806 21131 21326 22855 24187 22656 22116 23850 26716 27741 29578
32720 29578 32958 33840 31667 28272 27557 28583 28572 28693 27618 28953 29449 32157 30882 31710 31558 27228
32704 27228 23581 24224 26720 27916 28137 32027 32221 31953 32375 31564 31426 32138 29923 29347 28805 27757 30341
32687 30341 30471 29069 31719 31306 29147 30700 32446 33107 30789 30870 31688 31839 33023 33807 35054 35573 37342
32670 37342 36596 34492 34444 36206 34190 31656 31658 36146 39073 39983 38983 38857 37228 36534 39497 42341 45243
32653 45243 48563 49200 46752 47522 50403 48246 46486 42964 42113 40467 40196 43700 43777 44334 47068 47996
32637 47996 47885 45716 44562 49959 50683 49929 49973 47791 47496 42953 39192 44157 46744 44411 46097 49051
32621 49051 46282 47238 43535 42108 44446 49336 52732 53282 48727 47525 49848 49886 50109 52530 52054 49332
32605 49332 49284 49410 49944 52914 51731 48115 49597 51769 50192 46416 46049 44656 45953 43516 41574 43514
32589 43514 47902 48621 49471 54273 56251 54588 50905 50894 50488 52710 52252 51842 53270 54400 55471 53403
32573 53403 48845 45845 47704 50509 48873 50670 51684 55784 55397 53260 51523 54334 55165 53409 53935
32558 53935 55623 57273 54413 52387 50309 50152 51777 55352 60493 61804 58884 57277 59708 61849 62543
32543 62543 64238 63931 59476 56447 58973 58433 58186 53254 50383 55504 60747 62235 60883 59496 56108
32528 56108 53536 56270 59318 62112 63687 64632 62926 66815 70126 72118 70674 71085 69332 67757 68085
32513 68085 67341 67871 69818 71659 68993 67959 66769 62920 61530 62870 60947 61647 67642 69062 71069
32498 71069 71218 69482 68452 66824 65318 67226 68516 69855 73029 73790 75548 72182 68359 62929 63887
32483 63887 67299 68711 72613 75159 75912 72375 74632 75486 77778 78324 74852 70449 66715 60305 63642
32468 63642 68755 74193 76514 75376 72891 76286 79688 77110 77290 80792 80312 77073 75159 73187 69455
32453 69455 68008 70390 71841 70439 70568 73236 75087 75950 75074 76487 77515 78697 76617 72589 73692
32438 73692 76624 77524 76924 78485 81482 81468 77913 73386 69518 72132 76113 76894 76203 75544 80134 82461
32422 82461 78903 78044 79956 78744 77328 77882 81984 80580 79889 77760 72832 71711 73150 72728 74663
32407 74663 78921 80873 78461 75795 75191 78754 82479 81560 81554 83477 83581 80695 76204 69294 71133 73658
32391 73658 74617 76538 77085 78462 78502 78437 80171 77371 75075 77581 79315 79528 78023 74137 76342 74041
32375 74041 70779 73603 73195 70911 68855 75975 73870 72455 74032 74728 74384 73408 75689 76510 77005 79795
32359 79795 86889 86007 89915 89841 90941 91254 92708 87399 80674 75872 72575 75700 78885 80933 84488
32344 84488 90115 95152 94648 89600 84325 83987 86203 90989 91647 92524 94077 95076 94347 92688 87887 83443
32328 83443 82996 79937 79610 82261 82895 79096 81900 88820 90904 88697 89140 88683 85322 86498 82993 78831
32312 78831 77863 76914 81454 80557 81077 81159 80345 81246 84335 82273 79877 78942 77858 78864 78360 79968 79543
32295 79543 78921 78847 79033 84516 85289 85365 89672 90011 84581 84202 84237 82190 86044 86575 84688 83781 84778 87278
32277 87278 85954 81930 76636 74553 77022 80273 79493 80112 81870 86808 85552 88079 90138 88427 86817
32262 86817 84615 84848 79600 77619 79599 83874 86062 83253 81411 84192 86970 87754 86997 88482 88273
32247 88273 87870 86581 82930 82807 82081 84599 87983 90915 91795 92892 96220 97788 97426 92094 90831 90891
32231 90891 90238 88385 89769 87569 88187 88404 88410 88588 87801 83563 83052 81477 78493 78266 80993 82046 85715
32214 85715 84945 83721 85495 85962 85446 84646 82879 84190 87680 84867 82514 86645 90013 90727 92704 91975
32198 91975 87068 84651 87010 86105 85169 82147 79997 74680 76196 78898 82452 84426 85623 85275 87022
32183 87022 88343 93235 91627 86513 86399 88936 92522 94183 89816 85663 82162 81605 80177 84678 92638
32168 92638 93313 89436 91121 95174 96265 94815 89057 88077 86000 83671 82165 82650 78880 76015 72185
32153 72185 73071 76717 73497 76683 84299 85528 84720 84268 83492 81805 83419 83864 82286 86515 91276 90454
32137 90454 84784 80659 82577 82684 86193 87831 87475 86532 86380 89972 86130 89977 94758 92196 87068
32122 87068 84666 87152 88898 89091 89638 89017 87026 87856 90005 93342 91152 88216 87841 89238 95432 97452
32106 97452 96123 97490 96582 99608 97378 95101 92369 89160 89741 90340 90909 96178 94582 91274 91150 94927
32090 94927 95220 91171 86686 91448 92706 89656 85075 82395 88022 86028 86085 82013 81374 84403 89112
32075 89112 89804 91276 91470 87864 85797 85172 80539 77198 84754 91353 90561 92324 95333 92385 91237
32060 91237 90699 83610 85828 89667 86947 81614 80786 83277 81044 85406 91998 95287 98409 92940 88444
32045 88444 86201 86746 87012 90554 90871 89930 89718 88748 85968 88016 90624 95546 96092 94738 90844 86769
32029 86769 87275 89745 89667 89257 86533 86674 90780 94195 93642 94320 91382 89087 89101 90326 90634 90329 91308
32012 91308 92682 92064 92209 89836 95310 99389 96785 98127 95509 94458 90964 90441 89445 85945 90030
31997 90030 89802 89837 88724 92757 94734 95889 91463 85095 84423 87642 87998 88954 89048 87577 85364 88908
31981 88908 96159 97885 95823 97862 97593 95878 91617 89828 92069 91905 91559 93759 89813 83540 81397
31966 81397 83834 87184 81218 79623 84995 83746 84647 86983 88924 90094 90702 95191 93432 87901 86903
31951 86903 92673 93419 93875 93060 89469 86224 90139 98919 102740 98255 93087 94734 93489 93049 97010
31936 97010 98058 92816 87834 83615 84364 87539 87336 84905 84021 86982 89504 88639 90969 88866 88209 88377
31920 88377 86319 84789 84486 85583 86041 89144 87113 81425 78228 78913 80407 82096 87597 90157 85341
31905 85341 82335 85164 88198 85767 73105 73345 80863 82473 81421 79944 77854 82342 90467 94493
31891 94493 96769 95068 98611 94244 88782 85106 82095 83016 86565 87416 91578 93155 95147 96889 92829
31876 92829 94874 97153 94991 94189 90087 81666 81587 86260 88662 94011 94322 91103 90506 91841 91159 90148
31860 90148 88817 87012 88183 90808 93626 97070 99977 103085 100627 92863 91203 88295 88226 92571 91924
31845 91924 90579 91011 89312 89049 88026 89257 93064 90229 92542 91502 89090 88998 84021 83029 87694 91814
31829 91814 95092 97323 100097 102706 99503 92831 91080 89641 90107 93481 94797 91156 87125 85871 85574
31814 85574 82581 82316 86304 93343 96463 96330 92829 87675 88992 90709 87143 88819 91552 94610 97163
31799 97163 95419 92813 92182 89405 89983 91526 88411 86500 89876 90448 91347 94381 97790 96856 93714 96973
31783 96973 95533 91817 90533 90255 89242 92774 95637 95221 96704 95158 92922 93951 91029 90097 89806
31768 89806 87588 86301 85416 87593 88646 86633 84288 88207 88568 88600 92957 92208 92513 92702 91622 91196
31752 91196 93767 96750 95951 93505 89214 90877 95046 98075 99396 96738 93759 94455 95063 99517 103195
31737 103195 101003 95525 91977 94376 98985 97293 87026 82107 85617 88980 93284 93009 99484 93923
31723 93923 89423 88712 89033 85177 85184 88970 91793 94155 91912 90523 86039 83752 85903 86307 89495 92613
31707 92613 91340 89778 91328 88715 91954 96158 96598 99862 103615 99361 94175 93995 91608 94878 93686
31692 93686 87574 89416 92548 87094 86228 86786 90116 92038 92519 92250 84403 79266 81273 83393 89005
31677 89005 92287 93733 90605 88783 92508 99739 99972 93928 90025 91585 90668 91346 89153 85119 83972
31662 83972 83820 82860 85051 85984 89242 91558 94236 99595 97461 92722 92617 93781 89803 85133 81693
31647 81693 81180 85760 88788 92107 93804 89728 87437 88683 90946 91413 95022 96326 92945 90036 91574
31632 91574 88458 88021 89004 87825 88077 86953 86065 87314 83813 81518 85964 89011 86313 89796 93210
31617 93210 91777 91133 88045 84892 82951 90874 87807 86316 91634 95929 94798 93736 93724 93443 92864 95874
31601 95874 95226 99086 102778 100980 94892 91953 90701 87171 89976 95574 96214 96291 97582 99477 101002
31586 101002 95353 93117 93821 91350 86841 87370 87983 88320 88497 89028 95285 94872 90975 84677 85390 91322
31570 91322 93118 88266 90374 92858 90398 94207 100158 95987 94974 92610 87514 90160 90126 89868 89579
31555 89579 88115 88453 90916 89379 90163 89138 90453 91031 90676 90468 89681 91166 91885 93894 96161 96463
31539 96463 94147 87911 89883 87679 90814 92398 94688 93963 94123 94773 94226 90211 88106 88784 88359 85287
31523 85287 88611 92884 91806 88494 88415 89239 92074 90397 89946 88384 87280 89487 89122 87547 88993 86731
31507 86731 86076 87500 90136 91632 90745 90305 88320 84779 85431 86839 92283 96319 97102 92454 90758 92083
31491 92083 92244 93100 89109 89408 92183 93817 94475 92587 88999 89814 91345 93669 94868 94986 95589 95225
31475 95225 96739 93223 88744 89585 94899 92327 88845 90763 89696 87516 88751 91778 95226 97793 91207
31460 91207 88678 90753 92366 95034 94603 95294 96692 91472 90412 89327 86868 85014 88297 91357 93851
31445 93851 90298 93159 97083 97572 97691 96691 95601 98090 101884 100806 100580 98553 98226 93906 86865
31430 86865 83596 84996 81747 83798 90211 90799 86567 84187 83482 85811 86417 83814 83705 82617 86594
31415 86594 92543 93375 94189 91824 86892 82758 84350 92307 100504 100005 97298 88607 86493 92586 93170
31400 93170 93671 94594 94942 94651 95883 97089 94805 97547 99385 97799 99665 100969 97411 100042 98462
31385 98462 90054 89599 91399 93990 93882 89524 87397 90772 92607 89218 85807 86927 86015 87063 85562
31370 85562 82559 81676 84959 91944 96517 95658 96951 96126 92101 88245 85329 83767 88962 89749 89212 87258
31354 87258 84484 87593 89750 91936 98483 103574 103203 96067 95961 94838 95363 99518 96014 91740 89711
31339 89711 89500 92287 92150 87425 88987 96261 95564 93535 92643 93127 94681 94159 91092 88071 88892 90825
31323 90825 92564 91521 85997 86518 87065 87863 87304 90951 89780 88486 87265 86637 90347 88828 89735 90872
31307 90872 94746 95646 93241 89710 86696 90300 92964 91896 89080 88809 92575 92239 95714 97850 98394
31292 98394 92808 95568 94229 93416 90972 92078 95343 95875 93475 91584 98211 96318 94737 98133 99583
31277 99583 99972 96059 92613 93237 98614 97958 99497 98379 99579 99603 96625 95121 90278 89370 89984 88063
31261 88063 85865 88774 89162 88896 89912 92867 97943 96956 97217 97658 97609 96837 96883 94192 92996 94673 88302
31244 88302 85449 88243 89511 89204 92612 92501 94521 93086 89866 85892 84413 86171 90553 94057 91175
31229 91175 89236 89841 96477 99322 100960 105227 99923 99864 102728 97671 93800 93734 97260 94501 89344 85106
31213 85106 83908 83400 85102 90349 87200 82782 81452 82593 86010 88317 90644 91627 88531 86951 86611
31198 86611 87922 90617 93250 91196 86763 89387 89103 85574 87818 87552 90361 92606 90868 91554 92210
31183 92210 99768 101499 98024 91097 88525 84646 85028 91372 92812 95131 94774 94447 95854 91658 89032
31168 89032 90682 91675 90799 94742 95364 93643 91981 90137 87977 88933 90178 93366 100356 99415 99032 99413
31152 99413 99893 95689 97271 97474 95758 92470 92463 90816 88550 89887 92277 94299 96108 95475 94109 93490
31136 93490 92336 89860 89873 91499 92456 93946 91161 90187 96611 101000 100241 94911 93897 90912 89651 91733
31120 91733 91941 90328 91697 96587 98049 92901 91527 91569 93084 91693 92110 89281 92562 95891 99876
31105 99876 98562 96351 91751 95247 95882 95008 94861 94865 97776 98884 96848 93646 93176 95195 93438 91925
31089 91925 87914 88896 93358 90642 89956 87480 87737 89245 87317 88973 85573 85442 88198 89283 91141
31074 91141 89057 88399 89497 89167 88202 91586 98754 101856 97492 90702 85504 87058 85055 85850 88628
31059 88628 87386 85874 82580 84309 87060 88588 89575 94863 96601 99921 100584 96433 93258 89302 88871
31044 88871 88434 88641 90598 93212 93226 94567 93175 91694 88737 95079 101147 100328 98541 95500 93143 90619
31028 90619 86729 88391 93013 93151 95708 99453 97662 96731 97420 99703 96706 89597 86085 84680 88951
31013 88951 91399 89918 94319 96071 94323 100225 105139 104121 107705 105338 99019 96377 99406 100893
30999 100893 99624 98282 98746 91785 89239 88735 87907 89486 94578 93359 97036 98489 100222 98383 93230
30984 93230 93389 95232 93917 90960 94435 99688 99704 96175 95791 94666 94855 92992 96978 98080 95692 96056
30968 96056 95242 90542 88678 88944 86898 92634 101564 100557 97396 99179 101101 103314 98267 99490 97362
30953 97362 96899 99477 98463 99462 100506 97727 96541 92326 89789 89007 96044 102902 102685 97485 94542
30938 94542 95758 94761 96239 95290 96009 91152 90463 92405 96021 96796 98050 97418 95159 95683 100620 104644
30922 104644 105341 105582 98830 100772 100734 97074 94358 91592 90309 87710 91401 96101 101133 99681 98047
30907 98047 98790 95326 96318 92289 89787 88680 90800 88142 88860 90006 95446 98667 98814 93751 88665
30892 88665 90907 91800 93438 93881 96078 95977 98581 101045 100785 100896 101211 94748 94364 94769 91754 91315 90112
30875 90112 89670 88256 89273 90462 93567 96088 97314 97705 96522 91036 88427 90762 91807 91147 89810
30860 89810 93935 96221 93734 91452 91373 96786 101270 104809 105323 103231 105059 104695 106148 103777 100659
30845 100659 99964 97856 93533 92712 95125 94625 97800 97492 95501 98278 96787 98803 96896 96364 95821 96908
30829 96908 96672 96668 97419 95140 98685 97146 93517 89180 91438 94006 96363 92417 93157 91686 89453 89340
30813 89340 93888 93621 93416 96403 100021 100289 95564 92519 94181 95386 98797 95849 91842 87153 84307
30798 84307 86065 86184 88525 94488 95633 90343 89079 88980 88130 90216 92389 90895 87653 85100 85247 84572
30782 84572 86774 89768 92041 90337 90355 90998 95313 96128 92773 95745 100812 97365 96610 96565 93742 100337
30766 100337 99032 96691 94921 91952 89370 87497 87687 89233 92028 100523 102318 104841 109098 105322
30752 105322 99741 96555 94024 95748 96505 98470 99550 99997 104362 108116 109279 107885 108109 102464 99740
30737 99740 98069 95985 94255 92934 96545 92899 93750 96025 93758 94391 93131 88800 93765 98887 97602
30722 97602 95189 94186 88316 85919 90573 94437 90861 88441 89767 94488 94699 93422 94969 99601 96813
30707 96813 95223 98323 100532 97837 94705 92003 91403 88709 89552 92822 94425 91549 89448 92146 97861
30692 97861 101099 101361 102508 100554 97113 94734 89579 91450 94214 94627 93982 96211 99472 96011 98670
30677 98670 96641 97740 102410 99236 95266 93168 95821 96175 98737 101842 100549 94769 95792 97945 98057
30662 98057 96004 96138 95054 93870 90965 86797 86673 88357 85923 88824 94479 93990 93615 94202 93464 91882
30646 91882 94872 98036 96358 96679 96172 100794 100238 96173 91156 95025 96653 96903 99226 96669 90141
30631 90141 90830 88831 85984 89690 90874 87142 88150 92766 94951 98897 98600 97752 100085 97898 96771
30616 96771 98894 96304 87919 87795 91866 98896 99999 101375 100959 99420 96798 97834 100360 104700 106715
30601 106715 104308 96937 94175 96034 95170 96762 95016 88605 88899 91679 93145 98198 98996 94938 91851
30586 91851 91544 92733 94774 92481 89646 88835 93001 99063 104084 102805 102494 103124 102484 97998 94047 92699
30570 92699 92190 91660 95500 93739 99039 99179 96017 93989 99300 101082 97658 94889 101941 107062 106443
30555 106443 102201 101370 97227 93685 92598 91608 94741 100444 99290 101126 104787 106657 104724 103044 100950
30540 100950 101287 101589 99506 98380 101531 102432 96701 94337 92390 94123 99125 100398 98891 100991 101108
30525 101108 96460 92133 87962 91536 93743 91739 95886 98272 101108 99796 97070 93466 92966 95995
30511 95995 95021 98305 99534 95636 96327 95396 95980 95899 92782 92816 92426 90993 96975 97959 96213 93651 92770
30494 92770 96361 96065 96930 93239 90638 95458 93769 94101 96064 97367 97874 101898 104551 105831 102383
30479 102383 96140 96385 100210 100811 97360 97616 97420 97599 97033 95757 100832 102434 101912 102889 98145 94071
30463 94071 91506 89653 90021 90023 88034 90218 96245 96510 95171 100254 102187 100257 97246 98997 98554 93629
30447 93629 94005 92717 94147 98865 98644 97425 101139 100911 100498 95308 95248 94781 98055 100002 102296 97031
30431 97031 91619 90358 91328 93977 91382 87631 89890 89099 91875 98224 94125 94208 93893 95276 99010 95514
30415 95514 95524 90943 87341 86638 91067 90175 92433 92816 92957 97699 102140 96359 94189 92034 95691 99379
30399 99379 100369 102702 97749 92918 92624 97559 96959 95903 94652 101087 105232 106041 100506 97666 97710 96514
30383 96514 95008 98023 95550 91834 92295 95646 97603 98610 98302 104925 105404 105278 105039 103864 100108 98356
30367 98356 105324 107844 104118 99775 101032 98514 96396 99543 102677 104907 101497 101605 98165 91934 90065
30352 90065 90472 93687 102174 103119 105825 101727 95446 95520 93486 95544 96828 96655 99099 99786 97568 98641
30336 98641 97441 100587 100864 96532 93931 95957 97656 97895 101442 103443 100592 98681 98872 96177 97201
30321 97201 101504 100705 98102 93799 94597 95153 89869 93350 94277 93902 93819 95345 99917 103195 103309 107177
30305 107177 107007 105191 104910 108205 105814 97358 92659 101238 103838 102295 101717 98374 98070 101704 102351
30290 102351 100140 94368 93671 90670 87833 90662 94966 100338 100333 105264 103887 104303 99710 91091 91138 97277
30274 97277 101253 100517 99053 97902 94743 92064 91834 96032 97705 97067 100306 100348 94572 96492 99317 101767
30258 101767 104597 103182 98983 99737 99895 96001 94334 95306 97947 100620 95156 92019 90519 92433 95011
30243 95011 95737 95083 94810 96791 96568 100047 100237 98397 99020 96600 93359 88610 89793 91020 93348 93168
30227 93168 94839 95683 97782 102088 100105 98366 97211 100140 99857 96298 96281 101486 104629 101485 101873 99495
30211 99495 98111 98916 95768 93859 95291 99507 99320 99531 100137 100967 96521 91980 95532 95849 96862 99434
30195 99434 100422 97628 96332 93769 94655 97214 95435 99028 100424 100092 100298 101216 98021 92478 94457 100875
30179 100875 99683 94320 98670 102323 102223 101243 97394 94091 95657 95504 95169 92987 93292 100699 100818 99177
30163 99177 101077 105663 101903 98364 98360 99265 101239 100899 100416 100949 93418 90747 97057 94853 88869 92929
30147 92929 95170 90253 89542 93321 98848 104901 107048 105524 99950 99636 101033 100093 95509 97659 98624
30132 98624 103906 105930 102168 99705 99071 93512 93487 93154 97255 103766 105287 102903 102917 103622 103300 105986
30116 105986 109194 107501 106148 104979 104247 101441 101527 103835 101061 98690 97651 95470 90979 93795 95985
30101 95985 97618 99455 99638 96722 95896 97359 100327 103167 99496 98827 104722 101625 99404 104275 104360 106657
30085 106657 104561 99661 100550 102392 102949 102019 105519 109359 105850 107338 109319 110918 107803 103522 103143
30070 103143 99347 102802 106979 108479 107625 111877 110710 104070 102097 105142 101551 95275 95412 93139 92705
30055 92705 96275 101795 106848 105039 99015 104162 105297 97863 95271 95600 94374 91445 88621 90200 93016
30040 93016 99479 102627 103786 101735 101384 101660 102412 97688 97109 93736 93678 97354 98330 98360 97622 97575 95940
30023 95940 98026 96335 91887 95874 97796 96150 98629 107631 108579 103222 97940 96817 99684 105071 106722
30008 106722 108974 107025 108090 111932 106844 104167 103423 99956 99675 100645 101328 104688 104895 100796 97522
29993 97522 97119 93164 97401 101953 103704 101326 94500 92910 96626 95019 92293 95313 96803 98018 97600
29978 97600 97652 103071 99028 101166 100889 98146 96958 102273 102261 100973 96870 100151 107637 112068 105177 100388
29962 100388 99305 100152 98433 98248 99450 100426 100220 103430 101506 100160 106170 112911 109650 105658 105857
29947 105857 100656 103211 104755 103611 101516 100203 96150 98758 98767 100619 103149 102791 102674 102745 100896 99120
29931 99120 100767 98677 97140 100888 102308 101246 98143 102064 105600 105076 100735 101649 104421 106967 102568
29916 102568 102082 100968 96691 99486 99566 97509 96503 101721 105853 101337 101993 102108 107442 102539 100363
29901 100363 96073 95906 100954 107367 110771 109399 100309 99060 100141 99101 96957 96191 96102 100040 100717
29886 100717 98726 97813 99814 104974 104714 101469 101940 104708 104497 100823 95605 97237 100406 101932 101017
29871 101017 103679 103268 101234 97494 97072 98172 99497 102616 98485 97287 98368 99170 104546 106036 112224
29856 112224 111161 106787 105051 105258 101774 95320 99808 103697 102905 103273 103085 102910 98709 96416 97895
29841 97895 101987 103849 101610 102205 101451 97980 102571 103797 101339 98390 97660 100550 98843 97891 101135
29826 101135 101903 99141 97971 96935 96756 101715 98771 94508 95805 94433 99786 102866 99415 96832 96678
29811 96678 97159 98934 98177 98873 98583 100027 100158 104608 104805 108902 106824 100672 97156 100706 106783 107546
29795 107546 107555 105302 101016 102549 103071 103411 99984 96692 98095 96644 96002 96182 96596 96085 99125 96225
29779 96225 100136 105010 107154 103120 102767 101180 104145 106990 106473 105550 102816 107314 106216 105503 109175
29764 109175 111242 109754 108215 105866 108631 106240 102735 101335 100551 102045 102186 97170 94783 94954 98377
29749 98377 98769 99926 98064 97576 99073 98279 100633 105194 107202 107795 108262 105869 103670 100115 102970 107245
29733 107245 111480 114376 109235 107292 108109 105492 106330 107376 104184 103585 99094 103002 106002 101905 99264
29718 99264 96778 104722 108701 104548 103184 99945 96127 94165 95501 95928 99925 96772 95812 95908 94499
29703 94499 99739 100286 102598 100640 107005 110283 108440 102155 101594 103317 101420 101919 103873 104329 100427
29688 100427 98155 99006 102692 101581 99087 101390 105432 102207 98776 99115 101541 98850 100549 99574 100531
29673 100531 101011 105479 106177 105341 101073 94996 96782 104065 106657 106777 108247 109083 109061 103341 99820 102033
29657 102033 104275 106326 103018 100289 102297 103793 103439 99514 101047 101687 100996 102221 106127 101272 101274 104584
29641 104584 101608 99138 97764 98444 98340 98215 95674 97210 97742 99171 102470 103790 105772 110413 106999
29626 106999 104336 104461 104830 105180 106853 110704 112941 110991 106361 100557 95366 93702 98190 103695 100532
29611 100532 99497 101853 104893 103265 104711 106323 109099 108023 104969 97943 100802 106051 106113 98835 97027
29596 97027 103620 105819 105451 110392 107843 105846 108224 104497 102445 99470 99256 99216 100566 104356 104472 102468
29580 102468 102762 103213 104739 100050 98404 103201 105210 102370 97587 97278 99638 105441 109700 108710 108882
29565 108882 106631 103792 102064 103616 103823 107182 108331 106455 102748 100294 99038 97938 99014 104451
29551 104451 103578 104620 106243 104523 100193 102284 100920 98860 96723 100594 108048 113246 111860 105168
29537 105168 105967 106019 102895 106533 104118 103968 106370 110451 110383 108905 106379 105446 108226 105430 103135 103984
29521 103984 106837 103739 102887 103228 100225 102050 101910 106058 109697 107612 102978 105870 106047 108718 107327
29506 107327 104744 107509 107253 104142 104073 106819 107081 106288 104903 101910 100489 98370 93268 90990 93572
29491 93572 99192 99789 95135 94934 97717 105744 105369 102478 105667 103088 101235 99899 97453 98329 102426
29476 102426 103558 103944 103362 99791 96794 98271 101031 104861 108027 107317 107748 107002 103452 97187 95502
29461 95502 97370 98379 107470 103833 101831 103787 105520 109499 109322 106226 103904 106926 104146 99726 97508
29446 97508 100012 105547 105417 108688 108777 105643 108484 114267 110560 106018 104537 102352 99224 104653 102510
29431 102510 102354 102304 103701 106769 107383 109380 107661 106787 106252 103334 102052 99363 98426 98340 98779 103348 100405
29414 100405 95809 95118 99339 103618 104831 103599 100648 96190 99659 101815 100111 101677 103871 102444
29400 102444 101104 97529 98951 100465 103052 99812 103392 105190 101334 100232 100386 99717 101440 110217 115474
29385 115474 107567 106643 107659 108867 106952 105376 101653 99816 99423 99430 100553 101201 105120 102211 107578 111163
29369 111163 110122 110539 110599 104737 102396 104392 106871 102900 99158 99478 99340 97958 93211 92242 97856 102538
29353 102538 104762 107691 107495 103536 107298 104699 102546 103760 106120 111183 111278 107265 102853 104086 107953
29338 107953 109088 107428 107434 104870 105763 106018 105278 109687 111157 114927 117043 113252 109768 111714 113962 111300
29322 111300 110741 110164 102640 99423 99029 101875 103856 105020 102699 97029 95587 96341 101200 105370 109761
29307 109761 107257 105595 104151 102789 105137 108526 106778 101779 97979 101034 105007 105852 106769 106710 106164
29292 106164 102519 101184 100494 102601 102529 102201 101378 101472 102971 107521 109273 110616 110678 108777 108939 109309 110232
$$ [...]
##END NTUPLES=NMR SPECTRUM
##END=
