##TITLE=Analysis number 319300
Compound Code cc 46246
Book Reference 440/180
Project Code adrs
Chemist Name craigr
##JCAMPDX= 6.0         $$ Bruker NMR JCAMP-DX V2.0
##DATA TYPE= NMR SPECTRUM
##DATA CLASS= NTUPLES
##ORIGIN= Bruker BioSpin GmbH
##OWNER= nmr
$$ XWIN-NMR		Version 3.5
$$ Tue May  9 14:26:05 2006 GMT Daylight Time (UT+1h)  MAYBRIDGE\nmr@NMR_250MHZ
##.OBSERVE FREQUENCY= 250.131544655141
##.OBSERVE NUCLEUS= ^1H
##.ACQUISITION MODE= SIMULTANEOUS (DQD)
##.ACQUISITION SCHEME= undefined
##.AVERAGES= 16
##.DIGITISER RES= 18
##SPECTROMETER/DATA SYSTEM= dpx250
##.PULSE SEQUENCE= zg30
##.SOLVENT NAME= CDCl3
##.SHIFT REFERENCE= (INTERNAL, CDCl3, 0, 16.522)
##AUDIT TRAIL= $$ (NUMBER, WHEN, WHO, WHERE, WHAT)
$$ ##TITLE= Audit trail, XWIN-NMR		Version 3.5
$$ ##JCAMPDX= 5.01
$$ ##ORIGIN= Bruker BioSpin GmbH
$$ ##OWNER= nmr
$$ C:\u/data/dgb/nmr/ADRS/3980/pdata/1/auditp.txt
$$ ##AUDIT TRAIL=  $$ (NUMBER, WHEN, WHO, WHERE, WHAT)
(   1,<2006-05-09 14:25:39.66 +100>,<MAYBRIDGE\nmr>,<NMR_250MHZ>,
      <created by zg, POWCHK disabled, PULCHK disabled
       configuration hash MD5:
       84 BC 41 DB A1 6E 1D 46 DA 25 12 A5 C1 ED C5 3A
       data hash MD5: 64K
       57 4A D1 B5 0A DF 76 8E FC 6B 4F 9B 96 7C 87 DC>)
(   2,<2006-05-09 14:25:55.03 +100>,<MAYBRIDGE\nmr>,<NMR_250MHZ>,
      <Start of raw data processing
       ef LB = 0.3 FT_mod = 6 PKNL = 1 SI = 32K 
       data hash MD5: 32K
       F0 ED 02 02 A2 36 E2 06 22 1A 4B 55 B1 00 54 CA>)
(   3,<2006-05-09 14:25:56.66 +100>,<MAYBRIDGE\nmr>,<NMR_250MHZ>,
      <apk 
       data hash MD5: 32K
       B3 CC 33 80 03 92 B7 72 3C 38 BD E3 5B 43 C0 5D>)
(   4,<2006-05-09 14:25:57.41 +100>,<MAYBRIDGE\nmr>,<NMR_250MHZ>,
      <abs ABSG = 5 
       data hash MD5: 32K
       D4 47 2B 53 C2 EB B9 E8 BB 0F DC E9 5B 47 52 F2>)
$$ ##END=
$$ 
$$ hash MD5
$$ E8 86 1A B1 D5 B8 02 C7 46 A7 25 A6 85 1A 7C 08
##$RELAX= 
##$RELAX= 
##$RELAX= 
##$RELAX= 
##$RELAX= 
##$RELAX= 
##$RELAX= 
$$ Bruker specific parameters
$$ --------------------------
##$DU= <C:\u>
##$EXPNO= 3980
##$NAME= <ADRS>
##$PROCNO= 1
##$TYPE= <nmr>
##$USER= <dgb>
##$AMP= (0..31)
100 100 100 100 100 100 100 100 100 100 100 100 100 100 100 100 100 100 
100 100 100 100 100 100 100 100 100 100 100 100 100 100 
##$AQSEQ= 0
##$AQ_mod= 3
##$AUNM= <au_zg>
##$AUTOPOS= <44 >
##$BF1= 250.13
##$BF2= 250.13
##$BF3= 250.13
##$BF4= 250.13
##$BF5= 500.13
##$BF6= 500.13
##$BF7= 500.13
##$BF8= 500.13
##$BYTORDA= 1
##$CFDGTYP= 0
##$CFRGTYP= 5
##$CHEMSTR= <none>
##$CNST= (0..31)
1 1 145 1 1 1 1 1 1 1 1 1 1 1 1 1 1 1 1 1 1 1 1 1 1 1 1 1 1 1 1 1 
##$CPDPRG= <>
##$CPDPRG1= <>
##$CPDPRG2= <>
##$CPDPRG3= <>
##$CPDPRG4= <mlev>
##$CPDPRG5= <mlev>
##$CPDPRG6= <mlev>
##$CPDPRG7= <mlev>
##$CPDPRG8= <mlev>
##$CPDPRGB= <>
##$CPDPRGT= <>
##$D= (0..31)
0 1 0 0 0 0 0 0 0 0.06 0 0 0 0 0 0 0.0002 0 0 0 0 0 0 0 0 0 0 0 0 0 0 
0 
##$DATE= 1147181138
##$DBL= (0..7)
120 120 120 120 120 120 120 120 
##$DBP= (0..7)
150 150 150 150 150 150 150 150 
##$DBP07= 0
##$DBPNAM0= <>
##$DBPNAM1= <>
$$ [...]
##$SUBNAM6= <"">
##$SUBNAM7= <"">
##$SUBNAM8= <"">
##$SUBNAM9= <"">
##$SW= 20.6930455092707
##$SWIBOX= (0..15)
0 0 3 0 0 0 0 0 0 0 0 0 0 0 0 0 
##$SW_h= 5175.983436853
##$TD= 65536
##$TD0= 1
##$TE= 295.16
##$TE2= 300
##$TE3= 300
##$TEG= 300
##$TL= (0..7)
0 120 120 120 120 120 120 120 
##$TP= (0..7)
150 150 150 150 150 150 150 150 
##$TP07= 0
##$TPNAME0= <>
##$TPNAME1= <>
##$TPNAME2= <>
##$TPNAME3= <>
##$TPNAME4= <>
##$TPNAME5= <>
##$TPNAME6= <>
##$TPNAME7= <>
##$TPOAL= (0..7)
0.5 0.5 0.5 0.5 0.5 0.5 0.5 0.5 
##$TPOFFS= (0..7)
0 0 0 0 0 0 0 0 
##$TUNHIN= 0
##$TUNHOUT= 0
##$TUNXOUT= 0
##$USERA1= <user>
##$USERA2= <user>
##$USERA3= <user>
##$USERA4= <user>
##$USERA5= <user>
##$V9= 5
##$VALIST= <valist>
##$VCLIST= <CCCCCCCCCCCCCCC>
##$VD= 0
##$VDLIST= <DDDDDDDDDDDDDDD>
##$VPLIST= <PPPPPPPPPPPPPPP>
##$VTLIST= <TTTTTTTTTTTTTTT>
##$WBST= 1024
##$WBSW= 4
##$XGAIN= (0..3)
0 0 0 0 
##$XL= 0
##$YL= 0
##$YMAX_a= 352134
##$YMIN_a= -564760
##$ZGOPTNS= <>
##$ZL1= 120
##$ZL2= 120
##$ZL3= 120
##$ZL4= 120
##$ABSF1= 16.522
##$ABSF2= -4.171173
##$ABSG= 5
##$ABSL= 3
##$ALPHA= 0
##$AQORDER= 0
##$ASSFAC= 0
##$ASSFACI= 0
##$ASSFACX= 0
##$ASSWID= 0
##$AUNMP= <proc_1d>
##$AZFE= 0.1
##$AZFW= 0.1
##$BCFW= 0
##$BC_mod= 0
##$BYTORDP= 0
##$COROFFS= 0
##$CY= 12.5
##$DATMOD= 1
##$DC= 0
##$DFILT= <>
##$DTYPP= 0
##$F1P= 14.0000005364418
##$F2P= -0.99999901652339
##$FCOR= 0.5
##$FTSIZE= 32768
##$FT_mod= 6
##$GAMMA= 0
##$GB= 0
##$INTBC= 1
##$INTSCL= 1
##$ISEN= 128
##$LB= 0.3
##$LEV0= 0
##$LPBIN= 0
##$MAXI= 10000
##$MC2= 0
##$MEAN= 0
##$ME_mod= 0
##$MI= 0
##$NCOEF= 0
##$NC_proc= -3
##$NLEV= 6
##$NOISF1= 0
##$NOISF2= 0
##$NSP= 0
##$NTH_PI= 0
##$NZP= 0
##$OFFSET= 16.522
##$PC= 1
##$PHC0= 166.716
##$PHC1= 7.146974
##$PH_mod= 1
##$PKNL= yes
##$PPARMOD= 0
##$PSCAL= 4
##$PSIGN= 0
##$REVERSE= no
##$SF= 250.13
##$SI= 32768
##$SIGF1= 0
##$SIGF2= 0
##$SINO= 400
##$SIOLD= 32768
##$SREGLST= <1H.CDCl3>
##$SSB= 0
##$STSI= 32768
##$STSR= 0
##$SW_p= 5175.98343685301
##$SYMM= 0
##$S_DEV= 0
##$TDeff= 65536
##$TDoff= 0
##$TI= <Analysis number 999999
Compound Code 99
Book Reference 9
Project Code 9>
##$TILT= no
##$TM1= 0
##$TM2= 0
##$TOPLEV= 0
##$USERP1= <user>
##$USERP2= <user>
##$USERP3= <user>
##$USERP4= <user>
##$USERP5= <user>
##$WDW= 1
##$XDIM= 32768
##$YMAX_p= 311256558
##$YMIN_p= -84093
$$ End of Bruker specific parameters
$$ ---------------------------------
##NTUPLES= NMR SPECTRUM
##VAR_NAME=  FREQUENCY,     SPECTRUM/REAL,   SPECTRUM/IMAG
##SYMBOL=    X,             R,               I
##VAR_TYPE=  INDEPENDENT,   DEPENDENT,       DEPENDENT
##VAR_FORM=  AFFN,          ASDF,            ASDF
##VAR_DIM=   32768,         32768,           32768
##UNITS=     HZ,            ARBITRARY UNITS, ARBITRARY UNITS
##FACTOR=    0.157963299565203, 1,           1
##FIRST=     4132.6476996994, 0,             0
##LAST=      -1043.33573715361, 0,           0
##MIN=       -1043.33573715361, -84093,      0
##MAX=       4132.6476996994, 311256558,     0
$$ Real data points
##PAGE= N=1
##DATA TABLE= (X++(R..R)), XYDATA
$$ [...]
16600D4883L0022n284r896J5130j8377p370n529q61M041k5187j2032p865q931
$$ 44883 74905 69621 59725 74855 56478 49108 43579 42718 46759 21572 9540 1675 -7256
16587g256K0919J5461q342M433M510o893K1604P685M871j4440n670q588j4052
$$ -7256 13663 29124 20782 25215 29725 22832 44436 52121 56992 42552 36882 28294 14242
16574A4242l010K016k526J178p864j062l418P659j0562m188K7380J6965o439l032
$$ 14242 11232 13248 10722 11900 4036 2974 -444 7215 -3347 -7535 19845 36810 30371 27339
16560B7339P059K646M339N128J0702L5501N8699K7849Q525j447J6603K819J2881
$$ 27339 34398 37044 41383 46511 57213 92714 151413 179262 187787 186340 202943 205762 218643
16547B18643K9471n199m2172n1936l0078m0258k1988P20J87m028J187R139k8L1203
$$ 218643 248114 242915 200743 148807 118729 78471 56483 57203 57390 53362 54549 63688 63660 94863
16533I4863L7754L7984K4560L7571J3824j458m770Q857j7689l2844n1458l5892
$$ 94863 132617 170601 195161 232732 246556 245098 240328 249185 231496 198652 147194 111302
16521A11302o524j635j4817j6902j3944n43O120j1900Q435R812n551Q062N497
$$ 111302 104778 103143 88326 71424 57480 56937 63057 51157 59592 69404 63853 71915 77412
16508G7412p661n288k0065o831o429j7838J1429k0861L161J7671q212k5233j2608
$$ 77412 69751 64463 44398 37567 31138 13300 24729 3868 7029 24700 16488 -8745 -21353
16495b1353L2473M695k994J740k700J1204K112J1300p93j1063o825l588M772r678
$$ -21353 11120 15815 12821 14561 11861 23065 25177 36477 35684 24621 17796 14208 18980 9302
16481I302l0870k909J8176j0454m1j619L833k811J0116J8371J5408J162l987k681
$$ 9302 -21568 -24477 -6301 -16755 -16796 -18415 -14582 -17393 -7277 11094 26502 27664 23677 20996
16467B0996q323j5871L126j0552O404J4728k556N51J9996r228j8263M221j3500
$$ 20996 12673 -3198 -72 -10624 -4220 10508 7952 8503 28499 19271 1008 5229 -8271
16454h271K609K2543j485q959J8356O091l618J2016K031J3050o116r650j358o622
$$ -8271 -5662 16881 15396 6437 24793 30884 27266 39282 41313 54363 48247 38597 37239 30617
16440C0617M207K974k6636j8996P397k1101O115m033n102K083Q197Q204Q601J0772
$$ 30617 34824 37798 11162 -7834 -437 -21538 -15423 -19456 -24558 -22475 -14278 -6074 2527 13299
16426A3299J0035K435j1265j9610k0036L388J8794j4612o943P364l354j1265M465
$$ 13299 23334 25769 14504 -5106 -25142 -21754 -2960 -17572 -24515 -17151 -20505 -31770 -27305
16413b7305j0062J5913K9108P198l693L554L891o183j8981K0646J5184N335J2352
$$ -27305 -37367 -21454 7654 14852 11159 14713 18604 12421 -6560 14086 29270 34605 46957
16400D6957j2307j2272O765k019o535j1471k6726m750J9504M584l256L579j0529
$$ 46957 34650 22378 29143 27124 20589 9118 -17608 -22358 -2854 1730 -1526 2053 -8476
16387h476k9982l818K5802K2908M392Q595O316Q966J846J1819K1368M0437N3931
$$ -8476 -38458 -42276 -16474 6434 10826 19421 25737 34703 36549 48368 69736 110173 164104
16374A64104J9150J793l7407n0549l7563j1722Q068K6650K3183K4900M4657L2375
$$ 164104 183254 185047 147640 97091 59528 47806 55874 82524 105707 130607 175264 207639
16362B07639L0504j9610n2122m2173l8399L775J632R512M8796L3735j217K2201
$$ 207639 238143 218533 166411 124238 85839 89614 91246 100758 149554 183289 182072 204273
16350B04273k0090k1375l9631j7430j9824J5239N412J2915M1957J9359R598j8632
$$ 204273 184183 162808 123177 105747 85923 101162 106574 119489 161446 180805 190403 171771
16338A71771n4708j8912k7661j0793k4555O719R248L475n853j4077R658J4843
$$ 171771 117063 98151 70490 59697 35142 41861 51109 54584 48731 34654 44312 59155
16326E9155j3442r357j5890o29O237p28q157K988L691M707J9938K033j228j9274
$$ 59155 45713 36356 20466 19837 26074 25346 17189 20177 23868 28575 48513 50546 49318 30044
16312C0044j3952j1716J120K3003L899J6330K689r054K662j2740l1371Q925J3592
$$ 30044 16092 4376 5496 28499 32398 48728 51417 42363 45025 32285 914 9839 23431
16299B3431J2405J464l083k5985P51P047Q77j3264n261J4347j3186k6432L029
$$ 23431 35836 37300 34217 8232 8983 16030 16907 3643 -1618 12729 -457 -26889 -23860
16286b3860J0511K9769J5073o335o725M01m603j099M656J0010P928j3762K286
$$ -23860 -13349 16420 31493 25158 18433 18834 14231 13132 17788 27798 35726 21964 24250
16273B4250O533n438j1196j0128j0630K4512Q625r447j5430j6883J2281q052K543
$$ 24250 30783 25345 14149 4021 -6609 17903 26528 17081 1651 -15232 -2951 -11003 -8460
16260h460M163P838j9154m253O71J0098j11R70M511K833Q494L386O225O03j7299
$$ -8460 -4297 3541 -15613 -19866 -19195 -9097 -9208 -8238 -3727 -894 7600 10986 17211 17814 515
16245E15O045J2727j4969j4064J986j6346j519J6290J1881P895k1955q32M710
$$ 515 6560 19287 4318 -9746 -7760 -24106 -25625 -9335 2546 10441 -11514 -12346 -7636
16232g636Q501l899o385P003K426k629K51K161P724n919P894n676K1145J3187
$$ -7636 865 -3034 -9419 -2416 10 -2619 -2368 -207 7517 1598 9492 3816 24961 38148
16218C8148o155K949R065M253k9675j8550M264j9518j8789l824o299K2436J0850
$$ 38148 31993 34942 44007 48260 18585 35 4299 -15219 -34008 -37832 -44131 -21695 -10845
16205a0845M866K280J791m403k894J0093M366r845O723L172j310k1479J6818N299
$$ -10845 -5979 -3699 -1908 -6311 -9205 888 5254 -4591 2132 5304 3994 -17485 -667 4632
16191D632j5095q44J0072n613l806p642J7938J892j1837l449o786K083p208J497
$$ 4632 -10463 -11307 -1235 -6848 -10654 -18296 -358 1534 -10303 -13752 -20538 -18455 -25663 -24166
16177b4166L954m604J456J057j1369J8642K2959j2607j9040M555l767j995J5568
$$ -24166 -20212 -24816 -23360 -22303 -33672 -15030 7929 -4678 -23718 -19163 -22930 -24925 -9357
16164i357j982j9795p92J5858q816q075O025J3234k989q728l797l990j9968J0969
$$ -9357 -11339 -31134 -31926 -16068 -24884 -32959 -26934 -13700 -16689 -25417 -29214 -33204 -53172 -42203
16150d2203J8526L084K201n405M972j4546l061K0555K5427K131m105p746n012
$$ -42203 -23677 -20593 -18392 -23797 -18825 -33371 -36432 -15877 9550 11681 7576 -170 -5182
16137e182O789j2690m343n692n117J0743L2266K834j4855k2486N900J5820r800
$$ -5182 1607 -11083 -15426 -21118 -26235 -15492 16774 19608 4753 -17733 -11833 3987 -5813
16124e813j4740J5752R684K465j2733M37j0328K1785L398j0145o152J1838q043
$$ -5813 -20553 -4801 4883 7348 -5385 -4948 -15276 6509 9907 -238 -6390 5448 -2595
16111b595q600j0173J2343j4959j4113Q058J5014p409k294K2670p190j8380k96
$$ -2595 -11195 -21368 -9025 -23984 -38097 -30039 -15025 -22434 -24728 -2058 -9248 -27628 -27924
16098b7924k0513j4789J7801L4611N685j0657J321j3848o078j1721P101J2433
$$ -27924 -48437 -63226 -45425 -10814 -5129 -15786 -14465 -28313 -34391 -46112 -39011 -26578
16086b6578o33j417J3223J161L643Q743R899N652j2280j6498j7198r672J1967
$$ -26578 -27211 -28628 -15405 -14244 -10601 -1858 8041 13693 1413 -15085 -32283 -41955 -29988
16073b9988J4571K813J1588j592m671j8667n403J4718m279j0022R271j9579L818
$$ -29988 -15417 -12604 -1016 -2608 -7279 -25946 -31349 -16631 -20910 -30932 -21661 -41240 -37422
16060c7422J1624K1623K1042K932j5391R70j1506j3106n292K4151K6147N117j5778
$$ -37422 -25798 -4175 16867 19799 4408 5378 -6128 -19234 -24526 -375 25772 30889 15111
16047A5111q820J6035K4024k062J1314j5782k1190J1794L570j6154j7954j4036
$$ 15111 6291 22326 46350 44288 55602 39820 18630 30424 33994 17840 -114 -14150
16035a4150%J5719j7180j7349o788J3838n51j1038p741o364R182K7122Q769j2463
$$ -14150 -14150 1569 -15611 -32960 -39748 -25910 -26461 -37499 -45240 -51604 -42422 -15300 -6531 -18994
16021a8994j640L5R80j6303R680L914J0537J495j6251q300J1034K1082O584N145
$$ -18994 -20634 -20599 -19619 -35922 -26242 -22328 -11791 -10296 -26547 -34847 -23813 -2731 3853 8998
16007H998n380J993J3670J828j7301M566K375n529j2047j3346p142l537N898o075
$$ 8998 3618 5611 19281 21109 3808 8374 10749 5220 -6827 -20173 -27315 -30852 -24954 -31029
15993c1029J985L0604J1184J2536K119j9384l023j9421R54O179Q624N07o911J811
$$ -31029 -29044 1560 12744 25280 27399 8015 4992 -14429 -13475 -7296 1328 1835 -5076 -3265
15979c265O197j2879o747J8043R500O16j0057p391j1200l0528j2451J8815K5759
$$ -3265 2932 -9947 -16694 1349 10849 11465 1408 -5983 -17183 -47711 -60162 -41347 -15588
15966a5588J3446o781j2303Q076O515J173J4566l156L750L55Q566l107l966K969
$$ -15588 -2142 -8923 -21226 -13150 -6635 -5462 9104 5948 9698 10053 18619 15512 11546 14515
15952A4515q456k6582j4581N099J2492N974P762r44m282J1752J3904l803M620
$$ 14515 6059 -20523 -35104 -30005 -17513 -11539 -3777 -4721 -9003 2749 16653 12850 17470
15939A7470j6821j2331R183M769m673J346K321o473m396o431J564K9186J169q988
$$ 17470 649 -11682 -2499 2270 -2403 -1057 1264 -5209 -9605 -16036 -14472 14714 15883 6895
15925F895j5518N278J4330j5780j9249P810Mq187k1027j5135P267K2868J4028
$$ 6895 -8623 -3345 10985 -4795 -24044 -16234 -16230 -24417 -45444 -60579 -53312 -30444 -16416
15912a6416L76K305k350N323p052q349o677K0626J980j1609j0641P196r667J0420
$$ -16416 -16040 -13735 -16085 -10762 -17814 -26163 -32840 -12214 -10234 -21843 -32484 -25288 -34955 -24535
15898b4535J8959j2153j589r25n806j588R48J1934J6037O863M590j1321q372K826
$$ -24535 -5576 -17729 -19318 -20243 -26049 -27637 -26689 -14755 1282 8145 12735 1414 -6958 -4132
15884d132L483l391o474J2360R8n11O243l191J4263q653j0120k871J548J6024
$$ -4132 -649 -4040 -10514 1846 1944 1433 7676 4485 18748 10095 -25 -2896 -1348 14676
15870A4676L9n052q136j4030k2670L901P280j2011J5915K7396J218q664J8443
$$ 14676 14715 9663 1527 -12503 -35173 -31272 -23992 -36003 -20088 7308 8526 -138 18305
15857A8305o762k6842j968K6631P424j5557j5169Q792l278N769p298p347k559
$$ 18305 11543 -15299 -17267 9364 16788 1231 -13938 -5146 -8424 -2655 -9953 -17300 -19859
15844a9859K779P512r332J268r41k298K392m07k33k22M23M615R196J1050J5629
$$ -19859 -17080 -9568 -18900 -17632 -18573 -20871 -18479 -18886 -19119 -19341 -18918 -14303 -5107 5943 21572
15829B1572l149N19m049j4213k838K537K244j3931j2053J7518O064J4131O498
$$ 21572 18423 18942 14893 680 -2158 379 2623 -11308 -23361 -5843 221 14352 20850
15816B0850J416j5637j3562K530q744p659J5816J7178q087N139P244m465j2728
$$ 20850 22266 6629 -6933 -4403 -13147 -20806 -4990 12188 4101 9240 16484 12019 -709
15803g09j9225j3414J0282Q630J4397J0505j5106j0102J150k945n957r118p056
$$ -709 -19934 -33348 -23066 -14436 -39 10466 -4640 -14742 -13592 -16537 -22494 -31612 -38668
15790c8668l418K0848J2259j6060l363J2239K045P700K1816l509l386L106L04
$$ -38668 -42086 -21238 -8979 -25039 -28402 -16163 -14118 -6418 15398 11889 8503 11609 11913
15777A1913n294J4501M196j1347n598k452N155L432l35J0930K112p098p355M08
$$ 11913 6619 21120 25316 13969 8371 5919 11074 14506 14171 25101 27213 20115 12760 13168
15763A3168j4736n888P434M212r495l420L386L63L145r344j6059p399j5990J6361
$$ 13168 -1568 -7456 -22 4190 -5305 -8725 -5339 -4976 -1831 -11175 -27234 -34633 -50623 -34262
15749c4262J8958J3837j0477M604k052j429K1656k084o312P415r274M785J8824
$$ -34262 -15304 -1467 -11944 -7340 -9392 -10821 10835 8751 2439 9854 580 5365 24189
15736B4189n679J770L519j604j9739Q107j0839O02J097L092j568j3499J455J0361
$$ 24189 18510 20280 23799 22195 2456 10563 -276 326 1423 4515 2947 -10552 -9097 1264
15722A264o038j5570j2961R2J667K5565l911r899j7648q234K650J6966N274J4702
$$ 1264 -4774 -20344 -33305 -33213 -31546 -5981 -9892 -19791 -37439 -45673 -43023 -26057 -20783 -6081
15708f081K0975J2727j6248j2353k6041l656O307Q715K187k231N932N378m925
$$ -6081 14894 27621 11373 -980 -27021 -30677 -24370 -15655 -13468 -15699 -9767 -4389 -9314
15695i314J9330n759k0348L1782J0936k1588j8849m228K0111J0531p894O857j3147
$$ -9314 10016 4257 -16091 15691 26627 5039 -13810 -18038 2073 12604 4710 11567 -1580
15682a580m812J0572M0J648J1903J6292M194J390k7660n790O779j423j2166m120
$$ -1580 -6392 4180 4220 5868 17771 34063 38257 39647 11987 6197 12976 11553 -613 -4733
15668d733M718R64J0622o526k809j0330J6963O696P850j1653j7732L700m30J197
$$ -4733 -15 949 11571 5045 2236 -8094 8869 15565 23415 11762 -5970 -2270 -2700 -1503
15654a503M138J666p438k7975p564J4049K6072J885m366l137j5656k2135L641
$$ -1503 2635 4301 -3137 -31112 -38676 -24627 1445 3330 -1036 -4173 -19829 -41964 -38323
15641c8323K3850J6316J139j635l0845k2461Q747J0843K1578P028J5282L677k036
$$ -38323 -14473 1843 2982 1347 -29498 -51959 -43212 -32369 -10791 -3763 11519 15196 13160
15628A3160K072L082o759k287l0764N420K7274K9164K026k6569j1541K784P92
$$ 13160 15232 18314 11555 9268 -21496 -16076 11198 40362 42388 15819 4278 7062 7854
15615G854L861l065l483L383j1609P324J738r20j7768j4491r8K7591J8762k7874
$$ 7854 11715 8650 5167 8550 -3059 4265 6003 5083 -12685 -27176 -27274 317 19079 -8795
15601h795j1546k068K4735J2737k019l0741N374J1576M207j6785n789q874N834
$$ -8795 -20341 -22409 2326 15063 13044 -17697 -12323 -747 3460 -13325 -19114 -27988 -22154
15588b2154J0794N134l507N625o20Q030J690o941O710J3835m398Q004L4392j4336
$$ -22154 -11360 -6226 -9733 -4108 -4728 3302 4992 -1949 4761 18596 14198 22202 56594 42258
15574D2258k4890j9135p37o196j0687M910j1359K975M416k6851o331J1019J8385
$$ 42258 17368 -1767 -2504 -8700 -19387 -14477 -25836 -22861 -18445 -45296 -51627 -40608 -22223
15561b2223L283j747k447L319r883P926J0778L405K0069o906j1551r801k2926
$$ -22223 -18940 -20687 -23134 -19815 -29698 -21772 -10994 -7589 12480 5574 -5977 -15778 -38704
15548c8704n439J5610J1552J3723j2998j1217k511K0749k906K781j346j0313j1615
$$ -38704 -44143 -28533 -16981 -3258 -16256 -27473 -29984 -9235 -12141 -9360 -10706 -21019 -32634
15535c2634k162R536J1191m806p659o2p865L056j4384Q497J8312K677R899R01
$$ -32634 -34796 -25260 -14069 -18875 -26534 -26596 -34461 -31405 -45789 -37292 -18980 -16303 -6404 -5503
15521e503k2322k2897J0311K0104J3054P659O89j82j5177j5749K1826K2372m696
$$ -5503 -27825 -50722 -40411 -20307 -7253 406 1095 913 -14264 -30013 -8187 14185 9489
15508I489p610j275Q167R064j7790l9635J614K1005L2767R753K0215k5624j8060
$$ 9489 1879 604 8771 17835 45 -39590 -37976 -16971 15796 25549 45764 20140 2080
15495B080Q330q719j4621L467N508j6Q357m755j9449M168j346K513R894P743l733
$$ 2080 10410 1691 -12930 -9463 -3955 -3971 4386 -369 -19818 -15650 -16996 -14483 -4589 3154 -579
15480e79M742j2896k973J0175J1908M765N858n97p761p807j7528l377J727q343
$$ -579 4163 -8733 -11706 -1531 10377 15142 21000 20403 12642 4835 -12693 -16070 -14343 -22686
15466b2686j8435M870M844j4757R516K1895K7859M854o337o100j7381j4374J9832
$$ -22686 -41121 -36251 -31407 -46164 -36648 -14753 13106 17960 11623 5523 -11858 -26232 -6400
15453f400j0367J0248o372k061r40m0n116j3791j3858J6863K7300R95M217M486
$$ -6400 -16767 -6519 -12891 -14952 -15892 -15932 -21048 -34839 -48697 -31834 -4534 -3539 678 5164
15439E164M320M423J0378p61r152M0J454k49j4215j0728n024o048k475J0278K4006
$$ 5164 9484 13907 24285 23524 14372 14412 15866 15617 1402 -9326 -14350 -20398 -22873 -12595 11411
15424A1411J4631o201k0774j3962J1072J70l874k789n655p954N588J1167j3303
$$ 11411 26042 19841 -933 -14895 -3823 -3653 -7527 -10316 -15971 -23925 -18337 -7170 -20473
15411b0473j0559j0839J0634J2119m994J4303m765q74J0741J3457j6931j7403
$$ -20473 -31032 -41871 -31237 -19118 -24112 -9809 -14574 -15448 -4707 8750 -8181 -25584
15399b5584K226J440K7636m184j0493J5958o507k0760j2671J0869m008r643K2677
$$ -25584 -23358 -21918 5718 1534 -8959 6999 492 -20268 -32939 -22070 -26078 -35721 -13044
15386a3044J1888J3379n242q680j5003p177o321J1440O786n923K1421j001k678
$$ -13044 -1156 12223 6981 -1699 -16702 -23879 -30200 -18760 -11974 -17897 3524 2523 -155
15373a55R271k352L718j7958o890n651N091J0493m341j5023l243j5710j826J3754
$$ -155 9116 6764 10482 -7476 -14366 -20017 -14926 -4433 -8774 -23797 -27040 -42750 -44576 -30822
15359c0822J8412q310k0943j6314l152P512q576J9317K2401m386O97O596J7519
$$ -30822 -12410 -20720 -41663 -57977 -61129 -53617 -62193 -42876 -20475 -24861 -24164 -17568 -49
15346d9j803k438j2988o580P960j1870J880p119R059O653j7844j247J5614K3829
$$ -49 -1852 -4290 -17278 -23858 -15898 -27768 -25888 -33007 -23948 -17295 -35139 -36386 -20772 3057
15332C057K2697j9996j9274N735J3859m591k9357k154J3747O639J6763n649n804
$$ 3057 25754 5758 -13516 -7781 6078 1487 -27870 -30024 -16277 -9638 7125 1476 -4328
15319d328j2408j7864O051J5755k084r366K3276N348K3023J2441j3330j3193l904
$$ -4328 -16736 -34600 -28549 -12794 -14878 -24244 -968 4380 27403 39844 26514 13321 9417
15306I417nJ3467J6209J6280k6799k7399j0771k788j623P447o277q988J5142P498
$$ 9417 9412 22879 39088 55368 28569 1170 -9601 -12389 -14012 -6565 -12842 -21830 -6688 810
15292H10j1460p416J3389J594o682k954n976O231O327J4694O79q822j6432K611
$$ 810 -10650 -18066 -4677 -3083 -9765 -12719 -18695 -12464 -6137 8557 9236 414 -16018 -13407
15278a3407J5545Q398j2604j7039q273M3J2349j0939R094K0512k16k4546j1808
$$ -13407 2138 10536 -2068 -19107 -27380 -27337 -14988 -25927 -16833 3679 3463 -21083 -32891
15265c2891M774J5000j9670j2049O16M70J3096m995P208k578J1733K6570K882
$$ -32891 -28117 -13117 -32787 -44836 -44220 -43750 -30654 -35649 -28441 -31019 -19286 7284 10166
15252A0166j3216J4283L462R41K1293J8481j3681l9962j9170J422R18J1201j8867
$$ 10166 -3050 11233 14695 15636 36929 55410 41729 1767 -17403 -15981 -15063 -3862 -22729
15239b2729J4007J5637k1044N053j0551j930m675J0226m076J2443M71j8817j1392
$$ -22729 -8722 6915 -14129 -9076 -19627 -21557 -26232 -16006 -20082 -7639 -7168 -25985 -37377
15226c7377P388J779K4416P056j783L498Q159o443j3683N592N938j871k4090k4782
$$ -37377 -29989 -28210 -3794 3262 1479 4977 13136 6693 -6990 -1398 4540 2669 -21421 -46203
15212d6203R812Q273O789J2955j1636j1847j5379K943J7212p878P164K1401K686
$$ -46203 -36391 -28118 -21329 -8374 -20010 -31857 -47236 -44293 -27081 -34959 -27795 -6394 -3708
15199c708O019J7917R086k1221j5387j1066l124J4026m257j0991l863P181K4232
$$ -3708 2311 20228 29314 8093 -7294 -18360 -21484 -7458 -11715 -22706 -26569 -19388 4844
15186D844k229j1104j9691J226Q656J735p415p119K7749K2844j5482j6371k553
$$ 4844 2615 -8489 -28180 -26954 -18298 -16563 -23978 -31097 -3348 19496 4014 -12357 -14910
15173a4910l09J1532J0601j5495k1446m900q41O09J2611J2600L868j782R835r38
$$ -14910 -15219 -3687 6914 -8581 -30027 -34927 -35768 -35159 -22548 -9948 -6080 -7862 1973 1035
15159A035j5107R360J6994o894j8885j3105q779K1595J6767O894j0473L952Q054
$$ 1035 -14072 -4712 12282 5388 -13497 -26602 -35381 -13786 2981 9875 -598 3354 11408
15146A1408j6618O278R557J5917j1313r753p898J55J090M779l82k631O334m883
$$ 11408 -5210 1068 10625 26542 15229 5476 -2422 -2267 -1177 3602 3220 589 6923 2040
15132B040j8651O734K3602J0324n418M968J2418N224j3098k8265q867q085J0756
$$ 2040 -16611 -9877 13725 24049 18631 23599 36017 41241 28143 -122 -8989 -17074 -6318
15119f318k83k444L219p968Q627q352j8971N106J4783J9783k457n756j0203k095
$$ -6318 -6601 -9045 -5826 -13794 -5167 -13519 -32490 -27384 -12601 7182 4725 -1031 -11234 -13329
15105a3329J3830p961k2334R154R839J470Q645K090p357K3932Q342j1713k6957
$$ -13329 501 -7460 -29794 -20640 -10801 -9331 -686 1404 -5953 17979 26321 14608 -12349
15092a2349K268j5727j4367K5183O112r612m457K667k006n50K5059n691r487L87
$$ -12349 -10081 -25808 -40175 -14992 -8880 -18492 -22949 -20282 -22288 -22838 2221 -3470 -12957 -12570
15078a2570l056m002p537K4810R103j3062l1932k645J9673J4857k89j2046j7778
$$ -12570 -15626 -19628 -27165 -2355 6748 -6314 -38246 -40891 -21218 -6361 -6650 -18696 -36474
15065c6474J672O185J2936J0694J599L486j7246j7058M157L655l360K818L218
$$ -36474 -34802 -28617 -15681 -4987 -3388 98 -17148 -34206 -30049 -26394 -29754 -26936 -23718
15052b3718l875j0243l114J1186n203p108j469J4902J7778j3725M566Q161l828
$$ -23718 -27593 -37836 -40950 -29764 -34967 -42075 -43544 -28642 -10864 -24589 -20023 -11862 -15690
15039a5690j5247J5496M872n208J0778N535r211q109J0067O371J9386j861j7810
$$ -15690 -30937 -15441 -10569 -15777 -4999 536 -8675 -16784 -6717 -346 19040 17179 -631
15026f31N243j1425J505o436P30J5772J5996p032O502j704j7535o490j0099o264
$$ -631 4612 -6813 -5308 -11744 -11014 4758 20754 13722 20224 18520 985 -5505 -15604 -21868
15012b1868P688r281j5765l682o542K213J4463J7434K0605J0434j1601k0269L12
$$ -21868 -14180 -23461 -39226 -42908 -49450 -47237 -32774 -15340 5265 15699 4098 -16171 -15859
14999a5859P467q90J2137M184j009J1279K0456j1082k0270j8244L709j5801N80
$$ -15859 -8392 -9282 2855 7039 6030 17309 37765 26683 6413 -11831 -8122 -23923 -23343
14986b3343l956l791r657N56j143J8668R149j6329k557k649J3850M95J5345J9262
$$ -23343 -27299 -31090 -40747 -40191 -41334 -22666 -13517 -29846 -32403 -35052 -21202 -20707 -5362 13900
14972A3900n102J81M366M348n850k9000j0921J9288j064m11N510j2703Q2K332
$$ 13900 8798 8979 13345 17693 11843 -17157 -28078 -8790 -9854 -10265 -4755 -17458 -17376 -15044
14958a5044r33L619j699j7640j71J7766k0610l579P458J710r094j4495M683J7147
$$ -15044 -15977 -12358 -14057 -31697 -31868 -14102 -34712 -38291 -30833 -29123 -38217 -52712 -48029 -30882
14944c0882J000m076J5240L5511K1681l4987l1069j4J7357R690l658N952k29o665
$$ -30882 -29882 -33958 -18718 16793 38474 3487 -27582 -27596 -10239 -549 -4207 1745 1516 -5149
14930e149j9868m47P237k372o013m138K504K1661N495m023l708k2768K418R979
$$ -5149 -25017 -25464 -18227 -20599 -26612 -30750 -28246 -6585 -1090 -5113 -8821 -31589 -29171 -19192
14916a9192k549J748K0268p060k5838k4409M394J2138L2101J6255p170k106q973
$$ -19192 -21741 -19993 275 -6785 -32623 -57032 -52638 -40500 -8399 7856 686 -1420 -10393
14903a0393j4673Q749k328Q238J6101J5159M764n791o637j0833k8142j3334J3283
$$ -10393 -25066 -16317 -18645 -10407 5694 20853 25617 19826 13189 2356 -25786 -39120 -25837
14890b5837K528q419J7325Q493p753M940k8j1929j0538O148j5261K0311j0643
$$ -25837 -23309 -31728 -14403 -5910 -13663 -8723 -8751 -20680 -31218 -25070 -40331 -20020 -30663
14877c0663j2641M347J1351L429Q576J4545K630k2012n575j855l09Q61K3719j5954
$$ -30663 -43304 -38957 -27606 -24177 -15601 -1056 1574 -20438 -26013 -27868 -28177 -27316 -3597 -19551
14863a9551J2063O45P201J557J7009N144j6376k531n181o572p72j7724P347K9193
$$ -19551 -7488 -6843 358 1915 18924 24068 7692 5161 -20 -6592 -7364 -25088 -17741 11452
14849A1452J7729o700r39m110j1103j5859J0727o683R536j7296j4318J467N894
$$ 11452 29181 22481 21542 17432 6329 -9530 1197 -5486 4050 -13246 -27564 -26097 -20203
14836b0203J9946j710o119j456k387Q796j151l829L878l776j4819q402L355M69
$$ -20203 -257 -1967 -8086 -9542 -11929 -3133 -4284 -8113 -4235 -8011 -22830 -31232 -27877 -27408
14822b7408J77m249J3192J4672J2922q238p174k00L595j080m241L400k780K3716
$$ -27408 -27231 -31480 -18288 -3616 9306 1068 -6106 -6306 -2711 -3791 -8032 -4632 -7412 16304
14808A6304J5296m018o693J7724M423k3257k5119n051K0893N897j976k5818k0024
$$ 16304 31600 27582 20889 38613 43036 19779 -5340 -10391 10502 16399 14423 -11395 -31419
14795c1419L1634M919oJ3100j1362J277m820k856L0454N942j1770n549k5909k2502
$$ -31419 215 5134 5128 18228 6866 8143 3323 467 30921 36863 25093 19544 -6365 -28867
14781b8867J1926M68J2813K2508J7429o640k4586j483P317n478N817L69j9741
$$ -28867 -16941 -16473 -3660 18848 36277 29637 5051 3568 10885 5407 11224 11593 -8148
14768h148q885r522K745J5577p436M198j0274N730J1181M37r673l5J3288j0949
$$ -8148 -17033 -26555 -23810 -8233 -15669 -11471 -21745 -16015 -4834 -4397 -14070 -14105 -817 -11766
14754a1766k5574q144Q408K1949J5308R39q40L063j6197O229J1880J3607R821
$$ -11766 -37340 -45484 -37076 -15127 181 1120 280 3343 -12854 -6625 5255 18862 28683
14741B8683R22p061j8864j1440k4976j1196o008J0426J2891J0921J3609K231p618
$$ 28683 29605 22544 3680 -7760 -32736 -43932 -49940 -39514 -26623 -15702 -2093 138 -7480
14728g480r658o874J3560J972J1547J1357k944j9540j1443m376M961L868J8460
$$ -7480 -17138 -24012 -10452 -8480 3067 14424 11480 -8060 -19503 -23879 -18918 -15050 3410
14715C410p836k2445m753j943P013J9540k841j1070J4567K2155J1123o62j1504
$$ 3410 -4426 -26871 -31624 -33567 -26554 -7014 -9855 -20925 -6358 15797 26920 26258 14754
14702A4754P13q694k5974q086K2712j7492N220K554L932n546J1745O535R839O986
$$ 14754 15467 6773 -19201 -27287 -4575 -22067 -16847 -14293 -10361 -15907 -4162 2373 12212 19198
14688A9198p581M0K7003R695l2437k9681k0905L992R031P241k652J5878N582r303
$$ 19198 11617 11657 38660 48355 15918 -13763 -34668 -30676 -21645 -14404 -17056 -1178 4404 -4899
14674d899K3039J0097p840j8483j7010j3187q733L093J1533N163R868J1296j6749
$$ -4899 18140 28237 20397 1914 -15096 -28283 -37016 -33923 -22390 -17227 -7359 3937 -12812
14661a2812p505J3504J9867o533j6604K878l920j3332J2342k693O133k281r840
$$ -12812 -20317 -6813 13054 6521 -10083 -7205 -11125 -24457 -12115 -14808 -8675 -10956 -20796
14648b0796K3211K3208K3070j8191l1922r740N284J2057o183k3905P376K7435
$$ -20796 2415 25623 48693 30502 -1420 -11160 -5876 6181 -2 -23907 -16531 10904
14636A0904J947M025J7396j5920r314n00J7064J6519J4298k2074j3234k473j0345
$$ 10904 12851 16876 34272 18352 9038 8538 25602 42121 56419 34345 21111 18638 8293
14623H293r072l047O809Q353L0388J5341L375j6504j3387K916J7718K146L455
$$ 8293 -779 -3826 2983 11336 41724 57065 60440 43936 30549 33465 51183 53329 56784
14610E6784o531M554K70l3174k4295J5016l737j3227q943n955K889P317K206p125
$$ 56784 50253 54807 55077 21903 -2392 12624 8887 -4340 -13283 -19238 -16349 -9032 -6826 -13951
14596a3951J0174J9020J233J808J2352k0163k3193j677k052j3613J205J6336J762
$$ -13951 -3777 15243 16476 18284 30636 10473 -12720 -14397 -16449 -30062 -28857 -12521 -10759
14583a0759M270M465O878P184j119n742k3696M891K7487K515j1950j062O257j5340
$$ -10759 -6489 -2024 4854 12038 10919 5177 -18519 -13628 13859 16374 4424 3362 9619 -5721
14569e721p449N380M616q097m153J1690K5260k562J231N694k870m465k1241j8772
$$ -5721 -13170 -7790 -3174 -11271 -15424 -3734 21526 18964 20195 25889 23019 18554 -2687 -21459
14555b1459J8835J5897p24k0729J0123J270k1077m655K1218O846k771j435J6612
$$ -21459 -2624 13273 12549 -8180 1943 3213 -17864 -22519 -1301 5545 2774 1339 17951
14542A7951j326o674L504j474q835k285J4657j057j5943o450m26j0918J0577j323
$$ 17951 16625 9951 13455 11981 3146 861 15518 14461 -1482 -7932 -8358 -19276 -8699 -10022
14528a0022J9560J9848o294j0967q406j2518k072L411N506J0606j856J2654j1339
$$ -10022 9538 29386 23092 12125 3719 -8799 -10871 -7460 -1954 8652 6796 19450 8111
14515H111j7631j43q857J117j1273M645R008m594J0059L20r795j4618K615j311
$$ 8111 -9520 -9663 -18520 -17403 -28676 -24031 -15023 -19617 -9558 -9238 -19033 -33651 -31036 -32347
14501c2347J8176K2371r394K336K6524j3127l1461p475J0803R350o554q416K787
$$ -32347 -14171 8200 -1194 1142 27666 14539 -16922 -24397 -13594 -4244 -10798 -19214 -16427
14488a6427M013l0152q290J9928P900J1227J725J466J1063J0959J2918l189q222
$$ -16427 -12414 -42566 -50856 -30928 -23028 -11801 -10076 -8610 2453 13412 26330 23141 14919
14475A4919r554k2792j828J868J1762k757n994r325m703Q213J5078L768r693N006
$$ 14919 5365 -17427 -19255 -17387 -5625 -8382 -14376 -23701 -28404 -20191 -5113 -1345 -11038 -6032
14461f032O512q403K1699o170j5138l886J3896o496J5439K439j6025j8143k2665
$$ -6032 480 -7923 13776 7606 -7532 -11418 2478 -4018 11421 13860 -2165 -20308 -42973
14448d2973O656K0194j0845j251J6517R110M468K27n062L751J5566J6739j9832
$$ -42973 -36317 -16123 -26968 -28219 -11702 -2592 1876 2103 -2959 792 16358 33097 13265
14435A3265j8898o44O254N147M057r30q135j5658j0207P478N419J1761j1159j2323
$$ 13265 -5633 -6277 -23 5124 9181 8251 116 -15542 -25749 -18271 -12852 -1091 -12250 -24573
14421b4573O517l246K3926L3106m440j5587R734P96j4622j3156l664J2333J1758
$$ -24573 -18056 -21302 2624 35730 31290 15703 25437 26233 11611 -1545 -5209 7124 18882
14408A8882q404r171k2709k088J8740J0214r781l526J692j3594L238J371P410
$$ 18882 10478 1307 -21402 -23490 -4750 5464 -4317 -7843 -6151 -19745 -16507 -15136 -7726
14395g726j6729k115K7111J8189Q39J836m024k3305j2990M23O846R801N955J0525
$$ -7726 -24455 -26570 541 18730 19569 21405 17381 -5924 -18914 -18491 -11645 -1844 4111 14636
14381A4636P33l872n951k2672Q732N024O463j049q868m139R878M738M303N492
$$ 14636 15369 11497 5546 -17126 -8394 -3370 3093 2044 -6824 -10963 -1085 3653 7956 13448
14367A3448p040p230m386j370P480P783j4122k3185J2030m023N29n388l372J7208
$$ 13448 6408 -822 -5208 -6578 902 8685 -5437 -28622 -16592 -20615 -20086 -25474 -28846 -11638
14353a1638K1332J94O496k021j6707n097r910J2631j1099q550L0027J948k2509
$$ -11638 9694 9888 16384 14363 -2344 -7441 -17351 -4720 -15819 -24369 5658 7606 -14903
14340a4903O298J8835J7257K967j3803k2665p125m97j0336N767O944J8942K238
$$ -14903 -8605 10230 27487 30454 16651 -6014 -13139 -13636 -23972 -18205 -11261 7681 9919
14327I919L486o740k860J0810j4485j1126j1626L038J0184p161j3271J7521J8515
$$ 9919 13405 6665 3805 14615 130 -10996 -22622 -19584 -9400 -16561 -29832 -12311 6204
14314F204m94j5667j9011J9560N815k643J59j4636j9l319r498n346r187J726K0303
$$ 6204 5710 -9957 -28968 -9408 -3593 -6236 -6077 -20713 -20732 -24051 -33549 -38895 -48082 -46356 -26053
14299b6053L5424J3016p577j4874j102j746r46n273j552j066J2509J8727j3911
$$ -26053 9371 22387 14810 -64 -1166 -2912 -3858 -9131 -10683 -11749 760 19487 5576
14286E576q384j1040Q945J2700l129M03M346j4956r984R189O661n825l266m348
$$ 5576 -2808 -13848 -4903 7797 4668 5071 9417 -5539 -15523 -6334 327 -5498 -8764 -13112
14272a3112K483Q757K3802l2558m4947K6933L0629J8937j0315n553N778j2652
$$ -13112 -10629 -1872 21930 -10628 -55575 -28642 1987 20924 10609 5056 10834 -1818
14260a818l3526j937O141J1450J0014K211J8599P50k6387l4580J0731J3244J6915
$$ -1818 -35344 -37281 -31140 -19690 -9676 -7465 11134 11884 -14503 -49083 -38352 -25108 -8193
14247h193J0580J964m438j9892j5718J7483K7985M352j369M593j4448L795J2926
$$ -8193 2387 4351 -87 -19979 -35697 -18214 9771 14123 12754 17347 2899 6694 19620
14234A9620m18k5585j8703J2306L3107j590l0167K345M834O723O670J3193k069
$$ 19620 19202 -6383 -25086 -12780 20327 18737 -11430 -9085 -4251 2472 9142 22335 20266
14221B0266n101K86q566P890Q101m075j7074k648l024j6194M084J7666j3244j1254
$$ 20266 15165 15451 6885 14775 22876 18801 1727 -921 -3945 -20139 -16055 1611 -11633 -22887
14207b2887k784j0455R446J7977o894j0472n580L115M328r41J2171L962K4423
$$ -22887 -25671 -36126 -26680 -8703 -15597 -26069 -31649 -28534 -24206 -25147 -12976 -9014 15409
14194A5409O163N41j0556J043o719Q69j2468n876M930Q335L190k446p645K1755
$$ 15409 21572 22113 11557 12600 5881 6750 -5718 -11594 -6664 1671 4861 2415 -5230 16525
14180A6525p245j4532J12r648Q972j3087N655l663J0006O967R448l201J0464O088
$$ 16525 9280 -5252 -5140 -14788 -5816 -18903 -13248 -16911 -6905 62 9510 6309 16773 22861
14166B2861k4827j4816K941N960K1142P720J0852j6499j8309o368J3340N030j7625
$$ 22861 -1966 -16782 -13841 -7881 13261 20981 31833 15334 -2975 -9343 3997 9027 -8598
14153h598o290j0458Q444J58n717K9320l584N57K490j5142n222M385O157k637
$$ -8598 -14888 -25346 -16902 -16744 -22461 6859 3275 3832 6322 -8820 -14042 -9657 -3500 -6137
14139f137m144n065O625j6477j6612J2263K8031J7624n068j0750K610R904J503
$$ -6137 -10281 -15346 -8721 -25198 -41810 -29547 -1516 16108 11040 290 2900 12804 14307
14126A4307R947J4676J4616n705k7171p102q244p333j2622J4774K5396L1555J9823
$$ 14307 24254 38930 53546 47841 20670 13568 5324 -2009 -14631 143 25539 57094 76917
14113G6917j4167k3062j4037Q780j0830j4064K555q501N539l455k2540r88J9493
$$ 76917 62750 39688 25651 34431 23601 9537 12092 3591 9130 5675 -16865 -17853 1640
14100A640o764p272N09K4471J896j3048K1396J1233r006r630j7155r472P859J9050
$$ 1640 -5124 -12396 -11887 12584 14480 1432 22828 34061 25055 15425 -1730 -11202 -3343 15707
14086A5707J6364r787n000N147k298J421m298m193J1178j6458k3925j2696r007
$$ 15707 32071 22284 17284 22431 20133 21554 17256 13063 24241 7783 -16142 -28838 -37845
14073c7845q203J7953K0608J03o774L418N484p79m8j2433J313J1033K7111Q769
$$ -37845 -46048 -28095 -7487 -7384 -14158 -10740 -5256 -6035 -6083 -18516 -17203 -6170 20941 29710
14059B9710o836n772k329q102q752p266r363j0912J7795K9796M262j2354m28J644
$$ 29710 22874 17102 14773 6671 -2081 -9347 -18710 -29622 -11827 17969 22231 9877 9449 11093
14045A1093L054j3395j3857q91K937k792O782N879J1543p641k6308P193J406r039
$$ 11093 14147 752 -13105 -13996 -11059 -13851 -7069 -1190 10353 2712 -23596 -16403 -14997 -24036
14031b4036k498n668J6440o040o498J8381J2499J7442J048Q103m880m340k4226
$$ -24036 -26534 -32202 -15762 -21802 -28300 -9919 2580 20022 21070 29173 24293 19953 -4273
14018d273k354J7391j3999j3462J0227K1627m111J6379N988j4128l343j6431l627
$$ -4273 -6627 10764 -3235 -16697 -6470 15157 11046 27425 33413 19285 15942 -489 -4116
14005d116O293j1661j3033K4655Q92J1745J2055J532k3222J5343m068k3529O15
$$ -4116 2177 -9484 -22517 2138 3030 14775 26830 28362 5140 20483 16415 -7114 -6499
13992f499L077j0900Q896R446K0551L256k4667N900Q897j206J1232j2902J6859
$$ -6499 -3422 -14322 -5426 4020 24571 27827 3160 9060 17957 16751 27983 15081 31940
13979C1940k21j148l694q547k2034q438J2173Q33J0429J3284J1265K976k5j2348
$$ 31940 31719 30571 26877 18330 -3704 -12142 31 864 11293 24577 35842 38818 38793 26445
13965B6445j3411j1886O487j249k5128M911O190J1078P411o384j1174N21n659
$$ 26445 13034 1148 7635 6386 -18742 -13831 -7641 3437 10848 4464 -6710 -6189 -11848
13952a1848j9225o135K6872J4266q825O88N401J4833p57j1789r724n914k026J5353
$$ -11848 -31073 -37208 -10336 3930 -4895 -4207 1194 16027 15270 3481 -6243 -12157 -14183 1170
13938A170m871k084M563J0349Q551n910k7033J885L226J776L529j696K0286k119
$$ 1170 -3701 -5785 -1222 9127 17678 11768 -15265 -13380 -10154 -8378 -4849 -6545 13741 11622
13924A1622j9843K217M410L2988p282k3372N540J5459n268q465k714j459o366
$$ 11622 -8221 -6004 -1594 31394 24112 740 6280 21739 16471 8006 5292 3833 -2533
13911b533M075J5335o381j2945k470l257K282j5417l567K7457K9827o048j0322
$$ -2533 1542 16877 10496 -2449 -4919 -8176 -5894 -21311 -24878 2579 32406 26358 16036
13898A6036J5019n49o491j7900P33o692Q751k845K5061N449K037j096j2147j6591
$$ 16036 31055 30506 24015 6115 6848 156 8907 6062 31123 36572 38609 37513 25366 8775
13884H775L656J0550m889m162m138j2126m176R435o400p412R743J2604K4133j5084
$$ 8775 12431 22981 18092 13930 9792 -2334 -6510 2925 -3475 -10887 -1144 11460 35593 20509
13870B0509L529j9851j428P088K1133M394j7130j1713l464L028j6962M038J781
$$ 20509 24038 4187 2759 9847 30980 35374 18244 6531 3067 6095 -10867 -6829 -5048
13857e048j3875j6774J893J1018J1591L479p154J2795P005N899N585M280l050
$$ -5048 -18923 -35697 -33804 -22786 -11195 -7716 -14870 -2075 4930 10829 16414 20694 17644
13844A7644k5944k8894J9780M0172J4352j7788j1917N938J7477j2575o751j2073
$$ 17644 -8300 -37194 -17414 22758 37110 19322 7405 13343 30820 18245 11494 -579
13832e79N33K974l999k647k2052l519Q365j184p402j7223N011K5389L8593j2565
$$ -579 -46 2928 -1071 -3718 -25770 -29289 -20924 -22108 -29510 -46733 -41722 -16333 22260 9695
13818I695k8799j0666o215K3602J5479j0350m81j708J0276L0085J5880J365k4244
$$ 9695 -19104 -29770 -35985 -12383 3096 -7254 -7735 -9443 833 30918 46798 48163 23919
13805B3919r103j285j2834J0428J2249J3523l378n613p602j6588J617r534p124
$$ 23919 14816 13531 697 11125 23374 36897 33519 27906 20304 3716 5333 -4201 -11325
13792a1325j817j8904k641J0654J4147K0259O39r497j0137p921P152j4230j2560
$$ -11325 -13142 -32046 -34687 -24033 -9886 10373 11012 1515 -8622 -16543 -9391 -23621 -36181
13779c6181j6378J3778J8235Q237K6250P360j6789K96n760o711L539J8442M757
$$ -36181 -52559 -38781 -20546 -12309 13941 21301 4512 4808 -952 -7663 -4124 14318 19075
13766A9075q611j2317j1810k1260k010O361L0578J5289l413N378K288j1000j3266
$$ 19075 10464 -1853 -13663 -34923 -36933 -30572 6 15295 11882 17260 19548 8548 -4718
13753d718n838Q469J2005K840j5474j1710Q268J2441J9383q992l902j586p603
$$ -4718 -10556 -2087 9918 12758 -2716 -14426 -6158 6283 25666 16674 12772 11186 3583
13740C583m902j466r254N851Q970O576l818o130r104r194j557Q531J713M749m045
$$ 3583 -1319 -2785 -12039 -6188 2782 9358 5540 -590 -9694 -18888 -20445 -11914 -10201 -5452 -9497
13725i497P581K050P728N445j8833j2253J942N767j5109q130K7578O87M108J6607
$$ -9497 -1916 134 7862 13307 -5526 -17779 -15837 -10070 -25179 -33309 -5731 -5044 -936 15671
13711A5671n542k3479k3112M248R152Q706J1716j968r771q649M106j3344n68l91
$$ 15671 10129 -13350 -36462 -32214 -23062 -14356 -2640 -4608 -14379 -23028 -18922 -32266 -32834 -33225
13697c3225J760k335K1883J7698J2577p327k875k060j5945q993J4273K2643k0361
$$ -33225 -31465 -33800 -11917 5781 18358 11031 8156 6096 -9849 -18842 -4569 18074 -2287
13684b287j0687J9312J7874r100o135n939l805n077j0529K781J7628j104j7789
$$ -2287 -12974 6338 24212 15112 8977 3038 -767 -5844 -16373 -13592 4036 2932 -14857
13671a4857j3304k630J6621O068N120j2115j1415Q970J7489J446q75J1333J2222
$$ -14857 -28161 -30791 -14170 -8102 -2982 -15097 -26512 -17542 -53 1393 518 11851 24073
13658B4073N418m19j1781j3631k0034j0271k122N659J0081l273K894O816P023
$$ 24073 29491 29072 17291 3660 -16374 -26645 -28767 -23108 -13027 -16300 -13406 -6590 433
13645D33o530j837J5530k088q459q374q514j6962j796P139Q481J1351q260K960
$$ 433 -6097 -7934 7596 5508 -2951 -11325 -19839 -36801 -38597 -31458 -22977 -11626 -19886 -16926
13631a6926M301P374p684j1626J5738p58j1807J2441K1116J9137K2620j8673k1312
$$ -16926 -12625 -5251 -12935 -24561 -8823 -9581 -21388 -8947 12169 31306 53926 35253 13941
13618A3941J3462Q280q202k7883j8567J0679J0275P8O106K8310p85P51q588j8391
$$ 13941 27403 35683 27481 -402 -18969 -8290 1985 2063 8169 36479 35694 36445 27857 9466
13604I466O16p972R343J3149Q963p582j6240N415n407j2796N595j1683K0640O420
$$ 9466 10082 2110 11453 24602 33565 25983 9743 15158 9751 -3045 2550 -9133 11507 17927
13590A7927j7996n274R611q37l479m513q181k956M584J3417K0261j6612k8975
$$ 17927 -69 -5343 4268 3431 -48 -4561 -12742 -15698 -11114 2303 22564 5952 -23023
13577b3023n933p198O549l651j4399j206R78j867j023P976N126N675J4758P207
$$ -23023 -28956 -36154 -29605 -33256 -47655 -48861 -47883 -49750 -50773 -42797 -37671 -31996 -17238 -10031
13563a0031n74k447o037R961L3058q245k3967n119o588R826M487R005n578r936
$$ -10031 -10605 -13052 -19089 -9128 23930 15685 -8282 -13401 -19989 -10163 -5676 3329 -2249 -12185
13549a2185k1454J4801L2517M168K39k990n749j2473l588J4005j3811k0958r5
$$ -12185 -33639 -18838 13679 17847 18086 15096 9347 -3126 -6714 7291 -6520 -27478 -27573
13536b7573K648N177J458K239j764R378J4686J3060N059o137j1554j3982Q728
$$ -27573 -24925 -19748 -18290 -16051 -17815 -8437 6249 19309 24368 18231 6677 -7305 1423
13523A423J2780j3113j7291j071j290K1140J3425M185J3492Q89N856j6315k6834
$$ 1423 14203 1090 -16201 -17272 -18562 2578 16003 20188 33680 34569 40425 24110 -2724
13510b724k967P068J0286K973N761m89j902k3793P365R938K361Q230J3725j5464
$$ -2724 -5691 1377 11663 14636 20397 19908 18006 -5787 1578 11516 13877 22107 35832 20368
13496B0368j1769P72K249k930j678L679k090p980k1006j0035m175J2197J5848
$$ 20368 8599 9371 11620 8690 7012 10691 8601 621 -20385 -30420 -34595 -22398 -6550
13483f550M839R632R420q321L46M591J608R626l853K336l246j5994J0244J4168
$$ -6550 -1711 7921 17341 9020 9366 13957 15565 25191 21338 23674 20428 4434 14678 28846
13469B8846J1316j893j0404R44Q780n02j4831L858r52q65K4041J6575L748l923
$$ 28846 40162 38269 27865 28809 37589 37087 22256 26114 25162 24297 48338 64913 68661 64738
13455F4738j0037j0171j790j5222k0215m870J2818j2443n742J2719o194J6182
$$ 64738 54701 44530 42740 27518 7303 2433 15251 2808 -2934 9785 3591 19773
13443A9773J5799R622j095j1902j0027j585j0585K340j211J4235J626k9683j3669
$$ 19773 35572 45194 44099 32197 22170 20585 10000 12340 11129 25364 26990 -2693 -16362
13430a6362J1761k410J3731j651M620R590Q491N885r072j2396j586k54N889O837
$$ -16362 -4601 -7011 6720 5069 9689 19279 27770 33655 24583 12187 10601 10347 16236 23073
13416B3073O534l928M976o771j8961J2063K501M67K5761l471J131j6135j368J0271
$$ 23073 29607 25679 30655 23884 4923 16986 19487 19954 45715 42244 43375 27240 25872 36143
13402C6143m171n313R13k0761j5108q650R362J7873K6452P221j9499p481N320
$$ 36143 31972 26659 27572 6811 -8297 -16947 -7585 10288 36740 43961 24462 16981 22301
13389B2301Q539o340r417J741o005k3783j3516N145J9082J4049J2019r09J014
$$ 22301 30840 24500 15083 16824 10819 -12964 -26480 -21335 -2253 11796 23815 22906 23920
13376B3920M690K346j0969j9791n65O537O930J5535j5927j0826L157J6952M516
$$ 23920 28610 30956 19987 196 -369 6168 13098 28633 12706 1880 5037 21989 26505
13363B6505j7051n897L723J6287K4262l958k0213l7770O651N215J4575J7182J865
$$ 26505 9454 3557 7280 23567 47829 43871 23658 -14112 -7461 -2246 12329 29511 31376
13350C1376K255j4095j8925j3811j0060K6422K3722j3929j2020O284k118j618
$$ 31376 33631 19536 611 -13200 -23260 3162 26884 12955 935 7219 5101 3483
13338C483J676p023j2311M089K0877P770p07m08N465R888J0919K855R997k935
$$ 3483 5159 -1864 -14175 -10086 10791 18561 17854 17446 22911 32799 43718 46573 56570 53635
13324E3635p288J722j98L67q835l564Q639q505j3835J1962J1316j7187p704L571
$$ 53635 46347 48069 47871 48238 39403 35839 44478 35973 22138 34100 45416 28229 20525 24096
13310B4096j4324J0823J6527R645k1443o010o460l923J773N452J8878j4349j3280
$$ 24096 9772 20595 37122 46767 25324 19314 12854 8931 10704 16156 35034 20685 7405
13297G405J8238J9531o524p760k9306J1348J8702J0774L772Q598j3905j5791M996
$$ 7405 25643 45174 38650 30890 1584 12932 31634 42408 46180 54778 40873 25082 30078
13284C0078P696j434j5324o066N413K985l372P071l212N159K052O532J9621K330
$$ 30078 37774 36340 21016 14950 20363 23348 19976 27047 23835 28994 31046 37578 57199 59529
13270E9529j1641j1108o018j3015L531k4436J4525J4427K3085J3228m338r513
$$ 59529 47888 36780 30762 17747 21278 -3158 11367 25794 48879 62107 57769 48256
13258D8256j0519N51J4500J3081m931J441Q33k5174k6308J7694J7014M089j2254
$$ 48256 37737 38288 52788 65869 60938 62379 63212 38038 11730 29424 46438 50527 38273
13245C8273j3570K049K583j1499o30J4249L789O272J900P018K417L067j2486k8865
$$ 38273 24703 26752 29335 17836 17206 31455 35244 41516 43416 50434 52851 55918 43432 14567
13231A4567k217O611Q051J9334L1707J2203j3903j9851j0764J871l12P121L114
$$ 14567 12350 18961 27012 46346 78053 90256 76353 56502 45738 47609 47297 54418 57532
13218E7532k6247O401p18O964p80k141N723n624P539o490P15O798j1219J5573
$$ 57532 31285 37686 36968 43932 43152 41011 46734 41110 48649 42159 42874 49672 38453 54026
13204E4026J3840J8314k387j2486j1923J0588K390J1307J8739K3759q436j1441
$$ 54026 67866 86180 83793 71307 59384 69972 72362 83669 102408 126167 117731 106290
13192A06290K3129L9902M1743M1178P3345J16854J20080R3074R5143O2705L3814
$$ 106290 129419 169321 211064 252242 325587 442441 562521 655595 750738 813443 847257
13181H47257k2908o9249r6406j07061r3617q9192p6817n7166k6740k4461j1801
$$ 847257 824349 755100 658694 551633 458016 368824 292007 234841 208101 183640 171839
13170A71839p01q846J5970j6661p571N09k2941j7651N215L098J2148l879j0581
$$ 171839 171138 162292 178262 161601 154030 154539 131598 113947 119162 122260 134408 130529 119948
13157A19948r393O747o734j4272R148q657r963j728K116j0676j8019k134J5559
$$ 119948 110555 117302 110568 96296 105444 96787 86824 85096 87212 76536 58517 56383 71942
13144G1942q47l3810n201L0513J1418J1223k548n00j1832k0038J1613l894n718
$$ 71942 71095 37285 32084 62597 74015 85238 82690 82190 70358 50320 61933 58039 52321
13131E2321L216k463n171K727r212r380J3638J9868r269R812j0446J563j2355
$$ 52321 55537 53074 47903 50630 41418 32038 45676 65544 56275 66087 55641 57204 44849
13118D4849j0445j671Q802l326K321l94O524n318J4099K757P572p283n001J5934
$$ 44849 34404 32733 41535 38209 40530 40136 46660 41342 55441 58198 65770 58487 53486 69420
13104F9420J904n449l302J8486O343r408p198j0214r109l427J3580M894J0848
$$ 69420 71324 65875 62573 81059 87402 77994 70796 60582 51473 48046 61626 66520 77368
13091G7368k3570k9680m402J2393j4106K0553J3943J0810k7627j3004m29q012
$$ 77368 53798 24118 19716 32109 18003 38556 52499 63309 35682 22678 22249 14237
13079A4237j1951N257J0891p350J816P163J5652K6464J080r063l759q939m782
$$ 14237 2286 7543 18434 11084 12900 20063 35715 62179 63259 54196 50437 41498 36716
13066C6716q614r770N840P176R935J6209j8548q304j540q591j1692o047J4329
$$ 36716 28102 18332 24172 31348 41283 57492 38944 30640 29100 20509 8817 2770 17099
13053A7099O149l627j1648J1291L6296N838k479o226j9289k4607r73L3394J3332
$$ 17099 23248 19621 7973 19264 55560 61398 58919 52693 33404 8797 7824 41218 54550
13040E4550j2559j2926K886R136j0045q180M646k224M379J348p511J2514J2844
$$ 54550 41991 29065 31951 41087 31042 22862 27508 25284 29663 31011 23500 36014 48858
13027D8858J3501L00o147Q845K2324n015L385L467p808l697k284P665K0884R858
$$ 48858 62359 62659 56512 65357 87681 82666 86051 89518 81710 78013 75729 83394 104278 114136
13013A14136M986N770K476J0744J8050l861k8542k0040j1713J0072J4415k721
$$ 114136 119122 124892 127368 138112 156162 152301 123759 103719 92006 102078 116493 113772
13001A13772k0289n157J3644p469k667j419n456N093P010J471o64j1344K691J3748
$$ 113772 93483 88326 101970 94501 91834 90415 84959 90052 97062 98533 97869 86525 89216 102964
12987A02964N973p027l9548m412P230k825o664N528k112m558Q882J94j7324J1731
$$ 102964 108937 101910 62362 57950 65180 62355 55691 61219 59107 54549 63431 63625 46301 58032
12973E8032K7849j256R284j5861r144R340n256j4350J723Q878j5587o816J3889
$$ 58032 85881 84625 93909 78048 68904 78244 72988 58638 60361 69239 53652 46836 60725
12960F0725J9185J9451k403k30K861l725N853N839P590m496O366l09k3343p441
$$ 60725 79910 99361 96958 96728 99589 95864 101717 107556 115146 110650 117016 116707 93364 85923
12946H5923j7146p232J5733J9616q083l4152J274J6250K2613k354l2207j5624
$$ 85923 68777 61545 77278 96894 88811 54659 55933 72183 94796 92442 60235 44611
12934D4611J4760J0890O529r0j6026P204J5643m626j3274L153L411o053Q77q998
$$ 44611 59371 70261 76790 76700 60674 67878 83521 78895 65621 68774 72185 66132 67009 58011
12920E8011K198j6683R781p442j060L704m427O303q16O164J0208K1732Q174k2636
$$ 58011 60209 43526 53307 45865 44805 48509 44082 50385 49569 55733 65941 87673 95847 73211
12906G3211k084K9832J7160l460q683L522J9619L623j8768j2057j2560K225j1249
$$ 73211 71127 100959 118119 114659 105976 109498 129117 132740 113972 101915 89355 91580 80331
12893H0331l5211k0038R752K4128L1087J8403K5529p60p91J5253R737K6122J8269
$$ 80331 45120 25082 34834 58962 90049 108452 133981 133221 132430 147683 157420 183542 201811
12880B01811k923j1625j5636L075Q186Q53O810M356O488k2815j892J1885Q554
$$ 201811 198888 187263 171627 174702 182888 183741 190551 194907 201395 178580 176688 188573 197127
12867A97127K1414M761q848j2038J595L965j6832R856L9464J9520J0524p977J7328
$$ 197127 218541 223302 214454 202416 204011 207976 191144 201000 240464 259984 270508 262531 279859
12854B79859R87o993J468j341m272K3708k35q150j7774K506p216O356q48N146
$$ 279859 280846 273853 275321 273980 269708 293416 293181 285031 267257 269763 262547 268903 268055 273201
12840B73201K3278K6642J494O840P314J4818J9696j2013M287L344L270M702J9971
$$ 273201 296479 323121 324615 331455 338769 353587 373283 361270 365557 368901 372171 376873 396844
12827C96844K1571N097L529j4959k152J3621M3394K8353J9602J6047J3703M4775
$$ 396844 418415 423512 427041 412082 409930 423551 466945 495298 514900 530947 544650 589425
12815E89425M2370J8305J2986P601J2091J7665Q972L3675M0638K7461N0043N5887
$$ 589425 631795 650100 663086 670687 682778 700443 709415 743090 783728 811189 861232 917119
12803I17119K5786K7693M8266L7244M6280L7806M1492N9752O4240P4171P5675
$$ 917119 942905 970598 1018864 1056108 1102388 1140194 1181686 1241438 1305678 1379849 1455524
12792A455524P5880R0165R3130J06996J25920J63616J77755K31123K35457K80131
$$ 1455524 1531404 1621569 1714699 1821695 1947615 2111231 2288986 2520109 2755566 3035697
12782C035697L25430L85521M67210N97513P09559Q48867R53111J063019J169249
$$ 3035697 3361127 3746648 4213858 4811371 5520930 6369797 7322908 8385927 9555176
12773I555176J247132J414786J702502K196783L080166M562699O878577J0169661
$$ 9555176 10802308 12217094 13919596 16116379 19196545 23759244 30637821 40807482
12765D0807482J4228089J8442232K1712312K2667021K0428832J4808037O239015
$$ 40807482 55035571 73477803 95190115 117857136 138285968 153094005 159333020
12758A59333020l941875j3214280j9693237k2546170k1033095j6331442j1369770
$$ 159333020 155391145 142176865 122483628 99937458 78904363 62572921 51203151
12751E1203151p643909n254383l735079k781392k148372j787242j601314j518486
$$ 51203151 43559242 38304859 34569780 31788388 29640016 27852774 26251460 24732974
12743B4732974j502001j465267j397280j282889j137110r96105q58443p53880
$$ 24732974 23230973 21765706 20368426 19085537 17948427 16952322 16093879 15339999
12735A5339999o53820n84770n48590n02875m69433m48338m01096l94531l65670
$$ 15339999 14686179 14101409 13552819 13049944 12580511 12132173 11731077 11336546 10970876
12726A0970876l67430l52170l06488k75517k71586k67525k47947k11452j99516
$$ 10970876 10603446 10251276 9944788 9669271 9397685 9130160 8882213 8670761 8471245
12717H471245j78862j92608j99953k12267k15062j92684j78806j75409j76733
$$ 8471245 8292383 8099775 7899822 7687555 7472493 7279809 7101003 6925594 6748861
12708F748861j57530j53179j49238j39315j17631j34244j26137j08375j30217
$$ 6748861 6591331 6438152 6288914 6149599 6031968 5897724 5771587 5663212 5532995
12699E532995j07124r1941p8247r6916r3648r5753q6465q2112n6474m9131n8018
$$ 5532995 5425871 5333930 5255683 5158767 5065119 4969366 4882901 4800789 4744315 4695184 4637166
12688D637166l4497m1672n1070k6930K1111M2000J17133K48096M02909O10622
$$ 4637166 4602669 4560997 4509927 4482997 4504108 4546108 4663241 4911337 5314246 5924868
12678E924868P67279Q78796R21050Q03860N24817J41640k29807n71420q26447
$$ 5924868 6692147 7570943 8491993 9295853 9820670 9962310 9732503 9161083 8334636
12669H334636r26244r06572p83974o04176m48543l11323k36971j90364j52650
$$ 8334636 7408392 6501820 5717846 5113670 4665127 4353804 4116833 3926469 3773819
12660C773819j16303j23395j36719j25079r9810j10334j04832p5259q2727p6420
$$ 3773819 3657516 3534121 3397402 3272323 3172513 3062179 2957347 2882088 2799361 2722941
12650B722941o2527n1070n9620n7553o6511p7185o3535l9831m5773l9507l2262
$$ 2722941 2660414 2609344 2549724 2492171 2425660 2348475 2284940 2245109 2199336 2159829 2127567
12639B127567o6287l2691k2443n851j9999j147l2133k1138j3217l4980m5920m0543
$$ 2127567 2061280 2028589 2006146 2000295 1980296 1979149 1947016 1925878 1912661 1877681 1831761 1791218
12627A791218n5415n0577m3166k2053n5653o9857k5549L269k7038k8095k2754
$$ 1791218 1735803 1685226 1642060 1620007 1564354 1494497 1468948 1472217 1445179 1417084 1394330
12616A394330o312j9048l3181m5901j9829j0307l2562j5569L456n013j0906k0547
$$ 1394330 1388018 1368970 1335789 1289888 1270059 1259752 1227190 1211621 1215077 1210064 1199158 1178611
12604A178611j3652m835k0640l3259r905L131J3835K1742M061j8860L002J148
$$ 1178611 1164959 1160124 1139484 1106225 1096320 1099451 1113286 1135028 1139089 1120229 1123231 1124379
12592A124379j6970k9327j6835m6118o5669l3407k5947l1706j2248j3379l3581
$$ 1124379 1107409 1078082 1061247 1015129 949460 916053 890106 858400 846152 832773 799192
12581G99192l0758P758k074m4799q705J1236O891J6507k6603l9012r252Q159J0029
$$ 799192 768434 776192 774118 729319 720614 731850 738741 755248 728645 689633 680381 688540 698569
12568F98569P993N496J462K8122K9312K7477K0580K2827K2651O1145J06533J35515
$$ 698569 706562 712058 713520 741642 770954 798431 819011 841838 864489 925634 1032167 1167682
12556A167682J72500K52956K71465K18603J58575O0190p9288j79496k14066k36927
$$ 1167682 1340182 1593138 1864603 2083206 2241781 2301971 2222683 2043187 1829121 1592194
12546A592194k40169j96134j13686q0200o0458m7531n5839k4299m1071q010j7969
$$ 1592194 1352025 1155891 1042205 962005 901547 854016 798177 773878 732807 724797 706828
12535G06828l1572j6064k0824m5700l3770L231j2599j3265L11j9790R38R402j005
$$ 706828 675256 659192 638368 592668 558898 562129 549530 536265 536576 516786 517724 527126 526121
12522E26121k3809l0383k9679j5196m889m679k216p877r804K221k2571j2835m186
$$ 526121 502312 471929 442250 427054 422165 417486 415270 407393 397589 399810 377239 364404 360218
12509C60218J1406J2933J0706K1521K388j9179l101K7341K1290J7407j4139L426
$$ 360218 371624 384557 395263 416784 419172 399993 396892 424233 445523 462930 448791 452217
12497D52217J8474K1034J1591j1501M218K5812M1737O0656P3630J04193J14768
$$ 452217 470691 491725 503316 491815 496033 521845 563582 624238 697868 802061 916829
12486I16829J40090J28653J43992J12356P6203K6789k9125o6347j22388j57351
$$ 916829 1056919 1185572 1329564 1441920 1518123 1544912 1515787 1449440 1327052 1169701
12476A169701j53640j16314j08094r4990n0453n1716k6802j7647j8930j9873k1986
$$ 1169701 1016061 899747 791653 696663 646210 594494 567692 550045 531115 511242 489256
12465D89256k4973m1753l0440O515p790r95j3322k5403j0339j1866j0154r700
$$ 489256 464283 422530 392090 398605 390815 389820 376498 351095 340756 328890 318736 309036
12453C09036l2258k3775q76k184j1866O804r81j567N369L93k744p642k2646r979
$$ 309036 276778 253003 252127 249943 238077 244881 243900 242333 247702 248095 245351 237709 215063 205084
12439B05084m619L254m822J1880Q033O70l4470k6026J1920J7288j883p769q888
$$ 205084 200465 203719 198897 210777 218810 219480 185010 158984 170904 188192 186309 178540 169652
12426A69652M944q390k441j166P257K209k0051j3504j0768k512N527J4200J4879
$$ 169652 174596 166206 163765 162599 169856 172065 152014 138510 127742 125230 130757 144957 159836
12413A59836J274J9154R750J5319n794o05l815j6248j3129J105m536L737J1340
$$ 159836 161110 180264 190014 205333 199539 198934 195119 178871 165742 166847 162311 166048 177388
12400A77388j0198l0619M45l5j23o027n739J1226M921j7508m138n088n400r975
$$ 177388 167190 136571 137016 136981 136858 130831 125092 136318 141239 123731 119593 114505 109105 99130
12386I9130j0723j7758k419k030l141K4528J3393p770P425J6347j715p564j2297
$$ 99130 88407 70649 68230 66200 63059 87587 100980 93210 100635 116982 115267 107703 95406
12373I5406r551L069O970m718M430j4365j2514R037j5210r687K2955P287r26m105
$$ 95406 85855 88924 95894 91176 95606 81241 68727 77764 62554 52867 75822 83109 82183 78078
12359G8078N564o583N94J2160J2361O883J8867L9442O514J3151J5259M8435O0655
$$ 78078 83642 77059 77653 89813 102174 109057 127924 167366 173880 187031 202290 250725 311380
12346C11380M4255N4372P2860Q4252P0105L8286J4317k0230j1207l3685j8249
$$ 311380 355635 410007 482867 567119 637224 675510 689827 669597 658390 624705 606456
12335F06456K8947M1542R6939J05207P2056L7170n60o7926j23043j14989r4998
$$ 606456 635403 676945 773884 879091 951147 988317 987757 919831 796788 681799 586801
12324E86801r8416p3779l8793k9007m8388k8382r678j5552k0362j1468j1418j9378
$$ 586801 488385 414606 375813 346806 298418 270036 260358 244806 224444 212976 201558 182180
12312A82180k4761J5104K31R724j1313k0373L521j766j5378j0325R695P878m591
$$ 182180 157419 172523 172754 182478 171165 150792 154313 152547 137169 126844 136539 144417 139826
12299A39826k7416j2476p946K983J1871l21j3461J537J018o409j6114m740J0369
$$ 139826 112410 99934 91988 94971 106842 106521 93060 94597 95615 89206 73092 68352 78721
12286G8721L49K3023J0250j5983j9179k344m668n721K1612O522J2105L309m128
$$ 78721 79070 102093 112343 96360 77181 74837 70169 64448 86060 92582 104687 107996 103868
12273A03868l838j8828M489P138q0l714r252k3371O562J5877o435J8572j287J1519
$$ 103868 100030 81202 85691 92829 92749 89035 79783 56412 62974 78851 72416 90988 89701 101220
12259A01220L535k5147j4210K227k0665O67N560l31m253l167J4203J4154J7022
$$ 101220 104755 79608 65398 67625 46960 47627 53187 52856 48603 45436 59639 73793 90815
12246I0815o016J6619M609M461j4376j5568j8040J0989R839l370N955q738j5252
$$ 90815 84799 101418 106027 110488 96112 80544 62504 73493 83332 79962 85917 77179 61927
12233F1927k167J707q954q403r381K2178J8528J6884l82O220m217M245p789j6454
$$ 61927 59760 61467 52513 44110 34729 56907 75435 92319 91937 98157 93940 98185 90396 73942
12219G3942l2261k0343j3520K367j0899j1715K9266K1575l45J0911J8194l704
$$ 73942 41681 21338 7818 10185 -714 -12429 16837 38412 38067 48978 67172 63468
12207F3468j5111J6577O754k2365j7843o258L08K9132J0451M052J6261K0743J3586
$$ 63468 48357 64934 71688 49323 31480 25222 25530 54662 65113 69165 85426 106169 119755
12194A19755l122j498L174J4579J6944q000j5968j6804o956j3878k5011j8260
$$ 119755 116633 115135 118309 132888 149832 141832 125864 109060 102104 88226 63215 44955
12182D4955O596k095o520k260R034k552K193O445N642k8011j6432L0278q80l6935
$$ 44955 51551 49456 42936 40676 49710 47158 49351 55796 61438 33427 16995 47273 46393 9458
12168I458O203Q438J996K1338n002o257J5953J0459l99j478m436J7062J0914k5296
$$ 9458 15661 24099 26095 47433 42431 36174 52127 62586 62187 60709 56273 73335 84249 58953
12154E8953K88J0498k4972o946L2j4587k4753L717L965J9058K282k290J2407R346
$$ 58953 59241 69739 44767 37821 37853 23266 -1487 2230 6195 25253 27535 25245 37652 46998
12140D6998J672l075M998r447j2179L906M127l56n333n357j2598J9254Q565m186
$$ 46998 48670 45595 50593 41146 28967 32873 37000 36644 31311 25954 13356 32610 41175 36989
12126C6989n219j440J1312O103J3329j0371j7251j1981o327K793K290m783J5623
$$ 36989 31770 30330 41642 47745 61074 50703 33452 21471 15144 17937 20227 15444 31067
12113C1067J2545k056j8107J0701j1293P350p954j1629Q578J1424j8564j3808
$$ 31067 43612 41556 23449 34150 22857 30207 22253 10624 19202 30626 12062 -1746
12101a746M611J624k271p645J9813R532K1702J4094M893N402n146j0035k5448
$$ -1746 2865 4489 2218 -5427 14386 23918 45620 59714 64607 70009 64863 54828 29380
12088B9380l500q536j9493J267K9711M845K684j0295j025K8204l197l1128J3079
$$ 29380 25880 17344 -2149 -882 28829 33674 36358 26063 25038 53242 50045 18917 31996
12075C1996L416n164K172J8156K102M482j6762j7277j1942K02p591R08Q936R32
$$ 31996 35412 30248 32420 50576 52678 57160 40398 23121 11179 11381 3790 4698 13634 14566
12061A4566r595R850J3889j4982j2431m534o629J2649k940J2765l226L703O53
$$ 14566 4971 14821 28710 13728 1297 -3237 -9866 2783 -157 12608 9382 13085 13738
12048A3738O018q108j9911K328l0860N66J9952J7737k462n945j0532O664K3004
$$ 13738 19756 11648 -8263 -5935 -36795 -36229 -16277 1460 -1002 -6947 -17479 -10815 12189
12035A2189j645q033p738m981j760J1324L733k4763O754K7112M946K244j3173
$$ 12189 10544 2511 -5227 -10208 -11968 -644 3089 -21674 -14920 12192 17138 19382 6209
12022F209K4q615m317J3560O220Q436n046p137l384p079r016o917J3348P56l6200
$$ 6209 6233 -2382 -6699 6861 13081 21517 16471 9334 5950 -1129 -10145 -17062 -3714 -2958 -39158
12007c9158o770K6787R304p206P102K7626J815O745K125l777K607p396k0661m558
$$ -39158 -45928 -19141 -9837 -17043 -9941 17685 19500 26245 28370 24593 27200 19804 -857 -5415
11993e415q963l371R482J9222m597O472k971j871o80j0180R277R075J000j6854
$$ -5415 -14378 -17749 -8267 10955 6358 12830 9859 7988 7308 -2872 6405 15480 16480 -374
11979c74k2646k770n416P832J3736J8183J0807r411r432J1109J4036L48q809K181
$$ -374 -23020 -25790 -31206 -23374 -9638 8545 19352 9941 509 11618 25654 26002 17193 19374
11965A9374p709k0086J8270J859n808m060R209l510k4234K404K4908r935j2650
$$ 19374 11665 -8421 9849 11708 5900 1840 11049 7539 -16695 -14291 10617 682 -11968
11952a1968N880J9686K372j2403K68n211J1426J6806q630r250J463O540R91R217
$$ -11968 -6088 13598 15970 3567 3835 -1376 10050 26856 18226 8976 10439 16979 17970 27187
11938B7187k751O833j5829j2181j3650o78Q613J1472O755l117q620L647m606L758
$$ 27187 24436 31269 15440 3259 -10391 -11069 -2456 9016 15771 12654 4034 7681 3075 6833
11924F833J2465Q758j0511p190P504R070J806o054l6238j5805n556J0692K923
$$ 6833 19298 28056 17545 10355 17859 26929 28735 22681 -13557 -29362 -34918 -24226 -21303
11911b1303L001R355J1058M373J4059J6077p450n485k849j2192k039L543n219
$$ -21303 -18302 -8947 2111 6484 20543 36620 29170 23685 20836 8644 6605 10148 4929
11898D929O516J3263l944J652R587k095l823r392j1900k5885M741O345J9554L448
$$ 4929 11445 24708 20764 22416 32003 29908 26085 16693 4793 -21092 -16351 -10006 9548 12996
11884A2996j5121j1931K328O849L404j991J1223Q488k1881J2235Q488p803l2335
$$ 12996 -2125 -14056 -11728 -4879 -1475 -3466 7757 16245 -5636 6599 15087 7284 -25051
11871b5051m372K0870R934l619m556r753J3425R837l385j669q264r038K195O338
$$ -25051 -29423 -8553 1381 -2238 -6794 -16547 -3122 6715 3330 1661 -6603 -15641 -13446 -7108
11857g108N316J632l994k3724Q080M874l400K4808J2274j0646j8814N963k439
$$ -7108 -1792 -160 -4154 -27878 -19798 -14924 -18324 6484 18758 8112 -10702 -4739 -7178
11844g178J7616n921l983l446j3664j8227p441J6230J0875L0367J0892J1414j698
$$ -7178 10438 4517 534 -2912 -16576 -34803 -42244 -26014 -15139 15228 26120 37534 35836
11831C5836l0467j4591m994j4920j0577R506K3732J1119k112N37j8477j0725r46
$$ 35836 5369 -9222 -14216 -29136 -39713 -30207 -6475 4644 2532 3069 -15408 -26133 -27079
11818b7079R36J581k527L860J2183K473N440J1079p084k1522j8749J3649P343
$$ -27079 -26143 -24562 -27089 -23229 -11046 -8573 -3133 7946 862 -20660 -39409 -25760 -18417
11805a8417k20P345J3545Q410q903l0379j300J6904J2409L683j9659L73O797J2908
$$ -18417 -18637 -11292 2253 10663 1760 -28619 -29919 -13015 -606 3077 -16582 -16209 -9412 3496
11791C496M375K411K075L58j7005L878L615j432n636K7564J5861j7893o179p181
$$ 3496 7871 10282 12357 12715 -4290 -412 3203 1771 -3865 23699 39560 21667 15488 8307
11777H307k726J6871J0883j9455l1598J4124J5698J967l649k4084n072R264j1466
$$ 8307 5581 22452 33335 13880 -17718 -3594 12104 14071 10422 -13662 -18734 -9470 -20936
11764b0936P885N745J5682k5662J0610K3481J2983K3498l374k7215l070k568p804
$$ -20936 -13051 -7306 8376 -17286 -6676 16805 29788 53286 49912 22697 19627 17059 9255
11751I255r190J0919O236q183p098J4485P18l890k350k174J6082j0906j8782m925
$$ 9255 65 10984 17220 9037 1939 16424 17142 13252 10902 8728 24810 13904 -4878 -9803
11737i803Q571K7058J626l750R355j2194m244j0700K106Q455k1718J4860r08q894
$$ -9803 -1232 25826 27452 23702 33057 20863 16619 5919 8025 16480 -5238 9622 8714 -180
11723a80j2060p019J540q133p649J1535Q292Q254K4982P094q785j2789j287j5545
$$ -180 -12240 -19259 -17719 -25852 -33501 -21966 -13674 -5420 19562 26656 17871 5082 3795 -11750
11709a1750L537q043Q869J1529j1663N974L3J165J3175j3173M642O271M825j319
$$ -11750 -8213 -16256 -7387 4142 -7521 -1547 -1514 -349 12826 -347 4295 10566 15391 14072
11695A4072o894o312q117n346l589J388L943J8600R521l003m963j2221M984J756
$$ 14072 7178 866 -7251 -12597 -16186 -14798 -10855 7745 17266 14263 9300 -2921 2063 3819
11681C819J0862J3955j374j3955o757k689O545n35j0683n884o406j4776J760J0581
$$ 3819 14681 28636 27262 13307 6550 3861 10406 9871 -812 -6696 -13102 -27878 -26118 -15537
11667a5537K628L523J3253L631k867m355o86J6027L248m714q851N375L837j3100
$$ -15537 -12909 -9386 3867 7498 4631 276 -410 15617 18865 14151 5300 10675 14512 1412
11653A412p83n428j707J2361J147R562J2958j0319j8457J5442P340j2501k2197
$$ 1412 629 -4799 -6506 5855 7002 16564 29522 19203 746 16188 23528 11027 -11170
11640a1170k0486O911K5421K8764J1483n746J3802j0663l3409k6927J1594m117
$$ -11170 -31656 -24745 676 29440 40923 35177 48979 38316 4907 -22020 -10426 -14543
11628a4543m351n298O544J4871J5578R857l897M226j4533J5511k600k5534K1606
$$ -14543 -18894 -24192 -17648 -2777 12801 22658 18761 22987 8454 23965 21365 -4169 17437
11615A7437J5123j8770M404j9822M52R981K4236L511j4622p333Q815O202j3851
$$ 17437 32560 13790 18194 -1628 -1176 8805 33041 36552 21930 14597 23412 29614 15763
11602A5763j8685k5165j3499q639P124K4512J0046J0279j964n524j4206j411J4258
$$ 15763 -2922 -28087 -41586 -50225 -43101 -18589 -8543 1736 -228 -5752 -19958 -21369 -7111
11589g111R01j5384M942J8956j1378M621M7666j952l6539k412N703L716J4061
$$ -7111 -6210 -21594 -16652 2304 -9074 -4453 43213 41261 4722 2310 8013 11729 25790
11576B5790o052q448R341J6098K7050J0357N490K367J3427q113k6233j664r984
$$ 25790 19738 11290 20631 36729 63779 74136 79626 81993 95420 87307 61074 59410 49426
11563D9426J70M833m58j076j1399j9986n348R358J5400j8657n296j2151J6569
$$ 49426 49596 54429 53971 52895 41496 21510 16162 25520 40920 22263 16967 4816 21385
11550B1385J2495R599O330p90j4122M393O240j4675P122o156l4385J4417j0604
$$ 21385 33880 43479 49809 49019 34897 39290 45530 30855 37977 31821 -2564 11853 1249
11537A249p680P570J3376P240r919r343P601N215j8132L202L825m29l716R255
$$ 1249 -6431 1139 14515 21755 11836 2493 10094 15309 -2823 379 4204 3775 59 9314
11523I314J0924n23J6997K937k051J1267j294j7612o318o469N467m298N046J7059
$$ 9314 20238 19715 36712 39649 37598 48865 47571 29959 23641 17172 22639 18341 23387 40446
11509D0446P959J0927O603L756m071J340J9135L6517K8167M6094N7600P0860R7021
$$ 40446 48405 59332 65935 69691 65620 66960 86095 122612 150779 196873 254473 325333 422354
11496D22354J07791J17481J07360N5441j762p9614j23275j16701j08217q5592
$$ 422354 530145 647626 754986 810427 808665 729051 605776 489075 380858 295266
11486B95266n8983l5612l8904j3913J21O311K0727j403k1512k6524j1171m855
$$ 295266 236283 200671 161767 147854 147975 154286 175013 173610 152098 125574 114403 109548
11474A09548L813J6206J073k0153o958m723J2375r154L009j7929j1870o300N860
$$ 109548 113361 129567 130640 110487 103529 98806 111181 102027 105036 87107 75237 68937 74797
11461G4797p219P274Q745j3126j890K328k080n807p558j4912j1574k813r550o581
$$ 74797 67578 74852 83597 70471 68581 70909 68829 63022 55464 40552 28978 26165 16615 10034
11447A0034m91N895J7046J0734Q990R117k554k4947j641q875j5048J8228J216
$$ 10034 9543 15438 32484 43218 52208 61325 58771 33824 32183 23308 8260 26488 27704
11434B7704r984m54R216k632j8610M7o753J595j9785N619J9125P739J0069k541
$$ 27704 17720 17266 26482 23850 5240 5287 -1466 129 -19656 -14037 5088 12827 22896 20355
11420B0355O154J3526M222O388k4796k6038J7173J8913j1793J8225j0641k5180
$$ 20355 26509 40035 44257 50645 25849 -189 16984 35897 24104 42329 31688 6508
11408F508k712M21k5869k0838R393K3344O100J5745N000N683J527k604k3534J4240
$$ 6508 3796 4217 -21652 -42490 -33097 -9753 -3653 12092 17092 22775 24302 21698 -1836 12404
11394A2404q891L268R119K4353J1866l747j8480j5219j0578Q493J475j0949K4808
$$ 12404 3513 6781 15900 40253 52119 48372 29892 14673 4095 12588 14063 3114 27922
11381B7922N940j3002J5089J1813j4767k347J2684j928Q807j6101j5049J885J1984
$$ 27922 33862 20860 35949 47762 32995 30648 43332 41404 50211 34110 19061 20946 32930
11368C2930r591O312J6452r921k4271p646J5580j345j3639j5137j2440m648K3304
$$ 32930 23339 29651 46103 36182 11911 4265 19845 18500 4861 -10276 -22716 -27364 -4060
11355d060J6009j8946j0651K0684m241K2899J4677q586j4522j6148p643J2934
$$ -4060 11949 -6997 -17648 3036 -1205 21694 36371 27785 13263 -2885 -10528 2406
11343B406K0332p908N668J1744J0835n037k4410n213R007J5558j737m896r753
$$ 2406 22738 14830 20498 32242 43077 38040 13630 8417 17424 32982 31245 26349 16596
11330A6596j0886k0785L429J3374j5148o747L494K1473o230J7262J8535K983J8214
$$ 16596 5710 -15075 -11646 1728 -13420 -20167 -16673 4800 -1430 15832 34367 37350 55564
11317E5564J0213J0397k7991k298N601o034j0417k188j1995J939l973r434J0571
$$ 55564 65777 76174 48183 45885 51486 45452 35035 32847 20852 22791 18818 9384 19955
11304A9955p437l883Q693J9379R255l189j4984J1336k541o4o343o863p018Q082
$$ 19955 12518 8635 17328 36707 45962 42773 27789 39125 36584 36520 30177 23314 16296 24378
11290B4378o048N255J7244R739O606M191J2881J482P754K0150N1158R8326Q2005
$$ 24378 18330 23585 40829 50568 57174 61365 74246 75728 83482 103632 154790 253116 335121
11277C35121R4479Q7327N1995J388o3312q0944j07651q5134n7318k0721q026q441
$$ 335121 429600 516927 568922 570310 506998 426054 318403 233269 175951 155230 147204 138763
11265A38763m96o662j9531l2843J0701J3207o782k3297j1075m676K094j1049J720
$$ 138763 138267 131605 112074 79231 89932 103139 96357 73060 61985 57309 59403 48354 50074
11252E0074J2370J9r867n400L257O195O869K788j6531P683j416k6657j1712R011
$$ 50074 62444 62463 52596 47196 50453 56648 63517 66305 49774 57457 56041 29384 17672 26683
11238B6683J0089K0272J4885n580j9738j6869K133Q887Q804j1274j8484K305J971
$$ 26683 36772 57044 71929 66349 46611 29742 31875 40762 49566 38292 19808 22113 24084
11225B4084K3813Q095j2750j1175o476j9323j7340J865K9333J7520l119L661M854
$$ 24084 47897 55992 43242 32067 25591 6268 -11072 -9207 20126 37646 34527 38188 43042
11212D3042N880n240l058O523m230p038l886P330K2096J6923j9896o435J9771
$$ 43042 48922 43682 40624 47147 42917 35879 31993 39323 61419 78342 58446 52011 71782
11199G1782n669j2302L456p809J332P352J0507o498p586q592J4885K7471q31j8191
$$ 71782 66113 53811 57267 49458 50790 58142 68649 62151 54565 45973 60858 88329 87498 69307
11185F9307K132r033Q233J3560J3814O118j2669o614M7525P4488P4367R6553O4906
$$ 69307 71439 62406 70639 84199 98013 104131 91462 84848 132373 206861 281228 377781 442687
11172D42687L6748L7131J0946M583l1138q1183j08578r3396o1161j1332q087j2293
$$ 442687 479435 516566 527512 532095 500957 419774 311196 217800 156639 145307 137220 124927
11160A24927J899n986p844o826p141M048r25p037N325k1843q381k235r455O152
$$ 124927 126826 120840 112996 106170 99029 103077 102152 95115 100440 78597 70216 67981 58526 64678
11146F4678K4251j7519j6525L791m214J3854m223j5422m596J1383j5280J0726
$$ 64678 88929 71410 54885 58676 54462 68316 64093 48671 44075 55458 40178 50904
11134E0904O948P070m705J2018j639P771j2886j1793j7395l281P381J7152J7519
$$ 50904 57852 64922 60217 72235 70596 78367 65481 53688 36293 33012 40393 57545 75064
11121G5064q989m757l926J752O992k771L51J1587l588K276j6859j6333l861j4615
$$ 75064 66075 61318 57392 59144 66136 63365 63716 75303 71715 73991 57132 40799 36938 22323
11107B2323J223K7104K7841J0920k573r820m457j3583j472p470o787j577J1630
$$ 22323 23546 50650 78491 89411 86838 77018 72561 58978 57506 50036 43249 41672 53302
11094E3302M103k428j198Q27j1743n719P195j9498j0405L4875O01j1030J939q615
$$ 53302 57405 54977 53779 54606 42863 37144 44339 24841 14436 49311 49912 38882 40821 32206
11080C2206q096o047j4574j1565K1292K0152j3581k2228m775J3847K2866J1086
$$ 32206 24110 18063 3489 -8076 13216 33368 19787 -2441 -7216 6631 29497 40583
11068D0583R764n602j3986K1138r82j930j2330k36J2877n671N706Q549L247J8247
$$ 40583 50347 44745 30759 51897 50915 48985 36655 36419 49296 43625 49331 57880 61127 79374
11054G9374j836O369L263j6996j3297n944Q823N51o342k522k219j2280J6620K7319
$$ 79374 77538 83907 87170 70174 56877 50933 59756 60307 53965 51443 49224 36944 53564 80883
11040H0883J4461k5306j4857K0556k070j3359O95j3461k2830j1625l658J1556
$$ 80883 95344 70038 55181 75737 73667 60308 61003 47542 24712 13087 9429 20985
11028B0985M545K6593j479j609K146k633j5068J628n458J1283K0207P41j1091
$$ 20985 25530 52123 50644 49035 51181 48548 33480 35108 29650 40933 61140 61881 50790
11015E0790j3022r25N6J5876l31J0611j318j5068k1360q820o169N656q251J0145
$$ 50790 37768 36843 36899 52775 52444 63055 61737 46669 25309 16489 10320 15976 7725 17870
11001A7870R880J5886Q850j2970j1617J9025o756j9525K888K0275J0078R130K1433
$$ 17870 27750 43636 52486 39516 27899 46924 40168 20643 23531 43806 53884 63014 84447
10988H4447J877L295p932j4112j1890j0670Q156J2543L8892K6037J8783J559K216
$$ 84447 86324 89619 81687 67575 55685 45015 53171 65714 104606 130643 149426 150985 153201
10975A53201J1168M648j956o861l584k1550j7631j0076J4595O590L661R088k1240
$$ 153201 164369 169017 167061 160200 156616 135066 117435 107359 121954 128544 132205 141293 120053
10962A20053j1965m821J6162J0563K2848R354l390j8590R859L2956K9633L7274
$$ 120053 108088 103267 119429 129992 152840 162194 158804 140214 150073 183029 212662 249936
10950B49936N0715M6329P6145J51324K66280L41183K99161J73365k983j89610
$$ 249936 300651 346980 423125 574449 840729 1181912 1481073 1654438 1651455 1461845
10940A461845l17316k54237j80208j18494n6481m4563l8585k7597j0565k5476
$$ 1461845 1144529 890292 710084 591590 535109 490546 451961 424364 413799 388323
10930C88323J228k955J3488O592J0215K15q005n506j1178k3984j7271o825j1196
$$ 388323 389551 386596 400084 406676 416891 417106 409101 403595 392417 368433 351162 344337 333141
10917C33141j9455k0085k7947j7488k8546k2702m441N892j0491r292k0030P477
$$ 333141 313686 293601 265654 248166 219620 196918 192477 198369 187878 178586 158556 166033
10905A66033K508N770O995q558k2209j682J6490K4707j581j6331o439O788j984
$$ 166033 168541 174311 181306 172748 150539 148857 165347 190054 188473 172142 165703 172491 170507
10892A70507P997J1206M5035N3136L3891L498j7507k899n996Q77J3009J1316J8731
$$ 170507 178504 189710 234745 287881 321772 325270 307763 304864 298868 299745 312754 324070 342801
10879C42801K4729K6895L1248L1841M4727K5327J0308j6130m4149n2714l1010
$$ 342801 367530 394425 425673 457514 502241 527568 537876 521746 477597 424883 393873
10868C93873m0425l8021k5047k7816j3202k5283j7587j209j4066j1051j905J3120
$$ 393873 353448 315427 290380 262564 249362 224079 206492 205283 191217 180166 178261 191381
10856A91381K8068J122N840p131j4179j4091N871K6925L0332O0q833Q571K995
$$ 191381 219449 220571 226411 219280 205101 191010 196881 223806 254138 254198 245365 253936 256931
10843B56931m859J9042j181j0747J8938L2110K0344J9044K2751K3647J7570L699
$$ 256931 252072 271114 269933 259186 278124 310234 330578 349622 372373 396020 413590 417289
10831D17289L1305K7302P967J5243L1274J3726j8650l1472l4972k6314l1590k0053
$$ 417289 448594 475896 483863 499106 530380 544106 525456 493984 459012 432698 401108 381055
10819C81055L37K1805M063j7983j8953j5107l1436k1205q724k4646q274J723O150
$$ 381055 381392 403197 407260 389277 370324 355217 323781 302576 293852 269206 260932 262655 268805
10806B68805k547l591k6063n175n906o584M388L666j7169j8143O553j166q625
$$ 268805 266258 262667 236604 231429 225523 218939 223327 226993 209824 191681 198234 197068 188443
10793A88443K687P629J1120N771J4217j2075n275Q806J1513K4018L3319M7235
$$ 188443 191130 198759 209879 215650 229867 217792 212517 221323 232836 256854 290173 337408
10781C37408N1271P5756P3128N8992O5870O2059J5223k5849m6545p8935p7930
$$ 337408 388679 464435 537563 596555 662425 724484 739707 713858 667313 588378 510448
10770E10448n2514l2329k0449k3836n2051m895O414q848r117k0935k5143k3316
$$ 510448 457934 425605 405156 381320 329269 324374 330788 321940 312823 291888 266745 243429
10758B43429p094N177j2974Q397k360k0600j7602j0203R054K38J700J2438P677
$$ 243429 236335 241512 228538 236935 234575 213975 196373 186170 195224 195462 197162 209600 217277
10745B17277j5888M697J6229J0482N885k0436k0004j1136j9181O39K8271J4176
$$ 217277 201389 206086 222315 232797 238682 218246 198242 187106 167925 168564 196835 211011
10733B11011J5561J7708P126Q511K455J2960K6277K3290k1869m0938j8613l03
$$ 211011 226572 244280 251406 259917 262372 275332 301609 324899 303030 262092 243479 243176
10721B43176N776j0164J381j197r552n537K384l4349j4357Q176J3875O404k005
$$ 243176 248952 238788 240169 238972 229420 223883 226267 191918 177561 185737 199612 206016 204011
10708B04011m715j6238j0800O223K1836j207r344j8458o292j054n292K7435K7970
$$ 204011 199296 183058 172258 178481 200317 199110 189766 171308 165016 163962 158670 186105 214075
10695B14075J1439J3731l633K5641L0724L5056k590l2460j7195O60j2281n2984
$$ 214075 225514 239245 235612 261253 291977 327033 324443 291983 274788 275448 263167 210183
10683B10183k9550Q21r78j8904M629K6450J2176N434K027k298R468q077J5364
$$ 210183 180633 181454 180476 161572 166201 192651 204827 210261 212288 209990 219458 211381 226745
10670B26745P787k313m498k7343K854J892m556n591k136P148n71j9023n40k4931
$$ 226745 234532 232219 227721 200378 203232 205124 200568 194977 192841 199989 199418 180395 179855 154924
10656A54924l4688p047J323K4345N5243N3365L7801L6330K7455L0672R507j6990
$$ 154924 120236 113189 114512 138857 194100 247465 285266 321596 349051 379723 389230 372240
10644C72240j0236R258J6301k426J7567k355j5056Q701j7136j7526J5167R75J269
$$ 372240 362004 371262 387563 385137 402704 400349 385293 393994 376858 359332 374499 375474 376743
10631C76743j2883j393L0563J2902l607m785j9571J3072L0590J8082M99R351J6181
$$ 376743 363860 362467 393030 405932 402325 397540 377969 391041 421631 439713 440212 449563 465744
10618D65744K6470J0454J8225N064J0593P33q863l5055o141L866J452J792L267
$$ 465744 492214 502668 520893 525957 536550 537283 528420 493365 487224 491090 492542 494334 497601
10605D97601q800o073J6620K7747M927N869J6587K430L188P686K4879Q242K6921
$$ 497601 488801 482728 499348 527095 532022 537891 554478 556908 560096 567782 592661 600903 627824
10592F27824M5530L6334J7531o502P879O002N905M0326P0704M9646O2745O0342
$$ 627824 673354 709688 727219 720717 728596 734598 740503 780829 851533 901179 963924 1024266
10580A024266N4290N7338P5897R6353J47559K19795L01228M29858O15124P06243
$$ 1024266 1078556 1135894 1211791 1308144 1455703 1675498 1976726 2406584 3021708 3727951
10570C727951N94629L00474j18408n34176o05364m31737k43383j20896l4936l512
$$ 3727951 4322580 4623054 4504646 3970470 3365106 2933369 2689986 2569090 2534154 2530642
10560B530642Q668K7747L4154N7234J15902J15333J54225J60697J92194K43179
$$ 2530642 2539310 2567057 2601211 2658445 2774347 2889680 3043905 3204602 3396796 3639975
10550C639975L18600L60283L88438M33848M94510O28084P37359P96108P65759
$$ 3639975 3958575 4318858 4707296 5141144 5635654 6263738 7001097 7797205 8562964
10541H562964P13002P19841R00660J258681J723970K294643L018574L962787N385101
$$ 8562964 9275966 9995807 10896467 12155148 13879118 16173761 19192335 23155122 28540223
10532B8540223P569102J1162251J7293219K7645670M3380968N9614944O1499687
$$ 28540223 36109325 47271576 64564795 92210465 135591433 195206377 256706064
10525B56706064M2859461J1691033k9907754o0309228n8142347m0636045k5885711
$$ 256706064 299565525 311256558 281348804 221039576 162897229 122261184 96375473
10518I6375473j6883202j1644540q525375o466259n017906l943353l171748k625638
$$ 96375473 79492271 67847731 59322356 52856097 47838191 43894838 40723090 38097452
10510C8097452k151318j733823j424298j188027j056493r53272o71616j2262J038876
$$ 38097452 35946134 34212311 32788013 31599986 30543493 29590221 28918605 28906343 29945219
10501B9945219K067371K146505J143024n79912k789033l918364l320459k297987
$$ 29945219 32012590 34159095 35302119 34722207 31933174 28014810 24694351 22396364
10493B2396364j620218j218065r62112q46999p35080o30590n40745m50213m22358
$$ 22396364 20776146 19558081 18595969 17748970 17013890 16383300 15842555 15392342 14969984
10484A4969984l97790l66311l55800l60690l59607l52864l70339l97790l51895
$$ 14969984 14572194 14205883 13850083 13489393 13129786 12776922 12406583 12008793 11656898
10475A1656898l03586l14172k95514k51781k69942k55641k68071k32419j95955
$$ 11656898 11353312 11039140 10743626 10491845 10221903 9966262 9698191 9465772 9269817
10466I269817j78361j78527j97870j90637j68419j79864j80961j60985j64870
$$ 9269817 9091456 8912929 8715059 8524422 8356003 8176139 7995178 7834193 7669323
10457G669323j54892j32275j32492j48316j61082j71369j57902j33563j43658
$$ 7669323 7514431 7382156 7249664 7101348 6940266 6768897 6610995 6477432 6333774
10448F333774j49977j42144j18729j29593j14643r9352j08315r6728j04860j10349
$$ 6333774 6183797 6041653 5922924 5793331 5678688 5579336 5471021 5374293 5269433 5159084
10438E159084j16106j03664r8622r0334r7950q3691q0341p2043p4234r0164r2523
$$ 5159084 5042978 4939314 4840692 4750358 4652408 4568717 4488376 4416333 4342099 4251935 4159412
10427D159412n3337n1158r9954j12888p8793q8867q9370q7413n8925o2190m6965
$$ 4159412 4106075 4054917 3954963 3842075 3763282 3674415 3585045 3497632 3438707 3376517 3329552
10416C329552n0622m2085n3641o8792p1308o7023n2793l8784l6644m5690n8687
$$ 3329552 3278930 3236845 3183204 3114412 3043104 2976081 2923288 2884504 2847860 2802170 2743483
10405B743483n5324k4080k1746j9357k1354j6206M705j2083k7696m3538m6674
$$ 2743483 2688159 2664079 2642333 2622976 2601622 2585416 2590121 2578038 2550342 2506804 2460130
10394B460130m8743o2300o3917o7274n1450m5973o7432m4792l2876m1485k0850
$$ 2460130 2411387 2349087 2285170 2217896 2166446 2120473 2053041 2008249 1975373 1933888 1913038
10383A913038o1916n5410k4708j6801k4848l4246j3655j0490j8682l2669n73L582
$$ 1913038 1851122 1795712 1771004 1754203 1729355 1695109 1681454 1670964 1652282 1619613 1619040 1622622
10371A622622n506l3069k9655j1871k1909l6868m4494l8628m2005j4472j5862
$$ 1622622 1617116 1584047 1554392 1542521 1520612 1483744 1439250 1400622 1358617 1344145 1328283
10360A328283k0243j2262j2902l7816k6732k3602k7019q741n88j0229j6371j7922
$$ 1328283 1308040 1295778 1282876 1245060 1218328 1194726 1167707 1158966 1158378 1148149 1131778 1113856
10348A113856j1201j2221L146k5149m1347l5731k1563l0806k6209J918N995j4909
$$ 1113856 1102655 1090434 1093580 1068431 1027084 991353 969790 938984 912775 914693 920688 905779
10336I05779j4435k9700j8677l044J5449j227J8526J347j2213l2386j5818j1819
$$ 905779 891344 861644 842967 839923 855372 854145 872671 874018 861805 829419 813601 801782
10324H01782j8179q641k4289n334K228j376j9713l2402j1529n489r151q763k2392
$$ 801782 783603 774962 750673 745339 747567 746191 726478 694076 682547 677058 667907 659144 636752
10311F36752j6397q506j5311P539J5910J4123o75p733k4381j3809j2194k4330
$$ 636752 620355 611849 596538 604077 619987 634110 633435 625702 601321 587512 575318 550988
10299E50988k7684J816n07L964J9503L351j7284k0515k4227K116q199k487J5546
$$ 550988 523304 525120 524613 528577 548080 551431 534147 513632 489405 491521 483322 480835 496381
10286D96381l495j4903j2148j8205o366K406q144j3179l4222j0822J4867K532
$$ 496381 492886 477983 465835 447630 441264 443670 435526 422347 388125 377303 392170 394702
10274C94702j2615j6316Q233Q863j1115o490p244p067P61j243j5777j1789j7454
$$ 394702 382087 365771 374004 382867 371752 365262 358018 350951 351712 350469 334692 322903 305449
10261C05449K724J9514r546l519n191J666J3032k2662p001N538Q074M635j5606
$$ 305449 308173 327687 318141 314622 309431 311097 324129 301467 294466 300004 308078 312713 297107
10248B97107q861l648L18J2176R458l139m981m227k1215M240K0458k2986j9991
$$ 297107 288246 284598 284916 297092 306550 303411 298430 294203 272988 277228 297686 274700 254709
10235B54709r017R252M707K616j7373j4521J0989M485j8246r611J111q733L894
$$ 254709 245692 254944 259651 262267 244894 230373 241362 245847 227601 217990 219101 210368 214262
10222B14262m842L413j2513j7829k2057J1318J1341o720K6827J8688J6058L519
$$ 214262 209420 212833 200320 182491 160434 171752 183093 176373 203200 221888 237946 241465
10210B41465j2854r866k0881K569J7605l517O227k658j2247N498J5429J0770P333
$$ 241465 228611 218745 197864 200433 218038 214521 220748 218090 205843 211341 226770 237540 244873
10197B44873o810L1181J4086L8648M9362N9927P6356N1655K907j7566n5313o7829
$$ 244873 238063 269244 283330 321978 371340 431267 507623 559278 562185 544619 489306 421477
10185D21477m9920m9684m1213l0219k1353j3556p452L030l126k0901Q230J1056
$$ 421477 371557 321873 280660 250441 229088 215532 208080 211110 207984 187083 195313 206369
10173B06369L443K135j0025k8642P598o213J0076q686m238K6769K3064O610J5492
$$ 206369 209812 211947 201922 173280 180878 174665 184741 176055 171817 198586 221650 228260 243752
10160B43752K3441L2790L0929J4758M357M581L967o642Q141J1881l664o056k1023
$$ 243752 267193 299983 330912 345670 350027 354608 358575 351933 360074 371955 368291 362235 341212
10147C41212j8241j2007k139j9645k4110o595j9281l1989j9743N615J8677J7110
$$ 341212 322971 310964 308825 289180 265070 258475 239194 207205 187462 193077 211754 228864
10135B28864J0696P455Q230J7803m375L985J2342M340M106N797l05k8151j8293
$$ 228864 239560 247015 255245 273048 268673 272658 285000 289340 293446 299243 298938 270787 252494
10122B52494q078j5488k3887P858n058j3983n482L1359L1230M4057R061K9689
$$ 252494 244416 228928 205041 212899 207841 193858 188376 219735 250965 295022 304083 333772
10110C33772J0406L1055O0235N5231Q5671J34092J84115K76266L38996K95720
$$ 333772 344178 375233 435468 490699 576370 710462 894577 1170843 1509839 1805559
10100A805559J85329J5763j36544j80590j01766L9185J85532L38287M53121M81917
$$ 1805559 1990888 2006651 1870107 1689517 1587751 1626936 1812468 2150755 2603876 3085793
10090C085793M08449K18285n8817l20056m35269m60834m20593l25456k43515j84386
$$ 3085793 3494242 3712527 3653710 3333654 2898385 2437551 2016958 1691502 1447987 1263601
10080A263601j47910j01389p9998n3499l7907k9440n0798n6253l3284l0411m2391
$$ 1263601 1115691 1014302 934304 880805 842898 813458 762660 706407 673123 642712 600321
10069F00321k5802r421k7993l2263l1675k4943j2440j5174m989j7402j0002j5436
$$ 600321 574519 565098 537105 504842 473167 448224 435784 420610 415621 398219 388217 372781
10057C72781n297j6039j9471k2097j0798Q524J755l153K3771L4823J3574N0038
$$ 372781 367484 351445 331974 309877 299079 307603 309358 306205 329976 364799 378373 428411
10045D28411M6347L4899n116p9538n5848k6339n704j4103J0656J5762j3534j9433
$$ 428411 474758 509657 504541 425003 369155 342816 337112 323009 333665 349427 335893 316460
10033C16460j7221p166j3904M377n614l4978j4554Q313j182j1494J245k4203k0047
$$ 316460 299239 292073 278169 282546 276932 241954 227400 235713 234531 223037 224282 200079 180032
10020A80032o704J335M180j834J681Q932j4675j1626K0970J1159L487P932p368
$$ 180032 173328 174663 178843 177009 178690 187622 172947 161321 182291 193450 196937 204869 197501
10007A97501J3715R427r830R045O681j2112l2463l1094k2873j8709j270L0630
$$ 197501 211216 220643 210813 219858 226539 214427 181964 150870 127997 109288 108018 138648
9995A38648J012R473j9592k3061N285J2016J3411q560j4727J0331J5409K727q910
$$ 138648 139660 149133 129541 106480 111765 123781 137192 128632 113905 124236 139645 142372 133462
9982A33462N702J916r561j2689Q842Q273o32Q827q80m819j2389j4354q204J4232
$$ 133462 139164 141080 131519 118830 127672 135945 135313 144140 143260 138441 126052 111698 103494 117726
9968A17726J658P974J2244l0611o252J927L931J9830j7202j0596J1795P611L095
$$ 117726 119384 127358 139602 108991 102739 104666 108597 128427 111225 100629 112424 120035 123130
9955A23130J3507j835j5319j6781q757K806k556o733N340k164m102o890j6287
$$ 123130 136637 134802 119483 102702 93945 96751 94195 87462 92802 90638 86536 79646 63359
9942F3359o084K4958K0206J366j1543n40N205j1261j7436j5111o36K03m679K30
$$ 63359 57275 82233 102439 103805 92262 91722 96927 85666 68230 53119 52483 52686 48007 48237
9928D8237q78m523J9909J0053j0064k261j3961m555l923O040J5595l408q612j722
$$ 48237 47359 42836 62745 72798 62734 60473 46512 41957 38034 44074 59669 56261 47649 45927
9914D5927P705K4207K1283p63k2267q355m497M617N913k157j7573k445K8296o129
$$ 45927 53632 77839 99122 98359 76092 67737 63240 67857 73770 71613 54040 51595 79891 73762
9900G3762k2579K326K6551J3260j327J6420M6846O5464Q3333J24654J46377J76390
$$ 73762 51183 53509 80060 93320 91993 108413 155259 220723 304056 428710 575087 751477
9888G51477J78173J02160N8081k7486j53020j67055j52086j47204j06218o9653
$$ 751477 929650 1031810 1089891 1062405 909385 742330 590244 443040 336822 267169
9878B67169m4288j0573m708K242o880k7643m538j3685j8182r908q824N10N451
$$ 267169 222881 212308 207600 209842 202962 175319 170781 157096 138914 129006 120182 120692 126143
9865A26143J849M089k2154j6556K8237k852m902N648m404k4516q283R338J0814
$$ 126143 127992 132081 109927 93371 121608 118756 113854 119502 115098 90582 82299 91637 102451
9852A02451L3715J3180r342l0467k0184J7636J5501k2592j5402j3374j858m178
$$ 102451 136166 149346 140004 109537 89353 106989 122490 99898 84496 71122 69264 65086
9840F5086Q682k205J539j1522J1507K524j4402p098M239J4253j669J7819m05o518
$$ 65086 73768 71563 73102 61580 73087 75611 61209 54111 58350 72603 70934 88753 88348 81830
9826H1830k9586j7311K3627J793m973k65J1550l392k3559P919J3835n538O384
$$ 81830 52244 34933 58560 60353 55380 55115 66665 63273 39714 47633 61468 55930 62314
9813F2314J8947l0145j0519J6798J6236j7663j0429R119r939k352J0495J2459
$$ 62314 81261 51116 40597 57395 73631 55968 45539 54658 44719 42367 52862 65321
9801F5321p674p151q788K0576k998N244k2719n473P406n434M531M848j0803R05
$$ 65321 57647 50496 41708 62284 59286 64530 41811 36338 43744 38310 42841 47689 36886 37791
9787C7791K0000J3490N967J5538J7589J3364J5560L2192P966L8944M4038J8446
$$ 37791 57791 71281 77248 92786 110375 123739 139299 171491 179457 218401 262439 280885
9775B80885M825k6713l8977k5766k6957j7739k2495p745l5920k005P329M732j406
$$ 280885 285710 258997 220020 194254 167297 149558 127063 119318 83398 81393 88722 93454 92048
9762I2048J1149j1814l1486p815j917j2564J7218Q641l983k2813j3884O195l46
$$ 92048 103197 91383 59897 52082 50165 37601 54819 63460 59477 36664 22780 28975 28629
9749B8629j184O842J5044J6045O707o25j6215l2642N87Q603J9757J579J2285j121
$$ 28629 27445 34287 49331 65376 72083 71458 55243 22601 23188 31791 51548 53127 65412 64291
9735F4291R069k846k7170j7005M919N809N012j0243L322j3781j2872Q110J0777
$$ 64291 73360 70514 43344 26339 31258 37067 42079 31836 35158 21377 8505 16615 27392
9722B7392KK3829L4041K2679k936k1610j5540p326R298o264j8252n140j8495R41
$$ 27392 27394 51223 85264 107943 105007 83397 67857 60531 69829 63565 45313 40173 21678 22619
9708B2619kj1271O810M150o67J7952L125j7762J232Q551j1578P714Q398o436K79
$$ 22619 22617 11346 18156 22306 21639 39591 42716 24954 26186 34737 23159 30873 39271 32835 33114
9693C3114L061n166k3413N095J1380J4576O979k4271l3951K943O538K4007J5727
$$ 33114 36175 31009 7596 12691 24071 38647 45626 21355 -12596 -9653 -3115 20892 36619
9680C6619j2833j0677J2558K8287L1478p004j7737j4004j9734j3810m005R881
$$ 36619 23786 13109 25667 53954 85432 78428 60691 46687 26953 13143 9138 19019
9668A9019O820J8811J6587O943L02k675o532m921k179N533P821k655o596k1001
$$ 19019 25839 44650 61237 68180 68482 65807 59275 54354 52175 57708 65529 62874 56278 35277
9654C5277j7875k876j7689O195J9412J3010J1275k981n970m947j3414r555J4037
$$ 35277 17402 14526 -3163 3032 22444 35454 46729 43748 37778 32831 19417 9862 23899
9641B3899j784j3318O807K2090Q260m971J6882q827j5715j4479P761J2059j3164
$$ 23899 22115 8797 15604 37694 45954 40983 57865 49038 33323 18844 26605 38664 25500
9628B5500l992P606j3073Q811R368j1530N797l546o846q36O939m484j8628q218
$$ 25500 21508 29114 16041 24852 34220 22690 28487 24941 18095 17259 24198 19714 1086 -7132
9614g132j1063J527m834R417P21n331L556P718N318J5118M336K044N933J1697
$$ -7132 -18195 -16668 -21502 -12085 -11364 -16695 -13139 -5421 -103 15015 19351 21395 27328 39025
9600C9025J5815p416Q298k7873q815j1080K370P419j845j6970p218J138K8208
$$ 39025 54840 47424 55722 27849 19034 7954 10324 17743 15898 -1072 -8290 -7152 21056
9587B1056K2913j212j0379p417j442q737k5587j869J7192P881n843l465J7300
$$ 21056 43969 42757 32378 24961 23519 14782 -10805 -12674 4518 12399 6556 3091 20391
9574B0391K630k0511O080Q647J9826P363J3992O663j2297j7438P397o067j7409
$$ 20391 23021 2510 8590 17237 37063 44426 58418 65081 52784 35346 42743 36676 19267
9561A9267P761j2145Q605J5576r128P596j0636j0m093J458J0178o373m882l602
$$ 19267 27028 14883 23488 39064 29936 37532 26896 26886 22793 24251 34429 28056 23174 19572
9547A9572m202j875O706j128l647K95j8678O439O64o199o282J8163N787p332j538
$$ 19572 15370 13495 20201 19073 15426 15721 -2957 3482 4146 -2053 -8335 9828 15615 8283 6745
9532F745P352q427m997J4939L854l172j3175J6285K2431R993j425j1040l765J194
$$ 6745 14097 5670 673 15612 19466 16294 3119 19404 41835 51828 50403 39363 35598 36792
9518C6792Q515M73k646j1078m027L198r078r555j5343o180k213j5560l221K9464
$$ 36792 45307 45780 43134 32056 28029 31227 22149 12594 -2749 -8929 -11142 -26702 -29923 -459
9504d59J4237P478l324J1710K180p234p376j7573R34O326J266L2481K524j0890
$$ -459 13778 21256 17932 29642 31822 24588 17212 -361 573 6899 8165 40646 43170 32280
9490C2280j6470p853Q827J3792k912j2320j0384q964J1559Q882m493j6012J986
$$ 32280 15810 7957 16784 30576 27664 15344 4960 -4004 7555 16437 11944 -4068 -2082
9477b082Q444k196R939N300j46p848L697J977J3619J3607o910k4576J3560J6461
$$ -2082 6362 4166 14105 19405 19259 11411 15108 17085 30704 44311 37401 12825 26385 42846
9463D2846j5105R90J4727m131j9350r274J3860p801j9880j4649R121J0610j3876
$$ 42846 27741 28731 43458 39327 19977 10703 24563 16762 -3118 -17767 -8646 1964 -11912
9450a1912p034J2539K2870M473m153n537J8970q620j5495n672R016M728K488N368
$$ -11912 -18946 -6407 16463 20936 16783 11246 30216 21596 6101 429 9445 14173 16661 22029
9436B2029O255j70o52J2777N148r101p364p237L162j1648J564J4783l159J053
$$ 22029 28284 28114 27462 40239 45387 36286 28922 21685 24847 13199 14763 29546 26387 27440
9422B7440j8236M36N860j9490M669N707J6566N006k46L067n733j807j9292k5117
$$ 27440 9204 9640 15500 -3990 679 6386 22952 27958 27712 30779 25046 23239 3947 -21170
9408b1170Q685J5168J9213M2333l71K934Q319m160m8125j8947l472l761O447j647
$$ -21170 -12485 2683 21896 64229 63858 66792 75111 70951 22826 3879 407 -3354 3093 1446
9394A446r013J3322K5697J1023q582j2366K3274K3114M689j5419l323J688o817
$$ 1446 -7567 5755 31452 42475 33893 21527 44801 67915 72604 57185 53862 55550 48733
9381D8733m6j8918k1257q225J6880P383J2936j3951j697J3549K1914R357r180
$$ 48733 48687 29769 8512 287 17167 24550 37486 23535 21838 35387 57301 66658 57478
9368E7478j3817O715l64p933N823k824J0260r938n148p773j3149j9712J4541J7032
$$ 57478 43661 50376 50012 42079 47902 45078 55338 45400 40252 32479 19330 -382 14159 31191
9354C1191Q848j2188l462m980n660o991J5274J414q99K216P112n236K346l754
$$ 31191 40039 27851 24389 19409 13749 6758 22032 23446 22547 24763 31875 26639 28985 25231
9340B5231k0452J3539R194l597O150k054J0856K6252R957j7006K0865L713j5004
$$ 25231 4779 18318 27512 23915 30065 28011 38867 65119 75076 58070 78935 82648 67644
9327F7644k7175q915o754j5724J3529K4637R775j0808r188M009l815j1933O161
$$ 67644 40469 31554 24800 9076 22605 47242 57017 46209 37021 41030 37215 25282 31443
9314C1443N216K551o19o650k554k680k749j2900j5280l536L583Q350J2265J0165
$$ 31443 36659 39210 38591 31941 29387 26707 23958 11058 -4222 -7758 -4175 4175 16440 26605
9300B6605J3746M324K4658q765J372p080j6878j6329O322L225J4293J2461k634
$$ 26605 40351 44675 69333 60568 61940 54860 37982 21653 27975 31200 45493 57954 55320
9287E5320N121O278K105O542P384m783j504K771j6538l4381j151J8142J0677j2533
$$ 55320 60441 66719 68824 75366 82750 77967 76463 79234 62696 28315 27164 45306 55983 43450
9273D3450J778K0026R704N401K98j695r512o009J1779L454k3307r781Q46r276
$$ 43450 45228 65254 74958 80359 80657 78962 69450 63441 75220 78674 55367 45586 46432 37156
9259C7156O042Q163L706j6461K3901j2118j6623O873Q889J2460J340k449J4972
$$ 37156 43198 51361 55067 38606 62507 50389 33766 40639 49528 61988 63328 60879 75851
9246G5851K069k8532r670K524N730o920O537L023J4859M906J2348M79j0028L166
$$ 75851 77920 49388 39718 42242 47972 41052 47589 50612 65471 70377 82725 83204 73176 76342
9232G6342Q591r794m900J1244J0044p192k8373K463K6499j8151L811R735L698
$$ 76342 84933 75139 70239 81483 91527 84335 55962 58425 84924 66773 70584 80319 84017
9219H4017j0671j8292P58j839r121m508K040J3819K2059J460J379L498j4419m733
$$ 84017 73346 55054 55812 53973 44852 40344 42384 56203 78262 79722 81101 84599 70180 65447
9205F5447J0398J8962J1604j2K706K738O873j917R297Q410j8789j4630j1392k2443
$$ 65447 75845 94807 106411 106399 109105 111843 118716 116799 126096 134506 115717 101087 89695 67252
9191F7252p788j135R659J4555q39j8397j390N096j0553L422K0490J6245m105l3409
$$ 67252 59464 58329 67988 82543 81704 63307 61917 67013 56460 59882 80372 96617 92512 59103
9177E9103k1592K797P318J852J306N344J1797R459J1296k76P430P557Q78J1511
$$ 59103 37511 40308 47626 49478 50784 56128 67925 77384 88680 88404 95834 103391 104269 115780
9163A15780M1850K6641J7330L2916j243j271J3241r202O78j5111k8090O194q905
$$ 115780 157630 184271 201601 234517 233274 232003 245244 236042 236720 221609 193519 199713 190808
9150A90808l8649r645J0564k48O235K6119J1015k584J0236J0287J0581K8622N060
$$ 190808 152159 142514 153078 152830 159065 185184 196199 193615 203851 214138 224719 253341 258401
9137B58401p124k8536j8748j9018N80k0285j8764J5286M897m426j296m97o348
$$ 258401 251277 222741 203993 184975 185555 165270 146506 161792 166689 162263 160967 160470 154122
9124A54122j2608n005O341J1977J7084K3945K6460j321J7588J2649K2567J6049
$$ 154122 141514 136509 142850 154827 171911 195856 222316 220995 238583 251232 273799 289848
9112B89848J247L1357M3842K2601j873l672o968m582N875J0260K131P450k756
$$ 289848 291095 322452 366294 388895 387022 383350 376382 371800 377675 387935 390066 397516 394760
9099C94760j5057r666m456k8953l2848l1318j2540k462j4746j9031k850J1795
$$ 394760 379703 370037 365581 336628 303780 272462 259922 257460 242714 223683 220833 232628
9087B32628o229j7592L2664K6079J4679J5567p465k1674n346j479P26o259j3886
$$ 232628 226399 208807 241471 267550 282229 297796 290331 268657 263311 261832 262558 256299 242413
9074B42413j3692q866p51K5634K0321J7426J2706j0507k411O081m318R997j068
$$ 242413 228721 219855 219104 244738 265059 282485 295191 284684 282273 288354 284036 294033 292965
9061B92965O60J2243L8647K4939Q102n896j6648j7353n501j4474k2932m5M308
$$ 292965 293625 305868 344515 369454 377556 371660 355012 337659 332158 317684 294752 294707 299015
9048B99015J7794n80q335j632m208j6873J929j3505N88P462P230p418R606K793
$$ 299015 316809 316229 307894 306262 302054 285181 287110 273605 274193 281655 288885 281467 291073 293866
9034B93866m758m240l9665l6857p960j4713L391Q665O75k60j2293j6180Q396J1539
$$ 293866 289108 284868 245203 208346 200386 185673 189064 197729 198404 198144 185851 169671 178067 189606
9020A89606l042R35J2504K170j244J4018L7573K9294J9374J0425L040j3007J550
$$ 189606 186564 187499 200003 202173 200929 214947 252520 281814 301188 311613 314653 301646 303196
9007C03196J6840m30r039k2806q332J5169j8280k5824K659l799j4647o032J3521
$$ 303196 320036 319606 310567 287761 279429 294598 276318 250494 253153 249354 234707 228675 242196
8994B42196R170L867k301K2180J834k9555r086k179L1350J9926j8934j5034N511
$$ 242196 251366 255233 252932 275112 276946 247391 238305 236126 267476 287402 268468 253434 258945
8981B58945J1332J8577J4122J1780P131j734J0231j5975m329R79q51J3835k803
$$ 258945 270277 288854 302976 314756 321887 320153 330384 314409 310080 311059 310208 324043 321240
8968C21240j1325M004R871O199R555K8802J2305J4264K0900K1261o510j7281R44
$$ 321240 309915 313919 323790 329989 339544 368346 380651 394915 415815 437076 430566 413285 414229
8955D14229R703Q951K3130K1352K6776P174O555j241p965J414q286p143J5773
$$ 414229 423932 432883 456013 477365 504141 511315 517870 516629 508664 510078 501792 494649 510422
8942E10422J1025K200L542K5076J5964L2449O248p569Q708K2213K0336J1806o568
$$ 510422 521447 523647 527189 552265 568229 600678 606926 599357 608065 630278 650614 662420 655852
8929F55852K8447K2192L151K0814L2714L9594J4233K0978L3270L0459M8024L5284
$$ 655852 684299 706491 709642 730456 763170 802764 816997 837975 871245 901704 949728 985012
8917I85012K6943K4855K8811P2299O2109N3687L9042L6312M4231O5138N2980N1127
$$ 985012 1011955 1036810 1065621 1137920 1200029 1253716 1292758 1329070 1373301 1438439 1491419 1542546
8905A542546K4089L4931M9162K6801L6647N8709O5891O0046P5505P7190Q8457
$$ 1542546 1566635 1601566 1650728 1677529 1714176 1772885 1838776 1898822 1974327 2051517 2139974
8894B139974J06959J12852J21325J33467J27934J21034J46168J67229J92343K20921
$$ 2139974 2246933 2359785 2481110 2614577 2742511 2863545 3009713 3176942 3369285 3590206
8884C590206K31202K57025K86478L17726L51980L92261M38706N11389N81093O13372
$$ 3590206 3821408 4078433 4364911 4682637 5034617 5426878 5865584 6376973 6958066 7571438
8874G571438P00337Q00326R36945J081870J255474J483325J704400J981268K296485
$$ 7571438 8271775 9072101 10009046 11090916 12346390 13829715 15534115 17515383 19811868
8865A9811868K633741L007859L379541L684324L853779L774820L397409K671201
$$ 19811868 22445609 25453468 28833009 32517333 36371112 40145932 43543341 46214542
8857D6214542J604908L54979q48767j874748k635136l032838l138287l068678
$$ 46214542 47819450 48174429 47325662 45450914 42815778 39782940 36644653 33575975
8849C3575975k864559k595475k308804k064513j842432j603131j415453j261397
$$ 33575975 30711416 28115941 25807137 23742624 21900192 20297061 18881608 17620211
8841A7620211j133435r85935q61282p76926p10554o63656n92951n20011m83820
$$ 17620211 16486776 15500841 14639559 13862633 13152079 12488423 11895472 11375461 10891641
8832A0891641m83872m28723l70445l43921l24945l05988l06224k83012k57153
$$ 10891641 10407769 9979046 9608601 9264680 8939735 8633747 8327523 8044511 7787358
8823G787358k28632k09367k19930k00891j85976j85673j71492j79079j59361j31928
$$ 7787358 7558726 7349359 7129429 6928538 6742562 6556889 6385397 6206318 6046957 5915029
8813E915029j54281j53357j36742j25786j34080j36434j39727j40131j55891j51579
$$ 5915029 5760748 5607391 5470649 5344863 5210783 5074349 4934622 4794491 4638600 4487021
8803D487021r5018j08419j03429j15620r0776o4158j06385r2594j02334p5148
$$ 4487021 4392003 4283584 4180155 4064535 3973759 3909601 3803216 3710622 3608288 3533140
8793C533140o0532o6234o8764m5101o8018p9182q6154o2730m7781m5581n6914
$$ 3533140 3472608 3406374 3337610 3292509 3224491 3145309 3059155 2996425 2948644 2903063 2846149
8782B846149n7950o3925m8164m0878k0508n0446n5040l9446l1064l0805k7846
$$ 2846149 2788199 2724274 2676110 2635232 2614724 2564278 2509238 2469792 2438728 2407923 2380077
8771B380077k9539l1411k9353l0000m1358o2285m2442k2241l5241o3712k0212
$$ 2380077 2350538 2319127 2289774 2259774 2218416 2156131 2113689 2091448 2056207 1992495 1972283
8760A972283m8769o9313m0571m4492l1634k6443l9459j8708k6309j5324k7424
$$ 1972283 1923514 1854201 1813630 1769138 1737504 1711061 1671602 1652894 1626585 1611261 1583837
8749A583837l9231l2274l4971k1306k4596Q2j8824n3147l4712l4098k6908k7136
$$ 1583837 1544606 1512332 1477361 1456055 1431459 1431541 1412717 1359570 1324858 1290760 1263852 1236716
8737A236716j7844j8909j9311n04O19K562l876o777j6812j5633J50l987j8126
$$ 1236716 1218872 1199963 1180652 1180148 1180767 1183329 1179453 1172676 1155864 1140231 1140381 1136394 1118268
8724A118268k3324p417r710j4924k6312k9134l2119k8187j8856j1055j8745j6773
$$ 1118268 1094944 1087527 1077817 1062893 1036581 1007447 975328 947141 928285 917230 898485 881712
8712H81712k658j7862k3115l979j8721k2522j1056j5764j4984m758J941r707K0527
$$ 881712 879054 861192 838077 834098 815377 792855 781799 766035 751051 746293 748234 738527 759054
8699G59054r789k0531l8777k296O679j4807j4807q525k7284k4257q481L743J5683
$$ 759054 749265 728734 689957 687661 694340 679533 664726 656201 628917 604660 596179 599922 615605
8686F15605p879j4341j4654m706K848j1304j9444k1973O551j59J0606q576j6626
$$ 615605 607726 593385 578731 574025 576873 565569 546125 524152 530703 530544 541150 532574 515948
8673E15948r268k0535K844J0m693p614j6979k6067j4551J8696l950p111k7013
$$ 515948 506680 486145 488989 488999 484306 476692 459713 433646 419095 437791 433841 426730 399717
8660C99717j3661O644Q946M399K508j5125j0832o774J2335M777k1147q726J575
$$ 399717 386056 392700 401646 406045 408553 393428 382596 375822 388157 392934 371787 363061 364636
8647C64636P347l6730P636K0387M113J371l1142k54N711m245J596o709p675K146
$$ 364636 371983 335253 342889 363276 367389 368760 337618 337364 343075 338830 340426 333717 326042 328188
8633C28188j2786k3223K44M195m855N880o109j5983N170J1699n560q593J1696
$$ 328188 315402 292179 292423 296618 291763 297643 291534 275551 280721 292420 286860 278267 289963
8620B89963J9379q103m840n231n133K849j0216J871M426P816Q543R83M369J1414
$$ 289963 309342 301239 296399 291168 286035 288884 278668 280539 284965 292781 301324 302307 306676 318090
8606C18090J909O859j1300m905J2479j0543l178o409m829j6316k3226j8725J709
$$ 318090 319999 326858 315558 310653 323132 312589 309411 303002 298173 281857 258631 239906 241615
8593B41615J8111l998k1089r257L025p988r127J2999J3175k9444k2776m982K52
$$ 241615 259726 255728 234639 225382 228407 220419 211292 224291 237466 208022 185246 180264 180516
8580A80516P101J4309K779k4096j2716j1111R650m984M50j3591K1888J6863l580
$$ 180516 187617 201926 204705 180609 167893 156782 166432 161448 161898 148307 170195 187058 183478
8567A83478q583J0883J7454J614q027k2306n784R625J2710K2018M184P936k2929
$$ 183478 174895 185778 203232 204846 196819 174513 168729 178354 191064 213082 217266 225202 202273
8554B02273j5457j3439k279k43J0866k1255j8847R198j762l121j569m439l7036
$$ 202273 186816 173377 171098 170855 181721 160466 141619 150817 149055 145934 144365 139926 102890
8541A02890J3606J4084m498k0498o914O860M194n857R818j8134j4856J8550l201
$$ 102890 116496 130580 126082 105584 98670 105530 109724 103867 113685 95551 80695 99245 96044
8528I6044j4685J990Q605J2623J8957K711r524m549O086j3552j852O561J3864
$$ 96044 81359 83349 91954 104577 123534 126245 116721 112172 118258 104706 102854 109415 123279
8515A23279J4099J516L837m385j6712n445o323K474J1565O55n851Q61p163K861
$$ 123279 137378 138894 142731 138346 121634 116189 109866 112340 123905 124560 118709 119570 112407 115268
8501A15268j4395K626J0469K911k8261J0827J7209k9958R234K5731k574k8757
$$ 115268 100873 103499 113968 116879 88618 99445 116654 86696 95930 121661 119087 90330
8489I0330k4720J6891K5355J2092j9664j8703J355K118K263l829j9236k0697J8134
$$ 90330 65610 82501 107856 119948 100284 81581 82936 85054 87317 83488 64252 43555 61689
8476F1689J4479J093r000o832J0238J731O13O418j626j7268J5721J2239N022n608
$$ 61689 76168 77261 68261 61429 71667 73398 74011 80429 78803 61535 77256 89495 94517 88909
8462H8909l235m571n522n699j3441j5717l66J1093o602j3631K1019J2146O718
$$ 88909 85674 81103 75581 69882 56441 40724 40358 51451 44849 31218 52237 64383 71101
8449G1101p921k973J8970k656J703n585L932K707k0676Q125O331l970q506j2545
$$ 71101 63180 60207 79177 76521 78224 72639 76571 79278 58602 66727 73058 69088 60582 48037
8435D8037m843m484l970n045K1977J2565j912k3986J0427K0845O862j4119J900
$$ 48037 43194 38710 34740 29695 51672 64237 62325 38339 48766 69611 76473 62354 64254
8422F4254N028r965j207R113L188p880J2790M7858L6720J0475l766Q098j2631
$$ 64254 69282 59317 58110 67223 70411 62531 75321 123179 159899 170374 166608 174706 162075
8409A62075j0522r591r395j2878p871j1320k2472q081K950j0277p738K4394q458
$$ 162075 151553 141962 132567 119689 111818 100498 78026 69945 72895 62618 54880 79274 70816
8396G0816k1669N716l205j368J2679p830j836R502o702j904l989k149n829j7389
$$ 70816 49147 54863 51658 50290 62969 55139 53303 62805 56103 54199 50210 48061 42232 24843
8382B4843K774M428j5054q049K2937J6872P439O874J0910l471M749O792J074k79
$$ 24843 27617 32045 16991 8942 31879 48751 56190 63064 73974 70503 75252 82044 83118 82839
8368H2839J8495M1173N1055M1806J5814k3220l5079k6703j9268l3656l8750l883
$$ 82839 101334 142507 193562 235368 251182 227962 192883 166180 146912 113256 74506 70623
8356G0623q165j6435L660Q119J8634J2530q768j7099j5283k017J446o845j638
$$ 70623 62458 46023 49683 57802 76436 88966 80198 63099 47816 45799 47245 40400 38762
8343C8762Q774R811M505k804j8458k2623r169J3621K7680J5169N647m681Q154
$$ 38762 47536 57347 61852 59048 40590 17967 8798 22419 50099 65268 70915 66234 74388
8330G4388K97k6965L731o550K6305j2718R196n379J1071J2695J2400q096J8854
$$ 74388 74685 47720 51451 44901 71206 58488 67684 62305 73376 86071 98471 90375 109229
8317A09229K2571p33k335l0171j09r758j0035l7193q749N490Q462j4334L373N94
$$ 109229 131800 131067 128732 98561 98452 88694 78659 41466 32717 38207 46669 32335 35708 36302
8303C6302j0493J4316j7222K447M733l834R780j2513l737l595K1451L6271K6266
$$ 36302 25809 40125 22903 25350 30083 26249 36029 23516 19779 16184 37635 73906 100172
8290A00172J2698P296j2793r469m407j2988k7641j3024r603Q84l560p711J0830
$$ 100172 112870 120166 107373 97904 93497 80509 52868 39844 30241 31125 27565 19854 30684
8277C0684N399O637n858k877j251l67j2291j3803R96M67K654J4067J0091l273
$$ 30684 36083 42720 36862 33985 32734 32367 20076 6273 7269 7736 10390 24457 34548 31275
8263C1275J1298n705o610j6389j5401k072O909J2313P300o063n43O180j1468M64
$$ 31275 42573 36868 30258 13869 -1532 -3604 3305 15618 22918 16855 16312 22492 11024 11488
8249A1488J4382q458k14O673P551J0390j1776P984l615J719n278r42J0027j2098
$$ 11488 25870 17412 17198 23871 31422 41812 30036 38020 34405 36124 30846 29904 39931 27833
8235B7833K019J0656j3522q585p809k596J4068J1516j5Q915K297k1202j8232R882
$$ 27833 29852 40508 26986 18401 10592 7996 22064 33580 33565 42480 44777 23575 5343 15225
8221A5225J8036j0673l934N180p345j223O188j536k0330M680L1972R602M556j215
$$ 15225 33261 22588 18654 23834 16489 15266 21454 19918 -412 4268 36240 45842 50398 49183
8207D9183j1786k138j6396J390J1430J3468K1098J69r726j7058r783J8450J0854
$$ 49183 37397 35259 18863 20253 31683 45151 66249 66418 56692 39634 29851 48301 59155
8194E9155L948K810J912j4895n739m488O956m05K449o795n240K950q867m84L890
$$ 59155 63103 65913 67825 52930 47191 42703 49659 49254 51703 44908 39668 42618 33751 33267 37157
8179C7157O249P089L144n337j981L0046J6437p729J5863J5730M2038N8488R2534
$$ 37157 43406 50495 53639 48302 46321 76367 92804 85075 100938 116668 158706 217194 309728
8166C09728J08117J12815R1218P4839N8694n616m6359o8568q0182r4084q1902
$$ 309728 417845 530660 621878 696717 755411 749795 703436 634868 554686 460602 378700
8155C78700m3980k6263l7772l6051j4917j4839L094j6546j1628O955j0595j6345
$$ 378700 334720 308457 270685 234634 219717 204878 207972 191426 179798 186753 176158 159813
8143A59813k0976q258K3103Q995j0885j1021p065K773J646k2080K888J6969L437
$$ 159813 138837 130579 153682 162677 151792 140771 133706 136479 138125 116045 118933 135902 139339
8130A39339L213r15J1917L706J6133K9529O5278R0326R2031J60140K05904K21939
$$ 139339 142552 141637 153554 157260 173393 202922 268200 358526 450557 610697 816601 1038540
8118A038540K46772J96435R3670p0595j96673k15718k30127j84644j23479q4251
$$ 1038540 1285312 1481747 1575417 1504822 1308149 1092431 862304 677660 554181 469930
8108D69930o7370l3476M940n518l1903k8981j5383k891j412j0014j9538J2349
$$ 469930 402560 369084 374024 368506 336603 307622 292239 289348 287936 277922 258384 270733
8096B70733o116j4300j7779j8884p523j8263K1146J266O404R573j1910J65l158
$$ 270733 264617 250317 232538 213654 206131 187868 209014 210280 216684 226257 214347 214512 211354
8083B11354J9092J3263L922O038J0871M5988M3650N4567O5093Q6887Q7543N9103
$$ 211354 230446 243709 247631 253669 264540 310528 354178 408745 473838 560725 648268 707371
8071G07371L7478q043n7984n3959p6626p1183r7901o4437n5061j4401j7515q362
$$ 707371 744849 736806 678822 624863 548237 477054 379153 314716 259655 245254 227739 219377
8059B19377J0159Q803j1062k170q71L718m803k0156m102j0181M428L957M810j5365
$$ 219377 229536 238339 227277 225107 224236 227954 223151 202995 198893 188712 193140 197097 201907 186542
8045A86542k1129n111P744n820J57o346o498p271P955Q051J3004K0584j2936j3739
$$ 186542 165413 160302 168046 162226 162383 156037 149539 142268 150223 158274 171278 191862 178926 165187
8031A65187J5607J0703l4408k5441J2892O177j865m520j4087m537p209J0301L15
$$ 165187 180794 191497 157089 131648 144540 150717 148852 144332 130245 125708 118499 128800 129115
8018A29115j0294l507j0367J825J1208n653O021J2828j944j3949k6712j2372n36
$$ 129115 118821 115314 104947 106772 117980 112327 118348 131176 129232 115283 88571 76199 75663
8005G5663M779K4696k537j8154j3933k562J26M936m142P237P458J2090k0114r830
$$ 75663 80442 105138 102601 84447 70514 67952 68078 73014 68872 76109 83567 95657 75543 65713
7991F5713K0982P643J289J5289m919k346J5796M780k1556j1462j3306k4878j8231
$$ 65713 86695 94338 95627 110916 105997 103651 119447 124227 102671 91209 77903 53025 34794
7978C4794M885J4360J4998J7769M090N02j6234j03R894n317j7056O954p020N323
$$ 34794 39679 54039 69037 86806 90896 91398 75164 75061 84955 79638 62582 69536 62516 67839
7964F7839J6451M349k8918O89N514n029O084J533l112r993J0512K6577o371j2602
$$ 67839 84290 88639 59721 60410 65924 60895 66979 68512 65400 55407 65919 92496 86125 73523
7950G3523j0416N511k1301j2680l40O134K434m066N511j2263J817J9609Q109J4801
$$ 73523 63107 68618 47317 34637 34297 40431 42865 38799 44310 32047 33864 53473 61582 76383
7936G6383M274j8952r848j1301L451J6152j365J6131J6503l740k2426J830n710
$$ 76383 80657 61705 51857 40556 44007 60159 58794 74925 91428 87688 65262 67092 61382
7923F1382j4396k560j477O847p855l04O828O655j2825Q71K1610p974j9397n850
$$ 61382 46986 44426 42949 49796 41941 41637 48465 55120 42295 43166 64776 56802 37405 31555
7909C1555K875J5108j2006m843j1653j0347m026K4409J894j2005j4409J9895O410
$$ 31555 34430 49538 37532 32689 21036 10689 6663 31072 32966 20961 6552 26447 32857
7896C2857M502j4625j9913J1903K7436P429j4876J388q430r843r351l772J0752
$$ 32857 37359 22734 2821 14724 42160 49589 34713 36101 27671 17828 8477 4705 15457
7883A5457Q147j1603q104N369M324k1721K764Q182K502J5541J4499O402N863j6752
$$ 15457 23604 12001 3897 9266 13590 -8131 -5367 2815 5317 20858 35357 41759 47622 30870
7869C0870j0478P157L464k3306m251j802P0K1113p145k7196j4761P748M5149J1285
$$ 30870 20392 27549 31013 7707 3456 1654 1724 22837 15692 -11504 -26265 -18517 26632 37917
7855C7917l1882l621k161J5376O792n702M181K4184p302J691l374j1055j7517
$$ 37917 6035 2414 253 15629 22421 16719 20900 45084 37782 39473 36099 25044 7527
7842G527j31j4420k4801K810K3406J0124K973j2058L806m724M59N703J4933q889
$$ 7527 7396 -7024 -31825 -29015 -5609 4515 7488 -4570 -764 -5488 -5029 674 15607 6718
7828F718l2017r204L9901J2267r766m122K026q468l952O163M57O39M501N050j5706
$$ 6718 -25299 -34503 5398 17665 7899 3777 5803 -2665 -6617 -454 3 642 5143 10193 -5513
7813e513q571n17q099M374J2038J5062m92K795l841j4763k002o560M620L03r516
$$ -5513 -14084 -14601 -22700 -18326 -6288 8774 8282 11077 7236 -7527 -9529 -16089 -11469 -11166 -20682
7798b0682m021J4387n883j3276N667M266K0262k021L525M914K864k7319J1910
$$ -20682 -24703 -10316 -16199 -29475 -23808 -19542 720 -1301 2224 7138 10002 -17317 -5407
7785e407K4072m229p847l168k633p515p48P228Q971l470j1467M853m908j7515
$$ -5407 18665 14436 6589 3421 788 -6727 -7475 -247 8724 5254 -6213 -1360 -6268 -23783
7771b3783o040J6609J5946L315o637Q737J0910q368j5605j4777O35J4868m982
$$ -23783 -29823 -13214 2732 6047 -590 8147 19057 10689 -4916 -19693 -19058 -4190 -9172
7758i172J8890K053n348j6513l754n388M449J846n211L966J0359N866j977K817
$$ -9172 9718 11771 6423 -10090 -13844 -19232 -14783 -12937 -18148 -14182 -3823 2043 66 2883
7744B883K941J162R844m845l1557Q30j352L624R20q34K6074K9048P840j5386k5270
$$ 2883 5824 6986 16830 11985 -19572 -18742 -20094 -16470 -15550 -16384 9690 38738 46578 31192 5922
7729E922q542O38J4211P05q317J0155Q663M108p127J726j3690L358J174p235j5770
$$ 5922 -2620 -1982 12229 12934 4617 14772 23435 27543 20416 22142 8452 11810 12984 5749 -10021
7714a0021P124Q519R0J6834N279o463k0477j7817o073Q394L6538q13j8298N342
$$ -10021 -2897 5622 5712 22546 27825 21362 885 -16932 -23005 -14611 21927 21114 2816 8158
7700H158m949O96N806K3213j8026O011j6832j2326k159O335J45j1109k877K8557
$$ 8158 3209 3905 9711 32924 14898 20909 4077 -8249 -10408 -4073 -3928 -15037 -17914 10643
7686A0643K7257j8942k5201j8144K824K2047J0748L183m709j3395K856k299M061
$$ 10643 37900 18958 -6243 -24387 -21563 484 11232 14415 9706 -3689 -833 -3132 929
7673I29P376j2513m79k878m36j6866L67J3858K1765J6507O609l366q328J119p09
$$ 929 8305 -4208 -4687 -7565 -8001 -24867 -24500 -10642 11123 27630 34239 30873 22545 23664 22955
7658B2955L730j4926j3121j1928J6155P938m667p070l144j1636n922J4579K561
$$ 22955 26685 11759 -1362 -13290 2865 10803 6136 -934 -4078 -15714 -21636 -7057 -4496
7645d496n284N71j021J1941N448l658J1620J5550N788m949j7420K1391K3119j142
$$ -4496 -9780 -9209 -10230 1711 7159 3501 15121 30671 36459 31510 14090 35481 58600 57458
7631E7458j1605j0903k5048j3373r293l955J2163K5537M590q520k782k5580k561
$$ 57458 45853 34950 9902 -3471 -12764 -16719 -4556 20981 25571 17051 14269 -11311 -13872
7618a3872J6026j0487n602N134J3693K159N522M69k0464k137K076j0165q946M364
$$ -13872 2154 -8333 -13935 -8801 4892 7051 12573 13042 -7422 -9559 -7483 -17648 -26594 -22230
7604b2230P540L862J4457O707j2979r919M173J2740N824j331R711p042P831j1598
$$ -22230 -14690 -10828 3629 10336 -2643 -12562 -8389 4351 10175 8844 18555 11513 19344 7746
7590G746r682q023M074Q977j1972j2565k7351n717J3355J9711N756K244l51j35
$$ 7746 -1936 -9959 -5885 3092 -8880 -21445 -48796 -54513 -41158 -21447 -15691 -13447 -13798 -13933
7576a3933j8645o440p909l349R081J5062K0487l968K027p218q46r488L50M507
$$ -13933 -32578 -39018 -46927 -50276 -41195 -26133 -5646 -9614 -7587 -14805 -15651 -25139 -24789 -20282
7562b0282J9973K2388r245k7259j4395R172O899q129m555P377O143L418Q370L534
$$ -20282 -309 22079 12834 -14425 -28820 -19648 -12749 -20878 -25433 -18056 -11913 -8495 -125 3409
7548C409k871j0641R799K1402J7593J083k0408j8699j9472Q166J7679M225K5541
$$ 3409 538 -10103 -304 21098 38691 39774 19366 667 -18805 -10639 7040 11265 36806
7535C6806L680k6975k7204q303N310j0038J5795K6740j3643j6935j4753J3968
$$ 36806 40486 13511 -13693 -21996 -16686 -26724 -10929 15811 2168 -14767 -29520 -15552
7523a5552k121N254J3356k18j502n611j7310R008j0007j4805J7016J5137R854
$$ -15552 -17673 -12419 937 719 -783 -6394 -23704 -14696 -24703 -39508 -22492 -7355 2499
7510B499k0641J3323K6365l073q706j1139J0088N675JQ340l824p631J0043p62
$$ 2499 -18142 -4819 21546 18473 9767 -1372 8716 14391 14392 22732 18908 11277 21320 20558
7496B0558l191N405o344j5760n190K6957m116j8611M49R866j3886q134o359K286
$$ 20558 17367 22772 16428 668 -4522 22435 18319 -292 157 10023 -3863 -11997 -18356 -16070
7482a6070J0983l112K556N238J1181k651N529j0140q600k2727j3105J4300o838
$$ -16070 -5087 -8199 -5643 -405 10776 8125 13654 3514 -5086 -27813 -40918 -26618 -33456
7469c3456p598m955p483j921J3640J5084l547j398P098p90j917R946K0152j9250
$$ -33456 -41054 -46009 -53492 -55413 -41773 -26689 -30236 -31634 -24536 -25326 -27243 -17297 2855 -16395
7455a6395p241R458r714k3764J1885R610L012O73L400l940l074L847P642Q769
$$ -16395 -23636 -14178 -23892 -47656 -35771 -26161 -23149 -22476 -19076 -23016 -26090 -22243 -14601 -5832
7441e832J3534P44J142k1035j2845J5506R060l928q723L087n232p249m369J3262
$$ -5832 7702 8446 9588 -11447 -24292 -8786 274 -3654 -12377 -9290 -14522 -21771 -26140 -12878
7427a2878J0595o195m891k5157l762N600K9096Q623j312p055r884j777l607J7272
$$ -12878 -2283 -8478 -13369 -38526 -42288 -36688 -7592 1031 -281 -7336 -17220 -18997 -22604 -5332
7413e332M305r494j1899J0224K0706j3370o549o341m123K2914Q849j3583L496
$$ -5332 -1027 -10521 -22420 -12196 8510 -4860 -11409 -17750 -21873 1041 9890 -3693 -197
7400a97J0824K5222l145k0095n492M64M546j9757Q556o69j847J1925k015o069
$$ -197 10627 35849 32704 12609 7117 7581 12127 -7630 926 257 -1590 10335 8320 2251
7386B251r871K0563K134m847O799k126k2181K234m943j2827J9382R163J305r239
$$ 2251 -7620 12943 15077 10230 17029 14903 -7278 -5044 -9987 -22814 -3432 5731 7036 -2203
7372b203k0994r242K0342R511J9475j2633k303O363J497n453k0936j2092J906
$$ -2203 -23197 -32439 -12097 -2586 16889 4256 1953 8316 9813 4360 -16576 -28668 -26762
7359b6762J6173J4992J0476l798M399j2337o582P039J8137P171m955k1638j5115
$$ -26762 -10589 4403 14879 11081 15480 3143 -3439 3600 21737 28908 23953 2315 -12800
7346a2800K0107n229j4413K025K021o816j6337Q915K0508L378k0613n573J065
$$ -12800 7307 2078 -12335 -10310 -8289 -15105 -31442 -22527 -2019 1359 -19254 -24827 -23762
7333b3762L604k98J0647k959J5356J0713J3465J9879J1028k5742j7277r380j5554
$$ -23762 -20158 -20456 -9809 -12768 2588 13301 26766 46645 57673 31931 14654 5274 -10280
7320a0280N324j616N315L0071N640j6184k6978l600j5746J1346j0218J44O493
$$ -10280 -4956 -6572 -1257 28814 34454 18270 -8708 -12308 -28054 -16708 -26926 -26782 -20289
7307b0289R722J9956j970j3235o390Q503Q336r059p779j773J6735K0191j2915
$$ -20289 -10567 9389 7419 -5816 -12206 -3703 4633 -4426 -12205 -13978 2757 22948 10033
7294A0033m480P593m001l337j2821R628j82P57J7710j120j5927J423K602Q174
$$ 10033 5553 13146 9145 5808 -7013 2615 2433 3190 20900 19780 3853 5276 7878 16052
7280A6052J2508j3060O479r820p435j7170K631N823j1362Q920q332L405J9321
$$ 16052 28560 15500 21979 12159 4724 -12446 -9815 -3992 -15354 -6434 -14766 -11361 7960
7267G960K3735R769l3084l4595o833J4117J4087J2794o70k8207j2827J3192L0665
$$ 7960 31695 41464 8380 -26215 -33048 -18931 -4844 7950 7280 -20927 -33754 -20562 10103
7254A0103P286p84O732j184M470j4845q940L55j4965J6158q365j1518j7014L603
$$ 10103 17389 16605 23337 22153 26623 11778 2838 3193 -11772 4386 -3979 -15497 -32511 -28908
7240b8908J5199N179o235o400J1742K485K219o004n19j8824J1673J1231j0123
$$ -28908 -13709 -8530 -14765 -21165 -9423 -6938 -4719 -10723 -11242 -30066 -18393 -7162 -17285
7227a7285p75J9376K9226j5504j5317O828j5303j404K247J1474J6682j9900o611
$$ -17285 -18060 1316 30542 15038 -279 6549 -8754 -10158 -7911 3563 20245 345 -6266
7214f266l37j787k337o43L145M09O815q422j68M215j2083k054K1079J5184k304
$$ -6266 -6603 -8390 -10727 -11370 -8225 -7816 -1001 -9423 -9591 -5376 -17459 -19513 1566 16750 14446
7199A4446N887L377j0850n027k022j40m084r898M837P507J3645O128k9037j5809
$$ 14446 20333 23710 12860 7833 5811 5671 1587 -8311 -3474 4033 17678 23806 -5231 -21040
7185b1040r97R787J9628J4786q706K884p372j0311j4737j566o86J3446L75P425
$$ -21040 -22037 -12250 7378 22164 13458 16342 8970 -1341 -16078 -17644 -18330 -4884 -4509 2916
7171B916P008p098q351J149J3679O397n301j4335N76j726j3639P69J2791j0142
$$ 2916 9924 2826 -5525 -4376 9303 15700 10399 -3936 -3360 -5086 -18725 -17956 -5165 -15307
7157a5307M92J11J8013J1869p231k130R663j6810r143o768m213K2404n391j0825
$$ -15307 -14815 -14704 3309 15178 7947 5817 15480 -1330 -10473 -17241 -21454 950 -4441 -15266
7143a5266j272K1998k948p999Q845p855j4175P685J7566J017j9705j525j40J0198
$$ -15266 -16538 5460 2512 -5487 3358 -4497 -18672 -10987 6579 7596 -12109 -13634 -13774 -3576
7129c576P775m157M683k896n551j08m248m204J5654J1117J376q864k4245J673
$$ -3576 4199 42 4725 1829 -3722 -3830 -8078 -12282 3372 14489 15865 7001 -17244 -15571
7115a5571J1194J9155P6j0428k41J1966n2m409l1687j5185J6578K005l407j0160
$$ -15571 -4377 14778 14854 4426 4185 16151 16099 11690 -19997 -35182 -18604 -16599 -20006 -30166
7101c0166K0975r6j5632p0k426j2216p754K6274J9361j2452m845M638M939K050
$$ -30166 -9191 -9287 -24919 -24989 -27415 -39631 -47385 -21111 -1750 -14202 -19047 -14409 -9470 -7420
7087g420o121p062P580N228j2738K9041K5158j7791n718o194j813N833j6790P503
$$ -7420 -13541 -20603 -13023 -7795 -20533 8508 33666 15875 10157 3963 2150 7983 -8807 -1304
7073a304j1732M362m894l286P523j097M718J8489m771k1154o209L422o834J3192
$$ -1304 -13036 -8674 -13568 -16854 -9331 -10428 -5710 12779 8008 -13146 -19355 -15933 -22767 -9575
7059i575J4391k2822J936K70M056r277L491J1700J4093J4442P736r513n412k649
$$ -9575 4816 -18006 -16070 -15800 -11744 -21021 -17530 -5830 8263 22705 30441 20928 15516 12867
7045A2867q409J2755j345N990N885j1548n70N929j4399o199J476J4571q394j5181
$$ 12867 4458 17213 15868 21858 27743 16195 15625 21554 7155 956 2432 17003 8609 -6572
7031f572N383L045j4152j9667k527K4706J2679r885j3016j7868q737J7395K7958
$$ -6572 -1189 1856 -12296 -31963 -34490 -9784 2895 -6990 -20006 -37874 -46611 -29216 -1258
7018a258l759J0087j1003j531L006L2605K039k3633l816N211p07J1767J008R477
$$ -1258 -5017 5070 -5933 -7464 -4458 28147 30186 6553 2737 7948 7241 19008 20016 29493
7004B9493j4182Q949n704J693O322l0741l0247j2206Q414J3953J890n950O870
$$ 29493 15311 24260 18556 20249 26571 -4170 -34417 -46623 -38209 -24256 -22366 -28316 -21446
6991b1446K2780Q678j4810j3639j7K167o075R338j155o462o244j8012M937K5525
$$ -21446 1334 10012 -4798 -18437 -18454 -16287 -22362 -13024 -14179 -20641 -26885 -44897 -39960 -14435
6977a4435K0976j3149j3859l09O439K2533l24j5860j2865Q232J6247R981j3509
$$ -14435 6541 -6608 -20467 -20776 -14337 8196 7872 -7988 -20853 -12621 3626 13607 98
6964I8j0830J7128J8225n826o135P230K072j0610p917k1199m451j2256Q381r584
$$ 98 -10732 6396 24621 18795 12660 19890 21962 11352 3435 -17764 -22215 -34471 -26090 -35674
6950c5674n570o27M304k5662j2349K4294K4486N393J3642M041m480j8962l242
$$ -35674 -41244 -41871 -37567 -63229 -75578 -51284 -26798 -21405 -7763 -3722 -8202 -27164 -30406
6937c0406L2149O886l454J3526m195j6246j8678j1961J3889n817M999j9715K2412
$$ -30406 1743 8629 5175 18701 14506 -1740 -20418 -32379 -18490 -24307 -19308 -39023 -16611
6924a6611J9199J187l301r020j4269K80J9749O584K1536j8464q013J85j0286k2251
$$ -16611 2588 3775 474 -8546 -22815 -22535 -2786 3798 25334 6870 -1143 -958 -11244 -33495
6910c3495L2511L203j0171j7873j1776J576n850K1858J0896J9185R647j4933J2259
$$ -33495 -984 2219 -7952 -25825 -37601 -36025 -41875 -20017 -9121 10064 19711 4778 17037
6897A7037K0874l4418j2922O515J3331j2723j0781J0482P285n251n271P373N391
$$ 17037 37911 3493 -9429 -2914 10417 -2306 -13087 -2605 4680 -571 -5842 1531 6922
6884F922j9706j4789r11k644J3344K650p831q381J1095J3237M52j6150M212O53
$$ 6922 -12784 -27573 -28484 -31128 -17784 -15134 -22965 -31346 -20251 -7014 -6562 -22712 -18500 -17847
6870a7847k5261Q488R730J2096p890m226N852O233l12l20J0965n408J749R313
$$ -17847 -43108 -34620 -24890 -12794 -20684 -24910 -19058 -12825 -13137 -13457 -2492 -7900 -6151 3162
6856C162l986N997M601o812K780q738l97K3286p677j7768J0211J137j638k17q03
$$ 3162 -824 5173 9774 2962 5742 -2996 -3393 19893 12216 -5552 4659 5796 4158 3941 3138
6841C138j3507J911Q43q504p571l377P67j765J2464J3059L996l318j0016k70M688
$$ 3138 -10369 -8458 -7615 -16119 -23690 -27067 -26300 -28065 -15601 -2542 1454 -1864 -11880 -12150 -7462
6826g462k2739J056K1601J7964j64k0621j2435L507R787M710P493Q159Q476P650
$$ -7462 -30201 -29145 -7544 10420 10256 -10365 -22800 -19293 -9506 -4796 2697 10856 19332 26982
6812B6982q421j4456N120j3618k0064p825K3066J5129m069J4037J1349M071J594
$$ 26982 18561 4105 9225 -4393 -24457 -32282 -9216 5913 1844 15881 27230 31301 32895
6799C2895K90k395j8143m421O480P193n138n972J20j866O559m606j8449j2454
$$ 32895 33185 30790 12647 8226 14706 21899 16761 10789 10909 9043 15602 10996 -7453 -19907
6785a9907p57j925ML534Q201L086j2562K0793R206j3272k3795K422Q415m373k1050
$$ -19907 -20664 -22589 -22585 -19051 -10850 -7764 -20326 467 9673 -3599 -27394 -24972 -16557 -20930 -41980
6770d1980r825J0227J3292K0888R508k679j0488n156J2882J2809j5261j756L036
$$ -41980 -51805 -41578 -28286 -7398 2110 -569 -11057 -16213 -3331 9478 -5783 -7539 -4503
6757d503K3469J9511P583j3043K243N063M142Q930j3822j4413N265J6869o390
$$ -4503 18966 38477 46060 33017 35260 40323 44465 53395 39573 25160 30425 47294 40904
6744D0904n271r19J3454J3717j071J7668K2359J1661M787K574j1664r126l8301
$$ 40904 35633 34714 48168 61885 60814 78482 100841 112502 117289 119863 108199 99073 60772
6731F0772j8994m435j344p178L153l593J284P440j5680j4193p12m859j1352j5414
$$ 60772 41778 37343 35999 28821 31974 28381 29665 37105 21425 7232 6520 1661 -9691 -25105
6717b5105J6676K4971l143j1151k34K5344Q065k272n023p299q135j8019o842j0498
$$ -25105 -8429 16542 13399 2248 2014 27358 35423 33151 28128 20829 12694 -5325 -12167 -22665
6703b2665K2144K176j0067J3707k765Q979m976K73J9109Q613j9625k3174k4056
$$ -22665 -521 1655 -8412 5295 2530 11509 6533 6806 25915 34528 14903 -8271 -32327
6690c2327O588K0592J703L038k954j7353P083r684Q28J5472N523J7518j932o243
$$ -32327 -25739 -5147 -3444 -406 -3360 -20713 -13630 -23314 -22486 -7014 -1491 16027 14095 7852
6676G852l2254J0113K2288O836p99l397j3545N167N642J6564N598r934m594M044
$$ 7852 -24402 -14289 7999 14835 14036 10639 -2906 2261 7903 24467 30065 20131 15537 19581
6662A9581M647J1148J2232m018k2033j2638r114k5518k659N076J6080l788l890
$$ 19581 24228 35376 47608 43590 21557 8919 -195 -25713 -28372 -23296 -7216 -11004 -14894
6649a4894m053L029k090N644R05p777M476J677j3885J1809K4839N462j8699j0282
$$ -14894 -18947 -15918 -18008 -12364 -11459 -19236 -14760 -13083 -26968 -15159 9680 15142 -3557 -13839
6635a3839j218j1188J0822M183o988O192J0080n235k592K0987J7898k1673P619
$$ -13839 -15057 -26245 -15423 -11240 -18228 -12036 -1956 -7191 -9783 11204 29102 7429 15048
6622A5048P727k0095M038m531O798J2120P267k4409l0427q63K7013j4546k4937
$$ 15048 22775 2680 6718 2187 8985 21105 28372 3963 -26464 -27327 -314 -14860 -39797
6609c9797J5653K648n06J3849J1136J3961j3397k1031R137N880j5372j6907o012
$$ -39797 -24144 -21496 -22002 -8153 2983 16944 3547 -17484 -8347 -2467 -17839 -34746 -40758
6596d0758k75K889O981K8049J2911k8800j5911J0000N263j1500j3576M467J3590
$$ -40758 -41033 -38144 -31163 -3114 9797 -19003 -34914 -24914 -19651 -31151 -44727 -40260 -26670
6583b6670N194j2076J5368J0951N622L476l917j2205k386N614J991J3755J5561
$$ -26670 -21476 -33552 -18184 -7233 -1611 1865 -2052 -14257 -16643 -11029 -9038 4717 20278
6570B0278K143P468j2596j0111n670L737O875p450O042J2675J502j8367k8647
$$ 20278 22421 29889 17293 7182 1512 5249 12124 4674 10716 23391 24893 6526 -22121
6557b2121L425K2991n969M018n391J0110J505J1774N858j019q542j1166J1691
$$ -22121 -18696 4295 -1674 2344 -3047 7063 8568 20342 26200 25181 16639 5473 17164
6544A7164k9110q122K6713R687n191M833j0976k0379J1111J4554k854k2710l493
$$ 17164 -11946 -20068 6645 16332 11141 15974 4998 -15381 -4270 10284 7430 -15280 -18773
6531a8773L1884l159j4482J9400M183j2012k5874j4567R93J5043R717K471p910
$$ -18773 13111 9952 -4530 14870 19053 7041 -18833 -33400 -32407 -17364 -7647 -5176 -13086
6518a3086n771o208N028o740O006j213K944k296J98J6285j1146J1207j5517p517
$$ -13086 -18857 -25065 -20037 -26777 -20771 -21984 -19040 -21336 -21138 -4853 -15999 -4792 -20309 -27826
6504b7826j0742J0098J4881J4818M241j5620j9872J6180J9565R459k0191l0857
$$ -27826 -38568 -28470 -13589 1229 5470 -10150 -30022 -13842 5723 15182 -5009 -35866
6492c5866P223J6205J8142o287K570j6214m123J944j7570J5943J2322j7849M57
$$ -35866 -28643 -12438 5704 -583 1987 -14227 -18350 -16406 -33976 -18033 -5711 -23560 -23103
6479b3103K1284M456n468L350J0885J0279q945k0590r7J4102J1411j0460o051
$$ -23103 -1819 2637 -2831 519 11404 21683 12738 -7852 -7949 6153 17564 7104 1053
6466A053l866O466j2876O941j4768l379O279P736Q627P441j1700n395N516k622
$$ 1053 -2813 3653 -9223 -2282 -17050 -20429 -14150 -6414 2213 9654 -2046 -7441 -1925 -4547
6452d547L32r995L694J5428p234j9412j512j1406n314M382R220J7349Q780j9895
$$ -4547 -4215 -14210 -10516 4912 -2322 -21734 -23246 -34652 -39966 -35584 -26364 -9015 -235 -20130
6438b0130j4776O142n23R399J3349L807M453J2695k4186k0701R621K595J419m469
$$ -20130 -34906 -28764 -29287 -19888 -6539 -2732 1721 14416 -9770 -30471 -20850 -18255 -16836 -21305
6424b1305j813M654K616J8j0556r48J4655N861P614o2j5590J0193J7045P283k854
$$ -21305 -23118 -18464 -15848 -15830 -26386 -27334 -12679 -6818 796 734 -14856 -4663 12382 19665 16811
6409A6811p739j1481j6458j6187Q003R727o924k381m537n818J1753K0636J57m175
$$ 16811 9072 -2409 -18867 -35054 -27051 -17324 -24248 -26629 -31166 -36984 -25231 -4595 -4438 -8613
6395h613p300K297J3029k508r901L808J7075O992j2824p202O36L724L908J4327
$$ -8613 -15913 -13616 -587 -3095 -12996 -9188 7887 14879 2055 -5147 -4511 -787 3121 17448
6381A7448J1327j8800j445k875P560k945l5341j2J5404K4626Q615j6378j6948
$$ 17448 28775 9975 8530 5655 13215 10270 -25071 -25083 -9679 14947 23562 7184 -9764
6368i764R659J4718n337q179J1832k3550k7422J1557P550j2207j6598j1137L2359
$$ -9764 -105 14613 9276 1097 12929 -10621 -38043 -26486 -18936 -31143 -47741 -58878 -26519
6355b6519K7974J5208L119J832N931j0020q347j1018l07j2379k5216J2614P458
$$ -26519 1455 16663 19782 21614 27545 17525 9178 -1840 -2147 -14526 -39742 -27128 -19670
6342a9670M362m188q800N878K790O721j0142J6226P115k167K600j7354J4590O179
$$ -19670 -15308 -19496 -28296 -22418 -19628 -12907 -23049 -6823 292 -1875 725 -16629 -2039 4140
6328D140j5565j5692O724O012J1840K0712J6196L424k7100j1594J524k0901j5217
$$ 4140 -11425 -27117 -20393 -14381 -2541 18171 34367 37791 10691 -903 621 -20280 -35497
6315c5497o081M444o90M300J4406M721M915J8856K7592o933N86P034j7730j0496
$$ -35497 -41578 -37134 -37824 -33524 -19118 -14397 -9482 9374 36966 30033 30619 37653 19923 9427
6301I427k7473k217k916Q498K576j1218K570J6396Q723m264J1443k2828p070k507
$$ 9427 -18046 -20263 -23179 -14681 -12105 -23323 -20753 -4357 4366 102 11545 -11283 -18353 -20860
6287b0860j4744J6079N620J2385J1761k3806k89K4339Q707K078J0093n611j9030
$$ -20860 -35604 -19525 -13905 -1520 10241 -13565 -13854 10485 19192 21270 31363 25752 6722
6274F722k040j2328j1318K473Q681j7418J9413J9066k579J763j0117r064K47j6845
$$ 6722 4682 -7646 -18964 -16491 -7810 -25228 -5815 13251 10672 12435 2318 -6746 -6499 -23344
6260b3344M01K0418K367m468j1460J197j1632q995L574o09M239N472J1159J0127
$$ -23344 -22943 -2525 -158 -4626 -16086 -14889 -26521 -35516 -31942 -32551 -28312 -22840 -11681 -1554
6246a554J3450k994j0296n45j0607J1593K4891M71p958r364O418k936R912N041
$$ -1554 11896 8902 -1394 -1939 -12546 -953 23938 24409 16451 7087 13505 10569 20481 25522
6232B5522j2968o103n833M631o961J6589j0762l1022j3743K5576J1374j2008q011
$$ 25522 12554 6451 618 5249 -1712 14877 4115 -26907 -40650 -15074 -3700 -15708 -23719
6219b3719l059K2321K0756K127j4664j0410J3809M661J2625j2255j4586k781J2670
$$ -23719 -26778 -4457 16299 18426 3762 -6648 7161 11822 24447 12192 -2394 -5175 7495
6206G495N287o689j5415k405P706L974n404j9030M535M805P888j2361N33O095
$$ 7495 12782 6093 -9322 -11727 -4021 -47 -5451 -24481 -19946 -15141 -7253 -19614 -19081 -12986
6192a2986K38k1424n430M677L972K2152R283P714p565r849l750K0393n561p623
$$ -12986 -12748 -34172 -39602 -34925 -30953 -8801 482 8196 631 -9218 -12968 7425 1864 -5759
6178e759J7829K793j4202p119N574p581j4934R057o264J465m533J9718J0683k2923
$$ -5759 12070 14863 661 -6458 -884 -8465 -23399 -14342 -20606 -19141 -23674 -3956 6727 -16196
6164a6196j7509J0649K8562J6699k709k286J0528r048J5772Q188j3800k6513l4696
$$ -16196 -33705 -23056 5506 22205 19496 17210 27738 18690 34462 42650 28850 2337 -32359
6151c2359j6201J4516J48N954O827Q16L243J1601j7392k1253P445K1925J2941
$$ -32359 -48560 -34044 -33896 -27942 -21115 -20299 -17056 -5455 -22847 -44100 -36655 -14730 -1789
6138a789K0701j355O89m826l15r524j9775J0445n637J8989K0250j1214j9807q254
$$ -1789 18912 17557 18246 13420 13105 3581 -16194 -5749 -11386 7603 27853 16639 -3168 -11422
6124a1422p651J4461N077o241Q248P66j1510j0012o141K2950j6572j2645K0734
$$ -11422 -19073 -4612 465 -5776 2472 3238 -8272 -18284 -24425 -1475 -18047 -30692 -9958
6111i958L366p533j9298k729l197p365J6970L5400o679j7398O14K5117J3076j2545
$$ -9958 -6592 -14125 -33423 -36152 -39349 -46714 -29744 5656 -1023 -18421 -17807 7310 20386 7841
6097G841k471k1674J8692J2252k241N235P245P292j5517k0484M083P761K174Q65
$$ 7841 5370 -16304 2388 14640 12399 17634 24879 32171 16654 -3830 253 8014 10188 11053
6083A1053L83j5642n367m508L565M259L2844O589j9680N090P802q307k376L06
$$ 11053 11436 -4206 -9573 -14081 -10516 -6257 26587 33176 13496 18586 26388 18081 15705 16011
6069A6011m938k3181J0806J4173L887j1130N953j3880k4849J363K1874q410k2931
$$ 16011 11073 -12108 -1302 12871 16758 5628 11581 -2299 -27148 -25785 -3911 -12321 -35252
6056c5252J569J9004j0068p928J3452K6669l971j6159k0083K67l522P847Q835
$$ -35252 -33683 -14679 -24747 -32675 -19223 7446 3475 -12684 -32767 -32500 -36022 -28175 -19340
6043a9340O819N478J4744R289k932l160J0255o496l3060l099J959N791J4243n483
$$ -19340 -12521 -7043 7701 16990 14058 10898 21153 14657 -18403 -21502 -19543 -13752 491 -4992
6029d992j1J8357L405p481l1130j1217L456o116K6225L314K433Q187j349J81j9437
$$ -4992 -5003 13354 16759 9278 -21852 -33069 -29613 -35729 -9504 -6190 -3757 4430 3081 3262 -16175
6014a6175Q195J5681K2713n971j4232N819O559n867j197L676r606q876j309P880
$$ -16175 -7980 7701 30414 24443 10211 16030 22589 16722 15525 19201 9595 719 -590 7290
6000G290o555O450K675p430J2434o62j6247J9075O801N239j4295J0581R34j5839
$$ 7290 735 7185 9860 2430 14864 14202 -2045 17030 23831 29070 14775 25356 26290 10451
5986A0451r928j6767j2415J763r898r540p727K5628L4126r68p637q246p705J1501
$$ 10451 523 -16244 -28659 -26896 -36794 -46334 -54061 -28433 5693 4725 -2912 -11158 -18863 -7362
5972g362J9847l217Q645m60q133Q783o008j0245j3880N208J7270O639L781k7316
$$ -7362 12485 9268 17913 17453 9320 18103 12095 1850 -12030 -6822 10448 17087 20868 -6448
5958f448j0835J3493J111o968Q50r615R947K4251k39J3288j8467j3254P30J789
$$ -6448 -17283 -3790 -2679 -9647 -8797 -18412 -8465 15786 15547 28835 10368 -2886 -2156 -367
5944c67K2807R332p856J893J6779j3229k5013j2356j5550J1320r182l712J7438
$$ -367 22440 31772 23916 25809 42588 29359 4346 -8010 -23560 -12240 -21422 -25134 -7696
5931g696q10o866J4003q046j6472J0194j6084n736j986j0630N668K0604J3855
$$ -7696 -8506 -15372 -1369 -9415 -25887 -15693 -31777 -37513 -39499 -50129 -44461 -23857 -10002
5918a0002J1276j647j8116p46J2090J269q697K469M217J1352L158j612j912q366
$$ -10002 1274 -373 -18489 -19235 -7145 -5876 -14573 -12104 -7887 3465 6623 5011 3099 -5267
5904e267j1812M957n641r304q839k488P953J5668J2190n115M609P651l1408k0198
$$ -5267 -17079 -12122 -17763 -27067 -35906 -38394 -30441 -14773 -2583 -7698 -3089 4562 -26846 -47044
5890d7044o384K320O111M713j4741k063K5000P159N745J6179K3004Q054j0261
$$ -47044 -53428 -51108 -44997 -40284 -55025 -57088 -32088 -24929 -19184 -3005 19999 28053 17792
5877A7792q617L269K81J584Q05m459Q41M288o340J1233j7730k8491J2981J1830
$$ 17792 9175 12444 12725 14309 15114 10655 11496 15784 9444 20677 2947 -25544 -12563 -733
5863g33q247L250J8508j277K462L392j0916j9674K538J5768N596r343J5502n525
$$ -733 -8980 -5730 12778 11501 13963 17355 6439 -13235 -10697 5071 10667 1324 16826 11301
5849A1301j9061p748K0495K1216j7780j6290j716l081n124L645N153N365K39J074
$$ 11301 -7760 -15508 4987 26203 8423 -7867 -9583 -12664 -17788 -14143 -8990 -3625 -3386 -2312
5835b312O18R662l763o658p776O123p103j4866K626J285J831j1083j074O509J838
$$ -2312 -1694 7968 4205 -2453 -10229 -4106 -11209 -26075 -23449 -22164 -20333 -31416 -32490 -25981 -24143
5820b4143J0635J5515j0167j7435r430L095n660k877k756k75K752J2842l580J5359
$$ -24143 -13508 2007 -8160 -25595 -35025 -31930 -37590 -40467 -43223 -43498 -40746 -27904 -31484 -16125
5806a6125O838Q04J9718K0459J041r996j04j9010j3694J3185l35k415P596N803
$$ -16125 -9287 -8483 11235 31694 32735 22739 22635 3625 -10069 3116 2781 366 7962 13765
5792A3765O395j728k8261J361M441J4277J0968j7019r793L745l824o915J1471
$$ 13765 20160 18432 -9829 -8468 -4027 10250 21218 4199 -5594 -1849 -5673 -12588 -1117
5779a117l908K003k5282j0891M090M25K6405r74j2737j0313O065J970l654L520
$$ -1117 -5025 -3022 -28304 -39195 -35105 -34680 -8275 -9249 -21986 -32299 -26234 -24264 -27918 -24398
5765b4398r070J0259K8066J2185j5989p192J0568K044j103o073j2236r944K32
$$ -24398 -33468 -23209 4857 17042 1053 -6139 4429 6473 5370 -703 -12939 -22883 -22651
5752b2651L655m777J1090M8664O360k2568M10j2463m993J6889K576r840j2179
$$ -22651 -18996 -23773 -12683 35981 42341 19773 20183 7720 2727 19616 22192 12352 173
5739A73n481m85o600J6127K3022n412O403j3549j3876N294O632j732L308n827
$$ 173 -5308 -5793 -12393 3734 26756 21344 27747 14198 322 5616 12248 10516 13824 7997
5725G997j8687N76p844N113J6158K043k809M460n96j888J1387J6283k2444k7992
$$ 7997 -10690 -10114 -17958 -12845 3313 5356 2547 7007 6411 4523 15910 32193 9749 -18243
5711a8243k904M95J8576J2494l211J399j0334j0892J574p428m938j7045m472N763
$$ -18243 -21147 -20652 -2076 10418 7207 8606 -1728 -12620 -11046 -18474 -23412 -40457 -44929 -39166
5697c9166K5997K7639j2035k0858L07J0400K2069J3659j9036k0103R641O904k910
$$ -39166 -13169 14470 2435 -18423 -18116 -7716 14353 28012 8976 -11127 -1486 5418 2508
5684B508j975q096j9318j3017P104K0494m017j6984K0327R967k1918N215K5782
$$ 2508 533 -7563 -26881 -39898 -32794 -12300 -16317 -33301 -12974 -3007 -24925 -19710 6072
5671F072J0200O69k376k950L458o837J0039l760j7648k0266L746p80P298l67K665
$$ 6072 16272 16941 14565 11615 15073 8236 18275 14515 -3133 -23399 -19653 -20433 -13135 -13502 -10837
5656a0837p94J3372K657P329J1766p959J1409j2119r919N96j0328j2850j3479
$$ -10837 -11631 1741 4398 11727 23493 15534 26943 14824 4905 5501 -4827 -17677 -31156
5643c1156j1777J6391N123r970P230n950o017q900O71j5743j244L7437M741k2164
$$ -31156 -42933 -26542 -21419 -31389 -24159 -30109 -36126 -45026 -44355 -60098 -61342 -23905 -19164 -41328
5629d1328o33J629j2570p170L618J0369K0971j3648j2903k706J8107M131J5291
$$ -41328 -41961 -40332 -52902 -60072 -56454 -46085 -25114 -38762 -51665 -54371 -36264 -32133 -16842
5616a6842M216n478Q910L473J2175j164j4978P351J986l876J149j6821K772R067
$$ -16842 -12626 -18104 -9194 -5721 6454 5290 -9688 -2337 -351 -4227 -3078 -19899 -17127 -8060
5602h060m331l529K1881q264j3638P188J1477k547K352o313r711O22O45j0226
$$ -8060 -12391 -15920 5961 -2303 -15941 -8753 2724 177 2529 -3784 -13495 -12873 -12228 -22454
5588b2454J4857J5520Q853r2j4405J1079J6564l2314j0877K3027r57k936k4094
$$ -22454 -7597 7923 16776 16684 2279 13358 29922 -2392 -13269 9758 8801 5865 -18229
5575a8229k0900K8675R779j022j5943l571K2095J1586p728k0179j1118j0241J0432
$$ -18229 -39129 -10454 -675 -1697 -17640 -21211 884 12470 4742 -15437 -26555 -36796 -26364
5562b6364R350P134k50J2526o013R13r315L803P988n907j76j969K00o571k001
$$ -26364 -17014 -9880 -10130 2396 -3617 -2704 -12019 -8216 -228 -6135 -6311 -8280 -8080 -14651 -16652
5547a6652J0245o150nj78M949L002p188j3156j240J7153J8549J939j2485j587
$$ -16652 -6407 -12557 -12562 -12740 -7791 -4789 -11977 -25133 -26373 -9220 9329 11268 -1217 -2804
5533b804L667L804l146j1403J1211L832j1635j1151N178J1268l84J6463o872O775
$$ -2804 863 4667 1521 -9882 1329 5161 -6474 -17625 -12447 -1179 -1563 14900 8028 14803
5519A4803K264M637l488L885j9532l0534p583R681J5320P761P477R346j7067J6538
$$ 14803 17067 21704 18216 22101 2569 -27965 -35548 -25867 -10547 -2786 4691 14037 -3030 13508
5505A3508J9294k580k4632l448o793l3276M776M599o099J1529J7699q303M625
$$ 13508 32802 30222 5590 2142 -4651 -37927 -33151 -28552 -34651 -23122 -5423 -13726 -9101
5492i101K4130M075j9393R820P995q883j5430j6850J447j2454L491J6354K1294
$$ -9101 15029 19104 -289 9531 17526 8643 -6787 -23637 -22190 -34644 -31153 -14799 6495
5479F495O906j1053p068O320o745p056R938j359R052J2102J2991j104k3227k7134
$$ 6495 13401 2348 -4720 1600 -5145 -12201 -2263 -3622 5430 17532 30523 29419 6192 -20942
5465b0942o726O917J6273J932P083N275j0323O172J7988J8589N830Q73j8196k0599
$$ -20942 -27668 -20751 -4478 -2546 4537 9812 -511 5661 23649 42238 48068 48941 30745 10146
5451A0146j3275q797j6055L127K740Q158O543k746n018q693n872N588J3861N605
$$ 10146 -3129 -11926 -27981 -24854 -22114 -13956 -7413 -10159 -15177 -23870 -29742 -24154 -10293 -4688
5437d688L156O451J2786l378q370Q77o990p070J9153J2004R020p824j6736j3278
$$ -4688 -1532 4919 17705 14327 5957 6834 -156 -7226 11927 23931 32951 25127 8391 -4887
5423d887l035r150j3761P435l639k844k210K1716N462L903K291j3635k6613q930
$$ -4887 -7922 -17072 -30833 -23398 -27037 -29881 -32091 -10375 -4913 -1010 1281 -12354 -38967 -47897
5409d7897K579K6712J2075N027J0166k371J311q118m518j2569o03K3452n998m724
$$ -47897 -45318 -18606 -6531 -1504 8662 6291 7602 -516 -5034 -17603 -18206 5246 -752 -5476
5395e476J6336m337k5730j0830l185R304J3352m454J2969Q038N065n241p951o983
$$ -5476 10860 6523 -19207 -30037 -33222 -23918 -10566 -15020 -2051 5987 11052 5811 -2140 -9123
5381i123O614O237l588J0040O455m831j4029J7992K7447J2433j9658Q82m609k8676
$$ -9123 -2509 3728 140 10180 16635 11804 -2225 15767 43214 55647 35989 36871 32262 3586
5367C586j5353j3023j1089J1262J9417J7510J0474N422j0070j9875j1695M24M326
$$ 3586 -11767 -24790 -35879 -24617 -5200 12310 22784 28206 18136 -1739 -13434 -13010 -8684
5354h684l21o501q220m772n245P788R883J9149O427R4q300j2742L996K69n892
$$ -8684 -9005 -15506 -23726 -28498 -33743 -25955 -16072 3077 9504 9598 1298 -11444 -7448 -7179 -13071
5339a3071K660J9390J2167j499J3188n637k9370j3162K051l727m956q974J3674
$$ -13071 -10411 8979 21146 19647 32835 27198 -2172 -15334 -13283 -17010 -21966 -30940 -17266
5326a7266L856j0134N658J8509l226N477K5861J1634n611j3268j9010j1722N002
$$ -17266 -13410 -23544 -17886 623 -2603 2874 28735 40369 34758 21490 2480 -9242 -4240
5313d240j8621J4479J5943J2862r585k1077Q260O171j5266R024P327j2862J2296
$$ -4240 -22861 -8382 7561 20423 10838 -10239 -1979 4192 -11074 -2050 5277 -7585 4711
5300D711R050k282n315M99J3981K1623n535j2216j6358j9234P111L4722m075k9096
$$ 4711 13761 11479 6164 6663 20644 42267 36732 24516 8158 -11076 -3965 30757 26682 -2414
5286b414k9176o669J4822K770J2909J2016N158j2895l250J6358r938m097O945
$$ -2414 -31590 -38259 -23437 -20667 -7758 4258 9416 -3479 -6729 9629 -309 -4406 2539
5273B539l174L075k3706N938m393n833M26j169l98J8243J4362J139L84J6379O241
$$ 2539 -635 2440 -21266 -15328 -19721 -25554 -25128 -26297 -26695 -8452 5910 7049 7433 23812 30053
5258C0053J0115m020j5254r453L151o944o953n105r309J3237J320o919K440L617
$$ 30053 40168 36148 20894 11441 14592 7648 695 -4410 -13719 -482 838 -6081 -3641 -24
5244b4l602N916j1004q154J296j1069J4681J9859l035m415j5714j0986O800K8599
$$ -24 -3626 2290 -8714 -16868 -15572 -26641 -11960 7899 4864 449 -15265 -26251 -19451 9148
5230I148R917l194l259p355R048k217o054R317l252j8707o475K5744Q34o526p747
$$ 9148 19065 15871 12612 5257 14305 12088 6034 15351 12099 -6608 -13083 12661 13495 6969 -778
5215g78J41o580m755o659m036k018P271j3991L530Q060J7521p987p747j448o971
$$ -778 -637 -7217 -11972 -18631 -22667 -24685 -17414 -31405 -27875 -19815 -2294 -10281 -18028 -19476 -26447
5200b6447J6360n21J990j26n436r704Q826k2080k453P490K0980K0136j166k2473
$$ -26447 -10087 -10608 -8618 -8744 -14180 -23884 -15058 -37138 -39591 -32101 -11121 9015 7849 -14624
5186a4624J6876J5505j2043l0238n876K2747J3593Q781k849j3510J2015o50q279
$$ -14624 2252 17757 5714 -24524 -30400 -7653 5940 14721 11872 -1638 10377 9727 1448
5173A448P144m591l206j1027k853J8206P767n649n298j0285j0209j2558J2188
$$ 1448 8592 4001 795 -10232 -13085 5121 12888 7239 1941 -8344 -18553 -31111 -18923
5160a8923k488P262j4329M632J8529J4755j4519Q338J033m546k190J1565K0319
$$ -18923 -21411 -14149 -28478 -23846 -5317 9438 -5081 3257 4290 -256 -2446 9119 29438
5147B9438Q196q886o156j3614j6215L978J9511J1496k0184p432K19m338L175R316
$$ 29438 37634 28748 22592 8978 -7237 -3259 16252 27748 7564 132 351 -3987 -812 8504
5133H504P717P49j2789j9156j0077J5742J0010k4855j1157J7649J7077j4612K913
$$ 8504 16221 16970 4181 -14975 -25052 -9310 700 -24155 -35312 -17663 -586 -15198 -12285
5120a2285o770M990J0054M050L479M197O579k044J1025J3969O098j9316K831J3514
$$ -12285 -19055 -14065 -4011 39 3518 7715 14294 12250 23275 37244 43342 24026 26857 40371
5106D0371M106j8491j3184j2542j7045p317J1639J0187o365j1859M111J2113J1124
$$ 40371 44477 25986 12802 260 -16785 -24102 -12463 -2276 -8641 -20500 -16389 -4276 6848
5093F848J0172L888j0770N61k905K61N182P995O0j5397j578J1545o144j7553j767
$$ 6848 17020 20908 10138 10699 7794 8055 13237 21232 21292 5895 4317 15862 9718 -7835 -9602
5078i602J0115j257K536J9545j7418k6238l14J8975r487O113j3571J2263K860
$$ -9602 513 -744 1792 21337 3919 -22319 -22633 -3658 -13145 -7032 -20603 -8340 -5480
5065e480R808m570k6105J9001L851l502j3519o85K1884Q59K428m266r294p322
$$ -5480 4328 -242 -26347 -7346 -3495 -6997 -20516 -21201 683 1542 3970 -296 -9590 -16912
5051a6912M786J7597J9582J485n177L826j1351k7352j074J0055m41L094j0269
$$ -16912 -12126 5471 25053 26538 21361 25187 13836 -13516 -14590 -4535 -4976 -1882 -12151
5038a2151o170j4823l584J2256J5803J0187j8447q893J9075J5725K784L73j3689
$$ -12151 -18321 -33144 -36728 -24472 -8669 1518 -16929 -25822 -6747 8978 11762 12135 -1554
5025a554R329J4503J1093o186l3929k7224J6414n844j2525O584P489L217j2774
$$ -1554 7775 22278 33371 27185 -6744 -33968 -17554 -23398 -35923 -29339 -21850 -18633 -31407
5012c1407K172O237J4160J5204J3403j0906O535J2608L642j7841k047J169J0439
$$ -31407 -29235 -22998 -8838 6366 19769 8863 15398 28006 31648 13807 11760 12929 23368
4999B3368j4806j2226l78j733R305k370j711j4609p461j825N75j2022K0336J0440
$$ 23368 8562 -3664 -4042 -5775 3530 1160 -551 -15160 -22621 -24446 -23871 -35893 -15557 -5117
4985e117K6166J1488j3994k5679j4171J8399K5036K023q022r344n276J9549Q074
$$ -5117 21049 32537 18543 -7136 -21307 -2908 22128 24151 16129 6785 1509 21058 29132
4972B9132j6607k164m284j46n989J4516o030q066K391j2583k4644l111j0497q549
$$ 29132 12525 10361 6077 5931 -58 14458 8428 362 2753 -9830 -34474 -37585 -48082 -56631
4958e6631J8990J1398l285J0978Q273j589M82K2179l882J4113J398j3462m461
$$ -56631 -37641 -26243 -29528 -18550 -10277 -11866 -11384 10795 6913 21026 22424 8962 4501
4945D501M045m094k659n30o377J2134J3680k4019q49o81R923r709n477j4594J0966
$$ 4501 8546 4452 1793 1263 -5114 7020 20700 -3319 -4168 -4849 5074 -4635 -10112 -24706 -13740
4930a3740J342j1166L447R266J1677j3446j973O404J5793m201Q03N867m686k07
$$ -13740 -12398 -23564 -20117 -10851 826 -12620 -14593 -8189 7604 3403 4206 10073 5387 5180
4916E180K53p586N392J1052k391q549n23k6480o29J9067k212j236j6738K898K5374
$$ 5180 5433 -2153 3239 14291 11900 3351 2828 -23652 -24281 -5214 -7426 -8662 -25400 -22502 2872
4901B872p212j6452o536R973o453J4191k001P200J7689N820o7k414j9322j3917
$$ 2872 -4340 -20792 -27328 -17355 -23808 -9617 -11618 -4418 13271 19091 19024 16610 -2712 -16629
4887a6629j0437J0529R632J9790k2689m68K9164L906J5258j8058j4564O443K292
$$ -16629 -27066 -16537 -6905 12885 -9804 -10272 18892 22798 38056 19998 5434 11877 14169
4874A4169J5Q539p517k1199m59j86k833o046m213J608m94p414P750K958M518n054
$$ 14169 14184 22723 15206 -5993 -6452 -6638 -9471 -15517 -19730 -18122 -18616 -26030 -18280 -15322 -10804 -15858
4858a5858j3087k1525N362o679J1280J4192j3390o573k824R876J2937J1708R805
$$ -15858 -28945 -50470 -45108 -51787 -40507 -26315 -39705 -46278 -49102 -39226 -26289 -14581 -4776
4845d776J1614K8411O191k9385q970Q890j1222J915j268J2544j1368k6904q385
$$ -4776 6838 35249 41440 12055 3085 11975 753 2668 1400 13944 2576 -24328 -32713
4832c2713p242k623K2074J8846J5434m420j2268L373Q111k16J62j17j0019p304
$$ -32713 -39955 -42578 -20504 -1658 13776 9356 -2912 461 8572 8356 8518 8401 -1618 -8922
4818h922K6997M059l4799j8802M688R854p987n181N736J3405J2281q553O906J2762
$$ -8922 18075 22134 -12665 -31467 -26779 -16925 -24912 -30093 -24357 -10952 1329 -7224 -318 12444
4804A2444j4880p257K987j1508K488k949L170j4850j1426J6104O179O473K8972
$$ 12444 -2436 -9693 -6706 -18214 -15726 -18675 -15505 -30355 -41781 -25677 -19498 -13025 15947
4791A5947N588O43J0100j4447j2456O403L376j3426j531p199j0708k752O259J1146
$$ 15947 21535 22178 32278 17831 5375 11778 15154 1728 197 -7002 -17710 -20462 -14203 -3057
4777c057j413J100p566L82Q89R494J6125N345K694l916j0231O234O976m802j4529
$$ -3057 -4470 -3370 -10936 -10554 -9665 -171 15954 21299 23993 20077 9846 16080 23056 18254 3725
4762C725l542Q263J0179n253j2493q947R495J720P727j4764o720J0959J1436O431
$$ 3725 183 8446 18625 13372 879 -8068 1427 3147 10874 -3890 -10610 349 11785 18216
4748A8216j4592p51J1823Q241j0518j2252j285J4111N963O158J1238R83j5772
$$ 18216 3624 2873 14696 22937 12419 167 -1118 12993 18956 25114 36352 37335 21563
4735B1563j462p139j4785m718J2885L900j0638j8063k161K6501K6880J456j0365
$$ 21563 20101 12962 -1823 -6541 6344 10244 -394 -18457 -20618 5883 32763 34219 23854
4722B3854n833N146k4966l512N414j1583j6650J0184J3742J6026o356K933J1361
$$ 23854 18021 23167 -1799 -5311 103 -11480 -28130 -17946 -4204 11822 5466 8399 19760
4709A9760Q077j1755j067n211r069j5915q244L73N700K567K6889Q067p474m891
$$ 19760 27837 16082 15015 9804 735 -15180 -23424 -23051 -17351 -14784 12105 20172 12698 7807
4695G807k1015J1046J0684j0393k670p754N601M91j2619M341K3261P31K236P068
$$ 7807 -13208 -2162 8522 -1871 -4541 -12295 -6694 -6203 -18822 -14481 8780 9511 11747 18815
4681A8815K960j4881j7279p989J33j4289j18K3848O016k1564O17l34o20Q291M796
$$ 18815 21775 6894 -10385 -18374 -18241 -32530 -32648 -8800 -2784 -24348 -23731 -24065 -24685 -16394 -11598
4666a1598L596l556J213N322M901J5914n175q512J0671j1997q616L40j3262P299
$$ -11598 -8002 -11558 -10345 -5023 -122 15792 10617 2105 12776 779 -7837 -7497 -20759 -13460
4652a3460K1673m986l456P914P632L861j7344q759O129K649M301J5058j412j771
$$ -13460 8213 3227 -229 7685 15317 19178 1834 -6925 -796 1853 6154 21212 19800 18029
4638A8029Q833J299j2829j9726n237j2684J5564Q361J6709K2693l493j1254j6028
$$ 18029 26862 28161 15332 -4394 -9631 -22315 -6751 1610 18319 41012 37519 26265 10237
4625A0237r902p917Q555Q918N461J929K079J6729L838j3228j5811k0106j2457
$$ 10237 335 -7582 973 9891 15352 17281 19360 36089 39927 26699 10888 -9218 -21675
4612b1675k923j1321O139K2085K968K190k133J3461p820l568Q648N263J4810m868
$$ -21675 -24598 -35919 -29780 -7695 -4727 -2537 -4670 8791 971 -2597 6051 11314 26124 21256
4598B1256j8078j3634J5692K1875j767j1147j8972q142j0165J0392L969O225M762
$$ 21256 3178 -10456 5236 27111 25344 14197 -4775 -12917 -23082 -12690 -8721 -2496 2266
4585B266J549N045N048O253N059p957n044j2700k2942p136j2783K36J7056K048
$$ 2266 3815 8860 13908 20161 25220 17263 12219 -481 -23423 -30559 -43342 -43106 -26050 -24002
4571b4002L156Q153j0943j0855M555n029J7155J6582J8983R958l399j0848J305
$$ -24002 -20846 -12693 -23636 -34491 -29936 -34965 -17810 -1228 17755 27713 24314 13466 14771
4558A4771k976j108j1320P88M268J1313j200k6218j6605M144K3821K4346k427
$$ 14771 11795 10687 -633 155 4423 15736 14536 -11682 -28287 -24143 -322 24024 21597
4545B1597j4111J0073n358j7613j6397r705n088N077J4511K0855m27k7247J4775
$$ 21597 7486 17559 12201 -5412 -21809 -31514 -36602 -31525 -17014 3841 3414 -23833 -9058
4532i058K476l7447l081K4482J8884j9603r649q228n042J8562J4227J3419J0856
$$ -9058 -6582 -44029 -47110 -22628 -3744 -23347 -32996 -41224 -46266 -27704 -13477 -58 10798
4519A0798k2534L105n925k2989J2270K0203J4043L186Q62k1522j362J2607j865
$$ 10798 -11736 -8631 -14556 -37545 -25275 -5072 8971 12157 13019 -8503 -9865 2742 877
4506H77J5325J1135j0973j3515L097K611O606Q505Q08j2006L559J17j7648n020
$$ 877 16202 27337 16364 2849 5946 8557 15163 23668 24476 12470 16029 16146 -1502 -6522
4492f522l181J981r383R786J4188K0156J7898l1808k5522k34J5410R375L222k15
$$ -6522 -9703 -7722 -17105 -7319 6869 27025 44923 13115 -12407 -12641 2769 12144 15366 15151
4478A5151j6320j5440r88k948J8437J7103j9223k0431l844R831J6870O700j7871
$$ 15151 -1169 -16609 -17597 -20545 -2108 14995 -4228 -24659 -28503 -18672 -1802 4898 -12973
4465a2973k832M447J3674K79j373K3563J5845j9728l6212p392O564k981N320N495
$$ -12973 -15805 -11358 2316 2595 1222 24785 40630 20902 -15310 -22702 -16138 -19119 -13799 -8304
4451h304n096N569j041o703J3360J0100r76p955j879J1076j6509o429M782Q852
$$ -8304 -13400 -7831 -8872 -15575 -2215 7885 6909 -1046 -2925 8151 -8358 -14787 -10005 -1153
4437a153O180J1562k129j4806k052J948q553j1465K475k553j9454P742J8065K1583
$$ -1153 5027 16589 14460 -346 -2398 -450 -9003 -20468 -17993 -20546 -40000 -32258 -14193 7390
4423G390P381J9903m07r702N906k817k0493j5275J141J6542R137j7311j4127O654
$$ 7390 14771 34674 34267 24565 30471 27654 7161 -8114 -6973 9569 18706 1395 -12732 -6078
4409f078L89J1991Q178j407p597O678r13m461N061j5830j9675J8903p696j3209
$$ -6078 -5689 6302 14480 13073 5476 12154 11241 6780 11841 -3989 -23664 -4761 -12457 -25666
4395b5666J148P74J965J7632K75k2362l724L0899J2744j3501M059N353j2531j7499
$$ -25666 -24518 -23744 -21779 -4147 -3872 -26234 -29958 941 13685 184 4243 9596 -2935 -20434
4381b0434J0219J2798L215q933l995k420o707k375k967K894K1670M3892N611l1683
$$ -20434 -10215 2583 5798 -3135 -7130 -9550 -16257 -18632 -21599 -18705 2965 46857 52468 20785
4367B0785K496Q909k076j2669k5365j1188k19j1598O646o332m770K9403J8052
$$ 20785 23281 32190 30114 17445 -7920 -19108 -19327 -30925 -24279 -30611 -35381 -5978 12074
4354A2074j0030n197Q866L0703J0158j0017j4649J1534j491k3508j0758J256J7058
$$ 12074 2044 -3153 5713 36416 46574 36557 21908 33442 31951 8443 -2315 -1059 15999
4341A5999j914l1685q988j315l803P301P176R72J8941J1295k063K370o886r142
$$ 15999 14085 -17600 -26588 -27903 -31706 -24405 -17229 -16257 2684 13979 11916 14286 7400 -1742
$$ [...]
##END NTUPLES=NMR SPECTRUM
##END=
